##TITLE=Analysis number 325634
Compound Code btb 09284
Book Reference 128197
Project Code adrs fraglib
Chemist Name jom
##JCAMPDX= 6.0         $$ Bruker NMR JCAMP-DX V2.0
##DATA TYPE= NMR SPECTRUM
##DATA CLASS= NTUPLES
##ORIGIN= Bruker BioSpin GmbH
##OWNER= nmr
$$ XWIN-NMR		Version 3.5
$$ Fri Jan  5 13:45:01 2007 GMT Standard Time (UT+0h)  MAYBRIDGE\nmr@NMR_250MHZ
##.OBSERVE FREQUENCY= 250.131544655141
##.OBSERVE NUCLEUS= ^1H
##.ACQUISITION MODE= SIMULTANEOUS (DQD)
##.ACQUISITION SCHEME= undefined
##.AVERAGES= 16
##.DIGITISER RES= 18
##SPECTROMETER/DATA SYSTEM= dpx250
##.PULSE SEQUENCE= zg30
##.SOLVENT NAME= CDCl3
##.SHIFT REFERENCE= (INTERNAL, CDCl3, 0, 16.5231)
##AUDIT TRAIL= $$ (NUMBER, WHEN, WHO, WHERE, WHAT)
$$ ##TITLE= Audit trail, XWIN-NMR		Version 3.5
$$ ##JCAMPDX= 5.01
$$ ##ORIGIN= Bruker BioSpin GmbH
$$ ##OWNER= nmr
$$ C:\u/data/dgb/nmr/ADRS/500/pdata/1/auditp.txt
$$ ##AUDIT TRAIL=  $$ (NUMBER, WHEN, WHO, WHERE, WHAT)
(   1,<2007-01-05 13:44:36.74 +000>,<MAYBRIDGE\nmr>,<NMR_250MHZ>,
      <created by zg, POWCHK disabled, PULCHK disabled
       configuration hash MD5:
       49 4B E0 1D 92 C2 6B 37 9F E6 65 BC 52 41 86 1D
       data hash MD5: 64K
       EF EC C1 A2 28 31 28 8F 15 8A 22 F4 58 3D B1 4F>)
(   2,<2007-01-05 13:44:50.37 +000>,<MAYBRIDGE\nmr>,<NMR_250MHZ>,
      <Start of raw data processing
       ef LB = 0.3 FT_mod = 6 PKNL = 1 SI = 32K 
       data hash MD5: 32K
       EA 6F C1 CC 08 5C E1 A7 CA 3C 94 EC 00 8B 33 32>)
(   3,<2007-01-05 13:44:52.10 +000>,<MAYBRIDGE\nmr>,<NMR_250MHZ>,
      <apk 
       data hash MD5: 32K
       7F C5 4A 2B 11 2C AA 58 C2 39 01 15 D6 73 CA 7E>)
(   4,<2007-01-05 13:44:52.84 +000>,<MAYBRIDGE\nmr>,<NMR_250MHZ>,
      <abs ABSG = 5 
       data hash MD5: 32K
       29 AB 52 24 80 68 75 B3 D4 D3 2A 82 C0 D6 F9 06>)
$$ ##END=
$$ 
$$ hash MD5
$$ 81 AC 75 C0 03 AC C6 F5 CB 2B 92 AE 6C CF 7A 22
##$RELAX= 
##$RELAX= 
##$RELAX= 
##$RELAX= 
##$RELAX= 
##$RELAX= 
##$RELAX= 
$$ Bruker specific parameters
$$ --------------------------
##$DU= <C:\u>
##$EXPNO= 500
##$NAME= <ADRS>
##$PROCNO= 1
##$TYPE= <nmr>
##$USER= <dgb>
##$AMP= (0..31)
100 100 100 100 100 100 100 100 100 100 100 100 100 100 100 100 100 100 
100 100 100 100 100 100 100 100 100 100 100 100 100 100 
##$AQSEQ= 0
##$AQ_mod= 3
##$AUNM= <au_zg>
##$AUTOPOS= <50 >
##$BF1= 250.13
##$BF2= 250.13
##$BF3= 250.13
##$BF4= 250.13
##$BF5= 500.13
##$BF6= 500.13
##$BF7= 500.13
##$BF8= 500.13
##$BYTORDA= 1
##$CFDGTYP= 0
##$CFRGTYP= 5
##$CHEMSTR= <none>
##$CNST= (0..31)
1 1 145 1 1 1 1 1 1 1 1 1 1 1 1 1 1 1 1 1 1 1 1 1 1 1 1 1 1 1 1 1 
##$CPDPRG= <>
##$CPDPRG1= <>
##$CPDPRG2= <>
##$CPDPRG3= <>
##$CPDPRG4= <mlev>
##$CPDPRG5= <mlev>
##$CPDPRG6= <mlev>
##$CPDPRG7= <mlev>
##$CPDPRG8= <mlev>
##$CPDPRGB= <>
##$CPDPRGT= <>
##$D= (0..31)
0 1 0 0 0 0 0 0 0 0.06 0 0 0 0 0 0 0.0002 0 0 0 0 0 0 0 0 0 0 0 0 0 0 
0 
##$DATE= 1168004675
##$DBL= (0..7)
120 120 120 120 120 120 120 120 
##$DBP= (0..7)
150 150 150 150 150 150 150 150 
##$DBP07= 0
##$DBPNAM0= <>
##$DBPNAM1= <>
$$ [...]
##$SUBNAM7= <"">
##$SUBNAM8= <"">
##$SUBNAM9= <"">
##$SW= 20.6930455092707
##$SWIBOX= (0..15)
0 0 3 0 0 0 0 0 0 0 0 0 0 0 0 0 
##$SW_h= 5175.983436853
##$TD= 65536
##$TD0= 1
##$TE= 294.16
##$TE2= 300
##$TE3= 300
##$TEG= 300
##$TL= (0..7)
0 120 120 120 120 120 120 120 
##$TP= (0..7)
150 150 150 150 150 150 150 150 
##$TP07= 0
##$TPNAME0= <>
##$TPNAME1= <>
##$TPNAME2= <>
##$TPNAME3= <>
##$TPNAME4= <>
##$TPNAME5= <>
##$TPNAME6= <>
##$TPNAME7= <>
##$TPOAL= (0..7)
0.5 0.5 0.5 0.5 0.5 0.5 0.5 0.5 
##$TPOFFS= (0..7)
0 0 0 0 0 0 0 0 
##$TUNHIN= 0
##$TUNHOUT= 0
##$TUNXOUT= 0
##$USERA1= <user>
##$USERA2= <user>
##$USERA3= <user>
##$USERA4= <user>
##$USERA5= <user>
##$V9= 5
##$VALIST= <valist>
##$VCLIST= <CCCCCCCCCCCCCCC>
##$VD= 0
##$VDLIST= <DDDDDDDDDDDDDDD>
##$VPLIST= <PPPPPPPPPPPPPPP>
##$VTLIST= <TTTTTTTTTTTTTTT>
##$WBST= 1024
##$WBSW= 4
##$XGAIN= (0..3)
0 0 0 0 
##$XL= 0
##$YL= 0
##$YMAX_a= 337952
##$YMIN_a= -323268
##$ZGOPTNS= <>
##$ZL1= 120
##$ZL2= 120
##$ZL3= 120
##$ZL4= 120
##$ABSF1= 16.52313
##$ABSF2= -4.170042
##$ABSG= 5
##$ABSL= 3
##$ALPHA= 0
##$AQORDER= 0
##$ASSFAC= 0
##$ASSFACI= 0
##$ASSFACX= 0
##$ASSWID= 0
##$AUNMP= <proc_1d>
##$AZFE= 0.1
##$AZFW= 0.1
##$BCFW= 0
##$BC_mod= 0
##$BYTORDP= 0
##$COROFFS= 0
##$CY= 12.5
##$DATMOD= 1
##$DC= 0
##$DFILT= <>
##$DTYPP= 0
##$F1P= 14.0000005364418
##$F2P= -0.99999901652339
##$FCOR= 0.5
##$FTSIZE= 32768
##$FT_mod= 6
##$GAMMA= 0
##$GB= 0
##$INTBC= 1
##$INTSCL= 1
##$ISEN= 128
##$LB= 0.3
##$LEV0= 0
##$LPBIN= 0
##$MAXI= 10000
##$MC2= 0
##$MEAN= 0
##$ME_mod= 0
##$MI= 0
##$NCOEF= 0
##$NC_proc= -5
##$NLEV= 6
##$NOISF1= 0
##$NOISF2= 0
##$NSP= 0
##$NTH_PI= 0
##$NZP= 0
##$OFFSET= 16.52313
##$PC= 1
##$PHC0= 225.6393
##$PHC1= 5.432044
##$PH_mod= 1
##$PKNL= yes
##$PPARMOD= 0
##$PSCAL= 4
##$PSIGN= 0
##$REVERSE= no
##$SF= 250.129999717135
##$SI= 32768
##$SIGF1= 0
##$SIGF2= 0
##$SINO= 400
##$SIOLD= 32768
##$SREGLST= <1H.CDCl3>
##$SSB= 0
##$STSI= 32768
##$STSR= 0
##$SW_p= 5175.98343685301
##$SYMM= 0
##$S_DEV= 0
##$TDeff= 65536
##$TDoff= 0
##$TI= <Analysis number 999999
Compound Code 99
Book Reference 9
Project Code 9>
##$TILT= no
##$TM1= 0
##$TM2= 0
##$TOPLEV= 0
##$USERP1= <user>
##$USERP2= <user>
##$USERP3= <user>
##$USERP4= <user>
##$USERP5= <user>
##$WDW= 1
##$XDIM= 32768
##$YMAX_p= 393225565
##$YMIN_p= -465291
$$ End of Bruker specific parameters
$$ ---------------------------------
##NTUPLES= NMR SPECTRUM
##VAR_NAME=  FREQUENCY,     SPECTRUM/REAL,   SPECTRUM/IMAG
##SYMBOL=    X,             R,               I
##VAR_TYPE=  INDEPENDENT,   DEPENDENT,       DEPENDENT
##VAR_FORM=  AFFN,          ASDF,            ASDF
##VAR_DIM=   32768,         32768,           32768
##UNITS=     HZ,            ARBITRARY UNITS, ARBITRARY UNITS
##FACTOR=    0.157963299565203, 1,           1
##FIRST=     4132.93060649791, 0,            0
##LAST=      -1043.0528303551, 0,            0
##MIN=       -1043.0528303551, -465291,      0
##MAX=       4132.93060649791, 393225565,    0
$$ Real data points
##PAGE= N=1
##DATA TABLE= (X++(R..R)), XYDATA
$$ [...]
27969 -38529 29950 201030 276458 112384 41873 12811 21512 70614 39360 47642 78664 72885
27957 72885 100500 158363 135000 -54825 -139782 -59335 9883 83201 143091 95807 1818
27946 1818 77665 148606 166407 100763 5660 6147 -54345 31875 -108206 -220289 -101732 -31592
27934 -31592 4271 100362 39432 13148 -70122 -4471 13197 -131670 -169934 -140684 -192188
27923 -192188 -119058 66681 -16742 -92671 15830 -44085 -219535 -138049 -32876 99015
27913 99015 142174 188017 128370 34627 64424 205783 152451 56757 53457 139 -63396 -9156
27901 -9156 -20739 7387 19227 -70983 -107667 1937 100357 176247 192920 195482 20078 40375
27889 40375 71143 15804 37993 49241 66402 86433 137328 267039 196894 122913 216751
27878 216751 263485 164540 -22410 -176936 -168398 -126586 -74758 -117303 -110441 -182366 -91704
27867 -91704 -51232 -53597 -8642 -587 9370 37714 80382 33314 63074 77390 -15900 -64152
27855 -64152 -12974 114773 96337 125760 101631 16455 59818 68378 -32832 -46960 976
27844 976 43513 4484 7783 95279 219087 267954 115017 37411 78733 81208 29558 68909
27832 68909 104803 184761 115417 59193 25344 -7066 -171850 -128738 -56588 -44258 -31211
27821 -31211 31631 96694 179376 159678 135647 147910 186800 200662 268751 125677 -10531
27810 -10531 -115935 -148316 7359 85826 -30977 -111179 -46985 127333 161633 155433 -5859
27799 -5859 -161634 -224361 -203577 -241502 -256660 -134494 -129395 -215136 -209460 -187730 -186212 -295563
27787 -295563 -265524 -91156 -103667 -84739 -102916 -127103 -63718 -35846 -94241 -60561 -14790
27776 -14790 62417 113841 60963 107522 74502 -74687 -99747 -15752 -10513 -96053 7664
27765 7664 -78797 -160630 -128417 -99310 -233616 -231756 -126250 -91305 -78518 -50462 -280 -9451
27753 -9451 -63806 38998 33776 178999 70512 -75024 -996 63229 73177 48496 38906 10138
27741 10138 31179 72525 131459 158448 104503 4992 -6572 -47452 -20601 -92475 -129434 -142084
27729 -142084 -184183 -136985 -91937 -22287 86333 84963 686 56819 39010 89619 183034
27718 183034 285145 281405 254124 199306 198652 178446 181178 48560 -22469 5906 94949 34209
27706 34209 90006 155659 250151 230422 116169 158351 99125 51292 74471 17040 -71184
27695 -71184 -9030 -122143 -190161 -136354 -73928 58667 26836 -46231 55160 220347 230392
27684 230392 125466 185402 195180 80237 60854 67804 -23199 -94879 -12989 56137 127233
27673 127233 119996 93156 133367 188462 170938 66806 -124737 -141059 -39479 1402 -4053
27662 -4053 -68369 13932 -13321 -78858 -24591 105013 209557 261913 279374 153004 108315
27651 108315 239667 235366 156705 165732 150836 1925 47090 26017 50853 98291 263748
27640 263748 262168 271161 214877 207767 119276 110182 175825 225653 115042 53375 23093 21220
27628 21220 -47023 -54209 -49389 -101285 -35648 -95446 -80765 -28386 -26682 16606 81140 132517
27616 132517 72907 23994 62683 51644 -47558 -70898 -74674 -22055 17617 -40263 -108882 -186189
27604 -186189 -164915 -135424 -117698 -143894 -162181 -131664 -87308 55955 -28754 -151226 -129251
27593 -129251 -61034 -14130 74971 69034 55396 63478 10443 -90999 -98705 -13874 66715 77866
27581 77866 105348 46815 5009 -14839 4790 -81273 -135416 -41732 27184 45685 110642 144966
27569 144966 132718 120173 75228 3225 -129564 -116775 -20805 16348 69228 127768 113213
27558 113213 57629 -20339 -71126 -80345 -24110 18296 78880 21804 -73748 -107663 -101271 -50457
27546 -50457 22619 -30506 -27679 -19001 -27520 11215 -3391 -13208 47166 107770 126888 74566
27534 74566 -78125 -160184 -156747 22526 -44240 -65979 40938 58647 45850 66482 14468
27523 14468 23027 119022 228243 323636 286048 243769 135349 169137 129401 96094 71894
27512 71894 34061 145729 207524 162766 38516 -51872 -37241 -103032 -164165 -256314 -155983
27501 -155983 -48646 24557 -20266 -17444 4113 27015 -50558 -4086 2828 -1042 -120499 -320184
27489 -320184 -402868 -217964 -56528 18293 21385 -90771 -146021 -94010 -27217 14230 257
27478 257 -76775 -188275 -225722 -139807 -87258 3022 96262 76264 39864 17010 27364 15868
27466 15868 26873 76915 92914 51434 25034 16042 69605 67488 -2897 -137155 -85362 -15012
27454 -15012 -65430 -61412 -112909 -127144 -124834 -184837 -285862 -239730 -143883 -94070 -151921 -55822
27442 -55822 83691 190715 266645 257322 122004 144590 35349 107235 207731 143762 69371
27431 69371 56249 -2761 20127 57185 79669 110534 136586 96329 73862 14863 -8562 -100918
27419 -100918 -78993 70622 16959 -56749 -149097 -190353 -155124 34381 127096 97090 69128
27408 69128 59484 27293 -52372 -103883 -47469 15763 67013 125653 172860 204514 239183 244706
27396 244706 342212 320825 173485 209628 161228 83016 17172 77839 142253 178705 262097
27385 262097 215998 34677 -75271 -68541 -58135 -55817 -68371 59060 44185 78712 61152
27374 61152 -71485 -214153 -119168 -56902 -59685 -104290 -102592 -53291 -10685 -118557 -138229
27363 -138229 -99204 31127 97539 74150 108938 -14430 -60780 -47645 -44612 -147288 -85475
27352 -85475 89017 67316 26214 98745 189982 253141 253440 73030 -74117 -115873 29361
27341 29361 97116 79217 186401 212253 283012 125523 17925 -88170 -105652 -79504 4611
27330 4611 -1893 -65380 25136 126842 195190 191600 97952 44418 57564 92037 56361 66610
27318 66610 79707 174687 255032 147479 -35958 -126456 -112416 -8478 -43836 -200165 -256687
27307 -256687 -183372 -53530 54361 90122 -142145 -161195 -178569 -203802 -148991 -99746 -44951
27296 -44951 -37341 -113074 -196677 -197324 -70460 -75960 -55520 -105110 -90520 -9935 -19552 -45300
27284 -45300 -115770 -114300 68141 97461 53708 -20722 -117824 -210480 -104694 66973 228198
27273 228198 186358 -44229 -97178 -41990 -46784 13105 -43232 -28702 -57958 -108217 -69815
27262 -69815 -27284 -8486 59031 51186 64822 35334 -50626 -7496 -1015 68759 158787 103947
27250 103947 -24229 -91855 -84097 73071 77667 71416 202264 152270 145143 163956 69106 40568
27238 40568 110947 70501 -49876 -53864 -5422 86968 -80719 -144736 -65624 -137477 -37536
27227 -37536 72719 203436 100525 38049 118738 135745 160691 104611 41081 16386 -68305
27216 -68305 -115252 -91512 50969 111651 43675 -125433 -102727 -84475 -129173 -81091 -127786
27205 -127786 -82199 -8711 -29106 -59988 -106566 -116159 -58559 -17819 -32591 22190 4290 16429
27193 16429 20377 116284 210149 203848 152331 183254 241866 151430 115042 139042 93346 38039
27181 38039 26906 -23101 -199038 -291296 -148748 -27511 -67774 -109845 -127657 -57832 -23267
27170 -23267 15108 -12203 -163040 -166183 -158371 -120346 -108969 -109368 -120332 -81082 -18149 -54412
27158 -54412 -100138 -186412 -207068 -195004 -98559 -128069 -124293 -57323 -104035 -33405 -90098 -37845
27146 -37845 27073 -425 16602 -20206 -39871 -70964 -56808 -95206 -93353 -31903 -41525 -56960
27134 -56960 47082 123686 4366 18654 83607 68453 -1309 -71301 -76333 -175290 -272196
27123 -272196 -237710 -163229 -31106 -131194 -181490 -128910 -169947 -232467 -199801 -182375 -99570
27112 -99570 7194 -13320 -139695 -215070 -235617 -295418 -210826 -97684 -217220 -196760 -147290
27101 -147290 -117606 -86320 68233 102033 59180 -18350 29619 10668 96791 140414 86536
27090 86536 103475 98551 -70355 -55767 -3360 21526 51380 -43628 -7710 41605 53294 73582
27078 73582 8236 -85722 5269 92872 73773 -26763 -34082 21232 70924 115739 101899 52705
27066 52705 -88846 -76592 -187809 -223580 -224110 -312419 -221010 -78377 -12108 -58725 -63815 -20020
27054 -20020 -9389 -82072 -7196 107291 116949 -41031 -14497 10195 28799 42805 -76235
27043 -76235 -81349 -48307 -101858 -44167 14657 -10403 -8084 81314 68942 -29764 -5298 70961
27031 70961 92381 83173 181965 231664 137888 16 -65266 -50630 -67006 35877 14156
27020 14156 -43212 -256 -19091 58991 84333 -8830 24105 85066 56817 -52457 -110831
27009 -110831 -122688 -106313 -29997 -33401 -69851 -34000 77409 32760 147368 233447 218613
26998 218613 165244 73344 137249 204072 214868 62996 -54178 -133712 -157616 7435 28680
26987 28680 -1368 -12093 -75246 -69364 -127051 -118288 -8108 89915 149601 159148 170402 211485
26975 211485 272851 247163 162414 34935 135643 125527 96096 111766 99283 44959 91512
26964 91512 119933 50554 18323 -64706 -32798 -26042 -27805 33832 -75618 -163571 -17932 -68236
26952 -68236 -101529 -47950 -64040 -46603 38934 -41890 8443 39598 75907 88983 71168 -36724
26940 -36724 -101992 -154154 -23833 -30204 -179369 -290373 -197565 -209412 -132143 -77322 -75880
26929 -75880 -51688 -44624 -91066 -39941 106454 123215 -23838 -93117 -41984 -27598 -12443
26918 -12443 104462 72248 132977 110847 103411 88688 75943 -21473 33507 12449 -14338 83133
26906 83133 126281 123797 220262 153826 -122832 -181232 -85653 -46996 -7920 -84907 -93528 19886
26894 19886 10397 -85300 -114790 -36756 48802 145720 235976 336324 215363 177351 228310
26883 228310 195373 65625 87954 63272 28559 -10562 -50891 -48655 68943 133359 25449
26872 25449 -19734 13597 87631 -4151 36161 118620 33866 -42240 -55151 -68457 -6897 18011
26860 18011 -27946 41274 180607 115885 -50761 -130791 -84804 16536 10115 98533 -10132
26849 -10132 -94394 -109430 -198160 -212640 -86830 25837 100570 203525 273726 226225 236846
26838 236846 197244 130324 44954 58805 77341 145031 158301 -17367 -86242 -168376 -101825
26827 -101825 -26364 35555 59327 88269 64172 87646 94417 -47751 -202645 -111349 -9610
26816 -9610 31708 -63749 -41731 -10595 -65516 8648 71162 79642 -18347 -69579 -113369 -35156
26804 -35156 27746 -56300 -70722 38109 71747 49294 -108209 -234286 -86710 4179 -50504
26793 -50504 127490 120662 -38392 -21834 -45708 16638 31083 25561 19694 -5121 31044 148818
26781 148818 235379 154263 120599 50908 21957 23317 56246 165211 118942 -78230 -177171
26770 -177171 -197699 -144999 -48727 -53958 20453 -9615 6724 62069 58520 -142589 -44967 78468
26758 78468 79104 74597 42396 52287 81619 22080 14753 48663 68881 148762 148671 138439 137570 125725
26744 125725 14636 -39974 -57026 -116799 -110675 32298 39012 18714 -59996 -102684 -64415
26733 -64415 -92833 19857 100356 47721 -87024 -179937 -171421 -90494 8267 1264 -146822
26722 -146822 -148782 -122099 -145769 -129312 24192 127419 130652 30870 8299 -69940 -109034
26711 -109034 -125622 -93373 -45459 -18708 57427 194505 166486 81813 225137 257842 97958
26700 97958 -24676 -33161 -40707 -14053 -16249 -25566 2340 -91666 -106304 -99744 -52420 -11401
26688 -11401 -21740 -17996 -130328 -118598 -63993 -85142 -47322 -66292 -65795 -15090 -11782 -52275
26676 -52275 -2036 -42274 21291 19283 94453 78939 4458 20725 -130811 -162060 -129058 -57399
26664 -57399 -183815 -128020 -41819 -97326 -227575 -191279 -186634 -142370 -140267 -174887 -168024 -178862
26652 -178862 -123984 -4028 164156 185595 156137 86902 -18592 -46577 -52788 24319 -73452
26641 -73452 -111831 35514 187624 130663 127673 133858 51312 -52387 -93312 -87282 -13251 1071
26629 1071 -82415 -100064 -89978 -82741 -162825 -130797 7803 -9457 -31807 27507 78008 199212
26617 199212 404810 379705 210813 89567 12838 31415 105573 126773 88114 26371 -70635
26606 -70635 -83779 -119759 -63296 25131 237066 199786 162051 96815 69469 57551 194298
26595 194298 230341 186485 67801 34409 34153 -3682 62092 48299 122816 201928 245049 172871
26583 172871 161641 23893 -73527 -36587 -75269 -56348 4853 80439 -46461 -138477 -186212
26572 -186212 -170895 -22225 -107773 -127730 -38806 -42671 -101893 -88489 50519 52702 11551
26561 11551 25991 -25343 -45134 -117937 -187125 -207657 -123327 -98158 -65087 -147904 -139509 -144463
26549 -144463 -102348 42862 -64985 -212907 -172841 -209460 -176160 -324219 -338426 -167527
26539 -167527 -28028 -48895 -35227 38383 -17271 -111594 -98863 -78988 -14094 -17498 6420
26528 6420 24227 55846 130979 118184 69726 120245 122684 211918 187946 140592 11746 -44346
26516 -44346 -1814 -27550 3052 41625 -47877 -811 47412 86518 53546 -18353 -53399 -78304
26504 -78304 -50323 -119704 -75285 89150 96730 141780 85961 52653 -43048 -46595 9069 45274
26492 45274 -51113 70606 140572 229844 259699 198645 48248 -141127 -132429 -59790 52067
26481 52067 69884 26185 22790 -17327 43753 204398 155066 107039 51502 -9497 80013 116526
26469 116526 21693 51204 47300 37327 2025 -39902 2262 -75119 -67278 -67556 -38610 -81595
26457 -81595 -70015 -14553 8103 -99769 -40849 98305 33134 -59770 -135300 -90118 88691
26446 88691 -10899 -127439 -153722 -74050 30744 142314 149341 166357 140283 122668 55530
26435 55530 83968 87328 -118786 -155731 -95834 -81817 -94561 -129457 -102964 -99909 -51450 19398
26423 19398 -35100 -34076 -77091 -42821 -121283 -150932 -323653 -371712 -246607 -135504 11612
26412 11612 190980 277315 170437 1791 -29832 -3533 13553 -30011 -8677 39071 -41740
26401 -41740 62398 61070 38962 -25618 -172202 -92810 38966 16737 20527 78261 76168 -39841
26389 -39841 -31151 -52630 22473 120999 54098 48548 158138 121909 -51908 -112283 -142456 -182494
26377 -182494 -55576 -14257 -135657 -153823 -2415 9598 -71596 -10684 70630 90918 45224
26366 45224 -40917 -77124 -57403 32051 -40362 4946 33939 9627 107502 87559 29382 37810
26354 37810 -23007 -25054 -14834 -2233 -257 -136764 -126711 44988 81438 151578 164543 46589
26342 46589 9089 120058 135513 124109 -10942 -49249 57796 126149 74281 46630 128808
26331 128808 86851 4063 19307 39982 66522 96959 115358 93779 88609 6100 10991 10299
26319 10299 72454 107578 3928 -75812 -113644 -140268 -169766 13976 142721 196847 214273
26308 214273 50332 -60134 -17599 -32144 -28193 -73196 -4815 46690 211697 250643 163136
26297 163136 73432 -26810 -90867 -116540 -128036 -140387 -142265 -207341 -160976 -33941 -94297
26286 -94297 -147503 -94465 -63056 -10052 -95604 -215646 -164429 -50044 79760 64580 -146988
26275 -146988 -123309 -120442 -183605 -89957 -27127 -48530 -65567 21817 -43766 -119669 -129428 -123976
26263 -123976 -70782 -66651 -15167 3799 33852 133267 93869 35396 14131 71121 122079 155674
26251 155674 111324 177991 118101 22496 60011 177760 190829 165425 28720 -43983 13192
26240 13192 189887 127616 66365 -14172 -21886 -36825 6896 6050 -12219 -29188 -118955 -125959
26228 -125959 -147456 -118585 -13204 160263 233657 315620 344416 276899 177751 126939 19927
26217 19927 -110824 -230355 -190409 -192236 -148352 -89956 -6947 -19023 -97682 -230261 -122839
26206 -122839 -92079 -34390 20453 104332 103447 66900 73948 14992 -119841 -93343 -30872 56382
26194 56382 122919 221217 158474 1977 -65965 9106 -46782 -155 95332 108620 154322
26183 154322 199779 170054 52621 36736 108768 143044 46710 -82129 -63677 48789 105482
26172 105482 145409 73334 -48401 -115618 -158 -78862 -61939 20109 96166 -56423 -10039
26161 -10039 78832 108129 122174 -52782 -81491 -51011 5320 824 12958 39302 36356 29000
26149 29000 -92335 -129911 -151045 -138881 -103677 -119383 -184019 -208191 -172824 -186388 -26725
26138 -26725 51251 148222 166919 26710 8550 85831 95356 78807 127305 125122 158095 106701
26126 106701 139659 106506 -50559 -42908 20206 -65970 -109266 -50776 -17641 -31426 1238
26115 1238 623 72679 167332 171034 153537 64365 47182 -92320 -94590 -44050 -11386 130077
26103 130077 169924 110933 -771 -39507 51601 37175 18904 -57089 -45996 -24553 -45149
26092 -45149 -34067 10843 58456 137834 301257 211778 218108 118089 91679 166817 200407
26081 200407 164595 108930 -54906 -166726 -171964 -134364 -105746 -103793 -43960 83661 128671
26070 128671 96592 -43968 -71873 -14219 101998 129219 119238 29630 -38383 -51667 -66876
26059 -66876 -355 -23941 -44847 -76351 -10678 117180 117709 67370 119826 94989 38861 -43718
26047 -43718 -7656 151822 190108 184547 84362 3127 -37458 -16227 21653 -9080 56971
26036 56971 27786 -42221 -71635 -156737 -85712 30756 150235 37673 -8980 28702 7888
26025 7888 52049 -37180 -91918 -124574 -145302 -87524 -26220 63551 88089 -33039 -71483 -67302
26013 -67302 -56656 43559 74707 69158 80581 185591 162097 88608 -28684 -23744 82535
26002 82535 57415 66542 83462 139622 174666 34368 20360 69681 135649 117674 46608 72235
25990 72235 82983 9404 -103280 -238085 -221053 -129377 -61615 3242 134049 47782 -169951
25979 -169951 -199861 -123719 -27250 1271 47909 8854 20295 235582 300580 323047 345061
25968 345061 360133 203436 106146 115211 118292 30068 53921 75263 50204 4220 -5344 -68281
25956 -68281 -90929 27259 136259 124223 92379 108208 159958 118905 -1134 66029 153411
25945 153411 55623 111958 215992 204277 33471 43146 -15854 -4412 31027 24414 12497
25934 12497 -79399 -63994 -155278 -269620 -95988 37312 12107 137274 207108 189496 58792
25923 58792 -55681 -35705 22575 114622 109272 -1923 -60633 75724 156941 166224 238742
25912 238742 238755 166479 129673 26957 73050 68298 42233 -6266 32559 -95921 -111523 -83023
25900 -83023 -3641 83194 216419 209645 53264 5080 43966 43099 -44623 22861 -15447 -39874
25888 -39874 -99261 -191545 -196349 -102275 -57378 -60939 -30329 116908 221982 76156 72533 -21483
25876 -21483 -106881 9638 90184 103861 172244 199698 74007 -52768 -104960 35200 87225
25865 87225 42602 -74868 -99707 47337 136899 112162 80176 75978 54522 -104361 -117619
25854 -117619 -84573 -55279 83357 166055 129723 126380 103970 115844 87300 56846 7253
25843 7253 43330 95483 146121 166268 168630 121567 7433 7224 -59383 -149268 -234993 -238898
25831 -238898 -198250 -157261 -72718 -63759 -38340 40259 64730 -107739 -81346 -28416 -49662
25820 -49662 -69148 -88454 -115967 -31490 -102734 -73388 11207 137969 148768 234553 198168
25809 198168 89080 9362 -22773 -90616 -86494 -39419 -104192 -207562 -175118 -51265 -62817
25798 -62817 25758 -72707 -158132 61536 114111 36555 -20519 -83915 -128880 -206026 -144563
25787 -144563 -40514 -146833 -215614 -307137 -203429 -70779 18426 12684 35843 31496 8955
25776 8955 -19715 -17127 -1809 -66676 -94765 -94322 -161942 -232721 -190727 -6479 54759 16140
25764 16140 -29432 -34419 31440 44331 -10398 59588 -37766 44468 197577 229908 164698 65762
25752 65762 -18412 74128 64378 78917 -6515 -25314 6749 -59659 -98564 -136091 -94774 -93055
25740 -93055 -29155 -57418 -73052 -79718 -60063 -167 -23392 80362 36949 -8106 -12690 -56896
25728 -56896 26277 223059 162167 100123 86379 140364 47216 -45133 -206313 -174516 -81095
25717 -81095 17816 -4024 10166 -57986 -83913 39701 113964 77225 245 -41863 -81827
25706 -81827 -182929 -224959 -116278 27335 27148 96224 138079 186870 134526 224475 269115
25695 269115 174188 119676 99736 20364 56876 -17506 60081 -120151 -133397 -113584 -119036
25684 -119036 -96760 -57302 -145602 -55592 144885 114444 -11498 -58874 30401 69189 59293
25673 59293 29034 -20179 -3138 -73071 -133480 -58736 -103066 -103244 1155 -41320 -67542 -139891
25661 -139891 -80907 -40196 -102928 -26576 143882 157132 48561 -21873 -23350 -47029 -132686
25650 -132686 -58475 40769 -42269 -145119 -118819 -64753 -14738 -54671 -26256 87256 136528
25639 136528 156083 66687 -19745 -183865 -221777 -189788 -231526 -73811 113560 44365 -14354
25628 -14354 -59189 -56354 61925 119145 175422 141077 136388 106127 -90739 -164994 -115864 -108299
25616 -108299 11414 78241 34527 77283 131717 152591 60597 103392 135665 20566 21857
25605 21857 -55265 -39048 -76028 -132825 -211436 -128041 -23811 21848 71637 189043 154828
25594 154828 80331 -1207 35668 6307 -99909 -66969 -76350 -44680 -24832 -50822 -65574
25583 -65574 18220 -27505 -78490 -163776 -167124 -160819 -217885 -149036 -44902 -115880 -179052 -209663
25571 -209663 -111520 -77355 -109770 -96644 -86287 -51573 -129934 -52352 14089 148570 150505
25560 150505 158489 68662 91645 172982 33002 -36323 -567 -35365 -1871 19321 92670
25549 92670 148201 82759 106526 89131 125871 64314 -28482 -80454 26226 -30828 -67505
25538 -67505 -138771 -201731 -91208 13521 21201 58176 52605 -77004 -594 142911 274679
25527 274679 224359 33618 -67574 14992 100822 94211 178698 54132 -36107 24463 129224
25516 129224 142465 101515 53000 181919 178014 128861 88376 96467 85340 81689 85793 101817
25504 101817 129379 169940 79241 -76099 -182881 -67737 52730 112106 4337 -26868
25494 -26868 125988 111344 33090 132639 210476 190377 105442 -3124 -109196 -88432 -89738
25483 -89738 -21873 -70470 -125045 -93813 35415 178145 223576 111972 21561 17211 34824
25472 34824 152768 220754 180094 221533 193810 60689 -896 -119009 218 54961 20089
25461 20089 7622 -41935 15999 89527 75283 -6302 -860 -95243 -47645 -74643 -167239 -103012
25449 -103012 -4606 -61179 -149535 -88984 42279 153783 115747 107853 62278 65701 268370
25438 268370 279240 204771 132616 125551 86220 110130 131484 63509 24767 82659 106366 180624
25426 180624 144884 97931 76570 -74313 -207557 -228260 -153081 -143401 -59903 -5714 15199
25415 15199 34845 -57763 -66794 50082 -42072 -86511 -90863 -193647 -201579 -41325 39188 42809
25403 42809 109844 166420 166471 143424 148467 197164 230173 220087 23980 -87922 -11327 122413
25391 122413 100863 122591 171573 122552 96593 65857 104725 96224 38331 6959 67754 53987
25379 53987 79854 114721 146878 144771 156806 43748 -35874 -13042 50073 126584 64817 123577
25367 123577 159594 129573 110047 83861 134090 46769 73979 16346 -24357 16611 -3776
25356 -3776 3503 85010 94514 100771 11791 -153621 -164795 -13543 68135 12254 -107524 -198629
25344 -198629 -153113 -39266 139987 111561 11858 2932 743 5462 85855 55071 -28686 16085
25332 16085 -2685 -45475 25664 36493 56800 100403 151674 5162 53308 50999 47709 -10007
25320 -10007 -146847 -92935 24699 127924 62948 -52789 -120631 -107839 -88261 -56597 -438
25309 -438 35326 69208 45487 35558 45452 6025 -52012 -58824 17767 -1847 15597 100211 169224
25296 169224 124423 65411 60209 31246 76873 -80579 -176348 -42420 116823 62818 74239
25285 74239 175795 186106 172916 117572 86170 57634 42313 140503 172543 120479 -20413
25274 -20413 -65122 18138 85267 25005 12758 70900 118629 100133 125194 -13971 -67760
25263 -67760 -48503 3726 -62035 -174123 -160137 -75600 -118622 54940 82790 16709 -62978
25252 -62978 -142655 -50072 -37873 -26564 -1070 35540 110685 181025 196881 194500 215293 221514
25240 221514 244365 128567 96309 106343 80332 51392 53347 59199 -39347 -40681 -22003 -8585
25228 -8585 83395 24165 -160622 -245835 -135785 21709 421 -26820 -2008 -83254 -98883
25217 -98883 -136256 -49094 -28278 31453 62959 64208 82790 69680 50637 41708 -71200 -210007
25205 -210007 -197113 -168644 -167909 -133334 -32407 28819 46324 100679 82098 40212 17649 50459
25193 50459 59119 6488 14072 55501 -97170 -183577 -136909 -11884 58889 -24581 -127336
25182 -127336 -271689 -208252 -1077 83120 73211 29377 113251 230331 190248 133184 -33720
25171 -33720 -92931 -140563 -192427 -172409 -104679 -107767 -51131 -5788 -48788 -88999 -79776 -119095
25159 -119095 62805 142126 124319 248391 132035 7899 -26732 -73405 37595 117400
25149 117400 160877 182524 84427 49308 131026 135475 88637 35790 107236 147458 26773
25138 26773 -71051 23264 122200 94640 23912 -96243 -275166 -314649 -332558 -264766 -283655
25127 -283655 -333882 -257797 -220057 -182693 -23099 121115 41702 -142378 -227152 -207933 -109129
25116 -109129 6713 62956 115787 124661 -49147 -79710 -44891 -29028 10838 -62940 -7918
25105 -7918 4994 67180 115627 42769 1608 -37544 20109 61800 71080 95694 76190 82772
25093 82772 -12076 -28241 5439 -112070 -245210 -153155 19085 -822 66059 206719 272501
25082 272501 374032 409638 279764 146997 26741 -56666 -35179 130535 320161 317089
25072 317089 296864 189593 54843 78692 43246 15179 76944 60000 1609 87467 -8185
25061 -8185 -50224 43581 95349 -107556 -108635 38786 141626 81865 -40487 -166095 -279905
25050 -279905 -252641 -118239 -70877 33626 136903 166944 181124 62973 42738 26647 48443
25039 48443 177301 103439 112609 76621 -17422 14421 -30932 -50158 23488 88918 -27781
25028 -27781 -15531 24631 69895 56936 -68663 -104365 -88519 -32798 106870 123096 18423
25017 18423 14058 121258 164353 39938 -8177 44336 112618 53240 -78159 -151087 -248984
25006 -248984 -156166 -137817 -77166 -19049 -39872 20491 136409 180453 71138 17316 -22405
24995 -22405 -44252 -68520 -99681 -12206 -10363 -61351 -19279 75247 130332 103572 25475 71697
24983 71697 177633 217286 294617 244575 172431 234442 267757 216288 145884 33397 12462
24972 12462 118685 103473 36515 16778 112545 97509 57176 58116 -13173 28186 114490 188586
24960 188586 2709 -102059 -39607 -57425 -97377 -43968 57538 85696 44211 33980 -44085
24949 -44085 -103335 -144068 -46638 74936 50102 31849 56717 142224 180881 215404 223332 301623
24937 301623 234079 174240 174982 68291 10602 -12419 -90306 -131971 -36638 44590 52460 84287
24925 84287 127441 138987 220911 286034 261156 208136 134739 95535 94306 77439 -15003 98139
24913 98139 164469 147757 76772 -79128 -41839 -13425 -21380 -38637 287 -39465 36070 99782
24901 99782 12116 -58435 -31243 30775 41186 119068 50029 60694 52723 51089 -26704 582
24889 582 45166 -1557 13518 -1980 114133 59071 51897 -137589 -117325 67642 167861
24878 167861 119310 50206 52104 94572 107066 70756 12728 -10972 -7910 3017 37940 -133590
24866 -133590 -33854 -7815 59938 3017 30255 49580 80775 74112 13707 21250 21467 89190
24854 89190 138826 168006 101361 -27215 27462 75922 124004 225945 317796 224382 33617
24843 33617 -147936 -154737 64413 105272 26254 81822 116208 -53677 -49187 -40220 55903 -33218
24831 -33218 -69825 5957 10066 34378 -17638 -34090 -64519 -45611 37278 -111651 -82644 15180
24819 15180 -6092 -65458 -142321 -176455 -98097 137083 21346 -119831 -94913 -47855 10019
24808 10019 53471 51068 70108 52199 19662 -121291 -116991 -5453 19168 -6250 -2926 -19737
24796 -19737 7166 40139 136780 125499 -52517 32657 15278 -113384 1202 49512 13046
24785 13046 -17501 -38658 5816 -28262 -102650 -84505 15633 -16609 -37455 120137 313945
24774 313945 252704 125740 -51096 -92340 -73266 -38184 65253 20300 28327 59882 5514
24763 5514 13519 59181 160530 274519 261655 219655 57606 -18775 -48860 -23159 -106926
24752 -106926 -116029 -82849 -50110 7092 -17683 -34731 -61076 -12669 -56101 -72886 -94211 -100413
24740 -100413 -134533 -49541 29111 82241 100856 23689 42865 228152 191962 96027 88639
24729 88639 66594 36208 -17982 -63350 -86060 -52980 -21176 77911 168832 119963 68278 -31333
24717 -31333 -72106 -11650 36374 64327 220165 271710 209117 213046 119439 7186 -152054
24706 -152054 -125416 -86130 -67122 61911 64951 -16179 -17086 -45338 -26649 -53723 -97237 20246
24694 20246 14625 -42782 14649 -105468 -40060 95072 20306 -42883 60468 148964 242596
24683 242596 126230 68632 -44380 -24058 55534 8477 7229 -12073 -98275 -154540 -189647
24672 -189647 -184404 -60443 135052 137493 25407 -101189 -68531 -144605 -203172 -111894 45834
24661 45834 125718 89910 90865 30448 55398 -26429 -9114 88515 69051 -21306 -35402 -53841
24649 -53841 -30940 -38152 36007 104997 41198 22105 21534 -4726 19325 -42294 -94201 -53466
24637 -53466 66044 131047 41236 -5645 121347 89446 22249 -76569 -29044 -53622 -99014
24626 -99014 -115483 -67609 -32690 -93562 -53468 37925 68546 112238 174662 76844 -27587
24615 -27587 58302 180478 162333 130657 158992 340721 413121 293421 76685 30768 -31889
24604 -31889 -137101 -47929 -138161 -213832 -81255 -37215 -34016 54236 141760 74514 39611
24593 39611 74174 59839 12581 54156 -45119 -99624 -152894 -205573 -114837 -97945 -110011 -62141
24581 -62141 -2828 -34755 -72876 -191639 -139018 -152961 -104948 -46212 -33862 -55138 -111513
24570 -111513 -192674 -211031 -25202 90107 86412 80996 65485 111938 56416 91396 138593
24559 138593 212061 181375 89130 107676 164039 64107 -69949 -115684 -105729 -23006 51243
24548 51243 -10934 2590 -48965 -27728 -11361 -59287 -93496 -43541 -73371 -124121 -64223 87789
24536 87789 114814 115633 143049 103092 5640 25596 90266 15125 516 104367 120500 137282
24524 137282 53185 -26502 -32057 -79504 -69821 -29502 104273 74976 97864 28103 -53417 -131017
24512 -131017 -186093 -199081 -160740 -95034 -62965 -128524 -55060 -71003 -56577 11074 -66780
24501 -66780 -13943 40580 41377 43681 5651 690 28339 131767 156336 134135 106898 81674
24489 81674 134435 509 48884 96735 58161 107874 113710 144116 194939 126170 176427 116939
24477 116939 94390 149054 97825 79449 228419 217853 97243 98214 127940 66277 50269
24466 50269 -38061 -152786 -78809 65504 -76 -128257 -112870 -59768 -16315 -30223 81235
24455 81235 164632 265050 145662 164519 82346 46901 -17635 -27367 52761 129508 134107 183657
24443 183657 44053 -51107 15083 30076 67749 52249 112230 200935 196647 173732 252464
24432 252464 300806 133729 -19980 -104559 -38574 -7596 58790 45698 -60255 -4162 73153
24421 73153 -71610 -26077 48850 89268 8338 36742 -21259 9045 -39027 17106 110683
24410 110683 53506 -81269 -75912 19866 124749 28903 53157 109672 -32133 -77957 37938
24399 37938 -43523 -148046 -84052 -23782 -56254 -98483 -119318 2178 21995 -48222 110674
24388 110674 259168 267413 239032 184796 36594 53797 8173 1854 33744 -27503 -53695
24377 -53695 -142175 -63585 -47913 -131532 -136171 -155778 -156203 -42846 -54890 -140840 -57586 -24482
24365 -24482 -9062 -42773 79957 215004 217026 95669 144126 119964 71958 94460 9607
24354 9607 -80194 67999 153050 128861 125372 -56437 -86737 -24570 -26827 58465 86435 127732
24342 127732 136663 86442 626 -53236 -134120 -205623 -119106 22297 106394 54290 -58909
24331 -58909 -47450 -54559 24015 38847 20242 -47265 -209980 -226970 -168934 -42942 45197
24320 45197 106555 54591 29653 180692 207168 107964 97158 28328 -130366 -153082 -156209
24309 -156209 -53450 51970 123235 85230 123087 89656 -5250 -7309 40253 35960 -38263
24298 -38263 -19639 31793 66545 78977 75680 77731 124150 13466 -122481 -146410 -105297 14813
24286 14813 -29692 -111205 -171717 -265918 -273635 -227954 -37467 -15347 -42878 -57271 28189 28095
24274 28095 58825 42874 -5000 -14328 10369 32828 -4990 -22955 32880 91509 104841 121826
24262 121826 108677 -15866 -59649 24247 42236 22484 23432 46931 2028 -22424 36448 -1377
24250 -1377 6061 -46970 -136791 -183855 -195780 -119348 -34101 46080 -2387 -74387 -22876 -20801
24238 -20801 -79130 -92929 -35227 55401 15397 11330 12814 108760 172339 84352 -33619 32489
24226 32489 65558 -88952 -167052 -94257 -108209 -94470 4379 153509 88609 2025 71433
24215 71433 -21506 -32656 46549 -56662 -150947 -56650 -96606 -227316 -320489 -306948 -272122
24204 -272122 -321555 -223384 -59183 -21633 -224621 -188011 18087 62869 -7985 10941 29765
24193 29765 136808 169595 110202 73790 58241 -32516 -29629 -6678 -3531 -61883 -47981 78417
24181 78417 149723 90354 16825 118305 158040 -27044 -82674 -55609 18531 -22531 -32954
24170 -32954 26916 85886 43470 -32698 19425 56619 -27957 -78972 -120162 -37088 -2047 14612
24158 14612 -49857 -67737 -172250 -212249 -160459 -43205 -30575 73328 50633 13062 69765
24147 69765 -3188 -109104 -165555 -88454 81849 209302 165093 59867 -10501 -96839 -154119
24136 -154119 -158644 -128965 -56101 89776 141435 212833 164620 118222 93613 -15657 13699
24125 13699 93130 141354 142643 150689 102142 55935 19027 -23139 -33431 24278 -15161 -5613
24113 -5613 52358 38764 -46509 60687 98250 116224 105045 -36588 -38385 73707 33962
24102 33962 63067 185984 239277 282643 215609 64143 22038 40421 36559 24585 89104
24091 89104 111226 193783 164338 121075 228877 242530 252033 124323 -89530 -75064 -9310
24080 -9310 -42922 -52789 -176787 -150867 -237944 -393575 -362200 -331068 -246943 -227843 -161526 -108971
24068 -108971 -132644 -203694 -238441 -77086 -4842 -23548 -32286 -107859 -46629 -90133 -115369
24057 -115369 -21761 1349 86402 569 40314 94441 28774 -43072 30448 136727 166823
24046 166823 178587 144607 117659 47935 -76707 4822 84571 81868 34513 98425 47629
24035 47629 -2863 20220 -23084 -52488 -50499 5638 107083 115696 -22217 -73009 -35182 32141
24023 32141 206179 253126 247976 144408 84834 79615 65614 135721 179947 306583 241295
24012 241295 144959 116772 133568 156948 255670 241191 21844 27367 -26480 -1937 73834
24001 73834 162490 140163 99066 -28967 -18775 124740 181998 139375 47220 -3860 60080
23990 60080 60949 123305 73445 49418 54091 135120 187533 69360 32264 55448 20596 -93960
23978 -93960 -131007 -57192 15542 15852 25720 -59022 -59315 8496 -33498 -90649 -15143 44121 -16153
23965 -16153 -15882 35506 124741 102704 -25770 -101328 -117416 -195176 -216014 -217017 -196239 -115991
23953 -115991 54352 68055 60068 119830 246295 204405 157749 45715 560 98113 -54003
23942 -54003 -115935 -7082 -34849 -101095 -61769 120428 212878 282283 156316 4489 82857
23931 82857 155984 123148 -19994 -139064 -108422 -166935 -180781 -127515 -30867 122920 26985
23920 26985 -7081 -69403 -12042 8312 -6944 -22873 9107 68750 84527 4378 -48277 -144276
23908 -144276 -136515 -49547 40141 125025 -30262 -104465 66053 107119 147459 -43004 -95130
23897 -95130 -10194 8028 -16362 -81878 -29301 -102080 -166509 -189708 -199264 -123279 -113681 7459
23885 7459 63505 3117 28971 127956 211299 179557 137766 43174 -117001 -82471 32116
23874 32116 105418 126717 135409 104627 -37987 7258 87248 100047 79315 26981 -44878 -17227
23862 -17227 78586 152691 55431 76234 93834 54870 17482 129803 104552 44044 45610 23521
23850 23521 63147 38328 33517 40950 -62378 -25922 20507 -79461 -200843 -180201 -127891 -118841
23838 -118841 -196148 -140779 -2443 39633 -12534 121148 209627 219867 156815 61940 97513
23827 97513 145644 107059 150609 170089 19008 -22409 -134741 -182083 -127088 -64949 -106326
23816 -106326 -10042 -55010 -73581 -47496 -169213 -162472 -99387 -78430 -184745 -206478 -112592
23805 -112592 27205 162574 213517 259186 189553 151730 136697 158573 59135 -56461 -80979
23794 -80979 49570 577 65734 113260 143432 275214 368513 317916 232861 113643 60087
23783 60087 162808 153614 107760 113491 209788 62135 -20321 -29102 -125194 -210098 -210379 -157411
23771 -157411 -183577 -226986 -153404 -20453 89066 -33434 -54015 133962 167258 88545 69310
23760 69310 37217 55790 -28812 -13989 -98264 -129796 -70422 -70608 -50249 46744 116472 44472
23748 44472 23681 -75698 -102049 -21586 -10984 24801 -63785 -72851 66643 156582 159643 88747
23736 88747 50117 77294 9612 -8615 -91465 -88123 46892 77116 51455 63478 90241 213104
23724 213104 215475 97900 -67696 -79556 -18813 -43149 -198690 -69490 96861 87483 71754
23713 71754 17287 -10514 85020 55579 -80591 -264465 -225072 -192406 -163715 -67845 -70801
23702 -70801 -55864 -38265 41034 39069 -66473 -119830 -107203 -167206 -177095 -86085 28656 176479
23690 176479 336606 290635 218823 -16221 -111650 -60965 -80607 -79774 -2167 40691 -28751
23679 -28751 -136846 44997 58063 36766 -12691 108104 112831 48943 -41570 -9015 100473
23668 100473 238938 256367 231392 193177 116137 -71243 -125767 -158139 -276055 -291187 -256307
23657 -256307 -191642 -71595 -11884 -25542 -10419 42494 75698 23117 -92821 -188629 -262166
23646 -262166 -83289 95667 -14272 -31764 92627 -14666 -77597 -169872 -221414 -207561
23636 -207561 -145405 -115236 -138059 -40481 -5539 -18410 47376 138072 173954 164699 79509 44624
23624 44624 116999 116103 85804 53276 9417 -60890 -90450 -55858 83634 105124 16199 2820
23612 2820 -21934 -67808 -130588 -214721 -142290 -74954 -35193 9204 -141156 -110394 36142
23601 36142 41274 31973 106908 222105 179947 177906 147440 124950 63745 29200 -34480 -105635
23589 -105635 12098 -1282 85692 97725 31399 65535 101694 73608 1158 -2687 -48003
23578 -48003 -64817 -75282 -56573 -8277 31572 -35769 -126014 -68413 66140 26821 -6078
23567 -6078 -14512 -44414 -497 45106 39055 47206 -16218 -32377 94664 59117 100485 -14866
23555 -14866 -200621 -100023 114642 79680 -112237 -176934 -169621 -252610 -246337 -216959 -96663
23544 -96663 -58532 -35704 -8182 -9699 -78434 -41145 -116779 -155063 -16056 59087 -49377
23533 -49377 -35304 -34481 -22819 -21346 5855 19857 -30 49691 -18967 107003 125945 39417
23521 39417 -91458 -20348 -9162 38247 86037 71277 24727 -48501 -57700 -53707 -216768 -178455
23509 -178455 -91775 -87135 67770 34720 36976 183734 158831 148012 134385 72399 -109835
23498 -109835 -86347 96157 74004 17714 12880 -10577 52732 38875 1752 -93666 49442
23487 49442 29179 24145 111733 104338 97737 158997 110646 103797 241439 207529 -20787 25616
23475 25616 145681 58069 -53209 -94800 -164199 -114504 -126022 -3738 137048 130304 75360
23464 75360 11682 50491 49853 28228 125872 123469 7728 -64852 -68393 -73005 -31805 -52887
23452 -52887 -47559 14965 69510 104210 15328 2159 114448 256488 162399 57378 -27626
23441 -27626 -124379 -118980 -106658 -78252 -20365 -46964 -144309 -116737 -75061 15743 57081 110904
23429 110904 2944 -109110 -211198 -158802 -99447 27330 25694 64542 -57441 -59505 -6404
23418 -6404 -60998 27402 154322 135174 41792 1986 -29849 -3161 1647 -109864 18152
23407 18152 113485 -21141 -93935 -41752 -50609 -103996 -61122 35951 90010 47085 -23493 -35446
23395 -35446 -37750 55083 77003 20124 16539 30783 -21917 14138 -37039 -81535 80385 90356
23383 90356 26073 31809 -65732 -79770 -90071 -43454 -81952 -32001 -2435 3925 -85947 1925
23371 1925 -3689 -105397 -73658 -90102 -140634 -110678 -37700 9960 5187 -145308 -239579 -193870
23359 -193870 -118987 -228167 -265365 -228214 -60346 -92277 -163534 -213504 -204942 -96966 13313
23348 13313 -44025 -118758 -91028 -29422 -25880 -66551 -62873 -41276 -63178 -99997 -167881 -68905
23336 -68905 -23400 -60168 -139863 -115425 -72808 34521 115368 84727 37855 -100810 -99978 -43761
23324 -43761 -36630 49923 63675 117259 -11642 -1838 -51152 -84449 -179937 -272295 -234293 -117053
23312 -117053 115298 174993 21197 84399 223059 86175 132861 170350 119420 16048
23302 16048 64587 119410 160469 130858 102887 -7789 12209 55559 10989 -9068 -44316
23291 -44316 -115579 -45508 15024 79588 72905 92779 92028 8181 9887 17607 -143772 -136771 -101194
23278 -101194 -82657 -167905 -247344 -282310 -293295 -302028 -54204 -100509 -224130 -173922 -116338
23267 -116338 10919 14015 55801 33392 35216 -28791 -10042 -46600 -63214 -115815 -143878 -17763
23255 -17763 -110426 -165421 -150827 -186882 -260580 -383199 -297797 -213053 -203333 -106766 -31711 -11607
23243 -11607 14729 -110107 -74310 -104818 -129434 106385 181779 91228 -17090 -38016 -33858
23232 -33858 -74383 -117639 -55476 -4200 -28421 13791 112362 156097 190122 89889 43657
23221 43657 53560 73262 87661 39349 -17969 21292 66214 -10019 -63392 -16706 7782 112733
23209 112733 154458 79445 106032 129044 107003 172526 77067 9553 -43674 -120900 -153228
23198 -153228 -122031 -47824 -7839 92986 143371 161145 249179 157928 38259 -5789 -136938
23187 -136938 -80587 19667 36967 121366 -10233 -36796 -94015 -180456 -188843 -156996 -82097
23176 -82097 -36663 24808 -100632 -79991 -102724 -33174 50073 -30624 -14626 74184 149347
23165 149347 118415 6583 -39385 11452 -8577 -912 6903 -29784 -81898 -123442 -93579 -146526
23153 -146526 -137771 -222669 -290702 -251460 -217804 -122660 -49750 -74054 -42685 -36063 -52493 -124592
23141 -124592 -144055 -72959 -191043 -242407 -107441 23038 180205 61893 -64655 -114690
23131 -114690 -172837 -174527 -26601 17676 16425 1003 -99517 -97144 -32767 50266 405 18338
23119 18338 98121 160817 268117 317965 277905 217355 103277 -46023 -805 70316 37617
23108 37617 97490 84859 35841 48997 132892 -3992 -128984 -117396 -63821 -42756 47939
23097 47939 14317 -25006 -81744 -6596 97171 -90163 -125315 -36486 79129 130326 37180
23086 37180 -930 -20516 24956 24641 118031 136244 99977 -49804 -27280 79343 150327 180221
23074 180221 110230 15506 -1123 9641 -23970 -114221 -165930 -156407 -181600 -137083 -11417
23063 -11417 -63846 -32970 -17151 39766 -16109 13029 36722 159511 106982 11386 -91566
23052 -91566 -165532 -160206 -115186 -136240 -232312 -172816 -52075 4594 15581 130545 136524 46310
23040 46310 50724 -108976 -160447 -82037 -134392 -95411 46751 72394 -66460 -147209 -124693
23029 -124693 -117493 -108260 -161569 -199413 -88164 -89357 -93219 -113014 -46836 -14449 -5985 -66054
23017 -66054 -152948 -79863 -52772 -34876 23002 97186 -64689 -112187 -109382 -45147 22177 8948
23005 8948 2930 -14990 -37648 -16672 -25476 -109873 -94858 -11142 50333 108805 144485 178131
22993 178131 201807 109453 96475 35079 -9952 -33498 -65319 15154 -7746 -76047 9415
22982 9415 165370 146328 -39111 -96946 -37834 -45520 -53890 -4825 -52516 -119249 -98572 -93696
22970 -93696 -178992 -209938 -149270 24762 35368 -3089 82001 53809 53011 152371 48385 -167289
22958 -167289 -257581 -241738 -251339 -206006 -199923 -103751 -165203 -58109 47394 117758 -9527
22947 -9527 -51249 -30344 -26728 -49931 -47795 -18138 -14673 -130895 -213135 -122264 -68730 -91101
22935 -91101 -36285 -1014 -89070 -134329 -41047 -53597 -38945 13108 -66766 24838 116579 61003
22923 61003 -11996 -36946 -52322 -55396 -9351 -19723 -70159 -68709 -33983 -33374 69825 50415
22911 50415 -37922 -66090 -88622 -133761 -24845 16364 -28477 -25721 47183 13518 40552 -41756
22899 -41756 -149296 -188226 -95664 -36939 -72207 23516 46453 -23654 -110000 -23976 14085
22888 14085 56545 56637 -97852 5264 109936 106184 113991 55787 -18072 55331 104369 -8480
22876 -8480 155995 175345 194826 103952 -72874 -115758 -92227 -84334 -89877 -4662 100590 68274
22864 68274 11763 -18201 53833 20877 21314 588 -53624 -101071 -128404 -4584 19859 -16627
22852 -16627 4788 -28683 85436 89635 2170 77296 65252 -31937 -28328 -44457 -39933 -34387
22840 -34387 -145324 -110899 -43005 -90182 -162235 -136138 2655 23810 4046 15622 115182
22829 115182 37570 -184593 -310075 -307058 -156899 -102771 -186342 -84337 -63918 -157703 -110558
22818 -110558 -50500 -48476 -100300 -91488 -129907 -130610 -123095 -205013 -236269 -171223 -166746 -60660
22806 -60660 -41723 -98137 -56006 -17238 -95104 -94102 -153305 -104560 23739 148484 104833
22795 104833 -20258 -76161 -128464 -46686 -110402 7935 162947 148148 47331 51900 60152
22784 60152 137377 94300 -1511 -95078 -193019 -75569 59937 59751 14792 21655 24660 -9354
22772 -9354 26911 86846 -2717 -67911 101711 252906 187178 129600 -33131 -96194 -122059
22761 -122059 -141161 -215979 -198181 -109347 -24620 118523 53549 937 15212 -73875 -30601
22750 -30601 54355 127843 210900 234955 131009 126348 -30456 -56984 -105514 -100081 -27160 31313
22738 31313 30154 -28608 -101176 -77870 -28381 15733 3558 -18310 -25819 -1488 126387 140853
22726 140853 157332 63085 -29183 16474 4059 16537 -67806 -104644 -7037 -65609 -133595
22715 -133595 -42911 -25027 44813 53469 87434 91545 58952 13176 -81064 -184124 -120318 -69871
22703 -69871 -40485 -37483 36610 143190 211641 186021 34731 -27228 -30407 60619 67060 80934
22691 80934 198284 302990 168563 1501 46334 97838 113964 59160 125181 95328 53247
22680 53247 12469 88983 -31568 -102210 -47658 -100627 -57399 119360 182056 180511 146090
22669 146090 291777 201112 10008 36898 -32104 -73195 -93390 -56633 -57419 -138871 -102412
22658 -102412 -33719 -32142 -136756 -117498 63585 222836 111597 41239 63989 129457 57848
22647 57848 51089 -20149 -47064 115071 61116 -15971 116225 73628 127875 176196 57416
22636 57416 -71140 3474 41366 90905 84714 50655 42254 118236 269699 206711 196039 98455
22624 98455 -67972 -25512 60623 122264 131623 161546 115063 -66008 -72193 -3106 27907 91206
22612 91206 225057 160228 18078 74452 103082 59267 6050 -177796 -183154 -205221 -177625
22601 -177625 -116083 -66782 -61755 -91414 -131079 -187607 -141137 -61985 -9377 89708 74144 77407
22589 77407 141320 142174 112668 98278 94979 47721 -13549 -45167 -139429 -164697 -78933 -155755
22577 -155755 -334223 -369208 -262578 -174845 -164737 -152718 -36831 59261 121232 165057 30427
22566 30427 59630 76415 43861 46880 41570 -20889 12826 40314 129719 153762 -4150 10203
22554 10203 88810 63669 -40583 -73177 -177668 -172541 -186840 -209847 -231272 -150748 31913
22543 31913 176479 59278 -68120 -83098 -8613 30092 -42127 -92056 39287 171773 92118
22532 92118 72094 73686 -14317 -74548 -143072 -146352 -168307 -134210 -90424 10834 80687 57953
22520 57953 -34803 -155854 -180680 -101918 -73412 47389 152218 164420 -35841 -78694 -43505
22509 -43505 -58239 -81068 -28678 -87102 -7764 -30403 -106048 -66201 -185427 -165399 -198065
22498 -198065 -154058 -13127 83825 109638 113017 93773 9428 27554 26790 51374 16104 -36967
22486 -36967 -2732 50924 -83778 -63099 -118894 -144855 -125914 -37014 -6101 -73103 -31056
22475 -31056 -16592 -56524 -73034 -65699 -43418 -63185 -37394 33950 -24591 -95154 -74223 -149601
22463 -149601 -216659 -174740 -152869 -64190 -31843 -43542 -2782 81536 66317 38052 -43262
22452 -43262 -48139 -111543 -131992 -79826 -6384 -22233 -46927 -27315 5322 4906 -47449 -153447
22440 -153447 -64954 -26268 -82126 -123607 -53130 -36037 -32050 -24553 -56533 -45759 -39598 -19597
22428 -19597 13446 39709 88856 65111 81107 71051 24852 39705 54672 -41109 -95699 4029
22416 4029 -51812 -123413 -279322 -122546 -8535 -61222 -41253 -40778 -89692 -154293 -124801 -41850
22404 -41850 -62733 -45882 -6430 -21186 60941 117408 -27658 -84307 -109438 -71464 68874
22393 68874 83279 3738 -45391 85467 144715 166737 158088 95729 -17068 -101497 -99196 -85820
22381 -85820 -72351 -133166 -278877 -277623 -242533 -195833 -115101 -78457 42861 28191 57552
22370 57552 -7899 37158 49100 45916 3981 -27471 -22832 -7327 129331 139343 108997 95916
22358 95916 11517 58499 60586 23275 19012 47429 11714 -91004 -67313 14643 121275 137833
22346 137833 65539 -21844 -2782 58108 60502 19243 5534 -47262 20077 177879 124929
22335 124929 -137216 -116607 -75311 -26424 -4203 -5272 67644 94609 73985 54067 -23157
22324 -23157 -57396 -172607 -129521 -36530 17599 131032 145255 50513 5603 -21580 -21147 32164
22312 32164 23136 4830 -30954 16607 -103860 -206925 -184858 -94986 -51480 -71662 -27829
22301 -27829 42147 97442 138380 135127 73986 -67356 -23947 -32301 37330 73868 155143 117706
22289 117706 66718 33751 -15389 -37953 40200 59901 10061 21171 92418 20420 -78022
22278 -78022 -45150 -20606 -40714 -54948 -3732 -26576 67878 53614 -54803 -150041 -146345 -184375
22266 -184375 -203416 -174271 -121686 -161916 -149602 -180080 -208293 -92822 -50282 -82120 -15307
22255 -15307 138971 83566 119183 219764 264475 190737 118392 -111869 -227354 -63927 -10044
22244 -10044 -15346 50237 19359 -29008 24342 127317 63893 -55011 -42224 -34045 -116509 -206865
22232 -206865 -205915 -122249 -74018 -195119 -157169 -104264 -105956 -67523 -79514 -125652 -128743 -128162
22220 -128162 -14408 42185 80500 119840 -41645 -161535 -215184 -157109 -139628 -223392 -156931
22209 -156931 -125408 -81640 -133284 -163380 -113093 45554 103136 -64000 -152567 -111084 -216551
22198 -216551 -122873 -72944 -7830 -9420 -89090 17987 93124 82588 16765 -8406 59763
22187 59763 77696 34205 56735 118760 236496 101684 -7982 -59254 -15134 27456 85402
22176 85402 199706 202966 99900 -43238 -126159 -171327 -193474 -200392 -168569 -133595 -136454 -54375
22164 -54375 38921 30538 83956 218526 193060 139275 -64943 -198383 -124579 22699 155905
22153 155905 84135 77732 204235 155818 -90666 -203714 -156340 -85972 -30631 -37588 -152095
22142 -152095 -137124 -80252 -74810 -77846 855 -73047 -108350 -79855 -88228 -151295 -166157 -174213
22130 -174213 -136019 -35890 27598 50732 -7833 -51599 -13595 81835 -10828 -126474 -111883
22119 -111883 -121155 -41501 57968 114649 69179 -2075 -71487 25871 39196 68537 108693 8014
22107 8014 -8670 15791 -59225 -38230 -158871 -297938 -281965 -244161 -221102 -190173 -195440 -103429
22095 -103429 24945 -81601 -78068 -125277 -168822 -47558 9073 20839 21853 -13216 -109835
22084 -109835 -310639 -317178 -297762 -249225 -94304 -53002 -18888 58249 90101 79746 -98836
22073 -98836 -259204 -239320 -115936 -2731 -61759 -99813 -82713 -25275 -20882 -55615 25899
22062 25899 30918 -115241 -76222 28251 -7594 -62900 -18023 7509 74918 -7037 -28962
22051 -28962 30002 -14002 -38415 50912 154182 30702 5536 126979 92614 -65494 -92695
22040 -92695 -165688 -66144 137774 147528 14809 -48419 -184209 -239081 -168552 -158520 -210133
22029 -210133 -128147 -17203 -111519 -192447 -164854 -118500 -195743 -172128 -148130 -61335 32709
22018 32709 100462 174705 95290 35979 31959 35900 -62553 -64304 -117790 -73052 -37791 -131489
22006 -131489 -205640 -157715 -74020 -24973 -130270 -147574 -96789 -108055 -63773 44707 155669
21995 155669 187194 127627 91656 33978 22402 -68433 39812 -57103 -147028 -154243 -85446
21984 -85446 -33404 17439 -55090 -104439 -121031 -150193 -103827 -68027 -95930 73522 74130 5517
21972 5517 -43705 -63346 -138266 -183561 -122162 -61590 -106848 1564 23503 -53643 -4776 14329
21960 14329 -132950 -162526 -111752 -61480 -38774 -61674 -40340 -4838 -23854 -255 38681
21949 38681 67959 7418 -102547 -40103 62935 88448 13219 -29171 -29153 33514 145514 167304
21937 167304 198160 107423 -48214 14456 77909 41351 69593 40772 61860 156279 154373
21926 154373 177220 195497 87714 97541 85409 62269 30318 49571 3143 -4532 -56874 -32875
21914 -32875 19210 -35972 -184910 -208684 -259058 -249862 -214835 -145243 -31725 -2919 92727
21903 92727 139192 10681 20381 4583 -168555 -186619 -75039 -78516 -85828 -40740 89101
21892 89101 151590 192581 151395 49334 44298 -84475 -67488 72606 158336 138532 -66216
21881 -66216 -76199 36160 60175 92706 65676 -9233 -55149 -46748 101743 25840 -28567 -115712
21869 -115712 -216687 -193080 -118866 -96254 -195868 -58236 75130 39802 22113 161123 230202
21858 230202 61654 55991 -26697 -36449 106685 154818 43249 -59471 -63407 -22499 107929
21847 107929 232636 268828 126218 9907 19629 81554 54887 -63417 -64424 -123618 -90882
21836 -90882 19144 77379 3370 -152379 -99447 -20911 29603 85044 14338 -122416 -173517
21825 -173517 -57253 57813 58034 -35393 -28042 -56280 45348 93526 76387 50991 -86917
21814 -86917 -113630 -46337 26954 -42011 -204103 -264189 -137809 -71717 -82617 -137574 -59464
21803 -59464 -14802 56380 47445 -27648 -130738 -51330 -12184 201037 235098 217907 127590
21792 127590 108797 17515 -137893 -37605 51110 82471 144883 68317 97106 125111 44249
21781 44249 56913 132109 95450 44318 181670 122249 146216 208310 123432 67739 138352
21770 138352 210665 226771 247910 250988 186625 97578 58044 74619 129265 209858 183058 148352
21758 148352 116525 111841 19376 -4026 -110811 -158234 -78106 -74256 -60689 -60074 16659 -22254
21746 -22254 -85502 -41456 -38974 -89392 -119662 -194730 -153207 -193322 -116334 27308 129122
21735 129122 146626 119005 214025 52653 -126921 767 164117 145672 115958 44625 -61318
21724 -61318 -66176 19889 25229 -67706 -54048 -9343 162162 189084 104854 125550 67610 34571
21712 34571 43777 81298 69192 89495 172223 92154 15263 -116684 -115772 -33925 -42632 -37189
21700 -37189 -79800 -214475 -170471 -130634 -157615 -193627 -139825 -108168 -138586 -121507 -149850
21689 -149850 -234226 -311045 -198488 -44758 106760 117355 -1703 -62353 -102228 -73496 -30317
21678 -30317 -37487 -155458 -60625 45105 -9825 37904 105599 130342 143916 66598 -16149
21667 -16149 -160431 -149525 -9318 -78936 -101641 -116780 -192671 -221241 -187181 -243495 -343175
21656 -343175 -331416 -169204 -119505 1334 52289 102809 200375 47493 38301 100718 131768
21645 131768 123722 -53532 4064 19648 -89645 -210692 -187310 -175970 -75035 -153264 -225574
21634 -225574 -163291 18872 176810 104074 4787 -62505 -42329 -135710 -135023 -35580 39127
21623 39127 -18593 -27780 -9142 41498 72455 -106575 -251704 -140877 -54387 -123660 -51648
21612 -51648 -118118 -41432 63117 91853 95205 -37114 -13843 76398 40893 -16444 -13059 39230
21600 39230 69179 28547 84997 63493 -7175 -17614 -23644 68241 90630 26176 -70965 -155796
21588 -155796 -159483 -70422 139699 229608 88902 -78540 -175329 -137364 -120702 -176133 -61514
21577 -61514 -27247 -163799 -77200 -62265 -96264 -84315 6358 26877 -7826 -50693 -66751
21566 -66751 -6665 14361 41789 -10491 -57804 -74653 -111113 -23475 62330 12766 29301 70561
21554 70561 65124 86064 80045 61075 172432 201956 109325 95919 33608 107401 156804 131634
21542 131634 58372 76603 108731 73829 1491 -21644 -169755 -87224 25687 94870 154137
21531 154137 199259 99710 3181 -116898 -143283 -127339 -235181 -199264 -52825 48361 57690
21520 57690 14764 73403 35525 -15530 -41276 -28572 -58669 15409 100286 176443 96000 -49147
21508 -49147 -15109 102 -41669 -49289 -98082 -45561 -91382 -123118 22926 47307 68721 74604
21496 74604 -67862 -173980 -148481 -79784 -40824 34389 51757 -1293 -57657 -58031 -31239 -44082
21484 -44082 13658 120115 124974 132095 195591 89837 82634 162166 122805 49720 -23675 46106
21472 46106 58295 32671 16918 54786 36796 52188 -18483 -78367 -153904 -121818 -139157 -121929
21460 -121929 -70364 -24541 -88527 -116929 -152402 -138429 4834 4105 -118737 -101851 -52484
21449 -52484 -23614 -93976 -110829 -117547 -86275 -57363 -91190 -125970 -116829 -55928 -32759 -106941
21437 -106941 -176857 -96246 25786 57585 204730 270915 151399 32070 52502 120884 189116
21426 189116 140957 91710 -1435 -11942 -24030 -36139 74472 84061 37971 -52980 -55767 23790
21414 23790 136872 151641 114222 112148 15805 33460 8452 45138 77508 118397 131197 29866
21402 29866 13595 -17153 -5536 45270 129658 170486 57432 -80147 -100259 -180701 -98388
21391 -98388 69423 120644 110849 87525 97611 124286 13105 1693 21172 -39713 -32851 -8106
21379 -8106 -97837 -182177 -183641 -23684 -3670 14578 -28111 29532 48957 12652 -95568 -103489
21367 -103489 -193767 -233790 -188707 -135356 -47947 -74458 -53025 -42313 -11825 37406 -46094
21356 -46094 -169377 -123972 -54200 67882 9417 23267 -21196 -30883 74810 199074 187945
21345 187945 162305 100683 -28981 -198253 -143408 -33500 36293 58005 -53877 -113830 -118668
21334 -118668 -91662 -63415 -86899 -70019 -90949 -56922 -109596 -222275 -368101 -343537 -167127
21323 -167127 -181883 -143949 -154308 -109941 -65585 -94532 -159550 -95293 -7130 37848 95266
21312 95266 -71313 -237056 -169388 -76392 -9106 -66428 -69996 41676 39257 -2471 -73083
21301 -73083 -5272 27063 3559 -69357 -123369 -80154 75519 76760 134544 47540 -29046 53089
21289 53089 42826 -7874 13821 92299 -8275 -12581 39730 177715 142048 152070 165064
21278 165064 92656 -34746 -113416 -123312 -187485 -83161 -101718 -89671 -37767 -56406 -42368
21267 -42368 -82279 18100 16722 -86510 -163326 -237360 -278992 -182380 -177323 -156477 -153083 -173627
21255 -173627 -192671 -184581 -131640 -53972 -43830 -6195 56694 64492 77774 135769 182541 201394
21243 201394 113564 100747 80244 -5988 -95767 -95109 -102695 -40635 52496 117077 72521 -41638
21231 -41638 -147475 -126816 -93898 -100991 -90953 -90580 -114084 -75554 123169 134642 98490 103203
21219 103203 71325 106414 104902 177016 211578 80891 6702 -12639 -26420 63296 100874
21208 100874 119907 45823 -99781 -10254 120849 58955 -110792 -45951 -5210 -63332 -1693
21197 -1693 -28123 -116536 -114333 -67875 -2164 -30095 -134311 -9126 31882 2156 70818 68037
21185 68037 58538 28122 -44690 -55816 4619 84400 99165 61667 23142 -24690 -33358 3871
21173 3871 68892 42180 109592 168865 -4455 -110310 -32083 -48979 -110845 -33710 -57779
21162 -57779 38444 101312 130578 50143 -39328 -16886 -52597 -98974 20868 47902 14878
21151 14878 25214 70962 -2475 -131434 -220203 -288553 -252513 -22385 66845 -26253 -62314
21140 -62314 -3246 13368 36805 -39766 -25552 -125126 -106717 10686 -32715 -16028 5683
21129 5683 -29984 25683 42465 39177 55211 -63841 -227284 -160550 82035 152399 83786
21118 83786 76346 -24193 208 -48069 -208300 -210064 -144426 -73548 73689 136749 71229
21107 71229 27620 112637 97347 38915 26498 -165588 -186941 -100146 56297 -14038 -107452
21096 -107452 -107594 -63532 74298 180353 227180 88628 161145 129030 183241 244163 58469
21085 58469 -27400 16480 45437 175875 172627 198353 209871 169120 103417 61235 42291 13439
21073 13439 -38109 -249776 -349524 -385515 -344037 -226936 -154757 -194927 -128598 -70017 -91670
21062 -91670 -53287 -142990 -141604 -116355 -100331 -163634 -179354 -128232 -87811 -70066 -47794 50660
21050 50660 -20458 -43316 -42849 -2234 19856 -17588 14001 -39196 -72020 -15948 -94594 -138238
21038 -138238 -34047 -91441 -162130 -212721 -92176 4105 56031 58432 35926 -4364 63023
21027 63023 49968 58676 -2275 -129549 -157793 -188672 -171876 -31959 124517 110143 37880
21016 37880 -49291 -5461 47724 -20213 -26962 -106319 -167851 -124113 -197214 -89111 -58769 -191200
21004 -191200 -148337 -152923 -86938 19681 34471 22067 -16121 -44865 34800 -14305 11828
20993 11828 125152 137182 100035 208140 235715 119868 97155 75133 33274 -18198 -40044
20982 -40044 9937 39594 99075 -23302 -30285 29667 3375 -52763 -121310 -164202 -49092
20971 -49092 -107860 -116701 -32991 -88874 -137221 -121638 -51046 53249 83048 216368 119196
20960 119196 -10759 31310 31885 36912 22521 2983 14596 -41923 -104480 -208500 -165903 -88324
20948 -88324 -83390 -206304 -293868 -184888 -74534 -89313 -93649 -158183 -211647 -190646 -82840
20937 -82840 -19052 7176 -14343 -117138 -244850 -217538 -109406 45271 102327 427 55292
20926 55292 55358 -5250 -74266 -45232 -134307 -107063 -44622 -56640 -2476 70725 60884 6858
20914 6858 149502 161649 92723 -2662 -112262 -74720 -106700 -123686 15603 102679 73325
20903 73325 -104331 -181637 -136319 -152699 -252599 -176075 -109521 -180570 -267437 -316958 -191580
20892 -191580 -68736 -128266 -164343 -120135 -152625 -179431 -188849 -174332 -80651 121481 116436
20881 116436 32733 12962 -12650 -113772 -221076 -148986 -143171 -120908 -49742 388 69926
20870 69926 100680 56843 61198 76992 137975 221511 107942 31663 75761 109771 140699 27256
20858 27256 35464 19192 -9048 34214 1623 -205904 -263544 -204418 -18346 87527 169104
20847 169104 102597 52904 -2583 -1251 66389 153240 162623 112069 168235 116229 170413 191903
20835 191903 159594 106942 86042 138251 126592 82522 67164 45424 -126229 -112468 -65365
20824 -65365 4341 82682 86082 52958 44561 82106 -27232 -121790 -81438 -86239 -25463 -49950
20812 -49950 -32742 -21007 -72253 -132941 -85011 -54707 -113699 -87812 -84375 -69771 -16725 3634
20800 3634 35757 136879 134 -48192 -50248 -69834 -45012 -183267 -191765 -67469 74303
20789 74303 36612 -74571 -136442 -14036 44731 25209 41514 76996 14957 4041 126836
20778 126836 229534 56158 14850 73106 84657 39598 99381 51797 53718 28294 -76234
20767 -76234 3145 67975 -39195 -171636 -52517 115035 112424 58753 48539 -15614 114366
20756 114366 92979 -32454 -104219 5760 174281 155463 104279 4556 -60146 -95878 -44477
20745 -44477 -39622 -41637 35465 57846 99006 99734 -5564 -84652 -115825 -4779 19022 3517
20733 3517 -48222 9887 -8185 115849 197891 134569 101865 117799 152902 107728 58247 -28385
20721 -28385 -57985 -47309 -18674 128 4049 11157 -15745 38646 75165 89203 68491 -789
20709 -789 22242 -9286 -109821 -179602 -181855 -124128 -63847 13115 8118 36742 73071 68110
20697 68110 56582 10867 98368 245849 218067 118011 120908 100287 55486 15346 -21786
20686 -21786 -7624 -34639 31263 172589 105442 25448 -46453 7209 51169 46993 119054 226042
20674 226042 126342 66032 18784 -5052 25642 42856 26607 88404 52078 -13171 30155
20663 30155 -27251 -53045 16917 20319 -47145 -110631 -100834 -125457 -179857 -228385 -234447 -196771
20651 -196771 -146427 -9313 78949 27407 -22719 -47376 -17295 -48271 -183055 -335168 -127505
20640 -127505 7983 -48480 -5748 -2280 10995 -145670 -177061 -123451 -152581 -207911 -71276
20629 -71276 10939 -50260 -110722 -68619 -470 -38164 -105795 -170196 -160543 -73746 -37787 25659
20617 25659 140974 237447 350562 355030 182897 56136 -64502 -104669 -71598 -76285 -108773
20606 -108773 -83293 -137352 -182303 -158481 -81045 -3166 28798 -63072 -67018 8383 29952 63816
20594 63816 203821 123326 48211 -45216 -11681 169585 267415 115023 76611 154858 54592
20583 54592 -20223 -74418 -152927 -168820 -20210 -11826 32096 -30889 12445 74945 -92294
20572 -92294 -247885 -207029 -20580 108023 -32969 -127368 14690 115458 114576 130111 127725
20561 127725 112719 162174 174400 44846 -35457 -64328 -72649 -83531 -186038 -219078 -96180
20550 -96180 15067 45407 27214 86814 -19099 -154914 -229633 -115576 -140100 -14186 14938
20539 14938 -122916 -190076 -239157 -261529 -306785 -221844 -250743 -179712 -93048 -173437 -204889
20528 -204889 -191150 -151986 -77851 3364 48452 21992 115076 148413 -19672 -74351 -117384
20517 -117384 -141104 -149906 -118574 3970 -6617 -114074 -695 77979 85834 64269 47709
20506 47709 -112519 -225797 -217395 -250148 -292030 -260295 -224462 -118233 59254 97763 84870
20495 84870 100813 87960 88070 93497 21987 4200 54073 94436 98499 125114 32296 -2196
20483 -2196 33417 29301 12299 -39108 -65758 -135 -68364 -152756 -67282 16016 -79882 -87218
20471 -87218 -118132 22950 80293 32838 38397 -76449 -79224 -104506 -219231 -121533 -25534
20460 -25534 -77950 -66486 -46205 35964 51619 113171 134783 83366 106761 144049 146690 203744
20448 203744 170600 144055 184910 164168 180459 94601 83606 -25831 -19932 48961 14380
20437 14380 -83197 -116883 -72268 31573 -28993 -62219 -69463 -168561 -110463 1815 6503 -201565
20425 -201565 -157531 -2656 78759 77174 35127 61745 132007 57129 -35418 -104733 -105337 -62642
20413 -62642 -23619 -90846 -90803 -38343 11566 72821 147956 132944 186273 183353 142184 -9504
20401 -9504 -7191 152414 299482 357331 283543 260568 183554 -13801 -108674 -174650 -228190
20390 -228190 -122146 -38400 8105 94825 93927 -14243 -123568 -169729 -51965 -48596 -122493
20379 -122493 -71847 3909 -18852 47258 26077 -10724 39163 130113 102263 10174 28036
20368 28036 -12318 -105700 -136030 -109958 13471 -83919 -99658 53838 41916 -19118 926
20357 926 -60763 -111413 -86697 -78767 10046 -19210 24345 9187 -67940 -65378 -116911 -267853
20345 -267853 -277209 -207253 -77009 -902 -52862 34109 84220 128965 74144 -31390 -86969
20334 -86969 -148589 -237698 -219553 -172357 -179052 -201342 -186934 -264526 -286100 -217268 -238258 -159030
20322 -159030 -110348 -105447 -89224 -103532 -39186 74952 185084 205794 267220 170288 100801
20311 100801 29739 -83812 -148897 -235536 -201275 -124354 -178524 -292329 -333217 -290401 -119144
20300 -119144 -60386 -47467 51808 -67671 -98943 -6068 -36652 -23687 -31100 67913 102050
20289 102050 20043 -25289 -6421 -14985 -18941 19163 82368 91369 -109826 -85119 -83638 1435
20277 1435 -103712 -83995 -17623 -5177 -6578 -59703 43687 157387 225676 141546 53939
20266 53939 -33292 92285 147547 86667 31554 -68789 -311133 -210724 -75293 62259
20256 62259 193755 91086 86926 203144 226574 148184 147190 99881 -3472 1172 -46534 -63018
20244 -63018 26102 20615 -57349 -65550 96348 90019 -79947 -68358 -99629 -80100 -11583 84522
20232 84522 -19387 -146737 -176869 -130096 -180348 4880 -11885 -32083 -2488 5703 -70157
20221 -70157 -77554 -65975 47210 112132 54129 14966 -56005 -118924 -107258 -29523 9563 58396
20209 58396 90637 36137 70119 42127 59089 96187 16445 -191 137086 113349 83309
20198 83309 24920 -54230 -5110 -2387 -69680 -94566 -61386 -194353 -233283 -185705 -88069 -46441
20186 -46441 -20457 -46883 -51175 -63694 -72895 -80262 -130617 -150680 -102286 -112837 -116478 -235637
20174 -235637 -226369 -235785 -317788 -290899 -321692 -220232 -252434 -316420 -321723 -326997 -255789 -153091
20162 -153091 4802 120177 216241 118507 26858 -13787 4759 -3277 -33676 92852 127773
20151 127773 49358 -24605 -62719 -9125 29134 30748 16068 -58654 -11587 -50403 -39729 -229
20139 -229 -125868 -103433 35498 181180 190503 97155 101760 63857 42681 96012 87237 52799
20127 52799 116298 96470 7875 128365 144451 77946 120798 243699 266039 159311 160529
20116 160529 89538 -3775 34996 87697 195884 140126 -8294 133616 200286 229825 366565
20105 366565 258813 -2940 -66209 -14203 -3796 18107 -29623 2359 -68354 -100926 -158409
20094 -158409 -243806 -245777 -97393 441 -45910 -25900 14137 9051 -46326 -91249 39236
20083 39236 24356 -72103 -74659 48980 70362 64647 -38578 -94195 -67326 -36362 -120330 -230882
20071 -230882 -184452 -192119 -185915 -167052 -118635 -105915 -73268 -47827 -49663 -23599 56284 107367
20059 107367 -12594 17531 57148 19361 104382 70368 129024 122991 187204 179074 92284 26762
20047 26762 -79050 -26335 28679 553 72687 109648 120375 -17248 -59907 27629 -32556
20036 -32556 -42551 64671 143627 84132 -37583 -144877 -122070 -90453 76092 102898 40021
20025 40021 48167 120263 65175 -46666 -24848 97780 138491 69612 -4641 -75185 -67786 -28450
20013 -28450 -100695 -76486 -81139 -65037 -10600 -82090 -165552 -161632 -50379 148402 146472 10229
20001 10229 36698 30668 -85838 -102687 -139513 -77905 92980 142011 153896 124834 143274
19990 143274 228430 84326 -8847 -5740 1278 77598 57411 38862 -30848 -42231 9937 81532
19978 81532 100685 8269 -12668 -895 102890 83719 44020 82515 43095 -59520 -52383
19967 -52383 -28941 -37762 -74187 -122464 -158989 -59171 -11133 -46356 -31521 -57694 -12079 5830
19955 5830 38002 -4246 -52383 -97421 -112347 -87685 -149888 -180771 -52075 218659 321399
19944 321399 233779 143163 10981 3151 -1078 -20334 -11008 -34515 22828 48608 -12517 -6248
19932 -6248 -150508 -128048 -75441 -118101 -120041 -23749 16279 102957 131246 -5819 -148470
19921 -148470 -144663 -109321 -62783 -149564 -166813 -184338 -158795 35193 -11428 -186582 -236047
19910 -236047 -184845 -180556 -256998 -175800 -132699 -146399 -63774 99588 255578 270234 156510
19899 156510 77475 -21773 23338 60092 -39320 -47925 45834 2336 -107759 -128180 -140658
19888 -140658 -124019 -124447 -225166 -202228 -125741 -97663 -123946 -178426 -148357 -130240 8005
19877 8005 -40285 -149959 -156388 -143487 -76266 -113222 -124021 -130451 -83533 -216483 -195832 -137870
19865 -137870 -78209 -50013 -94833 -52610 -13563 12758 6614 -24188 -7078 -20508 -223657
19854 -223657 -154544 36397 97774 141791 50474 -90 -4251 123774 71389 74759 57571
19843 57571 6428 3693 5927 24564 -114043 -170252 -187689 -226562 -186202 -40450 -12181 -109280
19831 -109280 -128185 -105182 -92420 -106840 54281 25080 22176 38428 59584 46307 531
19820 531 39429 164789 79109 -77009 -114815 -126101 -103583 -37911 78553 302953 286641
19809 286641 385848 352465 103824 67657 10487 -84979 -76825 -91023 -50412 -5734 -75239
19798 -75239 14647 22683 34767 25274 86627 -41670 -38102 -17675 -77429 -112169 -91128 -35222
19786 -35222 907 -94185 -188170 -89308 38131 87726 69343 21674 -90846 -117833 -56116
19775 -56116 -19960 -149114 -160161 -1566 149654 125652 52956 93884 162680 53033 62365
19764 62365 22318 -15724 87758 130969 63614 -22265 27486 50979 40388 -95719 -135493
19753 -135493 -110849 -30925 121919 15914 -1855 -26863 -90531 -32580 -117872 -131498 -186752
19742 -186752 -105973 24845 20244 855 -83494 -154894 -75606 -76029 -52857 -12077 45238 -27397
19730 -27397 -148984 -284595 -331728 -357690 -222032 -59822 -58089 40496 128682 192731 98278
19719 98278 52029 -16651 34 129969 110096 -47574 -89592 -132089 -163952 -183719 -155340
19708 -155340 -186731 -146745 -120985 -12337 171313 149391 61835 -106092 -161754 -121193 -124772
19697 -124772 -84893 17390 93279 60736 146787 187021 144949 119342 90770 -52748 32836
19686 32836 38622 -81930 -139039 -137743 -185562 -263094 -193376 -2685 91280 -5645 -39438 97272
19674 97272 154851 63231 -35520 -138045 -82822 -93706 -158104 -199475 -57659 73176 73125 69513
19662 69513 43507 -100911 -140958 -97960 -84385 -80952 -149935 -232052 -234295 -154519 -203784 -75457
19650 -75457 69706 108054 69520 -13702 82530 138317 99954 80074 7017 53725 47531 -5250
19638 -5250 -50603 -39431 -131403 -140642 -54906 -94669 -60757 -25211 33570 49795 -10398 -5343
19626 -5343 77614 35055 70349 123721 116922 144969 231115 286560 152506 130263 175080 68773
19614 68773 -41888 -76769 -102962 -116739 -9185 84248 46080 -60310 -128954 -87393 -118221
19603 -118221 -99302 -46800 -44844 -133538 -167138 -71432 902 -20596 -37368 -58301 -110241 -35322
19591 -35322 -20922 27435 -21344 11672 25133 -74815 -45385 -16583 86417 64972 134831
19580 134831 57554 -45230 -62378 -38983 -114627 -59844 168740 148784 -52451 -218157 -217589
19569 -217589 -172332 -100972 -83256 124884 183409 92371 -34340 -63608 -15539 8574 45675
19558 45675 -82320 -27112 -37831 7503 50292 -15746 -40902 108032 194934 150546 68937
19547 68937 31549 109277 137336 99071 125655 86445 1128 -33887 5921 -57428 -13263 -22969
19535 -22969 -50251 22978 67003 -13920 28017 26351 -17389 -31105 -166069 -139731 -153630 -77530
19523 -77530 -69954 -90279 -46155 -6448 13288 36566 350 -65867 -72982 51411 -15883 -111383
19511 -111383 -88824 -114522 -108183 -26729 4435 -13032 12389 3547 -28320 -130465 -95044 16593
19499 16593 -11428 -88118 -97284 7014 110532 23676 -3177 42091 75998 47305 56324 149977
19487 149977 178496 243219 160450 20690 -45331 -29907 -81612 -38318 34147 110693 75989
19476 75989 117690 100981 -53213 -181853 -135402 -125840 -138978 -48692 -95011 -168671 -102761
19465 -102761 -140868 -18015 -25003 -54361 -5345 -14394 -21927 -70071 -159209 -166342 -95501 -80872
19453 -80872 -11590 -59887 -8283 25801 -50380 -97369 -86936 -75595 -134588 -150665 -114430 21486
19441 21486 37666 130024 127536 95730 22186 -37775 -62552 -146098 -169438 -79614 950 33836
19429 33836 54438 5708 70580 45867 17220 60424 105975 61036 -28558 -23920 8806 8944
19417 8944 -26269 -127848 -137923 -22208 10958 37372 84273 72591 -16990 -112723 -64594
19406 -64594 -30424 -29299 1525 -87868 35 19377 -7918 -58958 -48392 -39883 -56079 -34766
19394 -34766 40064 91359 -17418 -21316 -112475 -180918 -146246 -161535 -108920 -161070 -80755 -109583
19382 -109583 -185298 -181625 -228479 -77430 -6876 -47310 -161792 -163417 -157713 -62082 22466 137470
19370 137470 44963 -134641 -149493 -95491 -72721 94308 137416 89435 45914 1135 47770
19359 47770 -1439 -126930 -198185 -146096 -104344 -173976 -214086 -169506 -44524 55482 42121
19348 42121 -20138 37772 66823 51345 -23305 -25334 -39536 -26691 51725 -13509 -77586 -12650
19336 -12650 -29865 15153 -42739 -92162 -36950 -9016 92359 -31751 -92166 6708 70034
19325 70034 48211 95195 243857 270222 83762 -38897 -8113 -22984 39578 64310 48879
19314 48879 45697 -29604 -205373 -246359 -155588 -84447 91135 80030 55861 41243 -60781
19303 -60781 26622 -15638 75687 64870 -2039 -11869 111057 115611 123290 112500 -54408 -57135
19291 -57135 -74678 -46380 -1211 140255 199374 152855 62458 -65569 -41354 -58772 21115
19280 21115 16484 5351 108540 102470 119518 66275 -31520 65582 168505 245092 215724 110225
19268 110225 114846 17341 -7406 87948 -64589 -135853 3526 131348 95253 -9525 -60708
19257 -60708 -190248 -170474 -102232 -85289 -96385 -121347 -32802 -76935 -157630 -183976 -137510
19246 -137510 -27204 -183653 -105072 -20517 -117376 -256134 -188403 16550 126588 -37034
19236 -37034 -74851 -118202 -120884 -57727 -71600 -31354 -39494 31212 122426 125641 1992 -37706
19224 -37706 -23906 4036 70855 185601 203624 108211 80306 -18259 -32725 -92173 -70018
19213 -70018 -85120 -127561 -232831 -266290 -260346 -178584 -88011 -135748 -139886 -240822 -238385 -176115
19201 -176115 -221860 -189821 -180785 -228860 -322628 -317349 -154369 -19844 -13705 131568 256266
19190 256266 260646 137255 1960 43455 113881 38450 -87418 -27137 -11394 -140691 -183456
19179 -183456 -100304 -118852 -100123 -98463 -109326 -37891 -39414 -199910 -190121 -28603 96943
19168 96943 -35435 99797 69620 -50387 -75701 -203158 -175041 -57085 57033 16642
19158 16642 -13696 -79218 -11925 -41830 -54092 -27605 73578 101242 252636 280388 219359
19147 219359 166319 25801 -101153 -32596 -68630 -98779 -6018 -4799 -58481 -150965 -155653
19136 -155653 -171215 -15285 49233 -19036 40743 52470 72708 6391 -70857 -55286 16160
19125 16160 -15608 -109651 -43563 92475 10550 147913 212357 193202 -29793 -148550 -155135
19114 -155135 -66786 -9131 61914 39964 42310 28362 -113969 -45241 94122 187877 218315
19103 218315 188580 178345 202187 124409 156802 132885 32515 -146229 -353598 -339453 -230569
19092 -230569 -79364 64727 64874 72972 90673 152507 230533 78702 -88801 -54361 -10134
19081 -10134 -134756 -134683 -54291 -59148 -83096 3973 6927 -70302 -23115 86841 86511 -24265
19069 -24265 -143671 -99134 79764 100531 -1330 -27121 5075 19089 31207 -88546 -102452
19058 -102452 -77199 -134205 -174130 -77461 39048 163219 156398 144254 146917 99516 142876
19047 142876 156872 67557 31432 78021 109882 67807 145967 215840 180125 -3959 -45353
19036 -45353 97745 206119 295034 252891 139283 143767 165144 221134 194720 264798 167763
19025 167763 68910 163340 207297 87633 80595 207424 206802 73369 36769 35360 34094 144479
19013 144479 181726 257253 56706 -103086 -15702 44030 38885 20465 21571 -37050 -50452
19002 -50452 -62540 -71341 -54870 -52293 -121619 -176250 -91927 18042 -103621 -145889 -104750 -36315
18990 -36315 -90188 -10858 11252 -23123 -78877 -107056 -85734 23481 6473 5168 133607
18979 133607 73263 39873 148068 154118 103353 39002 54248 -46171 -40208 -80872 -108144
18968 -108144 -188748 -107146 -55329 -2287 58388 39058 89445 71426 -43366 -90774 -49658
18957 -49658 5774 -24120 -108118 -173944 -77231 -91961 -23961 -55482 -85063 -72486 -31420 23684
18945 23684 9394 67981 69294 10575 -14213 176729 96025 44712 53190 104277 92375 45310
18933 45310 21283 66130 86172 15958 -4152 123748 248559 265289 338567 368163 516761
18922 516761 638498 665210 707086 705753 611309 555827 367575 259441 285581 320757 260128
18911 260128 269469 374689 500719 469952 544457 680828 718545 786918 760543 538298 469213
18900 469213 469374 570871 558744 578546 543954 438196 347861 213663 222513 225575 81433
18889 81433 52902 4935 -49073 -25493 151033 297977 277484 197605 209318 167842 343251
18878 343251 501985 487369 476559 326956 206158 128091 118801 327040 367834 313673 360255
18867 360255 509767 556628 652593 729091 718088 713475 616240 634285 672656 834243 794108
18856 794108 756467 747708 716126 716742 698544 630375 751224 916600 955094 715183 526658
18845 526658 500443 367487 254621 201702 152936 249553 347141 247522 30433 -15565 76417
18834 76417 160714 179232 108751 233465 194996 140840 39006 -36896 10825 9058 24746
18823 24746 -95182 -1684 115080 188108 89194 43612 46202 77679 31975 46735 119525
18812 119525 95385 120783 60215 108036 208490 230924 131918 124093 80796 17334 135062
18801 135062 186897 249407 215183 79796 -69495 -119972 -8649 77742 155411 122279 159401
18790 159401 178914 204294 87218 -44913 -110371 -14651 47899 54181 -18160 -23606 127104
18779 127104 48830 -71237 101246 161072 112851 151363 203663 279694 349736 529700 779346
18768 779346 1084755 1462851 1619859 1320101 832498 587591 540021 504306 442058 528253
18758 528253 587129 623178 538697 442703 329394 244441 382691 444507 454871 439607 524222
18747 524222 645289 651497 694020 693338 704913 740147 755555 645759 508726 408301 270622
18736 270622 223283 308460 361204 311759 322184 310644 365473 305117 154595 56587 93600
18725 93600 182091 214630 117164 87586 41823 53646 98251 165809 95652 105106 185254 236245
18713 236245 334547 372893 486446 525138 622047 566195 439575 417974 470812 603071 668266
18702 668266 671837 750306 952994 870125 770357 798572 863601 858874 830532 710884 622184
18691 622184 555420 668099 641462 675336 755993 886691 1030265 963559 742258 601672
18681 601672 523160 444768 296613 252202 273235 365233 453972 274689 229922 116497 118993
18670 118993 206901 332873 277535 166013 117975 145773 143391 141584 97978 18347 -31579
18659 -31579 -42464 67412 188817 156842 233412 328649 322309 253363 80918 28467 13140
18648 13140 66629 78541 -33528 73672 165537 257971 249318 198548 66984 31058 121793
18637 121793 7446 -20722 172545 229488 319460 404830 321643 159505 99686 57155 -12772
18626 -12772 -13031 49770 103010 250206 188828 73650 20495 -1524 82720 229885 323263
18615 323263 440549 530665 609335 600739 651401 725797 725256 606675 378636 133122 193387
18604 193387 310696 291541 276703 196281 66207 175232 230848 435437 513340 357505
18594 357505 266303 252826 128071 182476 254861 174936 85719 9599 -101220 -114731 -77421
18583 -77421 -3386 18670 22824 81129 196723 323344 218232 120204 85880 262219 306974
18572 306974 229965 114840 54148 24615 45369 -86952 -82913 27680 80355 106645 104077
18561 104077 165498 98656 99833 260545 283472 268463 191480 110786 144603 233637 302781
18550 302781 401437 435531 520216 537497 465208 391036 313427 341724 323683 427369 402168
18539 402168 282762 289806 278676 250647 281320 269124 251326 305560 394691 426339 468757
18528 468757 467883 487379 339667 187370 94105 65608 188754 352780 412856 528152 499995
18517 499995 410541 444912 556910 599878 461123 343372 341122 285321 186492 257164 503343
18506 503343 564881 508250 377931 412754 339710 326363 389476 384484 340944 303833 259306
18495 259306 274169 407980 425303 357520 339403 436740 482241 656294 691930 639856 718986
18484 718986 808574 656898 653563 638145 739382 848094 1016524 1128897 1169218 1257509 1302278
18473 1302278 1310092 1254799 1215245 1268877 1217263 1193637 1211685 1106970 1052752 1094022 1065213
18462 1065213 1063264 1115032 1103526 1084161 943403 917776 1068581 1181201 1376911 1458749 1541310
18451 1541310 1684018 1967947 2262149 2540237 2894293 3016456 3063641 2982620 2998636 3028030
18441 3028030 3094239 3184555 3324730 3555900 4012119 4480430 5271828 6337428 7846444
18432 7846444 10346599 14291358 19001216 21899858 21209896 18057831 15354715 14209134
18424 14209134 14236606 14896089 16150329 18440661 22035765 27821383 37776606 55208498
18416 55208498 85751630 132882903 183055438 206786964 195533025 173129265 152583914
18409 152583914 124536800 91964656 67275687 52884445 45776078 43883346 46674043
18402 46674043 54798015 67594392 78606714 78398332 65449828 48856507 36222859
18395 36222859 28344027 23624903 20526943 18444658 16847691 15580785 14550809 13762298
18387 13762298 13011057 12354514 12084441 12190947 12416294 12967289 13807751 14869565 16387781
18378 16387781 18519197 21997614 27734919 37006659 51603775 72139665 92193739 100015766
18370 100015766 91128494 74622399 61588252 54917140 53563766 57043744 66761854 85785501
18362 85785501 119413424 173866970 246988838 321851500 377328970 391032915 347717691
18355 347717691 261812158 178606960 122967490 89652712 68989052 55703012 47256419
18348 47256419 42012702 38976751 37962810 39868022 45840269 54495730 59844181 55708819
18340 55708819 43831418 32363072 24692988 19938572 16784976 14409771 12612468 11190897
18332 11190897 10073863 9340870 8756900 8446840 8289108 8346865 8416325 8181154 7761358
18323 7761358 7210115 6495912 5806860 5221159 4747877 4310115 4062092 3878221 3593707
18314 3593707 3387805 3289382 3207287 3021760 2870226 2728138 2675919 2579516 2595662 2508139
18304 2508139 2665453 2615284 2515501 2396786 2302629 2336818 2285346 2242622 2275953 2272012 2179549
18293 2179549 2092250 1942989 1718804 1555330 1472657 1532508 1570635 1666481 1753266 1647888
18283 1647888 1584028 1559373 1529294 1650685 1752186 1821470 1850050 1904781 2020401 2042432 1969968
18272 1969968 1959030 1924174 1935822 1921024 1967666 1997338 1954576 1945842 1976149 2049186 2265024
18261 2265024 2501569 2731206 2779743 2799528 2971235 3166999 3386102 3751591 4222001 4626372
18251 4626372 5003078 5405415 6081117 7171424 8379173 9616828 10844526 12445883 14839232
18242 14839232 18877219 25871051 36952961 49008767 54186597 48693496 38999378 32758466
18234 32758466 30651853 31302076 33763149 37687374 43889876 54407369 73012819 105889851
18226 105889851 162306636 247593746 340402103 393225565 382310206 327774132 256320688
18219 256320688 183485552 128904525 96220117 77057333 65820704 60620121 60775050
18212 60775050 66694702 78991931 95555691 105954027 99001847 77777015 56510145
18205 56510145 42249120 33613865 28275719 24964177 22657051 20668940 18925326 17213232
18197 17213232 15616963 14418852 13675170 13269176 13080441 13078850 13217359 13693859 14350515
18188 14350515 15288182 16682205 19021303 23352127 31014437 43266513 60051843 74623281
18180 74623281 76769892 65766727 52174121 43605804 40486628 41765654 47662042 60954288
18172 60954288 85116108 118567221 150212610 173729145 196748072 212386062 192834039
18165 192834039 139486672 90648639 61592957 45147414 35459674 29394385 25425569
18158 25425569 22632977 20520281 19369874 19080764 20008750 22465070 25509542 26453111
18150 26453111 23547270 18520533 14519124 12053869 10471053 9500570 8579711 7680487
18142 7680487 6884460 6235461 5795040 5479071 5091509 4904245 4675420 4430921 4224234
18133 4224234 4082659 4075620 4046681 4100924 4079231 4093652 4298314 4357646 4543791 4875405 5490796
18122 5490796 6026653 6647018 7486880 8445983 9709407 11518504 14378839 18423879 24661463
18113 24661463 35329684 54756494 92662861 162624004 251220365 285661694 229030078
18106 229030078 136776155 81676297 54194505 38988966 29488748 23245452 18840318
18099 18840318 15645538 13239371 11503696 10072663 8851841 7863481 7220912 6621033
18091 6621033 5929940 5418844 5023681 4531442 4135367 3867723 3711603 3417530 3088732
18082 3088732 2895246 2608405 2483003 2508706 2343369 2153984 2053750 2012299 1968722 1813452
18072 1813452 1793441 1866516 1829818 1641900 1485234 1409997 1411982 1296113 1277539 1214932 1155711
18061 1155711 1123579 1094648 1254762 1267148 1109112 1086733 1168754 1182132 1171595 1085651 1065163
18050 1065163 1106519 1091795 988134 924110 881025 766121 715541 705163 624269 546462 557732
18039 557732 462574 330819 389616 534532 538890 574338 692598 675937 647798 619833 544275
18028 544275 405835 379478 498774 431535 314023 240040 315220 417666 337117 380082 507305
18017 507305 563158 495805 473153 412464 280072 291899 332892 332977 414805 460465 498180 387697
18005 387697 304169 425652 420960 251386 68000 39576 132192 195248 344337 361840 393889
17994 393889 475301 508469 362692 250949 213827 164653 6736 -9938 -22364 41980 15964
17983 15964 106457 142781 25044 -1431 89843 240314 330017 292898 291625 315704 311081 373675
17971 373675 290672 127129 87887 41074 135112 116054 165564 148760 110714 147489 104772
17960 104772 46739 154904 374703 494125 445635 415114 373040 397073 404384 313878 225468
17949 225468 99890 111026 218600 258828 277999 260932 316318 346484 370812 218522 82406
17938 82406 83915 71082 104511 110708 15152 -33078 3680 148174 196228 271388 348834 360657
17926 360657 352850 372618 357121 237664 245648 400600 562487 549078 415086 397992 367974
17915 367974 260538 337398 457747 485345 377097 474081 508815 678807 792258 714682
17905 714682 699408 576245 427987 267588 382395 617668 859341 1007186 1028347 945833
17895 945833 865097 782426 892439 953232 838538 605870 382709 356924 283258 304976 431166
17884 431166 587253 601167 533083 500919 448303 302801 160523 50438 40468 -9030 -36829
17873 -36829 -57459 96554 151310 172852 167953 184310 186663 227229 302768 316377 310065 353780
17861 353780 408632 373535 457813 580840 575903 370854 335993 467670 569838 493453 444128
17850 444128 568881 593515 609661 698472 675380 604880 619858 634912 521346 466811 449626
17839 449626 396883 465937 480333 586238 724700 651360 579626 476845 421470 332710 160806
17828 160806 83640 118538 115315 103056 127488 116029 58118 46821 49904 87759 14280 -72293
17816 -72293 -98533 -136813 -107165 -75322 -49548 20112 -71116 -100244 -35117 198530 404997
17805 404997 432917 407079 201834 47621 -33994 -125390 -125086 -109435 -135043 -63457 -3171
17794 -3171 16972 78783 -5224 63197 57584 111750 70872 45305 -2348 -152344 -201768 -43981
17782 -43981 -35185 -25839 7122 42493 -29230 79524 248112 184541 90016 -15699 3860
17771 3860 26 -66119 -120824 -91922 -31128 56202 -20134 -73704 -111651 22583 58001 97555
17759 97555 114667 104249 96296 128806 98550 -39118 -93949 -22327 37085 -24233 90648
17748 90648 117115 144631 192719 215310 187168 205025 189080 230590 188376 139389 130882 147317
17736 147317 238558 273627 80880 -117449 -132089 -17746 13681 86910 177715 180756 176809
17725 176809 214484 164812 106421 66425 188502 132193 157398 128535 98689 46921 59603
17714 59603 124473 222299 285657 277972 284537 583610 771572 714955 636524 556507 639041 630949
17702 630949 679026 675254 601176 694229 776367 823766 867643 875815 847577 762030 651323 486205
17690 486205 362831 266709 126035 158053 168625 204094 220065 -3281 -16722 3296 87479
17679 87479 193978 269173 194505 172567 158272 121566 87962 124254 208643 335063 313212
17668 313212 225061 110548 26028 -84253 -1854 -93705 -113027 95992 328018 495412
17658 495412 577581 641543 697009 710329 689622 596446 634979 691196 518755 390467 331297
17647 331297 287799 372092 428962 340566 295857 350062 399459 472169 558772 630661 782487
17636 782487 771627 675460 501315 356441 274948 174403 70148 92452 187039 91205 -2047
17625 -2047 83432 48916 -51061 -24851 60892 148331 189909 182757 169421 14676 -61326 66132
17613 66132 9759 -1008 -37926 21836 144345 57984 -21027 -3452 104044 68811 31262
17602 31262 46129 43013 -37794 -33916 11405 89002 -9325 13053 10576 -109050 -183809 -209242
17590 -209242 -66592 53042 16599 -19615 -97272 -35935 40761 -68836 -82998 -51127 -57463
17579 -57463 -31879 3657 49292 33031 1087 -57174 -200594 -235597 -62916 48025 70611
17568 70611 -10952 -57395 -65896 -42658 -3775 -26911 -43409 -66258 -77179 -136028 -49932 -32013
17556 -32013 -42991 16964 192882 143963 112928 85174 100569 148594 134799 5704 -148377
17545 -148377 -186762 -87975 75192 103288 122598 149195 181657 98507 8279 -93114 -82295
17534 -82295 -62190 -3844 2064 32218 -6100 -115512 -50095 34376 -32541 -171151 -302986
17523 -302986 -314951 -209129 -76493 -137359 -102937 -53540 -95744 -58861 -61333 -127864 -88626
17512 -88626 -64647 -102181 -40142 -83776 -34620 26748 150540 8935 -108613 508 -9173
17501 -9173 50626 87674 32013 -63158 -87102 -34624 2052 -7379 7524 42876 4795 -65583
17489 -65583 -70301 25076 23154 28109 -136639 -125013 -5608 78031 -84966 -154382 -150815 -38025
17477 -38025 140788 93258 -47145 -159135 -195626 -226332 -183735 -22915 -70037 -69341 -13874
17466 -13874 -89465 -130577 -96229 -154694 -208864 -115718 -80152 -43337 -38682 -31659 -99902 -34106
17454 -34106 8272 51738 140222 159482 131111 -9043 66775 173846 142601 270023 544712
17443 544712 1115319 1542629 1430699 900373 526225 378071 228431 45995 10236 102680
17433 102680 134657 64950 56602 25567 -3199 3893 -102440 -236179 -235823 -118114 -60918 -72462
17421 -72462 -70682 -44974 20193 -92007 -239230 -255128 -65195 -136095 -78637 12316 78525
17410 78525 56034 24478 52531 80647 118677 169015 201640 162872 120021 105495 30324 44760
17398 44760 13075 49515 71068 130272 174412 101548 -20627 3278 -110089 -228350 -139433
17387 -139433 -60413 83874 248443 144535 -19923 -90405 -165598 -156444 -120778 -125219 -63377
17376 -63377 -35210 47002 59979 -9832 -37853 -100131 -204945 -211018 -128755 -75391 -24377 -115729
17364 -115729 -202570 -125315 -72357 -60219 -115210 -131483 -155431 -64046 -40319 53804 107499
17353 107499 67545 2282 -79321 -220980 -196140 -105366 -83544 -21619 44901 25158 -20363
17342 -20363 -98361 -115989 -4941 113528 90391 140130 201710 187164 113447 24 -20533
17331 -20533 48466 -744 -135663 -107080 -35495 -77806 -119501 -42092 23911 -50775 -92977
17320 -92977 -69693 -86111 -135438 -121059 -12182 -65802 -148417 -156660 -82044 70745 31097
17309 31097 -57628 -51147 44594 -41058 -88563 -123659 -191540 -187333 -88871 -133617 -78640 -71639
17297 -71639 -129303 -159874 -152926 -166232 -131768 -54526 -145290 6350 109651 103383 44356 23724
17285 23724 56638 -29618 -85347 -90841 -191606 -84256 -109226 -94489 -73067 -61873 6921
17274 6921 -35151 -96944 -99806 -38643 34726 -52066 -79346 -78188 -141045 -174661 12993 125599
17262 125599 171652 30288 29913 76372 137418 120864 150379 143378 15314 -38232 -89854 -66800
17250 -66800 25038 10347 -114828 -182381 -150973 -32424 -20303 -126718 -265035 -239982 -302322
17239 -302322 -283049 -239456 -176254 -75091 -165555 -179613 -146284 -181117 -103449 -65951 4244
17228 4244 76432 152664 42130 -99428 -143559 -100037 -108826 -142845 -148345 -136902 -168225 -164393
17216 -164393 -176806 -135111 -50368 56106 31750 31431 -27189 -71696 -165632 -126391 -81441 -127446
17204 -127446 -24921 3963 -20600 -18485 24216 36560 -17401 -82326 -151504 -87313 50882
17193 50882 143484 70468 124080 -25490 -120111 -169320 -150818 -76226 95821 108166 64200
17182 64200 9956 -36157 -65280 -58825 -64089 7075 -39778 -132761 -155101 12608 82009 136384
17170 136384 214144 249200 98979 49527 163047 192228 83635 -34724 -82123 -9413 52464
17159 52464 87529 -18291 -42093 -27127 -23899 25636 85473 90405 -1448 -9558 9743 13551
17147 13551 50558 -41775 17401 51326 32828 78929 40827 -18841 -32914 -55479 -80099 1740
17135 1740 -38678 -95389 -98402 -151556 -81458 -135213 -111027 -45285 -40392 -105067 -137451 -120303
17123 -120303 7273 7012 -70117 -124457 -116514 -2653 51435 -22222 -63656 -133534 1623
17112 1623 14134 -19324 -48377 -141071 -252410 -294068 -254308 -211186 -198507 -110343 -168889 -336545
17100 -336545 -326794 -345203 -322538 -312546 -247841 -209664 -171438 -114072 -98606 -79615 -90639 -32674
17088 -32674 -28619 -171773 -221158 -112279 -63373 -71037 -126906 -169012 -240101 -199388 -25559
17077 -25559 46429 32253 22085 124712 45254 25001 139238 82823 70302 40779 2883
17066 2883 48544 50345 -13144 -16782 17453 -31473 -161828 -213971 -136957 2307 23392 95314
17054 95314 87637 -58367 -194943 -136468 -106598 -73114 -31197 35523 -10976 72668 33003
17043 33003 -70300 -9502 -90107 -101750 42977 40600 57754 69897 -26207 -72914 -130933
17032 -130933 -65659 -147849 -184627 -113791 -31960 -95304 -142567 -68803 10670 -51700 -78563
17021 -78563 -93330 -98552 -64802 -106880 -99396 -5926 -129041 -230930 -131212 -82110 20496
17010 20496 45370 72093 39851 26542 16248 49386 188159 332971 317133 110254 -6630
16999 -6630 71560 107444 75464 -118617 -265385 -276011 -92314 10124 -66796 -205871 -180167
16988 -180167 -104733 -64958 -89190 -97813 -18862 -62884 -187658 -188629 -107697 -70023 13652 37892
16976 37892 63578 104394 14188 -37995 -76362 -25759 -66760 -227597 -203862 -126273 -25336
16965 -25336 -49783 20259 94418 41983 99201 26581 -69808 -105226 8574 -16625 -49014
16954 -49014 10290 88218 13590 -86312 -48422 -69058 -127270 -174300 -56110 -17524 -7105
16943 -7105 -11433 -39109 34321 93828 117355 146811 207980 130337 81376 70591 125652 34037
16931 34037 4953 19091 -21803 -19185 -17469 -10632 18258 -35216 -79964 36250 158402 117201
16919 117201 19477 -135459 -174648 -63908 54067 71290 112225 179827 146836 60123 -14872
16908 -14872 105284 120749 64741 -1186 52675 139794 124826 114494 24215 -77403 -42029
16897 -42029 39724 -10359 31232 30848 49108 -16054 -100828 -71337 -152801 -171506 -72158 -25785
16885 -25785 -86104 -98618 -80655 38091 169220 127396 145525 63318 36750 108163 164758
16874 164758 172995 120916 139863 119286 169694 200277 163162 51177 12040 32505 -51612
16863 -51612 -150769 -165027 -130282 -100274 -114869 -33624 15812 57018 89472 51663 7635 46354
16851 46354 40868 -54151 -100709 -200974 -271654 -220227 -229789 -124162 -120504 -188811 -108443 -86177
16839 -86177 -14249 -81572 -143020 -219725 -244272 -182674 -122877 -120148 -49853 -51859 -20575 -2820
16827 -2820 14669 -52745 -149099 -82972 -34006 -52832 -74026 -190186 -281280 -322739 -391700 -308200
16815 -308200 -235805 -225213 -199383 -169524 -170171 -61144 -81674 -86444 -140431 -127942 -73584 -43593
16803 -43593 -66296 -162530 -94267 -61694 -176144 -201846 -93485 35144 116417 178880 94696
16792 94696 71856 60806 75400 137441 140345 174782 43522 -61441 -40189 -20399 -43586
16781 -43586 -10573 -36394 -91858 -176693 -142904 -145007 -165787 -89822 9608 83431 174935 160371
16769 160371 128715 -12964 -109408 42285 24340 -21100 -6077 90333 29674 -12876 -4572
16758 -4572 37960 68975 91873 27683 15597 60896 -161075 -206611 -153018 -95762 -166000 -306522
16746 -306522 -378412 -288599 -193737 -100597 -44120 15588 55626 64340 11877 27814 173920
16735 173920 308110 343421 283304 96145 -60672 -151443 -158188 -223314 -165893 -69175 5057
16724 5057 -69491 -133192 -186252 -157961 -116900 -55135 -66572 -6582 -35167 -122434 -149754 -81745
16712 -81745 999 47325 165704 136256 24309 -2691 -40238 -121007 -81108 10717 -59881
16701 -59881 -130825 -178142 -128444 -119630 -76037 21654 -66849 -126217 -156733 -137370 -51761 -129065
16689 -129065 -42018 -113736 -118991 -48017 -61960 -60436 -49951 -43390 106015 24369 -84357 -117813
16677 -117813 -50301 -57812 3932 105410 -42536 -124334 -25 14335 -19256 -53377 -43806
16666 -43806 24450 67790 1966 -8864 -66541 -80771 -49802 -59098 -89466 -155327 -113497 -145969
16654 -145969 -127904 -95546 96584 113028 129324 103321 -51911 -37999 35199 96655 86437
16643 86437 10577 -112808 -122803 -139873 -46345 -67642 -51883 -79918 -97110 -216150 -175236
16632 -175236 -128457 -190378 -142924 -51477 -51558 -87797 -182303 -122727 -24732 -14610 29115 -9999
16620 -9999 -89369 -172043 -164495 -119694 -218195 -208413 -186401 -164360 -103640 -176154 -111991 -53705
16608 -53705 17760 65325 28444 10075 -62321 -118467 -82839 51521 37057 56011 80248
16597 80248 121246 171955 100137 16721 -9672 -15814 -98542 -19752 -69212 -116639 -134802 -72140
16585 -72140 -32919 -162200 -76171 11108 -109975 -92952 -119279 -103573 -165271 -204011 -66361
16574 -66361 -57678 -40632 -59042 -144446 -65132 -11388 2802 215 -12492 87940 164927 37894
16562 37894 -83085 -25097 29391 -19087 -113546 -242461 -214155 -68553 58088 43374 64207
16551 64207 91887 -39079 -130802 -109507 -119912 -1251 45783 79552 86454 -31746 -4420
16540 -4420 42375 18725 -61503 -36467 6827 -5989 -120811 -177893 -153063 -90379 -121092 -95481
16528 -95481 -80636 142960 121595 -2354 -11467 5294 6487 -43247 22200 63480 19633 -6851
16516 -6851 83716 26801 60450 90658 169512 -41594 -210365 -268112 -139082 -39133 -2198
16505 -2198 -53563 -153883 -203676 -228223 -194809 -106647 -102684 -188971 -144958 -17830 -10067 -131982
16493 -131982 -74727 -87292 -227893 -229493 -200982 -226512 -202197 -170003 -89758 -47558 3327
16482 3327 -8885 -133790 -123224 -128003 -211648 -189539 -127333 -100035 -147091 -121408 -50345 -73506
16470 -73506 -92068 -861 10511 24059 34787 112727 13621 26742 -50041 -15786 57318 -18564
16458 -18564 -108266 -20747 115997 86706 -28792 11451 121699 118328 51585 29064 -40599
16447 -40599 1728 -27292 -210349 -143137 -6968 7691 -42137 -70039 -36283 31447 56988
16436 56988 4579 69053 170193 211574 264566 248739 143835 67273 128787 174634 118627
16425 118627 711 -116338 -138949 -187460 -228777 -132301 -11764 -42647 -150480 -241738 -314913
16414 -314913 -190487 -147057 -138991 -73123 49789 75486 73749 85246 101619 84176 83287 4777
16402 4777 -67634 -89326 -61467 -47897 68032 96096 96374 76965 5360 -7536 20673 18572
16390 18572 83244 73633 76364 107484 19525 60836 -9088 -67093 -28040 -160638 -235866 -118450
16378 -118450 32391 142704 190313 199858 115213 -53154 -160524 -55601 56704 209821
16368 209821 301992 179140 148291 89877 107676 129860 107943 124295 171478 154091 199043
16357 199043 133867 130328 97034 33829 47650 46482 2898 29891 54355 -48977 -104071 -103562
16345 -103562 -100305 -32455 41670 119179 117456 150214 59459 95755 121438 160546 162064 202367
16333 202367 199378 138309 81893 167106 109757 -5610 134221 88069 14497 -92348 -50667
16322 -50667 -56323 -136113 -93595 -85762 -192746 -193661 -181401 -159314 -74490 36353 108283 34638
16310 34638 -5851 79582 -5074 -14882 -44805 -35684 -46298 -88173 -124697 7211 82374 179708
16298 179708 211713 178391 54887 -34396 -106276 -67456 -48248 -48177 -23711 33149 7163 10314
16286 10314 -44147 -91653 -127052 -34790 94643 206203 166247 113819 116806 128056 97583
16275 97583 110188 12991 -166283 -300756 -170753 -81681 -22272 -37855 -28646 19096 -45497
16264 -45497 -103174 11092 22952 54253 99215 73438 10478 -33437 -31163 38543 97999 89587
16252 89587 -54161 -105574 -60361 -94652 -121130 -10442 16487 62221 127826 19537 -32895
16241 -32895 11704 -55134 -33112 115673 138591 -28438 -102678 -98437 16637 -35278 -100948
16230 -100948 13984 42636 -86256 -45588 -17401 -132836 -92306 303 98125 42684 78937
16219 78937 157102 159215 109368 72242 87046 42828 30481 -1661 -9863 22908 164938 180797
16207 180797 162205 143438 58919 38568 -82224 -143786 -146401 -164892 -215845 -107460 7708
16196 7708 -61251 -139241 -82015 -75737 -84589 -142672 -137307 -67431 -56376 -99662 -150865 -173311
16184 -173311 -141445 -37900 22589 -95628 -185329 -67361 51801 12877 10249 13391 27382
16173 27382 -75376 -200675 -165727 -116170 -201390 -208696 -152651 -39743 91315 126971 97749
16162 97749 14063 -135956 -184057 -72115 -94400 -176744 -143878 -1205 -6520 -65708 -3564
16151 -3564 85076 96840 54732 114995 118257 36586 1800 -64431 -157812 -23652 116958 175558
16139 175558 107570 121740 58586 101581 120368 186751 86413 -14056 -15185 -53358 -76198
16128 -76198 39702 77583 51394 64340 -72670 -24879 73484 116861 42071 -21470 -61873
16117 -61873 -109873 -123339 -107243 -51054 86388 66244 81195 -41429 -118174 -37471 -65966
16106 -65966 -96255 -101079 -144108 -227588 -89017 9223 -64740 -84021 -47279 -8575 66970 12371
16094 12371 -50872 -162263 -140678 -112008 -86635 -39414 71203 209236 170948 95778 -49908
16083 -49908 -103145 -160724 -10117 47652 -8756 113336 104838 -96348 -187349 -142753 -116579
16072 -116579 -116620 -125312 -168116 -219060 -198593 -192983 -66681 127948 54597 -108276 -105472 -36199
16060 -36199 -23896 -27849 77342 120213 80815 82335 165928 136544 163938 267194 205767 -25797
16048 -25797 -67064 -111345 -17782 43790 -39799 -135168 -92054 -96722 -48444 42124 81910 41722
16036 41722 -38433 -32546 -4793 3670 -27254 -25981 -40279 -44547 22191 -1651 -17884 269
16024 269 33797 76117 -2683 -12751 -22919 -12855 -11814 -13705 -79988 -57936 -132397 -128144 -24271
16011 -24271 88115 66872 -172 88476 26971 -82628 -59881 70058 32803 55700 185496
16000 185496 255897 196047 103650 -31191 -100135 20640 42490 82199 126604 74359 -15917
15989 -15917 -146586 -202528 -179217 -166038 -151060 -21747 -21297 -50346 -90997 -90904 -31538 36066
15977 36066 -17233 -105 18122 20597 -69930 -26490 136051 152518 18403 -38955 -16344
15966 -16344 -61552 -98513 -19902 65422 168243 179714 167396 139738 64063 -21691 -3678
15955 -3678 22197 -4631 53052 123926 142878 146771 177737 189572 96238 26439 28828 -1760
15943 -1760 -73114 -78985 24886 138057 235184 354056 353664 330962 264271 116612 9453
15932 9453 -110854 -197098 -226480 -222316 -214421 -219686 -208997 -162575 -127658 -60957 -5779 -50956
15920 -50956 -154346 -24333 -23086 -58392 -60583 -102021 -183883 -147944 -94857 -77768 -91328 -153638
15908 -153638 -79631 29085 94087 93172 83545 -10542 37854 64240 58962 -175393 -218665 -81457
15896 -81457 -64790 -127495 -103371 -111635 -89980 -86742 -37603 82561 126591 22465 -72461 19950
15884 19950 69285 33460 -52892 -163985 -207231 -138825 24706 -50715 -71246 76881 87494
15873 87494 55415 42468 7973 20779 84279 119330 -7711 -68045 23614 120346 57584
15862 57584 66634 86378 26376 -48737 -92789 -63359 -123953 -170893 -158831 -137609 -129943 -159983
15850 -159983 -143985 -182328 -80999 20953 -138644 -252589 -163927 -71255 -103325 -136178 -117045
15839 -117045 -62942 -107712 -130949 -159701 -58946 19299 -11719 -20493 -56627 -107256 -124559
15828 -124559 -17594 19770 -35037 -5923 26860 144360 128262 161409 159563 8819 -12864
15817 -12864 -53085 -98582 -92214 -17328 115352 84802 -115217 -169830 -122809 -83565 16363
15806 16363 55204 30771 18067 132215 123049 9081 71126 95298 43238 77703 -27961
15795 -27961 -55615 -21417 19233 61220 84335 105527 100560 54856 -50978 -119219 -61542 -6368
15783 -6368 37763 34082 -1476 -4297 46233 26203 -67458 -18550 -14874 116862 59356 -23149
15771 -23149 -78730 -14423 148612 92405 -56513 -70472 -51728 -54509 -32659 -76489 -20242
15760 -20242 58725 111655 -48918 -62308 25038 60419 47992 -21713 -31180 -45661 -172438
15749 -172438 -224841 -105369 6885 86482 129827 91724 -5216 -8770 47186 -25001 -137205
15738 -137205 -120029 -4744 10067 -39832 -4013 17997 23266 40533 -18577 69156 96882
15727 96882 -29095 15741 138 67752 -11974 -74868 -47525 57573 85689 92520 147644
15716 147644 149115 84672 81027 70887 6797 -109615 -48871 88003 76459 101270 45044
15705 45044 -1507 70343 148470 40585 136475 84433 16298 -60109 -47188 -12227 -6353 -3295
15693 -3295 5661 18743 -21841 -70582 8243 35021 124331 150254 124060 -29600 -80721 -73421
15681 -73421 -84352 39598 165151 161304 75086 30776 -70819 -133933 -206810 -256131 -229313
15670 -229313 -55699 68429 8155 9345 -12261 -76788 -125677 -110780 -157232 -188967 -74623
15659 -74623 138598 150681 -19405 -32136 91763 123733 -5674 -46540 -8929 79619 150177
15648 150177 83002 71953 118045 158446 174940 207685 142759 74707 -23091 -97025 -138778
15637 -138778 -52252 -26735 19955 -2337 52248 159985 188560 210685 214267 146901 27969
15626 27969 49506 19363 -11589 -129157 -55223 139275 90095 -47345 -95576 -138536 -65514
15615 -65514 -82321 -106031 -5135 -124453 -179205 -63112 24822 2978 -134732 -71261 42137
15604 42137 157608 129668 118002 101322 77938 53145 40089 184841 109990 113 -5264
15593 -5264 118317 112140 5985 -10336 -52223 86505 85872 56758 -52693 -25520 -45768 -15826
15581 -15826 -31327 54151 47510 111087 228636 121132 139182 151841 171754 156786 136748
15570 136748 201393 253240 192987 -50488 -164416 -84563 3128 51257 17918 30278 177726
15559 177726 -37482 -313273 -299455 -130028 -69188 -108857 -73296 -17594 43776 47859 -28264
15548 -28264 -175621 -149317 -42980 38795 78447 53923 -11489 -5153 -42265 -33009 -43382 -74481
15536 -74481 -18153 -29404 -128347 -152304 -66765 -51461 -44081 70877 42252 101786 115804 -72034
15524 -72034 -114297 -7854 70916 204503 202822 189999 120369 107846 181597 133244 130163 188707
15512 188707 155754 78919 42515 2286 4620 9920 30052 -89826 -155869 -223191 -118923
15501 -118923 -98197 -162908 -138962 -5241 211046 218904 106723 43144 6826 -46703 -120081
15490 -120081 -90229 -47710 -59281 -122926 -82193 -1313 47068 -69700 -187633 -69381 38687
15479 38687 84472 31109 -26374 31978 57055 90778 128378 99967 83734 97599 12514 45430
15467 45430 -14206 29953 180949 102373 193091 286918 231989 42693 -5136 -59433 -49711
15456 -49711 -68531 -69794 -59728 -6356 -8962 -185265 -220364 -232172 -170307 -173764 -238140 -164626
15444 -164626 -68582 -82939 69612 70476 5424 -23708 -86598 -135818 -115963 -11026 89912
15433 89912 97721 114684 154961 162652 224792 211017 99231 8559 50852 53908 24493 51848
15421 51848 60791 94481 216293 237315 154331 -21340 -87955 -163932 -223890 -324732 -197952
15410 -197952 17777 128588 198405 207895 253299 186463 132250 182945 77161 63885 128275
15399 128275 69608 -37319 91820 214396 320282 261484 188587 115852 119056 135248 76225
15388 76225 23770 -15453 4598 174095 154392 211037 246460 347876 389810 311886 200223
15377 200223 143024 104783 35846 70348 107817 98672 -43361 -121380 -134362 -48677 60356
15366 60356 24351 889 -67276 -85148 -122363 -36095 114459 116570 12314 -27604 26452
15355 26452 797 42785 -50376 -142191 -104393 27984 12382 -55364 3576 -21050 -13169 41189
15343 41189 159865 275487 185555 -30292 -98291 -69482 -15696 23882 105291 150096 146089
15332 146089 -45261 -136649 -43442 2719 68829 157075 145387 93202 38057 40019 -5687
15321 -5687 -60192 -70564 -64315 -20358 40675 -128 -16416 -25844 88967 156757 111758 161357
15309 161357 163026 174517 129002 65913 -42274 -51647 -30473 11259 34427 130141 144111 -4706
15297 -4706 -96619 -35211 -34789 -38875 -118531 -84620 -202 21095 44315 -23523 -184264 -229505
15285 -229505 -302525 -183461 -2949 79060 98856 26061 17782 52500 93277 37852 105981
15274 105981 172626 112090 164687 121184 4413 -33636 -43342 -95362 -87960 -152879 -200965 -70765
15262 -70765 54505 106123 19221 -38242 104384 88033 -23400 -122189 -103800 17567 -36694
15251 -36694 -77255 -10332 94403 -75671 30656 62972 81884 66728 37086 133235 108650
15240 108650 53671 -95514 -174358 -197448 -135686 -74493 -20636 -47950 -22766 79759 -68401
15229 -68401 -142592 -578 28072 99905 135080 101178 19242 -11464 -67804 -54069 11490
15218 11490 83156 125807 15596 -78810 -78505 -26392 8021 -41165 -113874 -103878 -133580 -107672
15206 -107672 -77626 -61390 -40155 -194532 -206835 -24504 86621 72329 -61710 -39695 -29084
15195 -29084 -47178 51446 106816 56831 -430 -28283 34047 -98740 -23374 49565 31342
15184 31342 -85803 -138421 -155881 -45241 -14582 -83021 -127244 -74590 -81383 -71607 -176906
15173 -176906 -155694 -83385 -131743 -93865 19896 -12122 -49972 -107243 -39026 61479 3207
15162 3207 108655 144875 101565 50545 169838 247572 142390 67967 -75513 -140603 25719
15151 25719 180483 93996 30136 88605 51457 87831 187509 210994 248177 213896 58224
15140 58224 -18896 -22181 -104162 -73338 -109444 377 69661 -43673 -74016 -90207 -81032 -13635
15128 -13635 47132 54165 -16868 5804 27247 47509 43048 -11514 -64519 -127931 -74328 39421
15116 39421 47297 81307 118642 92992 103556 56314 107807 164484 124909 21463 -131918
15105 -131918 -182050 -115393 -80454 -62574 12238 -25517 -21021 98288 165688 143889 7328
15094 7328 -145632 -160085 52516 160486 79850 154079 271399 200419 102284 98306 123924
15083 123924 146713 92328 2918 -38326 61591 -7994 -18714 2253 80733 -4238 63731
15072 63731 106077 69317 21130 -194933 -170852 29088 124549 7754 10940 167469 134254
15061 134254 -9765 -76407 -10938 -10794 47966 20368 -48053 25398 87775 101826 6394 96052
15049 96052 112374 51331 22267 -50390 -11338 152119 216782 216736 197068 27517 -74726 -127334
15037 -127334 -215004 -296073 -201313 -126288 -234007 -217855 -116307 -103918 -141369 -131802 -120088
15026 -120088 -139242 -80668 -124788 -106063 -39984 106842 37553 -23399 -259 -4714 15601
15015 15601 37090 52862 -137704 -34414 59952 74162 17279 18850 57250 98715 80294
15004 80294 43367 -2429 -22168 29333 96800 6552 11980 40581 186458 125858 -7485
14993 -7485 -33456 -76482 -118301 -150208 -126032 -145300 4629 11003 -50798 37334 42437 75843
14981 75843 106183 57168 3767 -24200 7094 66289 74127 68166 -104556 -188375 -116372 16440
14969 16440 -41230 -92092 -86243 -196484 -176779 -137213 -99357 -30039 17737 55266 33481 -28451
14957 -28451 -65974 -104355 -87842 13016 26572 32390 96321 30134 -34735 -6091 15241 32261
14945 32261 -4460 -120194 -96536 -69560 13471 -68478 -109220 -88469 -48854 -86976 16398
14934 16398 141432 153571 185650 177069 97107 80094 58842 -12271 83815 133188 42989 36887
14922 36887 33303 115497 202709 119569 28413 -53725 -75541 8186 60608 -33473 58315 155411
14910 155411 131355 73898 21917 -49900 -14982 52277 20635 -76221 -128808 -151342 -33810
14899 -33810 52218 -59982 -201595 -177979 -60541 -23830 -38450 4133 104485 140629 34038
14888 34038 -137026 -169289 -107521 -40838 -11570 48512 -48394 -100895 21473 -6768 -113248
14877 -113248 24399 -68300 -139178 -49125 -4776 75940 150479 155761 100582 86185 6591
14866 6591 -127584 -155047 -153238 -126834 -156845 -195285 -204310 -251213 -201803 -85327 -21914 -34529
14854 -34529 34186 40113 -19473 -11873 -40472 -49187 -25697 -61895 -91437 -125490 -83251 -59422
14842 -59422 -82177 -133909 -88292 -135940 -236053 -85181 -38805 17500 76526 40535 130997
14831 130997 115628 36359 -5165 -129448 -208012 -230379 -22910 31553 84343 -9964 -96706
14820 -96706 -69961 21040 87258 39486 58798 69284 136884 207799 126928 148653 251935
14809 251935 278912 176248 138213 67415 -3098 20167 125915 125603 -10219 9851 74494
14798 74494 85999 84550 60119 93605 67949 41433 67354 42254 47876 45819 -47226 -87545
14786 -87545 -49940 -50767 -15219 -31004 -23892 24353 42233 -68608 -167085 -217150 -210543 -184382
14774 -184382 -256498 -298871 -153578 -17922 91784 118890 92169 66786 118163 10622 -85910
14763 -85910 -27651 104436 68013 -3302 21159 69162 96918 103100 40358 -88796 -140407
14752 -140407 -149993 8257 97286 150806 130755 42865 -57434 -54100 -141638 -182224 -178427 -110312
14740 -110312 -183422 -248545 -211502 -133103 -111812 -124467 -119129 -110688 -136476 -101933 -31221 53477
14728 53477 73464 72089 106170 120133 103910 88924 12116 84720 66107 -14208 -46453 70856
14716 70856 75172 9385 10998 50981 -69678 -149304 -211911 -224739 -123921 -20030 53764
14705 53764 36480 -46979 -102645 -32738 43185 4351 -8705 -33144 -3646 15745 -68684 -5501
14693 -5501 -30542 -34853 -31356 -37379 47910 51353 48395 60488 9757 -18657 -82490 -186609 -96793
14680 -96793 -72126 1528 68214 45590 106738 173483 224760 54141 -100142 -146132 -116678
14669 -116678 -95811 -162779 -166700 -181842 -186024 -166440 -145924 -31819 -64615 -37204 -35400 -29738
14657 -29738 4336 -59904 -77305 -65222 -37480 -27284 -68549 -182472 -188921 -42408 11528
14646 11528 -22960 12637 103871 142970 70315 -13303 -126498 -168412 -63870 16546 10096
14635 10096 -25475 -53445 -128940 -266936 -187465 -124900 -151720 -63385 -525 -70071 -96363
14624 -96363 -134828 -152068 -25213 16394 -15421 49945 128386 171586 182939 92987 81381
14613 81381 74039 99052 -109937 -165292 -182326 -242626 -193586 -40737 -33611 -15437 106449
14602 106449 114960 -49899 -39250 -23433 58893 97649 51561 78972 70984 115852 58081 39212
14590 39212 -74935 -42235 -73254 -198352 -182469 -126101 -27448 44228 5586 -68207 14778
14579 14778 -5284 -25406 24773 138400 117634 8781 -40409 -25306 115085 154382 92967
14568 92967 141583 62409 -143667 -192014 -117379 6207 163335 73909 126317 173154 137296
14557 137296 -12330 -58325 -23878 -13752 38730 96141 31770 37391 137948 165145 221746
14546 221746 223004 250444 223329 132318 93098 210946 141772 54866 67409 136336 191407
14535 191407 136290 5992 -69763 8880 -15927 -49983 -80375 -207293 -211938 -80668 -18772
14524 -18772 -14527 -22770 -73795 -34566 25994 119811 119287 21540 109333 192357 172369 174140 225356
14511 225356 123480 56317 135122 81727 68581 38973 -46427 -63591 -47926 -79929 -25205
14500 -25205 38722 87594 108501 246875 222959 181721 35937 -62513 -31370 67698 244871
14489 244871 218908 -38659 -82985 -84536 28434 198698 223964 158573 67203 114169 97464
14478 97464 25692 -81976 -106084 -39164 38593 -3092 -49123 -70295 -88 94640 89823 2667
14466 2667 -79105 -23541 3555 4698 50834 -72505 -135860 -81808 -20969 -69736 -12790 -530
14454 -530 -12479 146686 234563 75523 104763 60679 12554 73475 183989 114491 -45036
14443 -45036 -90604 30776 53093 -58652 -83877 30273 107405 -5209 -12158 -2480 -14113
14432 -14113 34797 120164 78632 4455 103652 29067 -98028 -176073 -219802 -178851 -54251
14421 -54251 -18737 3131 -27146 -67771 114132 753 -55600 -64491 -240670 -285570 -231374
14410 -231374 -202497 -216884 -287184 -186126 -56248 11106 18800 41806 75795 54147 120522
14399 120522 150096 102996 46226 -79030 -110231 -161010 -190487 -190286 -28424 54061 13237
14388 13237 -63547 -70282 58823 126558 39676 3818 22403 25336 18136 49750 -7501 -56710
14376 -56710 85237 44562 42761 41859 120225 126004 -123254 -177080 -59089 32203 74594 -58097
14364 -58097 -145533 -59949 36806 89504 125347 137752 139366 91749 118178 95638 56994 12873
14352 12873 79526 74806 74337 33223 33594 -14235 -85042 -185013 -38180 41759 58481 3109
14340 3109 89962 98451 -43475 47996 88147 66499 -15026 -27921 15251 117663 56791 70887
14328 70887 105870 37186 45133 -15683 -98233 -181245 -201474 -203074 -226511 -291957 -254395 -94267
14316 -94267 -40555 -61141 -67060 -26007 33379 -80332 -97209 -9047 -59806 -55839 -24100 20755
14304 20755 -708 -139703 -199173 -154496 -113991 -34684 24485 -56060 -40499 12213 35675
14293 35675 28508 -4061 -35704 10467 55444 74631 172920 268858 217780 185121 168737 191087
14281 191087 92081 22072 95729 144850 63784 -22093 -113421 48104 115885 186584 153253
14270 153253 153930 192479 131964 37175 -13903 -44008 -10991 3535 -45246 -21682 22176 4219
14258 4219 -104996 -103573 -46212 -64254 29756 175414 141796 174130 176167 87184 193124 225545
14246 225545 246507 194987 73818 45987 128532 222388 191733 152193 118047 116664 42434
14235 42434 -33706 -26290 -105716 -130292 -16800 65857 160717 80940 13069 132386 200988
14224 200988 79603 88746 99912 -27771 -23218 -18330 7357 169041 166493 86824 37456 178537
14212 178537 345954 324343 94840 65821 85247 36876 4101 -103591 -129884 -63970 -49149
14201 -49149 -108911 -21950 48691 59549 54768 -6051 -44469 37041 128997 -4961 -145083
14190 -145083 -126487 -13503 58400 137667 103219 109654 118649 35641 -14220 -35984 -11401 -50201
14178 -50201 -97606 -136229 -170952 -86363 -53412 -175686 -292820 -339256 -324276 -308723 -149498
14167 -149498 32512 63867 60176 9844 -20797 90112 199992 177804 184054 137524 85692
14156 85692 50230 -23974 -28927 -119414 -198800 -82183 -74925 -128811 -8800 7121 87676 154036
14144 154036 203406 112973 18820 62954 91636 -27269 -187140 -227231 -127820 -89475 -60695
14133 -60695 -9944 -77347 -220836 -225065 -186236 -108410 -137880 -116009 -83560 -138266 -78978 69601
14121 69601 62025 28989 45381 -38222 -162874 -155339 -153449 -107385 -54021 -1703 -18982 -32006
14109 -32006 -138019 -131905 -63971 71742 151227 178451 112401 66428 86374 110050 129931
14098 129931 142314 190434 212656 276308 262638 73829 40171 -32365 -5247 52293 122360
14087 122360 124197 131175 -72719 -81740 -94965 -174306 -84995 130915 252135 245674 196435 52108
14075 52108 65990 -12855 12119 46122 -8794 -9582 -42285 -117468 -46250 -162507 -268268 -150816
14063 -150816 -8736 20692 -104584 -207771 -212694 -64558 37108 121397 144741 135670 83171
14052 83171 -11702 -32583 -104670 -139392 -120859 -181878 -52064 98466 160719 110796 -43045
14041 -43045 -128411 -207646 -217329 -159651 -91505 -26874 -56746 -41997 -24337 -51129 -25640 -8991
14029 -8991 -5221 58830 120842 68096 -47589 -47844 -36278 -82761 -37142 10284 -16808 -52647
14017 -52647 37241 128791 141983 110094 137066 111848 69696 119473 165343 40926 -55279
14006 -55279 -132325 -83898 -111757 -97343 -175973 -161692 -86645 -81833 -49447 -43712 24511 47845
13994 47845 -31889 -87177 13182 -67611 -128702 4194 -10950 -381 21344 -17261 56455
13983 56455 29487 -118746 -146317 18300 94358 131019 254993 276886 136935 80071 4810
13972 4810 -23988 -51837 -93298 29522 120521 146267 85155 17223 -6414 -50753 -101732 -114153
13960 -114153 -79342 -22590 -20569 12327 -60291 -105235 -67122 9981 75564 101756 42554 35266
13948 35266 -40470 -88430 -203604 -178723 -92292 4673 90428 31094 43949 193900 230135
13937 230135 233712 184661 87117 -52264 -44960 -57802 53969 -7199 -80904 -60374 -32124
13926 -32124 14620 -61173 -112281 23201 52029 17748 -28760 -156335 -141750 -35907 -2346
13915 -2346 -13270 -63573 -73015 -41273 -15559 -46652 -53724 -65723 41557 97961 -1047 -65604
13903 -65604 -111190 -146528 -165151 -160120 -214323 -157654 -71189 -10963 43737 128367 122576 9036
13891 9036 102831 2431 -31122 36791 61471 -17356 -25086 -49889 104768 151691 150790 -3327
13879 -3327 2631 83092 104222 43220 -57609 -81303 -54550 1804 -53757 -147880 -92283 -38002
13867 -38002 -117645 -63171 28859 17906 13947 -100186 -218303 -232925 -124181 -105842 -13907
13856 -13907 51841 -74738 -104962 10444 87514 22416 -2634 -27459 -41928 -66839 -63990
13845 -63990 -16545 37256 -12959 -21813 -173118 -265673 -215019 -132947 -15850 31144 20154
13834 20154 32359 61174 8543 -7867 -28349 -160046 -94817 129956 274874 303547 166534
13823 166534 43704 -71817 -24823 20292 30891 571 16564 86764 86901 14182 -30737
13812 -30737 64908 92425 113632 31679 -39168 -69287 -80822 -91151 -73146 -79312 -126367 -97540
13800 -97540 27052 165726 179051 37824 -98905 -41532 29080 -22680 66985 -42898 -95077
13789 -95077 -17355 30737 -87993 -96314 -36671 27095 113583 171232 -16206 -66982 -95769
13778 -95769 -65209 -22256 4910 -63232 -31233 93463 -300 108119 152287 113970 48778
13767 48778 -7676 75057 82446 179337 61261 -33878 -20681 -49095 -119528 -110571 76411 41234
13755 41234 34100 78242 119080 156012 105106 -22265 -27964 -29497 -110652 -124848 -20366 -16439
13743 -16439 -122241 -212353 -279347 -208833 -136060 -10451 95788 121944 57671 13559 -6192
13732 -6192 41268 -22624 -166579 -195294 -225532 -228651 -82539 -6559 -60984 -92051 -20454 -21509
13720 -21509 -80891 -95305 -117192 -115105 -143628 -80043 -144420 -177115 -170691 -111194 -62526 -37063
13708 -37063 -211857 -193849 -123304 14138 18879 -3829 37053 31325 78320 138225 149615 78201
13696 78201 73827 67606 103627 158079 90350 55151 -39711 -80314 40284 7946 -18539 -42310
13684 -42310 -11746 55973 -12053 -126849 -143148 -66766 22872 -26962 -65023 -52683 11047
13673 11047 145778 163907 125209 54250 -51290 -118272 -174848 -88509 18575 -24052 -93821
13662 -93821 -128786 -248801 -182638 29601 60805 17509 42659 149202 71615 -38445 2405
13651 2405 -49314 -81046 4576 21865 -23865 -34140 -89094 -16154 -8947 94425 93841 -13661
13639 -13661 -36416 -28146 -53989 -45964 -86683 -66281 -40622 -89447 -78971 -57985 42928 141588
13627 141588 25853 12205 76515 57027 36952 95693 45898 -96805 -176053 -116565 -141974
13616 -141974 -150822 -75729 -71729 -127827 -136799 -80902 -44745 -108407 -108917 -96969 -11618 70338
13604 70338 117098 141958 136976 25205 -59312 -56456 -53811 -60276 53634 36900 -29478 -65539
13592 -65539 -142189 -106770 -64419 -74049 -23972 -65711 -5364 -23326 116781 161619 89787 -60653
13580 -60653 -71042 -69834 -63185 -39894 3249 -28922 -117016 -64958 -27712 105940 182185 151119
13568 151119 93211 73693 141966 97538 109169 51035 73462 136288 56498 22999 39946
13557 39946 23374 -161266 -146445 -32022 -21598 -127737 -158966 36334 255101 193497 111909
13546 111909 96507 43677 -20875 2913 -40468 -129642 -97174 -117054 -41202 92278 78792
13535 78792 19600 74373 64933 72853 134138 104549 -48076 -121610 -11483 11490 -46494 4813
13523 4813 21995 -62083 -66543 -167279 -181582 -128604 -76169 38449 69374 53533 -31392 20142
13511 20142 -13659 39784 114224 87137 41277 -32632 64824 143719 138488 71162 20238 -77902
13499 -77902 -64934 70279 86223 2719 -106064 -101321 4982 33858 127744 120497 18965
13488 18965 -5580 69653 209462 216351 141387 15502 23953 -51811 -77850 -175095 -161017 -110086
13476 -110086 -116495 -58639 -178485 -157543 41573 79531 4692 -145947 -197353 -125033 -123658
13465 -123658 -175304 -162790 -136905 -127889 -127272 -47562 -75149 -147360 -143382 32319 123402 141003
13453 141003 60241 9578 -1335 -13196 -28893 -2814 -20781 20092 49495 186491 139385
13442 139385 100259 94823 30559 17377 57307 124186 73120 36657 15914 51500 100095 145428
13430 145428 172467 171427 240184 212948 139138 18053 2869 28860 23377 27546 -41354 -127718
13418 -127718 -115209 19412 97230 71982 28064 22917 72866 6843 -24779 -47710 -84352
13407 -84352 -447 59076 134044 164198 118188 -6351 2810 -134851 23903 119382 111191
13396 111191 123600 225607 164083 159952 104245 36159 178327 171611 -3933 32615 47994
13385 47994 -80654 -143732 -184496 -280811 -164817 -102166 -88075 -11421 -33964 -2218 77948
13374 77948 133371 71878 -25701 -103806 -194228 -59169 102728 109416 19077 -140656 -77377
13363 -77377 -11175 -10211 -11539 -59242 -64646 -22954 -52649 -42445 10099 62736 111507 225934
13351 225934 190718 31380 -40684 -8610 86711 59522 -27824 -176055 -220401 -144891 -62813
13340 -62813 8815 -72378 -188850 -156187 -138067 -131672 -96004 -72726 -77793 -67796 -106251 -175150
13328 -175150 -76377 -79652 -143639 -100313 308 -25479 11549 -19829 -18054 48259 80865 150767
13316 150767 81904 -13261 -4319 -15932 10086 3070 -92399 -52966 -157479 -58317 101107
13305 101107 100906 2729 1876 135504 157299 117718 74879 -9812 52838 199673 130476 36947
13293 36947 -59267 21131 122340 63301 43803 20801 -17 -22848 -36690 16247 -104216
13282 -104216 -76627 -159461 -125972 -115482 -121439 -124483 65457 205148 221447 169587 85712
13271 85712 14851 -76294 -21642 126807 67912 68360 20224 -52897 -72777 -19014 92825 179245
13259 179245 224311 124501 41016 -55853 -97426 13803 47114 -31002 35111 157465 242993
13248 242993 136502 28124 75577 29000 90525 128831 89226 100494 56115 46902 -4739
13237 -4739 -11512 50227 -24056 -24885 71188 80746 111853 93365 35573 -54678 -58068 67642 59084
13224 59084 60389 51433 115536 217192 188957 147059 51091 -58922 -45044 45560 67484 28854
13212 28854 17253 39344 52716 123165 87417 23282 -29507 -19618 -95908 -158870 -108000 -325
13200 -325 17290 60650 58491 -8157 -21640 -27614 -130686 -155685 14782 99510 83466 97796
13188 97796 76110 162278 223076 164692 142888 133612 -14738 -180343 -225175 -78535 55550
13177 55550 148917 42814 -91000 -49368 -51455 7402 91146 160131 174244 153149 174562
13166 174562 178792 141964 177200 98401 67171 39766 13428 35941 24622 -88322 -106869
13155 -106869 -116430 -21590 76293 78961 -77294 -68803 -102784 -84657 8531 69391 84613 10273
13143 10273 -67658 -103763 -65013 6180 145993 74062 -89823 3632 -37723 -151451 -141042
13132 -141042 -34052 78917 11569 70220 114411 -63375 -17973 71848 71981 -72779 -130414
13121 -130414 -108676 -61676 -82514 -107934 -7710 87053 116451 39472 -137023 -242388 -130224
13110 -130224 -102260 33936 92219 12082 -140112 -107010 -81135 -137338 -120140 -107014 16758
13099 16758 78261 98264 205464 183491 180824 254812 268903 169899 8297 17007 -39607 -30973
13087 -30973 34217 45228 36394 21101 -53093 25580 8178 -54609 -120633 -78364 -73151 -79833
13075 -79833 -68203 -87562 -133199 -243052 -85250 -101484 -100898 63618 151669 127440 161307
13064 161307 -9933 47455 -8374 -106123 -19127 -4291 79854 165741 128439 140377 213820
13053 213820 231544 255376 273523 150044 110098 124246 60995 37390 103407 156134 273910
13042 273910 231021 153157 29821 -121553 -203596 -117465 -108092 -97325 -46662 -44713 -103579
13031 -103579 -24574 104185 144620 88697 59427 4870 -100994 -25071 116105 74181 74393
13020 74393 86017 -21287 -38299 -18464 14652 -51991 -85456 -110339 5387 21281 -13926
13009 -13926 -7497 10640 -86085 -123759 -12667 82384 71581 77000 51162 72386 98929 59634
12997 59634 43664 87129 83612 12719 -4539 -74229 -52669 4176 -81894 -22816 141207 235756
12985 235756 210877 119934 50199 -39635 17093 72772 79353 81836 -7075 -20139 -13746 -111376
12973 -111376 -168448 -129230 -119028 -95825 -96508 -79724 -70807 -90256 -62711 -41577 -41057 -43572 19419
12960 19419 16097 42493 -11551 -109756 26670 134586 171224 91025 6282 116460 83110
12949 83110 151415 181021 35158 24375 18410 73303 116859 125004 48831 -167453 -292974
12938 -292974 -361334 -309011 -264767 -203660 -96569 62430 96526 -4806 -9204 132687 267312
12927 267312 228587 33144 -55834 6777 118275 87069 48463 62336 76892 150144 95870
12916 95870 172167 152970 170865 63452 -81003 -157129 -18410 203912 205716 91169 97763
12905 97763 163108 144371 35830 -19219 42533 209812 223710 123492 48349 79061 145179
12894 145179 112304 91551 66982 77907 -2383 -22865 -14284 -61168 -95319 6038 83463
12883 83463 26942 -55381 -49266 -142941 -104429 -126534 -138183 -152686 -126653 -168966 -259458 -235839
12871 -235839 -136034 -109150 -121836 -98145 -25298 26206 4514 -132897 -175668 11892 19798
12860 19798 -8189 -74081 -77671 35166 63926 -53402 -29483 -10132 34305 -149821 -162077
12849 -162077 -57483 -31356 38227 3600 -142268 -87674 49928 46553 65082 103800 65615
12838 65615 13292 79824 39537 -50799 -33085 -48368 -178292 -154272 -120250 -135189 -194931
12827 -194931 -154294 -195716 -185640 -43256 -7126 -10501 -74874 -57840 -68611 -68757 -14742 153814
12815 153814 185097 153292 109547 163841 126637 103904 31673 -36560 -9100 714 31399 200067
12803 200067 146572 -37725 -87171 67003 109844 55204 -51129 -9528 29329 92169 76643
12792 76643 -80379 -201396 -161138 -92117 -81790 -44525 17232 -4455 -37288 57580 48572
12781 48572 88398 51157 63509 17358 -49234 -95397 -24600 -92899 -47386 129007 84917
12770 84917 -37356 22198 116673 100667 84375 89729 106878 49067 70207 70950 53168 -34295
12758 -34295 86228 87690 -30486 -126802 -127788 -96971 -123527 -185905 -98313 69042 94006 172753
12746 172753 187309 114306 50775 99737 137154 87311 126367 27359 -162209 -56531 17027
12735 17027 21226 117635 228869 88257 8450 -11353 45390 57663 20772 37220 70419
12724 70419 73507 38934 35806 22605 107633 188991 305569 350927 291579 288644 204688 125149
12712 125149 34625 4655 -38905 -60141 -90355 75748 114644 14693 5512 -11667 -47279
12701 -47279 -91070 51746 128536 137353 42797 5792 627 -58188 50103 223577 236715
12690 236715 261755 319429 263202 146606 162722 101525 -67115 -45880 27970 101657 38151
12679 38151 -42853 -72572 -174160 -88009 -93598 -87791 -54801 -75788 -68014 7186 83243 247634
12667 247634 257561 104983 32241 51576 34379 -24813 17792 -42168 -98965 5594 -16124
12656 -16124 -88466 -48046 -41667 -141210 -105672 -66349 -71651 -133534 -57154 -59256 -127487 -129739
12644 -129739 -93182 -106017 -149063 -133879 -28777 113231 153516 73075 -35163 -70503 -69779
12633 -69779 -73177 -41529 -53600 26811 13775 -4849 -17310 -33717 12165 48234 -27072 -119450
12621 -119450 -79581 3806 -101074 -132429 3778 -28201 -83997 -164691 -214391 -119783 13679
12610 13679 16337 -13889 17481 57820 64841 177160 279732 267240 165100 195415 83244
12599 83244 -22518 -13441 30951 37020 53138 124395 138075 65057 -36110 47305 63254 -75408
12587 -75408 -71328 -204478 -43003 46963 11881 22540 78378 68440 50722 -10737 -34622 -34760
12575 -34760 -64919 6683 43719 184295 93150 -18964 -31454 -23812 -40205 -169405 -102083
12564 -102083 -8173 966 -73432 9820 147563 114751 40291 25162 193810 187023 166797
12553 166797 141065 261714 281439 196448 166750 158010 131322 107536 72648 50219 124173
12542 124173 115466 212683 256636 95953 31187 57692 80061 93323 206104 214309 181072
12531 181072 5006 -60457 -72027 -72631 23100 49155 9958 -72891 -128355 -89735 -96405 -55226
12519 -55226 -22449 4808 64648 64308 90934 8613 -55285 -168229 -214424 -165543 -67943 -63252
12507 -63252 -171082 -169001 -199278 -327016 -262965 -148233 -86581 -158490 -124758 -22104 -22290
12496 -22290 23129 35855 1226 80795 64724 44277 64235 22606 -87842 -113264 -132533
12485 -132533 -172460 -171537 -118041 -38715 117268 2170 -74192 -149718 -90683 87773 118447
12474 118447 128516 68809 182273 123918 52944 7419 3341 -76650 -70437 -67147 51904 174957
12462 174957 159548 180691 159020 -25768 -134986 -111238 9832 -30847 -207144 -216930 -111663
12451 -111663 43807 94559 156018 187312 257927 283288 66145 -7555 -28598 -15722 -30453
12440 -30453 -473 -11808 -36467 63685 127322 -17110 -19447 86616 121191 76842 38117
12429 38117 44890 152945 207924 127731 180417 161618 93710 44559 -16936 92449 174
12418 174 -100196 -65494 -73907 -183172 -181990 -137964 -60593 -113270 -98968 -59984 -122629 -107874
12406 -107874 -82039 3176 144438 133309 145435 108966 -36953 32702 104886 -23647 -84380
12395 -84380 -56839 -15262 2311 7903 35440 20166 67220 52773 30717 20279 76014 176530
12383 176530 129053 61516 57162 136998 111309 87677 204759 171626 104330 133928 75481
12372 75481 -109903 -143548 -93600 -162109 -51809 38974 15831 179947 202879 -61493 -59091
12361 -59091 -127119 -130812 10281 60332 79588 206394 170363 26317 -125890 -184139 -115225
12350 -115225 -95890 -165823 -140903 -109359 -67301 -74221 -45179 54790 172165 158429 184988
12339 184988 170990 159674 231740 220049 192687 188762 106570 -87239 -147955 -33370 6201
12328 6201 -1857 -128847 -113024 10898 182525 189416 20272 -34411 -39329 -3367 86836 -87661
12316 -87661 -178734 -97596 -81960 -105038 -176689 -99720 48219 -1085 -61271 46739 180676
12305 180676 78379 -62816 -51290 -124177 -4998 37421 -121193 -33636 116616 98028
12295 98028 87506 78979 45781 4489 68543 145314 202745 191628 62071 -10748 36193 -1740
12283 -1740 -17362 73706 108787 96943 30588 -32037 -34875 39054 115487 119907 57182 -20560
12271 -20560 -44125 -28469 -45077 80348 109488 58956 -71323 -187901 -29255 45694 131652
12260 131652 226799 243672 156745 -97645 -109893 -113791 -175301 -69085 22295 112346 162659
12249 162659 104365 77852 -61485 -73579 -29526 54579 72647 -8464 4602 32469 92872
12238 92872 59237 33975 53295 41712 24648 121709 189698 243114 201772 203132 46445 83000
12226 83000 165929 129253 -7405 -195807 -226264 -188484 -177896 -21362 63669 61198 -5482
12215 -5482 -22285 -80658 -105188 -111747 -12539 101535 61559 -6415 -17482 -42247 70381 91149
12203 91149 86864 128383 145954 128825 152015 182182 59846 39124 68134 -31892 -43275
12192 -43275 18966 35800 -77067 -45814 75898 127575 117234 129605 175216 204730 231572
12181 231572 135795 31436 -6968 49956 183094 194993 56565 -166779 -252309 -131813
12171 -131813 -89901 -29010 -33343 -93763 -83358 -118670 -151850 -158312 -122122 7011 9061 -45795
12159 -45795 -22348 12616 10052 -127897 -86145 -137620 -123274 -22746 71525 157289 136693
12148 136693 115964 69807 88618 15455 38741 104680 43226 33292 57887 -83552 -84887 -35464
12136 -35464 -40393 -126538 -288202 -271440 -176779 -158182 -188899 -158458 -76619 -55785 -115898 -156608
12124 -156608 -147695 -107885 -94503 -84097 -42157 -20551 30285 69261 41436 -33764 -49382 60819
12112 60819 125426 80230 72884 53626 7579 -27070 -43420 -45797 -57826 -15776 -61112 -62467
12100 -62467 -11779 -64052 -78482 -36938 61762 151489 165496 202702 99709 16197 39414
12089 39414 119866 117241 147293 181573 174624 118950 68280 63084 167218 112621 114491 115912
12077 115912 17278 14553 -36451 -25490 88234 149207 119813 131864 150106 116345 1502
12066 1502 71384 95192 42160 44327 3844 50259 -5159 -62161 -33559 -17342 -128544 -119344
12054 -119344 -136291 -82347 -3686 141826 77992 68135 58756 122955 239538 170895 69748
12043 69748 112073 118409 79346 132870 131792 115016 116457 -68426 -11465 31041 -42762 35559
12031 35559 91667 -27106 -66995 -105154 -88641 -47804 3365 49552 -8302 -63837 -79010
12020 -79010 -81487 -111541 -32497 34406 134982 148223 121339 175879 197182 285980 285933 220294
12008 220294 117216 175473 245888 167455 138262 325050 398722 357389 288998 125709 136559
11997 136559 187444 142439 234194 410424 436833 397327 331132 312463 257661 230876 121181
11986 121181 99837 130872 181266 199310 125392 108066 154436 173939 193318 133619 102476
11975 102476 6150 -79684 -84995 -120934 -96853 -174535 -107858 84166 50852 33705 53581
11964 53581 -20761 100735 89401 -20610 36897 89566 83918 137535 49420 65090 49350
11953 49350 90619 1432 -25134 76439 77242 17414 130285 135516 155376 267591 277916 159292
11941 159292 205683 253942 312772 505582 598426 561635 597449 564656 497560 587101 709701
11930 709701 702963 562232 653640 571972 479708 463148 483050 552552 568660 616993 628459
11919 628459 597333 663812 769382 779871 756172 671635 648765 564461 537194 501354 365751
11908 365751 345590 349595 416927 424080 325519 155059 126498 124122 217684 308995 173209 98479
11896 98479 77569 -1138 -52455 -104443 -50040 24569 31736 58050 -80372 -25211 50263 43263
11884 43263 32251 145436 126034 75533 72495 73160 -65308 -115951 -68794 -148815 -99240 -97460
11872 -97460 -134204 15198 23255 -28128 -139794 -3571 98996 154059 169832 157974 162910
11861 162910 279242 442262 505647 519842 496735 489489 443298 422061 453499 575014 673222
11850 673222 608923 558905 522619 520143 446229 370072 567258 699212 606310 583799 720218
11839 720218 705941 588730 595736 604439 454058 401098 369879 346749 310538 298789 345352
11828 345352 314802 194854 224216 150075 65496 52954 56813 73187 68532 85977 -66400
11817 -66400 -32448 115921 131179 85111 20595 1993 54980 220952 224244 81845 185619
11806 185619 224077 113062 127386 245458 268289 244994 123252 27101 16474 -378 58808
11795 58808 84123 13363 126498 237960 139831 -52330 -4902 46364 137894 193563 168522
11784 168522 119692 334276 382908 273421 177738 161608 272057 349600 382998 401649 517781
11773 517781 585452 467819 403817 501132 563016 557409 491607 509128 500547 493263 575804 616767
11761 616767 668329 658645 565146 599234 671151 556947 628615 718381 739219 744006 741660 653970
11749 653970 594778 577650 582202 671532 745442 720828 524011 492711 511546 525362 543662
11738 543662 477101 481712 466150 383927 440479 272213 319068 447992 506424 531197 590550
11727 590550 679376 642272 666519 624074 666208 745422 710265 645402 643869 539059 375453
11716 375453 309188 375510 413375 414089 431707 437575 468148 558576 636903 495289 440474 466473
11704 466473 467160 420921 339352 399776 475296 426730 374934 416566 391455 479225 608300 588527
11692 588527 602761 630360 680727 769386 677422 552224 510477 449990 536630 621573 643894
11681 643894 598131 616582 514626 637523 671664 686241 745506 918227 900287 739540 574996
11670 574996 453080 498387 489137 532458 650990 628177 465247 368968 415677 294454 356340
11659 356340 426792 387060 534898 642809 678991 709336 685383 759328 636756 698053 659051
11648 659051 659535 827840 943393 962689 915707 877032 832524 854770 930583 864004 772768
11637 772768 752099 810523 991619 991888 974409 1013384 1001832 933475 828703 917919 999386
11626 999386 1122133 1192800 1195621 1167350 1276971 1359313 1304930 1358693 1411098 1455343 1517170
11615 1517170 1651052 1847646 2013753 2247933 2327480 2483688 2774888 3105973 3495287 4174639
11605 4174639 4717381 5110847 5731089 6507088 7388184 8551956 10020554 12028698 14786260
11596 14786260 18620012 23481263 29207484 35065453 39674302 41812485 40853011 37806609
11588 37806609 34387252 31224653 28566702 26286225 24492515 23530747 23488692 24204451 25767232
11579 25767232 27986022 30625050 34040501 38376034 43076028 46540605 47148450 44091364
11571 44091364 38142779 31573690 26028999 21626452 18340720 15838713 13812072 12311956
11563 12311956 11008888 9726672 8711575 7958039 7371678 6807075 6366046 6061070 5770944
11554 5770944 5565870 5389169 5263894 5251959 5062456 4894083 4743983 4839437 4957525 4905467
11544 4905467 4965895 5098571 5188055 5327038 5399961 5521607 5829500 6163114 6564085 6982200
11534 6982200 7536653 8290907 9084474 9938980 11007096 12125050 13427325 15246816 17391195
11525 17391195 19957651 23146719 27136737 32020745 38341468 46770432 57828970 71420649
11517 71420649 86514260 100939798 112198935 118136331 117772215 111850673 102396661 92286770
11509 92286770 83389788 76604788 72003810 69307765 68595628 70189930 74097760 80255663
11501 80255663 88681978 98708769 109074692 117961320 123335972 123315436 116557508 104017343
11493 104017343 88277228 72642233 59209960 48664250 40827055 35033954 30519804
11486 30519804 26911782 24044084 21612955 19446594 17679720 16038011 14498182 13189763
11478 13189763 12084910 11131292 10304006 9824843 9326689 8892441 8498787 8062067 7871172
11469 7871172 7724661 7560609 7430907 7161514 7014597 6919303 6954936 7050606 7152703 7324753
11459 7324753 7638910 8017417 8470362 8995252 9708956 10400248 11007361 11901883 13085904
11450 13085904 14362801 16014931 18049844 20503237 23392563 27130558 32040318 38440265
11442 38440265 46817298 57623443 70414135 83444767 92997409 95704148 91383541 83121567
11434 83121567 74235506 66637602 60763517 56276111 53107300 51486307 51586599 53305591
11426 53305591 56527355 61028096 66801872 73551125 81063818 87930979 91631625 89618964
11418 89618964 81571675 69792221 57700029 47105420 38520400 31970959 27044835 23360478
11410 23360478 20668418 18417716 16450130 14844896 13485058 12155996 10875149 9799794
11402 9799794 8818801 7938914 7393435 6883781 6268811 5844024 5626548 5263680 4884171
11393 4884171 4564551 4294866 3995095 3942086 3929843 3813401 3572605 3330056 3324774 3312964
11383 3312964 3116337 3010977 3123310 3135896 3053568 2989425 3029128 3004801 2975744 2947149 2972473
11372 2972473 2994663 3094385 3283946 3412628 3415075 3537961 3857143 4033043 4092837 4218127
11362 4218127 4369059 4720421 5068975 5410369 5805445 6108158 6469043 6913630 7506568
11353 7506568 8202428 9084278 10342287 11838841 13691332 16150160 19486712 23675827
11345 23675827 28635084 34735617 41704146 48503417 54202863 58330123 60843268 62222541
11337 62222541 63138236 63951372 64677261 64966009 64641184 64010138 63455626 63536091 64210949
11328 64210949 65199776 66501228 68073162 69983454 72588251 75869846 79249636 81524910
11320 81524910 81879185 80523452 78803268 77522664 76934012 77146733 78149961 79811570
11312 79811570 82298188 84917151 86617979 86458745 84366959 81762455 79750063 78396723
11304 78396723 77234532 75772840 74131130 72564600 71480564 71417841 72443915 73954214
11296 73954214 75332447 76251257 76792570 77336569 77997162 78295600 77380825 74523532 70019487
11287 70019487 64323385 58413461 52539304 46333420 40002877 33995082 28886160 24925950
11279 24925950 21963701 19943304 18390619 17213668 16509702 16096755 15962890 16085486 16631472
11270 16631472 17759738 19567031 21886246 24577828 27420587 30182078 33016069 35744981
11262 35744981 38025128 39391943 39791458 39528914 39011576 38520517 38345184 38226256 37685670
11253 37685670 36855074 36070648 35919533 36603088 37796804 38877956 39745959 40290091 40764505
11244 40764505 41538148 42866737 44097463 44354746 43523128 41891242 40341173 39232191
11236 39232191 38670742 38523237 38866097 39624621 40578687 41497798 41521624 40598307 39126414
11227 39126414 37467495 36090012 35193765 34567380 34025868 33509186 33095519 33226421 33850001
11218 33850001 34585233 35207093 35445954 35265362 34878868 34390502 33730343 32618144 30801618
11209 30801618 27987235 24535763 21072769 17926407 15091639 12613045 10634779 9138704
11201 9138704 7980119 6991782 6191553 5538736 5105599 4714564 4422675 4121593 3747227
11192 3747227 3414363 3232811 3167879 2879230 2640347 2513056 2367421 2128286 2022800 2058329
11182 2058329 2100463 1938456 1835892 1896770 1801428 1716899 1704378 1670499 1580060 1401146 1381906
11171 1381906 1357972 1322545 1279506 1112488 1095370 1193712 1177568 1179845 1164812 995330 903552
11160 903552 944320 967649 930674 838648 881584 907069 909203 864616 841454 847498 787262 724632
11148 724632 779273 815963 834067 785940 727957 672916 605452 579122 585611 559451 449095
11137 449095 438402 368048 345703 545542 611734 592297 556903 426945 405949 453232 458102
11126 458102 465366 509171 466107 440042 326793 257428 332681 312670 248755 344643 404392
11115 404392 387022 253422 259454 335831 387157 340449 364880 443737 522632 434192 408248
11104 408248 451970 442869 368930 235387 342613 483406 487142 450621 546338 764327 874941
11093 874941 992577 1049161 1109681 1018261 914879 892788 838402 781456 711486 717363 615353
11082 615353 579917 479095 456587 587533 668912 813336 806348 794790 902342 974276 1124763
11071 1124763 1069792 925161 862837 736987 588485 610048 708820 634166 469051 336720
11061 336720 334721 381167 406937 370699 269892 275001 241981 297285 295477 352973 406148 307330
11049 307330 324274 317949 319287 199827 167618 262795 308026 167886 184958 278735 261693
11038 261693 229035 167512 169330 189469 198026 251613 297038 280750 196755 232031 185023 102501
11026 102501 108158 192075 201455 243332 222816 83198 45732 260868 318852 247052 373046
11015 373046 479288 596153 547762 570734 540924 421320 367682 399879 441196 390546 415343
11004 415343 481835 449861 401163 399613 454862 597451 685786 633186 515944 536751 483834
10993 483834 498398 518942 460726 329623 286860 200214 144354 144508 114966 196199 248211 124457
10981 124457 84225 180196 125663 134725 286107 250865 311299 383067 347618 271581 278089 275199
10969 275199 108301 190144 236996 159094 226037 314213 388470 369190 330996 305283 267357
10958 267357 266676 261362 280461 313349 350177 276209 223521 181016 204803 271919 340396 257697
10946 257697 53098 -18584 -58383 -80439 24777 13157 60671 152800 131021 170229 84122
10935 84122 57823 98287 147721 217986 176925 138900 85860 -39470 -5754 72941 152585
10924 152585 104417 92681 20766 -3977 -1638 10254 92751 110874 125028 46007 115557 122383
10912 122383 185537 307619 361464 489133 468540 432298 391818 287116 258258 262676 297507
10901 297507 283226 252931 281949 237812 282498 283952 269710 412487 408812 368629 534484
10890 534484 717621 592847 535181 560393 491519 484365 463729 528562 483467 468998 501660
10879 501660 668527 659292 664747 723546 670217 586572 515027 408946 289770 274401 349990
10868 349990 485546 461319 519260 485498 409795 427713 374805 488990 576926 509840 497152
10857 497152 503574 488352 515962 568165 559699 477057 390887 443817 337497 287822 270775 268330
10845 268330 231559 212597 241930 325300 276745 309092 180806 74089 141117 77946 7186
10834 7186 47646 175943 243275 259401 298991 256585 181870 71337 120041 149676 174196
10823 174196 151824 76791 49717 86678 154473 142293 160771 240094 365489 350853 256523
10812 256523 216267 115634 93701 115076 151455 193178 229273 216872 175884 246306 256437
10801 256437 218566 307493 359499 370060 366586 331049 300559 337767 344047 319406 262373 214615
10789 214615 268140 284440 282718 303490 254212 182338 273378 339696 336314 296769 336029 400707
10777 400707 334518 261657 226451 245152 477181 359415 286407 219986 246323 312438 290426
10766 290426 190126 224202 203628 147408 200375 248094 192169 118228 40388 22607 112473
10755 112473 136534 93200 108871 183012 15082 -37644 34156 140846 189465 117544 111209
10744 111209 53756 56999 113216 74942 67967 52897 104538 48563 5 52802 27212 119339
10732 119339 59860 62661 140384 202851 208807 51019 -50117 29888 37414 -41279 89654
10721 89654 135756 83998 34660 62067 98269 -58495 -75367 3879 3073 48427 90236 104606
10709 104606 76105 90619 99260 99719 44131 98278 102077 58519 22793 3555 -67806 -83373
10697 -83373 -125794 -118507 -1690 97608 227114 204782 155861 173751 174480 296417 205969 95091
10685 95091 1554 95020 161689 105266 -9650 -35082 -38048 -40241 -42822 -25347 -143802 -101312
10673 -101312 -28684 30368 67909 34646 74932 64151 69360 187921 146779 142707 197982 221207
10661 221207 182777 50396 6619 56313 104858 105773 91321 105383 108564 133187 110159 129746
10649 129746 171642 283797 395053 421909 386618 358465 260667 192122 73363 81311 120891
10638 120891 121753 10170 -83132 -40213 65326 170401 97354 39571 112908 40685 -68002
10627 -68002 -132901 -50292 123286 203381 111781 21839 103740 174371 216173 148094 92908
10616 92908 167543 212572 227276 242158 173567 125234 38722 -12473 -33783 40520 95579 62742
10604 62742 20567 10924 58030 116796 157939 152817 91530 72589 183467 163411 214949 253778
10592 253778 207956 283772 265455 246198 303450 333224 181167 60839 118323 101512 39003
10581 39003 -29905 180561 247805 291584 300178 314930 343618 311836 314781 184711 121884 159064
10569 159064 198863 245983 220849 68483 22115 41649 130376 246421 326592 228060 34053
10558 34053 -68857 -1010 71968 23913 107770 134826 172870 211564 253673 146955 59056
10547 59056 46721 22999 73791 170014 128603 -20984 -56080 -19402 11862 39618 78739
10536 78739 74707 138322 224968 252401 260990 172980 122674 246135 339054 267754 113319 40132
10524 40132 197087 325633 323237 219480 231182 52359 45507 45104 73618 260705 363658
10513 363658 300856 162882 173543 155648 61527 58301 11437 127802 301660 332898 320995
10502 320995 294481 194641 153074 183244 258101 357941 217203 188422 278063 354128 352184
10491 352184 314085 264988 119185 -16714 35538 105820 118430 284988 452536 438747 367744
10480 367744 321145 256417 187861 245132 404821 409851 367061 330787 185056 243348 369665
10469 369665 407727 327634 203940 259407 213984 123283 94930 236063 305069 368314 419127
10458 419127 345763 390322 546295 462330 320559 184916 177563 169467 281783 317397 318003
10447 318003 241246 219184 169053 91919 -29367 17499 143638 215476 259673 229791 176239
10436 176239 124366 46174 40640 90342 117826 137705 111651 43233 98824 129575 153327 269400
10424 269400 310868 308093 257462 160820 195158 226135 253181 208020 283147 242663 122331
10413 122331 70121 122380 174616 215175 250155 273260 232095 173273 139337 102553 97878 221711
10401 221711 336255 379021 390208 342699 398722 514458 495134 479013 555689 523379 334394
10390 334394 322550 366491 341867 338371 177937 207634 370652 365876 288866 337855 345700 247682
10378 247682 234197 242565 233128 163218 114162 83067 105679 225653 418013 482521 454291
10367 454291 369524 341911 298285 238903 309449 352763 368228 366196 359959 357496 315013 284015
10355 284015 316167 362242 347613 296955 355750 408281 332892 306323 256240 330472 318757
10344 318757 339638 348120 323483 337968 267466 265290 229123 271542 346897 427940 433953 329058
10332 329058 220723 230983 311566 322554 170449 202242 306050 329630 299636 257183 228506
10321 228506 341586 352748 230522 244548 234612 370023 449651 529887 479402 339622 319190
10310 319190 394116 372061 276855 291740 302049 323265 227199 82588 121174 389580 441414
10299 441414 417528 346994 234870 285846 313935 258915 198383 183095 158083 119222 119199 154117
10287 154117 301551 389346 335006 290378 356918 412063 485693 527604 404205 357326 398356
10276 398356 465115 586971 668497 697936 632613 505203 521277 559351 660926 571963 501491
10265 501491 401936 294107 388040 571436 679601 615578 677570 700484 644678 487826 498862
10254 498862 578441 613869 491732 433990 486798 583213 612726 547480 570337 539350 429028
10243 429028 404627 499866 519868 388220 348433 394030 452480 526593 499109 478968 605607
10232 605607 538340 571345 589633 670792 692679 703837 707584 754162 861291 877159 867026
10221 867026 910374 973084 900573 780898 689184 768006 783678 675185 577774 664899 697958
10210 697958 682142 656722 723991 729671 700049 691983 734939 742173 715549 735326 830461 854180
10198 854180 899003 988175 867193 819641 782251 775898 716533 800520 763273 692153 622520
10187 622520 638447 660890 664488 738794 709227 739765 756622 622215 477299 556223 513444
10176 513444 619001 584339 511395 672613 801767 754064 658156 573427 690586 771512 790175
10165 790175 603557 522726 594610 590143 553208 487854 547418 634519 659128 761267 765080
10154 765080 750625 819177 788637 870592 971543 1008935 1001550 963067 884667 961275 940684
10143 940684 1081228 1131534 1100114 1074204 993155 1044026 1079796 1162406 1259121 1327243 1290653
10132 1290653 1255328 1183812 1175383 1099820 985506 1004885 945318 830428 758094 769299 797312
10121 797312 844678 834920 895023 1068971 1194225 1297100 1321473 1211545 1110054 1012979 950142
10110 950142 989162 1029943 1127566 1138690 1133367 1158592 1112974 1058372 979195 882401 942416 968967
10098 968967 856337 790433 887404 907207 964567 1019497 1029908 962853 887532 1024812 1051411
10087 1051411 997310 933427 962088 962167 997361 934165 938427 1051729 1038864 975728 946017 1122114
10075 1122114 1258119 1245884 1184936 1099134 981909 995946 1137754 1219344 1154726 1095303 1084496
10064 1084496 1229034 1329791 1496160 1586652 1560753 1592758 1580521 1461888 1299001 1285913
10054 1285913 1263842 1241360 1302728 1320796 1416803 1534783 1488209 1611307 2041689 2880272
10044 2880272 3564701 3532768 2845458 2187510 1725919 1518253 1425999 1279350 1304377 1378927
10034 1378927 1299166 1261432 1334894 1429603 1497225 1458725 1486984 1526422 1547954 1442399 1293966
10023 1293966 1187644 1184797 1204123 1187792 1213862 1305867 1415245 1423532 1456722 1485395 1550481
10012 1550481 1415115 1315734 1261042 1210494 1319848 1275595 1375107 1452144 1458433 1548428 1554794
10001 1554794 1504713 1427894 1320209 1280098 1348749 1496537 1532796 1634130 1499734 1371454
9991 1371454 1330236 1368760 1481520 1548718 1586539 1604009 1598688 1500452 1466035 1466603 1466396 1569522
9979 1569522 1598311 1569113 1464889 1378957 1361855 1464021 1454109 1456514 1450458 1570133 1615082
9968 1615082 1544246 1516324 1540786 1573948 1489910 1450137 1494967 1535650 1692392 1809536 1841157
9957 1841157 1837574 1800363 1873673 1912229 1811154 1702082 1676129 1718787 1740093 1748992 1735355
9946 1735355 1662426 1694680 1733451 1636796 1719583 1873949 1776819 1665333 1691636 1783024 1822494
9935 1822494 1879202 1985649 1843870 1867800 1967366 1924696 1819026 1875426 1930141 1951593 1920198
9924 1920198 1959748 2104225 2192009 2197996 2186551 2332402 2302510 2247146 2102185 1999441 2073772
9913 2073772 2041149 2085419 2169034 2203951 2277923 2254228 2221330 2176724 2147388 2389566 2324376
9902 2324376 2260865 2398756 2388608 2300897 2351953 2444305 2448782 2400426 2386512 2392460 2387296 2478717
9890 2478717 2468177 2480041 2529090 2548975 2497435 2543373 2547154 2653813 2777863 2779931 2805362
9879 2805362 2750578 2740441 2850430 2804704 2861411 3079745 3170574 3241708 3255150 3245977 3221386
9868 3221386 3332455 3451844 3476764 3521664 3504169 3542790 3572896 3607971 3574971 3648144 3808307
9857 3808307 3885326 3876774 3893878 3965188 4093101 4394530 4593875 4795113 5004339 5150204
9847 5150204 5271012 5522465 5809332 6204011 6663272 7199387 7706075 8371216 9309447 10377224
9837 10377224 11546496 13071917 14989604 17218881 19760083 23029027 27217844 32384587
9829 32384587 38353298 44530342 49548823 52124807 51439572 48003198 43255915 38552956
9821 38552956 34229177 30256310 26977086 24083844 21590736 19551057 17966208 16751961
9813 16751961 15990369 15509762 15349640 15584442 16176298 17189838 18294393 19553777 20945371
9804 20945371 22609391 24367961 26342452 28972899 32245208 36120789 40329736 44588024
9796 44588024 48120974 49870716 49088448 45759342 41016192 36236638 32144941 28927310
9788 28927310 26259578 23995785 21820648 19845710 18054393 16346138 14810329 13649302
9780 13649302 12759094 12287458 11883343 11623481 11483973 11519958 11594936 11560128 11659237 11672807
9770 11672807 11708602 11675276 11871828 12328795 12790022 13456021 14399234 15561305 17106451
9761 17106451 18972987 21050838 23105201 25074548 27056277 29284534 32017944 35595081
9753 35595081 40217678 45661063 51225950 56119201 59767305 62229826 64221481 66096034
9745 66096034 68303833 71336252 75364555 79531659 82478705 83181560 81387349 77448177
9737 77448177 72453710 67436965 63069325 59377839 55931930 52763207 50188265 48274686
9729 48274686 46852807 46014186 45714576 45950403 46963361 48665561 51195548 54541084 58527212
9720 58527212 62765155 66757341 69684502 71355709 72138971 72713369 73192935 73825838 74822784
9711 74822784 75948402 76702183 76066120 73271162 68227254 61698421 55160376 49614875
9703 49614875 45318228 42117890 39298396 36483364 33503178 30438842 27381876 24605247
9695 24605247 22323069 20415832 18917841 17828695 17099954 16509185 16041017 15834198 15797644
9686 15797644 15769516 15593912 15397753 15439486 15472029 15646739 16061583 16627061 17395734 18534270
9676 18534270 20017962 21929592 24117861 26465519 29048645 31886819 35128307 39222646
9668 39222646 44288607 50387650 57338572 63641831 67537099 68182177 65752466 61113491
9660 61113491 55868313 50840511 46302778 42468653 39251334 36461485 34018350 31801640
9652 31801640 29647170 27800286 26333279 25112522 24308502 23913830 23795735 24086257 24844681
9643 24844681 26296751 28259171 30631565 33683059 37694206 42581657 48417235 55051967
9635 55051967 61960516 68023500 71525508 71178764 67130470 60561109 53136396 46108718
9627 46108718 39954282 34673767 30384501 27031428 24288465 22001442 19941293 18258892
9619 18258892 17077464 16062024 15221691 14440612 13810804 13304999 12760539 12264446 11871311
9610 11871311 11574449 11431774 11130894 10988475 10875894 10700681 10454399 10179925 9924057
9601 9924057 9725308 9647415 9622208 9582391 9407263 9277642 9258588 9269989 9123786 9064124 9092929
9590 9092929 9077614 9107370 9023972 8946510 8970966 8956667 8982210 8927795 8769910 8711872 8696329
9579 8696329 8800718 8859563 8785697 8848613 8798688 8826189 8852337 8808803 8721718 8698102 8767907
9568 8767907 8807401 8751363 8646995 8758224 8709682 8758993 8814788 8800442 8754983 8904900 8911474
9557 8911474 8857185 8840798 8852013 8910287 8957921 8902850 8778698 8754456 8673825 8673285 8759742 8840328
9545 8840328 8995433 9171683 9280359 9239141 9098618 8931557 8961419 9157984 9244436 9326385
9535 9326385 9421338 9324081 9270989 9408745 9496345 9569609 9565128 9576909 9497437 9460241 9395902
9524 9395902 9584881 9586547 9549176 9690000 9660238 9629475 9623493 9627210 9708236 9725152 9591155
9513 9591155 9561224 9738100 9976794 9982088 9822285 9819281 9999775 9997647 9895485 9850474 9823052
9502 9823052 9817499 9947433 10095393 10089331 10097982 10161553 10241444 10309506 10293534 10201396 10124090 10158652
9490 10158652 10177601 10187669 10252070 10309992 10291551 10309712 10316158 10264175 10233553 10220580 10153732
9479 10153732 10121218 10168811 10327781 10474582 10501020 10515939 10460819 10483161 10427412 10404243 10503379
9468 10503379 10643602 10710495 10592321 10530903 10562743 10597479 10636707 10607708 10601987 10566924 10694530
9457 10694530 10788692 10847318 10955713 11085578 11129678 11109219 11091065 11088392 11148909 11202478 11169140
9446 11169140 11091017 11126135 11083795 11162120 11281408 11295917 11287019 11256505 11297831 11273653 11205258
9435 11205258 11228703 11444776 11533833 11444611 11469161 11407510 11403252 11438302 11489676 11669226 11820040
9424 11820040 11898130 11905286 11941315 11863608 11845198 11793942 11676271 11631116 11663464 11686909 11613502
9413 11613502 11571529 11671664 11758432 11789699 11837747 11871606 11800503 11941783 12065355 12132024 12144620
9402 12144620 12123781 12196399 12243638 12210864 12370187 12414136 12496721 12706962 12773767 12822082 12840170
9391 12840170 12840226 12814023 12783363 12824286 12919669 12921937 12853890 12972328 13141828 13237475 13337362 13422133
9379 13422133 13380937 13548052 13742924 13940013 14047998 14138444 14347910 14635696 14857086 15229545
9369 15229545 15636228 16057138 16491315 17019955 17663432 18384782 19354297 20744407 22509932
9360 22509932 24794823 27556688 30635266 33903001 37046263 39737146 41695272 42653513
9352 42653513 42735130 42448356 42532996 43585443 45624278 48342345 51531351 55427425 60584191
9343 60584191 67408714 76013205 86088692 96242030 104841713 110914407 113999472 114377214
9335 114377214 112113271 107716297 102759232 98802798 96901733 97827544 101163269 105292900
9327 105292900 108498050 110216863 111675202 114718291 119700115 124922924 127955297 127517357
9319 127517357 123722893 116980400 108059182 98445071 89178273 80959356 74038154 68180558
9311 68180558 63746461 60743297 59097190 58182461 57691019 57489930 57486888 57159776 55903776
9302 55903776 53708005 50284129 45961886 41091725 36584112 32845081 29850287 27492027
9294 27492027 25558090 24205489 23127077 22141290 21265643 20528492 19872814 19355622 18983399
9285 18983399 18768793 18572097 18410829 18300362 18332925 18367246 18572619 18810265 19086795 19463032
9275 19463032 20057847 20920625 22168936 23773992 25822975 28418898 31564890 34756036
9267 34756036 37714301 40042178 41654368 42510554 42810236 42732623 42747102 42793406 43066727
9258 43066727 43940882 45741941 48650194 52500567 57455205 63388672 70188471 77135633
9250 77135633 83329357 87875317 90454494 90621721 88166325 84364585 80914849 78927749
9242 78927749 78144681 77501716 75619116 72693756 70149016 69343431 70397624 73048745 76241072
9233 76241072 79070147 80729901 80544340 78383394 74262038 68492769 61910137 55377098
9225 55377098 49736392 45246000 41731658 39069110 36769640 34810240 33291984 32417337
9217 32417337 32068195 32232801 32204094 31508456 30259051 28549904 26499888 24242848 22192125
9208 22192125 20484607 19028034 17880700 16948040 16182694 15497116 14903213 14508272 14219198
9199 14219198 13858056 13362377 13023793 12734095 12526105 12348954 12250838 12156123 11890489 11715778
9189 11715778 11622440 11541589 11511371 11375802 11308455 11246749 11214655 11102828 10929079 10625955
9179 10625955 10553301 10601009 10504217 10403289 10402384 10579632 10462856 10294648 10240868 10184016 10154311
9168 10154311 10151977 10057447 10108463 10073130 10023606 9833363 9689207 9531156 9558908 9695989 9659452
9157 9659452 9518210 9408735 9288797 9257988 9177979 9098691 9144111 9097881 9127701 9204894 9165840
9146 9165840 9064323 9016506 9024654 8997663 9001200 8938330 8791706 8712910 8723241 8655273 8576700
9135 8576700 8523148 8592134 8707259 8709837 8672652 8700681 8780902 8741404 8564644 8341747 8245812
9124 8245812 8342052 8272034 8256614 8091809 8144546 8212497 8133077 8064352 7999165 7962175 7859242
9113 7859242 7781669 7790603 7687936 7566773 7650674 7649468 7562317 7518843 7562800 7565276 7471532 7554916
9101 7554916 7564410 7504066 7429716 7318839 7291990 7330261 7333039 7302619 7235940 7206233 7100835
$$ [...]
##END NTUPLES=NMR SPECTRUM
##END=
