##TITLE=Analysis number 325642
Compound Code btb 12187
Book Reference 51874
Project Code adrs fraglib
Chemist Name jom
##JCAMPDX= 6.0         $$ Bruker NMR JCAMP-DX V2.0
##DATA TYPE= NMR SPECTRUM
##DATA CLASS= NTUPLES
##ORIGIN= Bruker BioSpin GmbH
##OWNER= nmr
$$ XWIN-NMR		Version 3.5
$$ Fri Jan  5 14:46:45 2007 GMT Standard Time (UT+0h)  MAYBRIDGE\nmr@NMR_250MHZ
##.OBSERVE FREQUENCY= 250.131544655141
##.OBSERVE NUCLEUS= ^1H
##.ACQUISITION MODE= SIMULTANEOUS (DQD)
##.ACQUISITION SCHEME= undefined
##.AVERAGES= 16
##.DIGITISER RES= 18
##SPECTROMETER/DATA SYSTEM= dpx250
##.PULSE SEQUENCE= zg30
##.SOLVENT NAME= CDCl3
##.SHIFT REFERENCE= (INTERNAL, CDCl3, 0, 16.5297)
##AUDIT TRAIL= $$ (NUMBER, WHEN, WHO, WHERE, WHAT)
$$ ##TITLE= Audit trail, XWIN-NMR		Version 3.5
$$ ##JCAMPDX= 5.01
$$ ##ORIGIN= Bruker BioSpin GmbH
$$ ##OWNER= nmr
$$ C:\u/data/dgb/nmr/ADRS/580/pdata/1/auditp.txt
$$ ##AUDIT TRAIL=  $$ (NUMBER, WHEN, WHO, WHERE, WHAT)
(   1,<2007-01-05 14:46:21.16 +000>,<MAYBRIDGE\nmr>,<NMR_250MHZ>,
      <created by zg, POWCHK disabled, PULCHK disabled
       configuration hash MD5:
       49 4B E0 1D 92 C2 6B 37 9F E6 65 BC 52 41 86 1D
       data hash MD5: 64K
       04 7E 44 8D 8E D4 88 18 04 04 58 C3 0D 6B 71 C5>)
(   2,<2007-01-05 14:46:35.63 +000>,<MAYBRIDGE\nmr>,<NMR_250MHZ>,
      <Start of raw data processing
       ef LB = 0.3 FT_mod = 6 PKNL = 1 SI = 32K 
       data hash MD5: 32K
       29 83 BB 74 74 05 BA 06 6E 3F 85 9C C9 8C 8C 0B>)
(   3,<2007-01-05 14:46:37.25 +000>,<MAYBRIDGE\nmr>,<NMR_250MHZ>,
      <apk 
       data hash MD5: 32K
       29 D3 53 BD 6B 37 3A 33 6C BF E0 D8 B9 33 B7 65>)
(   4,<2007-01-05 14:46:37.97 +000>,<MAYBRIDGE\nmr>,<NMR_250MHZ>,
      <abs ABSG = 5 
       data hash MD5: 32K
       5C 0C 07 72 7F C2 C6 CA 87 93 FE 66 3B EB 1E 85>)
$$ ##END=
$$ 
$$ hash MD5
$$ 79 61 DA 9B A0 93 AE A3 20 92 B2 7F E8 83 6D FB
##$RELAX= 
##$RELAX= 
##$RELAX= 
##$RELAX= 
##$RELAX= 
##$RELAX= 
##$RELAX= 
$$ Bruker specific parameters
$$ --------------------------
##$DU= <C:\u>
##$EXPNO= 580
##$NAME= <ADRS>
##$PROCNO= 1
##$TYPE= <nmr>
##$USER= <dgb>
##$AMP= (0..31)
100 100 100 100 100 100 100 100 100 100 100 100 100 100 100 100 100 100 
100 100 100 100 100 100 100 100 100 100 100 100 100 100 
##$AQSEQ= 0
##$AQ_mod= 3
##$AUNM= <au_zg>
##$AUTOPOS= <58 >
##$BF1= 250.13
##$BF2= 250.13
##$BF3= 250.13
##$BF4= 250.13
##$BF5= 500.13
##$BF6= 500.13
##$BF7= 500.13
##$BF8= 500.13
##$BYTORDA= 1
##$CFDGTYP= 0
##$CFRGTYP= 5
##$CHEMSTR= <none>
##$CNST= (0..31)
1 1 145 1 1 1 1 1 1 1 1 1 1 1 1 1 1 1 1 1 1 1 1 1 1 1 1 1 1 1 1 1 
##$CPDPRG= <>
##$CPDPRG1= <>
##$CPDPRG2= <>
##$CPDPRG3= <>
##$CPDPRG4= <mlev>
##$CPDPRG5= <mlev>
##$CPDPRG6= <mlev>
##$CPDPRG7= <mlev>
##$CPDPRG8= <mlev>
##$CPDPRGB= <>
##$CPDPRGT= <>
##$D= (0..31)
0 1 0 0 0 0 0 0 0 0.06 0 0 0 0 0 0 0.0002 0 0 0 0 0 0 0 0 0 0 0 0 0 0 
0 
##$DATE= 1168008380
##$DBL= (0..7)
120 120 120 120 120 120 120 120 
##$DBP= (0..7)
150 150 150 150 150 150 150 150 
##$DBP07= 0
##$DBPNAM0= <>
##$DBPNAM1= <>
$$ [...]
##$SUBNAM7= <"">
##$SUBNAM8= <"">
##$SUBNAM9= <"">
##$SW= 20.6930455092707
##$SWIBOX= (0..15)
0 0 3 0 0 0 0 0 0 0 0 0 0 0 0 0 
##$SW_h= 5175.983436853
##$TD= 65536
##$TD0= 1
##$TE= 294.16
##$TE2= 300
##$TE3= 300
##$TEG= 300
##$TL= (0..7)
0 120 120 120 120 120 120 120 
##$TP= (0..7)
150 150 150 150 150 150 150 150 
##$TP07= 0
##$TPNAME0= <>
##$TPNAME1= <>
##$TPNAME2= <>
##$TPNAME3= <>
##$TPNAME4= <>
##$TPNAME5= <>
##$TPNAME6= <>
##$TPNAME7= <>
##$TPOAL= (0..7)
0.5 0.5 0.5 0.5 0.5 0.5 0.5 0.5 
##$TPOFFS= (0..7)
0 0 0 0 0 0 0 0 
##$TUNHIN= 0
##$TUNHOUT= 0
##$TUNXOUT= 0
##$USERA1= <user>
##$USERA2= <user>
##$USERA3= <user>
##$USERA4= <user>
##$USERA5= <user>
##$V9= 5
##$VALIST= <valist>
##$VCLIST= <CCCCCCCCCCCCCCC>
##$VD= 0
##$VDLIST= <DDDDDDDDDDDDDDD>
##$VPLIST= <PPPPPPPPPPPPPPP>
##$VTLIST= <TTTTTTTTTTTTTTT>
##$WBST= 1024
##$WBSW= 4
##$XGAIN= (0..3)
0 0 0 0 
##$XL= 0
##$YL= 0
##$YMAX_a= 455707
##$YMIN_a= -410383
##$ZGOPTNS= <>
##$ZL1= 120
##$ZL2= 120
##$ZL3= 120
##$ZL4= 120
##$ABSF1= 16.52971
##$ABSF2= -4.163464
##$ABSG= 5
##$ABSL= 3
##$ALPHA= 0
##$AQORDER= 0
##$ASSFAC= 0
##$ASSFACI= 0
##$ASSFACX= 0
##$ASSWID= 0
##$AUNMP= <proc_1d>
##$AZFE= 0.1
##$AZFW= 0.1
##$BCFW= 0
##$BC_mod= 0
##$BYTORDP= 0
##$COROFFS= 0
##$CY= 12.5
##$DATMOD= 1
##$DC= 0
##$DFILT= <>
##$DTYPP= 0
##$F1P= 14.0000005364418
##$F2P= -0.99999901652339
##$FCOR= 0.5
##$FTSIZE= 32768
##$FT_mod= 6
##$GAMMA= 0
##$GB= 0
##$INTBC= 1
##$INTSCL= 1
##$ISEN= 128
##$LB= 0.3
##$LEV0= 0
##$LPBIN= 0
##$MAXI= 10000
##$MC2= 0
##$MEAN= 0
##$ME_mod= 0
##$MI= 0
##$NCOEF= 0
##$NC_proc= -2
##$NLEV= 6
##$NOISF1= 0
##$NOISF2= 0
##$NSP= 0
##$NTH_PI= 0
##$NZP= 0
##$OFFSET= 16.52971
##$PC= 1
##$PHC0= 223.1744
##$PHC1= 6.807739
##$PH_mod= 1
##$PKNL= yes
##$PPARMOD= 0
##$PSCAL= 4
##$PSIGN= 0
##$REVERSE= no
##$SF= 250.129998070603
##$SI= 32768
##$SIGF1= 0
##$SIGF2= 0
##$SINO= 400
##$SIOLD= 32768
##$SREGLST= <1H.CDCl3>
##$SSB= 0
##$STSI= 32768
##$STSR= 0
##$SW_p= 5175.98343685301
##$SYMM= 0
##$S_DEV= 0
##$TDeff= 65536
##$TDoff= 0
##$TI= <Analysis number 999999
Compound Code 99
Book Reference 9
Project Code 9>
##$TILT= no
##$TM1= 0
##$TM2= 0
##$TOPLEV= 0
##$USERP1= <user>
##$USERP2= <user>
##$USERP3= <user>
##$USERP4= <user>
##$USERP5= <user>
##$WDW= 1
##$XDIM= 32768
##$YMAX_p= 329477969
##$YMIN_p= -52921
$$ End of Bruker specific parameters
$$ ---------------------------------
##NTUPLES= NMR SPECTRUM
##VAR_NAME=  FREQUENCY,     SPECTRUM/REAL,   SPECTRUM/IMAG
##SYMBOL=    X,             R,               I
##VAR_TYPE=  INDEPENDENT,   DEPENDENT,       DEPENDENT
##VAR_FORM=  AFFN,          ASDF,            ASDF
##VAR_DIM=   32768,         32768,           32768
##UNITS=     HZ,            ARBITRARY UNITS, ARBITRARY UNITS
##FACTOR=    0.157963299565203, 1,           1
##FIRST=     4134.57652292101, 0,            0
##LAST=      -1041.406913932, 0,             0
##MIN=       -1041.406913932, -52921,        0
##MAX=       4134.57652292101, 329477969,    0
$$ Real data points
##PAGE= N=1
##DATA TABLE= (X++(R..R)), XYDATA
$$ [...]
17391D925K446Q326J868K503m394P094J766j1719j4343p276L477Q775J377O56
$$ 4925 7371 15697 17565 20068 15674 22768 24534 12815 -1528 -8804 -5327 3448 4825 5481
17377E481j512j407k872N40J2058K676j20N819L270P092J0087J491m462p292r423
$$ 5481 3969 2562 -310 230 12288 14964 14844 20663 23933 31025 41112 42603 38141 30849 21426
17362B1426l390l667j616r2p14q32n679j304l036O08m39M503M618L022l598k058
$$ 21426 18036 14369 12753 12661 11947 11115 5436 4132 1096 1704 1265 5768 10386 13408 9810 7752
17346G752K155J869Q250L905r853j3846j0570q17K916O639L217M281j936L578
$$ 7752 9907 11776 20026 23931 14078 232 -10338 -11155 -8239 -1600 1617 5898 3962 7540
17332G540J100j718J716r77l239k432J064N808k792j760k797j085o645q553Q278
$$ 7540 8640 6922 8638 7661 4422 1990 3054 8862 6070 4310 1513 428 -6217 -14770 -6492
17317f492O634k620L249M769L280l38M556O713L502k372p370q672J675N136j369
$$ -6492 142 -2478 771 5540 8820 8482 13038 19751 23253 20881 13511 4839 6514 11650 10281
17302A0281j420L614k67k113l027p614k479L031J042j988k873M376j847j889M09
$$ 10281 8861 12475 12208 10095 7068 -546 -3025 6 1048 -940 -3813 563 -1284 -3173 -2764
17287b764J765m560p393K048O168q66N46k992n863j16N104K845Q024J386l228
$$ -2764 -999 -5559 -12952 -10904 -4736 -5602 -5056 -8048 -13911 -14027 -8923 -6078 1946 3332 104
17272A04J547N473j188l578n344k273L38K192L76l838q66k49n213r78K281r6m952
$$ 104 1651 7124 5936 2358 -2986 -5259 -4921 -2729 -2353 -6191 -7057 -7306 -12519 -13497 -11216 -11312 -16264
17255a6264j429o68O599K351O307L577o134l733J232O564L060J242Q95m693o464
$$ -16264 -17693 -18361 -11762 -9411 -3104 473 -5661 -9394 -8162 -1598 1462 2704 3599 -1094 -7558
17240g558M13Jj341k897Q123R320M627l998r739k532K886K048O628m015o250l983
$$ -7558 -7145 -7144 -8485 -11382 -3259 6061 10688 6690 -3049 -5581 -2695 -647 5981 1966 -4284 -8267
17224h267j029l372J082P82O200P699L542J707N57l64O85n401p88p36m597M19
$$ -8267 -9296 -12668 -11586 -10804 -4604 3095 6637 8344 8901 8537 9222 3821 3033 2297 -2300 -1881
17208a881l460o84l276o616m605Q474R851l122o724L555L510O15M094P45L37k259
$$ -1881 -5341 -6025 -9301 -15917 -20522 -12048 -2197 -5319 -12043 -8488 -4978 -4363 -269 476 813 -1446
17192a446M674J858n440r253o574O681N091k499j398j195k115K875K004O994m612
$$ -1446 3228 5086 -354 -9607 -16181 -9500 -4409 -6908 -8306 -9501 -11616 -8741 -6737 257 -4355
17177d355o569K967K164R82k597k399M444N559N989r32k122N250n360j033p340
$$ -4355 -10924 -7957 -5793 -4811 -7408 -9807 -5363 196 6185 5253 3131 8381 3021 1988 -5352
17162e352j477N732Q422L983m177n823m14m601j042N080K659j03k735l267J000
$$ -5352 -6829 -1097 7325 11308 7131 1308 894 -3707 -4749 331 2990 2887 152 -3115 -2115
17147b115m514q74k362M277Q082O993p293q088m702N746O524J156q011k28L584
$$ -2115 -6629 -7503 -9865 -5588 2494 9487 2194 -5894 -10596 -4850 1674 2830 -5181 -5409 -1825
17132a825l376n032J4j094j949M993O584P281n375l989o57l967p23K901L626K907
$$ -1825 -5201 -10233 -10219 -11313 -13262 -8269 -1685 5596 221 -3768 -4425 -8392 -9115 -6214 -2588 319
17116C19L853l554p542k529O862K049K732K809k588j874J1424k426l588l440m27
$$ 319 4172 618 -6924 -9453 -2591 -542 2190 4999 2411 537 11961 9535 5947 2507 2080
17101B080j095m642r541r0K09M953J948k127o808J657Q814N025J044N055j496
$$ 2080 985 -3657 -13198 -13288 -13079 -8126 -6178 -8305 -15113 -13456 -4642 383 1427 6482 4986
17086D986k387L508r28M498j1q286k952K705l484j340L142J441j1373p013N018
$$ 4986 2599 6107 5179 9677 9666 1380 -1572 1133 -2351 -3691 -549 892 -10481 -17494 -12476
17071a2476J1335K839m550k489K73q754r31L33k792K769R516M495l595n353k702
$$ -12476 -1141 1698 -2852 -5341 -5068 -13822 -14753 -14420 -17212 -14443 -4927 -432 -4027 -9380 -12082
17056a2082N167Q651L11n446j594j247N454M542K767K651Q004Q481J1020J3644
$$ -12082 -6915 1736 2047 -3399 -4993 -6240 -786 3756 6523 9174 17178 25659 36679 50323
17042E0323L1161L6276K9851K7893J9433j6452m7811m5728k4136j4773j1615p274
$$ 50323 81484 117760 147611 175504 194937 178485 130674 84946 60810 46037 34422 27148
17030B7148n650k49K507O796J5970J6413m906j9025j3053l801k786j1543o513
$$ 27148 21498 21249 23756 30552 46522 62935 58029 39004 25951 22150 19364 7821 1308
17017A308K012J393K125k612l629L348J643n289J411L227n261J332K536q04O038
$$ 1308 3320 4713 6838 4226 597 3945 5588 299 1710 4937 -324 1008 3544 2740 8778
17002H778O986M30k353K082Q390P008J3572M099j785n593o564j1330r270M908
$$ 8778 15764 16194 13841 15923 24313 31321 44893 48992 47207 41614 35050 23720 14450 19358
16988A9358j10k278J2611K6317L9856M5097L6470N933j6366k4684l0662k6583
$$ 19358 19248 16970 29581 55898 95754 140851 177321 183254 166888 142204 111542 84959
16976H4959k1322j7223r058n810n406m541N756m003j0387l08q290o613m562M606
$$ 84959 63637 46414 37356 31546 26140 21599 27355 23352 12965 12657 4367 -2246 -6808 -2202
16962b202k900p483J402K323J027j062n122L917R70K481J176m408o124p76M516
$$ -2202 -5102 -12585 -11183 -8860 -7833 -8895 -14017 -10100 -9130 -6649 -5473 -9881 -16005 -16781 -12265
16947a2265Q05M759J992k205O440N632L283J553l750q123O290R37m527k497n96
$$ -12265 -11460 -6701 -4709 -6914 -474 5158 8441 9994 6244 -1879 4411 5348 821 -1676 -2272
16932b272k064k439Q15K206l295N216M531j458p486j333j259K701L40L727M651
$$ -2272 -4336 -6775 -5960 -3754 -7049 -1833 2698 1240 -6246 -7579 -8838 -6137 -5797 -2070 2581
16917B581M191o36l665n424K391k747q50K898N77O279Q340k696j0912r837j301
$$ 2581 6772 6136 2471 -2953 -562 -3309 -4159 -1261 -684 5595 13935 11239 327 -9510 -10811
16902a0811O691K169n20l930P00r19j600K614K692J474n647p11N939K174J847
$$ -10811 -4120 -1951 -2471 -6401 -5701 -6620 -8220 -5606 -2914 -1440 -7087 -7798 -1859 315 2162
16887B162J896J707k977j2640p903j445O638N353J206r02l813J132k670M379M101
$$ 2162 4058 5765 2788 -9852 -17755 -19200 -12562 -7209 -6003 -6905 -10718 -9586 -12256 -7877 -3776
16872c776m968l078j92n04k108M755K871l131k886K869o796o283K28K549P268
$$ -3776 -8744 -11822 -12014 -12518 -14626 -9871 -7000 -10131 -13017 -10148 -16944 -23227 -22999 -20450 -13182
16857a3182M484K979M872j177M053j014m652l506N848l046j352M93K838k363K295
$$ -13182 -8698 -5719 -847 -2024 2029 1015 -3637 -7143 -1295 -4341 -5693 -5200 -2362 -4725 -2430
16842b430m14j171j159K208P530j476l729J599N054k97m057p86m277Q26J406N630
$$ -2430 -2844 -4015 -5174 -2966 4564 3088 -641 958 6012 5715 1658 872 -3405 -2579 -1173 4457
16826D457J142r309l132k675M793J332r51N223P229n44q879n409K36J726N504
$$ 4457 5599 -3710 -6842 -9517 -4724 -3392 -4343 880 8109 7565 -1314 -6723 -6487 -4761 743
16811G43K121J633n853J471l883N557O975m285o766k095R96n67O748J376m914
$$ 743 2864 4497 -1356 115 -3768 1789 8764 4479 -2287 -4382 -3386 -3953 2795 4171 -743
16796g43k327o4Q50P659L339l534K183M848j1266j2293k557R15q8j746N114K397
$$ -743 -3070 -3134 -2284 5375 8714 5180 7363 12211 945 -11348 -13905 -12990 -13078 -14824 -9710 -7313
16780g313j218p329O304L468L248j749j307k288k59p011M756Q931l691P93O870
$$ -7313 -8531 -15860 -9556 -6088 -2840 -4589 -5896 -8184 -8443 -15454 -10698 -1767 -5458 -4665 2205
16765B205l79m946J710j374l424p076M621J0895j074j923P57j478l146n820K886
$$ 2205 1826 -3120 -1410 -2784 -6208 -13284 -8663 2232 1158 -765 -8 -1486 -4632 -10452 -7566
16750g566L859Q23J015j452J501N855o98o787j220l514L342M518M708n711M686
$$ -7566 -3707 -2884 -1869 -3321 -1820 4035 3337 -3450 -4670 -8184 -4842 -324 4384 -1327 3359
16735C359J543k234M265n103j616k385k472L121J270k874K182O020j1709o203
$$ 3359 4902 2668 6933 1830 214 -2171 -4643 -1522 -252 -3126 -944 5076 -6633 -12836
16721a2836J048j569O65K858M044L928N523k804K197J285j0330k433o595k394
$$ -12836 -11788 -13357 -12692 -9834 -5790 -1862 3661 857 3054 4339 -5991 -8424 -15019 -17413
16707a7413k001M786R009N767L448J80m987n904j447K940R89o680p39K432J0290
$$ -17413 -19414 -14628 -5619 148 3596 3776 -1211 -7115 -8562 -5622 -4633 -11313 -12052 -9620 670
16692F70P346N71m374k380R773j668j0026l212o42q82J534L357K334k333J392
$$ 670 8016 8587 4213 1833 11606 9938 -88 -3300 -3942 -4824 -3290 67 2401 68 1460
16677A460L64o434m557J344K780K090R01L066N871N515o919q658L788k498l234
$$ 1460 1824 -4610 -9167 -7823 -5043 -2953 -2052 1014 6885 12400 5481 -3177 611 -1887 -5121
16662e121k173n300J642Q512j265m015K080n086l509K001Q894M711j893l896K11
$$ -5121 -7294 -12594 -10952 -2440 -3705 -7720 -5640 -10726 -14235 -12234 -3340 1371 -522 -4418 -4207
16647d207O142k808j400L273p225j8j191o56P220L330j997p657n274K389k631
$$ -4207 1935 -873 -2273 1000 -6225 -6243 -7434 -8090 -870 2460 463 -7194 -12468 -10079 -12710
16632a2710L148N859M163l782L925k063o910K95M499m429l8J667K671k023j939
$$ -12710 -9562 -3703 460 -3322 603 -1460 -8370 -8075 -3576 -8005 -8043 -6376 -3705 -5728 -7667
16617g667L770j155J058j322K011j164r807k326o4N030O725L848J377J247k441
$$ -7667 -3897 -5052 -3994 -5316 -3305 -4469 -14276 -16602 -16666 -11636 -4911 -1063 314 1561 -880
16602h80p94m69J860K039J475j64m713L27k503n797L26n381k901K422l541l36
$$ -880 -1674 -2143 -283 1756 3231 3067 -1646 -1319 -3822 -9619 -9293 -14674 -17575 -15153 -18694 -19030
16586a9030M59M226K745O399M755P982j370r19p97n302n073n880o179K086J017
$$ -19030 -18571 -14345 -11600 -5201 -446 7536 6166 5247 4450 -852 -5925 -11805 -17984 -15898 -14881
16571a4881N357P048O19P613k56l052M097j848p89O561k766r564k917L943P297
$$ -14881 -9524 -2476 -1857 5756 5500 2448 6545 4697 3908 10469 7703 -1861 -4778 -835 6462
16556F462j070p669n535l836K338N268k180j544K735k72p132n012l572M347J919
$$ 6462 5392 -2277 -7812 -11648 -9310 -4042 -6222 -7766 -5031 -5303 -12435 -17447 -21019 -16672 -14753
16541a4753L004L454M497l755O989M600m401K838J591l299k945j662N051J552
$$ -14753 -11749 -8295 -3798 -7553 -564 4036 -365 2473 4064 765 -2180 -3842 1209 2761
16527B761j084Q18j291m262K532N588o057k169p60n372L784P402l368P920K22
$$ 2761 1677 2495 1204 -3058 -526 5062 -995 -3164 -3924 -9296 -5512 1890 -1478 6442 6664
16512F664l371j340m282p59L468j61j07q883k373J403M886M856q232j047r01n130
$$ 6664 3293 1953 -2329 -3088 380 219 112 -8771 -11144 -9741 -4855 1 -8231 -9278 -10179 -15309
16496a5309O460O248J114L744l460n580j098j051L399K348m26R914M304m589J446
$$ -15309 -8849 -2601 -1487 2257 -1203 -6783 -7881 -8932 -5533 -3185 -3611 6303 10607 6018 7464
16481G464J612N14o247p746l197r83k602M18J420L185N24j13M12LL892P85N488
$$ 7464 9076 9590 3343 -4403 -7600 -8583 -11185 -10767 -9347 -6162 -5638 -5751 -5339 -5336 -1444 -659 4829
16464D829M594m203l302P171n564j068M577n809j059M153k256o677m428R16L103
$$ 4829 9423 5220 1918 9089 3525 2457 7034 1225 166 4319 2063 -4614 -9042 -8126 -5023
16449e023o195J691N768J434J158m291K40N028m728k787L884O129j800q196M257
$$ -5023 -11218 -9527 -3759 -2325 -1167 -5458 -5218 -190 -4918 -7705 -3821 2308 508 -7688 -3431
16434c431j959k405J22J089K712M018L691O71o616o742l725O275l83n843j934
$$ -3431 -5390 -7795 -7673 -6584 -3872 146 3837 4508 -2108 -8850 -12575 -6300 -6683 -12526 -14460
16419a4460O74J719J924L078j424Q751J424L914l232l260o344m238O925L359m165
$$ -14460 -13786 -12067 -10143 -7065 -8489 262 1686 5600 2368 -892 -7236 -11474 -4549 -1190 -5355
16404e355K249l278n462k33K610O414q530j936M435O026O830m230o555K00M097
$$ -5355 -3106 -6384 -11846 -12079 -9469 -3055 -11585 -13521 -9086 -3060 3770 -460 -7015 -6815 -2718
16389b718L37K348Q166J256o299o953k575o851k392L76M822L978k841j599k084
$$ -2718 -2381 -33 8133 9389 3090 -3863 -6438 -13289 -15681 -15305 -10483 -6505 -9346 -10945 -13029
16374a3029J848m074K61Q881O445k54j195m700k271R738R015k814n068l964R54
$$ -13029 -11181 -15255 -14994 -6113 332 78 -1117 -5817 -8088 1650 10665 7851 2783 -1181 -227
16359b27o893n374q0L926m78p34q27L445J118P325O60m76m291N640M236j692p421
$$ -227 -7120 -12494 -12574 -8648 -9126 -9860 -10687 -7242 -6124 1201 1861 1385 -2906 2734 6970 5278 -2143
16342b143j0584J775Q170k793P122n65Q8L022m338n422k072K198J18m705l671
$$ -2143 -12727 -10952 -2782 -5575 1547 982 1070 4092 -246 -5668 -7740 -5542 -5424 -10129 -13800
16327a3800J1952L148k741L203K430j1808q803M89P655N433q63o03L267O497M113
$$ -13800 -1848 1300 -1441 1762 4192 -7616 -16419 -15930 -8275 -2842 -3705 -4308 -1041 5456 9569
16312I569k097q16l775K585K713p43l424p694J658m075J10j396L62l461K920m442
$$ 9569 7472 6656 2881 5466 8179 7436 4012 -3682 -2024 -6099 -5989 -7385 -7023 -10484 -7564 -12006
16296a2006J793P60M916J0592J608k980o343J918j370k854J389j689k638n359
$$ -12006 -10213 -9453 -4537 6055 7663 4683 -1660 258 -1112 -3966 -2577 -4266 -6904 -12263
16282a2263j680N307J2114n864l10j993o780O079Q22P804j124p218J489L456J036
$$ -12263 -13943 -8636 3478 -2386 -2696 -4689 -11469 -5390 -4568 3236 2112 -5106 -3617 -161 875
16267H75p837m200r68N203L082k233j636m212k43n37Q675M358q27J046k269J730
$$ 875 -6962 -11162 -12130 -6927 -3845 -6078 -7714 -11926 -12169 -12706 -4031 327 -500 546 -1723 7
16251GL378m630L993kn723n966k036L085j288P664L573N139m23l948k793N89M191
$$ 7 3385 -1245 2748 2746 -2977 -8943 -10979 -7894 -9182 -1518 2055 7194 6771 2823 30 619 4810
16234D810m420n35K403n011m425L736R52K141k746n264L870Q667K935q71n471
$$ 4810 390 -145 2258 -2753 -7178 -3442 -2490 -349 -3095 -8359 -4489 4178 7113 6242 771
16219G71r674l515k202P696M813m113l773j377P61L299N952l983l657P09P792
$$ 771 -8903 -12418 -14620 -6924 -2111 -6224 -9997 -11374 -10613 -7314 -1362 -5345 -9002 -8293 -501
16204e01L628J090k119k444j800k032r7j642O208k56N953J783o993k078m968l283
$$ -501 3127 4217 2098 -346 -2146 -4178 -4275 -5917 291 35 5988 7771 778 -1300 -6268 -9551
16188i551L475R504O298J452J531j27p25l126k862o520r60j456j08O814o017k856
$$ -9551 -6076 3428 9726 11178 12709 12582 11857 8731 5869 -651 -1611 -3067 -3175 3639 -2378 -5234
16172e234j699o339j439M669R227M933p854l7J72k875K146j560L201L354n140
$$ -5234 -6933 -13272 -14711 -10042 -815 4118 -3736 -3773 -3601 -6476 -4330 -5890 -2689 665 -4475
16157d475n303l392n041k416J1887P209L931Q459L742j0454j1183L37N661j750
$$ -4475 -9778 -13170 -18211 -20627 -8740 -1531 2400 10859 14601 4147 -7036 -6699 -1038 -2788
16143b788j745L153O352k226o649m938O125M704K198J724K777k093n304l859p05
$$ -2788 -4533 -1380 4972 2746 -3903 -8841 -2716 1988 4186 5910 8687 6594 1290 -2569 -3274
16128c274J228l201j751M444k485m36l002p588l883J361R445j227m543k085R35
$$ -3274 -2046 -5247 -6998 -2554 -5039 -5475 -8477 -16065 -19948 -18587 -9142 -10369 -14912 -16997 -16062
16113a6062L620N411K346l147k695l003j2L064j783k402M083L824k95R527l325
$$ -16062 -12442 -7031 -4685 -7832 -10527 -13530 -13542 -10478 -12261 -14663 -10580 -6756 -7051 2476 -849
16098h49m092j358k676O55j161M132N973j368j854L813j112j516K400j274o018
$$ -849 -4941 -6299 -8975 -8320 -9481 -5349 624 -744 -2598 1215 103 -1413 987 -287 -6305
16083f305J018M309Q15l9j2265o752o34P928N146P05J486K288k778m700m620L189
$$ -6305 -5287 -978 -163 -202 -12467 -19219 -19853 -11925 -6779 -6074 -4588 -2300 -5078 -9778 -14398 -11209
16067a1209P361N5j531k202m87R2J675J398j25l849O68J569J1219m178l123M94
$$ -11209 -3848 -3793 -5324 -7526 -8013 -7921 -6246 -4848 -4973 -8822 -8154 -6585 4634 456 -2667 -2173
16051b173M088J578P69L821m700o33m436l251k3R89J296l707M353Q70k657n15
$$ -2173 1915 3493 4262 8083 3383 2750 -1686 -4937 -4960 -3971 -2675 -6382 -2029 -1159 -3816 -4331
16035d331L335O717k221q188L442n775j988J703N177j545O316L799o296n017l844
$$ -4331 -996 5721 3500 -4688 -1246 -7021 -9009 -7306 -2129 -3674 2642 6441 145 -4872 -8716
16020h716l23J270R07N35O934J467k484j689n052M92L616k62M19j252o18m495
$$ -8716 -9039 -7769 -6862 -6327 607 2074 -410 -2099 -7151 -6659 -3043 -3305 -2886 -4138 -4756 -9251
16004i251m571P664P092R78r25p834K820L914n688o761m9l970P063O129k788O156
$$ -9251 -13822 -6158 934 1912 987 -6847 -4027 -113 -5801 -12562 -12611 -16581 -9518 -3389 -6177 -21
15988b1K2k080k273l492l964J406O446O89K410J929j074M543k209n849p66J371
$$ -21 1 -2079 -4352 -7844 -11808 -10402 -3956 -3267 -857 1072 -2 4541 2332 -3517 -4283 -2912
15972b912J828L677k122j237O439j709q742K949K643m816j379j453L201O137J623
$$ -2912 -1084 2593 471 -766 5673 3964 -4778 -1829 814 -4002 -5381 -6834 -3633 2504 4127
15957D127k521k437o00M36K759j935K542M115L819l549J713j272k956j659K727
$$ 4127 1606 -831 -1431 -995 1764 -171 2371 6486 10305 6756 8469 7197 4241 2582 5309
15942E309p15k569o570K813L290n461O34K591j360o066l901j32k744O440N079
$$ 5309 4594 2025 -4545 -1732 1558 -3903 -3269 -678 -2038 -8104 -12005 -12137 -14881 -8441 -3362
15927c362K702L675j201l8M047J292m981J752J433j0417k160L220k665J996j610
$$ -3362 -660 3015 1814 1776 5823 7115 2134 3886 5319 -5098 -7258 -4038 -6703 -4707 -6317
15912f317M717N501m632o960o083L434l21o860Q206P125r20J065J74M29k389j588
$$ -6317 -1600 3901 -731 -7691 -13774 -10340 -10661 -17521 -9315 -2190 -3110 -2045 -1871 -1442 -3831 -5419
15896e419j01N36K012j175M52J812l549n400R977J866o685k274l25L708N119k028
$$ -5419 -5520 -4984 -2972 -4147 -3695 -1883 -5432 -10832 -855 1011 -5674 -7948 -8273 -4565 554 -1474
15880a474n97N89N444M276L403L490k203q867k744Q19n94k994q07K735P407k69
$$ -1474 -2071 -1482 3962 8238 11641 15131 12928 4061 1317 2136 1542 -1452 -2259 476 7883 7614
15864G614M894l138l805k59M946L95j955p61O4l210j0872o991j037M522L143j3
$$ 7614 12508 9370 5565 5306 10252 10647 8692 7931 7995 4785 -6087 -13078 -14115 -9593 -6450 -6463
15848f463M739M377N83L239l39p09J935J990j050o126r718j255L966j521l135
$$ -6463 -1724 2653 3236 6475 6136 5427 7362 9352 8302 2176 -7542 -8797 -4831 -6352 -9487
15833i487J658O071J52M067M052K898q66q705n819l481L508J741M699J720R33
$$ -9487 -7829 -1758 -1606 2461 6513 9411 8545 -160 -5979 -9460 -5952 -4211 488 2208 3141
15818C141K391m548j815J944L989k602n566M038M721o279j298J513o314L908N198
$$ 3141 5532 984 -831 1113 5102 2500 -3066 972 5693 -586 -1884 -371 -6685 -2777 2421
15803B421M665l568L198K942q92j0583j0626L725N064L650L758m900n078K748
$$ 2421 7086 3518 6716 9658 8766 -1817 -12443 -8718 -3654 -4 3754 -1146 -6224 -3476
15789c476M150j777n91N665o906p114L6R53L281K489j764K11R8L56j061k392K635
$$ -3476 674 -1103 -1694 3971 -2935 -10049 -10013 -9060 -5779 -3290 -5054 -4843 -4745 -4389 -5450 -7842 -5207
15772e207j456j282l349J718L701M887l09k964K81O086j866l978N30M451N474
$$ -5207 -6663 -7945 -11294 -9576 -5875 -988 -1297 -4261 -3980 2106 240 -3738 -3208 1243 6717
15757F717K847N06k533K34m61n61K398n713m153j873P266K895L319j899n346p846
$$ 6717 9564 10070 7537 7771 7310 6749 9147 3434 -719 -2592 4674 7569 10888 8989 3643 -4203
15741d203n134k210k702R87M550m235p416N188Q911n094K360L236K469n48J619
$$ -4203 -9337 -11547 -14249 -13262 -8712 -12947 -20363 -15175 -6264 -11358 -8998 -5762 -3293 -3841 -2222
15726b222M894o20q415j419J272N01O809m631k859O220N110o234J319k318k275
$$ -2222 2672 2052 -6363 -7782 -6510 -6009 800 -3831 -6690 -470 4640 -1594 -275 -2593 -4868
15711d868K666K220l990K198q390L854N660J511K036n12K098L480k515M95l527
$$ -4868 -2202 18 -3972 -1774 -10164 -6310 -650 861 2897 2385 4483 7963 5448 5943 2416
15696B416K708J807j00q76M662l863o757R76k004m912J292J707K636O13L427N856
$$ 2416 5124 6931 6831 5955 10617 6754 -3 973 -1031 -5943 -4651 -2944 -308 305 3732 9588
15680I588L477k200K897n387k792O01lL776J809j753m044Q11k819p023L829O825
$$ 9588 13065 10865 13762 8375 5583 6184 6181 9957 11766 10013 5969 6780 3961 -3062 767 7592
15664G592L1k130p363L996M363q058O996L98o379m628J874K219P96M319r85r27
$$ 7592 7623 5493 -1870 2126 6489 -1569 5427 5825 -554 -5182 -3308 -1089 -293 4026 3041 2114
15648B114K736l764j435m461j41J233o547k588O647m778M313K526P124M607n913
$$ 2114 4850 1086 -349 -4810 -4951 -3718 -10265 -12853 -6206 -10984 -6671 -4145 2979 7586 1673
15633A673j55J541l584M40Q1j069n359k747J768M580L519M40L422K762m037o359
$$ 1673 1518 3059 -525 -85 -4 -1073 -6432 -9179 -7411 -2831 688 1128 4550 7312 3275 -3084
15617c084p647K736O915L54N02j076j041L369P665K991o444m673Q11J773l49n351
$$ -3084 -10731 -7995 -1080 -726 -224 -1300 -2341 1028 8693 11684 5240 567 1378 3151 2802 -2549
15601b549p053N862M022k155k643j960J626M452m245N788Q545N48j093j575m040
$$ -2549 -9602 -3740 282 -1873 -4516 -6476 -4850 -398 -4643 1145 9690 10238 9145 7570 3530
15586C530j087j873L389m211M36J615j127k352J142P468Q30N616p42m303p44j0568
$$ 3530 2443 570 3959 -252 184 1799 672 -1680 -538 6930 7760 13376 12634 8331 7587 -2981
15570b981p300k020R55K760J1935J1013m711l128K577m460n432J330J241o66L447
$$ -2981 -10281 -12301 -11346 -8586 3349 14362 9651 6523 9100 4640 -792 538 1779 1113 4560
15555D560O494N162p181o222m774m196k290n72k266O669J591J679K61j177j59
$$ 4560 11054 16216 9035 2813 -1961 -6157 -8447 -9019 -11285 -4616 -3025 -1346 -1085 -2262 -2421
15540b421K20m717o36J039L574O297O129J328j91j455m225k016m274l520n644
$$ -2421 -2201 -6918 -7554 -6515 -2941 3356 9485 10813 10622 9167 4942 2926 -1348 -4868 -10512
15525a0512k898M614Q132L850l532Q97l196k743l517M153M361k092J76K612O018
$$ -10512 -13410 -8796 -664 3186 -346 551 -2645 -5388 -8905 -4752 -391 -2483 -2307 305 6323
15510F323Q88Q62l098l498k551j981L954N017j460n948l643O439L342l318l040
$$ 6323 7211 8073 4975 1477 -1074 -3055 899 5916 4456 -1492 -5135 1304 4646 1328 -1712
15495a712j197L880M00K946l247l761j153j288P13K027n24l416J103J27K296k808
$$ -1712 -2909 971 1371 4317 1070 -2691 -3844 -5132 -4419 -2392 -2916 -6332 -5229 -5102 -2806 -5614
15479e614J831K320N750l647J811k476j950O247L183K138j101m335m786o360Q865
$$ -5614 -3783 -1463 4287 640 2451 -25 -1975 4272 7455 9593 8492 4157 -629 -6989 1876
15464A876J962p787J945j067j821l217N340M744j838M647j489M020l590l606J009
$$ 1876 3838 -3949 -2004 -3071 -4892 -8109 -2769 1975 137 4784 3295 7315 3725 119 1128
15449A128o20p719j494l277J3289M633m366k462J612L232K760j206J889n719p07
$$ 1128 508 -7211 -8705 -11982 1307 5940 1574 -888 724 3956 6716 5510 7399 1680 973
15434I73n330o611K99M182N677n70K06L899M208m510j827j418m522l397r57m21
$$ 973 -4357 -10968 -10669 -6487 -810 -1380 -1174 2725 6933 2423 596 -822 -5344 -8741 -9698 -10119
15418a0119M811L934M149L329p610j858K85m354L601L201n169j3M213j411p33
$$ -10119 -5308 -1374 2775 6104 -1506 -3364 -3079 -7433 -3832 -631 -5800 -5813 -1600 -3011 -3744
15403c744K0m204J759K603j428m14R75m40N383k131l354M044m47m499n524l949
$$ -3744 -3724 -7928 -6169 -3566 -4994 -5408 -4433 -4873 510 -1621 -4975 -931 -1378 -5877 -11401 -15350
15387a5350J915L283J402k870j0623j098R333R849M130k318L254K236l412J949
$$ -15350 -13435 -10152 -8750 -11620 -22243 -23341 -14008 -4159 -29 -2347 907 3143 -269 1680
15373A680m101M50M826J037o195M457K079j315K19o368Q37K184l17n459m643l28
$$ 1680 -2421 -1971 2855 3892 -2303 2154 4233 2918 3137 -3231 -2394 -210 -527 -5986 -10629 -10957
15357a0957J824K13l581m99P078o293o821K191O048N528J006l199L570J201K28
$$ -10957 -9133 -8920 -12501 -13000 -5922 -12215 -19036 -16845 -10797 -5269 -4263 -7462 -3892 -2691 -2463
15342b463j048j68Q868J426m870p53n380L3P527L098o51L775m862q054l24k962
$$ -2463 -3511 -3679 5189 6615 1745 992 -4388 -4355 3172 6270 5619 9394 4532 -3522 -3846 -6808
15326f808J213N575k006o722m394M543O026J821j335n605M031O131j149j1514
$$ -6808 -5595 -20 -2026 -8748 -13142 -8599 -2573 -752 -2087 -7692 -3661 2470 1321 -10193
15312a0193k456Q689J0872O47m943k082j71o00l129R89o70p42P07k373N66K24
$$ -10193 -12649 -3960 6912 7559 2616 534 363 -237 -3366 -2377 -3047 -3789 -3082 -5455 -4889 -4665
15296d665m385m261L616j907N389L709P94l643n714O78M177M755K616O695n694
$$ -4665 -9050 -13311 -9695 -11602 -6213 -2504 -1710 -5353 -11067 -10389 -6212 -1457 1159 7854 2160
15281B160j2827K835P791M351O528k517P05N788q249q852M871P325o515p468j765
$$ 2160 -10667 -7832 -41 4310 10838 8321 9026 14814 6565 -2287 2584 9909 3394 -4074 -5839
15266e839M04M706L129K566l43J195o529k793o69P155K408l94k395J771O68j861
$$ -5839 -5435 -729 2400 4966 4623 5818 -711 -3504 -4173 2982 5390 4996 2601 4372 5040 3179
15250C179k592o21M841N906J505K354l878m376k586L048k852m02o49m157k198
$$ 3179 587 -34 4807 10713 12218 14572 10694 6318 3732 6780 3928 3526 2877 -1280 -3478
15235c478j254m576J065n86n062N401M22j742j545L641J917L283j714j804k617
$$ -3478 -4732 -9308 -8243 -8829 -13891 -8490 -8068 -9810 -11355 -7714 -5797 -2514 -4228 -6032 -8649
15220h649L425m73o80J927l539Q80M157J98k754k215P560P198L069j434j874o666
$$ -8649 -5224 -5697 -6377 -4450 -7989 -7109 -2952 -2754 -5508 -7723 -163 7035 10104 8670 6796 130
15204A30m895K726k451o00j995L014j776J743N961L934m710J705N279m745P41
$$ 130 -4765 -2039 -4490 -5090 -7085 -4071 -5847 -4104 1857 5791 1081 2786 8065 3320 4061
15189D061J801k810j709k775m83r27K128k364K624N981j119k064l630p007j051
$$ 4061 5862 3052 1343 -1432 -1915 -2842 -714 -3078 -454 5527 4408 2344 -1286 -8293 -9344
15174i344K824j014j149O335N619R1p42J728m7J698J0K89o606m61M074M686p292
$$ -9344 -6520 -7534 -8683 -2348 3271 3362 2620 4348 4301 5999 6009 6298 -308 -769 3305 7991 699
15157F99p288J882Q510O102Q46n511n609p149L124K175m160l98O297J209r9k338
$$ 699 -6589 -4707 3803 9905 10751 5240 -369 -7518 -4394 -2219 -6379 -6777 -480 729 630 -1708
15141a708l367J328L247Q892L408q139p40J576K619R78M595J478p837l530k567
$$ -1708 -5075 -3747 -500 8392 11800 3661 2921 4497 7116 8094 12689 14167 6330 2800 233
15126B33l037M232L182J043O68j645j007L923j597j055K276j433j764n206M715
$$ 233 -2804 1428 4610 5653 6321 4676 3669 7592 5995 4940 7216 5783 4019 -1187 3528
15111C528L189L002k302n778j528j81Q40m00j591J501o020o482k895K381L847
$$ 3528 6717 9719 7417 1639 111 -70 770 370 -1221 280 -5740 -12222 -15117 -12736 -8889
15096h889Q63K487O985O28L033k984k825O779l352J673K679r001q384J232Q61
$$ -8889 -8026 -5539 1446 2074 5107 2123 -702 6077 2725 4398 7077 -1924 -10308 -9076 -8215
15081h215K036j567J386J657l88L646O491M974M466m857r398j392L874N55o000
$$ -8215 -6179 -7746 -6360 -4703 -5091 -1445 5046 10020 14486 9629 231 -1161 2713 3268 -2732
15066b732n007k299n836J962j317M109J24M163j467K073l303k242M501O286L693
$$ -2732 -7739 -10038 -15874 -13912 -15229 -11120 -10996 -6833 -8300 -6227 -9530 -11772 -7271 -985 2708
15051B708j417L319L236p04l941l511k720j944l69n500k801N801J0381K503k59
$$ 2708 1291 4610 7846 7142 3201 -310 -3030 -4974 -5343 -10843 -13644 -7843 2538 5041 4782
15036D782o952K186R087k062l153n342K193k952j54k74J855O28L264K473K485
$$ 4782 -2170 16 9103 7041 3888 -1454 739 -2213 -2367 -2641 -786 -158 3106 5579 8064
15021H064j607J73p10j496l399o365l007p30L288L220q59K331M343N681k97j704
$$ 8064 6457 6630 5920 4424 1025 -5340 -8347 -9077 -5789 -2569 -3428 -1097 3246 8927 8630 6926
15005F926O34m795n077L132n67k058k549l887r61K084R602l697r308L730K224
$$ 6926 7560 2765 -2312 820 253 -1805 -4354 -8241 -9202 -7118 2484 -1213 -10521 -6791 -4567
14990d567k925M415L328R974k27m687L714J725l111m620L38N943j321n343q03
$$ -4567 -7492 -3077 251 10225 9998 5311 9025 10750 7639 3019 3357 9300 7979 2636 1833
14975A833K799k896l860M365L854m686j846J0l029J939J241k504L710N306k271
$$ 1833 4632 1736 -2124 2241 6095 1409 -437 -427 -3456 -1517 -276 -2780 930 6236 3965
14960C965j309j304l644m270M66P89O06M397K233M388n816n633n363N529O652
$$ 3965 2656 1352 -2292 -6562 -6096 -5307 -4701 -304 1929 6317 501 -5132 -10495 -4966 1686
14945A686J749K398J870L627p757p167j202k160N337O49j311L431K590m210k345
$$ 1686 3435 5833 7703 11330 3573 -3594 -4796 -6956 -1619 -970 -2281 1150 3740 -470 -2815
14930b815K054K429L978m614q757o660O086O893l845l998L17M785KJ22N422O620
$$ -2815 -761 1668 5646 1032 -7725 -14385 -8299 -1406 -5251 -9249 -8932 -4147 -4145 -4023 1399 8019
14914H019p233k940K656Q037K333l401k557P729O014o719j641K233j877m214q172
$$ 8019 786 -2154 502 8539 10872 7471 4914 12643 18657 11938 10297 12530 10653 6439 -1733
14899a733j992l554O137N034J067J255P26n745j503q719n561M650Q731L965L647
$$ -1733 -3725 -7279 -1142 3892 4959 6214 6940 1195 -308 -9027 -14588 -9938 -1207 2758 6405
14884F405j50p795J302O533M723j000k660n175l016k445M712L405p603j773O039
$$ 6405 6255 -1540 -238 6295 11018 10018 7358 2183 -833 -3278 1434 4839 -2764 -4537 1502
14869A502P852J942n190j588O265q81l310m02k891k052j965o006J817J5017N752
$$ 1502 9354 11296 6106 4518 10783 9902 6592 6190 3299 1247 -718 -6724 -4907 10110 15862
14854A5862n324l965R3n76n173m687N229J928m750j655j438k056K741O539L82
$$ 15862 10538 6573 6666 6090 917 -3770 1459 3387 -1363 -3018 -4456 -6512 -3771 2768 3150
14839C150o464n905M528n130j340M7k236N117l137J115J753P735O928r17r731
$$ 3150 -3314 -9219 -4691 -9821 -11161 -11114 -13350 -8233 -11370 -10255 -8502 -767 6161 5244 -4487
14824d487n268J402N734j369K088j068M025J776J065m857l450K542M036k728L251
$$ -4487 -9755 -8353 -2619 -3988 -1900 -2968 1057 2833 3898 -959 -4409 -1867 2169 -559 2692
14809B692M248N549P62j151p96l395m560K58k637n147j260n20R2j367N688M357
$$ 2692 6940 12489 13251 12100 11304 7909 3349 3607 970 -4177 -5437 -5957 -5865 -7232 -1544 2813
14793B813J185m96k348K977J164k465j437k446n345J814J341K197L282k789N53
$$ 2813 3998 3502 1154 4131 5295 2830 1393 -1053 -6398 -4584 -3243 -1046 2236 -553 0
14778@l832M594K665J353P35L129L666k965m80o504p27j506l472L818Q137j265
$$ 0 -3832 762 3427 4780 5515 8644 12310 9345 8865 2361 1634 128 -3344 474 8611 7346
14762G346o826l764M349O007M614k542p304m995k99m42k557r63J0890K968l664
$$ 7346 520 -3244 1105 7112 11726 9184 1880 -3115 -3414 -3856 -6413 -7376 3514 6482 2818
14747B818n502P658L601o484J128j954j788J652p63m441J748N975M121k505m741
$$ 2818 -2684 4974 8575 2091 3219 1265 -523 1129 366 -4075 -2327 3648 7769 5264 523
14732E23k984o18M558l956J67J842n524L15j531m546L70J410L119j90L517Q912
$$ 523 -2461 -3079 1479 -2477 -2310 -468 -5992 -5677 -7208 -11754 -11384 -9974 -6855 -7045 -3528 5384
14716E384K361q524J774K456j056l177j615J076M249R909K238l202L43K042p018
$$ 5384 7745 -779 995 3451 2395 -782 -2397 -1321 2928 12837 15075 11873 12216 14258 7240
14701G240m488M618L744m219J621m93n726J822M633j441o483J703M473j252q518
$$ 7240 2752 7370 11114 6895 8516 8023 2297 4119 8752 7311 828 2531 7004 5752 -2766
14686b766p465K277J0159P973N263n736r522l390J097o318N690j196K317O038
$$ -2766 -10231 -7954 2205 10178 15441 9705 183 -3207 -2110 -8428 -2738 -3934 -1617 4421
14672D421L218M562m340m140m57m892K594Q405k640n691L213J349K703j165m093
$$ 4421 7639 12201 7861 3721 3264 -1628 966 9371 6731 1040 4253 5602 8305 7140 3047
14657C047N619r27j366q587K467N785l924l614M854K857j348J153L833n494j0606
$$ 3047 8666 7739 6373 -2214 253 6038 2114 -1500 3354 6211 4863 6016 9849 4355 -6251
14642f251l322q14k036j591L567N534P35J912N947J319j160n641o578l464R595
$$ -6251 -9573 -10387 -12423 -14014 -10447 -4913 -4178 -2266 3681 5000 3840 -1801 -8379 -11843 -2248
14627b248M762J435K813n57K676K596J424j131p729m402P482K759j723Q36m487
$$ -2248 2514 3949 6762 6205 8881 11477 12901 11770 4041 -361 7121 9880 8157 8993 4506
14612D506k662m645k180L004k543N573O263M225P61N123q15m022l355l180l683
$$ 4506 1844 -2801 -4981 -1977 -4520 1053 7316 11541 12302 17425 16610 12588 9233 6053 2370
14597B370P48l826n129k416K464J831O139j422O77J489L031m555k857M54J099
$$ 2370 3118 -708 -5837 -8253 -5789 -3958 2181 759 1436 2925 5956 1401 -1456 -1002 97
14582I7Qk701J887K262k842l579Q69L910j962n567n348P230M327J0069M170p144
$$ 97 105 -2596 -709 1553 -1289 -4868 -3999 -89 -2051 -7618 -12966 -5736 -1409 8660 12830 5686
14566E686j116J648J558n082n539O18k66O62J131Q694J122o641o2J30l590M357
$$ 5686 4570 6218 7776 2694 -2845 -2227 -2493 -1831 -700 7994 9116 2475 2413 2543 -1047 3310
14550C310r22l53J506O67K400j711l054j734n734L916K594K520J940O15K989k739
$$ 3310 2388 2035 3541 4208 6608 4897 1843 109 -5625 -1709 885 3405 5345 5960 8949 6210
14534F210k752o357q968j62M062N498r87j288j261M890P019P753k579l492j19
$$ 6210 3458 -2899 -11867 -12029 -7967 -2469 -3456 -4744 -6005 -1115 5904 13657 11078 7586 7467
14519G467N07M46m065n935L058Q954J697o08p920m433K727M27m177J242M661J316
$$ 7467 7974 8420 4355 -1580 1478 10432 12129 11521 3601 -832 1895 2322 -1855 -613 4048 5364
14503E364J903j122Q65o453p06L45r449K098O261N813K946l142j071m90LL30M117
$$ 5364 7267 6145 7010 557 -149 196 -9253 -7155 -894 4919 7865 4723 3652 3162 3165 3495 7612
14486G612n888L532J486J878j625N386K396k036j973p478m944L35j552M092o048
$$ 7612 1724 5256 6742 8620 6995 12381 14777 12741 10768 3290 -1654 -1319 -2871 1221 -4827
14471d827O10L115M489M023L078J800k745o663l018l30q8J294N164P36k419l682
$$ -4827 -4217 -1102 3387 7410 10488 12288 9543 2880 -138 -468 -556 738 5902 6638 4219 537
14455E37K99N246L289l012j586n321l014N804N02j033L319j199m363J767P026
$$ 537 836 6082 9371 6359 4773 -548 -3562 2242 2744 1711 5030 3831 -532 1235 8261
14440H261M639l30o135m408N172M711l320o053q150j703K933l69N975O85K085
$$ 8261 12900 12570 6435 2027 7199 11910 8590 2537 -5613 -7316 -4383 -4752 1223 1908 3993
14425C993O111O19o955j2111k245N704O062Q77K232n022N8K965L955P51o237l637
$$ 3993 10104 10723 3768 -8343 -10588 -4884 1178 2055 4287 -735 -677 2288 6243 6994 757 -2880
14409b880K564N068O78M225n484j049o57m031P48k56O743J1564k070j0930j183
$$ -2880 -316 4752 5430 9655 4171 3122 2465 -1566 -818 -1074 5669 17233 15163 4233 3050
14394C050K177m809r301M404O188m52m86M473n62r218j13L735j44N8p281P162
$$ 3050 5227 418 -8883 -4479 1709 1257 771 5244 4682 -4536 -4649 -914 -1058 -1000 -8281 -1119
14378a119L150O445k683P41r5K52j527m019j441N619M762J296n24M902J640r767
$$ -1119 2031 8476 5793 6534 6439 6691 5164 1145 -296 5323 10085 11381 10857 15759 17399 7632
14362G632k759j303L077J10K859J651P896M630q387q155J171n320J713N038J316
$$ 7632 4873 3570 6647 6757 9616 11267 19163 23793 15406 7251 8422 3102 4815 9853 11169
14347A1169l764l059M257l341m410m842m608M331L549n223q53m423K964L254Q209
$$ 11169 7405 4346 8603 5262 852 -3990 -8598 -4267 -718 -5941 -6794 -11217 -8253 -4999 3210
14332C210O374L126p471L92J118j762p620l176J946P074R21k5j912n00O228J217
$$ 3210 9584 12710 5239 5631 6749 4987 -2633 -5809 -3863 3211 4132 4107 2195 1695 7923 9140
14316I140r218j115L296R833L23J155j466m746r024j693k599L684K716q76q37
$$ 9140 -78 -1193 2103 11936 12259 13414 11948 7202 -1822 -3515 -6114 -2430 286 -590 -1427
14301a427k276k265N23J017K470j032p498p048M181J0768Q840M242M616m201m289
$$ -1427 -3703 -5968 -5445 -4428 -1958 -2990 -10488 -17536 -13355 -2587 6253 10495 15111 10910 6621
14286F621j213M461L87k920j691N766K987l122P83k378l243j4l195K386k75o253
$$ 6621 5408 9869 10256 7336 5645 11411 14398 11276 12059 9681 6438 6424 3229 5615 5340 -913
14270i13l837K342l77L765N652K789j654J257k757j156N284q082o296M356K558
$$ -913 -4750 -2408 -2785 980 6632 9421 7767 9024 6267 5111 10395 2313 -3983 373 2931
14255B931J014M306j845o520L6n575j541O745J267J532j69k739N451j973Q2N467
$$ 2931 3945 8251 6406 -114 -78 -5653 -7194 -449 818 2350 2181 -558 4893 2920 3002 8469
14239H469K719m971K678L309O41Q188n620J699J385k072o397l794j912J325J783
$$ 8469 11188 6217 8895 12204 12845 21033 15413 17112 18497 16425 10028 6234 4322 5647 7430
14224G430m69N481P276J069m288j1069o842M770J595K562K399M329Q63K679m718
$$ 7430 6961 12442 19718 20787 16499 5430 -1412 3358 4953 7515 9914 14243 15106 17785 13067
14209A3067n973K817n816j0390J645l6j652j385J438J044m446N218R567O361n74
$$ 13067 7094 9911 4095 -6295 -4650 -4686 -6338 -7723 -6285 -5241 -9687 -4469 5098 11459 10885
14194A0885j127J379n385j0747l033Q781o82P47L146L052Q54Q90L533j723k536
$$ 10885 9758 11137 5752 -4995 -8028 753 71 818 3964 7016 7870 8760 12293 10570 8034
14179H034l81K880L110m935j032K78N19k982Q85Q70n723q358J284J2232Q583k423
$$ 8034 7653 10533 13643 8708 7676 7954 8473 5491 6376 7246 1523 -6835 -5551 6681 15264 12841
14163A2841m611n835n968M334O116n090l322O537J062q719M062L726L540J484
$$ 12841 8230 2395 -3573 761 6877 1787 -1535 5002 6064 -2655 1407 5133 8673 10157
14149A0157j269K344N767o760K014m748m801m828J679K259K06Q140L002r081m601
$$ 10157 8888 11232 16999 10239 12253 7505 2704 -2124 -445 1814 2020 10160 13162 4081 -520
14134e20J699N428k390l331J221O556J312k869j796M644O111J055k741K688N08
$$ -520 1179 6607 4217 886 2107 8663 9975 7106 5310 9954 16065 17120 14379 17067 17575
14119A7575L662k497m734l346k956r71k089O477n082L433K910m338j795J947N606
$$ 17575 21237 18740 14006 10660 7704 6733 4644 11121 6039 9472 12382 8044 6249 8196 13802
14104A3802M261r66p653L076N36o885m592L783L483O418N86k908J583R91n052
$$ 13802 18063 17097 9444 12520 13056 6171 1579 5362 8845 15263 15849 12941 14524 15515 10463
14089A0463m544k886P595Q768k550k008N742L184m615l599L941k326q08j709n413
$$ 10463 5919 3033 10628 19396 16846 14838 20580 23764 19149 15550 19491 17165 16357 14648 9235
14074I235m321K173o91J187q66m040m935L172M233k64J90J299N453J0032M536
$$ 9235 4914 7087 6396 7583 6717 2677 -2258 914 5147 4883 5073 6372 11825 21857 26393
14059B6393m425j612n306r06R31K36K202j926J413L203k419J940k225k309n74
$$ 26393 21968 20356 15050 14144 15075 15311 17513 15587 17000 20203 17784 19724 17499 15190 14616
14044A4616l012j716J508q91M05n5M983L719j904k467o002J407K820o43l928L736
$$ 14616 11604 9888 11396 10505 10910 10855 15838 19557 17653 15186 9184 10591 13411 12768 8840 12576
14028A2576N407j0652k15O612n29q489m781n116N612J401K333M646J980J754o515
$$ 12576 17983 7331 7116 13728 13199 4710 -71 -5187 425 1826 4159 8805 10785 12539 6024
14013F024M187L081j2810l838L818J0194J893O304j720J159r94n778l541N14K146
$$ 6024 10211 13292 482 -3356 462 10656 12549 18853 17133 18292 17298 11520 7979 8493 10639
13998A0639k976m562K986O506K743r41n098K106M378L541m052n822n151N367O455
$$ 10639 7663 3101 6087 12593 15336 14395 9297 11403 15781 19322 15270 9448 4297 9664 16119
13983A6119o270l245M6K009J948j610J335k79N055Q913l915p152K273N726O22
$$ 16119 9849 6604 6650 8659 10607 8997 10332 10053 15108 24021 20106 12954 15227 20953 21575
13968B1575n755r95L293M491K209m244l463P022k091l481k348J325N821k961l743
$$ 21575 15820 14825 18118 22609 24818 20574 17111 24133 22042 18561 16213 17538 23359 20398 16655
13953A6655k641K063r57J185R314J315J111L875q83m262m317k041L294n556j253
$$ 16655 14014 16077 15120 16305 25619 26934 28045 31920 31037 26775 22458 20417 23711 18155 16902
13938A6902k272J082L061M812P185K59O39P537J1621J0896K3235L0555L5933L7832
$$ 16902 14630 15712 18773 23585 30770 31029 31668 39205 50826 61722 84957 115512 151445 189277
13924A89277K9459L208k4421l1564l4368l0168k5786j5986L42L349J00O187J3175
$$ 189277 218736 221944 197523 165959 131591 101423 75637 59651 59993 63342 63442 69629 82804
13911H2804J8478K3017K4023J1909n247j7709j6225j0032J938J5937L3871L5942
$$ 82804 101282 124299 148322 160231 154984 137275 121050 111018 112956 128893 162764 198706
13899A98706L2657J5696j0392l6402l8658k7173j1952j2644m931L400N298J6899
$$ 198706 231363 247059 236667 200265 161607 134434 122482 109838 104907 108307 113605 130504
13887A30504K5698K2053n873k8262k3876j8171j2917j0064p58J1170J8214K7052
$$ 130504 156202 178255 172382 144120 120244 102073 89156 79092 78334 89504 107718 134770
13875A34770L5150M8317O0787N8946K4685j0541k2587j8514j2601j9195l5491
$$ 134770 169920 218237 279024 337970 362655 352114 329527 311013 298412 279217 243726
13864B43726n1582m2825k8315j5738j8517j9733j240J4561J0370J6140J6765K1692
$$ 243726 192144 149319 121004 105266 86749 67016 65776 80337 90707 106847 123612 145304
13852A45304L0214J5340j2124k3097j8218q180N658K4827L2792L0038K9168J1699
$$ 145304 175518 190858 178734 155637 137419 129239 134897 159724 192516 222554 251722 263421
13840B63421j7827l2590l4436l0766k2277j4750k617M046R166J9586K8301J7878
$$ 263421 245594 213004 178568 147802 125525 110775 108158 112204 121370 140956 169257 187135
13828A87135o567k6182l0825k5302j2878p789J360R142J5591K4040L1328M4597
$$ 187135 180568 154386 123561 98259 85381 77592 78952 88094 103685 127725 159053 203650
13816B03650O3803L5479j1312m1377n3404m8435l2824k6135j7928j6435J747m175
$$ 203650 267453 302932 291620 250243 196839 148404 115580 89445 71517 55082 56829 52654
13804E2654m691p295k853l698K618L490K785K054o262j682L232k477o646k358
$$ 52654 47963 40668 37815 34117 36735 40225 43010 45064 38802 37120 40352 37875 31229 28871
13790B8871l327N044J089m868k140R79j974P165N908R26k372J092o25Q17J818
$$ 28871 25544 30588 31677 26809 24669 25648 23674 30839 36747 37673 35301 36393 35768 36585 38403
13775C8403K309O353r75l081p273j0900M440J3304M111R98K28K899L306m535r091
$$ 38403 40712 47065 46090 43009 35736 24836 29276 42580 46691 47689 47917 50816 54122 49587 40496
13760D0496j189K648o96q550j825L699P290k440m972J712m95O681J1609m830j2350
$$ 40496 39307 41955 41259 32709 30884 34583 41873 39433 34461 36173 35678 42359 53968 49138 36788
13745C6788l625M011M135N515m237p159k606n37L265J241N796P536N271l269N391
$$ 36788 33163 37174 41309 46824 42587 35428 32822 32285 35550 36791 42587 50123 55394 52125 57516
13730E7516R47q959L353J486m942l228k428L424L973J87k4K197M583M27p725m550
$$ 57516 58463 49504 52857 54343 49401 46173 43745 47169 51142 51329 51305 53502 58085 58512 50787 46237
13714D6237l096L303L96r95L963n08P959M896M38m736n736j551N677j7j0061l688
$$ 46237 43141 46444 46840 45845 49808 49300 57259 62155 62593 57857 52121 50570 56247 56230 46169 42481
13698D2481N140L037j012j005j887q878k287j17M310M940P357J038q648q050K740
$$ 42481 47621 50658 49646 48641 46754 37876 35589 35472 39782 44722 52079 53117 44469 36419 39159
13683C9159O336J598K283N275Q36j955k82J495l292n452n0L751l191n052N552
$$ 39159 45495 47093 49376 54651 55487 53532 53250 54745 51453 46001 45951 49702 46511 41459 47011
13668D7011Q844M386K902L515m874k342q95l513J118R111k094k711l959l866n57
$$ 47011 55855 60241 63143 66658 61784 59442 58547 55034 56152 65263 63169 60458 56499 52633 52076
13653E2076m018M549J350jJ801l722j362q88K338O259K559p684n184J53J1324
$$ 52076 48058 52607 53957 53956 55757 52035 50673 49785 52123 58382 60941 53257 48073 48226 59550
13638E9550J917m29k280m979j801M504Q052O370R80m933j688K355j41m28M057
$$ 59550 61467 61038 58758 53779 51978 56482 64534 70904 71884 66951 65263 67618 67477 67049 71106
13623G1106N048o537m012l854l955p701Q216J0801R359J11m388l40j380N085l16
$$ 71106 76154 69617 65605 61751 57796 50095 58311 69112 78471 78582 74194 73854 72474 77559 77243
13608G7243l571J156k014m895l772J958K271o08n105N65O129q00L486P343P121
$$ 77243 73672 74828 72814 67919 64147 66105 68376 67768 62663 63228 69357 68557 72043 79386 86507
13593H6507Q787J4823N501j1311p577q6R206N359j350m986j404l05l016j2210
$$ 86507 95294 110117 115618 104307 96730 96644 105850 111209 109859 104873 103469 103164 100148 87938
13579H7938r783l588K912M867J0465J1259O638J2003L06j1233j215O794K694j411
$$ 87938 78155 74567 77479 82346 92811 104070 110708 122711 123017 111784 110569 117363 120057 118646
13565A18646n671J639l110L231Q894J850l991j2452j2499L531P541P609Q968J435
$$ 118646 112975 114614 111504 114735 123629 125479 121488 109036 96537 100068 107609 115218 124186 125621
13551A25621R480J31j91p265m470o487L348K456k744M888M289J784j4M577L875
$$ 125621 135101 135232 135041 127776 123306 116819 120167 122623 119879 124767 129056 130840 130826 135403 139278
13536A39278O579J1127J1111J1313Q485L060O577J562j298q294j0259K561P636
$$ 139278 145857 156984 168095 179408 187893 190953 197530 199092 197794 189500 179241 181802 189438
13523A89438j585J0902M666l953j924L291M559J2150J2617J1707O724K731N402
$$ 189438 187853 198755 203421 199468 197544 200835 205394 217544 230161 241868 248592 251323 256725
13510B56725L952J215J742K585O776N084P693K886P86n43J1220J6909J2156R695
$$ 256725 260677 261892 263634 266219 272995 278079 285772 288658 289444 288901 300121 317030 329186 338881
13496C38881P233L267R307J5411K4889K9049L6018N4674P0673O7528K7719p657
$$ 338881 346114 349381 358688 374099 398988 428037 464055 518729 589402 656930 684649 676992
13484F76992k2549j6026N616K5738L3273N1591N3062P8278R6099J09390J47305
$$ 676992 654443 638417 644033 669771 703044 754635 807697 885975 982074 1091464 1238769
13473A238769K17070L40829N41904Q75725J390672J947491J843505N13640r34964
$$ 1238769 1455839 1796668 2338572 3214297 4604969 6552460 8395965 8909605 7974641
13464G974641j600280j252162o23308j42463K55775P35837J399186K303216L071820
$$ 7974641 6374361 5122199 4498891 4356428 4612203 5348040 6747226 9050442 12122262
13455A2122262K544879N99862r10822q77491K94572O88010k15539j031932p06409
$$ 12122262 14667141 15267003 14356181 13478690 13773262 14461272 14245733 13213801 12507392
13446A2507392Q86982K971313L777968J057075k645019m516424l672303j965955
$$ 12507392 13394374 16365687 20143655 21200730 18555711 14039287 10366984 8401029
13438H401029q02875l9771O05434J366001K406577L763270M731595L397201k12845
$$ 8401029 7598154 7558383 8163817 9529818 11936395 15699665 20431260 23828461 23615616
13429B3615616l152615l725273k227405k97484J698060M175519P463312J0265826
$$ 23615616 20463001 16737728 14510323 14212839 15910899 20086418 27549730 37815556
13421C7815556P527108k10769n614786n065767M79297O643551J0846525R677237
$$ 37815556 45342664 45131895 39517109 34451342 34930639 41574190 52420715 62097952
13413F2097952M918030K152711K269565p5462o855081j2332737j2782196r360906
$$ 62097952 67015982 69168693 71438258 71362796 64507715 52174978 39392782 30031876
13405C0031876n870230l528472k031523r62922j3793J041402K453452M575448
$$ 30031876 24161646 20633174 18601651 17638729 17624936 18666338 21119790 25695238
13397B5695238P705903J1552332J3744223J0075468K836082j561320j570250k739390
$$ 25695238 33401141 44953473 58697696 68773164 71609246 70047926 68477676 65738286
13389F5738286p422945j0496980q763993l137927K994887O853521L117105m821016
$$ 65738286 58315341 47818361 39054368 35916441 38911328 45764849 48881954 44060938
13381D4060938r848822r168588n466133k628081o30850J202759L013287L778604
$$ 44060938 34212116 25043528 19577395 16949314 16318464 17521223 20534510 24313114
13373B4313114J633349k091177m550344m528190l088394j814344r67653l51731
$$ 24313114 25946463 23855286 19304942 14776752 11688358 9874014 8906361 8554630
13365H554630L11043J258300K684617M374118M140142M24476k892494l769032
$$ 8554630 8865673 10123973 12808590 17182708 21322850 21747326 18854832 15085800
13357A5085800j893321J98319J243128P57734k99902n72522L40726J228873K16045
$$ 15085800 13192479 13390798 14633926 15391660 15091758 14519236 14859962 16088835 16304880
13348A6304880j813774l048663k802529j825837j027486m84187m6305M03188R25305
$$ 16304880 14491106 11442443 8639914 6814077 5786591 5302404 5256099 5659287 6584592
13339F584592J468464J392849R8993j348269k013802j675907j068194o58651m33462
$$ 6584592 8053056 9445905 9544898 8196629 6182827 4506920 3438726 2780075 2346613
13330B346613l03198k34936j75690j45235j25127j09090r4311p5894n7131l1626
$$ 2346613 2043415 1808479 1632789 1487554 1362427 1253337 1159026 1083132 1026001 994375
13320I94375j3930n435m462l5911o6417p2853o3238m9381m4344l5874l6368k9762
$$ 994375 980445 975010 970548 934637 868220 795367 732129 682748 638404 602530 566162 536400
13308E36400k9993l1971k6111j9553j5003r812j1991j8028j6158k1727j2921o062
$$ 536400 506407 474436 448325 428772 413769 403957 391966 373938 357780 336053 323132 317070
13296C17070j3580j3689j0600o616k495n409J272L537m104j492L206j3862k1791
$$ 317070 303490 289801 279201 272585 270090 264681 265953 269490 265386 263894 267100 253238 231447
13283B31447o754k261m037q801r427n080p565o790j1383l361k162k914l211K676
$$ 231447 224693 222432 218395 209594 200167 195087 187522 180732 169349 165988 163826 160912 157701 160377
13269A60377N987K482p181Q57o017j0589m911O221M996L756L814p79l585r419
$$ 160377 166364 168846 161665 162522 156505 145916 141005 147226 152222 155978 159792 159013 155428 146009
13255A46009o719j0405j1091q760j584J540Q338k556K126L374m755r640j4016
$$ 146009 139290 128885 117794 109034 107450 108990 117328 114772 116898 120272 115517 105877 91861
13242I1861l237K683L991m348k390j300J495n185p840n615q791l08J3846J8823
$$ 91861 88624 91307 95298 90950 88560 87260 88755 83570 75730 70115 61324 61016 74862 93685
13228I3685J0352l968j654O865j12j2923n689p023p440o223p752J520M877P92
$$ 93685 104037 100069 98415 105280 105168 92245 86556 79533 72093 65870 58118 59638 64515 65307
13214F5307J316k242l961o470K208m938L074M876P453Q670J413k694r483n551
$$ 65307 66623 64381 60420 53950 56158 51220 54294 59170 66623 75293 76706 74012 64529 58978
13200E8978P24q32j0016p124l00J27P977k632k141n764J122P78K867M762N23q529
$$ 58978 59702 58870 48854 41730 41430 41557 49534 46902 44761 38997 40119 40897 43764 48526 49049 40520
13184D0520q273L019Q696K195j2783q64L262k756l727N820L970R28R71j129P2
$$ 40520 32247 35266 43962 46157 33374 32510 35772 33016 29289 35109 39079 40007 40978 39849 39921
13169C9921M377M006k34j278n634p303k262L394K401M835l908m798M626N309K148
$$ 39921 44298 48304 48070 46792 41158 33855 31593 34987 37388 42223 38315 33517 38143 43452 45600
13154D5600l338L209J327r15o047m353K745l359k490Q543N372k365k947k685j096
$$ 45600 42262 45471 46798 45883 39836 35483 38228 34869 32379 40922 46294 43929 40982 38297 37201
13139C7201Q57j436k677K437j1688o849J5267N237p595p264J18L759M732K194
$$ 37201 38058 36622 33945 36382 24694 17845 33112 38349 30754 23490 23608 27367 32099 34293
13125C4293l881P07l264j675k560n030q60k584P238M752K644M478P724j67L681
$$ 34293 30412 31119 27855 26180 23620 18590 17730 15146 22384 27136 29780 34258 41982 41815 45496
13110D5496l826j2467l999K266M232q70P249L403l01L646m172o924j0645k753
$$ 45496 41670 29203 25204 27470 31702 30832 38081 41484 41183 44829 40657 33733 23088 20335
13096B0335k132M243K648r6K482p58L142L67n48J0221L33p861k080j1269m073
$$ 20335 18203 22446 25094 24998 27480 26722 29864 30231 29683 39904 40237 32376 30296 19027 14954
13081A4954P58L064K017L826K31n795M09K313K731M567P665k940q953n986K062
$$ 14954 15712 18776 20793 24619 24850 19055 19464 21777 24508 29075 36740 33800 24847 18861 20923
13066B0923J739K478j073r025l756J649m833L33J778O500O60m978n343o251K158
$$ 20923 22662 25140 24067 15042 11286 12935 8102 8435 10213 16713 17373 12395 7052 801 2959
13051B959O561O355o40o673k248m137M894M989K399K255Q236N303K025K629m811
$$ 2959 9520 15875 15235 8562 6314 2177 7071 12060 14459 16714 24950 30253 32278 34907 30096
13036C0096o650K630K213M4l041K461Q937L435L338j383O19l571j0754q931k428
$$ 30096 23446 26076 28289 28333 25292 27753 36690 40125 43463 42080 42699 39128 28374 19443 17015
13021A7015M917L107j470J304K518p08j354p836K228O756l647m663j21n436M466
$$ 17015 21932 25039 23569 24873 27391 26683 25329 17493 19721 26477 22830 18167 18046 12610 17076
13006A7076Q315l493K383Q537O350M687M013Q844L41j0177j1050k445L949N415
$$ 17076 25391 21898 24281 32818 39168 43855 47868 56712 57053 46876 35826 33381 37330 42745
12992D2745R618M268O165Q358J0147J6411J3585J5160K2065M1432N0561M0585
$$ 42745 52363 56631 62796 71154 81301 97712 111297 126457 148522 189954 240515 281100
12980B81100n751m0618m8095m4028l1301k0127j2556n343J950M299J6118K0697
$$ 281100 275349 234731 186636 142608 111307 91180 78624 73281 75231 79530 95648 116345
12968A16345K9761K9171J694k1514j3509r429j4316l112O194P529J7922L1802
$$ 116345 146106 175277 176971 155457 141948 132519 118203 115091 121285 128814 146736 178538
12956A78538L1346K6156O555j5468k7293k9592k2160j0150K094P052J2699J5833
$$ 178538 209884 236040 242595 227127 199834 170242 148082 137932 140026 147078 159777 175610
12944A75610N486k3762l4816j9220j3281j0833L72o98k364K81J5172K9555M5318
$$ 175610 181096 157334 122518 103298 90017 79184 79556 78858 76494 76775 91947 121502 166820
12931A66820O3399O5390O4197N3334K3003j7682o5473q2114o0208m0362l0568
$$ 166820 230219 295609 359806 413140 436143 418461 352988 270874 210666 170304 139736
12920A39736j3262k0989j1452j043N310J4988K7249K7971J2249p895k9345k2137
$$ 139736 126474 105485 94033 92990 98300 113288 140537 168508 180757 172862 143517 121380
12908A21380j8487r042m124J0550J3325K7806M3020L8238J2006j4303l2174k9983
$$ 121380 102893 93851 89727 100277 113602 141408 184428 222666 234672 220369 188195 158212
12896A58212k7740j5221j2573M797J9422K2981K1720r534l3757k9522j3090j1897
$$ 158212 130472 115251 102678 107475 126897 149878 171598 162064 128307 98785 85695 73798
12884G3798p862K882p177k901Q773J4572K0320L4084N1245L4420O308k1017l7329
$$ 73798 65936 68818 61641 58740 67513 82085 102405 136489 187734 222154 228462 207445 170116
12871A70116m1136l7896k4586j964m370p124j1315p655q144q475L625N81p146
$$ 170116 128980 91084 66498 64534 60164 53040 41725 34070 25926 17451 21076 21657 14511
12858A4511n18k523o721k758L919k585j816M694J1941M33q236J606K461R26k865
$$ 14511 13993 11470 4749 1991 5910 3325 1509 6203 18144 18577 10341 11947 14408 15334 12469
12843A2469o220m799K366j961j360m871K998K168L279j288K148J401o313j970
$$ 12469 6249 1450 3816 1855 495 -4376 -1378 790 4069 2781 4929 6330 17 -1953
12829a953J846l448N158j801k251m95O160j877k978r65J140N220N252K782n048
$$ -1953 -107 -3555 1603 -198 -2449 -2944 3216 1339 -1639 -2604 -1464 3756 9008 11790 6742
12814F742o393O943N779R053k945r137n248r87Q356K256n939o183J8m968n865
$$ 6742 349 7292 13071 22124 19179 10042 4794 3807 12163 14419 8480 2297 2315 -2653 -8518
12799h518N56l43K985N34O611M048l38N591O596n877p754m039L139m558m095m38
$$ -8518 -7962 -8305 -5320 -4786 1825 5873 5535 11126 17722 11845 4091 52 3191 -1367 -5462 -5900
12783e900j167O52M964k448j261L992O599l95l666o311n06l98j652O85N773K681
$$ -5900 -7067 -6415 -1451 -3899 -5160 -1168 5431 5036 1370 -4941 -5447 -5845 -7497 -6812 -1039 1642
12767A642L98l350r91k631j647m37L412N372J50J169J237k52m477l981j877K911
$$ 1642 2040 -1310 -2301 -4932 -6579 -7016 -3604 1768 1918 3087 4324 4072 -405 -4386 -6263 -3352
12751c352L050m90j625K12L011j446o159J666J4971L991q121l778J12R49j770
$$ -3352 -302 -792 -2417 -2205 806 -640 -6799 -5133 9838 13829 5708 1930 2042 2991 1221
12736A221Q05l465O144L516M90k261p13J203M466O098K8l084o602j956l564n019
$$ 1221 2026 -1439 4705 8221 8711 6450 5737 6940 11406 17504 17532 14448 7846 5890 2326 -2693
12720b693m8M965O553o177j471L033q71n5N033n984l721k106Q501L076m655j442
$$ -2693 -2741 2224 8777 2600 1129 4162 3291 3236 8269 2285 -1436 -3542 4959 8035 3380 1938
12704A938k865k238J04N216K029J881L827m296j763K068l620n780L639J117l37
$$ 1938 -927 -3165 -3061 2155 4184 6065 9892 5596 3833 5901 2281 -3499 140 1257 920
12689I20J866J489j800n326q015M337L103J1364K881k976R21j122N53p4m318k371
$$ 920 2786 4275 2475 -2851 -10866 -6529 -3426 7938 10819 7843 8764 7642 8195 8121 3803 1432
12673A432L459k00j76M810Jk069k684k862j601O99j985j257L70l288O623j5j508
$$ 1432 4891 4691 4515 9325 9326 7257 4573 1711 110 809 -1176 -2433 -2063 -5351 1272 1257 -251
12656b51K477k761l188k135l557K974J400M318l578J631O468O678j959o526J007
$$ -251 2226 -535 -3723 -5858 -9415 -6441 -5041 -723 -4301 -2670 3798 10476 8517 1991 2998
12641B998J273n774n62L25M03N07N7p31n582J933L114K85l230L161n683n337j720
$$ 2998 4271 -1503 -2065 -1740 -1337 -830 -773 -1504 -7086 -5153 -2039 -1754 -4984 -1823 -7506 -12843 -14563
12624a4563J195K931O00K492K61M467M197j521q915n154L592R01M020M705N796
$$ -14563 -13368 -10437 -9837 -7345 -7084 -2617 1580 59 -8856 -14010 -10418 -9517 -5497 -792 5004
12609E004l016J851N459j12L665m955j0885K264J401K411r78j30o422m943P982
$$ 5004 1988 3839 9298 9186 12851 7896 -2989 -725 676 3087 2109 1979 -4443 -9386 -1404
12594a404O673m881m84j0062m306j928P19L091M98P14j128r97l801J1711J323
$$ -1404 5269 388 -96 -10158 -14464 -16392 -15673 -12582 -12084 -11370 -12498 -13495 -17296 -5585 -4262
12579d262j922R48K971k255o058O168J170k366k930J624J521Q200M545k046o920
$$ -4262 -6184 -5236 -2265 -4520 -10578 -4410 -3240 -5606 -8536 -6912 -5391 2809 7354 5308 -1612
12564a612M111L843K647j541m350j54J559M63o204J368K333jj767M291m665L023
$$ -1612 2499 6342 8989 7448 3098 2944 4503 4966 -1238 130 2463 2462 695 4986 321 3344
12548C344k256L292N639J537m479n849o632p310K077O40l771Q29R215R703O529
$$ 3344 1088 4380 10019 11556 7077 1228 -5404 -12714 -10637 -9997 -13768 -12939 -3724 5979 12508
12533A2508n290k260p01N174l208j1613o687R47K367Q8j255M044L616J906M409
$$ 12508 7218 4958 4257 9431 6223 -5390 -12077 -11130 -8763 -8675 -9930 -5886 -2270 -364 4045
12518D045P342K128m584k00m799k587l700n950O048r05n415R50l89K373L213L477
$$ 4045 11387 13515 8931 8731 3932 1345 -2355 -8305 -2257 -3162 -8577 -7627 -8016 -5643 -2430 1047
12502A047J529l323m016K21m468l895l41P333O568p10o70P7k206o405N417l25
$$ 1047 2576 -747 -4763 -4542 -9010 -12905 -13246 -5913 655 -55 -725 -648 -2854 -9259 -3842 -4167
12486d167L7K194N612J003j1356o477M824O351L240M44j023n890l699N315P511
$$ -4167 -4130 -1936 3676 4679 -6677 -13154 -8330 -1979 1261 1705 682 -5208 -8907 -3592 3919
12471C919N03l865q72m519J274N732j391j71J667O075j031k741k137j847O56K294
$$ 3919 4422 557 -315 -4834 -3560 2172 781 610 2277 8352 7321 4580 2443 596 1252 3546
12455C546l703K572r37r047j057r13N96O470O393M674m160p212r183j045Q649
$$ 3546 -157 2415 1478 -7569 -8626 -9539 -8943 -2473 3920 8594 4434 -2778 -11961 -13006 -4357
12440d357N298m63M042O134k358l693m362J648l061n559J896M335K637O318p450
$$ -4357 941 478 4520 10654 8296 4603 241 1889 -1172 -6731 -4835 -500 2137 8455 1005
12425A005o005j120K921M039j717j942P044L85l789m949m240k808K521m17m899
$$ 1005 -5000 -6120 -3199 840 -877 -2819 4225 4610 821 -4128 -8368 -11176 -8655 -9072 -13971
12410a3971L023L740L409m764K536k784N042M125J828j817q788j640L935P338
$$ -13971 -10948 -7208 -3799 -8563 -6027 -8811 -3769 356 2184 367 -8421 -10061 -6126 1212
12396A212L169n993j991l274J550q65N135j102j925M392j928j105m932m055l71
$$ 1212 4381 -1612 -3603 -6877 -5327 -6192 -1057 -2159 -4084 308 -1620 -2725 -7657 -11712 -12083
12381a2083N667N989K363J550P252N752K317k124l918m202J814M354Q79k206q625
$$ -12083 -6416 -427 1936 3486 10738 16490 18807 16683 12765 8563 10377 14731 15610 13404 4779
12366D779k017L967r06n59j964K075j870o651k249O022m776q045L412N562p47
$$ 4779 2762 6729 5823 5264 3300 5375 3505 -3146 -5395 627 -4149 -12194 -8782 -3220 -3967
12351c967K682O214r301n327M304P252M580m56l72k954j154N108M274p76K6n874
$$ -3967 -1285 4929 -4372 -9699 -5395 1857 6437 5981 5609 2655 1501 6609 10883 10107 10133 4259
12335D259r086n271Q917J529m477o274O89M933M118K127O2r88j395k051K023L411
$$ 4259 -4827 -10098 -1181 348 -4129 -10403 -9714 -4781 -663 1464 1526 538 -857 -2908 -885 2526
12319B526n512J353N341Q641M515p858j0314l356k365m935j563L061j101j161
$$ 2526 -2986 -1633 3708 12349 16864 9006 -1308 -4664 -7029 -11964 -13527 -10466 -11567 -12728
12305a2728M140N639m04k431J11O147Q834O751l569j0933j2783L280N391L244
$$ -12728 -8588 -2949 -3353 -5784 -5673 474 9308 16059 12490 1557 -11226 -7946 -2555 689
12291F89K227J133k031P55K821m100k360o919J501k482m066K009J0389N03J605
$$ 689 2916 4049 2018 2773 5594 1494 -866 -7785 -6284 -8766 -12832 -10823 -434 69 1674
12276A674L709j487N85r19M137r474n710j48L255L555m488N384J989l29k001M783
$$ 1674 5383 3896 4481 3562 7699 -1775 -7485 -7633 -4378 -823 -5311 73 2062 1733 -268 4515
12260D515R390n19m799k79m702n849J26L732k893j312J456l571j471k337J223
$$ 4515 13905 13386 8587 8308 3606 -2243 -2117 1615 -1278 -2590 -1134 -4705 -6176 -8513 -7290
12245g290n609L883K548L987N263L012m340l781P02L65P110M618k867j542n294
$$ -7290 -12899 -9016 -6468 -2481 2782 5794 1454 -2327 -1625 -1260 5850 10468 7601 6059 765
12230G65l981O904P281q249k770r70k946k762l048j071j407J097K855O435r39
$$ 765 -3216 3688 10969 2720 -50 -1020 -3966 -6728 -9776 -10847 -12254 -11157 -8302 -1867 -2806
12215b806L573L821m87m621L73M006K400O8n063k832J873k48L126m30O85Q63l482
$$ -2806 767 4588 4101 -520 -147 3859 6259 6327 1264 -1568 305 57 3183 2753 3438 4301 819
12198H19m979L484O838m180o871j393L264l79p546r63P841R981J657n014j086
$$ 819 -4160 -676 6162 1982 -4889 -6282 -3018 -3397 -10943 -11906 -4065 5916 7573 2559 1473
12183A473J361k475n613r57n764j707O177P492L031m182J650q39j096k36O63k722
$$ 1473 2834 359 -5254 -6211 -11975 -13682 -7505 -13 3018 -1164 486 -353 -1449 -1685 -1022 -3744
12167c744J172J185l038L6O140O503J096p213L378K904k243r47o306p557r99L867
$$ -3744 -2572 -1387 -4425 -4389 1751 8254 9350 2137 5515 8419 6176 5229 -1077 -8634 -9633 -5766
12151e766J088J734L889J267L958J911o954k201N684J781L561j395p549j1655
$$ -5766 -4678 -2944 945 2212 6170 8081 1127 -1074 4610 6391 9952 8557 1008 -10647
12137a0647J962K037M959j044K592m177K859O074j813o304O318P772j965p348
$$ -10647 -8685 -6648 -1689 -2733 -141 -4318 -1459 4615 2802 -3502 2816 10588 8623 1275
12123A275L31N900J77r2m74n665j0550k818J0490M352O42j907n59J633m384J47
$$ 1275 1606 7506 7683 7591 7117 1452 -9098 -11916 -1426 2926 3568 1661 1102 2735 -1649 -1502
12107a502M04K032k98m099N04m22o05p73n40k333N601Q013j90l369o323j716m647
$$ -1502 -1098 934 636 -3463 -2959 -3381 -3986 -4759 -5299 -7632 -2031 5982 5792 2423 -3900 -5616 -10263
12090a0263L916N594l137J427L501j259k168l918k017J964P203J088o630N435
$$ -10263 -6347 -753 -3890 -2463 1038 -221 -2389 -6307 -8324 -6360 843 1931 -4699 736
12076G36L371l65j954K885l633j996L297K647j877k98m55k399k217O458M179q051
$$ 736 4107 3742 1788 4673 1040 -956 2341 4988 3111 2813 2358 -41 -2258 4200 8379 328
12060C28q157k350k052p11L718Q055M55n064O766j781o529m578O583P447J455
$$ 328 -7829 -10179 -12231 -12942 -9224 -1169 -714 -5778 988 -793 -7322 -11900 -5317 2130 3585
12045C585q690k984P124K522m301K445L20m007J683R271j332q944K565M272M108
$$ 3585 -5105 -8089 -965 1557 -2744 -299 21 -3986 -2303 6968 5636 -3308 -743 3529 7637
12030G637O050n983j1615m764M39L135J826J765N43L024K677k861p16M12j704
$$ 7637 13687 7704 -3911 -8675 -8236 -5101 -3275 -1510 -967 2057 4734 1873 1157 1569 -135
12015a35M155L52j389O44k012n757m953q566l029O186J919L028R582r00M645N541
$$ -135 4020 4372 2983 3627 1615 -4142 -9095 -17661 -20690 -14504 -12585 -9557 25 -875 3770 9311
11999I311m856p338l891P278O629j332j824k261M074M05m243k701K629K689J157
$$ 9311 4455 -2883 -6774 504 7133 5801 3977 1716 5790 6195 1952 -749 1880 4569 5726
11984E726M424k63j55M773j958n144l8n408j250j296j815k413o19J479N978J847
$$ 5726 10150 9887 9732 14505 12547 7403 7365 1957 707 -589 -2404 -4817 -5436 -3957 2021 3868
11968C868R93m380Q63q531M76J599J505K330J136K91N753j601K972L246K276m784
$$ 3868 4861 481 1344 -7187 -6711 -5112 -3607 -1277 -141 150 5903 4302 7274 10520 12796 8012
11952H012k048J114M933k623k459L87r014n109j761J826m58L276N194j71j275
$$ 8012 5964 7078 12011 9388 6929 7316 -1698 -6807 -8568 -6742 -7200 -3924 1270 1099 -176
11937a76m260J004o871k299P897Q992K082o391L726L965R56l588q793J307k199
$$ -176 -4436 -3432 -10303 -12602 -4705 4287 6369 -22 3704 7669 8625 5037 -3756 -2449 -4648
11922d648k003L923o656n148O251P889j468J875m850p843O868O048p00l561j050
$$ -4648 -6651 -2728 -9384 -14532 -8281 -392 -1860 15 -4835 -12678 -5810 238 -462 -4023 -5073
11907e073K907N77p14J808j761k803M881M884k62j2281j435O419K43k426j593
$$ -5073 -2166 -1589 -2303 -495 -2256 -5059 -178 4706 4444 -7837 -9272 -2853 -2610 -5036 -6629
11892f629p43j728q61N934M008K664O56j040p181n247K061O309P158L581J927
$$ -6629 -7372 -9100 -9961 -4027 -19 2645 3301 2261 -4920 -10167 -8106 -1797 5361 8942 10869
11877A0869n998m365k487J501K055M844j178k706l003j525l316K648M644p349
$$ 10869 4871 506 -1981 -480 1575 6419 5241 2535 -468 -1993 -5309 -2661 1983 -5366
11863e366R76Q88O797J645k873L467N437l869j01l622k320J281j726o517l587
$$ -5366 -4390 -3502 3295 4940 2067 5534 10971 7102 7001 3379 1059 2340 614 -5903 -9490
11848i490k629L930N188p28K499P375P696j732o578l725N09J292k956k146k293
$$ -9490 -12119 -8189 -3001 -3729 -1230 6145 13841 12109 5531 1806 2315 3607 651 -1495 -3788
11833c788l560k305j967N560P09j400N50K499J149p10O930J456j587j918q92K061
$$ -3788 -7348 -9653 -11620 -6060 -5351 -6751 -6201 -3702 -2553 -3263 3667 5123 3536 1618 726 2787
11817B787l504m248M611l349j945l512n187L899P517L27M642O11m972K344j605
$$ 2787 -717 -4965 -354 -3703 -5648 -9160 -14347 -10448 -2931 -2604 2038 2649 -2323 21 -1584
11802a584M077O096M492n619j0628K129J639Q9P901p49J7p064K542j272r63j687
$$ -1584 2493 8589 13081 7462 -3166 -1037 602 691 8592 7843 7860 796 3338 2066 1103 -584
11786e84P87Q806K147n229K596M181q490p746n415J953L453O52j61r683Q253R620
$$ -584 203 9009 11156 5927 8523 12704 4214 -3532 -8947 -6994 -3541 -2889 -3050 -12733 -4480 5140
11770E140K273l163L446k404n905j02Q562K018m345k637L179N758k826m401j841
$$ 5140 7413 4250 7696 5292 -613 -715 7847 9865 5520 2883 6062 11820 8994 4593 2752
11755B752J683J360j299l99L68r72m507m107l248J443J3442m128q214m806N215
$$ 2752 4435 5795 4496 4097 4465 3493 -1014 -5121 -8369 -6926 6516 2388 -5826 -10632 -5417
11740e417K647j325j503L467N713K486m691o662q994j679L334L351J959m807J393
$$ -5417 -2770 -4095 -5598 -2131 3582 6068 1377 -5285 -14279 -15958 -12624 -9273 -7314 -12121 -10728
11725a0728P174N721Q44n030o582N380P214j88J108k319k758q699L77R528n51
$$ -10728 -3554 2167 3011 -2019 -8601 -3221 3993 3805 4913 2594 -164 -8863 -8486 1042 491
11710D91j209j126K353R560J804r751J680K44M267k498r603l69K578M953O279
$$ 491 -718 -1844 509 10069 11873 2122 3802 4046 8313 5815 -3788 -4157 -1579 3374 9653
11695I653k488p09R13j793j391l814n223K385K21J22o129k354K143K849m858R35
$$ 9653 7165 6456 7369 5576 4185 371 -4852 -2467 -2246 -2124 -8253 -10607 -8464 -5615 -10473 -9538
11679i538J3521L004j363K511o384m608j137Q751M728q85j594J241l183p326m375
$$ -9538 3983 6987 5624 8135 1751 -2857 -3994 4757 9485 8600 7006 8247 5064 -2262 -6637
11664f637J844M412j095l039K702K114j351j540o56M792k369M252N685J311j496
$$ -6637 -4793 -381 -1476 -4515 -1813 301 -1050 -2590 -3246 1546 -823 3429 9114 10425 8929
11649H929r277n066L721O146N975m853l893J470L739j04l431k276P716L628o074
$$ 8929 -348 -5414 -1693 4453 10428 5575 1682 3152 6891 6787 3356 1080 8796 12424 6350
11634F350j472M496k826m689k307O95K494K459K824L571r33l170n74L855O90q774
$$ 6350 4878 9374 6548 1859 -448 247 2741 5200 8024 11595 10662 7492 6918 10773 11463 2689
11618B689j0648j042O416M556m854J26Q372M07j038M050m9K028m179j939r190
$$ 2689 -7959 -9001 -2585 1971 -2883 -2757 5615 6022 4984 9034 8985 11013 6834 4895 -4295
11603d295m244P731n48o642l088K481j098L135m4K197N598l282j965L426P74M32
$$ -4295 -8539 -808 -1356 -7998 -11086 -8605 -9703 -6568 -6612 -4415 1183 -2099 -4064 -638 136 568
11587E68l223n910J479L912P473L854o525l876Q543N064j870m769N778p522P25
$$ 568 -2655 -8565 -7086 -3174 4299 8153 1628 -2248 6295 11359 9489 4720 10498 2976 3701
11572C701m518j764O65L839O76K964J210j844K990k168j377n658j558k119N90
$$ 3701 -817 -2581 -1916 1923 2599 5563 6773 4929 7919 5751 4374 -1284 -2842 -4961 -4371
11557d371o303m212M686J961L200K580O624N24n785k264K834K33j681P073O142
$$ -4371 -10674 -14886 -10200 -8239 -5039 -2459 4165 4689 -1096 -3360 -526 -293 -1974 5099 11241
11542A1241M16k877l130R22l231n398j573l203J966K854L237k489o74J225J791
$$ 11241 11657 8780 5650 6572 3341 -2057 -3630 -6833 -4867 -2013 1224 -1265 -1939 -714 1077
11527A077K18l176O112N812k785l93N747k424j2149q348K396K400K191K937n607
$$ 1077 1295 -1881 4231 10043 7258 6865 12612 10188 -1961 -10309 -7913 -5513 -3322 -385 -5992
11512e992O217l323J974j118K912l833K0k376N709J377n891m218r9M295J1270
$$ -5992 225 -3098 -1124 -2242 670 -3163 -3143 -5519 190 1567 -4324 -8542 -8641 -4346 6924
11497F924Q78j3681m697N323M994O773k464l101L913p08L845O52J71q990l547
$$ 6924 7802 -5879 -10576 -5253 -259 6514 4050 949 4862 4154 7999 8651 8822 -168 -3715
11482c715N36P444L864q2m994K82L263N864N78l953n040l754L329K528l836k750
$$ -3715 -3179 4265 8129 8047 3053 3335 6598 12462 13040 9087 4047 293 3622 6150 2314 -436
11466d36K456J156k84l950K354k899P307R994K655r289n000J80K473p050o85J965
$$ -436 2020 3176 2892 -1058 1296 -1603 5704 15698 18353 9064 4064 4244 6717 -333 -1018 947
11450I47o45j104m453k194L419l87P351J3352n66m977l875o49p547k891Q756L311
$$ 947 302 -802 -5255 -7449 -4030 -4417 2934 16286 15720 10743 6868 6219 -1328 -4219 4537 7848
11434G848m524m192M02l400m381J431q02j816L562K476L116L051M993q64o224
$$ 7848 3324 -868 -466 -3866 -8247 -6816 -7618 -9434 -5872 -3396 -280 2771 7764 6900 676
11419F76L842n082K151O305M107k264j813N904K82j0953j946L235l73J549M70
$$ 676 4518 -564 1587 7892 11999 9735 7922 13826 14108 3155 1209 4444 4071 5620 6090
11404F090l434l101Q8O280Q747o434l952L47j928K370l034j213N130N514k418
$$ 6090 2656 -445 -357 5923 14670 8236 4284 4631 2703 5073 2039 826 5956 11470 9052
11389I052m439K008j883j877J0912P8j089J741o61m921k878l135k878Q723J621
$$ 9052 4613 6621 4738 2861 13773 13851 12762 14503 13842 8921 6043 2908 30 8753 10374
11374A0374j805l472K884L214k073l240l233m340j50J502j496p341J374K265M519
$$ 10374 8569 5097 7981 11195 9122 5882 2649 -1691 -1841 -339 -1835 -9176 -7802 -5537 -1018
11359a018J059l740n222N09m661N079J0377N769o26M078j645o019k81N164n228
$$ -1018 41 -3699 -8921 -8412 -13073 -7994 2383 8152 7526 11604 9959 3940 3659 8823 3595
11344C595m025K53J612j552j054K294N178p188j983Q815p49o422j239M580k163
$$ 3595 -430 -177 1435 -117 -1171 1123 6301 -887 -2870 5945 5196 -1226 -2465 2115 -48
11329d8P59J257k372P90N827m58j1755M65l005m734J0781N448K736J535n595N51
$$ -48 711 1968 -404 386 6213 5755 -6000 -5535 -8540 -13274 -2493 2955 5691 7226 1631 2182
11313B182R23M255L04o507L984k322o735k898K105J622O839L946r454o128O253
$$ 2182 3105 7360 7664 1157 5141 2819 -3916 -6814 -4709 -3087 3752 7698 -1756 -7884 -1631
11298a631M65j244m387m546O30n20J120p83O215m699K427Q121P741J070k365j392
$$ -1631 -1166 -2410 -6797 -11343 -10713 -11233 -10113 -10896 -4681 -9380 -6953 1168 8909 9979 7614 6222
11282F222o270k555K218k716l022R468n298l438O206J17o739o19N526l859o59
$$ 6222 -48 -2603 -385 -3101 -6123 3345 -1953 -5391 815 932 -5807 -6426 -900 -4759 -5418
11267e418l77M499j046K452j957o162k385L703J0150J096J099j42K960k640j105
$$ -5418 -5795 -1296 -2342 110 -1847 -8009 -10394 -6691 3459 4555 5654 5512 8472 5832 4727
11252D727N574Q44o650m987L790M718M528N37j2991k955N73m451O362L067J750
$$ 4727 10301 11145 4495 -492 3298 8016 12544 13081 90 -2865 -2292 -6743 -381 2686 4436
11237D436P99N58m256j338K515M494q684j1895l35J021n621J220P107R631O139
$$ 4436 5235 5793 1537 199 2714 7208 -1476 -13371 -13706 -12685 -18306 -17086 -9979 -348 5791
11222E791p728k320n55R11o69K730M548M761m75J047l346j741K180K19k834J42
$$ 5791 -1937 -4257 -4812 -3901 -4570 -1840 2708 7469 6994 8041 4695 2954 5134 5353 2519 2661
11206B661P15l359N211j222J166o436m775K306O11J980q38n103N426M673L645
$$ 2661 3376 17 5228 4006 5172 -1264 -6039 -3733 -3122 -1142 -1980 -7083 -1657 3016 6661
11191F661j181q9L01m129n198p243Q297J1801n365m596J749K228L672K347l161
$$ 6661 5480 5391 5692 1563 -3635 -10878 -2581 9220 3855 -741 1008 3236 6908 9255 6094
11176F094j84M381J610k396k038L383N416q19L361l218q536M18N815L302k234
$$ 6094 5910 10291 11901 9505 7467 10850 16266 15447 18808 15590 7054 7472 13287 16589 14355
11161A4355M084j071J781r63r76j962j2704p988J700O003J300j585N575N85k967
$$ 14355 18439 17368 19149 18186 17210 15248 2544 -5444 -3744 2259 3559 1974 7549 8134 5167
11146E167q000n659R86L344K793K282R19q866J571M850p777N204Q967J600L120
$$ 5167 -2833 -8492 -7506 -4162 -1369 913 1832 -7034 -5463 -613 -8390 -3186 5781 7381 10501
11131A0501n851k417J345O295K939n096r67k881K662P357p69L37n98k085n194
$$ 10501 4650 2233 3578 9873 12812 7716 6749 3868 6530 13887 13118 13455 12857 10772 5578
11116E578j125k641l536J404K071q97m430k83j623n628j178J2470N329R042N501
$$ 5578 4453 1812 -1724 -320 1751 854 -3576 -3859 -5482 -11110 -12288 182 5511 14553 20054
11101B0054n996j257r95l848R54K247N189M678K400M70k36j935k819J195q3l232
$$ 20054 14058 12801 11806 7958 8912 11159 16348 21026 23426 23896 23660 21725 18906 20101 20018 16786
11085A6786K930L774j523M526k139l949R191J235j4355j5404k761L021m328p160
$$ 16786 19716 23490 21967 26493 24354 20405 29596 30831 16476 1072 -1689 1332 -2996 -10156
11071a0156m865K616M701K02L053K294O192J0261J8287J9675J0349o31j0003m778
$$ -10156 -15021 -12405 -7704 -7502 -4449 -2155 4037 14298 32585 52260 62609 61978 51975 47197
11057D7197l390o22q676j4402j3275q602N15R959K605j603k493J430k043O91N278
$$ 47197 43807 43185 34509 20107 6832 -1770 -1255 8704 11309 9706 7213 8643 6600 7291 12569
11042A2569Q172Q65l230k199O510J1113L963L384j2342r259n959m367Q195K030
$$ 12569 20741 21606 18376 16177 22687 33800 37763 41147 28805 19546 13587 9220 17415 19445
11028A9445q84J335J968K882L599k829J964n154j264R204Q576L830L093N555R39
$$ 19445 18561 19896 21864 24746 28345 25516 27480 22326 21062 30266 38842 42672 45765 51320 52259
11013E2259N666N570J0813J8691K7142L1700O1374J04925J77766L00476M57540
$$ 52259 57925 63495 74308 92999 120141 151841 213215 318140 495906 796382 1253922
11002A253922M62079N4447l24275m89001l60365j90879j08950p1033m3382l1743
$$ 1253922 1716001 1770448 1446173 957172 596807 405928 296978 225945 182563 150820
10992A50820k5926k1451k1366j2645k020J660r94l060l911J752k241j0604j491
$$ 150820 124894 103443 82077 69432 67412 69072 68078 65018 61107 62859 60618 50014 48523
10979D8523L679j234P461q80j0023r210k808j1564q635J1967J328j079L276k28
$$ 48523 52202 50968 58429 57549 47526 38316 35508 23944 15309 27276 28604 27525 30801 30573
10965C0573j1050k658J093P65Q736N701O195R386l696p308Q24M260P584J022o960
$$ 30573 19523 16865 17958 18723 27459 33160 39355 48741 45045 37737 38561 42821 50405 51427 44467
10950D4467N1k754p320m3k933j5521j0090m163L960l611N181R087j42M554L140
$$ 44467 44518 41764 34444 34401 31468 15947 5857 1694 5654 2043 7224 16311 16169 20723 23863
10935B3863o050k538Q867J2935K626n337K118J309J696o344l260l230L164k660
$$ 23863 17813 15275 24142 37077 39703 34366 36484 37793 39489 33145 29885 26655 29819 27159
10921B7159J302N226m609r54M579J2871P982j073n43m432k6600k2450j0281K644
$$ 27159 28461 33687 29078 28124 32703 45574 53556 52483 51940 47508 20908 -1542 -11823 -9179
10907i179J233j130J372J762J3665J1057K151P622L969O76k095j1577j873K622
$$ -9179 -7946 -9076 -7704 -5942 7723 18780 20931 28553 32522 33198 31103 19526 17653 20275
10893B0275j089Q403M901R38K458o21Q327q68l479j963l276q269l819k86k953
$$ 20275 19186 27589 32490 33428 35886 35265 43592 42724 39245 37282 34006 25737 21918 21632 18679
10878A8679o1k075K476M525k835k559n227P627J260N426l120r61l365k516N809
$$ 18679 18618 16543 19019 23544 20709 18150 12923 20550 21810 27236 24116 23155 19790 17274 23083
10863B3083K839k057m385J320R427Q373M748J363m174r58p121l345P675M750N628
$$ 23083 25922 23865 19480 20800 30227 38600 43348 44711 40537 39579 32458 29113 36788 41538 47166
10848D7166N718p040o599n214N495K011m67l421r862j166P001K452N724J877n411
$$ 47166 52884 45844 39245 34031 39526 41537 41070 37649 27787 26621 33622 36074 41798 43675 38264
10833C8264l835o872L709j866l221m762j262N98j060j086Q503R481k605q60L457
$$ 38264 34429 27557 31266 29400 26179 21417 20155 20753 19693 18607 27110 36591 33986 33126 36583
10818C6583M805J0222O907M06m229n162k630o610j8989p380P403N98P255J3658
$$ 36583 41388 51610 58517 58923 54694 49532 46902 40292 21303 13923 21326 21924 29179 42837
10804D2837L211J497J5194J2748n119j3292j8842j0713o194J740J5496J4773q746
$$ 42837 46048 47545 62739 75487 70368 57076 38234 27521 21327 23067 38563 53336 44590
10791D4590j5738j6381j7165k4549j6909P768K1122K7245K0849J9333L1310M6633
$$ 44590 28852 12471 -4694 -29243 -46152 -38384 -17262 9983 30832 50165 81475 128108
10779A28108L1414l555k8229k6325j3548j304J7586J1125j9601m0380l5297j6726
$$ 128108 159522 155967 127738 101413 87865 86561 104147 115272 95671 55291 19994 3268
10767C268J5790K6922J4917N423O288J7837J6235J0170M917j564j6677j0527j2691
$$ 3268 19058 45980 60897 66320 72608 90445 106680 116850 121767 120203 103526 92999 80308
10754H0308j4239J4372Q172j2394j7121j784M204n346O494J1199J2523O713O605
$$ 80308 66069 80441 88613 76219 59098 57314 61518 56172 62666 73865 86388 93101 99706
10741I9706O582O241N740j3343k3223k0108l408O275j3957o427k723o592o805
$$ 99706 106288 112529 118269 104926 81703 61595 58187 64462 50505 44078 41355 34763 27958
10728B7958J979J2660O123Q57J1324K5641L1683K8531J5910M326m942O12Q414
$$ 27958 29937 42597 48720 49577 60901 86542 118225 146756 162666 166992 162050 162662 171076
10715A71076N261o453j3571j0838j2893j3844m494K906O901P066J0828P778M547
$$ 171076 176337 169884 156313 145475 132582 118738 114244 117150 124051 131117 141945 149723 154270
10702A54270N560L339J355j394j0142r656o27p79l422M953R032L594Q602m562
$$ 154270 159830 163169 164524 163130 152988 143332 142705 141926 138504 143457 152489 156083 164685 160123
10688A60123r083O155J499o584l899N412n469P998J0135K5625K3112J1483M066
$$ 160123 151040 157195 158694 152110 148211 153623 148154 156152 166287 191912 215024 226507 230573
10675B30573J684o43J558m100K265l072n449j0158J629N249Q347R070J5986K3602
$$ 230573 232257 231614 233172 229072 231337 228265 222816 212658 214287 219536 227883 236953 252939 276541
10661B76541K0860K0475L3657K3523J5382N235q64j711o250L009J5103K6350L1230
$$ 276541 297401 317876 351533 375056 390438 395673 394809 393098 386848 389857 404960 431310 462540
10648D62540L6811M2401N0589K7863Q252P352J0317Q455L1338O9964O7281M2530
$$ 462540 499351 541752 592341 620204 628456 635808 646125 654580 685918 755882 823163 865693
10636H65693L1937L8762M3521M3806M8835P9475J38348J58770J18854Q4555Q6084
$$ 865693 897630 936392 979913 1023719 1072554 1152029 1290377 1449147 1568001 1652556 1738640
10625A738640J31719K27200L36376M94876O73665Q67287P51590K78608J6156J08324
$$ 1738640 1870359 2097559 2433935 2928811 3602476 4469763 5221353 5499961 5516117 5624441
10615E624441M32615O71815R23849J273497J738280K422098L444992N259392Q341057
$$ 5624441 6057056 6728871 7652720 8926217 10664497 13086595 16531587 21790979 30132036
10606C0132036J3556788K3061976M0141587O7244483R3373145O1967954j9674837
$$ 30132036 43688824 66750800 106892387 174136870 267510015 329477969 309803132
10599C09803132p5842368q5557005n3539692k9605944j7443508j1048003p468178
$$ 309803132 233960764 148403759 94864067 65258123 47814615 36766612 29298434
10592B9298434n387174m060940l079362k371098j893943j541454j191812q60459
$$ 29298434 23911260 19850320 16770958 14399860 12505917 10964463 9772651 8912192
10584H912192n93830l08767j59507m67600p63847q59130o76891n06428m27452
$$ 8912192 8318362 8009595 7850088 7382488 6618641 5759511 5082620 4576192 4148740
10575D148740m03990l66465k76781j90216j40103j43318j63798j73366j47539
$$ 4148740 3744750 3378285 3101504 2911288 2771185 2627867 2464069 2290703 2143164
10566B143164j30965j23636j15581q7597n9458o3293q2407q8729q3488q4004o4273
$$ 2143164 2012199 1888563 1772982 1685385 1625927 1562634 1480227 1391498 1308010 1224006 1159733
10555A159733n1479m0285k6776l2377l2060m4351m4586n2969m9895n4718m4652
$$ 1159733 1108254 1067969 1041193 1008816 976756 932405 887819 834850 784955 730237 685585
10544F85585k0443r923j4756k398j0918j3552j1089k1393k1560k7269k6332j6858
$$ 685585 665142 655219 640463 638065 627147 613595 602506 581113 559553 532284 505952 489094
10532D89094j3811j4202j8416j8021k0327k6630k8612j5550n769P827J4908J2285
$$ 489094 475283 461081 442665 424644 404317 377687 349075 333525 327756 335583 350491 362776
10520C62776m946k5634k4003j7644q726o559m598j4674j4427j6174p481P255O452
$$ 362776 357830 332196 308193 290549 281823 275264 270666 255992 241565 225391 217910 225165 231617
10507B31617J997j1892k6518j2264p318j8495l380l565r805q68M856q81L599J263
$$ 231617 233614 221722 195204 182940 175622 157127 153747 150182 140377 139509 144365 143484 147083 148346
10493A48346m860l337p137j1971k7993k1847j5357n325m881q615n033M056L659
$$ 148346 143486 140149 133012 121041 93048 71201 55844 50519 45638 37023 31990 36046 39705
10480C9705K4692M7659M1710J5898P162j0076o161O62n76j614J4009K6295R519
$$ 39705 64397 112056 153766 169664 176826 166750 160589 161251 160675 159061 173070 199365 208884
10467B08884o939j9437k5543l4001k9346j4586n315L248O831P621M35M704P130
$$ 208884 201945 182508 156965 122964 93618 79032 73717 76965 83796 91417 91852 96556 103686
10454A03686p060j6259n955j0151M484J6301K2998J1368j6598j8165q541j3517
$$ 103686 96626 80367 74412 64261 68745 85046 108044 119412 102814 84649 76108 62591
10442F2591r794m464M846N068R174L613J357J9306K5496J0499j7476m1077l9487
$$ 62591 52797 48333 53179 58247 67421 71034 72391 91697 117193 127692 110216 69139 29652
10429B9652k0911O902J4361m545k4969l5361j8050J0858K7435K4169K3258J7149
$$ 29652 8741 15643 30004 25459 490 -34871 -52921 -42063 -14628 9541 32799 49948
10417D9948L6375L2583J8788L177k2548k2675j6031j1307j2036L983P777o21r505
$$ 49948 86323 118906 137694 140871 118323 95648 79617 68310 56274 60257 68034 67413 57908
10404E7908j1305j4530j4440j0193l689j111Q137Q078J0280J6058N660L587J656
$$ 57908 46603 32073 17633 7440 3751 2640 10777 18855 29135 45193 50853 54440 56096
10391E6096j0144j5252j0754p779q07J0249L938M078m004n337L776j312K666K107
$$ 56096 45952 30700 19946 12167 11360 21609 25547 29625 25621 20284 24060 22748 25414 27521
10377B7521Q522N885j402K127o360r117o151K199O69j248j418j650j998K305M774
$$ 27521 36043 41928 40526 42653 36293 27176 21025 23224 23893 22645 21227 19577 17579 19884 24658
10362B4658N148K738K62j486l491k734q80m188m32M44J564L113O355L597P47l990
$$ 24658 29806 32544 32806 31320 27829 25095 24215 20027 19595 20039 21603 24716 31071 34668 35415 31425
10346C1425q143j049k673l492j592p27L437L304O430j515J576J835L064l229p873
$$ 31425 23282 22233 19560 16068 14476 13749 17186 20490 26920 25405 26981 28816 31880 28651 20778
10331B0778o155O746R812K383j074J947n731m114j395k69p76M599N382K636l668
$$ 20778 14623 21369 31181 33564 32490 34437 28706 24592 23197 22928 22152 26751 32133 34769 31101
10316C1101o266n26j1541n140r42Q055J57j261L948O114L735%J350j1152m021
$$ 31101 24835 24309 12768 7628 6686 14741 14898 13637 17585 23699 27434 27434 28784 17632 13611
10301A3611O265n102M687J0784J0584P105m395L6l359q11r381k1101k0715q098
$$ 13611 19876 14774 19461 30245 40829 47934 43539 43575 40216 39405 30024 8923 -11792 -19890
10287a9890J1978J6337J3410N51j929m845P67K068K302j932O05M280m036m754
$$ -19890 -7912 8425 21835 22386 20457 15612 16379 18447 20749 18817 19422 23702 19666 14912
10273A4912k005J972n433j362N600N530k257j023j533K900L250k854l767O605
$$ 14912 12907 14879 9446 8084 13684 19214 16957 15934 14401 17301 20551 17697 13930 20535
10259B0535R07R08m608L174J30l991j868j344q70k672J407K827P408k496r068
$$ 20535 21442 22350 17742 20916 21046 17055 15187 13843 12973 10301 11708 14535 21943 19447 10379
10244A0379N199N992o314K622j679q27n496o714R687Q395K571j420P81O891n380
$$ 10379 15578 21570 15256 17878 16199 15372 9876 3162 12849 21244 23815 22395 23176 30067 24687
10229B4687M176O184j533r723r928k654J710P542n17m029o72L407M053j658M918
$$ 24687 28863 35047 33514 23791 13863 11209 12919 20461 19944 15915 15243 18650 22703 21045 25963
10214B5963L061j251M229J870K164j741K432O710J4408J1686J2930J8930L1320
$$ 25963 29024 27773 32002 33872 36036 34295 36727 43437 57845 69531 82461 101391 132711
10201A32711M8478Q4903J40560K27450L76593N11959K99426j58521m51951m38281
$$ 132711 181189 266092 406652 634102 1010695 1522654 1822080 1663559 1211608 773327
10191G73327k68175j55025r5246n9835l6252k5669j8722j7478j8145j6971j4284
$$ 773327 505152 350127 254881 195046 158794 133125 114403 96925 78780 61809 47525
10180D7525o476j379O289r77l222k435j127k450m884m318p176o266q61k247n765
$$ 47525 41049 39670 45959 44982 41760 39325 38198 35748 30864 26546 19370 13104 12243 9996 4231
10165D231k209O02O290k384L787N080k41n83J0126O017J775p196p963L630Q009
$$ 4231 2022 2624 8914 6530 10317 15397 15156 14573 24699 30716 32491 25295 17332 20962 28971
10150B8971k227j297j3809j8430j1635k819l464j966q082j2429J777K3173K6743
$$ 28971 26744 25447 11638 -6792 -18427 -21246 -24710 -26676 -34758 -47187 -45410 -22237 4506
10137D506J5209N46r64J289j649K70J251q720k251Q647O982o638o447j6737j1877
$$ 4506 19715 20261 19297 20586 18937 19207 20458 11738 9487 18134 25116 18478 12031 -4706 -16583
10122a6583m405O135M775q07K096p40J142L654J0064j289r121j81J826L034J52
$$ -16583 -20988 -14853 -10078 -10885 -8789 -9529 -8387 -4733 5331 4042 -5079 -5260 -3434 -400 -248
10107b48n896O102N590L45J769J135P665l988p235k101O131M233q74l427R26P194
$$ -248 -6144 -42 5548 5893 7662 8797 16462 12474 5239 3138 9269 13502 12628 9201 10127 17321
10091A7321K485n098m986l251J233J57P026o919o515J327n416j367N500K435P32
$$ 17321 19806 14708 9722 6471 7704 7861 14887 7968 1453 2780 -2636 -4003 1497 3932 4664
10076D664p983j037L071M437K627R21r42j225k935n899N648J0667K099m732k198
$$ 4664 -3319 -4356 -1285 3152 5779 6700 5758 4533 1598 -4301 1347 12014 14113 9381 7183
10061G183m971m397M026L929K143L494J537k93l029M49j190j042k473K794R92
$$ 7183 2212 -2185 1841 5770 7913 11407 12944 12651 9622 10071 8881 7839 5366 8160 9152
10046I152l684o330o236l231O263M489K120j786k184M549L839J392L386J767N773
$$ 9152 5468 -862 -7098 -10329 -4066 423 2543 757 -1427 3122 6961 8353 11739 13506 19279
10031A9279k861m801l45m626J230L661q66k756M025J37k692n52N251K906l461
$$ 19279 16418 11617 11272 6646 7876 11537 10671 7915 11940 12077 9385 8833 14084 16990 13529
10016A3529p289K201Q72k903K085r65j1060k061O569K220k398K395l433m394j261
$$ 13529 6240 8441 9313 6410 8495 7530 -3530 -5591 978 3198 800 3195 -238 -4632 -5893
10001e893k664K881L389J923M821K544m737p088N594k481J004n51N537K515m137
$$ -5893 -8557 -5676 -2287 -364 4457 7001 2264 -4824 770 -1711 -707 -1258 4279 6794 2657
9986B657p709m581q16j363M830k131r18K448n42k510N665P965N412l239n745L844
$$ 2657 -5052 -9633 -10449 -11812 -6982 -9113 -10031 -7583 -8125 -10635 -4970 2995 8407 5168 -577 3267
9970C267N295L312o926l790K063j080r9q47P21l61m8k189m521p88L011P433R576
$$ 3267 8562 11874 4948 1158 3221 2141 2042 1195 1916 1555 1507 -682 -5203 -5991 -2980 4453 14029
9953A4029j789j037J114m133J987l152k14n813J584L525j358n579P78J139j543
$$ 14029 12240 11203 12317 8184 10171 7019 6805 992 2576 6101 4743 -836 -58 1081 -462
9938d62O71Q16m87J191j501M807J301Q6m645n44J534j98l725M167j946J056K085
$$ -462 209 1025 538 1729 228 5035 6336 6422 1777 1233 2767 2569 -1156 3011 1065 2121 4206
9921D206k945K419L945n669p414L296O616J830J910p452q372j022N29J824K110
$$ 4206 1261 3680 7625 1956 -5458 -2162 4454 6284 8194 742 -7630 -8652 -8123 -6299 -4189
9906d189R72J20K814O88K81K074R18J58o558k785Q28k848l739j960J0321J0938
$$ -4189 -3217 -3097 -283 405 686 2760 3678 3836 -2722 -5507 -4679 -7527 -11266 -13226 -2905 8033
9890H033M814O38l748m716K025l696l907K485O43K001k011K851M384m478R57m786
$$ 8033 12847 13485 9737 5021 7046 3350 -557 1928 2571 4572 2561 5412 9796 5318 6275 1489
9874A489l1J920r405j027N021N974K328j171l352q110q486K191R101L239J779
$$ 1489 1458 3378 -6027 -7054 -2033 3941 6269 5098 1746 -6364 -14850 -12659 -3558 -319 1460
9859A460k932L471K643l232n552P39N586O702k553J609k254n697J048l58n759
$$ 1460 -1472 1999 4642 1410 -4142 -3403 2183 8885 6332 7941 5687 -10 1038 680 -5079
9844e079n463j245R556Q747o492L525k032m342j028J308P625o11O782j920p454
$$ -5079 -10542 -11787 -2231 6516 24 3549 1517 -2825 -3853 -2545 5080 4469 11251 9331 1877
9829A877n731O908K203p859o846n15P476K585P84P431Q45m498o516m128O725K83
$$ 1877 -3854 3054 5257 -2602 -9448 -9963 -2487 98 882 8313 9158 4660 -1856 -5984 741 1024
9813A024n8j920K251J644J961k669n890m724l275P74N723K817K964k497l311N218
$$ 1024 966 -954 1297 2941 4902 2233 -3657 -8381 -11656 -10882 -5159 -2342 622 -1875 -5186 32
9797C2q07l527k383J871L961J962o856o458N731J777j685j484L401j15L467L883
$$ 32 -775 -4302 -6685 -4814 -853 1109 -5747 -12205 -6474 -4697 -6382 -7866 -4465 -4580 -1113 2770
9781B770l540k817k317M006J29J838K276l94l321N13K61l460N939K533j997j82
$$ 2770 -770 -3587 -5904 -1898 -1769 69 2345 1951 -1370 -857 -596 -4056 1883 4416 2419 2237
9765B237k147p093k148M218P099J546J640Q219m02n118L030j679j413J433J033
$$ 2237 90 -7003 -9151 -4933 2166 3712 5352 13571 13169 8051 11081 9402 7989 9422 10455
9750A0455k673j2627M022j456J438j59j608M32j063N922N671n66l002j689J049
$$ 10455 7782 -4845 -823 -2279 -841 -1000 -2608 -2176 -3239 2683 8354 7788 4786 3097 4146
9735D146p653p816q86J347j334m139M235K012P96J723N34O130k922o258J520j016
$$ 4146 -3507 -11323 -12209 -10862 -12196 -16335 -12100 -10088 -9292 -7569 -7035 -905 -3827 -10085 -8565 -9581
9719i581q485P746J165q96L906M345m62j454n347k104N231L353n466Q13J2836
$$ -9581 -18066 -10320 -9155 -10051 -6145 -1800 -2262 -3716 -9063 -11167 -5936 -2583 -8049 -7236 5600
9704E600M403k478m487k906O662N54J513N255n065o326O60J529k509M605l034
$$ 5600 10003 7525 3038 132 6794 7348 8861 14116 9051 2725 3385 4914 2405 7010 3976
9689C976n083L302N509m946n953l46N291M571K149p008n293K049K994L016m180
$$ 3976 -1107 2195 7704 2758 -3195 -3541 1750 6321 8470 1462 -3831 -1782 1212 4228 48
9674D8J370K775o544j092l948K95M173N51P729P535n84r027q50M039p79j1104
$$ 48 1418 4193 -2351 -3443 -7391 -7096 -2923 -2372 5357 12892 12308 3281 2431 6470 5691 -5413
9658e413J378J94k313m31N553k28k722L324O121P02j406L66m486J731n453O006
$$ -5413 -4035 -3841 -6154 -6585 -1032 -1260 -3982 -658 5463 6165 4759 5125 639 2370 -3083 2923
9642B923O417m541m422k083j846j037K15K923J574n40l92J508J835K254p79J983
$$ 2923 9340 4799 377 -1706 -3552 -4589 -4374 -1451 123 -417 -809 699 2534 4788 4009 5992
9626E992l553j027N928O549l875r733o688L056N763J330K334p356m638R628m5
$$ 5992 2439 1412 7340 13889 10014 281 -6407 -3351 2412 3742 6076 -1280 -5918 3710 3665
9611C665l239n254k624k84P865Q648m71q682k569j548k456K254J54K584K414R4
$$ 3665 426 -4828 -7452 -7736 129 8777 8306 -376 -2945 -4493 -6949 -4695 -4541 -1957 457 551
9595E51l207p772N493J993n011J161J310Q873P415l94m106o359l858n522k90M801
$$ 551 -2656 -10428 -4935 -2942 -7953 -6792 -5482 3391 10806 10412 6306 -53 -3911 -9433 -9723 -4922
9579d922l085J119l59N805J504J189J701j551n276j500J330K327l688O632K347
$$ -4922 -8007 -6888 -7247 -1442 62 1251 2952 1401 -3875 -5375 -4045 -1718 -5406 1226 3573
9564C573l885m40L240L110m289k339L086j539m951L703o43m610k696K420L917
$$ 3573 -312 -752 2488 5598 1309 -1030 2056 517 -4434 -731 -1374 -5984 -8680 -6260 -2343
9549b343L208l175K853K800n782O18o615n734O251K501K618l769J53k661p05O30
$$ -2343 865 -2310 543 3343 -2439 -1821 -8436 -14170 -7919 -5418 -2800 -6569 -6416 -9077 -9782 -9152
9533i152r5Q24n66N378J848Q711K716m513j273l279K477L737m120j802m470j839
$$ -9152 -9247 -8423 -8989 -3611 -1763 6948 9664 5151 3878 599 3076 6813 2693 891 -3579 -5418
9517e418J027p1J648k246M9N660k46k746p976n239L548P080L296j47O866l098
$$ -5418 -4391 -4462 -2814 -5060 -5011 649 403 -2343 -10319 -15558 -12010 -4930 -1634 -1781 5085 1987
9501A987n327l354o04K304m171M149Q387L493j328n917m9K062K059k110n343K059
$$ 1987 -3340 -6694 -7298 -4994 -9165 -5016 3371 6864 5536 -381 -430 1632 3691 1581 -3762 -1703
9485a703K01k055K481K80n343J529L195K635j583j896J881L518J026K356k587
$$ -1703 -1502 -3557 -1076 -796 -6139 -4610 -1415 1220 -363 -2259 -378 3140 4166 6522 3935
9470C935k546K075l143k591l03K023O808N217m038k723l854L843k240n055k564
$$ 3935 1389 3464 321 -2270 -2573 -550 6258 11475 7437 4714 860 4703 2463 -2592 -5156
9455e156O307L94l002p201k667O471J563j055j631K85J989Q699K033k608J237
$$ -5156 1151 1545 -1457 -8658 -11325 -4854 -3291 -4346 -5977 -5692 -3703 4996 7029 4421 5658
9440E658K416R1p135K489o594k486o629N144J1433N223N4K417o696J70j991k662
$$ 5658 8074 8165 1030 3519 -3075 -5561 -12190 -7046 4387 9610 9664 12081 5385 5555 3564 902
9424I02M930R28N807Q984j954m544n512q76m412q138K534p06J596k106K825K814
$$ 902 5832 6760 12567 21551 19597 15053 9541 8665 4253 -3885 -1351 -2057 -461 -2567 258 3072
9408C072j511n184l483Q538L878j814k804j444M130P682N378m798o4k666j089
$$ 3072 1561 -3623 -7106 1432 5310 3496 692 -752 3378 11060 16438 11640 11576 8910 7821
9393G821k002M215m183J411Q54J828j0J232J582j036l234o20o52n602o83j029
$$ 7821 5819 10034 5851 7262 8116 9944 9934 11166 12748 11712 8478 7858 7206 1604 921 -108
9377a08j064m02O647p93l305M051M004J035O060L962R85p34N722M937J337m698
$$ -108 -1172 -1574 5073 4280 975 5026 9030 10065 16125 20087 21072 20338 26060 30997 32334 27636
9361B7636m017j031J125k610L564P988j0036K46r11O51O750J820M423O907j315
$$ 27636 23619 22588 23713 21103 24667 32655 22619 22865 21954 22605 29355 31175 35598 42505 41190
9346D1190J687L549J0379Q369J7681J7752Q059L945J3419K9670L1296L2818L9625
$$ 41190 42877 46426 56805 65174 82855 100607 108666 112611 126030 155700 186996 219814 259439
9333B59439N2318P5061J28286K08485L27177N66130R63958J483151J558311L86224
$$ 259439 311757 386818 515104 723589 1050766 1616896 2580854 4064005 5622316 6008540
9323F008540r30319j572655j249812p32265m20090k64372j80571j23393r2622
$$ 6008540 5078221 3505566 2255754 1523489 1103399 839027 658456 535063 442441
9314D42441o5397n9261m5818l7633k1820j9513j9930j4009j7291j4793p128l772
$$ 442441 377044 317783 271965 234332 212512 192999 173069 159060 141769 126976 119848 116076
9302A16076m208j1563j3272j2740l686j852o855K407M190p745j7485p220M322
$$ 116076 111868 100305 87033 74293 70607 68755 61900 64307 68497 60752 43267 36047 40369
9289D0369K031j237K115K146p717o130o499n789o82M274K786o450K9j78J160k641
$$ 40369 42400 41163 43278 45424 37707 31577 25078 19289 18607 22881 25667 19217 19246 19068 20228 17587
9273A7587l659L05M123k448n292p02j213k488L022N664K689m219q466J924r06
$$ 17587 13928 14233 18356 15908 10616 9914 8701 6213 9235 14899 17588 13369 4903 6827 5921
9258E921J462p70o86j176N988L699j244o186j682j029k972j257N251N896j6l960
$$ 5921 7383 6613 5927 4751 10739 14438 13194 7008 5326 4297 1325 68 5319 11215 11199 7239
9242G239q195J02N098N477N883o44m221l799N42l026k30J330R65K470o357p46
$$ 7239 -956 -854 4244 9721 15604 14960 10739 6940 7482 4456 4226 5556 6521 8991 2634 1888
9226A888J976n506M738k21n768J407L493k364j397N38r40q45k53l067j386O843
$$ 1888 3864 -1642 3096 2875 -2893 -1486 2007 -357 -1754 -1216 -2156 -3001 -3254 -6321 -7707 -864
9210h64l510j269l715o99J02P345J592P622Q831m113n236J383J575j103N714k649
$$ -864 -4374 -5643 -9358 -10057 -9955 -2610 -1018 6604 15435 11322 6086 7469 9044 7941 13655 11006
9194A1006j997J786q738k69L93l675N174j264n623O25K937J720J299j360k89K568
$$ 11006 9009 10795 2057 1788 2181 -1494 3680 2416 -3207 -2582 355 2075 3374 2014 1725 4293
9178D293L453l174k512L66J104k411k273M228J912o329J880N09l167J78L755M568
$$ 4293 7746 4572 2060 2426 3530 1119 -1154 3074 4986 -1343 537 1046 -2121 -1943 1812 6380
9162F380Q42l48p85k167L68q473L589R28L201k199L893j017m050R70m944n166
$$ 6380 7222 6874 6089 3922 4290 -4183 -594 334 3535 1336 5229 4212 162 1132 -3812 -8978
9146h978o94L842L310Q192P421j430p5k032l015m848l795o02j651j643J851N546
$$ -8978 -9672 -5830 -2520 5672 13093 11663 11588 9556 6541 1693 -2102 -2704 -4355 -5998 -4147 1399
9130A399K247P99M187K162l154L641n529r904J105O590O393j012m815J426K296
$$ 1399 3646 4445 8632 10794 7640 11281 5752 -4152 -3047 3543 9936 8924 4109 5535 7831
9115G831K617L85J073l979j62l785L043K65J35K39j714j181o750K641J193j463
$$ 7831 10448 10833 11906 7927 7765 3980 7023 7288 7423 7662 5948 4767 -1983 658 1851 388
9099C88j247j63m31K318j94j958j367L691L761J25L38p81k449n981N141k998M33
$$ 388 -859 -1022 -1453 865 671 -1287 -2654 1037 4798 4923 5261 4480 2031 -3950 1191 -1807 -1374
9082a374M21r10L506M726K328l191J73J777p226k850J903l577k987K678m461L132
$$ -1374 -953 -1863 1643 6369 8697 5506 5679 7456 230 -2620 -717 -4294 -7281 -4603 -9064 -5932
9066e932M619k945p40M61L32O561j012n349j943M236K041j496n77J748j725l069
$$ -5932 -1313 -4258 -4998 -4537 -4205 2356 1344 -4005 -5948 -1712 329 -1167 -1744 4 -1721 -4790
9050d790L599N087j129P780K149K34m030o842J651M122j844K617l28L328r01m671
$$ -4790 -1191 3896 2767 10547 12696 12930 8900 2058 3709 7831 5987 8604 8276 11604 10703 6032
9034F032k876k328K49j362j952l850k112O324O74j938K121l085k74J459n88L335
$$ 6032 3156 828 1077 -285 -2237 -6087 -8199 -1875 -1201 -3139 -1018 -4103 -4377 -2918 -3506 -171
9018a71P95L897l203o158K905N969m625M96M997l018m132j250l59k684K551N714
$$ -171 624 4521 1318 -4840 -1935 4034 -591 -95 4902 1884 -2248 -3498 -3857 -6541 -3990 1724
9002A724j380P112J44j1204j462K154P787N19K289J33n480k123k606J485N183
$$ 1724 344 7456 7600 -3604 -5066 -2912 4875 5394 7683 7816 2336 213 -2393 -908 4275
8987D275K01m209n716K094N030O628J133j331m120K626L663n755o488l248P097
$$ 4275 4476 267 -5449 -3355 1675 8303 9436 8105 3985 6611 10274 4519 -1969 -5217 1880
8972A880M223M731l346p578k944k050N417J0147n384j0117J919R785j865m672
$$ 1880 6103 10834 7488 -90 -3034 -5084 333 10480 5096 -5021 -3102 6683 4818 146
8958A46O4M438K08o694n781O397M326m005Q43N098r62p387k258N070M411N88q698
$$ 146 210 4648 4856 -1838 -7619 -1222 3104 -901 -58 5040 4078 -3309 -5567 -497 3914 4502 -4196
8941d196Q94M659n70J653M680J408J350m170j764L574l908K393L022K268J921
$$ -4196 -3302 1357 787 2440 7120 8528 9878 5708 3944 7518 3610 6003 9025 11293 13214
8926A3214m027m356K997J497o177n619m892o140j925j033L196N612J609L615P186
$$ 13214 9187 4831 7828 9325 3148 -2471 -7363 -13503 -15428 -16461 -13265 -7653 -6044 -2429 4757
8911D757L871j2243J382K132j465R18l180n294R74M427K595l311J1898P865m005
$$ 4757 8628 -3615 -2233 -101 -1566 -648 -3828 -9122 -8148 -3721 -1126 -4437 7461 15326 11321
8896A1321j1503L160P86j1396m380J3323P799K004J014m472m374l435O629J2146
$$ 11321 -182 2978 3764 -7632 -12012 1311 9110 11114 12128 7656 3282 -153 6476 18622
8882A8622N959j958j0166m561n693J440k00o66L175M131L954K159l346k041K731
$$ 18622 24581 22623 12457 7896 2203 3643 3443 2777 5952 10083 14037 16196 12850 10809 13540
8867A3540M533K599N494P635P816J616M079R210J7553J1725J6639O936J42r000
$$ 13540 18073 20672 26166 33801 41617 43233 47312 56522 74075 85800 102439 109375 109517 100517
8853A00517j0397q535j2347j2563j3078n158J632l567p659p48L923J507P24n223
$$ 100517 90120 81585 69238 56675 43597 38439 40071 36504 28845 28097 32020 33527 34251 29028
8839B9028k570m457P115J2727P991O80J4995J1203J2447Q531N66k654l513p747
$$ 29028 26458 22001 29116 41843 49834 50514 65509 76712 89159 97690 98256 95602 92089 84342
8825H4342j6198j2193j4073j4181p699n350j565M47p26J752L769k80k757k166
$$ 84342 68144 55951 41878 27697 19998 14648 13083 13530 12804 14556 18325 18045 15288 13122
8811A3122K025m697k993l00o96L250p445p380Q835k244L509L114o538k381j241
$$ 13122 15147 10450 7457 7157 6461 9711 2266 -5114 3721 1477 4986 8100 1562 -819 -2060
8796b060J700L772j503r818p340N029J490M145J197J058M243k311p28J894q105
$$ -2060 -360 3412 1909 -7909 -15249 -10220 -8730 -4585 -3388 -2330 1913 -398 -1126 768 -7337
8781g337o639j58o78j356J244J0676O161j342K026o14N647P48k002j356o566k441
$$ -7337 -13976 -14134 -14812 -16168 -14924 -4248 1913 571 2597 1983 7630 8378 6376 5020 -1546 -3987
8765c987n37n960M870Q329P346M219p588q030j78j4j465l523K406J814j966Q068
$$ -3987 -4524 -10484 -5614 2715 10061 14280 6692 -1338 -1516 -1530 -2995 -6518 -4112 -2298 -4264 3804
8749C804J230r37l309M042L698o844o013o39K94M365q75L986M762m160m136l033
$$ 3804 5034 4097 788 4830 8528 1684 -4329 -4968 -4674 -309 -1184 2802 7564 3404 -732 -3765
8733c765J465K968K433l497J631J203l552l320o28O905M281j719k600j390J110
$$ -3765 -2300 668 3101 -396 1235 2438 -1114 -4434 -5062 1843 6124 4405 1805 415 1525
8718A525J983L136m578m535m529J53K832N872j657l225j933Q06L081L162o60n297
$$ 1525 3508 6644 2066 -2469 -6998 -6845 -4013 1859 202 -3023 -4956 -4150 -1069 2093 1433 -3864
8702c864Q12O632m435p510k460j04K885m59M013l622K063P138K527k817J660J851
$$ -3864 -3052 3580 -855 -8365 -10825 -10929 -8044 -8503 -4490 -8112 -6049 1089 3616 799 2459 4310
8686D310O52j0r32q593m860k538K167j278J586k558k278K07M767l730j821O21
$$ 4310 4962 4952 4020 -4573 -9433 -11971 -9804 -11082 -9496 -12054 -14332 -14125 -9358 -13088 -14909 -14288
8670a4288J941Q789Q485J473p4j491p59L846k469m478o54k673p602J482N81l890
$$ -14288 -12347 -3558 4927 6400 6326 4835 4076 7922 5453 975 321 -2352 -9954 -8472 -7891 -11781
8654a1781l98K149M128K696K927k103R30k040j681M646L538L140q6P5l239k202
$$ -11781 -12179 -10030 -5902 -3206 -279 -2382 -1452 -3492 -5173 -527 3011 6151 6065 6140 2901 699
8638F99m141N64k609K293N783K304K871o613p261J628K751q50M317P02m527J641
$$ 699 -3442 -2878 -5487 -3194 2589 4893 7764 1151 -6110 -4482 -1731 -2581 1736 2438 -2089 -448
8622d48l09L499K246o212O423N909m912n783K745P385P608K533j8986o870L327
$$ -448 -757 2742 4988 -1224 5199 11108 6196 413 3158 10543 18151 20684 1698 -5172 -1845
8607a845J49J44j193J376K258K058r9m028k44L121k299L734N141L066P05M361
$$ -1845 -1696 -1552 -2745 -1369 889 2947 2848 -1180 -1424 1697 -602 3132 8273 11339 12044 16405
8591A6405j792N76J762p5J455L746Q1J011M042M640N730J1119J2373N297o430
$$ 16405 14613 15189 16951 16876 18331 22077 22158 23169 27211 31851 37581 48700 61073 66370 59940
8576E9940n774o781j3057o870m66j24k50n18m606n406j870j270J925l737l036
$$ 59940 54166 47385 34328 27458 26992 26868 26618 26100 21494 16088 14218 12948 14873 11136 8100
8561H100l425O038Q271M001l480n948o093K021L672q99k964n51J1302P463K328
$$ 8100 4675 10713 18984 22985 19505 13557 7464 9485 13157 12258 9294 8743 20045 27508 29836
8546B9836J146N81M115N246Q299L798p56J725J9264K6680L2938N0936J02364J90359
$$ 29836 30982 31563 35678 40924 49223 53021 52265 53990 73254 99934 132872 183808 286172 476531
8532D76531L27674M56901K28838j77293m17251l57357j95070r8520o2276l5301
$$ 476531 804205 1261106 1489944 1312651 895400 538043 342973 244453 182177 146876
8522A46876k4439k0178j3156r886j1778O05j23l821r026k812o093m415m328L877
$$ 146876 122437 102259 89103 79217 67439 68044 67921 64100 55074 52262 46169 41754 37426 41303
8508D1303P381L554l514J012n466L21L372M122P977J5381K5023M2577N9726J12251
$$ 41303 48684 52238 48724 49736 44270 44591 47963 52085 60062 75443 100466 143043 202769 315020
8494C15020K10408L60086M31690J24603k38443m27443l14827j62372q2419n8870
$$ 315020 525428 885514 1317204 1441807 1203364 775921 461094 298722 216303 157433
8484A57433l8793k4664j5674n915j477m876p021n876m247l125m787j0691r972
$$ 157433 118640 93976 78302 72387 70910 66034 59013 53137 48890 45765 40978 30287 20315
8471B0315l828L371J83O570n809j0829r507J873L775K213l996L032N470j602l822
$$ 20315 16487 19858 20041 26611 20802 9973 466 2339 6114 8327 4331 7363 12833 11231 7409
8456G409r91k744L413n82k374O8m418k298o07M304P401k976K559K445M370L49
$$ 7409 6418 3674 7087 6505 4131 4199 -219 -2517 -3124 1180 8581 5605 8164 10609 14979 15328
8440A5328q120J066J965k175n913k575P900L449j1824K789o9o26r09M748M428
$$ 15328 7208 8274 10239 8064 2151 -424 7476 10925 -899 1890 1821 1195 286 5034 9462
8425I462R69o14M25p11M742k693o305J972m59L585j397n444j030o299Q81Q298
$$ 9462 10431 9817 10242 9531 14273 11580 5275 7247 6788 10373 8976 3532 2502 -3797 -2916 5382
8409E382O744L78n262q222k042k872k112L887J464M710J923j50m285M789m339
$$ 5382 12126 12504 7242 -980 -3022 -5894 -8006 -4119 -2655 2055 3978 3828 -457 4332 -7
8394gN079R575m826o126M319l516r804N852O923k822k922k87J730J171M296M208
$$ -7 5072 14647 9821 3695 8014 4498 -5306 546 7469 4647 1725 1438 3168 4339 8635 12843
8378A2843k133k843k70k517L86n320J156N499k083L411n956l847L874o11Q1J089
$$ 12843 10710 7867 7597 5080 5466 146 1302 6801 4718 8129 2173 -1674 2200 1589 1670 2759
8362B759R06M477J260l131N212j597m252m542l910l974R51N755q32n309j2413
$$ 2759 3665 8142 9402 6271 11483 9886 5634 1092 -2818 -6792 -5841 -86 -918 -6227 -18640
8347a8640l982P551J0637M775p792M37Q47n773J399L041N051N876J458l174m528
$$ -18640 -22622 -15071 -4434 341 -7451 -7014 -6167 -11940 -10541 -7500 -2449 3427 4885 1711 -2817
8332b817r219J901J3289R72o021L258j540o980k504L566j463l315L668p70J941
$$ -2817 -12036 -10135 3154 4126 -1895 1363 -177 -7157 -9661 -6095 -7558 -10873 -7205 -7975 -6034
8317f034j795k311j655J413l271M030P859J170J294q333N65J439J0596O314j119
$$ -6034 -7829 -10140 -11795 -10382 -13653 -9623 -1764 -594 700 -7633 -7068 -5629 4967 11281 10162
8302A0162J685k279j3452j223j866l248j335L91K661P61K972O686Q017n036n775
$$ 10162 11847 9568 -3884 -5107 -6973 -10221 -11556 -11165 -8504 -7743 -4771 1915 9932 4896 -879
8287h79k810Q181N9o962j979o020K670K907J456n543j554M580J455O531Q669M68
$$ -879 -3689 4492 4551 -2411 -4390 -10410 -7740 -4833 -3377 -8920 -10474 -5894 -4439 2092 10761 11229
8271A1229o568p354n502l241Q447j34M667K204O687j514j2789n615M990J213k915
$$ 11229 4661 -2693 -8195 -11436 -2989 -3123 1544 3748 10435 8921 -3868 -9483 -4493 -3280 -6195
8256f195N268K052J987o756j651J18M267J519l121K673L746J35j128n077j923
$$ -6195 -927 1125 3112 -3644 -5295 -5177 -910 609 -2512 161 3907 4042 2914 -2163 -4086
8241d086J889N555o60m43K550L610j642k058J791q569p09n6j768K807Q15N559
$$ -4086 -2197 3358 2698 2255 4805 8415 6773 4715 6506 -2063 -2772 -2828 -4596 -1789 -974 4585
8225D585n430m060p664j956o010M572O437j945M86L367P822r79l092Q38J544l161
$$ 4585 -845 -4905 -12569 -14525 -20535 -15963 -9526 -11471 -10985 -7618 204 -775 -3867 -3029 -1485 -4646
8209d646j757l589l853R405K231M13O770l754L636M5j106K27l025j310P170l482
$$ -4646 -6403 -9992 -13845 -4440 -2209 -1796 4974 1220 4856 4901 3795 4022 997 -313 6857 3375
8193C375p407r14K241L677J699k97j050l660l12m25l873J513N100M924j959n786
$$ 3375 -4032 -4946 -2705 972 2671 2374 1324 -2336 -2648 -3073 -6946 -5433 -333 4591 2632 -3154
8177c154K987m155k084j178Q175N448q209p033l840K578M068j338O102J810n926
$$ -3154 -167 -4322 -6406 -7584 591 6039 -2170 -9203 -13043 -10465 -6397 -7735 -1633 177 -5749
8162e749p843n369r533N011J2011K859J258k078o02N599L104J513K722k269M061
$$ -5749 -13592 -18961 -28494 -23483 -11472 -8613 -7355 -9433 -10035 -4436 -1332 181 2903 634 4695
8147D695m52Q89J976k776J167P07k89k835O240K388o101m726j60N596j678M513
$$ 4695 4243 5132 7108 4332 5499 6206 5917 3082 9322 11710 5609 883 723 6319 4641 9154
8131I154K222m31p797o889k977l081k109n61L774m374O8L090M881M461K976j870
$$ 9154 11376 10945 3148 -3741 -6718 -9799 -11908 -12469 -8695 -13069 -13001 -9911 -5030 -569 2407 537
8115E37K06k485O562J291j205J384n655L109J827p96l43n851k095p256P4J1365
$$ 537 743 -1742 4820 6111 4906 6290 635 3744 5571 4775 4432 -1419 -3514 -10770 -10696 669
8099F69K81j1528M05L947L570L326O422K683k485k968p98p951J365m25j946M415
$$ 669 950 -10578 -10173 -6226 -2656 670 7092 9775 7290 4322 3524 -4427 -3062 -3487 -5433 -1018
8083a018R108l619p604N434K741j0K665j799k079j641m076l36k704j11L379K264
$$ -1018 8090 4471 -3133 2301 5042 5032 7697 5898 3819 2178 -1898 -2234 -4938 -5049 -1670 594
8067E94k914l153o353O25Q131L631J523P40M636O10k528o887L498m12P656n527
$$ 594 -2320 -5473 -11826 -11201 -3070 561 2084 2824 7460 8070 5542 -1345 2153 1741 9397 3870
8051C870l403P971Q536J500j916q281p217o627N596L739J575k454L379L84L270
$$ 3870 467 8438 16974 18474 16558 8277 1060 -5567 29 3768 5343 2889 6268 6652 9922
8036I922N201p191j1631m043k34N727M275L926M7P96l19J203Q97o922M435L280
$$ 9922 15123 7932 -3699 -7742 -7976 -2249 2026 5952 5999 6795 6476 7679 8576 1654 6089 9369
8020I369p39m559J548k319o806l645k788R413Q345M44n06M174k296K642o22j0688
$$ 9369 8630 4071 5619 3300 -3506 -7151 -9939 -526 7819 8263 7757 11931 9635 12277 11655 967
8004I67j1905M605M996K731M979O434q6q170r455o789J471M537m7l60O466r7o008
$$ 967 -10938 -6333 -1337 1394 6373 12807 12721 4551 -4904 -11693 -10222 -5685 -5732 -6092 374 277 -5731
7987e731J062M590R320K461n898k278P156m091n046l671k22p99L908L481J530
$$ -5731 -4669 -79 9241 11702 5804 3526 10682 6591 1545 -2126 -2348 -3147 761 4242 5772
7972E772j0713l983J0667N519l698M13o23m671l761J265K986O34M10n515J180
$$ 5772 -4941 -8924 1743 7262 3564 3977 3354 -1317 -5078 -3813 -827 -193 217 -5298 -4118
7957d118R067p124j3139O932J1635O358J078j144L419N541p91r042p540m910l1
$$ -4118 4949 -2175 -15314 -8382 3253 9611 10689 9545 12964 18505 17714 8672 1132 -3778 -3809
7942c809J489n311l676L536K702j022K603j302p466K202P463J0297L148j683o528
$$ -3809 -2320 -7631 -11307 -7771 -5069 -6091 -3488 -4790 -12256 -10054 -2591 7706 10854 9171 2643
7927B643j283r48k180n073K044K809L983O974O880m184o817j119l046o282P18
$$ 2643 1360 412 -1768 -6841 -4797 -1988 1995 8969 15849 11665 4848 3729 683 -5599 -4881
7912d881J31m438J158N21M978Q24K020N130J344j963J884o401P04k208J809L57
$$ -4881 -4750 -9188 -8030 -7509 -2531 -1707 313 5443 6787 4824 6708 307 1011 -1197 612 969
7896I69m0J97o302M73M100r84O102K71o315p03n24j873r76O521l448m716n332
$$ 969 929 1126 -5176 -4703 -603 -1587 4515 4786 -1529 -2232 -2756 -4629 -5605 916 -2532 -7248 -12580
7879a2580J74J753P79P4P494P449L841j580j104l428k130n98p023N192k606j232
$$ -12580 -12406 -10653 -9874 -9800 -2306 5143 8984 7404 6300 2872 742 144 -6879 -1687 -4293 -5525
7863e525m218J8K932M371k512k647k586j220N229J227K06J699k695m436J77M603
$$ -5525 -9743 -9725 -6793 -2422 -4934 -7581 -10167 -11387 -6158 -4931 -4725 -3026 -5721 -10157 -9980 -5377
7847e377O012j893l456J218P538N517Q85k895j351k200L185K41p393J737l459
$$ -5377 635 -1258 -4714 -3496 4042 9559 10444 7549 6198 3998 7183 7424 31 1768 -1691
7832a691M34k843O425K199o12n009l014kK81o773K365Q051Q360L909P83j0159
$$ -1691 -1257 -4100 2325 4524 3912 -1097 -4111 -4113 -3832 -10605 -8240 -189 8171 12080 12863 2704
7816B704k665K13N294j369k266K891K238n19k960J144p078n028R595M050j436
$$ 2704 39 252 5546 4177 1911 4802 7040 6521 3561 4705 -2373 -7401 2194 6244 4808
7801D808n347l013k637m262q14L722L316P393P140O558q546j0891l638P249J307
$$ 4808 -539 -3552 -6189 -10451 -11265 -7543 -4227 3166 10306 16864 8318 -2573 -6211 1038 2345
7786B345o161r380m449Q412P202N918N87m216p321R38k552k846n71N29J3735O992
$$ 2345 -3816 -13196 -17645 -9233 -2031 3887 4474 258 -7063 -6125 -8677 -11523 -12094 -11565 2170 9162
7770I162m176q57j196r611j334K564J014q122L382M384K905O002L898k089q348
$$ 9162 4986 4129 2933 -6678 -8012 -5448 -4434 -12556 -9174 -4790 -1885 4117 8015 5926 -2422
7755b422p674N525M284l3r825k090P430O885K850N088o77k263k337j380N940k947
$$ -2422 -10096 -4571 -287 -320 -10145 -12235 -4805 2080 4930 10018 9341 7078 4741 3361 9301 6354
7739F354N53m8m360j619L910K670o190N86l18l681n56R559K303n431k518o050
$$ 6354 6907 6859 2499 880 4790 7460 1270 1856 1538 -2143 -2699 6860 9163 3732 1214 -4836
7723d836n735L76J471K761L458o33n583K048q0k736L129J0751O564j0254n457
$$ -4836 -10571 -10195 -8724 -5963 -2505 -3138 -8721 -6673 -6753 -9489 -6360 4391 10955 701 -4756
7708d756n85p82M68M255J0383J182p450p76J819P194p350m949L0J445K8l127l236
$$ -4756 -5341 -6123 -5655 -1400 8983 10165 2715 1939 3758 10952 3602 -1347 -1317 128 156 -2971 -6207
7691f207k030K570J472l939m772J551N206K440R46J23j484L234L516j835k797
$$ -6207 -8237 -5667 -4195 -8134 -12906 -11355 -6149 -3709 -2763 -2640 -4124 -890 2626 791 -2006
7676b006l137l423L397L881o202n138j660L666j188R777K776j750Q6m559q697
$$ -2006 -5143 -8566 -5169 -1288 -7490 -12628 -14288 -10622 -11810 -2033 743 -1007 -921 -5480 -14177
7661a4177J724L773J0422M324l101k355k178q68L226k201n03j991ok777J31O808
$$ -14177 -12453 -8680 1742 6066 2965 610 -1568 -2436 790 -1411 -1914 -3905 -3911 -6688 -6557 251
7645B51P232l187k389j748K463N126o19j85j772L547P49p651n762q826J655L160
$$ 251 7483 4296 1907 159 2622 7748 7129 6944 5172 8719 9468 1817 -3945 -12771 -11116 -7956
7629g956j079k693L561L763M373q253j258k250J818n38O013k118p05k8L110j564
$$ -7956 -9035 -11728 -8167 -4404 -31 -8284 -9542 -11792 -9974 -10512 -4499 -6617 -7322 -7350 -4240 -5804
7613e804L69J426N266o094m048O703L333L23K213M773o253J12Q17m137j617M96
$$ -5804 -5435 -4009 1257 -4837 -8885 -2182 1151 1474 3687 8460 2207 2319 3136 -1001 -2618 -2122
7597b122R06J478K67J611m003L93K054l594m558K361K713L912Q74m061p281k221
$$ -2122 -1216 262 529 2140 -1863 -1470 584 -3010 -7568 -5207 -2494 1418 2292 -1769 -9050 -11271
7581a1271R28N07l06M027L541j899q531o963N569J2398Q065J790L71j559l527
$$ -11271 -10343 -9836 -10142 -6115 -2574 -4473 -13004 -19967 -14398 -2000 6065 7855 8226 6667 3140
7566C140j144j038O37m396L8N084P028Q12K479l236p014l570n310J934P79K847
$$ 3140 1996 958 1595 -2801 -2763 2321 9349 10161 12640 9404 2390 -1180 -6490 -4556 -3777 -930
7550i30m533l64L157j700L238k118j776P452K995j588m732o448K15j991l051J118
$$ -930 -5463 -5827 -2670 -4370 -1132 -3250 -5026 2426 5421 3833 -899 -7347 -7132 -9123 -12174 -11056
7534a1056R01r86O044O616K557j408l447j884P02l402K773M24J47J682n475J811
$$ -11056 -10155 -11141 -5097 1519 4076 2668 -779 -2663 -1961 -5363 -2590 -2166 -2019 -337 -5812 -4001
7518d001o664p530N889J2479j355k281r57n72L194k64k172O201K025n479l792
$$ -4001 -10665 -18195 -12306 173 -1182 -3463 -4420 -4992 -1798 -2062 -4234 1967 3992 -1487 -5279
7503e279K531R000l447r516O06m868O80m527k757O998M93L625R407j393K499r345
$$ -5279 -2748 6252 2805 -6711 -6105 -10973 -10293 -14820 -17577 -10579 -10086 -6461 2946 1553 4052 -5293
7487e293n373J011Q937K859N65k66n044k981r79j290j863K59k099M077M159J1195
$$ -5293 -10666 -9655 -718 2141 2706 2440 -2604 -5585 -6564 -7854 -9717 -9458 -11557 -7480 -3321 7874
7471G874l644j6412k711J414l411P743R188j542k99m890J722O825O065m568l801
$$ 7874 4230 -12182 -14893 -13479 -16890 -9147 41 -1501 -1800 -6690 -4968 1857 7922 3354 -447
7456d47k235j393N53J079N403O807K273k236Q89m186m617k411m951O591K85l666
$$ -447 -2682 -4075 -3522 -2443 2960 9767 12040 9804 10693 6507 1890 -521 -5472 1119 1404 -2262
7440b262k091N427O014r64j689K99j833j116N462l642n180j589K514l341p450
$$ -2262 -4353 1074 7088 6124 4435 4734 2901 1785 7247 3605 -1575 -3164 -650 -3991 -11441
7425a1441j58L092n173J258O063k959J865L491N799j846m860K33K038m23M313
$$ -11441 -11599 -8507 -13680 -12422 -6359 -9318 -7453 -3962 1837 -9 -4869 -4636 -2598 -3021 1292
7410A292J769l136o204k241P710M47m25l262K803K552N450p864n928O165O827
$$ 1292 3061 -75 -6279 -8520 -810 -363 -788 -4050 -1247 1305 6755 -1109 -7037 -872 5955
7395E955L377m78l706j700n02l802L660j359L677j628o659j731N339M664p402
$$ 5955 9332 8854 5148 3448 2946 -856 2804 1445 5122 3494 -3165 -4896 443 5107 -2295
7380b295o22O459j349n992m909r49J809n289O897M090l860l873P100L164M21k779
$$ -2295 -2917 3542 2193 -3799 -8708 -9657 -7848 -13137 -6240 -2150 -6010 -9883 -2783 381 802 -1977
7364a977l781K199L458L761N807m5j0702m061o14J588M638k303p111P244o68M261
$$ -1977 -5758 -3559 -101 3660 9467 9422 -1280 -5341 -5955 -4367 271 -2032 -9143 -1899 -2567 1694
7348A694N408n510p961n897P780k310P474J933P65M309k375M18l436K993K950
$$ 1694 7102 1592 -6369 -12266 -4486 -6796 678 2611 3376 7685 5310 5728 2292 5285 8235
7333H235l188J249k330n600L826J698k197J79J173k817k570k211j538M502j789
$$ 8235 5047 6296 3966 -1634 2192 3890 1693 1872 3045 228 -2342 -4553 -6091 -1589 -3378
7318c378J31N869P841L493n560p926O55M957J235j874l433k701m77K620P648K677
$$ -3378 -3247 2622 10463 13956 8396 470 1125 6082 7317 5443 2010 -691 -1168 1452 9100 11777
7302A1777k198j078j925k308q54l427n483m722N015P633q32k452N247L429m800
$$ 11777 9579 8501 6576 4268 3414 -13 -5496 -10218 -5203 2430 1598 -854 4393 7822 3022
7287C022m554l204j499K849k66k973M498O85k569j42r51l534o342K182k185Q85
$$ 3022 -1532 -4736 -6235 -3386 -3652 -6625 -2127 -1442 -4011 -4153 -5104 -8638 -14980 -12798 -14983 -14098
7271a4098J908L534J046K614J58K529K472M681j52M580k90R63O350m380j0656
$$ -14098 -12190 -8656 -7610 -4996 -4838 -2309 163 4844 4692 9272 8982 9945 16295 11915 1259
7256A259k660K710o119m498k918k042m602l314R086J0369Q237q62L482M87k017
$$ 1259 -1401 1309 -4810 -9308 -12226 -14268 -18870 -22184 -13098 -2729 5508 4646 8128 8615 6598
7241F598n246L634L130K476n678R16J111k290p539n206N620J67l365J277j387
$$ 6598 1352 4986 8116 10592 4914 5830 6941 4651 -2888 -8094 -2474 -2307 -5672 -4395 -5782
7226e782M88k634M261R629M170R49p844n439P35L133O42j883m202j43m99L718
$$ -5782 -5294 -7928 -3667 5962 10132 11081 3237 -2202 -1467 1666 2308 425 -3777 -3920 -4419 -701
7210g01K070Q64l58j087n037L322N9m101L78O620l370k167k205j293J338O545
$$ -701 1369 2233 1875 788 -4249 -927 -868 -4969 -4591 2029 -1341 -3508 -5713 -7006 -5668 877
7194H77J467k901n159j532J421O807J010L050J675J902J713K103K33l183o696
$$ 877 2344 -557 -5716 -7248 -5827 980 1990 5040 6715 8617 10330 12433 12666 9483 2787
7179B787n818M498J156J142m047J501j718R21r25J401L853j862p124K065M242
$$ 2787 -3031 1467 2623 3765 -282 1219 -499 422 -503 898 4751 2889 -4235 -2170 2072
7164B072K157r334n87O008J607o413m895M330L588k801N066R84K874j137j0627
$$ 2072 4229 -5105 -5692 316 1923 -4490 -9385 -5055 -1467 -4268 798 1782 4656 3519 -7108
7149g108j0296K289p40P279J6337M439l397m953n070o295j665J3291K245L194
$$ -7108 -17404 -15115 -15855 -8576 7761 12200 8803 3850 -1220 -7515 -9180 4111 6356 9550
7135I550j1298p774J1807O619k91m330q687j986j920l56K939O192P065o975n094
$$ 9550 -1748 -9522 2285 8904 8613 4283 -4404 -6390 -8310 -8666 -5727 465 7530 555 -4539
7120d539O08o437L994j047K055r63O492J743J576p97q707RN794n230J42N674N832
$$ -4539 -3931 -10368 -6374 -7421 -5366 -6329 163 1906 3482 2685 -6022 -6013 -219 -5449 -5307 367 6199
7103F199j762p659l992J027L556Q110R50p390l529q578k794J266P084M299j105
$$ 6199 4437 -3222 -7214 -6187 -2631 5479 6429 -961 -4490 -13068 -15862 -14596 -7512 -3213 -4318
7088d318j825m056j46j400k413L998M417K033L311L492M423k48J641O62K81J798
$$ -4318 -6143 -10199 -10345 -11745 -14158 -10160 -5743 -3710 -399 3093 7516 7268 8909 9571 9852 11650
7072A1650r533j0158o626O40J248l458Q985M950J579j843j1300j607K330L246
$$ 11650 2117 -8041 -14667 -14027 -12779 -16237 -7252 -2302 -723 -2566 -13866 -15473 -13143 -9897
7058i897N533L570K67L500O650K93r664q958Q44J251J368p54n750Q7L307R370
$$ -9897 -4364 -794 -527 2973 9623 9916 252 -8706 -7862 -6611 -5243 -5997 -11747 -11660 -8353 1017
7042A017Q927O830p507n535o256j722l46K084o12J2503M597p347q02l964L589
$$ 1017 9944 16774 9267 3732 -2524 -4246 -4592 -2508 -3120 9383 13980 6633 5831 1867 5456
7027E456L715O294k839m766N116j692k784j563N437m000l628j653J615r62q96
$$ 5456 9171 15465 12626 7860 12976 11284 8500 6937 12374 8374 4746 3093 4708 3746 2850
7012B850J013l056J647o86m085J911m045k979P532k645K170l706k341k364K475
$$ 2850 3863 807 2454 1768 -2317 -406 -4451 -7430 102 -2543 -373 -4079 -6420 -8784 -6309
6997f309R058K540M540Q339n1m428M97q47o961o689q29P456L962l516n704k370
$$ -6309 2749 5289 9829 18168 18117 13689 14186 13339 6378 -311 -1140 6316 10278 6762 1058 -1312
6981a312P982N082o790l31q4j784p34M085K636m407j443r91M736l436J724K309
$$ -1312 6670 11752 4962 4631 4547 2763 2029 6114 8750 4343 2900 1909 6645 3209 4933 7242
6965G242l623m18j320P980m18k519J90j1420J737K93M54l089N161L420q72Q58
$$ 7242 3619 3201 1881 9861 9443 6924 7114 -4306 -2569 -2276 -1822 -4911 250 3670 2798 3656
6949C656r55K498q49n467l444j021J533L579Q800o373j0262R10m656J604K491
$$ 3656 2701 5199 4350 -1117 -4561 -5582 -4049 -470 8330 1957 -8305 -7395 -12051 -10447 -7956
6934g956M844L636l440j251K704n135M68J2277L694n765k621j256L441m764k385
$$ -7956 -3112 524 -2916 -4167 -1463 -6598 -6130 6147 9841 4076 1455 199 3640 -1124 -3509
6919c509K615L929n127l911K935k28P56J886j351m045J125l089J667n515l528
$$ -3509 -894 3035 -2092 -6003 -3068 -3296 -2540 -654 -2005 -6050 -4925 -8014 -6347 -11862 -15390
6904a5390l904N030J3598M657l371j146m18J570O278J636n951q915p539P519m66
$$ -15390 -19294 -14264 -666 3991 620 -526 -944 626 6904 8540 2589 -6326 -13865 -6346 -6812
6889f812k041j431M248J0417L64J358M053o943j0084L236P100p866j847j134J974
$$ -6812 -8853 -10284 -6036 4381 4745 6103 10156 3213 -6871 -3635 3465 -4401 -6248 -7382 -5408
6874e408M207l42K400k189j076Q83L822n051Q39O436j892j133K877Q43p157J425
$$ -5408 -1201 -1543 857 -1332 -2408 -1525 2297 -2754 -1915 4521 2629 1496 4373 5216 -1941 -516
6858e16l009n681P577J1575J944n945n284l488J246n834k314N348m9l099N523
$$ -516 -3525 -9206 -1629 9946 11890 5945 661 -2827 -1581 -7415 -9729 -4381 -4430 -7529 -2006
6843b006j77n792m032P363M173Q95O47J042j294k65O65J678j05P844M81M932O489
$$ -2006 -2183 -7975 -12007 -4644 -471 424 1071 2113 819 554 1219 2897 2792 10636 11117 16049 22538
6826B2538n571j668m548n06p826k659m675K690k095L362M704R59l635m564l779
$$ 22538 16967 15299 10751 10245 2419 -240 -4915 -2225 -4320 -958 3746 4705 1070 -3494 -7273
6811g273J507j430l125j613K798L307M330J340J636j344J951K215l268p106O760
$$ -7273 -5766 -7196 -10321 -11934 -9136 -5829 -1499 -159 1477 133 2084 4299 1031 -6075 685
6796F85L770rn443k229L687K915J60l659K819l857j879k494m100M10M244n445
$$ 685 4455 4446 -997 -3226 461 3376 3536 -123 2696 -1161 -3040 -5534 -9634 -9224 -4980 -10425
6780a0425l102K395j157J510O176J550l421j464K190j748L54J848j066P299j568
$$ -10425 -13527 -11132 -12289 -10779 -4603 -3053 -6474 -7938 -5748 -7496 -7142 -5294 -6360 939 -629
6765f29n16J796l194m38K027p32j0132k040L732N190N984l12j0050j031j733O231
$$ -629 -1145 651 -2543 -2981 -954 -1686 -11818 -13858 -10126 -4936 1048 736 -9314 -10345 -12078 -5847
6749e847O952M499p309k561L682K98o907j082L984O484L209L089k348m491k332
$$ -5847 1105 5604 -1705 -4266 -584 -286 -7193 -8275 -4291 2193 5402 8491 6143 1652 -680
6734f80l006j303M446L722n535O41J772o15l215n892j044O695J635m35J699r82
$$ -680 -3686 -4989 -543 3179 -2356 -1715 57 -558 -3773 -9665 -10709 -4014 -2379 -2814 -1115 -2097
6718b097M339N634o296p955p52L932N337M087K045r138r650J798K421o33J728
$$ -2097 2242 7876 1580 -6375 -7127 -3195 2142 6229 8274 -864 -10514 -8716 -6295 -6928 -5200
6703e200N726L522n641l178L380N24K379N382R24n535M63j519k064P665j455q08
$$ -5200 526 4048 -1593 -4771 -1391 -867 1512 6894 7818 2283 2746 1227 -837 6828 5373 4565
6687D565J615k006k816k135L429J044N280J698l143k252n339P090j227j378m49
$$ 4565 6180 4174 1358 -777 2652 3696 8976 10674 7531 5279 -60 7030 5803 4425 3976
6672C976r416p302M230J0907M183q698n574J99M100l366o32N668K467n668l540
$$ 3976 -5440 -12742 -8512 2395 6578 -2120 -7694 -7495 -3395 -6761 -7393 -1725 742 -4926 -8466
6657h466K669K149J409M09K246p26o300j0470J716J4601N921n99M85M536J029
$$ -8466 -5797 -3648 -2239 -1830 416 -310 -6610 -17080 -15364 -763 5158 4559 5044 9580 10609
6642A0609o356j853n154N156N640J112q283k019Q88N152j574K747J069p17P46
$$ 10609 4253 2400 -2754 2402 8042 9154 871 -1148 -260 4892 3318 6065 7134 6417 7163
6627G163l569l371q92Q922J1215k131k718r74k66k404J459K540j381K17o5m518
$$ 7163 3594 223 -669 8253 19468 17337 14619 13645 13379 10975 12434 14974 13593 13810 13745 9227
6611I227k326J292O61M422O800K024l622j0649N433J2035O903K421J2303K2670
$$ 9227 6901 8193 8854 13276 20076 22100 18478 7829 13262 25297 32200 34621 46924 69594
6597F9594L8727P3430J41573K16560J13618q1328j93241j60333p4097l6756k8390
$$ 69594 108321 181751 323324 539884 653502 572174 378933 218600 144503 107747 79357
6586G9357j9918k0586j2083P33k164m766l771N140l277j205J093m302J377R335
$$ 79357 59439 38853 26770 27503 25339 20573 16802 21942 18665 17460 18553 14251 15628 24963
6572B4963O727k232K203o406n26J66l993p123l817R70J380J468r52q424j836P826
$$ 24963 31690 29458 31661 25255 24729 24895 20902 13779 9962 10932 12312 13780 12828 4404 2568 10394
6556A0394P151l370l160l698q12o824l114K089Q285l123n303J812K270Q22l913
$$ 10394 17545 14175 11015 7317 6505 -319 -3433 -1344 6941 3818 -1485 327 2597 3419 -494
6541d94J649K575L962k961k163l894k704n076j2330P932J1716n335L516K018l80
$$ -494 1155 3730 7692 4731 2568 -1326 -4030 -9106 -21436 -13504 -1788 -7123 -3607 -1589 -1969
6526a969k939J227R76L2n978L18L299k70M99K043K085N789Q485q26l66l814l390
$$ -1969 -4908 -3681 -2705 -2673 -8651 -8333 -5034 -5304 -4805 -2762 -677 5112 13597 12771 12405 8591 5201
6509E201j586r26K859j247m609n885n87m88R594N166K022j2866n079Q127k033
$$ 5201 3615 2689 5548 4301 -308 -6193 -6780 -7268 2326 7492 9514 -3352 -8431 -304 -2337
6494b337n958k258k540r53O031K832K83o78k217Q953L390O09j1529k714P043O428
$$ -2337 -8295 -10553 -13093 -14046 -8015 -5183 -4900 -5578 -7795 1158 4548 5157 -6372 -9086 -2043 4385
6478D385M795m895q897j772k357k912L946J185M670Q022n61j482R71K247r117
$$ 4385 9180 4285 -4612 -6384 -8741 -11653 -7707 -6522 -1852 6170 5609 4127 5098 7345 -1772
6463a772o279L64L785L083j544m929k881L005K211q73J856l04m686K372L212J458
$$ -1772 -8051 -7687 -3902 -819 -2363 -7292 -10173 -7168 -4957 -5830 -3974 -4278 -8964 -6592 -3380 -1922
6447a922K125J7L423K038O407p645o654M881N693M547r486j5171j841O961J0025
$$ -1922 203 220 3643 5681 12088 4443 -2211 2670 8363 12910 3424 -11747 -13588 -6627 3398
6432C398m94m26k671k324k869n057m565L761n55m75O999J84j986j451l25k150
$$ 3398 2904 2478 -193 -2517 -5386 -10443 -15008 -11247 -11802 -12277 -5278 -5094 -7080 -8531 -8856 -11006
6416a1006L202j115j224J221P155q77k096Q38k613N3N418K829J163k220n815J1294
$$ -11006 -7804 -8919 -10143 -8922 -1767 -2644 -4740 -3902 -6515 -6462 -1044 1785 2948 728 -5087 6207
6400F207P760n505o414j691r23O218K092J99q75o944m204O874M070l133j809L688
$$ 6207 13967 8462 2048 357 -566 5652 7744 7943 7068 124 -4080 2794 6864 3731 1922 5610
6384E610r661m825k906N006J51j493q22M08Q528j746O2K365K447R49k764L533
$$ 5610 -4051 -8876 -11782 -6776 -6625 -8118 -8940 -8532 -4 -1750 -1688 677 3124 4073 1309 4842
6368D842N608k010m937R29L342l405m928R68K062P92l227n227m066N0O197O031
$$ 4842 10450 8440 3503 4432 7774 4369 -559 409 2471 3263 36 -5191 -9257 -9207 -3010 3021
6352C021k983m851l594L415O586k409k133J44p04N439l14J305j510M23o14n572
$$ 3021 38 -4813 -8407 -4992 1594 -815 -2948 -2804 -3508 1931 1617 2922 1412 1835 1221 -4351
6336d351n389q57N633m804J755P91M810j229J861L802j86o32k311K304l950K276
$$ -4351 -9740 -10597 -4964 -9768 -8013 -7222 -2412 -3641 -1780 2022 1836 1204 -1107 1197 -2753 -477
6320d77O46l810N021p112n389Q526L03k979l144P146M897m954p457k996L280N145
$$ -477 169 -3641 1380 -5732 -11121 -2595 -2292 -5271 -8415 -1269 3628 -1326 -8783 -11779 -8499 -3354
6304c354Q291k499q89N716j829j297O88K632J073n321m656L233M088o790j731
$$ -3354 4937 2438 1549 7265 5436 4139 4827 7459 8532 3211 -1445 1788 5876 -914 -2645
6289b645j058q972j386J1521L92q903M03k222O454L992n100L035j100M855N501
$$ -2645 -3703 -12675 -14061 -2540 -2148 -11051 -10648 -12870 -6416 -2424 -7524 -4489 -5589 -734 4767
6274D767J674n048p037J281j772j942L609M362J202M44N046Q441L166k214n719
$$ 4767 6441 1393 -5644 -4363 -6135 -8077 -4468 -106 1096 1540 6586 15027 18193 15979 10260
6259A0260p783o945M21m292l354L316O048l683l068k973M031N323L124j247m219
$$ 10260 2477 -4468 -4047 -8339 -11693 -8377 -2329 -6012 -9080 -12053 -8022 -2699 425 -822 -5041
6244e041j314m911N439N541N001K005j578q241p926K606P49R274P313k9o997q453
$$ -5041 -6355 -11266 -5827 -286 4715 6720 5142 -3099 -11025 -8419 -7670 1604 8917 8888 1891 -6562
6228f562l895M595O877L355o079P73M219j501j093J952J012J038j403m66J815
$$ -6562 -10457 -5862 1015 4370 -1709 -936 3283 1782 689 2641 3653 4691 3288 2822 4637
6213D637q851l043P319M954Q069j073l706m185m227N48P126L20o044J513O186
$$ 4637 -4214 -7257 62 5016 13085 12012 8306 4121 -106 442 7568 7888 1844 3357 9543
6198I543j196j785q2o95n071m730j538J804P345M940j900l445J3695L239n779
$$ 9543 8347 6562 6480 5785 714 -4016 -5554 -3750 3595 8535 6635 3190 16885 20124 14345
6183A4345j190m277q214m978N62O627l073J761p45k111N137L395l225o648N09
$$ 14345 13155 8878 664 -4314 -3752 2875 -198 1563 818 -1293 3844 7239 4014 -2634 -2125
6168b125R748K59j2792O176K301l593J73j362N295K723l32j0915m320K358N321
$$ -2125 7623 7882 -4910 1266 3567 -26 147 -1215 4080 6803 6471 -4444 -8764 -6406 -1085
6153a085j070M514j887k143j221P24j603J990m950J294n318j473J899O473R42
$$ -1085 -2155 2359 472 -1671 -2892 -2168 -3771 -1781 -6731 -5437 -10755 -12228 -10329 -3856 -2914
6138b914J893Q99K682n212J748L240n839o933M977R338N018k748m243n085n995
$$ -2914 -1021 -122 2560 -2652 -904 2336 -3503 -10436 -5459 3879 8897 6149 1906 -3179 -9174
6123i174K990O096K750l88m299J586J568k242O50k346O01l136L863M411M434l232
$$ -9174 -6184 -88 2662 2274 -2025 -439 1129 -1113 -463 -2809 -2208 -5344 -1481 2930 7364 4132
6107D132k191k363j303K617J250o78jj819Q91K21j523m650K480M702L12R20L44
$$ 4132 1941 -422 -1725 892 2142 1464 1463 -356 535 756 -767 -5417 -2937 1765 2077 2997 3341
6090C341m00L561L014k364m338k63q21j385m760M481J0357Q31p556k055K960j962
$$ 3341 2941 6502 9516 7152 2814 2551 1730 345 -4415 66 10423 11254 3698 1643 4603 2641
6074B641m573k813J0893Q587j191q626j986m61l221j95J128M670J84k230O00l636
$$ 2641 -1932 -4745 6148 14735 13544 4918 2932 2471 -750 -945 183 4853 5037 2807 3407 -229
6058b29k982j033J258Q4K23k192m572P982L061J632m723J700j272k022m911p417
$$ -229 -3211 -4244 -2986 -2902 -2679 -4871 -9443 -1461 1600 3232 -1491 209 -1063 -3085 -7996 -15413
6042a5413L47M108P710m16n226K692k998k622L715J594N118M887r399j0151O618
$$ -15413 -15066 -10958 -3248 -3664 -8890 -6198 -9196 -11818 -8103 -6509 -1391 3496 -5903 -16054 -9436
6027i436m6j782j564K062J979M367N2M121j211m834N516Q594k325n213P47K572
$$ -9436 -9482 -11264 -12828 -10766 -8787 -4420 -4368 -247 -1458 -6292 -776 7818 5493 280 1027 3599
6011C599R17n519K591L181m797L625P011J292p122j4935j1751L378P252j754k448
$$ 3599 4516 -1003 1588 4769 -28 3597 10608 11900 4778 -10157 -21908 -18530 -11278 -13032 -15480
5996a5480R894J558k345n541N695K323N60N29P25q194j041j952O213J1225P905
$$ -15480 -5586 -4028 -6373 -11914 -6219 -3896 -3336 -2807 -2082 -10276 -11317 -13269 -7056 4169 12074
5981A2074J435q642j1855p419m712m218l815O362R344K912L040l688N124J2558
$$ 12074 13509 4867 -6988 -14407 -19119 -23337 -27152 -20790 -11446 -8534 -5494 -9182 -4058 8500
5967H500r32l376l397m682M414O921l743m160Q89L487j05J130k67j010q12L4K15
$$ 8500 7568 4192 795 -3887 527 7448 3705 -455 434 3921 3816 4946 4679 3669 2857 2891 3106
5950C106R69N25o468k009O52j658L51J33P245K459l339M660N04m176J010M415
$$ 3106 4075 4600 -1868 -3877 -3225 -4883 -4532 -4399 2846 5305 1966 6626 7130 2954 3964 8379
5934H379L699r19n317p406k037l083l069k041Q367q08o772J457r89L887M271Q920
$$ 8379 12078 11159 5842 -1564 -3601 -6684 -9753 -11794 -3427 -4235 -11007 -9550 -10539 -6652 -2381 6539
5918F539m311j726o48j199j622J36L486k879o84p475j0061n474j40O671R618L168
$$ 6539 2228 502 -146 -1345 -2967 -2831 655 -2224 -2908 -10383 -20444 -25918 -26058 -19387 -9769 -6601
5902f601K172M758M311m264p581j622J713M170n048L872k5r848J351N822N47m694
$$ -6601 -4429 329 4640 376 -7205 -8827 -7114 -2944 -7992 -4120 -4145 -13993 -12642 -6820 -6273 -10967
5886a0967j655N584K084m808o73l628K553M371N506J443j528J731L765J272o645
$$ -10967 -12622 -7038 -4954 -9762 -10435 -14063 -11510 -7139 -1633 -190 -1718 13 3778 5050 -1595
5871a595j0027K649K483K531J262l918K009M573J472k238j69M529l794k217N119
$$ -1595 -11622 -8973 -6490 -3959 -2697 -6615 -4606 -33 1439 -799 -968 3561 -233 -2450 2669
5856B669P08j363K351J967k475O50r19l588j46l844j244j583J426O616m897k716
$$ 2669 3377 2014 4365 6332 3857 4507 3588 0 -146 -3990 -5234 -6817 -5391 1225 -3672 -6388
5840f388R235J004m966o358q674n485J4087J2698P814m135o298j0079K06O591
$$ -6388 2847 3851 -1115 -7473 -16147 -21632 -7545 5153 12967 8832 2534 -7545 -7339 -748
5826g48J690M838j297j551K54K082K662m971j43L483J931k70q80j601m086n992
$$ -748 942 5780 4483 2932 3186 5268 7930 2959 2816 6299 8230 7960 7080 5479 1393 -4599
5810d599k974p03L045K724K678j260j1638o8O206K277l667K221J802J065K86Q186
$$ -4599 -7573 -8276 -5231 -2507 171 -1089 -12727 -12795 -6589 -4312 -7979 -5758 -3956 -2891 -2605 5581
5794E581L752l62L859j3003k761R234L238K838j411m523n336O52O68J177M839
$$ 5581 9333 8971 12830 -173 -2934 6300 9538 12376 10965 6442 1106 1758 2426 3603 8442
5779H442k875m285m810J744K864j721K418k36O872n144o441K904m368l277j461
$$ 8442 5567 1282 -3528 -1784 1080 -641 1777 1541 8413 3269 -3172 -268 -4636 -7913 -9374
5764i374L301P143O14l69j662k271L136N5m225J548p68m888l566P201j0M590R699
$$ -9374 -6073 1070 1684 1315 -347 -2618 518 573 -3652 -2104 -2872 -7760 -11326 -4125 -4135 455 10154
5747A0154o253j3017k393N422P902J565k914K939Ko80L950j674o223N58q43K037
$$ 10154 3901 -9116 -11509 -6087 1815 3380 466 3405 3407 2727 6677 5003 -1220 -662 -1505 532
5731E32M794o339j235J677L797R90n76m782J645M476p73l50N125l857L653m354
$$ 532 5326 -1013 -2248 -571 3226 4216 3640 -1142 503 4979 4206 3856 8981 5124 8777 4423
5715D423n274J76K068n01k023K179L38L693L687L1n489p742J947k207K580N777
$$ 4423 -851 -675 1393 892 -1131 1048 1386 5079 8766 8797 3308 -4434 -2487 -4694 -2114 3663
5699C663Q501P439n88o2m611l821q854j1024k644L359o34j011M885N985j23J28
$$ 3663 12164 19603 19015 18953 14342 10521 1667 -9357 -12001 -8642 -9276 -10287 -5402 583 460 588
5683E88N372l63P24o471k859m729K778K537q77L652K934j288m905k991R006R576
$$ 588 5960 5597 6321 -150 -3009 -7738 -4960 -2423 -3300 352 3286 1998 -2907 -5898 3108 12684
5667A2684l867n233M489J374k481m589n768j804k726n85M846L633k98k287M339
$$ 12684 8817 3584 8073 9447 6966 2377 -3391 -5195 -7921 -8506 -3660 -27 -325 -2612 1727
5652A727J1637P35m992m673O04q92n76j09l920K425K702N075K383J550p030r221
$$ 1727 13364 14099 9107 4434 5038 4146 3570 3461 -459 1966 4668 9743 12126 13676 6646 -2575
5636b575Q37l51K680K471L066J482l004n362j086n885j550P207O729K931L343
$$ -2575 -1738 -2089 591 3062 6128 7610 4606 -756 -1842 -7727 -9277 -2070 4659 7590 10933
5621A0933J134m004n201j0392K460L590O155j545m860J039J618O558J483R78n019
$$ 10933 12067 8063 2862 -7530 -5070 -1480 4675 3130 -1730 -691 927 7485 8968 9946 4927
5606D927K644P420j386l303o986o184O163J227j822n306k971k374n750O864L405
$$ 4927 7571 14991 13605 10302 3316 -2868 3295 4522 2700 -2606 -5577 -7951 -13701 -6837 -3432
5591c432L08J246N991n84l766O85M744K370j676r106o146L711O514j530L046R370
$$ -3432 -3124 -1878 4113 3529 -237 448 5192 7562 5886 -3220 -9366 -5655 859 -671 2375 11745
5575A1745n47p230j687r88K867l873r33M372k566O09M246O54K657L747p190n606
$$ 11745 11198 3968 2281 1293 4160 287 -646 3726 1160 1769 6015 6669 9326 13073 5883 277
5559B77k302j949n90O382M324M265n002R43M041n72p097l264R33p60n374p510
$$ 277 -2025 -3974 -4564 1818 6142 10407 5405 6348 10389 9817 2720 -544 389 -371 -5745 -13255
5543a3255j897N382n029J163K323M984J0036N477j0878n654R6Q904k707l554K370
$$ -13255 -15152 -9770 -14799 -13636 -11313 -6329 3707 9184 -1694 -7348 -7252 1652 -1055 -4609 -2239
5528b239j965k68n960l429R108O185k377M790K296p368l529N699K836m56j503
$$ -2239 -4204 -4472 -10432 -13861 -4753 1432 -945 3845 6141 -1227 -4756 943 3779 3323 1820
5513A820j787m398J246O143k110J412k699o997m895P726P292N208j3K127L446
$$ 1820 33 -4365 -3119 3024 914 2326 -373 -7370 -12265 -4539 2753 7961 7948 10075 13521
5498A3521K094j147n048j609j917k919m651J828P855j901k193q57q30j693L604
$$ 13521 15615 14468 9420 7811 5894 2975 -1676 152 8007 6106 3913 3056 2226 533 4137
5483D137K263j944L616M356o945o419l173L048P155J749l284q494m88K220P261
$$ 4137 6400 4456 8072 12428 5483 -936 -4109 -1061 6094 7843 4559 -3935 -4423 -2203 5058
5468E058o99o140o315j788j122Q869k339K337M522J85l487j624L892L322J445
$$ 5058 4359 -1781 -8096 -9884 -11006 -2137 -4476 -2139 2383 2568 -919 -2543 1349 4671 6116
5453F116j998n156j113K486l375p49L395N794M009j758m432l560Q85m718p843
$$ 6116 4118 -1038 -2151 335 -3040 -3789 -394 5400 9409 7651 3219 -341 544 -4174 -12017
5438a2017L631K240O890P021j110n598Q66l826j578k32O93J470N45m261L523N03
$$ -12017 -8386 -6146 744 7765 6655 1057 1923 -1903 -3481 -3713 -3020 -1550 -1005 -5266 -1743 -1240
5422a240k204m912p268N878M247k393K146k350o025j51O48N116M871J303J102
$$ -1240 -3444 -8356 -15624 -9746 -5499 -7892 -5746 -8096 -14121 -14272 -13624 -8508 -3637 -2334 -1232
5407a232q8M39R991O079k003m282l48l352k471J305J761J182l102m646n152o337
$$ -1232 -1320 -881 9110 15189 13186 8904 8556 5204 2733 4038 5799 6981 3879 -767 -5919 -12256
5391a2256n724M510Q854J275p8N888J407q098k019N853K435n379q628J322K258
$$ -12256 -17980 -13470 -4616 -3341 -3419 2469 3876 -4222 -6241 -388 2047 -3332 -11960 -10638 -8380
5376h380M791k07M293Q580J514k499q735o31K446j524k952N461N428J91K09o72
$$ -8380 -3589 -3796 497 9077 10591 8092 -643 -1274 1172 -352 -3304 2157 7585 7776 7985 7313
5360G313m830q057M689j598n41P802K100j1162j0418N319N278l176K078N750j892
$$ 7313 2483 -5574 -885 -2483 -3024 4778 6878 -4284 -14702 -9383 -4105 -7281 -5203 547 -1345
5345a345k056L489L030K07j826k231q680J175P225L360N296R546k235r529q332
$$ -1345 -3401 88 3118 3325 1499 -732 -9412 -8237 -1012 2348 7644 17190 14955 5426 -2906
5330b906o17N660J171n37p977K448M005n89m16L874m113o788l51j071m29N844
$$ -2906 -3523 2137 3308 2771 -5206 -2758 1247 658 242 4116 3 -6785 -7136 -8207 -8636 -2792
5314b792n55j50j689K206L944K28K293q821j81O475J653L784K921J097o734j26
$$ -2792 -3347 -3497 -5186 -2980 964 1192 3485 -5336 -5517 958 2611 6395 9316 10413 3679 3553
5298C553l548p562n90N598O880J461l023p471n22J381N241j568l263M189O83q658
$$ 3553 5 -7557 -8147 -2549 4331 5792 2769 -4702 -5224 -3843 1398 -170 -3433 756 1439 -7219
5282g219k293K801N509l432J678N178K198m376p066M874M673k297l193L053k918
$$ -7219 -9512 -6711 -1202 -4634 -2956 2222 4420 44 -7022 -2148 2525 228 -2965 88 -2830
5267b830J694l576j866K674k236q73Q783Q760j104n701k230k755n206K328O611
$$ -2830 -1136 -4712 -6578 -3904 -6140 -7013 1770 10530 9426 3725 1495 -1260 -6466 -4138 2473
5252B473L148k367m389O281K155j378J029r432o569l027L008K549l09J60R56J753
$$ 2473 5621 3254 -1135 5146 7301 5923 6952 -2480 -9049 -12076 -9068 -6519 -6828 -6668 -5712 -3959
5236c959L447L423p17q94L291m84l402J801R563k573l199k852o200k520m667M865
$$ -3959 -512 2911 2194 1300 4591 4107 705 2506 12069 9496 6297 3445 -2755 -5275 -9942 -5077
5220e077N909N093N97m380J565k473l762m402K676J775N403j636l476r000K562
$$ -5077 832 5925 6522 2142 3707 1234 -2528 -6930 -4254 -2479 2924 1288 -2188 -11188 -8626
5205h626N307N700n466l186J081l19J502r930m457K49K909J0927M706K802m028
$$ -8626 -3319 2381 -3085 -6271 -5190 -5509 -4007 -13937 -18394 -18145 -15236 -4309 397 3199 -829
5190h29J319L916P99Q757K024n919l06j265j0202n128P662M932k441L073n979
$$ -829 490 4406 5205 13962 15986 10067 9761 8496 -1706 -6834 828 5760 3319 6392 413
5175D13R71k447n061j733j472J449j369l66O004J291m668j663O994J573q29j993
$$ 413 1384 -1063 -6124 -7857 -9329 -7880 -9249 -9615 -3611 -2320 -6988 -8651 -1657 -84 -913 -2906
5159b906N03L712L821m567j278k589m081q42N96N674M431M257m359q662r14R69
$$ -2906 -2403 1309 5130 563 -715 -3304 -7385 -8227 -7631 -1957 2474 6731 2372 -6290 -7204 -6235
5143f235o269q91O502J531m937n350N977J835J592l30j167m210R0M880L419j131
$$ -6235 -12504 -13395 -6893 -5362 -10299 -15649 -9672 -7837 -6245 -6575 -7742 -11952 -11862 -6982 -3563 -4694
5127d694m079j379j725Q74J418j657m901K897P605O601K498j782K594k663J21
$$ -4694 -8773 -10152 -11877 -11003 -9585 -11242 -16143 -13246 -5641 960 3458 1676 4270 1607 1728
5112A728M119p504q278o99J339j515J681Q669N784J964o63P327k707n698k732
$$ 1728 5847 -1657 -9935 -10634 -9295 -10810 -9129 -460 5324 7288 6625 13952 11245 5547 2815
5097B815p91M430J533q145j324M605p57j782L454P75j527K208l784R43M155Q1
$$ 2815 2024 6454 7987 -158 -1482 3123 2366 584 4038 4813 3286 5494 1710 2653 6808 6889
5081F889K155L946J986p275l431n182N330j577p41k806K161L194N801J0534K846
$$ 6889 9044 12990 14976 7701 4270 -912 4418 2841 2100 -706 1455 4649 10450 20984 23830
5066B3830j0145r628O89L83k111r39J21n594m038j157l636L466Q656J894Q00J632
$$ 23830 13685 4057 4746 5129 3018 2079 2200 -3394 -7432 -8589 -12225 -8759 -103 1791 2591 4223
5050D223k136m963m165R04j742k64K932N205k869L84K239j407m525K367j431L795
$$ 4223 2087 -2876 -7041 -6137 -7879 -8143 -5211 -6 -2875 -2491 -252 -1659 -6184 -3817 -5248 -1453
5034a453O631L772k706k779K817p18oj404o34l271q520L197K975j111m668M411
$$ -1453 5178 8950 6244 3465 6282 5564 5558 4154 3520 249 -8271 -5074 -2099 -3210 -7878 -3467
5018c467M164O106K505P16k562l240j0579Q70O383O616N755J380J04q773r548
$$ -3467 697 6803 9308 10024 7462 4222 -6357 -5487 896 7512 13267 14647 14751 5978 -3570
5003c570l358L638J124k763l495K246m225p687L600P699j668K715l000p058n117
$$ -3570 -6928 -3290 -2166 -4929 -8424 -6178 -10403 -18090 -14490 -6791 -8459 -5744 -8744 -15802 -20919
4988b0919J804N150M620K730n415p21J175J610L438R989J180m244p271j92J202
$$ -20919 -19115 -13965 -9345 -6615 -12030 -12751 -11576 -9966 -6528 3461 4641 397 -6874 -7066 -5864
4973e864n847l436M629L499P546J412p58J213M318L966l914j618L921k378o689
$$ -5864 -11711 -15147 -10518 -7019 527 1939 1181 2394 6712 10678 6764 5146 9067 6689 0
4958@L617k30o208m145O630M545K078m464j141J767J121j224J726q11Lo953K184
$$ 0 3617 3387 -2821 -6966 -336 4209 6287 1823 682 2449 3570 2346 4072 3261 3264 -3689 -1505
4941a505N318J990n747k501n047P24R947N770l352P08O161K22M93l160k336j141
$$ -1505 3813 5803 56 -2445 -7492 -6768 3179 8949 5597 6305 12466 12688 13181 10021 7685 6544
4925F544n029k301j364K321m529k453L269k343K005M595K603M956j908m611J376
$$ 6544 1515 -786 -2150 171 -4358 -6811 -3542 -5885 -3880 715 3318 8274 6366 1755 3131
4910C131n789j654P57n338k184L408K944R521K759o646m042k807k252K837k09
$$ 3131 -2658 -4312 -3555 -8893 -11077 -7669 -4725 4796 7555 909 -3133 -5940 -8192 -5355 -5564
4895e564K163R65K384L14N969o42l606K610p256n209Q10M781m877L080j140M318
$$ -5564 -3401 -2436 -52 262 6231 5589 1983 4593 -2663 -7872 -7062 -2281 -7158 -4078 -5218 -900
4879i00L849M34j463J317p80m773M17p501p29Q548J945n42n101n142m31m96o41
$$ -900 2949 3383 1920 3237 2457 -2316 -1899 -9400 -10129 -1581 364 -178 -5279 -10421 -10852 -11348 -11989
4862a1989P030L95q68M882J492k780j575j104n228M17m27L931K568p63L308k366
$$ -11989 -4959 -4564 -5432 -550 942 -1838 -3413 -4517 -9745 -9328 -9755 -5824 -3256 -4019 -711 -3077
4846c077P097N509n54m998j499N149M011p046n923l738m403N721O536L087M252
$$ -3077 4020 9529 8975 3977 2478 7627 11638 4592 -1331 -5069 -9472 -3751 2785 5872 10124
4831A0124R39j384r62K885l551l129M156K179n600q306k229K269l616j638N078
$$ 10124 11063 9679 8717 11602 8051 4922 9078 11257 5657 -2649 -4878 -2609 -6225 -7863 -2785
4816b785L780m394q056n12J855j92m739J265N209O431L728k288Q23m519K651k689
$$ -2785 995 -3399 -11455 -11967 -10112 -10304 -15043 -13778 -8569 -2138 1590 -698 125 -4394 -1743 -4432
4800d432l728k883O520N598M715M906m822o525k795L451N288L719k133m446l905
$$ -4432 -8160 -11043 -4523 1075 5790 10696 5874 -651 -3446 5 5293 9012 6879 2433 -1472
4785a472l375p026j436O202M67l715L208M497n068j254L637l514m881L386M710
$$ -1472 -4847 -11873 -13309 -7107 -6640 -10355 -7147 -2650 -7718 -8972 -5335 -8849 -13730 -10344 -5634
4770e634k551M090N518L600j33k375m620l951k642R80J350m133O419P049L963
$$ -5634 -8185 -4095 1423 5023 4890 2515 -2105 -6056 -8698 -7718 -6368 -10501 -4082 2967 6930
4755F930m610p028p234j521N805P975m613M487N478R32l582j31l624N27M225L636
$$ 6930 2320 -4708 -11942 -13463 -7658 317 -4296 191 5669 6601 3019 2888 -736 -209 4016 7652
4739G652m371k015k639j021k710n03M214m039J229k521K568j882j430o536J695
$$ 7652 3281 1266 -1373 -2394 -5104 -5607 -1393 -5432 -4203 -6724 -4156 -6038 -7468 -14004 -12309
4724a2309N33N555O533l58l191M147M700j016J559N169K20n056j939j318n987
$$ -12309 -11776 -6221 312 -46 -3237 910 5610 4594 6153 11322 11542 6486 4547 3229 -2758
4709b758k570Q853k472J876n935j980P176N902L462j754R89J760j033j794k859
$$ -2758 -5328 3525 1053 2929 -3006 -4986 2190 8092 11554 9800 10789 12549 11516 9722 6863
4694F863K727k356l724p463j315M878K311p093n049P262M656o972L958O128R10
$$ 6863 9590 7234 3510 -3953 -5268 -390 1921 -5172 -10221 -2959 1697 -5275 -1317 4811 5721
4679E721L972j134n517m335N148p12l654p64k618J893J0365O23n105J317m726
$$ 5721 9693 8559 3042 -1293 3855 3143 -511 -1275 -3893 -2000 8365 8988 3883 5200 474
4664D74j486M999L8m841j9o938j138M085J2182J709r166o610M85M080R85J844
$$ 474 -1012 3987 4025 -816 -835 -7773 -8911 -4826 7356 9065 -101 -6711 -6226 -2146 -1161 683
4648F83j502O62M650K807J179l109o40J705j565J386J957j933J863k697o131L962
$$ 683 -819 -157 4493 7300 8479 5370 4730 6435 4870 6256 8213 6280 8143 5446 -685 3277
4632C277K541J229P78q156j326k808j516K016M440J151M506L91m565J659J553
$$ 3277 5818 7047 7825 -331 -1657 -4465 -5981 -3965 475 1626 6132 6523 1958 3617 5170
4617E170k485K35n19l858K640N034n88k706l873o585L37L395K67k603J942K967
$$ 5170 2685 2920 2401 -1457 1183 6217 5629 2923 -950 -7535 -7198 -3803 -3536 -6139 -4197 -1230
4601a230M98K33J26J865J943l865k347K110N291m52n219M157O790l291k098l836
$$ -1230 -732 -499 -373 1492 3435 -430 -2777 -667 4624 4172 -1047 3110 9900 6609 4511 675
4585F75M17K729o81n144o341M957m01l68k330L239L344J337k036J815J720K877
$$ 675 1092 3821 3140 -2004 -8345 -3388 -3789 -4157 -6487 -3248 96 1433 -603 1212 2932 5809
4569E809l044K199k104m09L554P3P06m45N192p82m201k904L56o94n279m131m159
$$ 5809 2765 4964 2860 2451 6005 6078 6784 6339 11531 10749 6548 3644 4000 3306 -1973 -6104 -10263
4552a0263M877O5L206M04K616l70K228M708j44k811r752n448N379N668K726O466
$$ -10263 -5386 -5321 -2115 -1711 905 535 2763 7471 7327 4516 -5236 -10684 -5305 363 3089 9555
4536I555N373o52m997L586N06r498k541j4n570q60M551j423r30k913m459n563
$$ 9555 14928 14276 9279 12865 13371 3873 1332 1318 -4252 -5112 -561 -1984 -2914 -5827 -10286 -15849
4520a5849L203O684N596K626q91l341P59N380n091K202L306m479J255k889j572
$$ -15849 -12646 -5962 -366 2260 1369 -1972 -1213 4167 -924 1278 4584 105 1360 -1529 -3101
4505c101Q463O174k023k712j901j0041n123N121P043j666l798J0141m676o172
$$ -3101 5362 11536 9513 6801 4900 -5141 -10264 -5143 1900 234 -3564 6577 1901 -4271
4491d271o90O394N028J105l874n077k861k370o31l731K8K398P327O46o128n670
$$ -4271 -4961 1433 6461 7566 3692 -1385 -4246 -6616 -7247 -10978 -10950 -8552 -1225 -579 -6707 -12377
4475a2377j413J1215K628j788K41l822j143P66m008M617r3K567N022J559j559
$$ -12377 -13790 -2575 53 -1735 -1494 -5316 -6459 -5693 -9701 -5084 -5177 -2610 2412 3971 2412
4460B412q68J241q7O169o45M44l903m133m392n111K083L481M04M446N339K084
$$ 2412 1544 2785 2698 8867 8222 8666 4763 630 -3762 -8873 -6790 -3309 -2905 1541 6880 8964
4444H964j453p50l33l105l292o908K86N507J697q71O806L665p967n217m124k445
$$ 8964 7511 6761 6428 3323 31 -6877 -6591 -1084 613 -258 6548 10213 2246 -2971 -7095 -9540
4428i540K522N614L957P719J809k663p695l267o146J07m95j190J297J890K156
$$ -9540 -7018 -1404 2553 10272 12081 9418 1723 -1544 -7690 -7583 -8078 -9268 -7971 -6081 -3925
4413c925n180j305J231L187K762N954N26N303l079q059n202M0K932N634M510M199
$$ -3925 -9105 -10410 -9179 -5992 -3230 2724 3250 8553 5474 -2585 -7787 -7747 -4815 819 5329 9528
4397I528j525L073k270M8j243J507m637q400k324J433M525m26L27J880L613k178
$$ 9528 8003 11076 8806 8854 7611 9118 4481 -3919 -6243 -4810 -285 -711 -384 1496 5109 2931
4381B931k567J380k666J533J79j679j924k896L997L094j092j090o141J04l375
$$ 2931 364 1744 -922 611 790 -889 -2813 -5709 -1712 1382 290 -800 -6941 -6837 -10212
4366a0212J957K554L077o087l290L039k582L53L052P812M936P63J968m861N479
$$ -10212 -8255 -5701 -2624 -8711 -12001 -8962 -11544 -11191 -8139 -327 4609 5372 7340 2479 7958
4351G958J446r05m89q309l066j976L739K510L996l273o354q494n44P56K256M947
$$ 7958 9404 8499 8010 -299 -3365 -5341 -1602 908 4904 1631 -4723 -13217 -13761 -13005 -10749 -5802
4335e802M996k891m70N389l638o396N338N198k595r861OO005M890n99J569k370
$$ -5802 -806 -3697 -4167 1222 -2416 -8812 -3474 1724 -871 -10732 -10726 -4721 169 -430 1139 -1231
4319a231J478m694J713L344k491n903K777J2963j750k455R29Q23N67K703L22n997
$$ -1231 247 -4447 -2734 610 -1881 -7784 -5007 7956 6206 3751 4680 5503 6070 8773 9095 3098
4303C098o578K681K895k21o634k579J2468O450K102M512j418q654r133l286J198
$$ 3098 -3480 -799 2096 1875 -4759 -7338 5130 11580 13682 18194 16776 8122 -1011 -4297 -3099
4288c099O868J684k114q051n195O347K849k494L980L992m224k689N525P87l148
$$ -3099 3769 5453 3339 -4712 -9907 -3560 -711 -3205 775 4767 543 -2146 3379 4166 1018
4273A018M245L81j617p116R396K041n042l268j0742M869l088K232L231k041l25
$$ 1018 5263 5644 4027 -3089 6307 8348 3306 38 -10704 -5835 -8923 -6691 -3460 -5501 -5826
4258e826j548M18L483M560M225J561j52l007M148J558M430k482l598k330o38p287
$$ -5826 -7374 -6956 -3473 1087 5312 6873 6721 3714 7862 9420 13850 11368 7770 5440 4802 -2485
4242b485L100n85m350m929n500M618O037q2L288N473J150m717k729m045O374Q990
$$ -2485 615 30 -4320 -9249 -14749 -10131 -4094 -4176 -888 4585 5735 1018 -1711 -5756 618 9608
4226I608M573L055j09n614j0097q03M643P09m150p023m276J239M018k618L184
$$ 9608 14181 17236 17127 11513 1416 613 5256 5965 1815 -5208 -9484 -8245 -4227 -6845 -3661
4211c661R69o320j747k178Q08L192J183M293K384K169J772k478n929j60N584M668
$$ -3661 -2692 -9012 -10759 -12937 -12129 -8937 -7754 -3461 -1077 1092 2864 386 -5543 -5703 -119 4549
4195D549m5m084j459P104L013o777m248O638j293k012j107L224j54r04n930l252
$$ 4549 4504 420 -1039 6065 9078 2301 -1947 4691 3398 1386 279 3503 3349 2445 -3485 -6737
4179f737O111k27k828K738L105o177Q83L376j924r70J265j228k318k128j165K268
$$ -6737 -626 -853 -3681 -943 2162 -4015 -3132 244 -1680 -2650 -1385 -2613 -4931 -7059 -8224 -5956
4163e956K85m932m919R04M028r5M609P065J102J578j174j471l63j890J050J447
$$ -5956 -5671 -10603 -15522 -14618 -10590 -10685 -6076 989 2091 3669 2495 1024 661 -1229 -179 1268
4147A268J454N850Q37o204L41j282l389k455N743j856n674L071J735k097L533
$$ 1268 2722 8572 9409 3205 3546 2264 -1125 -3580 2163 307 -5367 -2296 -561 -2658 875
4132H75M015L53o002M169P326k754m081J27L583l008p680Q78O368L679q95n15
$$ 875 4890 5243 -759 3410 10736 7982 3901 4028 7611 4603 -3077 -2199 4169 7848 6953 6438
4116F438P17k140J101L589m514k831q619L080L896j932n67n056L33J247R6j606
$$ 6438 7155 5015 6116 9705 5191 2360 -6259 -3179 717 -1215 -1782 -6838 -6505 -5258 -5162 -6768
4100f768K841k080j755o344O54N503Q434L205p838o478M452P362k852M112j565
$$ -6768 -3927 -6007 -7762 -14106 -13452 -7949 485 3690 -4148 -10626 -6174 1188 -1664 2448 883
4085H83M31l9k338p353j834K552P627K441j249k862m509m906N784Q296j235m004
$$ 883 1314 1275 -1063 -8416 -10250 -7698 -71 2370 1121 -1741 -6250 -11156 -5372 2924 1689 -2315
4069b315l958O531j41l19q97L486K338j075j715M438K347J860J366l306j787q093
$$ -2315 -6273 258 117 -202 -1099 2387 4725 3650 1935 6373 8720 10580 11946 8640 6853 -1240
4053a240j841K168l846m460o56q62k14P180m56N01p5L00p554j513J0966J027m46
$$ -1240 -3081 -913 -4759 -9219 -9875 -10737 -10951 -3771 -4227 -3726 -3801 -3501 -11055 -12568 -1602 -575 -1021
4036a021J549k163k751M489L944L5L511J392n134m407N626l330j507m151l010
$$ -1021 528 -1635 -4386 103 4047 4082 7593 8985 3851 -556 5070 1740 233 -3918 -6928
4021f928m391K419R172K728j435j081l945q5R44r53j225j96m630J828m307L82
$$ -6928 -11319 -8900 272 3000 1565 484 -3461 -3546 -2602 -3555 -4780 -4976 -9606 -7778 -12085 -11703
4005a1703J459K981Q750L578n53M84K874m717j2219p433M547P698m057n131n369
$$ -11703 -10244 -7263 1487 5065 4512 4996 7870 3153 -9066 -16499 -11952 -4254 -8311 -13442 -18811
3990a8811Q507P551M86K810k225p093j453J845N648k951M07R16L401j681l6m629
$$ -18811 -10304 -2753 -2267 543 -1682 -8775 -10228 -8383 -2735 -5686 -5279 -4363 -962 -2643 -2679 -7308
3974g308N365L634o29k243n838K571K277J027K85n634j035L638q99J390M834L818
$$ -7308 -1943 1691 1062 -1181 -7019 -4448 -2171 -1144 -859 -6493 -7528 -3890 -4789 -3399 1435 5253
3958E253k612m99n16K69K066r30j0168o835j522N890L198L516j697N863j152p265
$$ 5253 2641 2142 1626 1895 3961 3031 -7137 -13972 -15494 -9604 -6406 -2890 -4587 1276 124 -7141
3942g141M85L862K757l457p452O015K769l679n375O28O244M12l619M590J2208
$$ -7141 -6656 -2794 -37 -3494 -10946 -4931 -2162 -5841 -11216 -10588 -4344 -3932 -7551 -2961 9247
3927I247N29r170q19M081M61l283j385l543N500K692k242k57k043j851L663Q549
$$ 9247 9776 606 -213 3868 4329 1046 -339 -3882 1618 4310 2068 1811 -232 -2083 1580 10129
3911A0129l598m642q208l077o247k315N408L915M421M669j454O379j21m124J767
$$ 10129 6531 1889 -6319 -9396 -15643 -17958 -12550 -8635 -4214 455 -999 5380 5259 1135 2902
3896B902L157J09r565j717Q324P277o427j10L939o79n53k66o220o821j1r21J0341
$$ 2902 6059 6168 -3397 -5114 3210 10487 4060 3950 7889 7210 6657 6391 171 -6650 -6661 -7582 2759
3879B759Q335o385n675K561k867k277N65J224o15J477L791M96m656m078J742N677
$$ 2759 11094 4709 -966 1595 -1272 -3549 -2984 -1760 -2375 -898 2893 3389 -1267 -5345 -3603 2074
3863B074Q974J224j250j1716k263k281P187n124o799j100l644K745L796L70J016
$$ 2074 11048 12272 11022 -694 -2957 -5238 1949 -3175 -9974 -11074 -14718 -11973 -8177 -7807 -6791
3848f791J027M986K129j49j677n763l003r65j737j610N92J614m59M515M436j304
$$ -6791 -5764 -778 1351 1202 -475 -6238 -9241 -10206 -11943 -13553 -12961 -11347 -11806 -7291 -2855 -4159
3832d159N10J965q97l332q92L980o50M531O364k966l009N180q85J200l330K615
$$ -4159 -3649 -1684 -2581 -5913 -6805 -2825 -3475 1056 7420 4454 1445 6625 5740 6940 3610 6225
3816F225P849j103o589o778j729K383L521q39l920Q98M525j866n137k91M753N94
$$ 6225 14074 12971 6382 -396 -2125 258 3779 2940 -980 -82 4443 2577 -2560 -2851 1902 2496
3800B496m948j66K428L161M998m95q511k131k128k181M544j989k83K121J806m30
$$ 2496 -2452 -2618 -190 2971 7969 7474 -1037 -3168 -5296 -7477 -2933 -4922 -5205 -3084 -1278 -1708
3784a708j805K576j402M152N313K609m037r73M179O54n57n828k776J380k480k124
$$ -1708 -3513 -937 -2339 1813 7126 9735 5698 4725 8904 9558 9001 3173 397 1777 -703 -2827
3768b827j281L63J583k456k59P03q070J815N232p213J984N564j303k972j645P778
$$ -2827 -4108 -3745 -2162 -4618 -4877 -4174 -12244 -10429 -5197 -12410 -10426 -4862 -6165 -9137 -10782 -3004
3752c004L092j07l206P165J458L084R86L452L43o539l990k512K804L991m499K586
$$ -3004 88 -19 -3225 3940 5398 8482 9468 12920 13263 6724 2734 222 3026 7017 2518 5104
3736E104O650J021j024p03o938J975O727l759j516j218K897J249j941n932k25
$$ 5104 11754 12775 11751 11048 4110 6085 12812 9053 7537 6319 9216 10465 8524 2592 2367
3721B367j698j818k26k48n000J94J874M582l759J44O829k281p240N060J2076J0415
$$ 2367 669 -1149 -1375 -1623 -6623 -6429 -4555 27 -3732 -3588 3241 960 -6280 -1220 10856 21271
3705B1271k561j3051q584O91k907m013j439L094Q671N50m124L013l524r976o465
$$ 21271 18710 5659 -2925 -2234 -5141 -9154 -10593 -7499 1172 1722 -2402 611 -2913 -12889 -19354
3690a9354k748O358N405M079K239K951K530m359k005M633j274L20O948k526O809
$$ -19354 -22102 -15744 -10339 -6260 -4021 -1070 1460 -2899 -4904 -271 -1545 -1225 5723 3197 10006
3675A0006O447q990j4131m17n599k223O815P869L933l029n986j453K373K679j741
$$ 10006 16453 7463 -6668 -7085 -12684 -14907 -8092 -223 3710 681 -5305 -6758 -4385 -1706 -3447
3660c447l083J852J039j2n813O90J046k182J38M442J3279R607n640m507r704n417
$$ -3447 -6530 -4678 -3639 -3651 -9464 -8774 -7728 -9910 -9772 -5330 7949 17556 11916 7409 -2295 -7712
3644g712J1959M573k775k287j100J336n054k062K342N029L854p249n080N56L402
$$ -7712 4247 8820 6045 3758 2658 3994 -1060 -3122 -780 4249 8103 854 -4226 -3670 -268
3629b68n391o758N627R375Q06q509M807L909n187l742p36N594L989P04l528o576
$$ -268 -5659 -12417 -6790 2585 3391 -5118 -311 3598 -1589 -5331 -6067 -473 3516 4220 692 -5884
3613e884o637n0K997L557L350M285k091m722l475j2R29j364l54J871M428j470
$$ -5884 -12521 -12571 -9574 -6017 -2667 1618 -473 -5195 -8670 -8682 -7753 -9117 -9471 -7600 -3172 -4642
3597d642k229L326L892M802n557q522M361N803o208k837M376P48l22M56n430n030
$$ -4642 -6871 -3545 347 5149 -408 -8930 -4569 1234 -4974 -7811 -3435 -2687 -3009 -2553 -7983 -13013
3581a3013j028O496P463M500O814n602q965j131l598j436j838P95O158L446L968
$$ -13013 -14041 -7545 -82 4418 11232 5630 -3335 -4466 -8064 -9500 -11338 -10543 -4385 -939 3029
3566C029j180K362k341m856K87M362m803k119j42j07L895n38L73K888l797P825
$$ 3029 1849 4211 1870 -2986 -2699 1663 -3140 -5259 -5401 -5508 -1613 -2151 -1778 1110 -2687 5138
3550E138K733k026n078K857N23n618k167L687M198J540R37m267r57l918K850P099
$$ 5138 7871 5845 767 3624 4147 -1471 -3638 49 4247 5787 6724 2457 1500 -2418 432 7531
3534G531l416n836o830l15L157Q552M85P75J071j898K885j605n068o081N55k051
$$ 7531 4115 -1721 -8551 -8866 -5709 2843 3328 4103 5174 3276 6161 4556 -512 -6593 -6038 -8089
3518h089L473l373L00j718O539J899N782N46n071L332N439q866q223l350j764
$$ -8089 -4616 -7989 -7689 -9407 -2868 -969 4813 5359 288 3620 9059 193 -8030 -11380 -13144
3503a3144o55O404J1779j483q220j052M152L088K5J860j376J093j463M032M0q272
$$ -13144 -13799 -7395 4384 2901 -5319 -6371 -2219 869 894 2754 1378 2471 1008 5040 5080 -3192
3487c192P50j774k230j129j94K598J893j752O92J702L44K864L383k643k554K4
$$ -3192 -2442 -4216 -6446 -7575 -7769 -5171 -3278 -5030 -4338 -2636 -2292 572 3955 1312 -1242 -1218
$$ [...]
##END NTUPLES=NMR SPECTRUM
##END=
