##TITLE=Analysis number 325592
Compound Code cc 00904
Project Code adrs
Chemist Name fudan
##JCAMPDX= 6.0         $$ Bruker NMR JCAMP-DX V2.0
##DATA TYPE= NMR SPECTRUM
##DATA CLASS= NTUPLES
##ORIGIN= Bruker BioSpin GmbH
##OWNER= nmr
$$ XWIN-NMR		Version 3.5
$$ Mon Jan  8 09:35:44 2007 GMT Standard Time (UT+0h)  MAYBRIDGE\nmr@NMR_250MHZ
##.OBSERVE FREQUENCY= 250.131544655141
##.OBSERVE NUCLEUS= ^1H
##.ACQUISITION MODE= SIMULTANEOUS (DQD)
##.ACQUISITION SCHEME= undefined
##.AVERAGES= 16
##.DIGITISER RES= 18
##SPECTROMETER/DATA SYSTEM= dpx250
##.PULSE SEQUENCE= zg30
##.SOLVENT NAME= CDCl3
##.SHIFT REFERENCE= (INTERNAL, CDCl3, 0, 16.5264)
##AUDIT TRAIL= $$ (NUMBER, WHEN, WHO, WHERE, WHAT)
$$ ##TITLE= Audit trail, XWIN-NMR		Version 3.5
$$ ##JCAMPDX= 5.01
$$ ##ORIGIN= Bruker BioSpin GmbH
$$ ##OWNER= nmr
$$ C:\u/data/dgb/nmr/ADRS/730/pdata/1/auditp.txt
$$ ##AUDIT TRAIL=  $$ (NUMBER, WHEN, WHO, WHERE, WHAT)
(   1,<2007-01-08 09:35:24.36 +000>,<MAYBRIDGE\nmr>,<NMR_250MHZ>,
      <created by zg, POWCHK disabled, PULCHK disabled
       configuration hash MD5:
       49 4B E0 1D 92 C2 6B 37 9F E6 65 BC 52 41 86 1D
       data hash MD5: 64K
       19 FF 25 25 F8 8B 0A 06 3E 4A F5 12 AC 2B 99 7B>)
(   2,<2007-01-08 09:35:36.42 +000>,<MAYBRIDGE\nmr>,<NMR_250MHZ>,
      <Start of raw data processing
       ef LB = 0.3 FT_mod = 6 PKNL = 1 SI = 32K 
       data hash MD5: 32K
       68 7F BF A5 22 5E 06 C7 0D 3D AB CD 58 8C D9 29>)
(   3,<2007-01-08 09:35:37.97 +000>,<MAYBRIDGE\nmr>,<NMR_250MHZ>,
      <apk 
       data hash MD5: 32K
       44 55 AE 4A 43 B6 17 52 69 C2 55 D4 A3 EB E4 9B>)
(   4,<2007-01-08 09:35:38.70 +000>,<MAYBRIDGE\nmr>,<NMR_250MHZ>,
      <abs ABSG = 5 
       data hash MD5: 32K
       40 81 1A 60 C0 8F BF 7B 20 8F 4F B9 03 29 DE E7>)
$$ ##END=
$$ 
$$ hash MD5
$$ 55 CC 6C 0F 49 18 2F 34 AA 8C 94 9E CE 86 EC AF
##$RELAX= 
##$RELAX= 
##$RELAX= 
##$RELAX= 
##$RELAX= 
##$RELAX= 
##$RELAX= 
$$ Bruker specific parameters
$$ --------------------------
##$DU= <C:\u>
##$EXPNO= 730
##$NAME= <ADRS>
##$PROCNO= 1
##$TYPE= <nmr>
##$USER= <dgb>
##$AMP= (0..31)
100 100 100 100 100 100 100 100 100 100 100 100 100 100 100 100 100 100 
100 100 100 100 100 100 100 100 100 100 100 100 100 100 
##$AQSEQ= 0
##$AQ_mod= 3
##$AUNM= <au_zg>
##$AUTOPOS= <9 >
##$BF1= 250.13
##$BF2= 250.13
##$BF3= 250.13
##$BF4= 250.13
##$BF5= 500.13
##$BF6= 500.13
##$BF7= 500.13
##$BF8= 500.13
##$BYTORDA= 1
##$CFDGTYP= 0
##$CFRGTYP= 5
##$CHEMSTR= <none>
##$CNST= (0..31)
1 1 145 1 1 1 1 1 1 1 1 1 1 1 1 1 1 1 1 1 1 1 1 1 1 1 1 1 1 1 1 1 
##$CPDPRG= <>
##$CPDPRG1= <>
##$CPDPRG2= <>
##$CPDPRG3= <>
##$CPDPRG4= <mlev>
##$CPDPRG5= <mlev>
##$CPDPRG6= <mlev>
##$CPDPRG7= <mlev>
##$CPDPRG8= <mlev>
##$CPDPRGB= <>
##$CPDPRGT= <>
##$D= (0..31)
0 1 0 0 0 0 0 0 0 0.06 0 0 0 0 0 0 0.0002 0 0 0 0 0 0 0 0 0 0 0 0 0 0 
0 
##$DATE= 1168248923
##$DBL= (0..7)
120 120 120 120 120 120 120 120 
##$DBP= (0..7)
150 150 150 150 150 150 150 150 
##$DBP07= 0
##$DBPNAM0= <>
##$DBPNAM1= <>
##$DBPNAM2= <>
##$DBPNAM3= <>
$$ [...]
##$SUBNAM7= <"">
##$SUBNAM8= <"">
##$SUBNAM9= <"">
##$SW= 20.6930455092707
##$SWIBOX= (0..15)
0 0 3 0 0 0 0 0 0 0 0 0 0 0 0 0 
##$SW_h= 5175.983436853
##$TD= 65536
##$TD0= 1
##$TE= 294.16
##$TE2= 300
##$TE3= 300
##$TEG= 300
##$TL= (0..7)
0 120 120 120 120 120 120 120 
##$TP= (0..7)
150 150 150 150 150 150 150 150 
##$TP07= 0
##$TPNAME0= <>
##$TPNAME1= <>
##$TPNAME2= <>
##$TPNAME3= <>
##$TPNAME4= <>
##$TPNAME5= <>
##$TPNAME6= <>
##$TPNAME7= <>
##$TPOAL= (0..7)
0.5 0.5 0.5 0.5 0.5 0.5 0.5 0.5 
##$TPOFFS= (0..7)
0 0 0 0 0 0 0 0 
##$TUNHIN= 0
##$TUNHOUT= 0
##$TUNXOUT= 0
##$USERA1= <user>
##$USERA2= <user>
##$USERA3= <user>
##$USERA4= <user>
##$USERA5= <user>
##$V9= 5
##$VALIST= <valist>
##$VCLIST= <CCCCCCCCCCCCCCC>
##$VD= 0
##$VDLIST= <DDDDDDDDDDDDDDD>
##$VPLIST= <PPPPPPPPPPPPPPP>
##$VTLIST= <TTTTTTTTTTTTTTT>
##$WBST= 1024
##$WBSW= 4
##$XGAIN= (0..3)
0 0 0 0 
##$XL= 0
##$YL= 0
##$YMAX_a= 312228
##$YMIN_a= -492255
##$ZGOPTNS= <>
##$ZL1= 120
##$ZL2= 120
##$ZL3= 120
##$ZL4= 120
##$ABSF1= 16.52641
##$ABSF2= -4.166763
##$ABSG= 5
##$ABSL= 3
##$ALPHA= 0
##$AQORDER= 0
##$ASSFAC= 0
##$ASSFACI= 0
##$ASSFACX= 0
##$ASSWID= 0
##$AUNMP= <proc_1d>
##$AZFE= 0.1
##$AZFW= 0.1
##$BCFW= 0
##$BC_mod= 0
##$BYTORDP= 0
##$COROFFS= 0
##$CY= 12.5
##$DATMOD= 1
##$DC= 0
##$DFILT= <>
##$DTYPP= 0
##$F1P= 14.0000005364418
##$F2P= -0.99999901652339
##$FCOR= 0.5
##$FTSIZE= 32768
##$FT_mod= 6
##$GAMMA= 0
##$GB= 0
##$INTBC= 1
##$INTSCL= 1
##$ISEN= 128
##$LB= 0.3
##$LEV0= 0
##$LPBIN= 0
##$MAXI= 10000
##$MC2= 0
##$MEAN= 0
##$ME_mod= 0
##$MI= 0
##$NCOEF= 0
##$NC_proc= -4
##$NLEV= 6
##$NOISF1= 0
##$NOISF2= 0
##$NSP= 0
##$NTH_PI= 0
##$NZP= 0
##$OFFSET= 16.52641
##$PC= 1
##$PHC0= 225.4259
##$PHC1= 6.343247
##$PH_mod= 1
##$PKNL= yes
##$PPARMOD= 0
##$PSCAL= 4
##$PSIGN= 0
##$REVERSE= no
##$SF= 250.129998895565
##$SI= 32768
##$SIGF1= 0
##$SIGF2= 0
##$SINO= 400
##$SIOLD= 32768
##$SREGLST= <1H.CDCl3>
##$SSB= 0
##$STSI= 32768
##$STSR= 0
##$SW_p= 5175.98343685301
##$SYMM= 0
##$S_DEV= 0
##$TDeff= 65536
##$TDoff= 0
##$TI= <Analysis number 999999
Compound Code 99
Book Reference 9
Project Code 9>
##$TILT= no
##$TM1= 0
##$TM2= 0
##$TOPLEV= 0
##$USERP1= <user>
##$USERP2= <user>
##$USERP3= <user>
##$USERP4= <user>
##$USERP5= <user>
##$WDW= 1
##$XDIM= 32768
##$YMAX_p= 453148140
##$YMIN_p= -192448
$$ End of Bruker specific parameters
$$ ---------------------------------
##NTUPLES= NMR SPECTRUM
##VAR_NAME=  FREQUENCY,     SPECTRUM/REAL,   SPECTRUM/IMAG
##SYMBOL=    X,             R,               I
##VAR_TYPE=  INDEPENDENT,   DEPENDENT,       DEPENDENT
##VAR_FORM=  AFFN,          ASDF,            ASDF
##VAR_DIM=   32768,         32768,           32768
##UNITS=     HZ,            ARBITRARY UNITS, ARBITRARY UNITS
##FACTOR=    0.157963299565203, 1,           1
##FIRST=     4133.75070222953, 0,            0
##LAST=      -1042.23273462348, 0,           0
##MIN=       -1042.23273462348, -192448,     0
##MAX=       4133.75070222953, 453148140,    0
$$ Real data points
##PAGE= N=1
##DATA TABLE= (X++(R..R)), XYDATA
32767 19590 30502 43263 57808 51115 44914 49752 36768 -8577 -5910 -7067 -42885 -67163 -95788
32754 -95788 -78365 -71452 -46568 -55636 -80216 -59521 -30585 -18618 -15786 -37744 -39788 -42893 -5503
32741 -5503 17465 5051 22471 58134 38762 32437 2964 352 13356 34833 12137 -14021
32729 -14021 -23217 -40620 -36171 -30263 -21134 -9202 -10201 2873 9403 3454 -29013 -21821 2046
32716 2046 16579 45531 13528 24364 43848 -784 -28907 -8568 -25128 -31829 -2171 -26567
32704 -26567 -36541 -35157 -39562 -386 4128 22016 38713 19863 10837 22656 27735 -11521 6277
32691 6277 -1129 -23894 -28978 -22106 -54685 -73840 -79042 -68067 -33996 -21165 -4763 18504 14844
32678 14844 -36869 -54605 -50536 -29935 -33842 -53889 -63623 -35057 29033 59878 48797 41191
32666 41191 44668 -5495 -31381 -24962 -347 -4721 -42550 -65351 -45395 -1719 18385 12040
32654 12040 -18701 -26649 -33368 -17046 1567 -14059 -47443 -42821 -9114 2892 -2428 -7923 -2788
32641 -2788 -10124 4146 5569 -15434 17957 33669 -5013 -16034 -12973 -2289 19460 -4730
32629 -4730 -26394 -58157 -56088 -16365 6086 -37324 -62143 -58659 -35784 -2103 -9005 -5676 798
32616 798 -27311 -59214 -44442 -21862 -28932 -14054 35151 34005 13660 2708 525 -14508 -13627
32603 -13627 -34916 -57754 -21336 38761 47334 20242 48824 60950 32037 10617 -13548 -36953
32591 -36953 -23425 12105 7532 -16539 1279 -3755 -53767 -77762 -49574 -25983 -45364 -9549
32579 -9549 42976 88667 78282 66916 61882 57984 54420 30040 28585 25861 48361 51791 975
32566 975 -6035 -12469 4112 -7050 -31579 -6960 28385 9037 6934 9807 -25637 -56277 -18147
32553 -18147 -6734 11215 11344 -5147 -21877 -6815 34687 65503 48783 19911 -33580 -60941
32541 -60941 -77716 -51657 -26688 -28467 -9287 -32573 -46802 164 15767 5265 -2766 36649
32529 36649 38611 17745 19036 -5851 -54060 -65869 -75794 -45215 -12936 4128 -37422 -61549
32517 -61549 -77793 -53646 -30820 -12418 -13442 -17640 -3038 -765 40493 62258 31431 48519
32505 48519 39460 41708 37472 37038 -13888 -58628 -60795 -41182 -17842 -8388 1066 -14415 16084
32492 16084 12797 -2225 16136 2143 13696 52810 77404 40182 54992 45931 36764 -3372
32480 -3372 -15539 -61629 -91077 -79157 -13804 -27438 -27719 -27666 -36403 -19071 9172 27531 52373
32467 52373 20701 -7767 -37751 -28193 -20150 -28062 -30089 -55402 -36158 24 -7619 -26020 -33097
32454 -33097 -39232 -24609 -18082 -14917 -31785 -38533 -25124 8740 24143 16875 19945 51798 13701
32441 13701 -53717 -29661 26679 31326 14589 -16712 -50280 -92585 -115916 -79541 -42829 -16111
32429 -16111 -39817 -36907 -6058 -18288 -41388 -31763 3266 -15116 -3172 -41293 -57386 -44395
32417 -44395 11635 28871 44061 36100 75711 19712 -44538 -44442 -31919 -44640 -42844 -32574 -21049
32404 -21049 -16259 -28117 -16614 -13762 -37702 -51916 -65037 -49100 -33097 -49598 -22710 -10941
32392 -10941 27130 31249 23942 -9421 35 -4994 -14480 -6807 29320 -11441 -6302 11240 21116
32379 21116 5378 -20090 5881 26079 43936 41094 25825 20335 17387 65775 46582 9721
32367 9721 -32513 181 41286 40214 5350 -18634 -4447 58960 44944 -30974 -49319 -18588
32355 -18588 -62994 -57701 -57792 -29663 -23808 -15086 8315 -17666 -28925 -29876 2674 -3422 -47903
32342 -47903 -63715 -39968 1058 13427 17861 18851 -3928 31622 34744 9172 3660 22183 -11643
32329 -11643 -51367 -68304 -46945 -59471 -57469 -47197 -35458 7858 -712 -24093 -12263 13798
32317 13798 21950 -17114 -7738 14257 962 22989 -10471 -25826 -32674 -24149 -28651 -45595 20476
32304 20476 79214 78325 40294 -1457 -14685 -41733 -13531 -2727 9523 38392 45572 12186
32292 12186 -15628 -25845 -16908 -47205 -42972 8454 21945 24159 57 30250 38043 25782
32280 25782 -9966 -3241 -45822 -38226 14403 2438 -43921 -17563 5224 -8452 -21735 -36566
32268 -36566 -49059 -47295 -67184 -91275 -17550 -5850 4558 26520 -24128 -70120 -44044 -12224
32256 -12224 -30256 -27896 -5799 9782 41383 33844 15915 29906 32069 26253 20070 52517 49038
32243 49038 15127 -21315 -12669 7350 -10779 -1799 -2646 -5053 -27538 -51640 -50951 -36500 -63284
32230 -63284 -108200 -100088 -139428 -113407 -97181 -94132 -43925 -88840 -109738 -71463 -67020 -9649
32218 -9649 17870 27105 3471 -16696 11142 27772 30231 13547 48341 71421 62544 33784
32206 33784 27025 81422 93156 72979 30814 -33855 -22980 -56120 -89443 -62970 -37822 -60659
32194 -60659 -56420 -69462 -116620 -110079 -76395 -45497 -11727 -26788 -23116 3624 1996 41124
32182 41124 94733 80441 42315 -994 -52279 -58286 -41256 -39834 -6312 -65067 -42555 -52280
32170 -52280 -58173 -16998 20989 64936 57865 57526 79809 75452 81487 93771 117214 102035 95054
32157 95054 68886 26190 -25457 27298 30605 50957 63088 52667 25528 26158 57423 69875
32145 69875 60078 31205 25901 26305 58249 96152 90609 26924 34229 20122 -1555 19944 8189
32132 8189 25977 38054 30298 -32523 -54730 -51817 -40847 -16785 18665 11868 -18627 -11711 71
32119 71 50830 45222 -6715 -16151 -28733 -20066 39674 4847 -22025 -1828 16662 3284 27790
32106 27790 52551 28788 8719 -10371 4139 -21894 -60610 -104517 -27141 -38561 -31955 -2673
32094 -2673 -8275 -48891 -45290 -32707 -23110 -52239 -39913 -37122 -22592 -9860 -45082 -53976 -51118
32081 -51118 -60743 -104316 -139898 -102241 -23712 22617 -634 -18737 -54342 -91831 -118172 -91749
32069 -91749 -53812 -41630 -58971 -13985 -5380 -22952 -84694 -79311 -42525 4961 -10099 -34797
32057 -34797 -49221 -31979 -18546 -11390 -35638 -48197 -25646 7835 44394 46252 37961 54024
32045 54024 32596 -13103 -39004 -56521 -59404 -34652 -13927 30682 80124 127181 94322 56092
32033 56092 12315 -40730 7027 17705 -9091 -13619 -19645 23328 66149 47546 18458 23740
32021 23740 34934 13536 36768 48976 15520 9859 -46521 -69091 -70807 -120139 -98627 -30779
32009 -30779 -31200 -9392 13349 15380 -13074 42859 52639 12500 1101 -2449 21840 5519 -21342
31996 -21342 -12037 9842 -5728 6085 21640 -25813 -14374 9567 25546 39780 8311 -43950
31984 -43950 -41170 11270 -24646 -56124 -81166 -79698 -118516 -109885 -55347 -65736 -54603 -55834
31972 -55834 -70538 -46843 10354 14905 11181 28550 -28314 -29931 -3148 -6690 40381 54543
31960 54543 20446 -1152 22483 -3256 26971 73914 67655 21030 19719 31548 17670 -21511
31948 -21511 -23484 16014 20822 48840 21102 3741 -20439 9127 5095 -38412 -24016 -10896
31936 -10896 13738 71455 41249 12265 -60231 -33671 -5648 25705 16489 1076 18769 10954
31924 10954 12804 -983 -715 38023 6200 -33200 -36227 -95675 -97064 -52069 4696 -1202 -32311
31911 -32311 1650 18669 26116 1682 -26701 -16932 -2955 -5626 12640 63070 92233 90958
31899 90958 95990 51849 18705 -39647 -80860 -65676 -48860 -25635 -25755 -31633 -40124 -46238 2955
31886 2955 28569 20678 20929 1537 17060 -14175 -54190 -65465 -47147 7585 56176 3189
31874 3189 -53550 -76399 -136006 -101099 -85258 -78954 -49871 -18117 1845 -1348 -46441 -61208
31862 -61208 -44748 -42662 -4089 -10311 -4873 -5114 2404 -15344 40121 93955 97331 72855 58199
31849 58199 33733 18985 68944 54706 9011 -10813 61801 52280 52411 55174 56189 23608 -10959
31836 -10959 16284 33975 35478 -37743 -42618 17384 -4168 -40267 -65655 -120818 -108741 -101385
31824 -101385 -64311 -41795 -39477 14327 28111 -14523 -11962 10980 -36448 -85617 -99264 -83563
31812 -83563 -40230 6415 -1911 14580 41093 -13688 -39279 -53310 -80044 -71922 -45310 -19601
31800 -19601 -51973 -40141 -18612 -62805 -111016 -119422 -88138 -19654 12292 -12163 -40314 -33793
31788 -33793 -57666 -26363 -19011 -38235 -11099 22472 1604 12732 -41837 -31781 -58603 -68849
31776 -68849 2821 37247 36193 48649 62140 36674 48568 26237 -36786 -48440 -11707 54704
31764 54704 91380 48686 40690 46531 35095 56878 28750 4515 29808 64541 48983 55408
31752 55408 37135 1455 -12981 -22576 -7021 26028 31018 -16528 -12988 -23445 -50486 -76187
31740 -76187 -90331 -93926 -27824 -6541 -10800 -51063 -84688 -104592 -76878 -53139 -24432 -59888
31728 -59888 -10829 -14986 10476 2165 -29729 -55589 -6159 12116 -18317 -3277 24129 39133
31716 39133 23638 -12972 -37811 -45164 20304 36914 -2436 -8743 -31013 -14811 13684 12345
31704 12345 16550 10274 44818 27140 12792 -3974 -48030 -5109 18181 -34876 -64123 -74595
31692 -74595 -27445 -24171 -62596 -32685 -14570 -23413 -10766 22719 9832 22795 13582 22889
31680 22889 15429 11019 52657 57901 33229 29568 22924 -20094 -37028 -56762 -66883 -47366 -50715
31667 -50715 2193 4742 -68 36168 47398 58594 55671 59027 72045 46477 26320 19262 33186
31654 33186 39646 -10586 910 3640 -17968 -29301 5334 14308 48276 55550 65714 80319
31642 80319 61378 4402 16605 -3408 12661 11475 9875 21470 -20662 -78027 -49738 -9425
31630 -9425 -1822 -19368 5475 15207 19088 11586 27921 59974 56033 16801 -30670 -3226 -9457
31617 -9457 -20210 -15406 17078 753 -8552 -39077 -35689 -42410 -29441 -13418 38956 8345 -35589
31604 -35589 -69213 -31990 22574 39130 35844 38178 40255 13613 -36557 -47022 -29826 2629
31592 2629 35269 56325 105778 59663 -42611 -27443 4649 55209 35424 63738 26627 30024
31580 30024 9472 45234 37696 5676 26647 66115 69572 60463 62271 64575 25041 35386 69913
31567 69913 17304 -24420 -22976 -28029 21038 13077 -16716 -38238 -41700 -7937 -5209 -7533 -14875
31554 -14875 -49850 -63654 -33725 36074 51426 58566 47062 81114 66106 12387 20873 17647
31542 17647 -24275 -13205 -25796 -15879 -9475 3999 33222 -751 -36074 -17786 -28669 -27869
31530 -27869 -24503 -50201 -67122 -46112 -13227 -12643 -6498 21496 79135 88797 36431 30445 63604
31517 63604 24137 14816 1473 -802 -15163 7610 9349 5486 19285 -5267 -33625 -31858 11721
31504 11721 2374 -11981 -25652 -47156 -52211 7642 49029 26479 16907 36354 21319 23019
31492 23019 17195 39361 72095 22726 -8291 -20420 15926 -9604 -56966 -66209 -48004 -55191
31480 -55191 -77930 -46357 -4880 27329 -15082 -9270 8784 22863 16321 33428 -16781 -102490
31468 -102490 -111741 -82489 -13664 38535 37306 16610 -6270 -24517 2691 -11627 14681 13350
31456 13350 -17142 -32545 -49385 -61045 -47149 -43984 -67177 -40784 -42900 -15981 -15416 -8848 -30320
31443 -30320 -13959 -15911 -48489 -48292 -36068 1667 34464 43448 26985 15824 13158 -8505 23464
31430 23464 44161 -3167 20785 41360 30779 24582 28562 12224 -7454 3032 20469 9461
31418 9461 -43229 -83715 -64777 -17987 3662 7720 6526 -22125 -19755 5467 8011 -2511 12610
31405 12610 23864 6617 -16979 -12689 -16842 -23421 -50284 -57813 -31605 -76617 -72610 -75785 -53280
31392 -53280 -48493 -47727 -6374 -14401 -71007 -91992 -64728 -41722 10607 9898 17526 -17770 -43433
31379 -43433 -33228 -53767 -86500 -90171 -94170 -134271 -101528 -71002 -22596 28438 79435 81241
31367 81241 85340 62496 26651 -17536 26515 64532 22889 -24370 -40272 -58283 -58877 -9328
31355 -9328 -22029 -3099 28578 81394 59184 11529 -26772 18069 34782 42076 34961 80245
31343 80245 92880 73332 64496 66711 57695 10413 -15674 -22419 -61804 -28016 -38462 -44491 -11888
31330 -11888 51871 101024 92428 44932 -12103 3978 56305 67763 4060 -24958 20969 32325
31318 32325 34552 16936 66121 100661 71420 41218 -9264 -31474 -4097 3610 -3289 16609
31306 16609 -16743 -9522 11844 61860 40751 -11728 -96823 -84868 -15964 -7014 9953 878
31294 878 20526 -7172 -44991 -53863 -70273 -69159 -74462 -74267 -135719 -133940 -97614 -53121 -31238
31281 -31238 17223 -19995 -27938 10574 8074 17220 5097 -17535 -24627 -56209 -52185 -45490 -11017
31268 -11017 -3094 25284 1393 -12177 25790 14495 -30038 -63005 -53624 -14799 -66245 -70988
31256 -70988 -103110 -105437 -81846 -38383 27283 34563 39425 41051 47867 12909 -31326 -43408 -15177
31243 -15177 3766 44979 32502 3214 -30329 -10542 31630 38225 53267 43538 61752 65436
31231 65436 71813 59741 30772 -33971 -45837 -24218 38465 46310 -2520 31118 10931 -882
31219 -882 12089 7167 -9134 -18276 -7649 10339 -2287 -9581 5426 51922 83219 36438 -9670
31206 -9670 -4070 36550 40768 52275 4523 -25165 1778 10016 17182 17761 -2560 -16488 -17537
31193 -17537 15655 37134 42495 47578 32120 10462 -51088 -47884 -37716 -2266 -31381 -23662
31181 -23662 -31898 -66067 -73808 -69818 -57565 -9966 -10603 -8072 10414 17842 11326 12413 -6230
31168 -6230 -12015 49165 97877 79003 73413 95393 76318 93508 43266 5232 -1180 -32700
31156 -32700 -17793 -19834 -71025 -70749 -41939 -21071 -26343 -48249 -25772 -32878 -42409 -44879 -54002
31143 -54002 -90944 -127713 -97338 -55939 13052 16638 -21413 3064 39605 45936 57039 61750
31131 61750 38057 31552 10519 -1450 -25222 -3168 13134 17059 2405 53948 26313 18288
31119 18288 10468 -30202 -67942 -17134 65782 76040 51782 68104 60383 56145 9424 -43690
31107 -43690 -13990 29025 58377 31858 43319 47351 32909 32388 -19773 -4372 18926 20976
31095 20976 19869 32277 33915 80363 90958 73062 32559 -8336 -43536 -34801 -36593 -29317 -26528
31082 -26528 -62829 -63830 -71899 -92844 -65420 -43528 -17468 -33333 -69395 -63949 9650 16736
31070 16736 16919 5024 -23393 -823 20201 19040 7703 6856 25267 6983 -8779 -51148 -11683
31057 -11683 -11910 -24688 15131 45118 42721 72738 41200 -64149 -115862 -88198 -43684 -37975
31045 -37975 -29314 -30373 -1153 21079 22944 9988 11571 27211 38200 25259 43886 62723
31033 62723 15219 -1317 -12657 12708 18688 -49171 -38540 -11031 -2931 21301 65460 94749
31021 94749 102408 11730 654 -27791 -17175 11174 -3603 -32803 -23246 -35361 -100340 -135924
31009 -135924 -78762 -31303 20807 -2717 -55824 -64121 -15991 30761 19245 7735 5355 10519
30997 10519 70595 31916 38703 76331 42984 1803 -20150 30759 37681 -8359 -2909 32926
30985 32926 -11668 -39328 -60020 7474 78761 66131 1937 30848 16367 -50917 -68087 -36470
30973 -36470 -37762 -13316 -12456 -1119 24012 -6467 1799 49314 59029 49176 10026 3556 38681
30960 38681 67099 -20017 -90813 -79426 -70303 -39099 -21158 -41127 -6927 18582 -49963 -68606
30948 -68606 1516 26574 -33846 -19723 -31416 -49692 -18022 -36775 -110359 -107652 -72473 -47934
30936 -47934 -23066 -34567 -14115 -50220 -87210 -62915 -46336 -26488 -8834 -13527 -59952 -84935
30924 -84935 -82272 -75853 -78725 -79294 -41330 -1188 -28544 -11153 -41082 -68863 -33117 -27764 330
30911 330 -37253 -39974 -35784 -38165 23368 73424 52830 44653 38622 74409 57009 9016 -11047
30898 -11047 -44533 -93357 -139268 -154731 -112560 -49281 -17760 -37630 -29222 -36637 -37380 -28994 -49812
30885 -49812 -39443 -24775 -33059 -56197 -46719 -10739 -8092 -13233 -13595 -55800 -60919 -8898 12317
30872 12317 18930 18292 6169 7581 -22425 -11905 3255 -26724 22371 72188 37495 1421
30860 1421 -31424 -24077 -54081 -56757 -45333 -58594 -24442 38775 39037 60473 50769 -23654 -50391
30847 -50391 -79546 -50613 36511 59026 -48473 -129808 -97243 -85411 -103820 -72621 -81135 -54565
30835 -54565 -13547 -19237 -12444 4694 1084 48117 52828 7700 -48515 -28379 -8167 -9841 -36536
30822 -36536 -41181 -25442 -12629 11105 22902 -12000 -15346 -20822 -67693 -82043 -89453 -57450
30810 -57450 -1970 1683 16541 -12443 -28150 -38185 -47083 -45052 -21911 -31330 -32898 -31238 19468
30797 19468 32496 69002 46058 -18772 -54955 -13037 19143 -53340 -45159 -27104 -17074 13601
30785 13601 28400 24735 10622 -13232 -67919 -99127 -61898 -46811 -36733 -14950 21391 28447
30773 28447 -5235 2596 7627 -5046 1342 -5125 4509 -5584 -8310 13593 -11833 10939 58484
30760 58484 98693 125316 77837 52554 16540 33763 28666 37311 41471 4900 12770 18839 3286
30747 3286 -18106 -5717 -2661 9940 -28590 -38726 -51903 -64139 -63336 -64191 -51029 -38344 -41537
30734 -41537 -52823 -75664 -51363 -76953 -94639 -77133 -37306 -22628 -46475 -29442 11009 25604
30722 25604 71388 93000 136851 83414 64079 48005 8539 -17762 -17430 -2755 25871 16838
30710 16838 -9429 -72974 -74844 -45353 -33218 26872 72510 44796 8795 45693 95109 154076
30698 154076 155458 83919 51458 23514 -32373 -26867 13874 52742 36433 -4439 -6122 -4114
30686 -4114 -10445 17340 77444 83466 79776 54076 -8482 -54184 -40889 -29000 -24295 -8012 -17756
30673 -17756 -21089 -51696 -22836 -9413 -18285 -75447 -82918 -38733 -21458 34182 49717 40369
30661 40369 51800 21461 -523 6423 -17594 -4746 7336 244 20078 67694 55088 53173
30649 53173 95993 75246 43165 20201 -9956 -15528 8827 16126 12366 48216 50117 -13273
30637 -13273 -34566 -31458 -9113 38315 84058 105049 64483 -12382 -28969 -24687 -6899 -4432
30625 -4432 -4282 -19794 -16790 -14152 -2226 22108 -31543 -68773 -98805 -112837 -49960 -29911 -5919
30612 -5919 -11713 -6651 -45860 -51932 -51553 -37587 7134 50959 86760 47260 83390 85971 40680
30599 40680 -37647 -91102 -123031 -82650 -35009 -26277 13870 -16858 -64655 -12543 20656 4614
30587 4614 13512 -7192 -85473 -94755 -59110 -70974 -64140 -67638 -84476 -92082 -21425 -11535 -27143
30574 -27143 233 12762 -13442 -5857 56792 51507 41494 45718 29830 33173 41845 55699 45064
30561 45064 45812 16634 901 -44052 -39636 -31254 21776 -23283 -69966 -28987 -8121 -14324 -19183
30548 -19183 -30337 9125 -1893 -1204 6957 9374 4720 -3032 8848 51590 30184 8882 -9107
30535 -9107 33663 -13811 -45610 -24183 -29981 -31619 -68300 -93014 -57996 2063 20946 41826
30523 41826 68867 38354 9516 -27405 -12005 -25909 -10413 14253 21167 13947 43254 37538
30511 37538 19654 13717 -8702 17171 33492 7982 239 40410 3915 -7486 -13192 -76792
30499 -76792 -62497 -7968 8411 -17358 -21178 3716 39153 59538 51194 73656 85232 48187
30487 48187 -28984 -52712 -30922 -3850 50769 42053 10925 26805 36898 58298 70490 55604
30475 55604 54959 124 -42692 -35498 2272 9512 15471 22598 4640 -30422 -25075 -15935 -3811
30462 -3811 6931 44715 635 -25748 -88883 -93862 -53829 -63515 -48526 -80696 -105351 -57002
30450 -57002 -20498 -37221 -48181 -49706 -66922 -56579 -52720 27543 32750 -27265 -36289 -26643 -6924
30437 -6924 22374 -2515 13226 13508 -14636 2297 1924 -41644 -54409 -61358 -54350 -7667 -21350
30424 -21350 23716 17146 -29272 -41911 -20635 -46185 -34175 -28552 -31413 5010 -33 -42899
30412 -42899 -69667 -64326 -26692 -36731 -54075 -40959 -2032 2693 7078 27857 18580 61117
30400 61117 74101 74017 62787 80911 122475 72489 44142 10796 -21698 -9004 -12507 28407
30388 28407 77015 71834 -9511 5827 -164 17687 -10440 -1989 40565 49026 60372 25821
30376 25821 6300 34292 16187 -18278 15620 19378 -42290 -23060 -12764 -6998 9562 13274
30364 13274 31394 56332 33814 43324 17860 24484 47951 25641 -23032 -19772 -20028 -24907 -61220
30351 -61220 -66882 -29567 17330 5229 -26402 -40436 -73311 -74964 -53257 13282 19387 45463
30339 45463 38537 22836 4977 21712 13868 3825 -9692 47614 86233 61942 48053 5406
30327 5406 -13202 -14253 9600 -5728 -37500 -86521 -104502 -48182 -41722 -21883 -44214 -38294
30315 -38294 -29639 28765 49000 19031 11632 -3998 7567 60345 28690 -42599 -54507 -12890
30303 -12890 -18993 -14755 23878 33382 14703 -32810 -8875 36219 26843 7210 -35219 -36821 -7813
30290 -7813 -12213 -25972 -15358 32556 50405 57802 38811 32684 31942 9461 8283 21728 69810
30277 69810 96669 1891 -30744 -44834 -48251 -58288 -27993 -10397 -19322 -33772 21882 37946
30265 37946 47291 25642 -15467 -12804 -10352 14613 -5943 -33704 -74924 -78094 -55726 -8412
30253 -8412 20583 24408 12995 48164 47598 -3670 -15360 11736 15282 -10967 -29752 -7393 -32124
30240 -32124 -18199 16696 39642 36137 4806 4382 20038 14892 8305 -25164 -50895 -22359 -991
30227 -991 -51579 -57470 -42634 -85207 -44303 -26330 -8892 -42341 -49675 13962 81282 87711 117057
30214 117057 72257 19048 14047 25009 22228 4299 -41064 -26311 -10585 22381 43379 19759
30202 19759 6270 5529 28202 63203 65410 33834 18375 13 13722 35515 -2247 -4256
30190 -4256 18427 7306 -4093 -45994 -57267 -26091 14685 8948 30305 35034 -1604 14753
30178 14753 64274 42540 -39731 -101871 -44961 46091 57650 36729 14705 27378 25747 3737
30166 3737 -16957 -7256 19370 30658 68340 66125 16883 42395 47043 18852 39017 63950
30154 63950 43464 -9303 -22755 8071 12272 14755 -24337 -37206 -35283 -65148 -69394 -26828
30142 -26828 30457 71892 34177 -3534 -47314 9053 74961 51070 35959 5874 -69610 -15504
30130 -15504 -19694 33889 29240 9915 33185 27735 13690 -20679 -33862 -10392 -7357 -21642
30118 -21642 6881 -340 -8257 -33071 -52138 -29221 -19562 -49363 -46976 -56685 -58476 -37059 6312
30105 6312 29071 32542 15225 32800 53069 15142 42404 66088 64663 59849 65300 71512 56591
30092 56591 70031 48269 9995 -6219 -57 -7520 128 13115 -20324 -36642 -55701 -101678
30080 -101678 -59773 837 6434 3268 -23249 -18257 -623 -1657 -40664 -76367 -36802 25804
30068 25804 51159 9880 -41371 -31562 11438 40167 75321 86870 81022 28986 -1855 -39575
30056 -39575 -1015 32256 41787 64462 49459 76721 70636 43531 54628 34429 15514 -27362
30044 -27362 -35073 -92350 -132829 -113816 -120846 -46471 -46715 -26117 39516 68172 57720 41908
30032 41908 42820 48303 60163 60502 41041 32768 50530 36810 18650 19040 412 -14851 -29326
30019 -29326 11239 27799 32256 6424 -26745 -23322 -19946 -33763 -91445 -125738 -74680 -42658
30007 -42658 -22842 -41293 -68985 -53514 -30163 -16393 -15604 -9435 13523 395 13200 2969
29995 2969 9715 -27846 2055 52626 77474 45193 -210 -5921 17696 51149 12617 42145
29983 42145 93966 54892 81789 93053 88061 101775 79121 21995 10164 -13725 -4739 16191
29971 16191 33483 5660 -32248 -30686 -25036 14458 -3629 -59218 -40013 -17745 5099 -68060
29959 -68060 -87026 -58473 -65276 10264 52071 55503 58620 47351 50025 29258 -39101 -67366
29947 -67366 -48451 -54348 -72791 -92533 -100395 -68104 -57019 -21887 -28305 -38970 40785 70532
29935 70532 -11699 -40215 8513 24680 61980 46054 -31414 -60785 -64540 -31767 -47979 -18829
29923 -18829 83327 102992 76515 27890 -4906 -29707 -41544 -63564 -14105 14972 -16073
29912 -16073 -9803 -5487 -16964 -33762 -36801 -20395 -34664 7215 22306 15912 10223 -11129 -33190
29899 -33190 -19172 -17659 6593 23692 81250 95218 139464 105538 71307 4451 -65940 -67699
29887 -67699 -78774 -33689 -15502 -2402 -21197 -57688 -73607 -42228 -10418 -16048 -2290 10260
29875 10260 -17899 -8548 -17810 17176 38222 31276 -26356 -96304 -79320 -46205 -36931 -20590
29863 -20590 -14588 -4243 8313 -25313 -23080 -9291 -42602 -22897 36271 68191 73154 45533
29851 45533 -21396 -55852 -59467 25180 75862 6032 -43230 -33975 -18052 -32480 -54207 -60583
29839 -60583 -20326 -38469 -63100 -28386 17084 -11312 -17216 4226 -54933 -70644 -59448 -39142
29827 -39142 -27311 -8200 792 -28775 -31839 1073 -8649 -36011 -9083 21247 -10635 -9214
29815 -9214 32713 46718 49553 16444 -17065 -9615 8584 41738 38233 31150 -20490 -28697 182
29802 182 -15018 -15571 -16377 -3504 -12881 -4346 -38074 -61264 32205 76339 57443 24281 1964
29789 1964 9845 -5158 -42251 -61960 -60274 -82258 -80917 -47272 1123 43976 80073 44816
29777 44816 19360 -40994 -61744 -34682 -18885 -30678 -21950 47431 36232 -16528 -10599 21984
29765 21984 21924 15803 -21572 -22914 17054 24985 7197 40871 69758 26659 5098 -20614 2595
29752 2595 -9982 -36369 -25766 -30590 -11123 -20066 19802 47210 49270 31763 6564 -9183
29740 -9183 -73928 -92536 -43498 -34723 -80521 -87157 -47726 -16551 -38990 -50235 -90321 -116750
29728 -116750 -114385 -63044 -37888 -20659 2517 -11679 -7770 5119 9632 -6744 2538 27693
29716 27693 42421 55003 39074 8708 -13589 51345 75790 96951 49672 30905 -8521 -40455
29704 -40455 -27375 1339 -22747 -15520 30671 58204 69989 39044 1330 11834 8469 12550
29692 12550 24223 10275 18453 18952 49637 17336 -23431 -25221 -39664 -93515 -120189 -100537
29680 -100537 -82830 -105130 -82567 -69686 -62175 -16514 3035 -43053 -92691 -92665 -94512 -62367
29668 -62367 -39964 -45239 6334 62966 53402 68883 39844 1559 -23491 -15111 -39000 -68802
29656 -68802 -60293 -63573 -19313 28983 -2870 -37072 -17900 1851 31717 51 -44017 5990
29644 5990 29526 59051 56949 25568 5801 -13553 -19030 2691 9368 -57508 -72882 -52392
29632 -52392 -282 29295 29208 26509 13711 -14693 -30223 -8071 -12766 19858 -3585 26604 64111
29619 64111 84514 81865 66065 76124 62325 -16112 -3197 44309 73773 52660 -14267 10143
29607 10143 58685 68344 36520 72690 73289 43110 359 -30637 -21067 -32534 -19565 -56568
29595 -56568 -33099 -42897 -84829 -76096 -54198 4721 30055 -6225 -19118 19836 38566 66667
29583 66667 44839 25330 38485 55027 35686 44477 67002 50106 92780 89654 56045 31934
29571 31934 66951 100319 91475 70474 -18907 8470 33804 68552 94834 78600 67184 46804
29559 46804 35428 -179 21579 -17298 -51183 -27294 -3870 -13971 -8732 -35947 -30525 -53465
29547 -53465 -58091 -51152 -66373 -86964 -131729 -93631 -53888 -55624 -53732 -54159 -73130 -89589 -77837
29534 -77837 -22835 25667 100564 91896 39780 42963 61149 81143 86321 21508 -32170 -49816
29522 -49816 -36321 -5925 13432 6764 30922 14537 -1519 1313 29037 18022 18304 15516 23622
29509 23622 23056 4489 -18728 -13738 -22097 -46323 -54298 -17491 -32994 -27758 16910 39866 73460
29496 73460 53135 11512 -35588 -61792 -9085 77054 58039 3518 -19741 -14851 10796 -28209
29484 -28209 -74382 -74669 -55514 -86029 -95819 -91348 -67447 -61527 -29635 18210 33968 -279 -3029
29471 -3029 -5107 11773 -30670 -72042 -81988 -78466 -64849 -35474 -14337 -28769 -22005 -30374 -33410
29458 -33410 -12418 -35939 -44973 -19967 1115 12090 -349 211 15771 -45145 -102375 -98593
29446 -98593 -58376 -27250 -27134 -56155 -29322 -30734 -50427 -44406 -55918 -50420 -42222 -45345 -70885
29433 -70885 -81495 -74548 -38706 -2238 -58981 -93134 -45281 -16038 -6074 -23510 -18073 -32790
29421 -32790 -35422 12634 51796 60954 56125 56181 52834 81512 50816 6 -24505 -18588 -6180
29408 -6180 -20511 -58644 -54212 -76348 -48811 -6284 -13828 -4550 36261 26449 14767 59216 56751
29395 56751 23342 12829 29270 67980 55963 24474 15675 18939 14562 40556 69019 16990
29383 16990 -50649 -54077 -22746 20128 9732 -5467 25245 83842 78399 67261 26395 6496
29371 6496 -12357 2529 -42548 -56530 -76542 -63664 13705 38566 -34522 -110220 -117497 -101208
29359 -101208 -75824 -51852 49074 87200 38841 18578 12025 27874 16307 -2471 -29852
29348 -29852 -55074 -11010 28859 14638 -17693 -11129 -2914 -26024 -62442 -47119 -55158 -47369
29336 -47369 -59293 -74178 -43847 -6497 18844 25286 -28139 -33596 -7035 8661 12966 8772
29324 8772 -16126 13252 21379 13746 43389 52004 41841 38087 9786 48001 130270 157132 73790
29311 73790 6608 9459 7071 -13059 -42424 -66998 -86758 -104609 -80754 -40333 -45366 -31073
29299 -31073 -31455 -14320 -127 29780 70629 100104 117437 72014 21565 -44083 -35035 -7511
29287 -7511 14587 48777 60872 4874 -43044 -53233 -49723 -17763 22585 36974 39195 38988 46871
29274 46871 1363 -23226 -17860 -37447 -19509 -21102 979 19323 22732 36727 74051 18014
29262 18014 20819 22300 25014 38138 60348 47667 -18096 -28597 -5730 12687 13377 62279 33109
29249 33109 -25273 -33421 -60514 -19764 8382 4360 2591 -27590 -59443 -76169 -63628 -47517
29237 -47517 -31404 -1863 10709 -22093 -39251 -36096 -26463 -30210 4998 -9916 -16557 -62964
29225 -62964 -84971 -31845 -59733 -65217 -91443 -130441 -122741 -64082 -8061 4337 33105 14680
29213 14680 -6195 -5707 -24309 -54103 -26868 3235 6389 -9317 -40406 -48482 -39452 -18859 14959
29200 14959 15251 4752 44912 59811 85438 80029 72788 -12282 -20398 3361 52479 55980 35040
29187 35040 38819 39914 56587 55319 47342 26244 46833 46319 35738 46915 37969 -26486 -25466
29174 -25466 -20271 -55826 -54289 -35106 -34889 -20067 39599 85306 36555 7394 -6756 -17213
29162 -17213 -46261 -17116 22094 49591 88413 62714 -11981 -50624 -58438 -38481 -31158 -36783
29150 -36783 -3824 -8248 42818 72349 64480 33300 19710 17694 4520 -37314 -50246 -11875
29138 -11875 -15500 12288 47547 53628 69438 68564 42379 10043 -7905 -20929 -15533 -16130 -4441
29125 -4441 -11922 -27283 -66100 -51358 -41377 -22180 32458 32552 2473 -58419 -49259 -28459 -21584
29112 -21584 -7616 25375 46216 18182 -7377 -29866 -34854 6129 18430 38239 21627 1553
29100 1553 -21704 -25440 -48890 -53496 -37603 -23837 -26396 -21332 1771 -11020 -15506 29657 56541
29087 56541 35202 23432 35502 50092 49971 31395 2128 -14770 37161 61929 46892 40255
29075 40255 3577 -33360 -86081 -87461 -78236 -57348 -30864 7669 -3012 -38548 -66710 -88452
29063 -88452 -68297 -54078 -42492 -17883 -49640 -24137 3532 -17084 -39683 -18969 21278 25441
29051 25441 51863 56287 44203 54888 53524 3247 -34161 -33061 15672 17621 -14434 -34368
29039 -34368 -39156 -56048 -81286 -11903 13177 28397 75219 91574 64082 22742 -29716 -61205
29027 -61205 -56083 -86284 -44715 -10331 -19489 -53435 -78532 -37005 -14912 -7158 -45604 -31806
29015 -31806 -884 48050 68995 38370 -68900 -88321 -25667 10207 31351 22559 13608 9613
29003 9613 27280 43458 39406 12112 -10993 -9004 35417 58219 45304 39357 57896 70203
28991 70203 74778 89875 50878 -18352 -62641 -72128 -3195 36711 83226 45136 11716 22123
28979 22123 -154 24430 63913 98045 4264 -34898 -36736 -75995 -97081 -62219 -16634 -34254
28967 -34254 -61733 -62122 -94916 -133903 -95134 -46954 -34396 25831 65197 44016 17859 25456
28955 25456 45737 21405 29032 61609 39860 32201 2631 -9969 -2806 3139 -17231 -10224 43576
28942 43576 57630 58972 46124 -23648 -25820 14593 33996 34398 30654 10961 -2179 17415 -13135
28929 -13135 -4231 59170 48214 33605 19814 5547 69831 42714 63071 61676 31913 29360
28917 29360 16949 15072 17408 56461 46025 27692 18157 8833 -31582 -35280 -40390 -73288 -77265
28904 -77265 -48592 -4727 -15992 766 5945 31025 28592 -6159 -21178 2519 -46206 -26314
28892 -26314 -6383 10336 3346 -5991 -13041 -11066 -3541 3695 20989 -15410 -46296 -4539 -26536
28879 -26536 -263 12141 -5916 10718 33045 8630 -30633 -30742 -30715 -39574 9550 24512 18515
28866 18515 3578 14060 37350 11288 -2220 20532 -12759 -23930 -58678 -88647 -71794 -66976
28854 -66976 -45580 -7668 -25112 -47533 -22903 -5968 25134 58398 35510 7846 27307 39048
28842 39048 83332 97283 91222 54169 -3672 21246 75029 80511 114320 92883 44193 39551
28830 39551 41098 53823 6112 -32513 -33362 -32341 -13830 17753 -56885 -117795 -109735 -114473 -87763
28817 -87763 -29445 -11474 33809 21503 -31123 -34331 -43294 -26644 -29486 9827 38642 35616
28805 35616 11458 -2178 12566 -5584 -15560 -41903 -25439 17455 86728 55977 73725 44619
28793 44619 321 8656 53578 69674 51014 26759 7801 16921 17867 -14919 -47666 -15071
28781 -15071 -14076 17630 1690 24395 48909 11098 -20569 -68932 -99943 -66382 -10888 8872
28769 8872 -44735 -16291 30487 46010 27893 35650 51312 78898 41405 6285 9762 21580
28757 21580 9057 11818 22018 7026 8306 -36104 -54940 -61135 -65096 -51436 -65322 -64507 -47159
28744 -47159 -52448 -47946 -24745 -46251 -49764 -31327 1835 26360 47908 40967 67889 99833
28732 99833 94308 66026 25096 -16399 12656 55983 34032 4124 -715 -3744 10786 -18715
28720 -18715 -17221 -62669 -55533 -215 -4690 -18901 -65989 -20232 5346 14744 61308 74492
28708 74492 87585 83830 51155 -10540 -25207 -23088 9865 60878 59749 35573 -4840 -23662
28696 -23662 -3838 18450 -1864 -39132 -15448 -9095 -8394 -4169 46762 48777 8248 -30699 -33051
28683 -33051 -30479 2198 36191 25787 -17452 -7284 -24804 -45922 -35003 -38134 29023 38861
28671 38861 15177 -31041 -64913 -25308 30407 22724 14529 -26357 -15154 9210 23600 15136
28659 15136 13109 62316 62580 19487 14597 7029 -31362 -17219 -5613 -169 -11013 -36213 -93094
28646 -93094 -112610 -60428 -31297 -16533 -19530 -16626 6228 28575 51592 73693 83058 82014
28634 82014 88157 93628 73793 -9119 -23932 -38067 -67917 -48594 -53918 -26705 -60570 -68365
28622 -68365 -39686 -3989 58207 87160 96335 76941 26219 69760 93435 94457 91365 63957
28610 63957 33387 39452 61058 36201 6434 34121 45603 20531 39153 25620 9184 50056
28598 50056 99640 64901 27913 -3612 34986 53013 78671 55507 16232 -3920 -20587 -10200
28586 -10200 -31394 -59065 -57823 -48979 11289 14845 -53883 -64553 -43873 -27891 -40231 -14477
28574 -14477 -63444 -85090 -80382 -30867 -11121 13244 14320 -19470 -35895 -54677 -38872 -37633
28562 -37633 -41171 -27774 -30835 24999 68683 102198 113426 75337 31806 2977 -17351 12406
28550 12406 26961 -16387 -31962 -41681 -53627 1745 59893 64009 27672 12968 -7283 955
28538 955 55627 42309 33649 29374 16155 9495 9259 -38583 -14948 67936 109826 77126 89529
28525 89529 108210 81752 86164 50469 -2663 -27430 3457 -23770 9272 53122 100387 94289
28513 94289 12314 -12145 23465 -9443 -30162 -25426 3311 42762 59781 59023 46348 7537
28501 7537 -698 -15767 22541 51620 26022 25869 19758 37736 53502 48093 45239 33805 27829
28488 27829 -18920 -4206 9362 -26973 -16999 -33268 -53623 -47302 -52529 -34786 -9318 24998
28476 24998 82780 90700 54325 19154 33393 41303 49021 10019 23411 49556 48075 17154
28464 17154 -33448 -33718 -50300 -90940 -76760 21021 29387 10605 58714 77849 88216 66803
28452 66803 25425 22440 44376 41635 63949 69236 44066 32312 22363 36521 59007 51572 2857
28439 2857 -18385 -39030 -39274 33589 98003 111058 57111 68157 64173 58949 55928 45349 37059
28426 37059 4362 -10304 -7935 10895 543 -13227 -22451 -9815 -48829 -96531 -77949 -9135
28414 -9135 34079 40379 21848 -21394 -20513 -25507 -18489 30588 91181 95393 65232 -38770 -77110
28401 -77110 -47908 -10881 -26518 -10560 20171 21800 4704 -20803 -19337 14112 55274 42474
28389 42474 31869 34381 52952 19210 49375 103223 47384 -13736 28263 54701 78154 95772
28377 95772 109918 90011 56720 13124 51037 56969 32349 7121 -35291 -63087 -60348 -39162
28365 -39162 -67449 -92124 -16483 28170 14399 34308 62873 11500 10925 37512 38035 21914
28353 21914 -15608 -76466 -74488 -91031 -93399 -83593 -40461 -2136 -29373 -7167 26213 33101
28341 33101 42924 63899 56264 2692 12473 29077 -23267 -13685 11096 -40343 -29071 -8071
28329 -8071 24414 19041 -20073 -29074 -46657 -48400 -21475 2700 -52599 -50930 -34725 -100 36645
28316 36645 15787 -14877 -11667 -16867 -13559 25850 85649 92598 44708 17397 -3571 -26960
28304 -26960 -111577 -128510 -116949 -44486 16581 45705 28296 -21057 -40019 -49632 -51310 -82037
28292 -82037 -40119 12443 38554 16819 43515 60945 46206 -7262 12803 1435 6261 18611
28280 18611 27304 17691 8260 13719 20532 42550 65719 56483 34523 8045 -26178 21249 52487
28267 52487 69004 29581 -43576 -65941 -37129 -10424 31902 36849 65703 45352 -18431 -83102
28255 -83102 -100588 -19999 33767 31905 -15721 -45979 -9385 -5929 -61135 -113983 -44864 47423
28243 47423 -4473 -5294 -30843 -6370 1386 12973 13708 20098 23244 29899 39452 20745 -1559
28230 -1559 5662 -3156 -4521 -25180 -43996 -50450 -53673 -11838 10926 -18414 -75522 -63357 -24955
28217 -24955 -25062 -79986 -57832 -23155 17037 35554 27228 24051 18480 18100 20901 13496 -23993
28204 -23993 -54937 -25572 -6714 -1092 12990 13065 17146 32439 2182 -10471 11052 19970 -6116
28191 -6116 7995 76147 70980 56475 73672 47015 -4828 -25622 -30440 -13865 105 36089
28179 36089 32590 995 30099 51532 102108 137107 153083 159627 100379 136655 142652 97772
28167 97772 50912 -604 7116 -5674 -32003 -13445 -5494 16843 25834 20993 1660 5079 40257
28154 40257 76926 79323 83219 44988 13092 -24677 -70263 -51338 -41886 -35265 -44346 -32409 -4455
28141 -4455 -33239 -43258 -66136 -13739 2361 -38106 -58362 -13060 47679 59038 11390 -37678
28129 -37678 -38771 -2228 26485 -6569 -21897 -20941 -10065 -17641 15859 37580 22152 14645 54816
28116 54816 18059 -34505 -73540 -99516 -78020 -100509 -76343 15287 31454 28490 19862 31893
28104 31893 15397 5001 -5969 2539 9285 -20462 3827 44054 57528 33223 31559 53615
28092 53615 61724 94007 108662 54349 30094 13648 51605 75835 13654 -37085 1841 32572
28080 32572 46820 18976 -44588 -36455 1106 -11189 -14693 14547 15772 -10997 -25705 -8315
28068 -8315 -6913 1990 39177 41148 61712 88275 127085 64508 45889 28604 6452 -15497
28056 -15497 -35168 -69597 -44108 16530 10257 -46891 -49804 -68682 -70201 -55599 -51853 -37557
28044 -37557 -13927 -5271 -904 -31780 -79308 -77162 -22960 18805 21102 11018 30152 40206
28032 40206 11648 10235 2988 38634 23448 -10901 -18606 -38501 -37619 -27641 2157 42933 41500
28019 41500 -8172 -36453 -38122 -18473 9988 5192 -4784 23233 49033 25635 -1400 -6683
28007 -6683 30668 33262 11204 21251 41705 50604 62968 71315 69316 21037 -7107 3478 16945
27994 16945 9247 60232 77483 75797 50591 4578 -21809 -30856 -54174 -56654 -54225 -52857 -37436
27981 -37436 -43996 -28213 -22052 -71930 -87907 -91412 -40550 38166 64242 83913 62840 77024
27969 77024 25766 -9585 -9381 -10301 -21049 -48599 -23884 -7716 -1608 9268 17929 2808 14576
27956 14576 8644 -5141 -22109 -7212 33550 -31477 -105873 -101188 -35119 -25632 -16761 30001
27944 30001 52331 -3973 -39040 -22076 -4176 -28770 -50970 -5058 46902 70030 32242 -25133
27932 -25133 -22634 1548 -1289 -29278 10353 31327 59576 43496 1842 -24651 -66161 -28440
27920 -28440 28306 97610 56184 -29052 -57344 -64728 -64657 -72954 -83309 -55870 -29699 4667 6918
27907 6918 130 5382 61123 97966 93706 53034 64577 47190 44667 34255 -18899 -37883 -1841
27894 -1841 -17814 -37963 -4454 37285 15147 -3728 -7645 -4787 44019 30594 34838 38743 38034
27881 38034 18954 -26366 -55066 -30075 4761 22654 61026 73142 40309 1082 6249 35207
27869 35207 39696 27515 -5091 11252 2477 -21423 -23446 -31306 -10631 38646 12802 -10475
27857 -10475 34220 37579 44854 43613 40991 -15390 -65568 -69641 -76761 -104223 -59473 7615 -18343
27844 -18343 6883 66528 63809 46376 38503 18351 -22097 -53049 -48017 -7757 16709 18759
27832 18759 12461 -689 -23040 -13071 18335 14844 31428 41794 31062 -8732 8044 35378
27820 35378 48747 90850 84989 55852 2732 -17060 -18669 -28375 6735 6876 48698 20373 -45201
27807 -45201 -42958 -25904 -58915 -47166 -53952 -32982 -23524 -8678 24548 47404 45248 54214 67674
27794 67674 75058 60859 43942 -14220 -26840 -16664 -58158 -88795 -54429 -66446 -45597 2094
27782 2094 565 -3143 -30006 -15714 3590 746 -24869 -43318 -9413 1614 32819 45153
27770 45153 18894 51909 32265 30671 57271 43341 24139 22788 21426 -12555 -55925 -40066
27758 -40066 16170 42473 11763 -26695 -12795 9072 18369 -10718 -40970 5030 25046 -17360
27746 -17360 -56086 -72776 -56946 -5688 25260 1828 -50 47159 31343 11631 73575 129259
27734 129259 95980 64961 4528 -39272 -39182 23329 60138 17980 -912 -21794 -23347 -5079
27722 -5079 -51873 -33325 -63833 -115833 -59679 27540 44780 -1141 13713 32187 -60144 -107105
27710 -107105 -70028 -77722 -57589 -9358 15207 39287 70788 50956 69358 110146 92281 59428
27698 59428 60995 42775 54594 45107 24290 30353 33017 39011 60168 55804 -8459 -17120 -720
27685 -720 25330 59223 47896 39633 -377 -1992 -7233 33302 74860 33183 7053 62435 72503
27672 72503 33370 -7579 -31514 -36399 -35671 -36257 -77250 -90503 -69520 -56837 -57310 3115 21712
27659 21712 6175 27229 24428 -14770 -31374 -50249 -57479 -3636 7527 45438 19964 -25000
27647 -25000 -52269 -58100 -16419 -20150 -67766 -80932 -27117 8755 32746 27951 41177 19809
27635 19809 -3889 -14646 -22538 -30196 -45005 -14689 25360 48652 35810 -52320 -70408 -23260
27623 -23260 -43251 -67158 -39292 -17174 -23972 2475 3598 -25657 -34501 -19208 -31526 -34380
27611 -34380 -22976 -58660 -100021 -93493 -64376 -42595 36822 48939 14752 -2573 20149 9110
27599 9110 39116 36048 6562 31031 10189 22531 48011 56210 75494 70077 35816 43905 64373
27586 64373 90497 65622 40312 19533 -37068 -44211 -29776 -27820 19796 44507 60481 62544
27574 62544 60879 -1190 12644 51965 69182 70886 15988 -11710 -4710 34382 19930 -18868
27562 -18868 -16117 -50784 -16104 12119 40296 12329 991 47691 -10204 -10945 -13775 87
27550 87 44150 38226 13568 -15024 6542 -633 -15053 -42080 -47439 -15239 -31808 -32615 -7418
27537 -7418 10956 -19065 -81470 -122281 -76513 2265 -3857 8167 -1728 30730 17259 -14786
27525 -14786 -39756 -65443 -70667 -53464 -11729 4429 18540 44228 25771 11338 741 367
27513 367 39871 29701 20308 51930 50879 72307 34905 24357 74797 83316 43012 23388 37936
27500 37936 38747 3379 -10566 19310 12769 35074 27129 -9803 -16653 -734 16515 51609 55751
27487 55751 -5147 -16236 6389 -26048 -24496 -29829 -18616 29945 -3193 -91576 -65539 -31668
27475 -31668 -30355 -24157 10865 22844 -52267 -58145 -37987 -34446 -44349 -18885 -6090 -20140 29989
27462 29989 30476 41268 34866 65361 84380 82683 99008 84131 61212 43937 57717 46862
27450 46862 -9329 -11893 -45930 -70890 -36406 4259 10960 12042 24472 -16809 -34724 -44230
27438 -44230 1724 6385 15272 66185 87102 89211 124783 97944 32089 41608 50710 32478 4135
27425 4135 -28429 -44574 113 14688 25600 46727 9874 19337 37281 14762 6637 2419
27413 2419 1867 18408 19102 22613 25049 39524 62814 64852 19546 8712 -45896 -61670 -52376
27400 -52376 3769 6328 11765 -14714 -34625 -29185 -15997 -50179 -16002 22620 60908 73689
27388 73689 62436 52517 -571 4154 -15349 -16329 12102 48070 37725 -47520 -68793 -58760
27376 -58760 -51267 -25538 -11984 -40377 -72786 17205 71113 -14161 -74632 -81609 -25454 -16449
27364 -16449 16734 37848 43586 -18455 -55678 -62655 -12645 9223 24926 12252 -15382 -22048
27352 -22048 -34779 -47910 -42989 32 17406 -12452 37968 72761 34608 20216 44049 65924
27340 65924 73290 66609 -5431 -38124 -18684 29203 34999 17010 -4727 49876 96252 110885
27328 110885 57845 22731 33766 59266 55115 32150 23989 43153 78660 20646 -70994 -107092
27316 -107092 -123803 -96798 -73629 -89957 -82137 -35685 -16656 1691 14821 12638 42953 26730
27304 26730 -45313 -37289 13696 26360 56434 101915 133409 118165 57225 4810 -8479 -10520
27292 -10520 19518 24274 17618 -1828 -70183 -87418 -73471 -12492 -11112 14466 63926 46124
27280 46124 -16108 -21127 -10478 -31699 -62371 -69047 -49393 -7270 -9890 18794 74783 54969
27268 54969 -11513 -41923 -234 20115 -13538 -14053 -47723 -11105 25243 29837 -3277 -79471
27256 -79471 -84035 -44301 -27349 -54417 -15053 10756 -11103 -44154 2975 -39831 -93018 -48071
27244 -48071 93 15495 -15188 -3059 -9440 741 13860 2982 -34075 -91790 -105213 -56302
27232 -56302 15201 65716 83365 80777 69343 57353 -479 -67845 -96915 -114641 -55535 -62401
27220 -62401 -37367 -38079 -51645 -13305 3239 -16915 -4997 -25412 -69773 -39589 -5551 26704
27208 26704 44411 94182 34757 -10359 10338 64131 52588 40172 51565 24894 52596 80347
27196 80347 101063 100805 985 -19070 -11921 -12807 -17529 8656 44195 27702 -10168 14485 21979
27183 21979 17392 31019 49961 58620 52630 55841 29585 14834 17248 35049 54393 37142 7560
27170 7560 1826 80353 98053 96976 81304 50254 29643 16485 -6305 -24251 -52205 1339
27158 1339 12725 22706 29610 23925 4404 39703 33073 -3164 12162 -17188 -66707 -128105 -121763
27145 -121763 -106111 -102318 -105008 -89060 -74572 -77350 -73624 -20495 84227 86387 49097 50619
27133 50619 18929 -4375 30621 20670 28045 48951 38129 22146 51949 36298 21393 52279
27121 52279 84767 62846 81135 23410 -84471 -72160 -19176 21169 -21100 -45811 -10813
27110 -10813 3724 -15695 -27611 -44593 -42624 -26468 -16281 -8471 13508 9258 -19514 2700
27098 2700 2166 -27242 -41615 -8355 23606 41378 24199 17417 30673 21995 55063 97104 109334
27085 109334 73946 19732 -24502 -11565 48182 68567 61929 64796 67284 65939 35161 36287
27073 36287 36665 14177 40631 47083 -9501 -49284 -47360 -10012 45527 14638 -5880 877 -12586
27060 -12586 -70258 -27602 13479 26553 39067 31827 -34750 -35444 -14497 -541 1692 12320
27048 12320 1464 6060 13722 3686 -4308 -23565 -14947 16293 42303 103604 164730 141179
27036 141179 77280 62718 35001 24756 17873 -32573 8225 -2578 -724 -24151 -28488 -837
27024 -837 -6230 -59344 -95694 -37316 3741 -2073 20474 15559 -72755 -50508 -222 12493 29192
27011 29192 42638 30916 53850 44459 48069 25814 11168 64262 21200 26776 12689 -12540
26999 -12540 -6900 -18876 -31958 -36046 -24407 -11959 -56450 -38600 -31938 -10468 -13821 5126
26987 5126 24858 14711 43015 21336 11737 45950 62494 65396 37449 20931 -5559 -38480
26975 -38480 -20660 245 34348 13016 -32887 -18640 32636 45750 64881 55355 30924 66520
26963 66520 47154 15440 22806 -6037 -27660 9899 62181 78948 105156 113562 67810 46790
26951 46790 27009 68909 57656 48438 -11145 -58042 -77167 -30564 -929 13967 6737 38616
26939 38616 38702 29854 40302 56961 28009 18368 -12119 36609 71252 80596 38022 26792 26374
26926 26374 36965 8564 28869 56697 45425 34852 50170 77506 75583 61494 31222 -18804
26914 -18804 -90029 -67891 -56391 22567 86502 69220 32264 24881 47017 42684 42623 41795 39036
26901 39036 27566 24040 21575 12474 13600 -21501 -22969 -48342 -69399 17435 36710 23767 20152
26888 20152 12611 -463 -6548 42166 62782 35376 -399 7262 45335 26654 18390 -15709
26876 -15709 1364 14288 17106 65623 63687 8726 -53803 -41440 -6561 -42528 -72507 -35436
26864 -35436 -2911 48973 49381 52962 79680 61472 67333 36644 49004 84809 102318 76460
26852 76460 85355 134607 130624 63834 26772 56214 45439 2596 24673 46549 8900 392
26840 392 -6584 -7 -23182 -24428 -26401 -9593 -1169 19429 55629 35286 -37680 -53415 26972
26827 26972 49513 75173 61255 34489 -9696 -51704 -14116 -32426 -40675 -39350 -9491 -25893
26815 -25893 -13006 28355 20065 1076 65835 62926 18847 -1128 -46803 -46148 -32147 -63681
26803 -63681 -66795 8098 37020 55447 47483 -9247 -10795 -22963 -45397 -48422 -34054 -27954 -11853
26790 -11853 9625 28300 8477 -5365 -15038 -8535 15648 4997 16824 33346 21205 61929
26778 61929 53875 29439 52861 30516 1990 20175 197 -26863 -25252 -28056 -35123 -29706 -6784
26765 -6784 -3310 5692 -12471 -4353 -17844 -17730 44267 64521 74682 29549 -4357 -45723 -15796
26752 -15796 -8200 19427 5977 -75402 -125333 -132121 -77746 -51004 -44949 -12340 51503 47955
26740 47955 13326 -17961 -6119 -9980 -6452 32745 22506 -40962 -62300 -48654 -51582 -44973
26728 -44973 -70170 -64695 -41306 -33853 -9940 1075 26680 22340 50090 30133 8533 -21013
26716 -21013 -46627 -54849 -33414 -26346 -18280 50222 26294 4283 -5085 -47843 -47731 -11520 477
26703 477 20577 16981 -4520 2025 4607 35622 77001 21 -35821 -15419 47273 66296 22181
26690 22181 -49528 -51874 -78661 -120253 -113675 -103005 -151482 -120144 -88512 -78981 -69570 -35673
26678 -35673 -18502 -53546 -9033 34610 20487 -11362 -3925 -13678 19633 57116 81977 44461
26666 44461 -7733 -30285 -4533 -565 2445 21094 13534 6531 42379 44874 -14819 -18926 40197
26653 40197 46992 75467 92633 60810 84245 114562 78017 36149 50527 64364 58003 43273
26641 43273 31470 -15322 -298 12188 -2307 -15115 2802 -10196 -30795 -25561 -35469 -30361
26629 -30361 -41369 -25108 -25381 -42357 -24938 4441 35025 57946 44686 79752 49429 14407
26617 14407 -2609 -33717 6802 16705 -50548 -36359 14803 25226 -20662 -47634 -65466 -13727
26605 -13727 -24417 -1231 -9851 -63667 -3072 63446 5802 -62392 -83327 -21749 16782 5732
26593 5732 -52990 -14601 -16018 -35188 -37526 -27251 -72490 -134013 -64247 -10566 -22407 6833
26581 6833 53001 116075 58322 34728 33060 48654 66663 57044 44190 36747 29990 28669 6995
26568 6995 -46226 -70335 -50337 -11408 10884 -8067 -7574 -14319 3317 46528 6283 -50803
26556 -50803 -67517 -30956 15770 25257 44784 34216 335 48054 34995 -62024 -109158 -99927
26544 -99927 -104120 -62837 -29560 -14895 -43878 -69647 -29893 -12401 -14041 -37544 -78670 -71561
26532 -71561 -37325 -9539 -13803 7820 14672 86309 95009 26649 8385 -27047 -2250 11287
26520 11287 35334 55109 58845 7106 -33978 12077 -7981 -28070 -54899 -62662 -57509 -46733
26508 -46733 -40462 -46436 -30072 -14624 -4169 -52637 -51713 -44123 -34885 2137 -3945 9360 30102
26495 30102 -10853 -12750 326 31076 41415 50088 30493 3300 -35909 -74069 -32899 46470
26483 46470 41569 -19928 6030 53869 39414 38732 41873 65079 73858 61505 20023 18087 7065
26470 7065 14421 5954 -8733 29108 77407 68051 80494 71383 32323 15317 20883 -17543 -31690
26457 -31690 -12455 24557 -8093 -351 -18271 -70511 -80149 -64595 -35792 20467 40341 32865
26445 32865 56441 58485 47836 23271 -26566 -43353 16746 43466 24885 7354 36492 27211
26433 27211 24756 22871 18584 -2021 -14487 -22089 -35386 -45269 -51998 -27135 -21429 -28620 -42678
26420 -42678 -12254 23308 -12321 -86784 -85906 -30748 44447 63179 67540 72656 114488 150402
26408 150402 181468 116920 33807 -23228 -24662 11474 -1138 -28133 -21883 -51737 -13755 -53387
26396 -53387 -55325 -9493 56556 14282 -26500 -10808 4459 -22198 -60033 -60917 -82825 -114200
26384 -114200 -77187 -21405 -27989 -71621 -95061 -64568 -56058 -50877 -62498 -29887 40081 61642
26372 61642 83199 45974 11827 -25766 -27328 1960 40658 90928 130655 87741 55696 17952
26360 17952 -22963 -18880 -3746 20073 65652 60074 61485 23485 -50466 -20762 -28702 -2621
26348 -2621 57665 48581 7386 -13802 237 -7628 -16135 -35860 6340 47444 45621 67290 76186
26335 76186 51452 11557 -32823 -39842 -657 -45816 -76933 -72289 10011 40562 41004 74741
26323 74741 67155 43202 57111 13307 -2794 19735 -25468 -91886 -139921 -159363 -91099 -73965
26311 -73965 -33743 35308 32717 29704 23321 38912 41157 39505 44995 57790 55900 28801 9790
26298 9790 20721 14156 35858 44752 -7826 -17887 -40045 -28086 -20138 -39114 -29194 -21910 -34717
26285 -34717 -36447 -3163 39867 51544 27443 32376 -12937 -32807 -22816 -38047 -6562 61648
26273 61648 63820 39039 -3877 16418 69313 76904 15191 -16083 4581 28734 35692 15426
26261 15426 4121 -36830 -52324 -47606 -61815 -36143 22317 37699 9789 -18195 11372 60124
26249 60124 96683 101116 65722 42308 36526 44062 64304 38323 5722 17118 47930 42333
26237 42333 45101 58283 49726 69636 101012 104096 79506 60602 74553 44283 -15368 -61965
26225 -61965 -89640 -84873 -45087 -42230 -27663 -12595 5807 -49052 -64827 -63770 -46682 -62371
26213 -62371 -12823 48066 42489 -17005 -68901 -55528 8601 53572 92506 88153 69925 109042
26201 109042 80742 7224 -12848 4470 -30509 -64122 -72050 -81331 -84889 -39627 -82481 -73866
26189 -73866 -43454 -6754 31598 102521 57689 8798 12920 49997 69341 126075 94309 4050
26177 4050 -13774 -3785 -11095 22844 101838 100169 84042 49602 -12082 3743 65258 62553 64017
26164 64017 20255 39600 31159 45545 81523 45888 44709 30654 -7591 18667 24348 12920
26152 12920 18332 31099 7892 -39627 -13823 -25897 -35994 -45061 -37417 -52171 -32766 -42514
26140 -42514 -74562 -22158 -75 -36335 -71179 -93882 -74937 -40880 -40900 -52253 -23065 -17302
26128 -17302 -33338 -55706 15918 45555 15188 -24547 -69130 -117305 -103186 -115322 -121139 -66118
26116 -66118 -58012 -76080 -66841 -18138 -50072 -78799 -34763 -26799 -17746 29399 7050 -8289
26104 -8289 2768 -26259 -29589 -82000 -85504 -82652 -60434 -4553 1370 -14497 -5649 -1108 -34004
26091 -34004 -54081 -98951 -125469 -42680 -35851 -45407 -46420 -67190 -48208 -43832 -51523 7096 12870
26078 12870 -26689 -7836 10446 17855 12352 8419 54701 91251 58818 7385 -36144 -29380
26066 -29380 -8448 25752 -6031 6969 13178 17690 4547 -15966 -29828 -37164 -18469 -1943
26054 -1943 18495 42864 84715 100524 90598 64720 27991 47049 36444 46471 57629 11195
26042 11195 -20035 23197 40369 -2277 -11911 8689 11416 -36994 -40571 13379 17410 -42670
26030 -42670 -53405 -16218 12782 44024 11866 19972 -3401 -23340 -18849 -21505 -23468 5252
26018 5252 11452 37829 38451 20336 -19531 -13186 -19715 5449 27626 48456 31888 -15170 -23321
26005 -23321 -16575 -12745 -18988 18819 16006 -20956 -1354 -5744 -26934 -46788 -4546 32735 52191
25992 52191 75306 67953 70818 40793 18747 15198 -15813 -27098 35124 52023 40953 -5699
25980 -5699 -69335 -28205 -6725 -10955 21179 43193 34912 41536 26694 -17095 -12734 14474 38227
25967 38227 79508 103045 145636 138744 150845 165560 118732 15555 -19952 -3318 -3970 -37720
25955 -37720 -53247 -14569 -301 6947 19485 -11169 -29310 -26293 -30407 14008 -29189 -43469
25943 -43469 -28001 -50166 -40063 -9925 -6504 23645 24408 2965 -6247 18585 31988 -895
25931 -895 -36596 -27398 -32613 11871 75111 72181 43503 61800 55551 99418 86951 27395 21776
25918 21776 -4363 -39848 -54670 -19992 15386 24217 42975 45261 -9935 -41313 -39147 -44972
25906 -44972 998 -38006 -53940 -50293 9404 24115 -23096 -9979 -5600 -19288 15839 50750
25894 50750 39517 -8654 -7551 30711 60907 18846 -41611 -53031 -57257 7754 33071 -48019
25882 -48019 -103241 -56345 -25564 11425 -29796 -49397 -87281 -131589 -115469 -49293 33238 40796
25870 40796 -33496 -5924 38095 -3630 -8902 8127 -21884 -37755 -54441 -101157 -95864 -68653
25858 -68653 -75971 -128365 -116210 -90081 -55280 -55388 -47858 -62378 -38072 10319 12438 -18405 -227
25845 -227 -6934 -73681 -43792 13351 7985 6327 36499 65497 40578 50507 71553 68618 75187
25832 75187 93943 98336 64102 29797 30496 16068 -4544 1954 -26221 -23770 -54961 -35526 -14896
25819 -14896 -1721 -888 43651 32504 47153 83108 99946 35605 -16000 -41352 -61579 -31446
25807 -31446 -19612 7488 -27600 -45680 -37432 -28804 -34225 -51954 -37034 29726 46722 20031
25795 20031 -10567 -55667 -39000 -26710 -59666 -35462 -1163 66855 109214 111524 116220 61958
25783 61958 33763 67143 79299 21570 -4822 -21225 -3199 21220 12417 2120 -39745 -2516
25771 -2516 -204 1471 10767 38830 10129 32846 45995 50631 54854 -14343 -73041 -78939 -32624
25758 -32624 53421 27826 -25090 -22376 -11260 -134 -8344 -9454 -3473 6843 -5345 23891
25746 23891 -3888 -43984 -24333 -10060 -28168 -33002 -11341 17670 15705 -33891 -69302 -40827
25734 -40827 -41284 -36880 -6225 54636 9679 19454 46944 88562 69077 63256 62106 76806 26906
25721 26906 -33773 -13250 -14383 -61550 -113621 -75347 -59028 -50795 -15827 -25923 -47104 -15454
25709 -15454 -6419 -13021 -24404 -23661 -10005 11690 -5777 -2681 43837 31614 34105 57572 85685
25696 85685 46614 4654 17446 -45437 -59895 -25104 -37416 -32350 -60618 -40550 -47854 -68600
25684 -68600 -49206 -30965 14892 -11378 -40601 -21121 19685 34333 12940 36188 14497 4744
25672 4744 37417 32534 -30887 -38055 -1601 30183 48189 33180 42303 64214 30043 47830
25660 47830 44203 53663 84069 78056 59116 11662 -24666 -34583 -838 -13806 -8137 31124 55776
25647 55776 20298 -16225 -7210 -14882 -72713 -43008 -12707 82808 123244 90847 44127 51318
25635 51318 32534 -5524 -31064 -23641 -20943 -25736 25344 55395 66421 48227 35881 10209
25623 10209 -28019 -60656 -32366 -41504 -55534 -51413 -36406 -977 34299 46737 11931 17409
25611 17409 63191 63455 29503 32638 13224 -15336 10071 -8719 -13485 -41408 -46032 -17937 31652
25598 31652 43268 40734 28387 30011 -10589 -37821 -82600 -95748 -48873 -27422 -32695 -34289
25586 -34289 -61204 -84882 -65575 -30726 34818 94835 55003 23292 13499 -8778 -5665 39122
25574 39122 36830 18054 32224 22829 24111 61415 14525 -12216 -28078 -23675 -12272 8672
25562 8672 23278 10766 15854 31241 41730 28532 10451 76512 123375 98789 61831 48081
25550 48081 62444 33821 -17885 -25919 -14381 -25089 5882 3270 -18207 -54418 -39606 -35414
25538 -35414 -21585 7206 -1248 -45406 -7581 2061 -18402 -38087 12749 4520 -66482 -78719
25526 -78719 -66605 -56403 -16926 29672 31192 42688 30159 20707 -10092 -2516 3234 17901
25514 17901 17385 1739 -16109 -40463 -39328 -21544 8787 42729 64101 107963 57021 18555
25502 18555 16237 13185 -16349 -52642 -9174 5802 -37116 -8584 7837 37398 82309 80334
25490 80334 40330 57490 80588 -12400 -43913 -8560 17914 9660 23734 4311 8019 7723
25478 7723 2473 50402 50932 -14695 -10867 105 6120 7407 -26576 2163 13072 -14975 12417
25465 12417 51140 9464 -49490 -41860 2884 44347 48610 13810 -10911 -40253 -74662 -6962
25453 -6962 49886 32900 43004 60326 50251 33989 24109 38074 78719 62203 28887 16003
25441 16003 37445 11670 -3816 6189 6508 40546 68540 111719 97205 80465 19317 5914
25429 5914 23084 -15967 32259 103225 121672 82501 52912 30775 20745 11268 -10028 -3431
25417 -3431 -747 -38669 -41777 -40134 -54664 -102436 -52392 -51220 -107984 -131008 -108288 -84433 -32718
25404 -32718 -34003 -70085 -69595 -96540 -74377 -61438 -45350 -11352 30927 38797 26200 16787 32652
25391 32652 77035 73417 72372 3734 -13390 -6493 -5303 -3927 -28061 266 -7717 3705 36804
25378 36804 35768 35272 38088 -9325 -64824 -120270 -87828 -75258 -27228 -20080 358 13729 6753
25365 6753 26107 37422 57286 35113 37090 -1195 -5267 23125 7298 -8842 -108 1528 -14703
25352 -14703 -36434 -44078 -13233 -12074 15140 19923 -22708 -96067 -85652 -56832 -29665 -47715
25340 -47715 -65058 -58867 -23109 -30930 -26151 -9187 30474 25437 11224 24774 24253 7828 -2083
25327 -2083 -15844 -41596 13336 32187 7859 -54478 -73028 -36451 2041 37058 34173 -12027
25315 -12027 -21037 -35025 -59730 -82847 -81017 -27665 47842 23545 -17585 15285 31559 -47
25303 -47 -24299 -55735 -59791 -80237 -92680 -67421 -47646 -50502 -23388 34202 2776 16005 40832
25290 40832 -10557 -79691 -75576 -54122 28760 34845 297 -12047 2001 8196 -6307 -5979 -19340
25277 -19340 -32463 -11354 56331 79895 77208 60135 70388 93719 88706 61828 64205 116085
25265 116085 111764 91142 61462 49691 40126 15872 -2757 -18500 -34743 -33768 273 27646
25253 27646 24025 -23322 -35941 -43109 -51205 -60013 -38726 -33634 -28444 -53218 -27229 -38467 -55169
25240 -55169 -67963 -75429 -64665 -31113 7444 32599 7816 -16564 -21059 -10907 54622 63279
25228 63279 31579 -7521 -27667 -35330 -14411 1447 13141 -17399 -7131 -40904 -63996 -35138
25216 -35138 -46818 -37951 -10824 4821 4364 -3981 10822 -14856 -75603 -65250 -47426 -66225
25204 -66225 -69487 -22739 -1915 -24650 -36173 -38355 -26692 -63148 -70089 -32047 11202 56138
25192 56138 70090 93086 127374 99067 64087 69464 29646 11520 11637 -896 21 53604 41680
25179 41680 43526 76854 30006 56816 41814 53505 53059 59395 33669 4136 -18305 -82318
25167 -82318 -111820 -91890 -7336 67104 61950 36835 33553 9481 -46816 -88208 -70118 -35448
25155 -35448 40004 60120 55831 17014 6600 6785 -10918 22608 63895 93081 60368 17763
25143 17763 -9979 -24127 -22978 46442 59075 65619 72701 86525 74118 46179 7171 -45063
25131 -45063 -24179 -41526 -19630 -613 -3387 26581 741 -57198 -46742 -44566 -6973 -20927
25119 -20927 -33557 -57541 -63917 10796 26806 21591 -31505 -24010 -18821 -23242 16363 12604 -70614
25106 -70614 -65037 -50165 -19366 23611 60756 84191 101601 97950 69222 37853 65691 58076
25094 58076 27643 -8426 -76004 -45986 -42578 -46104 29769 38314 6666 -5182 -16495 -30015
25082 -30015 -16250 13313 33408 3788 -36127 -38136 -56324 -47679 -55002 -16815 -3869 -1151
25070 -1151 -56309 -12843 58327 43143 6051 -12145 -13597 -1310 -38329 -65673 -60822 -64532
25058 -64532 -43623 -14543 20088 55852 41518 -2219 -16618 21279 39893 43795 20621 52742
25046 52742 72920 22093 -9146 25363 47488 18345 26859 52838 57502 41056 5978 18625
25034 18625 15703 54356 63493 65297 54618 -19362 -27819 -16375 12296 -2655 -74522 -52122
25022 -52122 -36217 -37654 53168 179289 176971 190557 198172 163396 138871 114705 69860 42418
25010 42418 14595 478 -36228 -58586 -29349 8510 -26262 -40416 -22891 30696 42889 7196
24998 7196 44813 110791 136319 104410 97076 46616 16911 -2700 -7871 14607 14755 12600 -23400
24985 -23400 -33669 -27900 -7575 -10406 46408 37209 48032 71655 73243 62435 57824 1201 -6160
24972 -6160 11744 28608 -4458 6625 84627 110311 37064 1271 12493 20534 9838 47146
24960 47146 23749 -25505 -60873 -63973 -9449 32928 1865 -13632 557 38974 16303 -40891
24948 -40891 -64313 -28752 42456 36418 -1065 -29796 15395 6059 -16814 -29412 -57964 -128375
24936 -128375 -129898 -67713 -50761 -38930 -10964 20628 52526 53897 -2430 -27236 -27644 -22863
24924 -22863 -34565 -38176 -32156 273 13401 39203 20051 13722 26868 10502 8474 46379
24912 46379 53739 5595 -51843 -90050 -103854 -128382 -124627 -113440 -75613 -18695 13207 2219
24900 2219 -55764 -63339 -19162 11533 26529 28887 32706 72488 65307 12623 -7001 10988 2895
24887 2895 -94233 -133070 -136068 -96571 -53355 -18443 8828 34865 16237 -52314 -49216 -47447
24875 -47447 -91925 -106784 -80139 -99250 -91305 -32448 -26469 -36567 -53137 -54591 -11212 9292
24863 9292 58739 61425 7496 -6851 386 15094 32844 60131 94347 88114 41272 8956
24851 8956 14740 7134 -9271 -47188 -72168 -41685 -18499 6270 -42909 -98699 -93922 -83276
24839 -83276 -41173 -33303 -8180 -20181 -55954 -66481 -68283 -53797 -57132 -58514 -37964 860
24827 860 24373 39551 51910 39923 90871 86608 40804 10420 -22128 -33844 -32051 -34743 -31129
24814 -31129 -704 3249 18908 -32271 -54068 -22819 15676 -8356 -26662 6378 52603 67996
24802 67996 28935 16775 -1936 -69711 -76013 -66085 -29945 -22730 -20210 -572 29400 -2713
24790 -2713 -12802 -27666 -56938 -62320 -35739 -49869 -92854 -94942 -92797 -28264 -14356 -11319 299
24777 299 -8457 -15503 -54905 -39582 -42445 -50407 -36601 -29604 -49181 -32104 -14968 -29941 -38534
24764 -38534 -39626 -26736 -2156 -15489 -9755 -957 2635 25957 33916 8826 32236 49397 4709
24751 4709 21381 41401 72037 103496 95018 27208 24786 19521 -530 12575 74715 41887
24739 41887 43807 69267 28897 11040 29760 19307 19005 6060 1873 17560 71814 28544
24727 28544 5293 7399 -8356 -32338 -67442 -46651 -2128 16166 21201 12007 -17669 -21744
24715 -21744 -10246 -56207 -19054 15281 37032 46081 30723 32695 28145 121 6421 -1231 38922
24702 38922 32611 -779 13073 41041 26024 20377 34668 -22046 -58364 -44898 -9791 -28600
24690 -28600 -37780 -37734 -39927 -75533 -74189 -41087 -42950 -25600 -29882 -77273 -80892 -99371 -79893
24677 -79893 -59649 -37222 5240 21019 16984 45663 47853 42035 22048 12340 32396 69548
24665 69548 99024 136732 147185 135934 146665 179563 266509 263557 207647 200890 222444 183966
24653 183966 91985 45384 -289 2297 -32763 -32791 -41482 -6408 16252 13712 788 -30974 -8457
24640 -8457 5282 -22681 4415 9731 2086 -1980 2984 10209 28843 29638 29738 9197 -13886 -21859
24626 -21859 -56143 -29781 -47879 -15464 31088 25486 3830 9385 -21447 9839 18238 36176
24614 36176 56756 43216 35377 7883 30725 46181 -206 -16237 -15020 9618 29243 62711
24602 62711 62859 35610 45163 32136 -31846 -59730 -99642 -118919 -61595 -59459 -69801 -58407
24590 -58407 -66640 -123317 -91565 -58370 6709 15521 -12433 -8507 -11964 -49451 -60205 -37326
24578 -37326 -21461 -45317 -29760 -8894 57005 62068 666 -64516 -51363 -9845 7485 -16598
24566 -16598 -43217 -66461 -51744 -20934 -36105 -46884 -12696 437 -2759 14420 38548 -7464
24554 -7464 -27130 -27196 -13256 -1923 13594 -17283 -29150 -23628 -15615 -8629 -3683 8160 -13050
24541 -13050 -9879 -5086 6397 51315 44254 -16676 -31888 -949 -19371 -7494 15416 4020
24529 4020 -26075 -41042 -8843 28544 27885 -10077 5832 -14724 -22800 -23350 -14242 31598 65799
24516 65799 64652 41411 78495 116895 96798 113975 107246 36462 24204 11488 -19390 -63751
24504 -63751 -66635 -48291 -52926 -64842 -54307 -50713 -61952 -64139 -67132 -11309 4573 1558 11352
24491 11352 34520 62999 60909 46315 4801 -50658 13012 42448 -10166 -49404 -55740 -18757
24479 -18757 35916 23009 11912 14835 18151 10187 5448 28613 22847 -563 4394 -353 364
24466 364 13876 22355 20472 -30553 -19418 30298 -15518 -16922 15528 30356 20395 33775 23910
24453 23910 -12114 -5167 1178 -54323 -55736 -42768 -20676 18273 18124 19415 -13747 -16329 -14360
24440 -14360 4538 1596 22250 32084 63911 40560 68234 69701 45174 -29043 -10381 13945
24428 13945 2576 -8682 6392 -391 59369 73633 49437 -5226 -6090 -36545 -69437 -65482
24416 -65482 -58705 -39410 -8161 -17466 -10249 14384 20296 24929 553 -21044 3319 3654 -52342
24403 -52342 -35378 -14807 -15860 -49779 -97125 -60633 -43712 -36202 -23411 -6199 -20141 -81646
24391 -81646 -106033 -136167 -142846 -108117 -51294 -24751 -23716 -20001 -33377 -37832 -27279 6417
24379 6417 59844 30568 17360 41961 51618 763 -13296 -1486 -4224 -21168 -49112 -6341
24367 -6341 19947 40626 24521 17399 20986 17237 -30430 -32065 -11567 29951 40523 29120 -6222
24354 -6222 -62467 -71517 -46595 -34158 -13789 -21466 -33126 -87656 -91930 -58836 -30200 -17690
24342 -17690 -20790 -37752 22176 47373 52270 34717 58200 14949 8275 48048 -42742 -79952
24330 -79952 -40318 -25040 -55115 -96274 -60500 -6483 27870 -12020 -59603 -62169 -56543 -71491
24318 -71491 -67102 -48937 -41007 8760 2185 -20505 -25449 -16894 5478 -39576 12946 10521 -23925
24305 -23925 -52320 13445 49487 33828 -797 19409 28423 46124 46170 4590 24463 31198 4307
24292 4307 -19026 -16052 43072 82368 14820 -60780 -71186 -59043 -50231 46226 85484 92437
24280 92437 87450 55779 33848 43528 73914 33127 -31687 -61519 -27280 45663 -11047 -45986
24268 -45986 22742 56886 95646 95202 102708 81175 53123 56870 42479 31737 54742 103711
24256 103711 81307 47821 5099 9490 12657 -16354 -31765 -55258 -29490 -19252 -211 12481
24244 12481 -28251 -33802 -15065 25639 42268 -660 -13932 -49047 -24057 -18978 24972 90922
24232 90922 121341 50084 13088 17653 -13697 -9034 -6784 -3872 24052 32837 4754 -38603 -60754
24219 -60754 -33973 -8136 -23835 -32206 -40872 -36646 -7091 -43388 -27156 -39429 -81229 -81629 -72195
24206 -72195 -55032 -51456 -38712 -29733 -2067 -51968 -102608 -90759 -70252 -28359 -33478 -53696
24194 -53696 -83514 -36668 -3621 -8358 -21225 -53321 -65893 -67094 4461 -173 9282 5047 -2896
24181 -2896 -6975 14191 20099 40207 28060 52444 26349 21276 -5285 -6965 -6932 634 19067
24168 19067 25413 56302 62669 46660 11391 -20772 -12059 19153 22911 32790 15105 23272 -4651
24155 -4651 -34930 -66438 -58327 -37923 -55540 -36127 -9906 -9679 -4116 -9935 -36222 20140 3086
24142 3086 -62502 -33391 7297 6182 2706 -812 9848 -14419 -41969 -5705 34198 43845 73594
24129 73594 57267 19166 20356 32415 46189 -14219 -7608 15480 28511 55451 11357 -24395
24117 -24395 -97411 -116669 -84340 -27319 -17697 -19645 -25378 -43597 -31683 -23290 -13306 -7406 2891
24104 2891 51865 80482 78208 48151 63573 5897 -31610 -66909 -83736 -110238 -98605 -50252
24092 -50252 -25518 -35004 -12126 9647 43837 52125 45683 15812 -232 12307 18834 -15041
24080 -15041 7816 41756 24564 -2867 -8620 -28256 -46702 -12456 -26760 -5813 -13150 -50799
24068 -50799 -49534 -38258 -48050 -42910 -10099 8504 34164 86404 107237 45810 -13248 -3896
24056 -3896 -1077 -13518 -812 -9939 34524 49326 996 -28574 5299 33225 56757 39437
24044 39437 -1981 26737 26819 5900 28045 -15657 -29629 -47936 -12262 -3368 -4072 8216 46929
24031 46929 34245 -13322 -48807 -19787 -3643 10473 -13527 -29881 -33802 -53922 -28419 6615
24019 6615 7991 18793 58621 101188 38370 -26128 -42455 -25218 -2331 38211 46528 11337
24007 11337 -5754 32793 79955 48370 -10970 -4964 -1487 -42345 -46359 -33485 -20801 -29758
23995 -29758 -10953 -20215 -53308 -10105 54684 21582 8928 23856 33069 30043 35324 30740 10343
23982 10343 13484 2417 14945 34149 2525 -10906 -27964 -4504 -35912 -44280 -58263 -43687
23970 -43687 -26086 -25352 9518 14152 5902 5376 23196 -8476 -20866 -26875 22749 501 -26727
23957 -26727 -42426 -15483 7336 -931 12385 47497 41594 48684 16793 18692 19754 15934 13509
23944 13509 29657 45420 32570 37200 75865 63453 52215 -2305 14374 29452 54940 -8756
23932 -8756 -13453 9385 -1075 -33030 -29283 -48364 -51581 -38169 -15722 1508 37574 58028
23920 58028 12410 -20207 -29917 -42603 -29348 17876 56353 10701 -51700 -50075 -3048 4641
23908 4641 12317 19332 14018 -840 15580 -2354 3921 5196 49286 33498 23120 8047 -52
23895 -52 17917 20492 8611 -25197 -12476 21400 31271 8299 62882 34918 32731 27287 45960
23882 45960 21215 670 -12721 -21567 -2588 35400 -883 38433 43598 50933 55506 55846 56868
23869 56868 51279 43214 65556 75048 48039 19816 31419 6867 -31948 -60794 -28706 3292
23857 3292 -12079 -9023 1280 -31263 -34078 -28588 -57045 -46938 -38141 -40890 -11764 11095 41187
23844 41187 48266 26049 9818 -2002 22198 21948 -24119 -57882 -84452 -55849 -50616 -44288 -71315
23831 -71315 -26600 28781 59760 39508 11004 -3252 -26542 -44645 -5072 53077 36578 -6040
23819 -6040 -78196 -103154 -36699 -2339 -8170 -30665 -14106 -6065 16476 22190 30261 40705 85201
23806 85201 54239 6365 -9359 -30383 -21905 -42366 -50466 10969 51955 46828 62171 48344
23794 48344 20024 25231 2485 -47083 -41147 -1362 45636 39874 23838 59410 18981 -6958
23782 -6958 26569 95477 85114 43069 28359 16646 5114 -8962 -1314 16008 44966 24261
23770 24261 42114 36134 23841 -6305 2717 58717 85829 64184 31147 13250 -1008 19881
23758 19881 62100 42663 25350 1581 -15017 29208 53656 18738 9421 18791 38612 82636
23746 82636 109830 67014 -15107 -75939 -53293 9711 -43391 -38916 -40700 -28397 -11966 3575
23734 3575 44818 22523 -33234 -24226 -2550 6977 -4729 -21039 -53384 -66613 -8058 87202
23722 87202 101144 102279 56057 -7674 -10062 -6626 -42865 -2845 53297 68608 42703 30919
23710 30919 15690 48063 58515 60449 -1262 -45624 -52758 -77895 -74280 -98894 -110475 -43710
23698 -43710 11694 19733 -8090 -47442 -31355 -14394 -14010 -44802 -104367 -98533 17959 62522
23686 62522 45465 4597 -25187 35718 12531 -28050 -17085 -70734 -44521 -19504 -21271 10410
23674 10410 36689 11756 -17669 -10626 -3835 29060 8695 42313 51371 59856 63309 96239 106443
23661 106443 24868 9609 51342 59019 59798 52569 33065 -10556 -67297 -78879 -115028 -117109
23649 -117109 -116673 -64429 -35391 9417 25927 34047 16450 5523 21285 23369 12041 14653
23637 14653 25815 26334 -15765 -18983 27407 58561 64880 66280 12686 12652 2596 730 10318 -27944
23623 -27944 -39456 8552 -27041 -42803 -65560 -64636 -47975 -72213 -61666 -4801 -31685 -20758
23611 -20758 -1996 -22195 -22079 -9132 -63446 -61604 -45535 -42059 -85383 -76701 -13405 16150 -12298
23598 -12298 -74344 -71063 -28108 13293 -15095 -20747 -40101 -9433 17402 63714 22264 9673
23586 9673 27931 17794 52960 103493 85283 28187 17463 14440 6080 10541 -18761 -40149
23574 -40149 -67884 -105043 -144497 -154777 -91710 -70074 -50103 -7284 -13018 1470 -6368 -53471
23562 -53471 -88064 -63523 -41489 -15332 5568 7972 35815 54634 6348 -75784 -69690 -16739
23550 -16739 39849 42159 47162 46608 27651 25159 22512 43254 66396 33255 -3147 9614 -20723
23537 -20723 -30438 -21016 -43726 -27312 12739 50227 43358 23873 7501 -869 -9267 9516 -8491
23524 -8491 -21472 -30715 -44786 -18467 -30 5241 -29182 -27785 -27675 -9110 35957 90409 92091
23511 92091 103003 84411 54790 25751 56226 64147 78345 60115 -9907 -11229 17062 -10144
23499 -10144 -32705 -12982 18884 14503 26486 -6031 -2670 -11012 -9259 -15424 -27229 10750 29004
23486 29004 -19943 -23996 8434 -31468 -21579 -11898 -43790 -59835 -35343 -68126 -48659 -5948
23474 -5948 16621 -25974 -103205 -115481 -79502 2210 14781 9542 29744 -2863 -68860 -102275
23462 -102275 -32444 27720 41458 26255 8480 20104 33467 1245 24537 35210 848
23451 848 -1750 23712 3917 8857 49379 46935 27765 31406 78762 25108 -21108 -10556 -628
23438 -628 -31091 -4971 30505 43822 53060 70449 71440 62202 55371 36954 8898 -13417 -54475
23425 -54475 -78542 -67739 -26355 -5014 56981 79828 63692 46564 23767 -56465 -68747 -93055
23413 -93055 -42165 8879 -26036 -47367 -28634 -39858 -50172 -8640 -5783 -18455 -57931 -46561
23401 -46561 -30737 -36857 -32143 -34810 -19512 -14615 -45548 -43303 -30234 -43094 -10358 28730 47390
23388 47390 60380 16404 -31828 -40733 -9265 -44310 -18306 -43965 -64661 -39096 -22102 -48858
23376 -48858 -39738 -74403 -55340 30128 70865 35323 14242 20308 20156 -27000 -85252 -81034 -32709
23363 -32709 1284 -11842 -31475 -24648 -9590 6095 71810 85861 31668 15468 8380 -10440
23351 -10440 -26364 -85573 -99536 -63512 -56948 -51544 -43542 19932 60562 39689 9484 -20374
23339 -20374 -10185 -22837 -20829 -35266 14892 17850 29685 -9059 -57523 -51479 -29695 1373
23327 1373 38793 37090 -15332 -59707 -113248 -90385 -63508 -64640 -65922 6551 104519 142634
23315 142634 118637 76613 85266 74237 71301 61527 74284 90496 74458 79335 76367 87520
23303 87520 97234 139271 207165 294718 453042 771313 1300395 1784227 2053495 2102273 2157649
23292 2157649 2128406 1872379 1412754 933770 619666 398514 291711 193640 147408 166535
23282 166535 161872 104843 63963 88115 76131 48393 12639 7724 11129 7674 27062 47980
23270 47980 12524 -39801 -46351 -51340 -19356 9023 6768 6031 -19479 -22793 20823 55775 62737
23257 62737 34604 45232 46566 47811 75915 80187 92319 107960 61722 42251 17148 7626
23245 7626 43875 77953 87412 120455 96722 47267 32134 34766 29132 61655 41151 -12248
23233 -12248 -17641 -12470 14639 2678 -43138 -17817 24727 20874 5485 21535 33984 41745
23221 41745 -379 -27489 -67930 -67572 -51106 -5321 17972 41158 28130 -12277 -28508 -18969
23209 -18969 -18390 -12217 38318 66909 21008 -44270 -67000 -50000 -13375 27305 -12149 -9643
23197 -9643 6105 -6747 -50746 -33928 -30062 -15671 -44848 -68433 -64061 -39970 -1069 -1818 -8072
23184 -8072 28723 96877 85823 62170 88583 76778 51378 2368 11075 19231 13782 36331
23172 36331 24572 405 -12396 -9846 -61496 -54565 -11941 -25393 -13900 -10270 -10099 14426 54109
23159 54109 35335 39205 14461 -11055 -34472 -46501 -46551 -42947 -32682 -24289 -53065 -54994 -21257
23146 -21257 5018 41872 70987 118018 187239 239900 264220 230475 244821 310533 315163 294691
23134 294691 220919 165310 191747 110571 26787 -583 38937 30598 28896 46503 29238 18304
23122 18304 16265 36164 32239 -15109 -62284 10700 69187 61730 41422 2291 -10307 21308
23110 21308 -4955 -5543 5374 40430 74443 56391 61832 -11970 -54116 -7403 3525 -20434
23098 -20434 14839 40259 39534 -8692 -64398 -85710 -11006 30336 34868 -2209 7507 17703
23086 17703 27984 74945 84220 76577 42929 6154 14184 20251 7961 6642 68735 42326 -10578
23073 -10578 -53068 -43394 -20915 -14908 -11680 -28741 -49997 -28785 -9831 13148 58048 69359
23061 69359 75053 54903 83915 50920 74001 118757 130532 111213 90011 90698 68485 54709
23049 54709 125332 146146 144761 186839 201607 163207 150029 131760 86773 54056 37602 -23438
23037 -23438 -38931 25515 56663 56174 13413 44405 63293 33369 15824 48846 26984 -12965
23025 -12965 -35668 -50390 -29068 -17728 -12502 23011 6462 -37718 -50055 -53188 -40963 -66309
23013 -66309 -73185 -13279 -10091 787 46923 58486 23731 17025 4326 27382 -32423 -14894
23001 -14894 24337 80027 87257 105259 124537 101797 88088 139022 262390 263569 300019 294588
22989 294588 251050 212786 194227 88487 63602 12314 42282 100143 111995 72698 26248
22978 26248 26425 40823 29367 25485 26770 60863 73781 37546 53495 25171 10687 48047
22966 48047 7267 -4448 -6137 -22768 -47417 -18667 -18705 -44997 -45872 -69258 -77489 -63180 -18831
22953 -18831 30296 24354 18057 27559 27152 40669 50007 24737 -4139 -28722 -10485 18428 16631
22940 16631 39247 93515 80367 39733 -9659 -31697 -25708 -29495 32427 24124 -19361 -40632
22928 -40632 -12439 45143 8605 2930 -2237 46227 49342 62233 5551 11471 50048 124240
22916 124240 102416 28826 3802 46986 83349 70502 62796 43149 14989 -22942 3419 5537
22904 5537 12090 -9873 -5321 43771 52802 2835 -63928 -35806 20709 14537 -35293 -56946 -54113
22891 -54113 -57958 -67931 -67675 -14737 -9323 11815 -8767 -40283 476 50675 89331 102345 93485
22878 93485 73244 71448 74495 47572 23729 50340 70902 89824 97115 193526 244959 332364
22866 332364 399631 414056 346946 336147 350897 324305 207731 139049 64433 36768 15334
22855 15334 24446 58610 112751 181026 158427 127510 122716 116493 81295 57517 49700 86770
22843 86770 125110 130199 118588 92792 107861 144009 123509 84419 61739 97182 119090 176482
22831 176482 188768 242136 236161 235451 281591 288640 304696 302359 371953 404296 438831 522462
22819 522462 688211 982818 1463733 2053298 2522588 2784452 3069067 3354115 3182792 2469991
22809 2469991 1699498 1199485 845793 666272 567258 497858 428900 372404 379377 421408 448161
22798 448161 481087 519707 537086 500407 500786 540919 504192 504084 532060 530290 558509 579642
22786 579642 554805 589295 626078 629866 637838 691231 801261 904770 985464 1005761 1000243 1068883
22774 1068883 1111066 1114840 1167271 1211285 1285587 1405687 1537942 1728860 1975652 2249028
22764 2249028 2494519 2808082 3197444 3573324 3938122 4282116 4785327 5384896 6114387
22755 6114387 6975896 8017826 9398727 11256341 13630850 16507844 20083612 25149508
22747 25149508 32939674 45195923 66069902 105519341 179480566 281769046 359311027
22740 359311027 385242409 386269316 395226512 379966738 310502162 212395250 135103041
22733 135103041 89434050 63733295 47908830 37285101 29901776 24384281 19953937
22726 19953937 16378983 13637863 11611376 10041962 8695462 7612632 6751416 5958703
22718 5958703 5320250 4779758 4317822 3997842 3747189 3521992 3346122 3172796 3038475
22709 3038475 2897565 2702858 2495963 2328474 2175915 1997576 1800976 1591952 1438351
22700 1438351 1347791 1373821 1387636 1382641 1379059 1317975 1285750 1268634 1230772 1171103 1058010
22689 1058010 946681 838717 807296 901127 920592 937605 884081 859105 832105 778784 700011
22678 700011 634728 600934 605514 648752 661586 681252 694887 717792 799892 927934 1168389
22667 1168389 1648810 2200924 2479315 2463946 2448604 2463343 2254736 1805388 1286057 972478
22657 972478 810076 715438 628511 526624 463822 387974 354517 374221 385234 372350 367573
22646 367573 367952 364473 320109 315347 330337 340539 309695 276982 301400 309142 282298 270932
22634 270932 287809 285597 277736 250889 230237 206871 180468 194023 212736 251822 265574 316773
22622 316773 345257 344281 303830 288075 295830 329595 393385 645938 1080176 1429971 1331161
22611 1331161 1000156 703497 524017 446341 400843 360781 367450 384082 370272 305543 267038
22600 267038 221613 160342 116618 120934 168304 174519 191106 148999 121872 111819 113397 138980
22588 138980 161861 155822 215796 265211 208875 125603 103613 134286 153318 135718 159834 219830
22576 219830 195586 136632 139810 141793 100489 65351 59045 64458 65982 60211 55864 99285 112534
22563 112534 116311 108570 162131 234513 217073 201283 192637 164503 138070 125992 116444 151998
22551 151998 169155 160064 179447 203176 226502 205601 197596 186613 104376 48990 25196 22476
22539 22476 17405 18656 91703 104575 88785 82497 99835 87103 58060 55939 94558 54344
22527 54344 -19528 -2992 35878 53054 92804 141566 160061 166014 204902 240073 206289 141277
22515 141277 99305 72091 83119 63652 72528 67518 31958 22922 17871 55635 62442 48394
22503 48394 38010 -6544 2892 32133 108449 147835 149236 176122 202952 228490 153814 57244
22491 57244 67173 123673 140988 170258 196424 147871 109960 61195 17923 48191 35395 45290
22479 45290 41961 18400 36373 27489 72276 80302 34100 1564 -1732 11223 74441 117885
22467 117885 69388 45183 9721 1358 28759 -3 -3372 20900 44888 51548 92516 50418
22455 50418 22058 -916 2496 -14281 -56314 -17300 14198 296 -30990 -62136 -28338 46325
22443 46325 82891 49335 20709 17139 -30059 -65973 -39890 3876 -46290 -100459 -99498 -24390
22431 -24390 15992 -21684 -58992 -102268 -81999 -22620 -8148 31276 47140 64339 51115 14075
22419 14075 14292 21633 29314 11976 -27150 -37405 -16867 9583 21301 41196 78122 94341
22407 94341 78295 53250 12082 -14592 19896 73756 37735 30217 -17663 -40044 -71847 -86795
22395 -86795 -104353 -81117 -25173 -17436 -25846 -1148 -17195 -41480 -26660 -19802 20849 46808
22383 46808 82272 87439 87570 104262 102372 63498 31227 63547 89988 64142 46129 54524 126794
22370 126794 171380 136215 83080 29365 19665 -39220 -80634 -15500 -1084 -18766 -822 11327
22358 11327 -18095 -45274 -14862 16005 8703 15813 6819 19896 47519 38685 85656 166519
22346 166519 322154 458321 423548 251319 142096 97588 100031 84531 48782 35452 52288
22335 52288 47828 46971 48166 -10326 7008 98953 35570 -38723 -52318 -22008 -41687 -6098
22323 -6098 18439 16105 -7963 -51699 -52404 -50699 -11269 36937 32945 -17369 2516 3339 29136
22310 29136 -381 -2909 -3799 15045 4113 -3587 -6619 1514 44709 69089 111304 176717 166617
22297 166617 129802 93216 61579 37411 51458 71831 70706 13088 2302 19736 32560 65069
22285 65069 70586 98878 93358 146843 184104 329999 553987 752691 812180 618046 377161
22274 377161 242368 164210 159866 122542 127643 127935 94326 77020 108677 68789 33942 -1430
22262 -1430 -43420 -87855 -99460 -81111 -48880 -61907 -73038 -80190 -93711 -79023 -59421 -17569
22250 -17569 48431 66938 41186 -21908 -22928 -21114 9222 82544 56297 -857 -41364 -27735
22238 -27735 -48979 -75627 -134534 -176391 -132635 -62688 -36077 -17567 -34438 -27245 20155 62104
22226 62104 78521 89910 185616 279106 286549 199780 69676 16956 -39084 -50144 36577 44934
22214 44934 19220 12382 333 32361 55878 90017 89053 52308 60593 26638 23235 58817 34903
22201 34903 19548 55098 60995 58628 59823 69893 59790 48105 100328 93531 105078 136322
22189 136322 136102 140659 149810 199372 251058 269186 278231 323827 432802 642855 1010938 1501818
22177 1501818 1989123 2297915 2564445 2944273 3396811 3536275 3143205 2450359 1725047
22168 1725047 1146255 761936 522816 409398 306877 213180 208915 191489 200051 178914 156464
22157 156464 163580 162343 131123 136132 106916 81191 104179 99745 97613 59496 24437 -9167
22145 -9167 -22644 -49480 -26803 330 -30112 -23046 -33888 -72888 -21346 18814 40261 9363
22133 9363 -21825 -29186 15897 -3976 11635 10518 23923 38771 59680 105384 68957 7801
22121 7801 -48194 -19389 -1771 -12989 -7686 40985 79732 98908 68093 66518 63574 30480
22109 30480 61395 61841 13522 -11613 -31339 1554 6011 63502 59022 52692 19607 -10448 -20651
22096 -20651 9667 18034 26958 -22576 -18628 69027 82655 80760 74800 67566 50833 -5380 -72994
22083 -72994 -59530 -12360 29981 45318 54450 92150 99187 75401 33554 26927 46786 54992
22071 54992 81062 47800 21066 33821 18424 57946 89745 95322 61784 61041 78111 65694
22059 65694 19938 -14469 106 26622 -23003 -99643 -83386 -54654 -53430 -73677 -56488 -15383
22047 -15383 17796 67567 83973 115945 158565 196120 223640 186277 66079 42619 85637
22036 85637 73074 64672 82083 40121 25165 4626 7075 33393 40053 36860 -12108 -22929
22024 -22929 -17237 -11336 -43813 -66685 -40330 -44336 -14296 15251 25735 -21178 -19092 -15839 602
22011 602 48094 57925 46492 26182 46218 45724 27707 4449 30737 69934 107526 104173 118077
21998 118077 91846 26456 47975 43046 -10606 2877 33556 -14898 -27947 -60192 -25073 52596
21986 52596 76002 110787 99862 78181 67495 73113 20970 1501 9299 5439 -2196 -16219
21974 -16219 -17488 -40218 -36770 -32561 -58212 -67815 -72614 -3418 -659 -46057 -60005 -25790 -75026
21961 -75026 -86929 -96950 -88187 -63664 -65448 -40352 -2827 -6153 -1766 -55781 -78589 -55862
21949 -55862 -66786 -47991 -29814 -54919 -51565 -37991 -46523 -60770 -50570 -57796 -58374 -32819 -11483
21936 -11483 9492 15355 -24271 -30145 6686 73080 107352 104082 47605 -8163 -26302 -48236
21924 -48236 -36128 3175 7269 -25454 -38440 -18373 -37445 -35442 3013 9117 -15185 -34648
21912 -34648 -19522 -35379 -78884 -72863 -46280 -34955 51583 68409 83361 79784 56319 39893
21900 39893 13208 -34109 -55827 -26910 31888 56761 62823 79730 29440 -4890 29862 2934
21888 2934 -63948 -28368 12475 52374 76641 107714 65269 86486 23354 -71540 -71122 -47259
21876 -47259 11313 17541 -7243 -37877 -69035 -85837 -44512 -30790 -74211 -63075 -66214 -55627
21864 -55627 -23136 -6648 8296 27689 7828 -5949 -8768 2432 -5245 -47914 -9377 63134
21852 63134 80210 49626 56014 37161 -28150 -23019 -40978 10191 17641 -31241 -19544 -26258
21840 -26258 -27071 -52766 -19642 -13013 -34893 -46145 -101609 -120406 -122388 -112398 -65608 -27333 -12607
21827 -12607 -24154 -41191 41310 53601 -5235 16837 34622 45226 33216 3372 -3047 9616
21815 9616 -2092 4724 2564 57080 79991 74963 76830 46915 71592 29619 7829 19121 -8609
21802 -8609 -68868 -112016 -94241 -17309 -5916 -36880 -14735 3193 59303 103768 47087 24822
21790 24822 8031 -6668 -49794 -74886 -71365 -60313 17346 32421 -13672 -8408 -11147 -13366
21778 -13366 -45669 -63994 -47470 11996 41422 71797 66949 26010 -21119 -30278 -21067 67
21766 67 35838 34321 19918 -20064 -3933 -16990 -39528 -69888 -72457 -66715 -49908 -30662 -60952
21753 -60952 -34249 -17031 29908 42545 51514 33975 49977 61883 26517 17002 -4617 -1839
21741 -1839 39394 70010 46520 16333 -3507 8778 28955 45106 31975 32192 52057 36078
21729 36078 -11982 -8532 -24297 -37038 -25546 -29622 7196 42155 32682 10470 -8067 -194
21717 -194 14965 15791 -8061 -43865 -64813 -23560 -26463 -2127 -8052 4188 35565 64880 55345
21704 55345 32140 24872 13774 -49958 -119105 -90867 -33821 3310 27897 12791 32171 771
21692 771 2536 30585 46331 48493 54089 37528 51137 56968 49257 -9806 -51071 -24360 -6830
21679 -6830 -44105 -56287 18327 33238 31638 34825 36442 -25158 -56907 -98098 -59927 -13217
21667 -13217 19487 44535 -28192 -9692 -12051 8716 -19627 -43231 -51830 -11391 -1797 3570
21655 3570 1048 -25081 -52448 -52313 -55768 -49902 -46701 -39288 -790 -11878 -41252 -29071 31962
21642 31962 21435 12565 -51695 -114773 -56426 -10805 17855 44106 27273 9661 -33561 -51301
21630 -51301 -23072 8900 62677 102681 52522 15220 31431 26961 40153 19181 42630 45726
21618 45726 28885 -22816 -31546 37097 110798 116796 45706 36986 -2330 -60009 -58578 -88637
21606 -88637 -87186 -25160 706 -24802 -16430 10807 47877 47366 68185 13714 3907 11423 16412
21593 16412 27382 19161 33161 36634 -3792 -49325 -33228 -6428 -22045 -73121 -96900 -57144
21581 -57144 -50088 -55757 -88272 -70356 -38775 -55406 -83382 -34928 16974 17785 25828 58469 60512
21568 60512 66900 41572 33145 63189 133253 146344 113147 64374 -2757 1554 -10534 34007
21556 34007 33790 50390 33150 -2948 -16554 45467 107493 117744 164476 166588 127647 78081
21544 78081 77079 79918 60183 46367 -10126 12401 86075 60667 12612 34299 48556 15634
21532 15634 18524 63021 74043 64283 37339 39449 88392 67936 58268 46827 34531 81399
21520 81399 111440 85362 51945 51941 39835 -33496 -76245 4682 68745 46966 13584 -11600
21508 -11600 145 -12864 10915 24094 35256 34159 -4857 2738 52078 63738 41638 -7243
21496 -7243 21774 59858 58422 34756 30082 28039 17069 42701 51723 67163 56235 72128 67725
21483 67725 21353 -4790 34206 58535 61729 5182 -66751 -98334 -78932 -48442 -19896 12010
21471 12010 43638 44190 12732 -26138 -14619 9687 32540 25066 9474 24037 13020 7524
21459 7524 -29678 -33677 -86427 -80071 -58276 -65517 -45459 4413 19995 22087 23678 18533 47647
21446 47647 66800 85209 46902 -3909 -10575 -31245 -18967 -22776 -17033 24765 32607 39822 44566
21433 44566 65806 91912 89768 24243 -43380 -17643 28371 34099 9857 50595 67470 53818
21421 53818 42076 37125 63649 84204 92921 75700 43049 47972 6376 -62982 -90655 -90293 -39581
21408 -39581 -9358 -40761 -39649 -18379 -29467 -28826 -17809 -28149 -6072 -2050 -49849 -77567
21396 -77567 -48405 -37778 -36464 -26110 33290 83899 53936 4232 17578 34957 27872 13175
21384 13175 14301 13582 33788 39841 19384 35780 92837 86575 66977 60892 30841 -23845 -49181
21371 -49181 -62518 -51819 -22090 -11023 28745 35244 22297 33787 17363 13081 2086 140
21359 140 -9286 -34133 -26205 -26443 -56099 -49278 -20339 -21102 -21528 23886 109031 81960 27545 12965
21345 12965 21243 -15224 -7391 52751 63168 48149 49524 41740 4461 -7965 -30349 12839
21333 12839 2354 -22822 -13532 -60220 -103936 -117177 -28544 -10170 -2480 -54768 -73973 -49035
21321 -49035 -49985 -87505 -104862 -53601 -29785 -36796 -20330 9007 41170 41037 -21197 -23611 -7407
21308 -7407 7767 -18801 -52408 -51220 -56773 -46179 -53201 -89289 -91512 -60267 -27781 -24625 -35972
21295 -35972 -28530 -255 -22179 -37416 -61971 -56177 -21845 -60146 -42448 -6795 -8863 -54367
21283 -54367 -53108 -24675 -60167 -48917 -53538 167 50496 29992 19765 44882 50986 27178
21271 27178 -1450 -38402 -40362 -54300 -89331 -51219 825 24923 5780 -7432 20393 20725
21259 20725 28645 13417 13699 -44705 -47754 -5320 -220 -47007 -42163 -31094 -76709 -102624 -83119
21246 -83119 -61890 -50319 -53853 -47496 -19849 27831 29649 -5214 -46886 -45896 -23757 22307 6512
21233 6512 13612 39055 10205 -889 11179 37640 86083 95906 59175 32432 19956 42218
21221 42218 11794 4775 20924 32950 31742 17947 9240 25380 55747 55608 -12928 -30913 -37948
21208 -37948 1355 2900 -17545 -14660 -13761 -19468 -46435 -20479 -60564 -53038 -25758 -385 -11506
21195 -11506 -31854 -25115 -19619 -25298 -37274 -66124 -39241 34006 -5859 -41908 -86886 -86328 -88352
21182 -88352 -89289 -65110 -64487 -36371 -16579 22081 29121 35700 34145 2903 -16684 -10901 -39554
21169 -39554 7507 28104 -6024 -54319 -101210 -107105 -77975 -24055 -4086 -33330 -48715 -2657
21157 -2657 29918 6685 -12591 -37085 9497 20373 -40976 -64093 -53850 -13559 -45409 -73372
21145 -73372 -83857 -112174 -58612 -16506 -19648 -53686 -45783 -35135 -32745 -5311 36871 57745
21133 57745 82473 33837 6823 20465 21765 -19951 -41471 11224 -13459 -50125 -19431 -20965
21121 -20965 2448 25601 17629 -14859 -59678 -50872 -34156 -27716 7180 -2974 -21622 -31349
21109 -31349 -7264 4285 -19591 -3464 11279 -5649 -30545 -23530 -17257 -34878 -14217 -25338
21097 -25338 -69070 -61883 -51771 -29255 -23028 -42801 -37077 -69724 -50294 -6687 -54928 -29748
21085 -29748 10180 40219 21383 -1332 -51964 -72968 -81100 -60046 -66221 -32857 -7814 -41264
21073 -41264 -41561 -7706 -3122 -45522 -40256 44336 29813 28195 42913 43598 -22692 -15335 16499
21060 16499 4011 -17184 -18175 15593 43617 -6721 -53638 -26348 9264 11106 51909 34415
21048 34415 -9083 -37759 8915 19362 -15214 -16910 -579 -2081 -15970 6086 35245 -18576
21036 -18576 -26124 -19002 -3985 2211 -25462 14711 56396 38699 31992 45700 9139 30465
21024 30465 34027 12334 -18237 -33057 -14317 -14648 -47365 -71526 -77399 -91978 -74338 -31686
21012 -31686 -20264 -36993 -91644 -85557 -87530 -76025 -51772 -45137 -51638 -55464 -49219 -68076 -74765
20999 -74765 -64952 -47398 -53630 -85399 -84871 -104637 -85215 -20489 1456 -3148 -6798 -38013 -44012
20986 -44012 -66980 -22892 -1275 6686 -11325 -59640 -43261 -7054 -3390 -35236 -35223 -50025 -61464
20973 -61464 -64011 -35653 -57868 -45660 -37900 -36723 -55898 -41475 -52333 -21648 38694 38088 3296
20960 3296 8818 -18094 -67747 -104167 -76137 -38859 -5970 36043 42435 4767 4444 -8638 -71719
20947 -71719 -87812 -83809 -57082 -66148 -54210 -3549 35995 61195 32798 -22616 -43038 -96376
20935 -96376 -153937 -133430 -96612 -16736 -34837 5415 -9148 -38598 -24026 -9245 1265 -34806
20923 -34806 -84990 -133905 -116209 -89381 -139843 -128671 -80335 -26598 -29365 -6664 2395 -40866
20911 -40866 -89130 -97818 -56391 -36617 -80979 -79292 -31392 4029 16879 -14598 -33633 -51064
20899 -51064 -62484 -114922 -133304 -101706 -28121 -31725 -85603 -112556 -107513 -26538 23912 35913
20887 35913 46993 46792 93398 65941 26755 -8528 -3887 -23726 -37294 -50 -42194 -91250
20875 -91250 -48978 -26793 -15451 -21536 -3674 -25725 -64871 -16468 -17366 -33514 -47372 -44472
20863 -44472 -729 51999 38289 20380 37036 40703 38025 21756 21386 26330 20202 9802 -36066
20850 -36066 -45890 -16451 26559 37072 3214 18186 14761 -20795 -30949 -64253 -74525 -48630
20838 -48630 -35285 -13548 -17103 -29747 -34231 -52741 -27460 -40419 -84551 -41813 -36363 -69636
20826 -69636 -94953 -101022 -30762 32842 15151 23681 49699 33347 27342 17204 6685 5527
20814 5527 -24984 -7678 -40317 -59131 -39573 -64344 -80831 -76398 -89120 -93400 -66574 -38173
20802 -38173 -49807 -58457 -26605 24571 -56448 -103497 -61580 -35994 -62962 -96385 -49786 -55910
20790 -55910 -22558 -9206 -21133 -39764 -36007 -51934 -73213 -34685 -2717 41046 32665 -22898
20778 -22898 -40433 -55921 -35485 18178 33774 4284 -15303 -57975 -43168 -9887 -10031 -33483
20766 -33483 -98521 -138798 -111951 -67125 -33925 -76841 -44517 2531 -4053 17071 -8425 -22397
20754 -22397 -65059 -4973 1154 -31187 -56215 -83166 -114062 -94819 -57966 -68266 -105983 -77590
20742 -77590 -26012 -1766 -30329 -47826 -19648 22842 15671 -15564 -3874 41188 49498 6571
20730 6571 -5953 -22348 -20940 -31580 -40904 -36649 -11758 3855 33277 59648 32987 -4301
20718 -4301 -9617 -36862 -54421 -55298 -79608 -51401 -24808 -15693 3673 24036 -1472 31214 12948
20705 12948 29707 -990 9860 20646 17693 67460 67551 17736 -7325 -1796 -4102 9606 14710
20692 14710 4770 -8774 -66594 -101204 -89184 -39022 -18107 -33381 -68919 -5069 59729 48213
20680 48213 18764 15557 -2120 -40069 -40497 -13467 29603 41353 17265 -20759 -31654 -4225
20668 -4225 46508 9719 -83445 -111509 -40326 -39987 -51129 -48203 -69443 -63292 -33580 -30311 1347
20655 1347 1896 37047 17794 -873 63246 61038 -27093 -51483 -67283 -32618 -15134 10497
20643 10497 -39673 -106093 -162390 -134163 -109282 -108858 -122661 -128270 -113301 -120226 -112078 -119351 -111517
20630 -111517 -107766 -67783 -34647 8312 16134 -34826 -128324 -123708 -108224 -114827 -109080 -48436
20618 -48436 -4881 -25504 -20210 24055 24888 -20640 2606 23152 -28158 -45066 -46250 -25338
20606 -25338 -51507 -64094 -29470 16286 15906 29617 24083 -32016 -45763 -75666 -81459 -4505
20594 -4505 -18743 -70603 -88171 -75313 -56873 -80813 -91475 -74179 -74811 -27621 -13146 -51957
20582 -51957 -124043 -172747 -177662 -52354 34056 24627 -9697 4749 3372 17097 -31189 -47307
20570 -47307 -21351 -627 37498 59652 40470 26033 22402 -23179 -76693 -63864 -71913 -80111
20558 -80111 -49078 -24397 -47775 6357 277 -23652 -57590 -63498 -17726 16342 28313 -7055
20546 -7055 -3306 -13076 -41075 16814 53854 42026 99 -24037 13057 51935 42546 11011
20534 11011 -10291 2355 14098 7909 -7439 5348 6685 22592 28265 39474 20558 51348
20522 51348 41402 13665 -9502 -49369 -102371 -92811 -59893 -68314 -85888 -15355 47545 3139
20510 3139 -15601 -24463 -39458 -35403 -22505 23538 -421 -31976 -56293 -48309 -20156 8846
20498 8846 -5174 -28102 -940 23644 20791 -3764 24820 15729 -13128 7576 18157 2917
20486 2917 8954 28236 23441 -33596 -53772 -43702 -13261 -31597 -19289 5771 -37104 -57149
20474 -57149 -41135 35656 36668 -52637 -57083 -17077 -1104 4963 6844 25616 7748 -1595 -30799
20461 -30799 -43064 -40794 -26978 21368 20755 12944 24114 -14593 -87378 -90374 -47913 -29852 -26277
20448 -26277 -57485 -65971 -44539 -36782 -31250 15397 51702 48258 51285 9675 25597 8415 -34022
20435 -34022 -23303 17026 26599 -34444 -38039 -46388 -68210 -10050 29415 46598 32279 6456
20423 6456 -5261 46234 54002 92306 121484 91464 52965 1869 -6001 14431 -7455 -27806
20411 -27806 -13411 -8789 -63571 -51125 -12018 23510 26922 -24143 -25869 8523 10414 -18820
20399 -18820 -43867 -49687 -47399 -25400 839 34268 53799 68358 94603 72089 38933 45492
20387 45492 26683 32613 12425 12596 35968 -5158 -83984 -66861 -35188 -32460 -27099 -11705 -17475
20374 -17475 6608 88 5405 9663 15345 21186 6994 43119 7166 -6403 -2930 55876 53771
20361 53771 11618 -27471 -36278 -30518 -8210 -24173 -8957 -14829 -10947 -18297 7101 39160 18516
20348 18516 -30503 -64901 -59813 -46882 -21944 -60304 -95893 -52589 5608 23660 -10775 -27250
20336 -27250 -22161 5346 38856 46589 6910 -38028 -7738 14964 -25816 -7742 -10703 -26181
20324 -26181 -34146 -13208 16904 40898 42953 47596 14405 220 -19466 -32985 -23366 -10709
20312 -10709 26038 47216 53180 7361 -35536 -57832 -60500 -47661 -25574 -6922 31271 12792
20300 12792 -15806 -19580 4447 9802 55263 60449 32508 21731 -212 -56082 -55094 -73777 -61877
20287 -61877 -51550 -54288 -22416 12429 35494 820 -20519 -25069 -35022 -28295 -28883 -5406 21942
20274 21942 1858 -14549 -58785 -133926 -121273 -93456 -127771 -138088 -68053 -36711 -75310 -100976
20262 -100976 -96378 -101153 -97635 -94027 -94705 -70856 -66252 -52510 -1762 19944 13608 -6398 -14940
20249 -14940 -29130 -2073 -23845 -31754 -18641 -13912 -19491 -15557 -80028 -121063 -148426 -149662 -138109
20236 -138109 -115024 -86911 -48052 -22095 -59044 -79935 -119088 -149844 -162353 -133409 -72600
20225 -72600 -62016 -67799 -64523 -35412 -51279 -54965 -18005 -44245 -44803 -37229 -74149 -62638 -80511
20212 -80511 -83432 -17924 59823 61233 5680 7373 21252 11290 -27379 -9214 14169 -15271
20200 -15271 -39790 -32945 -56811 -59586 -26613 29832 21258 4489 -8076 -15247 -29606 -25969 -31533
20187 -31533 -28373 -14651 -422 10792 14489 -9323 -22422 -25259 -10344 -10458 -70971 -90198 -66440
20174 -66440 -26911 17605 60207 79485 104217 50044 -17647 -38418 -45055 -22961 -38579 -62602
20162 -62602 -36526 -33599 -16816 -7705 3335 -42090 -38228 34321 80251 5448 -29720 -56165
20150 -56165 -76902 -71984 -68736 -28049 20053 -9420 -46102 -17643 1619 -19870 -53482 -67279
20138 -67279 -53625 -40315 -17171 -26533 -49586 -79908 -77504 -56955 -25995 -2189 154 -71296
20126 -71296 -64846 7896 61342 62016 17273 -38272 -20064 -2790 16243 -11306 -34812 -42037
20114 -42037 -39237 5795 30743 18422 22989 13519 35528 -13795 -9310 -37745 -42305 -11521 -5359
20101 -5359 -59791 -63874 -38651 928 -15361 -17001 23737 -11007 1 -17436 -40531 -33949
20089 -33949 -28112 -34265 -10106 -27711 -29210 -42502 -59569 -76723 -108896 -101691 -123711 -92026
20077 -92026 -23761 -4075 -45855 -78970 -109155 -162871 -164127 -142408 -92387 -76999 -49186 -14254
20065 -14254 -20594 -34569 -88617 -86640 -67313 -43794 -27689 -64597 -119974 -106816 -25687 -43915
20053 -43915 -94094 -89876 -80627 -94565 -98712 -122831 -67958 -8142 -9428 -69539 -82361 -78874 -56063
20040 -56063 -18370 1314 -41418 -93568 -76690 -98747 -79634 -73399 -63455 -49667 -51668 -57102
20028 -57102 -22123 17564 -6824 -16411 -29617 -26233 27084 56404 82263 74412 9953 -46778
20016 -46778 -12458 1690 -14356 -39746 -54276 -6148 7705 -11406 -2530 27123 51439 25609
20004 25609 7251 5439 2322 26542 36263 45684 58895 37595 2708 -23870 -39435 -66743
19992 -66743 -33199 -10772 -19563 -40744 -56391 -71447 -26303 19320 -25281 -93714 -120556 -52729
19980 -52729 -6472 52717 90612 43194 14778 -26963 -46130 -56010 -1317 41412 -19754 -62803
19968 -62803 -74461 -112380 -107097 -67444 -33819 -29272 -4586 -22397 -35923 24008 81627 48082
19956 48082 -27847 -60672 -76795 -63703 -46037 -54204 -15070 -27368 -26421 11379 17799 41223
19944 41223 -2554 -33060 -42411 -86876 -102309 -73655 -60199 -25128 -25884 -95903 -102434 -82626
19932 -82626 -56299 -34454 -42395 -41935 -75065 -89529 -77537 -9630 -12587 -55921 -85090 -53693
19920 -53693 -15241 -19182 -36805 -84029 -103592 -89951 -79195 -86394 -61521 -46784 -40338 -59191
19908 -59191 -35496 -43520 -42479 -43985 -21406 -15900 1565 -8699 -10065 -33499 -50884 -68916 -82235
19895 -82235 -101874 -89731 -84977 -68617 -54890 28572 50788 50081 -11259 -29607 -1273 21068
19883 21068 -7077 2692 -30641 -115049 -135173 -71360 -60207 -36348 -33846 -23722 -6202 -12007
19871 -12007 -30380 -13103 -9418 22500 10326 -69971 -115967 -77812 -67406 -67148 -58506 -6941
19859 -6941 12950 34544 12461 42374 67655 57174 -4512 -34653 -2398 -1933 -68089 -71974
19847 -71974 -74762 -73413 -27253 -40705 -79261 -33420 -8373 -23332 -105100 -92219 -116141 -124203
19835 -124203 -33823 -24301 -31969 7292 35023 28194 16314 18927 22685 18038 -8610 -15888 5817
19822 5817 3210 -17275 -7565 18694 49915 24224 -10852 -27689 -12808 23120 23127 21193 -36986
19809 -36986 -31913 -4805 28090 53747 45773 22829 9637 17934 51183 33726 -4947 -1425
19797 -1425 277 -21787 -10488 -30141 -48839 -17702 -45002 -92979 -109213 -64734 -83629 -68547
19785 -68547 -42049 -14431 14978 28893 49250 47820 11295 -25981 -55293 -57114 -83933 -160068
19773 -160068 -141684 -100294 -108831 -98346 -19334 13036 3262 -9765 -28713 -38240 -84453 -78726
19761 -78726 -58015 -90225 -110679 -128151 -130465 -136466 -106423 -59650 -30193 -66177 -88591 -76598
19749 -76598 -54405 -43148 -11780 18179 39510 10925 18236 23332 -7994 -54666 -29957 -26771
19737 -26771 -36459 -17617 -23673 -39002 11731 64140 73764 27849 25006 26008 24330 -33534 -42146
19724 -42146 -14712 -11050 -63061 -72914 -79709 -60622 -32768 22030 51293 13767 21366 45972
19712 45972 18233 15226 -10276 -3897 37570 30944 37347 48118 35177 31563 42243 4860 -6137
19699 -6137 -11681 7794 6399 16479 12696 -13050 -85192 -115445 -111787 -94567 -25286 1858 16138
19686 16138 22709 13217 8983 -10949 -11689 -35905 -40748 -56235 -46199 -45822 -28462 -16872 -10119
19673 -10119 2534 -26218 -74098 -52167 -12785 -3970 10111 24854 27598 9969 7137 -8956
19661 -8956 -35091 -15016 -25459 -49911 -57832 -39047 -16541 6010 -18723 -30489 12135 45810
19649 45810 27496 -29773 -61578 -58678 -50516 -34360 -33634 -36866 -61230 -94928 -98093 -38109 -9550
19636 -9550 28990 41864 26313 20248 5663 32208 5720 -47171 -42063 5461 2132 -51 337
19623 337 2034 10259 139 -29294 -21509 -33049 -55674 -52083 -56289 -104423 -150516 -146194 -68364
19610 -68364 -55553 -8759 13409 -17927 -61953 -35866 14723 8411 14323 -37170 -61745 -70193
19598 -70193 -93461 -56081 -32677 -42612 -48299 -13010 -18011 26749 66238 49891 25453 -9410
19586 -9410 20495 4271 -49319 -61537 -86431 -46874 14151 -22134 -76708 -65776 -55880 -46207
19574 -46207 6345 26702 2128 -45222 -42161 -12772 7921 55257 29216 16311 -9166 -40357
19562 -40357 -8145 -54434 -84930 -105965 -103045 -86894 -75238 -40586 -52372 -74010 -94864 -46062
19550 -46062 707 61443 60132 29535 49342 84500 81615 56400 32712 20412 3078 -12531
19538 -12531 -4956 -1064 -16641 -24605 -51646 -76290 -32363 35237 41257 24243 -6558 -17308
19526 -17308 -66238 -94467 -118647 -52454 -11849 -31926 -35522 -25206 -27584 -20692 17764 32369
19514 32369 43263 59289 95228 69017 55693 13692 5928 -22925 -5051 -27223 -56622 -62634
19502 -62634 -72849 -91458 -69103 -86942 -41481 5008 38206 34350 53158 -26339 -37776 -5831
19490 -5831 2009 4761 6454 28675 82601 67536 53755 80592 80804 31709 25110 53991 30464
19477 30464 32284 81921 66601 11109 -26873 29671 88687 59426 61074 99312 129048 159454
19465 159454 209562 199310 155523 139651 108488 31781 47469 55575 128297 173925 146117 166495
19453 166495 232056 290278 285206 214393 186991 140130 106931 116285 128445 118262 49301 51888
19441 51888 92430 90037 80318 85591 62911 32611 43436 26071 20350 39622 41209 24280 22350
19428 22350 -28943 -58404 -40819 -4387 -37025 -42125 30386 43117 39881 -31728 -84269 -90923
19416 -90923 -52710 -23424 2332 4213 -29813 -49728 -13458 39464 57463 42004 -4032 -20156
19404 -20156 -56060 -30825 10499 -31080 -45432 2171 2803 -20277 -23747 2724 3731 -31329
19392 -31329 -9158 26008 28927 -18654 -65705 -96087 -81587 -52189 -46328 -57551 -69138 -30993
19380 -30993 50463 63729 75752 57068 27987 -6181 8487 21815 17423 37579 58343 66203
19368 66203 39755 -7089 2644 -39065 -44125 -24651 -30347 -7070 9079 -3736 -8935 6411
19356 6411 -22104 -32241 -29640 -47416 -45518 -22065 -26676 -15875 16005 43773 44122 55753 23443
19343 23443 -8691 -7154 70078 104221 67271 -4045 -26909 -24416 -37524 -53006 -70400 -36799
19331 -36799 -23369 -7649 3407 24591 -16515 -64908 -61545 -46170 -15942 -7069 -25370 -18810
19319 -18810 -8093 -399 -1091 -45787 -92080 -74445 -67501 -36681 -7043 -13519 -31507 -26735 -17781
19306 -17781 26288 28061 39938 33825 34193 43152 -11846 -45933 -33605 -34102 -22664 4758 40550
19293 40550 81618 105245 83136 70444 -42646 -97553 -108118 -101454 -58298 -52330 -46930 -5370
19281 -5370 4209 1796 -8909 -17026 16957 21126 40003 36365 78014 67859 17261 -28136 -38700
19268 -38700 9200 18988 33784 24969 28893 54473 20600 9138 33801 78296 96619 120573
19256 120573 153581 146670 96190 76537 156395 171334 129703 63232 71737 97395 94531 57328
19244 57328 15279 -14077 -34336 -49622 -52920 -27836 -27324 -16348 -7730 1768 46117 85975 38498
19231 38498 29750 32973 20616 7815 44566 96868 125462 122573 151590 132677 121977 149836
19219 149836 183065 158896 149517 192038 195598 191737 185988 219301 227322 293420 317448 352049
19207 352049 322993 249253 214255 237390 223238 198468 158099 178539 168873 204436 167339 86820
19195 86820 57891 22566 91935 115329 91514 26918 607 -30215 -41028 -35834 -55705 -37738
19183 -37738 -19849 -26682 7677 11629 -36550 -10589 12296 14459 56056 49287 13805 4535 16977
19170 16977 37454 55138 16530 60866 89185 123426 106776 102900 78727 31075 17707 51163
19158 51163 34314 16063 -3503 -3290 23425 28277 16592 4739 6331 21640 56695 51775 105430
19145 105430 178996 244589 221910 208149 252980 340048 438793 454366 461015 492213 477130 529803
19133 529803 564034 514941 475801 481225 489012 433295 342433 323864 342382 317322 283591 259156
19121 259156 200638 96036 90354 109907 107415 88473 95582 68089 45167 66938 50798 65363
19109 65363 84221 88216 51569 -41210 -55563 14809 38506 -28311 -20904 5128 15424 16174
19097 16174 36382 126357 184235 248146 243845 275151 335140 424945 496825 528276 512772 538552
19085 538552 544788 515540 480623 539455 593964 575864 529251 420496 372652 370749 306224 239968
19073 239968 142834 102329 85294 115424 196888 202925 120712 132489 123173 133364 103216 88112
19061 88112 57408 39479 116940 116176 59168 30117 38304 95215 107308 106486 66057 37322 58876
19048 58876 55121 45502 19182 14675 11668 24698 63365 164367 212203 243802 245529 258571
19036 258571 338486 421187 457436 365364 309361 329938 365965 433154 469756 480165 487369 455302
19024 455302 423853 407752 335064 294125 281444 245432 184957 116344 136004 174172 137252
19013 137252 84363 33750 -26531 20629 15507 72191 120415 111046 94877 79189 89206 89703
19001 89703 84975 42564 2233 21765 22570 48393 95516 55663 109659 151418 155413 259613
18989 259613 283532 259458 260271 265836 322978 438792 498038 489992 494514 504139 526358 492948
18977 492948 483713 535904 586176 546205 380782 292820 318469 400272 390959 320105 275500 250977
18965 250977 182334 139393 72389 29866 -11324 -7098 15719 44523 41638 51577 100613 102867
18953 102867 62919 51577 48975 80175 70683 24163 -18787 235 67911 80663 71506 73183
18941 73183 81942 49786 43670 35892 66853 60660 40095 30285 -9691 -35743 -30684 16184 15138
18928 15138 1886 -9942 -506 -5310 -17743 -23590 -26079 -3014 62442 101237 97933 69281 83119
18915 83119 98806 108165 73415 53272 74598 55078 -4565 5123 47442 37809 75764 110168
18903 110168 71361 33823 23457 -6714 -29884 -48324 -2258 -14061 -6314 3049 11334 28653
18891 28653 7712 44542 117992 178442 211885 285496 290736 293995 354333 415415 449199 461386
18879 461386 517390 611382 660650 668560 636749 613597 618696 660366 701035 741102 788006 791200
18867 791200 723538 682723 724671 775932 856589 914904 828894 713230 578216 563227 588573
18856 588573 615047 688072 677863 577211 384781 270163 235106 207897 190964 226802 293710
18845 293710 294845 268570 244878 211469 172399 152730 146020 103903 93838 67316 92976 88686
18833 88686 63149 57719 58701 90953 128666 167240 217861 301400 370018 393250 387372 367615
18821 367615 306680 313588 422433 540105 649632 669959 593612 487644 406774 389733 433825
18810 433825 504895 552729 591599 527465 401980 334493 314142 276384 247636 246791 317115 334252
18798 334252 290634 214791 169973 150914 138499 148305 192428 255795 288590 275646 274782 279200
18786 279200 307557 360070 466972 486675 419890 386679 439833 469427 506747 583677 636569
18775 636569 627299 569501 540647 579346 695611 774774 819565 920209 1063728 1183110 1032220
18764 1032220 804404 629838 543296 490088 438250 388481 316095 264264 214951 229833 287351
18753 287351 298531 268962 221522 228280 230267 235685 217696 192896 214363 263546 286267 259616
18741 259616 197151 106807 73986 80430 88848 83520 47362 118 46149 83026 128231 191122
18729 191122 219738 221028 252554 297274 369515 386782 354674 330156 318344 313919 367116 384604
18717 384604 384092 336312 377675 425446 427435 406748 410361 369836 364982 390480 348769 296296
18705 296296 269896 229003 174659 155841 183627 214734 226823 235542 254982 272807 275697 288834
18693 288834 280055 278767 279906 262489 277988 268052 281789 290230 260825 315087 380172 350492
18681 350492 305672 298778 328465 331548 344576 374519 371566 438844 480626 476196 464783 541009
18669 541009 608789 648989 759224 904856 959170 1050306 1197568 1346271 1491530 1627671
18659 1627671 1713529 1807317 1917769 1993774 2100439 2226389 2394148 2591889 2801453 2948683
18649 2948683 3053894 3244659 3587669 3996799 4413429 4963160 5728570 6915240 8755349
18640 8755349 11825817 17065953 25282818 34906178 41945367 44549589 46071092 52796407
18632 52796407 66929630 81372322 88197843 87444162 85975220 87079017 88282401 87500747
18624 87500747 87618884 91808857 95571192 91008554 76945832 62147753 54434708 52733547
18616 52733547 50570881 43746218 33631865 24477232 18263823 14423726 11953176 10313243
18608 10313243 9190848 8397043 7848491 7375659 7074430 6938408 6895086 6855098 6815087 6704073
18598 6704073 6724072 6917705 7210651 7649204 8220896 8982129 10286399 12362113 15892266
18589 15892266 21983821 31385793 41610509 48291041 50369677 52526949 61389664 77648130
18581 77648130 92506134 98244165 96449990 95034649 96462765 97501010 96646864 97414914
18573 97414914 102140997 104754584 97495993 81054789 65895038 58832151 57068867 53680171
18565 53680171 45133050 33763179 24148324 17708560 13641686 11030153 9209722 7909874
18557 7909874 6995487 6163727 5495591 5041874 4706651 4471765 4281388 4021622 3700344
18548 3700344 3432367 3271321 3101339 3007734 2902364 2768244 2579688 2368429 2148441 1996662
18538 1996662 1861068 1761417 1566872 1410868 1289503 1196699 1040656 981363 945884 903363
18528 903363 852240 833299 838192 782247 718989 680877 674882 686008 654912 617952 599404 537846
18516 537846 522189 578778 591021 549111 462535 366488 360131 403861 409334 379273 360194 369558
18504 369558 387926 392766 370240 370850 375292 413493 440093 365782 353189 361250 360605 342780 330447
18491 330447 344737 369899 435663 455272 457268 468962 489561 446048 418996 420077 396385 401977
18479 401977 455091 442160 448550 412797 401540 371922 335948 348927 429848 520249 552860 532353
18467 532353 489136 425335 376695 376606 384692 415067 504349 581509 527171 498467 492959 496379 487292
18454 487292 493575 520168 500982 461712 482797 490155 534720 628837 684520 605246 538754 516884
18442 516884 495325 480516 530698 558926 584908 544787 459543 385730 361819 395120 398086 386888
18430 386888 376415 360975 336737 309608 320866 332713 322905 333914 368663 398430 413304 434923
18418 434923 428557 453690 434166 401894 400145 394556 393359 329798 384490 449995 460495 476691
18406 476691 483183 454476 485770 522110 548507 585153 665056 762621 790476 842602 953119
18395 953119 1035563 1123996 1249498 1331403 1425582 1556765 1817579 2081138 2195484 2271256
18385 2271256 2351518 2395789 2536791 2796548 3153893 3517552 3828118 4114874 4540419 4978093
18375 4978093 5613770 6721633 8514718 11437565 16223864 24205033 34755370 41187185
18367 41187185 39137040 33939961 31549152 34303959 43859286 63037613 89728668 106610585
18359 106610585 100467024 80710577 63061207 54441384 55573215 67089594 87474317
18352 87474317 105651548 104215743 82887432 59357037 43868387 36313664 34752079
18345 34752079 38313025 43672682 43126738 35078340 25677078 18953101 14786132 12174231
18337 12174231 10607099 9811529 9500026 9363493 9197679 8995404 8884827 9019414 9585347
18328 9585347 10864834 13184405 16934537 23162546 33123989 44560577 49172418 44852792
18320 44852792 39034763 37531075 42294484 55483856 80038511 109654765 122068860
18313 122068860 108991244 85673482 68000894 61042650 65132843 80834832 104219182
18306 104219182 119847860 111017630 84771744 60328547 45384878 38660991 38252739
18299 38252739 42926974 47474911 44024939 33892556 23905174 17039068 12768878 10106282
18291 10106282 8439270 7379999 6569073 5930508 5269632 4659193 4108790 3682351 3428473
18282 3428473 3320752 3235187 3150846 3024436 2844019 2524256 2202202 2009016 1882567 1794409
18272 1794409 1695343 1578580 1486876 1419496 1277845 1150253 1068008 993300 955682 933424 921892
18261 921892 865745 764970 723712 698686 689472 722768 682023 634201 638893 686307 647949 614233
18249 614233 621131 573249 518446 571350 540575 497014 454219 445938 414989 417748 441140 416396
18237 416396 388986 418107 463799 451780 537161 526648 450673 407740 374128 376045 379811 383458
18225 383458 404332 376101 337683 382178 391386 354867 334698 332444 359277 394587 469899 521193
18213 521193 424637 347688 316519 312592 326289 308894 302762 297754 275789 310850 324307 302058
18201 302058 332953 322823 339433 324990 303977 284907 262757 284970 376904 346986 229682
18190 229682 221095 213259 217933 255353 276791 272598 280350 291711 274601 242578 230089 225549 232256
18177 232256 261621 289235 322667 333051 343620 323809 315724 269614 279412 302677 303870 261526
18165 261526 255787 262945 260969 282517 323926 366975 380666 434296 444261 429244 385894 390171
18153 390171 346290 243803 274425 304553 347976 377194 380002 349862 347297 354035 355371 400644
18141 400644 464963 518842 564378 579667 646650 762453 935564 1088600 1219705 1327441
18131 1327441 1373618 1423237 1460157 1421442 1356498 1380842 1462984 1572857 1812062 2045998 2279022
18120 2279022 2528206 2886807 3425656 4088579 4874491 6147234 8205950 11572763 17544434
18111 17544434 29124186 52877070 95545844 129588463 112236014 71722612 41627548
18104 41627548 25798742 17601731 12895353 9886958 7814895 6275324 5078290 4198181
18096 4198181 3556557 3054875 2624007 2370845 2229605 2110940 2041215 1948581 1911815 1955222
18086 1955222 1978525 1976484 1923388 1798448 1665792 1518056 1400442 1304644 1143842 1010457
18076 1010457 954305 898783 830609 823218 797320 768299 828339 859008 923604 1019260 1020550 986747
18064 986747 1006516 1007487 927618 886059 914470 929102 950832 919850 853668 733492 708303 669442
18052 669442 627031 565862 499551 415227 370920 366264 399218 395680 398846 470502 513201 517672
18040 517672 520797 588706 671668 706899 678010 631790 583383 522494 467952 365376 338418
18029 338418 326087 351282 365961 385879 411143 392558 362943 341204 330079 342899 358754
18018 358754 387605 432276 435204 399088 357947 362376 342453 300187 357095 337045 314657 327078
18006 327078 287067 220173 202776 219422 155953 117675 146757 133183 90301 139192 200706
17995 200706 201153 161726 140208 216873 226005 252359 221140 263949 294594 250810 178884 152103
17983 152103 153686 159935 270312 289514 268419 248043 252636 315260 348054 325953 261343 226244
17971 226244 270199 324126 319688 305383 298864 305979 303034 307850 304887 283317 268779 281259 264303
17958 264303 256970 253989 240580 271107 238265 244204 226725 158231 115695 118037 117694 101836 126591
17945 126591 145416 152001 137973 130563 176642 159201 84966 51922 80510 93398 92086 71615
17933 71615 78570 68084 79921 119949 117479 136026 154573 182803 163200 126723 96135 107098
17921 107098 148454 183634 149059 167710 175763 233184 223909 266335 276575 261813 234802 210683
17909 210683 226636 279070 285549 237092 243107 239889 219226 225737 267097 308451 264487 219569
17897 219569 197005 227047 277664 304052 296796 260153 231971 180600 163524 149801 144840 144431
17885 144431 148953 167357 189935 242156 303111 334415 357168 395997 421676 445549 454142 409034
17873 409034 400462 430018 393154 320312 328610 386182 411573 411769 426262 398682 413087 458398
17861 458398 489461 535178 511193 468251 468187 526711 605774 726853 830181 868586 793680 690579
17849 690579 617806 587340 624497 662370 704315 758125 704610 602106 528736 458500 386693
17838 386693 396699 451512 427248 440961 427496 427641 433615 454312 498372 558201 552319 519338
17826 519338 496973 489109 445840 421675 455114 496095 524623 535554 558114 568176 626096 633866
17814 633866 625928 603271 586089 578400 561065 642846 783647 908600 933062 797576 617147
17803 617147 544199 547095 575375 624445 694257 792508 779782 659116 529584 447948 412635
17792 412635 382504 409097 422639 402035 326190 260968 195336 201852 202191 231162 260967 315294
17780 315294 358638 315467 262827 264236 287660 273609 265908 217698 149928 120152 134771 110334
17768 110334 132768 178758 224512 198750 185465 220578 223222 207024 240797 272482 237176 195393
17756 195393 195011 137857 135768 170127 205757 198892 177927 169231 182304 184572 141600 110386 132315
17743 132315 166943 167750 183875 162643 114457 66530 16230 20583 7952 19494 -11168 -23144
17731 -23144 14648 55654 59718 16132 -23882 10285 35787 41087 64200 119725 189823 219825
17719 219825 278330 353396 490651 681472 826766 772850 639575 471816 331059 276541
17709 276541 227138 204477 174516 196585 207457 191339 192955 247410 297466 302755 283286 302718
17697 302718 292042 254123 245473 242927 202656 201232 205006 183724 161919 166166 214586 215108 228959
17684 228959 228483 172422 143993 203544 260934 228365 188340 139782 162046 253249 323174 430577
17672 430577 553693 704412 846572 1009558 1152431 1191375 1167145 1147651 1127290 1035545
17662 1035545 920152 829264 740510 667596 559898 559317 615405 693753 790427 911206 1075383
17651 1075383 1287791 1482989 1714907 1901587 2018608 2092165 2090877 2067110 1996750 1915794
17641 1915794 1914155 1932692 2088916 2355419 2635206 2952382 3389451 3961613 4770408 5861301
17631 5861301 7482176 9868587 13484688 19264563 29069217 44528987 64021915 83469260
17623 83469260 96780638 102964944 104240396 101052306 90085892 72463399 53074323
17616 53074323 37037988 26197298 19390364 15116443 12261476 10183933 8511184 7228579
17608 7228579 6203395 5477622 5096651 4919523 4803703 4778331 4908472 5080524 5357985
17599 5357985 5677436 5865167 5916827 5922258 5884547 5744242 5537926 5389594 5392569 5587933
17589 5587933 6031568 6701289 7660747 8976188 10855064 13718748 18003734 24865011 36261394
17580 36261394 53384697 74524725 96429336 115992257 134953038 152964883 165389012
17573 165389012 164136894 152062406 135545195 118313557 98398401 76532562 55917182
17566 55917182 40057700 29432127 22540092 17878700 14497784 12020154 10132270 8651778
17558 8651778 7576711 6809819 6266550 6014069 5926554 5939879 5950126 5942708 5939423 5924935 5775357
17547 5775357 5461996 5155551 4911073 4669584 4448161 4284564 4236223 4300901 4468448 4820372
17537 4820372 5477912 6466252 7971680 10214777 13722207 19557333 29392630 43678674
17529 43678674 59965204 73963833 81724480 84594474 83952622 78607131 66780782 51376115
17521 51376115 36555388 25459133 18332506 13860561 10834183 8653582 7104153 5925286
17513 5925286 4935835 4157002 3634655 3223368 2855183 2571026 2408522 2321954 2287456 2267799
17503 2267799 2290671 2359219 2398431 2342983 2243926 2023960 1733330 1486024 1285753 1180221
17493 1180221 1130025 1015348 925403 889611 842821 823840 781095 684569 653846 637003 565133
17482 565133 529120 539872 594619 647685 672299 706690 765211 824344 887630 980127 1113670
17471 1113670 1184174 1279851 1325158 1306502 1253971 1160674 1045932 881717 744130 663197 649610
17460 649610 589643 564225 552027 554567 582642 557522 534824 510299 483329 426711 346387 367236
17448 367236 415945 466838 478707 461701 588900 827363 1058452 1059366 833943 618558 472854
17437 472854 411304 398835 417087 393890 370188 386956 448518 509969 528517 496187 505798 530037
17425 530037 511493 544746 629517 660037 620147 518533 442179 407281 406133 375624 356616
17414 356616 337451 340855 359680 373950 394534 335710 329469 313075 289674 239756 286044 330437
17402 330437 310046 242312 195434 178456 206124 235425 228106 202095 180601 165889 174276 177454
17390 177454 201820 188333 183290 173852 213917 190175 191927 239185 285082 312137 294582 304478
17378 304478 347107 321065 342517 406462 428690 465310 445695 425917 467986 450211 403208
17367 403208 364247 330790 301602 300662 261294 222963 177532 143231 121893 128471 129689 171947
17355 171947 193265 198928 173806 146914 112099 64030 106791 146585 117369 107847 120234 118568
17343 118568 79324 84210 88379 139051 115986 91998 162679 260745 304915 283475 261404 242829
17331 242829 262025 210809 200003 203073 176244 202227 202409 221654 270474 253008 250726 231700
17319 231700 211083 195324 189866 142481 103763 80737 101132 101484 124380 116901 105697 97500
17307 97500 106338 123592 104604 108667 116200 111280 104282 96276 133160 207260 234727 218393 214929
17294 214929 194825 158685 162432 138830 99829 79653 89078 92627 122444 136499 99329 85448
17282 85448 185107 251427 251820 264278 256192 168259 100925 85386 72222 73087 87599 128671 128769
17269 128769 103431 115883 111960 80547 19397 -17824 22507 36543 11286 5629 54937 55797
17257 55797 73994 80660 48677 36559 45254 71151 61605 104331 104450 71483 58270 69112 45908
17244 45908 22373 26846 -10895 9322 20296 55872 35415 53419 56957 71502 98122 107250
17232 107250 100835 72105 52058 31767 43590 22677 -6220 29 -12423 -32595 -26054 33199
17220 33199 45496 39935 8002 -13252 -28891 -17812 15763 13492 -34922 17656 48712 49677
17208 49677 24504 -3583 -484 56472 -21981 -40030 -22556 -10445 61733 97353 64839 65874
17196 65874 18843 -45409 -75075 -30025 12118 5674 -13344 6813 36368 47669 27731 36095
17184 36095 46245 15244 14428 1041 11131 14816 33015 21970 13130 37356 12962 37035
17172 37035 63349 74117 59721 20388 -18207 27420 47445 32510 7711 1005 1909 55730
17160 55730 -4802 -23739 -27482 -23725 -60026 -99363 -85132 -39786 42258 55083 11000 14458
17148 14458 21252 24944 39094 37393 41302 50216 -14133 -33112 -16975 8571 26168 -1635 17526
17135 17526 -1933 17899 63555 35884 14015 39275 35547 16041 11142 -1665 -17609 299
17123 299 -12291 20327 57020 40780 42145 77968 96411 58380 61032 107897 162475 144093
17111 144093 128596 159063 168472 194263 286791 416635 466794 498405 513122 560366 534129
17100 534129 440282 320180 242823 172914 161968 78962 1620 28710 42953 69035 94684
17089 94684 124539 90186 71211 53439 -11602 -35466 -42281 -490 53383 28218 -11298 -4569
17077 -4569 37825 60411 21073 29204 106595 71369 61039 129119 121946 85303 75181 128542
17065 128542 165043 159176 183762 217605 327152 485644 587824 715488 844414 923318 951470
17054 951470 858187 777672 696434 562333 460936 370769 263544 143591 64036 16232 -4652
17043 -4652 -32734 -44859 11001 8764 29618 21753 5873 -45086 -16407 -315 -21125 12635
17031 12635 28814 48052 51284 5723 25559 46530 59597 31163 -30554 -3282 68383 65950
17019 65950 53561 95364 53514 29590 64396 56329 77233 166185 279791 361762 440871 529307
17007 529307 561822 513791 462590 390539 299928 215962 170706 152328 108239 46855 37751 16862
16995 16862 28141 25592 -24232 -32401 -47088 -36656 35203 84651 95602 44379 29588 -32083
16983 -32083 -28904 -238 -23420 -65887 -30522 -11061 38600 51044 21288 -3094 42618 48757
16971 48757 37142 -29660 -25885 -24455 -12540 27538 48911 18968 -86934 -126788 -51130 15775
16959 15775 -18899 -34597 -11485 -34214 -3034 47208 57551 31864 -30814 -86597 -63612 -32843
16947 -32843 -18746 -27663 -18429 -661 -44279 -21715 8003 -399 8779 -4822 -31861 -74808
16935 -74808 -81077 -118956 -147786 -101877 -77042 -54786 -75631 -60793 -37110 -25950 -16526 36255
16923 36255 87142 105158 72126 40023 23728 19522 63093 32278 -13409 -60275 -59475 -58326
16911 -58326 -22839 13276 6428 -12565 -40084 -67521 -62336 -7423 45834 42336 36727 27599 23734
16898 23734 -3554 -7679 -33867 -36032 19476 55009 40620 47596 21833 6509 2444 -25362
16886 -25362 -20311 7635 15400 -7904 -30816 -17935 -6142 -31914 -7727 52465 50988 63114
16874 63114 34008 -25551 -40057 -35391 -44979 -33693 -16129 -19174 -1287 -2349 -2150 -13184 -48255
16861 -48255 -51744 -30134 29148 29165 -16049 22021 81286 124686 88010 35208 -22038 -58475
16849 -58475 -74936 -62576 2959 -6513 -17928 14769 -16053 -49214 -25105 -37043 -67441 -93679
16837 -93679 -82606 -92518 -44883 -29911 -20202 -7705 -1478 -49941 -28481 16630 -2095 -7957
16825 -7957 20899 47941 108045 120431 139650 82129 20893 -4265 -17647 -17777 -46534 -54900
16813 -54900 -25878 -24364 2075 -35457 -72902 -87557 -71454 -68360 -7958 -35481 -38864 -36752
16801 -36752 -50125 -80732 -82032 -73568 -26318 25110 -3186 -60963 -56795 -48236 -58004 -84510 -72513
16788 -72513 -30709 -20000 -63137 -32541 -21221 -25270 -37726 -50221 -38338 -80114 -85117 -37294
16776 -37294 -18590 -23613 -28561 -22361 -40437 -49712 -57805 -19403 -6019 -62086 -61052 -25698 28712
16763 28712 39988 33643 59040 37484 -9450 -8808 7069 -16316 -16132 -20428 -30155 -6018 -1379
16750 -1379 -15947 -9836 9133 17962 -39109 -79759 -40740 -49403 -68704 -53778 -68446 -101827
16738 -101827 -101932 -64432 -35998 15827 14108 -1440 4802 37046 10525 -7007 -9088 -12241 -13666
16725 -13666 -12644 25585 5695 -19401 -28612 11709 24153 2490 -9011 -32339 -38617 -70343
16713 -70343 -61293 -30827 -24340 -58610 -81117 -43374 -26636 -45124 -13523 52571 1193 -35124
16701 -35124 -14007 2255 20230 2390 -1416 -15152 -36426 -24678 -50118 -52041 -31985 -26976
16689 -26976 -23752 -6925 26935 -678 -24814 -34471 -27307 -15259 28267 69142 108026 103835
16677 103835 43293 13132 11294 -45697 23779 68897 35911 6236 -38893 -41011 -17019 -4034
16665 -4034 14619 44412 1863 -62342 -64630 -48523 -19477 -21455 -16573 -69748 -156020 -159839 -106759
16652 -106759 -17676 9588 16083 -18131 -81842 -47290 -9194 12915 -228 -24784 21849 -10374
16640 -10374 -16937 -35402 6265 -6757 -1635 56074 70610 -18426 -64701 -84817 -72613 -50158
16628 -50158 -39154 -25293 14573 10833 -33063 -33153 -29579 1078 -24586 -49989 -53923 -36467 -53481
16615 -53481 -85615 -79247 -89427 -60203 -93837 -126280 -129692 -98960 -87865 -70071 -29961 9837
16603 9837 12743 -14711 -25967 -48186 -57134 -59439 -6866 21762 36088 33881 17203 -27612 -16824
16590 -16824 343 -23587 -59759 -28099 495 -43086 -76138 -44261 -36581 -14322 -26676 -66376
16578 -66376 -118577 -84175 -23402 -32556 -27306 -59414 -38674 -15182 17757 25448 15972 11933 23889
16565 23889 61080 53850 -6437 -21593 -50973 -45579 -31854 -53414 -39321 -29372 -4535 6316
16553 6316 -10365 -32844 -12495 -24845 -52645 -76735 -25835 33294 3394 -49456 -9908 16850
16541 16850 31209 11843 -27934 -50241 -23295 -12957 -7264 -30552 -41543 -9059 79731 109919
16529 109919 81144 -35028 -33436 -12015 -20036 -18956 -9334 -16137 -57406 -61306 -63039 -74744 -84923
16516 -84923 -76923 -88021 -116282 -113794 -85513 -66066 -18191 -32141 -47468 -53656 -18504 26312
16504 26312 45059 36901 23556 16178 9576 -5739 -23710 -58348 -88900 -68274 -60829 -87644
16492 -87644 -110238 -100434 -46720 8156 -26840 -21276 -16654 -61164 -37151 -42742 -48661 -12806 33561
16479 33561 24752 37068 70283 67352 36192 39013 20736 -37940 -41590 -37328 19112 21642 -24514
16466 -24514 -98987 -104200 -111241 -90961 -87245 -69156 -51609 -95878 -129433 -76819 -43798 -85160
16454 -85160 -126455 -98582 -70815 -82304 -48840 3109 7805 -50306 -43278 -51007 -44998 -45385 -83084
16441 -83084 -89230 -75665 -82731 -108974 -80033 -14000 -45424 -80474 -61245 -63127 -60926 -46087
16429 -46087 -44279 -39328 -26581 -33478 10494 31862 13229 -22326 -38935 -45192 -56282 -46610 -71921
16416 -71921 -58601 -49847 -32784 400 33173 38476 33818 34831 31283 -27195 -40332 -43061 -4553
16403 -4553 50059 100110 88454 21591 -43519 -68424 -23586 31438 100127 55410 8904 -6689
16391 -6689 -10976 -21992 4568 46369 33403 -8179 -13506 -15243 2591 40696 42117 5396 -64920
16378 -64920 -73495 -51127 -77040 -123137 -88482 -56513 -48966 -31551 4134 -3495 -59111 -74446
16366 -74446 -90431 -66728 8816 -1535 -37176 -36886 -6067 23717 -66110 -60549 -57270 -27835
16354 -27835 -34440 -8647 -12968 -76436 -93384 -84234 -94135 -94224 -91201 -103935 -93944 -72912 -54259
16341 -54259 -53620 -51782 -33140 24050 14363 43621 20598 -18789 -58949 -37717 -2156 20530
16329 20530 9371 -3254 8371 -18458 -51988 -13036 -26772 34263 59352 -1725 7276 64897
16317 64897 64399 41799 3399 -19467 -38791 -60349 -28916 19984 29357 11474 2420 4515 3964
16304 3964 13203 -58188 -70293 -16936 11977 2860 -19549 -57734 -88805 -70815 -3842 26082
16292 26082 -9448 -21200 -31521 -43526 -38321 -49343 -24413 3050 -5177 -12437 -4704 -68959
16280 -68959 -69491 -62081 -44805 6270 16416 4558 -58015 -37017 -7566 -20187 -3550 18677
16268 18677 56462 52876 -4690 -57833 -21696 15305 16922 22951 2522 -17897 -28268 -60497
16256 -60497 -46413 -12107 -34011 -32718 10754 14766 -3998 21886 24799 20607 -30346 -57253
16244 -57253 -36191 -41722 -41031 -39268 -61008 11477 31920 -6929 -36224 -18976 514 26012
16232 26012 42778 64112 47553 29772 8539 -847 9912 -36138 -23284 -41894 -84346 -65775
16220 -65775 -20056 -35068 -51442 -29576 -34384 -51927 -54817 -78238 -82859 -22182 28279 38696
16208 38696 16070 -24996 -24945 26693 32003 -12525 -47188 -54754 -70400 -95129 -52834 -5708 2764
16195 2764 13037 -8024 -6198 2078 13378 -805 -2970 41935 40836 54095 11418 -952 -12353
16182 -12353 -60612 -69513 -52638 -32426 -28453 -21690 17734 3615 -29349 -27496 42251 81717
16170 81717 37719 -9973 -9111 -12747 -29136 -14751 -35090 -45782 -16213 -38891 -74726 -34480
16158 -34480 11643 -10848 -14200 -24482 -10672 -4205 8076 -5194 -15667 -8224 -36182 -37519
16146 -37519 -11134 -5864 -30907 -30741 -22977 -16676 -13285 -9954 -11487 -21276 -56245 -55979 -54847 -27329
16132 -27329 9740 22149 16533 11605 53860 45341 23930 18444 -7663 -36125 -31004 14291 -6253
16119 -6253 -15714 -39868 -37887 -79934 -72465 -27690 33303 26655 22272 -27315 -78948 -99503 -83711
16106 -83711 -83126 -52746 -36677 -27832 2191 23336 24578 28073 126 17056 7786 -2934 30598
16093 30598 15935 -14110 -10062 8613 11518 -8417 -29784 -14365 -11677 -3431 20102 31586
16081 31586 7627 5471 15993 34314 29281 2985 -20106 18509 36210 23073 37571 44211
16069 44211 37867 25628 37614 29635 33560 40977 56873 31016 -6141 -35239 -36082 -17441 -67776
16056 -67776 -42582 -4440 -47037 -45228 -87574 -87088 -48920 -47794 -44358 -295 8732 -25742 -95169
16043 -95169 -115274 -93005 -76175 -36880 -41459 -61565 -31415 -29566 14742 25827 27920 5247
16031 5247 3814 22133 59092 17367 -10369 -21003 -22412 -47157 -47315 -24754 -56414 -93601 -76594
16018 -76594 -74839 -49196 -64259 -49065 -6293 -23201 -79759 -85109 -30110 -11528 36029 72508
16006 72508 54491 32494 12059 -4462 -8462 -19213 -62460 -61602 -31066 1579 -16725 -15983 -25289
15993 -25289 -6069 13785 23729 -26483 -39079 12822 54186 11579 -8352 -20701 -34759 -10364
15981 -10364 -3266 11349 28768 3615 21111 44452 49989 57908 54814 32672 19044 31374
15969 31374 49447 12186 31894 95987 61453 20439 25539 91559 110466 70274 32875 1977
15957 1977 -42205 -77736 -33494 41344 73981 88563 44408 11366 2505 -351 -37556 -72501
15945 -72501 -54976 -18865 -1838 -14004 -49317 -57322 -69024 -21510 -32662 -11957 2158 -75824
15933 -75824 -99803 -44366 11762 2629 -55964 -66516 -31491 -34176 -19343 -32212 -89525 -80724
15921 -80724 -50915 -47348 -32232 32508 33742 -9400 -4050 19442 13276 -15463 -4543 49893
15909 49893 78989 46359 -9034 -20622 -16936 -47192 -101370 -87107 -47175 -39320 -50545 -29047
15897 -29047 -52879 -18377 -17191 -32562 -27269 -66017 -67065 -53956 -59312 25012 -1725 5988 24690
15884 24690 -50135 -59203 -19354 -47880 -28107 31297 42942 45279 59335 19224 21729 30339
15872 30339 -5865 -12019 -5401 43404 -9789 10224 -27765 -38759 -15290 -18692 -19655 607 8931
15859 8931 3214 -23289 9067 45341 43798 47597 52351 42945 50746 17894 203 -24749 -15333
15846 -15333 4124 30 32045 40012 76464 53161 15082 13448 21347 25508 -23700 -54804 -43347
15833 -43347 -53647 1493 2743 -45763 -1955 9334 7463 31977 45014 19285 -18459 -34719
15821 -34719 -43866 -30179 -73441 -47891 -14752 -14207 -21379 -10572 19393 8005 14725 29363 45712
15808 45712 5185 -10840 -16712 -17715 6356 1476 -17048 -44276 -43534 -20913 -728 -48848 -49082
15795 -49082 -58906 -57925 -32416 -39909 -52053 33494 82759 69602 53386 50510 54173 28679 -10840
15782 -10840 5198 -40954 -42487 -59847 -57341 -17809 93542 114020 80008 53005 43549 55183
15770 55183 23845 -18648 -41507 -2082 30027 1163 -30531 -47162 -31969 2331 17494 968
15758 968 28110 17139 -8802 -17290 -26106 -84636 -143409 -129599 -51982 -60906 -19831 8603 -18795
15745 -18795 -24315 -37282 -80355 -70665 -32999 -81707 -83888 -85278 -76075 -104482 -107551 -21786 -6231
15732 -6231 15156 56918 28983 -8274 -60923 -84611 -56920 -16454 -3456 -2702 -24686 -72830
15720 -72830 -70341 -33050 -15030 2037 51406 104085 55100 9401 -39905 -73578 -26014 42117
15708 42117 37787 33221 12255 42876 24700 -40337 -91397 -115138 -68052 -55047 -47801 -107969
15696 -107969 -138173 -84043 10659 17869 -51022 -119276 -59531 -17820 10081 15788 50632 -6260
15684 -6260 -55459 -99429 -56001 -66571 -32002 -37372 -58904 -44573 -19975 852 -2828 1914
15672 1914 -6020 5122 14173 2763 29064 24633 5683 -30467 -45968 -23086 -23065 -27654 -6874
15659 -6874 53789 63114 191 -53700 -35287 -10786 -8824 -6702 -3839 -54017 -52098 -9483 19565
15646 19565 18731 6592 48471 80144 28280 4680 -23583 -30478 -8836 16252 6189 14914
15634 14914 13638 -29531 -65178 -53617 -2379 13746 33 -1346 -7330 -5408 -10672 -45171 -23099
15621 -23099 13450 21142 12869 50594 55029 39774 -3745 35115 39662 52042 29581 9608
15609 9608 12242 -44337 -60436 -1689 31215 6349 -11409 -35862 -48661 -56961 -84803 -66299
15597 -66299 -48364 -19657 -48532 -73820 -93517 -47362 -25126 -43668 -63596 -63662 -69006 -39583
15585 -39583 -30193 -1789 20388 43169 58012 2303 -51662 -8340 13802 60129 65909 12387
15573 12387 -14978 25873 13779 -12229 -21305 -6863 48818 80823 5326 -73145 -70922 -96156
15561 -96156 -104645 -69690 -13152 32600 25265 19209 -3125 -19351 -41586 -39438 18500 21062 6298
15548 6298 -14980 -75315 -104493 -63112 -58125 -53503 -66692 -83411 -33931 37200 36480 13530 22522
15535 22522 445 -39755 -22722 9580 48022 33566 -4850 -4697 -36246 -31015 -30264 11247 24622
15522 24622 36001 11843 -55071 -70439 -70002 -47332 -46321 -29099 -7924 -25722 -31355 -34196 -35527
15509 -35527 -76832 -70566 -75813 -48316 -30936 -44972 -48009 -76474 -61231 -75075 -89339 -88006
15497 -88006 -51199 -38213 -13870 28095 8003 20801 34197 50433 36575 61947 37095 -31387
15485 -31387 -55328 -54655 -43823 -70673 -57218 -39440 5439 -2424 -52531 -55025 -81554 -21238
15473 -21238 3645 -5049 26218 -14093 -28255 -24875 -23986 -47756 -81574 -34370 -25086 -48804 -53254
15460 -53254 -47407 5284 -14165 -74672 -70380 -43539 -31302 -51131 -35232 -2534 24202 20774
15448 20774 10260 -38993 -1403 34151 48921 39414 38869 19209 206 19886 -33518 -54450
15436 -54450 -97678 -96825 -58970 -83609 -58929 -49010 -50052 -29420 -44868 -55998 -34502 -11562
15424 -11562 -64920 -24801 26389 7738 -42602 -22524 -7425 -28860 -58544 -35992 -47776 -81008
15412 -81008 -102543 -84995 -33769 -31374 -31513 16650 68078 70213 59798 45755 51381 45844 32210
15399 32210 8142 -28148 -28356 2461 -7545 21434 62109 56298 27401 4271 -4059 -12327 -13540
15386 -13540 44575 84856 104689 7896 -58303 -45061 -63631 -75148 -5811 14201 -8956 -19894
15374 -19894 2014 11030 -33678 17529 5 -18669 27166 1601 23060 20471 2170 25934
15362 25934 47532 38146 31953 15066 3379 -35391 -1657 -5376 -1610 23453 4375 -4177 1124
15349 1124 19307 23498 -6442 -55389 -21036 6371 28766 55508 64310 67260 59770 32101 -32911
15336 -32911 -41671 -71413 -50642 -5001 87561 111577 50289 123 2573 34469 49697 58255
15324 58255 -5663 -37330 -21976 -34443 5611 42197 43702 30575 -10427 18692 74343 57897
15312 57897 35971 55406 28981 -26193 -42052 -38870 14749 57260 70672 68859 37133 34949
15300 34949 61826 11440 -9334 -33771 -39422 -11858 -31585 -59732 -51791 -30974 -44398 -16533
15288 -16533 15549 44522 48189 41303 35175 254 -45763 -63743 6580 71549 47231 -36285
15276 -36285 -94639 -90662 -87919 -67301 -24735 21642 9258 -26809 -17906 24203 -11651 -40297
15264 -40297 -38347 -35577 37597 51798 6241 -3206 2498 -18067 -8981 13825 19355 -29203 -38299
15251 -38299 -10043 -26946 -12049 -95222 -114547 -68999 -54477 -49329 -7075 646 32834 -3870
15239 -3870 -32749 -56854 -62951 -10952 22437 14811 14659 28568 31096 16368 53797 47020 -8338
15226 -8338 15746 79256 78743 27858 58071 58546 65095 84691 48218 -40633 -70305 -66044 -30174
15213 -30174 -18916 18052 36859 30912 7559 9370 -5396 -1738 63588 105550 67025 42708
15201 42708 11940 -7692 -8393 9186 30964 60500 39762 23060 -29096 -56319 -15188 9434
15189 9434 13341 24223 22533 44175 71812 64664 70068 71308 55824 49817 23951 -3 -12260
15176 -12260 -17412 -13452 27575 35821 14232 -14190 -86727 -83359 -57803 9110 76365 104154
15164 104154 105041 81300 25225 -6071 -24117 -6651 28432 56651 76326 62770 -13022 -20566
15152 -20566 -9651 -19335 -25023 -16933 -35687 -39300 7749 65379 56255 14028 -2704 46816 52120
15139 52120 32373 29949 35080 71550 63311 37473 24200 -9387 5825 17381 -12204 27439
15127 27439 21713 8152 40749 59831 86339 119758 109437 63868 106948 93022 78050 89415
15115 89415 80137 73126 49956 49550 83428 98259 97314 29762 -50515 -58019 -10408 11637 26074
15102 26074 14474 9251 5771 -934 37073 34303 -25088 -24124 29620 86695 114218 93976 56294
15089 56294 60042 54422 -6907 -17027 21133 51520 35802 66606 85929 100577 94426 101570
15077 101570 80479 27869 25234 42371 45248 46879 61516 19439 -11747 35216 45640 25097
15065 25097 34184 50659 -7289 -20116 -38121 -8669 -23933 6851 25013 32345 -10909 9532
15053 9532 44260 19752 7824 -13174 -5191 26733 67346 72810 67040 58673 44176 22926 4890
15040 4890 34037 43758 24523 3640 -14078 29335 42602 38977 23655 30764 42480 -36544
15028 -36544 -29139 6593 5545 9045 -17768 -22014 -47844 -16085 40822 7433 -45636 -68526
15016 -68526 -31816 11123 45368 75964 37718 19866 4075 -18885 -15935 -24145 -6112 20764
15004 20764 48728 58106 39175 30520 35659 4319 -25922 8953 -6724 -36804 -58364 -68139
14992 -68139 -96854 -78230 -14085 82487 76832 61094 60717 27930 -34355 -34532 9196 10080 -66701
14979 -66701 -68329 -28576 -39689 -22920 3347 16727 40142 94705 74998 45817 58227 40866
14967 40866 2050 -34079 -18173 11090 35131 49216 35995 41238 -4526 -22587 -18089 43419
14955 43419 101930 128831 121282 75835 64765 75595 115628 115043 88491 73961 54517 7319
14943 7319 -7472 16907 22624 13029 34588 26454 84800 68268 41943 23230 -21479 -46003
14931 -46003 -16502 32400 84596 91483 83208 24347 25288 66656 122474 144201 90198 28997
14919 28997 -16720 -17215 1257 -36050 -26701 -31086 4469 -2622 -31291 -62606 -57398 -62312 -69290
14906 -69290 -43265 -3065 -9296 7631 -17969 4375 -9041 -4970 -9292 -1474 -39113 -72448
14894 -72448 -30133 11948 19155 6494 18821 6187 34808 14046 14358 25303 21070 44898
14882 44898 21266 18304 17029 16993 26027 28017 23788 10734 -18017 -16526 -35808 -15049 -25146
14869 -25146 -20538 -3324 8759 31262 38359 60983 55091 24268 17741 6638 68978 30210
14857 30210 -31920 -50883 -16506 56212 56801 17108 28636 1917 -48137 -34093 -43001 -17076
14845 -17076 -2340 4575 -18791 -31694 10171 16335 24806 21574 38457 57983 47703 27348
14833 27348 57328 27599 -15394 -12518 -59976 -75927 -93448 -65754 -29755 15053 31909 10981
14821 10981 15009 28784 25547 2661 15133 6012 -15853 -44786 -1127 30847 43958 24296
14809 24296 7475 29891 -9661 -51175 -74982 -72835 -50079 -56633 -101004 -157553 -167003 -148092
14797 -148092 -60113 31018 26467 -9190 2345 390 -4134 -1265 -10062 -3231 518 -16404 -44628
14784 -44628 -4287 -3511 -8469 -34154 -63576 -88424 -44869 -12343 7854 2128 1644 15724 10004
14771 10004 -7849 894 -6507 23967 23932 2241 -17219 -29395 -27787 -21975 -13527 2717 16227
14758 16227 21922 31894 22319 4027 -5075 -34833 -26313 30261 38945 20864 32952 75871 95693
14745 95693 141156 134843 84709 38167 26074 12764 24642 7614 -2462 2477 4115 -32881
14733 -32881 -32621 -52837 -30400 -24667 -25033 -6878 -1324 -39257 -32271 12317 44461 91173 78371
14720 78371 43611 33941 -18056 -102734 -139737 -86864 -31816 41775 50747 34391 32935 8555
14708 8555 -20444 -27562 -57487 -2894 53839 45274 -16981 -51689 -41525 -31734 23698 41006
14696 41006 15736 1330 3761 29824 51048 67032 55662 17206 -30732 -24 40589 59914
14684 59914 33007 46407 51755 83571 41219 -20179 -46596 -62500 -18641 17256 34261 11059
14672 11059 -10993 28019 77637 104256 107624 58319 47318 57071 27139 33357 18314 11726
14660 11726 -11150 -11816 -49265 -81462 -89529 -76652 -27042 346 -14431 11803 19388 14880 65536
14647 65536 95996 119435 106804 140822 272484 422029 690342 1054904 1279949 1203403 907702
14636 907702 599652 353765 241414 183684 168077 142009 94462 70078 51252 77817 151133
14625 151133 140122 125034 93773 76485 75300 55134 49837 54062 11875 81503 92712 58415
14613 58415 8956 21506 -5552 -23968 6086 58414 141020 135977 125188 100921 31690 33678
14601 33678 94415 127976 84955 83846 130983 163971 158939 161250 215732 273448 296650 344188
14589 344188 447082 666117 955808 1445763 2014674 2411654 2375570 2056733 1705639 1346693
14579 1346693 1029048 807657 596311 418996 291813 276106 269489 230201 166930 101639
14569 101639 96836 95400 73417 108747 147612 132335 96255 41727 70739 79457 84052 119486
14557 119486 137065 143433 100800 83125 57318 43715 43236 54843 62316 38277 38248 8638 27207
14544 27207 79495 104478 102804 114788 75521 95464 151039 181132 167959 167148 198266 313720
14532 313720 412089 525207 778045 1162511 1404457 1374751 1059864 696986 440257 268805
14522 268805 219003 215222 235190 245257 204380 123159 77382 67790 59166 34293 12877 24340
14510 24340 63256 86293 108230 101448 101979 112342 138327 144393 150984 135097 93020 74097 41379
14497 41379 60503 46701 77943 130824 146995 145079 107990 75543 26774 29278 64912 50177
14485 50177 57306 76881 118166 85086 99588 101436 87198 84678 94252 107488 77442 56190
14473 56190 76740 82360 91673 76146 86832 84470 93604 55119 65217 55093 27599 52575
14461 52575 85809 51957 -2660 -17864 22166 83848 28152 -44990 -77775 -66305 18058 81848
14449 81848 58326 10706 -44216 -84201 -62427 -40758 -60188 -86838 -113665 -86235 -25025 36375
14437 36375 16038 -12183 -13246 14511 17654 44133 61611 78468 46243 27191 11030 53223
14425 53223 118589 101071 80651 85023 98111 149547 185141 250652 292563 328224 367287 327573
14413 327573 248023 149057 78446 13728 30816 73566 38551 45123 76998 124401 96784 51060
14401 51060 62630 113933 287114 390241 404268 301631 202274 129268 85929 50646 19691
14390 19691 12379 42665 32318 45489 25894 -22289 -96 15722 -8054 -18046 16594 47437
14378 47437 63290 55334 39960 -4419 -22225 -3804 43273 72651 72447 37527 56378 78150
14366 78150 130803 187922 232653 294634 407373 490866 439133 344740 271825 281496 221732 200321
14354 200321 167230 138147 111406 116331 49506 55576 95379 162894 189619 253907 401517 526185
14342 526185 537010 493833 494335 414889 302844 171282 162171 154529 89305 70886 39256 13773
14330 13773 40565 31102 -11055 -81019 -75194 -65225 -16172 36396 51229 55300 38597 36085 13285
14317 13285 7317 10001 42548 30957 23116 33089 40811 101719 165637 201565 210481 279574 306578
14304 306578 260639 217784 164006 184248 231371 278100 376225 487026 654599 915725 1217170
14293 1217170 1405030 1271527 1030372 874028 811001 759019 785247 800512 688631 556312
14283 556312 434869 336707 252400 215607 236673 232371 205394 215804 213803 167527 173289 186502
14271 186502 165835 158070 202188 298912 422558 539887 569356 419413 245963 143746 76856
14260 76856 52092 56700 33686 44624 79617 123242 205652 297688 321912 390091 357397 289680
14248 289680 309902 336534 375282 454941 536550 683147 943417 1358888 1913305 2400573
14238 2400573 2570947 2438864 2231274 1991341 1646286 1276770 1016484 899128 788136
14229 788136 709360 606503 532861 508233 505344 501334 507850 510799 523217 513233 460677 458941
14217 458941 486386 431948 444284 496151 497295 499736 505107 461808 453034 454539 473943 491327
14205 491327 529558 594366 686551 744558 795798 813119 809908 874117 955549 1058942 1184236
14194 1184236 1274402 1422654 1658615 1923139 2227075 2504772 2806418 3069604 3342355 3749833
14184 3749833 4286977 4842519 5172313 5385570 5679855 6172414 6871499 7771667 9001575
14175 9001575 10760902 13187042 16383562 20427558 25842618 33888546 47090967 70309613
14167 70309613 111341494 173751529 235414833 256204651 222243764 161434359 108248528
14160 108248528 73641605 53358467 41359451 33811337 28533802 24681520 22290982
14153 22290982 20755392 18327967 15059914 12232322 10250960 8902743 8017592 7351338
14145 7351338 6769781 6213165 5719768 5373758 5143777 5000127 4944773 4951557 5106480 5430416
14135 5430416 5834923 6312016 6671139 6936006 7206183 7462647 7653500 7946966 8428186
14126 8428186 9138978 10031729 11137058 12635624 14577281 17007612 20299749 24757503
14118 24757503 30488788 37744223 47478961 61882398 85168574 125480850 196568039
14111 196568039 306948190 417259070 453148140 416481946 363550501 303434345 226353538
14104 226353538 156151468 109094532 80896767 62891224 50196979 40733576 33378777
14097 33378777 27475286 22846271 19349511 16688687 14691625 13145725 11928419 10989665
14089 10989665 10184984 9294890 8423762 7706564 7159362 6828271 6575980 6391663 6321892
14080 6321892 6403003 6518357 6632311 6714502 6731557 6728748 6705210 6718700 6860504 7158345 7576070
14069 7576070 8240088 9169175 10469222 12380119 15358813 19145151 22130983 24028670
14061 24028670 26387987 30444022 37276139 48954275 69544097 106613191 168963681
14054 168963681 247425561 292303486 264954407 194390788 128906017 85926846 60801343
14047 60801343 46146284 36992105 30341128 24788797 20097408 16332009 13465775 11342584
14039 11342584 9782370 8625766 7884616 7452278 7223250 6862810 6259702 5623692 5034132
14030 5034132 4481746 3978045 3601918 3402280 3242862 3068515 2864205 2618167 2432527
14021 2432527 2335249 2237152 2089096 1920969 1820809 1736953 1671018 1592831 1560713 1550168 1566308
14010 1566308 1515856 1482896 1432290 1367009 1280804 1244224 1208229 1186323 1098856 1058013 1000525
13999 1000525 1008021 1028227 989269 911627 851370 824467 790366 782417 855162 921676 931302 899463
13987 899463 857131 806694 728082 687801 820905 898258 953378 1166963 1526500 1780228 1750592
13976 1750592 1518647 1214049 988943 932824 875091 787990 756807 706828 686401 652576 567946
13965 567946 568474 577852 562816 527443 562626 578700 636012 738584 809298 882941 982934 1147358
13953 1147358 1206849 1086542 938410 829848 736382 635956 572459 592228 577204 567270 563196
13942 563196 588676 546717 465328 452882 485565 497215 452976 407844 446062 544208 558402
13931 558402 526546 455507 387324 360183 423026 475582 491821 446213 443494 530103 546721 483508
13919 483508 426421 482985 489253 465605 486613 531115 579428 572904 528680 474017 446486 476505
13907 476505 536064 538542 497035 513126 534470 527446 496267 495834 448679 395499 356643 374006
13895 374006 389041 417195 450076 468135 501387 523417 543847 538683 426189 391278 432549
13884 432549 416811 439361 507736 515136 516599 527624 534734 536177 562126 533602 588263 730710
13872 730710 827877 891104 829873 741892 667228 592730 562595 600982 598049 547336 544426 545277
13860 545277 562679 630969 657679 644600 585861 534707 499465 479986 448948 430415 360849
13849 360849 287642 283196 312886 388045 364442 320217 289236 279952 279072 323604 360612 363444
13837 363444 383983 365432 323440 330619 394890 430823 470260 437293 359686 424413 471872 488580
13825 488580 493753 531996 578875 605648 623029 705821 791615 909551 968372 967278 886186 788094
13813 788094 704330 578288 490741 450303 393894 323342 298002 294838 287331 320161 358196 418703
13801 418703 435697 372735 338316 300849 294376 234640 208816 240034 215740 203037 274465 337153
13789 337153 397175 465258 531545 659450 883604 1009032 922315 754913 604874 457865
13779 457865 405102 415419 408797 349736 344344 346232 323285 273073 260386 264356 293545 343901
13767 343901 345149 290525 244834 258229 356367 541955 670655 659962 536330 403728 347053
13756 347053 344428 340059 308343 228893 220510 176123 175900 177129 136572 143803 192286 180154 116166
13743 116166 118426 194372 197955 148613 90953 75006 97557 116378 137350 178532 195528 215946
13731 215946 171792 138870 151861 140328 121111 127899 127458 146167 111666 61671 65151 88981
13719 88981 85800 55415 59680 92033 79679 58609 49438 17694 15135 78401 113244 34951
13707 34951 37102 78651 79278 97633 96870 97974 90113 119298 114909 118622 154860 122467 77119
13694 77119 125056 176553 204303 203215 242015 229233 203690 223730 296595 366929 542317 763727
13682 763727 1083032 1214679 1159184 962822 719592 568193 424949 343664 305620 247965
13672 247965 224670 242467 250897 233437 206828 210534 198714 131238 116621 108095 80623 65507
13660 65507 44586 36145 39939 72846 73276 44307 46437 71259 66407 87134 117078 78793 20409
13647 20409 9824 43358 46833 -26026 -41988 -25824 20741 105771 169490 148121 97425 117712
13635 117712 190081 221624 231714 308923 435134 630067 949776 1433623 1942201 2173843
13625 2173843 2108208 1907640 1671669 1328675 954547 656723 499856 412957 357639 304818
13615 304818 256436 213648 182328 139304 103114 105052 81214 96860 101848 68198 107980 107713
13603 107713 79167 69806 40901 46742 58324 49207 60118 47945 29273 -29263 -24515 -8155
13591 -8155 23293 23776 93282 139888 111665 68627 61076 89503 125949 121934 84353 89851 142156
13578 142156 148867 146548 206606 308482 437592 586775 834774 1153508 1397370 1409720 1193298
13567 1193298 863770 601372 425021 293303 253817 191061 135536 72583 33286 30133 23118
13556 23118 52477 107964 133762 133019 147464 129873 118704 95580 75695 84013 95322 104493
13544 104493 115716 109055 70395 65123 38921 -2984 -27765 -3621 10381 57081 13536 -33295
13532 -33295 7401 22667 29376 40083 20058 11258 32151 2217 -22989 -37288 -7419 6911
13520 6911 -9234 -34499 -15 4031 22847 8959 -25533 -11399 -8270 -26177 8068 8834 11227
13507 11227 34659 26635 18393 -5912 -11834 5090 30080 40581 40358 41784 66969 5363 -67258
13494 -67258 -47672 -57145 -64585 -5702 32907 50859 93034 86622 88886 46484 13002 17117 42187
13481 42187 48292 65559 101616 116434 123532 152395 157007 97502 23237 31002 91097 79534
13469 79534 54353 46024 84373 76266 58136 25499 20771 54265 32205 9760 -10144 -38853
13457 -38853 -22882 -32981 -8872 -34856 26937 45081 22012 -22647 2790 48894 73285 58747
13445 58747 13976 37710 35415 81 46570 24617 -24221 -13237 29828 49587 46101 31448
13433 31448 -9257 43112 59232 91412 100797 85856 73433 59115 29629 -39729 21274 69397
13421 69397 79601 52110 82152 96541 62906 63085 81672 98860 141033 85113 49376 21392
13409 21392 -18867 -29558 -25391 -2057 -20046 14214 56744 25944 23424 15377 -10879 -2849
13397 -2849 -24505 -34011 -4726 39265 83981 63665 6047 -14929 35936 59193 92747 98119
13385 98119 5051 -26619 2803 26006 20866 1517 -304 -4759 8960 44363 84411 122646
13373 122646 106071 114515 65341 47950 102593 102227 62097 40948 60873 49571 50459 45225 25282
13360 25282 34833 31715 2597 25984 57676 95571 63095 21470 -20806 -8958 -11600 -51960
13348 -51960 -23551 34193 8372 -10995 -55277 -73162 -51672 -18693 7081 49680 101629 74461
13336 74461 29591 29473 66802 89871 86871 83622 86636 69310 49891 42509 -10238 -14479 21410
13323 21410 59207 36289 46493 62387 71975 48968 27962 15166 2649 11623 6308 -20884
13311 -20884 -25817 -15592 -8941 44985 71102 37981 41672 42326 -1992 -2362 67957 81241 66845
13298 66845 68749 47533 75706 75316 25807 -30028 -82970 -71193 -37807 -18708 -52216 -29563
13286 -29563 -274 28804 7976 12178 32136 55372 108171 88250 23061 -31454 -51269 -26120
13274 -26120 -25503 -44477 -22448 4354 -17280 -23253 24090 10583 3165 27520 35379 14177 2471
13261 2471 24655 51424 57729 63775 112687 91911 60437 33033 -20344 -31077 -50664 -50981 -7417
13248 -7417 35000 13135 7212 -23991 -20512 270 -9249 -13479 -30289 -36129 -24123 -2182 25497
13235 25497 37816 40184 41137 23311 9549 763 17726 70236 98112 63643 28801 -1214
13223 -1214 -15358 -23272 -23613 9348 25539 17986 4633 -10009 19550 11041 -30248 -62046 -64214
13210 -64214 -70051 -59883 -3383 -18628 -44809 -32364 32109 31927 4166 28019 31786 19825
13198 19825 3474 9207 28210 -21083 -33089 31288 80659 41585 45482 65768 64629 46787
13186 46787 25044 20341 23383 25075 57702 55973 83656 63720 70406 19522 -33263 -34143 -32710
13173 -32710 -50328 -31672 20113 55914 46329 -4869 -42731 -46882 -39437 -61055 -78801 -82794
13161 -82794 -85548 -52945 -6813 9372 18226 -10408 12353 25175 9255 -15063 -20487 -18876
13149 -18876 67327 161078 173892 179103 194621 143608 65719 9397 -24545 -23238 -10423 -13773
13137 -13773 -21778 -3970 25158 -1241 15630 5973 -20651 20760 9422 26065 -5385 -47617
13125 -47617 -20369 23762 11931 -13556 4642 5547 -27048 -19027 -20544 -50690 -57777 -30356 4000
13112 4000 -1657 -433 8282 26264 60205 51735 -19489 -1722 75699 142903 163374 204327 195639
13099 195639 103436 41760 13127 -47523 -36285 -23464 -5943 2295 -7783 -49749 -20808 -26783
13087 -26783 -51531 -28768 -40915 -5441 -9807 17142 2622 -32630 -34059 -2161 -30611 -54807
13075 -54807 -55189 -61817 -73096 -54005 -45505 -46958 -32941 3082 74897 111193 88871 126450 76154
13062 76154 16636 18839 60300 68573 25794 32933 51526 30953 -2028 6774 -9090 -42201
13050 -42201 -15452 26726 -30940 -87210 -43133 -12500 -10323 43732 113098 133099 70725 66290
13038 66290 49678 82474 100695 74674 50984 60904 35457 34550 56570 45015 12980 -3627
13026 -3627 -36000 -59571 -53682 -36679 -6007 -21936 -24356 -30734 -17090 -15851 -56702 -69974 -67199
13013 -67199 -57849 4230 -4317 -11211 3164 25950 62437 58870 63169 75808 46657 32932 6941
13000 6941 -28620 -49229 -38321 31893 40176 40492 60122 55488 4177 5379 16007 21992 26106
12987 26106 34080 32988 4035 -10465 -15592 -2150 64531 113938 78492 14517 -16300 -48492
12975 -48492 -77531 -64289 -19694 -26738 -34397 -33481 -35696 4784 30093 -19024 -40350 -50990 -27465
12962 -27465 -54781 -86379 -37557 -12971 -40358 19391 12291 7252 51547 74936 40489 -16878
12950 -16878 -41169 -16347 -28644 -43043 -16896 3725 -36149 -51324 -57749 -47559 -42207 -39049
12938 -39049 -45378 -73402 -55965 -36854 9018 14282 12675 21731 44522 58036 75639 69107 8261
12925 8261 -22098 -10135 5649 26942 35769 24549 45714 19072 -21345 -26992 -13394 -8907
12913 -8907 -3762 10873 27579 32262 36329 -28854 -34580 10855 44977 39970 36546 31065 -24425
12900 -24425 -55303 -64524 -36269 2300 534 -1234 20789 29337 51589 22185 1408 28298
12888 28298 15529 -17704 4933 75715 88151 53002 34378 41741 19933 6355 34200 19697
12876 19697 62037 48344 7571 -4438 -71303 -65412 -48648 -47078 -71854 -47896 -56900 -51692
12864 -51692 -42508 -26139 -63998 -68189 -61347 -25632 -39268 -51344 -23968 -22707 23095 13392 -15971
12851 -15971 -42218 -109259 -126981 -93938 -57255 -58322 -51816 -21755 -36040 -86174 -95231 -115266
12839 -115266 -112472 -92338 -66310 -49321 -38364 -14534 -31912 -23534 19187 6820 -67782 -72632
12827 -72632 -65239 -57511 -55919 -73639 -96131 -137242 -106145 -121261 -166055 -164909 -105499 -117505
12815 -117505 -82954 -21044 10341 35813 25480 10079 12609 4298 7469 26372 17963 -51928
12803 -51928 -79180 -40264 -46101 -54673 -22523 21948 24268 10236 -7519 -29065 -17655 -5433
12791 -5433 -2813 -31116 -4591 5087 -45969 -50313 -39700 -19096 47824 41923 10970 41600 70570
12778 70570 45974 10136 1055 7731 46029 36634 55076 56318 49853 37619 12724 -14092 -59565
12765 -59565 -53170 -9895 -14812 -38813 -58473 -7157 8449 5377 -23454 -17343 -5289 -416 30621
12752 30621 27462 -10828 27125 32695 40804 36429 51351 10193 -15351 9605 -1282 -21806
12740 -21806 -9463 -93 -1957 -36037 -11063 -18396 -28241 -45694 -67449 -58073 -15914 -14418 -8830
12727 -8830 15033 -10775 13826 40310 48000 54513 -9783 -11721 1585 -30358 -36464 -42369 -795
12714 -795 -30979 -24980 -4514 -44734 -28807 -2374 20163 25988 39692 38759 46894 29443 19281
12701 19281 4818 -53525 -54802 -52847 -28512 -12375 -24515 -43680 -42132 -3346 11378 37771
12689 37771 38364 -16950 10580 -2533 -31362 -41032 -22916 -60398 -63544 -86159 -102166 -84139
12677 -84139 -67914 -43639 8985 45563 50358 25828 -20269 -6664 17971 20079 34936 31485
12665 31485 25545 20672 5352 8 -37051 -8983 3664 1296 -38931 -4686 25226 5477
12653 5477 -62167 -101430 -43528 -48132 -34255 21366 -25240 -3418 17747 30940 36145 37596
12641 37596 36961 34885 36662 16307 12459 14974 15586 62524 43564 17578 25081 41636 -12018
12628 -12018 -38291 -49889 -28145 -15019 -20851 52995 62782 71790 50502 24920 19635 53974
12616 53974 81922 72052 95388 58890 32884 36899 30943 -2494 12062 -1440 -3410 -16821
12604 -16821 -41319 -68877 -86221 -26930 -19261 -28402 20338 11820 -31094 -50016 -77436 -101382
12592 -101382 -99631 -75082 -40098 19333 46556 24569 4658 -7914 -20761 25605 8322 -36742
12580 -36742 -21048 -28898 -22608 -18391 -45115 -70614 -51003 -46705 -34314 15811 67833 67690 76764
12567 76764 42843 516 10973 24983 1188 -24724 -18878 -235 -3560 -60397 -73791 -54526
12555 -54526 -47131 -8820 46435 59696 49291 64621 64406 66517 71708 42053 -18170 2225 -29443
12542 -29443 -40267 -4157 39109 77851 71140 41433 19132 -21809 -10416 -25368 -29018 -27348
12530 -27348 20581 33164 44657 46825 44095 31113 10861 28407 73482 95162 92551 120640
12518 120640 107636 43895 29894 25279 12487 559 -38014 -7517 -311 22478 42921 45484
12506 45484 52272 47651 50102 64526 58077 24664 8549 4813 33627 41956 10001 26761 12266
12493 12266 31262 49731 -8589 -52168 -18881 40465 15249 -25391 -8442 -2469 -4164 40769
12481 40769 26865 15971 33495 53091 50394 35043 -36142 -62460 -46386 -5033 23994 23639
12469 23639 12213 -31406 -77399 -66325 -20840 -3823 7436 70064 46923 25308 10179 25785
12457 25785 23930 7385 1013 -2861 -6614 -40279 -73600 -47971 -14421 -222 35904 -4794
12445 -4794 -26557 29152 28257 -11629 -39915 -93949 -103151 -57409 -73329 -73733 -80125 -41258 -83450
12432 -83450 -51656 -28376 -19182 -7993 26205 22433 1455 -18410 -32099 -45946 -89457 -70879
12420 -70879 -6965 26532 60235 58080 74735 93671 61597 104817 59227 32637 25525 65290
12408 65290 55645 -12944 -38586 6810 38443 19510 -8431 -10254 -28495 -9100 3285 -2933
12396 -2933 21469 12357 31982 26089 63547 22814 -39174 9436 61395 91753 161950 287807
$$ [...]
##END NTUPLES=NMR SPECTRUM
##END=
