##TITLE=Analysis number 325648
Compound Code cc 18609
Book Reference 277207
Project Code adrs fraglib
Chemist Name jom
##JCAMPDX= 6.0         $$ Bruker NMR JCAMP-DX V2.0
##DATA TYPE= NMR SPECTRUM
##DATA CLASS= NTUPLES
##ORIGIN= Bruker BioSpin GmbH
##OWNER= nmr
$$ XWIN-NMR		Version 3.5
$$ Fri Jan  5 15:41:59 2007 GMT Standard Time (UT+0h)  MAYBRIDGE\nmr@NMR_250MHZ
##.OBSERVE FREQUENCY= 250.131544655141
##.OBSERVE NUCLEUS= ^1H
##.ACQUISITION MODE= SIMULTANEOUS (DQD)
##.ACQUISITION SCHEME= undefined
##.AVERAGES= 16
##.DIGITISER RES= 18
##SPECTROMETER/DATA SYSTEM= dpx250
##.PULSE SEQUENCE= zg30
##.SOLVENT NAME= CDCl3
##.SHIFT REFERENCE= (INTERNAL, CDCl3, 0, 16.5248)
##AUDIT TRAIL= $$ (NUMBER, WHEN, WHO, WHERE, WHAT)
$$ ##TITLE= Audit trail, XWIN-NMR		Version 3.5
$$ ##JCAMPDX= 5.01
$$ ##ORIGIN= Bruker BioSpin GmbH
$$ ##OWNER= nmr
$$ C:\u/data/dgb/nmr/ADRS/640/pdata/1/auditp.txt
$$ ##AUDIT TRAIL=  $$ (NUMBER, WHEN, WHO, WHERE, WHAT)
(   1,<2007-01-05 15:41:19.47 +000>,<MAYBRIDGE\nmr>,<NMR_250MHZ>,
      <created by zg, POWCHK disabled, PULCHK disabled
       configuration hash MD5:
       49 4B E0 1D 92 C2 6B 37 9F E6 65 BC 52 41 86 1D
       data hash MD5: 64K
       46 A3 41 40 A3 42 E1 A5 18 2D 6A D3 70 18 FE 1D>)
(   2,<2007-01-05 15:41:37.94 +000>,<MAYBRIDGE\nmr>,<NMR_250MHZ>,
      <Start of raw data processing
       ef LB = 0.3 FT_mod = 6 PKNL = 1 SI = 32K 
       data hash MD5: 32K
       B0 39 76 63 D3 C0 E6 A1 1E F8 3F 74 9D CA 17 6A>)
(   3,<2007-01-05 15:41:42.78 +000>,<MAYBRIDGE\nmr>,<NMR_250MHZ>,
      <apk 
       data hash MD5: 32K
       66 B5 60 35 A1 74 08 64 AA 9B 9A 0E C0 4E 11 9A>)
(   4,<2007-01-05 15:41:44.45 +000>,<MAYBRIDGE\nmr>,<NMR_250MHZ>,
      <abs ABSG = 5 
       data hash MD5: 32K
       C6 A4 01 C6 EB 50 D9 E5 14 66 4C 5A EE AD 5B D5>)
$$ ##END=
$$ 
$$ hash MD5
$$ D4 34 4E 69 F9 2A 53 E5 46 38 9C 87 45 56 AA CB
##$RELAX= 
##$RELAX= 
##$RELAX= 
##$RELAX= 
##$RELAX= 
##$RELAX= 
##$RELAX= 
$$ Bruker specific parameters
$$ --------------------------
##$DU= <C:\u>
##$EXPNO= 640
##$NAME= <ADRS>
##$PROCNO= 1
##$TYPE= <nmr>
##$USER= <dgb>
##$AMP= (0..31)
100 100 100 100 100 100 100 100 100 100 100 100 100 100 100 100 100 100 
100 100 100 100 100 100 100 100 100 100 100 100 100 100 
##$AQSEQ= 0
##$AQ_mod= 3
##$AUNM= <au_zg>
##$AUTOPOS= <5 >
##$BF1= 250.13
##$BF2= 250.13
##$BF3= 250.13
##$BF4= 250.13
##$BF5= 500.13
##$BF6= 500.13
##$BF7= 500.13
##$BF8= 500.13
##$BYTORDA= 1
##$CFDGTYP= 0
##$CFRGTYP= 5
##$CHEMSTR= <none>
##$CNST= (0..31)
1 1 145 1 1 1 1 1 1 1 1 1 1 1 1 1 1 1 1 1 1 1 1 1 1 1 1 1 1 1 1 1 
##$CPDPRG= <>
##$CPDPRG1= <>
##$CPDPRG2= <>
##$CPDPRG3= <>
##$CPDPRG4= <mlev>
##$CPDPRG5= <mlev>
##$CPDPRG6= <mlev>
##$CPDPRG7= <mlev>
##$CPDPRG8= <mlev>
##$CPDPRGB= <>
##$CPDPRGT= <>
##$D= (0..31)
0 1 0 0 0 0 0 0 0 0.06 0 0 0 0 0 0 0.0002 0 0 0 0 0 0 0 0 0 0 0 0 0 0 
0 
##$DATE= 1168011677
##$DBL= (0..7)
120 120 120 120 120 120 120 120 
##$DBP= (0..7)
150 150 150 150 150 150 150 150 
##$DBP07= 0
##$DBPNAM0= <>
##$DBPNAM1= <>
$$ [...]
##$SUBNAM7= <"">
##$SUBNAM8= <"">
##$SUBNAM9= <"">
##$SW= 20.6930455092707
##$SWIBOX= (0..15)
0 0 3 0 0 0 0 0 0 0 0 0 0 0 0 0 
##$SW_h= 5175.983436853
##$TD= 65536
##$TD0= 1
##$TE= 294.16
##$TE2= 300
##$TE3= 300
##$TEG= 300
##$TL= (0..7)
0 120 120 120 120 120 120 120 
##$TP= (0..7)
150 150 150 150 150 150 150 150 
##$TP07= 0
##$TPNAME0= <>
##$TPNAME1= <>
##$TPNAME2= <>
##$TPNAME3= <>
##$TPNAME4= <>
##$TPNAME5= <>
##$TPNAME6= <>
##$TPNAME7= <>
##$TPOAL= (0..7)
0.5 0.5 0.5 0.5 0.5 0.5 0.5 0.5 
##$TPOFFS= (0..7)
0 0 0 0 0 0 0 0 
##$TUNHIN= 0
##$TUNHOUT= 0
##$TUNXOUT= 0
##$USERA1= <user>
##$USERA2= <user>
##$USERA3= <user>
##$USERA4= <user>
##$USERA5= <user>
##$V9= 5
##$VALIST= <valist>
##$VCLIST= <CCCCCCCCCCCCCCC>
##$VD= 0
##$VDLIST= <DDDDDDDDDDDDDDD>
##$VPLIST= <PPPPPPPPPPPPPPP>
##$VTLIST= <TTTTTTTTTTTTTTT>
##$WBST= 1024
##$WBSW= 4
##$XGAIN= (0..3)
0 0 0 0 
##$XL= 0
##$YL= 0
##$YMAX_a= 267716
##$YMIN_a= -360033
##$ZGOPTNS= <>
##$ZL1= 120
##$ZL2= 120
##$ZL3= 120
##$ZL4= 120
##$ABSF1= 16.52477
##$ABSF2= -4.168402
##$ABSG= 5
##$ABSL= 3
##$ALPHA= 0
##$AQORDER= 0
##$ASSFAC= 0
##$ASSFACI= 0
##$ASSFACX= 0
##$ASSWID= 0
##$AUNMP= <proc_1d>
##$AZFE= 0.1
##$AZFW= 0.1
##$BCFW= 0
##$BC_mod= 0
##$BYTORDP= 0
##$COROFFS= 0
##$CY= 12.5
##$DATMOD= 1
##$DC= 0
##$DFILT= <>
##$DTYPP= 0
##$F1P= 14.0000005364418
##$F2P= -0.99999901652339
##$FCOR= 0.5
##$FTSIZE= 32768
##$FT_mod= 6
##$GAMMA= 0
##$GB= 0
##$INTBC= 1
##$INTSCL= 1
##$ISEN= 128
##$LB= 0.3
##$LEV0= 0
##$LPBIN= 0
##$MAXI= 10000
##$MC2= 0
##$MEAN= 0
##$ME_mod= 0
##$MI= 0
##$NCOEF= 0
##$NC_proc= -5
##$NLEV= 6
##$NOISF1= 0
##$NOISF2= 0
##$NSP= 0
##$NTH_PI= 0
##$NZP= 0
##$OFFSET= 16.52477
##$PC= 1
##$PHC0= 230.0606
##$PHC1= 4.688301
##$PH_mod= 1
##$PKNL= yes
##$PPARMOD= 0
##$PSCAL= 4
##$PSIGN= 0
##$REVERSE= no
##$SF= 250.129999306196
##$SI= 32768
##$SIGF1= 0
##$SIGF2= 0
##$SINO= 400
##$SIOLD= 32768
##$SREGLST= <1H.CDCl3>
##$SSB= 0
##$STSI= 32768
##$STSR= 0
##$SW_p= 5175.98343685301
##$SYMM= 0
##$S_DEV= 0
##$TDeff= 65536
##$TDoff= 0
##$TI= <Analysis number 999999
Compound Code 99
Book Reference 9
Project Code 9>
##$TILT= no
##$TM1= 0
##$TM2= 0
##$TOPLEV= 0
##$USERP1= <user>
##$USERP2= <user>
##$USERP3= <user>
##$USERP4= <user>
##$USERP5= <user>
##$WDW= 1
##$XDIM= 32768
##$YMAX_p= 374398921
##$YMIN_p= -684169
$$ End of Bruker specific parameters
$$ ---------------------------------
##NTUPLES= NMR SPECTRUM
##VAR_NAME=  FREQUENCY,     SPECTRUM/REAL,   SPECTRUM/IMAG
##SYMBOL=    X,             R,               I
##VAR_TYPE=  INDEPENDENT,   DEPENDENT,       DEPENDENT
##VAR_FORM=  AFFN,          ASDF,            ASDF
##VAR_DIM=   32768,         32768,           32768
##UNITS=     HZ,            ARBITRARY UNITS, ARBITRARY UNITS
##FACTOR=    0.157963299565203, 1,           1
##FIRST=     4133.3408929044, 0,             0
##LAST=      -1042.64254394861, 0,           0
##MIN=       -1042.64254394861, -684169,     0
##MAX=       4133.3408929044, 374398921,     0
$$ Real data points
##PAGE= N=1
##DATA TABLE= (X++(R..R)), XYDATA
$$ [...]
27988 -192881 28219 292420 284062 237960 190540 313507 261714 125307 146548 98502 97025
27977 97025 195859 180123 254054 339123 391375 262804 151321 52078 101766 148478 138707
27966 138707 235823 409511 402374 400747 270319 268492 210291 266161 278765 243983 174742 109956
27954 109956 106376 253095 110482 14174 49292 37639 45517 147411 94941 41582 -41425
27943 -41425 62548 -33229 -103883 -45860 -85369 32302 24776 -185263 -188586 -91459 -51135
27932 -51135 20124 108693 30353 31065 -65771 -65700 -79856 -82680 -184661 -216186 -180591 5769
27920 5769 41581 -85782 -45195 -52862 -11399 89385 114514 84908 202636 283156 300402
27909 300402 441784 464816 254593 149076 256220 296703 299629 133955 -172293 -244317
27899 -244317 -182859 -114966 109569 43675 -4609 65431 29660 14742 18902 65771 -68638
27888 -68638 -295320 -241692 -155282 -173379 -201368 24322 70432 1606 71985 195173 166901
27877 166901 185715 176693 343958 311530 300610 336912 288888 182052 218610 94792 33714
27866 33714 47073 114226 117243 44922 -172922 -174796 -256007 -242843 -170896 -160874 -74913 -132500
27854 -132500 -111151 -111241 -30211 51804 121223 138940 214346 129135 354039 253016 244744 232828
27842 232828 246577 267895 224993 118899 36632 -20361 175343 171829 86748 109786 122373
27831 122373 5424 5330 99491 134386 208228 104663 75149 49459 63386 98493 19703 89772
27819 89772 301226 161757 80728 34316 -78311 -111813 74213 212613 198589 9683
27809 9683 -73674 61433 154162 213056 111700 -46077 -25167 88582 103476 81964 151304
27798 151304 31306 -137594 -1891 231818 215878 158890 159269 21759 5571 41929 -51683
27787 -51683 -143963 -128998 -168302 -138604 -64882 4237 -6567 -108691 -88084 -83407 -16799 119097
27775 119097 119289 78720 27760 -9335 58194 62129 8474 -245576 -330913 -328000 -191665 -126911
27763 -126911 48580 249014 144711 79340 122579 112785 95575 191688 77160 76185 145238
27752 145238 148358 151944 235122 128176 -3758 45082 60654 236646 370518 365485 152191
27741 152191 52126 -41209 80466 250412 473675 461121 331538 402299 493939 411152
27731 411152 205375 152985 148691 166530 100508 82403 43969 -162140 -140308 -69759 39908
27720 39908 -121450 -154088 -170064 -125560 -12663 15843 180810 155981 11894 35287 85232
27709 85232 -131147 -170402 -52341 -137099 -133159 -65944 14152 178720 125647 12079 64526
27698 64526 171637 170427 188764 227837 150633 297927 412976 390285 356464 355723 209681
27687 209681 -28661 -287220 -266134 -229657 -204304 -209004 -195298 -241723 -262484 -44657 31661
27676 31661 -55988 -140518 -104204 61258 -40623 -149688 52370 393894 322515 111169
27666 111169 -15492 -25704 349 -14595 -86779 -202798 -56074 186680 201636 131585 100072
27655 100072 162439 189838 193242 105489 72709 165140 178992 120329 17718 24055 38653 36831
27643 36831 14908 -43525 -3113 109355 142893 87755 -19630 -66318 -60869 -80291 -109021
27632 -109021 97192 170141 85919 21562 50577 -76372 -227070 -317866 -133809 -64716 -82871
27621 -82871 -53481 -175026 -175236 -212557 -154773 -9477 85615 142436 17554 21868 47691 192736
27609 192736 84120 -96550 -66322 5895 68223 -64349 13001 111063 -878 -110007
27599 -110007 -35959 -41696 113735 203900 270845 128065 168448 154742 62108 82047 34287
27588 34287 -105116 -42191 45412 41000 56022 131472 175038 125451 197293 268659 154261
27577 154261 -85114 -28363 4468 -77655 -104115 51949 143178 159652 231225 130194 -28052
27566 -28052 18848 104257 37236 -41343 -52985 65855 88745 101478 117575 19528 -37866
27555 -37866 -43831 -2069 89340 183681 107985 206800 201648 485 -229215 -261138 -93355
27544 -93355 202642 266150 178743 68872 91255 5741 -215111 -298580 -328348 -186373 -49734
27533 -49734 77679 178283 124321 51786 -77854 16073 16282 -12553 -170738 -177227 -59918
27522 -59918 92093 66309 -49565 -57050 43117 110384 130237 47637 57351 124985 86121
27511 86121 114299 203808 259425 266344 202414 196847 217433 213400 248166 113537 78051 93758
27499 93758 908 -72305 -178066 -181422 17614 72092 65464 201383 132052 29308 -86233
27488 -86233 -190287 -164571 -98603 1290 -40685 43671 109029 113655 143510 10698 53686
27477 53686 32934 -22922 17542 -71148 -94811 65466 223110 211026 67373 -103778 -85623
27466 -85623 13772 210222 338604 170141 149234 66847 112618 127371 64074 -114562 -173441
27455 -173441 -101648 -56434 14707 55965 224675 137409 -113059 -100216 -57864 -62098 -91700
27444 -91700 -204403 -106577 -51928 8017 -6410 -35893 -3917 58411 -64817 -63647 106126
27433 106126 206216 292210 176649 4853 -12037 133270 178894 270639 266987 236874 1205
27422 1205 -87787 -104258 -104158 -125063 -43025 -12935 38686 76507 186674 140655 90498 -64
27410 -64 -95867 -86978 -108204 8398 123023 120406 82155 105797 -75768 -209165 -136354 -91627
27398 -91627 -198863 -127440 70260 198491 151840 35258 -180883 -168069 -66832 -111654
27388 -111654 -35090 211518 165808 -31298 90189 163358 -47973 -123781 -213744 -352774
27378 -352774 -277332 -195423 -163401 -80901 -122157 -211532 -231157 -220913 -294572 -353965 -198618
27367 -198618 18349 -5420 -10194 -139751 -173358 -69183 -116174 -19271 -61878 27143 -42956
27356 -42956 -30640 80744 41426 -119309 -113517 -38479 32866 74506 242384 352664 312099
27345 312099 364564 248384 133835 39335 -18813 59611 67171 57024 139236 135734 111043
27334 111043 209958 313175 335050 304737 389563 354499 221914 147110 -4945 -56706 144131
27323 144131 308896 413796 452726 297090 205319 33048 -19996 -73239 32582 198673
27313 198673 170684 -11032 -106944 -211772 -202403 -115290 -67943 20843 -39653 -82929 16691
27302 16691 -74884 -46523 46499 -720 4907 18012 46250 144954 204238 53982 29459 74792
27290 74792 143485 220065 224338 213134 351430 227080 -91531 -308366 -204560 -121812 -87024
27279 -87024 -130686 -143135 -97116 17576 89896 91071 254029 272179 164254 121470 331843
27268 331843 252003 170938 93038 -40624 131169 304687 238809 180584 66418 -34512
27258 -34512 82157 130206 252680 292844 317089 107790 47170 -70327 -281513 -446023
27248 -446023 -391457 -180385 -94660 14694 18764 -18420 74295 141028 77832 156941 242168
27237 242168 258038 137872 -85866 -146269 -58821 42331 54102 14887 -126390 -164820 -17161
27226 -17161 50846 215572 363448 251555 31534 -34756 -78687 -118928 32532 122925 186635
27215 186635 195124 162882 186320 221595 273675 252102 183490 210856 186096 103511 76615 163725
27203 163725 288560 231768 -16307 -83088 -7435 35219 66259 30845 83184 273678 242256
27192 242256 194908 167710 199207 44356 -85845 -93211 101145 127881 5736 -38524 7651
27181 7651 -6399 70228 125799 221404 360430 272400 -7457 -8016 33803 7532 -37143 84692
27169 84692 105613 27914 110874 152781 77896 -713 -130975 15947 -13276 -192404 -70639
27158 -70639 57984 9230 -88403 -39122 17382 58994 95885 54006 14435 -171628 -109326
27147 -109326 -158835 -80312 -83307 -113318 -124964 -65718 -58128 132816 129507 82658 -161943 -204286
27135 -204286 -212594 -119075 89618 87613 -18978 27289 89275 30397 -25345 -121224 -3509
27124 -3509 156267 128740 -51657 59679 34526 -153447 -247233 -327492 -263624 -312057 -359897
27113 -359897 -240026 32118 225509 184859 64205 25835 -4796 -78042 -137012 -117290 -16974
27102 -16974 -21394 -35968 181247 248741 107372 128349 43548 -51108 -61579 -85824 -154353
27091 -154353 -166518 -44801 -1001 147262 180712 188340 60382 82245 123925 94507 121602
27080 121602 161048 221590 271964 124564 37761 45057 -27893 11008 61748 -22230 -58995
27069 -58995 200097 293588 244197 101833 -380 5907 54104 -87660 -123000 -8881 70027
27058 70027 190586 146193 67116 98204 121053 149983 73832 11200 43509 -16521 -64352
27047 -64352 -71335 -36074 79989 183384 51427 34078 126774 83908 149415 151810 46025
27036 46025 62769 39537 15348 -43115 -40642 -19599 4899 94759 259552 267261 152948 -114365
27024 -114365 -131881 -55795 -169112 -79222 105730 151652 57067 -21534 29249 124170 162619
27013 162619 136928 -8397 58327 -2406 -99490 -10123 83270 245006 115509 21845 228356
27002 228356 240744 -79220 -98366 -25830 4261 37558 -72890 -215603 -219543 -272606 -188332
26991 -188332 6782 21621 -92475 -58850 -11045 34682 -21187 -99002 -144784 -213388 -267188
26980 -267188 -296036 -208761 -157455 -101921 -116253 25339 103363 40782 94980 143498 36626
26969 36626 51325 113097 150421 96494 73670 66096 148459 131840 97368 71018 67918 -56520
26957 -56520 -73274 -89097 -67889 84809 63057 -77672 -260353 -447262 -423784 -246599 -121223
26946 -121223 -25002 121719 106923 106543 53433 155252 179922 -105768 -330087 -333377 -216367
26935 -216367 -214486 -181765 -168996 109724 242861 215309 24893 -56867 90109 213871 124741
26924 124741 -623 -25398 -38990 13795 125246 85956 -19760 23240 29936 -45884 53742
26913 53742 22131 -36466 -41909 -70610 -50480 -48581 -50358 -143676 -96889 -136853 -109408 23243
26901 23243 -20567 -165416 -154174 6490 68648 -60015 -281784 -375864 -252933 -33093
26891 -33093 49688 90667 229278 296296 144574 -4664 111249 21441 1518 21072 56096
26880 56096 -10139 54300 184248 -33694 -28334 -52045 -176273 -268291 -243712 -96730 -20047
26869 -20047 74417 -110130 -140782 -71039 -175792 -79315 74154 103389 155573 69513 146010
26858 146010 271011 155547 127048 19114 102554 108888 -45265 87861 165799 112130 -26981
26847 -26981 124636 150730 -71443 -138453 -197028 -130203 -2131 69028 41434 31029 158753
26836 158753 199587 -15298 -185348 -24153 55848 80961 25229 -106345 -114970 -78327 -127761
26825 -127761 -157147 -106510 -128944 -131027 -87555 -35996 80747 123190 153316 266275 132104
26814 132104 -39286 15699 200540 239219 188706 214813 69401 57252 76083 -4644 -112630
26803 -112630 -80743 3807 51628 13937 25253 64088 -15017 -51866 -62113 -177498 -107442
26792 -107442 -51846 -150081 -187833 -149551 -87788 -40179 170954 416029 265647 47523 7430
26781 7430 -25661 9439 91585 128857 228704 305876 260649 139308 103370 20855 -46843 -51810
26769 -51810 67070 231379 230193 204423 132033 127822 42782 50441 232890 202412 12460
26758 12460 -71909 -48893 133257 199919 41155 -55703 19072 -82040 -51581 162089 90443
26747 90443 -43829 -28713 85594 168858 280346 221136 63240 104238 86914 206319 77752
26736 77752 -18476 -12136 -63029 -96135 -103500 -66578 115370 168720 12006 40498 3266 71741
26724 71741 51628 101466 -41859 -196540 -167882 -64566 -32002 -174721 -317192 -234239 -126377
26713 -126377 -68709 -92734 -46438 36950 44594 88968 258767 313321 261454 185949 -37371
26702 -37371 -94228 -208145 -186471 -150903 -79933 -84438 21325 57794 31443 -136219 -153693
26691 -153693 -131507 -145964 -53574 55015 164748 103241 129576 154603 124362 209764 187940
26680 187940 190341 208294 200816 79374 100348 159101 214681 147757 99492 24790 200574
26669 200574 192998 141882 83746 48411 166611 176126 97577 -101365 -256667 -81068 20203
26658 20203 -82829 -24205 -14919 35625 -91790 -98405 58972 23592 65036 78686 30956
26647 30956 -22937 -116526 -106243 1409 -29478 69253 108369 57953 -57339 -43505 114105
26636 114105 157361 120657 -713 -51227 116019 240838 350861 310803 185745 115627
26626 115627 -76124 -129046 -69543 -23546 -61072 5185 78761 76103 93035 -55 -148133
26615 -148133 -30272 -48085 23713 35436 16699 40060 39089 14829 69555 2827 -166835
26604 -166835 -198357 -141414 -84834 -42367 -109149 -112226 -90047 -179090 -187022 -127358 95580 265998
26592 265998 190870 -26968 -65594 29793 20415 212185 203848 239917 162511 -9544 -151013
26581 -151013 -45557 -115433 -113992 41051 98049 202268 74205 -84559 -128873 -68364 -51260
26570 -51260 -146394 -181592 -102813 -221317 -134030 -210513 -242316 -296770 -318200 -198206 20839
26559 20839 230844 289369 351048 398125 304065 299508 236627 101833 -91602 26005 218345
26548 218345 239266 78652 -106789 -59001 -2664 -148924 -9660 99582 141378 83790
26538 83790 101500 -72969 -154791 -55615 23884 -19840 49066 297110 481713 401455 253762
26527 253762 128669 97151 45408 -48856 -100662 -47092 106644 188488 238090 123221 118206
26516 118206 97225 91469 32372 80625 73908 163234 99463 132705 169074 158615 -2067 -50171
26504 -50171 -152886 -299774 -213593 -167186 -230437 -230175 -59009 64229 130702 279055 232997
26493 232997 151627 -78828 -126914 55627 73356 7063 131334 306665 296007 122548
26483 122548 29330 -85773 -232785 -168395 -39011 -21357 -71311 -28753 72774 -46989
26473 -46989 -39000 -62015 -53363 -81805 -101204 -62632 -23392 -34347 -133330 -81506 105113 156412
26461 156412 -29567 118677 101177 -95057 -122351 -40248 219152 301713 174086 75578
26451 75578 45393 -84746 -44679 -83030 -118590 -169298 -222873 -169185 -55056 42248 77737
26440 77737 154440 64470 37215 159536 173954 196540 61372 48879 132176 164028 97730
26429 97730 -21505 -149159 -188900 -150612 15690 173735 283536 178381 140934 95628
26419 95628 -44901 -15146 233601 116557 -114485 -100245 50096 71090 218167 247878
26409 247878 61022 -88518 -34927 100436 228934 313950 285094 238147 141426 -24579
26399 -24579 -98566 -50930 -153278 -298040 -157410 -101165 -261375 -220704 -200248 -226928 -142772
26388 -142772 -224569 -97117 17305 -68580 -223088 -385007 -383407 -415164 -361618 -370039 -440560
26377 -440560 -585482 -399768 -231829 -73699 51596 42756 90684 47144 -86970 46159
26367 46159 -8591 1506 139969 202759 207858 374149 290360 80095 -82528 -157732 -232028
26356 -232028 -58683 124771 193563 209882 -16481 -173933 -34336 -103760 -112082 -130104 -260365
26345 -260365 -333153 -260523 -275927 -330703 -309007 -167941 -228198 -103131 36835 181701 223577
26334 223577 43307 14267 128221 219662 235980 -19623 -112974 -230807 -100956 73855
26324 73855 109842 44525 -23022 -30392 -194781 -437444 -495377 -393082 -94801 88952 -22611
26313 -22611 -78432 -107540 -290761 -365269 -304553 -207192 -53132 24257 3770 -46727 125251
26302 125251 122680 -5748 -96668 -151214 29624 256605 204549 185405 93767 193288 174016
26291 174016 101929 47547 -18105 -59091 -131775 -2362 88560 54593 104047 8466 -132519
26280 -132519 3219 40245 -169271 -166298 -101884 -99769 -7123 3585 -181976 -247073 -174389
26269 -174389 -136110 -45143 17320 -19343 -151496 -128321 -72702 -89262 37748 38002 13374
26258 13374 -20484 67511 257633 107268 -337757 -322044 -195054 -376300 -255781 -131480
26248 -131480 -13942 -25053 -113013 -35615 83632 -14508 -159193 -142954 -123234 -289443 -216597
26237 -216597 17503 37617 -105775 -99525 -26890 -39064 37260 202033 130124 9153 96597
26226 96597 214955 126979 191704 299612 468895 401192 252456 213799 205466 100189 -11331
26215 -11331 43829 149879 156983 101162 -115984 -72985 37151 158302 200859 4878 -229655
26204 -229655 -236204 -77047 209930 272790 210942 121311 119649 188313 147338 229430 219471 72876
26192 72876 -44182 -150463 -71799 -20421 42795 -1072 162854 113890 -37750 73293 55175
26181 55175 10973 -81321 -116062 -65422 -150596 -165072 56646 46195 112201 287810 324877
26170 324877 94480 89258 -41082 -80777 -10001 15341 8143 -99678 -70312 -15471 147036
26159 147036 77771 170332 274914 126587 30906 -89925 -18360 44783 6933 -121557 -131733
26148 -131733 -98885 -21032 125315 58503 -70050 -16360 130901 227126 108521 -115219
26138 -115219 -160687 26512 41249 -74734 -57876 8249 -217728 -261270 -254661 -258869 -289503
26127 -289503 -247624 -291610 -269886 -215736 -222145 -53610 14142 -53076 -32173 73211 -79744
26116 -79744 -181708 -52258 -34966 -152167 -119446 -157484 -176533 -187564 -259287 -347394 -354864
26105 -354864 -144553 -58656 -108134 -183277 -88542 -10191 37212 150780 76913 15249 167125
26094 167125 389488 532535 405805 251864 187257 -12586 -164399 -183644 -220457 -180872
26084 -180872 -152485 -26558 23063 -112567 -147468 -118749 85937 207681 189674 189639 85695
26073 85695 80280 110835 117702 -25959 34973 129246 64869 -100696 -15626 8980 -94858
26062 -94858 -131649 -100116 -98170 17251 65725 118534 75784 -134280 -194548 -123647 -49499
26051 -49499 47143 193748 245517 -22005 33734 64817 -68855 48667 115247 276049 344678
26040 344678 321529 182861 124024 277287 245196 99358 160225 307946 278312 185920 35561
26029 35561 57409 151101 190439 42286 155811 282963 233133 218568 33449 -174325 -388464
26018 -388464 -104732 27818 9768 28487 -43826 -110035 -139059 -55170 121582 342421 225038
26007 225038 -72248 -16202 26774 -119851 -139893 -142570 -215514 -95409 -60939 -136242 -160377
25996 -160377 158019 223919 46481 45251 121141 98892 -52192 -87953 -13445 -136129 -210905
25985 -210905 -194912 -295121 -236037 -16182 36950 131883 195127 197575 141712 77328 -205974
25974 -205974 -146111 -82657 85687 183957 134468 -40410 -239086 -107626 -70672 -114412 -139910
25963 -139910 48959 173919 127538 211062 199232 130299 63914 135342 145680 62674 -95884
25952 -95884 -239616 -269913 -241313 -208980 -39710 133755 241906 175896 -6535 -138799
25942 -138799 -123509 21832 18685 71495 26762 -26071 -112657 -105400 -47496 129442 224458
25931 224458 205867 38941 -62356 77951 109546 107463 255573 164080 -39989 -105067 -47275
25920 -47275 -85691 -87443 -87441 -125649 -253796 -187884 -67607 -119530 -122758 -21948 137669 114492
25908 114492 81897 53904 -162851 -309196 -262445 -175741 -116722 120509 144255 -38241 -91088
25897 -91088 -192980 -100263 -91130 -106538 -15134 42609 121097 150367 115084 78241 127532 107011
25885 107011 -484 -85504 -137228 -306515 -257753 -249505 -100874 60305 43194 140833 48592
25874 48592 -31656 10152 55759 210380 200213 212050 52967 -15568 49694 22524 -7012
25863 -7012 48962 89209 -133179 -197561 -163289 -106058 47290 91238 32129 -105249 50187
25852 50187 258856 334835 280682 156206 85540 63647 37061 78336 17151 55117 229171
25841 229171 232058 143372 201550 79832 8189 84055 -142442 4314 134497 124495 221487
25830 221487 102932 34854 -72421 -56496 -38251 -15539 34302 -40113 -234589 -199763 -144963
25819 -144963 31589 50725 18637 146184 11076 -75733 -62755 -162883 -312109 -159700
25809 -159700 120466 264088 197417 271973 320383 340351 249428 151328 79436 29235 -105248
25798 -105248 -269526 -202322 -206420 -147563 -51010 2858 -276465 -443375 -305391 -190785 32575
25787 32575 95688 -139543 -286691 -469876 -360635 -163178 -69089 92997 135584 66300
25777 66300 40375 -51509 -110108 -213306 -225852 -185011 -65284 -50094 -2705 125910 61356
25766 61356 -69499 30392 18980 16547 57493 85472 307029 261405 97046 91017 59029
25755 59029 73397 133773 44941 -15872 15951 109934 153903 -32677 -109362 -51955 130855
25744 130855 142082 32834 -103537 -188886 -156425 -185141 -202186 -288418 -262517 -163058 11873
25733 11873 58480 41458 84101 -51505 -174058 -217405 -171079 4443 53469 109118 160346
25722 160346 -44402 -233175 -77901 -40404 -235084 -174269 -95954 -12610 -82877 11649 -126013
25711 -126013 -77061 -98429 -102007 64256 27793 31910 54326 23781 19755 72354 185716 159406
25699 159406 34940 -59912 -150335 -39819 -8592 -23493 -61927 -71148 -47803 44161 -29971
25688 -29971 -110930 86165 123514 -4288 -144159 -39913 -62909 -218312 -101566 -88091
25678 -88091 28401 144234 186054 171168 134742 39271 -115487 -124554 52471 310399 196600
25667 196600 109489 196718 214804 98806 -5415 45250 166181 241488 294053 327427 85215
25656 85215 -18664 46230 -67430 -164194 -297687 -151923 -194963 -189133 -306265 -234105 -135090
25645 -135090 -26938 88803 -2092 -169098 -115041 -77645 -162160 -105350 -95112 3024 118777
25634 118777 -144262 -400980 -473372 -243918 -188213 -278514 -166046 -197018 -259341 -338158 -274916
25623 -274916 -117336 100661 67378 -63254 -155428 -110767 36781 -65893 -32823 -68375
25613 -68375 32965 82550 129919 146449 51807 -115819 -115033 -77330 76112 227429 68786
25602 68786 23506 -115443 -178543 -61926 8819 215569 260812 63698 109854 108667 -6145
25591 -6145 -102960 -16551 -14000 11663 64068 127089 95029 -92658 -230120 -259215 -154058
25580 -154058 -173843 -179689 -128443 8329 -33228 -167718 -266758 -373181 -383922 -361272 -166156
25569 -166156 -77793 -142468 -292285 -276864 -170869 -165554 -26861 265825 128128 122623 54623
25558 54623 -70085 -141018 -146088 -74903 -30304 -122372 -195825 -67830 -40719 -58013 -85076
25547 -85076 -96105 -56374 -136598 -157774 -58663 82335 187506 284303 300848 200761 251801
25536 251801 209101 210556 48173 12765 -23932 -23719 -80250 -169870 -120386 -131768 -94801 125595
25524 125595 235775 309525 248256 289142 378708 345723 88169 154512 6225 -38227 -3486
25513 -3486 -30712 -16508 -15148 6060 -127121 -188717 -160048 5898 -12754 54037 -28344 -160315
25501 -160315 -56888 -14876 21301 131198 115039 71981 154467 126509 167593 299551 153431
25490 153431 -17159 39201 59560 7208 -90351 -144085 -2066 33507 33059 23477 159745
25479 159745 190621 67910 -45030 -153826 -9227 24273 11437 110170 233907 259122
25469 259122 300338 286067 94203 30035 -70266 -100029 91496 65513 47504 107098 -94410
25458 -94410 -292161 -126566 4154 43386 91249 -99350 -150021 -188789 -98325 250610 290808
25447 290808 176734 -17395 27123 4536 -73036 -103295 -195449 -111242 -121659 -151209 -318744
25436 -318744 -305924 -290686 -246212 -95314 -80991 -66833 15303 67312 105966 45393 -83887
25425 -83887 55367 353034 370565 180136 65983 -136075 -336376 -272506 -66106 23372
25415 23372 46426 -13333 -106761 -9729 172103 310080 143174 -38400 -98072 -63559 17221
25404 17221 -33059 -169449 -165099 40791 186435 161600 46862 -22818 108595 227867 170211
25393 170211 105781 -10270 108620 109133 53388 -134266 -219619 -199704 -213723 -257963 -127606
25382 -127606 52786 23943 -89389 33683 48153 36922 169445 157534 17376 28396
25372 28396 131727 172291 317855 237679 145606 245397 193585 151915 -27025 -57162 -20916
25361 -20916 99499 72610 -60724 73301 -2757 -10432 14327 198894 288677 119762 126360
25350 126360 -45313 -75154 27043 -23061 -33064 -102715 -145935 -162708 -227739 -201437 -160279
25339 -160279 -103514 19177 119434 70702 67136 30433 -29506 -209380 -231309 -190171 -205850
25328 -205850 -167011 -207592 -169548 -161026 31660 170537 175770 30765 29453 -111235 -124604
25317 -124604 -113170 142384 298973 240322 129371 -146842 -171674 -193165 -198846 -96216 -48524
25306 -48524 102104 102383 155171 79705 52333 -91069 -78578 106245 243597 213079 348993
25295 348993 384796 458698 263104 -27575 -197208 -66054 154016 188637 136440 186692
25285 186692 213134 178889 50457 -128309 -157266 -196905 -134309 -195626 -208768 -160646 114900
25274 114900 398545 410420 225332 206058 229561 193795 237927 163325 163710 74063 -1859
25263 -1859 -17873 -78243 -133168 -2326 -26734 -155456 -88743 -116839 -111030 -71558 -192998
25252 -192998 -191306 -174345 -143902 -193254 -67640 -113911 -185535 -120348 -60692 152541 173834
25241 173834 31704 13032 25999 69894 -30033 -51042 -159692 -240860 25627 333179 352558
25230 352558 261622 193481 108626 221349 326237 153595 31787 -38194 -4014 145253
25220 145253 212147 99718 -117585 -9862 -122506 -119713 -11349 173168 257505 171270
25210 171270 -158846 -258113 -115322 -96203 -49127 -26139 -767 -42417 -67696 167093 315695
25199 315695 230161 206687 137418 -1292 141966 230142 338308 232281 261835 108613
25189 108613 -78300 -172454 -271781 -203305 -315447 -372810 -394366 -305129 -128376 48222 93413
25178 93413 44531 99411 180511 292619 124959 32165 135801 112866 128341 167849 -89735
25167 -89735 -72399 -23000 20238 -182232 -279083 -126393 47242 -2748 -12813 -40657 -90110
25156 -90110 -82083 -98561 -63955 -57582 -66851 71097 218439 169443 72139 23121 -24714 106117
25144 106117 231703 243365 163012 -26359 -157370 2764 -53853 -29998 -46271 -129357 14713
25133 14713 129588 103105 88195 39534 -123882 -230266 -328465 -264653 -101937 -28188 -25082
25122 -25082 125255 80440 -43889 68820 124108 184694 357143 305998 102482 -178273
25112 -178273 -168821 28194 221021 197582 145314 215492 290342 238871 187910 -46249 -75288
25101 -75288 115280 82988 -13960 -82203 -155516 -274625 -331778 -146467 -84562 -4711 267667
25090 267667 257874 66268 146085 299960 453641 401133 467782 309167 111822 221450
25080 221450 245396 221051 142837 -1160 -159368 -119424 -4674 113256 224085 312476
25070 312476 167623 149469 108100 -125753 -259265 -264438 -282410 -251570 -104201 -11752 -50060
25059 -50060 -47814 -140512 -180576 -2312 -61635 -187506 -227554 -335735 -156745 -81297 -134586
25048 -134586 -91120 51143 180543 79298 -24360 44503 -13589 56988 -68406 -67178 91459
25037 91459 190193 213856 281045 244127 181467 94460 -107776 -232818 -140702 -31740 -170615
25026 -170615 -354308 -391124 -252429 -41126 106180 191465 343934 424044 360927 212012
25016 212012 -44505 -107447 -19350 165365 151957 4714 71485 157636 175184 118570 103502
25005 103502 118810 214831 214963 236546 25265 -79237 -96682 -13293 -111807 -14464 90338
24994 90338 173691 177206 28732 -253322 -432982 -313680 -149362 -103760 -106458 -140207 -211674
24983 -211674 -148371 -51771 55805 21909 81702 104337 25202 -117638 -294241 -414466 -178021
24972 -178021 81092 -54537 -218421 -303182 -487865 -494887 -490986 -444977 -426154 -266717 -253296
24961 -253296 -238375 -252246 -166577 -146601 -86761 -102241 -139882 -102849 -7858 71398 59890
24950 59890 141531 6585 -285777 -235975 -45103 24286 14305 70781 71689 32890 183909
24939 183909 157915 68065 -70887 -75372 -54242 -32816 10503 141543 344397 278412 313879
24928 313879 233964 150292 50635 119706 -50357 -222094 -261500 -159339 -106950 -68430 76301
24917 76301 77403 98148 25383 -54047 -25810 -36061 -4665 -32678 -159150 -100555 -22794 11897
24905 11897 92350 20489 -73512 -162941 33469 214473 235110 230579 94716 21700 72830
24894 72830 -3445 32711 77067 -172712 -326203 -323085 -268402 -337761 -310707 -280091 -266370
24883 -266370 -361295 -241724 -137156 -172330 -210608 -116305 -222156 -402420 -283375 -100635
24873 -100635 -132330 -71105 -9965 80578 163614 201499 114420 13041 90 74350 106848
24862 106848 -21458 -805 94568 161541 138762 -34429 -69586 12445 -81554 -185761 -174278
24851 -174278 -23708 41593 133456 80955 85975 175772 113280 -49258 -124939 -87625 42432
24840 42432 28521 -44646 -189116 -2227 68565 32155 -61831 -72163 52109 156779 105283
24829 105283 -61472 -280701 -354370 -191895 91421 104622 18388 -21480 97560 168566
24819 168566 82695 36221 101313 173222 28519 -93641 -117190 -128918 -148504 -98779 50699
24808 50699 112967 -90756 -305832 -260203 -202777 -83074 -107486 -20325 58648 -15445 -87833
24797 -87833 -147723 22459 -39851 -132293 -61516 63682 123030 63131 141254 257905 199522
24786 199522 251238 248270 62204 46082 -1824 -1237 56877 83710 225332 14372 -237703
24775 -237703 -262656 -192490 -256068 -125685 3599 14169 -36255 -58339 -49492 -83112 -120382
24764 -120382 -108846 -33933 -72803 -107817 48574 34723 41395 136875 -32609 -181645 -207967
24753 -207967 -209669 -5941 -130804 -127635 -133955 -273954 -318867 -188157 -104446 -290383 -267455
24742 -267455 -269417 -153146 -5740 -70664 -88846 -37498 99983 46520 -6329 -109540 -145514
24731 -145514 -115807 -97241 -225972 -43987 208115 -47130 -151196 -190167 -17126 38838
24721 38838 -174575 -233023 -210779 -65089 58878 93771 65351 53222 -10995 -1190 -49945
24710 -49945 -47013 23351 64166 10785 50860 40055 -148354 -243576 -256038 -137249 -114394
24699 -114394 -27103 -41103 11487 -27452 -44998 75584 69267 198691 314571 119763 -64973
24688 -64973 -155325 -313714 -318590 -302206 -136940 -85740 -41728 -29796 -103441 -24245 -155540
24677 -155540 -177422 -4587 -106708 -45421 53241 61692 -100226 -55643 -5324 53010 -29606
24666 -29606 -163930 -91579 115786 37180 -31527 187639 248921 155689 -56189 -260837 -205185
24655 -205185 55732 77890 -44564 64868 51116 -82582 -156773 -60558 30426 -14957 -20578
24644 -20578 40027 141154 152747 58084 61668 5435 55804 209141 311800 130787 -28476
24633 -28476 -54645 -55254 -114199 -173284 -146023 -56795 -51670 -14833 109342 178990 252011 141823
24621 141823 152394 172193 164429 227099 302934 426185 254038 165164 156404 128521 266385
24610 266385 239455 150489 69669 105486 54573 -26324 84779 9950 42417 28973 -56655
24599 -56655 -33057 8119 -5907 73816 103738 -5782 -37360 141114 218603 88651 30130
24588 30130 90746 3475 52304 50130 88579 -116810 -370996 -332232 -290206 -207070 -206603 -140175
24576 -140175 -30305 -63686 80035 268369 280442 82613 -44168 -132722 -125935 -191519 -240851
24565 -240851 -154050 49227 137140 29623 -126038 -258966 -276457 -148516 -16764 46858
24555 46858 3670 -67296 -196685 -272013 -192434 -169716 -150155 -117314 86198 10032 -34376
24544 -34376 -29118 -31918 -80144 -195063 -197226 90513 222482 187608 150957 10236 -135597
24533 -135597 -97201 -44035 -24857 -22689 104128 189622 181286 214931 255309 268467 245261 234520
24521 234520 249759 330180 406081 245920 144850 184095 94066 117861 197337 180806 83905
24510 83905 100576 42736 7396 -49860 -75787 -40884 -92425 -260357 -345593 -124352 -13198
24499 -13198 4703 48014 42161 39250 48273 11387 -158669 -231186 -129167 -17411 79353 62319
24487 62319 -4705 -220575 -233727 8385 137876 131124 92079 139643 237248 178540 227087
24476 227087 179064 60857 22523 14779 170994 167394 57699 -7534 -27920 56524 -54317
24465 -54317 120 104682 -8729 -132654 -81167 80333 137029 34732 -69916 68620
24455 68620 159939 174358 -48301 -55653 -134522 -18153 92570 62340 72745 53545 343
24444 343 40422 40113 -113081 -301509 -360638 -154110 15688 -42709 -108849 19757 52697
24433 52697 108086 70325 47115 148295 113236 -16814 42124 19703 15990 53320 42036
24422 42036 181851 256772 72411 135690 91033 146834 178140 263055 320458 160778 80301
24411 80301 108609 139634 191519 233543 93534 47778 152000 118199 231148 376887 169309
24400 169309 537 -35147 -74986 -215817 -24977 85149 74530 -75356 71382 198928
24390 198928 214257 79531 -20858 852 -107934 -97535 -26399 130737 176316 -128354
24380 -128354 -122127 154629 212658 6371 -157503 -175314 -141745 -42410 132937 75036 -20463
24369 -20463 -52292 40722 200425 81770 76112 29028 101395 46058 -61265 23621 18918
24358 18918 -172725 -83631 -85190 -88899 -6225 76645 32361 -31957 -310892 -474960 -330597
24347 -330597 -42748 84542 5798 70877 -114145 -137140 -116431 -43346 21040 -113845 -213138
24336 -213138 -97624 -137722 -288050 -281982 -213401 -195114 -172892 -43540 -99053 22497 194
24325 194 -131307 -211954 -68996 65164 180446 272649 135806 -37965 -83441 -85531 -64487
24314 -64487 -189716 -275248 -232333 -170763 -170702 -1979 45222 190204 227175 343653 291418
24303 291418 187435 224353 253990 41365 -56282 92538 52998 12471 -70459 -108532 123786
24292 123786 132954 79608 275804 287532 215615 145655 73229 31632 8804 92188 187912
24281 187912 253673 144359 -20884 -150351 -128478 -2709 -710 -57335 -40695 154494 160339
24270 160339 79425 42808 9667 69396 126004 85478 43069 7176 -62331 58483 171431
24259 171431 167755 130857 269435 377299 218327 246089 311951 150710 -62140 -126369 -262668
24248 -262668 -177669 142707 176230 131147 -28162 -12427 13160 75791 33757 50147 126493
24237 126493 -97474 -256748 -129532 10194 -90908 -24449 -53319 56210 215611 242410
24227 242410 19070 -193096 -256143 -214559 -124434 -10673 -164454 -132370 -13865 -121858
24217 -121858 -79427 21436 -53887 -133619 -23966 296888 287639 61788 -148095 -73900 43432
24206 43432 118395 275010 269946 116956 20624 -82271 -167137 11205 120764 16010 -67526
24195 -67526 -99289 -89385 107874 26891 -24261 -29032 -121070 -39882 -57047 -121907 -182839 -175076
24183 -175076 -97017 98183 113788 192092 235064 223781 390932 299603 188001 -17618 -244138
24172 -244138 -322372 -98572 236112 334734 396409 640533 420588 278298 138073 22684
24162 22684 -53543 -89227 -131213 -171310 -326436 -352024 -301840 -115885 -132138 6088 -10331
24151 -10331 -109293 -35720 53914 21726 -26701 52775 -18901 -68831 -41241 -79350 10729 -17723
24139 -17723 -62904 103017 1093 -196621 -95627 -3976 -84764 -34593 23669 102706 -61114
24128 -61114 -103186 18401 67009 34115 -106274 -115875 -32306 -161471 -318381 -132759 -159
24117 -159 28369 -41031 32787 79816 7316 64186 82256 -5270 -48362 -59112 29896 -51965
24105 -51965 4306 -21833 -192494 -137011 4788 -40789 -204256 -223023 -237284 -238757 -383370
24094 -383370 -424124 -240089 -104009 -23885 -31392 47806 238717 219866 60072 143890 112120
24083 112120 22017 50438 5139 61824 42888 -9127 -173053 -300999 -364649 -427094 -324785
24072 -324785 -299190 -303000 -258851 -351296 -278424 -50022 184221 182351 126686 -66513 -46099
24061 -46099 27716 51206 17630 37821 -115034 -183249 -170113 -205589 -154704 -41500 73039
24050 73039 -14205 20488 -48057 -146600 -85991 -59140 -61913 -228008 -341974 -268095 -235414
24039 -235414 -45875 55893 29299 89639 255277 336879 87780 3518 55197 172813
24029 172813 105619 67709 118178 5503 187888 183341 174543 146176 -53595 -307293 -191170
24018 -191170 -113913 -178274 -59018 -224286 -269968 -203604 60989 87249 -21310 -95879 -51894
24007 -51894 18744 -170632 -167069 -190585 -247094 -381144 -306193 -221444 -138730 62291 155832
23996 155832 114106 140159 65110 -82745 -87859 -118337 79062 230331 250753 334062 321850
23985 321850 109766 76975 98961 14403 27577 28332 -23942 -114648 -273717 -137713 -128354
23974 -128354 -32215 124671 160227 249459 59874 -160784 29654 101756 97385 138315 142784
23963 142784 13077 -142532 -274135 -365044 -233315 -253004 -302887 -171941 -67975 -38297
23953 -38297 39392 43104 5864 -108587 -153886 50928 -1340 -138085 -121141 -103856 -163530
23942 -163530 -197422 -222094 -165673 -94233 -332519 -360083 -205545 -132678 -78058 27460 -60349
23931 -60349 72556 -7170 -106179 -257183 -429702 -481057 -444216 -172278 18237 18548 -173162
23920 -173162 -257768 -207249 -89707 -58403 -257760 -479361 -369600 -154532 -70106 -213279
23910 -213279 -347584 -346727 -292233 -281759 -212393 -49930 60938 139920 59489 -11767 -76238
23899 -76238 -34711 12794 -252 -170080 -101860 61919 -5138 -55511 -152248 -285769 -389334
23888 -389334 -322416 -158955 18756 166754 210248 88173 -188905 -201619 -302340 -312953
23878 -312953 -22260 64525 132993 128649 -110067 -129048 151629 234632 -48333 -155106 -23646
23867 -23646 46054 -79926 -210365 -314429 -313698 -303827 -101760 101042 38789 -8556 39263
23856 39263 49467 72322 10165 -112185 -219035 -180002 -21102 4641 -60104 -79152 -163359
23845 -163359 -45085 -6083 -56220 -22511 72140 83436 -71048 -106182 -22614 -81387 -207257
23834 -207257 -229816 -117073 25833 177927 230950 160940 -24696 -115766 -9099 11556
23824 11556 -18662 -185614 -300433 -306444 -121340 80318 148205 126136 254006 269463 189520
23813 189520 180609 222408 98365 39585 54071 72685 -92304 -149584 -96767 -6351 -34818
23802 -34818 -174202 -147861 -216200 -198931 -33198 26617 59581 -32890 -60526 -85125 -25268
23791 -25268 103979 44056 82966 187210 33854 -101424 -46792 -63809 13847 68084 -138493
23780 -138493 -258348 -148117 142447 336944 399324 455357 411068 349617 215809 225827
23770 225827 160495 -146467 -352867 -81880 -91585 -92193 -71319 -86974 -285559 -389839 -350973
23759 -350973 -417825 -470288 -424298 -303642 -123935 -105519 -136745 -81500 173677 223589 186783
23748 186783 46401 102391 6284 99279 106165 -122035 -304652 -257942 -163236 -149673 -91327
23737 -91327 -98164 -67342 -64756 -197395 -119784 -66426 -39671 -98637 -36850 24529 132090 249128
23725 249128 253186 81834 -23586 27318 -37032 -132834 -344871 -260897 -41092 30081 231403
23714 231403 339508 294990 249333 273027 282205 80201 -168461 -70456 86072 211531 272904
23703 272904 154373 124380 -25657 -145880 -151859 -193361 -60240 141347 202614 129214 49217
23692 49217 92942 -16874 -63481 -14804 -159041 -114914 -58713 -51722 128907 248867 262037
23681 262037 122109 12815 -142173 -272688 -236899 -168975 -165405 -301687 -203463 -16970
23671 -16970 190695 206107 207033 353849 191084 62421 48652 193046 340116 156252 -228330
23660 -228330 -169373 -40971 -42642 -169513 -193669 -279633 -316707 -339676 -300189 -337851 -274271
23649 -274271 -151213 -53447 81398 204630 54226 70354 94529 154198 3311 209957
23639 209957 386059 226699 56586 -79702 97322 122652 93443 13561 -32442 64181
23629 64181 135152 -22379 -41702 187121 280712 183021 152055 106478 -25679 -110082 20563
23618 20563 75775 103327 42194 -17050 50008 130678 103299 61317 40769 72879 -7814 -124453
23606 -124453 -149942 -304938 -185228 -68929 -107423 -402985 -678362 -516170 -204894 -270077
23596 -270077 -194092 -82361 68622 110617 162458 108387 -116409 -129370 -28209 82278
23586 82278 69385 -19616 81188 66061 126925 -36716 -34288 5144 -19808 -103904 -71231
23575 -71231 202807 325757 134247 -121012 -126067 -55491 52918 83570 25703 7422 63858
23564 63858 -46594 -132954 -238190 -72923 118522 82874 67356 121184 75100 -10217 -100798
23553 -100798 -183539 -309751 -205409 -103324 -108075 -143203 -278792 -276016 -306314 -219924 73182
23542 73182 14968 -14286 44748 4700 26390 86445 15914 -6950 -2448 -63641 35834 127071
23530 127071 74944 124400 186257 285411 215728 107819 -52495 -57698 55815 -81504 -50154
23519 -50154 43164 -81556 -167148 -171605 -198539 -106206 -66209 -63555 -62616 18639 23322 -230944
23507 -230944 -287238 -90464 -7725 -54649 151294 -69811 -329359 -362002 -105258 -74964
23497 -74964 -140256 -264988 -252698 -182908 -104501 -148562 -115051 -53025 105061 65710 52630
23486 52630 12818 -88187 -95863 -34867 42501 -7805 -139565 -11483 -72380 -155368 -74845
23475 -74845 56780 69380 -116133 -243678 -102309 44572 108102 90788 -37954 11009
23465 11009 23746 -46152 -89493 -24679 22522 98504 -9780 26329 101991 137044 82346
23454 82346 45103 20728 20866 -51196 -81718 21433 -22625 129647 143748 67940 -24233 8874
23442 8874 6289 85969 234484 333948 191904 235391 219507 241243 269413 211810 9341
23431 9341 -137067 -192862 63269 198883 196872 202541 443707 302848 62916 -16219 -99754
23420 -99754 -250871 -241419 -158584 -152284 -117309 -31203 136032 41280 -35369 95878 201299
23409 201299 276659 339491 307778 303416 241470 122759 -60331 -71413 -16201 52254 160625
23398 160625 327369 211150 145995 120947 153136 -43464 -182045 -126920 15466 59504
23388 59504 122020 61232 -1506 40472 88071 70559 179513 228194 95936 43775 -77210
23377 -77210 -232484 -235945 -291977 -236245 -145141 -139144 -151633 -196148 -272923 -399204 -296434
23366 -296434 -130691 -174087 -264428 -171733 -148859 41596 128808 -2291 -159618 -76149 -49344
23355 -49344 66142 28554 41591 51876 112062 106684 90467 22020 -70161 -78093 -99979 -138391
23343 -138391 -20909 -31617 -138895 -168220 55281 111859 39736 -809 -9086 28298 47855
23332 47855 120854 54678 -5059 -22370 -30930 -23735 -16149 -129598 -27071 55217 99060 221117
23320 221117 207655 84815 -13599 56701 -122233 -239379 -287154 -176330 -90527 -118068 -149181
23309 -149181 119860 196715 102371 -32886 -180951 -181549 -52111 -103671 94814 239292 45262
23298 45262 37132 77482 7236 -12264 -148030 -256119 -158539 -24081 -139711 -127913 -151616
23287 -151616 -237532 -212296 -381511 -377101 -245700 17530 189356 105398 52310 30494 176357
23276 176357 193927 157803 111304 -56897 -51588 24407 16188 51373 64633 -82652 -105402
23265 -105402 -118945 51867 9528 38001 -86860 -97949 -49943 -58043 59825 162715 1316
23254 1316 4520 113221 112631 83578 -86642 -148691 -146459 -30754 65166 8191 40471 84118
23242 84118 -9327 -181005 -237928 -44413 -106203 -159383 -35924 45774 30357 -52168 56168
23231 56168 188365 60719 -23761 7344 144756 205225 173500 146057 51558 172584 165268
23220 165268 91933 12568 -59675 -145968 -303753 -386653 -322210 -113301 78552 194924 71671
23209 71671 -4910 -17582 -31081 -100361 224126 411424 390127 200980 -18106 63167 -19855
23198 -19855 -58824 -79505 -39245 -87718 -42018 115185 89130 -131043 -262502 -238095 -157744
23187 -157744 -85113 -103910 41086 115006 67174 3716 -72633 -47535 -101109 15703 212115
23176 212115 240058 19433 48357 7876 -52396 -14109 -1908 5899 -324540 -387195 -199462
23165 -199462 -160085 -256267 -238585 40018 178804 155141 139011 14454 -19055 64741 -48507
23154 -48507 -191312 -214611 -118610 -119077 -48181 -70182 -72746 -180930 -314629 -299279 -269849 -173078
23142 -173078 -67098 -115369 -34300 36942 96340 147820 81372 51005 53036 152174 234783
23131 234783 239994 225107 185227 1659 -13787 -15949 -62590 -59145 -79970 -155667 -183947 -272418
23119 -272418 -162169 -52405 -111088 -245052 -304054 -166400 -110660 -121979 -53600 -186316
23109 -186316 -363548 -360234 -238409 -347094 -400364 -178198 -159770 -174363 -142293 -127230 -93803
23098 -93803 -192651 -459959 -610181 -480974 -245011 -57465 -93618 -108865 -180754 -30441
23088 -30441 27806 19345 246592 415949 266774 23892 -142874 -310800 -376038 -263224
23078 -263224 -74492 -27024 -172093 -227570 -194115 -179807 -275919 -256279 -155596 22987 26148
23067 26148 -43540 -106947 27167 106451 52401 -82556 -193641 -304668 -384444 -225614 -26084
23056 -26084 -74423 -105831 -34815 -32293 133276 196965 2357 -127357 -311813 -257856 -77632
23045 -77632 79945 124531 109987 161993 160799 144141 205775 45099 103581 203144 195124 158640
23033 158640 171064 239329 229859 34846 -48069 -115453 -216324 -308451 -405587 -396833 -332656
23022 -332656 -245812 31327 362263 417314 256096 265216 254394 225622 117514 196974 237047
23011 237047 52506 69985 -59981 -84804 153667 33575 -93757 -107471 -72937 -123335
23001 -123335 33315 85086 114381 78563 133314 124794 233145 280847 70178 -93382 32557
22990 32557 98037 -41777 -77921 -165536 -195686 -154200 -248333 -178806 -18806 -127633 -137493
22979 -137493 -29482 -14679 -184148 -226234 -128955 -54857 -49078 80440 153974 85582 -2013
22968 -2013 -67008 -91037 -151530 -126277 -197678 -198424 -34339 141709 32351 -189467 -154068
22957 -154068 -93786 -236347 -227453 -84884 32244 -59372 -272042 -200810 -130926 -74425 4566
22946 4566 32588 -61548 -96092 -159666 -33968 150971 269235 278410 162283 206693 158234
22935 158234 94666 -37364 -30927 59617 122280 153885 171089 203895 289156 309131 271454
22924 271454 326394 286142 298015 156751 141645 102572 -43156 149740 146018 119198 209433
22913 209433 197119 186327 305632 289613 216691 212190 175440 149263 33975 -151476 -83377
22902 -83377 -65570 -3709 33225 4671 -85705 -92632 -146603 -152305 -22137 33818 181909 82206
22890 82206 -16324 73816 157839 150357 88775 -9003 19775 35390 -36990 -162644 -134615 -228937
22878 -228937 -273643 -284401 -185732 -261122 -334529 -358751 -354195 -295964 -299579 -168467 -160585 -81509
22866 -81509 -148657 -71310 -177280 -100109 128323 288159 222360 398062 529795 551251 439508
22855 439508 300378 180455 113842 -53312 -71875 -59620 34230 193404 129739 78809 118813
22844 118813 -37484 -296865 -345084 -35602 56432 106501 130018 55928 -41654 51771 146341
22833 146341 82877 -19754 64254 143336 123005 134105 336172 252047 164761 137462 258982
22822 258982 74626 -105811 -145404 -122892 -94250 -175024 -140505 -226911 -185082 59718 86114
22811 86114 52220 11056 -201049 -179392 -45931 66179 64689 -21433 -97066 -6597 -23591
22800 -23591 -40551 2891 -41420 -235131 -332348 -342901 -269131 -204011 -271141 -117268 -92599
22789 -92599 52781 54616 42711 -7506 -13903 60063 12639 17527 -204452 -296783 -330449 -249265
22777 -249265 -32205 -121182 -275770 -222064 -270908 -353992 -301855 -72328 41540 -32603 -108708
22766 -108708 -84498 91449 152878 288135 167552 55388 77101 -10895 -132623 -59696
22756 -59696 16572 59497 528 -120164 -61654 81910 249991 149671 139499 50263 -22156
22745 -22156 12767 96401 94222 63194 36954 32516 -52598 -143572 -320620 -242820 -127348 9178
22733 9178 55887 -23427 64760 77011 -60663 -125245 -428 22787 75225 -76784 -375795
22722 -375795 -370380 -125316 95088 212601 226185 109258 -157903 -118258 -77972 -45028 6103
22711 6103 -169694 43593 21422 -39695 -84093 31542 -60632 -166081 -221570 -134884 43773
22700 43773 171467 108185 23995 95709 84026 -30777 -96126 -123263 -33751 -26937 -154402
22689 -154402 -124105 -101775 -157550 -200079 -71116 6802 -109925 -233436 -274615 -358059 -186476
22678 -186476 -12795 -186657 -154123 -72525 -67648 -45446 60846 91343 10834 -59577 50133
22667 50133 196414 12521 -8440 132933 149799 227269 155429 131775 147307 206550 173915
22656 173915 76539 -186638 -95599 -106997 -111743 -66840 -84759 -15039 -16227 15251 -3070 96065
22644 96065 165805 332798 314629 37830 10922 22090 8832 -72539 30401 -11402 143385
22633 143385 160316 99711 134512 -6224 -305481 -328523 -58060 177251 342245 274664
22623 274664 102016 91992 120735 24408 73629 22177 -101091 -261360 -281699 -224596 -136170
22612 -136170 -212202 -398023 -293345 -161692 -37219 119135 134180 -31783 -125973 63921
22602 63921 99575 50474 54099 107601 -38246 -111663 -121328 -158344 -282579 -246353 -128083
22591 -128083 -63027 -215666 -265062 -181212 -105337 -144803 -88251 -87594 -151565 -80944 64973
22580 64973 104888 124172 -175814 -326322 -187620 -52990 36158 5358 -59766 9049 60068
22569 60068 225915 291332 222523 140914 -124592 -105887 132195 154836 -41643 -138805 -149912
22558 -149912 -74446 -126431 6366 -107568 -236303 -207230 -239987 -194838 -102195 -230477 -188077
22547 -188077 -102745 -269191 -326363 -264150 -331580 -259668 -225544 -231736 -241165 -217628 -197242 -186101
22535 -186101 -221680 -182493 8753 17702 184030 257907 156359 92974 83419 137035 143753
22524 143753 31593 17627 -160462 -130200 -121987 65874 252692 144813 75299 40014 -16270
22513 -16270 90603 -89867 -74196 -118186 -137050 -140710 -299929 -432682 -313737 -83031 -122159
22502 -122159 -306011 -239010 -10948 65479 32805 -60084 -176559 -237281 -135722 65322
22492 65322 63224 38395 88668 -77733 -51051 -44619 -14016 -26746 -63631 18615 169270 -21808
22480 -21808 -79017 -164930 -56928 28539 18302 38292 68230 -10196 4745 -4741 48611 86307
22468 86307 49788 55564 -131749 -153580 -159723 -126287 -105050 17013 92619 68009 -161029
22457 -161029 -130437 -147046 -492 33596 -153822 -205973 -183772 -282360 -215502 -246847 -156673
22446 -156673 -156865 -167748 -187435 -25442 87315 -45687 -178991 -18369 -13300 -41895 24003
22435 24003 -63873 -79165 -9904 -60383 -32061 -76426 -82544 58546 71785 135318 87342 100361
22423 100361 75156 12614 -132700 -111067 -204057 -314931 -262975 -196332 -208966 -299155 -160546
22412 -160546 42212 101101 41430 141883 195320 122694 151704 167478 60116 -97359 -207440
22401 -207440 -266997 -211686 -122582 -14620 -84006 -100775 -128236 -128312 -244211 -324798 -349365 -138134
22389 -138134 9124 -38590 -110103 -84657 -104938 -29424 84779 176574 110017 -24953 -9105
22378 -9105 70310 223708 68055 58009 -55304 -118932 -213667 -224266 -188517 -75130 -169160
22367 -169160 -168796 57312 82311 107741 260417 266023 158814 -39657 -135071 -57388 -203417
22356 -203417 -231157 -190241 58686 132944 67204 149649 164338 5606 -171144 -252756 -116592
22345 -116592 -104381 -70634 -88352 -54059 -124381 21481 240428 347004 299874 141488 48270
22334 48270 213716 356004 296263 34638 -102141 -140841 -74818 -102166 -50942 5290 112287
22323 112287 130035 59877 40691 194066 163148 -5802 -224628 -105352 -87035 -130928 -196920
22312 -196920 -189415 25270 107996 15243 44930 2878 -186060 -394907 -207336 -198326 -373344
22301 -373344 -275821 -61697 24215 135063 73357 156971 141860 40309 -42885 -124883 -8315
22290 -8315 81949 39868 17356 178742 125181 -118452 46136 263731 137409 166033 215987
22279 215987 142625 62924 -21337 -33794 89324 213359 58067 -110833 -123709 -94206 -88259
22268 -88259 -67067 103307 81224 173894 78240 -209235 -401724 -378766 -300601 -91431 -7049
22257 -7049 -24130 205 -10314 43348 98073 -112883 -61371 -83046 24304 185392 278467
22246 278467 157640 -16335 17394 33720 36090 45883 36183 59358 92397 -19269 -17861 213766
22234 213766 190427 -154048 -309278 -240530 -154824 -263532 -240392 -167216 -116064 -150204 -192120
22223 -192120 -220225 -381958 -350659 -254343 -272250 -332623 -77658 -32485 58524 112519 11785
22212 11785 -13382 -75212 -82772 -137280 -184102 -31958 61278 -158883 -324006 -348411 -158168
22201 -158168 -114402 88689 33575 -52252 -164087 -71699 -17299 -8376 21092 -47344 -110970
22190 -110970 -94401 -95760 6967 942 -54252 -94956 -69858 -62995 -35427 -66213 -101605 -29041
22178 -29041 -91070 -208295 -188156 -14258 -30734 -107809 -151672 -90744 1589 27865 -123054
22167 -123054 -125729 -74450 -9200 115242 126336 -73420 -135094 -157068 105533 95507 74370
22156 74370 47590 -69038 -16928 25815 96952 41893 41646 -74495 -57702 111139 139254
22145 139254 -9329 -65078 -60919 -191771 -255442 -178722 -215388 -486434 -432226 -253631 34060
22134 34060 -55152 -66030 59106 56438 -124767 -140060 -143089 -91889 104307 201274 116679
22123 116679 175786 209011 74647 -56096 -147006 -300863 -289140 -155106 -45790 -129936
22113 -129936 -233840 -164801 3028 65785 106173 68592 68759 98742 14443 -166420 -85636
22102 -85636 -94848 -170508 -172609 -149680 -44303 -78545 18392 -63508 74570 114409 96245 72116
22090 72116 144141 208940 73484 -96830 -233522 -524544 -506120 -302633 -332593 -271107 -209424
22079 -209424 -64129 -91733 -63452 34271 -113351 -146603 -113164 -196445 -124363 -104854 -103717
22068 -103717 147561 167324 76784 11522 68227 14844 -67098 -32833 -86008 -61214 52463
22057 52463 64656 202006 246432 235005 305500 278785 69930 -89538 -54753 64613 227730
22046 227730 364137 358266 324810 138620 136289 236729 159671 -25099 -81501 15731 -90493
22035 -90493 -219111 -195888 -63517 -36751 -49929 -2090 -27025 -107842 -53044 48491 95292
22024 95292 -57811 33904 27650 8061 -177159 -191575 180271 183303 -228871 -427696 -318667
22013 -318667 -149712 -124973 -50296 66152 142702 112925 -40462 -105594 95283 125089 -34731
22002 -34731 -29525 -116090 -226813 -256571 -235308 -1081 144144 173071 57041 -66374 81124
21991 81124 97423 -84856 -103995 -71393 -63739 -86451 -114250 -127674 -46341 -127000 -220388 -261900
21979 -261900 -240582 -163975 -42780 24335 107759 56704 -74681 -59312 -30324 -47855 -122666
21968 -122666 -161673 -83070 -26181 -72390 -22223 -27784 -31879 -179310 -153394 15303 9470 23296
21956 23296 -6803 -91535 -177195 -135697 -84810 -308125 -347821 -361371 -143844 63473 19861
21945 19861 15235 62770 95950 56961 -19962 -351687 -503414 -386365 -218996 -252088 -169848
21934 -169848 -44347 -137157 -122040 -262174 -145724 41356 184942 135848 -37047 -106987
21924 -106987 -76674 11698 -60308 29691 253066 299914 205235 174606 169662 8625 -121491
21913 -121491 -155259 -160147 128727 222944 216546 76491 -86960 -58853 -18336 -158328 -218051
21902 -218051 -89443 5758 120820 198020 -107904 -176095 -25685 -61151 -126966 -100560 -121031
21891 -121031 -145050 -158699 -146257 -121853 -123985 -38674 -25339 -92212 -269936 -234519 -228427 -173037
21879 -173037 -247735 -245465 -149330 -41932 -93728 -121443 -171513 28315 269446 224918 52648
21868 52648 -34492 -92435 -94343 -149617 -266449 -197815 -212759 -271132 -300327 -165582 -11290
21857 -11290 71708 -71153 -13842 -183851 -143131 -36800 -146107 -112110 -174467 -208385 -184500
21846 -184500 -25277 9301 -22872 -42674 -135314 -84469 68547 148040 138033 154056 26372
21835 26372 -166153 -149693 -34314 125169 93850 140527 206675 257196 325577 189352 -92571
21824 -92571 -121520 -90948 -110774 -29949 81024 4224 -119174 -246083 -282162 -293140 -133282
21813 -133282 -180687 -267661 -218368 -180579 -199826 -130645 -128805 -147195 -20424 -117461 -111222 -49923
21801 -49923 8613 -49729 -171117 -259203 -317378 -342222 -358549 -316119 -178959 -72969 38075
21790 38075 -80840 13880 -211653 -291718 -180513 -341 -108668 -348397 -199946 -105452
21780 -105452 24830 66907 -132262 -183307 -170702 -58620 -19135 33426 -116089 -194698 -204270
21769 -204270 -262053 -119836 -60284 -83780 43015 251095 284517 120217 161711 182287 20164
21758 20164 -92134 -189367 -200439 -161715 -242703 -226185 -171843 -200593 -75404 -26721 51433
21747 51433 10239 -34670 -221762 -255874 -294719 -209264 -139711 -67076 6002 -58957 -170686
21736 -170686 -164042 -264529 -223772 -163512 -213037 -224484 -156225 -92788 -70926 15678 -25546
21725 -25546 -82170 26949 132383 146361 163808 -8977 -61430 3033 -4870 -15988 -45352
21714 -45352 -71788 -62071 -110292 26711 137405 -16695 -242634 -247541 -64509 -196157 -304849
21703 -304849 -334552 -284938 -301503 -308440 -217859 -158035 -150137 -226739 -287179 -200561 -26814 209690
21691 209690 32321 -95729 -64933 110490 114594 69276 64439 15500 123810 93648 247792
21680 247792 250329 315737 199061 60779 -46909 241 50823 31148 -58003 115010 132262
21669 132262 211504 144229 8603 -197150 -293486 -389385 -387289 -289388 -61379 20603 57540
21658 57540 8347 -81591 57315 78924 72951 99797 -48172 -57835 -14841 9329 -139805
21647 -139805 -133374 -101499 -194497 -24011 134818 -5271 -86991 114388 203898 227817 167719
21636 167719 107297 219972 272451 254791 263726 185973 76425 17415 -73409 -70746 214
21625 214 -45584 -183153 -132407 -66078 17561 90386 40215 -44807 60888 48576 -201815
21614 -201815 -318980 -338099 -198011 -222524 -184869 -262918 -42227 -158766 -250915 -150281
21604 -150281 -220027 -139507 46824 44388 41457 8790 -16687 -179589 -281174 -61820 125085
21593 125085 -11866 -89940 -46122 -171228 -115785 -65569 -189377 -113927 -200739 -258959 -168224
21582 -168224 17031 68535 -12328 -136048 -179409 -186011 -119378 106431 88764 -103738 -203645
21571 -203645 -317669 -221807 -100776 -149633 -131496 -206403 -244586 -111259 -124651 -109990 -98225
21560 -98225 -196561 -250975 -194521 -99397 2388 -123314 -471 12776 -64963 3774 -114335
21549 -114335 -183522 -107762 26810 664 -143404 -278491 -264826 -208366 -193754 -115076 -133221
21538 -133221 -91713 127005 322625 346579 189828 22583 -116497 -29949 61123 -46294
21528 -46294 -157924 -264824 -253599 -72745 -3074 51635 -80568 -154465 -54182 -74584 -99237
21517 -99237 155825 71411 -102034 -68310 -34711 -73807 9074 78187 -112593 -285246 -170515
21506 -170515 -20076 101493 234719 260987 118762 223415 301376 169511 8724 191430
21496 191430 196329 136231 100519 60395 9412 -154608 -241689 -303382 -285782 -145691 -175625
21485 -175625 -395843 -452297 -310507 -113108 -95084 -182835 -188217 -216215 -211558 -210040 -189767
21474 -189767 -184428 -223834 -300759 -314076 -95934 6228 86306 116957 223975 278411 236604
21463 236604 161736 218680 182424 -48601 -162864 -165403 -304090 -273224 -406924 -238081 -20835
21452 -20835 29352 93703 38224 82626 45464 -11410 76910 -28456 -143054 -124044 -94979
21441 -94979 -75526 89137 181721 82399 39942 165769 158363 226493 79107 -218250 -249296
21430 -249296 -103090 49221 64443 171161 264103 295936 336374 402459 148770 26663
21420 26663 -149481 -405655 -248629 -111893 -160722 -252444 -343364 -209145 -128468 -134409 -55677
21409 -55677 22939 4012 -33089 -17104 -54711 -222044 -127316 -180645 -379789 -384553 -254195
21398 -254195 -30180 92972 -63828 -55449 65614 45282 -167856 -138822 -89939 -113354 62428
21387 62428 225853 142112 44496 38917 206679 445079 311654 74588 -2236 16592 -6549
21376 -6549 17058 37451 -29902 -90701 -154247 -259106 -377840 -162974 -63718 -52775 -111684
21365 -111684 -126566 -119799 -213282 -104931 121801 226094 223326 217628 64704 -53277 67870
21354 67870 65568 -8795 73447 10066 -47297 -87824 -65625 -102530 -70600 60878 -34745 -208120
21342 -208120 -293123 -178447 -97029 -131742 -210857 58772 144573 44109 131391 211221 117426
21331 117426 148201 38918 -55814 -240171 -118603 34799 -57709 -33099 -26121 152328 230329
21320 230329 207559 123662 150292 341196 440602 240482 246220 145383 116030 132891 76475
21309 76475 -22735 49992 -51437 -88138 43678 57537 15957 -59602 53421 160892 166328
21298 166328 79701 45678 7172 -39436 -3723 14300 -69874 24123 40329 -98797 -26725
21287 -26725 3384 -64374 12293 118031 23144 -69168 -113886 -288457 -204737 -67048 8419
21276 8419 -73752 -169957 -81660 36378 -8683 -78309 34222 49681 -149488 -172117 -41599
21265 -41599 25351 -48586 -28835 -66125 -15795 135604 183455 -37673 -44155 131888 219391
21254 219391 170217 168147 148371 44133 -28426 -7141 68169 159682 18447 -139213 -63648
21243 -63648 26637 -28669 -142014 -131105 -93910 -180259 -182851 -78007 -113023 -132207 -159240
21232 -159240 -84013 19804 -23576 -94516 -164932 -241263 -245979 -271682 -358998 -356812 -123841
21221 -123841 -81788 -116775 -75590 -114820 -102394 -14150 31137 -14656 -17828 72144 143616 53702
21209 53702 -14612 33612 88148 223677 121202 -43599 -247537 -377244 -301213 -84040
21199 -84040 -75249 -33274 79247 197391 203982 46785 -132972 12708 138663 188869 389929
21188 389929 421417 376581 326804 219785 138085 93749 -6779 7789 -4086 -220196 -394498
21177 -394498 -242035 -138659 -256576 -323147 -297195 -175008 52193 210578 -46570 -22952
21167 -22952 133472 153494 39698 141410 212603 24972 -239212 -209975 -90966 133023
21157 133023 51635 117458 222107 152012 176035 161737 163552 210177 -58083 -435446 -347202
21146 -347202 -70290 -77825 -194090 -157234 -143299 -28387 -12052 -40911 -192415 -215640 -245933
21135 -245933 -58231 162403 95644 69622 110147 63773 -55533 -74809 -54817 -95142 -38241
21124 -38241 -4623 -21945 -184120 -172891 -47612 0 27072 -132692 -111461 -243302 -321649
21113 -321649 -236415 -170330 -104458 69531 88280 4593 -34750 -21666 -113493 -153175 5008
21102 5008 -118585 -125534 -99211 25660 31010 136745 132211 60609 64670 -110727 -118638 -181875
21090 -181875 -358470 -452397 -393398 -115681 24526 5256 -30020 28709 31282 -16315 -24103
21079 -24103 20051 69015 -39414 133968 179339 116312 -54979 47955 103937 66909 121752
21068 121752 127224 50180 -41997 -68169 -52130 -68820 -105983 -269734 -240155 -283324 -390160
21057 -390160 -393828 -278876 -108035 -57457 -126848 -148135 -57867 -129432 -169149 -306794 -565772
21046 -565772 -684169 -445652 -142914 10637 98611 127294 144768 46415 188054 327083
21036 327083 269470 138697 26785 -44953 36290 135076 208177 170695 -20888 -123789 -167546
21025 -167546 -266282 -326867 -346607 -344150 -403402 -341958 -365834 -142716 -23802 63481 93745
21014 93745 97626 109648 -36301 -93043 -235132 -174258 46991 88534 32315 11781 -111503
21003 -111503 -212774 -167689 -131860 -153845 -254307 -221821 62575 146088 6999 -70393 -106677
20992 -106677 -59557 -146116 -81202 -90337 -134066 -191613 -242206 -4133 120981 9182 -8130
20981 -8130 -42099 -116087 -78902 -7460 141438 174396 110967 1333 -109869 38410 133531
20970 133531 231321 423097 165347 12157 -42744 -69136 -36657 111078 118050 25160 93989
20959 93989 214282 260273 211759 85754 -99813 -352196 -282502 -196243 -348290 -597955
20949 -597955 -479845 -191666 -8616 62698 268141 123799 -2427 35630 100635 82468
20939 82468 -102130 -67812 33619 121499 76533 4613 -18859 -128427 -236747 -257396 -289456
20928 -289456 -187585 -254439 -268210 -122838 34661 68892 102160 -6764 -104452 -97915 -22074
20917 -22074 -120368 -21519 -136140 -225283 -268881 -185064 -83881 12756 29407 -62869 -35285
20906 -35285 -601 -95412 -158642 -221574 -183203 -113643 -183882 -283821 -68977 86882 20030
20895 20030 -128007 -243174 -270929 -236563 -181843 -113125 -43236 -76998 -85960 83141 222090
20884 222090 213942 -76267 -355154 -346459 -208180 -31612 232231 408808 462941 373419 292678
20873 292678 189850 197635 160197 -86560 -130299 -101644 -130563 -204557 -136242 160090 287572
20862 287572 278747 222137 166271 24651 -43407 -29654 -114955 -80300 -126410 -351724 -273465
20851 -273465 1978 108620 59412 -98321 -250146 -274595 -249570 -210706 -162010 -94088 -41432
20840 -41432 -88828 47903 77677 26270 118276 181641 125431 49393 91228 207547 79247
20829 79247 74924 258644 165388 86270 31159 144811 210458 124297 -14095 -27259 5665
20818 5665 -8899 -133887 -215449 -35781 36357 -95184 -331926 -338561 -119051 13898 178575
20807 178575 276008 225782 71459 29583 112471 127328 240421 316839 485556 704841 811037
20796 811037 772501 870552 864548 1056012 1477256 1622873 1850767 1999577 1757610 1260071
20786 1260071 944606 783162 619351 508363 322842 240301 187484 157551 104035 109711
20776 109711 166662 446192 459782 381865 204539 225500 221091 108069 246518 334691 272780
20765 272780 172611 142984 55141 209298 445412 443905 317149 356220 207535 196788 293053
20754 293053 237548 -2978 -247291 -397030 -315207 -200093 -163046 -177524 -341864 -320992
20744 -320992 -146104 -12843 134351 32887 90352 203779 134295 86751 -20691 -105307
20734 -105307 -142610 -67141 85810 229712 196230 131380 -65592 -32455 -2868 82903 91390
20723 91390 -44010 -142314 -202519 -120803 61542 65351 -20260 111230 93873 898 -36859
20712 -36859 -117476 -36043 56193 22869 111428 214107 167367 190251 132737 85870 33125
20701 33125 -145495 -320735 -342452 -141700 -155200 -231134 -231556 -193142 -126895 -214194 -306266
20690 -306266 -423721 -315724 -221796 -173552 -98731 -64690 89460 177935 137216 42725 67396
20679 67396 159880 250972 126517 104528 73309 25868 -143593 -198191 -128700 -221196 -27240
20668 -27240 116895 109900 66871 147277 25009 68842 135698 76113 -3311 79608 149597
20657 149597 286756 333312 195971 146500 215222 193058 191092 245929 278462 294533 187298
20646 187298 182536 237336 92589 110016 94583 47374 16157 -60020 66525 147186 179264
20635 179264 155374 66906 141475 131459 -12401 -181043 -171245 -131099 -227425 -84064 163949
20624 163949 210989 109738 15585 10415 17958 -7858 -65146 -37063 123454 128314 105722 48180
20612 48180 16115 128730 94229 -29975 140530 152293 147180 263647 333355 204664 -9227
20601 -9227 -24033 75680 123302 36809 -19977 -21157 151853 61480 52209 195034 82619 3787
20589 3787 -134210 -42633 72057 87129 -420 -149483 -262244 -320498 -184846 -49800 -49598
20578 -49598 -84106 -58429 -25503 35967 91690 34259 32446 34062 292042 281431 175931 138888
20566 138888 115730 120883 127157 -54947 -102137 -22252 -46084 140258 21450 -172017 -123035
20555 -123035 -31116 179351 34621 -124659 3625 116161 67387 95798 11848 139424
20545 139424 205007 174905 237151 266788 188170 44436 34586 119438 193386 153666 -38523
20534 -38523 -51584 -12942 62651 213803 208611 172761 197453 140013 59532 89358 111464 93883
20522 93883 76107 182540 244187 232748 240882 59753 -149186 -187160 -102618 -109282 -95631
20511 -95631 -40305 92958 129207 217597 150932 76943 62195 -39193 -216400 -201991 -55525
20500 -55525 -80763 -214988 -362838 -280186 -141438 187950 370355 216204 130509 785
20490 785 42650 172817 131988 37002 33763 -116454 -30709 32045 -2923 34966 125177 69649
20478 69649 54872 -1321 -70613 -200928 -147866 -156622 -168741 -122719 22108 5967 -213133
20467 -213133 -38770 50916 -152113 -290554 -283837 -228986 -284358 -216770 -6890 253916 171027
20456 171027 -30161 17030 210462 201855 76558 16943 -159158 -271737 -110213 69836
20446 69836 171226 101447 8279 -219161 -185199 47198 -56423 -38117 178625 76771
20436 76771 -181773 -181892 -43788 -66274 61557 172246 166314 154565 9 -212992 -226025
20425 -226025 83131 241817 175097 137691 180827 291285 242581 104000 14522 31787 2317
20414 2317 -130439 -156895 -91092 -1301 88075 -77403 -279147 -328669 -287121 -264446 -142106
20403 -142106 118372 215671 78218 -26448 -78170 -194612 12704 119835 61982 35122
20393 35122 -30779 10812 -91315 -245331 -94688 182889 286254 328902 336289 228094 258697
20382 258697 288218 114538 184282 358892 212366 132196 263754 306063 254144 153204
20372 153204 -18128 -153 -9840 -26250 21761 172062 250795 185671 131365 261653 186718
20361 186718 139589 170077 384420 549951 408970 397887 429677 287046 232215 49783
20351 49783 170855 181024 279848 286564 279088 161196 -29643 -29521 76102 106533 102593 97535
20339 97535 167935 206700 151124 173079 40861 -69771 77882 400341 446816 386387 323968
20328 323968 70491 128308 212098 164783 3807 -36083 24468 42126 55307 104596 161811
20317 161811 245553 298578 400697 436821 387246 328553 355533 350302 207664 89103 -77792
20306 -77792 -115373 2485 210792 224011 106432 -23601 -15197 108673 192251 135289 23655
20295 23655 35486 -87378 -69807 153594 351897 322908 240205 244979 185688 106499 214474
20284 214474 318634 265634 174850 191285 153790 105225 103749 294167 203815 137699 279413
20273 279413 305713 254471 244951 338664 403740 287113 213402 179455 128534 181164 269907
20262 269907 265672 192901 172492 386249 605717 454838 359097 387065 381322 510860 637783
20251 637783 866467 886214 816855 716171 555675 481343 364703 279345 269490 272786 304056
20240 304056 374503 383608 470730 501613 440468 349497 354228 586001 572045 450159 308838
20229 308838 368332 307832 71805 25372 103181 263868 436414 397509 458875 515368 360920
20218 360920 311065 359857 585583 775271 781281 838448 883644 767064 795296 803488 798484
20207 798484 883242 890421 660858 471816 495212 677588 685778 823733 888207 759281 714023
20196 714023 859635 973097 1024695 989452 1030972 1072074 1179455 1290775 1254141 1246597 1461666
20185 1461666 1643900 1667553 1682958 1646719 1629304 1703930 1794984 1839856 2070000 2278430 2492649
20174 2492649 2642404 2716409 2760496 2905712 3260827 3608135 3799501 4093685 4559111 5043015
20164 5043015 5481154 6000106 6064809 5879290 5791000 5746860 5610141 5615959 5732882 5944456
20154 5944456 6323397 6667846 7131551 7456485 7807453 8420958 9120310 9977506 11055111
20145 11055111 12286472 13775271 15452787 17399286 19731855 22556702 26021154 30630160
20137 30630160 36504752 44074645 53914098 66393958 82651656 103514103 130616611
20130 130616611 165898780 210963276 264338443 316540030 350554327 352627884 321233219
20123 321233219 267280916 208787688 158890600 121365117 94207162 74477778 59718792
20116 59718792 48914931 40675117 34408311 29529172 25598744 22589249 20250084 18116183
20108 18116183 16264950 14667062 13316505 12180550 11119416 10276850 9692565 8997164
20100 8997164 8581257 8545453 8434224 7938346 7355894 6991778 6874934 6852633 6735483 6875483
20090 6875483 7340938 7692043 7888423 7681899 6980491 6053221 5340211 4768019 4086306
20081 4086306 3661489 3376329 2983663 2686203 2633116 2443231 2186246 2057566 1961280 1903199
20071 1903199 1763285 1736950 1803335 1809970 1879892 1949031 1855033 1695495 1659890 1649395 1810342
20060 1810342 1746892 1465604 1445854 1437638 1270113 1233608 1101675 1037177 1106134 1037114 974745
20049 974745 1026731 1144742 1039154 1052599 1068904 1135500 1166643 1123075 1004554 962009 993945
20038 993945 1080474 1076508 1041639 1049361 932683 830169 814905 916229 796776 654890 629053
20027 629053 672615 621573 493792 515087 606824 663773 701738 667931 553587 499343 692956
20016 692956 893026 1056954 1174367 1266231 1257825 1166100 1327633 1828387 2387839 2771411
20006 2771411 3418328 4448432 5557018 7063457 8746418 9641968 9006452 7284131 5465602
19997 5465602 4194005 3219994 2576506 2040325 1774783 1435154 1041018 1048102 1050061 1023101
19987 1023101 1025318 923882 813147 773310 843815 752170 632683 692450 456343 489164 399124
19976 399124 536117 581098 612030 600886 496064 371210 427555 504887 524861 382464 305073
19965 305073 480449 557522 434177 342740 494164 493002 354757 292793 415327 286523
19955 286523 240135 186210 170010 217995 273892 299762 373354 297887 314679 316884 187994
19944 187994 197248 126820 157058 173480 123458 102165 249001 272991 204649 301431 445627
19933 445627 410235 264224 217972 110759 -38561 117901 155623 230118 295386 268798 271678
19922 271678 211032 194597 155187 182220 147195 232736 206182 110454 12249 2870 44181 115050
19910 115050 113314 -21505 41607 88953 -36200 -190298 -108606 -144100 -141764 -982 36154
19899 36154 113630 216020 254270 289769 236552 201119 226100 70665 -216995 -182286 -66526
19888 -66526 -7161 89581 145440 165962 165665 182217 138606 238798 238937 302528 327831 281311
19876 281311 213974 243535 331799 329408 190596 175198 244839 147158 -43661 -110836 33740
19865 33740 47172 8659 -36837 -109879 -88373 -79991 96551 229064 45584 78573 161515
19854 161515 285937 380661 335540 293145 266864 151107 115538 231996 178594 153282 101770
19843 101770 142695 182747 54769 162395 302617 281688 181524 294675 263212 225907
19833 225907 153934 75168 12564 142030 148615 69864 11369 33543 -123072 7267 82067
19822 82067 1077 70169 -22144 -142878 -119293 17401 16421 -52329 74530 236114 336714
19811 336714 394067 381084 315426 87152 127992 234051 313404 347291 308571 214197 57193
19800 57193 110551 293034 378103 299244 172779 332635 161334 1571 66575 262547
19790 262547 237638 264565 288669 124476 -122424 -205684 -168089 -160067 -112846 -42955 -24440
19779 -24440 -3712 -120431 -164876 -165829 22973 201438 166569 43154 79395 68338 109361
19768 109361 56872 145118 310528 184527 75004 50060 100080 56520 50607 -98916 -198730
19757 -198730 -213091 -194812 -205964 -200216 -125692 -103431 -34300 51340 48991 36498 -86531 -56938
19745 -56938 63207 103287 -24267 -63526 74890 -28648 82876 201365 274666 321821
19735 321821 134838 -148541 -182846 -124014 -60740 -130130 -135020 -132093 -159115 -60726 140664
19724 140664 155327 182728 321496 258297 128586 84093 84578 126265 138208 237503 198273
19713 198273 100044 113776 72585 -127428 -69612 143929 272238 348199 211740 172734 165533
19702 165533 160940 228394 329820 235514 157511 234274 330160 276563 102489 202415 86941
19691 86941 66525 180509 279297 269380 231413 258242 439344 485676 382433 202440 67047
19680 67047 34280 89533 170676 225583 188735 150166 174589 184114 136336 15293 92576 225272
19668 225272 224795 275102 279124 206789 268 -91771 -160004 -193143 99093 214190 249688
19657 249688 228321 214187 343405 339343 301323 276210 371471 257467 175862 216621 381565
19646 381565 460072 318314 258190 462051 553214 501729 544260 574283 462866 369449 163846
19635 163846 184074 284011 317175 348822 449354 600998 502478 355385 321050 216204 237955
19624 237955 100540 140343 67096 141063 148798 51121 69022 196358 346304 373577 325776
19613 325776 -27 -162008 -218706 -194045 -185133 -43717 -123347 -59248 -22910 -120691 -24379
19602 -24379 83786 175779 262520 245631 79036 -45483 -106193 3917 217857 252051 321145
19591 321145 299812 359765 324786 418981 542741 558428 470611 477986 580560 702089 696194
19580 696194 582706 448729 410016 326713 347243 243253 121612 263599 373053 399813
19570 399813 407850 402870 384386 328914 436972 538354 596182 676642 623027 600091 628687
19559 628687 539405 475335 505423 451694 358502 280458 250955 174510 325488 459532 394797
19548 394797 500651 519695 457695 421491 468933 569524 621721 639822 634627 465148 523168
19537 523168 567300 714081 592029 508125 522809 655749 634755 658625 752782 713243 659115
19526 659115 639778 505762 467735 278818 238223 287181 206774 251855 405760 693927 888038
19515 888038 885278 665544 579888 740177 865031 817009 792357 901571 1050618 1000669 1115673
19504 1115673 1233725 1210302 1207784 1165415 1290699 1416366 1488353 1546950 1544610 1823211 1839005
19493 1839005 1789231 1624114 1508475 1677880 1641677 1718211 1857682 2071638 2289244 2479902
19483 2479902 2757826 2802568 2995613 2994460 2965872 3157183 3381638 3688873 3823877 3924364
19473 3924364 4042681 4274960 4391440 4527997 4800948 4935645 5104352 5128332 5509553 5927144
19463 5927144 6251602 6654496 7340523 8301552 9169233 10076137 10951346 12052977 13060880
19454 13060880 14103382 15338005 16500173 17774895 19050307 20592172 22793282 25569277
19446 25569277 29082171 33869639 40247836 48340764 58698677 71856220 88760517 110454417
19438 110454417 138253880 173669691 216958840 264253159 305594659 327252100 320660027
19431 320660027 287543434 238856708 188760023 146420886 113706232 89568030 71840589
19424 71840589 58612763 48370062 40519889 34620635 29952574 26403799 23512190 20921108
19416 20921108 18858893 17063146 15702954 14870420 13998878 13015049 12070699 11338321 10758192
19407 10758192 10042606 9264079 8587932 7857456 7282167 6921545 6335134 5815183 5412479
19398 5412479 5141967 4871044 4604900 4382343 4460029 4567839 4417369 4135739 3760914 3286173
19388 3286173 3107490 3034579 3043947 2983916 2945532 2866207 2782004 2742520 2620102 2495633 2296838
19377 2296838 2282467 2194869 1813729 1514751 1261093 1180895 1132780 1132672 1143016 1249249 1264095
19366 1264095 1255821 1346066 1382180 1388846 1401248 1381131 1218450 1033488 1021180 857043 860609
19355 860609 937430 1011724 1080393 1200161 1201143 1095727 1022073 1012920 1001461 1072519 889722
19344 889722 715538 545446 417504 646099 808990 870619 928917 918162 973516 825329
19334 825329 796773 988951 970637 934888 885389 754020 704147 644379 521076 358608 420252
19323 420252 551716 441166 367611 442870 485707 612524 626583 548669 468433 325871 397817
19312 397817 682390 729622 543227 555387 522997 418273 502814 445759 392121 486694 539878
19301 539878 512223 556033 562663 592962 723078 761322 808357 832268 1002270 1035757 954741
19290 954741 831335 915202 989812 914201 733608 776483 635020 599631 711947 829621
19280 829621 872465 1073080 1249345 1296385 1124256 1057801 1005306 879660 732050 810761
19270 810761 671269 366580 126085 201407 365819 390076 338088 253446 156291 10335
19260 10335 173066 241087 327343 336008 209207 162412 134435 176319 343519 379982 375911
19249 375911 395482 393460 413992 643746 744160 805022 860215 745223 762616 979579 1330626
19238 1330626 1581150 1633874 1554893 1291029 1045349 875791 894742 927969 1043852 1072953
19228 1072953 1133597 1172434 1070454 923153 932470 1096110 1060447 887281 736119 741274 621204
19217 621204 479230 485489 572179 740062 579377 421071 467218 629467 639749 611064 527678
19206 527678 487173 343693 165230 104644 205583 314539 388902 323958 165544 179073
19196 179073 335189 392770 481087 330777 349528 398646 248284 273652 273631 254736 279599
19185 279599 -10371 -77109 -28514 -2816 126198 198686 75737 -49542 -44439 32176 33021
19174 33021 -146879 -196155 37268 120804 113237 137979 158625 154189 280693 100851 -74120
19163 -74120 -252132 -200063 24167 107073 46359 -28821 -20204 163309 25248 -25245 87442
19152 87442 226457 11084 86108 345532 329750 213352 247850 169967 108938 231068 286220
19141 286220 370336 254514 158759 201592 138202 243430 -21438 -161186 -3664 65028
19131 65028 168662 119452 21066 13605 45768 -32388 -138423 -151959 -336202 -459148 -302876
19120 -302876 5332 252811 288914 236945 195644 205975 52841 -246265 -246225 -235528 15312
19109 15312 66624 -184516 -166634 -77132 -50449 160133 408494 486517 403747 514375 448448
19098 448448 144526 88080 385541 425950 529458 510990 372463 386360 376604 349169 267376
19087 267376 342796 375773 391841 476774 419530 223601 58252 -33495 -149088 -101380 12716
19076 12716 16088 55121 218273 255474 283004 221023 73112 -95753 -112765 -50318 128020
19065 128020 146594 184458 158620 110268 137853 72508 85421 90246 171369 92673 152950 191950
19053 191950 336712 328759 289119 279794 258510 626185 891307 965013 797542 649402 915473
19042 915473 1077075 963358 1075788 1138124 1109106 1170243 1145079 1069804 1003373 1040397 1023983
19031 1023983 880763 896228 955499 783695 677318 424256 294577 299370 258132 613167
19021 613167 644849 581043 610286 556368 436041 390156 342578 243906 337104 298966 37162
19010 37162 135703 276415 373269 393375 349860 360937 535572 556744 726794 702470 703911
18999 703911 793190 946857 1036849 974858 1006843 1109203 1178533 1043603 1081378 1244185 1356545
18988 1356545 1373372 1255853 1072625 1067496 1104372 1164583 1179942 1071845 1056150 1215941 1181540
18977 1181540 1069170 1043085 1096382 1170812 1077329 956143 864791 809950 767371 552612 422044
18966 422044 550943 625626 582881 353127 292436 324381 291133 216665 244130 344580 486193
18955 486193 384955 325195 327371 292893 260699 297644 276908 281292 410915 451529 348418
18944 348418 314063 499815 738882 734650 679202 563819 332596 123652 182621 304921
18934 304921 364512 456745 419523 408633 305695 48255 57190 135656 218387 340133 423080
18923 423080 406433 260243 171103 101541 113346 330831 387108 582079 587692 463656 374344
18912 374344 297034 304785 343987 241573 319314 601297 655964 496141 549705 526287 433463
18901 433463 406272 380235 500016 561908 495774 529094 623252 506483 505216 616111 658728
18890 658728 725445 726049 669795 561518 494360 573150 656929 558535 439533 533893 434116
18879 434116 547712 550778 552941 598418 570206 547852 545714 536193 434730 417631 345859 462949
18867 462949 437853 382216 604014 744175 603800 418485 526776 645593 759844 768273
18857 768273 725774 750308 673241 625042 688431 737736 858912 896683 1065351 1113693 1285251
18846 1285251 1266223 1131529 954978 834945 827646 970624 979280 1087019 1179581 1275310 1284983
18835 1284983 1259967 1240554 1239972 1319445 1312541 1387252 1413364 1459039 1647689 1681426 1780305 1782917
18823 1782917 1757768 1891153 1997743 1978849 1843513 1771450 1838443 2132959 2297759 2321500
18813 2321500 2412279 2386925 2550216 2813608 2776578 2906345 3087488 3241231 3342821 3624622
18803 3624622 4072195 4587772 5379141 6081358 6810605 7798884 8704271 9765415 11122670
18794 11122670 13099341 15699240 19298542 23474425 27390449 30198738 30782423 30205646
18786 30205646 29411246 29652106 31830598 36431068 43705940 54243792 69497996 91434801
18778 91434801 122531229 161242810 199940209 230243450 239109657 227345375 204313867
18771 204313867 175864896 148980442 124128293 103411091 88422119 80041938 77994379
18764 77994379 80951119 86083775 89573379 87149352 77053746 63369174 49614343 38385931
18756 38385931 30484976 25375645 22039143 19783153 18269961 17284706 16508356 16122492
18748 16122492 15868432 16003397 16583578 17612295 18967736 20644957 22868529 25709575
18740 25709575 29504733 34895530 42504087 53159970 67240423 83538515 98818196
18733 98818196 108855906 109659628 103674122 96428678 93066127 96950176 109664561 131729356
18725 131729356 163032334 202991613 250891264 301339169 346999449 374398921 371957869
18718 371957869 333042549 270768477 204885047 148748507 109157270 83785841 68421422
18711 68421422 59111916 54139843 52684457 54557480 57381467 58818045 56534463 49541053
18703 49541053 40524170 31896913 25192407 20662881 17609640 15519618 14168244 13002324
18695 13002324 11652718 10440376 9102023 7839676 6988962 6353609 5876001 5385520 4910583
18686 4910583 4723517 4724466 4367278 4030743 3797628 3519863 3314460 3056250 2741189 2718455
18676 2718455 2508542 2344767 2355513 2272223 2272237 2147910 1989768 2003208 2035039 2030486 1829936
18665 1829936 1609023 1709482 1837327 1987268 1941692 2016051 2120170 2031087 1889378 1965663
18655 1965663 2046142 2063222 2127166 2063623 2029966 1992612 1889258 1884130 1816290 1728098 1662051
18644 1662051 1543200 1553354 1501511 1537517 1641700 1778090 1792025 1721974 1808394 1531005
18634 1531005 1193543 1147270 1399782 1554325 1439085 1412939 1297761 1121290 1038887 1047487
18624 1047487 1156821 1121859 1335658 1557759 1549410 1329939 1165952 1123633 1170371 1159085
18614 1159085 1148670 1233553 1322101 1281358 1166738 1143465 1171854 1335256 1328666 1344988 1578849
18603 1578849 1706237 1788449 1795583 1831918 1837214 1908702 2266730 2490615 2445385 2427548 2552603
18592 2552603 2764861 3065584 3281435 3352776 3441174 3696807 3827370 3888108 3907207 3961301
18582 3961301 4058827 3963274 3683188 3529451 3551707 3660529 3622220 3670879 3618034 3462541
18572 3462541 3447669 3569791 3756287 3793131 3778674 4118931 4508944 4648429 4895131 5498830
18562 5498830 6048751 6353464 6689830 6981543 7469926 7967990 8435391 8944063 9495588
18553 9495588 10438414 11834390 13611865 16093841 19450589 23846003 29222546 33991023
18545 33991023 37616972 42223123 48634260 54041213 55419726 56246560 60432875 68268881
18537 68268881 79085987 94757194 118538186 150856761 183890590 209490462 234295842
18530 234295842 267808851 302058220 308989498 288565757 266319150 251806688 231009212
18523 231009212 197045167 163720246 140032968 124721246 112222471 101439425 94874969
18516 94874969 93989074 95198903 90477518 79302239 69009962 61743198 54790196 45930748
18508 45930748 37005397 30146566 25654228 22658390 20723469 19612774 18762571 18281367
18500 18281367 18392012 18650337 18959913 19820458 21018979 23129580 26399321 31284106 37794570
18491 37794570 45410286 51708544 56508226 63191524 72401089 79580808 80646607 81246047
18483 81246047 86680076 96110987 104860547 114816317 130299862 150930104 167895072 173701232
18475 173701232 177914667 186659564 194421594 181170088 152832149 129354504 114045689
18468 114045689 97928722 76645123 57641979 45010365 37952527 33782537 30608815
18461 30608815 28583380 28004972 27940626 26460884 23249915 20467592 18686822 16862168
18453 16862168 14268304 11914055 10185421 8909100 7893567 7045301 6213118 5662318
18445 5662318 5399039 5084931 4853543 4398896 3965193 3693096 3474119 3220511 2750180
18436 2750180 2497362 2284340 2282644 2220927 2170869 2019581 1813891 1725549 1676585 1459479
18426 1459479 1365479 1426234 1481849 1522455 1620539 1672766 1533399 1496094 1302130 1188438 1193029
18415 1193029 1274620 1444960 1365620 1230907 1181633 1174879 1177460 1053781 1095985 1163032 1249263
18404 1249263 1128553 1090981 1199624 1060080 971924 937793 777324 724751 812187 901637
18394 901637 888752 846198 812702 730745 622474 599283 615662 530640 489768 572036 522997
18383 522997 590849 712221 610283 604903 613263 469734 379289 420670 732304 972046 995025
18372 995025 986882 787241 593894 566940 677597 802963 764691 634270 545835 517583 469550
18361 469550 662477 661453 669140 732431 669595 564922 631305 565720 530681 560608 508642
18350 508642 393884 239396 302205 426564 389597 400597 587925 794144 852077 762290
18340 762290 799464 795743 646527 646870 454118 439324 467160 570450 754877 1114408 1175751
18329 1175751 1139100 1163138 987383 707751 492715 544256 682255 916094 1327447 1746715
18319 1746715 2237395 2720465 3317771 3931352 3999484 3998193 3787391 3513837 3104297 2577731
18309 2577731 2120014 1619520 1303761 1274269 1364268 1384483 1355523 1486252 1661036 1497643
18299 1497643 1014976 739008 599859 601256 841111 781913 493124 317278 393391 458645
18289 458645 396813 383471 340209 434242 480450 373102 289768 421759 429858 383586 521730
18278 521730 544503 743975 1062157 1204779 1332513 1425032 1344678 1387988 1416754 1357734 1423582
18267 1423582 1624007 1953846 2244566 2637594 2970585 3444125 3756137 3714874 3460935 2937430
18257 2937430 2506695 2371007 2047659 1591163 1496665 1563936 1436032 1442533 1407641 1367950
18247 1367950 1554475 1721260 1774397 1608972 1510932 1215695 1040047 973469 1041317 1014726
18237 1014726 1034615 935575 1072106 1131686 1131048 1126034 862383 679179 579361 558835 395268
18226 395268 283878 412114 477559 376391 395122 439445 531223 636391 598687 671706 602685
18215 602685 509731 547257 683373 680543 699526 760760 703189 593936 474711 508653 688690
18204 688690 743068 1173400 1401568 1288640 1215605 1208529 1129490 1080321 1109400 1110753 1069832
18193 1069832 996138 1063603 1171247 1314620 1151607 1245339 1331899 1236703 1084734 1074092
18183 1074092 1042004 917300 769186 762858 705604 747058 731470 664197 824066 791372 612131
18172 612131 583382 659308 598342 515317 561540 513135 647544 798690 896445 730823 717244
18161 717244 719322 879376 1122421 858401 909831 1035653 1126122 1201369 985726 882498
18151 882498 895935 1051024 1050612 1084498 1239971 1448709 1468336 1423162 1348845 1475049 1791150
18140 1791150 1806835 1685498 1755269 1671460 1600550 1855704 2186920 2390295 2652681 2926299
18130 2926299 3046455 3423045 3758330 4098447 4706004 5304111 6033291 7052113 8104953
18121 8104953 9127289 10732268 13080359 16462044 21301764 27946027 36991957 48959050
18113 48959050 64600566 86720858 122352354 181327718 268175841 358390383 341849183
18106 341849183 233454444 143243784 89754073 60071182 42775619 32024694 24790236
18099 24790236 19459815 15648627 13049078 11050477 9496270 8071100 6740242 5765267
18091 5765267 5201701 4714649 4403258 3951628 3571848 3306613 3020659 2690754 2322126
18082 2322126 2319614 2437068 2382854 2254077 2033233 1737957 1639615 1580818 1394168 1224442
18072 1224442 1203699 1234295 1084921 1054575 1037091 946466 1009579 1011503 748586 728982 587517
18061 587517 499031 647532 612272 487713 420822 355268 552760 755466 749855 578225 554589
18050 554589 544909 365465 196366 165793 301798 205023 86772 181998 281800 342527 482362
18039 482362 627725 630167 728549 858894 883945 800852 693279 731513 792699 747913 906548
18028 906548 871705 1081439 1304319 1225668 1225556 1292827 1149168 1025030 854081 813213 994195
18017 994195 1089297 1143517 1159220 1174188 1244590 1178082 1094722 985286 770813 591028 545605
18006 545605 622895 615963 571791 512164 436613 417734 380504 422062 594925 583939 548001
17995 548001 408070 231414 133709 94212 159068 142784 108356 172680 456063 525470 430461
17984 430461 376523 333360 307982 236588 230785 406515 623537 602148 746858 929575 908260
17973 908260 771096 778185 920757 865300 718007 666492 666265 666687 700078 633545 291951 154609
17961 154609 326583 413347 591784 687550 890492 843174 875930 711143 569170 453204
17951 453204 459658 481189 528179 437550 284269 225142 184384 255757 207332 204600 286090 257120
17939 257120 75100 98548 6956 -163605 -114071 -63486 -53319 -27668 -10019 -149571 -207944
17928 -207944 -171034 -117410 -258672 -41616 165442 128634 138627 39439 -161122 -217593 -220142
17917 -220142 -198747 -203913 78658 337893 149948 76302 127498 -10381 -84875 -23473 39369
17906 39369 -14542 26667 164721 249949 192692 62034 -6584 -84290 -60312 25329 57529
17895 57529 123478 365296 446505 382645 100288 -87115 -134645 -43201 -71650 -31256 -49181
17884 -49181 -48370 70933 -73820 -121513 -15252 326944 426257 263173 197443 -49718 -59686
17873 -59686 56464 261655 286668 225271 248094 217510 205850 245758 351182 293726 179858
17862 179858 174593 56356 -56990 60478 202366 176594 94898 -5603 -57563 93330
17852 93330 73142 139200 116560 196608 238701 231643 79338 -64023 -8869 -30160 -116994
17841 -116994 -283328 -98200 153998 142175 152597 182980 199072 187448 111778 45642 52452
17830 52452 177279 244252 204526 296363 183714 -71170 -111330 -65537 -222562 -172953 -72353
17819 -72353 -79673 -54544 45280 188915 166781 163626 134158 122794 116699 225 -102507 -7769
17807 -7769 109128 226611 250171 190196 246993 209842 126227 13344 -92207 -77242 143799
17796 143799 69822 -100560 74234 255026 169587 67212 31109 55634 54127 33047 -53614
17785 -53614 -147073 -253646 -172272 -187429 -214638 -166317 -189118 -230963 -244355 -159341 -186062
17774 -186062 -18746 205346 342714 477702 410738 286270 125498 43640 -105554 -137061
17764 -137061 15538 56774 -53120 -93172 127634 64831 73913 123629 120207 239579 405559
17753 405559 398497 246138 278832 133925 -36754 -11027 137196 128063 -2642 -64748 -83978
17742 -83978 -134040 -225129 -237516 -116408 -116535 -193808 -84617 -89991 -113384 -134819 -74913 19340
17730 19340 136125 98467 -8041 -96718 -46975 -159375 -192734 -155764 41633 91551 -162861
17719 -162861 -123948 229700 376769 348931 291580 232758 26565 -165498 -84210 -50316 -24564
17708 -24564 69599 148904 53945 289137 380040 251691 21606 58208 -2959 -115981 -95684
17697 -95684 -83122 -159571 -94757 52386 88209 99666 -4421 9946 72531 184186 168609
17686 168609 164473 123228 108323 118008 4868 -125310 -189854 -303519 -208254 -90525 -18911
17675 -18911 32640 86938 147005 24089 -42374 26339 -72291 -116379 -93099 -157489 -1805
17664 -1805 106010 89693 -5205 -140345 -107382 -117273 -189213 -220518 -288188 -231499 -183576 -64135
17652 -64135 -64264 -123445 -242576 -237991 -264464 -7043 124559 -4921 -93821 -137880 -125292
17641 -125292 -249708 -251418 -103926 21445 73530 -67553 63404 58763 -27806 24264 -1843
17630 -1843 -130483 -61032 173019 134928 28463 -130763 -78272 -36077 28556 167609 80011
17619 80011 128268 240899 282618 93877 2948 -3189 -79265 456 62302 -145195 -222447
17608 -222447 -75732 43762 175196 318682 310975 184840 -40348 -18379 -146966 -201525
17598 -201525 -205643 -219933 -127927 15548 -87899 -206422 -224564 -196399 -53587 13083 26773
17587 26773 -49843 1847 67871 24625 -5228 -3282 23188 11975 162388 164133 100797 -38157
17575 -38157 -23615 122232 114568 -17094 6091 88644 94557 66315 137195 197903 287875 218985
17563 218985 77340 43882 97364 127472 -34070 2594 56992 10764 -7684 108184 59973
17552 59973 -4785 39417 9632 -95212 -170994 162148 143645 -72821 -60398 80836 41898
17541 41898 -50916 -55278 -108357 -159680 10535 -207502 -305170 -268412 107181 210810 90623
17530 90623 47286 -69102 -51681 -93112 -57710 161874 101804 -34513 40841 -18738 -91025
17519 -91025 -37294 9872 34453 -24701 -105155 -143274 -236242 -359944 -330394 -242859 -129046
17508 -129046 -149040 -271836 -135940 -55728 62622 242429 76167 -18106 -1622 -61693
17498 -61693 -91721 -34387 72496 -106983 -206803 -119108 17989 175397 121776 28216 -110111
17487 -110111 -36922 -48820 -16257 90860 121017 55353 120398 73355 1394 -124769 -88788
17476 -88788 -50639 34101 24724 -22299 -43862 10023 48937 -105885 -170501 -159943 -89204 59035
17464 59035 57654 112055 97147 98352 -13402 29777 68269 10402 -176202 -56038 151507
17453 151507 46202 -183841 -183323 -108544 -38256 -38294 1769 215949 414947 771683 1249082
17442 1249082 1798042 1991165 1522817 857579 620801 523026 487398 502092 492525 386028
17432 386028 265663 84267 -40684 -163837 -96843 -171541 -93584 -59150 -14764 90361
17422 90361 176819 148688 125306 -7765 50187 142781 71162 4974 99267 71711 -2906
17411 -2906 -81652 -75142 -183209 -132526 -94833 -264934 -308239 -209241 -253297 -194804 -262348 -259996
17399 -259996 -243923 -120847 42284 -33291 -183259 -187145 -1432 175496 -43950 -147349
17389 -147349 -183430 -235837 -281844 -190216 62322 8454 38440 15695 -119579 -296621 -160508
17378 -160508 -153758 -226862 -142756 -60816 -90109 -148549 -191195 -143982 -113691 -16834 -193984
17367 -193984 -251444 -205083 -15086 113457 114716 101957 80025 64789 134128 74309 129959
17356 129959 30651 54507 275686 319351 210668 105331 137629 168012 159076 84513 114667
17345 114667 169711 293840 214793 -28190 -228088 -130786 -133700 -80607 34629 -197843 -178296
17334 -178296 63702 229650 251591 311608 219323 -81081 -186668 -125991 -68324 29869 151425
17323 151425 63153 151093 99900 16556 -79690 -41994 -101519 -303702 -381506 -214110 -183159
17312 -183159 -172671 -133937 -126888 -191335 -214385 -73495 -48390 -98788 -269328 -149458 -68159
17301 -68159 -51222 63931 -1634 -121459 -116572 -197248 -190119 -116854 -241752 -202717 -199688 -248098
17289 -248098 -195831 -64711 56549 -97660 -79961 -83280 -49904 -115195 -177715 -91505 55816
17278 55816 73290 26725 -31162 -95895 -89106 -33797 7689 -106789 -237266 -181851 -183078 -155376
17266 -155376 -122871 -127917 -92738 -56265 -74427 -4672 17286 -129594 -305442 -396734 -467398
17255 -467398 -365149 -91718 50188 109368 140371 76779 -27860 24108 162523 68520
17245 68520 -69415 281327 359829 113201 -141700 -195631 -73369 -152962 -150401 -120461 -125572
17234 -125572 -46477 12581 -34958 -90761 -117329 -99753 -62275 -225505 -222909 -49443 81232
17223 81232 66201 156764 109495 -67523 72975 82358 53680 190274 240509 269383 371858
17212 371858 164849 100392 186842 182177 218792 207025 203158 215844 130629 23553 89482
17201 89482 -47035 -101917 -255339 -114823 -25650 -93629 -64328 -25129 -60861 -196708 -191712
17190 -191712 -199304 -93579 -43083 54364 -116846 -171009 -166650 -236582 -284063 -197529 -142538
17179 -142538 49543 60923 -37615 -180609 8674 95939 143402 106830 -95630 -402162
17169 -402162 -377921 -288472 -217167 -317337 -292648 -205008 -206975 -277285 -314793 -217417 -31855
17158 -31855 -32320 -43727 -48738 45934 -80335 -158514 -181180 -141113 -128209 -7167 78327 -33056
17146 -33056 -309837 -282534 -92509 -221544 -193101 -79630 -11384 -63112 -9116 66838 108270
17135 108270 -42539 -80078 1882 61769 89238 149840 83137 -58176 19665 70513 190470
17124 190470 265075 258889 59783 -23736 -82701 -70594 75746 190125 136266 -22716 35167
17113 35167 -21654 -91622 -114225 -59638 -107268 -95084 -159045 -124985 -19667 -57542 -191810
17102 -191810 -135141 -199667 -99647 -144867 -158208 -176891 -142642 -151732 -77443 -183840 -295018
17091 -295018 -180955 -70279 -68525 -73540 -214349 -159996 8043 105555 36614 36725 98827
17080 98827 27276 -147558 -98522 -148749 -143470 -136503 -37672 197038 269389 202379 13028
17069 13028 36008 162741 234621 188152 129640 198252 257662 136161 115619 109309 25686
17058 25686 -48861 -32222 -226150 -271254 -200330 -21700 56231 222533 313777 177332 164860
17047 164860 58096 62207 -120311 -106196 -109117 63755 246013 173032 -19410 -101656 -141116
17036 -141116 -63765 127221 152176 -88867 -125644 -89428 -97115 17568 10299 95700 162044
17025 162044 281336 168117 -10969 -24418 -6625 -64766 -126058 -100234 -47503 -6733 24851
17014 24851 131025 145711 116508 24891 20194 212363 300561 269479 219151 158152 -81
17003 -81 -307505 -334377 -248594 -106881 34202 147434 194970 285565 309449 133926 -25954
16992 -25954 184837 406449 373450 320722 214209 367425 412553 391422 391831 304362 236086
16981 236086 180732 -65947 -235775 -126445 -67844 110705 186727 102962 355 -50234
16971 -50234 -10956 123201 119822 -18546 -160594 -251479 -234171 -250309 -347516 -161216 75836
16960 75836 107910 119126 123471 65092 -94219 -171551 -146885 -167700 -227669 -180779 -164066 -341975
16948 -341975 -441246 -418851 -245294 -215020 -190065 -160445 -254876 -153928 -12300 -30404 -198717
16937 -198717 -187363 -83029 -194924 -313951 -304684 -144997 -257489 -109288 168980 181933
16927 181933 286180 191628 196706 54516 -64684 -46181 46681 63053 35317 -9723 -50231
16916 -50231 2455 -5097 -113296 -166754 -77449 -5621 -60690 112365 139996 43221 37548 102496
16904 102496 93815 -917 59749 471 -60548 109709 109279 69402 186524 10700 -234542
16893 -234542 -378211 -370274 -138268 -46819 29480 144046 40408 -83799 -61422 1585 -89900
16882 -89900 39886 177050 246704 232465 63475 36021 134048 145405 35147 -151330 -332337
16871 -332337 -404659 -380782 -281271 -267037 -104298 -3852 -26600 -46328 70655 202201 168261
16860 168261 172732 118142 297745 318885 213761 -139395 -227912 -94153 -87364 11133 77265
16849 77265 -3405 -79667 -6075 63316 121210 31657 -142933 -271143 -126722 -1097 -152121
16838 -152121 -182404 -65195 55093 168518 161514 109331 40085 105356 156852 185359 175691
16827 175691 326618 267128 57601 38882 56156 154632 110149 66700 -69552 -21492 135356
16816 135356 251540 179544 83989 134514 46600 -53823 -46067 40329 278858 419991 272261
16805 272261 236981 108530 126213 116660 28185 53062 131446 161379 295146 153976 -22998
16794 -22998 -12383 -45301 -126605 -94132 -187157 -71174 68070 -108880 -206887 -51447 33096
16783 33096 91628 493 -46812 8723 9162 -18165 -195708 -183840 -213217 -159997 -1900 -114534
16771 -114534 -138369 -70453 -61911 108919 28515 87977 87499 96097 72716 53094 10163 -32014
16759 -32014 -93075 53987 50168 71611 45504 -175918 -275518 -306908 -365259 -286173 -151816
16748 -151816 -65684 -232607 -231085 -236001 -205776 -272034 -273022 -294825 -148953 8446 25301 33406
16736 33406 74072 -72950 -213421 -280077 -320131 -236677 -248603 -328019 -298915 -334610 -198298
16725 -198298 -343471 -290009 -196953 -143765 -9405 225485 122931 49055 33821 172689
16715 172689 273790 212727 139826 79953 98675 287010 289352 293862 157652 112760 38932
16704 38932 191821 92503 -39559 -105747 -96857 -164164 -298744 -286872 -81023 -8619 -27824
16693 -27824 -125528 -102098 -63813 -30011 4271 50543 171409 50651 -8021 -150958 -66183
16682 -66183 -8250 -73823 36179 74211 -56458 -223694 -389242 -282896 -218553 -243046 -254996
16671 -254996 -106177 -19833 -27547 88133 65798 163000 156452 76627 101398 -37041 -88789
16660 -88789 8327 108492 57401 195329 102826 44894 219335 234514 183753 268259 155698
16649 155698 89955 143597 125832 58065 233614 280269 228302 87581 -152455 -156831 16867
16638 16867 118154 217681 121601 -41448 -141525 -83605 113639 184683 50760 -132172
16628 -132172 -167365 -184232 -248235 -46070 128948 138631 59497 -135993 -206031 -68952 -5781
16617 -5781 -3566 10491 117000 49795 205675 76262 73725 171881 191326 91559 -204106
16606 -204106 -184833 -40383 -107703 -54168 33983 114050 -104830 -211096 -166270 -137311 -180943
16595 -180943 -191666 -164505 -83747 -3551 745 48401 -77101 51711 113421 79712 19025
16584 19025 72260 -48314 -201599 -303433 -220718 -72422 61167 -18780 -134754 -50286
16574 -50286 16547 -126006 -350129 -266819 -308661 -160428 -1190 -143168 -214963 -155197 -38946
16563 -38946 78647 120611 89548 39575 -85838 -220428 -187362 -74240 -144343 -163775 -123963
16552 -123963 -266839 -330347 -327603 -345241 -335559 -409345 -333054 -369917 -427347 -407833 -286946
16541 -286946 -131194 -83834 -183764 -301631 -221829 24895 67911 74734 30120 -64220 32589
16530 32589 49219 32671 57641 -78466 -207039 -215770 -139058 -62889 -49268 -125748 5004
16519 5004 49590 113180 24778 -38729 -113123 -166581 -94848 67424 31708 -81702 -168710
16508 -168710 -145770 42332 -73020 -7330 -25776 -213218 -177934 -46938 265134 462146
16498 462146 348017 226431 67812 126533 174086 97354 39913 -60335 -299235 -419360
16488 -419360 -504004 -394333 -297993 -249061 52566 280220 313616 373799 296728 155350 -40585
16477 -40585 -52074 44618 77905 -41673 -146708 -39170 -26127 -54906 -195142 -157379 41109
16466 41109 50039 149784 170034 97351 -51308 -168445 -139332 -276504 -218341 -196927 -168958
16455 -168958 -156458 -125901 -245070 -259904 -179258 -211419 -8850 58750 -45824 -122525 -147104
16444 -147104 -69681 -52632 -37489 -10665 -17130 136654 57959 -116418 -214417 -3877 -16697
16433 -16697 -25112 -70863 -215685 -116856 -63054 62900 62176 51254 269028 306914 161034
16422 161034 6553 1843 128809 46608 -178768 -297010 -258617 -99764 53868 60299 -59951
16411 -59951 -73201 -117008 -94084 -225331 -231477 21014 111965 -172 -45709 -79505 -81933
16400 -81933 212305 306467 182567 -79588 -217893 -169676 -282521 -260050 -180023 -235867 -243722
16389 -243722 -209108 -267886 -265386 -64563 2492 -11071 -19422 -65068 -110619 -71955 -59312 -33772
16377 -33772 -39756 -285060 -235159 -266222 -252912 -75060 75698 37038 73005 -16509 27934
16366 27934 -35301 52771 -100485 -177516 -188828 -152747 181 -23795 -154427 -204 176617
16355 176617 147429 -69866 -95758 -40733 -50025 -235 84931 -61560 -11594 84417 175932
16344 175932 38793 7347 -41910 -21364 55004 131197 -62699 -182650 -169022 -88844 -17869
16333 -17869 149959 153626 144075 78181 -109750 -88127 -13095 -33860 102333 222557 47121
16322 47121 35084 184050 236705 91033 31915 44194 84280 128012 12888 -145654 -59868
16311 -59868 -122157 -23572 161129 344779 252088 92923 -68135 -130044 -217785 -284396 -215931
16300 -215931 -61298 122146 216131 141162 -58549 -119556 48188 111317 113238 121054 224996
16289 224996 79555 37493 89952 169596 264324 248150 138306 114859 114143 150761 94207
16278 94207 -64080 -56447 106705 85238 -25041 -29292 -95834 -156040 -114686 -82710 -90151 -123766
16266 -123766 -82857 -87767 -212750 -243280 -275724 -192785 -348354 -293718 -159219 -207815 -145645
16255 -145645 -230697 -238723 -143641 51332 38738 -138578 -221581 -205589 -79938 -6868 -19499
16244 -19499 -82232 -72291 257809 324082 109364 -21275 -157344 -148975 -229669 -239321 -85899
16233 -85899 144324 223242 -57262 -225882 -123293 -9045 -63026 -79284 -78406 -67060 -67001 -12622
16221 -12622 -20793 89165 73768 -8509 -86174 150033 275736 188059 -118445 -111069 41726
16210 41726 -16020 -17334 -101944 -111280 50484 137529 77684 48410 27864 19930 -87121 -160999
16198 -160999 -83916 24039 118361 115653 118954 -34198 7006 -2048 3312 -163052 -84178 -70973
16186 -70973 -105722 -133781 -131980 -165473 -86587 11652 -75062 -269569 -224000 -38101 40240
16175 40240 -3165 -63261 -46690 -44350 58528 79035 37152 65147 83746 21751 82449 118075
16163 118075 45300 213 1327 -57945 -100937 35253 61450 29537 26823 35541 -45548 -14117
16151 -14117 16794 97558 72091 119760 161993 56194 -54441 -210948 -131626 -62899 -52359
16140 -52359 -21607 -67643 -57418 -94985 -76386 -55395 8606 137354 111545 63987 -193262
16129 -193262 -247768 -23477 13584 5374 -51708 -33791 -198380 -356637 -290271 -116176 -183543
16118 -183543 -367287 -192064 -259081 -329661 -331380 -336448 -405058 -323038 -179662 -64046 73111
16107 73111 67898 -160093 -218942 -29712 -3060 48008 69994 54512 92705 163201 233375
16096 233375 272148 274909 227072 213320 229655 166611 179187 123752 58070 -63675 -18101
16085 -18101 54482 -16418 -105973 -236974 -248412 -171004 -194222 -5328 107454 -72771 -192664
16074 -192664 -180312 -145619 -24267 67523 71923 27666 135773 73171 35793 18382 4993
16063 4993 -85270 -118326 -123553 60414 122144 47467 118950 131360 72078 47830 110554 242069
16051 242069 222057 30592 -18882 132418 115375 -1150 9456 -57649 -11657 21770 168646
16040 168646 69147 -174339 -180280 -200714 -88610 -2003 -144424 -338172 -374347 -185739 -41372
16029 -41372 -124859 -210351 -240690 -117558 -115812 35496 128398 200430 44735 -132949 -231733
16018 -231733 -249186 -394597 -324817 -126138 -83434 -192967 -83751 -65799 -172036 -337684
16008 -337684 -277242 -143023 -155603 -166536 -49986 -146060 -117270 -26414 -96363 -53548 78324
15997 78324 -106512 -16143 99371 25952 -220268 -320124 -321925 -220784 -86232 -111696 -98272
15986 -98272 -41168 -71826 40958 92982 -48621 -164677 -217749 -259219 -91475 -9025 -69369
15975 -69369 -196952 -275728 -352528 -441804 -481143 -489355 -571740 -304977 -177359 -73241 -97829
15964 -97829 37084 195428 225314 255592 384163 227121 19883 45614 78446 143547 143005
15953 143005 142 -110718 -140241 31991 269 -85856 -121985 72314 20697 -58445 -16468
15942 -16468 11696 -69998 -33035 -80958 -69998 -130864 -13007 96710 32858 -19050 -175353
15931 -175353 -224104 -243336 -393735 -361469 -206136 -19922 20637 59492 76175 164376 149234
15920 149234 178470 308598 164405 -16571 -105414 -106838 79673 78965 -46843 -147745 -244707
15909 -244707 -291577 -210325 84352 20325 -12842 -76146 56191 177378 248433 152675 216726
15898 216726 183985 82568 9533 -57384 -30286 55297 -82561 -95399 192185 192385 6865
15887 6865 -115027 -141711 -180764 -136626 -74350 -176942 -161236 -239282 -437934 -319330 -296336
15876 -296336 -133001 69709 32930 -142518 -296590 -353843 -244198 -164891 -275744 -409803
15866 -409803 -259052 -126110 -58080 75031 150313 102037 55936 -17379 109869 218734
15856 218734 123893 -23851 -40287 14213 -95293 -235314 -206658 -146319 -128670 -237368 -375635
15845 -375635 -371834 -242875 -304496 -147732 113335 208888 221489 250650 238531 33576 -9378
15834 -9378 59601 162558 214070 197024 232604 91969 5631 18323 -6453 -102196 -66146
15823 -66146 -73476 -95966 -96852 -135833 -126780 -159428 -95967 2401 82994 90728 -33526 -276336
15811 -276336 -321007 -141310 52020 4097 -162637 -260949 -191605 -187182 -118525 53353 132323
15800 132323 -21310 22607 236916 210161 40161 -146405 -108382 -182192 -268874 -288261 -114916
15789 -114916 -95893 -248812 -80 326866 352356 444934 605142 406353 294427 347018
15779 347018 97139 11479 24900 -45805 -82517 -32224 -24056 -69305 -16110 92515 146771
15768 146771 92696 29942 -106428 -98764 -125011 76568 166093 2082 -141873 -90113 -115207
15757 -115207 -144463 -79453 140856 132717 102959 212632 109247 -32848 -22162 45151 86615
15746 86615 32163 -61377 -77547 8575 88715 2619 -10140 -80393 -100078 -90749 -97365 79862
15734 79862 8233 -120063 88442 130681 67572 -204176 -346644 -376810 -475499 -304923 -55852
15723 -55852 -38845 -58188 -143060 -98269 -47135 -5175 -122292 -196531 -166940 -200102 -27550
15712 -27550 -77701 -150776 -126303 204874 257681 127781 -10936 -97364 -248917 -196482 -76251
15701 -76251 -29817 -32642 -158590 -182618 -70993 11577 42134 5826 21901 6659 19762
15690 19762 31816 5448 2 -32916 -94805 -110279 -125917 -81348 -45771 -9365 -35162 127448
15678 127448 84442 -48949 -167596 -158433 -2120 -6911 -59750 -166902 -121049 -188209 -324383
15667 -324383 -223248 -163333 -111404 -96002 -175189 -166237 -41326 -69322 -152930 -88613 197939
15656 197939 378946 238633 87220 29215 -6893 -28766 -129900 -23541 73872 7689
15646 7689 -41125 83851 48559 -115206 -132658 -248557 -297092 -293531 -240221 -170392 -166666 -191879
15634 -191879 -259051 -218576 -52625 18806 77583 153139 -57621 -240659 -286855 -202379 -128532
15623 -128532 -323666 -425176 -164973 -139322 -25674 -20631 45383 -23543 -60837 13376 -54325
15612 -54325 -90852 -322593 -315417 -126303 -151748 -109266 -134610 -143541 -224020 -110560 84876
15601 84876 135551 -48372 -261140 -423867 -325406 -110266 -91683 -160701 -196570 -106644 -6910
15590 -6910 5845 -59079 -131048 58241 102381 106267 107372 59802 -35162 -141849 -153273 -227286
15578 -227286 -274167 -303359 -345015 -214679 17882 63960 41307 -128614 -94953 1766 -30293
15567 -30293 -8657 -53571 47543 174926 191057 194575 171956 194949 204420 238985 256680 291235
15555 291235 223208 157057 25604 -21492 192380 328223 183930 157610 166770 117309 237730
15544 237730 377470 543349 365749 106576 10769 38974 51367 147188 85997 -16499
15534 -16499 -136676 -34936 -23054 -110291 -199228 -83519 93885 149830 20665 -123638
15524 -123638 -170419 -108547 -31863 -14496 -113309 -169705 -49233 42530 108682 64042 113856
15513 113856 188421 -12049 -51842 -145066 -104306 27792 154516 80738 71442 168565 190811
15502 190811 51800 -56129 -48037 65225 43953 116094 206554 92527 -134465 -87070 29326
15491 29326 172497 304041 215192 207725 69154 -82154 -138207 -136594 -126234 -229573 -234599
15480 -234599 -64586 -41042 -140692 -156520 -93954 105921 201719 302428 380561 178897 79037
15469 79037 103394 165906 178764 189299 95137 62225 19500 154706 265246 96901 -32300
15458 -32300 89879 186586 120117 35893 -3472 141036 209719 165276 85736 52950 -17470
15447 -17470 -105103 -140061 -207892 -54816 40409 -18691 -44808 -29924 34540 27214 82201 75501
15435 75501 92181 111854 10969 -14758 -100924 -212763 -231200 -258822 -162161 -109608 -63189
15424 -63189 -182380 -305632 -237728 -228124 10112 242317 158724 170963 84156 78834 77074
15413 77074 7605 16289 -185116 -157277 -143 105548 278406 327720 191309 47106 -45358
15402 -45358 5712 121868 18150 -259291 -359048 -456106 -354611 -292506 -334925 -297802 -207214
15391 -207214 -171983 -43673 35982 148762 126182 23338 -27773 93089 108672 36946 -57470
15380 -57470 -28674 -68896 -156040 -121739 -16567 -10537 40754 54777 148864 198737 123680 73964
15368 73964 133801 15473 -80203 -103414 82104 79040 -139461 -13951 -41778 -157683 -222022
15357 -222022 -52569 -31230 -353071 -466475 -514229 -525790 -402067 -296517 -197393 -33523
15347 -33523 42924 70350 264915 43965 -123675 -55962 40523 47211 -22171 -239161 -229451
15336 -229451 -11641 -93406 -31882 -122405 -198723 -213528 -182456 -62041 115641 91430 53616
15325 53616 63456 145281 84056 21651 54410 -3789 41162 123967 43296 105478 117450 -53629
15313 -53629 -18580 103147 91766 17333 -119215 -139869 -91324 -247920 -191392 -46709 213361
15302 213361 212405 43392 -20042 79697 -41991 -217969 -323957 -373692 -372822 -338895 -341742 -244220
15290 -244220 -242911 -197188 -201657 -206365 -185620 3010 -55587 -201528 -129128 -33349 198935
15279 198935 112351 84670 81590 -38688 -142213 -87665 -38864 64499 202345 335996 235110
15268 235110 -25376 -181499 -138419 -188898 8507 80995 54119 99106 -19318 -98041 -139879
15257 -139879 -62956 69158 74344 -135551 -9370 -59025 -57835 6203 -25813 101356 116595
15246 116595 -25221 75014 32322 29667 -42892 28855 144413 210122 263066 252867 223640
15235 223640 245209 120107 -115101 -93751 71622 135601 200122 280748 310204 276997 204305
15224 204305 96117 95350 36517 40334 31464 28102 27397 76418 126572 168149 209105 222468 286950
15211 286950 166888 186602 290704 160310 -1977 -89646 -74941 -18779 -41038 -56877 -91060
15200 -91060 -129065 -42530 89695 98706 -179902 -178842 -125446 -151201 -50272 -82793 10733
15189 10733 43266 -7821 24298 66558 151091 37742 -53530 8550 -4366 99774 57740
15178 57740 -16020 -62785 -225835 -108153 -148070 -248002 -254473 -122096 68215 165147 301875
15167 301875 259126 180081 109807 -99631 -261165 -293263 -209683 -241959 -272376 -229461 -76572
15156 -76572 -95978 -89854 -9145 32160 -26006 -56990 -67299 -108394 -140316 -77024 113671 71613
15144 71613 -4768 -90066 -53199 67013 29143 40479 218485 216699 132783 236563 186541
15133 186541 156290 233062 42078 -192336 -87288 -79412 -126481 -96606 -141769 -149015 -31688
15122 -31688 -72924 -32837 -21519 -112212 -85099 -133415 -119036 -124898 -68238 16323 -56620 43584
15110 43584 107472 230756 91372 -24864 -118592 -99817 -71713 22936 132943 11448 7838
15099 7838 25811 -165944 -204695 -155749 -91484 37292 147861 120017 -11658 -93957 -92772
15088 -92772 28969 88182 56743 -30664 -58770 -108343 -128145 -61476 -57482 2472 35731 81692
15076 81692 82845 67551 100298 78971 -70122 -42557 -106746 27411 102165 97676 171173 104003
15064 104003 -6438 -159881 -277900 -230344 -117230 16682 142490 169896 171170 172223 308164
15053 308164 436942 436429 264356 33494 -51150 -68700 36856 62038 227143 180911 185362
15042 185362 91837 32300 177104 348432 246208 129512 -45890 -79006 -148623 -31630
15032 -31630 49339 117972 183780 203832 332312 409648 285322 120713 201568 168679 -101043
15021 -101043 -130191 -47066 -39093 28336 42661 -33902 189748 200437 72756 -13524 125244
15010 125244 191508 9736 -74755 -24617 -50599 -6261 120022 158955 92555 7716 63860
14999 63860 -25920 -7851 47446 -60460 -74383 -203347 -182517 40588 190887 147714 187033
14988 187033 107465 44996 -52382 -162937 -237876 -21325 75697 16021 -146614 -267929 -326753
14977 -326753 -206208 -97885 -137657 -266239 -217079 -169881 -120752 -172349 -214058 -247773 -304748
14966 -304748 -275789 -67422 54662 -45917 -33831 -94759 -161606 -66099 21159 58698 49073
14955 49073 11269 12456 37997 39044 120955 180759 162284 -47368 -126525 -161708 -65524 -8890
14943 -8890 -51299 -27655 -70493 -99943 -88761 -230395 -285361 -336196 -255825 -124410 -180149
14932 -180149 -269243 -324081 -416628 -255682 -72286 -107204 -28254 33150 -236522 -366674 -384262
14921 -384262 -314105 -178962 -115944 -66501 -61892 -65054 -5267 159715 168188 60723 162781
14910 162781 224923 250827 197772 299461 277985 287302 173288 54347 51852 20444 25845
14899 25845 130286 50506 11430 -64750 -163383 -186921 -211133 -180260 -137886 -78146 -198860
14888 -198860 -121261 28166 67064 40311 -194894 -400858 -144695 106097 151645 125124
14878 125124 185435 222735 221196 162117 77454 13646 -1619 133883 75866 45582 -67718
14867 -67718 -20870 -24732 53383 18489 25374 -18743 63704 179337 163576 118826 -12223 -123381
14855 -123381 -20835 -236086 -351915 -197907 -121066 -17673 158875 -34086 -128558 -87429
14845 -87429 27941 141143 204691 353306 254229 101296 -80305 -33328 41673 -34847 7582
14834 7582 87587 54347 40771 68810 100402 78780 78537 3745 -65078 -163176 -292188 -291123
14822 -291123 -175932 -15843 1117 117154 -26943 -123737 -147186 -4586 -3513 -79609 -9945
14811 -9945 56527 177925 70406 15453 -16185 -11047 -60965 -113111 -3566 280127 123515
14800 123515 -17896 40817 81298 -85112 -24698 -51287 -27954 -17964 -68496 -104938 -30054
14789 -30054 -47854 -233121 -171569 6275 11683 -26969 -186589 -229634 -158958 -43100 -26786
14778 -26786 -17866 31208 211328 347572 306649 226655 120862 77885 31923 30371 55644
14767 55644 97597 56959 -16860 22123 18020 35387 56154 46221 34494 22432 32847 42416
14755 42416 -6837 -103859 -131167 -217600 -108196 -138855 -26503 123725 106112 78891 97073
14744 97073 263713 329724 380911 249716 -17060 -8058 103451 -8586 -150997 -118229 -75139
14733 -75139 -57413 -33684 262983 387427 352953 256835 81464 -78187 25160 -25509 -21978
14722 -21978 -64170 170940 355061 210861 31616 14983 -1720 7502 -10213 45120 161631
14711 161631 204017 -11452 -124967 -24124 -38672 53847 219936 393803 198655 -31611
14701 -31611 -202841 -314322 -161744 52706 248755 253585 7488 -67613 148154 402169
14691 402169 386404 96734 -130892 -210978 -167051 111105 184411 207513 215306 154736 160699
14680 160699 150994 58862 29784 42214 234613 426682 445298 300259 202459 141518 273494
14669 273494 285680 214071 198911 96203 16021 -24763 -48744 126234 143462 152929 175375
14658 175375 133094 324768 218493 57249 -182815 128911 186510 190653 224604 197318 90394
14647 90394 -19105 23212 136831 159559 358642 460519 512941 412594 550435 605998
14637 605998 652252 800628 926877 836010 838573 843697 1054925 1155382 1057470 825220 670110
14626 670110 701371 572032 605525 662544 745075 521334 451180 534744 624407 627779 504858
14615 504858 561198 759268 809945 727137 574644 506830 480819 729450 853024 829242 710853
14604 710853 822034 1037304 1379231 1525381 1477651 1476932 1301052 1335969 1271273 1218819 1170648
14593 1170648 1134549 1043658 994589 844243 848093 963418 795535 767954 733499 619904 450534
14582 450534 512193 663002 653731 524676 442720 450784 334093 295244 285530 115157 56206
14571 56206 323489 544324 499642 209661 196169 410137 332434 151582 186529 240264 298398
14560 298398 246502 121330 196933 264170 367278 287058 254180 33094 -171125 -206640 -162720
14549 -162720 -27936 145131 228203 96608 174880 236692 237704 118049 68721 16497 -141571
14538 -141571 -262614 23186 213079 233561 126583 -7941 81483 149309 102362 92690 160786
14527 160786 260790 281675 232733 123505 47270 -35024 -140209 -229426 -120444 -162542 -83072
14516 -83072 126897 163383 91573 -1930 -47539 -98338 -105391 -138851 -223740 -217828 -269823 -164358
14504 -164358 -57381 156848 54360 -238968 -114525 -54456 -159382 -223543 -233337 -174740
14494 -174740 -25181 71165 140441 323567 352219 219511 241942 175137 164595 144612 53461
14483 53461 -37862 -93123 -106466 55639 -16038 -87504 45338 101418 54813 129064 223070
14472 223070 144301 32490 -98399 -388355 -340539 -274372 -116391 92567 100172 141091 203589
14461 203589 41415 205934 521553 379243 237272 215692 240824 307325 269096 388890
14451 388890 247012 184633 130919 351519 484760 330274 271191 153588 107136 243909
14441 243909 417502 363798 333034 464140 527328 435833 259559 250318 336073 430322 482452
14430 482452 382027 343292 249642 219643 266227 282038 117620 123164 166386 153221 53147
14419 53147 121010 26131 -46352 126691 297276 338442 321005 370994 420329 462055 256366
14408 256366 181875 44652 226924 347709 314966 276020 442781 612002 589969 474447
14398 474447 301019 351656 370552 438525 318257 262085 308731 152277 2030 -73034 29245
14387 29245 -5982 42055 219536 271521 288893 290527 152097 109485 186073 318177 293393
14376 293393 116435 -20112 46064 28945 43101 33101 197081 186721 228994 337718 330221
14365 330221 323123 447731 376101 318771 305173 439628 494494 316197 88848 -47435 72788
14354 72788 411614 480170 482558 391532 200931 283683 421782 487379 425448 436044 465288
14343 465288 406000 341805 395240 239118 170993 145905 331994 511162 354819 253809
14333 253809 304929 269727 266424 286493 388648 497704 566718 446860 451001 530107 549368
14322 549368 552463 639754 633800 602559 699964 689463 735500 709254 780557 845490 816699 844775
14310 844775 940486 801135 520688 403537 537270 490125 438167 535791 592957 511345 559305
14299 559305 550315 590744 514564 633259 599918 608355 591747 460752 573444 766632 822814
14288 822814 667974 686588 851015 919221 950518 894664 863777 841068 688941 641775 634383
14277 634383 749711 893631 1073073 886899 716757 625798 628117 718059 800468 651193
14267 651193 604115 589183 686365 696789 730754 931697 886624 905967 928442 1000549 1110803
14256 1110803 1292491 1297154 1277146 1356741 1458757 1443006 1506399 1663230 1790132 1766289 1592243
14245 1592243 1647685 1636637 1747739 2171796 2440158 2452036 2430514 2376275 2430770 2509065 2708846
14234 2708846 2676841 2912370 3345090 3552098 3653072 3886406 4296203 4578098 4960041 5423012
14224 5423012 5813174 6220704 6600980 6689645 6880037 7164490 7410725 7519712 7822792 8297762
14214 8297762 8720596 9256603 9774604 10476486 11191343 12057766 13070443 14392473 15758630
14205 15758630 17662360 19837232 22447887 25534919 29011039 33146287 38160371 43854563
14197 43854563 50471678 58563919 68272815 79549367 92397764 106504245 121688257
14190 121688257 137352881 152965496 167449003 180259491 190613065 197646623 201157013
14183 201157013 200676822 196951407 190446022 181482604 170972723 159762999 148419381 137430689
14175 137430689 127518420 119144116 111930602 105909887 101128265 97600259 95366485 94045380
14167 94045380 93618477 94100612 95563579 98001209 101375754 105901931 111657793 118727725
14159 118727725 126961580 136333675 146819887 158037965 169217899 179805500 189192477
14152 189192477 196518077 201145366 202490839 200266319 194256396 184662556 172418244 158072048
14144 158072048 142285129 125943029 110041460 95354133 82142364 70354411 60350067
14137 60350067 51664198 44604689 38767793 33659586 29362297 25919387 23014823 20442201
14129 20442201 18087531 16068189 14453750 13095720 11808025 10828465 10016435 9036774
14121 9036774 8130666 7563947 6950956 6342847 5908870 5576838 5099962 4679269 4398047
14112 4398047 4182426 3954440 3681988 3597069 3446630 3188253 2979180 2635921 2566083 2485073
14102 2485073 2361066 2179300 2118130 2169116 2054319 1910212 1655178 1595304 1668190 1731654
14092 1731654 1734153 1556003 1348555 1182753 1121073 1393778 1418560 1403871 1354596 1351182 1295082
14081 1295082 1023983 1041740 1026172 1041849 1214953 1066322 992136 1017064 999681 901796 795523
14070 795523 780939 869909 791196 799450 886543 839757 733790 665705 581590 639086 627532
14059 627532 691278 818622 846063 955991 1029154 1011170 896844 699453 592587 614814
14049 614814 464562 359434 453871 660904 740924 569729 515259 537752 534968 636940 849514
14038 849514 651677 674966 635686 477542 361240 429373 586512 787146 808361 587657
14028 587657 444407 420353 330619 179187 258840 340911 540804 456587 381020 350737 325253
14017 325253 439169 543664 443691 574842 586753 456481 445799 589323 480955 472493
14007 472493 453078 258890 167165 414661 431234 458889 526451 537077 477551 519462 506626
13996 506626 541890 407681 359604 270759 292477 376609 453844 186274 178615 313753 487023
13985 487023 583399 485175 407352 478591 452654 387158 359306 364301 255983 63092 104436
13974 104436 183145 491864 469052 279430 271728 281727 251126 270221 358593 276273 198618
13963 198618 305039 502995 398516 284275 201195 201621 241993 243374 205359 331935 313802
13952 313802 296127 142328 170291 291233 173808 39888 30984 103628 28681 120746 221583
13941 221583 241046 127062 209002 444029 512237 378521 249952 194519 236956 285858 393825
13930 393825 228764 46401 -22333 9455 36211 160407 105570 132249 172804 288279 286759
13919 286759 162694 171127 255408 337033 273155 188635 236858 404714 349278 442751 266110
13908 266110 98037 96947 162666 130370 112600 140829 158508 293231 429178 435104 354172
13897 354172 188224 6586 18023 170501 178793 239551 335131 269248 147353 -24629 -207816
13886 -207816 -168792 122723 46510 -170599 -111373 -45328 37787 182602 170054 244841 293568
13875 293568 361914 371229 194747 82098 74232 -15056 74488 194766 192372 73753 69649
13864 69649 57216 -60297 -80942 -60760 -67019 28129 102584 66818 178378 154140 248354
13853 248354 258098 217534 323178 322638 238111 240685 245354 154730 106023 127536 87520 159879
13841 159879 83853 -39452 62613 90262 -6107 -93844 -89054 -112413 -229883 -361033 -216343
13830 -216343 -52920 -45034 -2158 -16574 -64832 -113400 14906 217068 318005 295603 151772
13819 151772 -23873 -119199 42399 217760 335076 383472 238440 33606 -41605 -80028
13809 -80028 75837 144261 -61150 -62311 -92461 -212560 -162529 67195 197907 138473 18815
13798 18815 175887 225528 187263 297774 392582 342070 144695 58613 -13762 -158001 -20028
13787 -20028 47661 -77298 -174607 -58410 45550 199510 214357 143003 163688 140785 185951
13776 185951 336365 254500 346878 309171 47961 -49122 11828 21308 -104191 27678 173549
13765 173549 205426 234398 277438 170017 100319 60991 -61678 -63014 -46564 -44711 87621
13754 87621 31462 -116741 -29525 32174 140197 183652 135359 112377 224447 381153 351260
13743 351260 238082 288995 345753 233089 346188 525142 554177 721103 675594 674323 788880
13732 788880 875979 1029252 1112044 999445 991947 1069036 1154631 1058462 1008563 1033755 1114283
13721 1114283 972865 826981 611934 517870 470152 162042 68807 280117 500288 524553
13711 524553 394618 431532 436093 362305 351078 367593 278690 325056 423607 596304 619502
13700 619502 685952 612979 693051 761679 663468 682736 740037 906660 1050085 993569 826896
13689 826896 585401 279357 221188 390761 527661 333248 262529 324935 302623 369584
13679 369584 308964 94300 -138629 -175543 -151774 40099 185456 148957 135233 75907 24519
13668 24519 84697 85228 -13251 -750 28911 70173 123305 61980 -105329 -263028 -263019 -129009
13656 -129009 -69094 31351 -28790 -104569 -51247 -72917 -124209 -106092 21635 120956 113717
13645 113717 81354 -65315 7245 12894 146029 145746 190731 126137 -7595 -10686 63628 159271
13633 159271 201249 41266 -89271 -75142 37689 86619 156871 178443 83256 170938 289437
13622 289437 201818 57165 79750 13460 -4777 62930 189248 149877 2814 172 237905
13611 237905 285769 218851 148034 293241 283302 141857 176769 224546 277493 301644 129508
13600 129508 -12411 -36604 147330 -13021 -166263 -288746 -106183 95500 69490 74412
13590 74412 -3588 -142032 14219 -3324 -74964 -60529 -20949 67084 158483 171907 81505
13579 81505 -47777 -46091 -60976 -44479 6238 -65510 -31702 -88462 -40346 82570 21747
13568 21747 72007 114567 -75204 -325080 -233401 -35768 57234 -79036 -189972 -332920
13558 -332920 -247334 -191990 -92617 -193022 -244236 -25767 104979 -43050 -71000 -114357 27937
13547 27937 138815 14484 -87546 -11873 -64245 -17560 5445 64076 89173 -30615 -205727
13536 -205727 -275844 -237871 -103404 -17154 -58833 -70144 -107130 -1299 -12258 28303 81681
13525 81681 68578 76637 29869 -93365 -174061 -135030 17093 68276 -25108 -9846 -16673 134693
13513 134693 228130 189723 99876 141306 243808 140250 -27905 -54723 60011 140926 54945
13502 54945 21650 121562 45617 -179186 -243881 -123776 -7084 -55904 -70883 192558 213911
13491 213911 133349 -57367 -102905 -149918 -96143 -187639 -237115 -219698 -125872 25078 158146
13480 158146 208339 160811 44829 225733 212684 46891 -106180 -19929 104884 87394
13470 87394 145371 82184 -12929 48032 54484 -101664 -25153 39089 -5578 15288 -52160 -41251
13458 -41251 -46738 -187794 -125048 -32661 66268 -166741 -193509 44301 133061 217276 45346
13447 45346 -41685 -83713 -136490 -50413 76614 51020 111841 34051 -60646 76516 83101
13436 83101 -88760 -163422 -161103 -353612 -340881 -306168 -283366 -160042 -142419 -270300 -148658
13425 -148658 -45153 -51512 3879 91737 -53282 100170 189487 128492 100676 31583 35074
13414 35074 54790 -36662 47224 92757 7927 -79044 -200719 -167408 -53043 44452 126057
13403 126057 207276 205842 196809 113705 44444 -27110 -162963 -26393 -53274 -34721 64373
13392 64373 66071 -47765 -153227 -36433 -91659 21501 252590 259820 144438 -55774 -254650
13381 -254650 -197208 -141867 -112786 -84751 -164490 -7475 78470 180067 96191 -33950 -167040
13370 -167040 -151807 -133004 -179664 -51527 -68386 -320850 -344834 -179967 -23104 32923 -11249
13359 -11249 -24993 -36917 -54332 -7021 209109 223339 224994 -10376 21848 91972 107718
13348 107718 128026 59962 117447 37090 -81214 -59425 -94844 -223148 -161722 -79825 32978
13337 32978 164552 193435 135126 110900 78809 -60562 17768 153522 173163 100761 34179
13326 34179 -39806 -113940 -228418 -226316 -213850 -240936 -195189 -206240 -39425 36058 21986
13315 21986 -75350 14192 207012 226801 153787 -5519 23125 132828 66774 113521 83230
13304 83230 -85202 44925 68566 123985 47657 -50695 -85586 -145194 -156211 -149084 -185063
13293 -185063 -27955 28289 -89845 -60090 -103929 -353319 -317162 -396780 -284207 -250215 -102027
13282 -102027 -14243 104872 134473 13052 -124377 -111491 -95921 -148895 -149094 -184521 -159972
13271 -159972 -89455 13798 149981 127728 -46783 -101575 -259896 -236205 -92717 -105327
13261 -105327 -143610 -92879 -306652 -296886 -67426 36400 157146 97031 25037 -149696 -269033
13250 -269033 -332728 -213472 -14085 58842 76816 101267 164907 141941 54354 90574 140434
13239 140434 166452 126001 -63765 -234120 -166729 -69283 -138556 -57654 88535 144066 253160
13228 253160 243724 108471 88522 174421 166701 206353 221496 182389 97734 -12185 -209023
13217 -209023 -167160 -154120 -198515 -172028 -238897 -294331 -351801 -220422 -134948 -43044 101354
13206 101354 200867 199714 157987 53592 -89087 -91330 -50218 -38693 -82912 -232645 -102858
13195 -102858 20833 -79616 -325733 -355217 -353479 -272099 -168299 -113265 -92005 3302 15536
13184 15536 -66285 -223507 -111675 -15267 84429 98208 -67519 -34421 30377 121526 151630
13173 151630 4366 -166297 -249065 -69927 11449 33812 22090 -20914 77868 196593 319880
13162 319880 335338 268450 193368 154626 -17736 -144767 -176572 -245810 -151263 -124348 67807
13151 67807 210421 71665 34970 -66510 -44668 -150142 -144377 -151468 -164857 -54204 38434
13140 38434 14876 -57417 -173258 -206925 -81130 -95373 -220997 -117932 62631 145805 404331
13129 404331 227180 -32873 -37559 7363 -92176 -156234 -30350 42085 -127628 -222976 -135772
13118 -135772 -75504 -81644 27908 26298 54690 83096 255852 252556 79320 109270 139503
13107 139503 24811 -35613 -55660 -60552 -143779 -208239 -176511 -187331 -94706 18038 137239
13096 137239 154544 -31743 -155155 -114021 -95082 -58139 17293 20191 46790 28684 45088
13085 45088 53322 132359 54972 -43248 28940 -200768 -293410 -137208 -47465 -57642 -64766 52322
13073 52322 85272 -28942 -160084 -243185 -366851 -238201 -37422 173762 250687 147618
13063 147618 257590 103610 -121322 -175239 4834 90735 110295 164208 184543 234361 306704
13052 306704 296813 186019 230111 252032 249712 190560 62171 -78309 -108610 -160792 -219588
13041 -219588 -140233 -38970 84215 160686 73122 -59298 -94253 -23416 88562 109653 302253
13030 302253 285263 182121 140524 71622 7337 117948 81139 -15948 13674 16830 -96113
13019 -96113 -45152 26841 20833 -164545 -93385 77149 202339 151040 116477 151977 190687
13008 190687 135868 125428 161424 233552 276463 125200 38971 223251 261948 118189 -56656
12997 -56656 32701 186937 -55855 -151325 -176608 -218692 -280574 -289397 -282673 -246585 -256124 -29246
12985 -29246 167917 272654 284839 280900 192747 116105 171365 63 -156799 -40909 71882
12974 71882 114052 61140 -78172 -211716 -224879 32512 59387 -121844 52305 316019
12964 316019 389371 210782 186374 266460 282603 181426 91708 7939 -15592 11572 59284
12953 59284 93353 -35283 -23384 147737 190091 111194 -131355 -134762 -122310 -274589 -194230
12942 -194230 -127861 -156215 -172469 -133881 -20596 182377 225213 208402 102519 85447 -16723
12931 -16723 -167875 -100064 -144488 -272038 -262212 -274604 -329282 -354709 -296985 -334392 -314421
12920 -314421 -322412 -326467 -204035 -145653 -118960 -25806 -67399 -66288 -70516 40824 -27291 -34578
12908 -34578 -67936 -35013 -66547 27889 -30264 -60153 51231 206110 276147 10519 -57518
12897 -57518 14643 -3713 194410 279387 129688 9450 38654 141833 287366 102185
12887 102185 67049 120908 -46091 -230407 -372419 -198384 63430 94215 109109 168850
12877 168850 249285 140344 159987 118317 110705 196571 140732 78265 155359 79541 -96409
12866 -96409 -181900 -158362 -359377 -289082 -245612 -76627 19708 -4954 -110892 -334543 -313073
12855 -313073 -373889 -418895 -412338 -333964 -426199 -306864 -197798 -234909 -154089 -80856 -59712
12844 -59712 61691 130054 126104 42515 2910 -50942 62751 164289 -80068 -95831 5496
12833 5496 37379 76459 132809 169913 183479 59598 190123 240486 69762 -119445 -133240
12822 -133240 -137021 -72173 -23023 -77762 -116543 24909 108746 -175176 -291943 -170160 84460
12811 84460 86962 -27190 -54993 -33178 17548 18022 -28128 21044 122224 5497 -169390
12800 -169390 -163719 69282 261971 209069 68206 -67822 17691 29254 88331 172556 81584
12789 81584 9140 -100909 -147938 -238308 -318812 -345091 -193778 -93839 -357893 -318894 28968
12778 28968 -11739 -46187 -192172 -193606 -121594 -47125 -158732 -191108 -129010 -141275 -157795
12767 -157795 -29821 82243 9933 -27986 -75946 -135033 -261857 -390090 -101542 73975
12757 73975 111603 -37909 -16846 51994 -7001 5918 15499 94345 62443 90896 56722 72987
12745 72987 -35243 -77769 -70847 73545 161507 79435 59495 183283 198766 162791 142861
12734 142861 -9537 -69188 -80709 86201 -133470 -186372 -46459 45545 37335 75443 2593
12723 2593 -71718 -80776 -56059 -72287 -140005 -137497 -46487 -41463 116541 292998 389068 247437
12711 247437 66952 20423 -20035 -61718 -107939 -112491 -86530 -3214 23008 62388 73822
12700 73822 -118167 -201844 -231763 -380970 -489169 -285591 -1550 78610 -101201 -184211
12690 -184211 -142727 27182 74942 107764 28013 66858 10544 -92184 -249639 -402165 -388881
12679 -388881 -203635 -222442 -307369 -224353 -69593 -23942 -105830 -99325 -96229 -43469 -59118
12668 -59118 -36327 120961 92175 37498 -63233 -177677 -315557 -205206 -186072 -267688 -311749
12657 -311749 -202527 -81259 -30059 -42343 -3202 -69552 -149633 -33357 -38433 17505 64638
12646 64638 128828 71209 -68548 -205537 -240764 -206011 -70505 5178 25147 -30208 -36254
12635 -36254 -9133 -102297 -142881 -104726 -201440 -78498 -37888 54001 -15308 -279592 -228956
12624 -228956 -83061 -130751 -155468 -209686 -140231 -7122 -88403 -49064 -110221 -68628 21155
12613 21155 68005 155075 101414 239418 213867 -76874 -134471 82381 322489 352756 352387
12602 352387 308869 120058 3495 29765 -47042 -72685 -17620 -79241 -16156 77115 82365
12591 82365 62583 -48867 -105767 -42299 101930 119741 75844 -34950 -146499 -145982 -311914
12580 -311914 -297488 -148790 -152456 -151731 -105431 2936 -27137 -165387 -302876 -188696 -119698
12569 -119698 -113243 -161306 -116536 -63600 -198780 -257976 -161735 -74627 151693 231239 246972
12558 246972 37600 7530 -58839 -121802 22726 91875 -125425 -270908 -266665 -292451 -261587
12547 -261587 -207319 -23569 -12492 64441 -26 -125725 -146526 118371 88580 107873 190790
12536 190790 299694 175356 -34056 76152 32245 -133284 -204178 26768 71908 43292
12526 43292 101656 123794 130723 127878 144690 102320 10519 -66690 -117964 55940 16527 -76884
12514 -76884 88444 105374 -18957 3731 75705 128923 121669 240214 105008 31764 127267
12503 127267 290429 258748 202161 92519 127728 98332 219658 310805 120450 107366 -117372
12492 -117372 -173290 -22580 -122909 12171 -26026 -31297 22733 -37986 -29326 120495 279050
12481 279050 438463 541783 469213 507703 511748 176827 7451 17741 1650 91883 192289
12470 192289 247671 204814 252206 -23556 -87495 -78870 -55551 -76968 -37512 -18552 -6458
12459 -6458 16893 -120234 -170286 -145685 -184737 -207547 -64590 8371 -26068 28886 80648
12448 80648 13994 -14269 169744 298551 175373 -72433 -90087 -62566 -12848 68078 218308
12437 218308 420820 491238 338162 330328 439597 340148 210574 161805 97973 -82604 -52654
12426 -52654 9921 -216467 -179187 103402 242133 232249 241499 181051 154868 111359 147830
12415 147830 283330 165280 -9635 -62992 -102561 -145734 -111728 93923 12204 -103635
12405 -103635 -181964 -195768 -341545 -214044 16832 84144 115973 203816 301929 258986 16276
12394 16276 -194066 -179580 -48332 -100592 -220846 -152753 -120997 -30268 22992 63018 123633
12383 123633 167870 118187 120820 21442 -38322 -9239 -20697 -69416 -172338 -298410 -286147
12372 -286147 -169174 -59046 46372 76877 -82676 -137597 -142392 5441 36599 -123890
12362 -123890 -247241 -190109 -96160 -50904 -226146 -411258 -305396 -344653 -356053 -280909 -275209
12351 -275209 -348561 -454049 -367078 -265203 -272397 -242993 -140123 -113063 12666 269857 312733
12340 312733 190467 56939 -155221 -248061 -246109 -188815 13640 2013 49740 134582 -65398
12329 -65398 16910 147069 167656 80769 -49396 -57221 -140227 -172182 -76318 -69511 -136530 -121088
12317 -121088 -68268 -82106 -24790 77258 88221 74723 92572 26996 20856 -27962 70151
12306 70151 4803 -94772 953 23552 72636 -11335 30696 94891 -12248 -17683 -129327
12295 -129327 -234231 -215860 -85412 -75668 -88781 -35567 89185 41178 167743 244008 343788
12284 343788 175142 118242 99293 192074 211876 139925 181640 188060 -89130 -125992 -52511
12273 -52511 -61225 -82378 -2817 196322 165054 166088 125874 58101 34662 123708 52693 -139988
12261 -139988 44254 65184 21978 -99010 -175434 -131370 3216 66099 57162 85059 35131
12250 35131 72720 -116508 -184546 -206311 -291219 -333282 -386604 -282375 -279604 -268467 -241940
12239 -241940 -207594 -127428 -195590 -124601 -38566 -125863 -333441 -389164 -429144 -245398 -92399
12228 -92399 44690 181363 146552 412562 330606 189888 93544 -12779 133271 263977
12218 263977 169035 85959 131179 64186 52913 26057 -205128 -271103 11754 -39885 -175367
12207 -175367 -167723 -15879 49055 184589 170748 234282 76344 -38446 -121287 -238049 38254
12196 38254 180684 22602 -93491 -69536 54239 43544 115739 2015 -108594 -137777
12186 -137777 -208761 -67784 250971 288967 223882 138336 -87290 -245637 -322439 -393007 -332758
12175 -332758 -172381 -152565 -122955 -172922 -385360 -531864 -387229 -194079 -149151 65312
12165 65312 -7416 59669 167053 156060 77816 122583 -5751 -113358 -161081 -127048 -59898
12154 -59898 -45101 -236747 -148717 68630 150779 109658 -7242 47918 116618 249009 125743
12143 125743 -57551 43427 34833 114523 111131 -54091 -100991 -82996 -14309 154188 157866
12132 157866 57228 -126795 -118925 -52849 97618 120975 110586 69130 78742 51161 -121319
12121 -121319 -360811 -234378 -199665 -229012 -235737 -306794 -258759 -156904 -166478 -169703 -130893
12110 -130893 -272996 -257000 -72791 -91653 -64999 -92846 6071 157433 252830 59090 -63047
12099 -63047 -241413 -231505 -170497 -8655 551 -215274 -274160 -124215 -31542 -66565 -134967
12088 -134967 -94380 -7162 168599 31401 -65752 -191182 -184284 16356 107712 54660 -131201
12077 -131201 -115575 -152206 -111945 -145516 -82065 -188846 -205396 -279416 -344888 -184607 -38630
12066 -38630 19764 151641 248667 51741 -150159 -102626 -174301 -173766 49663 45538 -138007
12055 -138007 -214843 -63173 44626 123879 18909 20971 -65972 -269216 -375274 -222244
12045 -222244 -67888 -20877 -16801 -143011 -228337 -61790 -95516 -65174 -3944 -79208 -6503
12034 -6503 53848 103075 100468 57939 80583 64967 42956 -56111 -45314 -76017 -92881 67370
12022 67370 126728 217980 112190 -96396 -158988 -103396 -142763 -339185 -475539 -431346 -365424
12011 -365424 -237728 -215552 -327199 -286689 -237631 -339321 -286310 -236085 -161243 -84764 -19715
12000 -19715 -24256 24984 283144 394871 268553 23604 -138275 -323023 -289898 -114833
11990 -114833 -29448 -113315 -205741 -201018 -88230 5027 5533 -2919 -38358 17505 -135558 -54754
11978 -54754 81674 41950 -166955 -301333 -204263 -276036 -398081 -379149 -261938 -236419 -137434
11967 -137434 -83411 -81167 -62742 -40898 -93698 -146711 -147860 -132720 -77150 -75118 -123785 -195043
11955 -195043 -190617 -183975 -274438 -209193 -316034 -428855 -128277 8286 -136136 -174501 -152438
11944 -152438 -68667 -78649 -125661 -175442 -136985 -40149 -33029 -68812 -72924 17314 -76090 -62366
11932 -62366 -62633 -86495 -17486 56604 -62892 -153337 -84096 11652 110668 69259 -20740 119990
11920 119990 72772 -90176 -169807 -143062 20580 103283 253944 178186 6085 -871 -36678
11909 -36678 -106576 -222886 -299259 -107131 5070 40327 60539 60739 14769 -117231 -225460
11898 -225460 -221649 -298991 -221404 -253861 -71846 39166 137606 290039 273294 17978 123211
11887 123211 268912 288314 154598 77577 21029 -21344 43032 -91447 -176590 -275735 -215369
11876 -215369 -70462 63117 29882 -8227 37078 46544 -102508 -196978 -204286 -97427 -197491
11865 -197491 -101268 -256586 -373613 -114290 -57236 -133025 -93093 -274344 -243063 -219813 -153338
11854 -153338 -155976 -176983 -118075 -17825 -59583 -137425 -107305 -118654 -162081 -195372 -344050
11843 -344050 -291527 -243560 -343462 -382850 -287195 -240116 -65002 54366 234578 322019 288432
11832 288432 451188 201415 -14190 -130963 -98604 -143020 -345907 -475316 -454341 -411400
11822 -411400 -254140 -126783 49512 97350 56411 -24203 7654 -30240 -143656 -105285 -91585
11811 -91585 -33977 -36466 -145293 -325196 -301709 -297587 -367854 -300944 -71603 -25053 -2987
11800 -2987 52599 9937 17422 22196 -194032 -252238 -229978 -40366 19060 202272 289834 262634
11788 262634 79416 102154 107075 73528 37196 153887 201615 224575 90575 -16678 13753
11777 13753 16974 276915 536827 328896 61114 -51515 -33677 -30990 58589 167189 49419
11766 49419 -94208 -145167 -258334 -49717 67161 41208 93840 245885 306899 258693 169208
11755 169208 53631 36866 -14266 -93283 4862 211361 223286 158958 138328 115833 148971
11744 148971 288513 146492 15182 97694 37347 -27365 -34741 47327 -47138 -97087 -47343
11733 -47343 181038 309729 293082 159320 64586 -170012 -191496 -290949 -136662 -114490 -61408
11722 -61408 -33022 -73481 -80208 -35856 -65150 52166 176213 97924 151715 223972 227118 199173
11710 199173 -100327 -293498 -207718 -121980 -177186 -406560 -296268 -21356 28405 -33952
11700 -33952 -10702 32448 61962 82388 -42371 -71124 -39179 -76637 -8451 201998 153410
11689 153410 -8942 -15429 -43366 8547 9304 124320 174729 17094 -194738 -181559 15052
11678 15052 138412 270664 272271 105376 8827 143399 103854 208602 261416 173211 103496
11667 103496 -2678 -28612 -15159 -110105 -135047 -154173 -125307 87104 190865 180166 82265
11656 82265 -56073 -114785 -175005 -13074 12117 78064 108296 155923 163952 89909 5165
11645 5165 -42605 154804 174902 157200 152453 181619 108330 169385 255004 117483 -47857
11634 -47857 -194714 -15976 250794 352839 237393 160215 31570 -141982 -19195 -63318
11624 -63318 -95808 -104684 143564 168880 -23128 -36188 116246 7759 -167932 -243198 -184270
11613 -184270 -155782 -175831 -187523 -59076 -37606 -114584 -201458 -108345 -112107 -36197 -53636
11602 -53636 -39576 92202 100265 -60550 -142938 -76186 -194484 -224299 -439671 -364291 -773
11591 -773 171652 28178 -97967 -81544 -140465 -186373 -159377 -32922 -112832 -51203 -152102
11580 -152102 -201365 -70768 -44297 26373 206647 214734 74236 106477 66525 -95565 -80092
11569 -80092 -264642 -316490 -225604 -160742 -147021 -62554 23486 10769 -64292 -35268 85105
11558 85105 86455 45575 129529 200998 148245 142713 147425 52556 -17248 -15386 181407 331010
11546 331010 229595 234992 147212 209589 185703 36391 72472 211106 199566 121619 172255
11535 172255 69864 -18950 39434 -5165 -197245 -99454 87710 40703 31434 174430 79923
11524 79923 -65708 61578 331695 427777 381876 276666 20854 -202514 -230706 -170557
11514 -170557 -269845 -202834 -86061 19944 -58417 -173501 -118165 -192964 -195849 -116445 -47460
11503 -47460 -86582 -38880 -64282 -93622 -62350 38870 99343 -16876 -151828 -39588 33089
11492 33089 -53673 -146077 -129022 -240552 -174582 -126242 -90067 -165698 -179592 -245493 -34474
11481 -34474 16473 -28495 -174702 -199229 -157452 -69171 -188344 -332830 -392866 -367908 -234768
11470 -234768 -147969 -124732 -101875 -114818 -97502 -72022 37967 119733 156989 125394 71694
11459 71694 126638 112489 58115 -12075 -176236 -250226 -250820 -232525 -207092 -225785 -202107 -237083
11447 -237083 -207629 -263743 -147825 156418 264945 240851 123165 53071 -144252 -138902 -148478
11436 -148478 -262789 -250910 -199800 -151895 -53679 10498 39769 -25022 58325 147913 148244 116511
11424 116511 170377 112041 -82474 -279228 -342971 -155079 8846 129691 183814 300909
11414 300909 216143 -21462 -85605 119588 197065 82932 -108566 -190817 11312 113422
11404 113422 -3428 -27462 75417 263020 230926 198497 161338 -43040 -17951 -73799 -104813
11393 -104813 82873 81686 109908 130136 14033 55149 -42534 -128194 -147070 -192730 -239831
11382 -239831 -114792 -7891 -124550 -92446 -284702 -478532 -355214 -177887 -105880 -56768
11372 -56768 125381 167158 271236 322318 201869 177098 53101 -126649 -104273 -71474 -20325
11361 -20325 43869 -12361 -152648 -261914 -244065 -198231 -85082 31604 54342 13477 56033
11350 56033 -136931 -202608 -338015 -266769 -167428 -132617 1938 -74107 -108969 -14364 -84593
11339 -84593 -26151 15192 241281 483858 436870 121798 -111204 -212500 -275293 -254997 33645
11328 33645 -29918 -87062 -37679 -163423 -187972 -163642 -149432 -132447 -3315 21096 -10499
11317 -10499 -88600 -74582 -6277 -61213 103037 180279 243025 242514 206978 145506 41983 142124
11305 142124 104362 -145063 -338387 -357367 -241810 192456 259373 162196 -61133 -164494
11295 -164494 -167263 -122396 -103071 -963 -88407 -83053 -5228 7327 -6125 83140 164350 224101
11283 224101 265978 306043 448758 327331 157072 119271 164415 239272 256176 218690 166034
11272 166034 243496 244524 241195 206381 63473 53893 93363 82194 -7503 -60469 -107515 52120
11260 52120 183000 138758 108181 185942 138918 57154 51128 6384 -123645 -28671 -31562 73366
11248 73366 17451 -67770 -81451 -100771 -38763 -7170 -3294 177653 33007 -184332 -153860
11237 -153860 -181954 -150128 -106406 -74038 172024 182319 261667 280257 254027 114705 42662
11226 42662 84884 205787 240821 96149 154590 98339 -88318 -165410 -368739 -305397 -170346
11215 -170346 -107865 -4585 149460 2301 -147264 -97796 136861 115483 15409 -1433
11205 -1433 68214 96222 81469 166787 159236 333777 362743 219859 112415 62077 653
11194 653 -46629 -91609 -81857 -83306 -21993 -39643 21366 -29587 -22569 167315 178020 98413
11182 98413 50918 116362 42755 63708 181921 72694 -72463 -222087 -193000 54201 148986
11171 148986 17390 -89575 -91357 22206 11203 2647 129430 26231 -103418 -46716 -87963
11160 -87963 -26871 122888 123491 247322 165386 109159 -81115 -131199 -188950 -300204 -409700
11149 -409700 -284333 -68919 -50294 -154230 -128913 -122902 -171723 -183102 -343953 -425814 -414169
11138 -414169 -468747 -677715 -681795 -374965 -244062 -179967 -169443 -88216 117954 59470 -26180
11127 -26180 -54138 -195049 -374014 -222890 -324864 -548736 -525087 -424561 -169102 -85737
11117 -85737 -256742 -335569 -247321 -161688 -184640 -302050 -29018 22910 120498 36926 -103762
11106 -103762 -44785 -15948 52380 194908 167606 130875 88057 -27590 -118576 -46056 1847
11095 1847 126680 117199 117823 158525 45995 49859 243463 170217 66951 186169 157464 -43136
11083 -43136 -77384 56813 235166 96834 159648 48357 -1581 -164473 -222139 -215738 -153185
11072 -153185 -140788 -193983 -148315 -36060 35974 91239 85915 130609 76480 -125560 -124073
11061 -124073 -72597 -142485 -34422 -34569 -79721 -103814 -112892 -45469 -72431 -102996 -37201 -51868
11049 -51868 -191192 -223935 -162092 -69839 -35857 -97920 -101085 123282 94490 -135757 -231166
11038 -231166 -253903 -308309 -372519 -469971 -426188 -289770 -193193 -154840 -209583 -103806 110363
11027 110363 51882 -152046 -346642 -201658 -93256 -60308 130652 2163 -238256 -216004
11017 -216004 -133763 4552 201270 294903 15312 -113301 31876 -34291 45732 77933
11007 77933 101941 78094 129717 135874 -73076 -87399 -94888 -65939 -6721 -17380 91241 -21644
10995 -21644 -182579 435 177349 260629 321998 242746 76970 144856 218233 -30770 -106786
10984 -106786 -104321 -242333 -336734 -101990 111782 -28990 -344290 -391247 -257953 19242
10974 19242 145838 263608 197336 29965 -2791 30260 4501 -37086 59942 25743 145409
10963 145409 306600 87010 -6969 -125633 -152113 -62586 -174749 -288897 -156783 -24974
10953 -24974 -4462 40550 124928 192376 70855 -29999 -13137 -104178 -126229 -77368 -175242
10942 -175242 28384 30011 -38550 48321 154056 68120 93932 191997 -9187 -117408 -48401
10931 -48401 35357 -40076 -62028 -102640 3949 -66085 -42300 -17594 16139 43519 -11986
10920 -11986 -82074 -39651 -105523 -301327 -332691 -330432 -221637 -177636 -151188 -151496 -68774 -39271
10908 -39271 4777 77921 -10961 -79300 -113760 -170260 -309135 -301077 -108865 -47315 -26563
10897 -26563 -101653 -135861 62407 216414 115390 22892 39111 89696 128069 66687 45205
10886 45205 -66823 -141388 -132178 -47682 -104679 -201802 -17855 77097 -2477 89579 240428
10875 240428 210927 75786 -77711 -149859 -134110 -14035 130506 25572 -8496 -75735
10865 -75735 -252590 -339761 -408211 -342396 -165977 -29061 -56616 -10239 92789 82701 110137
10854 110137 65724 -74524 -7731 -50465 -15811 -137916 -294696 -146530 20976 -14703
10844 -14703 -147609 -189145 -293568 -202520 197428 342404 185438 114188 94774 -55350
10834 -55350 -164493 -148708 70418 280298 218989 134610 138948 170152 222641 112575 113244
10823 113244 -127086 -347265 -354570 -307303 -347192 -199141 -200897 -55374 175908 38010 66101
10812 66101 -55549 -213612 -73487 105080 -16203 -86851 -153909 -93722 58753 128101
10802 128101 35524 -114520 -134696 -82753 18693 163662 166894 169291 102096 -1833 -135318
10791 -135318 -125969 -16740 -94583 -46920 3533 -3399 4874 93373 213672 254541 244291 298306
10779 298306 26710 -76196 -34745 123816 146922 5986 -44840 130883 299273 299938 312003
10768 312003 248347 179630 192176 141733 66753 -25320 -44979 48908 30550 -22126 -48062
10757 -48062 -154731 -183974 -270481 -208630 -173343 -135975 1169 -125959 -383632 -398538 -196992
10746 -196992 -74137 -11752 -61117 -88472 16806 53034 186038 232040 186217 67044 -44277
10735 -44277 -151522 -141286 -119758 -122610 -185009 -222817 -170386 -142148 -131148 -112742 -78879 -147287
10723 -147287 -30162 107947 117839 48990 -256 -19375 -61124 168238 -70637 -212683 -52861
10712 -52861 84911 114458 50319 -713 84285 281669 233117 19581 96747 44437 -64998
10701 -64998 -107511 -104025 -39972 50639 85625 78503 58044 74151 93232 -53873 -116386 -22278
10689 -22278 -50898 -91468 -72073 42739 123808 65470 24263 -42196 -44094 -108833 -77926 -97796
10677 -97796 -164687 -208404 -176916 -279994 -253167 -167069 -151697 -35407 49399 -62265 -129340
10666 -129340 -241519 -230350 -131378 -133761 -147397 -89732 -92389 -153823 -50821 108068 142993
10655 142993 8769 -80424 -73588 -27196 -324066 -388238 -132075 29838 -97982 -192109 -1048
10644 -1048 -7445 40010 153220 27894 -25854 -94985 -74653 60266 -125770 -114624 -186103
10633 -186103 -312016 -219432 -130371 -48578 6181 19797 843 -3912 -120756 3304 7855
10622 7855 -200301 -241406 -162183 -18915 -24710 109759 75824 -48289 -208703 -150398 -7593
10611 -7593 140498 278272 148141 -3808 48477 116240 309547 282717 327389 138462 17186
10600 17186 62532 -43892 -41285 76989 149136 -52454 87908 10211 17617 22140 58916
10589 58916 -28358 -46819 5878 -29513 68885 4921 -86897 -57257 -53157 -233088 -111285
10578 -111285 -109910 -87642 -35729 101934 125598 108824 327404 382977 320298 156775 237012
10567 237012 270531 90839 12510 36167 200535 99239 -18859 -47539 -38643 -85962 -163127
10556 -163127 -108725 -151226 -177735 -257170 -196198 31134 160908 193027 64660 105728 171991
10545 171991 179231 110457 157385 291987 236509 191060 27170 2712 -63439 -78234 -20856
10534 -20856 81974 147406 234031 210830 43144 14883 229187 346191 401209 401574 225530
10523 225530 163010 70174 -59848 15219 -20059 45701 172812 204749 338137 271515 -2370
10512 -2370 -147401 -96139 1114 116372 112638 248438 168271 75832 77309 169759 181338 179521
10500 179521 123192 20505 16987 148100 347316 384509 299783 285101 347890 258880 154207
10489 154207 222035 179770 223075 172968 55224 4148 13219 63634 3655 -98281 -110255
10478 -110255 -11581 -85441 -49596 155522 157620 199197 28965 -4669 113154 56936 -7783
10467 -7783 -47290 -55377 -136100 -42087 115024 205385 247553 282416 238595 173526 98811 41687
10455 41687 -69544 49113 204744 129524 300112 391972 528403 634283 661754 715388
10445 715388 563556 751223 805201 653777 554938 449503 325677 365437 373395 446254 402192
10434 402192 430052 560425 764065 881106 1124126 1201660 1087249 896617 688841 540716
10424 540716 425813 252262 142018 70726 164800 242052 320989 85287 -65628 -111155
10414 -111155 -30913 61066 113218 166166 253038 177835 118192 182413 123548 149547 255909
10403 255909 221992 20255 15128 28209 9852 -13288 16952 -8713 -27464 -130412 -101949
10392 -101949 -7776 122189 294267 189325 16345 70885 127040 22661 116680 73750
10382 73750 52164 40254 75446 72486 48301 3185 199075 323930 198885 71783 -98558
10371 -98558 -92226 -71149 -11743 95027 79030 30394 51441 175075 165400 33361 129411
10360 129411 316646 153387 -30066 -121335 -70224 -67353 -70104 -103810 -107480 -37337 30245
10349 30245 13670 143083 245719 147217 70984 39074 -82203 -110411 -187926 -128599 -1231
10338 -1231 -158569 -316421 -114295 28592 -113084 -162195 -23449 -32831 17568 186431 312899
10327 312899 353891 237418 180198 251760 173792 91331 -107194 -87643 -55980 -130253 -264689
10316 -264689 -323582 -334279 -197258 -271569 -246897 -109477 24135 164192 124095 133935 162747
10305 162747 53669 -51070 -65896 -18031 -15301 146181 193140 75160 125321 175318 128387
10294 128387 83151 39549 -455 150893 318923 272953 266586 162838 74201 246 236682
10283 236682 232895 231297 148502 56791 146167 149414 -10292 -18043 -33060 -68496 -50046 11649
10271 11649 103920 103078 99746 3115 206291 411512 318782 352283 380417 250710 142028
10260 142028 118241 63972 284331 508112 498257 430487 337759 336780 393015 354808 375612 436120
10248 436120 225361 182845 186267 249379 271642 305918 218352 52508 119645 381437 365523
10237 365523 160579 136354 167148 133961 110592 124769 211950 109642 123524 163646 252924
10226 252924 259961 35371 125429 360467 386437 342249 166396 79481 183513 247205 279378
10215 279378 361281 399143 56956 -37949 61121 185723 219152 229723 221817 147537 139267
10204 139267 137792 158888 263892 247907 360131 378409 341277 331218 375646 306117 216691
10193 216691 181628 259727 272808 370848 377549 341974 478058 508823 481146 308285 280791
10182 280791 335103 401044 418764 548778 568277 584079 572887 509978 437221 473477 639444
10171 639444 818225 899973 723694 613074 574565 577297 654626 505047 391411 582754
10161 582754 531697 553627 543307 565737 642546 667060 763546 646097 556843 559183 582971
10150 582971 585321 496604 518047 681309 601479 526644 636899 577946 501233 440193 581939
10139 581939 800219 894864 1072823 1086601 1132668 1036673 1015271 1061907 1014458 1030698 1154546
10128 1154546 1234526 1216267 980073 1060203 1164694 1181495 1359461 1255807 1068397 1102111
10118 1102111 1102951 989504 880750 827069 936836 1119319 1290529 1150385 1068757 1240053
10108 1240053 1293601 1237245 1389847 1594769 1811071 1895121 1885368 1813865 1833747 1724546 1864011
10097 1864011 2044860 2227610 2405488 2345731 2394746 2392211 2466787 2474292 2607659 2537897 2522906
10086 2522906 2605194 2592977 2865160 2884561 2723734 2687770 2668294 2803906 3057703 3132041
10076 3132041 3241924 3211417 3249107 3423726 3481714 3699397 3795902 3782023 3959797 4266218
10066 4266218 4775698 5001553 5483234 6175154 6972681 7673205 7919076 8055065 8411435
10057 8411435 9226048 10251072 11639976 13572158 16395457 20257869 25252556 31666993
10049 31666993 40173674 52390776 71842282 103917238 151099871 200741006 190071359
10042 190071359 130938627 84505869 58288051 44470475 37047140 33046460 31067700
10035 31067700 30274461 30414178 31339904 32863809 34885877 36947996 38927120 41078928
10027 41078928 43244339 45278582 46940891 47506572 46877139 45792930 44116160 42179262
10019 42179262 40122801 38079535 36110923 34506586 32926715 31388192 30040769 28990602
10011 28990602 28214905 27716801 27577101 27607242 27968547 28669118 29595942 30688886 32206430
10002 32206430 33888435 35932520 38445375 41404564 44817982 48676217 52992290 58101551
9994 58101551 63387167 68705557 74022963 78901185 83086743 86143927 87396224 86838205
9986 86838205 84698927 80853598 75871287 70387942 64670607 59157030 53997380 49153392
9978 49153392 44835292 41169544 37885471 35044574 32817019 30915538 29319272 27979129
9970 27979129 26845510 25928807 25355647 24983925 24785290 24839938 25212863 25724816 26369116
9961 26369116 27149856 28346269 29688836 31115359 32696367 34206917 35846584 37229809
9953 37229809 38181816 38853672 39065826 38679347 37541614 35842994 33693238 31409706 28714179
9944 28714179 26005837 23509806 21227876 19199871 17397489 15964497 14540422 13170344
9936 13170344 11930275 10619374 9628864 8821002 8261249 7840456 7339046 6696089 6336140
9927 6336140 6037460 5667743 5369261 5111045 4871041 4605350 4353323 4194004 3942738 3602359
9917 3602359 3103136 2984351 2913028 2816089 2681642 2571391 2430612 2327788 2280951 2140092
9907 2140092 2056388 2078327 2008047 2072568 1920470 1702290 1694592 1672265 1410014 1243338 1154070
9896 1154070 1162051 1398860 1413565 1278898 1205472 1245930 1143437 1137193 1271356 1426575 1405513
9885 1405513 1357213 1177537 1209772 1112463 963647 863972 999643 1120479 1128313 917192 734962
9874 734962 747527 927056 912518 878521 931338 900015 706622 698270 780124 720393 575208
9863 575208 329653 317762 471680 544617 437388 255595 330916 550019 621059 601886 563843
9852 563843 599554 662987 620124 542941 552941 707244 557597 534536 437635 425293 481819
9841 481819 507994 586136 637684 840608 697571 679112 693451 542993 626063 559128 519014
9830 519014 402455 225402 238343 273218 377611 361968 153168 123676 139558 122701 189304
9819 189304 221523 205074 239801 271447 132442 208883 379149 444919 236518 304584 411049
9808 411049 266802 133745 133468 185649 254201 301075 232843 278240 358439 359135 302030 381711
9796 381711 413064 404476 357818 189059 77908 163911 193715 141222 374683 408490 314516
9785 314516 194147 250292 361236 470480 418926 378262 387523 364763 367069 347463 446530
9774 446530 346059 142408 137279 217403 227078 100924 -87275 48080 179406 330495 271202
9763 271202 84343 167841 267226 294881 120292 65287 104024 284318 387616 215567 185001
9752 185001 152183 231866 234231 100327 28715 183308 176624 104998 -18682 -168409 -205842
9741 -205842 -41383 18816 -4917 -44975 -152231 -164754 -112029 -84092 -183041 9424 204051
9730 204051 191865 65874 155311 178509 263249 68631 125542 224915 259038 193135 313736
9719 313736 266905 201716 188463 193786 203368 287239 444220 384714 280577 357580 422040 328097
9707 328097 240667 283874 234517 238105 151892 186481 222078 40671 -126125 -197819 -1995
9696 -1995 245035 222151 260818 256273 101192 -39077 -18566 -59721 -246074 -68543 142944
9685 142944 188424 167140 119717 -53418 -164968 33936 109040 -16614 -169470 -164004 -157416
9674 -157416 -270306 -123964 -9233 59340 22495 -10230 117358 137085 159595 241224 219299
9663 219299 108826 101191 141355 -30415 165188 114494 75150 112403 16376 26035 83935
9652 83935 28446 -100392 -84603 -142919 22356 243693 195666 397537 379700 456024 664655
9641 664655 708418 626717 525459 498104 631049 523331 336366 286166 424183 403428 213703
9630 213703 5060 179106 191953 222795 206720 315939 369284 245869 44574 -217934
9620 -217934 -190712 -204457 -220952 9960 106953 242860 123541 -141693 -289464 -139780
9610 -139780 -70771 -10651 -56274 -195844 -34189 -68431 -175697 -119141 -7357 113618 71078
9599 71078 -4235 -24316 -74414 -101944 -94770 -53100 17423 -64732 -42865 -36324 -165568 -59520
9587 -59520 72879 127022 142991 184911 229918 265753 298325 183685 99314 -5685 -19103
9576 -19103 -166283 -92437 52508 60237 62125 30103 -30643 -89025 119311 223840 148270
9565 148270 119408 14429 290605 354983 216036 212535 186969 187041 339389 249961 238185 201512
9553 201512 24968 13201 48669 151701 165718 21557 -173893 -129768 -43651 -65797 -158153
9542 -158153 -90246 -116779 -41024 109285 147380 74075 296943 365033 538359 481568 301268
9531 301268 77587 40270 92898 223966 256073 278627 343987 303712 221608 57030 -88465
9520 -88465 -160029 -70584 8256 96035 231027 159401 83041 12876 6142 85280 293141 300184
9508 300184 174971 170179 105656 166710 253959 299200 232911 319094 389240 357006 71970
$$ [...]
##END NTUPLES=NMR SPECTRUM
##END=
