##TITLE=Analysis number 325920
Compound Code cc 19603
Project Code adrs
Chemist Name prosynth
##JCAMPDX= 6.0         $$ Bruker NMR JCAMP-DX V2.0
##DATA TYPE= NMR SPECTRUM
##DATA CLASS= NTUPLES
##ORIGIN= Bruker BioSpin GmbH
##OWNER= nmr
$$ XWIN-NMR		Version 3.5
$$ Fri Jan 19 09:08:18 2007 GMT Standard Time (UT+0h)  MAYBRIDGE\nmr@NMR_250MHZ
##.OBSERVE FREQUENCY= 250.131544655141
##.OBSERVE NUCLEUS= ^1H
##.ACQUISITION MODE= SIMULTANEOUS (DQD)
##.ACQUISITION SCHEME= undefined
##.AVERAGES= 16
##.DIGITISER RES= 18
##SPECTROMETER/DATA SYSTEM= dpx250
##.PULSE SEQUENCE= zg30
##.SOLVENT NAME= CDCl3
##.SHIFT REFERENCE= (INTERNAL, CDCl3, 0, 16.522)
##AUDIT TRAIL= $$ (NUMBER, WHEN, WHO, WHERE, WHAT)
$$ ##TITLE= Audit trail, XWIN-NMR		Version 3.5
$$ ##JCAMPDX= 5.01
$$ ##ORIGIN= Bruker BioSpin GmbH
$$ ##OWNER= nmr
$$ C:\u/data/dgb/nmr/ADRS/1410/pdata/1/auditp.txt
$$ ##AUDIT TRAIL=  $$ (NUMBER, WHEN, WHO, WHERE, WHAT)
(   1,<2007-01-19 09:07:56.74 +000>,<MAYBRIDGE\nmr>,<NMR_250MHZ>,
      <created by zg, POWCHK disabled, PULCHK disabled
       configuration hash MD5:
       49 4B E0 1D 92 C2 6B 37 9F E6 65 BC 52 41 86 1D
       data hash MD5: 64K
       5D D3 78 01 81 08 E2 45 D5 C2 4A A3 14 46 9D C4>)
(   2,<2007-01-19 09:08:09.41 +000>,<MAYBRIDGE\nmr>,<NMR_250MHZ>,
      <Start of raw data processing
       ef LB = 0.3 FT_mod = 6 PKNL = 1 SI = 32K 
       data hash MD5: 32K
       14 6A DB 2D E9 B6 49 71 E0 49 3C 3A C3 94 84 E0>)
(   3,<2007-01-19 09:08:11.10 +000>,<MAYBRIDGE\nmr>,<NMR_250MHZ>,
      <apk 
       data hash MD5: 32K
       82 2B 24 57 AC 37 A9 4B 31 09 E0 2C FE 45 57 99>)
(   4,<2007-01-19 09:08:11.85 +000>,<MAYBRIDGE\nmr>,<NMR_250MHZ>,
      <abs ABSG = 5 
       data hash MD5: 32K
       7C A9 36 E8 CD 53 54 B2 21 6D 3F 6A 8D AB 31 A4>)
$$ ##END=
$$ 
$$ hash MD5
$$ 11 7C 05 C1 75 5D FE E4 4C 63 AF B2 0F BE 95 78
##$RELAX= 
##$RELAX= 
##$RELAX= 
##$RELAX= 
##$RELAX= 
##$RELAX= 
##$RELAX= 
$$ Bruker specific parameters
$$ --------------------------
##$DU= <C:\u>
##$EXPNO= 1410
##$NAME= <ADRS>
##$PROCNO= 1
##$TYPE= <nmr>
##$USER= <dgb>
##$AMP= (0..31)
100 100 100 100 100 100 100 100 100 100 100 100 100 100 100 100 100 100 
100 100 100 100 100 100 100 100 100 100 100 100 100 100 
##$AQSEQ= 0
##$AQ_mod= 3
##$AUNM= <au_zg>
##$AUTOPOS= <3 >
##$BF1= 250.13
##$BF2= 250.13
##$BF3= 250.13
##$BF4= 250.13
##$BF5= 500.13
##$BF6= 500.13
##$BF7= 500.13
##$BF8= 500.13
##$BYTORDA= 1
##$CFDGTYP= 0
##$CFRGTYP= 5
##$CHEMSTR= <none>
##$CNST= (0..31)
1 1 145 1 1 1 1 1 1 1 1 1 1 1 1 1 1 1 1 1 1 1 1 1 1 1 1 1 1 1 1 1 
##$CPDPRG= <>
##$CPDPRG1= <>
##$CPDPRG2= <>
##$CPDPRG3= <>
##$CPDPRG4= <mlev>
##$CPDPRG5= <mlev>
##$CPDPRG6= <mlev>
##$CPDPRG7= <mlev>
##$CPDPRG8= <mlev>
##$CPDPRGB= <>
##$CPDPRGT= <>
##$D= (0..31)
0 1 0 0 0 0 0 0 0 0.06 0 0 0 0 0 0 0.0002 0 0 0 0 0 0 0 0 0 0 0 0 0 0 
0 
##$DATE= 1169197675
##$DBL= (0..7)
120 120 120 120 120 120 120 120 
##$DBP= (0..7)
150 150 150 150 150 150 150 150 
##$DBP07= 0
##$DBPNAM0= <>
##$DBPNAM1= <>
##$DBPNAM2= <>
$$ [...]
##$SUBNAM7= <"">
##$SUBNAM8= <"">
##$SUBNAM9= <"">
##$SW= 20.6930455092707
##$SWIBOX= (0..15)
0 0 3 0 0 0 0 0 0 0 0 0 0 0 0 0 
##$SW_h= 5175.983436853
##$TD= 65536
##$TD0= 1
##$TE= 294.16
##$TE2= 300
##$TE3= 300
##$TEG= 300
##$TL= (0..7)
0 120 120 120 120 120 120 120 
##$TP= (0..7)
150 150 150 150 150 150 150 150 
##$TP07= 0
##$TPNAME0= <>
##$TPNAME1= <>
##$TPNAME2= <>
##$TPNAME3= <>
##$TPNAME4= <>
##$TPNAME5= <>
##$TPNAME6= <>
##$TPNAME7= <>
##$TPOAL= (0..7)
0.5 0.5 0.5 0.5 0.5 0.5 0.5 0.5 
##$TPOFFS= (0..7)
0 0 0 0 0 0 0 0 
##$TUNHIN= 0
##$TUNHOUT= 0
##$TUNXOUT= 0
##$USERA1= <user>
##$USERA2= <user>
##$USERA3= <user>
##$USERA4= <user>
##$USERA5= <user>
##$V9= 5
##$VALIST= <valist>
##$VCLIST= <CCCCCCCCCCCCCCC>
##$VD= 0
##$VDLIST= <DDDDDDDDDDDDDDD>
##$VPLIST= <PPPPPPPPPPPPPPP>
##$VTLIST= <TTTTTTTTTTTTTTT>
##$WBST= 1024
##$WBSW= 4
##$XGAIN= (0..3)
0 0 0 0 
##$XL= 0
##$YL= 0
##$YMAX_a= 306043
##$YMIN_a= -405796
##$ZGOPTNS= <>
##$ZL1= 120
##$ZL2= 120
##$ZL3= 120
##$ZL4= 120
##$ABSF1= 16.522
##$ABSF2= -4.171173
##$ABSG= 5
##$ABSL= 3
##$ALPHA= 0
##$AQORDER= 0
##$ASSFAC= 0
##$ASSFACI= 0
##$ASSFACX= 0
##$ASSWID= 0
##$AUNMP= <proc_1d>
##$AZFE= 0.1
##$AZFW= 0.1
##$BCFW= 0
##$BC_mod= 0
##$BYTORDP= 0
##$COROFFS= 0
##$CY= 12.5
##$DATMOD= 1
##$DC= 0
##$DFILT= <>
##$DTYPP= 0
##$F1P= 14.0000005364418
##$F2P= -0.99999901652339
##$FCOR= 0.5
##$FTSIZE= 32768
##$FT_mod= 6
##$GAMMA= 0
##$GB= 0
##$INTBC= 1
##$INTSCL= 1
##$ISEN= 128
##$LB= 0.3
##$LEV0= 0
##$LPBIN= 0
##$MAXI= 10000
##$MC2= 0
##$MEAN= 0
##$ME_mod= 0
##$MI= 0
##$NCOEF= 0
##$NC_proc= -5
##$NLEV= 6
##$NOISF1= 0
##$NOISF2= 0
##$NSP= 0
##$NTH_PI= 0
##$NZP= 0
##$OFFSET= 16.522
##$PC= 1
##$PHC0= 222.6312
##$PHC1= 16.27276
##$PH_mod= 1
##$PKNL= yes
##$PPARMOD= 0
##$PSCAL= 4
##$PSIGN= 0
##$REVERSE= no
##$SF= 250.13
##$SI= 32768
##$SIGF1= 0
##$SIGF2= 0
##$SINO= 400
##$SIOLD= 32768
##$SREGLST= <1H.CDCl3>
##$SSB= 0
##$STSI= 32768
##$STSR= 0
##$SW_p= 5175.98343685301
##$SYMM= 0
##$S_DEV= 0
##$TDeff= 65536
##$TDoff= 0
##$TI= <Analysis number 999999
Compound Code 99
Book Reference 9
Project Code 9>
##$TILT= no
##$TM1= 0
##$TM2= 0
##$TOPLEV= 0
##$USERP1= <user>
##$USERP2= <user>
##$USERP3= <user>
##$USERP4= <user>
##$USERP5= <user>
##$WDW= 1
##$XDIM= 32768
##$YMAX_p= 399730604
##$YMIN_p= -533833
$$ End of Bruker specific parameters
$$ ---------------------------------
##NTUPLES= NMR SPECTRUM
##VAR_NAME=  FREQUENCY,     SPECTRUM/REAL,   SPECTRUM/IMAG
##SYMBOL=    X,             R,               I
##VAR_TYPE=  INDEPENDENT,   DEPENDENT,       DEPENDENT
##VAR_FORM=  AFFN,          ASDF,            ASDF
##VAR_DIM=   32768,         32768,           32768
##UNITS=     HZ,            ARBITRARY UNITS, ARBITRARY UNITS
##FACTOR=    0.157963299565203, 1,           1
##FIRST=     4132.6476996994, 0,             0
##LAST=      -1043.33573715361, 0,           0
##MIN=       -1043.33573715361, -533833,     0
##MAX=       4132.6476996994, 399730604,     0
$$ Real data points
##PAGE= N=1
##DATA TABLE= (X++(R..R)), XYDATA
$$ [...]
23292b8759N028R090r8064o0671L8534J23883Q4592j8826j01880j26766p0008
23281b43847M251J12886k73Q0379l8478q023N1370P1960P51m2420r3297m8358
23269a53099j8206K4835J09229J06023K0397q668j23941j10270Q865N0050l6506
23258a31291j32862M4791R0052k6971m2027Q1013m947k2338q3356K5756M7054
23247a55126l9206m7429o6137J01493P8230K5730n244k58K3382P9302j09383k42157
23235c56803j0596J37469Q6977m8410L9640M0856J14273K2643n1719J10673M2014
23224A27017j65953j63264R5939M2812L5047r3484q522O3546L9307m1962r4695
23213a64212n356J07143J75304O0390l4512j26p8239m4549P732K4272m4871R656
$$ plain form
23292 -28759 -23731 -14641 -112705 -173376 -134842 -10959 73633 54807 -47073 -173839 -243847
23281 -243847 -239596 -126710 -126983 -46604 -85082 -93105 -41735 30225 30976 -11444 -104741 -153099
23269 -153099 -171305 -146470 -37241 68782 89179 80511 -43430 -153700 -144835 -94785 -131291
23258 -131291 -264153 -219362 -129310 -156281 -198308 -117295 -122242 -144580 -227936 -202180 -155126
23247 -155126 -194332 -241761 -307898 -206405 -128175 -102445 -107689 -107947 -84565 -5263 -114646 -356803
23235 -356803 -367399 -229930 -142953 -191363 -151723 -110867 3406 26049 -25670 85003 127017
23224 127017 -38936 -202200 -106261 -63449 -28402 -121886 -130408 -66862 -27555 -69517 -164212
23213 -164212 -169568 -62425 112879 173269 138757 138631 60392 15843 23575 47847 2976 12632
23201A2632J2183n2956o8587j7904o7269j1153J12057J54169L9810Q1828j20808
23190G4002J12435n0833k12707k6345N3422r9461j6236K1514N8555j3498o632
23179a05784q999j40021R8587J44254J3544r7090m7743M2214L0269J20100J31730
23168A81061L91J4210o4223J4771Q661l7291r4918L6082K6477o066k0694j39174
23156h0713p6104J57358J50407q3652q5251l5799m4593n4277L7298J27248P2989
23145H4911J8145o8340j13317l330O7784m0899M712J0423j446N354j16508K5947
23133a26564M634j19202R1533N4870M8741L6387J03124O5849m180Q1872N6647
23122B93711j58384j67952N6316L5168o4759J3317j1267j6055k0414M788q139
$$ plain form
23201 12632 24815 -28141 -96728 -114632 -181901 -193054 -80997 73172 112982 194810 74002
23190 74002 186437 135604 -77103 -103448 -50026 -149487 -165723 -144209 -85654 -99152 -105784
23179 -105784 -114783 -254804 -156217 -11963 1581 -95509 -143252 -101038 -70769 49331 181061
23168 181061 181452 195662 131439 146210 154871 117580 22662 58744 85221 79155 58461 -80713
23156 -80713 -156817 541 150948 67296 -17955 -53754 -98347 -152624 -115326 11922 84911
23145 84911 103056 34716 -78601 -81931 -14147 -55046 -50334 -39911 -41357 -36003 -152511 -126564
23133 -126564 -121930 -241132 -149599 -94729 -45988 -9601 93523 159372 155192 237064 293711
23122 293711 135327 -32625 23691 58859 -5900 7417 -3850 -19905 -40319 -35531 -43670
23111d3670m6161M4131J1306p1941m8917K8954O9426o026J2982j68290J333N1396
23099a65477J2067l1588j5655m5209Q682J52702J27672J09009r166j53005j2342
23088b2310K8330J31310J04984r4490k9166j54084j67365M6547R2521L7951j853
23077b7625k893j5611O0169J02047J9441j1747j7041K0453l1326r1716o3515j28569
23065a87933q8780p257J13647M0540L583J76208j5299N8887q3804m7755n7607
23054i5570o4381M7698k2451P6811J6371j96498k9229J17975J22893m8556J53455
23043G8518J26590L0012k02622q3173j798k8509R1788L7281m3448qN467p8187
23031f8089K0294l8420P5032L1123j34000k9308O0321R2204Q3654q8930j60163
$$ plain form
23111 -43670 -89831 -45700 -34394 -106335 -155252 -126298 -56872 -62898 -49916 -218206 -216873 -165477
23099 -165477 -153410 -184998 -200653 -245862 -237180 -84478 43194 152203 143037 -9968 -22310
23088 -22310 6020 137330 242314 147824 118658 -35426 -202791 -156244 -63723 -25772 -27625
23077 -27625 -30518 -46129 14040 116087 135528 123781 106740 127193 95867 4151 -59364 -187933
23065 -187933 -276713 -283970 -170323 -129783 -126200 50008 34709 93596 9792 -37963 -95570
23054 -95570 -159951 -112253 -134704 -57893 -41522 -238020 -267249 -149274 -26381 -74937 78518
23043 78518 205108 235120 32498 -50675 -52473 -80982 10806 48087 4639 4631 10098 -68089
23031 -68089 -47795 -86215 -11183 19940 -114060 -143368 -83047 9157 92811 3881 -156282
23020a56282j4467Q8381n748J4836L7315j2520p0591K4132P0678K6006J9155Q1063
23008A01958J3722j139o609j7778J28628p0998k48195j37445q3218J38009N2478
22997a30587R5192R5497j12815l7709J8442L7822L9563Q1431J17288j25795j49237
22986g0908M818j36118o0699J57458L7518n09L9299R160N621J5809q2956n1903
22974a33410O558N6953O5777M2138L1005j12228j4302O319K3896Q7891M1444J3532
22962A15573m8411p9591P9920L1534j9314m4173p6521n4465O9103n4589p7494
22951a58428j73309Q340O9464N0087J6982K2237k0703j90299P5679K19379j1590
22940i2161J9999P1751q9333N475L9412n718j22714k6426p7523J32534Q0440k7468
$$ plain form
23020 -156282 -170749 -82368 -88116 -73280 -35965 -48485 -119076 -94944 -24266 1740 20895 101958
23008 101958 115680 114541 107932 90154 218782 147784 -100411 -237856 -321074 -183065 -130587
22997 -130587 -35395 60102 -52713 -90422 -71980 -34158 5405 86836 204124 78329 -70908
22986 -70908 -66090 -202208 -262907 -105449 -67931 -68440 -29141 -19981 -14360 1449 -81507 -133410
22974 -133410 -126852 -69899 -4122 38016 69021 -43207 -57509 -51190 -27294 60597 102041 115573
22962 115573 67162 -12429 67491 99025 79711 35538 -40983 -95448 -26345 -80934 -158428
22951 -158428 -331737 -323397 -253933 -203846 -186864 -164627 -185330 -375629 -299950 -80571 -92161
22940 -92161 -72162 -411 -89744 -84269 -44857 -50575 -173289 -199715 -277238 -144704 -64264 -91732
22928i1732m1994j54123L2568J77156M718p0075r2683R5273K5928j2040k4281
22917a51285k79R8419P1398O5442o7640l9956n8555j65006M3689M8680Q4203k2391
22905i3281N9382K6590J1601o3151N0846Q9145m7139J9416o1224k0375j23008
22894a51198m736M9745K2224J1161q3467K1586j5952k2185J1074P4468N5678l3476
22882f5078m7229R1633M1510K9741j3526m6722O6532P2358J9371O5961k3652n2364
22870A38535j08163k2618n3711n5606O3098J48425N0646j50157j04067m4634p670
22859a45922Q4415J05548j6475n7766l0856N4118n0404J4611J04694R5691J7281
22848A74935j12938j08739J24929L0050N6430n5454n1768N444J7987Q569O7299
$$ plain form
22928 -91732 -133726 -287849 -255281 -78125 -73407 -143482 -236165 -140892 -114964 -127004 -151285
22917 -151285 -151564 -53145 18253 83695 16055 -23901 -82456 -247462 -203773 -155093 -70890 -93281
22905 -93281 -33899 -7309 4292 -58859 -8013 81132 33993 53409 -7815 -28190 -151198
22894 -151198 -155934 -106189 -83965 -72804 -156271 -134685 -150637 -172822 -161748 -87280 -31602 -65078
22882 -65078 -112307 -20674 20836 50577 37051 -9671 56861 129219 148590 214551 190899 138535
22870 138535 30372 7754 -45957 -101563 -38465 109960 160606 10449 -93618 -138252 -145922
22859 -145922 -61507 44041 27566 -30200 -61056 -6938 -57342 -42731 61963 157654 174935
22848 174935 61997 -46742 78187 108237 164667 109213 57445 62889 80876 89445 156744
22837A56744j30155l5694r4184o6499l9310J06631Q5407k9816J84284K2527r3492
22826F6443k02600o2009M6461Q4913j49886k0198L4391R9525K3812J03976n1567
22815b6739j00488J27832N9609N6055l9906n6101j6511n6775R7052n5657M769
22804f860q78j02433q2275j7584O4049P2230J00641m7741m5737L718Q0817q4616
22792f6669j01723r2639P5256J28038q2891j63707k3698O7276P4427R0279m9728
22781a45779N2683O4895m2928M0843j5051m8918o2792l6774m4626Q048J46757
22770h3642Q6981k0097n5841j5281J10465k4800j22062l8626Q3349N9191N335
22759a5028p0631P1921P8567n7056J6867R8532J844n6462l5282r2975o6005K4083
$$ plain form
22837 156744 26589 -9105 -103289 -169788 -209098 -102467 -17060 -46876 137408 159935 66443
22826 66443 -136157 -198166 -151705 -66792 -216678 -236876 -202485 -102960 -79148 24828 -26739
22815 -26739 -127227 605 60214 116269 76363 20262 3751 -53024 44028 -11629 -6860
22804 -6860 -7738 -110171 -192446 -210030 -145981 -73751 26890 -20851 -66588 -62870 17947 -66669
22792 -66669 -168392 -261031 -185775 -57737 -140628 -304335 -328033 -260757 -186330 -96051 -145779
22781 -145779 -93096 -28201 -71129 -30286 -45337 -94255 -157047 -193821 -238447 -230399 -83642
22770 -83642 3339 -16758 -72599 -87880 22585 -2215 -124277 -162903 -79554 -20363 -15028
22759 -15028 -85659 -13738 64829 7773 24640 123172 125016 68554 33272 -59703 -125708 -101625
22747a01625l2095P2456j2577j0086K1826L1903r7831l8268j12538m921K2813
22736b60943O7246J1878Q4449L2998O2710O7170k0987n8011k9113r3192j20977
22725b56772l2813M0266J17354J72055N1077m8226l0169N1438l0059n6119q9618
22714a11586Q5507J15020r0294j79272O9380K06205n8877j03069l408o0901N9967
22703g1328J60378J09616o7815r7746K0103k5698k3795J35858r9055L4649j23640
22692d8473o7081n1542l6551J13674K25031k7029q0825N8424j08786j6588M3879
22681D133O8830K4567q7365k2316L4544l8589q1406l0269p4753q7812L3805j0648
22669b67279M0651N9773R3737M7314j46624O004K8428P25J4154P9913L0382j9361
$$ plain form
22747 -101625 -133720 -61264 -73841 -83927 -62101 -30198 -128029 -166297 -278835 -283756 -260943
22736 -260943 -193697 -181819 -97370 -64372 -1662 65508 44521 -13490 -42603 -135795 -256772
22725 -256772 -289585 -249319 -131965 40090 91167 42941 12772 64210 34151 -21968 -111586
22714 -111586 -26079 88941 -1353 -180625 -111245 94960 36083 -66986 -70394 -131295 -71328
22703 -71328 89050 198666 130851 33105 53208 27510 3715 139573 40518 75167 -48473
22692 -48473 -115554 -167096 -203647 -89973 135058 108029 27204 85628 -23158 -39746 4133
22681 4133 72963 97530 10165 -12151 22393 -16196 -97602 -127871 -202624 -290436 -256631 -267279
22669 -267279 -226628 -166855 -73118 -25804 -172428 -166424 -137996 -137271 -123117 -43204 -12822 -32183
22657c2183m3271j7809M6387n2611m0843m9496K04658M9927j31956N0034J4518
22646b645J53395Q2299j19444j63482n765O03K7745J1823o3482L007O137J0697
22634e9112j3051k5741N6842P9258J7723L9010K0778P144k9889j01440j67353
22623a75831r4575J26522J05642M5967J8480k01377l8278J30727O5847p812j29920
22612a54608o3285R277J49415Q7080M2096L2777k9409r9363j05983J8921J08375
22601d707k8456p923o8735m9201N3939J04708j8378k10145j61642N9812P6716
22590b54012m3022P4268O1845r989L1263J05338O8221n6634j20541O2541P488
22579g3234Q4417M5913K5480q2631j11654L2112l9947J27983J43117N2194J13020
$$ plain form
22657 -32183 -75454 -93263 -46876 -99487 -140330 -189826 14832 64759 -67197 -17163 -2645
22646 -2645 150750 233049 113605 -49877 -55642 -55039 -27294 -15471 -78953 -75946 -69809 -59112
22634 -59112 -72163 -97904 -41062 38196 55919 94929 115707 122851 92962 -8478 -175831
22623 -175831 -270406 -143884 -38242 7725 26205 -175172 -213450 -82723 -16876 -24688 -154608
22612 -154608 -217893 -208616 -59201 27879 69975 102752 73343 -26020 -132003 -113082 -4707
22601 -4707 -33163 -41086 -109821 -159022 -105083 -375 -18753 -228898 -390540 -330728 -254012
22590 -254012 -297034 -222766 -160921 -170910 -139647 -34309 33912 -22722 -143263 -80722 -73234
22579 -73234 11183 57096 82576 -55 -111709 -79597 -119544 8439 151556 203750 316770
22568C16770k6339j60261j66857n5593j1119l3222J12404Q7109K7196p3182N6535
22557G3441q9817j81871j52814J6511J22534J50620K5345P4101L899j5224r830
22546A6895l3761K4368J737L7198M5319J9260N5204n3901j5929n5713j52300k1227
22534a32850K0092P8182Q8934n1249j8447M0905o5392j26628l0044J21929N2500
22523b2068L5464k8278k5928K4512k1182M3875J39526p9404k1105P0792M2004
22512A58208Q1878l7323j46323r2656l0883N2237O078o9552L3371J1401k304L6250
22500C82n6103N1158J20532k1957k7200j53524j25683m3708J70314J39944n3776
22489C79O886Q9468Q2893p118n8827j01202M8241N288q1636j6206N2432O7514
$$ plain form
22568 316770 290431 130170 -36687 -92280 -103399 -136621 -24217 62892 90088 16906 73441
22557 73441 -16376 -198247 -351061 -334550 -212016 -61396 -36051 38050 41949 26725 16895
22546 16895 -16866 7502 9239 46437 91756 111016 166220 112319 96390 40677 -111623 -132850
22534 -132850 -112758 -34576 54358 3109 -15338 25567 -39825 -166453 -196497 -74568 -22068
22523 -22068 13396 -14882 -40810 -16298 -37480 6395 145921 66517 45412 116204 158208
22512 158208 240086 202763 56440 -36216 -67099 -14862 -8784 -78336 -44965 -33564 -35868 382
22500 382 -55721 -4563 115969 94012 66812 -86712 -212395 -256103 -85789 54155 379
22489 379 7265 96733 179626 172508 113681 12479 60720 66008 -15628 -31834 20598 88112
22477H8112l8926K961j4429O696J4925l2361k01826p7581Q3984J52651K8009L7929
22465E0144o2695N895j8237o1288m2976n4955J37114P8084j7273J05438j38674
22454a9423k9573R4828m1844o4132R1708k710J13245k978p570j16537j29891j9722
22442a34599J4841j01059l503J13520M3186L0293O8921L0320l1182L5813m4102
22431B2449K5356j82605k019n65R1782k718j6517J1425R479J37816O9972l6055
22419A27800O06M6285m9288r5530Q1593J02877j06139p5985k4491J11007J55523
22408B74258l3106L5033M3326q743r6001q3029q4093j13625R4388n27q4077j30488
22396a86684n4524J59921L4887p7071l4087P9727R7668m6216L047j41280o915
$$ plain form
22477 88112 49186 52147 37718 44414 59339 26978 -174848 -252429 -168445 -15794 12215 50144
22465 50144 -12551 -6656 -24893 -86181 -129157 -184112 -46998 31086 13813 119251 -19423
22454 -19423 -48996 45832 3988 -60144 31564 28854 142099 139121 131551 15014 -114877 -134599
22442 -134599 -119758 -220817 -224320 -110800 -67614 -37321 31600 61920 30738 66551 22449
22431 22449 47805 -134800 -136819 -137384 -45602 -48320 -64837 -53412 -43933 93883 163855 127800
22419 127800 128406 174691 125403 29873 111466 214343 108204 32219 7728 118735 274258
22408 274258 241152 276185 319511 310768 214767 131738 47645 -65980 28408 27881 -56196 -186684
22396 -186684 -241208 -81287 -46400 -123471 -157558 -77831 19837 -26379 -23332 -164612 -171527
22385a71527J07865P1490l1193j09957K6709k2875J43252Q9882k9488q8989m1181
22374e6012r9486l6510J8000L6924P9610J2879m7539R11k5876P4366O4490R1320
22362A13077q992k1265n5272k2165k3715j01921j9138m6791M1645J06531J03526
22351F5520L2722p1400j6745n4446J33401P370K3166n4149j08716n2638j4213
22340a10128M5870l0685J13728J43898J06318n4185j27891l2742p8644N8474O9909
22329A03922p3434N2083N4360M913o6455K9675j3703L6249j0767N762Q8944j00022
22317A11527j09085q5311N2075O6063N3880l1061j56950M614K9217n849Q3433
22306A2553P1688l6397J4837R46n0042o1457L7355M0811p0946K6244R3462j1248
$$ plain form
22385 -171527 -63662 7828 -23365 -133322 -106613 -129488 13764 103646 74158 -14831 -56012
22374 -56012 -155498 -192008 -174008 -137084 -57474 -44595 -92134 -91223 -117099 -42733 21757 113077
22362 113077 104085 82820 27548 5383 -18332 -120253 -139391 -186182 -144537 -38006 65520
22351 65520 98242 26842 10097 -44349 89052 96422 119588 65439 -43277 -95915 -110128
22340 -110128 -64258 -94943 18785 162683 269001 214816 86925 54183 -24461 34013 103922
22329 103922 30488 82571 136931 141844 75389 105064 91361 127610 116843 122605 211549 111527
22317 111527 2442 -82869 -30794 35269 89149 58088 -98862 -94248 -65031 -70880 12553
22306 12553 84241 47844 62681 63627 13585 -47872 -10517 30294 -40652 -14408 79054 67806
22294F7806m671o9373K312p1613Q6190M5940P8574l3983Q325K7244J00568L8395
22282B75714p5583p0061j12122o8782J5674K2039O3352K129r4680o6585j8049
22271a26954J24901J4568P0972K1055o2061j0209o4022M938K2722L0588N4996
22260H1494O3024J22506m0763r0053j93116p0559K7331m942M3300O6428Q4730
22249H9380L3557n1192J7059L0294p740j34253o3957L9081o2442R0463R1205O3405
22237A34860L6277r3065j71353j2667P0623J42160k6947j9254n236J3534j13028
22226d4096r9871M2989Q8535J1653J7434l6575k0678p4471L8916j8007L6653K1480
22214c6038k1891J9696O5480L9839o3031o6328J07885J7097l8931M961m669j10460
$$ plain form
22294 67806 63135 -6238 -3926 -75539 10651 56591 135165 101182 109507 136751 237319 275714
22282 275714 200131 130070 17948 -50834 -35160 -13121 50231 52360 -42320 -108905 -126954
22271 -126954 -2053 12515 83487 104542 42481 32272 -31750 -26812 -4090 26498 81494
22260 81494 144518 267024 226261 136208 -56908 -127467 -100136 -105078 -61778 4650 89380
22249 89380 122937 71745 88804 119098 111358 -22895 -86852 -47771 -110213 -19750 71455 134860
22237 134860 171137 78072 -93281 -105948 -35325 106835 79888 60634 55398 68932 -44096
22226 -44096 -143967 -100978 -12443 -790 16644 -19931 -40609 -115080 -76164 -94171 -57518 -36038
22214 -36038 -57929 -38233 27247 67086 4055 -62273 45612 62709 23778 28739 24070 -86390
22202h6390j9784n1998m166L9716N1603O7112J4820j0760r0462M0850J61910M3639
22190A56090J093q4197K1900O561l7085n9894q6675P5045P3677q1933n0199P4519
22178H902J31617o1310L2865l8215j13412r16Q1871r3291j26944J15985J04207
22167D1359N8415O3122j17707o8855J40934n0391j05673l7763l0313L2226j5729
22156i0375O911K6941Q0282q703J2423k6513m2156L9866J19833J51466l2036j83225
22144E4714j00064J69673l6024n3691J15986J3377N9812r9277r7285L4112m9203
22133A2130l5680Q988L7265J20255K3346J988J7873m0168j0708n052j31596o9175
22121g0534J36396L110k7196j00814j04379R4944J37960R3481o2318J6126l8081
$$ plain form
22202 -86390 -106174 -158172 -162338 -122622 -71019 -3907 10913 153 -90309 -49459 112451 156090
22190 156090 157183 72986 94886 101447 64362 4468 -82207 -7162 66515 -15418 -65617 8902
22178 8902 140519 79209 112074 73859 -39553 -40469 41402 -51889 -178833 -62848 41359
22167 41359 99774 162896 45189 -23666 117268 66877 -38796 -76559 -106872 -74646 -90375
22156 -90375 -83464 -56523 23759 15056 27479 966 -41190 -1324 118509 269975 237939 54714
22144 54714 -45350 124323 88299 34608 150594 163971 223783 124506 27221 61333 12130
22133 12130 -23550 -14562 22703 142958 166304 168292 186165 145997 135289 130237 -1359 -70534
22121 -70534 65862 68972 41776 -59038 -163417 -68473 69487 162968 100650 116776 78695
22110G8695j00625n9479M1144P0624j5080m7116P5525o3658L3955J04002M8977
22099A66964q6004o4215n7181R1601M7531n2448J2786Q202m2619J1172K4384M031
22087F4204N4449M6369j31788j70782k3700O7454J73075O8822Q4131J5030j67782
22076G9482K13K9307q600p980J27585n1058o6640k02522j35296M5255K788l4745
22064b22211r5374Q0771J19289Q7784R0656K9068O702l9201j13422q595K1355
22053d3178M6917J5084N7031l1301j7431L8071l2621N1369j5001r8824M411M1439
22041A5966l9175l6378J8230n5190N6524j01711l6588O7010J00500J5281n3464
22030d8995Q7820j151j02520o0688r8595j8005l670J26784P8018K293j17299J0647
$$ plain form
22110 78695 -21930 -81409 -40265 30359 15279 -31837 43688 -19970 13985 117987 166964
22099 166964 80960 16745 -40436 51165 98696 46248 59034 67236 24617 35789 60173 64204
22087 64204 118653 165022 33234 -137548 -161248 -93794 79281 148103 232234 247264 79482
22076 79482 79695 109002 100402 92422 220007 168949 102309 -100213 -235509 -190254 -187466 -222211
22064 -222211 -317585 -236814 -117525 -29741 60915 89983 96685 57484 -55938 -64533 -43178
22053 -43178 3739 18823 75854 44553 27122 65193 32572 83941 68940 -29884 -25473 15966
22041 15966 -23209 -59587 -41357 -96547 -40023 -141734 -178322 -111312 -10812 4469 -48995
22030 -48995 38825 37674 -64846 -125534 -224129 -242134 -245804 -119020 -41002 -38709 -156008 -145361
22018a45361L7808P290J5104l3366l5144K8285O4321L2924j19258J5872O7079
22007f4446N6514J50098Q3151j9734j16486q7750m1497J26182j37379j27557l2950
21996b11854J38862L9117n1440L2293K6169P1550R339Q782L8995Q917j3374M007
21984A01363K2133j00032j229Q1730k1401o8434n6636J11873J28116O7438r4041
21973A70880j31757q7876L6514o5652N9945J12280m722m3j9571p2772n268O5944
21961E7902M3377k7591l6978r5277q992m8155m2430J20696N722o7659m4672P3390
21949g0667J5408R1507J3467n5834Q3388P2890P1354j60595k2130M2743M0290
21938A21821j0296j30438r4041J4770Q2735J6919J18012k9425n0770n492k16p5713
$$ plain form
22018 -145361 -107553 -100263 -85159 -118525 -153669 -125384 -61063 -28139 -147397 -131525 -64446
22007 -64446 -7932 142166 225317 205583 89097 1347 -40150 86032 -51347 -178904 -211854
21996 -211854 -72992 -33875 -85315 -53022 -26853 44697 54036 62818 101813 110730 97356 101363
21984 101363 123496 23464 22235 103965 82564 14130 -42506 69367 197483 264921 170880
21973 170880 39123 -48753 -12239 -77891 -17946 94334 89612 89569 69998 -2774 -8042 57902
21961 57902 101279 73688 36710 -58567 -67559 -115714 -158144 -37448 -31726 -99385 -144057 -70667
21949 -70667 -55259 36248 49715 -6119 77269 150159 221513 60918 38788 81531 121821
21938 121821 111525 -18913 -112954 -98184 -15449 1470 119482 90057 39287 33795 33579 -42134
21926d2134r2790j07891R680J3333J53559N4714l6720j46397M4084J22092K5587
21915b883J16867J9526p1804j07174k1289j4166N1230J26338K0431l4562j40213
21904e7699j05246p7048R2031J24528N7756o8321r5573o2956q6364J5225J37315
21893a26352J71030j2341n5525N1943l0884k5965m7648M5402J0760N7378k3512
21882A4286n7572J18503Q7104M4895o5728j17149j38127r9666P2587M8783M1515
21871e0569p911K4932o120o2230k6644K1377m9409J0002K3825m7273l2318L3604
21859a68734n0968L716J49586R7609O386r6920r2374n0213q972m2177M2596J22615
21847h7850N961q1190n5133L7234J11273J15389M5004l8569j41170q1142k4531
$$ plain form
21926 -42134 -134924 -242815 -233135 -219802 -66243 -11529 -48249 -194646 -150562 -28470 -2883
21915 -2883 113984 133510 61706 -45468 -66757 -80923 -29693 96645 117076 82514 -57699
21904 -57699 -162945 -239993 -147962 -23434 34322 -33999 -129572 -192528 -278892 -263667 -126352
21893 -126352 44678 32337 -23188 28755 -2129 -28094 -75742 -30340 -19580 37798 14286
21882 14286 -43286 75217 162321 207216 141488 24339 -113788 -213454 -140867 -92084 -50569
21871 -50569 -58480 -33548 -39668 -101898 -128542 -107165 -156574 -146572 -122747 -170020 -202338 -168734
21859 -168734 -219702 -215986 -66400 31209 37595 -59325 -151699 -201912 -210884 -253061 -210465 -87850
21847 -87850 -81889 -163079 -218212 -180978 -69705 45684 90688 52119 -89051 -170193 -194724
21836a94724o2164M0321M8612j01197K03766J08327L1650L888L350l3487p7751
21825b9409k3483j8004Q8137K4509R3584l8083j72790p9776O5185P1221J8411
21814d98k6440r0667L4209p0155M9879L0344K6698r5897K1858L0136j8510K9215
21802g9828P8586J23482m0441l8813k3175p0599M3647J08931n7966q8356K3756
21791b0776j56066Q8583Q0585P721p664J6712j4244p912N0638J72062k7181p2244
21779A10214k20560k6791n4631L2620J088k6245K5428J40436J52360j15315j14071
21768i5467L5638K5274n4276J4058M2570n7398R8151R7357O1946j08388L2987
21757I2452N4133O1n8136j33496Q5349Q5815j48522n7364Q8391O4359M0825J1238
$$ plain form
21836 -194724 -256888 -216567 -167955 -269152 -65386 42941 74591 78479 81829 48342 -29409
21825 -29409 -52892 -70896 17241 41750 135334 97251 -75539 -155315 -90130 -18909 -498
21814 -498 -26938 -117605 -83396 -153551 -103672 -73328 -46630 -142527 -120669 -90533 -109043 -79828
21802 -79828 -1242 122240 81799 42986 19811 -50788 -7141 101790 43824 -44532 -20776
21791 -20776 -176842 -88259 -7674 47 -7617 9095 -5149 -13061 37577 209639 182458 110214
21779 110214 -110346 -137137 -191768 -159148 -158060 -184305 -158877 -18441 133919 18604 -95467
21768 -95467 -59829 -34555 -88831 -74773 -32203 -89601 8550 105907 167853 59465 92452
21757 92452 146585 146646 88510 -44986 40363 126178 -22344 -79708 8683 73042 113867 125105
21745A25105M0190p6609J9129q5564p3700L6421k5261j4507L2865p3134J9217
21734g5848L7981N4577o3051Q2658j1061n8532l0463L2756N6112n7958m9726m4375
21722a26930L485J50801Q8760k2142q7203j19596N3761O2877m4115j12294q8416
21711b41012n168J84033N2787j0198J5758K1640N0182K7445j11615J0334O2315
21700E6501j05314q0513Q9796M0219r3284k7970J42400J00279k8497Q215P5238
21689A77070o8030k5305n4860j8957N4617M7394m5060j27594o3099M4334R519
21678f9971n7715J9702O4546Q114Q4306o2175p4251m8043r823N2010J53777M8552
21666A09029L1506K129l1196p9700o6221m1515O1196Q7637j1033O0058N2779n8225
$$ plain form
21745 125105 165295 88686 107815 22251 -51449 -15028 -40289 -54796 -21931 -95065 -75848
21734 -75848 -37867 16710 -46341 36317 25256 -33276 -63739 -30983 25129 -32829 -82555 -126930
21722 -126930 -123445 27356 116116 93974 6771 -112825 -59064 3813 -40302 -152596 -241012
21711 -241012 -246180 -62147 -9360 -19558 -3800 17840 68022 95467 -16148 -5814 56501
21700 56501 -48813 -129326 -39530 689 -92595 -120565 21835 122114 93617 101832 177070
21689 177070 109040 83735 28875 9918 64535 111929 66869 -60725 -123824 -79490 -69971
21678 -69971 -127686 -107984 -43438 -35324 48982 -13193 -87444 -135487 -145310 -93300 60477 109029
21666 109029 140535 142664 111468 31768 -34453 -75968 -14772 72865 61832 121890 174669 116444
21654A16444r1074j9290k3273o311n1137r4185j55748o688L0072L7761k9448N9831
21642b33046N5422J3041M7889Q4956J10296p3533m7041Q7045m1133K1590J76570
21631B02056J11141j66559j12463m9631m1176M4950O1763r859j20394N2030P9106
21620E0964N1092j18345o26j9361n7633O0376j2747O6662J9440J5980J7320r9016
21608b5894j08587K9523M0967M2094J64147p5013j17311o0278O6617K0997p3800
21597i6538l5805K2912K5121n769k135j23559k7249J1612M2243L2729O2467o18
21585i4589P1690O6192J6713j8979j53028m4788J28910j4571p0000j5308O5457
21574f2301j33768r040K20759O8936j03250n0974m7202J29922J22068n5642k5698
$$ plain form
21654 116444 25370 6080 -17193 -23504 -74641 -168826 -324574 -331262 -301190 -263429 -292877 -233046
21642 -233046 -177624 -164583 -116694 -31738 78558 5025 -42016 45029 3896 25486 202056
21631 202056 313197 146638 34175 -15456 -56632 -11682 50081 40222 -80172 -28142 50964
21620 50964 102056 -16289 -16915 -36276 -93909 -33533 -46280 20382 39822 55802 73122 -25894
21608 -25894 -134481 -104958 -63991 -21897 142250 67237 -50074 -110352 -43735 -22738 -96538
21597 -96538 -132343 -109431 -84310 -90079 -92214 -215773 -243022 -231410 -189167 -156438 -93971 -94589
21585 -94589 -22899 43293 60006 41027 -112001 -156789 -27879 -42450 -112450 -127758 -62301
21574 -62301 -196069 -205109 15650 84586 -18664 -69638 -116840 13082 135150 79508 53810
21563E3810l6017O3882k4549j9796n078m2967Q4035J8654j8846l5891l4749j7557
21551a5069k801P7660L29o143N3036J01497P6336j3613j16536o8593r9316L8237
21539B5024P4582k0979q0930L4749m0749p9617n1300K2791K3500m8629J9082K1031
21527a01445K1685m1121m7498J05164J41745L9354N6206m5706j92269J3361K5351
21516b5173p717J00724J8268M7294j08368n6708J7526k5127k1338l1909O4423
21505b8105O7852Q1819K1582K6284j67575R899J4253K1467N4809N3505p4508J7967
21493I9249Q9491n3044j15593l9756J59118L31j29497r8273Q5146o6995M9415
21482b0408M4484j5908q4231L534Q6975l4156r312O1631j7610m594o0469p070
$$ plain form
21563 53810 17793 81675 57126 37330 32252 -10715 73320 91974 73128 37237 2488 -15069
21551 -15069 -17870 59790 60119 53976 107012 208509 284845 271232 154696 86103 -13213 25024
21539 25024 99606 78627 -2303 32446 -8303 -87920 -139220 -116429 -92929 -141558 -122476 -101445
21527 -101445 -79760 -120881 -168379 -63215 78530 117884 174090 128384 -63885 -50524 -25173
21516 -25173 -32890 67834 86102 133396 25028 -31680 -14154 -39281 -60619 -92528 -28105
21505 -28105 39747 121566 143148 169432 1857 11756 26009 47476 102285 155790 81282 99249
21493 99249 188740 135696 20103 -19653 139465 139796 10299 -87974 -2828 -69823 -20408
21482 -20408 24076 8168 -76063 -72529 14446 -19710 -29022 32609 14999 10405 -50064 -57134
21470e7134O8064Q2779k3841j28553P0259N6387p2642n1170n1232J6828J21358
21459C1103M4072M149l7435K4763R29m1070l5617o4542Q825n0845n8999K3828
21447a50839l2338J19164L8772N531J5891Q9366o5236q7430P6104K0531r3151
21436f3635P676P4944q1377j47781o6813J15056J64786J2823l985m5321j9236
21425e2863R1994J08118J4568n2765o8343k3955J6613J28931k0800j37874n9094
21414e5470K6448P3659n2655N0532M1092j37848j31519J09226J47620p6130m9047
21403e4092N4717L7765K5155J38246Q8954j04515r0777l7771L9672n8754j67917
21392a29317j42085J83898J78693K6877r1108J6207M5624n502J7759J3356o5675
$$ plain form
21470 -57134 10930 93709 69868 -58685 11574 67961 -4681 -55851 -107083 -90255 31103
21459 31103 75175 79324 41889 66652 67581 26511 -9106 -73648 -64823 -115668 -174667 -150839
21447 -150839 -183177 -64013 -25241 -19710 -3819 85547 20311 -67119 8985 29516 -63635
21436 -63635 -55959 18985 -62392 -210173 -276986 -161930 2856 15679 11694 -33627 -52863
21425 -52863 39131 147249 161817 109052 40709 16754 33367 162298 141498 3624 -55470
21414 -55470 -29022 44637 -8018 42514 83606 -54242 -185761 -76535 71085 -5045 -54092
21403 -54092 625 38390 63545 201791 290745 186230 95453 57682 97354 38600 -129317
21392 -129317 -271402 -87504 91189 118066 26958 43165 88789 83287 101046 114402 48727
21381D8727q6412P4721q6234M928n0755J26254Q4811N6249J10826R2997l3187
21370C42925k19113m8006N2724j31866j13818J55179J0554O8148N3195j1413M1809
21359B00318k3572k7817N835q7478j54100o8293K3870M729R0736J9351J26898
21348A10477L2739n3157j2390q0412k9078k4591J10987M2800k9802o1448j0821
21337d696P2605J627M8242j0747N4451k1150l2835j3049o8408P9017M6363j16536
21325C4884o4864J2620J27832O7379j25473m9401m3378r1784J3745J39172J4822
21314C5554r3853n7332M3196p8226N5460O4669J58849M4130p4235R8234Q3979
21303B80425q3277j16350r8759j32443M6411l0536k9391K0186P5482n489J16830
$$ plain form
21381 48727 -37685 37036 -49198 -44270 -95025 31229 116040 172289 283115 376112 342925
21370 342925 123812 75806 128530 -3336 -117154 38025 48579 116727 169922 158509 200318
21359 200318 176746 148929 154764 67286 -86814 -155107 -131237 -126508 -35772 -16421 110477
21348 110477 143216 90059 77669 -2743 -31821 -56412 54575 97375 67573 6125 -4696
21337 -4696 67909 69536 117778 107031 161482 140332 107497 94448 26040 105057 151420 34884
21325 34884 -29980 -17360 110472 177851 52378 2977 -40401 -132185 -118440 20732 35554
21314 35554 -58299 -115631 -72435 -150661 -95201 -30532 128317 172447 98212 196446 280425
21303 280425 197148 80798 -17961 -150404 -103993 -134529 -163920 -143734 -68252 -73741 43089
21292D3089J15013j08236p9303K8275j290J68408L0011R863K4586j94119j23608
21281h7311O2208M3467O5135M118K4917M5887Q4007L1071n3781n2917k08160l3523
21269g4882P2951M9607o3854K15168J6502m9245q3476j5204M4473l6861q2725
21258g546R784J20482O3006r8233m8775J1701Q4507l303j24191j42717R2412N6764
21246A3891J299K0104n10p8017N3696l2161m2J615J2504J03414N5763J4893j1082
21233A55367q7908N157K8289Q0535Q9909p5396m5377j741q2142r2410l582N1000
21221B1701j4985m6834R2306L2706J5482p5958J9542o6326r7075J01269k7354
21210d5526l7591P8681J58254P4574M9336j79351j84829M6559N7405n2520N5443
$$ plain form
21292 43089 158102 49866 -29437 -1162 -2452 165956 195967 205830 230416 36297 -87311
21281 -87311 -25103 18364 83499 87617 112534 158421 242428 273499 219718 166801 -41359 -74882
21269 -74882 -1931 47676 -16178 198990 215492 166247 82771 67567 112040 75179 -7546
21258 -7546 2238 122720 185726 87493 38718 50419 134926 131623 7432 -135285 -42873 13891
21246 13891 15190 35294 34784 -43233 10463 -21698 -21740 -20125 -7621 95793 151556 166449 155367
21233 155367 67459 72616 100905 181440 271349 195953 150576 148835 66693 -25717 -29299 21701
21221 21701 6716 -40118 52188 84894 100376 24418 43960 -22366 -119441 -18172 -45526
21210 -45526 -83117 -4436 153818 228392 277728 98377 -86452 -39893 17512 -35008 20435
21199B0435Q0259n8609o3819P0057J5042j28930k03614M327M7411M2953l668m9563
21187b27719j8944R3986R1866J3037J613q8178o5170J24656M7230L829K4324K9130
21175B9660r2749M7028m1730K7089O0589r178Q3484Q2991l8271m5228j2580j9811
21163G1294j2747Q677j07293R340l7068J14343J18413J3633j1239n7392L6529
21152A46490J58148J90709J43147L38661J29954R110K01368p516p7645l35511
21142H96915k40120j19891q8980l5480K2134j14687J8958K30071K26338J42789
21132I38047L52324r04j12646O8303J73530k22766k66828j33079j78337k50473
21122C67171k61518K7273O6124l3360n5664m2706J7686n913n737P0414J1949n3444
$$ plain form
21199 20435 100694 42085 -21734 48323 63365 -65565 -269179 -264852 -217441 -174488 -178156 -227719
21187 -227719 -246663 -152677 -60811 -47774 -46161 -134339 -199509 -74853 -27623 -23794 530 29660
21175 29660 -63089 -16061 -57791 -30702 29887 20709 104193 187184 148913 103685 91105 71294
21163 71294 58547 67224 -40069 -30729 -67797 46546 164959 178592 167353 109961 146490
21152 146490 304638 495347 638494 977155 1107109 1116219 1317587 1310071 1232426 896915
21142 896915 656795 536904 447924 412444 434578 319891 338849 568920 795258 938047
21132 938047 1290371 1289467 1176821 1245124 1418654 1195888 929060 795981 617644 367171
21122 367171 105653 132926 199050 165690 110026 67320 85006 79093 73356 143770 155719 102275
21110A02275j13865r6162M8413J27232l7988o9268m4240j3851o2095R193Q2163
21099f8193L3846L8391J30354J6217o7336J8032L5775m0718r4064Q1540J9073
21088A02917j60467J19191J17672k4861m1650J2669j35476q1276J07544o79j02361
21077h6777P9576k9497l8300n4421j20290O7403J77490P6389J7404p7897L7465
21066D8545o4425n0029o0615n3437L9033M6588K1358R7183L1286m2319L4417Q0780
21054A28365Q7618n6293l7507j09324l2974n300m2086k7192P7220L5454j13859
21043i5878j8295J14340M2512j15870J7197k3881m8977k0123J7264J34184k4956
21032b2483m1487M8624r781r8979M3003N805j04304J01831M2308Q1883N8146P8050
$$ plain form
21110 102275 -11590 -107752 -59339 67893 29905 -39363 -83603 -97454 -159549 -150356 -68193
21099 -68193 -34347 4044 134398 150615 83279 101311 137086 96368 2304 83844 102917
21088 102917 -57550 61641 179313 154452 112802 125471 -10005 -91281 16263 15584 -86777
21077 -86777 -7201 -36698 -74998 -129419 -249709 -182306 -4816 71573 88977 11080 48545
21066 48545 -15880 -65909 -126524 -179961 -140928 -94340 -72982 24201 55487 13168 47585 128365
21054 128365 215983 159690 122183 12859 -20115 -25415 -67501 -94693 -17473 17981 -95878
21043 -95878 -114173 167 42679 -73191 -55994 -79875 -128852 -148975 -131711 2473 -22483
21032 -22483 -63970 -15346 -25127 -124106 -81103 -75298 -179602 -77771 -35463 46420 104566 182616
21020A82616o7874o0554m5091m5749j2038M546m589r3912P5702J74946J40928
21009B48931l728m7666l544o3354q6257k5004J01145N1450L0125j18595r1481
20998g978J76414k8427o1193n8092J631K6524J30118m116Q0577m1357j49576j33748
20986f9223j11665N3034N8920o2567j3976K0972Q987l3684q512m9275J21865L407
20974h1717O0927p6445j1217j3586j06008J03116J49575j56580j20528R4490J08747
20963d9226J03253K2044L4561k2557j46817p8258j7904n2395N6458J07994N0409
20952G562K9679P9416j16430k09814M2568J17330q9146j2038l1501P9988O8085
20941c4301J04317M4579r7508M0317m2554k37181q02J08522q6234j30018R076
$$ plain form
21020 182616 114742 54188 9097 -36652 -48690 -44144 -48733 -142645 -66943 108003 248931
21009 248931 245203 197537 193993 130639 44382 19378 120523 171973 202098 83503 -7978
20998 -7978 168436 140009 78816 20724 22355 48879 178997 174881 255458 214101 64525 -69223
20986 -69223 -180888 -127854 -68934 -131501 -145477 -124505 -115518 -149202 -157714 -206989 -85124 -81717
20974 -81717 -20790 -97235 -108452 -122038 -228046 -124930 24645 -131935 -252463 -157973 -49226
20963 -49226 54027 76071 110632 88075 -58742 -137000 -154904 -207299 -150841 -42847 7562
20952 7562 37241 116657 227 -209587 -167019 -49689 -138835 -150873 -182374 -102386 -34301
20941 -34301 70016 114595 17087 57404 14850 -222331 -223133 -114611 -200845 -330863 -321787
20930c21787N6090J27201J30027J5507M6794P1648R0325l9049n1109J8950k8175
20919A16422J9140K3204J32689q2983j17795J18250P615L482L5845n0517r9122
20908A06230o8026l1761J05653J54517m1659j31725p4282p1372k3718m5685o2764
20897a84592P5924O8593N4072J46173P0393l3284q6486j27787j20780J15736K051
20886a9987J12876K52941p6599n3512k8800R24q5053j3254n7855k1086j01382
20875i0787J0334K6661K8233J53678l8394o5976R0143K8543p5756j8866l9475
20864H338K1493P1471o761j4459m3370o5002m9265K3687J06494N3976n667m4932
20852E6003N0416m595N254k346o2928j214K5337o357l445j07784j6142r4059j5676
$$ plain form
20930 -321787 -265697 -138496 -8469 7038 53832 125480 215805 176756 125647 144597 116422
20919 116422 135562 158766 291455 208472 90677 208927 216542 220024 255869 205352 106230
20908 106230 38204 6443 112096 266613 224954 93229 18947 -52425 -76143 -121828 -184592
20897 -184592 -108668 -40075 13997 160170 230563 197279 110793 -16994 -137774 -22038 -19987
20886 -19987 92889 345830 269231 215719 186919 187843 102790 89536 31681 10595 -90787
20875 -90787 -80453 -53792 -25559 128119 89725 23749 113892 142435 66679 47813 8338
20864 8338 29831 101302 94541 80082 36712 -28290 -77555 -53868 52626 106602 100935 56003
20852 56003 106419 101824 107078 104732 41804 40590 65927 59570 56125 -51659 -67801 -161860 -177536
20839a77536J26528P3646n8547L7863J00075R4956l1382q3372m5003M3013M274
20828H4515K5860L6207j05890J13056P8323j9966o5510r3964M0607M2189m0651
20817I4776j34973L1064J49070P6758o1079p4666R768M8296J05296L3994l3396
20806B44908J0932N771J45142o9643k2259m4108j40887J4052J03899m3639j41317
20795F2851o0604p1998J287P7134L0591J10987k0161j3562M3366P7037N8471R364
20783C04763M6202m5804k1447L8784o2328j20946J12802R0862j20225p588j0372
20772B04703K4358j5756p6310j3193J5847J4833o591M5847k835q4796J704j3575
20760I4236M3604K3470j7622n8919p1848R1620L6026k1912l6656o4899N7717N0643
$$ plain form
20839 -177536 -51008 22638 -35909 1954 102029 196985 165603 82231 37228 80241 84515
20828 84515 110375 146582 40692 153748 232071 212105 146595 52631 93238 135427 94776
20817 94776 -40197 -9133 139937 216695 155616 80950 90718 139014 244310 278304 244908
20806 244908 255840 261611 406753 337110 314851 270743 129856 143908 247807 204168 62851
20795 62851 2247 -69751 -68464 8670 39261 150248 130087 116525 159891 236928 295399 304763
20783 304763 350965 305161 283714 322498 260170 139224 252026 342888 222663 215075 204703
20772 204703 229061 213305 136995 123802 139649 154482 147891 193738 190903 106107 107811 94236
20760 94236 137840 161310 143688 84769 12921 104541 140567 118655 81999 17100 74817 125460
20748A25460P2767n1476o9244k9845R2783J10030O3165o0654j07022p6059j2848
20737E7057q5694J21094Q0873l3139R847P2805J7903j8218J0146o7697k3395j14791
20725B6791j71678M086K30691R5497j62090k8210j4508K0658q5725J37399J09437
20714A62348M2051k3748J2524p916o1739N6778m6979Q4403O5805J2961j37759
20703A58729j7533n2384L639J48261J2218j02011r031l4063o980m4269J21888
20692A78464R6061K7530M6814Q5127r5166j11692l0648K6364L8281o0773M8664
20681B49026l6701j20993k0532o4601Q7987K73422J88225J9560J05773J40730
20671H21896J00060j30568k18074j44094K8524j8510n5255L1503K7304J78503
$$ plain form
20748 125460 198227 146751 77507 47662 140445 250475 313640 252986 145964 69905 57057
20737 57057 -28637 92457 173330 140191 150038 222843 240746 222528 232674 164977 141582 26791
20725 26791 -144887 -140801 89890 185387 23297 -4913 -19421 1237 -84488 52911 162348
20714 162348 204399 180651 193175 185259 123520 180298 133319 217722 283527 296488 158729
20703 158729 141196 88812 92451 240712 252930 150919 141888 107825 100845 56576 178464
20692 178464 274525 302055 348869 433996 338830 227138 196490 222854 261135 200362 249026
20681 249026 212325 91332 70800 6199 94186 367608 555833 575393 681166 821896
20671 821896 921956 791388 573314 429220 457744 439234 383979 415482 442786 621289
20661F21289j2163j4004r287N7326J04450Q8706P7911R0368J8275j83095j85032
20650F54744j5027m6502p9737L1609J6190L1993k7718o3942Q816j22350N5111
20639D43187O7357R9491P9777l1110j03961r4993M7417m4359p5090K3681j7089
20628C94308J26299M1301J2988M9748Q5494q5033p05j1566K1169N7289n7989k7219
20616F06084l9377k0290n2736O6822J52705J53551L765r8923J0663O0094J34869
20605I77227J64710M3783k8219j2300L4872P0440M4421M1608K5593P3010J29253
20594A564398L3906J9075M5610Q5643P0733K50987M83417N44351M05626j1644
20584C492102K4911K95616Q5813l20112j74882j49943r8094K2340J00114R0161
$$ plain form
20661 621289 609126 595122 585835 643161 747611 836317 914228 1004596 1022871 839776 654744
20650 654744 639717 593215 513478 545087 561277 593270 565552 501610 510426 388076 443187
20639 443187 510544 610035 689812 658702 554741 459748 507165 462806 387716 411397 394308
20628 394308 520607 561908 574896 624644 710138 625105 624400 612834 634003 691292 633303 606084
20616 606084 566707 546417 493681 560503 713208 866759 870524 771601 782264 842358 977227
20605 977227 1141937 1185720 1157501 1145201 1180073 1250513 1294934 1336542 1362135 1435145 1564398
20594 1564398 1598304 1617379 1662989 1748632 1819365 2070352 2553769 3098120 3503746 3492102
20584 3492102 3517013 3812629 3898442 3578330 3403448 3253505 3155411 3177751 3277865 3368026
20574C368026L38851K48717K89725O35393P60267O13440O52431J011937J047355
20565H966142R08364L22240L73761P40362Q94046P85870Q83640J644365K710378
20556A8229168M160200O430636R762254J5638383K7422495M6296728O4951472
20549A92891336M8218380n954458j5540871J6528548J7725007l8207989o6720629
20542A48939324m7491363k6032198j3573131o194969k88747N678042J3869989
20535G4906947K8062435M9535707O7947701M1716216j6809641j7969426J6887095
20528B44277034R797780m8316768o9401282m7791145k7551398j6601158j0717791
20521C3695272p299478n036781l642807k505557j452492j042728r84052j033928
$$ plain form
20574 3368026 3706877 3955594 4245319 4880712 5640979 6254419 6906850 7918787 8966142
20565 8966142 9874506 10196746 10570507 11310869 12204915 12990785 13874425 15518790 18229168
20556 18229168 22389368 28820004 38582258 54220641 81643136 127939864 192891336
20549 192891336 241109716 235155258 219614387 236142935 253867942 215659953 148939324
20542 148939324 101447961 75415763 61842632 55647663 55358916 61036958 74906947
20535 74906947 102969382 152505089 220452790 262169006 245359365 227389939 244277034
20528 244277034 254074814 205758046 136356764 88565619 61014221 44413063 33695272
20521 33695272 26395794 21359013 17716206 15210649 13758157 12715429 11731377 10697449
20513A0697449o87017l22077m85457j102964j001036p85776n62717o76067q83771
20504D190567p29498o12200l10582m1127q1579r8308p929J15779K97996J99632
20494B922751J91233j35113j57685l6094m4731k31625m99534l45545l10515k31579
20484A121563q9583j46535j74621o3624l8778m0025J4298N8271L4185j07801J3257
20473E80607K819P943L4663J7041l6070l5983M3889p5718j27603m470M0452M2294
20461D89864J9215j02615j33309r7820O65J26543Q3824l1175p3199j06775p9034
20450I6184p4569O8756p890k6910L2255j22981l3767j8740M7781Q997r2500o3566
20438a86950M3779J75733m8966J3925k4632j6501J6680j8146p5391M6251j00256
$$ plain form
20513 10697449 10010432 9688355 9202898 8099934 7098898 6313122 5750405 5074338 4190567
20504 4190567 3461069 2848869 2538287 2497160 2415581 2317273 2309344 2425123 2723119 2922751
20494 2922751 3113984 2978871 2821186 2785092 2740361 2508736 2009202 1663657 1353142 1121563
20484 1121563 1031980 885445 710824 647200 608422 568397 582695 640966 675151 567350 580607
20473 580607 583426 591369 626032 643073 607003 571020 614909 539191 411588 407118 447570 489864
20461 489864 509079 406464 273155 175335 176000 302543 386367 355192 281993 175218 96184
20450 96184 21615 90371 82481 55571 87826 -35155 -68922 -87662 -39881 -30884 -123384 -186950
20438 -186950 -143171 32562 -16404 -2479 -27111 -43612 -26932 -45078 -120469 -74218 -174474
20427a74474o7611K664m8229J7683p9701J1070N3152N1508p6048q8085J88785
20416b09286N8603O3522J8724M7757Q7664O689q9516q0973l535l3617Q4346O767
20404d2855p0468J48719n7851L0806N2486J71955K30021J76853J5139k32952o7188
20393C54665N6811K4118j95136k28031j27298J45200Q5150j4359Q0004L9740J19859
20382C40723L9391m648L8148r1890j07540K5816J33270n3135j61275o5278L2870
20371A26452r3199q6139m8640J0933P4360j09454r032M9341Q8797m9346L1027
20360a4900n8944P5098J2449L8779P6289k2675p6843J3487j09429m9250K0663
20349i5276J03277N2577r698n6897k4837J1332L6280j8766j440q2347j4102J08855
$$ plain form
20427 -174474 -242085 -239421 -287650 -269967 -349668 -338598 -285446 -233938 -309986 -398071 -209286
20416 -209286 -150683 -87161 -68437 -20680 66984 73673 -15843 -96816 -100351 -133968 -49622 -42855
20404 -42855 -113323 35396 -22455 8351 60837 232792 462813 639666 654805 421853 354665
20393 354665 411476 435594 240458 12427 -114871 30329 115479 101120 181124 220864 340723
20382 340723 380114 375466 413614 321724 214184 240000 373270 320135 158860 93582 126452
20371 126452 33253 -52886 -101526 -90593 -16233 -125687 -134719 -85378 3419 -45927 -14900
20360 -14900 -73844 1254 13703 52482 128771 106096 29253 42740 -66689 -115939 -95276
20349 -95276 8001 60578 50880 -6017 -30854 -19522 16758 -2008 -3448 -85795 -99897 8958
20337H958L5218j3643L4104j58757k8344J4372l6085M3997j060p6089j01241J11423
20325a67147J49769l2733j29078K7743R4896J39448J2285l7660l8144l108l4450
20314a8179N2514R632k6248j38533n4682k7644Q1850J08827K4222o161l7736Q9472
20302E7334R7270o0169j19445m8512P8632P6153l84N327j003l8528J4909O754
20290F8338J1976J22848M8664r1167p6543J9634J37183L1703j03701j23838O4404
20279A09501l6203l6198K2286N6157k882n4552L8617N874Q7835J8612j75046m3726
20267i725L0498Q853J29431J12190K7934Q5346K64577L14448M6829l42701j63410
20256E04270j35576j50453m59k253j9661Q493o8381K5685J5195P4501J86638J98970
$$ plain form
20337 8958 44176 30533 64637 -94120 -122464 -108092 -144177 -100180 -101240 -177329 -278570 -167147
20325 -167147 -17378 -50111 -179189 -151446 -56550 82898 95183 57523 19379 16271 -18179
20314 -18179 34335 43967 17719 -120814 -175496 -203140 -121290 -12463 11759 5598 -32138 57334
20302 57334 154604 94435 -25010 -73522 5110 81263 80879 86206 85203 46675 61584 68338
20290 68338 80314 203162 251826 160659 84116 103750 240933 272636 168935 45097 109501
20279 109501 73298 37100 59386 115543 112661 58109 96726 102600 190435 209047 34001 -9725
20267 -9725 20773 29626 159057 271247 299181 384527 649104 963552 1010381 667680 504270
20256 504270 368694 218241 217782 215529 195868 204361 135980 161665 176860 251361 437999 636969
20244F36969K55668K40900j82824k41550j59523k35834m784q3512m3983r8227
20234H3300j28998j3272J53954K4960n3909m996j35109j09260K255N2135J03161
20223b5779o064P8454k4285P7419K6035q3371R7608J60763J4961j27708r08k4267
20211A62858r3248j3086J9074k1320O3959J69936L03450L25375J20919k79009
20201G58908k40739k56487j29926j6168j20073j00317o0839m412L8265O9675R4073
20190C1960R4004L25403M46337L89303o9362l93798l00382k30734j53376J2807
20180A52162J26663j45269l439n4746j77250j5191J27333q3599P9389O2470N6692
20169A25215l3883q6905q450M0528R763m5575k3609O0273N9362M0289r1236o6493
$$ plain form
20244 636969 892637 1133537 950713 709163 549640 313806 309022 225510 181527 83300
20234 83300 -45698 -58970 94984 119944 66035 61039 -74070 -183330 -181075 -128940 -25779
20223 -25779 -31843 46611 22326 99745 125780 42409 140017 300780 315741 188033 187125 162858
20211 162858 69610 56524 75598 54278 118237 288173 591623 916998 1037917 758908
20201 758908 518169 261682 131756 115588 -4485 -104802 -165641 -170053 -131788 -62113 31960
20190 31960 125964 451367 897704 1287007 1217645 823847 523465 292731 139355 152162
20180 152162 278825 133556 130117 75371 -101879 -117070 10263 -73336 6053 68523 125215
20169 125215 91332 4427 -4023 36505 46268 693 -22916 37357 96719 137008 45772 -20721
20157b0721J42061j3570P3317k3910R086l545m9618p7634p24L2764j34016k6271
20145i2781N0323o310L4312k5131j6553m3239q0954J20532R6293J02876R5599
20134B34967m6126n2993k2032K0682q317k771j0532j43170j33186n1074J64355
20123e0197R0221j23943k9664J69910P2680q7168n0352l287M3617J8805p1818
20112b1196p5159L1956J04561M2094l604o0912r3906o958Q1743J292o6404j06069
20100a72562l4985P5876Q998L5130R8559N0902m1112k7361k8978L5604l6729N1972
20088A5314o7203L9492K0828q376j8547J12137J44879K8109n6080j36308p0495
20077C750L2096O3023O1545l5828n3153J0737m240q6253l5552l663Q263J5517
$$ plain form
20157 -20721 121340 107770 181087 157177 166263 162718 113100 35466 34742 67506 -66510 -92781
20145 -92781 -42458 -48768 -14456 -39587 -56140 -99379 -180333 -59801 36492 139368 234967
20134 234967 188841 135848 113816 134498 126181 123410 112878 -30292 -163478 -214552 -50197
20123 -50197 40024 -83919 -113583 56327 129007 41839 -8513 -11800 31817 50622 -21196
20112 -21196 -96355 -64399 40162 82256 78652 17740 -76166 -83124 -1381 -89 -66493 -172562
20100 -172562 -207547 -131671 -122673 -87543 11016 61918 20806 -6555 -35533 71 -36658 15314
20088 15314 -51889 -12397 8431 55 -18492 93645 238524 266633 210553 74245 3750
20077 3750 35846 98869 160414 124586 71433 82170 77930 -8323 -43875 -47538 -39275 -23758
20065b3758K7906J4785m0858N2648N0264K6488j2884j10334o1703r559j06181
20054a93186p8497O7975J03869p397m9167N4602Q7774K2375o653M604L3806o3135
20042b3030m6742O4237p7017M8780P9845J02609k0583p3684M3015k1958j3558
20031F1914p993n2196J5166J53879n210r6136j13221J4577J46451N1170K6819
20020A95220K2940j72071q6031n9241l7334N3840J36761J25552j160r357O8829
20009B37948P6547n0042j20553l5160j3570m2001l4346O3775l0013L9286m1794
19998E0077J09392n063j7585l504Q46Q2663K8641l5568J2788p3614r8619J18333
19986A68787J74192O0520n2874j9865o6132p9805R4460N3255L7202Q4294j94013
$$ plain form
20065 -23758 4148 18933 -21925 30723 80987 107475 94591 -15743 -77446 -87005 -193186
20054 -193186 -271683 -203708 -99839 -107236 -156403 -101801 -14027 8348 1695 6299 40105 -23030
20042 -23030 -69772 -5535 -82552 -33772 46073 148682 128099 54415 97430 75472 61914
20031 61914 53921 1725 16891 170770 165560 69424 -43797 -29220 117231 168401 195220
20020 195220 218160 46089 -39942 -99183 -136517 -82677 54084 179636 178476 169119 237948
20009 237948 314495 264453 143900 108740 95170 53169 18823 82598 52585 91871 50077
19998 50077 159469 154406 136821 133317 134163 216826 245467 209899 222687 149073 50454 168787
19986 168787 342979 403499 350625 330760 264628 184823 279283 332538 369740 454034 260021
19975B60021r9674l9713O7232O0887N8139M1663j1559p5036o4483j6692k183r7293
19963H1309n6369J52566L6464j1920M4000J66q2901P390j1457L0054o0147m520
19951A24635o145P3689K74357R3032J52003J54022R7304J90232K49917L1024j27355
19940A306715J8549L1756j49307j77932k04519n8015j50454j06829P4175j7360
19930E66779o581J82406K99300L64475L47645Q1184r6338n4080n6905j47890l30760
19919A149235m29492k21985k942K3690l7353o8622n3606j11273q8076P0468J8416
19908B48460L4198K9078M2239k3505M1989O2706j24607j01569j16642p2837J01861
19897A21371J04849k0247j22000p224N1332j6878q1025K8438O7022J192m4034
$$ plain form
19975 260021 160347 120634 187866 248753 306892 348555 336996 261960 197477 180785 178602 81309
19963 81309 24940 177506 213970 202050 246050 246216 163315 170705 159248 189302 129155 124635
19951 124635 118490 192179 466536 559568 711571 865593 962897 1153129 1403046 1434070 1306715
19940 1306715 1325264 1357020 1207713 1029781 825262 767247 616793 509964 584139 566779
19930 566779 560198 742604 1041904 1406379 1754024 1835208 1738870 1684790 1627885 1479995 1149235
19919 1149235 719743 497758 494816 518506 481153 412531 358925 247652 159576 230044 248460
19908 248460 282658 311736 353975 330470 372459 435165 310558 208989 92347 19510 121371
19897 121371 226220 205973 83973 76749 128081 111203 30178 58616 125638 126830 82796
19886H2796N1560p9577l0265j5018j0347q0722R5823P5680p739L5974m4358j74305
19874a00498m9632P0245J78809Q4992M9999p6009o2639o3682L1043k1943k8429
19863A2256M3613J28262l0977j95435J4522O3092K4246R2188O6450l9420K469
19852A81266J87248O8914Q6837J9038j25872M6343J7602m7519j07853n889K5834
19841C45949n4279k5302q167o3158K2908O4884J31177P4386L6094J5919n298r1227
19829D43886m8556N1657j44086l275n9506K9452O1316M1793j75284p531K4941
19818B14807k1106J9157M1726o5926q462L621l6116j32739m5973J33715Q1091
19807A83795j4971R7491p6844j30834m2259K8091j62m3471l9710J19012L2247
$$ plain form
19886 82796 134356 54779 24514 9496 -851 -81573 14250 89930 82191 118165 73807 -100498
19874 -100498 -150130 -79885 98924 183916 233915 157906 95267 31585 62628 40685 12256
19863 12256 55869 184131 153154 -42281 -27759 35333 59579 151767 218217 178797 181266
19852 181266 368514 437428 524265 543303 417431 463774 481376 433857 326004 320115 345949
19841 345949 291670 266368 258201 195043 217951 282835 414012 488398 524492 540411 535113 443886
19829 443886 395330 446987 302901 299626 240120 269572 330888 372681 197397 189866 214807
19818 214807 193701 212858 254584 188658 180196 183817 147701 14962 -31011 102704 183795
19807 183795 168824 266315 189471 58637 16378 44469 44307 836 -38874 80138 112385
19796A12385J6128N3898K13557J20655n6063L0410l6706p5181J295P6544L708
19785D60630r1471n7139m5494j3031J64654O6949K05681J84613K43899K01218
19775A320509j46102l9265N0959N4952k5147j46797j66486n6480K5592J42987
19765A014722J39318K45977K08618K20723K03892L33767J70420o9046M7881N12747
19755C029019N55124P7626m39201p41956l66706m4597J92866L8149J90744K70613
19745B761681M11139O62606P18028L83524M12479L57219J53918L00298J89163
19736F350055M2656R6731N36499J133207J775291K642454L715249N893816R968707
19727C2154665J7582247L3829811O0608878P6838685R317108p2240561o4206762
$$ plain form
19796 112385 128513 182411 395968 516623 460560 490970 454264 379083 380378 456922 460630
19785 460630 369159 312020 266526 253495 418149 485098 690779 875392 1119291 1320509
19775 1320509 1174407 1135142 1186101 1241053 1215906 1069109 902623 846143 871735 1014722
19765 1014722 1154040 1400017 1608635 1829358 2033250 2367017 2537437 2468391 2516272 3029019
19755 3029019 3584143 3661769 3222568 2480612 2113906 2069309 2262175 2300324 2491068 2761681
19745 2761681 3172820 3835426 4553454 4936978 5349457 5706676 5860594 6160892 6350055
19736 6350055 6392711 6489442 7025941 8159148 9934439 12576893 16292142 22185958 32154665
19727 32154665 49736912 83566723 144175601 221014286 230331394 158090833 93884071
19720I3884071l4096388j7588280r818490n913906l348330j307939K06667K164504
19712B4181909M885927R306470J7577218L4252957O0234499O9386747m362299
19705B15463428p3263550n8316530l0681609j6340250r425888o098934l917953
19698A7418714k528464k012544j777189j400530q30276q53289q46262m13616k91534
19689F465010l80401k44441j0846P4846L44996L19266J0048L09985N08998L84366
19679G781827M17481Q34908J405576J386422J815603L245768N462121R044569
19671C1394275J5444305K9069161N3915103Q0615323M3356852n8267199p8128846
19664A17398974m4872517k2870659j2521622p437513m464133k273391k54299J772024
$$ plain form
19720 93884071 59787683 42199403 32380913 26467007 23118677 21810738 22017405 24181909
19712 24181909 29067836 38374306 55951524 90204481 150438980 219825727 215463428
19705 215463428 142199878 83883348 53201739 36861489 27435601 21336667 17418714
19698 17418714 14890250 12877706 11100517 9699987 8869711 8016422 7170160 6756544 6465010
19689 6465010 6084609 5840168 5829322 5904168 6249164 6568430 6578478 6888463 7397461 7781827
19679 7781827 8199308 9034216 10439792 11826214 13641817 16887585 22349706 31394275
19671 31394275 46838580 75907741 129822844 210438167 253795019 195527820 117398974
19664 117398974 72526457 49655798 37134176 29696663 25232530 22959139 22704840 24476864
19656B4476864M307642Q162324J5114786K9430242N4724712P7959550K9210587
19649B43386707o6364704p3692824m0579749k0982099j1819199p661688n291266
19642A6995178l515795k455673j698817j071095o86391o00715q12969o69721m91600
19633D992402o66118o98254n59771l81902k17047j94643l29878l49020j33053
19624A462716p0421r093K38150L58540O4020l97508k36920j51137k40946k28255
19614G89146j21155j07641J299m5122k1657j9661Q1510P9441R351j43194j48808
19603C53509m0852K5563o3752n6996k6039m6212O9572M2657Q4738O5906j1841
19592C96253k1752j11209M4079J56771K2304j07302j38631L2861N1092m8569n3156
$$ plain form
19656 24476864 28784506 36946830 52061616 81491858 136216570 214176120 243386707
19649 243386707 177022003 103329179 62749430 41767331 29948132 22286444 16995178
19642 16995178 13479383 11023710 9324893 8253798 7567407 6966692 6153723 5484002 4992402
19633 4992402 4326284 3628030 3068259 2686357 2469310 2274667 1944789 1595769 1462716
19624 1462716 1392295 1383202 1621352 1979892 2043912 1646404 1409484 1258347 1017401 789146
19614 789146 667991 560350 561649 516527 494870 475209 556719 636160 645511 502317 353509
19603 353509 312657 338220 274468 217472 191433 145221 214793 257450 342188 408094 396253
19592 396253 374501 263292 307371 464142 486446 379144 240513 273374 324466 275897 222741
19581B22741R2293Q7108o823l2100J8850J7140L8947L0580l4210R014R1928J84120
19569G19588K88166K60611J99956j51535q7237J22437n537k56304k81849j51891
19559F56405q866m0299k5162N5074J32722K98398K63522J73646M7408k34337l3706
19548A284805J45740N7841l06389l32307l00474k42274j48107j78668l6811Q6030
19538B9386J37028J0543j9467N2949R549p8555R316k5669K9442j00752j66777
19527a13007k782P5277M3364p1283J21920J47780k4341M3355J77799N5565Q1688
19516E35335J6414m5643j09941k09925m8373N7537o2752k7151l7523Q288L8032
19505A14298M4117J4543K8972J59613J72270K67932L84624K27010j55369j18541
$$ plain form
19581 222741 315034 402142 395319 363219 382069 399209 438156 468736 434526 443540 535468 719588
19569 719588 1007754 1268365 1468321 1316786 1229549 1351986 1346449 1090145 808296 656405
19559 656405 647539 607240 582078 637152 769874 1068272 1331794 1505440 1552848 1318511 1284805
19548 1284805 1430545 1488386 1181997 849690 549216 306942 158835 -19833 -56644 29386
19538 29386 166414 176957 157490 210439 219988 141433 150749 125080 154522 53770 -113007
19527 -113007 -115789 -40512 2852 -68431 53489 201269 176928 220283 398082 453647 535335
19516 535335 551749 506106 396165 186240 137867 195404 132652 105501 67978 76266 114298
19505 114298 158415 172958 201930 361543 533813 801745 1186369 1413379 1258010 1139469
19495A139469n0381o492k04682k40605j50156k26636j55676k7263N4828O8912
19485B01318J08115J30743K71299L09426J87220j56549j60168J6036N1272j21055
19475H37657k11333k35080q1213o1168m0760O3996J2935p6449k5903R5754J11458
19464C89894n9510n4882J1359k3825j11311j60870O6974N1614o4297j21721J24657
19453D8082l2058j46851M6777J16422O4149j8852K8823K0518k8287r7930Q0699
19442H1492J20467j4561o6162k6002J57810Q256l0755j08581l6666m8412m299
19431C2587L317k4928J02766j07876n4014J47593j2361n0802K224R9668N6277
19420A94451j56614n0681M7789O7671n4111p5539K7996Q847M446k17779m6172
$$ plain form
19495 1139469 1089088 1082596 877914 637309 487153 260517 104841 77578 132406 201318
19485 201318 309433 440176 711475 1020901 1208121 1051572 891404 907440 958712 837657
19475 837657 626324 391244 310031 248863 208103 272099 285034 208585 182682 278436 389894
19464 389894 330384 275502 286861 263036 151725 -9145 57829 109443 45146 -76575 48082
19453 48082 16024 -130827 -84050 32372 96521 77669 106492 127010 98723 793 81492
19442 81492 201959 187398 121236 95234 253044 261300 230545 121964 85298 36886 32587
19431 32587 35904 10976 113742 5866 -48148 99445 87084 36282 38506 138174 194451
19420 194451 37837 -12844 34945 102616 48505 -27034 962 9809 14255 -203524 -249696
19409b49696N3350Q746M667J27511M5808R8039k888m0912j01307j19806J34217
19398d2271J48339J42444j66325q4626l9996N7954R5233p3393n9698L3925j8873
19387g287O1172n1002j31052M497M9270p749J4485P526k0124O8293J03682o3381
19375B8330j24401k0452j8584k9942j813L9381L4756L9456R9914K1328P7424j07905
19363C7492l1059L4822l3931j20882m5138m2034O9156O9946k2474J6651R5639
19352B8188o5256j79903l755J21068R1581M0396L335q450K8323R0534K8191j1769
19340A62483j45203L645L8647m1863K4098k5972m7969J03361Q9384p141j01252
19329E2218j4121l6403l7162L9976N0550r7035J04244n4468o0178L9453L3319
$$ plain form
19409 -249696 -196346 -187600 -182933 -55422 -9614 88425 85537 44625 -56682 -176488 -42271
19398 -42271 106068 248512 82187 -2439 -42435 15519 110752 37359 -22339 11586 -7287
19387 -7287 53885 2883 -128169 -123672 -74402 -82151 -67666 -60140 -80264 -11971 91711 28330
19375 28330 -96071 -116523 -135107 -165049 -166862 -127481 -92725 -53269 46645 67973 145397 37492
19363 37492 6433 41255 7324 -113558 -158696 -200730 -131574 -61628 -84102 -67451 28188
19352 28188 -37068 -216971 -220726 -99658 -8077 32319 35654 27204 55527 146061 174252 162483
19340 162483 17280 20925 59572 17709 41807 15835 -32134 71227 160611 153470 52218
19329 52218 38097 1694 -35468 4508 55058 -41977 62267 7799 -52379 -12926 20393
19318B0393M5115O2533L6189k06125k1506o3330M2832K05208l4894j80415l4844
19307a28844O340Q302N6629M1020k4511q286N3708K9349q4798m4807J27137M2173
19295G3412K4169m4968m1385r8171l7982J24425R2184L1488M8974J10920J08752
19284C91818l8243J3145J3983J5167P6903K89888L70184J20440j34305n6609J60003
19273A222374K45578j82972m66535l83731j48314n0258L7861J09493O1917J38281
19263E83694L36754M39800J09341j24643r9756R8203J06066l02695m19134k10600
19253E17030j91364r0755j07826P1913J7411M336n0188k1192n471P530r854K5863
19241A67433k365j91728k0816O990J38453O7452q1737K0270l8943o6294J03411
$$ plain form
19318 20393 65508 128041 164230 -41895 -63401 -126731 -83899 121309 86415 -94000 -128844
19307 -128844 -122504 -114202 -57573 -16553 -41064 -49350 4358 33707 -51091 -95898 31239 73412
19295 73412 97581 52613 11228 -86943 -124925 -500 91684 123172 172146 283066 391818
19284 391818 353575 366720 380703 395870 472773 762661 1132845 1253285 1118980 1062371 1222374
19273 1222374 1467952 1284980 818445 434714 286400 236142 274003 383496 445413 583694
19263 583694 920448 1360248 1469589 1344946 1245190 1343393 1449459 1146764 727630 517030
19253 517030 325666 234911 127085 198998 216409 220745 170557 149365 143894 151424 141570 167433
19241 167433 165068 -26660 -47476 -40486 97967 165419 83682 103952 65009 -1285 102126
19230A02126j7437J2827K3901k5070o8802j11968M7224j3459j29325m0287J0578
19219b09692Q5728Q1179J15202J9019J163m9800m2363k5063L2719M0057p7149
19208b9000r356r6394R1690K7134l9088J7370L1201M760p2476N0877K03959L3857
19196B14534K2502J96339L52483L90717R9863k48442l32086j48005R581k12523
19186C44963n4483M1666J45657J83995L86086L14217J680k08667L1986K7907J48823
19175A363830j40988l87514j92739j76540L3267m5053j4153J66111N4428K0404
19165F81053K65730L26418m9676k93468j88408j46743j47528k63846n7989K1994
19155A47537J0359R471o638m9207k8309J28670p604n1036R020m2836m4817M2821
$$ plain form
19230 102126 84689 97516 121417 96347 27545 -84423 -37199 -50658 -179983 -220270 -209692
19219 -209692 -123964 -42785 72417 91436 92599 42799 436 -24627 8092 48149 -29000
19208 -29000 -38356 -134750 -43060 -15926 -55014 -37644 -6443 -1683 -74159 -23282 180677 214534
19196 214534 237036 433375 785858 1176575 1276438 1027996 695910 547905 557486 344963
19186 344963 290480 332146 477803 661798 1047884 1362101 1363781 1155114 1187100 1215007 1363830
19175 1363830 1222842 835328 642589 466049 499316 454263 440110 606221 660649 681053
19165 681053 946783 1273201 1223525 930057 741649 594906 447378 183532 125543 147537
19155 147537 157896 167367 160729 111522 83213 211883 204279 153243 162263 119427 74610 117431
19143A17431O2038J6536R4695K52615J96672K19365L38346j12669k52696k16678
19133G15655j28753o2637p9211j12227j5750r670J93174L82624M54484J96078
19123A533767j01871j06585J31504R7984l38743l58004j54288j52778j47329P3792
19113D77449J68510L987J60239J34570J31872K45458L3585k85731k45547q7940
19103G36452k06355p4766j33049j23021J9503K9141J56995K7591n1095j33431
19093B47965n4591P5596P1203n4494j30259p9957P3844r5575j07713M7643l3302
19082c9640l515m5502J28046K12987L6811k9486l3437j7648j4538J1673q633n5875
19070A41243J03429K40155K90975L27571J55885k50642n08022l18311j02846J358
$$ plain form
19143 117431 179469 196005 290700 543315 739987 959352 1297698 1185029 932333 715655
19133 715655 586902 524265 445054 332827 317077 307407 500581 883205 1337689 1533767
19123 1533767 1431896 1325311 1456815 1554799 1216056 858052 703764 550986 403657 477449
19113 477449 645959 649946 810185 944755 1076627 1322085 1355670 1069939 824392 736452
19103 736452 530097 455331 322282 199261 218764 247905 404900 432491 381396 247965
19093 247965 193374 268970 340173 285679 155420 75463 149307 53732 -53981 -6338 -39640
19082 -39640 -43155 -88657 39389 252376 289187 259701 226264 208616 194078 205751 197118 141243
19070 141243 244672 484827 775802 1103373 1259258 1008616 500594 182283 79437 80795
19060H0795J04176K6320j04540L6521P3473m1299p7730Q6712K64136M14394J55787
19049A018745k22257j99426j58352j65551r5791o0427j19040n1705N4376n1754
19039e1182J6124J26584Q0588p7399J81J1512o4235m2598k7323P5125J8578k4428
19027D1527J7665m3694k6038J4241R023J45554J55842L0148R8108N2033J41897
19016F36306j1101Q9007L47968N27550N71843q1595n75398l97046o5205P1875
19006A114204J55088L93602J22984j78241m2320p6507l68617l13226O0879N09830
18996A377676M02128k27996m48022k44920l8895K26157K12229J92164K1326m44144
18986A027703m50529o5494J15716j13871j07501j57690m2274M0561o3323m2345
$$ plain form
19060 80795 184971 211291 106751 143272 216745 175446 97716 184428 448564 862958 1018745
19049 1018745 796488 597062 438710 273159 177368 116941 -2099 -53804 572 -51182
19039 -51182 -35058 91526 172114 94715 94896 106408 42173 -425 -27748 47377 65955 41527
19027 41527 59192 15498 -10540 3701 12724 158278 314120 344268 442376 494409 636306
19016 636306 625205 714212 1062180 1589730 2161573 2079978 1504580 1107534 1042329 1114204
19006 1114204 1269292 1662894 1785878 1607637 1565317 1488810 1120193 806967 867846 1377676
18996 1377676 1779804 1551808 1103786 858866 819971 1046128 1258357 1450521 1471847 1027703
18986 1027703 577174 511680 627396 513525 406024 248334 206060 246621 183298 140953
18976A40953M0874L4024Q3506J01000K3771Q2522J24042N9996j65J15198K7870
18965H33591k9011Q677m1383K2199J6372j0892K35833K81710K18169J56589J03030
18954A794884M7389J2550j7054J83424J53428k92423l67877j44688l613j61444
18944A204576k26360k62302j86186j12487L7389k6004O1599J26893J75541L93313
18934A185972L09521k32577o00762k37170p0625j04715k3097O748L1668p1341
18924A93622j6829Q8405R5578Q1314q364M2349o2366n6922m6354n1285J13054
18913C72202K36094J70920J19688J30082O142p9793j72470p1015k7395q1841p8238
18902E24376k4545J19411J98818P7221r5140j67335l07339j21505O7718O6891
$$ plain form
18976 140953 181827 215851 299357 400357 424128 506650 630692 690688 690523 805721 833591
18965 833591 804580 813257 771874 794073 810445 799553 1035386 1317096 1535265 1691854 1794884
18954 1794884 1842273 1854823 1837769 2021193 2174621 1882198 1514321 1369633 1366020 1204576
18944 1204576 978216 715914 529728 417241 454630 428626 490225 617118 792659 1185972
18934 1185972 1495493 1262916 662154 424984 354359 249644 226547 233295 264963 193622
18924 193622 176793 265198 360776 442090 433726 476075 413709 356787 310433 259148 372202
18913 372202 608296 779216 898904 1028986 1035128 955335 782865 711850 684455 602614 524376
18902 524376 499831 619242 818060 895281 800141 632806 325467 203962 271680 338571
18892C38571P78r0464n9370j04755m3581J26909J37946P399k568M9278K7279j99239
18880A88183p9948o1682L6100J0872J15319J794p5466k0667J4973R619J08019
18869B47116o5764q9089l674J9886K7923N2368Q8576p9764o8052q8923n9685L2290
18857A3208J09950q7649j56732L407J30111P2732M0596j8517N7588q9036J0125
18846H5783L337l1370m4686K2209n5915K6619K1366j3417R524j9653q022R107
18834D882O919J5971J3875r6056k9198R9504M027k7660n5407J23346N1337n3984
18822E7556M7856n5012n2147K2570q8860O3956r572J0458O1367P0349k9309q6419
18810A2793r2981j48793O4067R7069J07025J35058M6093p936n6778r027j53842
$$ plain form
18892 338571 339349 248885 189515 84760 41179 168088 306034 313433 310865 360143 387422 188183
18880 188183 108235 46553 82653 93525 208844 210638 135172 114505 129478 139097 247116
18869 247116 181352 92263 88589 108475 136398 188766 277342 197578 129526 40603 -19082 13208
18857 13208 123158 35509 -121223 -117816 12295 85027 125623 107106 164694 75658 85783
18846 85783 89120 57750 13064 35273 -20642 5977 27343 13926 23450 3797 -4225 4882
18834 4882 11801 27772 41647 -54409 -83607 15897 19924 -7736 -63143 60203 111540 57556
18822 57556 105412 50400 -1747 20823 -68037 -4081 -13653 -3195 58172 128521 99212 12793
18810 12793 -80188 -228981 -164914 -67845 39180 174238 220331 212395 155617 146590 -7252
18799g252m2132N1129M9841M3950k8198r2130j6072O6733j9159j408J15505j8416
18787A02391k4934P7231N8716r3694o1711O0944o7263n507K8780l7900p5111J16588
18775G8530J31662J46422O7121Q9182l1207K5119K76002M26379O52015K58774
18765B119999o27920o76245k22574m5101j25539j59959r211L9789M4540Q1716
18755D19495j4342p2436N1843n5028M7349K27481K49528K73589n5804k62434k42303
18744E66938j43598j08436k4680o9950j12847l4527q117L2101J04248K5580O6178
18733B92890K14350K88702L46809J1375l71778j42632m262k1705N5725J82752
18723H52226J31657J61530J21133R1483j36638o0022N1231r411j26968j51588
$$ plain form
18799 -7252 -49384 1745 51586 95536 67338 -24792 -40864 25869 6710 5302 120807 102391
18787 102391 77457 154688 213404 119710 57999 118943 51680 46173 74953 37053 -38058 78530
18775 78530 210192 356614 423735 512917 481710 506829 782831 1209210 1861225 2119999
18765 2119999 1492079 815834 593260 548159 422620 262661 253450 293239 337779 419495
18755 419495 405153 332717 384560 329532 376881 604362 853890 1127479 1071675 809241 566938
18744 566938 423340 314904 290224 220274 107427 72900 64783 96884 201132 226712 292890
18733 292890 507240 795942 1142751 1154126 782348 639716 635454 613749 669474 852226
18723 852226 983883 1145413 1266546 1358029 1221391 1161369 1212600 1203189 1076221 924633
18713I24633j41296j38336j67652J18588J02539M4022J07482r8028m6420p1229
18703F34303j6646J7042j4291o392j07851p2347P8672K18781M2163J64974K83274
18692A221682O6346k25805j78320k58366j63893m9324q3556o5149L7284j7898
18682B83001J04276J55180J92533J62804l749J22496K70841J41853j21471r4744
18672A213020r6799k20535p2787m6845m8056j16893q5695O1446J11189j0686j69597
18661E17762j56108q3215O3730J69676j6113j05160J25751P9240q1996j29170
18651C84397j3285n5774P4819O1899Q2606k6609j68225q7683m4779q3886j0596
18640A12884J1415M2601J55148q6521l578L9474J26195r038j18413L6410k0123
$$ plain form
18713 924633 783337 645001 477349 595937 698476 742498 849980 751952 705532 634303
18703 634303 617657 634699 620408 614016 506165 433818 512490 731271 773434 938408 1221682
18692 1221682 1288028 1062223 883903 625537 461644 412320 328764 263615 300899 283001
18682 283001 387277 542457 734990 897794 894045 1016541 1287382 1429235 1307764 1213020
18672 1213020 1116221 895686 822899 776054 727998 611105 525410 586856 698045 687359 517762
18661 517762 361654 278439 342169 511845 495732 390572 516323 595563 513567 384397
18651 384397 371112 315338 390157 452056 534662 508053 339828 252145 207366 123480 112884
18640 112884 124299 166900 322048 235527 231949 271423 397618 388580 270167 306577 286454
18629B86454J51743R4890N800l9804l7589n247l965j09139o9976N5818J14838
18618D43823R270l7164P7609j1106l1567o5416m2628j1833j9037j8183l1212j5965
18606B46591q6084o5741l5562n5102Q0939K04227M8051P9295J06220p554j71155
18595C44125j25402M821L3102J9370j10047L3934L9302K0785J03883l4343o1515
18584B68015k0381J59931K53793J01247R5136J33356J48637K11385L8603k03483
18574A186239j82877k35275m2935P8713N4974K1205l0607m3961j17586j58119
18564E29771k1502J45347J25142r2024r3903R8149J07283K0984K041M9930q7294
18553G83924j09619K2053L159J9008J1620M7041N6078R4823n623j44199L2588
$$ plain form
18629 286454 438197 533087 538887 499083 461494 456247 452282 343143 273167 328985 443823
18618 443823 453093 415929 493538 482432 450865 385449 342821 330988 311951 293768 262556 246591
18606 246591 160507 94766 59204 4102 85041 289268 337319 416614 522834 515280 344125
18595 344125 218723 223544 256646 276016 165969 199903 239205 259990 363873 329530 268015
18584 268015 247634 407565 661358 762605 857741 991097 1139734 1351119 1389722 1186239
18574 1186239 1003362 768087 725152 803865 858839 880044 849437 805476 687890 529771
18564 529771 508269 653616 778758 686734 592831 690980 798263 819247 821288 871218 783924
18553 783924 674305 696358 699517 718525 730145 777186 833264 928087 922464 778265 810853
18542H10853L15606K14032J59156J18444J64459J38185K03692K38292R3772J06824
18532B563315J09234J04532J3061K6826J60435N6608J55529K95132M17085M28602
18522D330359L07622K27687O28504J080934J830240L344912N469977O459725K052230
18513B5732190l948692m191189j931698J87204K166749M465071Q229205J4941642
18505D5650482K3612220K4289977N406795n062035N859787J4182949J6599621
18498A30539796P203702j2341936k0321750k6208658k3255795j4085326o968456
18491C4561577k082627K471653P789464J3267269J3114871j365489j5855919j5229825
18483C6670974r015306m807355k627472j340411q81901q47303p52716m27760J20864
$$ plain form
18542 810853 1126459 1340491 1499647 1618091 1782550 1920735 2124427 2362719 2456491 2563315
18532 2563315 2672549 2777081 2790142 2816968 2977403 3034011 3189540 3484672 3901757 4330359
18522 4330359 4637981 4865668 5494172 6575106 8405346 11750258 17220235 23679960 25732190
18513 25732190 21783498 17592309 15660611 15847815 18014564 22479635 30708840 45650482
18505 45650482 69262702 93552679 98959474 93897439 99757226 113940175 130539796
18498 130539796 137743498 125401562 105079812 78871154 55615359 41530033 34561577
18491 34561577 32478950 34950603 42740067 56007336 69122207 67756718 51900799 36670974
18483 36670974 27655668 22848313 20220841 18880430 17998529 17151226 16398510 15970750 16091614
18474A6091614R16783K334991M604673P129926P138977J001292m378902k995853
18466C1843501N00582M168090R060617J5127574J7817193Q128843l619096L56527
18458H3383831J5129990L5215203N3725683M8850251L5849681L2601015R313692
18451C14069346o698814r020298k6660755m4882310l4379288j6701320J928574
18444A77655135K0716042J0853655k0373998m1060520m1718172k8927332j6616473
18437F0528337q511732k790337K034503M086217k971429j0636442r699556o333856
18429B5705705m168638k626293j452328p27948j98567J09291N41861P70537Q53529
18420A8807149Q28492J628350K806980M698901Q090118J3950574K2125840K7274211
$$ plain form
18474 16091614 17008397 19343388 23948061 31077987 38216964 39218256 34839354 31843501
18466 31843501 32344083 36512173 45572790 60700364 78517557 86646400 83027304 83383831
18458 83383831 98513821 133729024 187454707 236304958 272154639 304755654 314069346
18451 314069346 307370532 298350234 271689479 226807169 192427881 175726561 177655135
18444 177655135 198371177 209224832 188850834 147790314 106072142 77144810 60528337
18437 60528337 52016605 49226268 51260771 55346988 52375559 41739117 32039561 25705705
18429 25705705 21537067 18910774 17458446 16730498 16531931 16641222 17183083 17953620 18807149
18420 18807149 19635641 21263991 24070971 28769872 36859990 50810564 72936404 100210615
18412A00210615J3968313j2631693k0388035j1781708n49157J1688581K5974681
18405A06491597L6893359L2314962L2691846M2259530K0023558j2857282j6317156
18398B41500414j5231145m3553123n6311141l9686326k3543855j4608415r395732
18391C9170677n832684l608272k210053R8458L263645O767378P758676p83275
18383D4624550j0241734r820065n969671l512234k292044j488366j031412r83132
18375I285892r78079p27692l50861j71807q1379N8334P2123p9489k70960o6180
18365F689902j07796j97900Q0249J38903K523l58016m49078l41633l25493k95630
18355D836031j82393k069j1551j25802n0234l7481m4809k18370k19845j35102
$$ plain form
18412 100210615 114178928 101547235 81159200 69377492 68828335 80516916 106491597
18405 106491597 143384956 175699918 208391764 250651294 270674852 257817570 241500414
18398 241500414 226269269 182716146 126405005 86718679 63174824 48566409 39170677
18391 39170677 33337993 29729721 27519668 27618126 30881771 37649149 45407825 44624550
18383 44624550 34382816 24562751 18593080 15080846 12788802 11300436 10269024 9285892
18375 9285892 8307813 7580121 7229260 7057453 6976074 7034408 7106531 7027042 6756082 6689902
18365 6689902 6582106 6384206 6464455 6603358 6605881 6247865 5798787 5457154 5131661 4836031
18355 4836031 4653638 4651569 4640018 4514216 4463982 4426501 4381692 4163322 3943477 3808375
18345C808375j21211o9558k25104j28998N2199o6281k75839j26293J47334P6318
18335C070942p1288q2000m6044j15313k68532k22915l20651m5099m3232j04425
18325A751443r8034o4584m0589Q3451J90187J31248l3731j02439J14182R4049
18315B025183o2715J65271J80984K37261J54500K09525J91370m7369k16643j62927
18305B674440j15809j08270P851R8013J47624j56461j81211j37732j80676j82680
18295A865089p6436n1308j59311j05609o367J16623J22138P7087J658R8728Q7387
18284A969679K04678L39678J52463j48674k37982j73858j57224M1221K68989M14341
18274B673311L91916P6108o0829N6260J30749L64213N97315O09773Q40284J103380
$$ plain form
18345 3808375 3687164 3617606 3392502 3263504 3315703 3249422 2973583 2847290 2994624 3070942
18335 3070942 2999654 2917654 2871610 2756297 2487765 2264850 1944199 1899100 1855868 1751443
18325 1751443 1653409 1588825 1548236 1631687 1821874 1953122 1919391 1816952 1931134 2025183
18315 2025183 1962468 2127739 2308723 2545984 2700484 2910009 3101379 3054010 2837367 2674440
18305 2674440 2558631 2450361 2458212 2556225 2703849 2547388 2366177 2228445 2047769 1865089
18295 1865089 1788653 1737345 1578034 1472425 1466058 1582681 1704819 1781906 1783564 1882292 1969679
18284 1969679 2174357 2514035 2666498 2517824 2279842 2105984 1948760 1989981 2258970 2673311
18274 2673311 3065227 3141335 3080506 3136766 3267515 3631728 4229043 4838816 5679100 6782480
18264F782480J406210K052246K664137L988951P239950J3141396K0265685J8783384
18256G6324439n87346j3414368q183569J770666J3301617K8136417M0463490K3566642
18248A61377988k3836785m0502783k5599987r779645K566276J3935386J8364164
18241I6524614m36103k4255657k4303440j5032532q660400n221176l232748k077456
18233A3305102j365236j085850p53821n93026k87938j10637j09609j20490P5207
18224H953702K78232J54269K93328Q11787J282027K211189L843758O642157J0997965
18215C5468414J5493244J0998468n728008j2109174o236405L11044O390394J3971550
18207E8559527K4108522L3356162L1672737J9530936J3536361J1059159k073610
$$ plain form
18264 6782480 8188690 10240936 12905073 16894024 24133974 37275370 57541055 76324439
18256 76324439 75737093 62322725 54139156 55909822 69211439 97347856 137811346 161377988
18248 161377988 137541203 97038420 71438433 61658788 64225064 78160450 96524614
18241 96524614 96088511 71832854 47529414 32496882 23836482 18615306 15382558 13305102
18233 13305102 11939866 10854016 10100195 9507169 9219231 9108594 8998985 8878495 8953702
18224 8953702 9231934 9386203 9679531 10491318 11773345 13984534 17828292 24470449 35468414
18215 35468414 50961658 61960126 56232118 44122944 37886539 38197583 44587977 58559527
18207 58559527 82668049 116024211 147696948 167227884 180764245 191823404 189749794
18200A89749794j6919871l6675689m2357205k9214185j6566966q969642m189321
18193C4856915m02532L886908Q446339R136238j532850j2885174j2481795p980340
18185B1043709m861010l037228j955158j223234q71043o89173k87775j73421j78810
18176G766857j28478j80282j70772o5569j27127Q6817L70498R30109J605514K519984
18166A2607551L976200P087489J1385590J0217691k272300q732278m725941J028459
18158C0572461P112881J4956194K0050181N918563j7434832j9337566j0564759
18151C1273123l531535K114236O774563O044997m965334j1369478q547341n133152
18143A2660079l231105j929758j176825p98430n54068l15792l18385m22850l01128
$$ plain form
18200 189749794 172829923 136154234 93797029 64582844 48015878 39046236 34856915
18193 34856915 34454383 38341291 46787630 55923868 54391018 41505844 29024049 21043709
18185 21043709 16182699 13145471 11190313 9967079 9096036 8406863 8119088 7945667 7766857
18176 7766857 7638379 7458097 7287325 7221756 7094629 7181446 7551944 8482053 10087567 12607551
18166 12607551 16583751 23671240 35056830 45274521 43002221 34269943 29544002 30572461
18158 30572461 37685342 52641536 72691717 78610280 61175448 41837882 31273123
18151 31273123 27741588 29855824 36630387 42675384 37710050 26340572 17793231 12660079
18143 12660079 9428974 7499216 6322391 5523961 4969893 4654101 4335716 3912866 3611738
18134C611738q2109R86J497N5675K26173Q2506j03429J27524L95170K78474M16987
18123E011192M98964M39512O79928Q92713Q59626R97983J599935K175546L370596
18114A6525995N490856R157819J6117200L1682693O2876254J05990042P7052127
18107C24892986p0731914j10109700o0632085k9779871j6522629r799148o368428
18100B0949211m323133l183870k370600j668918j373594q27415n98201o80326
18092E923154n86341n14248o15120n43200k83541j28993k8893k21406k00837k44765
18082B555810j25818k6202q215l8355N0883N872j08824m4285J0655j2459J20235
18071B379297M1307J69951L10121K06580N3268O1843L5393j05377k48655j87012
$$ plain form
18134 3611738 3529629 3530615 3532112 3587787 3813960 3896466 3793037 3920561 4315731 4594205 5011192
18123 5011192 5510156 5949668 6629596 7522309 8381935 9379918 10979853 13155399 16525995
18114 16525995 22016851 31174670 47291870 78974563 141850817 247840859 324892986
18107 324892986 254161072 144051372 83419287 53639416 37116787 27317639 20949211
18100 20949211 16626078 13442208 11071608 9402690 8029096 7201681 6603480 5923154
18092 5923154 5336813 4822565 4207445 3664245 3380704 3251711 3222818 3001412 2800575 2555810
18082 2555810 2429992 2403790 2395575 2357220 2408103 2413975 2305151 2260866 2271521 2259062 2379297
18071 2379297 2420604 2590555 2900676 3107256 3160524 3222367 3257760 3152383 2903728 2716716
18061B716716j72050k23250j81880j08915N3608N5065J08071J26975O1212k0384
18051B415168r6871q7996J33887J73216K95567O1322p4408k15328l24923k17954
18041B061680j8521N8088J44207J36920L18435L20847J77830M6348k9496J41841
18031C358179K52160k3628p1717J94580L54248L09575M22196N66310O09002Q07601
18021F778506O39536N69871M31612M86008P42415J084214J593839K033803K688211
18012A7048015M290370P372959J2639151J8659904J6766560J978934j0481676
18005F8274217r500786o35098J0084706K3078715L8672298M9778807N9495524
17998B39248383N4128153j4200042o5816028m8168368j3808539J9267519N7680749
$$ plain form
18061 2716716 2544666 2321416 2139536 2030621 2084229 2139294 2247365 2374340 2435552 2415168
18051 2415168 2318297 2230301 2364188 2537404 2832971 2894293 2819885 2604557 2279634 2061680
18041 2061680 2043159 2101247 2245454 2382374 2700809 3021656 3199486 3245834 3216338 3358179
18031 3358179 3610339 3586711 3514994 3709574 4063822 4373397 4795593 5361903 5970905 6778506
18021 6778506 7418042 7987913 8419525 8905533 9647948 10732162 12326001 14359804 17048015
18012 17048015 21338385 28711344 41350495 60010399 76776959 78755893 68274217
18005 68274217 58773431 58138333 68223039 91301754 129974052 179752859 239248383
17998 239248383 293376536 279176494 213360466 165192098 151383559 170651078 228331827
17991B28331827R4730994P6667783j0500603m7900517m7125781o0015422o5496304
17984A68691977m9734941l0733461j8055523r716533l354688K807441R738539
17977F9642811J5747343J1714437p652574k0622261j7591124j1110706p028244
17970C3099682m307450k134029q90618r67508j468076j129614j20403Q71308J524910
17961B4478202K216438L703226O306343J0628271J7537457K4169574J8560372
17954A07599883K175582J571521J6109918K2885041Q044345j3098925k0762979
17947A24524386q333157J4988739M4000138O7969287L5476814k6948243k4162144
17940B27515820j727934K82728j823666J4466000K0978782k7555225n9088786
$$ plain form
17991 228331827 323062821 399730604 389230001 341329484 294203703 234188281 168691977
17984 168691977 118957036 88223575 70168052 60451519 57096831 59904272 69642811
17977 69642811 85390154 97104591 89452017 68829756 51238632 40127926 33099682
17970 33099682 28792232 26658203 25767585 24800077 23332001 22202387 22081984 22953292 24478202
17961 24478202 26694640 30397866 36704209 47332480 64869937 89039511 107599883
17954 107599883 109775465 111346986 127456904 150341945 158386290 145287365 124524386
17947 124524386 116191229 131179968 175180106 243149393 278626207 251677964 227515820
17940 227515820 225787886 226070614 224246948 238712948 259691730 232136505 173047719
17933A73047719m7293294l4836258k3855731j4393996r192787o830065m967765
17926C1677823l505469k078171j077016j54874R72403K732846M970133N709719
17918C9247394J616410k867326j673212K469205P689724J5766458L0764928N6226591
17910A49240172Q6588738O1067253k6448022k9394945K8413326L1862387n6569527
17903B44759382r0503384n6405492k9541601j7372758j1517159p960520n349524
17896B6108944l566101k715066k206470j583240j271856j362626j333013r07343
17888A1163229n19182j77293J47965O4618o69660p87338j99707P1525k33340j40123
17878H720694N4685l45743o49536m13085o0894l7659k26557j05056K68883L04869
$$ plain form
17933 173047719 125754425 90918167 67062436 52668440 43475653 36645588 31677823
17926 31677823 28172354 26094183 25017167 24862293 25834696 28567542 33537675 39247394
17918 39247394 40863804 37996478 36323266 38792471 46482195 62248653 93013581 149240172
17910 149240172 235828910 296896163 270448141 241053196 269466522 301328909 244759382
17903 244759382 154255998 97850506 68308905 50936147 39418988 31458468 26108944
17896 26108944 22542843 19827777 17621307 16038067 14766211 13403585 12070572 11163229
17888 11163229 10644047 10466754 10614719 10679337 10009677 9222339 9022632 9094157 8860817 8720694
17878 8720694 8775379 8429636 7780100 7367015 7306121 7268462 7041905 6936849 7205732 7510601
17868G510601K3433K73288L77406N59988Q91982J407039J819983K257461L082523
17859A8203704M866421P740573J3391016K4555756M4711562P4682706P7110215
17852B65261953j785292l8435145J0170274M1773182k4478803q6451360o5201302
17845A00853507l4251133j9018730j2177072q348819n529966l876148k774354
17838A4877285k259787j865274j396551j113178r54554p50664o42290l74129o8634
17829E452224J94781o0334m31257n12749k22746j15934n84355n70073m67842l59257
17819B322458j81063k65494k30888m9125o308K6129K3319o9970k32682j32580
17809A203796Q2527N8272J7400l1149Q9373m7259N5486M0769j42248j0442J947
$$ plain form
17868 7510601 7534034 7807322 8184728 8744716 9636698 11043737 12863720 15121181 18203704
17859 18203704 23070125 30810698 44201714 68757470 113469032 188151738 265261953
17852 265261953 263476661 225041516 235211790 276984972 252506169 166054809 100853507
17845 100853507 66602374 47583644 35406572 27057753 21527787 17651639 14877285
17838 14877285 12617498 10752224 9355673 8242495 7287941 6537277 5894987 5520858 5452224
17829 5452224 5647005 5586671 5155414 4642665 4419919 4303985 3719630 3149557 2681715 2322458
17819 2322458 2141395 1875901 1645013 1595888 1589580 1615709 1639028 1569058 1336376 1203796
17809 1203796 1286323 1344595 1361995 1330846 1420219 1372960 1428446 1469215 1326967 1316525 1318472
17798A318472Q9939K9601o7004q4599L7864P9072j01798k28692o8074q5573j0108
17787I09100N8025K1812k09214j82089j31797N5670j10978N7325M8704J01520
17777F18078J70566P0051P639J57243P1997j04647J4919k4279j48373j7092O7215
17766H83317j3178j01286q9989P6549J54621L7642j45998K5009J34910r3131j33783
17755G34683k7577K3924K0775M8817j27429m615r045j03550K4257J09937J10854
17744H01031J45165n1707n1654L6700j5844K82921K25620j83826k60432j41175
17734G86799M7833o4282j05306J17654j01335l2742k07770j81237J32N581m9144
17723B16183n7200N722J05405R9165N191P1322n5563j2253M2778O6148k5507P1588
$$ plain form
17798 1318472 1408411 1438012 1371008 1286409 1324273 1403345 1301547 1072855 1004781 919208 909100
17787 909100 967125 988937 779723 597634 465837 521507 410529 467854 516558 618078
17777 618078 788644 858695 866334 1023577 1095574 990927 1005846 981567 833194 816102 883317
17766 883317 870139 768853 678864 755413 910034 947676 801678 826687 961597 868466 734683
17755 734683 707106 731030 751805 800622 673193 668578 659533 555983 580240 690177 801031
17744 801031 946196 894489 842835 879535 863691 1146612 1372232 1188406 927974 786799
17734 786799 834632 770350 665044 782698 681363 648621 440851 259614 259746 265327 216183
17723 216183 158983 164705 270110 369275 374466 445788 390225 377972 420750 486898 461391 532979
17711E32979O7183r326m6691O5037J75579m8597K7805l514J01880J17416J57443
17700A137194K17842J07680K56648N13965K50461j89851j70452K37351N06475
17691B867313j28720n04072m88995l00393j45912L8247r1493n0383L7916P7286
17681A310794K4541k09680j63301M195M5405N406J20420K99099L01394q216k88674
17670A441383r8217K10923J06648k61113l84625r9469p7019r7322k39377p3401
17660D28411K4293P4958J11171R3238k3121o0903J4684K00983J09266k5412J510
17649I49078j01955j37789N358N3724J81434K44270J37946K35654K52242O1415
17639A881377k19344J41967M25295Q276o16277n92584l84017j05130q7990Q0166
$$ plain form
17711 532979 600162 590836 544145 609182 784761 736164 763969 760455 862335 979751 1137194
17700 1137194 1355036 1462716 1719364 2233329 2483790 2293939 2123487 2360838 2867313
17691 2867313 2738593 2234521 1745526 1445133 1299221 1337468 1245975 1195592 1233508 1310794
17681 1310794 1335335 1125655 962354 966549 1011954 1017360 1137780 1436879 1738273 1730057 1441383
17670 1441383 1343166 1554089 1660737 1399624 1014999 915530 838511 741189 501812 428411
17660 428411 452704 527662 638833 732071 708950 648047 662731 863714 972980 947568 949078
17649 949078 847123 709334 714692 768416 949850 1194120 1332066 1567720 1819962 1881377
17639 1881377 1662033 1804000 2229295 2237571 1621294 1028710 644693 539563 451573 531739
17629E31739J4789n4620k3606l2559o5392J05106j5825J5267J97629J90179L06758
17618A169465K53310j73450j49301K49298J85010m6731l48399k72327k19345k28664
17608D18866l9392l5231N3579K4582j81646j07857J42043N6439p423l4232p4839
17597B14889j7549L3222Q902L1939M468L0185K2817L6111j7843m7934j28748m6113
17585A24346J20912Q6734R4672k3166l806o4483K4496j05772k7883M9035n0878
17574B24207j96236r3699P8756N0535l7955j3767j8291n0171n2151J31416J36131
17563A58775J65828j0090j86601m8463K2968J41007R1830J8462J13078M3563K74331
17552G84688L90444L49277p857l56435J07342M03057M6099l06243l09468l69370
$$ plain form
17629 531739 546528 491908 468302 435743 370351 475457 459632 474899 672528 862707 1169465
17618 1169465 1422775 1249325 1100024 1349322 1534332 1487601 1139202 866875 647530 418866
17608 418866 379474 344243 397822 422404 240758 132901 274944 331383 323960 289728 214889
17597 214889 197340 230562 239464 271403 275871 306056 328873 364984 347141 299207 170459 124346
17585 124346 245258 331992 426664 403498 399692 335209 359705 253933 226050 275085 224207
17574 224207 27971 -65728 13028 63563 25608 11841 -6450 -56621 -108772 22644 158775
17563 158775 324603 314513 127912 79449 102417 243424 335254 353716 466794 510357 784688
17552 784688 1175132 1524409 1516552 1160117 1267459 1670516 1716615 1410372 1100904 731534
17542G31534j90202j41648n8912L8720o983O4559O6838p0906L0574J23570J51837
17531G38981L88557K67620q0074k28683J6604M1903j67025m48755k32743L6654
17521C33039J286L582n1751j38170l0767O4091L8745n8508q3501J4939R5398Q3505
17509B71888j2837n7466J9875J16768O9729N4640P8066k2821j6280J91184J13542
17498H06288M20597N68944J81034k48744r0891J82861J60483j67968k26447r8744
17488A487413k31815p8368m8648l8460k5287J5357M8573j34134j81181N6925K10412
17477A080787K94056M33194M29074J15795M4760O6989k3403k45440n20661l18837
17467A356314q7252n1597j21176j87661k28820j45435q0514R7368j19306j07482
$$ plain form
17542 731534 541332 399684 340772 379492 372509 437068 503906 433000 463574 587144 738981
17531 738981 1127538 1395158 1315084 1086401 1103005 1144908 977883 529128 296385 333039
17521 333039 334325 337907 286156 147986 117219 181310 220055 161547 78046 92985 188383 271888
17509 271888 259051 201585 221460 338228 407957 462597 540663 517842 501562 692746 806288
17498 806288 1226885 1795829 1976863 1728119 1637228 1820089 1980572 1812604 1586157 1487413
17488 1487413 1255598 1177230 1128582 1090122 1064835 1080192 1128765 994631 813450 870375 1080787
17477 1080787 1374843 1808037 2237111 2352906 2397666 2464655 2441252 2195812 1675151 1356314
17467 1356314 1269062 1217465 1096289 908628 679808 534373 453859 551227 431921 324439
17457C24439K49l1128L8408K947M0022k0278K2998O9462r4087k7787K056R7910
17445D25211J88019L06417O15004P02212L21m07366k26001k24083j39470N8076
17435A298340Q9006n2846K5882j53541k07441m6235J67827J52970j44360l07985
17425H21617k57113k6940J46399J28404K09089Q7720j07970o513k13363r0725
17415F90605j05010l5278N3794J11181P2664O568j33816j89956j31362N838n2589
17404B92639j14214K6325J9843j9596k532J8725J57901j126n4731n530o1653o2983
17392A93068l7787l7769j9042Q303k1276n1541P6286L3482j12664M4953k5849
17381E0164m6269k7687j19694M4404J41641M5298n9983q9737P9533P0028o4087
$$ plain form
17457 324439 324688 293560 331968 334915 374937 354659 377657 447119 353032 325245 327301 425211
17445 425211 613230 919647 1534651 2236863 2237184 1829818 1603817 1379734 1240264 1298340
17435 1298340 1387346 1334500 1360382 1206841 999400 953165 1120992 1273962 1129602 821617
17425 821617 564504 537564 683963 812367 1021456 1109176 1001206 994693 781330 690605
17415 690605 585595 550317 604111 715292 787956 794524 660708 470752 339390 345228 292639
17404 292639 178425 204750 224593 204997 202465 221190 379091 377965 323234 317704 256051 193068
17392 193068 155281 117512 98470 106773 85497 33956 110242 143724 31060 76013 50164
17381 50164 3895 -23792 -143486 -99082 42559 87857 27874 -61863 17670 87698 23611
17370B3611J08365R884J57597J27245N9465j1867K03861L52159M35375P3149j00758
17359A438086M6063K10566M4921l69974m71050m15874k39936k0671N9767l7687
17349B44211q4215p1818L5414m8671N4633R6720N0623J7109O2663J1567j13864
17338B54372r9152j2186O3309k9398m6768j87336q3678J41367p6530j5253J67615
17327G6362J0888N0408R1802K9840l2946q7531k5893l6377j4900K0305L6764M4236
17315A62958k4224p2501o2560l8M8464J64725R9274N8176K15727N52238L13241
17304A455480j11247n5813L6900J20388k07990m44873l38685j71424j07111j38549
17294C7076J02954j7488q8280j04537J8742Q4550O2899j08192n1804l0824o3863
$$ plain form
17370 23611 131976 141860 299457 426702 486167 474300 678161 1030320 1465695 1538844 1438086
17359 1438086 1484149 1694715 1739636 1369662 898612 482738 242802 222131 281898 244211
17349 244211 159996 88178 123592 74921 129554 226274 276897 294006 356669 368236 254372
17338 254372 155220 143034 206343 176945 130177 -57159 -140837 530 -76000 -91253 76362
17327 76362 87250 137658 229460 259300 226354 138823 112930 76553 61653 81958 118722 162958
17315 162958 138734 66233 3673 3635 52099 216824 316098 374274 590001 1142239 1455480
17304 1455480 1344233 1288420 1325320 1445708 1237718 792845 454160 282736 175625 37076
17294 37076 140030 122542 34262 -70275 -51533 33017 95916 -12276 -64080 -94904 -158767
17283a58767P1409J05686L8379l7194l2920M2735N6530k1191O910l5059o3293
17272b6775N515J70966K6787q6676K627p7765N1267L7573N4354J0315j3453m4593
17260A10142P092n2739l2365O2785R182j30084m8983k5330l1194o129N8051P4168
17248e404J1104R7890J61806l4846j70582j09183N7139p9620N5836M6512j5202
17237A5450n6219o6354J7883n1781m1665Q6628J14911J52584r9736j48740N7041
17226a9998l3290l8947m3605N774M4103M8009l2121J54381J37323q0425o8021
17215G3183p3581p6383j60K2828k9366l323m8393j68224K2120J45853l7645R2648
17203h0443N4983p3625n778R6707J46326M3929m0957j6613l1328j23243l7938
$$ plain form
17283 -158767 -87358 18328 56707 19513 -13407 29328 85858 64667 71577 36518 -26775
17272 -26775 -21260 149706 176493 89817 92444 14679 65946 103519 157873 168188 154735 110142
17260 110142 117234 64495 32130 94915 104097 -25987 -74970 -100300 -131494 -137623 -79572 -5404
17248 -5404 5700 103590 265396 230550 59968 -49215 7924 -71696 -15860 30652 15450
17237 15450 -40769 -107123 -89240 -141021 -182686 -96058 18853 171437 71701 -77039 -19998
17226 -19998 -53288 -92235 -135840 -130066 -85963 -37954 -70075 84306 221629 141204 73183
17215 73183 -398 -76781 -76941 -54113 -83479 -86802 -135195 -303419 -281299 -135446 -173091 -80443
17203 -80443 -25460 -99085 -104863 -8156 138170 182099 141142 124529 93201 -30042 -67980
17192f7980n4771P4398O333P3441J4421j7157P5117R3107M5439j18102J8546Q8794
17180B31586m5850q6291L8292J3241O2582m7538n464Q8720q4861j42945n1244
17169b9772j7651K7538o082N4778K8607p5652q0561m9181M9293j5601q1060q1348
17157b76692R0949m8849J6587N2840l634J08769M6280j15342L1235K7628k6054
17146i6283k8601j6845M5268K6544J62139O3915m9949j20530L700K6600l6741
17135b0783j47684R6145J64077k7699p7345o484J9108N0536p2997n5050j5468
17124i3644N771L9332o853r0584k2549R7875O4296J3381J48112K6282k01164o2849
17112h2594J1516K7599L5652k6203k7072j15523L0624J1763Q2418P3746m1963
$$ plain form
17192 -67980 -122751 -48353 -42020 31421 45842 28685 103802 196909 242348 124246 142792 231586
17180 231586 185736 99445 137737 150978 213560 166022 160558 249278 164417 21472 -29772
17169 -29772 -47423 -19885 -25967 28811 57418 -18234 -98795 -147976 -98683 -114284 -195344 -276692
17157 -276692 -185743 -234592 -218005 -165165 -168799 -60030 -13750 -129092 -97857 -70229 -96283
17146 -96283 -124884 -141729 -96461 -69917 92222 156137 106188 -14342 -10642 15958 -20783
17135 -20783 -168467 -72322 91755 64056 -13289 -19773 -665 49871 -23126 -78176 -93644
17124 -93644 -87873 -48541 -55394 -145978 -168527 -70652 -6356 7025 155137 181419 -19745 -82594
17112 -82594 -71078 -43479 -7827 -34030 -61102 -176625 -146001 -134238 -51820 21926 -20037
17101b0037k6467l3452L1621m6074J5486M237o7145R3372o586M2102K3945N748
17089A6750M3745L3456K4638p4707P3478J37173r7794j70004P0122L6596n1065
17078D2388n6521K5440l3676j16508q837P018J68738M0795p1309K8791J6134k1755
17066B0698k9023k3281n402r0899n1086l8562k8811N3258P6826Q3356j4782J14564
17054F6856Q1031O4314n6830j49837j47816j62l6585J68099N9017q2755M8262
17043A3594k6644p6965n438J9292J15892K8310o071J1039j23171Q8716N0491k7584
17031F1461j51661p4500M5955O5799J0057M2260J06507o4511n8405k8217L6463
17020h792m928o2973Q684K2383Q6941l996N8308K3504o6258K4888J30037m1967
$$ plain form
17101 -20037 -46504 -79956 -48335 -94409 -78923 -74686 -141831 -48459 -55045 -12943 11002 16750
17089 16750 60495 93951 118589 43882 117360 254533 156739 -13265 56857 93453 42388
17078 42388 -14133 11307 -22369 -138877 -147714 -140696 28042 68837 -2472 26319 42453 20698
17066 20698 -8325 -31606 -37008 -127907 -178993 -217555 -246366 -193108 -116282 -32926 -47708 66856
17054 66856 147887 212201 155371 5534 -142282 -142444 -179029 -10930 48087 -34668 13594
17043 13594 -13050 -90015 -95453 -76161 39731 68041 61970 73009 -50162 38554 89045 61461
17031 61461 -90200 -164700 -118745 -52946 -42889 -629 105878 41367 -17038 -45255 -8792
17020 -8792 -13720 -76693 -68009 -45626 41315 37319 95627 119131 52873 77761 207798 165831
17008A65831l7312j0062q4699q6150l5878k1200k119R5704O1514N2844J3669o8338
16996D3804n6337m6429Q3809M9747q348r2069m9582l3452l1119L8124l8298p60
16984a40910j07748P6324j8829n6177O0894P1599n805K5087K8826Q2164O9485
16973H4910l8416j28535j19179k6912J47759K46932J11642n9217p1723q5856J1274
16962G2679o6429l7205J88011J07452K15N2555q9313p3986k06489j14143k4875
16951a91528q9870j1295J44883P9902L1383n4518R736L9870j7580p385l0298J23086
16939B6386j5170q840j197M8984p8442K1544Q6447N2448L3623q8200j33938j5659
16927g2014J32096l8951l0951j6441j22998l1579L9510Q5959J17999Q5299m977
$$ plain form
17008 165831 128519 118457 33758 -52392 -88270 -109470 -111589 -15885 45629 98473 112142 43804
16996 43804 -12533 -58962 24847 74594 66246 -25823 -75405 -108857 -139976 -101852 -140150 -140910
16984 -140910 -248658 -172334 -191163 -247340 -186446 -114847 -120652 -95565 -66739 15425 84910
16973 84910 46494 -82041 -201220 -228132 -80373 166559 278201 218984 147261 61405 72679
16962 72679 6250 -30955 157056 264508 264723 317278 227965 153979 -52510 -166653 -191528
16951 -191528 -281398 -292693 -147810 -67908 -36525 -91043 -81307 -41437 -59017 -66402 -96700 26386
16939 26386 11216 2376 1179 50163 -28279 -6735 79712 132160 165783 77583 -56355 -72014
16927 -72014 60082 21131 -9820 -26261 -149259 -180838 -141328 -55369 62630 147929 142952
16916A42952n4744p4311o7044j47607m6500O5483K08936J10164k3828q9622m4233
16905b0354K4339R2801M1063j54271j08820Q2470J5075K3212J23206K6911P4957
16894B20589k6171j19870j33397k9332M3234Q9087O21j07495K4290R169p14j9691
16882d9680L3462j1773M1235j01963l4633M4271Q1672L9842k4470K384P6717r6058
16870A006m3704k7917j7047k2317J18815Q7920J01133k6366p1646q9444p3922
16859f3489p8996J45649K7977K0239N4040J6020P0005N6524L6863o5185m8212
16848A71435n5689O7638j14033p9227O431r335l8836N38L7829J06103N8180R0091
16836B41125N1586m3548k08430r6690j6350J21641P7116q2357q2450p0739P1801
$$ plain form
16916 142952 88208 13897 -53147 -200754 -247254 -181771 27165 137329 113501 23879 -20354
16905 -20354 3985 96786 137849 -16422 -125242 -42772 -27697 -4485 118721 145632 220589
16894 220589 194418 74548 -58849 -88181 -44947 44140 44761 -62734 -38444 -29275 -29989 -49680
16882 -49680 -16218 -27991 13244 -88719 -123352 -79081 2591 42433 17963 20347 97064 1006
16870 1006 -42698 -70615 -87662 -109979 8836 96756 197889 171523 99877 10433 -63489
16859 -63489 -142485 3164 31141 51380 105420 121440 191445 247969 284832 219647 171435
16848 171435 115746 183384 69351 -9876 -3445 -12780 -51616 -51078 -13249 92854 151034 241125
16836 241125 292711 249163 40733 -55957 -72307 49334 126450 44093 -38357 -109096 -37295
16825c7295J19150J8589l5701q3460j01217P8499K9689k8543o4706Q4509N6794
16814C6308J4968n3480l4972m6524m520K1269J9469L2958k1727J343O8358K413
16802C5863R9490m2278K3164J117q0414M4445K1798M2510q7088j5868N0495M3241
16790A36475Q527o8172K6276L7193m5412j3732k7501j70866p7430Q3779J28691
16779A7828Q6598J1846m9880p5298O8255n135m503O1206m2410p3070J07211J19410
16767B22058L1071n5543j09692n4737J7901o2028J08365M3225p2372l9299M5701
16756G4650K0339j42924q2169n5969M6415J31350j650L2906J266L206j16880j51492
16744b40952K0261J10864J50625q285N9497M4299J243l6163M8949l6004L9531
$$ plain form
16825 -37295 81855 100444 64743 -18717 -119934 -41435 -11746 -40289 -104995 -20486 36308
16814 36308 51276 -2204 -37176 -83700 -88220 -66951 -47482 -14524 -36251 -34908 33450 35863
16802 35863 135353 93075 116239 117356 36942 81387 103185 145695 58607 42739 93234 136475
16790 136475 145002 76830 103106 140299 94887 81155 53654 -117212 -194642 -110863 17828
16779 17828 104426 116272 66392 -8906 59349 54214 49711 110917 68507 -4563 102648 222058
16767 222058 253129 197586 87894 33157 51058 -10970 97395 140620 68248 28949 74650
16756 74650 94989 -47935 -130104 -186073 -139658 -8308 -9958 22948 24214 27420 -89460 -240952
16744 -240952 -220691 -109827 40798 32513 92010 136309 137552 101389 150338 114334 153865
16733A53865J03525J6069j64694l6912J44829j5416p0920j57358l3688O9931L4969
16722D4200l5847j0702R1625O0219l5615n7385j7609N9627K2059j02127l1433
16711a2988P8430J0465l2415n427O3518O1445l9921l1968K7029p5446M2k1157
16699B1607K4409O9024k432j19919j700J18744m3322M2016J31546q7841q7413
16688F4719M0090L5317L5316k7902m5368j11954L5042Q3802N9968q463j27882
16677C2685N097n2781r06L3087m9206j2898P1024j02606P4844l2226m372J10248
16665G1990o6657j38361p5602O056N3054J50354k1768k0098M0750N3079l4450
16654A8347j26060r9981O2560Q925m9640j7408N8092J08970O6327M6633j81189
$$ plain form
16733 153865 257390 273459 108765 71853 216682 201266 130346 -27012 -60700 9231 44200
16722 44200 8353 -2349 89276 149495 113880 56495 38886 98513 120572 18445 -12988
16711 -12988 65442 75907 43492 38065 101583 163028 123107 91139 118168 42722 42764 21607
16699 21607 46016 115040 112608 -7311 -9011 109733 66411 108427 239973 152132 64719
16688 64719 104809 140126 175442 147540 102172 -9782 25260 109062 169030 160567 32685
16677 32685 37782 -14999 -15905 17182 -32024 -44922 26102 -76504 -1660 -33886 -38258 71990
16665 71990 5333 -133028 -208630 -202574 -149520 834 -20934 -41032 -282 52797 18347
16654 18347 -107713 -207694 -145134 -136209 -185849 -203257 -145165 -36195 30132 76765 -104424
16643a04424j93477P1483J33997N0492P1770L2745l1337m3353j26322o7519O7993
16632a37952J48532J1849o5789k0922j1357L9630O602M6335P1720p7856q6544
16621g5752m2786J1850M8242K1646P1753R8315m9285j23761j13259J7956n1090
16610a86171r8418K2969R8061J42244K7380p4017p2132L2703p690r1000J75618
16599c0453M0963j1478j4216M9626j4766m1820R0441J06796q5432K8360r279j47918
16587c9176L0634Q9268P8940Q670j43368k2353Q1404J02593p604r3706j05336
16576b0034j1001j7647L684j44M2179L8514J03933n6904k1277J19433q327o3336
16564A09073m1746n4613o7120M0627M8863M5612r6898j02358J2042J34978o6035
$$ plain form
16643 -104424 -297901 -226418 -92421 -41929 29841 62586 31249 -12104 -138426 -205945 -137952
16632 -137952 10580 22429 -43360 -64282 -75639 -36009 -29407 16928 88648 10792 -75752
16621 -75752 -118538 -106688 -58446 -36800 34953 133268 83983 -39778 -153037 -135081 -186171
16610 -186171 -284589 -261620 -163559 -21315 6065 -67952 -140084 -107381 -115071 -206071 -30453
16599 -30453 10510 -968 -15184 34442 19676 -22144 68297 175093 89661 118021 108742 -39176
16587 -39176 -8542 80726 159666 168336 24968 2615 84019 186612 179008 85302 -20034
16576 -20034 -31035 -48682 -44998 -45142 -2963 35551 139484 82580 61303 180736 172409 109073
16564 109073 67327 12714 -54406 -13779 35084 80696 -16202 -118560 -106518 28460 -37575
16553c7575p1576N1164P4837k3963l0030r668p6162l7031L5339R0569O5472j5002
16541A6374K5035l7183m7133j1572K1941J6172J04387O2797n9387p5249r2121
16530g5939J9565k5060K2047q2312J3350J06677n636K0693l9734J3808n2342K6815
16518e8068O1632k5126O816j3247q9940K1004M8866O8684q8628p1704J42926J5975
16506A9190k7616O8537l2214O7920l611r6781l7738M2552l5715o8381r3782j25737
16494c23376m3154K4402R2641L683J44918N8995q530L0198J05756O9565L2007
16483A87105l5280j61674o5930J7297N2741Q873m2832o5668k7355q1787n7387
16472b71897k2884Q6526J55672J13439J4255k4850k6760l9903j19873p4037N8304
$$ plain form
16553 -37575 -109151 -57987 16850 -7113 -37143 -46811 -122973 -160004 -124665 -34096 31376 16374
16541 16374 41409 4226 -42907 -54479 -32538 -16366 88021 150818 91431 16182 -75939
16530 -75939 -56374 -81434 -59387 -141699 -128349 -21672 -27308 -6615 -46349 -32541 -84883 -58068
16518 -58068 3564 -21562 -14746 -27993 -117933 -96929 -48063 20621 -68007 -139711 3215 19190
16506 19190 -8426 60111 27897 95817 92206 -4575 -42313 239 -35476 -103857 -197639 -323376
16494 -323376 -366530 -342128 -249487 -245804 -100886 -41891 -50421 -20223 85533 155098 187105
16483 187105 151825 -9849 -75779 -58482 -5741 3132 -39700 -105368 -132723 -214510 -271897
16472 -271897 -294781 -208255 -52583 60856 75111 50261 23501 -16402 -136275 -210312 -152008
16461a52008N0496M4357n9201r7234O6760M6433J06677K3359n6559l1027M5620
16450a2327R3296j03912m9091j1180r893L2109j7908m9415k8368N2938J57836
16439E4085M0312r1062l3791L9216Q4327m3927L5315J0312j17906l0250M8945
16428d424p0573m3869J68656L2468o8686Q7986o4807K8332j9503Q660M0621m0451
16416E4410n288M1341p6059N5394J3463r5535l6398L692m982P5751l0467k06370
16404b11048o716L1167N0772J17808O7868p8879j21978J2921J15609j4153j20397
16393a57026P9818N3962K025M255k922r343k0097L2281P555K1306m6259n3151
16381h7596O6521J47903r927l5700J0030J1595q1336O3762j15755p8412J01339
$$ plain form
16461 -152008 -101512 -57155 -116356 -213590 -146830 -100397 6280 29639 -26920 -57947 -12327
16450 -12327 80969 -22943 -72034 -83214 -93107 -60998 -78906 -128321 -156689 -103751 54085
16439 54085 94397 3335 -30456 8760 93087 49160 84475 94787 -23119 -53369 -4424
16428 -4424 -74997 -118866 49790 82258 13572 101558 36751 65083 45580 54240 94861 54410
16416 54410 49122 90463 14404 69798 83261 -12274 -48672 -44980 -49962 25789 -4678 -211048
16404 -211048 -217764 -186597 -135825 -18017 49851 -29028 -151006 -138085 -22476 -36629 -157026
16393 -157026 -77208 -23246 -21221 -16966 -19888 -29231 -49328 -17047 -9492 11814 -34445 -87596
16381 -87596 -21075 126828 116901 81201 91231 102826 21490 85252 -30503 -108915 -7576
16370g576p4010J832l9254n5932R4667R6282N5469j0627J2488l2144M1913R1200
16358A74308L914j58899j9325r5735n120m6269L2686M2599m9342N7354O2244J42420
16346A40835K2362P4752j17695n0172j18552j49531K2813M0004P4656l115Q0473
16335A6830q1002m816k2224R1922O7808O178j34324j11898N2895J2680O0589M9847
16323D485m529r3747r4350n2238p4470r870R8714j9383l8384o355J67922K13947
16311I1742r5006J6337M7953Q954o255p8220l9706R7186n4785j29318P8350J45093
16299H2325L5596j17430p7268K4743M9284P5945J44922o6067j22368j49049Q5944
16288c3423Q9898M4835j02302p2574K6637K06029l6125L2689J40470r2152j31980
$$ plain form
16370 -7576 -81586 -79754 -119008 -174940 -80273 16009 71478 60851 73339 41195 83108 174308
16358 174308 178222 19323 -2 -95737 -100857 -147126 -114440 -71841 -121183 -63829 -1585 140835
16346 140835 163197 237949 120254 70082 -48470 -198001 -175188 -135184 -60528 -63643 16830
16335 16830 -64172 -68988 -91212 710 68518 74696 -59628 -171526 -118631 -105951 -45362 4485
16323 4485 -44 -93791 -188141 -240379 -314849 -324719 -226005 -245388 -283772 -290127 -122205 91742
16311 91742 -3264 13073 61026 69980 63725 -14495 -54201 42985 -11800 -141118 -62768 82325
16299 82325 117921 491 -76777 -52034 -2750 73195 218117 152050 29682 -119367 -33423
16288 -33423 56475 101310 -992 -73566 -46929 159100 122975 155664 296134 203982 72002
16277G2002j66235K1519P8929P167k7487j3948O7522m0548l035K2442J16624j91111
16265e6159Q4270P9946p6824o2607L7489J23495n297j3081l4394o4973k2738k2109
16253c2982o0987K2941N6173O4309N0102M1863N0358N9274k6077j54109r9774
16242b8909m8902l1912q7428P7748R6370n270J04232k622q2808M3714n8720R9723
16230G5216J987Q955M8328P5368j22884j50333m4063K8477P031j1517J9882P7294
16218A3741P4416j7798o6631L1956r5378j8519M5916j06604j3880R3629K7369
16207c1783m2613j05332r4960J03295J23816m5758J1034N6437K12605o583r7534
16196H2624q4339l7654J38076j5367n2740l9151k7761n9154L0354J6394q5102
$$ plain form
16277 72002 -94233 -72714 6215 13382 -14105 -28053 39469 -1079 -4114 18328 134952 -56159
16265 -56159 28111 108057 31233 -31374 6115 129610 124313 111232 76838 11865 -10873 -32982
16253 -32982 -93969 -71028 -14855 49454 99556 141419 191777 251051 224974 70865 -28909
16242 -28909 -77811 -109723 -197151 -119403 -23033 -28303 75929 73307 -9501 34213 -24507 75216
16230 75216 77203 86158 134486 209854 86970 -63363 -107426 -78949 -71918 -83435 -63553 13741
16218 13741 88157 70359 3728 35684 -59694 -78213 -32297 -138901 -152781 -59152 -31783
16207 -31783 -74396 -179728 -274688 -171393 -47577 -93335 -82301 -25864 186741 180158 82624
16196 82624 -1715 -39369 98707 83340 30600 -8551 -36312 -95466 -65112 -48718 -133820
16185a33820K6767Q3905J1032n6788n6276L5273n8855n2995L1442J03337P3666
16174F688j75668J0023J1879K5499M1509J05937l2672L350n2906j4279J4140j5478
16162g1978o048m5823j26100O0347R9425L1728K9536l9109n3186p3563J341R0652
16150a02778j5160j36567L6207J34420l296P3118L4807l1555m7964J07733J12683
16139A61648K0507p1880K2473l4185j24190p5604j96175J01778K96895N7029j51417
16128F879j2172L0763q859K5642l1957r7571m0623l8201k3364J00538P9410M3345
16116C3830l8990J26713J5161R4411L7265j55250j43231o6875p877k9407N6691
16105g7559Q4198m375n3027m6435j4654j8022J2062L8093J35585j3564J5694L3831
$$ plain form
16185 -133820 -107053 -23148 -12116 -68904 -125180 -89907 -148762 -201757 -170315 -66978 6688
16174 6688 -168980 -158957 -147078 -121579 -80070 25867 -6805 -3455 -56361 -70640 -56500 -71978
16162 -71978 -78026 -123849 -249949 -189602 -90177 -58449 -28913 -68022 -121208 -194771 -193430 -102778
16150 -102778 -117938 -254505 -218298 -83878 -87174 -14056 20751 -10804 -58768 48965 161648
16139 161648 182155 110275 132748 98563 -25627 -101231 -297406 -195628 101267 158296 6879
16128 6879 -5293 25470 16611 42253 10296 -87275 -127898 -166099 -189463 -88925 -9515 33830
16116 33830 -5160 121553 136714 231125 268390 113140 -30091 -96966 -104843 -134250 -77559
16105 -77559 6639 2264 -50763 -97198 -111852 -129874 -117812 -79719 55866 42302 57996 91827
16093I1827j005L8353L0769N8519J20115j04635j18598n3748n645p9990J14153
16082I0115N3895l6837r5379k3943K0764k1763j16999O3667J02758j7815k957
16071A5506j7380J3082k757k8169K4739r7414o4053j2742K9749M4465R8097K5574
16059B8697j32219k7253n6316M5856P2184M2729o4539K8360J26484o1770j17881
16048a15668J6386O1761k9453p4059L6685l3497L3754L6316L5224j04473l1965
16037a68989J69369J33537n0793j04699o2295O4056N7173N558L7351n93j73364
16026i3689j17187l1506J11904J70982l2323j02111Q0993K2299o1830J16240Q2225
16015A45997n8761k9516O928L05N3327r9466q6919j16294L7512J8832l0782k8438
$$ plain form
16093 91827 90822 129175 159944 218463 338578 233943 115345 61597 55952 -24038 90115
16082 90115 144010 107173 11794 -12149 8615 -13148 -130147 -66480 36278 18463 15506
16071 15506 -1874 11208 8451 -19718 5021 -92393 -156446 -169188 -139439 -94974 3123 28697
16059 28697 -103522 -130775 -187091 -141235 -69051 -26322 -90861 -62501 63983 2213 -115668
16048 -115668 -99282 -37521 -66974 -141033 -104348 -137845 -104091 -67775 -32551 -137024 -168989
16037 -168989 380 133917 83124 -21575 -83870 -19814 37359 42917 80268 79675 -93689
16026 -93689 -210876 -242382 -130478 40504 8181 -93930 -12937 9362 -52468 63772 145997
16015 145997 87236 57720 64648 64953 118280 18814 -68105 -184399 -146887 -128055 -158837 -187275
16003a87275r919O0898R4780P3965L2377J38459o6614K612N6858K9785l7940p5214
15991A12772p2600l7581j06451M0931O8887O8440l995l7744m2379n9036o296L6502
15979c8550m5035k0562R1976M5402j1843Q5501N3434j9630j0744j4001j55087
15968c9139k4743Q0190R8405L4278J78J0763M773K3348n7249r2546k4825Q841
15956B2274o5615L8529o2884j11362p6140N2506J23311J40947J57308j7045k3111
15945A78718j0116j3414m0995k4048p7719j03767R684J24156l0786k2600J33157
15934A22270l8979o1461o767K0937J28188j2465r9646k8951l7642j0664q750r2808
15922a26738N6911L5720l0138L1839K14784L1810j48355k0114j8023L5458K6832
$$ plain form
16003 -187275 -197194 -136296 -41516 32449 64826 203285 136671 139283 196141 225926 187986 112772
15991 112772 40172 2591 -103860 -62929 5958 74398 70403 32659 -9720 -68756 -75052 -38550
15979 -38550 -83585 -104147 -12171 33231 21388 106889 160323 140693 129949 115948 -39139
15968 -39139 -63882 16308 114713 148991 149169 159932 164705 188053 130804 38258 13433 22274
15956 22274 -43341 -4812 -67696 -179058 -255198 -202692 -79381 61566 218874 201829 178718
15945 178718 168602 155188 114193 90145 12426 -91341 -81657 42499 11713 -10887 122270
15934 122270 83291 21830 15063 36000 164188 151723 52077 23126 -14516 -25180 -33930 -126738
15922 -126738 -69827 -34107 -64245 -32406 182378 214188 65833 45719 27696 63154 89986
15911H9986P835O200q9553Q9920J4519m5476n2118n7383m1290J6300k5616p3142
15899a59818M8109J00215q859N03K0069Q1522Q1216K8974m6436j20787R258j5957
15887A8009o5881m0063o0477J9168Q5102K6732j7307j32933j1128J8233O7678
15876i2867k4200p9568j31124L1728J60121N7898J9241J01655J401L8424M9282
15865A31991o8873j53837J54768L0108n6291M1279j0963j72167k4370Q1040N9329
15854A2014k5585j26922o0420j5745Q9953K2723Q8461L301L951l7772q4456J17028
15842a3469J29396l3485r4479P273P7105m4628p188j25350j66665O155N0379J92368
15830b2588Q3669J8907l9707J4999J32455m4434r1858j69316q1491r653J12187
$$ plain form
15911 89986 97821 104021 14468 104388 118907 73431 21313 -36070 -77360 -61060 -86676 -159818
15899 -159818 -111709 -11494 -20353 -19850 219 81741 162957 191931 145495 24708 33966 18009
15887 18009 -47872 -87935 -148412 -129244 -44142 -17410 -34717 -167650 -178778 -160545 -92867
15876 -92867 -117067 -196635 -327759 -296031 -135910 -78012 -58771 42884 44285 82709 131991
15865 131991 63118 -90719 64049 94157 37866 79145 68182 -103985 -128355 -47315 12014
15854 12014 -13571 -140493 -200913 -216658 -126705 -103982 -15521 -12220 -8269 -46041 -130497 -13469
15842 -13469 115927 82442 -12037 -4764 72341 27713 20525 -104825 -271490 -265335 -214956 -22588
15830 -22588 61081 79988 40281 55280 187735 143301 51443 -117873 -199364 -209017 -96830
15819i6830J01434m3871l456L5849p8118k8849q2686N7042J46037L9843j416l4709
15807A0270j19030l6624L5140L7813K628k2806N4358J2636O565Q5522n6250k07830
15795a97608L2204K12406K719p0431o2140K1495L3825q9229J3921M2681r8670
15784a58827o9187M3369m289j01432M3708N7726L7822n1296J25408l4056R9929
15773a1125k7348L0341P2652J1722j0580K0169P1957m9019K2096J17400j02757
15762A45508p8977l8327r4369n6984q2443p8047N7483J64509l4065j03191l2638
15751b31541l7648p3528O3589J44591K6209l7941J22035Q8289O208k4549J4966
15740F0680q588l2579o6055J5215K0027Q090j05960j11491l5746J40039J22606
$$ plain form
15819 -96830 4604 -39267 -42723 -6874 -84992 -113841 -196527 -139485 6552 46395 44979 10270
15807 10270 -108760 -145384 -110244 -72431 -69803 -92609 -38251 -25615 -19050 66472 10222 -197608
15795 -197608 -165404 47002 49721 -20710 -82850 -61355 -27530 -116759 -102838 -60157 -158827
15784 -158827 -228014 -184645 -188934 -290366 -246658 -188932 -151110 -202406 -76998 -111054 -11125
15773 -11125 -38473 -8132 64520 76242 65662 85831 157788 108769 130865 248265 145508
15762 145508 66531 28204 -66165 -123149 -205592 -283639 -226156 -61647 -95712 -198903 -231541
15751 -231541 -269189 -342717 -279128 -134537 -108328 -146269 -24234 64055 70263 45714 60680
15740 60680 52092 19513 -46542 -31327 -11300 -3210 -109170 -220661 -256407 -116368 6238
15729F238j65521q4897K29350J12035n9297j70619p6844q9342J27528K02655M4414
15718G5700j09560q6450J23053O5754n321j00038l1353J99802M4408q3581l6716
15707E5698l4079L4837j55753l3328R0260J0369k7564J17019J48671n9491j84903
15696c8264L2060P3891N5644k7693n0090j50490q7325M6175K0409N9253J8900
15685d7530N8783J06763R610r3933m7483M880q1284j05878N8820J7975O4642N4645
15673A0l120m7831J5l1606j47544m289J52468N0321o218l1802k5582M6608K750
15660d5820j9386J33940J06925j27370p0472O0825j3581J9017k3305l6815m3717
15649e9759J19221J54017L460k24955j51082N4156J17172L8873r3364j54619p0340
$$ plain form
15729 6238 -159283 -244180 -14830 97205 37908 -132711 -209555 -298897 -171369 31286 75700
15718 75700 -33860 -120310 2743 68497 63176 -36862 -68215 131587 175995 92414 55698
15707 55698 21619 56456 -99297 -132625 -42365 -31996 -59560 57459 206130 146639 -38264
15696 -38264 -6204 67687 123331 95638 45548 -104942 -192267 -146092 -125683 -66430 -47530
15685 -47530 11253 118016 127626 33693 -13790 -8910 -90194 -196072 -137252 -119277 -54635 10
15673 10 -3110 -50941 -50926 -82532 -230076 -234365 -81897 -31576 -37794 -69596 -95178 -48570 -45820
15660 -45820 -65206 68734 175659 48289 -22183 38642 25061 44078 20773 -16042 -59759
15649 -59759 59462 213479 216939 -8016 -159098 -104942 12230 51103 -42261 -196880 -267220
15638b67220j5674O9990j055J04068J25435J2591j0832P6947M9949M9641j00520
15627I3320r8307J03430j7923q2436j0822R3955K4828p1657q4806m5530K5736
15616g0212q201o5408K3662O2582j757O6925m0957p6277L4936J10035j2669j5845
15604F814L948p3709k7618J08457l408N4434l3446j11053l4356o1881K7156m7162
15592a91824p055n416N7753L8778O4663m174l6360r0r434q867J31016R2957J37426
15579B59373o282p7811j01016r051K0410P0422K1774j14778q2355K9414N972q8151
15567g2079M5730M6016j19131q055J00512P5481p1509k1787n9398p1543p826r391
15555a72980N9039M6979j2488n3641J2702Q2875m8793J45377M8481r3172k6205
$$ plain form
15638 -267220 -282894 -212904 -213959 -109891 15544 28135 17303 94250 144199 193840 93320
15627 93320 -4987 98443 80520 -1916 -12738 81217 106045 34388 -50418 -95948 -70212
15616 -70212 -78413 -143821 -120159 -57577 -59334 7591 -33366 -109643 -74707 35328 22659 6814
15604 6814 10762 -62947 -90565 17892 14484 68918 35472 -75581 -109937 -171818 -144662 -191824
15592 -191824 -198879 -204295 -146542 -107764 -43101 -47275 -83635 -83725 -93159 -102026 28990 121947 259373
15579 259373 253091 175280 74264 65213 85623 156045 177819 63041 -19314 10100 16072 -72079
15567 -72079 -26349 19667 -99464 -107519 -7007 68474 -3035 -24822 -84220 -155763 -163589 -172980
15555 -172980 -113941 -66962 -79450 -133091 -120389 -37514 -86307 59070 107551 14379 -11826
15544a1826J3525o317L6325j1589k8433n6980R6310R8902K8944j51450j38824
15533a31413q8190L4908K07239N7665q2606j13399J2470J37719R746J03487J8011
15522A65637r8917l8777N174K8865J3125p8612J4017r6166o3826R6090M0996k2081
15510c4475n7724J93424j9578r3720j1333k7948P8124J33719J17166p4684k40585
15499c7614j855J29251M1394K8551M5097m0654q8738p7591J1238J6836q2247m2712
15487i9044O2899J0254M2072j49883q3506N5399J17555l4115P0115O7119J6714
15476G5579M4572m3617j31704p425K9413M9969k9340M788J24584M9964j3444k8679
15464A24660o1945k3825o6503L5701J24326J3099j54218o1700K3780J8376l9215
$$ plain form
15544 -11826 1699 -4618 31707 20118 -8315 -65295 31015 129917 158861 7411 -131413
15533 -131413 -219603 -184695 22544 80209 -2397 -115796 -103326 34393 44139 147626 165637
15522 165637 66720 27943 33117 61982 75107 -3505 10512 -85654 -149480 -53390 -12394 -34475
15510 -34475 -92199 101225 81647 -12073 -23406 -51354 26770 160489 277655 202971 -37614
15499 -37614 -39469 89782 131176 159727 204824 164170 75432 -2159 9079 25915 -56332 -99044
15487 -99044 -36145 -25891 16181 -133702 -217208 -161809 -44254 -78369 -8254 58865 75579
15476 75579 120151 76534 -55170 -62595 -33182 16787 -12553 -7765 116819 166783 153339 124660
15464 124660 62715 38890 -27613 8088 132414 145513 -8705 -70405 -46625 -28249 -67464
15453f7464P3317J42192j5718q8802j56618j9612J12638M7113n2794l5803O5449
15442C898J14548p7310o5971n3673n4909N9740P8983K5383O8464P699n7549M6910
15430I6213N5203j8174k0257l1337P0522J10506J0075j93711q7853k5480m4790
15419g9083L7692K3817o7674r3456J23275M3447r2453K948J36694L7533N8053
15408A30793J5377j47971Q4307o3545p9357J26822P0445l9132j16117O5975K9260
15397G6857o2600N9640R3423m1526j24326j30941R518J1541J11478J28757r4661
15386C7160p9488J5885j2781j37594J05945P1204R4766k1889n3344O3885J9668
15375A03417l8486n5318K4170k9453l45j7573l5663q67m2272J03636P9670q4860
$$ plain form
15453 -67464 5853 148045 132327 43525 -113093 -132705 -20067 27046 -25748 -61551 3898
15442 3898 118446 41136 -24835 -78508 -133417 -73677 5306 30689 99153 106852 49303 96213
15430 96213 151416 133242 112985 81648 152170 262676 272751 79040 -8813 -34293 -79083
15419 -79083 -41391 -17574 -85248 -178704 -55429 -11982 -104435 -101487 35207 72740 130793
15408 130793 146170 -1801 82506 18961 -60396 66426 136871 97739 -18378 47597 76857
15397 76857 14257 73897 167320 125794 1468 -129473 -119955 -108414 3064 131821 37160
15386 37160 -42328 -26443 -39224 -176818 -70873 331 95097 73208 19864 83749 103417
15375 103417 64931 9613 33783 4330 3985 -13588 -49251 -50118 -92390 11246 90916 6056
15363F056Q230R9823m6968l6261J05309K0994n1914K140K3957q1491P4718m702
15351A19891n2667k5869R3973K9171j2333k04427o1696k5097J93033Q8246o0317
15340H1908P4082k531n6628n477j3811L2623o0662J44948J12176r1587j59702
15329E5339K4450j12416k23693K338J81829P4680O6122J4312L7774O0155l4426
15318A46464m4538j83418q6119q2665K4373J73709Q3972p6957Q3673K3402j7151
15307D4745L1325n3371L4061N8851O304o2346j06169M5132n1794N7197o5395J159
15295f0301Q1901K284j14976M9388K7642j14731m8689M1639J04898K766O545m2254
15283f3888k7119Q1501n3387j63334N1921M5470M2397n0664n7424j2494k242J26831
$$ plain form
15363 6056 14286 114109 67141 30880 136189 157183 105269 107409 131366 49875 124593 119891
15351 119891 67224 41355 135328 164499 152166 -52261 -113957 -139054 53979 142225 81908
15340 81908 155990 153459 96831 91354 77543 110166 49504 194452 306628 215041 55339
15329 55339 79789 -32627 -256320 -253982 -72153 2527 68649 82961 120735 180890 146464
15318 146464 101926 -81492 -167611 -250276 -225903 -52194 31778 -45179 38494 61896 44745
15307 44745 76070 22699 56760 115611 121915 59569 -46600 -1468 -53262 3935 -61460 -60301
15295 -60301 21600 23884 -91092 -41704 -14062 -128793 -177482 -135843 -30945 -28179 -21634 -63888
15283 -63888 -91007 -9506 -62893 -226227 -174306 -128836 -86439 -137103 -194527 -207021 -209263 -82432
15271h2432J93283j4061Q5039O2655q8523q9608L2062N3851j15970m2638J1843
15260E501j06135o5373M7726N1699R075R3698J25014k5561j74281l5957Q2435
15249G841j0385m2331J51913q33j29331j7924J1627k6685N9499J9570L2404l745
15237E1620J0299O5226j35932o1688N2647L545l1290l9652N7182J06753L6623
15226A15333O3446J6172q4916o6064M4024J4628J46508K7016j30062l6607p3843
15215C5635n5198k8236J29886Q6387j18267J7408M5445K9955J06712n9566q2711
15204A07450n1508R44M6601L5070k8067j00897k066m5932l0628L1773N8516P8889
15192A00145J8918n0858j1936m9549j44986K095R6253k9578L0052l478p9807o5038
$$ plain form
15271 -82432 110851 96790 181829 244484 155961 66353 98415 152266 36296 -6342 5501
15260 5501 -100634 -166007 -118281 -66582 -57507 36191 161205 135644 -38637 -74594 7841
15249 7841 -2544 -44875 107038 106205 -23126 -41050 -29423 -56108 3391 22961 55365 51620
15237 51620 61919 127145 -8787 -70475 -17828 -14283 -45573 -85225 -28043 78710 115333
15226 115333 178779 194951 110035 43971 87995 102623 249131 276147 146085 109478 35635
15215 35635 -19563 -47799 82087 168474 50207 67615 113060 143015 249727 190161 107450
15204 107450 55942 56886 103487 138557 110490 9593 7527 -38405 -69033 -37260 21256 100145
15192 100145 119063 68205 56269 6720 -138266 -136171 -39918 -69496 -39444 -42922 -122729 -187767
15180a87767J48549J02896j4803R0982Q0439l4903j38378m0258J9632o056k4092
15169c759p4137L9360L3607p0874J07266K37595K1148j28406m3770j20413k2500
15158b4883n8953N3641J45551m676k9212Q9632J5916j86117J9597J34860m3886
15147A11470j57942j06770K7953J40352p430q6754n089Q1311R9492J0211k0196
15136H6608r9431q825M9426J0040J01971j53540k2825J2494J852k4560m2101J3391
15124g5500j08468j30768O4427J5970o1221O4068P0741o4701n0199M7399P9378
15113a48874J39249j60911P0267J06755q1104q028L5280P48O9942N0523l8565
15102C5282O6975L8539o6914j37044k6866O7816L5945J97207O8191l9370r6837
$$ plain form
15180 -187767 -39218 63678 48875 139857 220296 185393 47015 6757 26389 20333 -3759
15169 -3759 -77896 -38536 -4929 -75803 31463 269058 290206 161800 118030 -2383 -24883
15158 -24883 -83836 -30195 115356 110680 81468 171100 187016 899 20496 155356 111470
15147 111470 -46472 -153242 -125289 15063 7633 -79121 -84210 -2899 96593 106804 86608
15136 86608 -12823 -21648 27778 37818 139789 -13751 -36576 -24082 -22230 -46790 -88891 -75500
15124 -75500 -183968 -314736 -250309 -234339 -295560 -231492 -160751 -225452 -275651 -228252 -148874
15113 -148874 -9625 -170536 -100269 6486 -74618 -82646 -47366 -46618 23324 73847 35282
15102 35282 102257 140796 73882 -63162 -90028 -22212 13733 210940 279131 239761 142924
15091A42924j33445R715n786p407m1423p4761m8196M3742P6255J8536q6372J905
15079a04313P9296r725o6560O5540R1941K7729m5584n7603m8628j11952j01832
15068b81691l6387M3630J62014R6808L8020o6381l7964L5485J4826q3973L2988
15057h2625J8769L1074k1151j04708J0084J04306j5907N3552J46225J3542n0790
15046A02371K8607J7313K4846q263J1327l0224m9919j65508r4981J67J18903N4239
15034H878P3522M9532O2712m2221K5978N7478O5895Q2224j12661j55486l9774
15023G6077O475j12725m0175K1476R7286J11099K4568l8868l3415Q5177L9220
15012B36195m3516M995N1041p9355r6408O99l6871O2916P4838L3344j95322r2016
$$ plain form
15091 142924 9479 19194 13408 6001 -35422 -110183 -158379 -114637 -38382 -19846 -106218 -104313
15079 -104313 -25017 -34742 -101302 -35762 56179 83908 38324 -19279 -67907 -179859 -281691
15068 -281691 -318078 -274448 -112434 -15626 22394 -43987 -81951 -46466 -31640 -115613 -82625
15057 -82625 -63856 -32782 -53933 -158641 -148557 -44251 -60158 -6606 139619 153161 102371
15046 102371 130978 148291 173137 164874 176201 145977 96058 -69450 -164431 -164264 -45361 8878
15034 8878 82400 131932 194644 152423 178401 235879 301774 383998 271337 115851 76077
15023 76077 82552 -30173 -70348 -48872 48414 159513 184081 145213 111798 196975 236195
15012 236195 192679 197674 248715 169360 72952 73651 36780 99696 174534 207878 12556 -79460
15000g9460J02763l8489m080o3481R3649L2305l4337L5541O5487p193l13346q4262
14988b94903J75637R3506R9599p2392k930p095Q5989j1999N618k4918q5709j25290
14976a64887j710N3327L1708K9481L8646j6264L986j5015n7574k92O4855P2154
14964C8415o2909L6392p3493M837m6385J4673J09800M1342M0745q7703l440L4357
14952D6631j03061p208O1663q052k512l1173q015o2202M1436O1675N5866m8652
14940c604n9735r4537L4929J9278M7834J3939l837p061R2524O1318K2758L3559
14928A57365r4037k54571j03316Q7305O1087O8458J06159o1296o866J33347J00814
14917A94449N1818l11J6168m2358J66573J09522j87596j22931n9416j87479n3584
$$ plain form
15000 -79460 23303 -15186 -19266 -82747 10902 43207 8870 44411 109898 102705 -210641 -294903
14988 -294903 -119266 -25760 73839 1447 -1483 -8578 77411 65412 71030 46112 -39597 -164887
14976 -164887 -166597 -113270 -81562 -52081 -13435 -29699 -25713 -40728 -98302 -98594 -33739 38415
14964 38415 -24494 11898 -61595 -56758 -103143 -88470 21330 62672 103417 15714 12274 46631
14952 46631 -56430 -63638 -1975 -10027 -12539 -43712 -51727 -113929 -72493 -10818 45048 -3604
14940 -3604 -63339 -157876 -122947 -103669 -55835 -41896 -45733 -52794 39730 101048 123806 157365
14928 157365 63328 -191243 -294559 -207254 -146167 -77709 28450 -32846 -39712 93635 194449
14917 194449 246267 245956 262124 219766 386339 495861 308265 185334 125918 -61561 -115145
14906a15145q446J33533J82620n6080r3032O5884N340j59176p3310j08615L2005
14895a94422R2019L9257j05319J4518Q1035M6966N819p4538N7670J111M4792J58297
14883A67205j7433j04013M3287O2808m3516m1821q815j5583L773L2887P2513k1873
14871A29419j8558m7908j0002k7492J0099J21648L5610k2845o8388l1422j6230
14860E3931Q1941j15302l8419m7291j00247J9635J30092N4573l185O5474m9155
14849E2047J8395J8213k30855j30785P2480p4130L5889Q1494Q0489L796j30618
14838b03585N391k6140O1977P0896O3780R6507P0707n5163l2997k859J302r2279
14826d2463J4540J109l4849R8561J06532L2039k48709K5078N4242q2376J3420
$$ plain form
14906 -115145 -123591 9942 192562 136482 43450 109334 114674 -44502 -117812 -226427 -194422
14895 -194422 -102403 -63146 -168465 -153947 -72912 -25946 -20127 -94665 -36995 -35884 8908 167205
14883 167205 149772 45759 89046 151854 108338 66517 57702 42119 45892 78779 151292 129419
14871 129419 110861 62953 52951 25459 35558 157206 192816 169971 101583 70161 53931
14860 53931 135872 20570 -17849 -65140 -165387 -145752 -15660 38913 35728 101202 52047
14849 52047 70442 88655 -142200 -272985 -200505 -274635 -238746 -157252 -76763 -72967 -203585
14838 -203585 -198194 -224334 -162357 -91461 -27681 68826 139533 84370 51373 48514 49816 -42463
14826 -42463 -27923 -26814 -61663 36898 143430 175469 -73240 -48162 6080 -76296 -62876
14815f2876J3375q9013o7178M8975P5645O6617M899J295R8123j3457r0873L1910
14803A7442L0705q3898j20246R3868K0814L7865q5656K8734P8316o6309L3526
14792a4839R5209K1985l4670n2549Q7479o2604j65536k07058J11585J24312M8398
14781d8288Q9464j2533R1321R5785o8031n3357j2555q249j02023J2538Q0744k7411
14769C7405k9110l7504K2747P4253J24502l9957p5393p1852J6167K3167n564j9476
14757A9385K948J03380j5080j12306n0447m6511O1915O8504o2899J7142M6344
14746C2375j7943J9892M4513m9738k4780O903p1626L8358o9696k5083J5962J15571
14734A4708N1353j7781O4632j5750j10010k5029j3906J16746Q1683j88691J4963
$$ plain form
14815 -62876 -49501 -138514 -205692 -156717 -81072 -14455 -9556 -8261 89862 76405 -14468 17442
14803 17442 48147 -35751 -155997 -62129 -41315 -3450 -89106 -60372 17944 -48365 -14839
14792 -14839 80370 102355 67685 15136 102615 40011 -125525 -332583 -220998 -96686 -48288
14781 -48288 41176 28643 119964 215749 147718 94361 81806 73557 -28466 -15928 64816 37405
14769 37405 8295 -29209 -6462 67791 192293 152336 76943 5091 21258 44425 38861 19385
14757 19385 22333 125713 110633 -1673 -52120 -98631 -36716 31788 -31111 -13969 32375
14746 32375 14432 34324 78837 29099 4319 11222 -60404 -22046 -91742 -116825 -100863 14708
14734 14708 66061 48280 112912 97162 -12848 -37877 -51783 64963 146646 -42045 -27082
14723b7082k8080p0056K2023k8361P6285J03681N900j66022M624J4140p4485p770
14711a75203M0123m0817m8608L1637J37803R6478K6576l0664J21178K6233N0021
14700B34757p8018j34963l3308r430M4707N8577Q4229p735m6534M7241k6201O2988
14688A96310r2301j02025J16036Q7605j23236o6106j8893p1483N3111R7628J02935
14677A79581K1372p0270j24196j4830O4120l890L6709r8409p0096j7504N753Q3301
14665h359P2088J1367M2755J2014j13684j11099J6218l9376M9784J62215P0170
14654A64093j18056j03494J4543j0452p3503l0310J08637Q6109J77121p029j66730
14643D0929l2343k5737O9291O175J1594o877J1348o4319j28533R0191J00835M977
$$ plain form
14723 -27082 -55162 -125218 -103195 -131556 -55271 48410 54310 -111712 -107088 -92948 -167433 -175203
14711 -175203 -135080 -175897 -224505 -192868 -55065 41413 67989 37325 158503 184736 234757
14700 234757 156739 21776 -11532 -20962 23745 82322 166551 158816 112282 159523 133322 196310
14688 196310 104009 1984 118020 205625 82389 16283 -2610 -74093 -20982 76646 179581
14677 179581 200953 130683 6487 -8343 55777 51887 88596 -9813 -79909 -97413 -91660 -8359
14665 -8359 63729 75096 117851 129865 16181 -94918 -78700 -118076 -68292 93923 164093
14654 164093 46037 -57457 -42914 -53366 -126869 -157179 -48542 37567 214688 207659 40929
14643 40929 8586 -17151 52140 58315 69909 63032 74380 10061 -118472 -28281 72554 77531
14631G7531m4104o7973R6262o592m2501O2745M4255K5071j2431J1279m3825R0375
14619A90092N3189j99888k21270M5445J61039O5099j4075K2917L7642N8353M0466
14608B39009j969m9545N1265L3509o2526K3124J118j8362Q978k5297N1960j55268
14596I5996j07448O1193L7235m1355n2103J1115K831P8060J13072o4606r7785
14585C6205n7560p0394l2983N4081J37007K0069J72820j02214j24726J228m262
14574B9271J4761K4464J08183l316r5840m3511L7794o8872l1465k9417j5539J12736
14562C9249J14796m3015o3941n0888N9763P418j20670L3638J13619j5625j27932
14551e3588L5754o5357o0863P9761J44628O2444K4869m947q3309N594L8741l2610
$$ plain form
14631 77531 33427 -34546 61716 55124 12623 75368 119623 144694 132263 143542 99717 190092
14619 190092 243281 43393 -177877 -132432 28607 93706 79631 102548 140190 198543 239009
14608 239009 237040 187495 238760 272269 209743 232867 233985 215623 224601 199304 251264 95996
14596 95996 -11452 49741 86976 45621 -6482 4633 7464 85524 198596 133990 36205
14585 36205 -21355 -91749 -124732 -70651 66356 86425 259245 157031 32305 33533 29271
14574 29271 44032 68496 176679 173363 77523 34012 71806 2934 -28531 -57948 -73487 39249
14562 39249 154045 111030 47089 -3799 55964 63382 -57288 -23650 89969 74344 -53588
14551 -53588 -17834 -83191 -144054 -64293 80335 142779 167648 162701 79392 84986 123727 91117
14539I1117m9364O873J58463m1514j56780j69415K1328J49372J2442n7518q8406
14528a23402m9972N8864M9869n0564J41270K0961P961m3666j6683k2595n2035
14517g9992o887Q2882O9307K1268j6387p8363k5461M2422m9035l0221q8295j18698
14505b77460k3659N9332J02589J46548L0955o9712o172p716m2369P6212Q5670
14494G4218j19345j93963k2792J25701J32778k7555n5674r8055k929k333K22099
14483C2150K12658p0658p3720j7043M6072r9957p6660J24040P4020k1073M0540
14472A70369p9133n9074L9303m9953q4930L5677l2562P5020J4370p4360j0586
14461e5859M733P4714K6970P9251j2407q5325Q7070J6641k9697N382p3342j00198
$$ plain form
14539 91117 41753 48626 207089 165575 8795 -160620 -139292 10080 22522 -34996 -123402
14528 -123402 -173374 -114510 -64641 -115205 26065 47026 54987 11321 -5362 -27957 -79992
14517 -79992 -86879 -3997 65310 86578 70191 -8172 -33633 8789 -40246 -70467 -158762 -277460
14505 -277460 -301119 -241787 -139198 7350 38305 -31407 -37579 -45295 -87664 -11452 74218
14494 74218 -45127 -239090 -261882 -136181 -3403 -30958 -86632 -184687 -187616 -189949 32150
14483 32150 244808 174150 100430 83387 129459 29502 -47158 76882 150902 129829 170369
14472 170369 91236 32162 71465 21512 -63418 -27741 -60303 14717 29087 -45273 -55859
14461 -55859 -51126 23588 50558 129809 117402 32077 119147 135788 106091 111473 38131 -62067
14449f2067j6330O8323P8154j28372k7426Q4002P9331O0439p1666P7338K6695
14438A68421K2421N1841o3272n1450m7666m5746m4934J1693n9709l1443j8757
14427a08601p7797p7927M1680J14502Q7067j6986o5266j7102k2892k0808K2179
14416a41951l9531P0644j07884o4822j2920R183J01010O6300J1091N806l1504
14405a34578N1488p0892O6494m6422l1449J47014j162k7947M0903J00233O0949
14394A54631m0130j42567o5722M3975J30866R893m0913j9153n5792p5449l1513
14383a31874p8387P8129J13551N7827J33924K1796m8830j21634n5790j5323J22392
14372G5781P4569l6742k8021l3337l8220J5997M3140q421o4874k9636q241Q012
$$ plain form
14449 -62067 -78397 -10074 68080 -60292 -87718 -3716 75615 136054 64388 141726 168421
14438 168421 190842 242683 179411 127961 80295 34549 -10385 1308 -58401 -89844 -108601
14427 -108601 -186398 -264325 -222645 -108143 -21076 -38062 -103328 -120430 -143322 -164130 -141951
14416 -141951 -181482 -110838 -218722 -283544 -296464 -287281 -186271 -119971 -108880 -103074 -134578
14405 -134578 -83090 -153982 -87488 -133910 -165359 -18345 -19507 -47454 -6551 93682 154631
14394 154631 114501 -28066 -93788 -49813 81053 90946 50033 30880 -24912 -100361 -131874
14383 -131874 -210261 -132132 -18581 39246 173170 194966 146136 24502 -31288 -46611 75781
14372 75781 150350 113608 85587 52250 14030 30027 73167 64746 -128 -29764 -38005 -29993
14360b9993j6283J5732R214l0680J28011l1604J9543j9700P706K9796N7554j44043
14348d747J3864L1703P9399o0938l1110m0924J5974l2674l2900K3355L0774K0111
14336A1887k5275o9645n824P7710k706J2055M2542j947k7300o0087j63753J13992
14324i8351N2179O6255p6933K5862M0609O0365k942o777J33196o1809r6358m7756
14312a2460j256K6774N8603N6218j6462O1724Q4195l2989r045J324p3597q668
14300A34361Q5477j03532p0384J29282R8069j9174j14615j5752M5264O6037m8619
14289A86414q5617o0814J0699l5748P2000Q0452j4437j23940l4996O9394q4702
14278b1295Q1700K5321O451M4781K3216N1605Q5000p8991q7770K9880j18011j04041
$$ plain form
14360 -29993 -46276 -30544 -21330 -52010 76001 44397 63940 44240 51946 81742 139296 -4747
14348 -4747 9117 40820 120219 59281 28171 -12753 3221 -29453 -62353 -38998 -8224 11887
14336 11887 -13388 -83033 -88857 -11147 -13853 -1798 40744 38797 11497 -48590 -212343 -98351
14324 -98351 -46172 20083 -56850 -30988 9621 69986 67044 60267 193463 131654 35296 -12460
14312 -12460 -13716 13058 71661 127879 111417 173141 257336 224347 215302 216626 143029 134361
14300 134361 219838 116306 45922 175204 273273 254099 139484 123732 168996 235033 186414
14289 186414 100797 39983 50682 14934 86934 167386 152949 29009 -5987 63407 -21295
14278 -21295 60405 85726 92177 136958 160174 211779 296779 217788 130018 159898 41887 -62154
14266f2154L692J62229Q9311o4210p107o9426l8361j14400j50866O0303Q3285
14255a07704L4265O2541R2433m3827J05412J61665j20017N9828j23388j93495
14245g2287o9086P3282J22969k470Q3451J32966M0092m7906j92094o9974O9308
14234F8251n1648Q1667P2060M1075p2125j44801O0974P1166M4207O0329l7140
14223A94015j33344j34281N2300K3903j031Q5566L3795k4809M4591n0351n6130
14212C4224K5024L2461o8905j2500m903j35378j03870J20628J60694R8070l2322
14201A13223L0111n5903j21788j04925j5838O1457M2348J24374p4130j04643J6377
14190h9337L5737J37297L2810m7213j04407n0270n151k9027O1379j5926Q2291
$$ plain form
14266 -62154 -58462 103767 193078 128868 121761 52335 13974 -100426 -251292 -190989 -107704
14255 -107704 -73439 -10898 81535 37708 143120 304785 184768 244596 121208 -72287
14245 -72287 -141373 -68091 54878 52408 135859 268825 308917 261011 68917 -1057 68251
14234 68251 16603 98270 170330 211405 139280 -5521 55453 126619 170826 231155 194015
14223 194015 60671 -73610 -21310 2593 1562 87128 120923 96114 140705 90354 34224
14212 34224 59248 91709 22804 10304 5401 -129977 -233847 -113219 47475 145545 113223
14201 113223 143334 87431 -34357 -139282 -155120 -93663 -51315 73059 -1071 -105714 -89337
14190 -89337 -53600 83697 116507 69294 -35113 -85383 -90534 -119561 -58182 -74108 8183
14179H183L7856o9419j03692O3469J30355K5865N2201M6654J415P7450K9217m8148
14167B51406m5725k3119j3171k580j26269q0612J7672M4831l856p6789j8597m7526
14155a24335J7603J1510n751J70901j83780j11110J29879L9799m834o1908L2812
14144h9214l9012P2688J06721n6259K7308m9176k6003L9808K659L8135r9751p8077
14132a50173J06802O4677j19041p4488p259M7187O6025J28446P0215n0330q8458
14121f397Q1724q9582o7580J03712N6456q674k1461j32936j5075M2231O9812K02658
14109B14888N2616p8571j50808l9633L6824l1138j7061j45619n6060Q4313J08862
14098b1387N8549J14484j3294m7779L7567O078j28818j34911O03j3084q1451l548
$$ plain form
14179 8183 46039 -23380 -127072 -63603 66752 92617 144818 191472 192887 270337 299554 251406
14167 251406 205681 182562 169391 166811 40542 -40070 -22398 22433 18577 -58212 -76809 -124335
14155 -124335 -106732 -95222 -100973 69928 -113852 -224962 -95083 -55284 -60118 -122026 -89214
14144 -89214 -128226 -55538 51183 -5076 22232 -26944 -52947 -13139 -10480 27655 -72096 -150173
14132 -150173 -43371 21306 -97735 -172223 -179482 -132295 -66270 62176 132391 82061 -6397
14121 -6397 75327 -14255 -81835 21877 78333 69659 48198 -84738 -99813 -57582 12230 214888
14109 214888 267504 188933 38125 -1508 35316 4178 -12883 -158502 -214562 -130249 -21387
14098 -21387 37162 151646 138352 90573 128140 134218 5400 -129511 -128908 -141992 -223443 -226991
14086b26991P6497J15640p3153l493l720K1179P835p7740K1969j30835L6829Q1007
14074a54976k4766o4006J93478O6532N1981J16340q3640j06160r84J6542N2067
14063F2408m1705j9996L6783q8123k3628J1435J12448M1215k0357o6039r0257
14052h5816J27019n33j79100j02167L9979J23700O5562l3454M1023m2730L3548
14041a2969Q5453k7573Q9521Q836m6188p4163l2626j84499J2681Q4893p9097Q589
14029a67142M2885Q6800O9553n9892m9790M138j04116J9598L9615N3283j3108
14018g8176K4599M6934j10394j12781o5724L0664J04132J12163P0413O4289o3619
14007B2500n946J0137l8486O7366m8080j67531q1933J68419J18877O0068O5664
$$ plain form
14086 -226991 -150494 -34854 -108007 -111500 -115220 -94041 -86206 -163946 -141977 -272812 -235983 -154976
14074 -154976 -179742 -243748 -50270 16262 68243 184583 100943 -5217 -6201 10341 62408
14063 62408 20703 707 37490 -50633 -74261 -62826 49622 90837 70480 4441 -85816
14052 -85816 41203 40670 -138430 -240597 -200618 -76918 -11356 -44810 -3787 -46517 -12969
14041 -12969 72484 44911 134432 143268 97080 22917 -9709 -194208 -181527 -96634 -175731 -167142
14029 -167142 -124257 -37457 32096 -27796 -77586 -73448 -177564 -157966 -118351 -65068 -78176
14018 -78176 -53577 -6643 -117037 -229818 -295542 -264878 -160746 -48583 21830 86119 22500
14007 22500 16554 26691 -11795 55571 7491 -160040 -241973 -73554 45323 105391 171055
13996A71055n0860j30256Q6944J03527j66687j25656N6686L5580L722M7652J23018
13985A54725k7070r4917r5047q6661L0674J01226K5323K1159N2437p1349q5131
13974g4631N3868n4407j09075j9536P0839K0143P7377K1125N6901P4889l4884
13963H2609n7978O5548r280o3167J9615k7498K5270R2419j7194Q7127M1561o1877
13951A77155j30320L489J639J5434r7166J01600K4336o6558j13386K9504K1363
13940c2910J1312L6597O0498q6738n9101j1034J20633R406M2362P2696j7207j8706
13928A27808n646P9384j4593j16296m3422M0967p3417m1163m5480j4158q4889
13917a90905J7257P5460k4516J0492l1046l3889J1893L9012O7403J04010K9485
$$ plain form
13996 171055 120195 -10061 76883 180410 13723 -111933 -55247 -19667 -15945 31707 154725
13985 154725 127655 32738 -62309 -148970 -118296 -17070 8253 29412 81849 10500 -74631
13974 -74631 -20763 -75170 -184245 -203781 -132942 -112799 -35422 -14297 42604 117493 82609
13963 82609 24631 90179 80899 17732 37347 9849 35119 127538 110344 197471 239032 177155
13951 177155 46835 50324 51963 67397 -29769 71831 96167 29609 -83777 -54273 -32910
13940 -32910 -21598 14999 75497 -11241 -70342 -81376 39257 48663 91025 163721 146514 127808
13928 127808 122162 201546 186953 70657 27235 68202 -5215 -46378 -91858 -106016 -190905
13917 -190905 -173648 -98188 -122704 -112212 -143258 -177147 -165254 -126242 -58839 45171 74656
13906G4656p867J1202m6344n245l7328k915l7287k8970J3205M4323p141l4347
13894f4058j4415k6006r8479Q8518J67578J29168k9510J5974j93992j0165J53733
13883A18346L6569k1357q0675p3228n5968p2084P8459O5685n7354K8211M0891
13872G495j925L3162L5856j00561O6133P2697J04511j3359p2215k4411J09894
13861B17277m0997j52155q4479k64Q5514N2244m8309j4825J24989o5792p1223
13850A980p6652k4405Q004k8217q913l0843N7509q4535L0436p613Q4291k2782
13838a01740P5962o6841N2043J9625k6794L5628M24m0983Q187Q7078N0499p9725
13826A3363K9209J4116o5822p6043J62952P0373Q824p3922k7587O8170J01231
$$ plain form
13906 74656 66789 77991 31647 26402 -10926 -13841 -51128 -80098 -66893 -22570 -29711 -64058
13894 -64058 -78473 -104479 -202958 -114440 53138 182306 152796 168770 -25222 -35387 118346
13883 118346 154915 133558 52883 -20345 -76313 -148397 -69938 -4253 -61607 -33396 7495
13872 7495 5570 38732 74588 -25973 40160 112857 217368 204009 131794 107383 217277
13861 217277 176280 24125 -60354 -60618 24896 77140 28831 14006 138995 73203 1980
13850 1980 -74672 -99077 -91073 -119290 -128203 -159046 -101537 -186072 -155636 -163249 -78958 -101740
13838 -101740 -25778 -92619 -40576 -20951 -47745 -12117 -11693 -52676 -44489 42589 93088 13363
13826 13363 42572 56688 -9134 -85177 77775 148148 156972 83050 55463 123633 224864
13815B24864p7212j6920j29640N7784J1725q9734M0497n342k4351j16523J10177
13804a4675l4374k2685J36752n6656k9167L0055k7291M8007L0257q3528J3423
13793i882P4139l3445J0362q3879j8261m2939P8681J04183K4254k8404j36299
13782f1490l8568N5149k0896k7040k7214r307P2083k7300k6689Q1341J53611N7937
13770A81617j21829j39066L1696k6657j8796m6597J0156l6099q5007N613K9938
13759b15031N4094L3672O2320J6732J5200n3005o8223m5467R9623N7323O6733
13748B3971p0323M1710j2138L3521Q5208N5140j88985Q23m670P8673K2617k8779
13736C6768p4920N2117Q3188O853J06867l977j78129j6794O9654J1306M6216J0888
$$ plain form
13815 224864 147652 130732 1092 58876 70601 -19133 21364 16022 -8329 -124852 -14675
13804 -14675 -49049 -71734 65018 8362 -20805 9250 -18041 29966 60223 -23305 -9882
13793 -9882 64257 30812 41174 -42705 -60966 -103905 -25224 78959 103213 74809 -61490
13782 -61490 -100058 -44909 -65805 -92845 -120059 -129366 -57283 -84583 -111272 -29931 123680 181617
13770 181617 59788 -79278 -47582 -74239 -93035 -139632 -129476 -165575 -250582 -244969 -215031
13759 -215031 -160937 -127265 -64945 -48213 -33013 -86018 -154241 -199708 -100085 -42762 23971
13748 23971 -46352 -4642 -16780 16741 101949 157089 -31896 -31073 -35743 42930 65547 36768
13736 36768 -38152 13965 97153 104006 210873 206896 28767 11973 81627 92933 139149 150037
13724A50037m359j32047l449P2707J76256L0330j56869q3082j7742j09474j01474
13713a79166M4992J12545K9008k1401j48180m9336P733R872J49477k0220j5261
13702g9937p755k0428j3193O2875J08214l7837o0608l4134l9162L2240R0091L8941
13690C9307P9711R4678l3175o3490n1060m7888j29512o0376L9552j969L9923p9254
13678a73553r7355K712J15780r7681Q8107J12015Q952J8221N9238p4420k27739
13667b65723m5261R8589O5433J17548K36799L5823l920k6033p7449l9836k9498
13656F6472j9809p0809r3234P0760J9851k4413n5244q0686P2868P5009J23654
13645H4419J12476P4700j10769p5628j44098J0361P2000n0713l4680o2275l4034
$$ plain form
13724 150037 145678 13631 10182 82889 259145 289475 132606 49524 31782 -77692 -179166
13713 -179166 -134174 -21629 7379 -14022 -162202 -211538 -203805 -193933 -44456 -64676 -79937
13702 -79937 -87692 -108120 -121313 -58438 49776 11939 -48669 -82803 -121965 -89725 366 39307
13690 39307 119018 213696 180521 117031 65971 18083 -111429 -171805 -132253 -134222 -94299 -173553
13678 -173553 -270908 -268196 -152416 -250097 -161990 -49975 -41023 -22802 36436 -37984 -265723
13667 -265723 -310984 -212395 -146962 -29414 207385 243208 239288 213255 135806 95970 66472
13656 66472 46663 -24146 -117380 -46620 -26769 -51182 -106426 -187112 -114244 -39235 84419
13645 84419 196895 271595 160826 85198 -58900 -48539 23461 -27252 -61932 -124207 -158241
13634a58241O7490N5063o0095j1951j059O3772K8499p3844n4376Q8702J21168
13623F5128J9571k4252j11242j39346J12291J50720J21034o6732m5754N0079n2068
13612G9429j30778j09799L4212Q9686P6872K0760p0089k14262k3651J00693k9846
13601a76773j05851R2636J22233K1468j0407p6991L4803J0460m3426Q0964O4259
13590A3375M4061k3945K5257L4523o7583N2730J19101q706m1279j09784O507j05797
13578f1540L3881K5844j17529j6507O3420J20580j2000J1643n0102O948p5905
13567g1267P5271p96j04782n1501k9891Q4259J50315J6493m4052J8253L1091O4228
13555A37621n8377J1434M1804m7783j77564O4605O4549n8715q2087o4085P9529
$$ plain form
13634 -158241 -90751 -35688 -95783 -107734 -108793 -45021 -16522 -90366 -144742 -56040 65128
13623 65128 84699 60447 -50795 -190141 -77850 72870 193904 127172 81418 131497 79429
13612 79429 -51349 -161148 -126936 -37250 39622 60382 -9707 -223969 -247620 -146927 -176773
13601 -176773 -282624 -189988 -67755 -46287 -56694 -133685 -98882 -88422 -131848 -50884 13375
13590 13375 57436 33491 58748 93271 25688 78418 197519 188813 147534 37750 44257 -61540
13578 -61540 -27659 -1815 -119344 -135851 -72431 48149 36149 47792 -2310 4638 -71267
13567 -71267 4004 3208 -101574 -153075 -182966 -98707 51608 68101 24049 42302 73393 137621
13555 137621 79244 90678 132482 84699 -92865 -28260 36289 -22426 -104513 -168598 -89069
13544h9069J17778J55923Q3022m8343J4132n4637n7567k335m4201r8052j07199
13533a30548Q1408J10184L2159m2304p4775J3613j1540j12930j7171K5606k0736
13522a47034O1771P9269j2509k6328j7196R6835L5435p0876n3499o9940k1161
13511a45233m445P5342J33437J3327r9544o8781p1343K4984R2355N7262N0341
13500E7702M1591M8287q682J3080O48q4117r2394L4955O8702R1629n0988j03471
13488A6942m2603r5561K2341j00239l9908P8367o1696P3079P3780p5672M66J9239
13476a31465j9916K7327J08330J07020K76L0365r935J3555P45J05390n0968j20743
13464E9981j44456j8029j349L3389J1079K8634J50514K3264m2964J9430M79j11534
$$ plain form
13544 -89069 28709 184632 267654 219311 233443 178806 121239 118904 74703 -23349 -130548
13533 -130548 -49140 61044 93203 50899 -23876 -10263 -21803 -134733 -151904 -126298 -147034
13522 -147034 -85263 -5994 -18503 -44831 -62027 34808 70243 -633 -54132 -124072 -145233
13511 -145233 -149678 -74336 59101 72428 -27116 -95897 -167240 -142256 -49901 7361 57702
13500 57702 99293 147580 138898 151978 152626 68509 -23885 11070 79772 171401 120413 16942
13488 16942 -25661 -121222 -98881 -199120 -239028 -160661 -222357 -149278 -75498 -151170 -150704 -131465
13476 -131465 -151381 -124054 -15724 91296 91572 121937 112002 125557 126302 231692 180724 59981
13464 59981 -84475 -102504 -103853 -70464 -59385 -30751 119763 143027 100063 119493 119972 8438
13452H438j36634J0801M4573K2563j8591p7950J90295R0135o755m6017j7794j10379
13440d7315K0220n6240p5687N8726p5558j08978J20044J57295O9074J00486n159
13429A56908m84o3571k7045L0353J8441q2629m7392l8065O1611J79601L8538j42547
13417H3719j8027l4275N7708L3940j02149j09735Q8371L7961p8751m9712J09117
13406A8167P6807j56251q6416j04266j26842J2939N4370Q7451K8033L4030O7063
13395i4915j7960l692k6358n4839o3126L0406J26190K3580Q1869J04674q9721
13384A6108n0275m4187j05838l0420j9691M0874K4790J06361l5235j20098P7612
13373a39999l7728M5343J03308l7847r644K1502J02268N1261O8708l724p0179
$$ plain form
13452 8438 -128196 -117395 -72822 -50259 -68850 -146800 43495 133630 126875 80858 63064 -47315
13440 -47315 -27095 -83335 -159022 -100296 -175854 -284832 -164788 -7493 61581 162067 156908
13429 156908 156424 92853 65808 96161 114602 31973 -15419 -53484 8127 187728 226266 83719
13417 83719 65692 31417 89125 123065 20916 -88819 -448 37513 -41238 -90950 18167
13406 18167 94974 -61277 -147693 -251959 -378801 -365862 -311492 -224041 -196008 -161978 -94915
13395 -94915 -112875 -116567 -142925 -197764 -260890 -230484 -104294 -80714 1155 105829 16108
13384 16108 -34167 -78354 -184192 -214612 -234303 -193429 -168639 -62278 -97513 -217611 -139999
13373 -139999 -177727 -132384 -29076 -66923 -76567 -55065 47203 98464 167172 163448 93269
13362I3269q1492j31247J30155M8298r6828M1155n349j08314q9063K1390J57599
13351b0427J40325J00290k2931m5311j18087r2926j40994J3327Q7124j6491m1468
13340a57569k7228o5281K1671K20894O0471l1013K9400J17854r5398j68527n1119
13329a45845J5145K0421l831j56674j11828J02446J72493J34533K270L0606J48586
13318B08322Q3147j14546j6903q335R425j7414K5276p589L130N0255o738p0235
13306A37795p8826k0489n9558L7660n0963M4977L939j30601q2458L9339J27503
13295c1682M6686J4010l4270j65248l6245J47376R9081P5593L0831J0440M0295
13284A96867j39378j08159Q5764J1159n9680k8571j06223j1664K192j1348J62973
$$ plain form
13362 93269 11777 -119470 10685 58983 -37845 3310 -2039 -110353 -199416 -178026 -20427
13351 -20427 119898 220188 197257 151946 33859 -59067 -200061 -186734 -99610 -116101 -157569
13340 -157569 -184797 -250078 -228407 -7513 52958 21945 51345 169199 73801 -94726 -145845
13329 -145845 -130700 -110279 -114110 -270784 -382612 -280166 -107673 26860 29130 59736 208322
13318 208322 291469 176923 160020 151685 161110 143696 168972 161383 164513 214768 208030 137795
13306 137795 58969 38480 -21078 16582 -34381 10596 14535 -116066 -198524 -159185 -31682
13295 -31682 15004 29014 -5256 -170504 -206749 -59373 39708 115301 146132 156572 196867
13284 196867 57489 -50670 35094 46253 -13427 -41998 -148221 -159885 -157693 -169041 -6068
13273f068L8042k950J25625K13k06949q1377j7843K01546j6228P1471r5621j38664
13261a28803q6137P220P4847l0142L4201K1633P5448K0673j4322J6053O4730m334
13249E1067m6304N7862J20131j6866q8752J1408j9966Q5349O8411q2980q4746
13238E4614j11329J2748L8925r9180k4580l620L2531J59028l6645j23440K1987
13227g8961J01250L4728R6908p290j04409R433O7972J8636J19476j1520n6742
13216A89481j03897m8538P9895Q2672n7759j11887Q2247P3190q2528o4020J4998
13205E3854j7499P2180J03245R0379P4378o5183j44372n2813l656L2009n7624
13194H4898m6344J43110P4221j19387q2246n5938R4984L3689j34770j05549k1076
$$ plain form
13273 -6068 31974 29024 154649 154862 -52087 -133464 -151307 50239 34011 105482 9861 -128803
13261 -128803 -214940 -207720 -132873 -163015 -128814 -107181 -31733 -11060 -25382 -9329 55401 51067
13249 51067 4763 62625 182756 165890 77138 88546 68580 153929 222340 139360 54614
13238 54614 -56715 -43967 -5042 -104222 -128802 -132422 -99891 59137 22492 -100948 -78961
13227 -78961 22289 57017 153925 146635 42226 51659 119631 138267 257743 246223 189481
13216 189481 85584 37046 116941 199613 141854 29967 112214 185404 102876 38856 53854
13205 53854 36355 108535 211780 302159 376537 311354 166982 114169 110513 142522 84898
13194 84898 38554 181664 255885 136498 54252 -1686 93298 126987 -7783 -113332 -134408
13183a34408L8727O2889R802J76536O2763j18781p4672k1570n2355M8998J9752
13172A7681k9195n3401P0195J1336J858L8681J9794m6011J254P7928J28498J08
13160B38726j37122k7892K2355k9390P3703l0013J5568r8713m6815n305l6511
13149f1409o9022O4916p6724j07557L7910J04715k6714j2399l2044J49813J9120
13138i395m9138j39251o0276K1290J51535J13619L0933j11728K497k9322n0114
13127a29350p5007J0176J08392Q9838J07939O1744o6366j69622j48321R9063Q9847
13116b1667k0677j13195j09184j1895Q5547k6627p043J14325N3561N6115M1920
13105D1180J0908O9947K8172O6028L6143K4015p6948o7254m6304K0446M3137j5809
$$ plain form
13183 -134408 -95681 -32792 -22990 153546 216309 97528 22856 1286 -51069 -2071 17681
13172 17681 -11514 -64915 5280 16616 18474 57155 76949 30938 32192 110120 238618 238726
13160 238726 101604 73712 96067 66677 140380 110367 125935 27222 -19593 -24898 -61409
13149 -61409 -130431 -65515 -142239 -249796 -211886 -107171 -133885 -146284 -178328 -28515 -9395
13138 -9395 -58533 -197784 -258060 -236770 -85235 28384 59317 -52411 -49914 -79236 -129350
13127 -129350 -204357 -194181 -85789 4049 111988 173732 107366 -62256 -210577 -111514 -21667
13116 -21667 -42344 -155539 -264723 -276618 -191071 -217698 -224741 -110416 -56855 -740 41180
13105 41180 52088 122035 150207 216235 252378 276393 199445 132191 85887 106333 149470 133661
13093A33661k6241j06878l3992Q8058m751r2832p8135L754R4796R2718j0321Q7215
13081A47052M9606M2451j7194m3258j4264M7235K5748o4543K862k9221o9921j68966
13069i2413r2826r799O3984Q9975J3409O3706J8972l767K0440N032l4941q4150
13057d2378l438k3952n0253K1460l0709K4119Q0410K7850K3774R8595j29362j15831
13045a19715Q5598N4155J398o5184k4683R7901J608k9230K9231N6402l923l4416
13033D9142L5286R161O182l7070j9902K4339n0400l1997n5367K4968R7757l3317
13021A8782N1386R0956K4724l8503O307Q2152j1351j54514q2066K863r401L4944
13009A6279n0649j431J8563r1526r0179J73043p829j04395P0128J08266o0915
$$ plain form
13093 133661 107420 542 -33450 54608 49857 -42975 -121110 -117356 -22560 70158 59837 147052
13081 147052 196658 239109 221915 178657 164393 211628 237376 172833 175695 146474 76553 -92413
13069 -92413 -185239 -195038 -131054 -41079 -27670 36036 55008 51241 71681 76713 41772 -42378
13057 -42378 -45816 -69768 -120021 -98561 -129270 -105151 -24741 3109 26883 125478 -3884 -119715
13045 -119715 -34117 20038 21436 -43748 -68431 29470 31078 1848 31079 87481 83558 49142
13033 49142 84428 93589 99771 62701 42799 67138 16738 -15259 -70626 -45658 52099 18782
13021 18782 70168 161124 185848 147345 153652 235804 224453 69939 -12127 -9264 -18665 16279
13009 16279 -34370 -35801 -17238 -108764 -198943 -25900 -33729 -138124 -67996 40270 -20645
12998b0645j07614k5273r8591J4334O6094J24862N1217Q2499r6777n4266j1569
12987g5729N6359k3250J817q0953o582O8523J35610L2812j11422O4815j8925r7142
12975e4067O0913n2819P4552J9832l7925M9753j3265N3484m7106j01297p0176
12964a18121L4214N6678n2052p733l613o1465Q9681Q3361Q8172k961k128n5056
12952D8977L0909K2317l6250q7204O1337J7642J3691Q8709k8386J2704N2165K4080
12940B20691k4607q8573q1330r9434P9165J02201J35784L0729R574j09651k40793
12929f6244l8310R6051j1524q1604n2085J42036K93217p331k53734j39815K3115
12918i6228J52071j1254q3804N1875p6301K263L2392k2185N6837j009j01864l0284
$$ plain form
12998 -20645 -128259 -153532 -252123 -237789 -171695 -46833 4384 86883 -9894 -64160 -75729
12987 -75729 -19370 -42620 -40803 -121756 -128338 -59815 75795 108607 -2815 62000 43075 -54067
12975 -54067 6846 -45973 28579 48411 10486 60239 46974 100458 53352 -47945 -118121
12964 -118121 -83907 -27229 -79281 -87014 -90627 -152092 -62411 20950 109122 106161 104033 48977
12952 48977 79886 102203 65953 -21251 40086 57728 71419 160128 131742 144446 196611 220691
12940 220691 196084 107511 26181 -73253 5912 108113 243897 274626 284200 174549 -66244
12929 -66244 -104554 -8503 -20027 -101631 -153716 -11680 281537 274206 20472 -119343 -96228
12918 -96228 55843 44589 -39215 12660 -63641 -61378 -28986 -51171 5666 4657 -97207 -127491
12906a27491J0342M8641l4364r2658j5445N3542p011J4148K52270J01758j31522
12895G2210M438m2412O633M2718P2882Q1067l1566K6064o3429k9838K9292M1276
12883B09335M8979L6521j17236o8613J5865n3286k9217J2469Q069j6714o9007
12872b2835P4241N6749j48361n8010Q9131m4790l3412l6691j10763M1459K09970
12861A6688O8566N7346p7495j05387k7243p138P1260K0950q6033r5197R8291L8465
12849b6927k4468N1270M5104n0268Q6122L8575K453j02009K5434j20427p8497
12838a53638J40374J74495j09216Q564N8741N0754J0430j5374J3107o5520j058
12827A11659n092j52490j08147J6797K89J1103p3850n4195K23153l3764n2505
$$ plain form
12906 -127491 -117149 -68508 -102872 -195530 -210975 -157433 -164444 -150296 101974 203732 72210
12895 72210 76648 34236 40869 83587 156469 237536 205970 232034 168605 138767 168059 209335
12883 209335 258314 294835 177599 108986 124851 71565 42348 54817 62886 46172 -22835
12872 -22835 51406 108155 -40206 -98216 -9085 -53875 -87287 -123978 -234741 -193282 16688
12861 16688 85254 142600 65105 -40282 -67525 -74663 -3403 17547 -68486 -163683 -65392 -26927
12849 -26927 -51395 -125 44979 -5289 80833 119408 121861 19852 45286 -75141 -153638
12838 -153638 -13264 161231 52015 60579 119320 170074 180504 165130 178237 112717 111659
12827 111659 106567 -45923 -154070 -137273 -136984 -125881 -199731 -253926 -30773 -64537 -117042
12816a17042L056l2794J08005q850J3007J6192N5526K1125k21211j71276L6803
12805b97459J23415j712Q072P2220Q3299J14103o5980q1988R5992J15203p4140
12794I1025n6285N2852j9958k1512k0632J69018K8049j41015n4127j12444O2060
12783b2969q346k5615O8420Q0448p7849l1508K7947M6706j5092p3758j70569P401
12771a94784m405K5935N8811J73629J1614j6047r8011j36381J4299j0613q0099
12760b56052K2273O1283L4190o3737j7148J04035J59843M6962m0422q7705j9571
12749e6049o0246L0637N7787k0675O8141m20n3629R522k7039J01555k4271N5047
12737H0360J31173j540j14874j32998L1359N7510J3792J04870j48412j60785n5443
$$ plain form
12816 -117042 -113986 -146780 -38775 -47625 -34618 -18426 37100 58225 -162986 -334262 -297459
12805 -297459 -174044 -175756 -167684 -95464 -12165 101938 35958 -46030 49962 165165 91025
12794 91025 34740 87592 67634 46122 25490 194508 222557 81542 27415 -85029 -22969
12783 -22969 -31315 -56930 11490 91938 14089 -17419 10528 57234 42142 -31616 -202185 -194784
12771 -194784 -199189 -173254 -114443 59186 70800 54753 -43258 -179639 -165340 -175953 -256052
12760 -256052 -233779 -172496 -138306 -202043 -219191 -115156 44687 91649 51227 -36478 -56049
12749 -56049 -116295 -85658 -27871 -48546 19595 19175 -34454 -24932 -51971 49584 25313 80360
12737 80360 211533 209993 95119 -37879 -6520 50990 64782 169652 21240 -139545 -194988
$$ [...]
##END NTUPLES=NMR SPECTRUM
##END=
