##TITLE=Analysis number 324616
Compound Code cc 21104
Book Reference 483/88
Project Code adrs
Chemist Name mattw
##JCAMPDX= 6.0         $$ Bruker NMR JCAMP-DX V2.0
##DATA TYPE= NMR SPECTRUM
##DATA CLASS= NTUPLES
##ORIGIN= Bruker BioSpin GmbH
##OWNER= nmr
$$ XWIN-NMR		Version 3.5
$$ Tue Nov 28 11:06:53 2006 GMT Standard Time (UT+0h)  MAYBRIDGE\nmr@NMR_250MHZ
##.OBSERVE FREQUENCY= 250.131544655141
##.OBSERVE NUCLEUS= ^1H
##.ACQUISITION MODE= SIMULTANEOUS (DQD)
##.ACQUISITION SCHEME= undefined
##.AVERAGES= 16
##.DIGITISER RES= 18
##SPECTROMETER/DATA SYSTEM= dpx250
##.PULSE SEQUENCE= zg30
##.SOLVENT NAME= CDCl3
##.SHIFT REFERENCE= (INTERNAL, CDCl3, 0, 16.522)
##AUDIT TRAIL= $$ (NUMBER, WHEN, WHO, WHERE, WHAT)
$$ ##TITLE= Audit trail, XWIN-NMR		Version 3.5
$$ ##JCAMPDX= 5.01
$$ ##ORIGIN= Bruker BioSpin GmbH
$$ ##OWNER= nmr
$$ C:\u/data/dgb/nmr/ADRS/1280/pdata/1/auditp.txt
$$ ##AUDIT TRAIL=  $$ (NUMBER, WHEN, WHO, WHERE, WHAT)
(   1,<2006-11-28 11:06:22.62 +000>,<MAYBRIDGE\nmr>,<NMR_250MHZ>,
      <created by zg, POWCHK disabled, PULCHK disabled
       configuration hash MD5:
       49 4B E0 1D 92 C2 6B 37 9F E6 65 BC 52 41 86 1D
       data hash MD5: 64K
       A9 77 BA BF 3E 43 94 3A 97 EB B0 C3 2A 9E E1 8C>)
(   2,<2006-11-28 11:06:41.55 +000>,<MAYBRIDGE\nmr>,<NMR_250MHZ>,
      <Start of raw data processing
       ef LB = 0.3 FT_mod = 6 PKNL = 1 SI = 32K 
       data hash MD5: 32K
       A0 3F ED B9 E4 C6 81 B3 69 D4 0F F5 C8 54 F8 25>)
(   3,<2006-11-28 11:06:43.43 +000>,<MAYBRIDGE\nmr>,<NMR_250MHZ>,
      <apk 
       data hash MD5: 32K
       D3 CF F9 5E 2D 98 D1 5E 0C 7F 18 43 1D 21 92 52>)
(   4,<2006-11-28 11:06:44.19 +000>,<MAYBRIDGE\nmr>,<NMR_250MHZ>,
      <abs ABSG = 5 
       data hash MD5: 32K
       65 1A 90 C1 E8 74 6B E8 04 0A E2 B8 03 30 1E C8>)
$$ ##END=
$$ 
$$ hash MD5
$$ D9 F4 41 0C B9 90 76 B5 34 8D 9D 65 D2 5B 1D 2D
##$RELAX= 
##$RELAX= 
##$RELAX= 
##$RELAX= 
##$RELAX= 
##$RELAX= 
##$RELAX= 
$$ Bruker specific parameters
$$ --------------------------
##$DU= <C:\u>
##$EXPNO= 1280
##$NAME= <ADRS>
##$PROCNO= 1
##$TYPE= <nmr>
##$USER= <dgb>
##$AMP= (0..31)
100 100 100 100 100 100 100 100 100 100 100 100 100 100 100 100 100 100 
100 100 100 100 100 100 100 100 100 100 100 100 100 100 
##$AQSEQ= 0
##$AQ_mod= 3
##$AUNM= <au_zg>
##$AUTOPOS= <25 >
##$BF1= 250.13
##$BF2= 250.13
##$BF3= 250.13
##$BF4= 250.13
##$BF5= 500.13
##$BF6= 500.13
##$BF7= 500.13
##$BF8= 500.13
##$BYTORDA= 1
##$CFDGTYP= 0
##$CFRGTYP= 5
##$CHEMSTR= <none>
##$CNST= (0..31)
1 1 145 1 1 1 1 1 1 1 1 1 1 1 1 1 1 1 1 1 1 1 1 1 1 1 1 1 1 1 1 1 
##$CPDPRG= <>
##$CPDPRG1= <>
##$CPDPRG2= <>
##$CPDPRG3= <>
##$CPDPRG4= <mlev>
##$CPDPRG5= <mlev>
##$CPDPRG6= <mlev>
##$CPDPRG7= <mlev>
##$CPDPRG8= <mlev>
##$CPDPRGB= <>
##$CPDPRGT= <>
##$D= (0..31)
0 1 0 0 0 0 0 0 0 0.06 0 0 0 0 0 0 0.0002 0 0 0 0 0 0 0 0 0 0 0 0 0 0 
0 
##$DATE= 1164711981
##$DBL= (0..7)
120 120 120 120 120 120 120 120 
##$DBP= (0..7)
150 150 150 150 150 150 150 150 
##$DBP07= 0
##$DBPNAM0= <>
##$DBPNAM1= <>
$$ [...]
##$SUBNAM7= <"">
##$SUBNAM8= <"">
##$SUBNAM9= <"">
##$SW= 20.6930455092707
##$SWIBOX= (0..15)
0 0 3 0 0 0 0 0 0 0 0 0 0 0 0 0 
##$SW_h= 5175.983436853
##$TD= 65536
##$TD0= 1
##$TE= 294.16
##$TE2= 300
##$TE3= 300
##$TEG= 300
##$TL= (0..7)
0 120 120 120 120 120 120 120 
##$TP= (0..7)
150 150 150 150 150 150 150 150 
##$TP07= 0
##$TPNAME0= <>
##$TPNAME1= <>
##$TPNAME2= <>
##$TPNAME3= <>
##$TPNAME4= <>
##$TPNAME5= <>
##$TPNAME6= <>
##$TPNAME7= <>
##$TPOAL= (0..7)
0.5 0.5 0.5 0.5 0.5 0.5 0.5 0.5 
##$TPOFFS= (0..7)
0 0 0 0 0 0 0 0 
##$TUNHIN= 0
##$TUNHOUT= 0
##$TUNXOUT= 0
##$USERA1= <user>
##$USERA2= <user>
##$USERA3= <user>
##$USERA4= <user>
##$USERA5= <user>
##$V9= 5
##$VALIST= <valist>
##$VCLIST= <CCCCCCCCCCCCCCC>
##$VD= 0
##$VDLIST= <DDDDDDDDDDDDDDD>
##$VPLIST= <PPPPPPPPPPPPPPP>
##$VTLIST= <TTTTTTTTTTTTTTT>
##$WBST= 1024
##$WBSW= 4
##$XGAIN= (0..3)
0 0 0 0 
##$XL= 0
##$YL= 0
##$YMAX_a= 264409
##$YMIN_a= -372467
##$ZGOPTNS= <>
##$ZL1= 120
##$ZL2= 120
##$ZL3= 120
##$ZL4= 120
##$ABSF1= 16.522
##$ABSF2= -4.171173
##$ABSG= 5
##$ABSL= 3
##$ALPHA= 0
##$AQORDER= 0
##$ASSFAC= 0
##$ASSFACI= 0
##$ASSFACX= 0
##$ASSWID= 0
##$AUNMP= <proc_1d>
##$AZFE= 0.1
##$AZFW= 0.1
##$BCFW= 0
##$BC_mod= 0
##$BYTORDP= 0
##$COROFFS= 0
##$CY= 12.5
##$DATMOD= 1
##$DC= 0
##$DFILT= <>
##$DTYPP= 0
##$F1P= 14.0000005364418
##$F2P= -0.99999901652339
##$FCOR= 0.5
##$FTSIZE= 32768
##$FT_mod= 6
##$GAMMA= 0
##$GB= 0
##$INTBC= 1
##$INTSCL= 1
##$ISEN= 128
##$LB= 0.3
##$LEV0= 0
##$LPBIN= 0
##$MAXI= 10000
##$MC2= 0
##$MEAN= 0
##$ME_mod= 0
##$MI= 0
##$NCOEF= 0
##$NC_proc= -5
##$NLEV= 6
##$NOISF1= 0
##$NOISF2= 0
##$NSP= 0
##$NTH_PI= 0
##$NZP= 0
##$OFFSET= 16.522
##$PC= 1
##$PHC0= 223.2716
##$PHC1= 4.48774
##$PH_mod= 1
##$PKNL= yes
##$PPARMOD= 0
##$PSCAL= 4
##$PSIGN= 0
##$REVERSE= no
##$SF= 250.13
##$SI= 32768
##$SIGF1= 0
##$SIGF2= 0
##$SINO= 400
##$SIOLD= 32768
##$SREGLST= <1H.CDCl3>
##$SSB= 0
##$STSI= 32768
##$STSR= 0
##$SW_p= 5175.98343685301
##$SYMM= 0
##$S_DEV= 0
##$TDeff= 65536
##$TDoff= 0
##$TI= <Analysis number 999999
Compound Code 99
Book Reference 9
Project Code 9>
##$TILT= no
##$TM1= 0
##$TM2= 0
##$TOPLEV= 0
##$USERP1= <user>
##$USERP2= <user>
##$USERP3= <user>
##$USERP4= <user>
##$USERP5= <user>
##$WDW= 1
##$XDIM= 32768
##$YMAX_p= 381865661
##$YMIN_p= -565357
$$ End of Bruker specific parameters
$$ ---------------------------------
##NTUPLES= NMR SPECTRUM
##VAR_NAME=  FREQUENCY,     SPECTRUM/REAL,   SPECTRUM/IMAG
##SYMBOL=    X,             R,               I
##VAR_TYPE=  INDEPENDENT,   DEPENDENT,       DEPENDENT
##VAR_FORM=  AFFN,          ASDF,            ASDF
##VAR_DIM=   32768,         32768,           32768
##UNITS=     HZ,            ARBITRARY UNITS, ARBITRARY UNITS
##FACTOR=    0.157963299565203, 1,           1
##FIRST=     4132.6476996994, 0,             0
##LAST=      -1043.33573715361, 0,           0
##MIN=       -1043.33573715361, -565357,     0
##MAX=       4132.6476996994, 381865661,     0
$$ Real data points
##PAGE= N=1
##DATA TABLE= (X++(R..R)), XYDATA
$$ [...]
28054a50236J29893k3631j5577n2601m8978J39219J36899N9356o4739L0806n8101
28043H2310l0742p8488j70358m9578K2678N2606K4466K7088Q756N1748O4264j5794
28031a1044L9436K7977q1521j51185L8644Q8188L7909p4405m0327O6179j2543
28020g2692j4912j21570o9231L6040J32350N8535m0983L4912L0925k5565R587
28009d2604P8200J16392P6772k19024k04919Q6617p1151J596J4139n2187Q9981
27998a26188N1690N1118r5811K73o5P1725J44159K9262p7019n9732J12041K4046
27986A25499N524l6646k8077l5755j06897o8217O9132J066l381J05695k0327J29765
27974A37381K7884n1711J27152j8288N505r0230r5588n0269R715J34765o7098
$$ y = [-150236, -20343, -43974, -59551, -112152, -161130, -21911, 114988, 174344, 109605, 140411, 82310, 51568, -26920, -197278, -246856, -224178, -171572, -147106, -120018, -111262, -59514, 4750, -11044, 28392, 56369, -25152, -176337, -137693, -49505, -11596, -86001, -126328, -60149, -72692, -87604, -209174, -278405, -242365, -110015, -51480, -92463, -57551, -26626, -52191, -42604, 35596, 151988, 228760, 9736, -195183, -108566, -179717, -178121, -163982, -216169, -126188, -74498, -23380, -119191, -118918, -118983, -47258, 96901, 126163, 49144, -10588, 101453, 125499, 131023, 94377, 66300, 30545, -76352, -144569, -75437, -74371, -77752, 27943, 7616, 137381, 165265, 113554, 240706, 222418, 227923, 137693, 42105, -8164, 1551, 136316, 69218]
27963F9218J334j1820J0758n4099Q011K3154q6727m4959M087J59419n056P4435
27951A47755J32796j17600n1615J19341l5659K0492j99958k7856P1947J10744
27941A70387J8400l2001Q5169j84238j26337J22363J46519j62434j32180O1014
27931c3338J6034j0840j17344J1169Q7932n132l5304j2266P4429n6944q7739R1863
27919g7480J27747q0071J714p2292m2691N1431J59732j7509r1146j23654r3124
27908b57343K7901K17323K6031m1322k2908R6673J11588P0146j88547k06892J30905
27897c6445J23030J31185O3514M0983j17301j51150L5797M3459k7016j10431k2371
27886b6746Q7890j22555J3606M6176K950j04383o8967m3182j6931P3616J60778
$$ y = [69218, 70552, 58732, 69490, 15391, 23402, 46556, -40171, -85130, -81043, 78376, 73320, 147755, 280551, 162951, 111336, 230677, 195018, 215510, 15552, -12304, 59643, 170387, 188787, 156786, 241955, 57717, -68620, 53743, 200262, 37828, -94352, -33338, -17304, -28144, -145488, -134319, -46387, -51519, -86823, -99089, -24660, -81604, -169343, -77480, 50267, -29804, -28090, -100382, -143073, -91642, 68090, 50581, -40565, -164219, -257343, -229442, -12119, 13912, -27410, -50318, 46355, 157943, 228089, 39542, -167350, -36445, 86585, 217770, 281284, 322267, 204966, 53816, 89613, 133072, 106056, -4375, -26746, 61144, -61411, -47805, -1629, 1321, -103062, -172029, -215211, -232142, -158526, 2252]
27875B252J1646n4063k0601K439J25064P5989k0627K4881o9959L2193q9589k5380
27863e755R6244j678j75885J057N2075J03060J03048o5980r4859J02743n6804
27852E7266n9862k1855l4171O8226J8854m3145q6806k1949O1962P1272J30139
27841A39931K9759k77932p4724O8435N0190N8921J53009J2402j15452j95339j65088
27830c15888l3144J03098K30893J17144Q7603q1600j22388j09791K5227J3191
27820h5655J5010R1644J0694o9710j4024J53718P2445M264J0104j9588J18505
27809B87407j20543m8929J0700j11521L4223l0022K5410L9411o6887j1897p1040
27798f3688j21024o9302J86168J56512N8322j1355j6170m2616j12502l7934k2946
$$ y = [2252, 13898, -40165, -60766, -58327, 66737, 142726, 122099, 146980, 77021, 109214, 19625, -5755, 90489, 88811, -87074, -86017, -33942, 69118, 172166, 106186, 11327, 114070, 57266, -2596, -24451, -58622, 9604, 28458, -14687, -101493, -123442, -61480, 9792, 139931, 169690, -108242, -182966, -114531, -64341, -5420, 147589, 159991, 44539, -150800, -315888, -349032, -245934, -15041, 102103, 189706, 108106, -14282, -124073, -98846, -85655, -70645, 20999, 31693, -38017, -52041, 101677, 174122, 178386, 188490, 168902, 287407, 166864, 117935, 128635, 17114, 51337, 21315, 46725, 86136, 19249, 7352, -63688, -184712, -254014, -67846, 88666, 146988, 135633, 119463, 76847, -35655, -73589, -96535]
27787i6535O7837j2110M584l0045n3645J65721l864j5343j25346j56740K0615
27776b34871J66330j3658o4930J03152J04906j0876O2250N7746k6170o8361q9674
27765a4156k1668J7239Q2983q6590k8947J22789J34995k4694j64574r2226l011
27754g7860Q6664k9665n1317k2154n7618J2434K00503l6934r6162j07657n7714
27743b37480J85579J42093q1140N6738l6759j85390k358P4420N7928L4746p2679
27732f4302o9215M8067N2403R7936J5613n2772M5754l1045q3337q1993P2272J26747
27720G6128J08511j23949j38088J38121R4842n9367R452m8818K2080O0690Q360
27709A47962j54184P7743j74471m5555R3307J05403n8365M1133Q9833j17886o6485
$$ y = [-96535, -28698, -40808, -36224, -66269, -119914, 45807, 41943, 26600, -98746, -255486, -234871, -68541, -82199, -147129, -43977, 60929, 50053, 112303, 170049, 143879, 75518, -14156, -35824, -18585, 64398, -22192, -51139, 71650, 206645, 181951, 17377, -74849, -77860, 8804, -20861, -72178, -94332, -151950, -139516, 60987, 24053, -72109, -179766, -237480, -51901, 90192, 9052, 65790, 29031, -156359, -158717, -84297, -26369, 8377, -64302, -133517, -85450, -33047, 64889, 80502, 27730, 73484, 42439, -40898, -122891, -50619, 76128, 184639, 60690, -77398, 60723, 155565, 96198, 105650, 56832, 78912, 139602, 147962, -6222, 71521, -102950, -148505, -55198, 50205, -8160, 32973, 122806, 4920, -61565]
27698f1565k0002k6090K4534L0588m0064K1905J0327l1466J31716k1587j00315
27687h2019J03900k1300j1121O3753J56415j0973o9469k8303J6856J37328j53864
27676A01203j22337L3616N7042P0244P9920m9208j37389k044r9854o6195p087
27665a42089l6742Q7145K0122n6212J30427J42690R171k30055j13090J51567p4193
27654a11259l2427P045m0692O7536N5857N014m7862K00R5402r243n1387J61636
27642I9820J91744n3695l04487j03866K08915J63255q8694j5134l6962q2669N6976
27631C5203O4185K3396o5741p3846o5996l700J40580Q3583j04424l9976k4444
27620c1180j2078Q2984j04541p6592n5592J08010J17909J50979o184n8457K2272
$$ y = [-61565, -81567, -107657, -83123, -52535, -92599, -70694, -60367, -91833, 39883, 18296, -82019, 21881, 581, -10540, 53213, 209628, 198655, 129186, 100883, 117739, 255067, 101203, -21134, 12482, 69524, 139768, 219688, 170480, 33091, 31047, -68807, -135002, -142089, -178831, -91686, -71564, -127776, 2651, 145341, 154512, -75543, -188633, -37066, -111259, -143686, -136641, -177333, -109797, -53940, -48926, -96788, -96588, -1186, -10429, -61816, 99820, 291564, 237869, -66618, -170484, 38431, 201686, 112992, 97858, 60896, -21773, 35203, 99388, 122784, 57043, -16803, -82799, -86499, 54081, 137664, 33240, -6736, -31180, -43258, 39726, -64815, -141407, -196999, -88989, 28920, 179899, 173715, 115258, 137530]
27609A37530j5933j68907n4490J1489O7881n1368R7325n8998q8691N0166K9436
27598d4560m3074O2423j0188K5192r0870q8571L651o8130M8809K38314o5171j75064
27586b07239J6505J04226N7494l1332q6290O8652l8396j4838O8636J28428O0911
27575A26757j14215n3487p5705P1793R8471k3810J10495j154n8883K3626o5711
27564C8177K4541K9733j0143l9604M4098P171L9648k9103k8694o2195j09000J20004
27552B4633R9724Q7778q4084j77326R4382N0363q4539o1202k2821L0502L9200
27541c390R4887j91675j18317j1647l424J21780M459O5527L9290j91111Q1315
27530a12306L368j5924J27463N8323J8802J36168j09506l05214r784Q8605N2909
$$ y = [137530, 121597, -47310, -101800, -90311, -22430, -73798, 23527, -35471, -124162, -73996, -44560, -87634, -25211, -35399, -10207, -101077, -189648, -185997, -254127, -205318, 32996, -32175, -207239, -190734, -86508, -29014, -60346, -146636, -77984, -116380, -131218, -62582, 65846, 126757, 12542, -40945, -116650, -44857, 53614, 29804, 140299, 139145, 80262, 103888, 38177, 62718, 92451, 82308, 42704, 86802, 93973, 133621, 104518, 75824, 13629, -95371, 24633, 124357, 212135, 128051, -49275, 45107, 95470, 10931, -50271, -73092, -42590, -3390, 91497, -100178, -218495, -230142, -233566, -111786, -107327, -41800, -2510, -193621, -112306, -108938, -124862, 2601, 60924, 79726, 215894, 106388, -198826, -208610, -120005, -67096]
27519f7096Q1198k351j10953j14688m9733Q0524m8177O8089J2627L26J06901M2691
27507f42m7194n9074L8421q8207j1543J21705N706j55143K4683Q8498K4104J20470
27495F1784R35p1547P6286P5961n8930l1346k3897l9122o9853l5644K7477O9449
27483a8447J00907j4973l6733j1268J10116O4095p1556k8943L3664L3187K4182
27472A84231p9660L5909k2953l3834j38482p2623P2647m3243j3005l3582R8132
27461d6463J33106r0459M8372O1486q9438r0686J02945n106K7470q103j6080j65192
27449a38148m0166J11957L3118N0710O6602l610o0928m4133L5517o2017J01575
27438E0477N2294M5764M4485o2677J8262O0644j7076r9894n8240J53898N9861
$$ y = [-67096, 14102, 11751, -99202, -213890, -263623, -183099, -231276, -163187, -150560, -150234, -43333, -642, -47836, -106910, -68489, -156696, -168239, -46534, -40828, -195971, -171288, -82790, -58686, 61784, 62719, -8828, 67458, 143419, 84489, 53143, 29246, -9876, -79729, -115373, -87896, -18447, 82460, 67487, 30754, 19486, 129602, 193697, 122141, 93198, 126862, 160049, 184231, 104571, 140480, 117527, 83693, -54789, -127412, -54765, -98008, -111013, -144595, -46463, 86643, -3816, 44556, 106042, 16604, -74082, 28863, 23757, 51227, 43124, 27044, -138148, -178314, -66357, -33239, 17471, 84073, 80463, 19535, -24598, 10919, -51098, 50477, 102771, 148535, 193020, 130343, 148605, 209249, 192173, 92279, 34039, 187937, 247798]
27427B47798J10780n4531j51011p043j8551j3709k39573r3780J43833J09695K6953
27416F0861J5806l1544j1296p4349l4473P9031J54837J31722q8693j68609q837
27405B4456k803P3288K0264k7340l507r6912J9076q5350l3476Q0474m3812R7552
27393B1910L1651L210K3601K8740P2433p9150k2028n0321q5576j47090J27351
27382g5269J60536o0543k0521l442q2028J596O6707M7179Q1124o9446o2145j720
27370a7972p702N7199J2779K3254J44811k0561o9017j24298q4957q8973O4976
27359a10461N0099K5882K2925n0426j58263L9094O3141k7834J3497Q3499R7634
27348D8787K7682L1580l6438q9765o9193j82363j8032M9862Q8718M8906Q9915
$$ y = [247798, 358578, 304047, 153036, 145993, 127442, 113733, -125840, -219620, -75787, 33908, 60861, 76667, 45123, 33827, -40522, -74995, 4036, 158873, 290595, 201902, 33293, 24456, 21653, 94941, 115205, 87865, 84358, -12554, 6522, -78828, -112304, -31830, -75642, 21910, 53561, 56771, 80372, 109112, 181545, 102395, 80367, 30046, -55530, -202620, -75269, 85267, 24724, 4203, 761, -81267, -79671, -12964, 34215, 115339, 45893, -16252, -17972, -25674, 31525, 44304, 67558, 212369, 191808, 122791, -1507, -86464, -175437, -110461, -60362, -34480, -11555, -61981, -220244, -181150, -118009, -145843, -132346, -48847, 48787, 76469, 108049, 71611, -18154, -87347, -269710, -287742, -237880, -149162, -100256, -10341]
27337a0341K1751J6644j10202j34111M7764L5046J24529O516N4076N6351K4945
27326A32968q6429p0380L5924j28059j7486P0093Q5358M5636l9249J5943j8358
27315B5961K8271p425o1437J19103L6376j84310l5650m4998L9203P1066Q2511
27304F8671N6656k576J3371O3778r2800L0801J54718o8388k01735r1808p2258
27293a41570R5838R6272r4052q2175Q0814N7832K3679p3349J00312J175l4642
27282C0134J35117q5489Q1548n7061j06729k0835N8391P8660L1576j77529j03664
27271a35881j1239J07474M0302o7168M766L5586K7373O7594O3231j0247R0029
27260B11820o1151o9555j07629r4717p6157P8434Q595J22413R6375N5012N286
$$ y = [-10341, 11410, 28054, -82148, -216259, -168495, -133449, -8920, -2404, 51672, 108023, 132968, 46539, -23841, 12083, -115976, -133462, -63369, 21989, 67625, 28376, 44319, 25961, 54232, 46807, -14630, 104473, 140849, -43461, -79111, -124109, -84906, -13840, 68671, 125327, 122751, 136122, 199900, 107100, 137901, 292619, 224231, 22496, -69312, -141570, -45732, 50540, -43512, -125687, -44873, 12959, 36638, -36711, 63601, 64776, 30134, 165251, 79762, 161310, 104249, -2480, -23315, 35076, 113736, 145312, -32217, -135881, -147120, -39646, 656, -66512, -61746, -26160, 1213, 68807, 132038, 121791, 211820, 150669, 81114, -26515, -121232, -197389, -118955, -110360, 12053, 108428, 163440, 168726]
27249A68726k7068k7475L440o0665J62445J80190j41103j8451l0230k72837l6440
27238i9468K5437Q1823m084K7350N4207Q0541j32637p0244K61974L0351j22506
27227A32744j46350j21862J0635L2677J18583l9822q9525K5853N5538K4865J08398
27216A11734Q1459L9966r4417q658J01267r5111j45728q1097J61139L8287j03511
27205E330R8385L9899p7623p909n1297j05442J2111J611k8548n2594J59529P2970
27193F6422j4042Q0412M6393k7908q2281L2564j07553j11179M1707J47057l2888
27182C8704p4304M3272P8027R8965J35423l5144j50975k04818j96981J03852J40150
27171b3829j6023j838L8966J06503j04921m1221J330p495J51463K0995J23968
$$ y = [168726, 141658, 114183, 117623, 56958, 219403, 399593, 258490, 240039, 209809, -63028, -99468, -74031, 7792, 3708, 31058, 85265, 165806, 33169, -37075, 224899, 255250, 132744, -13606, -135468, -124833, -92156, 26427, -13395, -102920, -77067, -21529, 3336, 111734, 193193, 233159, 138742, 130084, 231351, 136240, -9488, -90585, 70554, 108841, 5330, 103715, 143614, 65991, 58082, 6785, -98657, -86546, -84935, -113483, -166077, -6548, 66422, 52380, 132792, 179185, 151277, 68996, 101560, -5993, -117172, -75465, 71592, 38704, -35600, 7672, 85699, 184664, 320087, 284943, 133968, -70850, -267831, -163979, -23829, -39852, -41690, -2724, 103779, -1142, -42363, -41033, -48528, 102935, 123930, 247898]
27160B47898M5085q1980k8742k7044q4000j04689j99231j19432p1253m756K03900
27149b24244J61240j81633K5004l2777Q2098K31148Q0934k25557k7899J2172k9932
27138a29446o5412L8134p0557r0221P3136R9684J19634L8485m2441L9976Q759
27127A9731q6594M8451l2812m2519j5698L3997K2166k0616K3015J5375r252R5806
27115E1050k085J4485L7541n360O0005O5842j1840J017q4121j44714p9136M2410
27103e4906N9298M8751K1199K2532L5819p1414j22588o2949j9423N7854N118m971
27091h5680J44059O309q2456n2686n1286j7269o4792K6180J79240J11786l4225
27080G9180J3796j09372j22104J733Q4502O6910r349J36221L8515r2696k47408
$$ y = [247898, 292983, 211003, 182261, 155217, 71217, -33472, -232703, -352135, -423388, -428144, -224244, -63004, -244637, -219633, -252410, -170312, 60836, 141770, -83787, -111686, -99514, -129446, -194858, -156724, -227281, -317502, -244366, -144682, -25048, 13437, -29004, 10972, 19731, -66863, -18412, -51224, -93743, -109441, -75444, -53278, -73894, -50879, -35504, -44756, 51050, 48965, 63450, 100991, 95631, 155636, 221478, 209638, 210655, 126534, -18180, -97316, -54906, 4392, 53143, 74342, 96874, 132693, 61279, -61309, -124258, -143681, -85827, -80709, -85680, 58379, 64688, -17768, -70454, -121740, -139009, -203801, -177621, 1619, 113405, 79180, 92976, -16396, -138500, -136767, -52265, 14645, 5296, 141517, 180032, 87336, -160072]
27069a60072j44781J66059J05698n4426p2932M0355J32874j3784o8986R0785M4963
27058F5753J26459L5039n8052m4072m4438q7474J4831L2778O8760n7263m0493
27047A1828j14153K5330Q0309j2915J9786q5295j05671N9287k8452Q8220N2830
27036h896k1911n2346L2963J59641N6666j22985r6704m0263l8168J70077R8733
27025A36807J1367j45190r769J14948m1096o5268k2421m1496N3074m3553n0545
27014a03142J6249R790L960k9219j8168Q9912j42961j51610R0552J47138P4349
27003a3150L4522l7496l6977L5374o6586N1867N5342J36694j56266k21741P2670
26992a45747J92884n0618r5984j20706O9791L9136J38409J05830k8398l7760Q177
$$ y = [-160072, -304853, -138794, -33096, -87522, -160454, -120099, 12775, -1009, -69995, 20790, 65753, 192212, 227251, 169199, 125127, 80689, -6785, 8046, 40824, 109584, 52321, 11828, -102325, -76995, 3314, -9601, 10185, -75110, -180781, -121494, -149946, -61726, -8896, -30807, -83153, -50190, 109451, 166117, 43132, -53572, -93835, -132003, 38074, 136807, 148174, 2984, -6785, 108163, 67067, 1799, -20622, -62118, -9044, -52597, -103142, -86893, -77103, -73143, -102362, -120530, -30618, -173579, -325189, -234637, -87499, -13150, 21372, -16124, -53101, -17727, -84313, -32446, 22896, 159590, 3324, -218417, -145747, 47137, -3481, -99465, -220171, -150380, -111244, 27165, 132995, 104597, 66837, 75014]
26981G5014p8272L5708m2482P9466K0952k7818K7970l7129n9848o8454N8418N7240
26969D0765m9721k6616P4327J54731l2034k21166j26642N2868J6535K8340K9902
26958e8711P1254L6925o3600r4525j3216P3934m2733n7724k6205J83982J59826
26947A69207n7009l5558L1944j28112j44496q3189Q9542J01159q206m9599K3677
26936i0640j10873k281R1740o859J5933l5469L8269Q6777J01941N8183r0772j65661
26924a09712Q2082P6349L3092p760j55868m6423K88n3271K1192N8902P2851q8941
26912a17219R5023k040l8253J305n4045j7525o35K11068P9635N2385o1162j47705
26900H32L1844p7196j77903k1984J05224O6526j09565J33602Q0585P2876l8619
$$ y = [75014, -3258, 32450, -10032, 69434, 90386, 62568, 90538, 53409, -6439, -74893, -16475, 40765, -8956, -35572, 38755, 193486, 161452, -59714, -186356, -133488, -116953, -88613, -58711, 12543, 49468, -14132, -108657, -121873, -47939, -90672, -148396, -174601, 9381, 169207, 112198, 76640, 108584, -19528, -164024, -247213, -157671, -56512, -64718, -114317, -90640, -201513, -203794, -112054, -118913, -102980, -138449, -100180, -13403, 88538, 146721, 55949, -109712, -27630, 48719, 81811, 74051, -81817, -128240, -127952, -181223, -160031, -101129, -28278, -117219, -22196, -24236, -62489, -61184, -115229, -132754, -133389, 77679, 157314, 209699, 148537, 832, 32676, -44520, -222423, -244407, -139183, -72657, -182222, -48620, 31965, 104841, 66222]
26889F6222p4816k7321L8567J8684j54694L5282Q5691N2931J18475o6715k54271
26878a61965M249J41938j9461J667P3415N6244Q5592o5451j09681j37799K8079
26867a03173K115m3817m4138K4946P5522J56722L0254j02662m2699P9913M3043
26856G6026r7030j68589P5284K6911j7782l1795M5319k2730N2498N425n8347R970
26844a04840l8481J17547P6991l965o5283L9396M0773L1284K2236k03404k8951
26833a16697J77695K19004Q1511j16039o8720q5993p4855j9312L1841j05794K0926
26822e6433l4574J3244L96L9904P1996n132j16490m740J46610R6218j8863k4414
26810A07722j2957j1565k2046M9163r6620m465l250m9747R076j28084j09764J00682
$$ y = [66222, -8594, -35915, 2652, 21336, -133358, -98076, -12385, 40546, 159021, 92306, -161965, -157716, -15778, -35239, -33572, 39843, 96087, 181679, 116228, 6547, -131252, -103173, -101058, -144875, -189013, -164067, -88545, 68177, 98431, -4231, -46930, 32983, 76026, -21004, -189593, -114309, -87398, -105180, -136975, -91656, -114386, -61888, -56463, -114810, -104840, -143321, -25774, 51217, 47252, -18031, 21365, 62138, 93422, 115658, -87746, -116697, 60998, 280002, 361513, 245474, 176754, 90761, 15906, -3406, 28435, -77359, -56433, -91007, -77763, -77367, -37463, 34533, 29401, -87089, -91829, 54781, 150999, 132136, 107722, 94765, 83200, 61154, 110317, 13697, 9232, 5982, -43765, -34689, -162773, -272537, -171855]
26798a71855Q6129M6756O6132j6449q3934l8065N8784M4035J8609j8776l930q3558
26786i6122j8231j5101R8339j01770p8817J49379j850O563l7533r1517p713L810
26774a90563N3511m5275k8511r6796o8950J13680J97061J62545P441k0276N9660
26763A43527o7228r8915M9461R6970m6160j9567L3313P083J2403l1160r3396m4332
26751e8001O3320J1186j12823N7317K4708K8474M0860n0650l9196J12901Q6248
26740A64344j08194r2545K1018p3974O8957J19152M851k42008L6832K41038J13977
26729B53448n5090P650o0049L8364O048Q0261j22528o5504r3830p4525K40213
26718A54458J63774j26827j02031O4041P459j19184o9843O734N0411Q8589n6293
$$ y = [-171855, -85726, -38970, 27162, 10713, -73221, -111286, -52502, -8467, 10142, -8634, -12564, -96122, -114353, -129454, -31115, -132885, -211702, -62323, -64173, -57610, -95143, -186660, -194373, -190563, -137052, -182327, -210838, -307634, -376584, -262904, -65843, 96702, 104143, 83867, 143527, 76299, -22616, 26845, 123815, 77655, 58088, 91401, 98484, 110887, 79727, -13669, -58001, 5319, 16505, -96318, -39001, -14293, 14181, 55041, 4391, -34805, 78096, 164344, 56150, -36395, -15377, -89351, -20394, 98758, 103609, -138399, -101567, 139471, 253448, 198358, 206008, 145959, 184323, 190371, 270632, 148104, 82600, -11230, -85755, 154458, 318232, 191405, 89374, 153415, 160874, 41690, -28153, -21419, 28992, 117581, 61288]
26707F1288j6932n5334R5581J18824n7132m1422N343j44150j83080K601J3134
26696b01279J2427K57578J16344k8263n0596J7777j4292O6181q886p4810p1832
26685B0349J08787R0700n6143l5237n7498m5823J2108J28901o3338r4691k5804
26674a7689M6193p7463L9231O5579J9660M4099j01536K9761l3122j9224l0977
26663c5488l6771O0293J01969Q9043l5358q2286O1749j28052j86510j13203K03770
26652a00844Q7063j5248L9482K6060j3344q7105p9898J58077Q3610m5358m2536
26641I959L1596l5408j5716J5323M1308O1867M2848O9155o646j03902n4526j00816
26629d4958j19962j0517L6785J07866O6394R8268l796j52634n6248j68214k065
$$ y = [61288, 44356, -10978, 84603, 203427, 146295, 104873, 110216, -33934, -217014, -214413, -201279, -188852, 68726, 185070, 156807, 106211, 123988, 109696, 175877, 166991, 92181, 20349, 129136, 219836, 163693, 128456, 70958, 25135, 37243, 166144, 102806, 8115, -17689, 28504, -48959, -9728, 55851, 75511, 119610, 18074, 47835, 14713, -4511, -35488, -72259, -11966, 90003, 179046, 143688, 61402, 123151, -4901, -191411, -304614, -100844, -13781, -29029, 10453, 36513, 23169, -63936, -143834, 14243, 97853, 52495, 9959, 41555, 6147, -9569, 5754, 47062, 108929, 151777, 220932, 214286, 110384, 55858, -44958, -164920, -175437, -138652, -30786, 35608, 133876, 130080, -22554, -78802, -247016, -249081]
26618b49081J0657n7607Q8328J36438L6319N6713q3584O6521n4867l8204P1854
26607a6513P8082J1293l4855N5172n480k6134m2747q5342M9277p076k7159j35118
26595a86600n8895O1873m9824j04363K1761Q0981O6689N8149k8761J57342R7327
26584A15679P30r8008l280J6285N7403k1741K5934o7850k701Q573l495M8655J14221
26571A90405j97885p4189p40j62188o4897R9522N0693R3005P5235Q1055K0135
26560A10151q5144R948l9256o8065J4622P6665O8475R3793N4709j13754r0559
26549C1585K6395O1045J14014j26701n1336j42j15001J32104J33871m6683k39615
26538h0464l3051m5904r2600J17972p384R2566J874j5789o5782q8067J624L5117
$$ y = [-249081, -238424, -296031, -207703, -71265, -34946, 21767, -61817, 4704, -50163, -88367, -16513, 61569, 72862, 38007, 93179, 87699, 61565, 18818, -66524, -17247, -24323, -51482, -186600, -245495, -183622, -233446, -337809, -316048, -235067, -168378, -110229, -138990, 18352, 115679, 116409, 18401, 15121, 31406, 88809, 67068, 93002, 25152, 22451, 31024, 27529, 76184, 190405, -7480, -81669, -82409, -244597, -309494, -209972, -159279, -66274, 8961, 90016, 110151, 25007, 34955, -4301, -72366, -57744, 18921, 87396, 181189, 235898, 122144, 31585, 57980, 119025, 233039, 106338, 55002, 54860, -60141, 71963, 205834, 159151, -80464, -113515, -159419, -252019, -134047, -141431, -48865, -46991, -62780, -128562, -216629, -215005, -179888]
26526a79888L2978Q2944j8772O3371J9557O0343J0296j9579P2249k2714m684k49
26514I5852L721q5206o925l3728q13k880q0961q8281m517J18517k8982k4603k9414
26501a68220J4091n0996n8738L2754j06341L9414K16974O4049N4778r433J20746
26490A49078J20574j21073j34241N392Q358K3752j2141n0141M4670R2075j5154
26479A11149j713j45130J4048J17050P6112p6470j27978p4409N6098Q1861R6001
26468A26619o0969j36333o5979J40324j8183k3657L5857K1031n222P0443n168
26457G8763k16871N944L5293o1951J02604l9255R4350p278m343k7045p412J8345
26445b8856k1276j42322J7981J84737J63244o1668j57625L7801M1222j10946j18334
$$ y = [-179888, -146910, -63966, -82738, -19367, 190, 60533, 70829, 51250, 123499, 100785, 96101, 95852, 99573, 14367, 7442, -26286, -27099, -29979, -110940, -199221, -203738, -85221, -114203, -138806, -168220, -154129, -205125, -263863, -231109, -337450, -298036, -81062, -17013, 37765, 28332, 149078, 269652, 148579, 14338, 19730, 28088, 51840, 39699, -10442, 34228, 126303, 111149, 109436, -35694, -21646, 95404, 171516, 95046, -32932, -107341, -51243, 30618, 126619, 65650, -70683, -136662, 3662, -14521, -38178, -2321, 18710, 13488, 83931, 78763, -138108, -132164, -96871, -158822, -56218, -95473, -1123, -8401, -12744, -39789, -47201, -28856, -50132, -192454, -174473, 10264, 173508, 111840, -45785, -7984, 33238, -77708, -196042]
26434a96042J3819J00497j7565O0324J2064J3393M3970L1545j11075r2439M0379
26423a01130n871O1786J1023P296j19596p1494n8762J45536K45799L2453o4347
26412H2693p8939J01356K5600n0918k1468J08782j39139o0275P2932J15937q0015
26401G6546p0715j3575O4280N9533O9748L8501p8517r7929r686j2918J5191J05389
26389A45848J02702j24253k32112n058J62642L7857j5951n3685j4846k8052j65619
26378a90527q9128J41466J82658K9452j24727O5382O6874r3017O5409o4894K1502
26367A0450L5504O226P378J0224L4864L8342M8270r3410j55954K1949N1187j4080
26355I50J24266O2843r1913j17227J69342Q3993o2467n3836j27534l9591l2359
$$ y = [-196042, -182223, -81726, -99291, -38967, -26903, -13510, 30460, 62005, -49070, -141509, -101130, -107001, -45215, -34192, -26896, -146492, -217986, -276748, -131212, 114587, 147040, 82693, 3754, 105110, 130710, 79792, 58324, 167106, 27967, -32308, 40624, 156561, 76546, 5831, -7744, 56536, 116069, 185817, 224318, 145801, 47872, 38186, 25268, 40459, 145848, 248550, 124297, -107815, -112873, 49769, 87626, 71675, 17990, 3144, -24908, -190527, -279655, -138189, 44469, 73921, -50806, 14576, 81450, -11567, 53842, -11052, 10450, 45954, 52180, 59558, 69782, 104646, 142988, 191258, 97848, -58106, -36157, 15030, 950, 125216, 188059, 96146, -21081, 148261, 232254, 169787, 115951, -11583, -51174, -83533]
26344h3533N7756o2014l509R8649P5014k0314j23172l345O071J43180L1387J2640
26332A28810o8961K5027M6937j44574j12691J44450O8748p8265m7982M7319j8861
26321a0043k2614M9542K89226P6700j90266j32809k3717P8120J32191o2886j86771
26310c327k848q213M3825K06575j20272j39277N5418j05105m6374L3677j32494
26299b18415j16033M8352Q4122J75858P5245N8366r5821L8426O8507j0037J04439
26288B13009j12483j8996Q5798n4332j6708K1083j00184p8702l4440N5841Q82
26277c9232K7653K6913O9064J04063K6771n3331r2995J29k5501k7475o2384L2301
26265a4024j41729J5642J25317l4459P4990J64284Q654m2481n2353p9632j03596
$$ y = [-83533, -25777, -87791, -91300, 7349, 82363, 62049, -61123, -64468, -58397, 84783, 116170, 128810, 59849, 84876, 131813, -12761, -125452, 18998, 87746, 9481, -38501, 8818, -10043, -32657, 16885, 306111, 382811, 192545, 59736, 36019, 114139, 246330, 183444, -3327, -6175, -14388, 29437, 236012, 115740, -23537, 31881, -73224, -119598, -85921, -218415, -334448, -286096, -201974, -26116, 49129, 107495, 11674, 50100, 118607, 108570, 213009, 100526, 81530, 167328, 112996, 96288, 117371, 17187, -61515, -95955, -40114, -39232, -11579, 15334, 84398, 188461, 215232, 161901, 68906, 69035, 43534, 16059, -46325, -14024, -155753, -140111, -14794, -49253, 25737, 190021, 198675, 156194, 103841, 24209, -79387]
26254g9387o3243J1882K2501o5498J346J28507Q2187l7377o7803m8028K7979L5535
26242e1399L3990r9812K2614j7080k8704J29137r893p5921k4492O251q3377J64619
26230c4067J5449K4098J61283J09584r6030k38459j41788m5848M7396P4671K4670
26219i9041P5163Q1192m4524M5376o1150n3807p184k7298q4892M5463R6573N4550
26207B0421M6779j9287p2415N7060q3767n5984K4208l0548k1842J07471J2344
26196a5560J15172J52419N2739j91394j47955N090J79444M2927M0377j06409j14276
26185A2574O9033m6033r9838m0108l7805J4913J00374k1733k6940n0933j866N4750
26173g3612J6730P5393l0926j13149p7151O2096l3053j36945P8660L0575n439
$$ y = [-79387, -142630, -130748, -108247, -173745, -172399, -43892, 38295, 918, -66885, -114913, -86934, -51399, -17409, -117221, -94607, -111687, -140391, -11254, -21147, -97068, -121560, -115309, -198686, -34067, -18618, 5480, 166763, 276347, 180317, -58142, -199930, -245778, -198382, -123711, -99041, -23878, 57314, 12790, 58166, -2984, -56791, -63975, -91273, -176165, -130702, -34129, 20421, 67200, 47913, -24502, 32558, -51209, -107193, -82985, -113533, -135375, -27904, -15560, 99612, 252031, 304770, 113376, -34579, -29489, 149955, 192882, 233259, 126850, 12574, 81607, 35574, -64264, -104372, -142177, -127264, -26890, -48623, -75563, -126496, -128362, -73612, -56882, 18511, -12415, -125564, -202715, -140619, -173672, -310617, -231957, -201382, -206821]
26162b06821N3334J33431R9031J9104K3633P9699j02538j22221j18111k2540L9355
26151a24644O1666M7627M177K1208k557k7223k2087J82869R7932l4654r9439j79569
26139g4694N2060k8933m8515Q7340P7074J75409M876j18921j60747j45623k28315
26128d08989N1747P8978N609Q4591L9980m8762R9004J0451j2800J24297P3804
26117I7910m078K5257o7607n7914N1684L723r811O7274J93919o6826n2745M4929
26105B25715j03700j22083j27154J7874K382N3674Q1758o9376n1920M3751L1138
26094a7941O2464J7092j43603M1076R8249N921J702l1755P1086m8209N0866r6336
26082A0612m3405o9052j5694Q8075o9673J1304J09571m2442J5004M8139n2972
$$ y = [-206821, -153487, -20056, 78975, 98079, 121712, 201411, 98873, -23348, -141459, -163999, -124644, -62978, -15351, -11174, 10034, 7477, -19746, -41833, 141036, 238968, 204314, 104875, -74694, -22634, -51567, -100082, -12742, 64332, 239741, 244617, 125696, -35051, -180674, -408989, -357242, -278264, -272655, -188064, -148084, -196846, -97842, -87391, -100191, 24106, 97910, 93832, 119089, 51482, -6432, 45252, 48975, 39164, 106438, 300357, 233531, 180786, 225715, 122015, -68, -127222, -109348, -106966, -53292, 28466, -40910, -92830, -49079, -17941, 44523, 61615, -81988, -40912, 57337, 63258, 64960, 33205, 104291, 56082, 106948, 10612, -32793, -101845, -117539, -29464, -99137, -87833, 21738, -20704, -5700, 42439, -10533]
26071a0533k156K9207O4122N7758J5198q7479J4983J17085k2965j41735l2395
26060A090J25015r1820p647P0582q439J02936n5675l2362p8202k07039J1954l6909
26048b06516J10131Q6727l4727r3724N3094J81627K15428j11675j55168j8191
26038B7006M0155j05021r9358L5102O8209K9977O0124K1986J9469m1014j899O3175
26026A17911Q193P0727P692j03249o0102l2018k1092L0216k3324J37180M3080
26015A75214k73680j04584J2325J50005R0921k8680L713n3668l759L4410N348
26004G565j06808m6075O2372N9326J15716N0876m5202m2972L1767j9208p4046
25993f689K3881j1279j13955J8184j916j2757L7269m5956J19499P8869K3864M6189
$$ y = [-10533, -12689, 16518, 80640, 138398, 153596, 66117, 81100, 198185, 175220, 33485, 1090, 126105, 34285, 26638, 97220, 88781, 191717, 136042, 103680, 25478, -181561, -169607, -206516, -96385, -9658, -44385, -138109, -85015, 96612, 312040, 200365, 45197, 27006, 67161, -37860, -137218, -102116, -33907, -3930, 56194, 78180, 97649, 56635, 54736, 117911, 126104, 196831, 204523, 101274, 41172, 9154, -11938, 18278, -5046, 132134, 175214, -98466, -203050, -190725, -40720, 50201, 21521, 25234, -28434, -32193, 2217, 7565, -99243, -145318, -82946, -23620, 92096, 142972, 97770, 54798, 86565, 67357, -6689, 17192, 5913, -108042, -89858, -91774, -104531, -67262, -113218, 6281, 85150, 109014, 155203]
25981A55203k8558q3099q6378q9537k3427L7700o9460M3879J24907O6931q98M9446
25969I6709m3867L4240n0235p9701R8520j07528j13285p0305R9932N5104k8769
25958a09185L7289O863J01125J44195m107r8757N2851r520q3932j15658J48283
25947F9447M8442k7806o2805n6984j7759K583L2535J02843J20194r1008k09167
25936h9485L1784Q5475M8222j12821j68548J05163N0012m1500r6180J04155J0893
25925g2830p5573l2612N3008J7022l4454J01800J7434Q8671m5583j07288j20661
25914b11066J45188J34293l9656j43796m3320J36472J1478O8785P3887n6568k8134
25903D7563P8960j764o2367o0520J8692M2077j0646j04521j30652J20193N8170
$$ y = [155203, 126645, 43546, -42832, -132369, -155796, -118096, -187556, -143677, -18770, 48161, 47263, 96709, 52842, 87082, 36847, -42854, 55666, -51862, -165147, -235452, -135520, -80416, -109185, -71896, -65033, 36092, 180287, 176180, 77423, 130274, 120754, 36822, -78836, 69447, 117889, 90083, 27278, -29706, -47465, -44882, -12347, 90496, 210690, 119682, -89485, -57701, 27774, 75996, -36825, -205373, -100210, -50198, -91698, -187878, -83723, -72830, -148403, -181015, -128007, -110985, -145439, -43639, -26205, 62466, 16883, -90405, -211066, -65878, 68415, 28759, -115037, -158357, -21885, -10407, 58378, 132265, 75697, 47563, 126523, 124759, 62392, 1872, 20564, 62641, 51995, -52526, -183178, -62985, -4815]
25892d815Q6813k0818j6448N9791j9937k0048M675k4130Q744O1406K4757J1565
25880A51555r1493j41638o8403K6863O4273L5921o0423j02162K785k4024J01962
25869a04784J2212l3064M0778j7506m0332k6382N8946K2194J45659N0006o0033
25858D7694m6889k4834k9711M378Q748m476m5521j04342J05490k6552L0977J8540
25846f6498K3737J4970M5006m7661l9094L296J12255J82993O2661K941j79228
25835A15378J503k8808P2600J9243m3408n4413j26674J754M3033l7469L3125J01233
25823I7097q8372k3437L0655j16033J8351J48921P073J18917j28798j65830k055
25812a03511O5496R4615r1975j20943k3033J62236N5524J19410j5164K7378L6439
$$ y = [-4815, 81998, 61180, 44732, 104523, 84586, 64538, 69213, 45083, 53827, 115233, 139990, 151555, 60062, -81576, -149979, -123116, -58843, -22922, -83345, -185507, -182722, -206746, -104784, -92572, -125636, -84858, -102364, -142696, -169078, -110132, -87938, 57721, 107727, 47694, 805, -24029, -53740, -49362, -40614, -45090, -90611, -194953, -89463, -116015, -85038, -66498, -42761, -27791, 17215, -30446, -69540, -66244, 46011, 229004, 291665, 294606, 115378, 116881, 88073, 160673, 179916, 136508, 82095, -44579, -42825, 208, -37261, -4136, 97097, 8725, -14712, 15943, -100090, -81739, 67182, 74255, 193172, 64374, -101456, -103511, -38015, 56600, -35375, -156318, -179351, -17115, 38409, 157819, 142655, 170033, 206472]
25801B06472J4892q4068k09153j12225O2223m7862J56668M5361j00998k7250l3683
25790a29623L5760J51568m4453J353j03543l3489N2370J59999Q4185j5725j16337
25779D2065l246O0163L754r509M3736j77171j06757J0204k2935P2559P1410K6889
25767A1162N3199n3054Q5695l3175k8765Q2768J1634l1818N6710l3969p7483k7975
25755A4929L6232R9193l6139N4200j11338L6058K27929l0914j52652O149k4365
25744A19282j03154M772l540J02517J18095k500o2879J0287j63746N4994P8761
25733A52889o3770K9309n0795j5155p1270j40872N0945J98916J47920K3688j67628
25722I4177j69512j00107M7029J90144K22388J06829p8443j29918R9889k4743
$$ y = [206472, 221364, 137296, -71857, -184082, -121859, -169721, -13053, 32308, -68690, -95940, -129623, -93863, 57705, 13252, 14605, -88938, -122427, -70057, 89942, 174127, 158402, 42065, 38819, 98982, 102736, 93227, 136963, -40208, -146965, -136761, -159696, -87137, -15727, 11162, 64361, 11307, 97002, 63827, 35062, 117830, 129464, 97646, 154356, 120387, 42904, 14929, 51161, 150354, 114215, 168415, 57077, 93135, 321064, 290150, 137498, 143647, 119282, 16128, 20900, 17360, 119877, 237972, 235472, 172593, 182880, 19134, 74128, 152889, 89119, 118428, 67633, 52478, -18792, -159664, -108719, 90197, 238117, 261805, 94177, -75335, -175442, -128413, 61731, 284119, 390948, 312505, 182587, 282476, 257733]
25712B57733o0697k5679r29j27766o7674o0631P5983N8662n2274j03851Q2947
25701b4176J37909P2766L9984j7960o9995M2635n0452k3443o7945k2267J25752
25690A42808J21148N7707r1415m8006j24227j15105J89345N3958j227l6927j2036
25679A36023o6800q0691J47620m4061j25218l140J0920J4514J38125o8997j31819
25668g3524J02811j54419q3821K20230J22756o5988l7903k4310k3938P8911J80853
25657B41658l1449r59J01529p500k28454j59908l1821N9596q4414R9735M2309
25646C22m6127L0402k8239j1429O2671l1705j3529j9440p3385j4637j48770j15434
25634d09300N7421K10969Q1061J8405L8080J16934R1975L3685K0097j33644j03328
$$ y = [257733, 197036, 171357, 170428, 42662, -25012, -85643, -9660, 49002, -3272, -107123, -24176, 113733, 186499, 226483, 208523, 138528, 181163, 130711, 107268, 39323, 17056, 142808, 263956, 321663, 230248, 182242, 58015, -57090, 132255, 186213, 184986, 148059, 136023, 69223, -11468, 136152, 92091, -33127, -36267, -25347, -10833, 127292, 58295, -73524, 29287, -125132, -208953, 11277, 134033, 68045, 30142, 5832, -18106, 60805, 241658, 210209, 209250, 310779, 303279, 74825, -85083, -116904, -57308, -141722, -41987, 322, -45805, -15403, -43642, -55071, 7600, -24105, -37634, -57074, -130459, -145096, -293866, -409300, -351879, -140910, -59849, -41444, -3364, 113570, 205545, 239230, 259327, 125683, 22355]
25623B2355p4849J55017l3083r8625l8259N5333N971m3073n5014J5058J02329
25612A3160J50960l5182q4008L6048r6169J291r2509n0197L8246O9915p3727K130
25600a20042L7017N0091r8034r1150J07857J86423M9548j52690r8726Q0627Q2789
25589C3710M7765O051o3499j45018q5753J00793O4288K1287R4787O4218L02j0776
25577A28155j13037j9263J5543Q9014j7970p7294m060J12205k5761j09470j13611
25566a35549O1934J29144L122m8683k5953K3508j10617k25958K7655J55699O7580
25555g8118k2924k8345O0628o743j7022M7408M5675J03173P9858P5030R107j19222
25543A48505j19225J27504J1792j82532j78209L5402J6837m0832m1370K09574
$$ y = [22355, -52494, 102523, 69440, -29185, -67444, -12111, -6140, -49213, -104227, -89169, 13160, 164120, 128938, 44930, 80978, -15191, -13900, -106409, -156606, -118360, -48445, -122172, -120042, -83025, -32934, -130968, -222118, -114261, 72162, 121710, -30980, -129706, -49079, 33710, 81475, 87526, 24027, -120991, -206744, -105951, -41663, -20376, 74411, 138629, 138931, 128155, 15118, -4145, 11398, 100412, 82442, 5148, 1088, 113293, 87532, -21938, -135549, -73615, 55529, 58651, 9968, -15985, 7523, -103094, -329052, -301397, -145698, -78118, -101042, -129387, -68759, -75502, -92524, -45116, 559, 103732, 183590, 258620, 267727, 148505, 29280, 156784, 168576, -13956, -192165, -156763, -139926, -180758, -222128, -12554]
25533a2554J411j1430J40945M5604N0862n1721j70546j20745j46817K9218O4435
25522a81338n0735J21176K4169j8066Q2307R1022r0363m7709k0094k58J88039
25511I8150j8948k4031m6684n1651P0635n224k2247o1591k1144n9458O2631J11051
25499C1489j2745n0636L5494q7772j6038P0459n5514o1093M5990r1179k0751O9529
25487a42767N1147L641Q5054r2241j56852R2360J70980n3818m9076N1982O231
25476c3359J01532J60103o4777m0887k02507j51048J7575R341n8638m0538R7300
25465b05903J29137J41348j6076k35845j19220J51832J53762r0968K7983M9516
25455a4434L944k1670n4107N6836L254p2985j0266r9395L7399J90216K5234n2861
$$ y = [-12554, -11143, -22573, 118372, 163976, 214838, 163117, -7429, -128174, -274991, -245773, -181338, -232073, -110897, -86728, -104794, -22487, 68535, -21828, -69537, -89631, -89889, 98150, 79202, 55171, 8487, -43164, 27471, 22247, 0, -61591, -82735, -142193, -79562, 31489, 18744, -31892, 3602, -84170, -100208, -29749, -85263, -146356, -100366, -191545, -212296, -142767, -91620, -87979, -2925, -95166, -252018, -159658, 11322, -42496, -91572, -39590, -33359, 68173, 228276, 163499, 122612, -79895, -230943, -213368, -204027, -262665, -303203, -205903, -76766, 64582, 48506, -187339, -306559, -154727, -965, -91933, -63950, -14434, -10490, -32160, -86267, -29431, -26177, -99162, -109428, -208823, -171424, 18792, 44026, -8835]
25443h835J20278P3025j48874j08221N0866l1200l6075p2058P4666J87366J11697
25432B12635Q426o0808j52832j2602N7544j6868r7910j18837o7582P0099p4534
25421b53269J0109J74381L7814k6117r00m3706k2824J14920l3857L9254N8602
25410E4407m248L7981K2926j30372K9916J14050Q3782N1158j39497l5081R0270
25399A75292p1273j19082j46190J07117R7420K9069j78239K9345O8771q913O0986
25388D4303o3815J319P4185n2232N9560o8207j63832j14235J22973J86536k235
25377B4320O4265o8001p1614l4194O0857J15019P5289n2564o8150N272k0975M9324
25365G8848j03291p1841J15003j4345j0604O0782J05727q9224l6612J00470k1314
$$ y = [-8835, 111443, 184468, 35594, -72627, -21761, -52961, -89036, -161094, -86428, 100938, 212635, 221061, 160253, 7421, -5181, 52363, 35495, -62415, -181252, -248834, -178735, -253269, -243160, -68779, -30965, -57082, -57982, -101688, -124512, -9592, -43449, -4195, 54407, 50159, 88140, 111066, -19306, 10610, 124660, 208442, 259600, 120103, 85022, 175292, 104019, -15063, -161253, -54136, 43284, 72353, -105886, -76541, -7770, -16683, 44303, -19512, -18193, 55992, 3760, 63320, -4887, -168719, -282954, -159981, 26555, 24320, 88585, 20584, -51030, -85224, -24367, 90652, 165941, 113377, 45227, 50499, 29524, 78848, -24443, -96284, 18719, 4374, -6230, 54552, 160279, 71055, 34443, 134913, 113599]
25354A13599j31208N60J38417j2251n2910l6578n9077O9833O5949j7382K1724
25343A00676j38651j44154J9247J24230P6174N3482N7878M8391J3245O0697l4539
25332B36676P223l8942q4817q7952k3358j10919r7068J6266J85753m080r1021
25321i2239k1830L2283K6182N02k5283n0017m1077K9709J78448k201r5846J01732
25309D0363j325m5917j60906q8267J0106J07788R5488O926N0004L1280J47318
25298A92858j0006j74270q7198Q6589k0331j36815m1236O0641N5260r9356n6515
25287b30379K1780J00881n2448j39591K7193J56061J06332l879q5571j2418Q0804
25276c1235L2793J0882l1527k6361q9922j20856N5383R1206J45060O9387r7067
$$ y = [113599, -17609, -17049, 121368, 109117, 56207, 19629, -39448, 30385, 96334, 78952, 100676, -37975, -182129, -162882, -38652, 37522, 91004, 148882, 197273, 210518, 271215, 236676, 243899, 204957, 120140, 32188, 8830, -102089, -199157, -182891, 2862, -1218, -92239, -114069, -81786, -55604, -55102, -80385, -130402, -171479, -141770, 36678, 34477, -61369, 40363, 39038, -6879, -167785, -256052, -245946, -138158, -42670, -35744, 14260, 45540, 192858, 182852, 8582, -78616, 7973, -12358, -149173, -190409, -129768, -74508, -173864, -230379, -208599, -107718, -160166, -299757, -272564, -116503, -10171, -14050, -99621, -112039, -31235, 1558, 12440, -19087, -45448, -135370, -256226, -200843, -109637, 35423, 104810, 7743]
25265G743P5913K2750p6016L4115l358k1373J59611K4363M4166k3966k9698K469
25253B16719j3850p7558J8037r413n9194j06584M0456r1282j18743P8445R6115
25242b6852J28894J7172m4339j91067r3910k3459J06709J24015Q5808M9042j0780
25231A21233q9234l3883j0315N544j1031L404M3718j0406j35964L1669P8782j9100
25219b5583p4775O1604O5031q8883j12580K7575j9290q1928O0211P5946J38770
25208B6098K973j259N66j8189j1137q7636j0247q1739O7086J74809j37437q3464
25196a59576j5789l2278K22463L0056j72100j17635J20614J08719p7851m261j9053
25185a16691j51284J1036J10542l2176L1203J40053Q7184j0352q5150J8853J80950
$$ y = [7743, 83656, 106406, 30390, 64505, 61147, 39774, 199385, 223748, 267914, 243948, 214250, 216719, 202869, 125311, 143348, 133935, 74741, -31843, 8613, -82669, -201412, -122967, -26852, 102042, 119214, 74875, -116192, -210102, -233561, -126852, -2837, 82971, 132013, 121233, 31999, -1884, -12199, -6655, -17686, -14282, 29436, 19030, -116934, -85265, -6483, -25583, -100358, -38754, 26277, -62606, -175186, -147611, -166901, -248829, -188618, -112672, 26098, 29071, 27812, 28378, 10189, -948, -88584, -98831, -180570, -113484, 61325, -76112, -159576, -175365, -207643, 14820, 44876, -127224, -244859, -124245, -15526, -93377, -97638, -116691, -267975, -256939, -146397, -178573, -147370, -7317, 79867, 69515, -15635, 3218, 184168]
25174A84168j0983K4449j04612j88809p6105K8468r1470M3752P9993K43860q658
25163A24053o7989O34o5644M3492J47257o1088l7398R9137q1395J3147p8441o8301
25151c2536k9012L8920j33399K629R4882P7105Q5688N9955J8190r2727j5938j40608
25139f6851j09716m770N5764M4191j17308O2105L0065k0587L236j56946k5408
25128c06225j2543J01351L983M6649J27841q320M7959O9467R3733l8610j94929
25117f9644j11563q4278J00252K4827J37393J33547J28148j25065j74785j05872
25107a47040j3127J22606J16194L3601m4678P2124K3014k7503p1676j43709j10779
25096a90973J24888R6532j4313N5082l2194l9399P5766J04054j27508j25366N9338
$$ y = [184168, 173185, 197634, 93022, -95787, -171892, -143424, -234894, -191142, -111149, 132711, 124053, 56064, 56698, -8946, 34546, 181803, 120715, 83317, 182454, 101059, 114206, 35765, -32536, -61548, -22628, -156027, -153398, -58516, 18589, 104277, 164232, 182422, 89695, 73757, -66851, -176567, -181337, -125573, -81382, -198690, -136585, -106520, -127107, -123871, -280817, -306225, -318768, -217417, -213434, -166785, -38944, -47264, 695, 70162, 163895, 125285, -69644, -181207, -265485, -165233, -140406, -3013, 130534, 258682, 133617, -41168, -147040, -160167, -37561, 78633, 112234, 67556, 139680, 162694, 135191, 63515, -80194, -190973, -66085, 30447, 16134, 71216, 39022, -377, 75389, 179443, 51935, -73431, -14093]
25085a4093J9651K294j8782r6044J7802R5925J03718j2483n5934j9327J28Q5641
25073A08496j01096p5297J34800l849J00983j6571o2738j07926k3522Q7393P9696
25062A20369l2381k7546o5988P1261Q2402l1322n7802r3128j85237j21090J41317
25051a99145J57779j15705R4162J7325r3864P1858P4118q082l4840m7862J6985
25040f7271J9077k8080P1331J49828j4579p4170q5933j05953r2812N2185R8180
25029g8197p4900j13211L0211J69592K20797N6978j63204r415j05245q2759p9724
25018b29077l0110J26213O6758N5515P3876j3989k81064n8863J80059R5595P8398
25007F3311P6380M0677k319o1857p0457L4482m8648J004q712j8083o1320j3539
$$ y = [-14093, 5558, 7852, -10930, -106974, -89172, 6753, 110471, 97988, 42054, 22727, 22855, 108496, 7400, -67897, 66903, 63054, 164037, 147466, 84728, -23198, -46720, 40673, 120369, 87988, 60442, -5546, 65715, 148117, 116795, 58993, -34135, -219372, -340462, -199145, -41366, -157071, -62909, -45584, -139448, -67590, 6528, -1554, -36394, -84256, -67271, -48194, -76274, -4943, 144885, 130306, 56136, -29797, -135750, -228562, -176377, -78197, -153097, -266308, -236097, -66505, 154292, 211270, 48066, 38651, -66594, -149353, -229077, -259187, -132974, -66216, -10701, 63175, 49186, -231878, -290741, -110682, -15087, 63311, 139691, 180368, 178049, 116192, 45735, 80217, 31569, 32573, 23861, 5778, -55542, -69081]
24995f9081j297n3164J73942m7976q9231m13j9961N2184Q0703o9665j08434j6654
24983a69047o7595r3887J11196O9648L6738J99786K8184j57948j50855L2592K25935
24972F4747Q6274L4445J274r8368P4869j5969o120L4365M2839l6056M2507m2875
24960A81932p9206j70875j57097K438P1286k696Q2832n5965K9804p62r2148R0472
24948i9985J70975M2837k47905r9877M6207j9269K08071J02625q3426N0292J45494
24937B16039k5466o2402L754j83095j92936J13711O3959k3796j26273o8537O9329
24926b15713j7971k4704K2943M6256J82888O2998J23959o9483J7040m4652m9560
24915C4001M696n0667p4230J9948L6279l4690M5033L1610J62804J4290p4017l4861
$$ y = [-69081, -70378, -123542, 50400, 2424, -86807, -87220, -107181, -54997, 25706, -43959, -152393, -169047, -236642, -330529, -219333, -149685, -112947, 86839, 115023, -42925, -193780, -161188, 64747, 151021, 185466, 186740, 88372, 163241, 147272, 141152, 175517, 218356, 182300, 224807, 181932, 102726, -68149, -225246, -222808, -151522, -154218, -71386, -127351, -97547, -98309, -190457, -99985, 70990, 113827, -134078, -233955, -187748, -207017, 1054, 103679, 20253, 70545, 216039, 190573, 128171, 131925, -51170, -244106, -130395, -66436, -90232, -216505, -285042, -215713, -233684, -258388, -235445, -189189, -6301, 56697, 180656, 111173, 128213, 83561, 34001, 38697, -11970, -86200, -66252, -29973, -64663, -19630, 11980, 174784, 189074, 115057, 80196]
24903H0196j39839r2038M3349m8093J49774J2655m1930r6649P1223J22048j05803
24892d5107m1741n2441R3055J83033k2868m769k6374M124M161R5319K433q2704
24880A06121j0051J8131j29118J07810R3750q9222j09910n6437m7497q7685p3254
24869b77362k5980M7405J66537J77434r6568j17396M2576J15163P8265j48632
24859c8558j41444O5860Q1415l4572k1208J55974j0744Q58J08795L8678k1880
24848A83174R7121n3295j80173m5618Q519k3232m1399J16766k9099p0421K9728
24837g929l9669j14058J00917O9766k4901j44061J3132J12247P2631M1914M1726
24826A21715r1407O0768K747M2206l7615Q870K4318o4558l3787o768l3923m3636
$$ y = [80196, -59643, -151681, -108332, -156425, -6651, 6004, -35926, -132575, -61352, 60696, -45107, -86848, -139289, -46234, 136799, 113931, 109162, 82788, 86912, 91073, 186392, 188825, 106121, 96070, 114201, -14917, 92893, 186643, 97421, -12489, -68926, -116423, -204108, -277362, -303342, -255937, -89400, 88034, -8534, -125930, -83354, 31809, 110074, -38558, -180002, -114142, -32727, -67299, -88507, 67467, 56723, 57581, 166376, 205054, 183174, 280295, 227000, 46827, 1209, 9728, -13504, -54903, 61863, 32764, -37657, -7929, -47598, -161656, -60739, 9027, -15874, -159935, -146803, -34556, 38075, 79989, 121715, 30308, 91076, 93823, 136029, 98414, 107284, 131602, 67044, 33257, 26489, -7434, -51070]
24814e1070j1360o2779k3931J65853J05058n9977p4030r3315J5500O3769O4454
24803C8172j26430m5042P749J23453R8388m7725o8476p7283J33371k8584q711
24792a118O1036K113j39041P1373m4333j56697J84829J41080q9201K4278M5190
24781I9509M4464l2770p9960r3680P6399N1064p0839N5286j05131K9870P1553
24770D5765M9532j01205j32265l5756K3488n9937R8925J2236O1338L1720j3361
24759a9520N2747k2510N1403J87462j4690k31899r4437J27635P1025L2853j32694
24748G375P378R9073L7932j79857n5049J06215P4783n0928k2882j3257r6781l7175
24736a23173n2024q5946L0042J22662M2844n2823q6930K06289J08655J6290r684
$$ y = [-51070, -62430, -125209, -149140, 16713, 121771, 61794, -12236, -105551, -90051, -26282, 38172, -88258, -133300, -125551, -2098, 96290, 48565, -19911, -97194, 36177, 7593, -1118, 59918, 62031, -77010, -5637, -49970, -206667, -21838, 119242, 30041, 54319, 99509, 143973, 111203, 31243, -62437, 13962, 65026, -5813, 49473, -55658, -25788, 45765, 95297, -5908, -138173, -173929, -150441, -210378, -111453, -99217, -37879, -6159, -19520, 33227, 10717, 62120, 249582, 234892, 2993, -91444, 36191, 107216, 140069, 7375, 14753, 113826, 151758, -28099, -83148, 23067, 97850, 46922, 24040, 10783, -85998, -123173, -175197, -261143, -231101, -108439, -65595, -118418, -205348, 941, 109596, 125886, 116202]
24725A16202j75880l8029m2459K6830J9031r5822o7380l0354K3225J61679J17094
24714A4137k9714l2234m1864p6697k823J13302K5513j77523j6464o5560J74302
24703a15625O752p1305M4592m1550m8181M7408J66875R95p7196o0531l5085M4639
24691a38212J19844R6892o9787o8664O8959R7981j9467q3907L3460K0748L0334
24680H8181P0027l9747j04938q3391m9454J1529m3138K6281n2265n8319Q6175
24669a49059P1747N0805N1820m0486j77465L7317J17868N4615L3532J5408Q367
24658G4469k4324m3992q5939m166N2136P2649R167n5173N1829N9159l4548m5514
24646B5753o9921N8178M6205j53216j49425J28738J47195j15107L3631J06097
$$ y = [116202, -59678, -97707, -140166, -113336, -94305, -190127, -257507, -287861, -264636, -102957, 14137, -15577, -47811, -89675, -166372, -169195, -55893, -30380, -207903, -224367, -289927, -115625, -108873, -180178, -135586, -177136, -225317, -177909, -11034, -10039, -87235, -147766, -182851, -138212, -18368, 78524, 8737, -59927, 9032, 107013, 87546, 3639, 37099, 57847, 88181, 158208, 118461, 13523, -69868, -119322, -107793, -150931, -124650, -176915, -235234, -149059, -77312, -26507, 25313, -15173, -192638, -155321, -37453, 17162, 50694, 66102, 74469, 50145, 6153, -79786, -83952, -31816, 40833, 50000, -5173, 46656, 105815, 71267, 25753, -44168, 14010, 60215, -93001, -242426, -113688, 33507, -81600, -47969, 58128]
24636E8128j55226r1519J4303L0079l2830P954Q7129P0175r2399N1988J8159j49767
24624a83826j83483O0466P8232M7678J00356N8956j06252R005o772J35401Q7310
24613I7071Q860p9509j02428o4800j377o3357j4077J31028P0755k3704o1848M2509
24601f0877J87063n2648k08214j03824J50488Q5383m1603O1594Q7416q2736n2558
24590c0516R8464N4241j14291j04702N7549j42306q4916J03602O4702N1606R5184
24579D8617J7152N0514q3267J4952L4167r4445p7341j5483j00807J52559Q1434
24568B8052j68909m4770J533K1044J05295j886j07615n3046L0850j3641n2434
24557b55527J6394L0042L7892J46432J29484K3855j24963o3345N2677M4359j9124
$$ y = [58128, -97098, -188617, -174314, -144235, -177065, -169111, -81982, -11807, -104206, -52218, -34059, -183826, -367309, -306843, -228611, -180933, -80577, -21621, -127873, -118868, -125640, 9761, 97071, 105931, 26422, -76006, -140806, -142183, -205540, -219617, -88589, -17834, -41538, -103386, -60877, 126186, 73538, -134676, -238500, -88012, -2629, -44232, 17362, 104778, 22042, -30516, 67948, 122189, 7898, -96804, -39255, -181561, -266477, -162875, -98173, -46567, 48617, 65769, 116283, 33016, 47968, 82135, -12310, -89651, -105134, -205941, -53382, 28052, -140857, -185627, -184094, -163050, -57755, -59641, -167256, -220302, -189452, -203093, -255527, -239133, -209091, -171199, -24767, 104717, 128572, 3609, -59736, -7059, 37300, 18176]
24546A8176j06403M1414J05752R2121p9870M7267r3148r9916L9424N7163j6798
24535E182K1590L6034m7931P8799J08619l9679j40903j70635p213J80735J34963
24524A59561q717K0495j70504j01880p226R6576J11568J08785K6423Q0721r5616
24513B20186l62899o9513M2660J51159M4055P068n8153O5700O4896j17632o5560
24502g8033r2935j9613P5066N1085j04511j811n3720k7128j8665M4202K21855
24491d208p2697p1214J09794N1587l6240K1721q9708j3395M1417j5353o0716p4790
24479b13802N6959k0958M1764O7642k7965p6233q8646j5412K2196J27000R5868
24468c1587J19003J2474p0151k56204n8427Q2438J8722k0359O069p7717q7785
$$ y = [18176, -88227, -46813, 58939, 151060, 71190, 118457, 25309, -74607, -35183, 21980, 5182, 26772, 62806, 14875, 93674, 202293, 162614, 21711, -148924, -156137, 24598, 159561, 150844, 171339, 835, -101045, -108271, -11695, 99873, 208658, 235081, 315802, 220186, -142713, -212226, -169566, -18407, 25648, 32716, -25437, 40263, 105159, -12473, -78033, -170968, -190581, -115515, -64430, -168941, -170752, -224472, -251600, -270265, -226063, -4208, -76905, -148119, -38325, 13262, -22978, -1257, -90965, -104360, -62943, -78296, -139012, -213802, -156843, -177801, -136037, -68395, -96360, -172593, -261239, -276651, -254455, -127455, -31587, 87416, 99890, 29739, -226465, -284892, -202454, -183732, -204091, -198022, -275739, -363524]
24457c63524R3018J75843l001J300J57578K2109j6757m9498o7877l9222K8179
24446f1852J2338j4320m8234P4224N8880j8160R409r4865k9844R5507M8831J08170
24434A40084P6075j22896p5716r8658r8926K4135J7422J98889J00448L7590q3991
24423A14456j78294o5458R7676p8545O9713N3260N9393m4345K7728m7623p9169
24412g1208R782J742J208k3440p0230L5131J58261N1787l3462m1102J8849J25911
24400A63229n2177p6630N0067n8105q5706J5027O1384k4725m1718p4148K3322
24389a00180L9521M1867j2520o6937K4590O3194r1163k252M2930o43J2988l4360
24377h2965j06185K8300J78915J14553l8228l4430J36501l0780l3681L4038j87215
$$ y = [-363524, -270506, -94663, -97664, -96364, 61214, 83323, 66566, 17068, -50809, -90031, -61852, -49514, -63834, -112068, -37844, 21036, 2876, 12285, -82580, -112424, -16917, 31914, 140084, 216159, 93263, 17547, -81111, -180037, -155902, -138480, 60409, 160857, 198447, 114456, -63838, -129296, -31620, -110165, -40452, 12808, 72201, 27856, 55584, 7961, -71208, -61426, -59684, -58476, -81916, -152146, -117015, 41246, 93033, 59571, 18469, 37318, 163229, 111052, 34422, 84489, 26384, -59322, -44295, 17089, -7636, -49354, -123502, -100180, -60659, -18792, -31312, -98249, -73659, -10465, -101628, -103880, -60950, -61593, -48605, -82965, -189150, -160850, 18065, 132618, 94390, 59960, 196461, 165681, 132000, 166038, -21177]
24366b1177K3458l9052P0427J9356k2123j4018p3660q3075j2222J3751K3155O0843
24354e4337M7949J07758K9909L6950N3978n1904o3274q955Q9146o138N5123N1415
24342B87620j57646j18082l0820n1390q7688P63R5243j0025J7695J46438j19986
24331b7878q2053j9724P1569J02846M4105k6955m6976N4873j8783r5692r0397
24320a35065J21215J01719l091R1824N7205j45629p7667p9171N1969L2748n7113
24309d1056M81J0825J2185J1411l2683R0135K07885j00655k57057j66115Q963
24298b55681J05594M0834P5242j00710k8592J23213J04867j4158q305J20540n8419
24287A04425L782M2700q1941j18221J41664O6690K2563l8213J2730O5119j0925
$$ y = [-21177, 2281, -36771, 33656, 53012, 30889, 16871, -56789, -139864, -152086, -138335, -115180, -54337, -6388, 101370, 131279, 168229, 222207, 170303, 107029, 98074, 187220, 181082, 236205, 287620, 129974, 11892, -18928, -70318, -158006, -157243, -62000, -72025, -54330, 92108, -27878, -109931, -129655, -58086, 44760, 88865, 61910, 14934, 69807, 51024, -44668, -135065, -13850, 87869, 84778, 176602, 233807, 88178, 10511, -68660, -16691, 16057, -41056, -40575, -29750, -17565, -6154, -38837, 51298, 259183, 158528, -98529, -264644, -255681, -150087, -109253, -34011, -134721, -163313, -40100, 64767, 50609, 42304, 162844, 104425, 108207, 150907, 68966, -49255, 92409, 159099, 181662, 143449, 156179, 221298, 210373]
24276B10373l948M895j88049k50505m3228L7003J49094R9390J14665N8401K3824
24265B11915l4161J3544j75343q3888J33671L6605j60629k14239J36671O246n5139
24254a84747R5776k3147J42652N8408l7384q1468K9144j5603M0698q1721k2414
24243g9806M8878j06480J48957J58264J3392m460j21158j06345m6724r6660P8920
24232a13222N3107J7440p079k22861K7778N0157M2884q6951p8309J37023R5270
24221h4763Q7280j44446o1373P8299J28938P7412M1809m3375j7052J34601l9768
24210A57562j72230j10574J07448Q0127m5744M185j0486Q7955O6837j00801j26530
24199f2251o5888m9114J74005K5991k5217M1327N3592j6542K9368k6119j26488
$$ y = [210373, 206425, 211320, 23271, -227234, -270462, -233459, -84365, 15025, 129690, 188091, 211915, 177754, 191298, 15955, -67933, 65738, 102343, -58286, -272525, -135854, -129608, -184747, -88971, -112118, 30534, 88942, 51558, -29910, -766, -16369, 24329, -57392, -79806, -30928, -137408, 11549, 169813, 183205, 178745, 57587, -48758, -95482, -192142, -113222, -60115, -42675, -49754, -272615, -244837, -194680, -151796, -238747, -317056, -180033, -84763, 2517, -141929, -203302, -125003, 3935, 81347, 123156, 79781, 62729, 197330, 157562, -14668, -125242, -17794, 62333, 16589, 20774, 10288, 98243, 165080, 64279, -62251, -128139, -177253, -3248, 22743, -2474, 38853, 92445, 75903, 105271, 79152, -47336]
24188d7336l5622j31909O2035J65577N0184p781n2639p5589M6691K9667n0436
24177d7158j51842K5954J50224j7784L9648K3474o1107j22986l19j06658J13077
24166a55477N893j01460n2826o9439J28953j9012R8919J77518o2866j6649m8265
24155a14711q0639K6736J23581O8692O8217j07638j01429k3513J07093n4815M4073
24144d4353P809l0791N0784J13766q404m722n3240J4023k7771N6385K3791q834
24132H8443q713n8004m919n1098o9562J12395J14530j00038j42174r4623j0262
24121b24025j3150J11596r7854k1819m2182J03235J12702J17780P9198l033j31665
24110i217m7715k3923L6599L8100j5472J0338K3446n4834Q3098q694p1898j66786
$$ y = [-47336, -82958, -214867, -152832, 12745, 62929, 55148, 2509, -73080, -26389, 3278, -47158, -199000, -173046, -22822, -40606, -958, 22516, -38591, -161577, -161896, -268554, -155477, -149584, -251044, -303870, -373309, -244356, -263368, -164449, 13069, -49797, -66446, -114711, -195350, -168614, -45033, 23659, 91876, -15762, -117191, -140704, -33611, -88426, -44353, -36544, -67335, -16551, 97215, 88811, 84089, 30849, 44872, 17101, 73486, 97277, 88443, 79730, 21726, 16807, -34291, -103853, 8542, 123072, 23034, -119140, -213763, -224025, -237175, -125579, -223433, -245252, -287434, -184199, -71497, 46283, 125481, 122448, -9217, -56932, -80855, -44256, -6156, -21628, -11290, 12156, -42678, 40420, 31726, -40172, -206958]
24098b06958r1838K3642P9957L0701m9742J71852J69958k2458N1369j01509j29433
24087g4459J0313J5462Q9168O2950j75855j23775N0089J27054r26m0642p5225
24076a35846N852p8411J8702J27669K1116k0672j11350L8870O1839j5870O8058
24065b0043K6312J5042L2524p4708j4021L3704m3984L4076M4718J63255k8335
24054A68540p1831j72167l9505m2782p4442m2449r7465M0890J80857J08099R6226
24043E3971Q2976j56684r7344M7256M6792L2157r127p6253j61015r777J17060
24032a29988J00537j6016R7652j18196O9014J2453q3722l0652r7220k2692O270
24021b12560M8259P4785K7419j17916l7714L1437O6261J25400J16313n3630q098
$$ y = [-206958, -298796, -275154, -195197, -164496, -214238, -42386, 127572, 105114, 156483, 54974, -74459, -64146, -48684, 40484, 103434, -72421, -196196, -146107, -19053, -19979, -60621, -135846, -129994, -208405, -189703, -62034, -40918, -61590, -172940, -134070, -72231, -88101, -20043, 6269, 21311, 53835, -20873, -34894, -1190, -45174, -11098, 33620, 196875, 168540, 96709, -75458, -114963, -157745, -232187, -274636, -372101, -331211, -150354, -42255, 53971, 136947, -19737, -117081, -69825, -23033, 9124, -3, -76256, -237271, -247048, -129988, -29451, -45467, 52185, -66011, 3003, 15456, -68266, -98918, -196138, -218830, -212560, -164301, -89516, -62097, -180013, -217727, -186290, -120029, 5371, 121684, 68054, 59956]
24010E9956l586k9148J4295j8634j41456n1835Q4559O3268l8137m8404O8419O803
23998c3900Q2524j10335p2848N5473Q8394j6114j42481j34994L9342O0177K06479
23987B1717Q7400o5222q0461n5534O2717O1953L1842m4781N2998M6138q6410m8550
23975a6193l1943K4907L3855l1002q7405M2820P8357l9315r062o2052k274n2352
23963a51659M3608J27197q978l5794L3270J49392j0905j07172Q5998m7l465j40921
23951a9476r0874L2447k0565k6356Q2701N4287O743L5282r7287p2817J13710Q2075
23939G9870J350j65835N2246N7949j14674J86655j4757n0869K5119P5452R9282
23928B31788O2988q8959o5600j02369q5351q1524J3188P5646L0810O609o5303
$$ y = [59956, 56370, 27222, 41517, 22883, -118573, -170408, -85849, -22581, -60718, -109122, -40703, -33900, 48624, -61711, -134559, -79086, 9308, -6806, -149287, -284281, -244939, -184762, 21717, 109117, 43895, -36566, -92100, -29383, 32570, 64412, 19631, 72629, 118767, 32357, -16193, -48136, -23229, 10626, -20376, -107781, -64961, 13396, -25919, -34981, -97033, -99307, -151659, -108051, 19146, 10168, -25626, 7644, 157036, 146131, 38959, 124957, 124910, 121445, -19476, -110350, -77903, -98468, -124824, -42123, 12164, 18907, 54189, -43098, -115915, -2205, 79870, 81220, -84615, -32369, 25580, -89094, 97561, 82804, 31935, 57054, 132506, 231788, 294776, 205817, 140217, 37848, -47503, -129027, -115839, -40193, -9383, -2774, -68077]
23917f8077p9019L0302m4897P9039J16534M1625L8495l3553K9317R2143R5249
23906B97158j43280j79877q0501p6199L8775P8725O0224r3580N6491r3333j3056
23895a48453J53971J34029O019j94859r2462j186M5692j3547q5901J01592j5385
23884a10490O3178J12485N4272m4937k778n375r4615j00312j615K01407j7659
23873E3561p9975k94470l5916K11415J47347j84171j0446J63538O6534p9300L3626
23862h257k7012p1392l6744l8982N8940R8666L4604N7589l9753j48401J54431
23851C3689j3995j29647m386j6317K1723Q1218M722j18999J8300K7665L9076N6515
23839d36M4054r0879j14757R3667Q1518O4Q586J39255l9160j09085n5921O6924
$$ y = [-68077, -147096, -116794, -161691, -82652, 33882, 75507, 114002, 80449, 109766, 201909, 297158, 153878, -25999, -106500, -182699, -143924, -65199, -4975, -98555, -42064, -135397, -148453, 5518, 139547, 145566, -49293, -141755, -142941, -97249, -110796, -196697, -95105, -110490, -47312, 65173, 119445, 74508, 71730, 66355, -28260, -128572, -130187, 71220, 53561, -26414, -320884, -356800, -145385, 1962, -182209, -192655, -29117, 37417, -41883, -8257, -35269, -106661, -143405, -182387, -123447, -24781, 9823, 67412, 27659, -120742, 33689, 19694, -109953, -114339, -130656, -108933, -27715, -22993, -141992, -123692, -96027, -56951, -436, 43618, -47261, -162018, -68351, 13167, 13231, 21817, 161072, 121912, 12827, -43094, 23830]
23827B3830p4934J3386j2220n5412J36094M0610p5527k8657J5347O7923M9084
23816I9524j837l4391j17134L8939J17574J41225q9718k29247j11227K7076l8278
23805a97494Q8699M9938o258K4185P7887K551p594P2021J9282o9844n525J14597
23793A62445N1650J283n0582q5748o9775j07552q3004J28709p0558l413K7542
23782i9003M8465J27285J14229k9748j04622j58586j07313J23795J56820j04526
23772c3204K9526L2166n6645n8653J05496J51921l4453O2432p7571O070J5502
23761A42587j26885n1634n20n2194M3442K5407L2302K4643O0200L0655o0660R6152
23749A63495j27268q3499J17169N4753o9176o311o916j6218O7887K2330k9851
$$ y = [23830, -51104, -37718, -49938, -105350, 30744, 71354, -4173, -32830, -17483, 50440, 99524, 97687, 63296, -53838, -14899, 102675, 243900, 154182, -75065, -186292, -159216, -197494, -108795, -58857, -65115, -40930, 36957, 39508, 31914, 103935, 123217, 53373, 47848, 162445, 214095, 215378, 164796, 79048, 9273, -98279, -181283, -52574, -123132, -126545, -99003, -50538, 76747, 190976, 161228, 56606, -101980, -209293, -85498, 71322, -33204, -3678, 28488, -28157, -86810, 18686, 170607, 136154, 198586, 121015, 127085, 142587, 15702, -35932, -36452, -88646, -45204, -19797, 12505, 37148, 97348, 128003, 67343, 163495, 36227, -47272, 69897, 124650, 55474, 49163, 42247, 26029, 93916, 116246, 86395]
23738H6395j60580m5060O1580N416O1099n3347J65511L4113j27958o9609N1485
23727I045Q6141R9136o1898L1109k9459q0250q4159j55956k2753P8929N5829O1538
23715a2748m3451o3560J22656O1958K0853R4679j9112J4802L1821j42869n2418
23704A2611k9903Q2846l1370m9623P3890n8503k5511j29106J12558J78919M5366
23693A82174p0408j82962o0516O965j33462P7817J46835n4929q7132J8929Q1579
23682g5110Q9063K7576O9876M33j31324J6537J17280p2351j48160o0977P3262
23671i3895L7051p0457j20217p1182J52175J16992J90990N4193l0130L9888M9667
23660B55075j3306j16181r0409j13605J38521N2080o2171l4846j6833l6294l257
$$ y = [86395, -74185, -119245, -57665, -52249, 8850, -44497, 121014, 155127, 27169, -42440, 9045, 95186, 194322, 132424, 163533, 134074, 53824, -30335, -186291, -209044, -130115, -74286, -12748, -56199, -119759, 2897, 64855, 85708, 180387, 161275, 176077, 207898, 65029, 12611, -17292, 65554, 34184, -15439, 58451, -52, -25563, -154669, -42111, 136808, 182174, 111766, -71196, -131712, -124747, -258209, -180392, -33557, -88486, -175618, -156689, -75110, 13953, 41529, 111405, 111838, -19486, -2949, 114331, 41980, -106180, -167157, -93895, -56844, -127301, -247518, -318700, -166525, -49533, 141457, 195650, 165520, 205408, 255075, 241769, 125588, 35179, -78426, 60095, 112175, 50004, 15158, -1675, -37969, -41226]
23649d1226k5607o0652O3903J9402J76556M0642j33677j12445O6275m1144m3558
23638i1531Q9972R4504j39671j87608p763Q3985l6821n5955M2901J82372N5121
23627B9506j2038M8142M7082q5819n2314R8570J9300j1036l9045j52949j3857
23616a24458P471K8353K6023J6521o0446j29987k0551M7802N6559j9004m5763
23605b17480J25593r3498k5343P3135R5217M4017o2564j48048j4355M9268L5625
23594a38433j0647m5194p3111K7385J2521J26722j2188m9633N0160O5986n0219
23583i6651m9891J1531j1325L4638O1341l6700o7281l6819L1505J38262P2026
23572E0636l9526j36337J07054M145m3084Q8105n3211J6027N7857m7829q5487
$$ y = [-41226, -66833, -127485, -63582, -44180, 132376, 173018, 39341, -73104, -6829, -47973, -91531, -1559, 92945, -46726, -234334, -242097, -158112, -194933, -250888, -207987, -25615, 29506, 17468, 65610, 112692, 26873, -25441, 73129, 92429, 81393, 42348, -110601, -124458, -116987, -88634, -62611, -46090, -106536, -236523, -257074, -209272, -152713, -171717, -217480, -91887, -185385, -210728, -137593, -42376, 1641, -60923, -208971, -223326, -174058, -138433, -149080, -194274, -267385, -240000, -227479, -100757, -112945, -162578, -112418, -46432, -96651, -146542, -135011, -146336, -111698, -50357, -87057, -154338, -191157, -159652, -21390, 50636, 11110, -125227, -18173, -14028, -57112, 30993, -22218, -6191, 51666, 3837, -81650]
23561h1650M5905K0637L5654j3393m7500k1481k2988J5707N435M7894l1922l2064
23549g9766l4662N0272r9572j01589o6063J49789J39418N372J2913J6883O0738
23538E3733r036j48979j84330P1711P9138N9844M7746J24715o4613j45277l968
23527a19316Q3109j189K7796J05966m3917k4849p4451q5557n9692m894q7411O4300
23515b20105Q8232M7009R305J66164R3701j35159j1721K2643l0048K7792r7777
23504c9964m516J15697J23034K2362n460p3717k4371j14056j02108Q222N4127
23493d0750J65969j04222m1694K4637l716n495K6264J7165n5889p6672j8607l2570
23481a45580J43736M5483K8024O0928K7371N9829j8512j17700n9078o9819j909
$$ y = [-81650, -35745, -15108, 20546, 7153, -40347, -61828, -84816, -69109, -63674, -15780, -47702, -79766, -114428, -64156, -163728, -265317, -331380, -181591, -42173, -36801, -23888, -7005, 53733, 44697, -104282, -288612, -216901, -137763, -77919, -30173, 94542, 29929, -115348, -119316, -36207, -37396, -9600, 96366, 52449, 27600, -46851, -132408, -192100, -196994, -284405, -220105, -131873, -84864, -75559, 90605, 184306, 49147, 37426, 60069, 30021, 57813, -39964, -44480, 71217, 194251, 216613, 211153, 137436, 113065, -991, -103099, -94877, -40750, 125219, 20997, -20697, 3940, 224, -5271, 20993, 38158, -17731, -94403, -113010, -145580, -1844, 43639, 71663, 132591, 159962, 219791, 201279, 83579, 24501, -45318, -47227]
23470d7227K1082p055n9015R9103N8172J2868r6255o7155q9249J4840R3740R9018
23458C2867J22163k5121j57472p4932R8778j8324N4373n8145p245R606j08484
23447a31936j32076P386J19420P1319K7583J738L8075p6020j05626J7914L7407
23436a24816j45343k7347R2558P4704J36596M1813p4916K0366j5191p6918J7508
23425h0986K214J3443M6715n2755N4960q8068r3985J19504K25114l4165r9528
23414A2463j06360O9635o3617p9735P0624R681N5977P7974Q8439r1788P6749l7727
23402H2315l7041k2035k1436j4694K2679K4095k7455P7990Q0673N4896r8070k59491
23390a37574k3338N2081l3760o75n692R3017Q7972j2302l6492n3236j19824m8661
$$ y = [-47227, -26145, -33200, -92215, 6888, 65060, 77928, -18327, -85482, -174731, -159891, -66151, 32867, 155030, 129909, -27563, -102495, -3717, -22041, 32332, -25813, -33058, -23452, -131936, -264012, -256626, -137206, -65887, -38304, -36566, 1509, -74511, -180137, -162223, -124816, -270159, -297506, -204948, -130244, 6352, 48165, -26751, -6385, -21576, -98494, -80986, -78772, -65329, -18614, -71369, -16409, -104477, -198462, -78958, 146156, 111991, 12463, -93897, -24262, -87879, -167614, -96990, -87309, -31332, 46642, 135081, 43293, 120042, 82315, 45274, 23239, 1803, -12891, 9788, 33883, 6428, 84418, 165091, 219987, 121917, -137574, -160912, -108831, -142591, -143266, -148958, -55941, 32031, 19729, -16763, -69999, -189823, -238484]
23378b38484J62896P3516o5955N4337L5441k4265Q518r5371K784Q1936m5618o4568
23366a14833J1273J71497J09017q3326k10515K2227J35308J67650j08851n2203
23356D7244r6884j46369P2755Q7003k8294j6010j6530J4586j14805q595K6006
23345a79893J36998O2459P0267O0202Q5570N4534J0168o4412p3716Q4718p7427
23334A69468j30864n4861l1073j12154J9807L5414L4443M0762J94284m6013k5394
23323I3819R442j09523j34220J08715L9488O8819l7393k9587m6822m7407M5725
23312c8944oN886K3088N3226l5055p3362j42821P748K23411P9792n9362P1010
23300A14611Q9601p932k34997j12618Q404P6417L8245q7715L5014l8405R6865
$$ y = [-238484, -75588, -2072, -68027, -13690, 21751, -2514, 6004, -89367, -86583, -4647, -50265, -114833, -103560, 67937, 176954, 93628, -116887, -94660, 40648, 208298, 99447, 47244, -49640, -196009, -123254, -36251, -64545, -80555, -97085, -82499, -197304, -205899, -179893, -42895, 19564, 89831, 150033, 235603, 290137, 300305, 235893, 162177, 246895, 169468, 38604, -16257, -47330, -159484, -139677, -104263, -69820, -29058, 165226, 119213, 93819, 103261, -6262, -140482, -31767, 7721, 76540, 39147, 9560, -37262, -84669, -38944, -38950, -33064, -9976, 43250, 8195, -65167, -207988, -200240, 23171, 102963, 43601, 114611, 204212, 196280, -38717, -151335, -142931, -66514, -28269, -115984, -80970, -119375, -22510]
23289b2510Q5513K0017j08065n8124j6697P4269R6759J50696l3423k01485m0319
23278e3369O7895L7029k5102R9520L9398q4607j36074L6534l2022N1088N9458
23267E9748k2428m2458j49655o108J08535J05R1344N3468k2304j191j22670K6192
23255b7422J79779J43507o8152J1125j9256l8668k20671j48171R5945L3417Q2238
23244B3671Q2490M0483J4752j7673j15218p5069p6339l7828J52641L39697J61695
23233D93302R1929J03400J96606M45961K07821J57024K24307J4481j07286j67103
23223A660442l54288k76728k20424k09367q1122j29250l2971M8696j20553j57011
23213A27424l7556L170R031j35173j12759q4166L5867Q1753P1503R5548p590j17952
$$ y = [-22510, 63003, 83020, -25045, -83169, -99866, -25597, 71162, 221858, 188435, -13050, -53369, 14526, 51555, 26453, 125973, 165371, 80764, -55310, -18776, -50798, 290, 59748, 37320, -5138, -154793, -160901, -52366, -52261, 39083, 92551, 70247, 69056, -53614, -27422, 152357, 295864, 227712, 238837, 219581, 180913, -39758, -187929, -91984, -58567, 23671, 106161, 146644, 161396, 143723, 28505, -46564, -122903, -160731, -8090, 331607, 493302, 585231, 688631, 885237, 1331198, 1539019, 1696043, 1920350, 1934831, 1827545, 1660442, 1306154, 1029426, 809002, 599635, 518513, 389263, 356292, 404988, 284435, 127424, 89868, 93038, 102069, -33104, -145863, -230029, -194162, -112409, -40906, 54642, 47052, -70900]
23201g0900O694J9425j5977r3725l4157J8869J42363L3636n7636Q4456j64361
23190a31313J5967O0515j43870m6683N9752N0452J41229M9199l6188L3769K0813
23179G3642o8914J6972N2765J6120L3772M8420l0534j25908n9701o1566o5861
23168a70793K1193j0552J895J76202K0016j3587o5398L7104O0519Q8639p7940
23157F7298j44110L3632M9402J21444P4748L2046L539j62855l7522m2980k2953
23146b8311R3205J16000k5601j34358j16435L5074j5501m5431j5573Q9132R5553
23135D7754Q4716J0586j90108o4337j19590j16178J05228P7276Q3430j23386j01331
23124c05940J7819J7158J88311J47708J34122R3726q6930j04557j03604k13470
$$ y = [-70900, -64206, -44781, -60758, -154483, -188640, -169771, -27408, 6228, -51408, 33048, -131313, -115346, -54831, -198701, -245384, -185632, -135180, 6049, 55248, 19060, 52829, 73642, 4728, 21700, 74465, 90585, 124357, 172777, 142243, 16335, -43366, -104932, -170793, -149600, -160152, -158257, 17945, 37961, 24374, -41024, -3920, 56599, 145238, 67298, -76812, -43180, 6222, 127666, 202414, 234460, 237999, 75144, 37622, -5358, -28311, 64894, 180894, 155293, 20935, -95500, -60426, -75927, -121358, -136931, -47799, 47754, 132470, 143056, -47052, -111389, -230979, -347157, -241929, -164653, -81223, -204609, -305940, -288121, -270963, -82652, 65056, 199178, 292904, 205974, 101417, -2187, -215657]
23114b15657n2872J16280J42344L1713n7998J6267l1418J1743J01634K7804n1295
23103C8545j3748p8518j0171R6560k497j35528l3454N7359N7297J02993J51402
23092B30240L0098j258M0575k19596j9794o6463n1106O7607j0388r1899m835j40857
23080b37676J8740J04120M4890r2383J11032L0215Q7972J0793l0258j31448j33280
23069b17283m0063K15931R7434Q4507P1175j42288r3121P1773l8018p1054o2894
23058a23901l594n1819J9334J16916J8238j94125j8553J04981j9683M0891J87616
23047G6301N3189n4299j7455o2780j3139J43369n5910j06059m4084M8740O5257
23036C3130J9960r0222p4614O2915O4435R5983Q7219k01800j56620j7692N5640
$$ y = [-215657, -268529, -152249, -9905, 21808, -36190, -19923, -51341, -39598, 62036, 89840, 38545, 24797, -53721, -63892, 32668, 30171, -105357, -138811, -81452, -24155, 78838, 230240, 260338, 259080, 299655, 80059, 60265, -6198, -57304, 10303, -85, -91984, -96819, -237676, -218936, -114816, -69926, -162309, -51277, -21062, 66910, 77703, 47445, -84003, -217283, -257346, -41415, 56019, 140526, 211701, 69413, -23708, 48065, 10047, -61007, -123901, -127495, -179314, -159980, -43064, -24826, -218951, -237504, -132523, -152206, -111315, 76301, 129490, 75191, 57736, -5044, -18183, 125186, 69276, -36783, -80867, -32127, 33130, 53090, -37132, -111746, -48831, 15604, 111587, 198806, -2994, -159614, -177306, -121666]
23025a21666K5967J45581K6441n7149p7634n3128L2771J64050k345M028j08538
23014b1622o8067P6396R0032L0372j56049r154J5898l8329J2217m3911k5441L8128
23002i9530Q9331j1223K9950J67661K1253n8124j46875l9835N1970L3331J48566
22991A86475J01679m9652m5820m6649l1297L1076j6354m088j0615M9636J11194
22980B75585O661L5438K3735j46113j25034K5474o3526j33406K2505J50504J17913
22969A89736q2103j16331N6450R857J01225n9246j09323j60139J08290o5169N2973
22958g3780K44873j687l3441j8246j57874L9953O6658K5027n4483j31707J7004
22947g7703k0665o6977n3241m9663M7136J37350N0807Q7856Q8020m6294n3125
$$ y = [-121666, -95699, 49882, 76323, 19174, -58460, -111588, -78817, 85233, 82888, 86916, -21622, -89689, -13293, 76739, 107111, -48938, -58092, -42194, -80523, -68306, -112217, -137658, -99530, -10199, -21422, 8528, 176189, 197442, 139318, -7557, -47392, 4578, 37909, 186475, 288154, 238502, 192682, 146033, 114736, 145812, 129458, 125370, 114755, 164391, 275585, 282246, 317684, 341419, 195306, 70272, 95746, 32220, -101186, -78681, 71823, 189736, 107633, -8698, 47752, 57609, 158834, 99588, -9735, -169874, -61584, -126753, -73780, 171093, 169406, 135965, 117719, -40155, -202, 66456, 91483, 37000, -94707, -77703, -98368, -165345, -218586, -268249, -221113, -83763, -32956, 54900, 142920, 96626, 43501]
22936D3501k323J90284J30597o4558p8714O2137P4082R5910p9212n3149J31177
22925D49732J8168q5124r7567r6697K489r2700o5302k3990n2091J3967k8816m1699
22913i9630Q5892K05462l230o1076J5917r6608R3920J00838j93368n2756R5626
22902I0987J24518m7200j3771j0537j16265K5263J8531o7706j62800n267K05941
22891D1694J56814j43814R3008P3249j5951r0470O130p8093l8915m2691M7037
22880G998M2743K5988J55742M7782j84514j50244k6533K7289P3326p7435n1836
22869a09694L0945K5550k00757j26350J28895K47664l5452l867n982q191J41765
22858H4526j11144j29649J5748j1398Q4629N2081l3465r4959R0971N0671j71806
$$ y = [43501, 41178, 231462, 362059, 297501, 218787, 280924, 355006, 450916, 371704, 318555, 449732, 467900, 382776, 285209, 188512, 191001, 98301, 32999, 9009, -43082, -29115, -57931, -99630, -13738, 191724, 188494, 127418, 143335, 46727, 140647, 241485, 48117, -4639, 90987, 215505, 168305, 154534, 143997, 27732, 52995, 71526, 3820, -158980, -164247, 41694, 198508, 54694, 147702, 220951, 205000, 114530, 120660, 42567, 3652, -39039, 7998, 50741, 76729, 232471, 280253, 95739, -54505, -81038, -53749, 19577, -57858, -109694, -78749, -53199, -253956, -380306, -251411, -3747, -39199, -43066, -49048, -57239, 84526, -26618, -156267, -140519, -151917, -67288, -15207, -48672, -143631, -52660, -1989, -173795]
22847a73795Q7727K01744O3544j83299q2020Q6795J15512n1606j2122J21125j360
22836A72245l2155p1293k3142N5999L3278o9640P5238j6389L1319N1260r3031
22825A13689n1552R4613j77970q3855R2677J42961N8129o4685j59693k2688J10862
22814E2488Q6308K3523L9062n7223L8842M2996J1461l4063n7289p1554q2577o525
22802a4551M2663J22246J01976p7952k3660p086J21710J9974l3836o3426O9293
22791B57351K2763J54714M406j21155j24565q079K0044L8570l9464K108n341J30782
22779C32134n4880j34899m4673M0867j33746J2498J19430J26373J58j6306K811
22768B49767N2357M0990M0163M9747J07321K6840J03341J10387r4539j25519J81339
$$ y = [-173795, -86068, 115676, 179220, -4079, -86099, 696, 116208, 64602, 52480, 173605, 172245, 140090, 68797, 45655, 101654, 134932, 65292, 140530, 124141, 155460, 206720, 113689, 62137, 156750, -21220, -105075, -12398, 130563, 188692, 124007, -35686, -58374, 52488, 138796, 162319, 201381, 144158, 183000, 225996, 237457, 203394, 146105, 74551, -8026, -14551, 28112, 150358, 252334, 174382, 150722, 143636, 265346, 285320, 251484, 188058, 257351, 280114, 434828, 439234, 318079, 193514, 185435, 205479, 244049, 204585, 206693, 201352, 332134, 277254, 142355, 97682, 138549, 4803, 17301, 136731, 263104, 263262, 246956, 249767, 302124, 343114, 383277, 433024, 540345, 567185, 670526, 780913, 686374, 560855, 742194]
22757G42194K29906J13021p5806L10471N69518L40933O2240K29233P5443n3495
22747B543658l09329m78292m66801k76643q58j48681j43766J39015Q7243j1677
22737I33869N1912p1320K988N8700k5682n0624j42070M9650O5937L2181J45334
22726A050875J85183Q0084J1326j8143M5649m8914Q023j7343n5219n1573J75201
22715A365149L18611J18534p022J65773J25437J45219J83253l3533O5431K63066
22705B709918J79694L0445K80275L10899L69564L67199L01587L45086N14671M73262
22695E882600M83363Q33609Q83042R55357J071044J249578J476114K041688K513339
22686A7389734L256359M386646N737896P428599J0032954J3895960J9121117K6780768
$$ y = [742194, 972100, 1085121, 1009315, 1319786, 1889304, 2230237, 2292477, 2521710, 2597153, 2543658, 2234329, 1756037, 1289236, 1012593, 1011735, 863054, 719288, 858303, 945546, 933869, 985781, 914461, 917449, 976149, 950467, 899843, 757773, 807423, 873360, 905541, 1050875, 1236058, 1316142, 1327468, 1309325, 1354974, 1306060, 1314083, 1296740, 1241521, 1189948, 1365149, 1683760, 1802294, 1795272, 1961045, 2086482, 2231701, 2414954, 2381421, 2446852, 2709918, 2889612, 2920057, 3200332, 3511231, 3880795, 4247994, 4549581, 4894667, 5409338, 5882600, 6365963, 7199572, 8082614, 9037971, 10109015, 11358593, 12834707, 14876395, 17389734, 20646093, 25032739, 30770635, 38199234, 48232188, 62128148, 81249265, 108030033]
22678A08030033L9416961N6402737O6700837N8991378L7742987J4580728q422953
22671C73442708l2709242n4006704o6124544o3419847m7710699k9747389j8280356
22664F1443927j2306529q918533o865250n222662l969233l166933k536238k033572
22656A6424977j926301j601915j134309j073112r36795p54931p27278m64455n64569
22647G241312m49725n15394l90953m35499m15608l70457l33549k91014k51654
22638C787459k18922k86768k48124j97411k56907o2918O453p2542r3713J04653
22628B461260j46912l43380j00241k1781p3459j07327m4475j39580j53972k9565
22618A300568M5330l4768j19984p950n9376j75315N8760L0390N9521o4768j11563
$$ y = [108030033, 147446994, 203849731, 270550568, 329541946, 367284933, 381865661, 373442708, 340733466, 286726762, 220602218, 157182371, 109471672, 79724283, 61443927, 49137398, 40218865, 33353615, 28130953, 24161720, 20994787, 18458549, 16424977, 14498676, 12896761, 11762452, 10689340, 9752545, 8997614, 8270336, 7805881, 7241312, 6791587, 6276193, 5885240, 5449741, 5034133, 4663676, 4330127, 4039113, 3787459, 3568537, 3281769, 3033645, 2836234, 2579327, 2516409, 2522862, 2450320, 2356607, 2461260, 2314348, 1970968, 1870727, 1848946, 1775487, 1668160, 1623685, 1484105, 1330133, 1300568, 1345898, 1311130, 1191146, 1183196, 1123820, 948505, 1007265, 1037655, 1097176, 1032408, 920845]
22607I20845q4165j05595j76839K2468Q5759K38959L39025L00885K60230K71147
22597B072719L33432J85649Q2061R6504m6299k38602m50375m95099m43424k35397
22587H61169l8564l5015J27990o6535j74061K400k1573K1864p4775r3554p5771
22576D33575r4613p3504J43576K9601j3596O6881m9906O1097J2698R1950P3128
22565F80887n9494j28516m2142j10108j11344P5863R7089p3810j98265K9467J4822
22554A74449j88068k3434J67238K11832J23340n5326M8915j64914j71761M6741
22544A69012N9918l717n6829L3031m7964o9538o5663R9923J89685J13843N5773
22533D77474r8941j60416M2268R9885m2920q7443j87898o2592M6209l7274J04778
$$ y = [920845, 836680, 731085, 554246, 576714, 662473, 901432, 1240457, 1541342, 1801572, 2072719, 2406151, 2591800, 2673861, 2770365, 2724066, 2485464, 2035089, 1539990, 1096566, 861169, 822605, 787590, 915580, 849045, 674984, 677384, 655811, 677675, 602900, 509346, 433575, 338962, 265458, 409034, 438635, 425039, 491920, 442014, 503111, 515809, 607759, 680887, 621393, 492877, 450735, 340627, 229283, 305146, 402235, 328425, 130160, 159627, 174449, -13619, -37053, 130185, 342017, 465357, 410031, 458946, 294032, 122271, 169012, 228930, 225213, 168384, 201415, 153451, 83913, 18250, 118173, 307858, 421701, 477474, 378533, 218117, 260385, 360270, 317350, 229907, 42009, -20583, 25626, -11648, 93130]
22522I3130Q2077L115j8463k724j2600Q053j19903m7975J32515Q152M0543Q6697
22510B52617l4303M459k8870m276q6141M1478j8585n9521L421j9866J9798K0893
22498I1104P1717L0940O344j35728k12081k1051P7005J76257J2722m8480o8380
22487a9631J00248J06881k2398j27242N3601M2050L7320K0819P9060Q7351o0757
22476B97302j05040j74086p6342L1409m2m0501P7043Q8204N1045q8017K6928M797
22464I2700k0353m761p890m8920l6775p1713m2696L4465n7432N1376J8304M7852
22452d5843J45632q8109Q97J3290j2251l8143J3851r2651q1375J11090J25265
22441E1653P2916j0387k168o3082J54844O4246j0239m6944o5836j9354o0393r9373
$$ y = [93130, 175207, 178322, 159859, 157135, 144535, 152588, 32685, -15290, 117225, 125377, 165920, 252617, 218314, 222773, 193903, 189627, 103486, 144964, 126379, 66858, 70279, 50413, 70211, 91104, 162821, 193761, 200105, 64377, -147704, -168755, -91750, 84507, 97229, 48749, -19631, 80617, 187498, 165100, 37858, 91459, 133509, 170829, 191648, 270708, 358059, 297302, 192262, 18176, -58166, -26757, -26799, -67300, 9743, 97947, 148992, 60975, 87903, 92700, 72347, 67586, 59696, 10776, -25999, -97712, -140408, -105943, -163375, -111999, -93695, -45843, 99789, 11680, 12577, 25867, 13616, -24527, -10676, -103327, -184702, -73612, 51653, 124569, 114182, 112014, 48932, 203776, 268022, 257783, 210839, 145003, 125649, 65256, -34117]
22429c4117K1461p235O3632k0443k63J02691o5328L8561r2169j38052O589J07973
22417a6700J35589L8113q1772J71016P1500k7770q450j83828P4627J2295j22795
22406F1825K3490J11588p3731J7874j05376n6247J9669K9369k80K4602L7917k766
22394H7934K9645n1152l552j9381J5356O940O833R1503M7812m0664j27818J01623
22382A45079P9054j53299j68010j15433K7047M6959l0892p385J14184o3178Q8797
22371c7077O5595j03233j20582N6508P483p4197P2997R4047M383L2045Q003N7380
22359F3352j2572j90551N945J55353p0251P4183P5488K1552l2086J6197P5871
22348A82481j25874p6040J46319p843r2120K8312K5372L5368P9915K3391n6802
$$ y = [-34117, -12656, -19891, 43741, 23298, 23035, 125726, 60398, 98959, 6790, -131262, -124673, -16700, 118889, 157002, 75230, 246246, 317746, 289976, 281526, 97698, 172325, 184620, 61825, 85315, 196903, 123172, 141046, 35670, -20577, -908, 28461, 28181, 52783, 90700, 87934, 117579, 66427, 62875, 43494, 58850, 65790, 72623, 164126, 211938, 171274, 43456, 145079, 224133, 70834, -97176, -212609, -185562, -138603, -169495, -176880, -62696, -125874, -37077, 28518, -74715, -195297, -138789, -131306, -205503, -132506, -38459, -34076, -2031, 5972, 63352, 50780, -139771, -133826, 21527, -48724, 25459, 100947, 122499, 90413, 106610, 182481, 56607, -19433, 126886, 119043, 26923, 55235, 80607, 115975, 195890, 219281, 162479]
22337A62479k374m3932L6595k3171R8339l0639j51676o0813l6665l4991M4419
22326d2429J35257n7539N0140p6267K8611J7395r9832j24001N6364M6935l6242
22315a01608N6411J19531R373l3720L5097M7263j23751R3660o7550j87377l8643
22304a91314r8561J66631J26574M5360J73538l0856q6716n3274j16766j46133
22294b11517k879O5595r4226J6361J38312j642N898L7954L1239N0001j03766l274
22282g1944l5283m3742M1914O6219J0017l0509q9662K0336J17812n4518K4871
22271d4489Q537L8126K6662k8824M2513L7575q0192j86983o4472P4453P7128L4842
22259f5124o0534J8555K5751q486m0795l5375j2065l032O1805L1147N7656J97735
$$ y = [162479, 160105, 116173, 152768, 129597, 227936, 197297, 45621, -15192, -51857, -86848, -42429, 92828, 35289, 85429, 9162, 37773, 55168, -44664, -168665, -112301, -65366, -101608, -45197, 74334, 83707, 49987, 85084, 132347, 8596, 102256, 34706, -152671, -191314, -289875, -123244, 3330, 48690, 222228, 191372, 104656, 51382, -65384, -211517, -214396, -148801, -243027, -226666, -88354, -89996, -84098, -46144, -14905, 35096, -68670, -71944, -107227, -150969, -109055, -42836, -32819, -63328, -152990, -132654, -14842, -69360, -44489, -35952, 2174, 28836, 12, 42525, 80100, -92, -187075, -251547, -177094, -99966, -65124, -125658, -107103, -81352, -89838, -130633, -166008, -178073, -181105, -119300, -88153, -30497, 167238]
22247A67238l8813j17439j54013j17527k6491l5917L4579K13714P8835r904K217
22236c521k588q5794R178n5876r3961K0679Q1984m0474M9649J01367n7083q4419
22224a60859R0943O5883N1684n1081j17565j8824N9253P1798j18835o5976L1707
22213a61872J0258K19415R4037L3178q4305o8047q3912P8N4123J4118R983q1629
22201d4575J0620J23971N8239o393m2706l9629j12510r761J32443L8103j4584
22190I3218R213q219p0293m5139j2066q4528j25171p3511J44251m2555J81396
22179c3404L8067l8859j22744n6261J14771P4278k7291k6947M2128M9624P988
22168B1350L0909l9805k4669J78819k5723j15023r6508k7570M5554p8041q3012
$$ y = [167238, 128425, 10986, -143027, -260554, -287045, -322962, -288383, -74669, 4166, -5738, -3521, -6109, -91903, -82725, -138601, -232562, -211883, -129899, -170373, -120724, -19357, -76440, -160859, -69916, -4033, 47651, -3430, -120995, -139819, -80566, -8768, -127603, -193579, -161872, -151614, 67801, 161838, 195016, 110711, 42664, -41248, -41170, 12953, 27071, 37054, -44575, -33955, 90016, 148255, 141862, 99156, 59527, -52983, -62744, 69699, 107802, 93218, 102431, 94212, 23919, -21220, -33286, -117814, -242985, -316496, -172245, -214800, -33404, 4663, -34196, -156940, -213201, -98430, -24152, -51443, -78390, -36262, 13362, 21350, 52259, 12454, -12215, 166604, 140881, 25858, -70650, -98220, -52666, -130707, -213719]
22157b13719M1390l2568n7663J12642O7303R4269r408l3144J7438N7403l9502
22146D441q734o8r6544k5790P7752l3044R0746J59785j26443o2669k2148J02423
22134E9707P0646l5019J1605r1446m2207K3944o5940m061J09437J0328R3619R7293
22122B37906r7061j5038J33034j1508O2378p2472J21175K05001L52222L93149
22112A308786K48386J41602k662j29550j14690l13063l23600q0385j71941k66326
22102B96557r9721j47170M3558P8845p818j5327q8886M7719M5032p4235m5056
22091C3498l1887K1235R9002n5209J10537o5602L1577M8028L6809j85243j19782
22080g7037j14000N8510J74259j06851O7173M0007m3389L1341n5451o4742J01255
$$ y = [-213719, -172329, -204897, -262560, -149918, -82615, 11654, 2246, -30898, -13460, 43943, 4441, -4293, -4361, -100905, -126695, -48943, -81987, 8759, 168544, 42101, -20568, -42716, 59707, 130353, 95334, 106939, 15493, -26714, -2770, -68710, -72771, 36666, 46994, 140613, 237906, 140845, 125807, 258841, 247333, 309711, 237239, 358414, 563415, 915637, 1308786, 1557172, 1698774, 1696112, 1566562, 1451872, 1138809, 815209, 734824, 562883, 296557, 196836, 49666, 93224, 172069, 164251, 148924, 60038, 107757, 152789, 78554, 33498, 1611, 22846, 121848, 66639, 177176, 111574, 143151, 191179, 227988, 42745, -77037, -191037, -132527, 41732, -65119, 2054, 42061, -1328, 30013, -25438, -90180, 11075]
22069A1075j6029J1440m8833P4935k378o2659j09743k1585K1483J91027j20463
22058g1730O715J00476p5908r9388P1915L8559j03749P319n6107l2397K2478J27
22046a91690J05813j2836R7310J06207q2823j00402J523K4566P0607N6932K4529
22035I9736j5042K1544N2206j06507j44228K1888J11361N3534J4421Q172l6010
22024H1075n650j51781L2850j4r3126K0441J10363L4654J10777J1526j32717m47
22012A7951q1889m8972k616P1245n072k0733O5123M3931R0425k8983K2581m2968
22000H0023j04511r7162R1067n2274j08741j01674l2153L0393k7873J69104J51906
21989a895k967O3558p20j80305k6180R4173R0360L7655n1376J42745M1828k1443
$$ y = [11075, -4954, 6486, -42347, 32588, 30210, -32449, -142192, -163777, -142294, 48733, -71730, -65015, 35461, -40447, -139835, -67920, -29361, -133110, -125791, -181898, -214295, -191817, -191690, -85877, -98713, -1403, 104804, 21981, -78421, -76898, -52332, 18275, 75207, 99736, 84694, 106238, 158444, 51937, -92291, -70403, 40958, 94492, 108913, 117085, 81075, 75425, -76356, -43506, -43520, -136646, -116205, -5842, 28812, 139589, 151115, 18398, 17951, -63938, -112910, -115526, -44281, -49353, -70086, -4963, 38968, 129393, 100410, 122991, 80023, -24488, -121650, -30583, -82857, -191598, -293272, -325425, -295032, -322905, -153801, -1895, -4862, 58696, 57976, -122329, -148509, -54336, 36024, 73679, 22303, 165048, 206876, 185433]
21977A85433j03050K2955k9141k6085l0621L6983k8523j48578J3356L8313K7304
21966d1654l0346j78882o563R9771J27366j675l4428l7002K446o0500Q4122J67130
21954H9785j6081j75680k1640O6654O0815M1732L3508l6391J2182j3591l6673
21943D620l5608n4960L9040j0956P0310J5223Q1657k3204r6056L38P8218J31035
21931A99657k2813j00670l178M7780K7405q6753q6586O8465J63999K3282j34769
21920I5819j44400M47o0081l9581J94566R2052R3396j20116j02083J31161J41577
21909B82757j59729j10445J3408l3648q5462n2389M017p0791K3666l9662J33498
21898i4780J52637Q270j31778j83944R7383O2335o2117J5352M2432o8131R0464
$$ y = [185433, 82383, 105338, 76197, 50112, 19491, 56474, 27951, -120627, -107271, -68958, -41654, -72000, -250882, -257445, -157674, -30308, -31983, -66411, -103413, -100967, -161467, -77345, 89785, 73704, -101976, -123616, -56962, 3853, 45585, 79093, 42702, 54884, 41293, 4620, -30988, -85948, -46908, -57864, 12446, 27669, 109326, 86122, -9934, -9596, 68622, 199657, 176844, 76174, 72996, 120776, 148181, 61428, -25158, 43307, 207306, 230588, 95819, -48581, -48134, -108215, -147796, 46770, 138822, 232218, 112102, 10019, 141180, 282757, 123028, 12583, 25991, -7657, -93119, -145508, -141491, -212282, -188616, -228278, -94780, 57857, 66127, -65651, -249595, -152212, -89877, -151994, -136642, -94210, -162341, -71877]
21887g1877J271o7362n6098J91841J82713Q535J2945M2648j39037l382M5557p7117
21875G0637p3599n7311J9254j6664j67763P7748J43093m7059j22383j0108j2113
21864a96268p2543J679J01446K8281Q7770J11289J0806n7490m698q3668M6369
21853b7027j02896r1163Q5530K9913N7449N5763J06701j42734j9771j3829k0864
21842h2928n2783J36347J21796K5978N80p112m579L0145L6636o4349p65j20992
21830A7974q5535n9284J4481R2728O9911N6524r3019q231q1189m2457J46628N6088
21818H4619j20050j21166j14421N8661J07535J68618J68134o9382q7429n5269
21808A9850J15240l1274K9779j44540j94448j7773j1584K2092L6616m220K7677
$$ y = [-71877, -70606, -137968, -194066, -2225, 180488, 189023, 201968, 244616, 105579, 102197, 147754, 70637, -2962, -60273, -41019, -57683, -225446, -147698, -4605, -51664, -174047, -184155, -196268, -268811, -267132, -165686, -137405, -49635, 61654, 72460, 14970, 10272, -73396, -27027, -129923, -221086, -135556, -105643, -48194, 7569, 114270, -28464, -48235, -62064, -82928, -135711, 636, 122432, 148410, 148990, 141878, 137299, 167444, 204080, 139731, 138966, 17974, -67561, -126845, -112364, -19636, 50275, 106799, 13780, 5549, -75640, -118097, 28531, 84619, -35431, -156597, -271018, -212357, -104822, 63796, 231930, 162548, 75119, 19850, 135090, 103816, 133595, -10945, -205393, -223166, -234750, -212658, -176042, -180262, -152585]
21797a52585j04923r7081J13158J44666O33J1101q9633k3733j08269Q8826O6250
21786a51590J53269j00956n945k1861k4795o9085m1034J08905j21400K04692R9766
21775B9966n2784l9362n7143M7297p6043J3807M8588Q026Q64L3964r0777p0718
21763b04315J45720l6956P2842J6028o9987M0343P3979O8488M5718J5849n4273
21752A13436q6890P0224N5962k6700p5343k7769o4559M0403J40384J66275K6144
21741C31567m0432O8326n9303m7620r6666q6483R9769L0021o2601j64985J7179
21730a1228j2411O2173O7643J9824l2328j38930j68672J13357M4362n940J7606
21719d4544Q3363N4949p4624q9543M1082J3071j11601m1565N6063n696n4510K1080
$$ y = [-152585, -257508, -354589, -241431, -96765, -96132, -85031, -174664, -198397, -306666, -217840, -151590, 1679, -99277, -105222, -127083, -151878, -220963, -261997, -153092, -274492, -69800, 29966, -22818, -62180, -119323, -72026, -148069, -134262, -85674, -77648, -76784, -42820, -133597, -204315, -58595, -95551, -22709, -6681, -76668, -36325, 37654, 106142, 151860, 167709, 113436, 26546, 96770, 152732, 126032, 50689, 22920, -41639, -1236, 139148, 305423, 331567, 291135, 359461, 300158, 252538, 155872, 69389, 169158, 199179, 136578, -28407, -11228, -23639, 38534, 106177, 126001, 93673, -45257, -213929, -100572, -56210, -62150, -44544, 38819, 93768, 19144, -70399, -29317, -16246, -127847, -169412, -113349, -119045, -173555, -152475]
21707a52475J47409O2643K9198L0925j14195r7868J08133P7527j72900j42002
21697b23605l4211L2259J43842L2860J13388m5532m4969l4617J7151q6785Q0246
21686d9973J520j2822J03630K3370o5622J2545M2212M3290J20248J61951r1829
21675B88520j79061o1795p5095j07186j7265N7683Q3331L4854J36672j35508j09690
21664h4540K5403M6403Q0426J24692p2789K925J6174o4191L6016k063j1093J88671
21652B86034J13367J53920N5996N4019J46702J48152M077J4110j01180k05963
21642F69234p235J50518O9539m2832o9126k9417K6484Q0687o9346l7009j629M6262
21630G86130n7494n9407K3583j20218n4033j67515j01022L3232K8129j01223n1715
$$ y = [-152475, -5066, 57577, 86775, 117700, 3505, -94363, 13770, 91297, -81603, -223605, -257816, -225557, -81715, -48855, 64533, 19001, -25968, -60585, -43434, -130219, -49973, -48453, -61275, 42355, 65725, 103, 12648, 54860, 98150, 218398, 380349, 288520, 109459, 47664, -27431, -134617, -151882, -94199, -10868, 23986, 160658, 25150, -84540, -59137, -12734, 67692, 192384, 119595, 122520, 138694, 74503, 110519, 108456, 97363, 286034, 399401, 553321, 609317, 663336, 810038, 958190, 962267, 976377, 875197, 669234, 661999, 812517, 882056, 839224, 770098, 740681, 767165, 847852, 778506, 741497, 739868, 786130, 728636, 669229, 692812, 572594, 518561, 351046, 250024, 283256, 311385, 210162, 158447]
21619A58447O6313L4825j01134q2115o2412L2062l7468o0581Q4131J16695L4539
21608A83302j66969p6095n5681n5353Q0655K2767J4641k3864q1459J08304J45578
21597I5826R0992J13137J2694r5912j16224J5896r2644J6917L8671m7738M5457
21586G7072K1218j3799k8605O5112K7451R95p1189p960P0612l0076n0628k2595
21574C7608k12984J7428j847M3882o0525J20796N9602Q146j28956J4342J18280
21563A5772n0485K734O6486k47432m7468J03533J65104o8305r4393J3785P8825
21552f1844j9881Q832J0736q4421q301P7196Q1988J2401o3575m2947k1684O1242
21540e0258R6188n8444N4644M1330k8922o3677K2653R228k032l2078J0082M4983
$$ y = [158447, 224760, 259585, 158451, 76336, 13924, 45986, 8518, -52063, 32068, 148763, 183302, 16333, -59762, -115443, -170796, -90141, -67374, -52733, -76597, -158056, -49752, 95826, 186818, 299955, 312649, 216737, 100513, 116409, 23765, 40682, 79353, 31615, 77072, 98290, 84491, 55886, 120998, 148449, 149444, 78255, 70295, 140907, 110831, 60203, 37608, -175376, -157948, -159795, -115913, -176438, -55642, 3960, 12106, -116850, -102508, 15772, -34713, -31979, 34507, -212925, -260393, -156860, 8244, -60061, -154454, -140669, -61844, -81725, -72893, -62157, -146578, -154879, -77683, 4305, 16706, -46869, -89816, -111500, -50258, 45930, -12514, 42130, 83460, 54538, -9139, 13514, 22742, 20710, -11368, -1286, 43697]
21528D3697j63254n7510J02298J73485l8581O678l762m9015r2820J84567J73930
21517B79713j02331j54203j24328j75504r5070J50520Q9412k7341O4060J56887
21507F1815j44157j6747J15288J23663k510J2467q1916l968l2496O1857p3270
21496B0026o464K8127K6222K1844N4379l9920l542j59911p5677R2677j4083l7325
21484i3647l8200J08353K3349l5652m9117q4701m7692O9668m6253j2237P1674
21473a34455J9230N9596J79519k5137k2935k9668j81547j05286R9330J04616P5789
21462C9052j508L7340M9751r5693j82023k13309P0659k6625J12100K13159O7350
21451G0253l3718J5906Q2179j3781J18103M6052j20920m6739Q7346J01665o4138
$$ y = [43697, -119557, -177067, -74769, 98716, 60135, 66813, 63051, 14036, -78784, 105783, 279713, 177382, 23179, -101149, -276653, -371723, -221203, -131791, -159132, -95072, 61815, -82342, -99089, 16199, 139862, 137352, 149819, 67903, 63935, 31439, 93296, 20026, 13562, 41689, 67911, 89755, 144134, 104214, 100672, -59239, -134916, -42239, -56322, -93647, -131847, -23494, -145, -35797, -84914, -169615, -217307, -147639, -193892, -206129, -134455, -115225, -55629, 123890, 98753, 75818, 46150, -135397, -240683, -141353, -36737, 39052, 37544, 74884, 124635, 28942, -153081, -366390, -295731, -322356, -210256, 2903, 70253, 36535, 52441, 134620, 120839, 238942, 284994, 164074, 117335, 204681, 306346, 242208]
21440B42208k5943N213p9253J03562o843n8915n9566m3772M8513p6305r255R2749
21428A32393n2554k04013j22050m4393K08060P7253M2736K6265O6751j22081j4488
21417f121m1979K9992M9854O3077n3051M5093o8993l8608J49732n8319k13852
21406a43175p1280O3920l3296K1952Q6021L8735L6913M2511m2432k4902o1383
21395h6416M7437J54825n5527n6364Q0217n2393q5919j32405Q4739J915j2609
21384a12500J91098Q7126m1730j71564q2320L0892N0866p7163L525p612K7921
21373a01461N2915m4994O2108P6383J1557k28K2592L6153L7446L1835J1078j15966
21361G9418n1981k6994K875l7327K3275r150J12082P2136M2456j6111j21456J3256
$$ y = [242208, 216265, 221478, 142225, 245787, 238944, 180029, 120463, 76691, 125204, 48899, 39644, 132393, 79839, -124174, -246224, -290617, -82557, -5304, 37432, 63697, 130448, 8367, -6121, -48100, -18108, 31746, 94823, 41772, 86865, 17872, -20736, 128996, 70677, -143175, -214455, -150535, -183831, -161879, -75858, -37123, -210, 42301, -131, -25033, -86416, -38979, 115846, 60319, 3955, 84172, 31779, -54140, -186545, -101806, -99891, -112500, 78598, 165724, 123994, -47570, -129890, -98998, -48132, -125295, -121770, -129382, -101461, -48546, -93540, -31432, 44951, 56508, 56280, 78872, 115025, 152471, 184306, 195384, 79418, 27437, 443, 3318, -34009, -10734, -19884, 92198, 164334, 206790, 190679, 69223, 82479]
21349H2479L0659N062n6629J41929n2183J4373N008m466M6570K06297j67560p0213
21337A81326P8223Q6069O0190j91598n6376J15053P7224j54630j42312L4043m6000
21326D1212Q7913L9433R0593R1819j7462r2890o340J43907P8842j25114n3276
21315B78637M7238m0814j33449k7213L8362L9748L2120k6693n5980j01653M6552
21304I6855M0249r1175j55730l0140J64348M1126r3247J03891k2401j48078j8916
21293a13218j1137P7122J13690M7112L8251N772j49532j6187J30163J26838o8054
21282A80820j15948j26513J00147L6741m5693j15921O8224m5596J11465q1090
21272c3364j09711p6932l2768l3761O0401J2903J16200N7979p2348j54521O5568
$$ y = [82479, 113138, 118200, 61571, 203500, 151317, 165690, 170698, 166232, 212802, 419099, 251539, 181326, 259549, 345618, 405808, 214210, 157834, 272887, 350111, 195481, 53169, 87212, 41212, 129125, 168558, 259151, 350970, 333508, 240618, 234278, 378185, 457027, 331913, 278637, 325875, 285061, 151612, 124399, 162761, 202509, 234629, 207936, 151956, 50303, 96855, 137104, 45929, -109801, -139941, 24407, 65533, -27714, 76177, 53776, -94302, -113218, -124355, -47233, 66457, 113569, 151820, 157592, 8060, -8127, 122036, 248874, 180820, 64872, -61641, 38506, 75247, 29554, -86367, -18143, -63739, 47726, -33364, -143075, -220007, -252775, -286536, -226135, -213232, -97032, -39053, -111401, -265922, -200354]
21261b00354J47854L3931Q7471J49149M089q8165j49084j87996N853J70478l000
21250b9774j07388M1187J68954M4002j16035p9260P00J16060J31052M4978L2007
21239B46483m6717p9635M6032M6394j01625K0981J2043l319L0185N5046K3787
21228B49655p0439L2806k2273k4366l3271q061n4083R8907p4024L5674Q1406p3962
21216A37969k2033J44343n056n3269l1133K17625O9589o3120j14545o9748j48803
21205F1819l6375J77561p5093P969o4833J50598K30575J22805Q7131j60713j21575
21194C79869O3259O3273m8698j04994o9937l5376P9905q918K6745n8904K3732
21183C09956n4064j00682J11249K8856J6992N9550k2118N2761J50568J0328J4541
$$ y = [-200354, -52500, -18569, 68902, 218051, 222140, 133975, -15109, -203105, -197252, -26774, -29774, -137162, -95975, 72979, 116981, 946, -78314, -77614, 38446, 169498, 214476, 246483, 199766, 120131, 166163, 212557, 110932, 131913, 143956, 140637, 170822, 225868, 249655, 179216, 212022, 189749, 165383, 132112, 124051, 69968, 168875, 94851, 130525, 211931, 137969, 115936, 260279, 255223, 201954, 170821, 388446, 458035, 394915, 280370, 210622, 61819, 25444, 203005, 127912, 135881, 71048, 221646, 452221, 575026, 662157, 501444, 379869, 443128, 506401, 457703, 352709, 282772, 247396, 327301, 318383, 345128, 286224, 309956, 255892, 155210, 266459, 295315, 312307, 371857, 349739, 402500, 553068, 563396, 577937]
21172E77937k3218n6604J35027j5598j54569q2415P0768K7125n3919k1908q9925
21161C12701j03647J00070J8315J9738J00125Q6273P3577L2651j20650j91464
21151C27689r3037Q0553J03577L3223N3655k835j679J1349K01370J74833m1584
21140H47114m7517J51255J9728M6150l8243n0465n6939k888J23003J54707J70172
21129A316077R6816J22323J73379O9306r5190P1351L13463K83613J69909K57119
21119B778166K84757K95613J64183M8015P0546O5146J58486J31946K20509L33955
21109D551322J73461L01851O31517N54049N17833N00193O50607N49347Q46373
21100I276553Q49110Q82896R31093J127967J458936J778943K446300L146074M155845
$$ y = [577937, 554719, 498115, 633142, 617544, 462975, 380560, 451328, 478453, 424534, 402626, 312701, 209054, 309124, 327439, 347177, 447302, 533575, 607152, 639803, 519153, 327689, 234652, 315205, 418782, 452005, 505660, 502825, 501146, 512495, 713865, 888698, 847114, 799597, 950852, 970580, 1016730, 978487, 928022, 871083, 868195, 991198, 1145905, 1316077, 1412893, 1535216, 1708595, 1777901, 1682711, 1754062, 2067525, 2351138, 2521047, 2778166, 3062923, 3358536, 3522719, 3570734, 3641280, 3706426, 3864912, 3996858, 4217367, 4551322, 4724783, 5026634, 5658151, 6212200, 6730033, 7230226, 7880833, 8430180, 9276553, 10125663, 11008559, 11939652, 13067619, 14526555, 16305498, 18751798, 21897872, 26053717]
21091B6053717N615814P520130J0212422J3681902J8644074K2754065K1499454
21084A25981578J3710856L721409j453803J73235M318964L067749m505979j2582920
21076A32431089j4891278j0355980p64420R458104J6411420J5694598P749888
21069A55733421k114972o606265m255582j52190k641944j1404155k0211705k3458241
21061H4888367k0740409j5003799r989947o855439m961939l696765l008039k568879
21053A8063151j970765j565381j242522q58224o46601p42013r07391q06777n95980
21044H727497m95292n27532n39195m12182o54075o16095k06135l02228k19402
21035D755361j18240j50636l79523k20704K1776o3965k78985k74691l36410l63708
$$ y = [26053717, 31669531, 39189661, 49402083, 63083985, 81728059, 104482124, 125981578, 139692434, 143413843, 141960040, 142133275, 146452239, 149519988, 145014009, 132431089, 117539811, 107183831, 106419411, 115877515, 132288935, 147983533, 155733421, 153618449, 147012184, 142756602, 142604412, 139962468, 128558313, 108346608, 84888367, 64147958, 49144159, 39154212, 32298773, 27336834, 23640069, 20632030, 18063151, 16092386, 14527005, 13284483, 12426259, 11779658, 11037645, 10130254, 9323477, 8727497, 8232205, 7704673, 7165478, 6753296, 6099221, 5483126, 5276991, 4974763, 4755361, 4637121, 4486485, 4106962, 3886258, 3908034, 3844069, 3565084, 3290393, 2953983, 2590275]
21025B590275j50287j98544k11131n1026j21902j37602r1339O8454J5046N1456
21015A763400l7153j02551j39261j84951k13660m9132J1117q3425j0379K4739
21005I78744R012N893n1152p085L4230q2072j19388j9535J6655K7568q9958r678
20993F93234N2905L9203r179j11247p4328J31357J12771M7295j04820j82316j67900
20982D26975J27148M5895p4012J85303k009m4578j61492j70147j1445P6905Q3360
20971D81903l1775J02900M7703K2958J4477m9581j93350n9568J01802j02650k0378
20960C14441J07415L0086R5236Q2063j12132o4904j48830o192P1248l9720K4875
20949C53586K325N7095J8619n3558N0081j29834j1187P8553O2491k7322L4287
$$ y = [2590275, 2439988, 2241444, 2030313, 1979287, 1857385, 1719783, 1628444, 1696898, 1711944, 1763400, 1726247, 1623696, 1484435, 1299484, 1085824, 1036692, 1047809, 964384, 954005, 978744, 987756, 993649, 942497, 935412, 969642, 887570, 768182, 748647, 765302, 792870, 702912, 693234, 746139, 785342, 776163, 664916, 590588, 721945, 834716, 882011, 777191, 594875, 426975, 554123, 600018, 526006, 711309, 709300, 664722, 503230, 333083, 321638, 398543, 481903, 450128, 553028, 600731, 623689, 638166, 588585, 395235, 335667, 437469, 334819, 314441, 421856, 451942, 547178, 629241, 517109, 452205, 303375, 297183, 368431, 328711, 353586, 355911, 413006, 431625, 378067, 428148, 298314, 287127, 365680, 428171, 400849, 435136]
20938D35136L9499o326R9466J3323j53025q5372l0947M1363k3442j13789o5078
20927A50808m911q9291J8314J19256Q4344N2792K3146r1957p731J9961J36364
20916D11095j8267M1602J3099j18700j32027k1624n0680O525P0767P8270j85098
20905I4962j31918j00575P1728J44349P9248p520J02663O561p910q9249K1351
20894A83690n5333m4052J59549J95941o4305q6739m3733j01324m0014k2307K2796
20883A04169J28807O9897j8616j42927k8543P3074R2320l4604m9980m6134m3643
20872A03820j34152j60083j2782R1687p367M50K520R4855n346j07699M2744J07601
20860A6248j16724k8871J88876P0246j83614K8010J00134l1993J3993j2578M2477
$$ y = [435136, 474635, 468309, 567775, 581098, 428073, 342701, 311754, 353117, 329675, 215886, 150808, 145897, 56606, 74920, 194176, 278520, 331312, 354458, 262501, 254770, 274731, 411095, 392828, 434430, 447529, 328829, 196802, 175178, 124498, 131023, 201790, 280060, 94962, -36956, -137531, -65803, 78546, 157794, 150274, 252937, 259498, 251588, 162339, 183690, 128357, 84305, 243854, 439795, 375490, 288751, 245018, 143694, 103680, 81373, 104169, 232976, 302873, 284257, 141330, 112787, 185861, 278181, 243577, 193597, 147463, 103820, -30332, -190415, -203197, -111510, -118877, -118427, -115907, -21052, -26398, -134097, -91353, 16248, -100476, -129347, 59529, 129775, -53839, -25829, 74305, 42312, 56305, 43727, 86204]
20849H6204J23737j07293j31792K1606J13244m3301j27354J5975K53140m5832
20839A58334q7213J28601j3645j09571J6616q3063j27538j5017m9458N6528Q102
20828a17324j4224o6762N8147P8232o9928N6569k8213P7204J68234M7397L9196
20817B28528l2236m3723o3949m1261p0505k5355L7224J94712J65054k5415r1256
20806B31818k18435j93395l6795J90611K09146j4351j19243j23084n8014j5215
20796a46957J90342P7814l6988O6023J10448o0929m2071J040L1648n1423j03288
20785C5659R8418N5902k2917n5017Q9266J23849j5168j4351k6208q1795J04458
20774B92096j789j30657m5263m2857j16544k6573j5158J4169l6651L9727O7636
$$ y = [86204, 209941, 102648, -29144, -7538, 105706, 62405, -64949, -48974, 204166, 158334, 71121, 199722, 186077, 76506, 93122, 10059, -117479, -132496, -181954, -125426, -117324, -131548, -198310, -140163, -61931, -131859, -75290, -103503, -26299, 141935, 189332, 228528, 196292, 152569, 88620, 47359, -23146, -48501, -11277, 183435, 348489, 323074, 231818, 13383, -180012, -216807, -26196, 182950, 168599, 49356, -73728, -131742, -146957, 43385, 121199, 84211, 150234, 260682, 199753, 157682, 158722, 190370, 138947, 35659, 134077, 189979, 167062, 112045, 201311, 325160, 309992, 295641, 269433, 187638, 292096, 290307, 159650, 114387, 71530, -45014, -71587, -86745, -72576, -109227, -69500, -1864]
20763a864q6871K9488J05325J2499L364n9623O6923N7792K3517J09780K1831n0871
20751B31290q5574M669J25486n1633n1119k3419r1508k4805r1914p0146R4647
20740c4026J23876K5350P2322q4788K6051j04625L1257k437l8733n0924M2244
20729E567j190M9100Q1677j21463k5029J08101M3333K4372N6516p7358o1109J0118
20717I2635q4970l3168o0506L7602N7081j02563j38013k6125J06641J40119r8790
20706a10057j01719L6196j0566k3927N5256l6668N0004r7528j55827J10668J22556
20695a61612J00766O1680n2478l7317O7185Q8708J43571j6350k3437N7776K5853
20684B54345n8632j05223R012J95394J79578j02610q7368j77360K8185J75902
$$ y = [-1864, -88735, -59247, 46078, 58577, 61941, 2318, 69241, 127033, 150550, 260330, 282161, 231290, 145716, 150385, 275871, 224238, 173119, 149700, 58192, 33387, -58527, -128673, -34026, 89850, 115200, 187522, 102734, 128785, 24160, 55417, 52980, 14247, -36677, 5567, 4377, 53477, 135154, 13691, -11338, 96763, 140096, 164468, 220984, 143626, 82517, 92635, 7665, -25503, -86009, -48407, 8674, -93889, -231902, -258027, -151386, -11267, -110057, -211776, -175580, -186146, -210073, -154817, -191485, -141481, -239009, -394836, -284168, -161612, -60846, 834, -51644, -88961, -21776, 66932, 210503, 194153, 170716, 228492, 254345, 195713, 90490, 99502, 294896, 474474, 371864, 284496, 107136, 135321, 311223]
20674C11223O6279j10217M5505j47025k01311R726J5512p5900r0215J34801J45877
20663A04255J7298n052l0842O3222j25145j09863n6242J47261N3073R169N823
20652G2957l957m9162k1878Q3830N3483N7159K14813L1260j2072j5149j24986
20641B86298k15011j17113R0854J07503j16555P577p2667n2125j08326k2277J19305
20630i2537Q3938J27566N4817k02078l04008k0394L71802J99256j64970o9498
20620a6106K1512m8064K3080O2723q5928J05268Q356R354m7717j45474j2260M7757
20608g7499Q7758l4784m8598K3246N4916N4626R3949l738j12200j30283o5077
20597a57684N9912J74943O0326k6543p6215J6697J0992n201o7308K4883l9923
$$ y = [311223, 377502, 267285, 312790, 165765, -35546, -25820, -10308, -86208, -176423, -41622, 104255, 121553, 116501, 85659, 148881, 23736, -86127, -142369, 4892, 57965, 67134, 72957, 69000, 19838, -2040, 81790, 135273, 192432, 407245, 438505, 426433, 411284, 286298, 71287, -45826, 45028, 152531, 35976, 43553, -29114, -81239, -189565, -211842, -92537, -8599, 118967, 173784, -28294, -332302, -352696, 19106, 218362, 53392, -16106, 5406, -42658, -19578, 43145, -42783, 62485, 70841, 80195, 32478, -112996, -125256, -77499, 10259, -24525, -73123, -49877, 5039, 59665, 153614, 149876, 37676, -92607, -157684, -97772, 77171, 137497, 110954, 34739, 51436, 62428, 57227, -10081, 14802, -25121]
20586b5121j15127L0271J94244J8827j08082k03420K8721Q9455N1832L6409r4261
20575i6252M7478J41597O1448l3452J00989p8021o3395J45509q7504l8975J01545
20564B00967j61334j12757J99906J24267n1607j19161q9755n4154J9688O0544
20554A6604J08678m270j4628k9949k4414J4051N1203L7580j24193j07103J3981
20543f2460M7517O042J21580J59992k1123j03199Q3136K5367p5611M4893L9992
20532B66126j2921p4174m7416R0691j0068j00592N0241L2170L1664q4597Q5566
20521B26690Q8221q4729Q670Q3481k413K4331J75613J84630P7118J75046m7594
20510I09064k14275l2101J30248J2559r0754q3460q042O9157O05o9202J74925
$$ y = [-25121, -140248, -109977, 84267, 103094, -4988, -208408, -179687, -90232, -38400, -1991, -96252, -48774, 92823, 154271, 120819, 221808, 143787, 80392, 225901, 138397, 99422, 200967, 39633, -73124, 126782, 251049, 199442, 80281, -9474, -63628, -43940, 16604, 125282, 121012, 106384, 76435, 52021, 66072, 117275, 154855, 30662, -76441, -62460, -14943, -8901, 112679, 272671, 251548, 148349, 231485, 256852, 181241, 226134, 266126, 253205, 179031, 131615, 222306, 212238, 111646, 161887, 194057, 225721, 141124, 226690, 314911, 230182, 238852, 322333, 319920, 344251, 519864, 704494, 781612, 956658, 909064, 694789, 662688, 792936, 805495, 714741, 631281, 623239, 692396, 693001, 623799, 798724]
20499G98724j8491m2711L499r0975L2683j40160j59027m9613n3318L1607k8231
20488B83987P394l0881L4469K638k7623j46152j35557j050J20404R420k03138
20477h6089k9753J12351K6420K1471J4200J2721j57450m1423J04757M4050K8072
20466D9327m7010l8185Q131O1180M2841P8472N8437K1735j9381j3186Q0411q9514
20454A93258N7763k932J3087j9373p3209O5361q5686j57984J0597P5754N3249
20443A29885j0101j6419p2625k43831l7950Q0514J08471J31130k0510j9686J6389
20432D5267M4888M5378K1632p5291j2974r1735n7352K8587N9581P8003L1512l4271
20420H3225J21529P0160r8246n2228K3307J2272M3793j17306L8533l5474j00283
$$ y = [798724, 780233, 737522, 741021, 650046, 682729, 542569, 383542, 333929, 280611, 312218, 283987, 291381, 260500, 294969, 297607, 269984, 123832, -11725, -12775, 107629, 117049, -86089, -115842, -3491, 22929, 44400, 58600, 71321, -86129, -127552, -22795, 21255, 49327, 2317, -35868, -27737, 33443, 76284, 154756, 213193, 234928, 215547, 202361, 282772, 193258, 251021, 248089, 261176, 241803, 168594, 233955, 148269, -9715, 882, 76636, 129885, 119784, 103365, 30740, -213091, -251041, -170527, -62056, 69074, 48564, 28878, 45267, 90155, 135533, 157165, 81874, 68900, -22835, -80187, -51600, 7981, 85984, 117496, 83225, 204754, 274914, 176668, 124440, 147747, 160019, 203812, 86506, 125039, 89565, -10718]
20409a0718L4586P4415l0418o5536J29371R2924P6929J4013q6184j23692p4138
20398C1552Q0430n6328o6181R2373J80286k4769j12107p2051m8718m839P7495
20387G7143J22430r6461K421Q2190j2098j10208l7277r878p8433n4337o6016J09710
20375g0814N2644l5057l8901q9893J0010K11534N5956j60022n7945J6928P409
20364i8151J15438q2549R5634P8345k8170K747O8269K1735O69J1768J43322P0557
20352C99614p1008k17087k4544l4594n3100O5289L2666M0249k0845j40962j81509
20341b05831Q3693N6235O6533J6735P8939L3245j21822o3833J32901r3111n6806
20330g3122R3772J96007m5058o5578j03616r6635N1189n2071J07492J71538n0941
$$ y = [-10718, 23868, 98283, 67865, 2329, 131700, 224624, 301553, 315566, 229382, 105690, 31552, 111982, 55654, -10527, 81846, 262132, 237363, 125256, 53205, 4487, -352, 77143, 199573, 103112, 105533, 187723, 175625, 65417, 28140, 18262, -60171, -114508, -180524, -70814, -18170, -53227, -92128, -182021, -172011, 39523, 95479, -64543, -122488, -105560, -98151, 17287, -65262, 30372, 108717, 80547, 83294, 151563, 173298, 173967, 185735, 329057, 399614, 328606, 111519, 86975, 52381, -719, 64570, 97236, 137485, 116640, -24322, -205831, -122138, -65903, 630, 17365, 96304, 129549, 7727, -56106, 76795, -16316, -73122, 20650, 216657, 171599, 106021, 2405, -94230, -43041, -95112, 12380, 183918, 132977]
20319A32977J7804R0421j99185J4922L2552j29995P0311J23882K9298R2946J01440
20308C77373K6989J3662j44022j50350J9020J19454Q7199L2195p8979j42268m6669
20297A13604p9431J13388J3481K3620l2428n5324m0550j30500K2026n7916L8904
20286g1126K1403n9561j4806N1245J65935j704O7693L5955j81123L1988J14381
20275A60280P2107K6056m0082l0390j15149j26722K15995L701Q298M2053j11219
20264A04928q0894K8713J57146N2293m0220j49511j63323L5948j2273L9229N613
20253b2351R6956r0114j40208J35377J15780Q2908L3123k1809K2484k3424l9643
20242A49079j36153m4931N8119n2600o5096L1503J72654L0183m2302J4704o6528
$$ y = [132977, 150781, 241202, 42017, 56939, 89491, -40504, 29807, 153689, 182987, 275933, 377373, 404362, 418024, 274002, 123652, 142672, 262126, 349325, 381520, 302541, 160273, 113604, 34173, 147561, 161042, 184662, 152234, 96910, 56360, -74140, -52114, -110030, -71126, -49723, -109284, -124090, -72845, 93090, 91386, 159079, 195034, 13911, 45899, 160280, 232387, 258443, 218361, 187971, 72822, -53900, 162095, 165796, 174094, 216147, 104928, 24034, 52747, 209893, 262186, 221966, 72455, -90868, -54920, -67193, -27964, -22351, 74605, -15509, -155717, -20340, 95440, 178348, 211471, 189662, 212146, 188722, 149079, 12926, -32005, 26114, -26486, -91582, -60079, 112575, 142758, 100456, 115160, 48632]
20231D8632j57556P6074J41603J48958J7672j10234j0922o9713q4690n1610Q749
20220d3037j11192L1338J70954J09811j02800r8088q117j01053l8531J4015J54950
20209b1750Q8951J69748J42897M5738J01875O5142O5580r7428j09505M2729o5637
20198D28340R4407p3348q3097O5925Q1742L673R4230J28133P9825n7409k01784
20187E60637j83875p2040q7994j61298j09933M1236K8747O0883J07Q08o7960J2213
20175B1531k8584Q1354J10290L2409n2822N657n4155k0098n5588l6498M7393J01750
20163A52639J13881M9321q3496m6836k42029p7384K03446P2102J20305M0363J29382
20152D31694L26865R6326o7432q0396k27086j94656O4594J72515J42219l0967
$$ y = [48632, -108924, -32850, 108753, 257711, 275383, 165149, 154227, 84514, -176, -51786, -43037, -154229, -122891, 48063, 157874, 55074, -43014, -51131, -152184, -190715, -176700, -21750, 67201, 236949, 379846, 425584, 527459, 592601, 658181, 560753, 451248, 493977, 428340, 522747, 449399, 366302, 432227, 513969, 517642, 611872, 740005, 819830, 762421, 560637, 376762, 304722, 216728, 55430, -54503, -13267, 15480, 76363, 76470, 77278, 9318, 21531, -7053, 74301, 184591, 217000, 164178, 169835, 115680, 95582, 39994, 3496, 50889, 152639, 266520, 315841, 232345, 185509, -56520, -133904, 69542, 141644, 261949, 302312, 431694, 758559, 854885, 787453, 707057, 479971, 285315, 349909, 522424, 664643, 633676]
20142F33676l4850m0084J04031M7943L7644O121n7112k13809j49141p9167p6515
20131A78737O9288r7567q2643M7367p9043o4887J24451M8440p7895k1260N1162
20120I6150k1887K4591O2013j3328N016N4109P0965r8866j21119P4847J03228
20109B35719k5570O3263Q0326j09962o1135N752J80490J6795j15101J1881r9751
20098A82707K169M4059J1652J17136N8213q9142J4783l2883o5222J24508L1670
20087C99650n2214l9674K1090k227j44104o9472N0761n6299K0291J08283k8293
20076B07792m6726N9190M5732L7470j33790l4219J0071N9492M6219l4103Q060
20065B25188q6791o9214M4050m9260l0369j01167O1788P1411R8959M0690j53279
$$ y = [633676, 598826, 558742, 662773, 710716, 748360, 754481, 697369, 483560, 334419, 255252, 178737, 248025, 150458, 67815, 115182, 36139, -28748, 95703, 144143, 66248, 44988, 96150, 74263, 98854, 160867, 147539, 152555, 206664, 277629, 178763, 57644, 132491, 235719, 210149, 273412, 353738, 243776, 182641, 188393, 368883, 385678, 270577, 282458, 182707, 184876, 228935, 240587, 357723, 415936, 326794, 341577, 308694, 243472, 367980, 399650, 347436, 307762, 328852, 326625, 182521, 113049, 163810, 107511, 127802, 236085, 207792, 161066, 220256, 265988, 303458, 169668, 135449, 145520, 205012, 251231, 217128, 225188, 138397, 69183, 113233, 63973, 33604, -67563, -5775, 65636, 164595, 205285, 52006]
20054E2006m0418N9884k8839O9822P4840M0558J9605k4991p9925q7791M1818N5314
20042A51883K7941j7144l6270j0046Q3965p438J8056J54844L0315o7478j9827
20031C08801K6890k2087j24827q2940K3152m3102m7951N052j6319J42103J24440
20020B93212n821n7051j08527L0036O789J18379N5264j96557j06228K94397J54096
20009D77989p5040k81759j09593L3213k3414o9287J87458P4709p6310n6733O5931
19998A47164M741k5581k1183m5843Q3607l6244n9202J9005R425Q7528L5398j495
19986A97320o3509J45726J98826N1020q8912m8867p3637j38198J3035L0895L1723
19975B55422k667J4904J31081R4427p1571J3443J47007l3028K5223n8763q0326
$$ y = [52006, 11588, 71472, 42633, 112455, 187295, 227853, 247458, 222467, 142542, 54751, 96569, 151883, 179824, 162680, 126410, 116364, 200329, 192891, 210947, 365791, 396106, 328628, 308801, 335691, 313604, 188777, 105837, 128989, 85887, 37936, 42988, 26669, 168772, 293212, 287391, 230340, 121813, 151849, 158638, 277017, 332281, 135724, 29496, 323893, 477989, 402949, 121190, 11597, 44810, 21396, -47891, 139567, 214276, 137966, 81233, 147164, 151905, 126324, 105141, 59298, 142905, 106661, 47459, 66464, 75889, 163417, 198815, 197320, 133811, 279537, 478363, 529383, 440471, 391604, 317967, 179769, 192804, 223699, 255422, 252755, 267659, 398740, 493167, 421596, 435039, 582046, 549018, 574241, 515478, 435152]
19964D35152m7768j4980K8960L8677J5657J30783K7131J3594m1763p7812Q2346
19953E89977K92541J30541J04431j3211q0234j26411o8497j36055m4694J8089
19943F66477K10696P1626l9589K7963J80572K2612j29709q9631k55669r5892Q155
19932E77611p0988J1381l4547k1168L0704K06109J72332l7572j2826R1012l9405
19921H72643j13874j88029o7317P6770J74024J02131j18753j21711Q0397j72168
19911E24113q4590Q3705M0560n3648J51667J267J6294J14379K4193R040J6057
19900H43037J58473P3925n2512k19467j17680j15540p7253M1696J06973M7822
19890F89474L3644k661P0252J8276n8713j10853r0446j8920J236j04254p660N2040
$$ y = [435152, 387384, 372404, 401364, 440041, 455698, 586481, 613612, 627206, 585443, 507631, 589977, 882518, 1013059, 1117490, 1104279, 1024045, 897634, 829137, 693082, 648388, 666477, 877173, 948799, 909210, 937173, 1117745, 1140357, 1010648, 921017, 665348, 569456, 577611, 506623, 518004, 483457, 462289, 492993, 699102, 871434, 833862, 821036, 912048, 872643, 758769, 570740, 503423, 580193, 754217, 856348, 737595, 615884, 696281, 524113, 439523, 523228, 563788, 510140, 661807, 663074, 679368, 793747, 817940, 826980, 843037, 1001510, 1075435, 1022923, 803456, 685776, 570236, 492983, 534679, 641652, 689474, 723118, 720457, 790709, 808985, 750272, 639419, 548973, 530053, 531289, 427035, 419375, 471415]
19878D71415N3629o7734j94313L9771J21709O1031o643j9690k2801k04719k3474
19867B08181O0979p0947M3388J15519n0010k6402j870j48720l5939J26600M5629
19856B66408R0241j65555j69707R4728R9427k2411J72420K54510k8152o6073p0396
19845D55440r7067k6419M4140L197L1547L1018j15329n6394O6246Q9462q807o0448
19833C56586M1223r0843q8542O5982m7594Q3960m3829o1204r3471j15685K4465
19822C1048J09515M7599P3548r1595j2689J7406M472K957Q7496J9742q5573l7357
19810A66569O8320O2879n4640J4462J25329m269o671K8814m0678L3869M9274l6359
19798D06899J30878k7508n5321m1102m8925N00Q8918j1603k6518M8959M6613j38392
$$ y = [471415, 525044, 457310, 262997, 302768, 424477, 485508, 478865, 459175, 436374, 231655, 208181, 269160, 198213, 241601, 357120, 307110, 280708, 278838, 130118, 94179, 220779, 266408, 356649, 191094, 21387, 116115, 215542, 193131, 365551, 620061, 591909, 525836, 455440, 358373, 331954, 376094, 379291, 410838, 441856, 326527, 270133, 336379, 425841, 417034, 356586, 397809, 306966, 218424, 284406, 236812, 320772, 276943, 215739, 122268, 6583, 31048, 140563, 188162, 261710, 170115, 157426, 174832, 179304, 182261, 269757, 289499, 203926, 166569, 234889, 297768, 243128, 257590, 382919, 378650, 371979, 400793, 360115, 393984, 443258, 406899, 537777, 510269, 454948, 413846, 364921, 365421, 454339, 442736, 416218, 465177, 511790, 373398]
19786C73398r2153n0003l0268J06574J34492j38588r2734n634n370J28388J8232
19775C46334Q575k360R9260P4476j76151l8667j9732J30127K3925J12342L2623
19764E90752j20307n1531M1306K16254J07343q9255J1286m9175l0786J01473J06518
19753H33878L3706l71j07801j18089J6443O9526m8021n0059M309j7352N8305j2479
19741F61995q0723J6831O3447J66500Q2140M6429j00799j02158N8214O1131J24791
19730I97798j2431k4658J38706L690j32086K8551N4897J50113J20094O1398J52239
19719A538311Q7776j6269J10161J4598l3226K32750J56607K07121K92492L42859
19709B933180L60755K92262J75366J51531K28271M31011L43318K71698M26680
$$ y = [373398, 281245, 231242, 200974, 307548, 442040, 303452, 210718, 205084, 199714, 328102, 346334, 354909, 352549, 451809, 526285, 350134, 311467, 291735, 421862, 445787, 558129, 590752, 470445, 418914, 460220, 676474, 783817, 694562, 705848, 656673, 625887, 727360, 833878, 867584, 867213, 759412, 641323, 657766, 727292, 679271, 629212, 633521, 616169, 674474, 661995, 581272, 598103, 661550, 828050, 910190, 956619, 855820, 753662, 811876, 873007, 997798, 985367, 960709, 1099415, 1103105, 971019, 999570, 1054467, 1204580, 1324674, 1386072, 1538311, 1626087, 1609818, 1719979, 1734577, 1701351, 1934101, 2090708, 2297829, 2590321, 2933180, 3293935, 3586197, 3761563, 3913094, 4141365, 4572376, 4915694, 5187392, 5614072]
19700E614072O94139Q57891R34220J240194J689989K166766K923550M072265N663366
19691B5856452P849010J1193505J6593802K2792462K1315525O962955r083190
19684A03480521k0666532k2593726j5114068p910228l250889j59134K857245N966360
19676D2609549R899438J5466421K1445599J8351205K974468j2344999k2458360
19669G5943321k2842893j5329247r065405n583979l621725k541096j663510q65933
19661A4429533m97331l24073n63306o89322o36144l76548p5654N9488K92754L79436
19651A1998833L52842J65025j12218j90983l7541K37031R91366J585644K229152
19642A7219151K924788M322237O035189Q406293J1886026J7332055K5032737K8384863
$$ y = [5614072, 6308211, 7166102, 8100322, 9340516, 11030505, 13197271, 16120821, 20193086, 25856452, 33705462, 44898967, 61492769, 84285231, 105600756, 112563711, 103480521, 82813989, 60220263, 45106195, 37195967, 33945078, 33785944, 36643189, 42609549, 52508987, 67975408, 89421007, 107772212, 110746680, 98401681, 75943321, 53100428, 37771181, 28705776, 23121797, 19500072, 16958976, 15295466, 14429533, 13932202, 13608129, 13044823, 12355501, 11719357, 11342809, 11267155, 11326643, 11619397, 11998833, 12351675, 12516700, 12404482, 12213499, 12175958, 12412989, 13404355, 14989999, 17219151, 20143939, 24466176, 30501365, 38907658, 50793684, 68125739, 93158476, 121543339]
19634A21543339J5950031m735676k1220608k8422180k2393784j2495097n807119
19627D2418906j312572K093148N684801J0110588J6183402K3970539K5710824
19620A24859636J1329234r053325k3985944k9793994k3140413j3942575q360435
19613B7912184n428286l968633k944794k085495j648279j205760j033416r35176
19605H662345q19249o06678n60613m86514l25532k63387k35567l46012m92987
19596D525806n59234m55138n04872k91281p75p6404m4964l8186j74712j29004
19586B251236m7943k63264j32613o1045J28959J4358p4281j9850j93147p5489
19576A526921k9872k5092j78039O202P8246q5291j2982J36817J1643j03937j29337
$$ y = [121543339, 137493370, 132757694, 111537086, 83114906, 60721122, 48226025, 42418906, 41106334, 43199482, 48884283, 58994871, 75178273, 99148812, 124859636, 136188870, 127135545, 103149601, 73355607, 50215194, 36272619, 27912184, 22483898, 18515265, 15570471, 13484976, 11836697, 10630937, 9597521, 8662345, 7843096, 7236418, 6675805, 6189291, 5863759, 5600372, 5364805, 5018793, 4525806, 3966572, 3511434, 3006562, 2715281, 2714506, 2638102, 2593138, 2554952, 2380240, 2251236, 2203293, 1940029, 1807416, 1746371, 1875330, 1889688, 1815407, 1795557, 1602410, 1526921, 1497049, 1471957, 1293918, 1300120, 1378366, 1293075, 1280093, 1416910, 1428553, 1324616, 1195279]
19565A195279J6963n9165M9871n884r583j3350P7977j14880r1074L7325K181Q9783
19553A175443p5004k8005k4063k6327p1727q6564r8858p4926K149L5434j6464
19542G11088M0923L1587m3956J65158P4396P2588L2729k798k2479j339J03266
19531A161163j4910K4546P6991O4438L6396m1992r8998p2353k7986J20354J19896
19520A347545J20616L5534p1003M399j3559m8278K16678J67783J12161R9927J43874
19509B115677K52572K16158J42939J86662M1530J73629M001J06199J64163j04470
19499C299060r3983N4711q2366O2378K51157K88283M56203P43608P29542O79671
19489F388264N95509J35637m39160o42407n78973k74115r951K22605L49845L54095
$$ y = [1195279, 1212242, 1153077, 1202948, 1197064, 1187481, 1174131, 1252108, 1137228, 1046154, 1083479, 1085660, 1175443, 1100439, 1072434, 1048371, 1022044, 950317, 863753, 764895, 689969, 692118, 727552, 711088, 752011, 783598, 739642, 904800, 979196, 1051784, 1084513, 1081715, 1059236, 1057897, 1161163, 1146253, 1170799, 1247790, 1312228, 1348624, 1306632, 1207634, 1135281, 1107295, 1227649, 1347545, 1468161, 1503695, 1432692, 1437091, 1423532, 1375254, 1591932, 1759715, 1871876, 1971803, 2115677, 2368249, 2584407, 2727346, 2914008, 2955538, 3129167, 3133168, 3239367, 3403530, 3299060, 3205077, 3259788, 3177422, 3239800, 3490957, 3779240, 4235443, 4979051, 5708593, 6388264, 6983773, 7119410, 6680250, 6037843, 5458870, 5184755, 5174804, 5397409, 5747254, 6101349]
19479F101349M45914N24609N91613N71113Q40113R81977J297737J801371K610269
19470A5766065L227543L262894L059491K380168Q87083K6833K8211J150642L105944
19461C2894874M580929N519227P178500R913518J5376498K3464075L0946574K5479138
19453A55353333O256022r848836k0352890j8733974j2547791q144823o301838
19446H5679203n652108l684967j231597K256031P208904R546099P436414M612083
19438A06170062L406839M240292M632374J937065m164239q409405p171368k441941
19430I8199679J172758Q02757J87991J137426L896325N398244K595077m408152
19422A08982105r225323q948827n535470l702701m286791m293378l456774r14408
$$ y = [6101349, 6547263, 7071872, 7663485, 8234598, 9074711, 10056688, 11354425, 13155796, 15766065, 18993608, 22256502, 25315993, 27696161, 28583244, 28610077, 28638288, 29788930, 32894874, 37475803, 42995030, 50173530, 60087048, 75463546, 98927621, 129874195, 155353333, 161609355, 151760519, 131407629, 112673655, 100125864, 91981041, 85679203, 80027095, 76342128, 75110531, 77366562, 84575466, 94121565, 101557979, 106170062, 109576901, 113817193, 118449567, 120386632, 116222393, 107812988, 100641620, 98199679, 99372437, 100175194, 100363185, 101500611, 105396936, 110795180, 113390257, 108982105, 99756782, 90807955, 85272485, 81569784, 77282993, 72989615, 69532841, 68618433]
19414F8618433o66236j591334j759853M8135M567839J0196672J5744424J9808042
19406A14966122K1485442K3290640K0219313Q917781o030901k2637929k8841615
19399A31368853k5737944j6268155n773713K878033J0983395K0479507K8194622
19392A46124598K1812607l1992j8776021l0946002k8012246j7911461j1693816
19385F0565667q601394p721262p093803n867929m674416l316255k315859j458264
19377A9516485r65551l95596k37272K9822P31047J357556J083974m28809j856426
19368A8835230k704454k547350j866134j256713o92528l71219k22887k33649j69372
19359H770924j67671K80662K61771k63655l26504j70558l59503n02625o56297
$$ y = [68618433, 67952197, 66360863, 64601010, 64649145, 69216984, 79413656, 95158080, 114966122, 136451564, 159742204, 179961517, 188879298, 182848397, 160210468, 131368853, 105630909, 89362754, 83589041, 86467074, 97450469, 117929976, 146124598, 167937205, 167905213, 149129192, 118183190, 90170944, 72259483, 60565667, 51964273, 44243011, 37149208, 31281279, 26606863, 23290608, 20974749, 19516485, 18550934, 18155338, 17918066, 17947888, 18678935, 20036491, 21120465, 20691656, 18835230, 16130776, 13583426, 11717292, 10460579, 9768051, 9396832, 9173945, 8940296, 8770924, 8603253, 8883915, 9145686, 8882031, 8555527, 8384969, 8025466, 7522841, 6866544]
19350F866544q52785r47547q09356l35629k86532p2837o8539j56980l9188J2396
19340C309547m436O7709J30287j34488j37946k88777l48574j75112j68964q8802
19330B160444j2652J2819j43438j61915m796Q7664N3737J8079o1922n9027L4737
19319A923730o7177j87861n3091m2000m3225j42970l9498J33499J2359r0118J8163
19308A421811p1110O6086J9512q0050r7108m0J27020J9493N4869j05393j44209
19297A210881Q8062J11009l7458J21062J13837j25644j65223Q8436J6605K4807
19287A446374l7438j2624K6680O2825M5055K2515O5748m0301k9270M3312K4281
19276A617157M6031j6168m0959n0632j13130l2196L8692J30927j747P0839L4974
$$ y = [6866544, 6013759, 5066212, 4256856, 3921227, 3634695, 3561858, 3493319, 3336339, 3297151, 3309547, 3305111, 3372820, 3503107, 3368619, 3230673, 2941896, 2593322, 2418210, 2249246, 2160444, 2147792, 2160611, 2017173, 1855258, 1850462, 1938126, 1991863, 2009942, 1948020, 1888993, 1923730, 1856553, 1668692, 1615601, 1573601, 1530376, 1387406, 1347908, 1481407, 1493766, 1403648, 1421811, 1350701, 1416787, 1436299, 1356249, 1259141, 1259101, 1386121, 1405614, 1460483, 1355090, 1210881, 1298943, 1409952, 1372494, 1493556, 1607393, 1481749, 1316526, 1404962, 1421567, 1446374, 1408936, 1396312, 1422992, 1485817, 1530872, 1553387, 1619135, 1578834, 1549564, 1592876, 1617157, 1663188, 1647020, 1606061, 1555429, 1442299, 1410103, 1448795, 1579722, 1577975, 1648814, 1683788]
19265A683788R2371k6660k01661J4661j8654p856K9753N0222N9543k7511n6828
19254A591168N2691j19195n7889Q0168J11443J76560o2855j68905Q780q0847j28485
19243A402634P6935K04780K3547R203J04526J7370j0573L3641N7948q6369J32123
19232A965765L3547r2577j5447J2830J99382j5667q6626j47200o8080J75912M4896
19221B006735j1768J18323L6099J22036L4284L8870J17057m9049j14557M0979
19211B339009k5649K5999R2665Q3745J90583J91380M1641Q580J12475r8610Q0436
19200C042254J86211M6955O6964K48180J57114J35590L24464M19830L55698L81606
19190E364866L58280M63257M55385M90506N71366N94873Q81281J013607J195617
$$ y = [1683788, 1776159, 1749499, 1547838, 1562499, 1543845, 1535989, 1565742, 1615964, 1675507, 1647996, 1591168, 1643859, 1524664, 1466775, 1546943, 1658386, 1834946, 1772091, 1603186, 1611966, 1531119, 1402634, 1479569, 1684349, 1707896, 1717099, 1821625, 1838995, 1828422, 1862063, 1920011, 1833642, 1965765, 1999312, 1906735, 1891288, 1904118, 2103500, 2087833, 2001207, 1854007, 1785927, 1961839, 2006735, 1994967, 2113290, 2149389, 2271425, 2305709, 2344579, 2461636, 2412587, 2298030, 2339009, 2313360, 2339359, 2432024, 2515769, 2706352, 2897732, 2939373, 2947953, 3060428, 2961818, 3042254, 3228465, 3275420, 3342384, 3590564, 3747678, 3883268, 4207732, 4627562, 4983260, 5364866, 5723146, 6186403, 6641788, 7132294, 7703660, 8298533, 9179814, 10193421, 11389038]
19181A1389038J455519J948392K740391L543763M834679O572593R027272J2821382
19173E4333029J8064733K2335936J9722048J4632031J2609153J0905175Q316673
19166A60918778L612573p044010j2228358j1828246j3653811j7230054j9743728
19159H2803144k0788547j6352721j0871278o998234m662846l153103k455970j985818
19151A5534627j493231j263739q33684o11779n06441o65105n94790k87552o9649
19142I208657P8548K08701L26211L99051J24892j04677k38616k04694J28817M17624
19132A0344514N20302P15132Q95989J037442J338917J828898K275848L085988
19124B2043030M303731O258244R021878J3086025J7437373J7542831J3071624
$$ y = [11389038, 12844557, 14792949, 17533340, 21077103, 25911782, 32484375, 41511647, 54333029, 72397762, 94733698, 114455746, 129087777, 141696930, 152602105, 160918778, 164531351, 157487341, 145258983, 133430737, 119776926, 102546872, 82803144, 62014597, 45661876, 34790598, 27792364, 23129518, 19976415, 17520445, 15534627, 14041396, 12777657, 11943973, 11332194, 10825753, 10160648, 9565858, 9278306, 9208657, 9287205, 9495906, 9822117, 10221168, 10346060, 10241383, 10002767, 9798073, 9926890, 10344514, 10864816, 11579948, 12475937, 13513379, 14852296, 16681194, 18957042, 22043030, 26346761, 32605005, 41626883, 54712908, 72150281, 89693112, 102764736]
19117A02764736J0646335R120105P320513M763701k427684r667595r935816j0526367
19109A02057928j3294344j5365497j7096053j5255457j0298596o488353m490523
19102A9769105l135752k282689j749282j489594j192752r25463r38513o69424
19094G385636n16403m20542l03807l53360l06154m97654o11121j74040J8413j75954
19084D045014q3002j57152l91977l10308r0299o9676j12824k25167m4571M8563
19074B608601J70715J15455p5204j79867l21102k13881k8274j24680j06936o7180
19064A777647j01358o3919j82742j23444J2930M0420Q7486j9844j02095o8390
19054A256691J8648m8047j2282O8394R7954j8076r9386L2479J5780J30393P5931
$$ y = [102764736, 113411071, 122531176, 129851689, 134615390, 132187706, 122520111, 112584295, 102057928, 88763584, 73398087, 56302034, 41046577, 30747981, 24259628, 19769105, 16633353, 14350664, 12601382, 11111788, 9919036, 8993573, 8055060, 7385636, 6869233, 6448691, 6144884, 5791524, 5485370, 4987716, 4376595, 4202555, 4220968, 4045014, 3962012, 3804860, 3412883, 3102575, 3012276, 2942600, 2829776, 2604609, 2560038, 2608601, 2779316, 2894771, 2819567, 2639700, 2318598, 2104717, 2076443, 1951763, 1844827, 1777647, 1676289, 1612370, 1429628, 1306184, 1319114, 1359534, 1447020, 1427176, 1325081, 1256691, 1275339, 1227292, 1215010, 1283404, 1381358, 1363282, 1263896, 1296375, 1312155, 1442548, 1518479]
19043A518479J32660M6363o4833r239j72744m6807J7948Q3164L4264R4320M372
19032A637947p7359P3303J76918M5606r1476q4505q1444k8052m9403L7598j0792
19021A548341j09088l9320k37803k54836J0938K07698J81674J05563p5699j29096
19011A208372m7274j13635n3192j0993J9759O6874L6389J6609j05529j55549j6988
19000H44843J02376R5723K0299N4143M0833K49117J76135Q3324L6706j44774K2540
18989A581265p5084k54474k0227p632j35923j52132L6243J08946k5877j33426
18979I21679J6728J18092M3492o6493q9686l786j13208j76425p0901k2615J90438
18968G47315J47573O2908P954q7025j44569M8957M8800R556J9096N4583q1811
$$ y = [1518479, 1651139, 1697502, 1632669, 1623430, 1450686, 1403879, 1421827, 1504991, 1539255, 1633575, 1637947, 1560588, 1633891, 1810809, 1856415, 1764939, 1680434, 1598990, 1570938, 1521535, 1559133, 1548341, 1439253, 1399933, 1162130, 907294, 918232, 1125930, 1307604, 1413167, 1337468, 1208372, 1161098, 1047463, 994271, 983278, 1003037, 1069911, 1106300, 1122909, 1017380, 861831, 844843, 947219, 1042942, 1063241, 1117384, 1158217, 1407334, 1583469, 1666793, 1703499, 1558725, 1581265, 1506181, 1251707, 1231480, 1223848, 1087925, 935793, 972036, 1080982, 1055105, 921679, 938407, 1056499, 1099991, 1033498, 943812, 940026, 826818, 650393, 579492, 556877, 747315, 894888, 957796, 965750, 878725, 734156, 783113, 831913, 841469, 860565, 915148, 833337]
18957H33337l6806j3945n2511M5084J16471J64285J30243J16155r3324L2901P0011
18946A311901k498o7887j06996n458j7149K27725P8601o3129N6076R7944J22767
18935A631897n7875j46975j97106o6746j80621N2626Q4997k8904o4854P7745p8371
18924A025813j11318k2959q269j1875j03300j48875r74P7719K9391n2982O5922
18913G38293K21101J74016M974j03898k4805j66304M4182O4741J15763n8609J1968
18902A021422J17950K2083K60984J20520j02127j09822J8314j24093j33747K3107
18892A114591J1617R0183J90021O7858J07094p4467k00262j88831j35306o1599
18882I20899o9065p6474N4714Q7109P1434P5026N3772r2442q9007j31948l2985
$$ y = [833337, 796531, 782586, 730075, 775159, 891630, 1055915, 1186158, 1302313, 1208989, 1241890, 1311901, 1309403, 1241516, 1134520, 1129062, 1111913, 1339638, 1418239, 1355110, 1411186, 1509130, 1631897, 1574022, 1427047, 1229941, 1163195, 982574, 1035200, 1120197, 1091293, 1026439, 1104184, 1025813, 914495, 891536, 883267, 871392, 768092, 619217, 618243, 695962, 725353, 672371, 738293, 959394, 1133410, 1138384, 1034486, 1009681, 843377, 887559, 952300, 1068063, 1009454, 1021422, 1139372, 1161455, 1422439, 1542959, 1440832, 1331010, 1349324, 1225231, 1091484, 1114591, 1126208, 1216391, 1406412, 1474270, 1581364, 1506897, 1306635, 1117804, 982498, 920899, 851834, 775360, 830074, 917183, 988617, 1063643, 1117415, 1024973, 935966, 804018, 771033]
18871G71033K867l5643j29117n6414q0988J3042P8795j5849q3272J1651P7375
18860E53480o1979M5328M8026l2880k4378l9072j3269M5587J364j4650n522J04192
18848F06227J66211j3746j35454k9680P6730j0136j35468Q084M7040k9530j1954
18837E38324N0295q1414k6593J07925Q6349Q3466m0510j54419k8894L0911j3079
18826E52361J8031o4341M4615N7997m2316L0371l4224O208k12524J8633M1241
18815D16052J2491J32877K9806L7728n319j84036L5076o955J11243Q1519r4462
18804E66020j40854k4325n080o6651Q2969J2391j91070k258J41283K51772P4583
18793F98780j25033n2578k9709K473n7156P0348J4146p3405n1177O8560K2863
$$ y = [771033, 773900, 738257, 609140, 552726, 471738, 484780, 563575, 547726, 464454, 476105, 553480, 491501, 536829, 584855, 551975, 527597, 488525, 475256, 520843, 522207, 507557, 502035, 606227, 772438, 758692, 623238, 593558, 670288, 660152, 524684, 532768, 579808, 550278, 538324, 588619, 507205, 480612, 588537, 674886, 758352, 717842, 563423, 534529, 565440, 552361, 570392, 506051, 550666, 608663, 566347, 596718, 562494, 568702, 356178, 374811, 416052, 428543, 561420, 591226, 628954, 623635, 439599, 474675, 467720, 578963, 660482, 566020, 425166, 400841, 395761, 329110, 412079, 424470, 233400, 231142, 372425, 624197, 698780, 573747, 521169, 491460, 493933, 436777, 507125, 521271, 447866, 396689, 465249, 488112]
18782D88112K4091Q2995J13305N8850l4970k2106q0813K2964P3815K19795K54748
18771A200786k5947J34676K30862K93821J90313j03179P0475l69198m18246j39942
18761A064421j19325L9408j49063j57954J9898J54018l7788O9256J7404j90607
18751G09668j60353j7577J99807J59246j4209M4788J05331L5418q3039k00596
18741G78484o3363L9461N816j3862n4454o0228o1217n391O7127R0933K7264R326
18729G59896p5424N5650N95l2591j1487l388n8537K211N837j27563Q7936o157
18717E96978r367l9061P0394M1641N943j80529J67611J10245q6078j0909M5648
18706G12516N921k8036n2448P441k1095l3538J15161j04998J139R9827O4192j7872
$$ y = [488112, 512203, 595198, 708503, 767353, 732383, 710277, 629464, 652428, 726243, 946038, 1200786, 1174839, 1309515, 1540377, 1834198, 2024511, 1921332, 1991807, 1622609, 1204363, 1064421, 945096, 984504, 835441, 677487, 697385, 851403, 813615, 882871, 900275, 709668, 549315, 531738, 731545, 890791, 876582, 921370, 1026701, 1062119, 979080, 778484, 715121, 754582, 760398, 746536, 692082, 631854, 570637, 565246, 632373, 723306, 750570, 759896, 684472, 740122, 740717, 708126, 696639, 693251, 634714, 636925, 642762, 515199, 603135, 596978, 587611, 548550, 618944, 660585, 666528, 485999, 653610, 763855, 677777, 666868, 712516, 718437, 690401, 637953, 645394, 624299, 590761, 705922, 600924, 602063, 701890, 766082, 748210]
18694G48210O3161J23473n2221Q281j8500l7578o6510K2978N812O8521Q2917Q1474
18682A030018l452j43258K776k0766K9570p3037q2680L2836j80855m7836J29305
18671F72621Q8998j530k4347k3347N2046P8197P2737J25887O4474j6233m0471
18660A049032k7315j81796l3996M7796J72775L8973n2690J33853J66190J40271
18650A453093J15658R8427M8585J92081L7772P5285J46015o2123k0515K5849J6998
18639B127125j01382k63671k12436l9799o4485J8717R5091R7522J01563n849M9776
18628A802172M8644M3358o3163j05533R9787J31068m5161K5338J07295K76889
18618B320694J59858P9047J68161K50223K13785L79305L57440K65510J32787Q6155
$$ y = [748210, 811371, 934844, 882623, 890904, 872404, 834826, 768316, 791294, 797106, 865627, 948544, 1030018, 1026566, 883308, 886084, 865318, 894888, 821851, 739171, 772007, 591152, 543316, 672621, 761619, 760089, 735742, 712395, 764441, 842638, 915375, 1041262, 1105736, 1089503, 1049032, 1021717, 839921, 805925, 853721, 1026496, 1065469, 1012779, 1146632, 1312822, 1453093, 1568751, 1667178, 1715763, 1907844, 1945616, 2020901, 2166916, 2104793, 2084278, 2110127, 2127125, 2025743, 1762072, 1549636, 1509837, 1445352, 1464069, 1559160, 1656682, 1758245, 1752396, 1802172, 1850816, 1894174, 1831011, 1725478, 1825265, 1956333, 1911172, 1936510, 2043805, 2320694, 2480552, 2559599, 2727760, 2977983, 3191768, 3571073, 3928513, 4194023, 4326810, 4412965]
18608D412965M3225K3611J39529J90216L90469P19007R62483J093495J636127
18599I611127K342207L363447L784092K512617O34548n94462j204471r48749j385752
18590A8114604j730772j815854r27797R6723J159405J418778L7246j013762j875870
18581A3462701j659413p93903k01459M60470R74782J256730J664443K363668L501965
18572B1029984M175923L856600L836371M903266O880456O757056J759838k465497
18564E0733997n571794m837277j885863r29767n83243o7387J112777K185911P67170
18555D0924524j672190l183170l172650j489108M80739K585583M672720O874248
18547D6020696R547715J0355307R852827J0939216J4560260K1332903K4709097
$$ y = [4412965, 4456190, 4479801, 4619330, 4809546, 5200015, 5919022, 6881505, 7975000, 9611127, 11953334, 15316781, 19100873, 21613490, 22248038, 21653576, 20449105, 19500356, 18114604, 16383832, 14567978, 13640181, 13736904, 14896309, 16315087, 16352333, 15338571, 13462701, 11803288, 11009385, 10807926, 11268396, 12243178, 13499908, 15164351, 17528019, 21029984, 25205907, 29062507, 32898878, 37802144, 44682600, 51439656, 53199494, 50733997, 45162203, 40324926, 38439063, 37509296, 36926053, 36858666, 37971443, 40157354, 40924524, 39252334, 36069164, 32896514, 31407406, 31888145, 34473728, 39146448, 46020696, 55568411, 65923718, 75776545, 86715761, 101276021, 122608924, 147318021]
18540A47318021J9083502J3228782P528076o92987q650507j2387952j3602081
18533A51824854j0964060r060606p045275m360402J535974O341558Q824266O520854
18525A43617163J305432M38367J413464P66763o420872j3705796j9058806j7786196
18517I0569519j1259053n583057j297824K393537O242174J0757540J6403069K3700889
18509A31926794L1747460L7650118L6267131L0397106K7326769K1309142Q872619
18502C25497139j4663783l6965370m4811498l7972599j8043458Q16798J4366034
18495A88223263K5267165L9012224M7704597L1423665k847344l7959383o0965307
18488B29858880n8612280m3313867k8342981j7059954j0014647n176581j295313
$$ y = [147318021, 166401523, 179630305, 187158381, 186465394, 177814887, 165426935, 151824854, 140860794, 131800188, 124754913, 120394511, 121930485, 128272043, 137096309, 143617163, 144922595, 145360962, 146774426, 147541189, 141120317, 127414521, 108355715, 90569519, 79310466, 73727409, 72429585, 74823122, 81065296, 91822836, 108225905, 131926794, 163674254, 201324372, 237591503, 267988609, 295315378, 316624520, 325497139, 310833356, 273867986, 229056488, 191083889, 173040431, 173857229, 188223263, 213490428, 252502652, 300207249, 331630914, 328783570, 290824187, 229858880, 171246600, 127932733, 99589752, 82529798, 72515151, 67338570, 66043257]
18481F6043257J615712J520771j382864l631413m647940k403179J158517K510887
18473F0783748M49007j910020n639543p182105o516156n120197k728877k21696
18465C1914161J769686K416045N82570k134950m423619n318747m434985l159952
18457A7210209k266024j584936j153009q67112n74491n19315n45122n75082l63170
18448H761948m25660k59236p3409k17899J23354J481l3263M9586K80656P86442
18438H994000J252667J207817M92146n72323j101622j402844q77811m81150j06541
18429G404339J70392L97628P42764R00971P50832L0916p03190j182227j061856
18420G450569p26592k69333l00012k02382l4917O3150j31941j12768l02630m79120
$$ y = [66043257, 67658969, 69179740, 67796876, 64165463, 59517523, 57114344, 58272861, 60783748, 61232755, 59322735, 53683192, 46501087, 39984931, 34864734, 32135857, 31914161, 33683847, 36099892, 36682462, 34547512, 30123893, 24805146, 20370161, 17210209, 14944185, 13359249, 12206240, 11339128, 10764637, 10245322, 9700200, 9125118, 8761948, 8336288, 8077052, 8003643, 7785744, 7909098, 7910579, 7877316, 7926902, 8207558, 8994000, 10246667, 11454484, 11946630, 11374307, 10272685, 8869841, 7992030, 7510880, 7404339, 7574731, 7972359, 8715123, 9616094, 10366926, 10397842, 9694652, 8512425, 7450569, 6723977, 6454644, 6154632, 5952250, 5917333, 5980483, 5848542, 5735774, 5433144, 4954024]
18410D954024l40350r9243n028j94265j69020O6304L7364O068j58997j77665J11713
18399D030905N7445n0475l6238p0195r7028O2934q1657j31225M665p0024r2230
18388C526877m1339j1341J27842q0235p1416J31466M8845j29266o0989R1761R3799
18377C626004o3561R4007q5351J7266L423o6680m7747K1947P1253n4085m5859
18366C470617Q5784n9693P7713J9016j5085n662l4840j45264j51259j97739N0415
18355C094003J53491l4509j58191O8340L0643o7508J8815j81041n7350j7858p6350
18344B772485L8763k3125o9491R9603n6867q4466j72898J1398o6637k8316k9273
18333B391176j60381j13324o0511J8031N7285m9658L9100Q281J20629J7790j01580
$$ y = [4954024, 4613674, 4514431, 4509403, 4315138, 4146118, 4212422, 4249786, 4255854, 4096857, 3919192, 4030905, 4088350, 4037875, 4001637, 3931442, 3834414, 3897348, 3815691, 3684466, 3689131, 3619107, 3526877, 3485538, 3474197, 3602039, 3521804, 3450388, 3581854, 3630699, 3501433, 3440444, 3532205, 3626004, 3562443, 3656450, 3571099, 3588365, 3591788, 3525108, 3477361, 3499308, 3570561, 3516476, 3470617, 3556401, 3496708, 3574421, 3593437, 3578352, 3572690, 3537850, 3392586, 3241327, 3043588, 3094003, 3247494, 3212985, 3054794, 3123134, 3153777, 3086269, 3105084, 2924043, 2866693, 2848835, 2772485, 2811248, 2788123, 2718632, 2818235, 2761368, 2676902, 2504004, 2515402, 2448765, 2420449, 2391176, 2230795, 2117471, 2056960, 2074991, 2132276, 2082618, 2121718, 2129999, 2250628, 2268418, 2166838]
18322B166838m4095m0730j52496R0770J59933l6224o5791K4921O4261o9771k4115
18311B073501L5645j0147o1807L0711O2280j05695j11721m4048O9337r1084n836
18300A841136J27186j83624j11436j01272p0689J73135P6842j21231q6150o0805
18290A483092J07226M8813L2198K35832K0002P2412p3013p4998l9652m8085o3665
18279A700162j87490r3139J03159J46801N7829l0358k44127p8832O9703O8830
18269A512538j6447j94984k24560k9361J41167J30567m1721k0645O6824k6696
18259A296682j26157P3107L9319m3360N0205m0513L2870k3530L767O5267j1987
18248A315670j5883M7619o5640j96344M9696O9292O9190M1500o6518k4855j0175
$$ y = [2166838, 2122743, 2082013, 1929517, 2020287, 2180220, 2143996, 2078205, 2103126, 2167387, 2097616, 2073501, 2109146, 2098999, 2037192, 2067903, 2130183, 2024488, 1912767, 1868719, 1938056, 1846972, 1841136, 1968322, 1784698, 1673262, 1571990, 1501301, 1674436, 1751278, 1630047, 1543897, 1483092, 1590318, 1639131, 1671329, 1907161, 1927163, 1999575, 1926562, 1851564, 1811912, 1763827, 1700162, 1512672, 1419533, 1522692, 1669493, 1727322, 1696964, 1452837, 1374005, 1443708, 1512538, 1496091, 1301107, 1076547, 1047186, 1188353, 1318920, 1277199, 1256554, 1323378, 1296682, 1170525, 1243632, 1282951, 1239591, 1289796, 1249283, 1282153, 1258623, 1262390, 1327657, 1315670, 1299787, 1347406, 1281766, 1085422, 1135118, 1204410, 1273600, 1315100, 1248582, 1223727, 1213552]
18237A213552j73735p5066j3047j42143J186N079J53917J59214Q2536l8078j1679
18226A161736m3074r4647J9045J56753n451n8199O0954L1223m0786r1483j27306
18215I68765l2042p85K1711Q0846m404R587J88222l873r0365q4833j06467j37912
18203H08450p301O6509n8738r0023P6914J1430n201m2373P1508Q1919p6606j0623
18191H25865P1505p6093R8689o6265L7169J3710J07644N4821N5168K6360j48530
18180A000043q8403J00688n1970p0558Q442K26843P2620N054r1884j55272M2279
18169I97882J90902K3657q9110r0009O7093K240m0146K09986j27133j40178J792
18158A006976k2499N0521J02664J26985m5869j1302O9702K70975N4963m5308O3366
$$ y = [1213552, 1039817, 964751, 951704, 809561, 810747, 815826, 969743, 1128957, 1211493, 1173415, 1161736, 1118662, 1024015, 1043060, 1199813, 1194362, 1136163, 1197117, 1228340, 1187554, 1096071, 968765, 936723, 935938, 957649, 1038495, 1034091, 1043678, 1231900, 1228027, 1137662, 1052829, 946362, 808450, 801149, 867658, 808920, 718897, 795811, 807241, 802040, 759667, 831175, 913094, 836488, 825865, 897370, 821277, 919966, 853701, 890870, 904580, 1012224, 1067045, 1122213, 1148573, 1000043, 911640, 1012328, 960358, 889800, 898242, 1125085, 1197705, 1202759, 1110875, 955603, 997882, 1188784, 1212441, 1123331, 1033322, 1100415, 1102655, 1062509, 1272495, 1145362, 1005184, 1006976, 984477, 1034998, 1137662, 1264647, 1218778, 1207476, 1277178, 1548153, 1603116, 1557808, 1621174]
18147A621174l1051n48J15346L1033J9214J6703J45346N0882J38202R4658J81659
18136B382618J76630K58295K44604K08756J92262K84354M75499K61886L43768
18127D828672M35729O29653P22775Q22738R11802J216266J611225J935186K578472
18118A5692518L447063M832809O816710R598125J3661534J9179762K8064238M4315280
18110A45608039O5237922N1267169o650550l8142332o9526695n6150273l0495632
18103F1147648j7060218j0274924o855829m897859l715363k790587k030777j681236
18095A1840855j465688j141866q79966q77441o59840m44429m66772l79398n05733
18086E019722m23836k75208k77939l00548j47146k70886k8102j44922k10422j42494
$$ y = [1621174, 1590123, 1589575, 1704921, 1735954, 1755168, 1771871, 1917217, 1968099, 2106301, 2200959, 2382618, 2559248, 2817543, 3062147, 3270903, 3463165, 3747519, 4223018, 4484904, 4828672, 5264401, 5894054, 6616829, 7439567, 8351369, 9567635, 11178860, 13114046, 15692518, 19139581, 23972390, 30789100, 40387225, 54048759, 73228521, 101292759, 145608039, 210845961, 262113130, 255462580, 217320248, 147793553, 91643280, 61147648, 44087430, 33812506, 26956677, 22058818, 18343455, 15552868, 13522091, 11840855, 10375167, 9233301, 8353335, 7475894, 6816054, 6371625, 5904853, 5525455, 5019722, 4595886, 4320678, 4042739, 3742191, 3595045, 3324159, 3296057, 3151135, 2940713, 2798219]
18076B798219j51951k47923j98271p8158K5467n4845r0579j09139N1727p6775
18066A867772r5722K1367O8609N281J42553l7076j78241j06928j20850j46650
18056A420115O0126m5961M9000Q5824j07822j28312m3316N4134m5693j11155Q6309
18045A273249N9033M6791p8389j42862J0384K1300l5830M1942j7842r7180l3850
18034A046746K0786j5170L3126J38333O2235M7741J06450o5805q3094L4230Q1262
18023A406840N3536k1915J07733k0046O0687r3828j08656p138J08634J61636L9406
18012A686889j62168k60671j16314l3223k3427m4421j42674j07674P8035J10927
18002I85279o9650o4556r6329J0736J46291J1007j94663j69341k2646J36247J31038
$$ y = [2798219, 2646268, 2398345, 2200074, 2121916, 2147383, 2092538, 2001959, 1892820, 1944547, 1867772, 1772050, 1793417, 1862026, 1867307, 2009860, 1972784, 1794543, 1687615, 1566765, 1420115, 1480241, 1434280, 1483280, 1569104, 1461282, 1332970, 1289654, 1343788, 1298095, 1186940, 1273249, 1332282, 1379073, 1300684, 1157822, 1168206, 1189506, 1153676, 1195618, 1177776, 1080596, 1046746, 1067532, 1052362, 1085488, 1223821, 1286056, 1333797, 1440247, 1374442, 1291348, 1325578, 1406840, 1460376, 1438461, 1546194, 1526148, 1586835, 1493007, 1384351, 1377213, 1485847, 1647483, 1686889, 1524721, 1264050, 1147736, 1114513, 1091086, 1046665, 903991, 796317, 874352, 985279, 915629, 851073, 754744, 765480, 911771, 922778, 728115, 558774, 536128, 672375, 803413]
17991H03413N2431P6924j8033J31941J02615R3658j11882q898J3891q7070j11768
17980I37222J4498J52011P9891m1192Q8711L8733r3766q9517l9850N5985j25153
17969I77573P8213j16971j49387r9787P8354R7864p3961j25720j30203l1676L4972
17958E39271M2851J12298p544j38841m8452N1510m7829J6518L3452J6326n2758
17947E16802k13558n9751j0972J6474J7605j8297m796L1879K0140M1888P8985
17936D16399l1152j3581j0820o3055J02612J17886J31721J0668Q4250M2450l1792
17925G55586q0539j81097j4457j6276r3008J22835J38428j5218j41957k24530
17915B49767k14924Q5315J21647q4196o6252Q3133j1486k9446Q8994o4905j03547
$$ y = [803413, 855844, 932768, 914735, 1046676, 1149291, 1242949, 1131067, 1122169, 1136060, 1048990, 937222, 951720, 1103731, 1183622, 1142430, 1231141, 1269874, 1176108, 1086591, 1046741, 1102726, 977573, 1055786, 938815, 789428, 689641, 767995, 865859, 791898, 666178, 535975, 504299, 539271, 582122, 694420, 686876, 548035, 499583, 551093, 503264, 519782, 553234, 569560, 516802, 303244, 243493, 232521, 248995, 266600, 248303, 243507, 275386, 295526, 337414, 416399, 385247, 371666, 360846, 297791, 400403, 518289, 650010, 660678, 744928, 787378, 755586, 675047, 493950, 479493, 463217, 370209, 493044, 631472, 616254, 474297, 249767, 34843, 120158, 241805, 157609, 91357, 174490, 163004, 133558, 222552, 157647, 54100]
17904E4100J00534M0834J16336q988j82541P0583l9130j02055J07992J2092n6058
17893A13699n1819J01292J74494J00178L0227p9880j32636O0913L3456M9878r1019
17882C08783K1895L8000j4678J2465l0522l9525n401j4250r587j37612j15956
17871A3612n2893R0448n551p107J6505M4913K4928R4468m329l4782r4576n6423
17859B9213J48401N0684p0585j875j9043J29999l6551p0251L6051o4562J37294
17848B68775k319j70784j11459j948N4297j6953q8294J8200J79831L8450o7521
17837A00275j68272J0162R3084N2065M846o2682k9436M2897J00005M1832N3024
17826B37800l8437J2267L8747J8992k05455j4785M8239m0763O3675N0433j268
$$ y = [54100, 154634, 195468, 311804, 302816, 120275, 190858, 151728, 49673, 157665, 169757, 113699, 61880, 163172, 337666, 437844, 468071, 388191, 255555, 316468, 349924, 399802, 308783, 330678, 368678, 354000, 366465, 335943, 296418, 291017, 276767, 267180, 129568, 13612, -39281, 51167, 45616, 38509, 55014, 99927, 124855, 219323, 214994, 180212, 85636, 29213, 177614, 228298, 157713, 155838, 136795, 266794, 230243, 159992, 196043, 131481, 268775, 266456, 95672, -15787, -17735, 36562, 19609, -68685, -50485, 129346, 167796, 100275, -67997, -57835, 35249, 87314, 92160, 29478, 42, 42939, 142944, 184776, 237800, 199363, 211630, 250377, 269369, 63914, 49129, 97368, 56605, 120280, 170713, 169445]
17815A69445r1724j05860k0339M8266J6267p9442R3173k9261j1646Q8943P4897
17804A52719J05616J08247o5151j50341j450Q008l8159m9862n8052M96P1176K4110
17792A07357Q0805j08306N8311j3023R035J432j01267p7290r011J48730N6343
17781A53116o2782J69962K17990j88225j49532K3786R1172N0799o4097r5296P4327
17770B21220J29736O170P5883l3429p2313N49r0694r1644r5965j9382J9485Q9381
17758A38997m70M297L1252P8345p3735j9736J88338M2907N6153j39273k04363
17747A02712o3648k104M1335j6511j0611R8647M9984l7274P7566k696j16109M600
17735A25891j01228P081J52918K399r908o6513r7914j4520k9954K5026j1830l4767
$$ y = [169445, 77721, -28139, -48478, -212, 16055, -63387, 29786, 525, -11121, 77822, 152719, 258335, 366582, 301431, 151090, 149640, 157648, 119489, 69627, 11575, 12071, 83247, 107357, 188162, 79856, 138167, 125144, 134179, 135611, 34344, -42946, -51957, 96773, 153116, 90334, 260296, 478286, 290061, 140529, 164315, 255487, 306286, 242189, 146893, 221220, 350956, 357126, 433009, 399580, 327267, 327816, 237122, 145478, 49513, 30131, 49616, 138997, 138527, 142824, 174076, 252421, 178686, 158950, 347288, 390195, 446348, 307075, 102712, 39064, 36960, 78295, 61784, 51173, 149820, 199804, 162530, 240096, 237400, 121291, 125891, 24663, 31744, 184662, 187061, 177153, 110640, 12726, -1794, -31748, -6722, -18552, -53319]
17723e3319m5396L008M3150K0075J19477O9586L5859J4878j04074P4241N2396
17712B29881j01656j25015l6000O0113k5918P7485K6214p9432l11064j30672n221
17701d21285k5604J25348J01088Q4659Q0731M9176Q8002K4989j20262j05278k8448
17690a46884L5921N2681j02325j20837L3928L7859k2311Q1364N2072L8699k4777
17679h4610J18075Q4049m3699p8240Q8592J434j26670p9563R5686l0213L7340
17668a7819M5575K7936J24569k2623k1981M6899P4099r3671r2993r1783K2469
17657F77M4J1894j0299J18594M6581J5845n5813p3568M7659Q412k1230L027N0243
17644A42066m0906k6498j91164r7993Q8336P5648M5988J30916J23287j71651j23749
$$ y = [-53319, -98715, -95707, -52557, -32482, 86995, 156581, 192440, 207318, 103244, 177485, 229881, 128225, 3210, -32790, 27323, 1405, 78890, 105104, 25672, -285392, -416064, -421285, -446889, -321541, -220453, -135794, -55063, -5887, 82115, 107104, -13158, -118436, -146884, -110963, -58282, -160607, -281444, -247516, -209657, -231968, -150604, -98532, -59833, -84610, 33465, 117514, 73815, -4425, 84167, 85601, -41069, -120632, -24946, -55159, -17819, 27756, 55692, 180261, 157638, 135657, 182556, 256655, 162984, 69991, -21792, 677, 721, 12615, 2316, 120910, 167491, 183336, 127523, 53955, 101614, 110026, 88796, 91823, 142066, 101160, 74662, -116502, -214495, -126159, -50511, -4523, 126393, 249680, 78029, -45720]
17633d5720j2592O7101L2024k9916j5512J18132P4375q338n7412P6220k2163j13389
17621F2810K3035q4963R7203R1568l3874j09877m2596j6837K4087m8684j3563
17610e1691J4214N7953L0697K867R1169J20367r5182j83736R266L5935m2367q669
17598a9177m4254O3300j08258j09101Q5622J24918J06167J09104K7832r0209q082
$$ y = [-45720, -58312, 8789, 40813, 10897, -4615, 113517, 187892, 179554, 122142, 198362, 176199, 62810, 85845, 882, 98085, 189653, 155779, 45902, 3306, -13531, 10556, -38128, -51691, -37477, 20476, 51173, 54040, 145209, 265576, 170394, -13342, -4076, 31859, -10508, -19177, -63431, -131, -108389, -217490, -131868, -6950, 99217, 208321, 236153, 145944, 137862]
$$ [...]
##END NTUPLES=NMR SPECTRUM
##END=
