##TITLE=Analysis number 315059
Compound Code cc 30513
Book Reference 441/167
Project Code adrs
Chemist Name colinb
##JCAMPDX= 6.0         $$ Bruker NMR JCAMP-DX V2.0
##DATA TYPE= NMR SPECTRUM
##DATA CLASS= NTUPLES
##ORIGIN= Bruker BioSpin GmbH
##OWNER= NMR
$$ XWIN-NMR		Version 3.5
$$ Fri Nov  4 10:14:07 2005 GMT Standard Time (UT+0h)  MAYBRIDGE\NMR@NMR_250MHZ
##.OBSERVE FREQUENCY= 250.131544655141
##.OBSERVE NUCLEUS= ^1H
##.ACQUISITION MODE= SIMULTANEOUS (DQD)
##.ACQUISITION SCHEME= undefined
##.AVERAGES= 16
##.DIGITISER RES= 18
##SPECTROMETER/DATA SYSTEM= dpx250
##.PULSE SEQUENCE= zg30
##.SOLVENT NAME= CDCl3
##.SHIFT REFERENCE= (INTERNAL, CDCl3, 0, 16.522)
##AUDIT TRAIL= $$ (NUMBER, WHEN, WHO, WHERE, WHAT)
$$ ##TITLE= Audit trail, XWIN-NMR		Version 3.5
$$ ##JCAMPDX= 5.01
$$ ##ORIGIN= Bruker BioSpin GmbH
$$ ##OWNER= NMR
$$ C:\u/data/dgb/nmr/ADRS/11910/pdata/1/auditp.txt
$$ ##AUDIT TRAIL=  $$ (NUMBER, WHEN, WHO, WHERE, WHAT)
(   1,<2005-11-04 10:13:30.55 +000>,<MAYBRIDGE\NMR>,<NMR_250MHZ>,
      <created by zg, POWCHK disabled, PULCHK disabled
       configuration hash MD5:
       62 19 C7 07 E1 42 D1 B7 37 6C 3D D0 77 39 F9 E6
       data hash MD5: 64K
       A3 21 A6 DD B9 30 AF 7E 34 DD E0 F4 27 9B F3 93>)
(   2,<2005-11-04 10:13:46.85 +000>,<MAYBRIDGE\NMR>,<NMR_250MHZ>,
      <Start of raw data processing
       ef LB = 0.3 FT_mod = 6 PKNL = 1 SI = 32K 
       data hash MD5: 32K
       4D 60 53 02 F7 8C 96 21 FD 5D 03 13 26 84 2D 3E>)
(   3,<2005-11-04 10:13:49.35 +000>,<MAYBRIDGE\NMR>,<NMR_250MHZ>,
      <apk 
       data hash MD5: 32K
       47 74 74 99 52 4E 95 21 8A 34 94 1B 6D 63 B1 3B>)
(   4,<2005-11-04 10:13:50.49 +000>,<MAYBRIDGE\NMR>,<NMR_250MHZ>,
      <abs ABSG = 5 
       data hash MD5: 32K
       14 6B 7B 57 08 86 A7 C4 D4 1D EC 55 EA 92 12 8E>)
$$ ##END=
$$ 
$$ hash MD5
$$ 06 C1 39 72 05 0A B3 E3 FE FB 03 E4 BF 67 EC 47
##$RELAX= 
##$RELAX= 
##$RELAX= 
##$RELAX= 
##$RELAX= 
##$RELAX= 
##$RELAX= 
$$ Bruker specific parameters
$$ --------------------------
##$DU= <C:\u>
##$EXPNO= 11910
##$NAME= <ADRS>
##$PROCNO= 1
##$TYPE= <nmr>
##$USER= <dgb>
##$AMP= (0..31)
100 100 100 100 100 100 100 100 100 100 100 100 100 100 100 100 100 100 
100 100 100 100 100 100 100 100 100 100 100 100 100 100 
##$AQSEQ= 0
##$AQ_mod= 3
##$AUNM= <au_zg>
##$AUTOPOS= <1 >
##$BF1= 250.13
##$BF2= 250.13
##$BF3= 250.13
##$BF4= 250.13
##$BF5= 500.13
##$BF6= 500.13
##$BF7= 500.13
##$BF8= 500.13
##$BYTORDA= 1
##$CFDGTYP= 0
##$CFRGTYP= 5
##$CHEMSTR= <none>
##$CNST= (0..31)
1 1 145 1 1 1 1 1 1 1 1 1 1 1 1 1 1 1 1 1 1 1 1 1 1 1 1 1 1 1 1 1 
##$CPDPRG= <>
##$CPDPRG1= <>
##$CPDPRG2= <>
##$CPDPRG3= <>
##$CPDPRG4= <mlev>
##$CPDPRG5= <mlev>
##$CPDPRG6= <mlev>
##$CPDPRG7= <mlev>
##$CPDPRG8= <mlev>
##$CPDPRGB= <>
##$CPDPRGT= <>
##$D= (0..31)
0 1 0 0 0 0 0 0 0 0.06 0 0 0 0 0 0 0.0002 0 0 0 0 0 0 0 0 0 0 0 0 0 0 
0 
##$DATE= 1131099209
##$DBL= (0..7)
120 120 120 120 120 120 120 120 
##$DBP= (0..7)
150 150 150 150 150 150 150 150 
##$DBP07= 0
##$DBPNAM0= <>
##$DBPNAM1= <>
$$ [...]
##$SUBNAM7= <"">
##$SUBNAM8= <"">
##$SUBNAM9= <"">
##$SW= 20.6930455092707
##$SWIBOX= (0..15)
0 0 3 0 0 0 0 0 0 0 0 0 0 0 0 0 
##$SW_h= 5175.983436853
##$TD= 65536
##$TD0= 1
##$TE= 295.16
##$TE2= 300
##$TE3= 300
##$TEG= 300
##$TL= (0..7)
0 120 120 120 120 120 120 120 
##$TP= (0..7)
150 150 150 150 150 150 150 150 
##$TP07= 0
##$TPNAME0= <>
##$TPNAME1= <>
##$TPNAME2= <>
##$TPNAME3= <>
##$TPNAME4= <>
##$TPNAME5= <>
##$TPNAME6= <>
##$TPNAME7= <>
##$TPOAL= (0..7)
0.5 0.5 0.5 0.5 0.5 0.5 0.5 0.5 
##$TPOFFS= (0..7)
0 0 0 0 0 0 0 0 
##$TUNHIN= 0
##$TUNHOUT= 0
##$TUNXOUT= 0
##$USERA1= <user>
##$USERA2= <user>
##$USERA3= <user>
##$USERA4= <user>
##$USERA5= <user>
##$V9= 5
##$VALIST= <valist>
##$VCLIST= <CCCCCCCCCCCCCCC>
##$VD= 0
##$VDLIST= <DDDDDDDDDDDDDDD>
##$VPLIST= <PPPPPPPPPPPPPPP>
##$VTLIST= <TTTTTTTTTTTTTTT>
##$WBST= 1024
##$WBSW= 4
##$XGAIN= (0..3)
0 0 0 0 
##$XL= 0
##$YL= 0
##$YMAX_a= 360074
##$YMIN_a= -280867
##$ZGOPTNS= <>
##$ZL1= 120
##$ZL2= 120
##$ZL3= 120
##$ZL4= 120
##$ABSF1= 16.522
##$ABSF2= -4.171173
##$ABSG= 5
##$ABSL= 3
##$ALPHA= 0
##$AQORDER= 0
##$ASSFAC= 0
##$ASSFACI= 0
##$ASSFACX= 0
##$ASSWID= 0
##$AUNMP= <proc_1d>
##$AZFE= 0.1
##$AZFW= 0.1
##$BCFW= 0
##$BC_mod= 0
##$BYTORDP= 0
##$COROFFS= 0
##$CY= 12.5
##$DATMOD= 1
##$DC= 0
##$DFILT= <>
##$DTYPP= 0
##$F1P= 14.0000005364418
##$F2P= -0.99999901652339
##$FCOR= 0.5
##$FTSIZE= 32768
##$FT_mod= 6
##$GAMMA= 0
##$GB= 0
##$INTBC= 1
##$INTSCL= 1
##$ISEN= 128
##$LB= 0.3
##$LEV0= 0
##$LPBIN= 0
##$MAXI= 10000
##$MC2= 0
##$MEAN= 0
##$ME_mod= 0
##$MI= 0
##$NCOEF= 0
##$NC_proc= -5
##$NLEV= 6
##$NOISF1= 0
##$NOISF2= 0
##$NSP= 0
##$NTH_PI= 0
##$NZP= 0
##$OFFSET= 16.522
##$PC= 1
##$PHC0= 80.09954
##$PHC1= 12.46424
##$PH_mod= 1
##$PKNL= yes
##$PPARMOD= 0
##$PSCAL= 4
##$PSIGN= 0
##$REVERSE= no
##$SF= 250.13
##$SI= 32768
##$SIGF1= 0
##$SIGF2= 0
##$SINO= 400
##$SIOLD= 32768
##$SREGLST= <1H.CDCl3>
##$SSB= 0
##$STSI= 32768
##$STSR= 0
##$SW_p= 5175.98343685301
##$SYMM= 0
##$S_DEV= 0
##$TDeff= 65536
##$TDoff= 0
##$TI= <Analysis number 999999
Compound Code 99
Book Reference 9
Project Code 9>
##$TILT= no
##$TM1= 0
##$TM2= 0
##$TOPLEV= 0
##$USERP1= <user>
##$USERP2= <user>
##$USERP3= <user>
##$USERP4= <user>
##$USERP5= <user>
##$WDW= 1
##$XDIM= 32768
##$YMAX_p= 445655499
##$YMIN_p= -990320
$$ End of Bruker specific parameters
$$ ---------------------------------
##NTUPLES= NMR SPECTRUM
##VAR_NAME=  FREQUENCY,     SPECTRUM/REAL,   SPECTRUM/IMAG
##SYMBOL=    X,             R,               I
##VAR_TYPE=  INDEPENDENT,   DEPENDENT,       DEPENDENT
##VAR_FORM=  AFFN,          ASDF,            ASDF
##VAR_DIM=   32768,         32768,           32768
##UNITS=     HZ,            ARBITRARY UNITS, ARBITRARY UNITS
##FACTOR=    0.157963299565203, 1,           1
##FIRST=     4132.6476996994, 0,             0
##LAST=      -1043.33573715361, 0,           0
##MIN=       -1043.33573715361, -990320,     0
##MAX=       4132.6476996994, 445655499,     0
$$ Real data points
##PAGE= N=1
##DATA TABLE= (X++(R..R)), XYDATA
$$ [...]
23096f2178o1222r4657j08914J87584J72707J94212j33466k53106J1770M8127
23086i9143K2563J63437K3604k3893M536K32557j23210K3129n4817O206J65354
23075C40323M7859l58235k58100J17254J86847j7656L7580K9010K182N3211J00279
23064B80554J14955l1877n7732k01700k29648n815j90920K11867K8612j08072
23054a89776j75941j0359J05209r5001o7206K78427K45889k33406j68898m9769
23044c60831m4513j59306O6622L41806M1789j51683o2779J34916k8065q606k6927
23033b57577k43676K4435N4329K10983L34688L47024j5223k13709l39744O3004
23023c5466K14500J43350J1276j71111L0797j39791N3603m2681j90221r0817M9140
$$ plain form
23096 -62178 -123400 -218057 -326971 -139387 33320 227532 94066 -159040 -147270 -99143
23086 -99143 -76580 86857 110461 86568 91104 323661 200451 223580 168763 174969 340323
23075 340323 388182 29947 -228153 -110899 75948 58292 95872 124882 127064 180275 280554
23064 280554 395509 363632 305900 104200 -125448 -131263 -322183 -110316 -81704 -189776
23054 -189776 -365717 -376076 -270867 -365868 -433074 -154647 91242 -142164 -311062 -360831
23044 -360831 -405344 -564650 -498028 -156222 -114433 -266116 -328895 -193979 -222044 -230650 -257577
23033 -257577 -501253 -476818 -422489 -211506 123182 470206 454983 241274 -98470 -35466
23023 -35466 179034 322384 333660 162549 193346 53555 107158 64477 -125744 -216561 -167421
23012a67421J04603K93863J49146j68905m4535R0735K46824J59248q2445l0958
23002E50155K9300j05188l54385o8871K49366K7799j00476l0027J04575j81167
22992A21081j43382R5092L8313j32977l28933p6504j1824k0968J23368j05806
22982d42540P3712J70024p8302O1215J35888P6780R4399J87203J05714m1187j15492
22971B27414k10839M5680J23215j8891J57200k0850J177k68326j57626j01897
22961b23743k65068K98310N04737J13655L7293N8475j77439j76862K7680j45009
22951E2029l24020N1771K37282m5198Q392j41547j20578l0764L18527p7643l8742
22940a10491q005O5299J18100o5697j549K11594j25854r1791J92777k27868k95641
$$ plain form
23012 -167421 -62818 231045 380191 211286 166751 257486 504310 663558 581113 550155
23002 550155 579455 474267 119882 51011 300377 328176 227700 197673 302248 121081
22992 121081 -22301 72791 111104 -21873 -350806 -427310 -439134 -460102 -336734 -442540
22982 -442540 -368828 -198804 -277106 -215891 -80003 -3223 91176 278379 384093 342906 227414
22971 227414 16575 62255 185470 166579 323779 302929 304106 35780 -121846 -223743
22961 -223743 -488811 -190501 314236 427891 465184 523659 346220 169358 197038 52029
22951 52029 -271991 -220220 17062 -28136 -19744 -161291 -281869 -312633 5894 -71749 -110491
22940 -110491 -118496 -53197 64903 -794 -2343 209251 83397 -8394 184383 -43485 -339126
22929c39126J27785J24201L0825n0197m4071q8338m6924j10089p2412K54240J45119
22918f8987l98256N1777J81287L7232k2995J08648q7216k4947K41971j05245j08834
22907a95565p0424j58065m7503J0052J15825J71007p5926j52539J06667J54958
22897a41513J65372j28523l69026O9397M30826k12466j07860L2120K07566N0787
22887c320J43047J7403j19591J34888j48855P1502J70630k3405j12089k54628
22877a24418O3697j66879O4100P7003o5279J89264K04848J78509J6055j83853
22867B53047J1508m3840K03207R3231k66946J4684M1976J19133j15605k76053
22857C4342j89750L1405M9366L20461L54504N5513k75536k11023k71543j39320
$$ plain form
22929 -339126 -211341 -87140 -56315 -106512 -150583 -238921 -285845 -395934 -468346 -214106 -68987
22918 -68987 -467243 -415466 -234179 -196947 -219942 -111294 -198510 -223457 18514 -86731 -195565
22907 -195565 -265989 -424054 -471557 -461505 -345680 -174673 -250599 -403138 -296471 -141513
22897 -141513 23859 -104664 -473690 -404293 26533 -185933 -293793 -261673 -54107 -3320
22887 -3320 139727 157130 37539 172427 23572 95074 265704 242299 130210 -124418
22877 -124418 -60721 -227600 -163500 -86497 -151776 37488 242336 420845 436900 253047
22867 253047 264555 220715 423922 517153 250207 264891 306867 426000 310395 34342
22857 34342 -155408 -124003 -74637 245824 600328 655841 380305 169282 -102261 -241581
22847b41581k43357K55668O94591J00510k09096k04844p4168N4047r7607O0771
22837I4934M8644j26327j44221J52841J14387k39044J12145P6935k80873n4003
22827b44582J11272K11654Q5133j83796j61057r0416r2386n1558K58942K71433
22817A14639J05045o051j2124j3912j64122j59380K43745J21307j86138l44115
22807c01106L4980L57680K5660l3060j0362n9011j3009r1505q9440R4083L44696
22796B59606K3827J6010o6128o8881j63339J15351J24348K5853O2787Q5163k29041
22785A85556j29931j95991r7649K22164P8653m3761L75302R9940k39748k62483
22775g948k18342k26813J16529K39411L00092M71917k2188p23431R742k28810
$$ plain form
22847 -241581 -484938 -229270 465321 565831 356735 151891 77723 131770 34163 94934
22837 94934 143578 17251 -126970 25871 140258 -98786 13359 90294 -190579 -244582
22827 -244582 -133310 78344 163477 -20319 -181376 -271792 -364178 -415736 -156794 114639
22817 114639 219684 213633 201509 187597 23475 -135905 107840 229147 43009 -301106
22807 -301106 -266126 91554 117214 84154 73792 14781 1772 -89733 -179173 -85090 259606
22796 259606 283433 299443 233315 164434 1095 116446 240794 266647 329434 414597 185556
22785 185556 55625 -140366 -238015 -15851 62802 19041 394343 494283 254535 -7948
22775 -7948 -226290 -453103 -336574 -97163 202929 674846 652658 -70773 -61031 -289841
22765b89841k29845q751K03718K19599P6650J26025j57442o8898N8778m2448O852
22754a05603J37942J41725J55193J66485j50189k43103q0719N3151o6739l02120
22744b93977j19704O1286M7695r8584Q9182K32894r104O3027j61721j9987k7362
22733b36355N0205N4132K1976p009n2712J15443R8917k24183j71161K5762K28782
22722i6203J42277m6829k51889j3141J1163J058K31036J16448k05519m58435l5462
22711f05496J65982K36708R3846P3828P9771j8011j74928J47496k8516n8416J725
22700h6011K57845M76930j84766m93650n6717j38682o1378J18922J02391R6191
22690C1075K04981N6327j02361j86340K68029K85061j46759k24281n9964K25554
$$ plain form
22765 -289841 -519686 -528437 -324719 -105120 -28470 97555 -59887 -128785 -70007 -112455 -105603
22754 -105603 32339 174064 329257 495742 345553 102450 21731 74882 8143 -293977
22744 -293977 -413681 -352395 -304700 -403284 -314102 -81208 -90312 -27285 -189006 -208993 -236355
22733 -236355 -186150 -132018 -110042 -117051 -169763 -54320 44597 -179586 -350747 -324985 -96203
22722 -96203 46074 -755 -252644 -265785 -254622 -253564 -22528 93920 -111599 -570034 -605496
22711 -605496 -439514 -202806 -108960 -35132 44639 26628 -148300 -804 -29320 -87736 -86011
22700 -86011 171834 648764 463998 -29652 -86369 -225051 -286429 -167507 -65116 31075
22690 31075 236056 292383 190022 3682 271711 556772 410013 185732 125768 351322
22680C51322K45767r1243k12884k10389M1388l0594N243J40194J0734O2720j52289
22669A59969m6344j34678P2478K68017N7500l26589j0425O7856j8030l21205j8614
22658b50065J9469j37234P1142K09026j66727o7943m1654K13739M18754J20128
22648C88635J15760j21130r5066N6121k00745j70927r3606J71873K0635N992L9897
22637A17439q9471n1286n4756J0814P5817J1607j95990J56503J26151L2748l33909
22626a94333l90490m8322L7373R6218K07546Q0197K28983J21641k39829j16197
22616b17213K47239P521k68058J3648K53453J94776r5002M3627J5259Q402k3956
22605A79696L5908M3296j18383p9114l7334j82469j02621q5388J21182L2660p5699
$$ plain form
22680 351322 597089 505846 292962 82573 123961 93367 98610 238804 249538 312258 159969
22669 159969 113625 -21053 51425 319442 376942 50353 39928 107784 89754 -231451 -250065
22658 -250065 -230596 -367830 -296688 -87662 -254389 -322332 -363986 -150247 268507 388635
22648 388635 504395 383265 288199 344320 143575 -27352 -120958 50915 71550 77542 117439
22637 117439 27968 -23318 -78074 -67260 8557 20164 -175826 -19323 106828 139576 -194333
22626 -194333 -584823 -633145 -595772 -499554 -292008 -211811 17172 138813 -101016 -217213
22616 -217213 30026 37547 -230511 -216863 36590 231366 136364 179991 195250 203652 179696
22605 179696 215604 258900 140517 61403 24069 -158400 -261021 -346409 -225227 -192567 -268266
22594b68266J89618Q9552L5521J72278j03192l16530k07936J78761M03393n8905
22584A14294N8123J80125l5440l99862q7295j05754Q7963p550M2374J73855n2474
22573c1641J01590K4408L06283j48493l44711k39794Q4974M23948m052P5757l0096
22562B18173L4484k33577N2943m3154O7729J54371R0960k38088L7375O1071j20195
22551H2092k84912j46107J29594K7736J83981q1731J20887L0148N5999j43323
22541b5636J95293J73145k91802j06327J42887N43n1901N3803n7288k59196j39374
22530c65853Q8424K22489j38543k38679j7811L29032Q9912O1045J86593J91599
22520D08208p5891p9767k8648K55j36907j11791J2602l1392j18091o3131J83541
$$ plain form
22594 -268266 -78648 10904 46425 218703 115511 -201019 -408955 -230194 173199 114294
22584 114294 172417 352542 317102 -82760 -170055 -275809 -187846 -195396 -153022 20833 -31641
22573 -31641 69949 94357 400640 252147 -92564 -332358 -247384 176564 172512 248269 218173
22562 218173 252657 19080 72023 28869 96598 250969 341929 103841 141216 202287 82092
22551 82092 -202820 -348927 -219333 -191597 -7616 -89347 31540 61688 117687 -25636
22541 -25636 169657 342802 51000 -55327 87560 88103 36202 90005 32717 -226479 -365853
22530 -365853 -277429 -54940 -193483 -432162 -449973 -120941 -31029 30016 216609 408208
22520 408208 332317 252550 223902 224157 87250 -24541 -11939 -43331 -161422 -224553 -41012
22509d1012q9366j5262K35357J70275Q759R4401N4417l3069p9793Q8627K19807
22498F13141m87591l14103J72191R553J63756j26634j7425J44280j43876k50083
22488b36791k36354P8826J53340p2910J18322J86776j3532j76027k87595j47316
22478f33261M1923J07071j8478j1457J95207J82284K78011J64006j20124j21371
22468F3811O8456M1396j85490m1384Q3803k46384l02536j4898M60595M69172j83130
22457B13411J95966k18146j61768p076j02078j11320j06205L27839r9872j52062
22447b21311l1172R3943J12976k5795j85618k11408K23519J63093O5313k6579
22437d3039R4260N1039n072r6367m5517j94757J02410J16584o1066k7942P0909
$$ plain form
22509 -41012 -130378 -145640 89717 259992 268751 363152 417569 384500 304707 393334 613141
22498 613141 125550 -188553 -16362 -6809 156947 30313 12888 157168 13292 -236791
22488 -236791 -473145 -394319 -240979 -313889 -195567 -8791 -22323 -198350 -485945 -633261
22478 -633261 -591338 -484267 -502745 -514202 -318995 -136711 141300 305306 185182 63811
22468 63811 132267 173663 -11827 -53211 30592 -215792 -518328 -533226 -72631 396541 213411
22457 213411 409377 191231 29463 22387 -79691 -191011 -297216 30623 -69249 -221311
22447 -221311 -252483 -158540 -45564 -71359 -256977 -468385 -244866 -81773 -16460 -43039
22437 -43039 51221 102260 97188 821 -44696 -239453 -137043 -20459 -81525 -109467 -38558
22426c8558O2633N6244p647J70081n7168j56174m4273J83219K1098m9622L97508
22415E37341K81578l37652j46276k2666k29220K40702r7037n4125j66555M5957
22405E2047J02417p1869L1337o0807m0012K640j02518k29776K56552K36750k2028
22394A54733p9642K29217P8221j42088k52735L60935j31348m40596r3259J83543
22384a33019L75271O041l21458k08640N8744J12582j185L0112N8812K0220j00925
22373a03445q7042N2335N3672N4468j24582J05714R6267P6903j6949R8440k35548
22362b9767k78259L5353J96597K15157o9533k82633n8385R9735J78894O2598r2628
22351b2871j1822o3315j36204o0685k05584p5201O5641M6199K88008J739J44432
$$ plain form
22426 -38558 24075 80319 72672 242753 185585 29411 -14862 168357 189455 139833 537341
22415 537341 818919 481267 334991 312325 83105 323807 226770 172645 6090 52047
22405 52047 154464 82595 113932 53125 13113 15753 -86765 -316541 -59989 176761 154733
22394 154733 75091 304308 382529 240441 -12294 348641 217293 -223303 -316562 -133019
22384 -133019 242252 248293 -73165 -281805 -223061 -110479 -111664 -81552 -22740 -2520 -103445
22373 -103445 -190487 -138152 -84480 -30012 -154594 -48880 47387 124290 107341 205781 -29767
22362 -29767 -308026 -272673 -76076 139081 69548 -213085 -271470 -171735 7159 69757 -22871
22351 -22871 -34693 -98008 -234212 -294897 -500481 -575682 -510041 -463842 -175834 -174095 -29663
22340b9663J34629j01011k28245J88170N4699N794K73588K47227N1823j13892
22330D83119l05832k50042p0069J01540k35304j04996k26262M5932n6667M670
22320f13911K35230K26725J09131l06528M191J93663M2111K19897n9622o2353
22310a1466k95856k55034J08977L07261N704J51205K36394j21181j23220k05760
22300b02976M5029K35956K29942j25776m4942l77408j43319J06319J21164n6152
22290b12163L2554k68831K9051K75850K51098j84509L32567R8561Q0021j37939
22280B96260l06406j79336R3919o6104L6585N3059P6537m4335o5218k17133K25431
22269i6741L7899j08550o31K2232J70093R9572l7291L99263Q4216j51837l14799
$$ plain form
22340 -29663 104966 3955 -224290 -36120 18579 24373 297961 545188 597011 483119
22330 483119 177287 -72755 -142824 -41284 -276588 -381584 -607846 -561914 -618581 -613911
22320 -613911 -378681 -151956 -42825 -349353 -345162 -151499 -109388 110509 50887 -11466
22310 -11466 -307322 -562356 -453379 -146118 -140414 10791 247185 126004 2784 -202976
22300 -202976 -157947 78009 307951 182175 137233 -240175 -383494 -277175 -156011 -212163
22290 -212163 -179609 -448440 -419389 -143539 107559 -76950 255617 354178 434199 296260
22280 296260 -10146 -189482 -95563 -161667 -125082 -72023 4514 -39821 -105039 -322172 -96741
22269 -96741 -58842 -167392 -168023 -145791 24302 123874 86583 485846 570062 418225 103426
22258A03426j46647J47727J29735m3705J4566j73823j66531j54103K07507k0799
22248a02647n6407p7088j1908j57710J96086m3213j6331j28282L7124J04773K87755
22237C2152m8361k36148R4748q2268j81095P2947K06254n3289j68801K01624L06275
22226A44038j0406k27785R6713j12863k39194J53881K43350R6234q876M2250K27625
22215D04967O4119l57381k46516j12379Q8810j22453n7742J00600K59489J40776
22205A62290J4938J11569r0062j07674m0842j41583j46870j32821j5553K92426
22195i4182K98977J38098o067j86120l11228J04318Q5782R711J56509J98571j81556
22184B12813j30308k19697r5653p73p8606J12082J37281J53405L2494J77614O1654
$$ plain form
22258 103426 -43221 104506 234241 190536 205102 31279 -135252 -289355 -81848 -102647
22248 -102647 -159054 -236142 -248050 -405760 -209674 -252887 -269218 -397500 -360376 -255603 32152
22237 32152 -16209 -252357 -157609 -239877 -420972 -348025 -141771 -195060 -363861 -162237 144038
22226 144038 133632 -94153 2560 -110303 -349497 -195616 47734 143968 135092 177342 404967
22215 404967 469086 111705 -134811 -247190 -158380 -280833 -338575 -237975 21514 162290
22205 162290 177228 288797 198735 91061 50219 -91364 -238234 -371055 -386608 -94182
22195 -94182 204795 342893 336826 150706 -160522 -56204 29578 39289 195798 394369 212813
22184 212813 82505 -137192 -232845 -233618 -312224 -200142 -62861 90544 123038 300652 362306
22173C62306p8241m11661r6608P8730O718k5431L155L47948L34143r8593k00980
22162B21486k47453O8307K32136J48466R8524k57116l44705j23646Q418L4651
22152a60932r2379j63828o630J19705J48343j3492K48369K53879l10562j93989
22142a71516J38070o6650L08430J16775o4719K594j14622m01134p8651j93800
22132e25223M64213M36592J29747j55143l05041l23050j85914J20733J27744J52288
22122f3054N1383J45381j02760j33257k20673j7722j19988J64192K66225J13296
22112H3023j36348N6809J39865N0687o0553J40233p9946p1265Q7217K79148l359
22101D85511l02326Q5722K92155k06439j43425k32659l49652R3859j35120J95798
$$ plain form
22173 362306 284065 -127596 -224204 -145474 -138756 -164187 -161032 186916 521059 422466 221486
22162 221486 -25967 42340 274476 422942 521466 264350 -80355 -204001 -195583 -160932
22152 -160932 -253311 -417139 -423769 -304064 -155721 -169213 79156 333035 22473 -171516
22142 -171516 -33446 -100096 208334 325109 260390 262984 148362 -252772 -331423 -525223
22132 -525223 -61010 375582 505329 350186 45145 -277905 -463819 -343086 -215342 -63054
22122 -63054 -11671 133710 30950 -102307 -322980 -340702 -460690 -296498 -30273 83023
22112 83023 -53325 3484 143349 194036 133483 273716 193770 122505 209722 488870 485511
22101 485511 183185 268907 561062 354623 211198 -21461 -371113 -277254 -412374 -216576
22091b16576R0609P5641j90743k37999O4976L13723J78557N9310K7704j4423j83938
22080c3159P672M5770j15275p7147J3688K8711J90781K63190r3489m1436K525
22069A91831O948P606j91752q3888k40329k34157R2606L00607n8908j09731J6090
22058c03077K59533k9775k40845K58272J42334j43488K7831J18226m5795q2399
22048c9183m5504L25689J72005R4742k68332l68722j10423P9452K1790J37869
22038f17J66922j34652J2812L79547k4901l52526j22805K29181K22177m5209j82790
22027A47139n6598m8268K7647J64576m4622l6364N1584l39813k11464Q4329K62941
22016A087N61548k00830r7349j23879j04994O993K71585j68603j71936K27260
$$ plain form
22091 -216576 -125967 -50326 -241069 -479068 -414092 -100369 78188 137498 165202 150779 -33159
22080 -33159 -25487 20283 -94992 -172139 -158451 -129740 61041 324231 230742 189306 191831
22069 191831 198779 206385 14633 -69255 -309584 -543741 -451135 -150528 -209436 -319167 -303077
22058 -303077 -43544 -73319 -314164 -55892 86442 -57046 -29215 89011 43216 -39183
22048 -39183 -84687 241002 413007 507749 239417 -129305 -239728 -160276 -138486 -617
22038 -617 166305 31653 44465 424012 399111 46585 -76220 152961 375138 329929 147139
22027 147139 90541 42273 69920 234496 189874 153510 205094 -134719 -346183 -261854 1087
22016 1087 562635 361805 264456 140577 35583 42576 314161 145558 -26378 200882
22006B00882J54817k57778m68650n1753J0028J12931J63727o1010J7939J62931
21996a5936P8158J9554K66208j21125q2590n6391k21255k77337J8928Q6935J60701
21985a44150p8620N1516Q0423J02576Q6675o9099o4521Q5721K385o5405j23832
21974a36331q979K17824L14563O8193l93967j33741K42676J71828k47387j93488
21964i8809N9120P6596L96233q987m78968R9606M7523L3401j02067r9762k34110
21953c10224R4799J72967L04385J39183m754q7972j66370o4922l0166P6245m8562
21942G4609j06085p1039J3045k0618K17406n0946j33029M9893k3674K41987L45049
21931E36598J0857k08760m04195j89667J72425j31969k71127J23199J93582k1054
$$ plain form
22006 200882 355699 97921 -370729 -422482 -412454 -299523 -135796 -196806 -178867 -15936
21996 -15936 62222 81776 347984 226859 144269 87878 -133377 -410714 -391786 -304851 -144150
21985 -144150 -222770 -171254 -90831 11745 98420 29321 -35200 50521 52906 -12499 -136331
21974 -136331 -145310 72514 387077 455270 61303 -72438 170238 342066 94679 -98809
21964 -98809 -39689 36907 433140 424153 -54815 44791 92314 125715 23648 -76114 -310224
21953 -310224 -215425 -42458 261927 401110 396356 308384 142014 77092 46926 123171 74609
21942 74609 -31476 -102515 -89470 -110088 107318 56372 -76657 -26764 -50438 191549 536598
21931 536598 547455 338695 -65500 -255167 -82742 -214711 -485838 -362639 -169057 -190111
21921a90111K90679K07514j76524j49684k80834l5021K1363J06432L67836N2785
21911B14435K09135l34705l10953o7072K42166j14951J9056o9376l1893J84637
21901e9521J55383j89745q5041m0384J03841M14517N2575J1339l09007N1153P9492
21890A84602J7125k50580j63774J85208L1926L11024n1840l20958L9529R7580
21880G9842n4595j6288l41898m6286p2352k86220m13J3168N2411r6098L14061
21869d54668J07415o4729J49432P1741P2327P5227L84392P9906l07122k22263
21859a08342j76158J66313M87914j3394k44488m1622m42192j95837j16249M4700
21849f39355M15922J73736k61777j64251K01758K20911o3484m5953K3537j10199
$$ plain form
21921 -190111 100568 308082 131558 -18126 -298960 -333981 -312618 -206186 161650 214435
21911 214435 423570 88865 -222088 -289160 -46994 -161945 -142889 -212265 -244158 -59521
21901 -59521 95862 -93883 -178924 -219308 -115467 299050 351625 362964 53957 105110 184602
21890 184602 201727 -48853 -212627 -27419 4507 315531 263691 -57267 -17738 79842
21880 79842 25247 8959 -332939 -379225 -451577 -737797 -738210 -725042 -672631 -768729 -454668
21869 -454668 -347253 -411982 -262550 -190809 -118482 -43255 341137 421043 113921 -108342
21859 -108342 -284500 -118187 369727 356333 111845 70223 -371969 -567806 -684055 -639355
21849 -639355 -223433 -49697 -311474 -475725 -273967 -53056 -116540 -162493 -138956 -249155
21839b49155k0074j25229J57984L5241k05456k8798Q1804R6127K6126J89373q9558
21828a31615j99407J20819M15887K285n5603k99037k0634J10503J0691N6905M7856
21817E8650J27244j04008k52228k17561J19322K44310j13251n5953J80585M08737
21807C95847K98177n1039k8119k48641j73545P4245j36606k96376J48936J91590
21797A74469l5240j35577o9483r0640m1120j33425p9433j94736O3932J61628N4160
21786c25465J03958J61589K858j97495K998J6908Q0700Q4307R0449n920J20351
21775A35238K68991o8359k19431P4818J0450m43489l29862L30697L11309R9860
21765A70222p3833k69452k68209Q6156L19001j6415J9900N5403J89834m7939m6167
$$ plain form
21839 -249155 -269229 -394458 -236474 -201233 -406689 -435487 -353683 -257556 -231430 -42057 -131615
21828 -131615 -331022 -210203 205684 207969 152366 -146671 -167305 -56802 -46111 10794 58650
21817 58650 185894 81886 -170342 -387903 -268581 -24271 -137522 -193475 -12890 395847
21807 395847 694024 642985 614866 366225 192680 266925 130319 -166057 -17121 174469
21797 174469 139229 3652 -65831 -156471 -197591 -331016 -410449 -605185 -541253 -379625 -325465
21786 -325465 -221507 -59918 -57060 -254555 -251557 -234649 -153949 -69642 20807 14887 135238
21775 135238 404229 335870 116439 191257 201707 -241782 -571644 -240947 70362 170222
21765 170222 96389 -173063 -441272 -355116 -36115 -52530 -32630 22773 212607 164668 118501
21754A18501j01852j263L2773k22212P4349J54908j41821q4948M3954L18461O0810
21743B51660k64924k05130l6820M00032K49209l08172k86139N4232L66457o7571
21733A52834R9198M976p2644q7608j97578k15395q2703K70564K92754m0572l1268
21722I2558j05194J56244M6404j74410l02083J19414L78730J00986l6788J04529
21712C80390M7432L9873j91115j1536k29256j77537j33325r7638K25251K75728
21702A28267n7804k70315j77845Q153O7647J10018K18123k7442q2459o8138Q6461
21691f5334J04624J13260m8880n6965J28849j32100j80090q2666R7680p3887Q5942
21680a09567p4901j07409J37752j87291m3888K00618Q5817J56739J03179K29412
$$ plain form
21754 118501 16649 15386 48159 -174053 -99704 55204 -86617 -171565 -127611 190850 251660
21743 251660 -13264 -218394 -255214 144818 394027 85855 -200284 -146052 220405 152834
21733 152834 252032 257008 184364 96756 -100822 -316217 -398920 -128356 164398 123826 92558
21722 92558 -12636 143608 190012 15602 -286481 -167067 211663 312649 275861 380390
21712 380390 427822 467695 276580 265044 35788 -141749 -275074 -372712 -147461 128267
21702 128267 70463 -199852 -377697 -369544 -301897 -191879 26244 -1198 -83657 -151795 -65334
21691 -65334 39290 152550 103670 46705 175554 43454 -136636 -219302 -121622 -195509 -109567
21680 -109567 -184468 -291877 -154125 -341416 -385304 -184686 -98869 57870 161049 390461
21670C90461Q1338j38705p762k94941L9132K71776Q4671j11305L6007J58644j87060
21659C22256k62559M2851k27718l38051J01209J27061p362J53051J52777J8279
21649H1794k59843k84407P7868M35040P7997j63715j45082j01438J24601K5186
21639a31999j74140R1734R9340j99131j7132j47213j18206K69870R1084O659j32401
21628c61535M6678l3761l759K88680L61163N3873M5345k12219k32113J79397J26575
21617B58324o3802K62374L16223R2781j95153l95729k47157M6599J38986j71655
21607D1791J25644k46457k46802Q718L45367j33548J36024M9410k63808k88441
21597d72102k99627K32218M23114K27941m9307J9905j27344j67874j98543P9642
$$ plain form
21670 390461 471799 333094 325332 30391 69523 341299 425970 314665 350672 509316 322256
21659 322256 59697 102548 -125170 -463221 -362012 -234951 -242313 -89262 63515 81794
21649 81794 -178049 -462456 -384588 50452 128449 -35266 -180348 -281786 -157185 -131999
21639 -131999 -306139 -214405 -115065 -314196 -331328 -478541 -596747 -326877 -235793 -229134 -361535
21628 -361535 -314857 -348618 -352377 -63697 297466 351339 396684 184465 -47648 131749 258324
21617 258324 194522 456896 773119 865900 670747 275018 27861 74460 213446 41791
21607 41791 167435 -79022 -325824 -317106 28261 -105287 30737 80147 -183661 -472102
21597 -472102 -771729 -539511 -116397 111544 62237 82142 -45202 -213076 -411619 -331977
21587c31977K7077j04352K11476K07775K1476j09626n8948j41228j82860J60015
21577c01172L5288O7132K23833K95896J54485j52068l07357m0729j3501k2008
21567f0201K82481J03383L6475J06271q3316J83000M4173j04683j9991l8199k21788
21556B27605J4380r9603j69430P0682k19536k68265n2046R6950o228N0159L37299
21545a8033R7937l3251n899P7131j85596M07237O3817k92725j59907l3558j26774
21534b09621q5431K51795J52183r7352o1326j68650J96348J40657J36059R3562
21524C48224j66092p7755R0356K11335m8562l60431j89547o4360J12604J57556
21514A3328j10119N9934j22290J19305q554m1296M5616P9170k8935j11583j80030
$$ plain form
21587 -331977 -304900 -409252 -197776 9999 31475 -78151 -137099 -278327 -461187 -301172
21577 -301172 -265884 -198752 25081 320977 475462 323394 16037 -24692 -38193 -60201
21567 -60201 222280 325663 362138 468409 385093 568093 612266 507583 487592 449393 227605
21556 227605 241985 142382 -27048 43634 -175902 -444167 -496213 -399263 -405491 -355332 -18033
21545 -18033 79904 46653 40754 117885 -67711 339526 403343 110618 -49289 -82847 -209621
21534 -209621 -295052 -43257 108926 11574 -49752 -218402 -22054 118603 254662 348224
21524 348224 182132 104377 194733 406068 357506 -2925 -192472 -256832 -144228 13328
21514 13328 -96791 -36857 -159147 -39842 -48396 -89692 -44076 35094 6159 -105424 -285454
21503b85454k63200j63266j23954K84318M22344o921j5942J39261J94690j09743
21493G2133k01532J32412K720p7151J21432J289K43026K41158l7413k93455o5889
21482A38730k5166J2546j7960j31772r3639k11670P484j10117j18310J10864O9892
21471c69118J59844J49410M23416J71389J37256k68591l42384j35189N0386j59962
21461a83543K34955K66920j62785k71947j40468J00126j285j37373j63101J08791
21451c49710O6902l697N3360P3668J27053P7119o2305k36994j35545J1905J58316
21440b19928j44560k52358L9951l19373r4052K36958M88527K88974K5192p4039
21430b4708q0495N0999J24289j51621l9359j34970L64848J8566J28221j40670
$$ plain form
21503 -285454 -548654 -711920 -835874 -551556 -129212 -136133 -152075 -12814 181876 72133
21493 72133 -129399 3013 5733 -71418 50014 51303 294329 535487 498074 204619 138730
21482 138730 113564 126110 108150 -23622 -117261 -328931 -321447 -431564 -549874 -439010 -369118
21471 -369118 -209274 -59864 363552 534941 672197 403606 61222 -73967 -23581 -183543
21461 -183543 51412 318332 155547 -116400 -256868 -156742 -158027 -295400 -458501 -349710
21451 -349710 -282808 -286505 -233145 -159477 -32424 44695 -17610 -254604 -390149 -378244 -219928
21440 -219928 -364488 -616846 -576895 -896268 -990320 -753362 -264835 24139 49331 -24708
21430 -24708 -105203 -54204 70085 -81536 -120895 -255865 108983 127549 255770 115100
21420A15100q3798j7562j63487K2325J38108m36404k62353K80717J01643K07078
21410i8633K28593K72840k39140m6674j68962O5260J72375k48742l89171K7082
21400d25172r507j20383K18302P6680j16301p3941J72770n3808J72674n9700o2558
21389b80944J14076K02496j0984k26482N1008J4087J61104J7828J13288m4424
21379A11053j25769O834M53K28945q0184k72388j40099K51191K00262n4088K78088
21368D04298r9081l90639j52492J71417P5926l7858k1406k4239j32816k13345
21358d20235o5994J44465J78375j98152p5086O2482L17889J2589j88092N1269
21348a80490J72071K16446m42792k42979N8128N3349J38202k76024j91844J26376
$$ plain form
21420 115100 31302 13740 -149747 -127422 10686 -425718 -688071 -407354 -305711 -98633
21410 -98633 129960 402800 163660 116986 -51976 13284 185659 -63083 -452254 -425172
21400 -425172 -434679 -555062 -336760 -260080 -376381 -450322 -277552 -331360 -158686 -218386 -280944
21389 -280944 -166868 35628 24644 -201838 -150830 -136743 24361 42189 155477 111053
21379 111053 -14716 -7882 -7429 221516 141332 -131056 -271155 -19964 180298 126210 404298
21368 404298 305217 -85422 -237914 -66497 9429 -28429 -49835 -74074 -206890 -420235
21358 -420235 -486229 -341764 -163389 -361541 -436627 -374145 -56256 -43667 -231759 -180490
21348 -180490 -8419 208027 -234765 -477744 -419616 -366267 -228065 -504089 -695933 -569557
21338e69557J48141K72152l96182k75034K11583K42742K03310j89247l2054J03088
21328b81058L1008K6213J25889k00012j17258J7945J58319P1302K53642k11294
21318a25304j03857R4267j8809k25254j55282l97306K10451L48109N0620L38864
21308A6499J58566J43120k5996m24692m64982L67931J70251n5783l1389K53910
21298A07435K16255L4463j57j54827n1243Q5031L9517m9543l57857N9714m1603
21287a12815j5150j13721l1001J66636m1875Q1970j41723k39150O146K42226j12515
21276c10972j1887n4360J48707K54689J1350k9861j22733O4047J93773M3245R5632
21265B81630L1380m8349j34442O5615Q762j75472l08299m1198K28549l2687K5832
$$ plain form
21338 -569557 -421416 -149264 -545446 -820480 -608897 -366155 -162845 -352092 -384146 -281058
21328 -281058 -250050 -223837 -97948 -297960 -415218 -397273 -238954 -167652 85990 -125304
21318 -125304 -229161 -134894 -153703 -378957 -534239 -931545 -721094 -372985 -322365 16499
21308 16499 175065 318185 292189 -132503 -597485 -229554 -59303 -115086 -146475 107435
21298 107435 323690 358153 357996 203169 151926 236957 276474 226931 -130926 -71212 -112815
21287 -112815 -127965 -241686 -272687 -106051 -147926 -65956 -207679 -446829 -440683 -198457 -310972
21276 -310972 -322859 -377219 -228512 26177 37527 7666 -115067 -51020 142753 185998 281630
21265 281630 313010 264661 130219 195834 204596 29124 -279175 -320373 -91824 -124511 -98679
21254i8679J12317o0525J31221K8638O9322O3060k83708k79929j61600j23384
21244f03267L5510K89348k69625o0957J04000K84154L69692J22267p1582j48603
21234E0937J90983j06222q7495j00720J01361J70928j78671r6918j18285j84866
21224c58968o4426r4186L8002K58235n1405j01567K22076K21458P9402j84135
21214c5514k33399j28761j52932K1449N3902J83599K42284J39804P3921J02331
21204B66684j95527R5624j3194j67144L4010Q7565o2572k08186M0654J93721k9548
21193D2087K18218l7723k12391K09986J05722R8588l4823k71771k4887o1142n3654
21182b1790J21180J17531n9345l15628j0301J82735J235M2582P7866K7721K53891
$$ plain form
21254 -98679 13638 -46887 84334 112972 182294 245354 -38354 -318283 -479883 -603267
21244 -603267 -567757 -278409 -548034 -608991 -504991 -220837 148855 271122 199540 50937
21234 50937 241920 135698 48203 -52517 48844 219772 41101 -55817 -174102 -358968
21224 -358968 -423394 -517580 -479578 -221343 -272748 -374315 -152239 69219 148621 -35514
21214 -35514 -268913 -397674 -550606 -529157 -475255 -291656 -49372 90432 164353 266684
21204 266684 71157 166781 153587 -13557 20453 108018 45446 -162740 -122086 71635 42087
21193 42087 260305 222582 10191 220177 325899 424487 389664 117893 93006 31864 -21790
21182 -21790 99390 216921 157576 -158052 -168353 14382 15617 58199 136065 163786 417677
21171D17677J55618j52088o3141K5741J73648k02567j95494j22921m7125k06190
21161b16842J91269p9794K07478R4564M1115m51750J23101J63629M4776K03520
21151C21066j78012J14220q3709m5256J52j55031K26628J47832m3785r3283j16514
21140I4308p2987j12328j2484p4584J5218R6625K06982r2998j07009p9366p4743
21129b13366L3708k3002J37831L50013L94058p3721l81004K9680J60540p5312
21119C39425j82308k83493J22047J66914j29902l3047K0277L1885J72615r2837
21109A31576M5806j61013j36714l26815k33793M4135O03609j0934l07335p1053
21099d22531J7781k44719k11412R7600L77500N9293p9441J9268J43350j37773
$$ plain form
21171 417677 573295 421207 358066 383807 557455 354888 159394 36473 -10652 -216842
21161 -216842 -25573 -105367 102111 196675 237790 -213960 -90859 72770 117546 321066
21151 321066 143054 257274 173565 128309 128461 -26570 200058 347890 304105 210822 94308
21140 94308 21321 -91007 -103491 -178075 -162857 -66232 140750 47752 -59257 -138623 -213366
21129 -213366 -179658 -202660 -64829 285184 679242 605521 224517 254197 414737 339425
21119 339425 157117 -126376 -4329 162585 32683 -364 19913 51798 224413 131576
21109 131576 177382 16369 -120345 -447160 -680953 -636818 -33209 -44143 -351478 -422531
21099 -422531 -404750 -649469 -860881 -763281 -385781 -326488 -405929 -386661 -243311 -381084
21089c81084j11855P8783J80018N6014j29020K69850k2684j2253j78618L63808
21079A12959J14768n0166N3663j76917j18188j00702R4496M16941k1500q1533
21069B43821K66517j30856m44927k71607K51890R4907Q2357n6706j17798n148
21059h7550j44017k2517L5063p6936N3995J94096q799j04994j21127K55597J24760
21048I7571k15220J2444R5816M2539O3275r3029O7621j11380m6818q7548j41793
21037c16522j15934j36341K43701M66290J99405m39880k40320J27494J00926j45130
21027b56311K25450K11141j15339K969J25306P5724K968j30659n4237r8871l09209
21016c21068j6729M90245J43145j97067j67783j57807k6306j1601k00771R5402
$$ plain form
21089 -381084 -492939 -414156 -234138 -178124 -307144 -37294 -59978 -72231 -250849 112959
21079 112959 227727 177561 231224 54307 -63881 -164583 -70087 346854 325354 243821
21069 243821 510338 379482 -65445 -337052 -85162 9745 92102 35396 -82402 -87550
21059 -87550 -231567 -254084 -219021 -295957 -241962 -47866 -56665 -161659 -282786 -27189 97571
21048 97571 -117649 -105205 -9389 33150 96425 3396 71017 -40363 -87181 -174729 -316522
21037 -316522 -432456 -568797 -325096 141194 340599 -99281 -339601 -212107 -111181 -256311
21027 -256311 -30861 180280 64941 67910 193216 268940 271908 141249 87012 -11859 -321068
21016 -321068 -337797 152448 295593 98526 -69257 -227064 -253370 -264971 -465742 -370340
21006c70340L57582M8753j44063j97438P8178j94692j05932q2167J18340R5582
20996c96197r6180J13941K29914j74503p1051K4386j04597p7382J11131k01119
20986f41657o3468P7700j10950j28286M805J07258K55460L88265l6273j16077
20976b63223l6336J17782J74907J60548j01954k27475J80219Q1213k7689K15968
20966B73960R3871j79617m167O5296J55453o1895q3644K55187J59831k85872l00600
20955H7803K365N5094o5674j9808j02559L3116P6275m1071p4618l3500R6236L384
20943A7043k43908M6136l7775K37818L27938j9619m2360j38955k1825J99138k00470
20932A23161m49725K50224J31650j79682K1046j54072J5062J84300k2806J69464
$$ plain form
21006 -370340 -12758 35995 -108068 -305506 -227328 -422020 -527952 -610119 -491779 -396197
20996 -396197 -492377 -378436 -148522 -323025 -394076 -369690 -474287 -551669 -440538 -641657
20986 -641657 -705125 -627425 -738375 -866661 -861856 -754598 -499138 -110873 -147146 -263223
20976 -263223 -299559 -181777 -6870 153678 51724 -175751 4468 85681 57992 273960
20966 273960 367831 188214 184047 249343 404796 342901 259257 514444 674275 388403 87803
20955 87803 90168 145262 79588 59780 -42779 -9663 66612 25541 -49077 -82577 13659 17043
20943 17043 -226865 -180729 -218504 19314 347252 327633 285273 146318 124493 323631 123161
20932 123161 -326564 -76340 55310 -124372 -103326 -257398 -242336 -58036 -80842 88622
20922H8622n9802j3149o4252K70443L5987j86153j8284J98172L0614j53125k3466
20911A05607k90709k95626J46925M0756J05998l0150j37224m2235J08472j441
20901b89627L86734L0141l72996k18157J31758J34323J58235K21386j81695j84414
20891a84312p9605R5674M06536J71939j43667P7775K03679J0340j53069N4557
20881D59847Q1976j15027m02199L2417K72171J39984k11893M9491j36084k93996
20871a23313J32208M4455O3460L44848q0510l10930N5295N9652n3964k76330l39253
20860d84382N5329k444M1294J4250K75343J06278l98288j9634M87458K11438k92778
20849f136k84435k2002O0635L91989j9247J22589r8889N1442l611k19023l4574
$$ plain form
20922 88622 28820 15671 -48581 221862 257849 71696 53412 251584 282198 129073 105607
20911 105607 -185102 -480728 -333803 -293047 -187049 -217199 -354423 -396658 -288186 -289627
20901 -289627 97107 127248 -245748 -463905 -332147 -197824 -39589 181797 102 -184312
20891 -184312 -263917 -168243 238293 410232 266565 344340 548019 558359 405290 459847
20881 459847 541823 426796 24597 57014 329185 469169 257276 306767 170683 -123313
20871 -123313 8895 53350 116810 461658 381148 70218 125513 185165 131201 -145129 -484382
20860 -484382 -429053 -431497 -390203 -375953 -100610 5668 -392620 -412254 75204 286642 -6136
20849 -6136 -290571 -312573 -251938 140051 120804 243393 144504 195946 192335 -26688 -61262
20838f1262O5125J47523j15366p5823q914j8277K41393R0674L1472j21989k4057
20827A50499J65958k76419k16087J28446n6258J46589J07398J13209l11808j68658
20817b17131J11608J84933Q521R0758j51649k03690j94388L86019K16231q9655
20807A41557k24831o2463k72436P8460L28561k6333J71403p7667j75945N7310
20797f2384K31408O3176K03007j36134l01658J69473L6108j05565j37764j06043
20787a46376J68572J91151J8663m2617J905n7519k33664J43118J77499k4314q5350
20776A11068k66450k26713l0251K2097P0126K5735J30410Q9938R6584j11710K25
20765h8941r6857O3359L74866L43967k08418l72920l45050L0004K80871r9096
$$ plain form
20838 -61262 3863 151386 36020 -39803 -48717 -66994 174399 265073 296545 174556 150499
20827 150499 316457 40038 -176049 -47603 -103861 42728 150126 263335 -48473 -217131
20817 -217131 -105523 79410 87931 178689 27040 -176650 -371038 14981 231212 141557
20807 141557 -83274 -145737 -418173 -339713 -11152 -37485 133918 56251 -119694 -62384
20797 -62384 169024 232200 435207 299073 -2585 166888 202996 97431 -40333 -146376
20787 -146376 22196 213347 232010 189393 191298 133779 -99885 43233 220732 196418 111068
20776 111068 -155382 -382095 -412346 -390249 -320123 -294388 -163978 -74040 22544 -89166 -88941
20765 -88941 -185798 -122439 252427 596394 387976 15056 -329994 -299990 -19119 -118215
20755a18215J45248M64109M8763l52319l22063J79092L25281k20743k39242l2180
20745a22269m1605J03562n2580M357j5384j3509r4540R0455M38505K4446j17585
20734B03853l07620l9337p6506J20601O3165l19607j80269L12491P1424j51397
20724c03202q1290O8664J63567j67926j64399K24080K70766k1563j21980K08702
20714G5419l0001M0781R74L6390k1084r4493k4323k43850J46803L58236K56115
20703E00967m25406l31693k76154K26640K83704N6349k83148o0853L6029K02101
20693g1464m2656n6845K18235J67305J15987R0223k54154o6212P6705j86854n4852
20682f4582k2676J1083j42365j89931Q1366N7769p6304J87191L15392n422k86355
$$ plain form
20755 -118215 27033 491142 539905 187586 -134477 44615 369896 149153 -90089 -122269
20745 -122269 -163874 -60312 -112892 -108535 -123919 -137428 -231968 -141513 296992 321438 203853
20734 203853 -103767 -143104 -219610 -99009 -35844 -355451 -535720 -223229 -151805 -303202
20724 -303202 -384492 -315828 -152261 -320187 -484586 -260506 10260 -11303 -133283 75419
20714 75419 45418 86199 87173 123563 102479 7986 -16337 -260187 -113384 244852 500967
20703 500967 75561 -256132 -532286 -305646 -21942 34407 -248741 -309594 -273565 -71464
20693 -71464 -114120 -170965 47270 214575 330562 420785 166631 100419 177124 -9730 -64582
20682 -64582 -87258 -76175 -218540 -408471 -327105 -269336 -345640 -158449 156943 151521 -134834
20671a34834m9515O5756k27891p7570J60930N4676J30724J65757m9130j23899
20661h4996n8006J87754o977l5307k408J81162K0657j46893j44207k75472J25906
20650b38787K04882Q4120J63849o3082j32258j05881K31092K39807K12336k62246
20640C33832l26680j54626j10939j44181j14547K66629J94545J67899k2843l18909
20630b29820J51699O6641j06249J6237j3784J02440l30036L0233J72073o0781
20620b01347k64683r3292K31536K49785J97863R3886J09229j94567l28825m6172
20610b46587R9169q1715n6920q8198J62735L50268J10172k47104q8870k39050
20600c26100j99760M0724J45218K28386J14708j03534q6545J48776M0375J66744
$$ plain form
20671 -134834 -184349 -118593 -346484 -424054 -263124 -208448 -77724 88033 38903 -84996
20661 -84996 -143002 44752 37775 2468 60 181222 201879 54986 -89221 -364693 -238787
20650 -238787 -33905 50215 214064 150982 18724 -87157 143935 383742 596078 333832
20640 333832 7152 -147474 -258413 -402594 -517141 -250512 -55967 111932 89089 -229820
20630 -229820 -78121 -11480 -117729 -101492 -115276 -12836 -342872 -312639 -140566 -201347
20620 -201347 -466030 -559322 -327786 -78001 119862 213748 322977 128410 -200415 -246587
20610 -246587 -147418 -229133 -286053 -374251 -211516 138752 248924 1820 -87050 -326100
20600 -326100 -525860 -485136 -339918 -111532 3176 -100358 -186903 -38127 2248 168992
20590A68992R4427L7154N1349L7977l1099l69647j79559R799K02430k05983O0436
20579a23724K42911p6525M1586o9915j44009k17472p5948J79010O4155m3327J46827
20568g6431r9952N4839J44264j72449j93058J22887K65187q6650K61839m6243
20558A74233k25246m5500Q6127j91073M710J61542l04291K68760L5684o0010L17817
20547B22753N7063k8294J60041J3564k59772m5110O3362j18343q030K46966J41601
20536D45801j33271k09640J30908O3129k30293j74216O0304L4282k12112n2115
20526b77223k03839q7120J60187J62974M6396p5337K68991K55917k00449k15365
20516a64868O8593J97620R0309j00644M6732L1207O0611m5616k35830j12136m8516
$$ plain form
20590 168992 263419 300573 351922 389899 358800 -10847 -190406 -180607 21823 -184160 -123724
20579 -123724 119187 42662 84248 14333 -129676 -347148 -423096 -244086 -179931 -223258 -76431
20568 -76431 -176383 -121544 22720 -149729 -342787 -219900 45287 -41363 220476 174233
20558 174233 -51013 -96513 -10386 -201459 -196749 -35207 -339498 -70738 -35054 -95064 222753
20547 222753 279816 251522 411563 425127 165355 120245 183607 65264 57234 304200 445801
20536 445801 312530 102890 233798 296927 66634 -107582 -47278 -12996 -225108 -277223
20526 -277223 -481062 -568182 -407995 -245021 -198625 -273962 -4971 250946 50497 -164868
20516 -164868 -96275 101345 191654 91010 137742 168949 229560 183944 -51886 -164022 -212538
20505b12538J74284J31247K53391l8737k16359k19109r8957l47002J01529K39527
20495b32724K85851k70535p665J47747J27833q1800K02981m9725k35446J41040
20485B7557j76014Q4892R6546l33616J03295Q7346N5200j45384p8512n442K35512
20474d8620R6275L21205m1284k91675P1456L3075Q5730j4663J16852J21869j3660
20463D36560k41596l72138k51014J35792K15381J06937L2133N6041J89384p9547
20453B27933j66634N331M7905L0720k09269m17142j12797J14996J84829K10114
20443h4014K05005J26129P7970N825p675j88861k21241J17864j73982j40373L01588
20432A8235J66853k0146k93350j67154N8773K50390R4211j8705J5451K62339R1846
$$ plain form
20505 -212538 -38254 92993 346384 307647 91288 -127821 -226778 -573780 -472251 -232724
20495 -232724 53127 -217408 -225073 -77326 50507 -31293 171688 121963 -113483 27557
20485 27557 -148457 -63565 32981 -300635 -197340 -109994 -54794 -200178 -278690 -284132 -48620
20474 -48620 47655 368860 327576 35901 107357 140432 226162 211499 328351 450220 436560
20463 436560 194964 -177174 -428188 -292396 -77015 29922 62055 118096 307480 227933
20453 227933 61299 66630 114535 145255 -64014 -481156 -593953 -478957 -294128 -84014
20443 -84014 120991 247120 325090 330915 323240 134379 -86862 31002 -142980 -283353 18235
20432 18235 185088 164942 -128408 -295562 -236789 13601 107812 89107 104558 366897 458743
20421D58743j1044j47941k14775m42513k22335j6538J12829K95341M3766m195
20411a48662l2155j5434Q5425p8568j13876P8004K09974K03202p935o2742n326
20400A11907j19222o4088j40690j17732J73738J41664M3007k64596k36716J60874
20390c11854K48224J73516K32312J40916l8328j72104k88621n0223j11237j25228
20380c02627J35693J60472k92908j09631J87660j2767J23733J39624j12312l71711
20370d54774j92092K05901L74467J04517R3321j31859r5851J65497J17244L9296
20360B25667j6332j18353R8460n908j97761j41932q9848J21818P5107j87981n9016
20349b96079j29779j28033M57072K39659K1088j09896N9444J75474N635m15893
$$ plain form
20421 458743 447699 299758 84983 -357530 -579865 -596403 -483574 -188233 -144467 -148662
20411 -148662 -180817 -196251 -110826 -189394 -303270 -225266 -15292 187910 179975 117233 111907
20400 111907 -7315 -71403 -212093 -329825 -156087 -14423 28584 -236012 -472728 -311854
20390 -311854 -63630 109886 342198 483114 444786 272682 -15939 -66162 -177399 -302627
20380 -302627 -166934 -6462 -299370 -409001 -221341 -234108 -110375 29249 -83063 -454774
20370 -454774 -646866 -440965 -66498 38019 131340 -519 -96370 69127 186371 225667
20360 225667 209335 90982 189442 183534 -14227 -156159 -246007 -124189 -49082 -237063 -296079
20349 -296079 -425858 -553891 -96819 142840 163928 54032 113476 288950 294585 -121308
20339a21308r9196P8687J68940J17823J90925k0715j93474J71644K89330j61794
20329D20862J4234j3536k15675j64737R9122r2335j41875k63636J87853K40834
20319G1111J58032m0932k82837Q3774Q4224R6608l35306J05187O4497J5329J42958
20308A62645o6907o1360J14182j64242k18945j90551j28509N9026J50723l9194
20298c83132k10471Q209L49598K79949m35945j95579J50887O8483J18489J7265
20288b32247K18673K811N5569J18252l18894j94696o2548N5064p0941n5707M07034
20277g7630K60983J93653Q3843q4545j85529k1099K64761R4020K8654l05972m3237
20266B07902j860j12754j36507J33287P2509l60252R5860J54646J53722m7963
$$ plain form
20339 -121308 -220504 -141817 27123 144946 335871 315156 121682 293326 582656 420862
20329 420862 435096 421560 205885 41148 140270 47935 -93940 -357576 -169723 71111
20319 71111 229143 188211 -94626 -10852 73372 169980 -165326 -60139 4358 19687 162645
20308 162645 95738 34378 148560 -15682 -234627 -425178 -553687 -494661 -343938 -383132
20298 -383132 -593603 -585394 -235796 44153 -391792 -587371 -436484 -368001 -249512 -232247
20288 -232247 -13574 -10763 44806 163058 -155836 -350532 -413080 -358016 -428957 -484664 -77630
20277 -77630 183353 377006 460849 376304 190775 169676 434437 528457 557111 251139 207902
20266 207902 206042 93288 -43219 90068 162577 -197675 -101815 52831 206553 158590
20256A58590j36755m29611p4508K79095J69787o8665n9561J72276J39188K7523
20246A77359R2843J61001p3060l33036k88897l6610K0924k39818J97898M29566
20236A08170L3681m8470K82K3321j32518k72390K28934M06225P8911j80627l57887
20225a12368p7089J67612R7454K94122J93583j23318k84892o7239j17337k10656
20215b40128J20271J55820j9472n5975j35474j80746k5837R5061J87911m0156
20205a38725J09624j48177r5034K95761J08548k6317J5151K37742m0197m0874
20195B77502k3900q4670M6562m6478m07j62503n8958j36785l8663J13432O0870
20184e3998K03627L50248r1421k64996J04988M3306l57672q4562P3465q969L1062
$$ plain form
20256 158590 21835 -407776 -482284 -203189 -33402 -102067 -161628 10648 149836 177359
20246 177359 270202 431203 358143 25107 -263790 -300400 -279476 -519294 -321396 108170
20236 108170 141851 93381 93663 116984 -15534 -287924 -58990 347235 426146 245519 -112368
20225 -112368 -189457 -21845 75609 369731 563314 439996 155104 87865 -29472 -240128
20215 -240128 -119857 35963 16491 -39484 -174958 -355704 -381541 -286480 -98569 -138725
20205 -138725 -29101 -177278 -272312 23449 131997 105680 120831 358573 318376 277502
20195 277502 253602 168932 215494 169016 168609 6106 -52852 -189637 -228300 -114868 -53998
20184 -53998 149629 499877 408456 143460 248448 291754 -65918 -150480 -77015 -85984 -54922
20173e4922K3880k34280j56445J99234K89472m383J51327K10753p5471l08511
20163D0654k88847j79029J05878J63328p4867j0211R4223Q8052k788k9052J2071
20152h0588k8200r7676k44849o4514r6414P9313L19345J29641m5900k20741L73553
20141B2970N44967k42733k08181l4834O1900n2671j3805O0430j69104p2552J27074
20130B3461J24129O7041j10197k69686r2344N807R0589j9481j35303q1666K58032
20119a39618J18341j66744n1795j85005o1247K72495j15334J0223K61092P9536
20109B1944N7695l7307k3328q8817k27797k60953m2218K39377K76314P6742n3334
20098f1682J27999O5764P8589K52118N3173n21723r7232n4110L1188J79313L2094
$$ plain form
20173 -54922 -31042 -265322 -421767 -222533 66939 62556 213883 424636 349165 40654
20163 40654 -248193 -427222 -321344 -158016 -232883 -243094 -148871 -60819 -63607 -92659 -80588
20152 -80588 -108788 -206464 -451313 -515827 -612241 -532928 -213583 -83942 -129842 -350583 22970
20141 22970 567937 325204 117023 82189 144089 91418 77613 138043 -31061 -103613 23461
20130 23461 147590 214631 104434 -165252 -257596 -251789 -161200 -180681 -315984 -397650 -139618
20119 -139618 -21277 -188021 -239816 -424821 -486068 -213573 -328907 -318684 -57592 21944
20109 21944 79639 42332 19004 -69813 -297610 -558563 -600781 -361404 -85090 -8348 -61682
20098 -61682 66317 132081 210670 462788 515961 -5762 -102994 -157104 -125916 53397 85491
20087H5491J68785J58958j87609o9830J83030k7578l65170k73237Q262J27931
20077a90967J1416Q7393J4483k54934M8772l734k20651L4332Q402J08860J50596
20066b06032K68511J67782k0833O3249m47182j39828P6746j2294r0762J51404
20056a89239M8545j23956J57698L73883m8616k33446l74146k24735K23740L25093
20046f5179P9699N6497j46195L0524k68329J30261Q8260K01224K54794R1380j8890
20035D34046O5119Q9886K0517k2809l20838j63984j20691J61020q9800J38440
20025A90906n7107j13743N6801Q9716J07043j75144k08564n3122M4584j72850
20015b91480J11552K16162l6027J3521o2122O9190R5186j19357K3610N5974o9426
$$ plain form
20087 85491 254276 413234 225625 155795 338825 311247 -53923 -327160 -318898 -190967
20077 -190967 -179551 -92158 -77675 -332609 -283837 -287571 -508222 -473890 -465488 -356628 -206032
20066 -206032 62479 230261 209428 272677 -174505 -314333 -237587 -249881 -340643 -189239
20056 -189239 -140694 -264650 -106952 266931 218315 -15131 -389277 -614012 -390272 -65179
20046 -65179 14520 71017 -75178 -44654 -312983 -182722 -94462 106762 361556 452936 434046
20035 434046 499165 589051 609568 586759 265921 101937 -18754 142266 52466 190906
20025 190906 133799 20056 76857 166573 273616 98472 -110092 -163214 -118630 -291480
20015 -291480 -179928 36234 207 13728 -48394 20796 115982 -3375 20235 76209 6783
20004F783p8478j79165k5333K27334P3629l8673M7542k21098p1234N2781K00619
19993e293P3998j74732K9221K18095L49189J99668J95629k62508K1324m72573
19983A72018J8258K60298j61822o7920P1972L10346j37943l64999K8643J15693
19973B44544j66441q4021n6233k05901l0995O2157J83655J93059J8043J14493
19963B72360j51693K3830K7107l36127J6730m8579l52959O0445l3001J2792J20525
19952c88570K41835j49911n5076L0855m0787P7217O3597R2961k43309p0911J47535
19941b94564p9048K0688J76453q926L05582J30187k9342j60203J62304N5604j00995
19930A77740Q6405j45486k67415r6564l1871J01182L45854Q3533l13420j081m8670
$$ plain form
20004 6783 -71695 -250860 -276193 -48859 24770 -13903 33639 -187459 -258693 -205912 -5293
19993 -5293 68705 -106027 -76806 141289 490478 690146 885775 623267 644591 172018
19983 172018 190276 450574 288752 220832 292804 603150 465207 100208 128851 244544
19973 244544 78103 -5918 -62151 -268052 -299047 -236890 -53235 139824 157867 272360
19963 272360 120667 144497 171604 -164523 -147793 -196372 -549331 -488886 -521887 -509095 -388570
19952 -388570 -146735 -296646 -351722 -320867 -361654 -284437 -220840 -127879 -371188 -442099 -294564
19941 -294564 -373612 -352924 -176471 -185397 120185 250372 221030 60827 223131 278735 177740
19930 177740 264145 118659 -148756 -245320 -277191 -176009 169845 253378 -60042 -61123 -109793
19919a09793k18373j29197K06441J42828j74019q4578R658M08819n5980o4854
19909f9048j1261j22673J02831K84251N0033j69427R3946j4810n103q0240J05692
19898A64191O3274k75160k38555j38771J97560o7250j79592K40679P0755l31575
19888d94444P1192P8663K60298J68325L4979P3217L16664j27007j95170J85779
19878C72496j10177k29004q7742k74417Q2725K18682J31988J05130j5378L33614
19868E27917k51174j30555j55256q4623M4944j71077K93910M28108o0535j42140
19858B99519o1933j81497k10073K08488J04849j76835l5379r8529K32166N9420
19848A40196r6595J46212L81041J44516r2422m16110n3273o2474q2035O9357j77878
$$ plain form
19919 -109793 -328166 -457363 -250922 -108094 -282113 -366691 -357033 51786 -4194 -69048
19909 -69048 -80309 -202982 -100151 184100 234133 64706 158652 143842 138739 58499 164191
19898 164191 227465 -47695 -286250 -425021 -227461 -294711 -474303 -233624 -162869 -494444
19888 -494444 -423252 -344589 -84291 84034 119013 192230 508894 381887 186717 372496
19878 372496 262319 33315 -54427 -328844 -246119 -27437 104551 209681 194303 527917
19868 527917 276743 146188 -9068 -93691 -48747 -219824 74086 502194 441659 299519
19858 299519 237586 56089 -153984 54504 159353 -17482 -52861 -151390 80776 140196
19848 140196 43601 189813 570854 715370 622948 206838 153565 91091 9056 78413 -99465
19837i9465n6747k63313J01323J31493J19335n8480O3969j4777j90687n6526K96099
19826b7776L57684l3296R8174P3912o406j16171L4319l46053R637j4240j09974
19815h0190n3395K97927j99423l5307J99904J25953r7606R2600j436j4504J32673
19804C67196J74253l4301k11224j98808l0175k59903P0361j3974JO6207J88904
19793A18537J66570J60675N7988L9866j41560o8533o7641l1577j01609J22793
19783B55509j40380K3752R717K25733k9167j27958j96731K26608K20469L4291
19773E01843k70481J76767o0670p3130k29819k02125j282K06589m6359K00196
19763B01529j16603l28685j150J79740L5876O0036O4845l4052j17472j10207J5140
$$ plain form
19837 -99465 -156212 -419525 -318202 -186709 -67374 -125854 -61885 -76662 -267349 -323875 -27776
19826 -27776 329908 296612 394786 468698 462292 346121 380440 34387 44024 29784 -80190
19815 -80190 -133585 164342 -35081 -70388 129516 255469 157863 250463 249027 234523 367196
19804 367196 541449 507148 295924 97116 66941 -192962 -122601 -136575 -136574 -70367 118537
19793 118537 285107 445782 503770 543636 402076 333543 265902 234325 132716 255509
19783 255509 115129 138881 148598 374331 345164 217206 20475 247083 467552 501843
19773 501843 231362 408129 347459 274329 44510 -157615 -158897 47692 1333 201529
19763 201529 84926 -243759 -244909 -65169 -29293 30743 95588 61536 -55936 -166143 -151003
19752a51003J59465J05832j98135j7302M6740k2798O464k50366k2172n042l3443
19741c81760M1759J58038N3912N7480m4124k74664J61353J03464J67552m7892
19731d882j23447P8090J71491j38398k93324j39566K57299J65248k951m44334
19721d74774J74615K86880K94015k4084L5046l4457q5671n850m0487o4006J01754
19710A62981r0881J64384p6775j3576j10602k998o8200K95905R5216j31835q7661
19699A35958p8015O6497j02112k28443J3668Q3732P2611l5567L5796l5860J76019
19688A04284J08024j05246j3697j32052p3893k5515j53826M9752k3716k35169
19678e01054M4765J69601K80090j97060M2429L898Q2372m0761j38458P4383J59880
$$ plain form
19752 -151003 8462 114294 -83841 -101143 -54403 -77201 -70737 -321103 -343275 -348317 -381760
19741 -381760 -340001 -181963 -128051 -70571 -114695 -389359 -228006 -124542 43010 -4882
19731 -4882 -128329 -50239 121252 -17146 -310470 -450036 -192737 -27489 -30440 -474774
19721 -474774 -300159 -13279 280736 256652 291698 257241 171570 165720 125233 61227 162981
19710 162981 72100 236484 159709 146133 35531 32533 -35667 260238 355454 223619 135958
19699 135958 57943 124440 22328 -206115 -192447 -108715 -36104 -71671 -35875 -71735 104284
19688 104284 212308 107062 93365 -38687 -112580 -138095 -291921 -242169 -265885 -501054
19678 -501054 -456289 -286688 -6598 -203658 -161229 -157331 -74959 -115720 -254178 -179795 -19915
19667a9915J47591j43137l5988j34530J25089L4401n8647R9436K85699Q990j38273
19656A70716j20929j24818k89224m1813M15221k1303L15920K49730J68625j286
19646G20839k33609j59161m6780Q8479N6506n2751J02919L9309k12175j89342
19636A14234j3288j5603l05274J9850o060j1554K04228n0550j13569R6940j40725
19625b21371m3176L40585P2113J29734R1042k31230k85191r9400J81319l20079
19615c85654K09625J34178p8376J15850Q8660J93808j65241J03092l08898K36752
19605A43796r0411L1073j13766J87419L17448R1086k26606j6547l59998J65306
19595A28800J09723l02554j83126n8627L0398q2606L40693J6193m7204J54851
$$ plain form
19667 -19915 127676 -15461 -51449 -185979 -60890 -26489 -85136 14300 299999 308989 170716
19656 170716 49787 -75031 -364255 -406068 9153 -12150 303770 553500 722125 720839
19646 720839 487230 328069 281289 369768 426274 373523 476442 515751 303576 114234
19636 114234 100946 85343 -219931 -200081 -206141 -217695 -13467 -64017 -177586 -80646 -221371
19625 -221371 -264547 76038 148151 277885 368927 137697 -147494 -246894 -65575 -385654
19615 -385654 -176029 -41851 -120227 -4377 84283 278091 112850 215942 -92956 143796
19605 143796 53385 84458 -29308 158111 475559 566645 340039 323492 -36506 128800
19595 128800 238523 -64031 -247157 -305784 -275386 -357992 -17299 -1106 -48310 106541
19585A06541P8716N8563n1712r2963L43481l2126q5976j26276j07594j86337j28543
19574b24226j23116R8558N6476j73506J03681J55616O1354J96497K43208j54032
19564B40510o7132m4908j07528k07760K69697J34021J36495L4474K25592O1822
19554F75283J75030j10280k59731L4196k06686k11559O2755p410k1198j15583
19544A4817R2232R4112j20996O159p8179M3509j01333K24885K98868p2801j89192
19533B12081l0538j69559k43381J73931J80273K16301n1336k50342L14172J58615
19523E10217j86319l98305j49991J36192J18035L8334K14202j06920j45232K542
19513C2755K88968L9953p1699O027o323j98622p9531J43710K25404k09609j69530
$$ plain form
19585 106541 185257 243820 192108 99145 442626 410500 324524 198248 90654 -95683 -224226
19574 -224226 -347342 -248784 -192308 -365814 -262133 -106517 -45163 151334 394542 240510
19564 240510 173378 128470 20942 -186818 82879 216900 353395 387869 613461 675283
19554 675283 850313 740033 480302 514498 307812 96253 159008 151598 130400 14817
19544 14817 107049 201161 80165 86324 8145 51654 -49679 175206 474074 401273 212081
19533 212081 181543 11984 -231397 -57466 122807 339108 287772 37430 351602 510217
19523 510217 323898 -74407 -224398 -88206 29829 68163 282365 175445 30213 32755
19513 32755 321723 361676 289977 296004 289681 91059 11528 155238 380642 171033 1503
19502A503J58026m2236k1324k58523J84876K28108P826r9488j98169m5174M56972
19491C72397r8302l14739j07647j51653O1479K82336J40989j6041l8549m5098
19481H5172J8766k3045R4779r6587J19654P384J15659J58682o0340k57640J23689
19470B86173O1556j19971r3459j98482j20561P1910K15297M3562K88904m1155
19460C93774K24506q5466k3508p4183m0354j40520O3341R4237J98387K3641K7203
19449F61058j70332o2018k8193r226m3898q4637J58145K78722l7592J14362N3034
19438H29425o2346L7145J86155O4291j1648l8M4650j57225n2774m6866Q8742k79264
19426F40247k72887J28144o1829K79119J23837J25554k54936j13419O9178J20499
$$ plain form
19502 1503 159529 117293 95969 -162554 22322 250430 258256 158768 -39401 -84575 372397
19491 372397 274095 -40644 -148291 -299944 -238465 43871 184860 168819 130270 85172
19481 85172 103938 80893 175672 79085 198739 206123 321782 480464 420124 162484 286173
19470 286173 347729 227758 134299 -64183 -184744 -112834 102463 146025 434929 393774
19460 393774 618280 532814 509306 435123 394769 254249 317590 411827 610214 633855 661058
19449 661058 490726 428708 400515 391289 347391 262754 420899 699621 662029 776391 829425
19438 829425 767079 804224 990379 1054670 1043022 1042984 1087634 930409 877635 830769 919511 640247
19426 640247 367360 495504 433675 712794 836631 962185 707249 593830 663008 783507
19416G83507J78044j7902j02260J06953k46937l4046J49570j78587l32547j37098
19406A68697j1541K82798K43838j47652K32398K50434k36838k38273m6745J85321
19396F82437J7841k57183m1589J29427J58603P1649J02634k7310k71816j96165
19386C68528j72707K88708K11082J06675M789j13771j41309q5187k23653n4549
19376A88606K73912M125k77214j64724p0777O2359J56931L0730P3357J13129m3206
19365C47228O6358K01234J16574j00721j64130n9215J91794o4829l49031k58603
19355g3341J68980M4015j06857j00049K4302N514j5285l140J11141J30431J73835
19344C59546J74709M1042k60586m37942R7568n6R4982N1047J73620O9464l88715
$$ plain form
19416 783507 961551 943649 841389 948342 701405 667359 816929 638342 305795 168697
19406 168697 157156 439954 683792 536140 768538 1018972 782134 543861 497116 682437
19396 682437 700278 443095 401506 530933 689536 761185 863819 836509 564693 368528
19386 368528 195821 484529 695611 802286 807075 693304 551995 466808 243155 188606
19376 188606 462518 466643 189429 24705 -46072 16287 173218 203948 277305 390434 347228
19365 347228 413586 614820 731394 630673 466543 407328 599122 534293 185262 -73341
19355 -73341 95639 139654 32797 -67252 -42950 -37436 -52721 -55861 55280 185711 359546
19344 359546 534255 575297 314711 -123231 -25663 -25719 69263 120310 293930 363394 -25321
19333b5321M4330M72069K79062j66827l03188J19033j28929k55688O6397K98899
19323C99837J21219j13007k68905j16092O6895Q4015P908l32945l08044L6671
19313d22448M00183J18597k5647M4542K95342J87891j74063j01737L13965k11039
19303D25586k40166j98664j46966N8716K25873J6352k79695j02350m1455J37314
19293a45455K57601Q2513l6238j33627L35651j41517Q8542J01417j62713n7383
19283A88791j62169K7380j99742k63005j50749j80991L44832M33537R2502J03393
19273B33779N9318j19560n4170p5819o6366Q4060l2433P2906K71189M6794k70605
19262A49093L5608l03944J44134L43608J5484j73337o9228l386L44518K97538
$$ plain form
19333 -25321 19009 491078 770140 603313 300125 419158 290229 34541 100938 399837
19323 399837 521056 408049 139144 23052 89947 173962 181870 -151075 -459119 -422448
19313 -422448 -22265 96332 70685 115227 410569 598460 424397 322660 636625 425586
19303 425586 185420 -13244 -160210 -101494 124379 140731 -138964 -241314 -282769 -145455
19293 -145455 112146 194659 158421 24794 360445 218928 307470 408887 246174 188791
19283 188791 26622 54002 -145740 -408745 -559494 -740485 -395653 37884 130386 233779
19273 233779 293097 173537 119367 43548 -22818 61242 28809 101715 372904 419698 149093
19262 149093 184701 -119243 24891 368499 383983 210646 141418 138032 482550 780088
19252G80088k46854k48531N5416k50696q2597P2940J55130J23683M5390J71313
19242E75282K96748r0063j66934j9884l08694j5401R0339N2530J1960M0721j81401
19231B85203j91872k04022K16028P3452K89996n0330m1442k42827l9537J12322
19221B06971j11253L9202l5199L3389k43262k21637Q2792k2079K54251K59342
19211B42517k5705J2194K56931l7952j06155r7P6592K18298l13323r5606J22355
19200C50049J927J62652J36002j74128j0468k24324L9578J18598m12110r9451
19190a11675K3119J31154J16951R0887K72189J0024j1849k90441P8221j91151
19180A17429J17664P4188P3419j00954m9960L30360M13833N6958p2358n3855k22518
$$ plain form
19252 780088 533234 284703 340119 89423 6826 79766 234896 358579 403969 575282
19242 575282 872030 781967 615033 595149 286455 271054 361393 413923 425883 466604 285203
19231 285203 93331 -110691 105337 178789 468785 418455 377013 134186 94649 206971
19221 206971 95718 134920 99721 133110 -110152 -331789 -248997 -271076 -16825 242517
19211 242517 216812 229006 485937 447985 341830 341733 418325 636623 323300 227694 350049
19200 350049 351976 514628 650630 476502 466034 241710 281288 399886 -12224 -111675
19190 -111675 -88556 42598 159549 250436 522625 532649 520800 230359 308580 117429
19180 117429 235093 309281 382700 281746 231786 562146 975979 1032937 960579 906724 684206
19169F84206k25845N9367J17733j76587l63637n331R026K3602L55967J88779j40853
19158E26427R1653M3160n5683o4801K28515K32820m4685k65693k21894j34503
19148C35316K7536R4039j9795k51540K25735K29377j07321r3920o8511P4122J69404
19137F14442Q5613J22961N4260k43446j76507k0774J75683O4884p78r5967j39669
19126D40702j13057N5041L00493M4941m0103j30142j74776j04901j38592j05683
19116C3923J04800J35473k42397j15849J24392O5463l0631J62396P2147l7042
19106B72675Q6244J80464K2835j58154N7944M2574Q3512k3078O3126K5627R4164
19095G47933o2647R0060o0579l17148l09294L7554J18431L21138Q36j65396K25663
$$ plain form
19169 684206 458361 517728 635461 458874 95237 89906 98932 122534 478501 667280 526427
19158 526427 618080 661240 605557 540756 769271 1002091 957406 691713 469819 335316
19148 335316 362852 456891 437096 185556 411291 640668 533347 439427 370916 445038 614442
19137 614442 700055 823016 877276 633830 457323 436549 612232 677116 676338 580371 440702
19126 440702 327645 382686 683179 728120 688017 557875 383099 278198 139606 33923
19116 33923 138723 274196 31799 -84050 40342 105805 75174 237570 309717 272675
19106 272675 358919 539383 562218 404064 462008 504582 588094 565016 628142 653769 747933
19095 747933 685286 775346 714767 397619 88325 125879 244310 565448 566284 400888 626551
19084F26551j57654j90763q7754L25118J80252P4580j09709k56107J5217k5814
19074C93917o491j01378m2357l5329J48954K00048n2919r1904M6265J11030Q1317
19063F51153k2166l6831J28252M351k05475j6453K90387o4489J60464J82582k15130
19052H56645J05200K06544J4907m28725j37960k5513J45967p733p9105j12841
19042E37386m9709J19413J00598J37044K40287J03664K94466J88803j7529l35212
19032A319211j77099J73112K19273k20016j81741J93824L3042l38126m8447K88628
19022A261661J14639j34582J39018L33341K18495j65771j06051J0253l910J0620
19012A677713K11323J68348K43431K42207K58702j44233k9725n9566P147K84247
$$ plain form
19084 626551 468897 278134 190380 515498 695750 770330 660621 404514 419731 393917
19074 393917 387426 286048 243691 208362 357316 557364 504445 412541 458806 569836 651153
19063 651153 628987 592156 720408 724759 519284 502831 793218 728729 889193 1071775 856645
19052 856645 961845 1168389 1183296 754571 616611 591098 737065 729332 650227 537386
19042 537386 487677 607090 707688 844732 1085019 1188683 1483149 1671952 1654423 1319211
19032 1319211 1142112 1315224 1534497 1314481 1132740 1326564 1359606 1021480 973033 1261661
19022 1261661 1376300 1241718 1380736 1714077 1932572 1766801 1660750 1671003 1667093 1677713
19012 1677713 1889036 2057384 2300815 2543022 2801724 2657491 2627766 2568200 2575347 2859594
19002B859594K81850m09799j95800J254J73342K08031J31751J70544L15048K29808
18992C765623L99334O68910O90275N77779J67187J44215j97580k61984l46801
18983E606958l90415J4462j22300R2356N67166K62793M19205L63785L52678Q55982
18973H022670J114064J255756J330841J274229Q41357O38417J142052R94859J583674
18964A8197919K403895L182951K621184J844179J867976K691913L280950L500381
18956C9591348M964528Q047106J3622909K1110132K6522091J9915990L531919
18949A37306023n542539p609571j2051714j3745074r801027n257436m093012l174658
18941G6030992N55442M723172P317093P226536N646044N326708L823232K82668
$$ plain form
19002 2859594 3141444 2731645 2535845 2537099 2710441 2918472 3050223 3220767 3535815 3765623
18992 3765623 4164957 4833867 5524142 6101921 6269108 6413323 6215743 5953759 5606958
18983 5606958 5216543 5231005 5108705 5201061 5768227 6031020 6450225 6814010 7166688 8022670
18973 8022670 9136734 10392490 11723331 12997560 13838917 14477334 15619386 16614245 18197919
18964 18197919 20601814 23784765 26405949 28250128 30118104 32810017 36090967 39591348
18956 39591348 44555876 52602982 66225891 87336023 113858114 133774104 137306023
18949 137306023 131763484 124153913 112102199 98357125 88556098 83298662 79205650 76030992
18941 76030992 76586434 81309606 88626699 95853235 101499279 106825987 110649219 110931887
18933A10931887j122818j303664k801494k526395k569574o172042o588514l535577
18925H4311809j086216L94173m27195r47491L28154J507169N71097j537468j649445
18916H1464587q1653q83927k938807k697841j287885j190653k332923k208912
18908F7841986M4357L034815O875104J1708977J4536437J6509422K1575347K4271963
18900A66398408J4159271m547989j6942994k0884802k1581879j7902821j0218312
18893H8478882j59556J0530786K1486643K5740298J3528181n572880j4590394
18886A39441960j8597526k3381715k1893100j6777901j2177029q570125n639223
18879C2405341l891221k864811k158073j989138j899166j160232m63586N43183
$$ plain form
18933 110931887 109809069 108505405 105703911 103177516 100607942 94435900 87847386 84311809
18925 84311809 83225593 83619766 83192571 82245080 82573234 84080403 84651500 83114032 81464587
18916 81464587 81382934 80499007 77560200 74862359 73574474 72383821 70050898 67841986
18908 67841986 67886343 70921158 77796262 89505239 104041676 120551098 142126445 166398408
18900 166398408 180557679 176009690 159066696 138181894 116600015 98697194 88478882
18893 88478882 88319326 98850112 120336755 146077053 159605234 154032354 139441960
18886 139441960 120844434 97462719 75569619 58791718 46614689 38044564 32405341
18879 32405341 28514120 25649309 23491236 21502098 19602932 18442700 17979114 18522297
18871A8522297J060837R47262l67102j973262k178395k080351j974236j739754
18863A0217296j353049q33040r26682q08234k25542J72603j44747j81509j65304
18854E751792n11419j79937J53198L92601N54355L81459L23697l98014p15824
18845E751908q43759r67405l69454k75822l10342j49701l40915k28123Q9176K37353
18835B592916k30040r4657R281J36830j45767r4084Q430q1257k83433n24707k93320
18824A000192K36663J87878o4246J38735J71654R2742n1934k39280k12768k7197
18814A232439P2455k32905L4843r149j36595N3838m298j41628j25388K00126L20808
18803A264546J49606n97786l32646P7017L50239L44532J19500l9957k85951m53880
$$ plain form
18871 18522297 19583134 20530396 20163294 18190032 16011637 13931286 11957050 10217296
18863 10217296 8864247 8031207 7104525 6296291 6070749 6243352 6098605 5917096 5751792
18854 5751792 5240373 5060436 5213634 5606235 6160590 6542049 6865746 6467732 5751908
18845 5751908 4908149 3940744 3571290 3295468 2985126 2835425 2494510 2266387 2355563 2592916
18835 2592916 2362876 2268219 2277500 2414330 2268563 2174479 2182909 2101652 1818219 1293512 1000192
18824 1000192 1236855 1424733 1360487 1499222 1670876 1763618 1711684 1472404 1259636 1232439
18814 1232439 1304894 1071989 1106832 1097683 961088 1014926 1010628 869000 743612 943738 1264546
18803 1264546 1414152 816366 483720 560737 910976 1255508 1375008 1335051 1049100 595220
18793E95220k84962L70616K41540M0240o4972J5786q7413r8784J77345J72342
18783A076958R7783K55470r7860n86815l21860P6419J78437K62421J7479m9093
18773I09339j50764j2429J22378J59075J15757R9516N6118Q8273M75962M95517
18763B358742M82661o7278l52232k04643m18059m49975k90161n8834J95307o9278
18753A126250l75918m08673L8287j59175n4685k63479l0125J04199j55955k57467
18743d36741j19720L51879M36423J43263j93164o2214j16426J53257o2066N8340
18733A52831k4081p7931L14048J2178J80537K08164j06148k07509r2654j59894
18723A99541k61347K9283j06150K21292K47449J02154k02375r2573J30523j1072
$$ plain form
18793 595220 310258 680874 922414 962654 897682 913468 826055 727271 904616 1076958
18783 1076958 1174741 1430211 1332351 745536 423676 500095 678532 940953 958432 909339
18773 909339 758575 746146 868524 1027599 1143356 1242872 1298990 1387263 1863225 2358742
18763 2358742 2841403 2774125 2421893 2217250 1799191 1349216 1059055 1000221 1195528 1126250
18753 1126250 750332 341659 379946 220771 166086 -97393 -127518 -23319 -179274 -436741
18743 -436741 -556461 -204582 231841 375104 181940 119726 3300 156557 94491 152831
18733 152831 128750 50819 364867 377045 557582 765746 659598 452089 359435 199541
18723 199541 -61806 -32523 -138673 82619 330068 432222 229847 137274 267797 256725
18713B56725k53215O7023J13987K48818J82356j35119j42801m7675k16745J22466
18703A95820m8966K64067K26506l4011j49993j6430l29356k15064P6835N6042
18693B5450k6331O8525K76014J10668O1271j00592j48805J52882K70588j73992
18683E15678k76411J9209j78717l56128K18169L91342l22677r0615K37520J30332
18673B87702q007R0174j86422L4513J53815O9804k40847j98518K41654J71024
18663D14892n2979K17044J92295r4771N146j79552j92440K41023k249m1688K68774
18652G75495q1709J362o7154q433Q7195j44829m2716J77222j86175k56376J4514
18641B68396p0457j9005K50758J38746j91556K15481Q8464J1935j06365j26565
$$ plain form
18713 256725 3510 70533 184520 433338 615694 480575 337774 290099 73354 195820
18703 195820 146854 410921 637427 603416 453423 436993 107637 -107427 -30592 25450
18693 25450 -881 67644 343658 454326 515597 415005 266200 419082 689670 515678
18683 515678 239267 258476 79759 -276369 -58200 333142 10465 -80150 157370 287702
18673 287702 279695 369869 183447 217960 371775 441579 200732 2214 243868 414892
18663 414892 361913 578957 771252 676481 681627 502075 309635 550658 548409 506721 775495
18652 775495 693786 695148 627994 619561 706756 561927 519211 696433 510258 253882 268396
18641 268396 197939 178934 429692 568438 376882 592363 680827 692762 586397 459832
18631D59832j32349L42849K02019j61161j47074r7898j40859j06964K8968j03532
18621A43831l0355j66138J82136Q9577K68346M6401Q7017K23677J63336K1399
18611A029227l33525j71032J1932k43367k68999M1811J89358L45600L5224m8117
18601E88112J22361J1110M7443l2932M8812R3880L08870K48999k77726r4347L7811
18590A102393j06351l91735l78229j133r3068J44977L9130P6882j38825M9006
18580C03047j51401l5965P7924O7746K5546p14q8648K4134J34844J15185m8021
18569D23677J04249J30286L47640K29403k62820j32414J55882J18376k96441k91548
18559E26290p1926j22618l5270J34401J21859J87228j20635L62117K54495R1483
$$ plain form
18631 459832 327483 670332 872351 711190 564116 466218 325359 218395 247363 143831
18621 143831 113476 -52662 129474 219051 487397 533798 620815 844492 1007828 1029227
18611 1029227 695702 524670 536602 293235 24236 66047 255405 601005 636229 588112
18601 588112 710473 721583 769026 736094 784906 878786 1187656 1436655 1158929 1064582 1102393
18590 1102393 996042 604307 226078 224945 131877 276854 315984 392866 254041 303047
18580 303047 151646 115681 193605 261351 286897 286183 197535 221669 356513 471698 423677
18569 423677 527926 658212 1005852 1235255 972435 840021 995903 1114279 817838 526290
18559 526290 454364 331746 296476 430877 552736 739964 619329 981446 1235941 1327424
18549A327424L2632K75532Q9499k49436r9771J21983j890k7417k03214q3220j30929
18538A051193J99968k96057j49987L18L59616J82305J98154M45185J2417k70378
18528A732734j57856K0998q8540o50K61833L81481K07757Q7871K27760J33202
18518B806590J83025K00563L21679L68125O5965K14100R1743k3045m8362j02516
18508D077867r4929K2599L24153L38151M47294P03950P29202P87088J310294K240441
18498A0886110L327851M270667K827806O52864K96092M25656o20979k010935j964430
18489A8090702j379711p77810J2800J342039J342572n4058j280989j193043j223001
18480A4879501j221529o59355J905Q87296J700564L067814L771839L692743L434104
$$ plain form
18549 1327424 1360056 1635588 1725087 1475651 1375880 1497863 1495973 1468556 1265342 1182122 1051193
18538 1051193 1251161 955104 805117 805435 1165051 1347356 1545510 1990695 2003112 1732734
18528 1732734 1574878 1595876 1507336 1506686 1768519 2150000 2357757 2445628 2673388 2806590
18518 2806590 2989615 3190178 3511857 3879982 3945947 4160047 4251790 4228745 4180383 4077867
18508 4077867 3982938 4005537 4329690 4667841 5115135 5819085 6548287 7335375 8645669 10886110
18498 10886110 14213961 18484628 21312434 21965298 22261390 22687046 22066067 20055132 18090702
18489 18090702 16710991 15933181 15945981 17288020 18630592 18576534 17295545 16102502 14879501
18480 14879501 13657972 12998617 13000522 13887818 15588382 18656196 22428035 26120778 29554882
18471B9554882M910828P045074O454238J493318l114346l462011m193611l878428
18463C4809944j935038Q77546L294356M559166L599611O84474k286347l456396
18455D0147316l886077l773088k486109j104449K01831J692360K805027M576253
18447C8173064P091921J0134578J2481876J3551934J6357189K0883959J9399647
18440A38074168J1643917Q985934J1156380N650510m718272q293109n923053q881209
18432A47695266j2257117r389254n677302n219942k401409K186307Q08764m220217
18424A11525096n627789m125989l268292o06383N231678Q338980L064288m883878
18416A09647711p407738q238043q301322n560844j238939L545035Q598547J5209048
$$ plain form
18471 29554882 34465710 41510784 47965022 49458340 46343994 42881983 38688372 34809944
18463 34809944 32874906 33752452 37046808 41605974 45205585 45890059 43603712 40147316
18455 40147316 36261239 32488151 30002042 28897593 29099424 30791784 33596811 38173064
18447 38173064 45264985 55399563 67881439 81433373 97790562 118674521 138074168
18440 138074168 149718085 158704019 169860399 175510909 170792637 162499528 156576475 147695266
18432 147695266 135438149 126048895 120371593 115151651 112750242 114936549 115745313 111525096
18424 111525096 105897307 101771318 98503026 97896643 103128321 111467301 114531589 109647711
18416 109647711 102239973 94001930 85700608 80139764 78900825 82445860 91044407 106253455
18408A06253455K3679828L0307060K9089945K2479019K2182631K5393822K3138572
18401B82524332P569559j6576566k9101020k9845285k8157889j8742945j940021
18394A65730165J7331693L6272176M3257457K7205591K805362j9634437l8807410
18387B34160597m4857769m1523994l4702234k5706396j7445637j2002139q016057
18380D9906371m992329k814536k22635K464553N006048N290933K925191J104245
18372E8667841L07358j071596k456513m834025o402499o305951n472640m487419
18364B7944556k318173J35579J808886K611535J491272j111571k922289l751972
18356B3887823l735231l436194k882352k119977j635269j090840q75998r08281
$$ plain form
18408 106253455 129933283 160240343 189330288 211809307 233991938 259385760 282524332
18401 282524332 290093891 273517325 244416305 214571020 186413131 167670186 165730165
18394 165730165 183061858 219334034 262591491 289797082 292602444 272968007 234160597
18387 234160597 189302828 147778834 113076600 87370204 69924567 57922428 49906371
18380 49906371 44914042 42099506 41876871 44341424 49347472 54638405 57563596 58667841
18372 58667841 58975199 57903603 55447090 50613065 44210566 37904615 32431975 27944556
18364 27944556 25626383 25761962 27570848 30182383 31673655 30562084 27639795 23887823
18356 23887823 20152592 16716398 13834046 11714069 10078800 8987960 8111962 7203681
18348G203681q93869o04572k01379k9389J59413j5030k51556m89768j92932l32222
18338D352377r0062J94662M66698N93207O79781J072785J527892L58469m71747
18329H684062p99176p50386p20869m47518K1931L40548M08792P94467J002186
18320H534037M75858n58412n43299p67363j089545j012936o90604m00286k79159
18311C668291K1205m2683k0179j51207n9193l4884m64600n53871j51642l83375
18301A827862l52893m1594L35626O0674n3733J1584k52850j75343n9583O3993
18291A363743k17488p3509n5126k17278j53775K03305k2873j88142j86867J39097
18281E91087j23163n0184K18128Q3722k23376o4713L07035L3680l31784J57627
$$ plain form
18348 7203681 6309812 5705240 5503861 5474472 5633885 5618855 5367299 4877531 4684599 4352377
18338 4352377 4262315 4456977 4923675 5516882 6196663 7269448 8797340 9155809 8684062
18329 8684062 7884886 7134500 6413631 5966113 5988044 6328592 6737384 7531851 8534037
18320 8534037 9009895 8451483 7908184 7140821 6051276 5038340 4347736 3947450 3668291
18311 3668291 3689496 3646813 3626634 3475427 3416234 3381350 2916750 2362879 2211237 1827862
18301 1827862 1474969 1433375 1769001 1829675 1775942 1787526 1534676 1359333 1299750 1363743
18291 1363743 1146255 1072746 1017620 800342 646567 849872 826999 638857 451990 591087
18281 591087 467924 417740 635868 719590 496214 431501 738536 772216 440432 598059
18271E98059R9899j84351q0337K12901j56465J11500j82213m3616J95538k61754
18261C09161j56165Q5594n5118K59488K66748k52817J19017K86824l9158k18049
18251F05525l68198r2686P7022K99244L24165P1045n56101k28479J84541L74198
18241F90276k516j39779j77501k3162L72280J52549k73877q6743K5875M6966J7797
18230F02165k1446j63376J83618K60848l31653n65494o3178J15182J02400J02513
18220B21579R2731J82598K46590m6185m41538k77270J18063K11905n436J44975
18210D48012o5077j00453M8413O4997k00464R579l3099J47427r3564j45605j83254
18199a03088R3546J09117J45432K1437o5800p6555j71478O9047L52936o3116J07365
$$ plain form
18271 598059 697958 513607 433270 646171 489706 601206 418993 375377 570915 309161
18261 309161 152996 238590 183472 442960 709708 456891 575908 862732 823574 605525
18251 605525 237327 144641 221663 520907 845072 916117 360016 131537 316078 690276
18241 690276 687760 547981 370480 347318 719598 872147 598270 511527 537402 584368 602165
18230 602165 580719 417343 600961 861809 530156 -35338 -98516 16666 119066 221579
18220 221579 314310 496908 743498 697313 255775 -21495 96568 308473 303037 448012
18210 448012 382935 282482 330895 395892 195428 205007 171908 319335 225771 80166 -103088
18199 -103088 -9542 99575 245007 266444 200644 124089 -47389 21658 374594 311478 418843
18188D18843l6951Q3884P9166N5572O8486P5774j09463j27394J68425J79153J75285
18177A030780J04531l02621l21747J96473M9538l97K32387K30279m9732j96827
18167I72664j13423K7562R2330J11735r3445J84256M3450k24534j09618k3012
18157H67965n2325L14433J67947Q248J23234O5585K33348j4712J03481q2198J01691
18146A836697L59051L05451J57748K8985m5057n3561L44442J26641J9006J29384
18136C208787P8491J78004L15678M84831M47192K26316K37491M63041M24484L09638
18126F373953J50762N80011J106088J336368Q57302Q41983J281172J886703J910284
18117A6324626K624722L422266L913105M489936O163872Q525548J1620599J7419032
$$ plain form
18188 418843 381892 465776 544942 600514 669000 744774 635311 507917 676342 855495 1030780
18177 1030780 1135311 832690 510943 707416 756954 756557 988944 1219223 1169491 972664
18167 972664 859241 886803 979133 1090868 997423 1181679 1225129 1000595 890977 867965
18157 867965 815640 1130073 1298020 1306268 1429502 1495087 1728435 1713723 1817204 1735006 1836697
18146 1836697 2195748 2501199 2658947 2687932 2642875 2589314 2933756 3060397 3079403 3208787
18136 3208787 3287278 3465282 3780960 4265791 4712983 4939299 5176790 5639831 6064315 6373953
18126 6373953 6524715 7104726 8210814 9547182 10404484 11246467 12527639 14414342 16324626
18117 16324626 18949348 22371614 26284719 30774655 36938527 45464075 57084674 74503706
18109G4503706K7718265M5972985P8727663J20415085R8317795r911026o3082845
18102C72661628n5918744q0759303p6146471m9116344k9864757j9935839j4006057
18095D6914113j0109544p492597n265675l752206l004207k721801j862403j649183
18087A1056497j396054j150879q16514p32021q00943m91885o80859o01018j23286
18078D263038m66746n41614l58448k27050k97651k9572k20993k00628J10377j13805
18068A916908J08987n8147j37073k80734m03882j20064l7839P8450J18780J84773
18058A370159j55939j38841j53598j22981J3001O3249m0702j89572M0004J01802
18048G86582l15857j76131K2006M9761M2595k39281P2000J83229j00000R3170
$$ plain form
18109 74503706 102221971 148194956 226922619 347337704 445655499 435744473 372661628
18102 372661628 316742884 235983581 159837110 110720766 80856009 60920170 46914113
18095 46914113 36804569 29311972 24046297 20294091 17289884 14568083 12705680 11056497
18087 11056497 9660443 8509564 7693050 6961029 6160086 5668201 4987342 4386324 4263038
18078 4263038 3796292 3254678 2896230 2669180 2371529 2341957 2120964 1920336 2030713 1916908
18068 1916908 2025895 1967748 1830675 1549941 1146059 1025995 988156 1066606 1185386 1370159
18058 1370159 1214220 1075379 921781 798800 811801 875050 834348 644776 684780 786582
18048 786582 470725 294594 316600 366361 408956 169675 241675 424904 324904 418074
18038D18074k1600m20539l6952L00835J83228j7865m6966j41050K10468p6535
18028C51098M5785j12251l32334J39141J66057K84422l04078n9704j63079J82815
18018A97872J20442O2890l46220j42931J89412k9417m8517j24191j90390L7755
18008b73295N13815r5068k65835P3504j64596k96254J17409J81285J4171J52186
17998d2678K51665o4504j67955o7312j96515m6277L11495K03790P632k12342k84166
17987c07167q1955J18741L35594P6752l77562K703j20025j13548O0217J20293
17977b85957K37068J530J30370R5577L01303L0162k31112n0116P0239j6535L53242
17966F35771J20425l7640J47970O3461j94777L0453j30673m4907J24361o5850
$$ plain form
18038 418074 396474 -24065 -61017 239818 423046 405181 358215 217165 427633 351098
18028 351098 396883 284632 -47702 91439 257496 541918 237840 178136 15057 197872
18018 197872 318314 381204 34984 -107947 81465 52048 3531 -120660 -311050 -273295
18008 -273295 240520 145452 -120383 -46879 -211475 -507729 -390320 -209035 -194864 -42678
17998 -42678 208987 144483 -23472 -90784 -287299 -333576 -22081 181709 189341 -23001 -307167
17987 -307167 -389122 -270381 65213 141965 -235597 -232894 -352919 -466467 -406250 -285957
17977 -285957 -48889 -47359 83011 178588 479891 510053 278941 228825 299064 282529 635771
17966 635771 756196 718556 866526 929987 735210 765663 634990 590083 714444 648594
17956F48594j7586J13138l1179k04177l9513J60711J94807n6412k67508k74992
17946B25883o6516J31677l3233J57148K16193M5012m7282k6734J38771J91198
17936I32117n5049j26299K33370M76611K9985l85852n38007J13669J54895j529
17926H33911J95870J05074K467N4494k40888q9251J19020m62656j76663J86404
17916E27782J01412M5403j56181j07080J22545o8570l0844l16535o3703J33803
17906A88032J17301p3354k32188J54679M093j48666R6763L0448N0529O7542l1643
17895B23536k91880k39497R9644J07148K13742J65016N2472j09514l7783L654
17885A86538N2530Q7351N0486j22176j73916L3121J68812R4874J34621l97100
$$ plain form
17956 648594 631008 744146 712967 508790 469277 629988 824795 768383 500875 225883
17946 225883 159367 291044 257811 414959 631152 676164 628882 602148 740919 932117
17936 932117 877068 750769 984139 1460750 1490735 1104883 566876 680545 835440 833911
17926 833911 1029781 1134855 1137322 1191816 950928 861677 980697 518041 341378 527782
17916 527782 629194 674597 518416 411336 533881 465311 434467 117932 54229 188032
17906 188032 305333 231979 -209 154470 158563 9897 106660 137108 187637 255179 223536
17895 223536 -68344 -307841 -208197 -101049 112693 277709 330181 220667 182884 186538
17885 186538 239068 326419 376905 254729 80813 113934 282746 377620 512241 115141
17875A15141l42665J39188N14509L07430J47461j45094k16717K4514Q5284K0374
17865F49425J03893m5185j22505l18954j56602j08695j4874M49834j07878j68209
17855A60250o9413J2719m3329l10497j12089K88216M13709J32718j03122J27698
17845D96860J32198l63038j94100m5371j32374J13835L290O8998K4218k40402
17835a35886J47726J8635L10007j16261l14970l2797K66066N6472k19450k68146
17825b88604J37575K06081J83981q7105J08011j01686j63969k18123l6069J49643
17815a10265P154j87963K01277K79879r4009j59954l9023J23938J7690K02432
17805B41156K3808k83531k66712M4490j31859J07242K96202K70729j53523l33182
$$ plain form
17875 115141 -227524 -88336 426173 733603 881064 735970 519253 543767 629051 649425
17865 649425 753318 708133 585628 266674 110072 1377 -13497 436337 328459 160250
17855 160250 90837 103556 60227 -250270 -362359 -74143 339566 472284 369162 496860
17845 496860 629058 266020 71920 26549 -105825 8010 11300 80298 104516 -135886
17835 -135886 11840 30475 340482 224221 -90749 -123546 142520 198992 -20458 -288604
17825 -288604 -151029 55052 239033 151928 259939 158253 -5716 -223839 -259908 -110265
17815 -110265 -103111 -291074 -89797 190082 96073 -63881 -102904 21034 38724 241156
17805 241156 264964 -18567 -285279 -240789 -372648 -265406 30796 301525 148002 -185180
17795a85180n7687J01263j65768k23198J9346K52604K61607P5663j79317R4614
17785f053O4259J12873j01808j38691M0396j36079j60066K397O2899p707J60398
17774a07182o3246j46290J86826O4828o9367O819K30974j95875M5351J61388N7455
17763A71681r9571q1604M708j06684R3890j77377l28114o7899J63682J49474J60817
17752a16997R7503J0656r2737R4399j33244r8131L2695K20719K68239p5519J61680
17741C69263j67047k43352p4126P5532j46478j9954k9386J31403J2704j79126
17731b70567L6274N20142K01499n7406k58457j29534j27357K80213J68081J75489
17721E38377m4967k34354k02553m0588L0201o9583j49773L49101J65143k06581
$$ plain form
17795 -185180 -242867 -141604 -307372 -530570 -511224 -258620 2987 78650 -100667 -6053
17785 -6053 58206 171079 69271 -69420 -29024 -165103 -325169 -322772 -259873 -267580 -107182
17774 -107182 -170428 -316718 -129892 -65064 -134431 -127612 103362 -92513 -47162 114226 171681
17763 171681 72110 -9494 -4786 -111470 -17580 -194957 -523071 -590970 -427288 -277814 -116997
17752 -116997 -19494 -8838 -101575 -7176 -140420 -238551 -205856 14863 283102 207583 369263
17741 369263 202216 -41136 -115262 -39730 -186208 -206162 -235548 -104145 -91441 -270567
17731 -270567 -234293 285849 487348 429942 171485 41951 -85406 194807 362888 538377
17721 538377 493410 259056 56503 15915 46116 -23467 -173240 175861 341004 134423
17711A34423k53816k697Q4421m6222n0662M2150M16964p2291l80140k65165j27429
17700e20464K00331K87820l0066K3029Q6314k30386k15898L16997K62578n7496
17690A22759k86276q6618L83590L50254m2888j56933k80474J8070J04663p7442
17680D8705J3423j29875J35505K0424k69937j46249J70444o5454Q7231M6530L2819
17669e6434L20137J21835j4530k70095J25766K864M6482j2337r8772p1802k72930
17658a79816j14642N12812J50531K3111l4187r4683J31696j71047K5269r3700
17648A55344k13757k20903J34829r570o9496N6009J73807J41814M6914j4197j05050
17637G5744n494k00841J22824J02286o6580n2814n8142l9667M088m1935l6063
$$ plain form
17711 134423 -119393 -122090 -37669 -83891 -134553 -92403 324561 252270 -127870 -393035 -520464
17700 -520464 -320133 -32313 -62379 -39350 46964 -183422 -399320 -82323 180255 122759
17690 122759 -163517 -250135 133455 483709 440821 283888 3414 21484 126147 48705
17680 48705 62128 -67747 67758 88182 -181755 -328004 -157560 -223014 -135783 -89253 -56434
17669 -56434 263703 385538 371008 100913 226679 229543 276025 263688 164916 93114 -179816
17658 -179816 -294458 218354 368885 391996 357809 263126 394822 223775 249044 155344
17648 155344 -58413 -279316 -144487 -154057 -223553 -167544 6263 148077 194991 180794 75744
17637 75744 70250 -130591 -7767 94519 27939 -24875 -83017 -122684 -118596 -160531 -196594
17626a96594j33991K70205K9557K7274L3114n8409J44213M9349O983N5966J10633
17615C38300m7809J1692l41007l31519k74971K29592J16989k46861J44786J11076
17605b89732M6429K47197K07561j51858J791j6413O7586j18644J48169k1860N8500
17594A78726M1382n0896K01796R600m1220r7616J10359k06540n21488J59162J59227
17583e7508j09112j28689J19664K51090J879k24464j49503L7591j45240k5970
17573d30262J39845J34305L84116J42108K9428k01094j99547J03059P630j69048
17563e9460k11475K30885q0791R2033J63174J3706k17310K583K33391j74372k45867
17552b53503k06964K30128j3830o8620J982j34482L5080N6373J00689Q4280J20819
$$ plain form
17626 -196594 -330585 -60380 -30823 -3549 29565 -28844 115369 164718 171701 227667 338300
17615 338300 290491 302183 -38824 -370343 -645314 -415722 -298733 -545594 -400808 -289732
17605 -289732 -243303 3894 211455 59597 61388 44975 112561 -6083 142086 120226 178726
17594 178726 220108 169212 371008 380608 339388 241772 352131 145591 -375897 -216735 -57508
17583 -57508 -166620 -295309 -175645 75445 77324 -147140 -296643 -259052 -404292 -430262
17573 -430262 -290417 -156112 228004 370112 399540 198446 -1101 101958 109588 -59460
17563 -59460 -270935 -40050 -120841 -28808 134366 148072 -69238 -66655 166736 -7636 -253503
17552 -253503 -460467 -230339 -244169 -312789 -310807 -445289 -410209 -353836 -253147 -168867 -48048
17541d8048R1218j23242p0264K7660J77875m3746j20732l7299P4723J57566L6232
17530A21943l5782j10171P1351P5442J05216M6442j78781j60859K0691l03917
17520c48425N6018L6723m1482k8949l8215L294k29309J6346K08528J64674L6908
17509a63889j65589K16392K59340J69054j05547o7712q0489o6891J32095K51271
17499C78035l7488m5592R915P60938P41482J74441J59870j75498j31522k07734
17489A626847l55343k87878j29706k39348m83296l63670j42595Q1873J94092J86954
17479H7930J81934j82769j69010J6954J25348M04711J97389m5825j61568j99627
17469B55467p9788j50352q2006N1339K3789k48977m365L8835K02573O4112J62356
$$ plain form
17541 -48048 43170 -80072 -150336 -122676 55199 11453 -109279 -146578 -71855 85711 121943
17530 121943 86161 -24010 47341 122783 227999 274441 95660 -65199 -44508 -348425
17520 -348425 -292407 -255684 -297166 -326115 -364330 -361036 -590345 -573999 -365471 -200797 -163889
17509 -163889 -329478 -113086 146254 315308 209761 142049 61560 -5331 126764 378035
17499 378035 340547 294955 304870 1065808 1807290 1981731 2141601 1966103 1834581 1626847
17489 1626847 1271504 983626 853920 614572 131276 -232394 -374989 -293116 -99024 87930
17479 87930 269864 87095 -81915 -64961 60387 465098 662487 616662 455094 255467
17469 255467 175679 25327 -56679 -5340 18449 -230528 -234893 -196058 6515 70627 232983
17458B32983M08512j90042n26741j75880j43443r2448R399R6429J24842k40135
17448d96524j62885K00600K53377J5066K96118K04647M29008O75522O06254L81263
17438B402446J20264m56033j59268l69412l30794j03418k90866k68192j11930
17429D32797k47876n5842k63766P9883K63774K73352k6995j77370p461Q6908k78728
17418G8676n1096P5505J78662L7929o7916k14459j67238J81647r4707N3926J36175
17407A47104L16003J43482l04149j78345p3751O5651l1035R14R2934p5926p9686
17396B3196Q0114k03834j60284K00189p8399l2267K11153J11681n0934k17011
17386a16396j20693L95717j46796n2333K90645j61666j42547p513J4045n8558
$$ plain form
17458 232983 641495 451453 -75288 -251168 -394611 -487059 -477660 -381231 -256389 -496524
17448 -496524 -659409 -458809 -205432 -190366 105752 310399 739407 1414929 2021183 2402446
17438 2402446 2522710 2066677 1907409 1537997 1207203 1103785 812919 544727 432797
17429 432797 184921 129079 -134687 -54804 208970 482322 455327 277957 270496 357404 78676
17418 78676 27580 103085 281747 319676 251760 37301 -129937 51710 -42997 10929 147104
17407 147104 463107 606589 302440 124095 50344 115995 84960 85874 178808 102882 23196
17396 23196 103310 -100524 -260808 -60619 -139018 -171285 39868 151549 100615 -116396
17386 -116396 -237089 158628 11832 -40501 250144 88478 -54069 -61582 -47537 -106095
17376a06095k10054n5458L73388k5656J06689J0811L8715K4755k83517n5534K39035
17365E7079J6540m6069p2709k9022J30707q2691j4903j1300o8501j4961L23143
17354A87313K74182j52802J20864J30340j98149k38871j35157N9961J0948j44506
17344h5877m3657J50764L0050j76571k85905J79596K33124n59k16297j27653N96
17333c42389k97064j12116K90159J62433m3103l8285r1512j16037J11681J88511
17323b87722o5120K29142L59868j16997m6897J0604n5192K9538J2255n2603o0114
17312d3238j04756j93368r6476P6412j12899Q1353K10640J57363J67519n1837
17302I0713j25956J84856J15316l3864R1133j30385l6137k7167R8692j10214j52342
$$ plain form
17376 -106095 -316149 -371607 1781 -23875 82814 93625 132340 157095 -126422 -181956 57079
17365 57079 73619 27550 -45159 -74181 56526 -26165 -41068 -52368 -120869 -135830 187313
17354 187313 461495 308693 429557 559897 361748 122877 -12280 47681 58629 -85877
17344 -85877 -129534 21230 51280 -125291 -411196 -231600 1524 965 -215332 -342985 -342389
17333 -342389 -639453 -751569 -461410 -298977 -342080 -380365 -471877 -587914 -476233 -287722
17323 -287722 -352842 -123700 236168 119171 72274 82878 27686 57224 69479 16876 -43238
17312 -43238 -147994 -341362 -437838 -361426 -474325 -392972 -182332 -24969 142550 90713
17302 90713 -35243 149613 264929 231065 322198 191813 155676 128509 227201 116987 -35355
17291c5355j29748J30046K04641j01748o8007l25536K63362K49914l8833n7550
17281I1186p1738q4583j72201p3498J06885l7948q995l4830j84702J81329j35163
17270d24258r9946J75464M33072j3861l07062R0559K25812K21928J05816L0637
17260D38161q4012j06362N4771K6047o0112r1170L3648k77838k37395j38560j37761
17249e80583K21310K97777K96563j42299K11029J1573R513J21352j11861Q0938
17239D15312q0370k33227j77660m8404N8980M6272n1403m20018O8955R9726K50154
17228g1683O1470L3461J82131k02916m27138j48579J78533K25036R5826k47535
17218c21394p9497J56933L29044K29403M1345J12178J0951q960j16719k40566
$$ plain form
17291 -35355 -165103 -35057 169584 67836 -171 -325707 -62345 187569 148736 91186
17281 91186 19448 -65135 -237336 -310834 -203949 -241897 -250892 -285722 -470424 -289095 -424258
17270 -424258 -524204 -348740 84332 70471 -236591 -146032 79780 301708 407524 438161
17260 438161 354149 247787 302558 328605 268493 177323 210971 -66867 -304262 -442822 -580583
17249 -580583 -359273 -61496 235067 92768 303797 315370 324883 446235 334374 415312
17239 415312 334942 101715 -75945 -124349 -65369 -19097 -70500 -490518 -421563 -321837 -71683
17228 -71683 -10213 23248 205379 2463 -424675 -573254 -394721 -169685 -73859 -321394
17218 -321394 -400891 -243958 85086 314489 355834 468012 478963 470003 353284 112718
17208A12718K0119j67822j40287O5308l0574j43121K70824Q9182o5158j02094
17198i0905o9272Q65O1715n5666N4974P9549J04984p6513k10174l7811J36770
17187a01484l4913j90694o8831L89129j92176r3864j87288K57736K74720k00404
17177a48069J62401Q3646j33854m2586K74579K39269k32586k15470l62282O5073
17167c09879R621K8297l8767K70345K98835k93847r2535J51307J37660J14699
17157B75736j29496M5492j32628K335p1516K6990q2348M7616M8996J14937j0268
17146A35846j09170O2882k7163K51498m194j50429J02102j48647q1822p8281j37636
17135a85014K56908O2129J29595j27382m6337J21384J05000n2826J44385J07139
$$ plain form
17208 112718 132837 -34985 -175272 -109964 -140538 -283659 -12835 76347 11189 -90905
17198 -90905 -160177 -159312 -97597 -153263 -98289 -18740 86244 9731 -200443 -238254 -101484
17187 -101484 -136397 -327091 -395922 -6793 -198969 -292833 -480121 -222385 52335 -148069
17177 -148069 14332 97978 -35876 -78462 196117 435386 202800 -12670 -374952 -309879
17167 -309879 -300258 -271961 -310728 -40383 258452 -35395 -127930 23377 161037 275736
17157 275736 146240 191732 59104 61439 -10077 16913 -65435 -17819 31177 146114 135846
17146 135846 26676 89558 62395 313893 309699 159270 261372 112725 30903 -47378 -185014
17135 -185014 71894 134023 263618 136236 89899 211283 316283 263457 407842 514981
17125E14981j80013r1593O5401J51398J78353k6015L9521j72527m18j34940l1450
17114C12698J7123k328j83110m0922K64055m0087m10295l88228k54005K79995
17104d45104J82259J40053J01874m1430M2923j84223m8449j57861k02811K27966
17094c84803K25952P1228J40337J24941j02907n01054l46895J26022K40195j54329
17084e61313K99357K36278J88684J99286J04548N4131k12813j50936J37287o4432
17074B30077j39096J64376l9208l0014n7053J4129q3163Q4409j85257j43513Q054
17063a76259J38536M7719K73037K97953j9214p350M1367j49830j2139J64468K28695
17052H26983l77638j41509J16503n1998k57572R8705J4520J19674J34369K50571
$$ plain form
17125 514981 334968 243375 308776 460174 638527 612512 652033 479506 479088 344148 312698
17114 312698 329821 327493 144383 103461 367516 327429 -82866 -471094 -725099 -445104
17104 -445104 -262845 -122792 -20918 -62348 -19425 -203648 -252097 -409958 -612769 -384803
17094 -384803 -158851 -87623 52714 177655 74748 -426306 -773201 -647179 -406984 -561313
17084 -561313 -261956 -25678 163006 362292 466840 520971 308158 157222 294509 230077
17074 230077 90981 255357 216149 186135 129082 143211 60048 144457 -40800 -184313 -176259
17063 -176259 -37723 9996 283033 580986 561772 554422 595789 445959 433820 598288 826983
17052 826983 449345 307836 424339 372341 114769 213474 227994 347668 482037 732608
17042G32608k07249l60571j34886j02257P2019J73575O7399Q026k12160J1081
17032D7585N40001N6498j95230k58016J09867J19576j94417j80189K51337q1356
17022B15656j85778J91487O2982J70595q6200Q1294K70604k86919l17410j87939
17012g1628r2656K09231J87461j40791J26010K37403J86466N8892k01840k16862
17002B81686K1042o2327R3200L10282l8296J55328J122k35420J50727M11962N4353
16991A143659J62499r1197l39525k82659k5473j0579J30369J88275J66268o1457
16981I80180k40207J20761Q0971L65725L47299L04463k47095j128n4382j01497
16971A555090j8904K35460r698J25604M62903J97241J87574L81550K36063K38333
$$ plain form
17042 732608 525359 164788 29902 -72355 -336 173239 240638 248664 36504 47585
17032 47585 587586 644084 448854 190838 300705 420281 225864 45675 297012 215656
17022 215656 29878 221365 284347 454942 368742 450036 720640 433721 116311 -71628
17012 -71628 -164284 44947 232408 91617 217627 455030 641496 700388 498548 281686
17002 281686 302728 240401 333601 643883 605587 760915 762037 526617 677344 1089306 1143659
16991 1143659 1306158 1214961 875436 592777 567304 556725 687094 875369 1041637 980180
16981 980180 739973 860734 941705 1307430 1654729 1959192 1712097 1710969 1656587 1555090
16971 1555090 1536186 1771646 1761948 1887552 2350455 2547696 2735270 3116820 3352883 3591216
16961C591216L17795N40377O83178L70749L95986O71516N15943L57733J09834
16952G554327K6147K7989J46637K95944L95461K88638J126786J626690J742631
16943A3231250J406981J887610K316673K639186L281663M358263N153165O965731
16935D1240522J0136638J4868142K2539818L4390979N0315239O2816853O4994694
16928C01302885N2988198K2905084j2571894l8955187n6229466o0235177n2683468
16921A56520975m1915697l0333836k0953917j4398745j0259383p552000n221025
16914B5886372l952027k779848j954586j487385j708622j246861j217453j399161
16906A0140429j322808j186167j002710p20861o96673o38295Q0039K00652J09007
$$ plain form
16961 3591216 3909011 4449388 5132566 5503315 5899301 6570817 7086760 7444493 7554327
16952 7554327 7580474 7608463 7755100 8051044 8446505 8735143 9861929 11488619 13231250
16943 13231250 14638231 16525841 18842514 21481700 24763363 29121626 34274791 41240522
16935 41240522 51377160 66245302 88785120 123176099 173491338 236308191 301302885
16928 301302885 354291083 377196167 364624273 325669086 269439620 209204443 156520975
16921 156520975 114605278 84271442 63317525 48918780 38659397 31107397 25886372
16914 25886372 21934345 19154497 17199911 15712526 14003904 12757043 11539590 10140429
16906 10140429 8817621 7631454 6628744 5907883 5211210 4572915 4652954 4853606 4962613
16897D962613k91089j5796j6708r3791l84960o71927n81859l10124k85034j71282
16887B140043l34728l02904k7066K19419R7781j45827l07674m79663O8427L6929
16877I64737M733o5247R1549L4701j52216k65194j38141J77973M69800M3778k82558
16866H83915j73352r2750N7261J10204n3851O2515O1940n8115j12532N9833q1147
16855F63921Q2717J63869j20233k19305m2232J95998K20968L0526l09100n2124
16845F15005J02917K39624N64854O77815J46445L5029J42300J63270K06159J99892
16835C093310o4377l39318k17756j72241l51098m95474j64279M8938j90407m31731
16825G15567m7053k2999p1874P4033j8098j97898j29026j01887L2096k83092j18073
$$ plain form
16897 4962613 4671524 4655728 4639020 4545229 4160269 3488342 2906483 2596359 2311325 2140043
16887 2140043 1805315 1502411 1475345 1694764 1792545 1646718 1339044 859381 927808 964737
16877 964737 969470 904223 995772 1030473 878257 613063 474922 652895 1122695 1166473 883915
16866 883915 710563 617813 675074 785278 731427 793942 855882 797767 685235 745068 663921
16855 663921 746638 910507 790274 570969 528737 724735 945703 976229 667129 615005
16845 615005 717922 957546 1522400 2200215 2346660 2381689 2523989 2687259 2893418 3093310
16835 3093310 3028933 2689615 2471859 2299618 1948520 1453046 1288767 1337705 1147298 715567
16825 715567 668514 645515 573641 647674 629576 431678 302652 200765 232861 -50231 -168304
16814a68304K76376K47713J34679j03636j24674K15213J28901K7891r0682j36964
16804D06513j02124N8661M9457j07369k72021k18946K55951n7993k3967K8142
16794A6304l18021q0443J56669K00120p1888P657K91139J35913m2483l0315k01543
16783F3109k67510j32449J32897n7156J00657L20028M7294k11018J13395J42812
16773B52059K2777n3586K6452j9749K136K3196j69277K2322J62967m0383j40189
16762H8725k39522J74456O6857k3731q4688n0901J92134K96953O4347L0973k75164
16751B40439o6035K96734m7626k15682J9968K51940K10109P4014j84773n47279
16741C1809l75607j49872P6823Q7227J17618l23156o5922K41406j15515j51083
$$ plain form
16814 -168304 108072 355785 490464 386828 262154 477367 606268 634159 543477 406513
16804 406513 304389 363050 412507 305138 33117 -185829 70122 12129 -11838 16304
16794 16304 -301717 -382160 -225491 -25371 -97259 -89602 201537 337450 294967 264652 63109
16783 63109 -204401 -336850 -203953 -261109 -160452 159576 206870 -4148 109247 252059
16773 252059 274836 221250 247702 227953 230089 253285 84008 106330 269297 228914 88725
16762 88725 -150797 23659 90516 66785 -17903 -68804 123330 420283 484630 515603 240439
16751 240439 174404 471138 423512 207830 227798 479738 689847 763861 579088 31809
16741 31809 -343798 -493670 -416847 -329620 -212002 -535158 -601080 -359674 -475189 -626272
16731f26272J38301J80811j25864Q1018J15184L35561P8426P2406o3313p9022
16721A07236k72313k85740J32494L9998J08487L1277N8379Q9654n4963j66497
16711b11988J07867l9911k86222j30790L0562K41882K72061p1352k92562Q7055
16701b93398L70176J71295R6216Q5399o11180k00835M4889J11012J24631J14807
16691A3012o1318k77367R6802P4345J36342J04921j14337J93742K9821Q1317Q3748
16680C61028j16190j76952k47255L00974K77552j71522J02632j59555j83615J7876
16670D973j85004n6263k44470P8846K01254o4368P1325L7928N2624J18859J7496
16659C3200J38632J05388J6787P2121j01351p4956O0280L79183k61871l05463
$$ plain form
16731 -626272 -487971 -307160 -433024 -352006 -236822 98739 177165 249571 186258 107236
16721 107236 -165077 -450817 -318323 -278325 -169838 -138561 -80182 9472 -45491 -211988
16711 -211988 -104121 -144032 -430254 -561044 -530482 -288600 -16539 -87891 -380453 -293398
16701 -293398 76778 248073 344289 429688 -181492 -382327 -337438 -226426 -101795 13012
16691 13012 -48306 -325673 -228871 -154526 -18184 86737 -27600 166142 195963 277280 361028
16680 361028 244838 67886 -179369 121605 399157 227635 330267 170712 -12903 4973
16670 4973 -180031 -236294 -480764 -401918 -200664 -265032 -193707 -155779 -103155 15704 33200
16659 33200 171832 277220 294007 366128 264777 189821 250101 629284 367413 61950
16649F1950l32844j34919J19921j75799j8090J97312L785J72607Q186k66048l0260
16638c94199J235J90544K91752R4932Q0461J9381K27693j65837k12457L9396n0328
16627A22573j06884k10869k31437J85356K15770j24046O9210R9432N0052M8104
16617A17261k03562q7118k60558j98815K29573K68643J07714q2381k16661M8433
16607b77471P7069o4898J34433J10474j66275j96742L7447K50003M2811j97692
16597b50841k76805J48824P3061J97224N3859J15366K03448J09487k27960k71691
16587a26028j21913J23207J20964J41742l571m2209j46486k06550J82854K27032
16577A49042O5673j38999q0057J3135L2044M3771K25929K80051N4756j24431m5973
$$ plain form
16649 61950 -270894 -405813 -285892 -461691 -479781 -282469 -278684 -106077 -97891 -363939 -394199
16638 -394199 -392964 -202420 89332 184264 264725 284106 511799 345962 133505 172901 122573
16627 122573 15689 -195180 -426617 -241261 -25491 -149537 -80327 19105 69157 117261
16617 117261 -86301 -173419 -433977 -632792 -403219 -134576 -26862 -109243 -325904 -277471
16607 -277471 -200402 -265300 -130867 -20393 -186668 -383410 -345963 -95960 -53149 -250841
16597 -250841 -527646 -378822 -305761 -108537 -54678 60688 264136 373623 145663 -126028
16587 -126028 -247941 -124734 -3770 137972 134401 92192 -54294 -260844 -77990 149042
16577 149042 214715 75716 -4341 8794 40838 84609 310538 590589 645345 520914 474941
16566D74941N6886l1641k35130j56408j48635J59223j30885l8468j92209q3968
16556c26294J49581J82139j32936j90399R3678K5419k05025R6741J77826K00569
16546G1299K13990m35426j54295J39071K53963J326k19424n8576K2494J01441
16536f4137o5866j67073J71321K13824M3739K61969m48441j91232J03644l5905
16526a78157j43384k5969K37037J75726J08629M4303j3443k49569o0008N5970
16516d8865J38016p5031j22339Q1358L7992j99141M4699j70501k49947N0538j42446
16505f55667K13691J98380R5804l4002K81284K66180R413j27139k01583k85435
16495b39074j38613j67428j36265J6091K05298J72408R508o7449K02585m5594
$$ plain form
16566 474941 531827 500186 265056 108648 -39987 119236 -11649 -50117 -242326 -326294
16556 -326294 -176713 5426 -127510 -317909 -224231 -198812 -403837 -307096 -129270 71299
16546 71299 285289 -150137 -304432 -165361 88602 89928 -129496 -188072 -165578 -64137
16536 -64137 -130003 -297076 -125755 88069 131808 393777 -54664 -245896 -142252 -178157
16526 -178157 -321541 -347510 -110473 65253 173882 218185 204742 -44827 -104835 -48865
16516 -48865 89151 14120 -108219 -26861 11131 -188010 -143311 -313812 -563759 -513221 -655667
16505 -655667 -441976 -243596 -147792 -181794 99490 365670 375083 247944 46361 -239074
16495 -239074 -377687 -545115 -681380 -665289 -459991 -287583 -278075 -345524 -142939 -188533
16485a88533r7862J0648J4069J54824q5879J43305K43679r5095j72630j40513
16475b13987k9687J58659J50036j45389j4961j24820J32684J38157J22388Q1602
16465B54682j86978J5627j0975j76157q5303L22054J11894n8359k1462j38472
16455B6551j26682j75948r285q0234J08853L4996q6473j18257J9313K38192J08691
16444f0283J47895K71686j03296P2325R3020j25662J14068K16060P38k14417k98227
16433A13907j09972j12177j12843k3750J4117q4584J17149K34464j20181j4283
16423i8153J42855L3306r9959J5717J65768O4125n4145j90747j77389O6745L42490
16412B10613L4475k66651j26476o2978J40323J54439K51564Q9216J10644j96738
$$ plain form
16485 -188533 -286395 -275747 -261678 -106854 -192733 -49428 194251 99156 -73474 -213987
16475 -213987 -243674 -85015 65021 -80368 -95329 -220149 -87465 50692 173080 254682
16465 254682 67704 83331 72356 -103801 -189104 132950 244844 186485 165023 26551
16455 26551 -100131 -276079 -285364 -365598 -256745 -221749 -308222 -426479 -407166 -168974 -60283
16444 -60283 87612 359298 256002 328327 421347 295685 409753 625813 626551 412134 113907
16433 113907 3935 -108242 -221085 -244835 -230718 -315302 -198153 36311 -83870 -98153
16423 -98153 44702 78008 -21951 -6234 159534 223659 169514 -21233 -198622 -131877 210613
16412 210613 245088 -21563 -148039 -211017 -70694 83745 335309 424525 535169 338431
16402C38431k96813M745M470j15881J27635J87402o0296L4250p0868k60137p2987
16391a80049k7278J58585L1390k10317l0541J02134J69965j00403j99971j21657
16381d08142K26899K55134K83989j03012m14690j62427J26645J57335K502o4279
16371a00046K96531P5685k81305K5729M9320K56167L15170j22188P314J06435
16361F28812J84754r1055J63068L91832J91199J26722J50041K45679o96759l46639
16351I47654k00029k12144j83821m5587j51658J50279J4279J08967L13k0101k73704
16340A34448m8263J70649j13666k85235J37489K98232p3686o2776j5363l9726
16330A02103q7110r840o0245j38508K17886J75098p1705Q38J9203q6335K08754
$$ plain form
16402 338431 41618 46363 50833 -65048 62587 249989 189693 223943 153075 -107062 -180049
16391 -180049 -207327 -48742 -17352 -227669 -258210 -156076 13889 -86514 -286485 -408142
16381 -408142 -181243 73891 357880 254868 -159822 -322249 -195604 -38269 -35767 -100046
16371 -100046 196485 272170 -9135 16594 65914 322081 637251 515063 522377 628812
16361 628812 813566 722511 885579 1277411 1468610 1595332 1745373 1991052 1294293 947654
16351 947654 747625 535481 351660 306073 154415 304694 318973 427940 428253 408152 134448
16340 134448 86185 256834 143168 -142067 -4578 293654 219968 157192 141829 102103
16330 102103 14993 5153 -55092 -193600 24286 199384 127679 128517 147720 61385 270139
16319B70139j48626j29469p1205L9878j55511K42844J88680J43127K78271L6157
16309F94285l24296l72453k22665r1435j68901J14797P036n0275J97996k8008
16299b43919k60784j48036J10460l2517K97853K05044k2580j57947n8325M40886
16289A30135J30705r4940k62939k21745o5404J39087K70933O7799m0469K6023
16279G9185J73642N6922q0908j17849m9177j07643q0487j92570j12139R3641J71537
16268a65846J40640K1868l07552J76718j068j49071j00087K07194K05509k15354
16258a87049r1055J40667L42596j16178j52646j84037r9601K31273J43390J88431
16248B15791p0128J09210r2131q0714j09116m7272M0842K29401J12296J6972j70684
$$ plain form
16319 270139 121513 -7956 -79161 -39283 -194794 48050 236730 379857 658128 694285
16309 694285 369989 -2464 -225129 -316564 -485465 -370668 -363632 -413907 -215911 -243919
16299 -243919 -504703 -652739 -542279 -574796 -276943 -71899 -94479 -252426 -310751 130135
16289 130135 260840 165900 -97039 -318784 -384188 -245101 25832 93631 53162 79185
16279 79185 252827 309749 228841 110992 61815 -45828 -126315 -318885 -431024 -337383 -165846
16268 -165846 -25206 -3338 -310890 -134172 -135240 -284311 -384398 -177204 28305 -187049
16258 -187049 -278104 -137437 205159 88981 -63665 -247702 -347303 -116030 27360 215791
16248 215791 145663 254873 162742 82028 -27088 -74360 -33518 195883 308179 325151 154467
16237A54467j20835j54961m339k29035l12719R7054O08589L38702j57836L4267
16227B53354J79018O4185l93819n16381j14636o1741K36880M18449O9147o4274
16217G0182k6924r7966j36990j4614j44214r7858K3591J98582P2252J64619P6786
16206H7446l1221L899R444k3952j05965J40918M0879J71046N6061l81041j56895
16195a89381M19143J55134J78723m6378j33358j10766m8769k25575m9234j27638
16185a78099J62990N06602J13350m00026j42256n3670k7449K56035j39870j39955
16175d2348K2526k79712p3452M302k6185K30747K51606j57467j18710k6347J98690
16164a6350L44090Q7466N4935o4074J32453p9958r4448n8160j11590p208J30115
$$ plain form
16237 154467 33632 -121329 -125668 -354703 -667422 -570368 38221 376923 219087 253354
16227 253354 432372 496557 102738 -413643 -528279 -590020 -353140 65309 134456 70182
16217 70182 43258 -54708 -191698 -206312 -350526 -448384 -424793 -226211 -153959 10660 87446
16206 87446 56225 60124 69568 45616 -60349 80569 121448 292494 348555 -32486 -189381
16195 -189381 229762 384896 563619 517241 383883 273117 224348 -1227 -50461 -178099
16185 -178099 -15109 491493 604843 204817 62561 8891 -18558 237477 97607 -42348
16175 -42348 -19822 -299534 -372986 -368684 -394869 -164122 87484 -69983 -188693 -215040 -16350
16164 -16350 327740 415206 470141 406067 538520 458562 364114 305954 194364 187156 317271
16153C17271J25872o560j20039j66768j27456k36191q5462J20575L13060O7417
16143B01719j29489j08935O5569j81133j76907J4403L56445K03925j14262k45183
16133a13848P3649n7781j08378K29257L14839j15987j10099q8322j76459Q142
16123a44987P7985k99962k17600o0848J94378L4004Q0643J21315q8256L6440o793
16112b73681L74546L13916P793m04291j89015n2121p0990K06334K00140J22387
16102B35018K1691J21936j4840k62577j32476j2674K88731L40817j29781j29850
16092C25995l04454J9647M7701j14304k65741o3742K41590L49763j12927J62224
16082B85752k02584k52619K331J46394K4155L0043k1398j03441J0693J19092p6306
$$ plain form
16153 317271 443143 436583 316544 149776 22320 -213871 -299333 -178758 134302 201719
16143 201719 72230 -36705 28864 -152269 -329176 -314773 41672 245597 131335 -113848
16133 -113848 -40199 -97980 -206358 22899 337738 221751 111652 23330 -153129 -144987
16123 -144987 -67002 -366964 -584564 -645412 -451034 -417030 -336387 -215072 -303328 -266888 -273681
16112 -273681 100865 414781 422574 18283 -170732 -222853 -293843 -87509 112631 235018
16102 235018 256709 378645 363805 101228 -31248 -43922 244809 585626 455845 325995
16092 325995 21541 41188 88889 -25415 -291156 -354898 -113308 236455 123528 285752
16082 285752 83168 -169451 -167120 -20726 3429 33472 12074 -91367 -80674 38418 -37888
16071c7888J08904J44367o5962k80148j35179L63405J97558k36042k64168j7017
16061b22170k35919m0174J76815P8528L86639J0508q1457J68925O1882L5995k09848
16050A29724r1843k00627k26110R6552K8657k9438L9523K44818O1031l00387M6341
16039b01759J6794P48k86711p9217J80149K30892k9719J75611j6582k5305j28993
16028a64092p6839k2616J42061q0988l0832j82153p7217J39629J80747Q3425j71000
16017b59875l1209j00767Q7300M4117J17170J63831j84385r0921j6447j03632
16007c74818l06019Q1022L77330J05833L58651K72418p7430k49772j25553j49246
15997h7584P6031L27223k04789k34246k78778k45773L70565O9589k05767l1336
$$ plain form
16071 -37888 71016 215383 149421 -130727 -265906 97499 295057 59015 -205153 -222170
16061 -222170 -458089 -498263 -321448 -242920 143719 154227 72770 241695 303577 339572 129724
16050 129724 37881 -162746 -388856 -292304 -263647 -293085 -253562 -8744 52287 -248100 -201759
16039 -201759 -184965 -184217 -470928 -550145 -369996 -139104 -168823 6788 -9794 -35099 -164092
16028 -164092 -240931 -263547 -121486 -202474 -233306 -415459 -492676 -353047 -172300 -88875 -259875
16017 -259875 -291084 -391851 -304551 -260434 -143264 20567 -163818 -254739 -271186 -374818
16007 -374818 -680837 -599815 -222485 -116652 241999 514417 436987 187215 61662 -87584
15997 -87584 -11553 315670 110881 -123365 -402143 -647916 -277351 -207762 -413529 -444865
15987d44865K13939J1689N1435K99224K37793j27860l12845N209o0861k52857
15977c79999j6253K60150L40582l6227j44030l13196R6301K82643J0204J26356
15967B26531R1793l5495O649j31999j83544l53135j69621m0297l8115J37259Q3352
15956d06622J28732o8744q799P6025j02612J02878J81062R2161J04425o0746p3658
15945c5898o6207K7747Q7063p7686K59057n9460j16890k11895j24745j01839P6489
15934c44264J29329L29185m7532J10334K3519j41646j34800L2516K03630j65716
15924e445j69028O8480J07675q0587k1092J85267Q3216l94963k6464j64596K62280
15913a55257l1866R3174J39405P2974p3782o1309j36353J69426n2788j36695j87200
$$ plain form
15987 -444865 -230926 -219237 -167802 131422 369215 241355 -71490 -66281 -127142 -379999
15977 -379999 -396252 -136102 204480 168253 24223 -288973 -192672 89971 100175 226531
15967 226531 318324 282829 289478 157479 -26065 -379200 -548821 -589118 -627233 -489974 -406622
15956 -406622 -277890 -346634 -355433 -279408 -382020 -279142 -98080 -5919 98506 37760 -35898
15945 -35898 -102105 -74358 12705 -64981 194076 134616 17726 -194169 -318914 -420753 -344264
15934 -344264 -214935 114250 66718 177052 200571 58925 -75875 -43359 160271 -5445
15924 -5445 -174473 -105993 1682 -78905 -99997 85270 168486 -226477 -252941 -417537 -155257
15913 -155257 -187123 -93949 45456 118430 44648 -16661 -153014 16412 -36376 -173071 -360271
15902c60271j15386N1466O6066l02034J84414K59354n2406Q1996L20975K08801
15892C42975m1699j60752J25364l1126J10264K7990J09934l06942l7991j20808
15882A7209k28516L9884J12321r5386j02210R2371L11948M21399r4601j7868L8951
15871D95502j91018j76649J67672j15844m0111l5300l0440k6348J83301P1546
15861C02311k05075k59239q4065J35445J2159K09225l1343Q8675j37871j11558
15851h1336j4074J29136J13554j00174k28552k10369K41538j38794k71249k75215
15841h35535J74841J89859L2068j14236j06728M4251L8674J03554K19853J97865
15831e5534k08977k23948k3606L06709M7345l8190j30780R0016O3630l56308N6610
$$ plain form
15902 -360271 -475657 -424191 -358125 -660159 -475745 -216391 -268797 -186801 134174 342975
15892 342975 301276 140524 265888 234762 345026 373016 482950 176008 138017 17209
15882 17209 -211307 -171423 -59102 -154488 -256698 -164327 147621 569020 474419 456551 495502
15871 495502 304484 127835 295507 179663 139552 104252 73812 47464 230765 302311
15861 302311 97236 -162003 -246068 -110623 -98464 110761 79418 168093 30222 -81336
15851 -81336 -95410 33726 147280 47106 -181446 -391815 -150277 -289071 -560320 -835535
15841 -835535 -660694 -470835 -438767 -553003 -659731 -615480 -576806 -473252 -253399 -55534
15831 -55534 -264511 -488459 -512065 -205356 -158011 -196201 -326981 -236965 -173335 -529643 -473033
15820d73033K81692Q1628J326J14666K4323P9337J7957r8097j15133J7748K52104
15809A84518p1494j5217Q209m5168J29247j42185k28699p6078Q3356j22000j10706
15798d06217j59622J54460L36745L05032K9656k81610k26125J1294J40031N3544
15788d2812k5585j85272j41966N8734o9061j90861k30676K16956K41044K24215
15778a45284N3511K06400J56944J8895o9569p751j53273k42765j06462J60343
15768a29011K97013q6681p3040Q4752k69983K5734O7668k9339l8060J72681q4572
15757f2838k0072k43952m8643r5337N6875L92849J83957K471j46111j15285o6300
15746a62386p9263Q116J98490k79019n9773K73971J73148N9585J03604j09187
$$ plain form
15820 -473033 -191341 -109713 -108387 6279 30602 109939 127896 29799 -85334 -67586 184518
15809 184518 113024 97807 106016 60848 190095 47910 -180789 -256867 -173511 -295511 -406217
15798 -406217 -565839 -411379 -74634 230398 260054 -21556 -247681 -236387 -96356 -42812
15788 -42812 -68397 -253669 -395635 -336901 -405962 -596823 -827499 -610543 -369499 -145284
15778 -145284 -91773 114627 271571 290466 220897 213146 59873 -182892 -289354 -129011
15768 -129011 168002 81321 8281 93033 -176950 -151216 -83548 -112887 -150947 21734 -62838
15757 -62838 -82910 -326862 -375505 -470842 -413967 -21118 162839 165310 19199 -96086 -162386
15746 -162386 -241649 -233533 -35043 -314062 -373835 -99864 73284 132869 236473 127286
15736A27286k1581m984R8755J39283K09440k18973q8106m25623j46164K8029j43494
15725d46132k5346P8443J53110K32771L0302n6452J64383q7117r7306m3084q3393
15714a79821k0301J4093Q7750r9621O3455K68654J05k13691J18425J51403Q9430
15703B79881J2336j51131l05859p0076L89793R539j1039J61474N394j0684L7651
15692C47279k01114j46660j54172J86333L17129J24514N00j75175n9239m6642
15682A92753j30695l3412j33265k84984p5772K71152L31733J8269j7441l7627
15672A00711k66828j1411P0875J5536n5424N9355j7428m8760j30368l8621j94837
15661e17200j1895K90164K41544J0407J17793j00277l56062J31608L01898M11337
$$ plain form
15736 127286 105705 100721 199476 338759 548199 329226 241120 -184503 -330667 -302638 -446132
15725 -446132 -471478 -393035 -239925 -7154 23148 -33304 131079 43962 -53344 -96428 -179821
15714 -179821 -200122 -186029 -98279 -197900 -134445 134209 134314 -79377 39048 190451 279881
15703 279881 292217 141086 -164773 -234849 154944 164483 153444 314918 320312 309628 347279
15692 347279 146165 -495 -154667 31666 348795 473309 473809 298634 239395 192753
15682 192753 62058 28646 -104619 -389603 -465375 -194223 137510 155779 138338 100711
15672 100711 -166117 -177528 -106653 -91117 -146541 -87186 -104614 -153374 -283742 -322363 -517200
15661 -517200 -529095 -238931 2613 13020 130813 30536 -325526 -193918 107980 519317
15651E19317n707l84294k19639p4817j11982J7712m4131j507j10924r7603M7352
15640d66223L09461j28908J74598Q7574N6156n0690j58743j3807L64129Q7455
15630B61002j19249l0016J61591P1884j05251M3426p6286o0579L9247j06067o5176
15619A4526o2842l17728l07465O8060k02339N0347R6181L85537L77614O7886J0762
15608A80539n4050n864J41909R6575l9184m1132J59378l6584k05108k50591r3752
15597a47864l1648P2986J34435L70536K2872l09576j17303J30939K89854k31522
15587A83709p8311n2850q3891J97434J97098K5972l06351j99003J44470J60643
15577A88920k06677o497o3495n8268J75800J48694M2575k57254m862O1509r9831
$$ plain form
15651 519317 513610 129316 -90323 -165140 -277122 -259410 -303541 -305048 -415972 -513575 -466223
15640 -466223 -156762 -285670 -111072 -23498 32658 -18032 -176775 -190582 173547 261002
15630 261002 141753 111737 273328 345212 239961 283387 207101 146522 185769 79702 14526
15619 14526 -48316 -366044 -673509 -605449 -807788 -757441 -661260 -275723 101891 169777 180539
15608 180539 126489 120625 262534 359109 319925 278793 438171 401587 196479 -54112 -147864
15597 -147864 -179512 -106526 27909 398445 421317 111741 -5562 125377 415231 183709
15587 183709 105398 52548 -31343 166091 363189 389161 82810 -116193 28277 188920
15577 188920 -17757 -24254 -87749 -146017 29783 178477 221052 -36202 -41064 20445 -79386
15566g9386j7795J58062K06514K82086k55793m77117n1543J7643k5560J98165
15556d4724K40199j54581R9551J43691k10192k45128k61182M2429K61939K97321
15546A69323j76975k80035j04956J00603K51618j0386R1723k8545r2296J07817
15536B7891k0469K925J63483j46694O8750J43004J10544q4933q3169j25548j90317
15525a34533k4914J8082O4686m9782J14047n8643K5076k2532j1441m8747p5674
15514b04375k4219K67034J08165K96924J35565m09865j16503j33278J6873o4005
15504a27684J85197J54757J26730k22730j75560p3312l6846j71599j15792J55203
15494c01636K21409M4976m9980J13685K33561k59740k92438Q5941J19880Q4770
$$ plain form
15566 -79386 -97181 60881 267395 549481 293688 -183429 -234972 -217329 -242889 -44724
15556 -44724 195475 40894 140445 284136 73944 -171184 -432366 -389937 -127998 169323
15546 169323 -7652 -287687 -392643 -292040 -40422 -50808 40915 12370 -79926 27891
15536 27891 7422 10347 173830 27136 95886 238890 349434 264501 181332 55784 -134533
15525 -134533 -159447 -141365 -76679 -126461 -12414 -71057 -45981 -68513 -79954 -128701 -204375
15514 -204375 -228594 38440 146605 443529 579094 169229 52726 -80552 -63679 -127684
15504 -127684 57513 212270 339000 116270 -59290 -132602 -169448 -341047 -456839 -301636
15494 -301636 -80227 -35251 -85231 28454 262015 2275 -290163 -204222 -84342 428
15484D28q7815L56479K21692j83687k02467q1943J15006q1237M4349J45851l7208
15473B09448l80946m22525K34155N09120Q4507k94593j24344P578L45141j24478
15463D3063j17334J35574j76611j54161Q8903K05687K49190k14088o5304j71576
15453a76657n495J10582J1448N0991j70472j44481L64423J98202j91013J36044
15443A83572K89465l20104l27456m2600J7236P8718k2692j8833K05011J26472
15433A68789L12646K94199j90709n62654k33892J71386j5904K99518q0291J64321
15423C27409Q0204j61383j84631j96424j42373j0590Q3409l7419P2183P15N1772
15412a17128J07022Q4217J2248N3757k73559k12286L88074L65431m0300k95194
$$ plain form
15484 428 -87387 269092 490784 307097 104630 22687 137693 56456 100805 246656 209448
15473 209448 -171498 -594023 -359868 149252 233759 -60834 -185178 -177600 167541 43063
15463 43063 -74271 61303 -115308 -269469 -180566 25121 274311 60223 -5081 -176657
15453 -176657 -182152 -71570 -60122 -9131 -179603 -324084 40339 238541 47528 183572
15443 183572 473037 152933 -174523 -217123 -199887 -121169 -143861 -162694 42317 168789
15433 168789 481435 775634 584925 22271 -211621 -40235 -56139 243379 163088 327409
15423 327409 407613 246230 61599 -134825 -277198 -287788 -204379 -241798 -169615 -168900 -117128
15412 -117128 -10106 74111 86359 140116 -133443 -345729 42345 407776 367476 72282
15402G2282k5574n1137P6527n6571J63840j2550j02057L3551k67868j98929J32731
15391b35755J60019J37043k2046j54094m3487l8618m9463Q8150J02794K66601
15381B11144r0821j78472r1613n1629L1631J67071O2411j22371j44283j0583J66592
15370e0923L26936K1763J23396J60995l3659l48614o6624l0025J5985J13775l6100
15359A96905n3172q8923J16816K05658j95373j09184L52174J77057K7029r878
15349F19109M4087j96054P9588k42370l03325j8755N6967j23509j5279O9503K13386
15338A83348M2178k56968p9032j60528l4800m780J61253p6487J16651j17002j56883
15327c83050K04405L62353K2687j42191M5725k97657l53871J96011j9260M6655
$$ plain form
15402 72282 46708 -4429 72098 15527 179367 166817 64760 98311 -169557 -368486 -235755
15391 -235755 -75736 61307 39261 -114833 -158320 -196938 -246401 -158251 -55457 211144
15381 211144 120323 -58149 -149762 -201391 -169760 -2689 59722 -62649 -206932 -217515 -50923
15370 -50923 276013 297776 421172 582167 548508 199894 133270 103245 119230 233005 196905
15359 196905 143733 54810 171626 377284 181911 72727 424901 601958 628987 619109
15349 619109 663196 467142 546730 304360 1035 -17720 39247 -84262 -99541 -30038 183348
15338 183348 225526 -31442 -110474 -271002 -305802 -310582 -149329 -225816 -109165 -226167 -383050
15327 -383050 -178645 183708 206395 64204 109929 -187728 -541599 -345588 -364848 -318193
15317c18193q9980m2733k07564j3760K86349M13585J93785j64225Q2114r5252
15307D4126k85416k12305J93407J95159j1448k24521J19089j1943J33904M0532
15297a9416O9764J94727L5223M0856j64177o3908j31488k5240N3266j47491R3013
15286f4871J49020j6443o1020k85055J11148K44498k0617n6367k39232j31066
15276c70005j51643q6339n2604K21534K19253J68631Q0843K68369j23503k55060
15266h0524m4432R1182n4882r45p5130J8557M46766k16859k68497J31863M091
15255d8810p0783q6645J83756j1153J70858k26813k73885N4379K46179K95504
15245B32587n18100P7936L63563J7482l2539m5497k95298m29424j48778K04240
$$ plain form
15317 -318193 -408173 -450906 -658470 -672230 -385881 27704 221489 57264 139378 44126
15307 44126 -241290 -453595 -260188 -65029 -76477 -300998 -181909 -193852 -59948 -19416
15297 -19416 50348 245075 280298 321154 156977 93069 -38419 -63659 -10393 -157884 -64871
15286 -64871 84149 67706 6686 -278369 -167221 77277 56660 293 -238939 -370005
15276 -370005 -521648 -607987 -660591 -439057 -219804 -51173 29670 298039 174536 -80524
15266 -80524 -124956 -33774 -88656 -89601 -164731 -146174 300592 83733 -184764 -52901 -48810
15255 -48810 -119593 -206238 -22482 -33635 137223 -89590 -363475 -309096 -62917 232587
15245 232587 -285513 -207577 155986 173468 140929 95432 -199866 -629290 -778068 -573828
15235e73828P9697N07876K45157o1456O9261o6075J7260l8175k04624j65109j23863
15224c13879K04702J91797L19222J342m47660j0453J78688n3984j90934K94354
15214A73195J376M3371K2769l54645k39070o8562J01449J65903k31811r1574N1594
15203d26005n9084k1168P615J06692M05770J18569k9872n1455O9306Q091k04126
15192g5667L945j74091p3655J54070l25702k01319L50139K00526J96935L8188
15182I3369K2852l1486Q0806o5490k14427J13096k14835O8021j13868Q9313M558
15171a68091j89454j9144R5020J0512k96719K7481L1216j28954n4758J17844N6238
15160e18809K5789m3025J21955N508J2565J73707N6548L5014J16029k63289J01960
$$ plain form
15235 -573828 -494131 13745 258902 197446 266707 200632 217892 179717 -24907 -190016 -313879
15224 -313879 -109177 82620 401842 403184 -44476 -54929 123759 69775 -121159 173195
15214 173195 174571 217942 240711 -113934 -353004 -421566 -320117 -154214 -386025 -477599 -426005
15203 -426005 -485089 -506257 -498642 -391950 13820 132389 102517 51062 120368 128459 -75667
15192 -75667 -71722 -245813 -319468 -165398 -491100 -692419 -342280 -141754 55181 93369
15182 93369 116221 84735 165541 100051 -114376 -1280 -216115 -148094 -261962 -172649 -168091
15171 -168091 -357545 -376689 -281669 -271157 -567876 -540395 -509179 -638133 -692891 -575047 -518809
15160 -518809 -493020 -536045 -414090 -408582 -396017 -222310 -165762 -130748 -14719 -278008 -176048
15149a76048L21425L05413k06518j00979J8307k09714k45816l1012p2672K32341
15139a65273R8972j6329k15180J74319q2785J04000K92135J72203r7262l82174
15129a17374P8315J2466o950k44506K22825R2475k70485J20558K79723k5163k74771
15118a32887k0327J72370N6829M5762L17069J07213j90403m65974j84179J84585
15108a09942k3509o1039K22538j60719j71674q3505l0040Q2391K93643J45158
15098A03302K3731j40306j6028N3177k56797j83344J02660J2477J45875K61126
15088A05873K77321j29519j10347R060J03649p5992j25290k41173L0937K69852
15078A14371P8036J18406k47710j75402R8766J42794o1105j78401J95965J67546
$$ plain form
15149 -176048 145377 450790 244272 143293 161600 -48114 -293930 -324942 -397614 -165273
15139 -165273 -66301 -82630 -297810 -123491 -206276 -102276 189859 362062 264800 -117374
15129 -117374 -39059 -26593 -33543 -278049 -55224 37251 -233234 -112676 167047 141884 -132887
15118 -132887 -153214 19156 75985 121747 438816 546029 355626 -110348 -294527 -109942
15108 -109942 -133451 -194490 28048 -132671 -304345 -387850 -417890 -335499 -41856 103302
15098 103302 127033 -13273 -29301 23876 -232921 -416265 -313605 -301128 -155253 105873
15088 105873 383194 253675 143328 152388 256037 180045 54755 -186418 -155481 114371
15078 114371 192407 310813 63103 -112299 -13533 129261 68156 -110245 85720 253266
15068B53266j46293l0556j9730k86528j16442p451J24355J64982O9307K11154
15058B16064k56761j88751m4952n0992j34120j8778Q050J10784P6922J67766j59104
15047b73872r811M2227k27090J58176K54572J69171r9791j58990j20712K374n7066
15036c20812J57053j3035l13182K4194L25264J7481j26001M8991J28146k08429
15026b80330k6749Q21k72379J19362N5963J79799o7740k2062k35145j6699L2559
15015e32600J1115R1652k5082o1016O0712K21424J16936L6399J6310j98454k39242
15004e01846j15227J19803J34147L98364M0200k0458J01088Q2461P7184k4312
14994B91404k5241k03509k8409J84703n5416K2605j55043L5518k27648j96644
$$ plain form
15068 253266 106973 76417 56687 -229841 -346283 -353734 -229379 -64397 4910 216064
15058 216064 -40697 -229448 -274400 -325392 -459512 -478290 -470240 -359456 -282534 -114768 -273872
15047 -273872 -283683 -241456 -468546 -310370 -55798 113373 13582 -145408 -266120 -263746 -320812
15036 -320812 -163759 -176794 -489976 -465782 -140518 -123037 -249038 -200047 -71901 -280330
15026 -280330 -307079 -306258 -578637 -459275 -403312 -223513 -291253 -313315 -548460 -565159 -532600
15015 -532600 -521485 -429833 -454915 -515931 -455219 -233795 -116859 -80460 -64150 -262604 -501846
15004 -501846 -617073 -497270 -363123 35241 75441 54983 156071 238532 315716 291404
14994 291404 266163 62654 34245 218948 163532 186137 31094 66612 -161036 -357680
14984c57680K1124K11683j62134j53616N3452J46522J61851K53709Q6613k53100
14974H424o7423K90500k95304m43582N3580L29540K38888l4859k96874N9257M125
14963a53728k3981J32671Q7079o4224k96657j46066j19794J87886J64645Q3259
14953a48910j9302O7789o2931n3340J58510L1571j39221K45325L30285N2702k22933
14942B39545l60805N3313p1672l8124Q1525R1564J08166l6007l69522k59361K10649
14931c50729M07404L03770L9264k13730k40321J16146o6363j60554J12309K7780
14921b5024J24310p5969R1133J29023Q443k03965l50297j8792J77800Q8457k47257
14910c02138Q1957K62883J46300J59775o9951o8312k10149L64477l176j26741
$$ plain form
14984 -357680 -336556 -124873 -287007 -440623 -387171 -240649 -78798 174911 261524 8424
14974 8424 -58999 231501 -63803 -507385 -453805 -124265 114623 79764 -217110 -157853 -153728
14963 -153728 -177709 -45038 42041 -22183 -318840 -464906 -584700 -396814 -232169 -148910
14953 -148910 -168212 -100423 -163354 -216694 -58184 -26613 -165834 79491 409776 462478 239545
14942 239545 -121260 -67947 -139619 -177743 -96218 -4654 103512 67505 -302017 -561378 -350729
14931 -350729 56675 360445 399709 185979 -54342 61804 -4559 -165113 -52804 -25024
14921 -25024 99286 23317 114450 243473 251916 47951 -302346 -321138 -143338 -54881 -302138
14910 -302138 -220181 42702 189002 348777 278826 210514 365 364842 361666 234925
14900B34925r366j36294j05467Q8498L17867J23632l12741r7769J18554M4144
14890B65983J35032j33420l02428m8454l12154J6965J92754l8435K65107J82604
14880B23554j44022L1390l3982k28899m65786k6906L61444J89462m4808j08832
14870b47385J55083J11386M5953J01706j44553j83637J49767J67904N6193k78999
14860f6582j27684o429J20496K48823M6258l00580k36247J99212K35377k48607
14850a35963N5323j5444m8142o1634J08227K35241o8226J23634J79563j90025
14840A82554j02587K00074R5363K45125j63197k51705j4025j61108k97262Q0433
14830a86335N5240J17765j04616r969O7758m6169q6347R574O3833K49960J39103
$$ plain form
14900 234925 225559 89265 -16202 72296 390163 513795 201054 103285 221839 265983
14890 265983 401015 267595 -34833 -83287 -395441 -378476 -185722 -224157 40950 223554
14880 223554 79532 110922 76940 -151959 -617745 -644651 -283207 -93745 -138553 -247385
14870 -247385 -92302 19084 65037 166743 22190 -161447 -11680 156224 212417 -66582
14860 -66582 -194266 -200695 -80199 168624 214882 -85698 -321945 -122733 112644 -135963
14850 -135963 -80640 -96084 -144226 -205860 -97633 137608 69382 193016 372579 182554
14840 182554 79967 280041 375404 620529 457332 205627 191602 30494 -266768 -186335
14830 -186335 -131095 -13330 -117946 -127915 -60157 -106326 -192673 -183099 -119266 130694 269797
14819B69797j10296o4039j20437j39217P5151Q0650P9123m9226n6135p0519m9285
14808a54433j51125n8327L0207m1234J90212J78313k29920j22881L50657o4598
14798g3129j97185J72028L11636Q9732J98965K3311j82652j68897l88824N4899
14788a60116l1591p8088K6636M3267q3742k26784L34512K90219j11702q6938k79589
14777c63916J84595j07922k36376K2438J72275o8523j96736N2439N3804J16998
14767c70924J65561Q9134M28431K84845j85340q4201j01314j68844L6143J17000
14757B10491Q7824j42015k56021J07053L21863J607k1231j47661l1660j519J89791
14746C18522j01168n27749j42261J43316K44239l5390O0303N5131L16130M3129
$$ plain form
14819 269797 159501 95462 -24975 -164192 -89041 -8391 70732 21506 -34629 -105148 -154433
14808 -154433 -305558 -363885 -333678 -374912 -184700 -6387 -236307 -359188 -8531 -73129
14798 -73129 -270314 -98286 213350 303082 502047 525358 342706 173809 -215015 -160116
14788 -160116 -191707 -269795 -243159 -199892 -283634 -510418 -175906 114313 2611 -84327 -363916
14777 -363916 -179321 -287243 -523619 -501181 -328906 -397429 -594165 -541726 -487922 -370924
14767 -370924 -205363 -116229 312202 597047 411707 327506 226192 57348 93491 210491
14757 210491 298315 156300 -99721 7332 329195 330802 309571 161910 130250 128731 318522
14746 318522 217354 -310395 -452656 -309340 -65101 -100491 -40188 14943 331073 374202
14736C74202j62442q6335L5274l08908Q2254L3570J56250P9769k47633j85478
14726b29477j14717K43740k6950j36830K14086K55936Q1123l94464k63322Q5225
14716b85650K46079j5694m1478k08735q8587J68614K66661j26702k64877K25364
14706a25005K32093p1142K513J8533k56587j59846p7671j52134k8707m0350K59484
14695c98819m097o0108K83254Q6142M58013J49524l56498j80891p79K3165K5821
14684B4727j24553j87731n7135P7500K86524L22747j49250l36262P7716L40843
14674B75126L8804j28246j3369j70281j78423j99571M0686Q8314K6867m1426l0222
14663b91741k04611q7411K7388j36463j07617L89204L33464K44797J20941J54704
$$ plain form
14736 374202 211760 125425 160699 -148209 -65955 -32385 123865 203634 -43999 -229477
14726 -229477 -344194 -100454 -127404 -264234 -50148 205788 286911 -107553 -370875 -285650
14716 -285650 -39571 -55265 -96743 -305478 -394065 -225451 41210 -85492 -350369 -125005
14706 -125005 107088 35946 38459 56992 -199595 -359441 -437112 -589246 -617953 -658303 -398819
14695 -398819 -402916 -463024 -179770 -93628 364385 513909 157411 -23480 -24259 -1094 24727
14684 24727 -99826 -287557 -344692 -267192 19332 342079 192829 -143433 -65717 275126
14674 275126 313930 185684 172315 2034 -176389 -375960 -335274 -246960 -220093 -261519 -291741
14663 -291741 -496352 -583763 -556375 -692838 -800455 -411251 -77787 167010 287951 442655
14653D42655l3377l06603k51718p1438J19272N8965m7695K06412K31209p1042
14643B76640q3673o1325L8327j77429j70535K01319J65398L003k88560k59895
14633c56730J24502k49489O5138K07887m249R0175K07169J85310j8958j59384
14623I1371n0104j095O941K67889L0760j3002k01537Q0774J42760j32334j64578
14612E7845K23805k8694N7399o6287M4141p0083J6608P7015k48071J12990K09034
14601C85702n43168k78381J04055l0886K53302K87593J01445O657m2828j40100
14591A03391l76700n00J77392j16892j60175L62544J74798r8947k24172j1298
14581a70559p2383k77262K49389L23164J97292J08605p7946J64066o8780j27385
$$ plain form
14653 442655 409278 102675 -149043 -220481 -101209 -42244 -89939 116473 347682 276640
14643 276640 192967 131642 169969 -7460 -177995 23324 188722 191725 -96835 -356730
14633 -356730 -232228 -481717 -416579 -208692 -212941 -122766 84403 269713 250755 91371
14623 91371 41267 40172 47113 315002 345762 332760 131223 211997 354757 222423 57845
14612 57845 281650 252956 310355 244068 288209 218126 234734 311749 63678 176668 385702
14601 385702 -157466 -435847 -331792 -362678 -109376 178217 279662 286319 243491 103391
14591 103391 -273309 -273809 -96417 -213309 -373484 -10940 163858 64911 -159261 -170559
14581 -170559 -242942 -520204 -270815 52349 249641 358246 280300 444366 375586 248201
14571B48201r9449q3131k49916l3209N06453J83330m8279J30684q9774j12522
14561C52388l26189k94347J32581J97346P7797p3437P4538j8450j73721q5383
14551a36877j7456J63501J86265J6238K35279l2681j28585O0591J36258o8232
14541D14301l04344k03560l8048j34968k3841m7159m9635M9678P2566K13408L2539
14530a9063l57245k07036K83768M25682K6243j42120l9805j78330o0333J84529
14520h3710m6492k01257J93936J38430L17580J26354l8516l02881j14619J94645
14510A83470m7808k86909j94829L16082j73745n1697m6847O3438R2007l3686j88947
14499c69471L2944J84712q0475j21019K46670M7591R6971K61065q4095K58912
$$ plain form
14571 248201 148752 65621 -184295 -217504 288949 472279 424000 554684 464910 352388
14561 352388 26199 -268148 -135567 61779 139576 66139 140677 122227 -51494 -136877
14551 -136877 -154333 9168 195433 211671 446950 414269 285684 346275 482533 414301
14541 414301 109957 -93603 -131651 -266619 -290460 -337619 -387254 -337576 -265010 -51602 -19063
14530 -19063 -376308 -583344 -299576 126106 152349 10229 -29576 -207906 -268239 -83710
14520 -83710 -130202 -331459 -137523 907 318487 444841 406325 103444 -11175 183470
14510 183470 135662 -151247 -346076 -29994 -203739 -255436 -302283 -238845 -146838 -180524 -369471
14499 -369471 -336527 -151815 -232290 -353309 -106639 -59048 37923 298988 214893 473805
14489D73805M4794p171k41710P3653q4220k89801L1018j6654o9027l27829j78176
14478e91318K73684J0743J37114J52912q7057j94349P1044j06536j53410p3537
14468e60710L44074m4925k64287K9820K94060K22358Q5920m7147n3939R5302J60710
14457B61236j6852k34342k86682q5938L18144M2674j72755Q0946j659K8750j76588
14446b43066J50219M53663j86578k82151P9354J27639J78799o6533j64945j91788
14436a45387J86723K33182R7636r7344n5743j99993P6165N4721k38562k63602
14426c52204L769j28898J12617J30324q4953J69750K41056p7250j5665j5585j96312
14415b13351J44403J32502N0643q8214K6678J17879Q4008k64190o3512k08594
$$ plain form
14489 473805 518599 511428 269718 343371 259151 -30650 368 -16286 -85313 -413142 -591318
14478 -591318 -317634 -306891 -169777 -16865 -103922 -298271 -227227 -333763 -487173 -560710
14468 -560710 -216636 -261561 -525848 -496028 -201968 20390 106310 59163 5224 100526 261236
14457 261236 244384 10042 -276640 -362578 -44434 -1760 -174515 -93569 -95228 -66478 -243066
14446 -243066 -92847 360816 174238 -107913 -28559 99080 277879 211346 46401 -145387
14436 -145387 41336 274518 372154 274810 219067 19074 95239 149960 -88602 -352204
14426 -352204 -348435 -477333 -364716 -234392 -319345 -149595 91461 14211 -1454 -17039 -213351
14415 -213351 -68948 63554 114197 25983 52661 170540 254548 -9642 -73154 -281748
14405b81748l03405M31858j18692j05916J5048k2177K08767j74443k48658J39520
14395d59846j60491l89K67039q3330R3741K16584K12502P4535n5201J35307k31640
14384H811j70106j39461O5950J86235j48020j14039K96603k1210P0507r6944j49876
14373b11550K92849J88703j04202j69672j4623J59948K18809K71127j7721k90877
14363C22791l81659k368p533J47508j00237Q3025r8892j49412L13777M44223J31576
14352G02799j51344j80111L6789N7643j57581r6553j80667k9903J00431r6112
14342E391N540Q0510K952j58002r2862k25877m0600J70277L78846p1191k0665
14331C4319J6513l8200m2906r1385k8343N661L28942l7585k02130m2911O0866
$$ plain form
14405 -281748 -585153 -153295 -271987 -377903 -362855 -385032 -176265 -350708 -599366 -459846
14395 -459846 -620337 -620726 -353687 -437017 -343276 -126692 85810 160345 105144 240451 8811
14384 8811 -161295 -300756 -234806 -48571 -196591 -310630 -14027 -35237 35270 -61674 -211550
14373 -211550 81299 270002 165800 -3872 -18495 141453 360262 631389 613668 322791
14363 322791 -58868 -61236 -68769 78739 -21498 61527 -37365 -186777 127000 571223 702799
14352 702799 551455 371344 408133 465776 308195 211642 30975 1072 101503 5391
14342 5391 10931 91441 94393 -63609 -156471 -382348 -422948 -252671 126175 54984 34319
14331 34319 50832 12632 -30274 -121659 -150002 -144341 184601 147016 -55114 -98025 -37159
14320c7159l9161L9838J79910j4114k66234q7541Q6547r4440j70046O6664Q9217
14309b46519J28442O1083K04372j43826k05597K02225J00773k47356p2824n5496
14299b74723J66107J63104l8050o309p8282l0635j33709p1507L1758L017N15p5215
14287c43929j7110o4189K1723P3523J92145J87379j38508K14664J52609j65821
14277A12486n00282j56136j19325L52332K49710J57013l6598M359P8975K22776
14267C65310K6413J10929j61060j47639r9598j34777l5050J64200k29228r306
14257a49806J40199j32870J78311P0157k26059j5882J37193k76521j61072K8299
14247d08051j15246N8193J09801L60518J32577k02772k63721M513K54808K65915
$$ plain form
14320 -37159 -76320 -36482 143428 129314 -136920 -224461 -137914 -232354 -402400 -335736 -246519
14309 -246519 -118077 -56994 147378 3552 -202045 180 100953 -146403 -219227 -274723
14299 -274723 -108616 54488 16438 10129 -68153 -98788 -232497 -304004 -272246 -269229 -268714 -343929
14287 -343929 -361039 -425228 -403505 -329982 -137837 49542 -88966 125698 278307 112486
14277 112486 -387796 -543932 -663257 -310925 -61215 95798 59200 63559 142534 365310
14267 365310 391723 502652 341592 193953 94355 -40422 -75472 88728 -140500 -149806
14257 -149806 -9607 -142477 35834 105991 -120068 -135950 1243 -275278 -436350 -408051
14247 -408051 -523297 -465104 -355303 5215 137792 -64980 -328701 -324188 -69380 196535
14237A96535J37615j354q2713J43608j2328j299k70100j56949J43447N879K9580
14226A31921r6010j214N9307k2525J7232J42077j05271p5708M3694K21950J4138
14215C29591p2891j6276r7703L352p0865j42511N5343K04817j84892n9496O8142
14204A6611j18600j10971K8411m8471L609N7748j12311k41851l8892J67749L71363
14193b5605J44122j17636j15634J51987M5735l00856k00036j95642m9879K19901
14183d43543K52356K05366J11625N27127K76790l36006j92024j08966N0301l82418
14173c9392l05708j00291Q7764J33023j87549o7078K79976J84658l5729J2480
14163c7846j10317J79397J95694r8532q6053J11286n9336l0312R7610J31934k41411
$$ plain form
14237 196535 334150 332796 250083 393691 381363 380064 109964 -46985 96462 102341 131921
14226 131921 35911 34697 94004 71479 88711 230788 125517 49809 93503 315453 329591
14215 329591 256700 240424 142721 146073 75208 -67303 -11960 192857 7965 -51531 16611
14204 16611 -101989 -212960 -184549 -233020 -229411 -171663 -283974 -525825 -564717 -396968 -25605
14193 -25605 118517 881 -114753 37234 82969 -217887 -417923 -613565 -663444 -443543
14183 -443543 -191187 14179 125804 652931 929721 593715 401691 292725 343026 -39392
14173 -39392 -345100 -445391 -357627 -224604 -412153 -479231 -199255 -14597 -50326 -37846
14163 -37846 -148163 31234 226928 128396 42343 153629 94293 63981 161591 293525 52114
14152E2114l54933o959J81381J26686m3312J29377R5923K6831L5367J17759J65171
14141E25405l23949k57373J15959m0422j6820j48027j63313J98069j1976L54L5576
14130h6517J99070l4059j35461r9738j10734K69430J65331q531K2769j98345K3341
14119F556r3627m1094J1510K12234J91435l3658l65893O0607k2363K10501P7541
14108B13749k75627j30523J13415N9845P1331J79885q5450k22153k0647n8714
14098a54889J99939j16375j51240K22549o8781l30929L15393P4697j23951J64646
14088C1059j09720M1549N7536p4483J27706Q2626j38167j2629k94995j04390L85490
14077h418R9041q9272q582m1350j9713m9022l2254j1331O5699Q9619M0826j31823
$$ plain form
14152 52114 -302819 -309778 -128397 -1711 -45023 84354 180277 207108 242475 360234 525405
14141 525405 201456 -55917 60042 19620 2800 -145227 -308540 -110471 -122447 -122093 -86517
14130 -86517 112553 78494 -56967 -156705 -267439 1991 167322 158791 181560 -16785 6556
14119 6556 -87071 -128165 -116655 95579 287014 253356 -112537 -51930 -74293 136208 213749
14108 213749 -61878 -192401 -78986 -19141 52190 232075 146625 -75528 -96175 -154889
14098 -154889 45050 -71325 -222565 -16 -68797 -399726 -84333 -9636 -133587 31059
14088 31059 -78661 -37112 20424 -54059 73647 156273 18106 5477 -289518 -393908 -8418
14077 -8418 90623 1351 -7231 -48581 -68294 -117316 -149570 -160901 -95202 -5583 35243 -96580
14065i6580J18680J54885k46273k20740O4122k7898M9947k9410K2365q1587R8359
14054a94130o8987K14761j28258K59071M3618j00782Q174J42244j37131J51307
14044A89887J21124j16113l31080l0442l4171j8934J54871K09510n46k5178j10652
14033H276j09524J47347k37999J71001K42950j74584o46092J8529L02022J09098
14023a68976Q5527k55729j30571J22152j3403J4329k4148R0047K32333O93k97100
14012c44846p5283j38839K71631J02942j43255J54523K78206L10270J4265k07107
14002B22507k56791r7010l9162k8983J31569k07568k49607J39774Q8135J05018
13992a92118j38398j19334K41637J78829k05891j88N53353K8167j58115L4360
$$ plain form
14065 -96580 22100 176985 -69288 -290028 -225906 -253804 -203857 -233267 -210902 -292489 -194130
14054 -194130 -263117 -48356 -176614 82457 126075 25293 33467 175711 38580 189887
14044 189887 311011 194898 -136182 -166624 -200795 -219729 -64858 144652 144106 118928 8276
14033 8276 -101248 46099 -191900 -20899 222051 47467 -598625 -580096 -278074 -168976
14023 -168976 -83449 -339178 -469749 -347597 -361000 -346671 -370819 -280772 -48439 -47746 -344846
14012 -344846 -420129 -558968 -287337 -184395 -327650 -173127 105079 415349 429614 222507
14002 222507 -34284 -131294 -170456 -199439 -67870 -275438 -525045 -385271 -297136 -192118
13992 -192118 -330516 -449850 -208213 -29384 -235275 -235463 317890 346057 187942 222302
13982B22302l511k9898L8267n833J46229K78147K30232o7994j33325l29143j76691
13971A68782o233M5492j03934J06559J92028K5944j01690o1832o1477k07996j5281
13960a9638O1585J48588J04738k32173n680n7118j0671k09081N5183K128O8138
13949i4001L91715R6731m6345r6129R1811K15066j12819k14688L2615k09786k53191
13938a99021R7005o7993q4094J99335K94437J80185j85949j21799J08141j09521
13928A10726k57074j45K77687l7743j90847q5837N265k08053K02792K39900L1675
13917H8346k6876Q5669L52796J18741k51668k78042j83419Q5871J65443J10725
13907B67586K176j54306l02336p706k992O9722Q0533O7741j1814N7405K98440
$$ plain form
13982 222302 218791 188893 227160 221327 367556 645703 875935 807941 674616 345473 168782
13971 168782 162549 208041 104107 210666 402694 428638 326948 265116 203639 -4357 -19638
13960 -19638 41947 190535 295273 63100 57420 302 -10369 -219450 -164267 -162139 -94001
13949 -94001 297714 394445 348100 251971 343782 558848 446029 231341 263956 54170 -199021
13938 -199021 -102016 -170009 -254103 -54768 239669 419854 233905 112106 220247 110726
13928 110726 -146348 -146493 131194 93451 -97396 -183233 -177968 -386021 -183229 56671 88346
13917 88346 61470 147139 499935 618676 367008 88966 -94453 -8582 156861 267586
13907 267586 269762 115456 -186880 -194586 -197578 -127856 -47323 20418 8604 66009 364449
13896C64449l4150j81721j32455k1350J44417k37433k62931K0651R1250J17874
13886a31399P5562l1780p1352j23354l995j20938J05096j7330J66556J57967M0221
13875D5254k00404j83944K53300L7138K37677J45721k43521j55366j04893K87114
13865A18076L94959o7022m188q2462r5561j61690R7716K34717O8421j78037k66734
13854E8195j49277j1108L4874q8599J11415R7724l2827k47795J56055K19168J57684
13843C05509j16103q0395j40565q1727j47904j06104n3185J58748J74295K20858
13833A33427Q6668J84697j16073j71866J0708m5351J23250K0701m1289k33047
13823d8175L51066j81492j98057q3206p9901j51331J13298J14586j9462K0745
$$ plain form
13896 364449 330299 148578 16123 -5227 139190 -98243 -361174 -340523 -249273 -131399
13886 -131399 -55837 -87617 -158969 -282323 -286318 -407256 -302160 -319490 -152934 5033 45254
13875 45254 -155150 -339094 -85794 -48656 189021 334742 91221 -64145 -169038 118076
13865 118076 513035 446013 441825 359363 263802 102112 199828 434545 502966 324929 58195
13854 58195 -91082 -102190 -67316 -155915 -44500 53224 20397 -227398 -71343 147825 305509
13843 305509 189406 109011 -31554 -113281 -261185 -367289 -420474 -261726 -87431 133427
13833 133427 220095 404792 288719 116853 127561 82210 205460 226161 184872 -48175
13823 -48175 302891 121399 -76658 -159864 -239765 -391096 -277798 -163212 -182674 -161929
13813a61929k83963J37992J57335K46592l9673k8190l8624R4042N1098q2685P9006
13802A31001J7863j3762J99504j89905j94234o0588K25738J58797j84564j78577
13792h8727m9515j00136Q8852J14794O5105q903R0982j03257k22787k52008q0117
13781e45717K27012L94657k28433m1842j05762K3902j33500j80231j9996o5944
13771f75854K19986Q2510j46223M0448J00719Q6826O8750K06868l4781k05435
13761b56186j30883p95L86845p544j52356o8084k1078j70387J85568J81625K8572
13750b4703J65931n6339j45573j73708M4936J29741Q5141K55684j34569k83698
13740a37157n7956M6513P413l65747j48601J62211K09589K04972K25995K7629
$$ plain form
13813 -161929 -445892 -307900 -150565 96027 56354 28164 -10460 83582 134680 51995 131001
13802 131001 148864 135102 334606 144701 -49533 -110121 115617 274414 89850 -88727
13792 -88727 -138242 -238378 -149526 -34732 30373 21470 112452 9195 -213592 -465600 -545717
13781 -545717 -318705 75952 -152481 -194323 -300085 -276183 -409683 -589914 -609910 -675854
13771 -675854 -455868 -373358 -519581 -479133 -378414 -291588 -222838 -15970 -50751 -256186
13761 -256186 -387069 -387864 -1019 -8563 -160919 -229003 -250081 -420468 -234900 -53275 -24703
13750 -24703 141228 84889 -60684 -234392 -189456 -59715 25426 281110 146541 -137157
13740 -137157 -195113 -148600 -141187 -506934 -655535 -493324 -283735 -78763 147232 174861
13730A74861j2732l57741p0710J01248J85371K4797j10900k521J85022j0279K8970
13719A35386q1786j27264j6144k13694j57054K45986j79937O007J94809j3430
13709b07121m3441J0412n3896k30206j51173J50505K27711Q1040j05462k3790
13699c45421j24827k03835N4351K05690J02188Q5611q009P4643n8621l8273k69125
13688e25628k23899k6058J16082L89216K70871N8803J10295N8532l3764j67062
13678B7388j50011l4110P9190K5757N30917N7644l79097k99612L2981P2359J15673
13667G9079o0345l9186J35234l24096j2619n4806O1589J94604r7819m05989m3011
13656e67365q6720J32711M06776K35165J9668k79577j50486j324Q1745L23407
$$ plain form
13730 174861 162129 -195612 -266322 -165074 20297 45094 -65806 -68327 116695 106416 135386
13719 135386 53600 -73664 -89808 -303502 -460556 -214570 -394507 -388500 -193691 -207121
13709 -207121 -250562 -240150 -294046 -524252 -675425 -524920 -297209 -216169 -321631 -345421
13699 -345421 -470248 -674083 -619732 -414042 -311854 -226243 -234252 -159609 -218230 -256503 -525628
13688 -525628 -749527 -775585 -659503 -270287 584 59387 169682 228214 194450 27388
13678 27388 -122623 -156733 -77543 -51786 479131 536775 157678 -141934 -108953 -36594 79079
13667 79079 18734 -20452 114782 -209314 -221933 -276739 -215150 -20546 -118365 -524354 -567365
13656 -567365 -654085 -521374 -114598 120567 140235 -139342 -289828 -291152 -209407 114000
13646A14000J90895r3969j68703k86748p7474J83750j20947k03174M7821o0403
13636d74952K59517N7183k3664Q5569j95946Q2942j67139j1299L39840J44202
13626I6253j57063o4493m7449o2969j00843O8238J36889m7682p2165K75897L90079
13615D14692L2321k09344j46233O7086L9033m6865r5203J96136j39747l9838L0989
13604A03027k23248l70163q9723J70984K89339J03252M9086j43386O6308j51196
13594a95720Q7311J0526k88589J50172O2910Q2104l2204K02377J57403Q9368Q111
13583C33769k29924j79621j03470m1047Q8887N5411l62129Q2976J29756j73393
13573c98785j6941O5348j16978J89268L20131j67842K53026J09517k8169k19546
$$ plain form
13646 114000 304895 210926 42223 -244525 -321999 -138249 -259196 -462370 -414549 -474952
13636 -474952 -215435 -158252 -181916 -96347 -292293 -209351 -376490 -387789 -47949 96253
13626 96253 -60810 -125303 -172752 -235721 -336564 -268326 -131437 -179119 -251284 24613 414692
13615 414692 447013 237669 91436 158522 197555 150690 55487 251623 111876 72038 103027
13604 103027 -120221 -490384 -580107 -409123 -119784 -16532 32554 -110832 -44524 -195720
13594 -195720 -108409 -97883 -386472 -236300 -173390 -91286 -123490 78887 236290 325658 333769
13583 333769 103845 -75776 -179246 -220293 -131406 -75995 -438124 -355148 -225392 -398785
13573 -398785 -415726 -350378 -467356 -278088 42043 -125799 127227 236744 208575 -10971
13563a0971l62240o5140j26762L6235L36908J33900j49770J45266J1439J09619
13553E8484O3677J98966o1935m24489r0394M01239J93801Q6461j93860k81439
13543d9489j84879J6313K18540m781K7782K62448J17238l3263p4041j51032j34597
13532A0239j40080r5445K65067K04836K20725Q6243o3859n0747n6596L4185j51284
13521B63284j32644l3790L0459R6343k05512P3411K14206J31331L5039j84891
13511B87236k71955J72829L18815j36299n97015k91055K66865j07802R932K9625
13501c18824J96835L2473J70629o044J03202L38772J39032j63896j39427L929
13491C56681j20638P3814M8720k46614M0608n1029j36007K71954K24607l22172
$$ plain form
13563 -10971 -373211 -438351 -565113 -528878 -191970 -58070 -207840 -62574 -51135 58484
13553 58484 122161 321127 259192 -165297 -255691 145548 339349 425810 231950 -49489
13543 -49489 -234368 -218055 485 -4296 23486 285934 403172 369909 295868 144836 10239
13532 10239 -129841 -225286 39781 244617 465342 551585 487726 436979 380383 414568 263284
13521 263284 130640 96850 127309 223652 18140 91551 305757 437088 472127 287236
13511 287236 15281 188110 506925 370626 -226389 -517444 -250579 -358381 -348449 -318824
13501 -318824 -121989 -89516 81113 75069 178271 517043 656075 492179 352752 356681
13491 356681 236043 309857 358577 111963 152571 101542 -34465 237489 462096 139924
13481A39924J32712J49210Q729o3581j3223J32600m1537j32740j72387J8841J73990
13470C32538l11150j36245L09866L34090q5950K16792j46286r9144J50672j19521
13460D45662k10989N5725J72334k93582k52979J84108J22203P4649O9484K43791
13450F10406j92669k75421q5928m5387M5981j22755m9104O9019J49371J69164
13440B72677j53034j05770J26070n9883j695K83686J07564J12575P3400N1654
13430G07244j64130l9535m0343j49243j92802L2184J85131P5542j2723P3690k77401
13419A97614j47553J89936R57r8844J14902m9632m7357l84683J83919L55206R527
13408C23992n993k64028j28016J98590k1623q7337k02803o1201M27336L58025
$$ plain form
13481 139924 272636 421846 430575 366994 353771 486371 444834 312094 139707 158548 332538
13470 332538 21388 -114857 195009 529099 443149 659941 513655 414511 565183 445662
13460 445662 234673 290398 462732 169150 -83829 100279 222482 297131 366615 610406
13450 610406 417737 142316 56388 11001 56982 -65773 -114877 -45858 103513 272677
13440 272677 119643 13873 139943 80060 78365 362051 469615 582190 655590 707244
13430 707244 543114 503579 463236 313993 121191 153375 338506 414048 401325 475015 197614
13419 197614 50061 239997 240954 142110 257012 207380 160023 -224660 -40741 314465 323992
13408 323992 317999 53971 -74045 124545 102922 15585 -187218 -248419 178917 536942
13398E36942r9468j18663M5831N7811k24102M0866j54566j79328J07390J74315
13388A87028J13616l64488J7897K87989k0042p1840n9892J81400L26317L6011
13378F33996O2009l4939q3128j08059p6079J67699K80631R0927J59964j18902
13368I74119l7760K53037J75857J22730m5424r49K46140J72099k10348m04867
13358A244634r2459J04424Q3663J96823l23720m09001p7987K5984l012j90987
13348E58362p2054r8806n0850R111J66028K1332j72366k60882J03521J3167M4051
13337B60614O1689j27138L6344l3555j60476j41864j66986J81964O3454l5582
13327f1536l7181j39331K24049P55j55044P9614J73808K02580N0029o0333j14494
$$ plain form
13398 536942 437474 318811 364642 422453 198351 239217 84651 -94677 12713 187028
13388 187028 300644 -63844 -45947 242042 222000 150160 90268 271668 597985 633996
13378 633996 696005 661066 577938 469879 393800 561499 842130 933057 1093021 974119
13368 974119 936359 1189396 1365253 1487983 1442559 1441610 1687750 1859849 1649501 1244634
13358 1244634 1152175 1256599 1340262 1537085 1213365 804364 726377 752361 749349 558362
13348 558362 486308 387502 336652 345763 511791 533123 360757 99875 203396 216563 260614
13337 260614 322303 195165 231509 197954 37478 -104386 -271372 -89408 -25954 -61536
13327 -61536 -98717 -238048 -13999 -13244 -168288 -88674 85134 287714 337743 277410 162916
13316A62916J66135K2287j33604j14032P8275L47710J37214k17857L1868P1927
13306E52839j40402J254k6855j49323j62479R1868K37990j3629k39904l2253q868
13295A10238J39332l2528j06575m7088K42297J8018Q0014j8666l27336j00319
13285d2613J11527j1505j08460J5159K55207j29219j15615r187j84816L13057
13275I3535Q4636o1482j25919Q1345J55338j43467K3838j97517K51400K64733
13265D26440j90982J6157M1080Q5518j98678k47219j95575R7684q0227k06205
13255d52007J80100K97183K38625J27446N6117J21163j32648R0980r7781j68127
13245B61051p798N8942k64696P0053L01894j60495k52454j06440K79211N3973
$$ plain form
13316 162916 329051 351338 217734 103702 181977 529687 666901 449044 480912 552839
13306 552839 412437 413691 386836 237513 75034 166902 404892 391263 151359 119106 110238
13295 110238 249570 217042 110467 63379 305676 323694 403708 385042 57706 -42613
13285 -42613 68914 57409 -51051 -35892 219315 90096 -25519 -34706 -219522 93535
13275 93535 178171 116689 -9230 72115 227453 83986 107824 -89693 161707 426440
13265 426440 235458 251615 292695 378213 179535 -67684 -263259 -165575 -245802 -452007
13255 -452007 -271907 25276 263901 391347 447464 568627 435979 526959 429178 261051
13245 261051 253253 312195 47499 117552 419446 258951 6497 -99943 179268 233241
13235B33241k25039m01269m6626K76219J08476J33796o4993L8264L2579j41516
13225e6868J03670J89599M7606P6850J58797l17733j72297Q0743r4788P6625j3560
13214G8644j4630K39971j9597j75566J48115j32479j5513j94865j4070L33413
13204B33423J0929o5373j83764K36510L60378J49372K57435k25348l88517P7839
13194D62884K33412j82995l48083K11233K34141J47490l10876j9320m3224j3471
13184C71191K71246P2440l37197k60699j71953j97374q1221M20030j21139K2181
13174a2495L38434r9790n2492J5326Q5029Q8553l8295j00515M5617P9771K5109
13163C74252p7654o7145J46364J41921p6202k5113m1018J8907J02782j69734j22951
$$ plain form
13235 233241 8202 -393067 -439693 -163474 -54998 78798 13805 52069 84648 -56868
13225 -56868 46802 236401 284007 360857 519654 201921 29624 110367 15579 92204 78644
13214 78644 64014 303985 284388 108822 256937 124458 108945 -85920 -99990 233423
13204 233423 244352 178979 -4785 231725 592103 741475 998910 773562 385045 462884
13194 462884 696296 513301 165218 376451 610592 758082 447206 427886 384662 371191
13184 371191 642437 714877 377680 116981 -54972 -252346 -333567 86463 -34676 -12495
13174 -12495 325939 226149 173657 188983 274012 362565 324270 223755 269372 349143 374252
13163 374252 296598 229453 375817 517738 441536 416423 375405 394312 497094 327360 204409
13152B04409J67778K28770n3026L1721R5586R8032M3763o1451k48486j61349j17576
13141B28171M9603J41260j08527k7430K51296p5848m8387L89402k14767J0338
13131E95111j36468o0266J54203L00023k5074n2354J08355K26328j80914k86269
13121F42675k83103j87099N7027J40461J00901J71265R8598j0778L855K3999k17420
13110E40381l93455k08856N7544J58862k36748k55913L25469L57142K86673p6402
13100E54697m06353j41526J00375R6853L25144k1771m4947N1503k2673j209J9065
13089E09158J4479P6491P9127N3318j58345J0957K02707Q7857l72686l59123k14993
13078g1053j00289q1599J21466J13640l0269K57629M0131p3003L04903L94710
$$ plain form
13152 204409 372187 600957 547931 579652 675238 773270 817033 755582 507096 345747 228171
13141 228171 277774 419034 310507 283077 534373 458525 410138 799540 584773 595111
13131 595111 458643 398377 552580 852603 827529 775175 883530 1109858 928944 642675
13121 642675 359572 172473 229500 369961 470862 642127 740725 729947 733802 757801 540381
13110 540381 146926 -61930 -4386 154476 -82272 -338185 -12716 344426 631099 554697
13100 554697 148344 6818 107193 204046 529190 507419 462472 513975 491302 490093 509158
13089 509158 523637 600128 679255 732573 574228 585185 787892 875749 503063 143940 -71053
13078 -71053 -171342 -252941 -131475 -17835 -48104 209525 249656 176653 481556 876266
13068H76266L51138M9376L2660j20655j30221r604P898Q9942J67274j3013L1347
13057A332408J24514J18330o1476P0092l9687j66854J0337N9950J04061p8482
13047A473193N1751J10407M4902q5379j39126p0612m3391L9316J32682K93942
$$ plain form
13068 876266 1227404 1276780 1309440 1188785 1058564 1048960 1056858 1146800 1314074 1301061 1332408
13057 1332408 1456922 1575252 1513776 1583868 1544181 1377327 1387664 1447614 1551675 1473193
13047 1473193 1524944 1635351 1680253 1594874 1455748 1385136 1341745 1381061 1513743 1807685
$$ [...]
##END NTUPLES=NMR SPECTRUM
##END=
