##TITLE=Analysis number 325985
Compound Code cc 32509
Book Reference 504/136
Project Code adrs
Chemist Name howarde
##JCAMPDX= 6.0         $$ Bruker NMR JCAMP-DX V2.0
##DATA TYPE= NMR SPECTRUM
##DATA CLASS= NTUPLES
##ORIGIN= Bruker BioSpin GmbH
##OWNER= nmr
$$ XWIN-NMR		Version 3.5
$$ Tue Jan 23 09:40:44 2007 GMT Standard Time (UT+0h)  MAYBRIDGE\nmr@NMR_250MHZ
##.OBSERVE FREQUENCY= 250.131544655141
##.OBSERVE NUCLEUS= ^1H
##.ACQUISITION MODE= SIMULTANEOUS (DQD)
##.ACQUISITION SCHEME= undefined
##.AVERAGES= 16
##.DIGITISER RES= 18
##SPECTROMETER/DATA SYSTEM= dpx250
##.PULSE SEQUENCE= zg30
##.SOLVENT NAME= DMSO
##.SHIFT REFERENCE= (INTERNAL, DMSO, 0, 16.522)
##AUDIT TRAIL= $$ (NUMBER, WHEN, WHO, WHERE, WHAT)
$$ ##TITLE= Audit trail, XWIN-NMR		Version 3.5
$$ ##JCAMPDX= 5.01
$$ ##ORIGIN= Bruker BioSpin GmbH
$$ ##OWNER= nmr
$$ C:\u/data/dgb/nmr/ADRS/1570/pdata/1/auditp.txt
$$ ##AUDIT TRAIL=  $$ (NUMBER, WHEN, WHO, WHERE, WHAT)
(   1,<2007-01-23 09:40:00.41 +000>,<MAYBRIDGE\nmr>,<NMR_250MHZ>,
      <created by zg, POWCHK disabled, PULCHK disabled
       configuration hash MD5:
       49 4B E0 1D 92 C2 6B 37 9F E6 65 BC 52 41 86 1D
       data hash MD5: 64K
       8F 4A 10 7D 07 34 C6 4C 5B 82 33 19 63 0E 6F 89>)
(   2,<2007-01-23 09:40:24.04 +000>,<MAYBRIDGE\nmr>,<NMR_250MHZ>,
      <Start of raw data processing
       ef LB = 0.3 FT_mod = 6 PKNL = 1 SI = 32K 
       data hash MD5: 32K
       98 3B 2E 9F 18 00 DE F6 E3 45 5D 7D A3 41 90 FE>)
(   3,<2007-01-23 09:40:28.71 +000>,<MAYBRIDGE\nmr>,<NMR_250MHZ>,
      <apk 
       data hash MD5: 32K
       00 2B 3C 01 96 0B DB 33 EB EF A0 E3 2E E0 CF 5F>)
(   4,<2007-01-23 09:40:30.41 +000>,<MAYBRIDGE\nmr>,<NMR_250MHZ>,
      <abs ABSG = 5 
       data hash MD5: 32K
       66 2C 5B DB E5 9A F1 13 F5 6F 17 54 6B BD 5F 40>)
$$ ##END=
$$ 
$$ hash MD5
$$ FC 41 A7 38 AE FC 4D 5D 81 4D 7B C7 B3 B3 FA BB
##$RELAX= 
##$RELAX= 
##$RELAX= 
##$RELAX= 
##$RELAX= 
##$RELAX= 
##$RELAX= 
$$ Bruker specific parameters
$$ --------------------------
##$DU= <C:\u>
##$EXPNO= 1570
##$NAME= <ADRS>
##$PROCNO= 1
##$TYPE= <nmr>
##$USER= <dgb>
##$AMP= (0..31)
100 100 100 100 100 100 100 100 100 100 100 100 100 100 100 100 100 100 
100 100 100 100 100 100 100 100 100 100 100 100 100 100 
##$AQSEQ= 0
##$AQ_mod= 3
##$AUNM= <au_zg>
##$AUTOPOS= <25 >
##$BF1= 250.13
##$BF2= 250.13
##$BF3= 250.13
##$BF4= 250.13
##$BF5= 500.13
##$BF6= 500.13
##$BF7= 500.13
##$BF8= 500.13
##$BYTORDA= 1
##$CFDGTYP= 0
##$CFRGTYP= 5
##$CHEMSTR= <none>
##$CNST= (0..31)
1 1 145 1 1 1 1 1 1 1 1 1 1 1 1 1 1 1 1 1 1 1 1 1 1 1 1 1 1 1 1 1 
##$CPDPRG= <>
##$CPDPRG1= <>
##$CPDPRG2= <>
##$CPDPRG3= <>
##$CPDPRG4= <mlev>
##$CPDPRG5= <mlev>
##$CPDPRG6= <mlev>
##$CPDPRG7= <mlev>
##$CPDPRG8= <mlev>
##$CPDPRGB= <>
##$CPDPRGT= <>
##$D= (0..31)
0 1 0 0 0 0 0 0 0 0.06 0 0 0 0 0 0 0.0002 0 0 0 0 0 0 0 0 0 0 0 0 0 0 
0 
##$DATE= 1169545198
##$DBL= (0..7)
120 120 120 120 120 120 120 120 
##$DBP= (0..7)
150 150 150 150 150 150 150 150 
##$DBP07= 0
##$DBPNAM0= <>
##$DBPNAM1= <>
$$ [...]
##$SUBNAM7= <"">
##$SUBNAM8= <"">
##$SUBNAM9= <"">
##$SW= 20.6930455092707
##$SWIBOX= (0..15)
0 0 3 0 0 0 0 0 0 0 0 0 0 0 0 0 
##$SW_h= 5175.983436853
##$TD= 65536
##$TD0= 1
##$TE= 294.16
##$TE2= 300
##$TE3= 300
##$TEG= 300
##$TL= (0..7)
0 120 120 120 120 120 120 120 
##$TP= (0..7)
150 150 150 150 150 150 150 150 
##$TP07= 0
##$TPNAME0= <>
##$TPNAME1= <>
##$TPNAME2= <>
##$TPNAME3= <>
##$TPNAME4= <>
##$TPNAME5= <>
##$TPNAME6= <>
##$TPNAME7= <>
##$TPOAL= (0..7)
0.5 0.5 0.5 0.5 0.5 0.5 0.5 0.5 
##$TPOFFS= (0..7)
0 0 0 0 0 0 0 0 
##$TUNHIN= 0
##$TUNHOUT= 0
##$TUNXOUT= 0
##$USERA1= <user>
##$USERA2= <user>
##$USERA3= <user>
##$USERA4= <user>
##$USERA5= <user>
##$V9= 5
##$VALIST= <valist>
##$VCLIST= <CCCCCCCCCCCCCCC>
##$VD= 0
##$VDLIST= <DDDDDDDDDDDDDDD>
##$VPLIST= <PPPPPPPPPPPPPPP>
##$VTLIST= <TTTTTTTTTTTTTTT>
##$WBST= 1024
##$WBSW= 4
##$XGAIN= (0..3)
0 0 0 0 
##$XL= 0
##$YL= 0
##$YMAX_a= 227516
##$YMIN_a= -320983
##$ZGOPTNS= <>
##$ZL1= 120
##$ZL2= 120
##$ZL3= 120
##$ZL4= 120
##$ABSF1= 16.522
##$ABSF2= -4.171173
##$ABSG= 5
##$ABSL= 3
##$ALPHA= 0
##$AQORDER= 0
##$ASSFAC= 0
##$ASSFACI= 0
##$ASSFACX= 0
##$ASSWID= 0
##$AUNMP= <proc_1d>
##$AZFE= 0.1
##$AZFW= 0.1
##$BCFW= 0
##$BC_mod= 0
##$BYTORDP= 0
##$COROFFS= 0
##$CY= 12.5
##$DATMOD= 1
##$DC= 0
##$DFILT= <>
##$DTYPP= 0
##$F1P= 14.0000005364418
##$F2P= -0.99999901652339
##$FCOR= 0.5
##$FTSIZE= 32768
##$FT_mod= 6
##$GAMMA= 0
##$GB= 0
##$INTBC= 1
##$INTSCL= 1
##$ISEN= 128
##$LB= 0.3
##$LEV0= 0
##$LPBIN= 0
##$MAXI= 10000
##$MC2= 0
##$MEAN= 0
##$ME_mod= 0
##$MI= 0
##$NCOEF= 0
##$NC_proc= -4
##$NLEV= 6
##$NOISF1= 0
##$NOISF2= 0
##$NSP= 0
##$NTH_PI= 0
##$NZP= 0
##$OFFSET= 16.522
##$PC= 1
##$PHC0= 216.2729
##$PHC1= 9.232007
##$PH_mod= 1
##$PKNL= yes
##$PPARMOD= 0
##$PSCAL= 4
##$PSIGN= 0
##$REVERSE= no
##$SF= 250.13
##$SI= 32768
##$SIGF1= 0
##$SIGF2= 0
##$SINO= 400
##$SIOLD= 32768
##$SREGLST= <1H.DMSO>
##$SSB= 0
##$STSI= 32768
##$STSR= 0
##$SW_p= 5175.98343685301
##$SYMM= 0
##$S_DEV= 0
##$TDeff= 65536
##$TDoff= 0
##$TI= <Analysis number 999999
Compound Code 99
Book Reference 9
Project Code 9>
##$TILT= no
##$TM1= 0
##$TM2= 0
##$TOPLEV= 0
##$USERP1= <user>
##$USERP2= <user>
##$USERP3= <user>
##$USERP4= <user>
##$USERP5= <user>
##$WDW= 1
##$XDIM= 32768
##$YMAX_p= 398424336
##$YMIN_p= -869964
$$ End of Bruker specific parameters
$$ ---------------------------------
##NTUPLES= NMR SPECTRUM
##VAR_NAME=  FREQUENCY,     SPECTRUM/REAL,   SPECTRUM/IMAG
##SYMBOL=    X,             R,               I
##VAR_TYPE=  INDEPENDENT,   DEPENDENT,       DEPENDENT
##VAR_FORM=  AFFN,          ASDF,            ASDF
##VAR_DIM=   32768,         32768,           32768
##UNITS=     HZ,            ARBITRARY UNITS, ARBITRARY UNITS
##FACTOR=    0.157963299565203, 1,           1
##FIRST=     4132.6476996994, 0,             0
##LAST=      -1043.33573715361, 0,           0
##MIN=       -1043.33573715361, -869964,     0
##MAX=       4132.6476996994, 398424336,     0
$$ Real data points
##PAGE= N=1
##DATA TABLE= (X++(R..R)), XYDATA
$$ [...]
$$ plain form
17540 -72334 -99754 -65970 -22547 8791 -57134 -54636 -39363 -36625 -30833 -33881 -34464 -80999 -118006
17527 -118006 -111392 -57220 -46957 -27665 18147 46882 61949 56151 36867 17533 -31577 -17566
17515 -17566 -1792 54175 27025 -25869 -3501 9715 -15965 -35125 -54076 -49004 -58301 -19110
17503 -19110 9038 45311 10831 -61928 -89294 -108435 -100613 -101973 -111106 -27303 31248 27912
17491 27912 -24539 -60805 -67815 -76396 -134052 -127310 -44233 -9269 -26733 -39154 -117852 -155779
17479 -155779 -167282 -112496 -97333 -116611 -113589 -129435 -152120 -108776 -100382 -116519 -112002 -91883
17467 -91883 -43758 -728 15060 11354 10365 -54782 -119016 -112665 -141041 -114486 -110955 -94791 -27820
17454 -27820 -28878 -8059 13740 3876 -73502 -75414 -45832 -97149 -77852 -42868 -28144 8824
$$ packed form
17540g2334k7420L3784M3423L1338o5925K498J5273K738N792l048n83m6535l7007
17527a18006O614N4172J0263J9292M5812K8735J5067n798j9284j9334m9110J4011
17515a7566J5774N5967k7150n2894K2368J3216k5680j9160j8951N072r297L9191
17503a9110K8148L6273l4480p2759k7366j9141P822j360r133Q3803N8551l336
17491B7912n2451l6266p010q581n7656O742Q3077L4964j7464j2421p8698l7927
17479a55779j1503N4786J5163j9278L022j5846k2685M3344Q394j6137M517K0119
17467i1883M8125M3030J5788l706r89o5147o4234O351k8376K6555L531J6164O6971
17454b7820j058K0819K1799r864p7378j912K9582n1317J9297L4984J4724L6968
$$ plain form
17442 8824 -34270 -44180 -50948 -23034 -7825 -40725 -93542 -87148 -44480 -70994 -136635 -91817
17430 -91817 -68168 -109354 -102353 -120262 -66627 -31469 -24189 -50344 -61749 -50369 -63328 -65739
17418 -65739 -66950 -92345 -101200 -79160 -93045 -115601 -99372 -135675 -103091 -90145 -106097 -145319
17406 -145319 -133360 -97349 -122937 -155078 -92491 -6380 -1025 55733 153859 272894 429036
17395 429036 573132 707829 687074 598259 514137 395691 278096 210848 150577 102213 60819
17384 60819 1393 -25326 24970 53205 20337 -41307 -51787 -73949 -35718 17449 -23690 -50348
17372 -50348 -23200 18317 133889 246445 305721 402698 551206 677981 682016 563386 398709
17361 398709 273194 138028 23735 13962 -5161 -1127 3894 -10396 -73277 -128770 -178371
$$ packed form
17442H824m3094r910o768K7914J5209l2900n2817O394M2668k6514o5641M4818
17430i1817K3649m1186P001j7909N3635L5158P280k6155j1405J1380j2959k411
17418f5739j211k5395q855K2040j3885k2556J6229l6303L2584J2946j5952l9222
17406a45319J1959L6011k5588l2141O2587Q6111N355N6758R8126J19035J56142
17395D29036J44096J34697k0755q8815q4122j18446j17595o7248o0271m8364m1394
17384F0819n9426k6719N0296K8235l2868o1644j0480k2162L8231N3167m1139k6658
17372e0348K7148M1517J15572J12556N9276R6977J48508J26775M035j18630j64677
17361C98709j25515j35166j14293r773j9123M034N021j4290o2881n5493m9601
$$ plain form
17350 -178371 -181509 -181735 -132155 -128897 -74511 -24312 -71193 -123196 -127731 -155938 -104002 -37691
17338 -37691 3222 -25244 -34734 -23276 -14700 -46211 -36772 -39040 -24712 -50410 -68466 -95187
17326 -95187 -48631 -12613 36911 -28226 -79075 -72939 -78059 -24968 7523 6837 -43844 1426
17314 1426 -3764 3847 30222 9732 43520 16817 -31388 -7632 34854 85491 93112 62022
17302 62022 17151 13743 13158 -8544 -36860 -24077 -35688 -30099 -62227 9881 20275 31128
17290 31128 22813 22481 16603 -31750 -56610 -92574 -63382 -47287 -83953 -63838 -78024 -72062 -90929
17277 -90929 -118945 -45098 -5404 -40719 -99718 -94479 -71456 -89664 -129432 -106602 -79297 -35759
17265 -35759 -50264 -76315 -73554 -70313 21191 75000 29038 -9933 14064 -81686 -140469 -93111
$$ packed form
17350a78371l138k26M9580L258N4386N0199m6881n2003m535k8207N1936O6311
17338c7691M0913k8466r490J1458Q576l1511R439k268J4328k5698j8056k6721
17326i5187M6556L6018M9524o5137n0849O136n120N3091L2491o86n0681M5270
17314A426n190P611K6375k0490L3788k6703m8205K3756M2486N0637P621l1090
17302F2022m4871l408n85k1702k8316J2783j1611N589l2128P2108J0394J0853
17290C1128q315l32n878m8353k4860l5964K9192J6095l6666K0115j4186N962j8867
17277i0929k8016P3847L9694l5315n8999N239K3023j8208l9768K2830K7305M3538
17265c5759j4505k6051K761L241R1504N3809m5962l8971K3997r5750n8783M7358
$$ plain form
17253 -93111 -59324 -24871 -90942 -122943 -67517 -50734 -119256 -115345 -133735 -113371 -87151 -91344
17241 -91344 -97278 -126520 -108868 -134112 -125564 -109337 -144334 -117603 -123078 -126318 -111358 -37052
17229 -37052 -1023 112 -18366 9599 33699 8412 -88103 -123264 -62039 9362 31753 18454
17217 18454 30073 39643 35516 -30172 -73906 -24453 20170 29204 -10844 -17693 42652 75699
17205 75699 24903 -23707 -47649 -79860 -143920 -116489 -96295 -127221 -94408 -43916 -71014 -95654
17193 -95654 -87800 -69480 -40831 -35681 -54542 -68643 -48508 -24499 19189 33852 35386 56661
17181 56661 53524 -15491 -92909 -78342 -89349 -75863 -89433 -117674 -152555 -198618 -146522 -92198
17169 -92198 -102313 -107304 -68488 -116841 -124985 -129054 -145972 -110108 -104571 -94292 -40539 -21359
$$ packed form
17253i3111L3787L4453o6071l2001N5426J6783o8522L911j8390K0364K6220m193
17241i1344n934k9242J7652k5244Q548J6227l4997K6731n475l240J4960P4306
17229c7052L6029J135j8478K7965K4100k5287r6515l5161O1225P1401K2391j3299
17217A8454J1619R570m127o5688m3734M9453M4623R034m0048o849O0345L3047
17205G5699n0796m8610k3942l2211o4060K7431K0194l0926L2813N0492k7098k4640
17193i5654P854J8320K8649N150j8861j4101K0135K4009M3688J4663J534K1275
17181E6661l137o9015p7418J4567j1007J3486j3570k8241l4881m6063N2096N4324
17169i2198j0115m991L8816m8353q144m069j6918L5864N537J0279N3753J9180
$$ plain form
17157 -21359 25904 -8075 -33814 -74503 -106116 -107160 -58441 7225 -3627 -21269 -32947 -49428
17145 -49428 -91474 -94614 -28606 -35057 -11697 64343 30948 -45646 -48185 19150 -42 -21396
17133 -21396 -43643 -55398 -25854 5209 15577 -14534 -22380 33925 15225 28390 83238 92452
17121 92452 72443 24770 8587 -47109 -102671 -76672 -65254 -26463 -63285 -120863 -102027 -59690
17109 -59690 -54297 -80766 -84566 -70368 -71976 31000 55967 20195 -9249 7678 -58785 -62467
17097 -62467 -42551 -99842 -129715 -118262 -119899 -147318 -126899 -98330 -99113 -102093 -105057 -71744 -42537
17084 -42537 -4733 15568 24202 14278 18193 -44555 -75355 -77834 -99216 -81313 -45821 23062
17072 23062 -5042 -23201 -18027 -55401 -33418 -65055 -129321 -170520 -107135 -57385 -15418 -13207
$$ packed form
17157b1359M7263l3979k5739m0689l1613j044M8719O5666j0852j7642j1678j6481
17145d9428m2046l140O6008o451K3360P6040l3395p6594k539O7335j9192k1354
17133b1396k2247j1755K9544L1063J0368l0111p846N6305j8700J3165N4848R214
17121I2452k0009m7673j6183n5696n5562K5999J1418L8791l6822n7578J8836M2337
17109e9690N393k6469l800J4198j608J02976K4967l5772k9444J6927o6463l682
17097f2467J9916n7291k9873J1453j637k7419K0419K8569p83k980k964L3313K9207
17084d2537L7804K0301Q634r924L915o2748l0800k479k1382J7903L5492O8883
17072B3062k8104j8159N174l7374K1983l1637o4266m1199O3385M9750M1967K211
$$ plain form
17060 -13207 -64876 -30464 1008 23749 -16413 -39155 -98169 -82985 -67453 -47709 -41217 -14932
17048 -14932 -54557 -34410 -46122 -104763 -59839 -33166 -7168 -25349 -31681 -5475 10504 20172
17036 20172 -1831 43333 64329 45843 -8514 -65076 -82563 -42784 -19303 34952 5101 6737
17024 6737 80823 58541 69570 24842 -13429 -28288 -46636 -7171 21758 3389 -22440 25766
17012 25766 37348 25138 -24032 -81325 -169679 -199051 -156661 -104130 -42959 -11882 -26204 -25209
17000 -25209 -3413 31117 32345 16476 2498 8316 -13525 -56181 -81824 -47454 -16023 -20219
16988 -20219 -20525 -39145 -39599 -9786 -14107 27766 43094 63183 31317 -2981 19138 26736 33430
16975 33430 6318 -661 39220 47287 58556 47683 -3637 25700 78358 60830 -40199 -100534
$$ packed form
17060a3207n1669L4412L1472K2741m0162k2742n9014J5184J5532J9744O492K6285
17048a4932l9625K0147j1712n8641M4924K6673K5998j8181o332K6206J5979R668
17036B0172k2003M5164K0996j8486n4357n6562j7487L9779K3481N4255k9851J636
17024F737P4086k2282J1029m4728l8271j4859j8348L9465K8929j8369k5829M8206
17012B5766J1582j2210m9170n7293q8354k9372M2390N2531O1171L1077j4322R95
17000b5209K1796L4530J228j5869j3978N818k1841m2656k5643L4370L1431m196
16988b0219l06j8620m54K9813m321M1873J5328K0089l1866l4298K2119P598O694
16975C3430k7112o979L9881Q067J1269j0873n1320K9337N2658j7528j01029o0335
$$ plain form
16963 -100534 -106994 -95778 -89126 -77562 -115224 -159929 -145781 -113212 -79279 -46036 -76539 -38901
16951 -38901 -55146 -84110 -98282 -155910 -155635 -70522 -39718 -62081 -132779 -133065 -113875 -92860
16939 -92860 -45780 -4556 38408 39576 40324 24065 12454 1427 13635 -7348 -8498 16512
16927 16512 1976 16944 33674 68485 69480 50925 35139 48897 1143 -55841 -69483 -75828
16915 -75828 -60825 -55862 -101605 -64597 -28200 -36605 -31029 10568 2492 -77318 -95521 -55972
16903 -55972 -18014 2057 -16520 -18297 -24251 -141176 -191417 -147173 -85257 -21366 -21621 -22208 -33072
16890 -33072 -94817 -105756 -30288 29013 12514 -75056 -90983 -87152 -137181 -39697 4498 8480
16878 8480 101844 109532 58075 53055 -7364 -15096 -11404 -3103 -49184 -40657 -29478 -108658 -181204
$$ packed form
16963a00534o460J1216O652J1564l7662m4705J4148L2569L3933L3243l0503L7638
16951c8901j6245k8964j4172n7628K75Q5113L0804k2363p0698k86J9190K1015
16939i2860M7080M1224M2964J168P48j6259j1611j1027J2208k0983j150K5010
16927A6512j4536J4968J6730L4811R95j8555j5786J3758m7754n6984j3642o345
16915g5828J5003M963m5743L7008L6397q405N576M1597q076p9810j8203L9549
16903e5972L7958K0071j8577j777n954j16925n0241M4244O1916O3891k55n87j0864
16890c3072o1745j0939P5468N9301j6499q7570j5927L831n0029R7484M4195L982
16878H480R3364P688n1457n020o0419p732L692Q301m6081Q527J1179p9180p2546
$$ plain form
16865 -181204 -195461 -115515 -113401 -106343 -66618 -1919 31986 12061 2854 7833 -34954 4147
16853 4147 9243 9071 -17320 -4163 -5441 7776 41516 4452 -36107 -93251 -84083 -97931 -111956
16840 -111956 -102306 -62196 9921 86346 104845 10456 -86400 -126268 -79728 -26945 -77821 -127797
16828 -127797 -74136 -46134 15236 64573 24321 -18908 32511 28917 -33304 -54648 -28769 -15697
16816 -15697 5144 -38793 -80870 -55440 -57033 -83991 -96202 -83258 -35833 -79727 -69181 -15055
16804 -15055 -8351 -52113 -95776 -120602 -108808 -135927 -112437 -112046 -88548 -126138 -173016 -139523
16792 -139523 -82700 -31798 -3429 -14947 -42464 -33231 -50527 -74883 -55256 -39824 -70568 -13292
16780 -13292 32076 33008 -16034 11698 19169 -83905 -97202 -59685 -82680 -82420 -8095 -8889 -36928
$$ packed form
16865a81204j4257P9946K114P058L9725O4699L3905j9925r207M979m2787L9101
16853D147N096j72k6391J3157j278J3217L3740l7064m0559n7144R168j3848j4025
16840a11956R650M0110P2117P6425J8499r4389r6856l9868M6540N2783n0876m9976
16828a27797N3661K8002O1370M9337m0252m3229N1419l594o2221k1344K5879J3072
16816a5697K0841m3937m2077K5430j593k6958j2211J2944M7425m3894J0546N4126
16804a5055O704m3762m3663k4826J1794k7119K3490L91K3498l7590m6878L3493
16792a39523N6823N0902K8369j1518k7517R233j7296k4356J9627J5432l0744N7276
16780a3292M5368R32m9042K7732P471j03074j3297L7517k2995K60P4325p94k8039
$$ plain form
16767 -36928 -48408 -35128 34881 15967 52750 79212 4814 -27546 3934 3855 59140 50752
16755 50752 3244 -57049 -76295 -84393 -74821 -78907 -15984 48504 33458 170 -21311 -16252
16743 -16252 -25544 -67249 -56967 -52732 -39859 10354 39857 14626 -40916 -80308 -79411 -43203
16731 -43203 -13117 -31705 -40460 -12265 -56904 -71615 -73990 -36845 -4627 -3130 27934 -11906
16719 -11906 -53791 -59669 -79491 -30677 -3959 -48628 -35735 -52709 -79195 -82484 -45082 -36251
16707 -36251 17745 43037 -23126 -146880 -129415 -32485 -20441 -19678 -3108 -5513 -31053 -53831
16695 -53831 -34149 -33556 -22279 5661 57371 81055 59385 49465 21793 -23240 10917 32765
16683 32765 20740 1060 -24471 -7509 1711 43012 99438 78144 27348 -17956 -14757 20429
$$ packed form
16767c6928j1480J3280P0009j8914L6783K6462p4398l2360L1480p9N5285q388
16755E0752m7508o0293j9246q098R572m086O2923O4488j5046l3288k1481N059
16743a6252r292m1705J0282M235J2873N0213K9503k5231n5542l9392Q97L6208
16731d3203L0086j8588q755K8195m4639j4711k375L7145L2218J497L1064l9840
16719a1906m1885n878j9822M8814K6718m4669J2893j6974k6486l289L7402Q831
16707c6251N3996K5292o6163j23754J7465R6930J2044P63J6570k405k5540k2778
16695e3831J9682N93J1277K7940N1710K3684k1670r920k7672m5033L4157K1848
16683C2765j2025j9680k5531J6962R220M1301N6426k1294n0796m5304L199L5186
$$ plain form
16671 20429 27729 43558 -35163 -43443 -34600 -54980 -58348 -59907 -84949 -34433 -45806 -79305 -102065
16658 -102065 -58248 -20580 -16895 -49413 -55356 -18344 -63006 -146503 -165471 -79759 -6260 28768
16646 28768 63140 56911 9851 -27216 -26587 -32194 -20066 13800 -31041 -63954 1642 63344
16634 63344 11496 -20012 -29017 -6756 14299 -10321 -51136 5329 -7950 -59388 -78698 -15947
16622 -15947 32829 -28528 -32103 -820 21974 22458 21890 -10174 -6720 37566 21549 -18299 10356
16609 10356 14771 34211 -23802 -87492 -104036 -39291 -3474 -54955 -87500 -52202 138 3251
16597 3251 7147 44282 7437 -36422 -18895 -70059 -51750 -29574 -18470 -14293 -7050 -3920 -26113
16584 -26113 -72940 -70101 -88610 -133878 -122647 -80473 -27403 -42656 -112152 -73099 -46411 -115947
$$ packed form
16671B0429P300J5829p8721q280Q843k0380l368j559k5042N0516j1373l3499k2760
16658a02065M3817L7668L685l2518n943L7012m4662q3497j8968Q5712P3499L5028
16646B8768L4372o229m7060l7067O29n607J2128L3866m4841l2913O5596O1702
16634F3344n1848l1508r005K2261K1055k4620m0815N6465j3279n1438j9310O2751
16622a5947M8776o1357l575L1283K2794M84n68l2064L454M4286j6017l9848K8655
16609A0356M415J9440n8013o3690j6544O4745L5817n1481l2545L5298N2340L113
16597C251L896L7135l6845m3859J7527n1164J8309K2176J1104M177P243L130k2193
16584b6113m6827K839j8509m5268J1231M2174N3070j5253o9496L9053K6688o9536
$$ plain form
16572 -115947 -97321 -103612 -111439 -48352 -33915 -62778 -30194 -18400 20066 4305 23902 -31574
16560 -31574 -78632 -53835 -24193 -58333 -91605 -66366 -47496 -39933 -39478 -104670 -56213 -68765
16548 -68765 -84476 -31499 -8088 -80214 -105697 -62823 -45046 -110328 -147633 -90985 -43739 -64253
16536 -64253 -48922 -20423 -40021 1368 65527 11635 -29755 -26143 6693 22235 20567 -18406
16524 -18406 32675 51701 5451 21586 3594 -17199 35160 20843 -15689 -39764 -1173 35291
16512 35291 6109 22579 31572 -11771 -19950 21019 31871 -12294 -84672 -98353 -135657 -180233
16500 -180233 -155829 -129507 -75523 -57426 929 39338 5457 -24687 1806 618 -8699 -13330
16488 -13330 -3697 -44502 -105230 -78015 -7268 -2373 -15894 -79804 -105689 -81664 -86813 -118386
$$ packed form
16572a15947J8626o291p827O3087J4437k8863L2584J1794L8466j5761J9597n5476
16560c1574m7058K4797K9642l4140l3272K5239J8870P563M55o5192M8457j2552
16548f8765j5711N2977K3411p2126k5483M2874J7777o5282l7305N6648M7246k0514
16536f4253J5331K8499j9598M1389O4159n3892m1390L612L2836J5542j668l8973
16524a8406N1081J9026m6250J6135j7992k0793N2359j4317l6532k4075L8591L6464
16512C5291k9182J6470Q993m3343q179M0969J0852m4165p2378j3681l7304m4576
16500a80233K4404K6322N3984J8097N8355L8409l3881l0144K6493j188r317m631
16488a3330R633m0805o0728K7215P0747M895j3521o3910k5885K4025n149l1573
$$ plain form
16476 -118386 -111973 -146221 -156172 -107233 -158806 -101293 -22780 4506 63505 66326 32767 16504
16464 16504 1828 -14330 26184 10525 -13387 -56665 -92546 -90698 -48974 -27047 -26782 -22620
16452 -22620 15772 21427 -2961 -26589 -25624 -13137 -34705 -22861 -50262 -83656 -74275 -74892 -91697
16439 -91697 -92861 -99767 -175101 -164526 -154392 -100747 -101951 -110715 -62488 8137 31015 -25643
16427 -25643 -9198 24996 38702 -25118 -112261 -95063 -30725 24473 13397 15307 18937 76919
16415 76919 46816 -16883 11207 24317 17013 -39309 -42522 -25758 -91690 -64486 -60725 -11175
16403 -11175 -6163 11067 766 -23739 -27490 4532 49955 112 -5203 -30202 -60094 -88737
16391 -88737 -111796 -96051 -116041 -115609 -76388 -94746 -115274 -111690 -98452 -81184 -58415 -15089
$$ packed form
16476a18386O413l4248r951M8939n1573N7513P8513K7286N8999K821l3559j6263
16464A6504j4676j6158M0514j5659k3912m3278l5881J848M1724K1927K65M162
16452b2620L8392N655k4388k3628R65J2487k1568J1844k7401l3394R381o17j6805
16439i1697j164o906p5334J0575J0134N3645j204q764M8227P0625K2878n6658
16427b5643J6445L4194J3706o3820q7143J7198O4338N5198j1076J910L630N7982
16415G6919l0103o3699K8090J3110p304n6322l213J6764o5932K7204L761M9550
16403a1175N012J7230j0301k4505l751L2022M5423m9843n315k4999k9892k8643
16391h8737k3059J5745j9990M32L9221j8358k0528L584J3238J7268K2769M3326
$$ plain form
16379 -15089 16924 14901 -16226 -11631 251 -20266 -37135 -56951 -27740 -18724 -40139 -16797
16367 -16797 -47206 -72629 -125703 -136955 -83021 -16569 18992 -14078 -60759 -53901 -53843 -50664 -67477
16354 -67477 -91575 -99367 -127527 -135388 -57694 8834 37875 -11198 -67207 -91762 -101484 -97422
16342 -97422 -43038 -81546 -102575 -83003 -65932 -92557 -88336 -20167 56985 86278 90778 88701
16330 88701 40384 25852 -9222 -15681 -14166 42215 83174 95507 75894 25242 -7441 -47593
16318 -47593 -63201 -107066 -91022 -58418 -62615 -30925 16998 73614 95943 73618 38383 78354
16306 78354 62072 -39754 -88994 -38539 -46011 -102578 -76451 -14603 -37891 -51371 -77741 -74518
16294 -74518 -64931 -37534 26748 43620 50540 30408 42451 28834 -40050 -64198 -8593 -21184
$$ packed form
16379a5089L2013k023l1127M595J1882k0517j6869j9816K9211R016k1415K3342
16367a6797l0409k5423n3074j1252N3934O6452L5561l3070m6681O858N8L179j6813
16354f7477k4098p792k8160p861P7694O6528K9041m9073n6009k4555r722M062
16342i7422N4384l8508k1029J9572J7071k6625M221O8169P7152K9293M500k077
16330H8701m8317j4532l5074o459J515N6381M0959J2333j9613n0652l2683m0152
16318d7593j5608m3865J6044L2604m197L1690M7923N6616K2329k2325l5235L9971
16306G8354j6282j01826m9240N0455p472n6567K6127O1848k3288j3480k6370L223
16294g4518R587K7397O4282J6872O920k0132J2043j3617o8884k4148N5605j2591
$$ plain form
16282 -21184 -50556 -61686 -132918 -125765 -106506 -82004 -136960 -165566 -129087 -83704 -13493 19786
16270 19786 40194 6232 -34761 -30141 -29394 -53712 -100199 -112307 -79334 -89242 -49561 -58803 -65015
16257 -65015 4867 1242 -42098 -6794 -18588 -37396 -64708 -89202 -89161 -156121 -152641 -154824 -148283
16244 -148283 -138007 -115107 -106126 -142982 -154210 -116153 -67257 -19031 23487 -1227 -2567 -23889
16232 -23889 -75362 -111064 -61659 7219 -29078 -30884 10343 -8612 34825 56163 37710 25713
16220 25713 3352 44979 65194 41371 90561 83599 64087 745 -67928 -49900 -40473 -58494
16208 -58494 -27080 -39267 -53084 -70186 -125135 -161933 -143744 -121162 -91033 -97995 -114371 -99141
16196 -99141 -47002 41241 17162 -49575 -55890 -64232 -70289 -71479 -68303 18772 55963 47793 57210
$$ packed form
16282b1184k9372j1130p1232P153J9259K4502n4956k8606L6479M5383P0211L3279
16270A9786K0408l3962m0993M620P47k4318m6487j2108L2973r908L9681r242o212
16257f5015O9882l625m3340L5304j1794j8808k7312k4494M1o6960L480k183O541
16244a48283J0276K2900Q981l6856j1228L8057M8896M8226M2518k4714j340k1322
16232b3889n1473l5702M9405O8878l6297j806M1227j8955M3437K1338j8453j1997
16220B5713k2361M1627K0215k3823M9190o962j9512o3342o8673J8028R427j8021
16208e8494L1414j2187j3817j7102n4949l6798J8189K2582L0129o962j6376J5230
16196i9141N2139Q8243k4079o6737o315q342o057j190L176Q7075L7191q170R417
$$ plain form
16183 57210 -24362 -9137 -31313 -44861 6442 39054 60565 -293 5009 27505 25442 45756
16171 45756 29247 -20236 -88674 -175088 -157867 -79284 -37055 -27730 -5772 7146 -11005 -45520
16159 -45520 -27340 -92534 -65510 -76997 -42448 -7576 -13593 14096 38196 5966 -77295 -131978
16147 -131978 -85118 -30134 -28165 -32398 28236 46383 34961 -49281 -31334 -30913 -25012 9392
16135 9392 22456 12672 -24570 -56774 -92159 -58580 -2339 -58521 -69862 25782 14259 -40427
16123 -40427 -116019 -129647 -89781 -33375 -28665 -49425 -20840 -67112 -119048 -147986 -126642 -87746
16111 -87746 -93546 -106742 -97042 -39751 -44880 -9463 -37411 -16422 45960 61918 46854 30532
16099 30532 -3120 -28445 -47037 16865 36207 -1072 -22188 -58026 -99951 -78064 -85394 -134910
$$ packed form
16183E7210q1572J5225k2176j3548N1303L2612K1511o0858N302K2496k063K0314
16171D5756j6509m9483o8438q6414J7221P8583M2229R325K1958J2918j8151l4515
16159d5520J8180o5194K7024j1487L4549L4872o017K7689K4100l2230q3261n4683
16147a31978M6860N4984J969m233O0634J8147j1422q4242J7947M21N901L4404
16135I392J3064r784l7242l2204l5385L3579N6241n6182j1341R5644j1523n4686
16123d0427p5592j3628L9866N6406M710k0760K8585m6272n1936k8938K1344L8896
16111h7746n800j3196R700N7291n129L5417k7948K0989O2382J5958j5064j6322
16099C0532l3652k5325j8592O3902J9342l7279k1116l5838m1925K1887p330m9516
$$ plain form
16087 -134910 -127082 -48367 -21895 -67553 -64765 -38534 -69023 -80029 -37856 -1180 17608 44361
16075 44361 89883 41437 19398 -7269 -7705 -24979 -36965 -54960 -28323 -32722 -82130 -150545
16063 -150545 -75155 -108961 -117750 -63000 -58543 -22909 22367 73708 58477 13090 -35223 -42905
16051 -42905 -86141 -85096 8047 32416 -51638 -23089 51246 63312 46853 -38314 -61484 -61335
16039 -61335 -43260 -40424 -71221 -79696 -34718 20827 25555 -11878 -38556 -31038 -9911 -32525
16027 -32525 -22092 -46887 -2891 58151 1272 -43637 -45114 -32794 -94556 -84628 -99829 -85265
16015 -85265 -29472 4596 1317 -42513 -85066 -89548 -90589 -66437 -8279 33282 82024 68548
16003 68548 56124 9675 -430 12206 1358 -32362 -50811 -102456 -99132 -32705 -75430 -51225
$$ packed form
16087a34910P828P8715K6472m5658K788K6231l0489j1006M2173L6676J8788K6753
16075D4361M5522m8446k2039k6667m36j7274j1986j7995K6637m399m9408o8415
16063a50545P5390l3806q789N4750M457L5634M5276N1341j5231m5387m8313p682
16051d2905m3236J045R3143K4369q4054K8549P4335J2066j6459q5167k3170J49
16039f1335J8075K836l0797q475M4978N5545M728l7433k6678P518K1127k2614
16027c2525J0433k4795M3996O1042n6879m4909j477J2320o1762R928j5201J4564
16015h5265N5793L4068l279m3830m2553m482j041K4152N8158M1561M8742j3476
16003F8548j2424m6449j0105J2636j0848l3720j8449n1645L324O6427m2725K4205
$$ plain form
15991 -51225 4667 -6505 -19341 26180 67648 60623 54879 27967 14334 -15048 -29077 14462
15979 14462 37472 18277 5745 21629 -8205 -8033 5631 32511 28522 17932 30102 41754
15967 41754 10371 27210 13404 32809 -45954 -56201 -73246 -66951 -30659 -19271 -43992 12112
15955 12112 34225 21522 44991 20568 -5531 -49738 -69427 -32111 28957 44405 36567 -17941
15943 -17941 -24806 -21725 -22174 48674 4782 -35205 -51465 -94831 -79167 -12804 -10292 -26155 -79250
15930 -79250 -75982 -46274 12470 51148 31293 -28088 -52537 -70410 -46699 2085 -5384 -10316
15918 -10316 47329 863 -66900 -38615 2811 55087 67111 62556 52446 43931 68431 -15784
15906 -15784 -76938 -92242 -65855 -26104 2328 -17166 -3629 -54566 -81331 -39700 -64383 -147864
$$ packed form
15991e1225N5892j1172j2836M5521M1468p025n744k6912j3633k9382j4029M3539
15979A4462K3010j9195j2532J5884k9834J72J3664K6880l989j0590J2170J1652
15967D1754l1383J6839j3806J9405p8763j0247j7045O295L6292J1388k4721N6104
15955A2112K2113j2703K3469k4423k6099m4207j9689L7316O1068J5448p838n4508
15943a7941o865L081m49P0848m3892l9987j6260m3366J5664O6363K512j5863n3095
15930g9250L268K9708N8744L8678j9855n9381k4449j7873K3711M8784p469m932
15918a0316N7645m6466o7763K8285M1426N2276J2024m555j0110q515K4500q4215
15906a5784o1154j5304K6387L9751K8432j9494J3537n0937k6765M1631k4683q3481
$$ plain form
15894 -147864 -160997 -188139 -177339 -118189 -35090 -38292 9797 67666 67779 47871 73159 47124
15882 47124 28497 43452 73297 22563 4648 5152 -4047 2836 -11666 -58543 -128735 -114922
15870 -114922 -63104 -4785 -6528 -37919 -37940 -36842 -14028 16869 33481 39034 23037 -42304 -48221
15857 -48221 -48069 -94464 -89568 -13215 -19134 -35905 -13344 -7397 -62800 -118545 -114170 -75997 -43566
15844 -43566 -99119 -81293 -54089 -42308 -61827 -98547 -93415 -93590 -48299 53759 21685 -13344
15832 -13344 -18734 -21452 -60763 -141239 -168548 -153828 -71020 -49998 -2883 9734 11356 27471
15820 27471 25300 12547 495 -1477 28919 63421 3860 -64753 -67797 -35215 6113 2939
15808 2939 -21283 -104325 -170382 -134379 -103231 -84409 -103329 -72001 -50367 4506 15353 -18320
$$ packed form
15894a47864j3133k7142J0800N9150Q3099l202M8089N7869J13j9908K5288k6035
15882D7124j8627J4955K9845n0734j7915N04r199O883j4502m6877p0192J3813
15870a14922N1818N8319j743l1391k1J098K2814L0897J6612N553j5997o5341n917
15857d8221J52m6395M896P6353n919j6771K2561N947n5403n5745M375L8173L2431
15844d3566n5553J7826K7204J1781j9519l6720N132j75M5291J02058l2074l5029
15832a3344n390k718l9311q0476k7309J4720Q2808K1022M7115J2617J622J6115
15820B7471k171j2753j2052j972L0396L4502n9561o8613l044L2582M1328l174
15808B939k4222q3042o6057L6003L1148J8822j8920L1328K1634N4873J0847l3673
$$ plain form
15796 -18320 -5348 37444 32143 50235 9814 48123 67663 80451 48970 11626 -28038 -8458
15784 -8458 -48678 -45221 -76415 -77578 -10596 13147 -57030 -22244 14609 12362 31124 -2938
15772 -2938 -37193 -29906 -20287 21177 25748 4102 17017 -24360 -110004 -140892 -81619 -36033
15760 -36033 -43082 -132298 -155300 -124622 -57458 -38811 -70851 -83564 -120809 -122624 -142981 -126372
15748 -126372 -102552 -50939 -60480 -69850 -90028 -78308 -69579 -70832 -69470 -126945 -130749 -113065 -105090
15735 -105090 -61508 -112786 -117240 -82163 -90516 -130024 -98047 -77460 -84045 -68273 -79697 -91639
15723 -91639 -62085 -73858 -86533 -37813 -39861 -72483 -20924 26524 -45807 -112193 -112299 -73804
15711 -73804 -21161 -39200 -20810 55231 77147 -9827 -33943 40806 70568 34756 27992 17246
$$ packed form
15796a8320J2972M2792n301J8092m0421L8309J9540J2788l1481l7344l9664J9580
15784h458m0220L457l1194j163O6982K3743p0177L4786L6853k247J8762l4062
15772b938l4255P287R619M1464M571k1646J2915m1377q5644l0888N9273M5586
15760c6033p049q9216k3002L0678O7164J8647l2040j2713l7245j815k0357J6609
15748a26372K3820N1613r541r370k0178J1720Q729j253J362n7475l804J7684P975
15735a05090M3582n1278m454L5077q353l9508L1977K0587o585J5772j1424j1942
15723i1639K9554j1773j2675M8720k048l2622N1559M7448p2331o6386j06L8495
15711g3804N2643j8039J8390P6041K1916q6974k4116P4749K9762l5812o764j0746
$$ plain form
15699 17246 -15432 -88070 -67057 -52649 -28266 -21288 -9489 3489 57573 36638 -3276 -27280
15687 -27280 19137 -18120 -94473 -97540 -4888 80009 59208 -30541 -101295 -70405 -89800 -98568
15675 -98568 -56513 -66492 -75261 -95889 -46689 3311 44236 32789 562 -56797 -31333 -876
15663 -876 -30150 -57462 -81688 -53826 -32897 -23728 -21079 -75020 -129505 -83173 -98583 -123369
15651 -123369 -146197 -145876 -116465 -78543 -85947 -115641 -102981 -123468 -78043 -16127 -17774 -53068
15639 -53068 -103786 -123097 -78507 -25310 -22075 -34473 -45518 -69514 -30114 -25707 -81709 -73809
15627 -73809 -77051 -68288 -29175 -43275 -57521 -106257 -113984 -137338 -162565 -127832 -139789 -152744
15615 -152744 -191500 -264006 -249416 -166963 -124126 -112147 -88854 -111731 -160718 -165326 -171136 -127966
$$ packed form
15699A7246l2678p2638K1013J4408K4383O978J1799J2978N4084k0935l9914k4004
15687b7280M6417l7257p6353l067R2652Q4897k0801q9749p0754L0890j9395q768
15675i8568M2055r979q769k0628M9200N0000M0925j1447l2227n7359K5464L0457
15663h76k9274k7312k4226K7862K0929R169K649n3941n4485M6332j5410k4786
15651a23369k2828L21K9411L7922p404k9694J2660k0487M5425O1916j647l5294
15639e3068n0718j9311M4590N3197L235j2398j1045k3996L9400M407n6002P900
15627g3809l242Q763L9113j4100j4246m8736p727k3354k5227L4733j1957j2955
15615a52744l8756p2506J4590Q2453M2837J1979K3293k2877m8987m608n810M3170
$$ plain form
15603 -127966 -90876 -35470 -91326 -125321 -132976 -140736 -116164 -113822 -134199 -93256 -43739 -35708
15591 -35708 -139452 -180419 -149310 -68987 -46342 -4645 -55690 -20503 -29176 -14333 -44390 -86270
15579 -86270 -97261 -30557 -28650 -46336 -18561 -12785 -3516 9543 -13843 -45317 -10483 37063
15567 37063 43472 56457 69157 63594 24383 -21505 -29095 39622 -21709 -46894 -38095 -49523
15555 -49523 -50899 -32061 -47346 -3016 52354 19691 -13763 -26017 -45983 -55724 -56505 -48606 -7668
15542 -7668 48853 24349 -43518 -64028 -76667 -108651 -96340 -37999 15961 -42607 -124184 -80083
15530 -80083 -59318 -46979 -43470 -67083 -63896 -61466 -25580 -89721 -152227 -126286 -66708 -61334
15518 -61334 -68902 -65974 -26674 -29380 -134383 -144734 -78289 -100879 -90687 -78361 12446 24740
$$ packed form
15603a27966L7090N5406n5856l3995p655p760K4572K342k0377M0943M9517Q031
15591c5708j03744m0967L1109Q0323K2645M1697n1045L5187q673J4843l0057m1880
15579h6270j0991O6704J907j7686K7775N776R269J3059k3386l1474L4834M7546
15567C7063O409J2985J2700n563l9211m5888p590O8717o1331k5185Q799j1428
15555d9523j376J8838j5285M4330N5370l2663l3454j2254j9966r741p81P899M0938
15542g668N6521k4504o7867k0510j2639l1984J2311N8341N3960n8568q1577M4101
15530h0083K0765J2339L509k3613L187K430L5886o4141o2506K5941N9578N374
15518f1334p568K928L9300k706j05003j0351O6445k2590J0192J2326R0807J2294
$$ plain form
15506 24740 109341 132820 58738 -11442 36501 40468 -41477 -71936 -52520 21424 78759 36799
15494 36799 -15298 -25918 26316 47818 -26805 -79100 -96351 -63486 -54372 -58372 -61505 -94685
15482 -94685 -97410 -96635 -77592 -16614 -296 -18270 -56708 -81345 -56906 -14153 4066 -43602
15470 -43602 -124283 -102395 -49489 -36858 -75653 -34651 -43515 -73556 -63988 -5667 -84285 -102998
15458 -102998 -68615 -13799 -30327 -53078 -21445 4766 -784 -38502 -68828 34505 71796
15447 71796 12965 -34479 -45679 -7345 52868 47225 56000 62279 83658 68741 33948 -27163
15435 -27163 -94964 -52531 14394 50219 41628 13541 75260 110573 38853 34189 53231 62704
15423 62704 58860 62992 91827 81505 86023 113714 54601 43571 73299 68194 26536 29275 -16129
$$ packed form
15506B4740Q4601K3479p4082p0180M7943L967q1945l0459J9416P3944N7335m1960
15494C6799n2097j0620N2234K1502p4623n2295j7251L2865R114m000l133l3180
15482i4685k725P75J9043O0978J6318j7974l8438k4637K4439M2753J8219m7668
15470d3602q0681K1888N2906J2631l8795M1002q864l0041R568N8321p8618j8713
15458a02998L4383N4816j6528k2751L1633K6211n550l7718l0326J03333L7291
15447G1796n8831m7444j1200L8334O0213n643Q775O279K1379j4917l4793o1111
15435b7163o7801M2433O6925L5825q591k8087O1719L5313p1720m664J9042R473
15423F2704l844M132K8835j0322M518K7691n9113j1030K9728n105m1658K739m5404
$$ plain form
15410 -16129 -65366 -55115 -74162 -78156 -68134 -23538 49055 50907 20871 19487 24252 28377 22149
15397 22149 79223 89222 26927 31634 61457 115271 107731 59684 26059 54443 57125 5179
15385 5179 9657 14809 41041 -19545 -16839 -8626 -8343 -3530 -18706 -9966 -50844 -64007 -82295
15372 -82295 -58902 29103 24861 -68333 -33702 -8074 4755 21345 12474 39402 116042 133012
15360 133012 116534 78266 54264 27321 -31804 -117864 -107910 -14150 -3190 75193 119329 49871
15348 49871 89473 97166 11990 -48981 -5033 -25807 -8672 59814 36388 49590 60418 21303
15336 21303 -46257 -103713 -105139 -35742 -14478 -11867 27910 95771 99497 33044 28300 107752
15324 107752 184228 88103 59 -24438 -19690 -7187 43782 83398 33922 30340 -10697 -57974
$$ packed form
15410a6129m9237J0251j9047l994J0022M4596P2593J852l0036j384M765M125o228
15397B2149N7074R999o2295M707K9823N3814p540m8047l3625K8384K682n1946
15385E179M478N152K6232o0586K706Q213K83M813j5176Q740m0878j3163j8288
15372h2295K3393Q8005m242r3194L4631K5628J2829J6590q871K6928P6640J6970
15360A33012j6478l8268k4002k6943n9125q6060R954R3760J0960P8383M4136o9458
15348D9871L9602P693q5176o0971M3948k0774J7135O8486k3426J3202J0828l9115
15336B1303o7560n7456j426O9397K1264K611L9777O7861L726o6453m744P9452
15324A07752P6476r6125q8044k4497M748J2503N0969L9616m9476l582m1037m7277
$$ plain form
15312 -57974 -67776 -100413 -70484 -46294 -29187 -21333 -6087 -233 15503 2302 58329 91689
15300 91689 64553 2213 -7041 23508 60971 28485 7029 40715 55380 22317 -58317 17122
15288 17122 83039 91885 101317 15638 -18766 3725 -6268 48226 104733 124321 99209 55354
15276 55354 8538 -19639 5404 4231 -25197 -12422 -30352 -5322 -18311 -10649 27173 35737
15264 35737 19589 -21908 -93461 -68275 -84734 -99531 -63489 -72416 -56946 -56184 -32968 38361
15252 38361 81370 101947 130233 88894 78364 68226 22734 64731 27621 56197 63915 103874
15240 103874 114975 19780 28757 93171 48987 33793 97608 36145 -62044 -62983 22169 26583
15228 26583 43881 58610 66290 27210 18140 74275 -1166 -41915 -46912 -54835 -13942 -36814
$$ packed form
15312e7974r802l2637K9929K4190J7107P854J5246N854J5736j3201N6027L3360
15300I1689k7136o2340r254L0549L7463l2486k1456L3686J4665l3063q0634P5439
15288A7122O5917Q846R432q5679l4404K2491r993N4494N6507J9588k5112m3855
15276E5354m6816k8177K5043j173k9428J2775j7930K5030j2989P662L7822Q564
15264C5737j6148m1497p1553K5186j6459j4797L6042q927J5470P62K3216P1329
15252C8361M3009K0577K8286m1339j0530j0138m5492M1997l7110K8576P718L9959
15240A03874J1101r5195Q977O4414m4184j5194O3815o1463r8189r39Q5152M414
15228B6583J7298J4729P680l9080r070N6135p5441m0749m997p923M0893k2872
$$ plain form
15216 -36814 -61520 593 -5452 -24088 -21005 15524 78788 47844 -652 -51288 -76671 -58773
15204 -58773 3518 44477 56906 67555 57318 13378 17855 35667 40862 21361 -392 35026
15192 35026 41366 16642 -24025 -39099 -25797 25476 34649 -10174 -37251 -58471 -46678 -46860
15180 -46860 -12734 -8062 -47330 -84390 -70147 -4304 -24097 -470 32829 -11229 -76109 -84123
15168 -84123 -47647 -29862 -62191 -110487 -145525 -107672 -65101 -26481 57315 47324 2131 -31077
15156 -31077 -36780 5748 49912 51398 -13987 -40605 -2206 25588 51720 52063 23390 46047
15144 46047 77166 61377 41536 -6362 -25384 -23608 -2556 -34233 -28666 26567 70676 95837
15132 95837 91757 114501 124414 117629 95446 80479 90131 71538 -16871 992 15598 27625
$$ packed form
15216c6814k4706O2113o045j8636L083L6529O3264l0944m8496n0636k5383J7898
15204e8773O2291M0959J2429J0649j0237m3940M477J7812N195j9501k1753L5418
15192C5026O340k4724m0667j5074J3302N1273R173m4823k7077k1220J1793j82
15180d6860L4126M672l9268l7060J4243O5843j9793K3627L3299m4058o4880q014
15168h4123L6476J7785l2329m8296l5038L7853M2571L8620Q3796r991m5193l3208
15156c1077n703M2528M4164J486o5385k6618L8399K7794K6132L43k8673K2657
15144D6047L1119j5789j9841m7898j9022J776K1052l1677N567N5233M4109K5161
15132I5837m080K2744R913o785k2183j4967R652j8593q8409J7863J4606J2027
$$ plain form
15120 27625 29191 25480 18758 37364 26405 9347 56296 84605 69845 46418 36349 48294
15108 48294 51186 42984 37439 77801 116682 130550 78476 37649 -35015 -99108 1006 96677
15096 96677 127785 79021 45003 83540 73908 79685 64531 561 -18753 -53700 -15421 59782
15084 59782 76286 112581 58108 26228 39996 34222 70087 98184 80474 41359 79628 77469
15072 77469 17181 -656 -4195 22626 55726 59588 52482 13009 8948 26264 1246 -13840
15060 -13840 -78408 -94485 -69398 -55530 -45544 -22930 18740 96326 62048 2902 298 52085
15048 52085 47002 11891 -8937 33920 72837 53148 559 5502 9892 80003 36090 74328
15036 74328 130533 115789 95165 75172 98036 132685 53231 3078 -36108 12074 75253 76067
$$ packed form
15120B7625J566l711o722J8606j0959j7058M6949K8309j4760k3427j0069J1945
15108D8294K892q202n545M0362L8881J3868n2074m0827p2664o4093J00114R5671
15096I6677L1108m8764l4018L8537r632N777j5154o3970j9314l4947L8279P5203
15084E9782J6504L6295n4473l1880J3768n774L5865K8097j7710l9115L8269k159
15072G7469o0288j7837l539K6821L3100L862p106l9473m061J7316k5018j5086
15060a3840o4568j6077K5087J3868R986K2614M1670P7586l4278n9146k604N1787
15048E2085n083l5111k0828M2857L8917j9689n2589M943M390P0111m3913L8238
15036G4328N6205j4744k0624j9993K2864L4649p9454n0153l9186M8182O3179Q14
$$ plain form
15024 76067 51910 16395 25685 59643 81711 15614 -36983 -16265 1732 -50960 -82111 -124670
15012 -124670 -72494 5486 37732 37540 90440 97454 67635 -15734 -15830 -8387 1173 32501 31865
14999 31865 43246 47547 7110 -13747 -22719 50647 43723 58751 89734 98862 109322 92694
14987 92694 85978 43055 12025 2791 42389 63997 46645 26907 21000 73460 39578 -51878
14975 -51878 -27204 -3167 11307 15138 42839 1857 7334 -26947 41574 85316 105933 136443
14963 136443 106073 105935 130241 176598 145250 174232 132490 162988 239924 273930 217770 206581
14951 206581 169962 113399 64618 42568 55234 70138 19490 20694 -18830 -51366 7477 68317
14939 68317 44389 -11484 -1293 -37333 -27637 32002 113972 145777 174081 197219 203479 113394
$$ packed form
15024G6067k4157l5515R290L3958K2068o6097n2597K0718J7997n2692l1151m2559
15012a24670N2176P7980L2246j92N2900P014k9819q3369r6P443R560L1328o36
14999C1865J1381M301m0437k0857q972P3366o924J5028L0983R128J0460j6628
14987I2694o716m2923l1030r234L9598K1608j7352j9738n907N2460l3882r1456
14975e1878K4674K4037J4474L831K7701m0982N477l4281O8521M3742K0617L0510
14963A36443l0370j38K4306M6357l1348K8982m1742L0498P6936L4006n6160j1189
14951B06581l6619n6563m8781k2050J2666J4904n0648J204l9524l2536N8843O0840
14939F8317k3928n5873J0191l6040R696N9639Q1970L1805K8304K3138O260r0085
$$ plain form
14927 113394 96179 98259 88061 77882 101015 136607 194903 245485 256436 245545 184037 110299
14915 110299 88053 44286 65797 106815 112013 139083 130842 97173 81865 66582 66897 118296
14903 118296 124601 148155 160246 172047 191332 174047 122400 101576 122217 141688 145158 170649
14891 170649 122433 111591 49066 13237 47679 39109 -20553 -27840 -77699 -41645 100800 123007
14879 123007 129187 165396 138209 96840 48892 14564 -21619 -40794 -11737 26991 7477 44770
14867 44770 80846 99246 107595 93895 131299 104028 116916 100021 91713 33319 -18950 24341
14855 24341 44634 42008 75390 117048 131895 117927 159002 160167 126532 126909 161880 202163
14843 202163 124333 77991 31311 16525 81833 105611 110470 87718 42679 80404 99873 57226
$$ packed form
14927A13394j7215K080j0198j0179K3133L5592N8296N0582J0951j0891o1508p3738
14915A10299k2246m3767K1511M1018N198K7070q241l3669j5308j5283L15N1399
14903A18296O305K3554J2091J1801J9285j7285n1647k0824K0641J9471L470K5491
14891A70649m8216j0842o2525l5829L4442q570n9662p287m9859L6054J42445K2207
14879A23007O180L6209k7187m1369m7948l4328l6183j9175K9057L8728j9514L7293
14867D4770L6076J8400Q349j3700L7404k7271J2888j6895q308n8394n2269M3291
14855B4341K0293k626L3382M1658J4847j3968M1075J165l3635L77L4971M0283
14843B02163p7830m6342m6680j4786O5308K3778M859k2752m5039L7725J9469m2647
$$ plain form
14831 57226 96107 128668 102528 90905 75836 48011 72276 79734 66388 58074 104759 136080
14819 136080 91109 88214 70889 89919 87443 112369 158113 136072 95186 78315 63256 20664
14807 20664 30492 91586 132709 113225 75687 77009 150294 187074 160244 114245 40529 44904
14795 44904 26814 56978 62593 49384 8503 -30262 -3820 47055 51214 13922 -37165 25915
14783 25915 95903 81144 84986 29231 51887 87643 99082 98877 38272 -28141 -114807 -59516
14771 -59516 24817 67238 71121 89938 171717 169254 71799 100680 231081 206437 133496 60920
14759 60920 52025 76605 124823 175029 166017 150980 171428 152252 73342 51158 159810 181393
14747 181393 141042 156127 165689 129029 144489 161868 157362 135053 113993 74452 -35844 -179639
$$ packed form
14831E7226L8881L2561k6140j1623j5069k7825K4265P458j3346q314M6685L1321
14819A36080m4971k895j7325J9030k476K4926M5744k2041m0886j6871j5059m2592
14807B0664R828O1094M1123j9484l7538J322P3285L6780k6830m5999p3716M375
14795D4904j8090L0164N615j3209m0881l8765K6442N0875M159l7292n1087O3080
14783B5915O9988j4759L842n5755K2656L5756J1439k05o0605o6413q6666N5291
14771e9516Q4333M2421L883J8817Q1779k463r7455K8881J30401k4644p2941p2576
14759F0920q895K4580M8218N0206r012j5037K0448j9176p8910k2184J08652K1583
14747A81393m0351J5085R562l6660J5460J7379m506k2309k1060l9541j10296j43795
$$ plain form
14735 -179639 -231412 -258873 -203129 -125384 -37917 40331 39272 66017 127892 170623 214296 262491
14723 262491 257795 214631 215195 215319 252240 266312 238298 229262 234626 245521 293845 330830 321245
14710 321245 298663 287506 271306 236970 250499 269014 262851 250667 180533 135901 92504 34762
14698 34762 83459 117822 119432 187363 226289 289595 285084 230951 249463 270372 347357 409120
14686 409120 421726 465299 554371 604953 609244 622293 685556 745995 769869 737448 751393 768487
14674 768487 829973 859797 835525 824789 885497 993588 1104171 1157421 1234749 1386964 1530225
14663 1530225 1660022 1875779 2123210 2333546 2562816 2874675 3265793 3746468 4478982
14654 4478982 5531787 6787102 8407348 10664909 13875804 18596322 25501319 35085652
$$ packed form
14735a79639n1773k7461N5744P7745Q7467P8248j059K6745O1875M2731M3673M8195
14723B62491m696m3164N64J24L6921J4072k8014r036N364J0895M8324L6985r585
14710C21245k2582j1157j6200l4336J3529J8515o163j2184p0134m4632m3397n7742
14698C4762M8697L4363J610O7931L8926O3306m511n4133J8512K0909P6985O1763
14686D09120J2606M3573Q9072N0582M291J3049O3263O0439K3874l2421J3945J7094
14674G68487O1486K9824k4272j0736O0708J08091J10583N3250P7328J52215J43261
14663A530225J29797K15757K47431K10336K29270L11859L91118M80675P32514
14654D478982J052805J255315J620246K257561L210895M720518O904997R584333
$$ plain form
14646 35085652 46250342 56176557 61315642 59097955 50117241 38834778 29280077 22399582
14638 22399582 17604973 14277014 11932246 10293469 9035722 7998680 7244636 6648950
14630 6648950 6265107 6016868 5858838 5754529 5753134 5844718 6050247 6438807 7006390 7748586
14620 7748586 8709488 10038467 11843072 14294120 17562203 22067913 28550498 38321778
14612 38321778 52947090 73445966 98074674 121527427 135790697 134198620 116203699
14605 116203699 89196208 64459858 47028327 35495854 27734890 22377587 18513817
14598 18513817 15676542 13472415 11656343 10228741 9065544 8207712 7479305 6904378
14590 6904378 6537209 6307248 6163518 6078640 6159939 6375133 6821025 7443437 8276916 9511564
$$ packed form
14646C5085652J1164690R926215N139085k217687q980714j1282463r554701o880495
14638B2399582m794609l327959k344768j638777j257747j037042p54044n95686
14630F648950l83843k48239j58030j04309j395R1584K05529L88560N67583P42196
14620G748586R60902J328979J804605K451048L268083M505710O482585R771280
14612C8321778J4625312K0498876K4628708K3452753J4263270j592077j7994921
14605A16203699k7007491k4736350j7431531j1532473p760964n357303l863770
14598A8513817k837275k204127j816072j427602j163197q57832p28407n74927
14590F904378l67169k29961j43730q4878Q1299K15194M45892O22412Q33479J234648
$$ plain form
14580 9511564 11168901 13408984 16600802 21392502 28565127 38620912 50864079 62735143
14572 62735143 70174929 69630925 60595584 47203033 34975804 25974616 19791799 15523502
14564 15523502 12562609 10378240 8708676 7410849 6362690 5493664 4750652 4098560
14556 4098560 3558418 3115340 2763932 2426482 2167481 1964854 1766337 1624741 1501510
14547 1501510 1363063 1256600 1130420 1066800 1085047 1063481 971401 869064 842886 799867
14537 799867 774683 687666 635811 656601 705012 637332 647577 655484 579275 559356 494765 458587
14525 458587 444105 424839 435243 450775 510848 553795 504555 475346 522036 513605 447070 408845
14513 408845 364051 397768 376970 295398 260234 242671 263045 278556 250352 250687 307844 370698
$$ packed form
14580I511564J657337K240083L191818M791700P172625J0055785J2243167J1871064
14572F2735143P439786n44004r035341j3392551j2227229r001188o182817m268297
14564A5523502k960893k184369j669564j297827j048159q69026p43012o52092
14556D098560n40142m43078l51408l37450k59001k02627j98517j41596j23231
14547A501510j38447j06463j26180o3620J8247k1566r2080j02337k6178m3019
14537G99867k5184q7017n1855K0790M8411o7680J0245P907p6209j9919o4591l6178
14525D58587j4482j9266J0404J5532O0073M2947m9240k9209M6690q431o6535l8225
14513D08845m4794L3717k0798q1572l5164j7563K0374J5511k8204L35N7157O2854
$$ plain form
14501 370698 374834 344900 269305 236749 176886 151659 213708 208051 138157 130697 173897 238507
14489 238507 271664 218795 150928 137881 211112 339091 481464 621656 690079 632771 563062
14478 563062 472925 378234 308968 258496 190079 204093 191182 161895 166760 155691 199318 127050
14466 127050 58874 155832 209938 177573 147182 106102 102404 93281 110595 156162 138729 120439
14454 120439 114014 116903 53007 41870 106272 151673 183958 159639 186453 225634 254221 244066
14442 244066 182545 172906 153251 167733 134201 137632 105956 141666 185861 233461 226079 159824
14430 159824 133906 124586 174754 207506 189478 170849 101605 23109 -29969 47936 99011 82318
14418 82318 53440 63319 30583 -3719 23137 58257 82259 51649 -63888 -53698 17815 15451
$$ packed form
14501C70698M136k9934p5595l2556n9863k5227O2049n657o9894p460M3200O4610
14489B38507L3157n2869o7867j3047P3231J27979J42373J40192O8423n7308o9709
14478E63062r0137r4691o9266n0472o8417J4014j2911k9287M865j1069M3627p2268
14466A27050o8176R6958N4106l2365l0391m1080l698r123J7314M5567j7433j8290
14454A20439o425K889o3896j1137O4402M5401L2285k4319K6814L9181K8587j0155
14442B44066o1521r639j9655J4482l3532L431l1676L5710M4195M7600p382o6255
14430A59824k5918r320N0168L2752j8028j8629o9244p8496n3078P7905N1075j6693
14418H2318k8878R879l2736l4302K6856L5120K4002l0610j15537J0190P1513k364
$$ plain form
14406 15451 -10495 5748 -9665 26227 56521 74202 69090 58746 80345 101700 83728 41432
14394 41432 99381 137186 167158 141440 155182 98303 116027 136216 159309 169716 147268 132208
14382 132208 110138 69384 36575 43134 42061 67512 69762 99261 66378 55425 71768 126755
14370 126755 95207 92713 157056 140400 139982 165365 109452 63926 7879 8266 48365 44082 82826
14357 82826 43321 44538 75087 60338 33959 6946 14490 -1498 -27880 -31320 -40743 13799
14345 13799 33704 55728 94017 127169 105613 83468 72038 75584 109666 126258 160957 146539
14333 146539 124845 109346 79368 55817 48553 85104 129062 159327 145188 105931 28976 -6471
14321 -6471 -36430 -29318 -4842 2214 -9870 -1077 48054 66305 65663 65888 101763 88082 53785
$$ packed form
14406A5451k5946J6243j5413L5892L0294J7681n112j0344K1599K1355j7972m2296
14394D1432N7949L7805K9972k5718J3742n6879J7724K0189K3093J0407k2448j5060
14382A32208k2070m0754l2809O559j073K5451K250K9499l2883j0953J6343N4987
14370A26755l1548k494O4343j6656m18K5383n5913m5526n6047L87M0099m283L8744
14357H2826l9505J217L0549j4749k6379k7013P544j5988k6382l440r423N4542
14345A3799J9905K2024L8289L3152k1556k2145j1430L546L4082J6592L4699j4418
14333A46539k1694j5499k9978k3551p264L6551M3958L0265j4139l9257p6955l5447
14321f471k9959P112K4476P056j2084Q793M9131J8251o42K25L5875j3681l4297
$$ plain form
14308 53785 32926 -955 14250 50719 52099 79979 11918 -35251 34847 65578 17155 -14286
14296 -14286 -6487 41350 41260 167 -16329 8608 10246 27815 25533 12813 -10964 20565 33748
14283 33748 60019 48795 63097 95354 40474 8827 76739 138594 146945 148599 111485 58494
14271 58494 28113 -19534 5192 19185 44978 74669 130861 111001 47160 -1967 4917 -7150
14259 -7150 48202 93183 68734 71772 53821 -43329 -52336 -20205 -54577 -86203 -11317 102201
14247 102201 81153 65555 52848 32102 45803 75716 53819 -28692 -32331 -34210 -25538 20593
14235 20593 54347 43970 7588 -669 -15451 25599 29597 38113 -242 -707 7805 69428 73007
14222 73007 83186 81414 80825 36206 53207 89009 78163 107515 56405 48384 64527 89867
$$ packed form
14308E3785k0859l3881J5205L6469J380K7880o8061m7169P0098L0731m8423l1441
14296a4286P799M7837r0m1093j6496K4937J638J7569k282j2720k3777L1529J3183
14283C3748K6271j1224J4302L2257n4880l1647O7912O1855Q351J654l7114n2991
14271E8494l0381m7647K4726J3993K5793K9691N6192j9860o3841m9127O884j2067
14259g150N5352M4981k4449L038j7951r7150r007L2131l4372l1626P4886J13518
14247A02201k1048j5598j2707k0746J3701K9913k1897q2511l639j879Q672M6131
14235B0593L3754j0377l6382q257j4782M1050L998Q516l8355m65Q512O1623L579
14222G3007J0179j772n89m4619J7001L5802j0846K9352n1110q021J6143K5340
$$ plain form
14210 89867 128873 106364 74596 24721 28799 48670 34432 38714 -10104 3724 82812 72108
14198 72108 37446 -26320 -39511 10700 21169 -70936 -97951 -66253 -8791 19600 59389 97477
14186 97477 124490 123122 62346 -33382 -83378 -14527 18174 42913 32709 4056 17328 31340
14174 31340 38702 107079 88020 92136 107713 73221 11964 -26681 -104458 -76758 -58062 -63303
14162 -63303 -45592 -40004 35551 78343 53502 45938 47258 8415 -69256 -37642 33704 19918
14150 19918 -13517 -17344 20911 57214 36706 -30366 -101908 -95606 -90754 -59593 -15780 -36993
14138 -36993 -36543 -15438 60461 95477 129192 91070 75445 68428 84031 127870 155724 117008
14126 117008 64421 116490 175051 137779 147635 172636 140100 130529 138709 145277 127777 106708
$$ packed form
14210H9867L9006k2509l1768m9875M078J9871j4238M282m8818J3828P9088j0704
14198G2108l4662o3766j3191N0211J0469r2105k7015L1698N7462K8391L9789L8088
14186I7477K7013j368o0776r5728m9996O8851L2701K4739j0204k8653J3272J4012
14174C1340P362O8377j9059M116J5577l4492o1257l8645p7777K7700J8696n241
14162f3303J7711N588P5555M2792k4841p564J320l8843p7671L1614P1346j3786
14150A9918l3435l827L8255L6303k0508o7072p1542O302M852L1161M3813k1213
14138c6993M50K1105P5899L5016L3715l8122j5625p017J5603M3839K7854l8716
14126A17008n2587N2069N8561l7272R856K5001l2536r571Q180O568j7500k1069
$$ plain form
14114 106708 148063 144250 133256 243546 324001 490858 598182 716910 808938 900239 956254
14103 956254 941424 964846 1000411 1014126 944765 822151 706624 572229 505371 444802 341953
14092 341953 257401 225736 212998 183660 130217 121479 145118 185091 221470 235236 256154 244912
14080 244912 197871 198003 239315 281483 279953 295408 392470 519525 598607 728169 851947
14069 851947 944710 914633 891320 929503 961584 923468 817025 665077 544738 442877 325167
14058 325167 211866 210905 242970 239104 194046 155824 148893 124970 156141 179854 139431 77055
14046 77055 41477 51627 92187 126040 92094 79130 44741 55260 93991 63329 56909 21927
14034 21927 7027 38194 65614 40788 68070 109873 125184 124615 100062 76918 95106 79894
$$ packed form
14114A06708M1355l813j0994J10290Q0455J66857J07324J18728R2028R1301N6015
14103I56254j4830K3422L5565J3715o9361j22614j15527j34395o6858o0569j02849
14092C41953q4552l1665j2738k9338n3443q738K3639L9973L6379J3766K0918j1242
14080B44912m7041J32M1312M2168j530J5455R7062J27055P9082J29562J23778
14069H51947R2763l0077k3313L8183L2081l8116j06443j51948j20339j01861j17710
14058C25167j13301r61L2065l866m5058l8222o931k3923L1171K3713m0423o2376
14046G7055l5578J0150M0560L3853l3946j2964l4389J0519L8731l0662o420l4982
14034B1927j4900L1167K7420k4826K7282M1803J5311n69k4553k3144J8188j5212
$$ plain form
14022 79894 57663 68405 -4017 16047 63031 50954 41252 81189 103284 73083 53520 37106
14010 37106 -11980 3926 81221 157176 143377 94064 57285 14355 -14616 -13383 -4950 -19204
13998 -19204 -49642 -47990 -35899 43258 69147 19809 -78672 -46825 -6578 42845 143815 162062
13986 162062 131465 153998 154355 109686 93797 149598 113881 86603 92525 113892 71863 62357
13974 62357 76901 95069 165695 148642 121698 106333 126159 56691 46959 59721 52719 110211
13962 110211 175373 171256 100850 86449 59066 91346 112050 98958 65674 70386 70426 3475
13950 3475 -17163 37776 30011 38542 72746 60615 28971 66360 60035 45341 -10002 37885
13938 37885 111392 84519 67375 64044 62055 51462 80911 109757 120786 94541 120463 115084
$$ packed form
14022G9894k2231J0742p2422K0064M6984j2077r702L9937K2095l0201j9563j6414
14010C7106m9086J5906P7295P5955j3799m9313l6779m2930k8971J233Q433j4254
13998a9204l0438J652J2091P9157K5889m9338r8481L1847M0247M9423J00970J8247
13986A62062l0597K2533L57m4669j5889N5801l5717k7278N922K1367m2029r506
13974F2357J4544J8168P0626j7053k6944j5365J9826o9468r732J2762p002N7492
13962A10211O5162m117p0406j4401k7383L2280K0704j3092l3284M712M0o6951
13950C475k0638N4939p765Q531L4204j2131l1644L7389o325j4694n5343M7887
13938C7885P3507k6873j7144l331j989j0593K9449K8846J1029k6245K5922n379
$$ plain form
13926 115084 81708 106433 136502 165037 127082 151215 176174 204012 138733 87399 106913
13915 106913 131846 175144 179405 171779 237431 219922 161410 125631 131829 50495 23372 29994
13903 29994 103186 130824 133031 145290 91490 89893 139541 150552 118907 96241 63400 81221
13891 81221 119086 122069 145659 160927 175576 204756 236308 265489 263257 224418 167823 136629
13879 136629 180286 224531 239707 295087 299499 249678 182374 192025 206188 209536 226617 186819
13867 186819 110477 80051 94875 138638 166014 200881 235001 249754 272727 263837 337664 357543
13855 357543 304153 265650 240253 166112 121766 147811 210323 209457 178695 151076 210032 245176
13843 245176 215188 157786 101547 168274 209591 217461 194769 229554 224885 235513 207079 132192
$$ packed form
13926A15084l3376K4725L0069K8535l7955K4133K4959K7838o5279n1334J9514
13915A06913K4933M3298M261p626O5652j7509n8512l5779O198q1334k7123O622
13903B9994P3192K7638K207J2259n3800j597M9648J1011l1645k2666l2841J7821
13891H1221L7865K983K3590J5268J4649K9180L1552K9181k232l8839n6595l1194
13879A36629M3657M4245J5176N5380M412m9821o7304R651J4163L348J7081l9798
13867A86819p6342l0426J4824M3763K7376L4867L4120J4753K2973q890P3827J9879
13855C57543n3390l8503k5397p4141m4346K6045O2512q66l0762k7619N8956L5144
13843B45176k9988n7402n6239O6727M1317P870k2692L4785m669J0628k8434p4887
$$ plain form
13831 132192 129061 114636 123974 129639 176660 222920 276766 313363 362640 392718 462324 508272
13819 508272 472758 463556 404789 407305 387935 285889 245084 177184 121762 141556 195154 202963
13807 202963 127609 111508 79642 59013 44440 118413 96060 42309 5125 33703 88112
13796 88112 58703 44880 -51911 -164707 -275132 -345240 -371675 -327371 -313042 -298993 -310923
13785 -310923 -250530 -169041 -139994 -38323 100300 98519 124273 196690 199095 146167 123020
13774 123020 205894 242591 204705 168686 157104 141548 152990 155944 136636 131635 165900 197855
13762 197855 174703 122689 129287 123364 99676 8415 -106191 -219755 -236967 -170941 -67274
13751 -67274 -36730 9683 -21683 22920 141181 233651 298554 294403 328767 356798 349825 355686
$$ packed form
13831A32192l131j4425R338N665M7021M6260N3846L6597M9277L0078O9606M5948
13819E08272l5514r202n8767K516j9370j02046m0805o7900n5422J9794N3598P809
13807B02963p5354j6101l1866k0629j4573P3973k2353n3751l7184K8578N4409
13796H8112k9409j3823r6791j12796j10425p0108k6435M4304J4329J4049j1930
13785c10923O0393Q1489K9047J01671J38623j781K5754P2417K405n2928k3147
13774A23020Q2874L6697l7886l6019j1582j5556J1442K954j9308n001L4265L1955
13762A97855k3152n2014O598n923k3688r1261j14606j13564j7212O6026J03667
13751f7274L0544M6413l1366M4603J18261R2470O4903m151L4364K8031o973N861
$$ plain form
13739 355686 369593 413928 461086 460514 487824 448569 423271 390813 409548 468202 484693 475349
13727 475349 467778 541634 567518 541546 540074 520041 558262 597221 560420 577029 602068 655916
13715 655916 678670 696304 767407 878116 848374 828677 890813 970219 994636 1034221 1092107
13704 1092107 1199280 1261387 1359915 1479205 1550078 1572413 1623404 1719803 1840699 2041985
13694 2041985 2174783 2232889 2363293 2563745 2777063 2969656 3149239 3439050 3782093 4135774
13684 4135774 4494394 5018680 5734194 6573223 7519943 8648604 9818419 11063468 12559441
13675 12559441 14465662 16960496 20333259 24888959 31331851 40947416 55607579 77159912
13667 77159912 105538406 136506737 162648897 177440378 179854716 177645170 179273876
$$ packed form
13739C55686J3907M4335M7158n72K7310l9255k5298l2458J8735N8654J6491r344
13727D75349p571P3856K5884k5972j472k0033L8221L8959l6801J6609K5039N3848
13715F55916K2754J7634P1103J10709k9742j9697O2136P9406K4417L9585N7886
13704A092107J07173O2107R8528J19290P0873K2335N0991R6399J20896K01286
13694B041985J32798N8106J30404K00452K13318J92593J79583K89811L43043L53681
13684D135774L58620N24286P15514Q39029R46720J128661J169815J245049J495973
13675A2559441J906221K494834L372763M555700O442892R615565J4660163K1552333
13667G7159912K8378494L0968331K6142160J4791481K414338k209546J628706
$$ plain form
13660 179273876 183599389 182159519 167605812 140281115 109179380 83209287 64489804
13653 64489804 51504863 42473457 35970273 31176301 27642696 25040277 23150516 21820928
13645 21820928 20967158 20422288 20151374 20120945 20345972 20892456 22018372 23904310 26595046
13636 26595046 30481636 36233976 44804464 57783381 76966191 102279321 130255592
13629 130255592 154312118 168157696 170393926 167075743 166529481 168964307 167077599 153501161
13621 153501161 127948813 98384761 73261086 55148427 42631314 33857488 27614666
13614 27614666 22956490 19377854 16642789 14469937 12741958 11211111 9837946 8693654
13606 8693654 7617380 6649998 5814008 5183464 4713502 4301842 3891824 3545269 3245661
$$ packed form
13660A79273876M325513j439870j4553707k7324697l1101735k5970093j8719483
13653F4489804j2984941r031406o503184m793972l533605k602419j889761j329588
13645B1820928q53770n44870k70914l0429K25027N46484J125916J885938K690736
13636B6595046L886590N752340Q570488J2978917J9182810K5313130K7976271
13629A30255592K4056526J3845578K236230l318183n46262K434826j886708j3576438
13621A53501161k5552348k9564052k5123675j8112659j2517113q773826o242822
13614B7614666m658176l578636k735065k172852j727979j530847j373165j144292
13606H693654j076274r67382q35990o30544m69962m11660m10018l46555k99608
$$ plain form
13597 3245661 2940842 2682254 2469558 2321477 2132010 2006166 1844697 1767666 1685582 1592081
13587 1592081 1557135 1475645 1424172 1429544 1390382 1267033 1242425 1249886 1288303 1238889 1165457
13576 1165457 1102533 1042757 1013077 961590 875469 851773 845757 799941 706677 650418 624229
13565 624229 567364 533815 563923 563031 539866 577244 610561 609799 555462 493029 428328 487779
13553 487779 460496 400652 430276 454659 419461 390697 386617 407397 436303 523802 590418 610097
13541 610097 602896 666816 807458 861141 872598 847216 848457 871362 922435 941505 866509 810330
13529 810330 760519 704928 667493 585810 545967 497066 509437 534848 470283 418184 388192
13518 388192 368046 290360 255493 232867 258598 268189 342437 353472 293192 260143 290509 271136
$$ packed form
13597C245661l04819k58588k12696j48081j89467j25844j61469p7031q2084r3501
13587A592081l4946q1490n1473N372l9162j23349k4608P461L8417m9414p3432
13576A165457o2924n9776k9680n1487q6121k3696o016m5816r3264n6259k6189
13565F24229n6865l3549L0108q92k3165L7378L3317p62n4337o2433o4701N9451
13553D87779k7283n9844K9624K4383l5198k8764m080K0780K8906Q7499O6616J9679
13541F10097p201O3920J40642N3683J1457k5382J241K2905N1073J9070p4996n6179
13529H10330m9811n5591l7435q1683l9843m8901J2371K5411o4565n2099k9992
13518C88192k0146p7686l4867k2626K5731R591P4248J1035o0280l3049L0366j9373
$$ plain form
13506 271136 348385 406061 472571 542025 614027 710529 757499 755962 765210 835619 880216 835826
13494 835826 795488 678547 536584 481586 449368 418262 384589 338569 376316 394499 376414
13483 376414 323072 258082 258264 290866 270071 208709 159018 150468 168548 148938 148900 199893 246970
13470 246970 219364 167002 172082 106984 53796 30807 42111 86502 138440 162481 207753 216509
13458 216509 141347 112413 158792 212919 191364 140554 88400 90570 38979 88018 148006 220900
13446 220900 213444 188547 176257 174881 180940 170847 173043 167246 145132 101482 39728 -9750
13434 -9750 23721 -22026 -21522 35448 34470 52654 70943 48233 13023 43358 33190 124501 169489
13421 169489 197734 200614 213735 228972 244432 249743 254992 253298 268694 281358 240295 190125
$$ packed form
13506B71136P7249N7676O6510O9454P2002R6502M6970j537R248P0409M4597m4390
13494H35826m0338j16941j41963n4998l2218l1106l3673m6020L7747J8183j8085
13483C76414n3342o4990J82L2602k0795o1362m9691q550J8080j9610l8N0993M7077
13470B46970k7606n2362N080o5098n3188k2989J1304M4391N1938K4041M5272Q756
13458B16509p5162k8934M6379N4127k1555n0810n2154K170n1591M9039N9988P2894
13446B20900p456k4897j2290j376O059j0093K196n797k2114m3650o1754m9478
13434i750L3471m5747N04N6970r78J8184J8289k2710l5210L0335j0168R1311M4988
13421A69489K8245K880J3121J5237J5460N311N249j694J5396J2664m1063n0170
$$ plain form
13409 190125 197447 214574 198273 130062 113845 68400 72080 115389 135782 124518 143699 153754
13397 153754 166803 150941 90970 54544 149336 205695 179488 197519 185292 200706 246941
13386 246941 276077 296904 293186 267069 298702 272639 234475 139268 138313 195473 160424 138925
13374 138925 149308 138316 68598 73607 17991 68277 66703 11379 17434 59317 54956 64260
13362 64260 52662 45630 39818 -8649 -41826 35230 145532 180940 180369 138058 133235 174583
13350 174583 167418 194049 199391 200415 211888 221444 206804 182213 133781 154612 176033 122474
13338 122474 105857 73518 51645 82103 136368 147001 125611 53578 -10084 19266 85147
13327 85147 103237 42475 -14934 32587 95520 82622 58864 10518 -28177 -79895 -86263 -62010
$$ packed form
13409A90125P322J7127j6301o8211j6217m5445L680M3309K0393j1264J9181J0055
13397A53754J3049j5862n9971l6426R4792N6359k6207J8031j2227J5414M6235
13386B46941K9136K0827l718k6117L1633k6063l8164r5207r55N7160l5049k1499
13374A38925J0383j0992o9718N009n5616N0286j574n5324O055M1883m361R304
13362F4260j1598p032n812m8467l3177P7056J10302L5408n71m2311m823M1348
13350A74583p165K6631N342J024J1473R556j4640k4591m8432K0831K1421n3559
13338A22474j6617l2339k1873L0458N4265J0633k1390p2033o3662K9350O5881
13327H5147J8090o0762n7409M7521O2933j2898k3758m8346l8695n1718o368K4253
$$ plain form
13315 -62010 -31665 12539 2862 -5913 -16575 -69980 -56836 -1170 32293 31064 7291 183
13303 183 27622 62408 112626 112953 64229 -609 57251 43574 31835 -18481 -16996 26696 16490
13290 16490 7945 46361 -6857 -14674 -11615 -46548 -35476 2210 -8077 8191 35394 60264
13278 60264 50299 2780 -16462 -3626 47040 6614 -4019 16405 27700 13521 13311 31301
13266 31301 50149 22739 -18216 39735 90488 156999 160112 89059 57268 41604 21039 27133
13254 27133 -39923 -67299 -63096 -57114 -32800 1803 25171 1005 -48823 -63575 -100595 -118249
13242 -118249 -14467 61862 33435 -1199 -19358 -8736 4081 25108 -22124 25459 60316
13231 60316 50253 95195 82521 42884 80678 173758 223281 201676 246450 277858 353056 496581
$$ packed form
13315f2010L0345M4204r677q775j0662n3405J3144N5666L3463j229k3773p108
13303A83K7439L4786N0218L27m8724o4838N7860j3677j1739n0316J485M3692j0206
13290A6490q545L8416n3218p817L059l4933J1072L7686j0287J6268K7203K4870
13278F0264r965m7519j9242J2836N0666m0426j0633K0424J1295j4179k10J7990
13266C1301J8848k7410m0955N7951N0753O6511L113p1053l1791j5664k0565O094
13254B7133o7056k7376M203N982K4314L4603K3368k4166m9828j4752l7020j7654
13242a18249J03782P6329k8427l4634j8159J0622J2817K1027m7232M7583L4857
13231F0316j0063M4942j2674l9637L7794R3080M9523k1605M4774L1408P5198J43525
$$ plain form
13219 496581 667442 750183 808324 822319 861550 918720 947581 959127 841863 722403 716798
13208 716798 556240 408236 318734 212188 160292 148155 139715 139111 115016 114897 92550 67950
13196 67950 105795 167767 156169 134443 160018 197285 247913 266276 321555 375784 385004 443930
13184 443930 496452 589961 735160 871198 899749 909526 914110 903744 891806 869186 859858 822243
13172 822243 678494 462459 311421 265614 171271 90206 63641 15862 38996 82115 69800
13161 69800 40442 25417 -11724 -46302 -7230 -10340 -21445 -66841 -78484 -27429 1887 -26831
13149 -26831 -36393 -6529 -62375 -42111 -44292 -70991 -36710 248 22828 30558 -31193 61518
13137 61518 108213 79418 100948 118895 92335 55570 4064 6100 61459 16357 -16312 -58403
$$ packed form
13219D96581J70861Q2741N8141J3995L9231N7170K8861J1546j17264j19460n605
13208G16798j60558j48004q9502j06546n1896j2137q440o04k4095j19k2347k4600
13196F7950L7845O1972j1598k1726K5575L7267N0628J8363N5279N4229R220N8926
13184D43930N2522R3509J45199J36038K8551R777M584j0366j1938k2620r328l7615
13172H22243j43749k16035j51038m5807r4343q1065k6565m7779K3134M3119j2315
13161F9800k9358j5025l7141l4578L9072l110j1105m5396j1643N1055K9316k8718
13149b6831r562K9864n5846K0264k181k6699L4281L6958K2580P730o1751R2711
13137F1518M6695k8795K1530J7947k6560l6765n1506K036N5359m5102l2669m2091
$$ plain form
13125 -58403 -89851 -101707 -106778 -142695 -138656 -62429 -51212 -68826 -62860 -24409 58550 55601
13113 55601 7919 -38130 -61201 -89152 -103713 -71878 10247 33315 31183 1836 -37041 6718
13101 6718 7739 -26457 -67067 -26021 -70098 -100638 -100253 -63252 -116130 -167669 -113734 -79797
13089 -79797 -37018 -20294 -23504 32202 44161 -380 50631 22960 -1195 6684 16908 53586
13077 53586 62625 84274 122925 140334 70153 -15828 -32033 -52819 -29083 37660 33001 46138
13065 46138 50081 26378 7947 25887 15674 3977 -22603 21418 24300 9014 20369 76912
13053 76912 73138 11085 14700 512 694 -53007 -41818 5623 48167 56801 49887 1025 -15802
13040 -15802 789 29795 33199 -19087 -80476 -51957 -49927 -84011 -88000 -55100 -76749 -47589
$$ packed form
13125e8403l1448j1856n071l5917M039P6227J1217j7614N966L8451Q2959k949
13113E5601m7682m6049k3071k7951j4561L1835Q2125K3068k132k9347l8877M3759
13101F718J021l4196m0610M1046m4077l0540L85L7001n2878n1539N3935L3937
13089g9797M2779J6724l210N5706J1959m4541N1011k7671k4155P879J0224L6678
13077E3586R039K1649L8651J7409p0181q5981j6205k0786K3736O6743m659J3137
13065D6138L943k3703j8431J7940j0213j1697k6580M4021K882j5286J1355N6543
13053G6912l774o2053L615j4188J82n3701J1189M7441M2544Q634o914m8862j6827
13040a5802J6591K9006L404n2286o1389K8519K030l4084l989L2900k1649K9160
$$ plain form
13028 -47589 -22519 -12228 -78428 -57421 -37657 -82379 -121450 -67632 -43323 -11994 -10394 -54499
13016 -54499 -50635 -31834 -49780 3124 64101 -18180 -67772 -59512 -826 -5718 -41741 -1080
13004 -1080 66973 66025 44645 18485 -27675 11213 21456 7211 7977 -13447 -13984 40624 47242
12991 47242 49802 63641 45441 -12254 -54446 -72246 -44107 -12881 33526 1294 -48822 14413
12979 14413 -2827 -4179 11431 25709 17766 1884 -7172 -72102 -45462 11850 40150 7601
12967 7601 -21015 1806 -27071 -67915 -47162 -24690 10184 -17648 45993 70580 -10274 -107303
12955 -107303 -93606 -43992 -74175 -77238 -43563 -9089 -10622 -43303 -50316 -27135 -1587 14488
12943 14488 -6648 6527 38087 69161 42451 37435 -13357 -71475 -37304 -26272 -76595 -143139
$$ packed form
13028d7589K5070J0291o6200K1007J9764m4722l9071N3818K4309L1329J600m4105
13016e4499L864J8801j7946N2904O0977q2281m9592Q260N8686m892l6023M0661
13004a080O8053r48k1380k6160m6160L8888J0243j4245P66k1424n37N4608O618
12991D7242K560J3839j8200n7695m2192j7800K8139L1226M6407l2232n0116O3235
12979A4413j7240j352J5610J4278p943j5882r056o4930K6640N7312K8300l2549
12967G601k8616K2821k8877m0844K0753K2472L4874k7832O3641K4587q0854r7029
12955a07303J3697M9614l0183l063L3675L4474j533l2681p013K3181K5548J6075
12943A4488k1136J3175L1560L1074k6710n016n0792n8118L4171J1032n0323o6544
$$ plain form
12931 -143139 -94748 -96 9500 -14912 29630 52243 34528 55985 79913 24448 54471 5299
12919 5299 -32169 -2434 -7291 27560 26517 2874 4635 1388 30999 96169 73282 20883 -77741
12906 -77741 -123043 -87557 3411 63059 32430 -57686 -152250 -138153 -106672 -40563 -14800 -20435
12894 -20435 -32229 29295 47421 23863 33060 25522 -11487 22657 18546 71389 85771 5562
12882 5562 -55225 -47357 33517 121659 162564 144151 91203 29599 -14564 -22254 -56035 -55226 36816
12869 36816 61241 28956 21058 48197 2901 -5899 9833 -67388 -77072 -147483 -164995 -102759
12857 -102759 -57468 -60043 -96400 -128202 -133328 -84711 -79804 -92366 -63079 -48113 -94438 -104692
12845 -104692 -61539 -28663 -39596 -10529 -10130 -92731 -141878 -134926 -102858 -89548 -111326 -119409
$$ packed form
12931a43139M8391R4652R596k4412M4542K2613j7715K1457K3928n5465L0023m9172
12919E299l7468K9735m857L4851j043k3643J761l247K9611O5170k2887n2399r8624
12906g7741m5302L5486R0968N9648l0629r0116r4564J4097L1481O6109K5763n635
12894b0435j1794O1524J8126k3558R197p538l7009L4144m111N2843J4382q0209
12882E562o0787P868Q0874Q8142M0905j8413n2948o1604m4163p690l3781Q09R2042
12869C6816K4425l2285p898K7139m5296q800J5732p7221r684p0411j7512O2236
12857a02759M5291k575l6357l1802n126M8617M907j2562K9287J4966m6325j0254
12845a04692M3153L2876j0933K9067L99q2601m9147O952L2068J3310k1778q083
$$ plain form
12833 -119409 -41389 19651 9963 -43367 -31998 -111958 -89372 -83945 -113755 -106101 -52129 -17507
12821 -17507 -14645 -33469 -32697 -24832 -65471 -59211 32103 65162 48739 56330 80830 75561 100809
12808 100809 126992 66283 27080 1883 -59335 -62681 -33676 12490 37214 -17701 -18135 10491
12796 10491 -80047 -120821 -73040 -57955 -14685 -1316 8215 41162 18648 -17907 -64837 -65877
12784 -65877 -39905 -29821 -29961 -35665 -19017 -21358 -31386 -2686 -1310 -25288 34837 18892 32503
12771 32503 43410 35244 50590 18633 32958 54627 25048 -39862 -17092 -16935 -9744 -17281 -17199
12758 -17199 -59548 -75498 -38247 41236 68755 25002 -38001 -56587 -55798 -73022 -47333 2249
12746 2249 23689 71687 80222 106901 69535 30363 -1370 8001 -8946 -17420 29773 21360 30107
$$ packed form
12833a19409P8020O1040r688n3330J1369p9960K2586N427k9810P654N3972L4622
12821a7507K862j8824P72P865m0639O260R1314L3059j6423P591K4500n269K5248
12808A00809K6183o0709l9203k5197o1218l346K9005M6166K4724n4915m34K8626
12796A0491r0538m0774M7781J5085M3270J3369R531L2947k2514l6555m6930j040
12784f5877K5972J0084j40n704J6648k341j0028K8700J376k3978O0125j5945J3611
12771C2503J0907q166J5346l1957J4325K1669k9579o4910K2770J57P191p537Q2
12758a7199m2349j5950L7251P9483K7519m3753o3003j8586P89j7224K5689M9582
12746B249K1440M7998Q535K6679l7366l9172l1733R371j6947q474M7193q413Q747
$$ plain form
12733 30107 48798 42374 47075 19788 -9045 -9997 -22627 10013 35724 31804 27902 -26673 -36971
12720 -36971 11014 36943 -44334 -57076 2736 11783 -44535 -96516 -106759 -96015 -81507 -28545
12708 -28545 39513 53122 -8161 -7806 -15740 12700 10795 -68003 -76151 -36653 -50968 -78715 -97445
12695 -97445 -106856 -42832 -42017 -64624 -42080 -12504 -2509 22183 49860 41467 -18865 -42439 -45924
12682 -45924 -19330 -34057 -51375 -10528 -11370 -7484 8942 19290 -13215 -29388 21411 18705
12670 18705 -9600 12331 54230 40281 55180 71876 38707 15499 13439 25074 63423 97200
12658 97200 110078 66742 107025 68428 -3948 27336 61003 107325 73478 10517 -41985 -22419
12646 -22419 -2422 9569 39342 22516 -8766 16656 -28959 -40367 -28969 41104 61099 31689
$$ packed form
12733C0107J8691o424M701k7287k8833r52j2630L2640K5711l920l902n4575j0298
12720c6971M7985K5929q1277j2742N9812R047n6318n1981j0243J0744J4508N2962
12708b8545O8058J3609o1283L55p934K8440j905p8798q148L9498j4315k7747j8730
12695i7445r411O4024Q15k2607K2544K9576R995K4692K7677q393o0332k3574l485
12682d5924K6594j4727j7318M0847q42L886J6426J0348l2505j6173N0799k706
12670A8705k8305K1931M1899j3949J4899J6696l3169k3208k060J1635L8349L3777
12658I7200J2878m3336M0283l8597p2376L1284L3667M6322l3847o2961n2502J9566
12646b2419J9997J1991K9773j6826l1282K5422m5615j1408J1398P0073J9995k9410
$$ plain form
12634 31689 14455 13049 25747 1378 3548 52402 27715 6771 20344 -47978 -100931 -28472
12622 -28472 41280 18685 -41787 -48723 -42358 -67129 -29302 -21306 -23631 29757 98704 130742
12610 130742 120842 103619 88072 87429 114816 95387 46214 -801 20062 28835 7412 -21433
12598 -21433 -26897 71614 66685 63183 82670 100432 31388 -43378 -38816 26430 96339 146131
12586 146131 72626 18731 1732 56098 82484 100954 91476 89866 87598 52531 36478 12537
12574 12537 -38487 -83843 -119079 -28871 23446 28282 -54899 -74755 -34786 -3002 -46364 -75838
12562 -75838 -40212 -70768 -32464 -4610 76594 111199 49504 -20873 14567 75016 66934 27018
12550 27018 9289 -29926 -55018 -12316 16980 -41924 -64842 -86544 -88425 -59879 -21096 16308
$$ packed form
12634C1689j7234j406J2698k4369K170M8854k4687k0944J3573o8322n2953P2459
12622b8472O9752k2595o0472o936O365k4771L7827P996k325N3388O8947L2038
12610A30742r900j7223j5547o43K7387j9429m9173m7015K0863Q773k1423k8845
12598b1433n464R8511m929l502J9487J7762o9044p4766M562O5246O9909M9792
12586A46131p3505n3895j6999N4366K6386J8470r478j610k268l5067j6053k3941
12574A2537n1024m5356l5236R0208N2317M836q3181j9856L9969L1784m3362k9474
12562g5838L5626l0556L8304K7854Q1204L4605o1695p0377L5440O0449q082l9916
12550B7018j7729l9215k5092M2702K9296n8904k2918k1702j881K8546L8783L7404
$$ plain form
12538 16308 78777 75853 47951 33212 13842 35853 61618 20374 31418 27379 -2216 -21042
12526 -21042 -42826 -12638 -32825 -15067 -3934 -36415 6313 -1659 26506 1491 -73458 -102626
12514 -102626 -16140 55299 26857 41566 66825 70086 27683 -19364 -11928 27520 -27063 -60469
12502 -60469 -18421 -1486 -246 -6876 -24527 -15213 44569 54779 -606 -8261 61053 104571
12490 104571 100176 -7536 -51803 16810 94869 94555 65429 40336 -4496 -38779 -29122 36247
12478 36247 63329 71614 109538 89354 91092 92761 63128 -29920 -79213 -12732 13532 40886
12466 40886 90248 109739 42819 -3741 12267 18975 17061 35123 50443 4608 -19730 -28640
12454 -28640 858 59510 47961 20606 -22968 -27924 -83753 -130039 -3722 87734 57502 36032
$$ packed form
12538A6308O2469k924k7902j4739j9370K2011K5765m1244J1044m039k9595j8826
12526b1042k1784L0188k0187J7758J1133l2481M2728p972K8165k5015p4949k9168
12514a02626Q6486P1439k8442J4709K5259L261m2403m7047P436L9448n4583l3406
12502f0469M2048J6935J240o630j7651R314N9782J0210n5385p655O9314M3518
12490A04571m395j07712m4267O8613P8059l14k9126k5093m4832l4283R657O5369
12478C6247K7082Q285L7924k0184J738J669k9633r3048m9293O6481K6264K7354
12466D0886M9362J9491o6920m6560J6008O708j914J8062J5320m5835k4338q910
12454b8640K9498N8652j1549k7355m3574m956n5829m6286J26317R1456l0232k1470
$$ plain form
12442 36032 23087 17604 -526 11627 4564 19943 1814 16169 14098 -15012 -53779 -39417
12430 -39417 -68173 -9566 4770 15148 -2302 19648 9945 -12669 17953 29786 -69164 -80006
12418 -80006 -69188 -84459 -54332 -5453 94335 103807 101967 74580 22923 -32839 -39178 4739
12406 4739 31827 27536 -10834 -15743 -35942 -37918 -54009 -56141 -25943 -29000 14884 41998 9072
12393 9072 -43165 -24679 19250 -16249 -31553 8080 27476 55583 77345 80282 68895 -22038
12381 -22038 -76527 -40756 -26188 -40887 -68395 -39772 -22209 -85988 -43353 -14383 -7867 -17567
12369 -17567 -32215 -35938 30448 106855 83405 25228 14141 24716 1610 31617 -17025 -46734
12357 -46734 -17200 -42246 -39003 -22498 -21698 -106 35022 52223 28595 12573 -13194 42698
$$ packed form
12442C6032j2945n483j8130J2153p063J5379j8129J4355k071k9110l8767J4362
12430c9417k8756N8607J4336J0378j7450K1950r703k2614L0622J1833r8950j0842
12418h0006J0818j5271L0127M8879R9788R472j840k7387n1657n5762o339M3917
12406D739K7088m291l8370m909k0199j976j6091k132L0198l057M3884K7114l2926
12393I072n2237J8486M3929l5499j5304L9633J9396K8107K1762K937j1387r0933
12381b2038n4489L5771J4568j4699k7508K8623J7563o3779M2635K8970O516r700
12369a7567j4648l723O6386P6407k3450n8177j1087J0575k3106L0007m8642k9709
12357d6734K9534k5046L243J6505Q00K1592L5128J7201k3628j6022k5767N5892
$$ plain form
12345 42698 63528 68696 41377 10800 31497 17032 20904 12105 30821 30136 71529 85831 73805
12332 73805 107210 100418 49555 6729 -11688 -10413 -25899 -13157 -40393 -37820 -29395 -61492
12320 -61492 -69616 -44171 -44995 -57606 -4957 64898 75223 48485 20559 47550 73509 31232
12308 31232 48124 136328 149166 68032 49593 13103 10097 49911 100044 117945 80714 13348
12296 13348 -4714 24 -40309 -25772 -4071 -24023 -8991 1522 35053 27540 7236 23487
12284 23487 -10545 -74936 -109477 -58712 -6988 -9019 -29110 -41868 -63412 -57029 -78142 -123211
12272 -123211 -84646 -57860 -43227 -33191 -25240 -3796 38304 35265 16846 73581 56778 -11135
12260 -11135 -54356 -74914 -11159 -13570 -12135 -47058 -75878 1389 32872 15626 14393 2143
$$ packed form
12345D2698K0830N168k7319l0577K0697j4465L872q799J8716o85M1393J4302j2026
12332G3805L3405o792n0863m2826j8417J275j5486J2742k7236K573Q425l2097
12320f1492q124K5445q24j2611N2649O9855J0325k6738k7926K6991K5959m2277
12308C1232J6892Q8204J2838q1134j8439l6490l006L9814N0133J7901l7231o7366
12296A3348j8062M738m0333J4537K1701j9952J5032J0513L3531p513k0304J6251
12284B3487l4032o4391l4541N0765N1724k031k0091j2758k1544O383k1113m5069
12272a23211L8565K6786J4633J0036P951K1444M2100l039j8419N6735j6803o7913
12260a1135m3221k0558O3755k411J435l4923k8820P7267L1483j7246j233j2250
$$ plain form
12248 2143 -24680 38565 121588 108953 152462 153300 149340 132058 131160 121685 111550 88903 45069
12235 45069 5743 -2194 10891 35857 70048 53034 97617 171582 126306 46347 40758 45574
12223 45574 79535 95100 86904 50865 71092 6500 61668 54852 -32919 -37675 -8878 31949
12211 31949 49617 69822 83848 90686 181389 218464 226413 217853 150041 90687 31610 27827
12199 27827 95355 199092 290555 307554 293732 291279 384013 443929 408168 381953 292046 181231
12187 181231 116567 99888 155923 190781 134783 149817 163618 197533 180147 134345 122713
12176 122713 120171 101034 85644 109231 84890 91864 172601 169880 100662 82181 96610 91511
12164 91511 63862 58317 32459 45165 58939 26295 5160 50561 61109 5400 -28144 -56151
$$ packed form
12248B143k6823O3245Q3023j2635M3509Q38l960j7282q98r475j0135k2647m3834
12235D5069l9326p937J3085K4966L4191j7014M4583P3965m5276p9959n589M816
12223D5574L3961J5565q196l6039K0227o4592N5168o816q7771m756K8797M0827
12211C1949J7668K0205J4026O838R0703L7075P949q560o7812n9354n9077l783
12199B7827O7528J03737R1463J6999j3822k453R2734N9916l5761k6215q9907j10815
12187A81231o4664j6679N6035L4858n5998J5034J3801L3915j7386m5802j1632
12176A22713k542j9137j5390K3587k4341O974Q0737k721o9218j8481J4429n099
12164I1511k7649n545k5858J2706J3774l2644k1135M5401J0548n5709l3544k8007
$$ plain form
12152 -56151 -71443 -23230 10372 48637 34087 28968 54217 83065 100765 147303 124007 144153
12140 144153 164223 143180 175208 193586 177507 146377 103398 138247 138563 152512 114457 64250
12128 64250 41086 56432 70410 36892 33420 63296 38931 13142 20617 73309 46876 48472
12116 48472 7585 18714 103309 73161 49201 19807 94120 113454 169647 199815 162181 128569
12104 128569 140425 118090 118376 149922 235458 282980 285018 293622 292147 257879 179712 75596
12092 75596 96175 123176 157404 180283 172029 251274 192160 159704 152853 136133 150417 162979
12080 162979 118199 83756 59763 49686 127973 121639 62079 -25959 -85602 -173658 -314117
12069 -314117 -456971 -627154 -812103 -869964 -813018 -662063 -459048 -241767 -127015 -41337
$$ packed form
12152e6151j5292M8213L3602L8265j4550n119K5249K8848J7700M6538k3296K0146
12140A44153K0070k1043L2028J8378j6079l1130m2979L4849L16J3949l8055n0207
12128F4250k3164J5346J3978l3518l472K9876k4365k5789P475N2692k6433J596
12116D8472m0887J1129Q4595l0148k3960k9394P4313J9334N6193L0168l7634l3612
12104A28569J1856k2335K86L1546Q5536M7522K038Q604j475l4268p8167j04116
12092G5596K0579K7001L4228K2879q254P9245n9114l2456o851j6720J4284J2562
12080A62979m4780l4443k3993j0077P8287o334n9560q8038n9643q8056j40459
12069c14117j42854j70183j84949n7861N6946J50955K03015K17281J14752Q5678
$$ plain form
12059 -41337 17990 104907 146451 207804 216265 152920 182142 195271 217086 236306 214095 191748
12047 191748 155928 203475 207735 246692 245861 269198 302174 305284 376590 351495 310734 291125
12035 291125 310853 397850 419935 437747 426505 378445 354375 370938 383097 403465 382458
12024 382458 422155 451951 461901 522118 573953 498215 520547 561306 565354 611078 686947 748842
12012 748842 739001 778450 795141 786428 811678 840629 874425 866789 854134 878971 916342 924540
12000 924540 939006 963546 989545 1023149 1050186 1127646 1077732 1017833 1056708 1140139 1238201
11989 1238201 1294209 1346551 1398351 1433006 1486841 1574920 1729415 1814360 1911264 2049588 2195449
11978 2195449 2362520 2488095 2645810 2863916 3014961 3182690 3343480 3517106 3748840
$$ packed form
12059d1337N9327Q6917M1544O1353Q461o3345K9222J3129K1815J9220k2211k2347
12047A91748l5820M7547M260L8957q31K3337L2976L110P1306k5095m0761j9609
12035B91125J9728Q6997K2085J7812j1242m8060k4070J6563J2159K0368k1007
12024C82458L9697K9796R950O0217N1835p5738K2332M0759M048M5724P5869O1895
12012G48842r841L9449J6691q713K5250K8951L3796p636j2655K4837L7371Q198
12000I24540J4466K4540K5999L3604K7037P7460m9914n9899L8875Q3431R8062
11989A238201N6008N2342N1800L4655N3835Q8079J54495Q4945R6904J38324J45861
11978B195449J67071J25575J57715K18106J51045J67729J60790J73626K31734
$$ plain form
11969 3748840 4013343 4275674 4570477 5008147 5467236 5960324 6498443 7086447 7644473
11960 7644473 8362068 9251273 10215790 11378542 12788145 14519051 16634170 19208180 22471512
11951 22471512 26570301 31870437 38898093 48621393 62336741 82279543 111797005 155098367
11943 155098367 214788520 286476127 354993508 398424336 396914050 347033133 271804554
11936 271804554 202151792 150116740 113518815 87786983 69397492 55868832 45716757
11929 45716757 37975162 31992926 27261878 23525136 20429789 17844017 15705834 13876768
11921 13876768 12319816 11068160 9986770 8975714 8107116 7451417 6808660 6239170 5733455
11912 5733455 5279062 4817322 4466446 4133745 3894408 3719739 3471903 3320406 3175150
$$ packed form
11969C748840K64503K62331K94803M37670M59089M93088N38119N88004N58026
11960G644473P17595Q89205R64517J162752J409603J730906K115119K574010L263332
11951B2471512M098789N300136P027656R723300J3715348J9942802K9517462M3301362
11943A55098367N9690153P1687607O8517381M3430828j510286m9880917p5228579
11936B71804554o9652762n2035052l6597925k5731832j8389491j3528660j0152075
11929D5716757p741595n982236m731048l736742l095347k585772k138183j829066
11921A3876768j556952j251656j081390j011056q68598o55699o42757n69490n05715
11912E733455m54393m61740l50876l32701k39337j74669k47836j51497j45256
$$ plain form
11903 3175150 3030749 2860467 2759538 2609235 2535382 2468285 2335197 2256962 2213187 2099574
11893 2099574 1958131 1904726 1828112 1759294 1697633 1619115 1505540 1417463 1359198 1328207 1279064
11882 1279064 1255490 1157126 1085029 1022634 1007952 1037961 947681 874567 833191 789403 761833
11871 761833 712454 719030 688898 665864 613416 563388 577606 645469 582966 556515 555241 544213
11859 544213 588894 610329 607598 576393 526103 480331 449660 457119 432319 454039 494151 520951
11847 520951 511804 457905 448275 436609 391777 369926 429262 400104 399575 383628 350755 344851
11835 344851 315272 254330 225224 277818 322528 320650 283007 230359 184086 154436 136842 190986
11823 190986 178925 170239 217168 296343 402628 485931 649793 881865 1205992 1454810 1571810
$$ packed form
11903C175150j44401j70282j00929j50303p3853o7097j33088p8235m3775j13613
11893B099574j41443n3405p6614o8818o1661p8518j13575q8077n8265l0991m9143
11882A279064k3574r8364p2097o2395j4682L0009r0280p3114m1376m3788k7570
11871G61833m9379O576l0132k3034n2448n0028J4218O7863o2503k6451j274j1028
11859E44213M4681K1435k731l1205n0290m5772l0671P459k4800K1720M0112K6800
11847E20951r147n3899r630j1666m4832k1851N9336k9158n29j5947l2873n904
11835C44851k9579o0942k9106N2594M4710j878l7643n2648m6273k9650j7594N4144
11823A90986j2061q686M6929P9175J06285Q3303J63862K32072L24127K48818J17000
$$ plain form
11812 1571810 1585942 1497554 1309133 1130756 974142 866505 796976 760607 720353 637642
11802 637642 546211 457823 376212 324706 378748 331802 267409 249269 231285 252742 267592
11791 267592 213234 209528 244291 221256 196980 265968 220220 122758 100167 140960 166744 156644
11779 156644 191897 219812 205341 199422 180048 125990 131329 137284 99448 157201 192719 191291
11767 191291 189288 175915 192974 191212 169421 197103 217249 203862 192535 181448 219877 195120
11755 195120 196963 166810 166251 163852 130264 75096 95115 98273 123061 108224 117839 58157 35071
11742 35071 35926 70718 109336 124066 141074 83427 90938 113620 102650 43923 8213 -11490
11730 -11490 60277 155847 156379 59954 -93161 -61145 6252 15698 16733 42414 56024 18605
$$ packed form
11812A571810J4132q8388j88421j78377j56614j07637o9529l6369m0254q2711
11802F37642r1431q8388q1611n1506N4042m6946o4393j8140j7984K1457J4850
11791B67592n4358l706L4763k3035k4276O8988m5748r7462k2591M0793K5784j0100
11779A56644L5253K7915j4471n919j9374n4058N339N955l7836N7753L5518j428
11767A91291k003j3373J7059j762k1791K7682K0146j3387j1327j1087L8429k4757
11755A95120J843l0153n59k399l3588n5168K0019L158K4788j4837R615n9682k3086
11742C5071Q55L4792L8618J4730J7008n7647P511K2682j0970n8727l5710j9703
11730a1490P1767R5570N32r6425j53115L2016O7397R446J035K5681J3610l7419
$$ plain form
11718 18605 -6931 20169 99624 62703 33797 37806 44413 71444 40961 31146 107773 90259
11706 90259 53770 40219 62455 71952 47362 51294 35352 -40656 -2726 9583 52006 136234
11694 136234 108578 59882 62585 118658 140453 138148 155813 124890 71107 4600 -60257 -57472
11682 -57472 -52686 -12768 14982 35309 22266 -17924 -9610 21626 19157 61541 122751 172035
11670 172035 160583 141299 94946 86248 99483 110699 106025 90929 784 -59820 13242 15368
11658 15368 -89652 -54507 15022 605 -61685 -31070 -14066 -8312 63141 85229 -11401 -69161
11646 -69161 -100597 -110131 -75944 -46216 -86598 -9210 36578 15569 34813 15527 -6326 -50371
11634 -50371 -78829 -122726 -137266 -74560 -4055 35328 24730 32446 12342 53159 43493 29972
$$ packed form
11718A8605k5536K7100P9455l6921k8906M009O607K7031l0483r815P6627j7514
11706I0259l6489j3551K2236R497k4590L932j5942p6008L7930J2309M2423Q4228
11694A36234k7656m8696K703N6073K1795k305J7665l0923n3783o6507o4857K785
11682e7472M786L9918K7750K0327j3043m0190Q314L1236k469M2384O1210M9284
11670A72035j1452j9284m6353q698J3235J1216m674j5096r0145o0604P3062K126
11658A5368j05020L5145O9529j4417o2290L0615J7004N754P1453K2088r6630n7760
11646f9161l1436r534L4187K9728m0382P7388M5788k1009J9244j9286k1853m4045
11634e0371k8458m3897j4540O2706P0505L9383j0598P716k0104M0817r666j3521
$$ plain form
11622 29972 -29936 -37194 -47397 -82666 -50618 14711 34653 33369 35443 5696 -33363 -63322
11610 -63322 -85185 -22970 101948 123966 97278 46693 17490 82292 69655 42930 13851
11599 13851 6708 3460 24283 67802 48100 -21650 -35141 -85710 -85916 -147791 -151180 -91860 -36360
11586 -36360 -46171 -71217 -111471 -33581 -11656 -3385 -6070 552 -15799 -49076 -12922 -37623
11574 -37623 -22290 -21574 -42789 -1418 14598 -4331 -65623 -77924 -93867 -132715 -87744 -44331
11562 -44331 -41478 -5128 46384 142939 161112 47823 -14260 -11112 30249 56900 32006 59701
11550 59701 25787 -17418 -10688 9730 -5525 33638 49018 43886 -34235 -37383 -20075 -34352
11538 -34352 -20338 -29695 -88786 -34887 -2542 7606 -50949 -63909 -66418 -78724 -54746 -28887
$$ packed form
11622B9972n9908p258j0203l5269L2048O5329J9942j284K074k9747l9059k9959
11610f3322k1863O2215J24918K2018k6688n0585k9203O4802j2637k6725k9079
11599A3851p143l248K0823M3519j9702o9750j3491n0569k06o1875l389N9320N5500
11586c6360r811k5046m0254P7890K1925Q271k685O622j6351l3277L6154k4701
11574c7623J5333P16k1215M1371J6016j8929o1292j2301j5943l8848M4971M3413
11562d4331K853L6350N1512R6555J8173j13289o2083L148M1361K6651k4894K7695
11550E9701l3914m3205O730K0418j5255L9163J5380n132p8121l148J7308j4277
11538c4352J4014r357n9091N3899L2345J0148n8555j2960k509j2306K3978K5859
$$ plain form
11526 -28887 32521 -6109 -80013 -99363 -95199 -63329 -48472 -74911 -46085 -39420 15078 93365
11514 93365 114425 79541 51289 30867 -13193 -5938 45094 5210 -32611 1943 14764 -32572
11502 -32572 -40812 -1564 13432 29441 47756 44580 31861 92472 81842 3957 -43046 22278
11490 22278 35036 509 -102257 -72642 -9012 -4229 -27771 -54678 -286 35292 -39053 -98310
11478 -98310 -134802 -82011 -20039 -13340 19076 39386 -24226 -4340 -30516 -47531 31872 58402
11466 58402 32862 -3671 -1635 -12300 27128 30455 54662 77126 76306 5969 -9831 -11886 12421
11453 12421 67133 101248 48811 16195 -10191 68598 94858 35544 -1493 31083 7738 2145
11441 2145 20383 9783 -26023 6801 -5725 -48763 -100730 -61071 -26666 -5251 -7633 -31108
$$ packed form
11526b8887O1408l8630p3904j9350M164L1870J4857k6439K8826O665N4498P8287
11514I3365K1060l4884k8252k0422m4060P255N1032l9884l7821L4554J2821m7336
11502c2572q240L9248J4996J6009J8315l176j2719O0611j0630p7885m7003O5324
11490B2278J2758l4527j02766K9615O3630M783k3542k6907N4392L5578p4345n9257
11478i8310l6492N2791O1972O699L2416K0310o3612J9886k6176j7015P9403K6530
11466E8402k5540l6533K036j0665L9428L327K4207K2464q20p0337j5800k055K4307
11453A2421N4712L4115n2437l2616k6386P8789K6260n9314l7037L2576k3345n593
11441B145J8238j0600l5806L2824j2526m3038n1967L9659L4405K1415k382k3475
$$ plain form
11429 -31108 -19299 -18436 -55516 -32230 -3491 35818 -25148 -106790 -75332 -39663 13988 46614
11417 46614 10243 -39009 -82326 -7816 91600 97046 103805 101138 36297 -31853 -17885 -28755
11405 -28755 -28835 -26469 5721 -18000 -67721 -66264 -59231 -71831 -134436 -92160 -15900 -7318 -36041
11392 -36041 -3927 -51659 -40097 22932 21484 -8623 5897 -3491 -47042 -7264 14101 55018
11380 55018 60464 36453 -12109 2437 -2974 2704 -3307 -61249 -84920 -108861 -75395 -62811
11368 -62811 -76573 -13877 13289 -12987 27909 1441 -6177 -75756 -119495 -117478 -74246 -44139
11356 -44139 22037 54509 96583 71478 37890 11872 -22962 23165 22617 -40559 -61875 -8847
11344 -8847 43361 49393 22022 -18068 -37620 -28632 -6230 -68508 -172426 -171921 -64698 16462
$$ packed form
11429c1108J1809Q63l7080K3286K8739L9309o0966q1642L1458L5669N3651L2626
11417D6614l6371m9252m3317P4510R9416N446O759k667o4841o8150J3968j0870
11405b8755q0K366L2190k3721m9721J457P033j2600o2605M2276P6260Q582k8723
11392c6041L2114m7732J1562O3029j448l0107J4520r388m3551L9778K1365M0917
11380E5018N446k4011m8562J4546n411N678o011n7942k3671k3941L3466J2584
11368f2811j3762O2696K7166k6276M0896k6468p618o9579m3739K017M3232L0107
11356d4139O6176L2472M2074k5105l3588k6018l4834M6127n48o3176k1316N3028
11344h847N2208O032k7371m0090j9552Q988K2402o2278j03918N05J07223Q1160
$$ plain form
11332 16462 2675 11391 -7107 -13422 -7995 -23213 -6431 17364 -21040 -26841 -312 34664
11320 34664 37767 17069 7056 4030 -34039 -43215 -28701 -23180 12854 -2019 -28147 -51685
11308 -51685 7853 -8273 20702 69082 33053 -25534 -37168 -54531 -41951 -50888 -1051 8654
11296 8654 -4028 15133 -18492 -73065 -46586 -9999 -53183 -30893 7583 83239 103439 4601
11284 4601 -16959 58461 -3498 -37110 18257 7532 19293 -18665 -26148 21609 -21485 7029
11272 7029 37647 6702 -64421 -16511 21768 50451 53996 16448 -3895 -26592 -47675 17985
11260 17985 24840 17581 70028 119189 122748 56644 8177 -5681 35151 43552 -4814 -2113 13576
11247 13576 -4822 -24479 -52715 -43700 9044 47188 26501 -6053 -27157 3639 31587 37195
$$ packed form
11332A6462j3787Q716j8498o315N427j5218J6782K3795l8404n801K6529L4976
11320C4664L103k0698j0013l026l8069r176J4514N521L6034j4873k6128k3538
11308e1685N9538j6126K8975M8380l6029n8587j1634j7363J2580q937M9837R705
11296H654j2682J9161l3625n4573K6479L6587m3184K2290L8476P5656K0200r8838
11284D601k1560P5420o1959l3612N5367j0725J1761l7958p483M7757m3094K8514
11272G029L0618l0945p1123M7910L8279K8683L545l7548k0343k2697k1083O5660
11260A7985O855p259N2447M9161L559o6104m8467j3858M0832Q401m8366K701J5689
11247A3576j8398j9657k8236R015N2744L8144k0687l2554k1104L0796K7948N608
$$ plain form
11235 37195 23309 9738 25089 27568 32864 34233 29937 57701 107894 149846 69759 -1118
11223 -1118 -36550 -55289 -66585 -44343 30804 41404 15627 10701 -29097 -53043 -89682 -165764
11211 -165764 -143381 -102493 -77947 -7340 -2837 -34249 -55071 -65325 -7416 -36711 -40561 -66339
11199 -66339 -79787 -14869 -32490 -44951 -38856 -38718 -16392 20047 39941 8335 -59110 -37606
11187 -37606 -32814 -27778 -30554 -48855 -8851 -18029 34089 84796 5650 -8093 41646 68914
11175 68914 179689 148557 83287 -4204 -20960 -31864 16488 75544 111392 134140 111674
11164 111674 94015 55013 13513 -18701 -31031 -42081 -31311 -13447 -7045 -23792 2059 -6079
11152 -6079 -62720 -91908 -21150 31141 41608 49074 -5915 -43970 -16636 -21192 -50797 -57515
$$ packed form
11235C7195j3886j3571J5351K479N296J369m296K7764N0193M1952q0087p0877
11223a118l5432j8739j1296K2242P5147J0600k5777m926l9798k3946l6639p6082
11211a65764K2383M0888K4546P0607M503l1412k0822j0254N7909k9295l850k5778
11199f6339j3448O4918j7621j2461O095J38K2326L6439J9894l1606o7445K1504
11187c7606M792N036k776j8301M0004r178N2118N0707p9146j3743M9739K7268
11175F8914J10775l1132o5270q7491j6756j0904M8352N9056L5848K2748k2466
11164A11674j7659l9002m1500l2214j2330j1050J0770J7864O402j6747K5851q138
11152f079n6641k9188P0758N2291J0467P466n4989l8055K7334m556k9605o718
$$ plain form
11140 -57515 -42266 -17588 -56494 -53174 -67378 -69141 -39676 20342 68489 39197 -24814 8002
11128 8002 33107 6929 -9711 -25968 -15736 -11002 -8937 8712 23569 23605 4782 -50966 -90403
11115 -90403 -23122 51891 105068 94389 106819 31275 -38708 -12903 -21231 -71989 10313 33799
11103 33799 -16260 -42316 -105712 -110116 -57288 16275 50140 28113 4245 -51844 -117621 -81461
11091 -81461 -8460 17800 23075 52876 46298 12462 -69979 -79219 -69830 -55471 -61159 -23473 33967
11078 33967 26969 -50226 -129011 -140197 -152076 -125611 -67632 -30076 334 16237 -17033 -47116
11066 -47116 -42504 -57547 -42224 19123 80250 43234 48530 42721 61440 43794 37717 65685
11054 65685 106008 143899 157649 158056 97652 107349 174072 236190 208905 209623 297479 328780 344915
$$ packed form
11140e7515J5249K4678l8906L320j4204j763K9465O0018M8147k9292o4011L2816
11128H002K5105k6178j6640j6257J0232M734K065J7649J4857L6j8823n5748l9437
11115i0403O7281P5013N3177j0679J2430p5544o9983K5805q328n0758Q2302K3486
11103C3799n0059k6056o3396m404N2828P3563L3865k2027k3868n6089o5777L6160
11091h1461P3001K6260N275K9801o578l3836q2441r240R389J4359n688L7686N7440
11078C3967o998p7195p8785j1186j1879K6465N7979L7556L0410J5903l3270l0083
11066d7116M612j5043J5323O1347O1127l7016N296n809J8719j7646o077K7968
11054F5685M0323L7891J3750M07o0404R697O6723O2118k7285P18Q7856L1301J6135
$$ plain form
11041 344915 306481 232759 251253 326683 344482 357881 395212 473179 555111 525578 547022
11030 547022 521959 491172 530718 541662 519052 524504 633616 714814 721655 709238 764230 822486
11018 822486 777642 644790 550089 522924 469227 511226 621602 665517 644103 615182 599188
11007 599188 499091 412952 330499 286104 215933 218677 195910 159371 157270 199443 254642 238552
10995 238552 259926 208404 144167 66582 9228 -15387 -3780 35830 41140 -49919 -26289 54663
10983 54663 70441 54034 74725 59920 66644 30574 35761 62473 55340 87721 84519 77782 104459
10970 104459 139133 81122 31524 56890 71612 16658 28104 65945 52248 2118 -20430
10959 -20430 -36255 -28652 -27525 6849 15311 21240 41966 2021 -208 36723 40122 22430 -3286
$$ packed form
11041C44915l8434p3722J8494P5430J7799J3399L7331P7967Q1932k9533K1444
11030E47022k5063l0787L9546J0944k2610N452J09112Q1198O841j2417N4992N8256
11018H22486m4844j32852r4701k7165n3697M1999J10376M3915k1414k8921j5994
11007E99188j00097q6139q2453m4395p0171K744k2767l6539k101M2173N5199j6090
10995B38552K1374n1522o4237p7585n7354k4615J1607L9610N310r1059K3630Q0952
10983E4663J5778j6407K0691j4805O724l6070N187K6712p133L2381l202o737K6677
10970A04459L4674n8011m9598K5366J4722n4954J1446L7841j3697n0130k2548
10959b0430j5825P603J127L4374Q462N929K0726l9945k229L6931L399j7692k5716
$$ plain form
10946 -3286 -28414 -35966 1368 10187 -32271 -47334 -77813 -67433 26670 17020 -81627 -52599
10934 -52599 -60127 -62256 1990 -11592 -11176 -14609 32045 25135 14376 14564 9701 -10076 -36674
10921 -36674 -54427 -12567 8655 -323 -25347 -31545 -104509 -177372 -174515 -94921 -22094 -9536
10909 -9536 21268 6512 -36949 -37009 -6019 -28503 -17458 23771 40263 17529 35659 24355
10897 24355 -7442 15292 -35119 -61600 -49226 -67241 -23224 17925 -7891 -22125 -41967 -58685
10885 -58685 -61995 32345 103958 127622 103576 71108 91942 84849 17607 10603 70368 78087
10873 78087 65338 74178 81125 84451 110357 125268 109313 120023 150820 118875 114660 53871
10861 53871 4049 -11516 2371 20195 72042 34245 43952 151541 199787 205642 191446 194255
$$ packed form
10946c286k5128p552L7334Q819m2458j5063l0479J0380R4103r650r8647K9028
10934e2599p528k129O4246j3582M16l433M6654o910j0759J88m863j9777k6598
10921c6674j7753M1860K1222q978k5024o198p2964p2863K857P9594P2827J2558
10909i536L0804j4756m3461o0L0990k2484J1045M1229J6492k2734J8130j1304
10897B4355l1797K2734n0411k6481J2374j8015M4017M1149k5816j4234j9842j6718
10885e8685l310R4340P1613K3664k4046l2468K0834p093o7242p004N9765P719
10873G8087j2749Q840O947L326K5906J4911j5955J0710L0797l1945m215o0789
10861E3871m9822j5565J3887J7824N1847l7797R707J07589M8246N855j4196K809
$$ plain form
10849 194255 176509 204803 186985 145510 129852 123797 103303 51676 -11040 -34763 -60926 -13282
10837 -13282 89831 124786 119034 127975 151762 132697 78750 1759 75026 101386 106154 123502
10825 123502 125506 110604 52752 -79198 -13806 44045 41914 6893 14841 32675 75111 41917
10813 41917 -6642 -29442 -5560 38838 44017 40355 74916 120792 94575 57095 2601 56667
10801 56667 -8195 -67886 -48104 -13600 19231 59459 29365 -5091 -21821 -54578 -15505 -45822
10789 -45822 -65432 -64670 -8854 72009 78650 54559 28248 15506 105469 85383 -4037 -62346
10777 -62346 -57345 4713 48769 73661 55917 52801 81848 80784 47635 39610 27426 9359
10765 9359 16824 85779 85899 125297 147345 112350 31621 -10521 16832 -23373 4982 40727
$$ packed form
10849A94255j7746K8294j7818m1475j5658o055k0494n1627o2716k3723k6163M7644
10837a3282J03113L4955n752Q941K3787j9065n3947p6991P3267K6360M768J7348
10825A23502K004j4902n7852j31950O5392N7851k131l5021P948J7834M2436l3194
10813D1917m8559k2800K3882M4398N179l662L4561M5876k6217l7480n4494N4066
10801E6667o4862n9691J9782L4504L2831M0228l0094l4456j6730l2757L9073l0317
10789d5822j9610P62N5816Q0863O641k4091k6311j2742Q9963k0086q9420n8309
10777f2346N001O2058M4056K4892j7744l116K9047j064l3149q025j2184j8067
10765I359P465O8955J20L9398K2048l4995q0729m2142K7353m0205K8355L5745
$$ plain form
10753 40727 63840 -3083 -29829 3073 19788 -15235 -62689 -8339 12087 -12780 -30721 -41243
10741 -41243 -17511 -41221 -58394 -69852 -6843 3772 -5200 -21355 -88290 -144116 -246176 -287637
10729 -287637 -280644 -301881 -274422 -203987 -104436 -85665 -154794 -218473 -221776 -225078 -305426 -322242
10717 -322242 -298215 -330215 -337067 -256890 -145072 -59131 -31471 -11476 -93617 -220671 -275790
10706 -275790 -319773 -291966 -221529 -149878 -146406 -127444 -69126 -60806 -19652 -65864 -144875 -160666
10694 -160666 -108727 -74115 -75096 -90720 -66546 -18014 12456 62488 69932 62239 53747 68957
10682 68957 82632 86139 72801 121919 119921 150190 226844 286269 306346 293222 227526 210294
10670 210294 180037 155280 227911 200930 164680 181746 192308 227155 279202 273668 267970 277299
$$ packed form
10753D0727K3113o6923k6746L2902J6715l5023m7454N4350K0426k4867j7941j0522
10741d1243K3732k3710j7173j1458O3009J0615q972j6155o6935n5826j02060m1461
10729b87637O993k1237K7459P0435R9551J8771o9129o3679l303l302q0348j6816
10717c22242K4027l2000o852Q0177J11818Q5941K7660J9995q2141j27054n5119
10706b75790m3983K7807P0437P1651L472J8962N8318Q320M1154m6212p9011j5791
10694a60666N1939L4612r81j5624K4174M8532L0470N0032P444p693q492J5210
10682F8957J3675L507j3338M9118j998L0269P6654N9425K0077j3124o5696j7232
10670B10294l0257k4757P2631k6981l6250J7066J0562L4847N2047n534n698R329
$$ plain form
10658 277299 339796 335961 278238 307664 372649 394082 441166 448862 515570 617891 688053 678186
10646 678186 667611 745814 770108 777956 846648 922465 887361 914364 1074721 1188007 1401526
10635 1401526 1587177 1795229 2121113 2495013 2818298 3099722 3386638 3638955 3959601
10626 3959601 4475950 5065164 5881595 7132202 8816874 11211699 14417315 18781599 24491811
10617 24491811 31357780 38524170 44528881 48145054 48804049 47220370 45075630 43915168
10609 43915168 44769994 48310984 55176730 65737940 79319057 93427367 104353333 108720878
10601 108720878 105595682 97311319 88307397 81968209 79927883 82873221 91204176 104831368
10593 104831368 122205206 139195232 150229522 150968219 140805987 123948516 106837025
$$ packed form
10658B77299O2497l835n7723K9426O4985K1433M7084P696O6708J02321P0162r867
10646F78186j0575P8203K4294P848O8692P5817l5104K7003J60357J13286K13519
10635A401526J85651K08052L25884L73900L23285K81424K86916K52317L20646
10626C959601N16349N89214Q16431J250607J684672K394825L205616M364284N710212
10617B4491811O865969P166390O004711L616173O58995j583679k144740j160462
10609D3915168Q54826L540990O865746J0561210J3581117J4108310J0925966M367545
10601A08720878l125196q284363r003922o339188k040326K945338Q330955J3627192
10593A04831368J7373838J6990026J1034290P38697j0162232j6857471j7111491
$$ plain form
10586 106837025 93541960 85319223 82277046 84147621 90304859 99010000 107173027 110793310
10578 110793310 107198992 96669163 82539285 69074019 58645246 51729660 47979006
10571 47979006 46960699 47875016 49754785 51169687 50546718 47089469 41088711 33897017
10563 33897017 27073575 21353878 16929942 13604346 11094607 9210742 7683566 6531252
10555 6531252 5626883 4882089 4337504 3929997 3576545 3217422 2842816 2504700 2306677
10546 2306677 2163173 1942128 1758213 1701968 1660690 1541793 1449904 1403837 1293645 1141059
10536 1141059 1059931 983705 1010041 970678 914423 890841 843234 772472 732520 780766 820496
10525 820496 775208 676876 585886 540468 572511 528612 436355 437524 490004 499555 437585 357518
$$ packed form
10586A06837025j3295065q222737l042177J870575O157238Q705141Q163027L620283
10578A10793310l594318j0529829j4129878j3465266j0428773o915586l750654
10571D7979006j018307R14317J879769J414902o22969l457249o000758p191694
10563C3897017o823442n719697m423936l325596k509739j883865j527176j152314
10555F531252r04369p44794n44585m07507l53452l59123l74606l38116j98023
10546B306677j43504k21045j83915n6245m1278j18897r1889m6067j10192j52586
10536A141059q1128p6226K6336l9363n6255k3582m7607p0762l9952M8246L9730
10525H20496m5288r8332r0990m5418L2043m3899r2257J169N2480R551o1970q0067
$$ plain form
10513 357518 331127 349739 328984 320035 283115 340478 364347 409454 412989 346021 360439 365526
10501 365526 377728 411023 344912 313103 320266 327604 313971 299818 231585 235010 236056 287275
10489 287275 416624 464025 387724 336062 380430 331423 298216 341197 374560 404433 469451
10478 469451 535443 609552 609584 517887 438117 369246 359861 377442 403916 488133 508857 504298
10466 504298 601321 649962 679099 647477 579886 590399 598734 518521 440438 420424 372120 419597
10454 419597 420960 481285 548537 603446 534711 518882 452030 374334 361765 383128 395122 389910
10442 389910 424831 419522 403562 410672 397689 343607 324998 293592 302461 311867 267675 224367
10430 224367 203021 227801 218343 149071 109043 120595 201622 147180 68116 123818 191175 156530
$$ packed form
10513C57518k6391J8612k0755q949l6920N7363K3869M5107L535o6968J4418N087
10501C65526J2202L3295o6111l1809P163P338j3633j4153o8233L425J046N1219
10489B87275J29349M7401p6301n1662M4368m9007l3207M2981L3363K9873O5018
10478D69451O5992P4109L2r1697p9770o8871r385J7581K6474Q4217K0724m559
10466E04298R7023M8641K9137l1622o7591J0513Q335q0213p8083k0014m8304M7477
10454D19597J363O0325O7252N4909o8735j5829o6852p7696j2569K1363J1994n212
10442C89910L4921n309j5960P110j2983n4082j8609l1406Q869R406m4192m3308
10430B24367k1346K4780r458o9272m0028J1552Q1027n4442p9064N5702O7357l4645
$$ plain form
10418 156530 115092 76869 50056 81893 89212 139693 158406 106056 98968 90863 79811 114433
10406 114433 144371 127281 63445 17851 42138 117548 87475 102754 145386 141130 137718 56306
10394 56306 7730 -40508 -27703 -51685 -45599 -38721 -19783 11363 71642 99855 93854 124395
10382 124395 119820 53059 -16343 -66203 -59545 -63945 -18709 42003 55503 13900 -86869 -66840
10370 -66840 -24414 -22411 -27895 6862 42216 117052 142973 95388 43835 19054 26600 -18559
10358 -18559 22673 60144 79992 9629 -81816 -37873 34662 65307 95056 38441 27501 54387
10346 54387 -30892 -68674 -24704 -20098 16117 47557 -10722 -21297 540 -49774 -106426 -39984
10334 -39984 8276 18643 9968 25398 83103 112297 82836 58212 9365 22035 20546 -99866
$$ packed form
10418A56530m1438l8223k6813L1837P319N0481J8713n2350p088q105j1052L4622
10406A14433K9938j7090o3836m5594K4287P5410l0073J5279M2632m256l412q1412
10394E6306m8576m8238J2805k3982O086O878J8938L1146O0279K8213o001L0541
10382A24395m575o6761o9402m9860O658m400M5236O0712J3500m1603j00769K0029
10370f6840M2426K003n484L4757L5354P4836K5921m7585n1553k4781P546m5159
10358a8559M1232L7471J9848p0363r1445M3943P2535L0645K9749n6615j0940K6886
10346E4387q5279l7782M3970M606L6215L1440n8279j0575K1837n0314n6652O6442
10334c9984M8260J0367q675J5430N7705K9194k9461k4624m8847J2670j489j20412
$$ plain form
10322 -99866 -135346 -133427 -107256 -92456 -87385 -73786 -37961 -34740 -42735 -34352 -22397 16109 79091
10309 79091 62443 -9939 15098 17603 -2034 -34980 -52575 -31659 1152 -43626 -40407 -75880
10297 -75880 -76350 -114768 -97760 -81554 -54273 -22366 42875 33783 79539 113108 67848 26647
10285 26647 22568 67484 117903 90176 89800 95040 80733 55370 23509 14101 -14947 4776 28353
10272 28353 22336 -29214 9371 -26786 -6945 35313 -18333 -53521 -83709 -70281 -40519 -25835
10260 -25835 22571 69190 51588 41280 46757 23796 11993 28620 32590 -30816 -35221 -12839
10248 -12839 -58987 -85012 -73376 -50019 6786 -19248 -9313 -23724 -59287 -53173 19851 61631
10236 61631 1305 -22442 -32657 -20319 -19952 -6840 -7290 -19973 -34831 2059 -20022 -6011
$$ packed form
10322i9866l5480J919K6171J4800N071J3599L5825L221p995Q383J1955L8506O2982
10309G9091j6648p2382K5037K505j9637l2946j7595K0916L2811m4778L219l5473
10297g5880m70l8418J7008J6206K7281L1907O5241r092M5756L3569m5260m1201
10285B6647m079M4916N0419k7727l76N240j4307k5363l1861r408k9048J9723K3577
10272B8353o017n1550L8585l6157J9841M2258n3646l5188l0188J3428K9762J4684
10260b5835M8406M6619j7602j0308N477k2961j1803J6627L970o3406m405K2382
10248a2839m6148k6025J1636K3357N6805k6034R935j4411l5563O114P3024M1780
10236F1631o0326k3747j0215J2338L67J3112m50j2683j4858L6890k2081J4011
$$ plain form
10224 -6011 63577 34034 -8205 5042 -71493 -66366 -40393 -33683 -30574 -74476 -2287 83173
10212 83173 31302 25756 40530 49460 24177 29142 44746 -3553 -73484 -96768 -19915 45839
10200 45839 62210 26087 47074 86051 26994 -30948 -24364 -57945 -83457 -95823 -102052 -156860
10188 -156860 -133053 -84072 -41841 1891 67243 97388 173382 253119 239353 196608 229878
10177 229878 280762 269738 228439 203668 201502 237914 289061 331426 366709 384732 488805
10166 488805 605058 663170 599240 522913 465463 378310 374834 442392 515557 601769 669589
10155 669589 790389 872269 807991 746732 751700 777101 711398 551956 509194 528647 540719
10144 540719 587708 584496 554384 628416 597578 511508 439443 361639 346906 318934 238360 255821
$$ packed form
10224f011O9588k9543m2239J3247p6535N127K5973O710L109m3902P2189Q5460
10212H3173n1871n546J4774Q930k5283M965J5604m8299o9931k3284P6853O5754
10200D5839J6371l6123K0987L8977n9057n7942O584l3581k5512j2366o229n4808
10188a56860K3807M8981M2231M3732O5352L0145P5994P9737j3766m2745L3270
10177B29878N0884j1024m1299k4771k166L6412N1147M2365L5283J8023J04073
10166D88805J16253N8112o3930p6327n7450q7153l476O7558P3165Q6212O7820
10155F69589J20800Q1880o4278o1259M968K5401o5703j59442m2762J9453J2072
10144E40719M6989l212l0112P4032l0838q6070p2065p7804j4733k7972q0574J7461
$$ plain form
10132 255821 284248 289304 242401 229743 201517 153466 99232 53393 68642 54562 42970 80975
10120 80975 44209 25136 26995 7187 50297 36070 -53874 -90302 -37798 -5946 -4752 -25635
10108 -25635 -61700 -48628 -88137 -59318 31304 49958 35961 33223 56518 22868 5101 73977
10096 73977 44406 -7515 -19388 2253 5345 -8381 -1500 35808 56463 18057 31890 25171
10084 25171 47880 61507 55566 27415 -39094 -35932 -31468 -48488 -51033 -32395 -86541 -125230
10072 -125230 -122704 -63702 -37209 -87633 -93689 -9573 101087 110564 65485 98384 91278 89726
10060 89726 56831 54207 98691 14306 -7659 -8440 69201 117671 73181 12688 18811 31174
10048 31174 996 -12878 -13184 -157 -35034 -46209 -37292 -27987 -17139 -16589 -36533 -21069 1588
$$ packed form
10132B55821K8427N056m6903j2658k8226m8051n4234m5839J5249j4080j1592L8005
10120H0975l6766j9073J859j9808M3110j4227q9944l6428N2504L1852J194k0883
10108b5635l6065J3072l9509K8819R0622J8654j3997k738K3295l3650j7767O8876
10096G3977k9571n1921j1873K1641L092j3726O881L7308K0655l8406J3833o719
10084B5171K2709J3627n941k8151o6509L162M464j7020k545J8638n4146l8689
10072a25230K526N9002K6493n0424o056Q4116J10660R477m5079L2899p106j552
10060H9726l2895k624M4484q4385k1965p81P7641M8470m4490o0493O123J2363
10048C1174l0178j3874l06J3027l4877j1175Q917R305J0848N50j9944J5464K2657
$$ plain form
10035 1588 2251 2166 30413 30516 64275 103894 69187 19540 -5684 -43751 -52576 -9724 45856
10022 45856 106594 125327 107820 76314 56423 571 14274 -45552 -41596 17432 33588 11206
10010 11206 43852 28508 12860 48931 6577 -28460 -21778 -30444 -59774 5839 69177 72313
9998 72313 -9015 10553 64348 132271 157800 82423 79254 73713 26634 5598 51128 46982
9986 46982 29535 -60006 -136250 -144200 -28092 7183 -41120 -74778 -76956 -106072 -162488 -141557
9974 -141557 -55406 24028 75796 49237 -13149 -52918 -102078 -125090 -108271 -49766 17832 28708
9962 28708 40413 -39783 -58448 -82519 -98526 -152180 -146057 -103156 -38930 -1661 19796 19180
9950 19180 57432 22031 85939 87811 75964 86614 18456 667 55322 53711 60323 65913 -7409
$$ packed form
10035A588O63q5K8247J03L3759L9619l4707m9647k5224l8067q825M2852N5580
10022D5856O0738J8733j7507l1506j9891n5852J3703n9826L956N9028J6156k2382
10010A1206L2646j5344j5648L6071m2354l5037O682q666k9330O5613O3338L136
9998G2313q1328J9568N3795O7923K5529p5377l169n541m7079k1036M5530m146
9986D6982j7447q9541p6244p950J16108L5275m8303l3658k178k9116n6416K0931
9974a41557Q6151P9434N1768k6559o2386l9769m9160k3012J6819N8505O7598J0876
9962B8708J1705q0196j8665k4071j6007n3654O123M2901O4226L7269K1457o16
9950A9180L8252l5401O3908J872j1847J0650o8158j7789N4655j611O612N590p3322
$$ plain form
9937 -7409 -17761 28671 11595 65361 115503 128969 188404 235129 204092 202135 327822 423000
9925 423000 568348 787712 1125758 1654299 2814879 4925689 7779510 10230026 11193629
9916 11193629 9921517 6544514 3948872 2575601 1829000 1337410 972235 737483 551631
9907 551631 432424 367336 276489 262842 281546 264852 244786 202038 191482 130784 102716
9896 102716 125377 117791 96653 86480 36948 110123 72774 8919 24259 10770 -20158 36872
9884 36872 44948 -18085 17872 28039 38442 65453 44301 -16370 43580 66193 25215 21441
9872 21441 -3121 16409 14680 15618 22531 98284 63856 29941 8649 -65001 -77171 -42773 -80021
9859 -80021 -33313 -25963 -21660 -39808 -9283 -73534 -101983 -114836 -74400 -108660 -108995 -52427 -42158
$$ packed form
9937g409j0352M6432j7076N3766N0142J3466N9435M6725l1037j957J25687R5178
9925D23000J45348K19364L38046N28541J160580K110810K853821K450516R63603
9916A1193629j272112l377003k595642j373271p46601m91590l65175k34752j85852
9907E51631j19207o5088r0847j3647J8704j6694k0066m2748j0556o0698k8068
9896A02716K2661p586k1138j0173m9532P3175l7349o3855J5340j3489l0928N7030
9884C6872Q076o3033L5957J0167J0403K7011k1152o0671N9950K2613m0978l774
9872B1441k4562J9530j729R38O913P5753l4428l3915k1292p3650j2170L4398l7248
9859h0021M6708P350M303j8148L0525o4251k8449j2853M0436l4260l35N6568J0269
$$ plain form
9846 -42158 -57628 -77943 -29266 -25175 -4589 55235 91022 86517 48097 20045 13015 8942 6028
9833 6028 12866 -25487 -26346 -14899 -3534 -19920 -13464 -38662 -20918 46083 103736 82457 34104
9820 34104 3297 24704 25804 25280 17060 -559 16856 -12485 -7896 29342 59621 63858 60089
9807 60089 86477 50529 5556 33310 27078 7641 4809 26845 29975 64844 116290 85864
9795 85864 36619 13931 32001 113351 112387 79067 34947 1835 20833 -13473 -2383 -8749
9783 -8749 -27250 27534 33203 36482 47276 -35970 -27266 -46138 -98399 -138524 -95563 -31633 68
9770 68 -32621 -54111 -44268 -15240 18695 22601 -12103 -23173 -63508 -31061 -16361 -13824 16220
9757 16220 18118 -31743 -94852 -90106 -97974 -65354 -14642 38905 40953 21464 -19682 -12802 28962
$$ packed form
9846d2158j5470k0315M8677M091K0586N9824L5787m505l8420k8052p030m073k914
9833F028O838l8353q59J1447J1365j6386O456k5198J7744O7001N7653k1279m8353
9820C4104l0807K1407J100n24q220j7619J7415k9341M589L7238L0279M237l769
9807F0089K6388l5948m4973K7754o232j9437k832K2036L130L4869N1446l0426
9795H5864m9245k2688J8070Q1350r64l3320m4120l3112J8998l4306J1090o366
9783h749j8501N4784N669L279J0794q3246Q704j8872n2261m0125M2961O3930L1701
9770F8l2689k1490R843K9028L3935L906l4704j1070m0335L2447J4700K537L0044
9757A6220J898m9861o3109M746p868L2620N0712N3547K048j9489m1146O880M1764
$$ plain form
9744 28962 30630 21718 26553 10748 3268 -25390 -16527 38000 42688 12174 7515 -41795 -70114
9731 -70114 -35750 31286 104294 59254 -9497 57361 56461 37592 23806 -15072 67491 89425
9719 89425 208 -43385 -21060 -12389 -12560 -83805 -95284 -81323 -52774 -31908 14099 78649
9707 78649 66396 54774 25618 16018 18842 1398 69779 91192 60536 35209 51802 81910
9695 81910 149573 174571 156013 154091 125199 110188 48758 16867 -11960 -219 10484 -9032
9683 -9032 57238 58483 34595 51317 -22453 22944 47060 24636 -3542 -41933 -25869 46578
9671 46578 114464 131326 73112 71550 110755 133117 135949 124588 98291 66116 58253 99736
9659 99736 136541 125353 140073 260878 442729 671222 864317 845958 527018 276564 188975
$$ packed form
9744B8962J668q912M835j5805p480k8658Q863N4527M688l0514m659m9310k8319
9731g0114L4364O7036P3008m5040o8751O6858r00j8869j3786l8878Q2563K1934
9719H9425q9217m3593K2325Q671j71p1245j1479J3961K8549K0866M6007O4550
9707G8649j2253j1622k9156r600K824j7444O8381K1413l0656k5327J6593L0108
9695H1910O7663K4998j8558j922k8892j5011o1430l1891k8827J1741J0703j9516
9683i032O6270J245k3888J6722p3770M5397K4116k2424k8178l8391J6064P2447
9671D6578O7886J6862n8214j562L9205K2362K832j1361k6297l2175p863M1483
9659I9736L6805j1188J4720J20805J81851K28493J93095j8359l18940k50454q7589
$$ plain form
9648 188975 87680 27107 82717 115839 44613 39743 62397 47781 9222 -12548 -12611 8753
9636 8753 -7283 -43091 -70033 -31557 -5988 34986 46321 79867 87969 22869 14432 61965
9624 61965 38953 -29319 -53031 -46853 -52725 1401 7046 32666 60256 47017 13829 -13837
9612 -13837 14523 57183 93350 100071 90287 32429 -48752 26310 83845 86744 81863 124313 116215
9599 116215 45420 37982 5087 34032 36494 28171 27367 16591 49531 156274 147313 74897 96817
9586 96817 62663 83402 139011 114146 65012 58216 63670 58019 3933 -45029 -90947 -78606
9574 -78606 -40179 -7029 11703 24802 61074 88653 88646 63461 2663 -36310 -24323 64 -12658
9561 -12658 -16091 -11989 16276 29344 64865 26315 614 30562 204 -73525 -43427 25821
$$ packed form
9648A88975j01295o0573N5610L3122p1226m870K2654j4616l8559k1770o3K1364
9636H753j6036l5808k6942L8476K5569M0974J1335L3546Q102o5100q437M7533
9624F1965k3012o8272k3712O178n872N4126N645K5620K7590j3239l3188k7666
9612a3837K8360M2660L6167O721r784n7858q1181P5062N7535K899m881M2450q098
9599A16215p0795p438l2895K8945K462q323q04j0776L2940J06743q961p2416K1920
9586I6817l4154K0739N5609k4865m9134o796N454n651n4086m8962m5918J2341
9574g8606L8427L3150J8732J3099L6272K7579pk5185o0798l8973J1987K4387j2722
9561a2658l433M102K8265J3068L5521l8550k5701K9948l0358p3729L0098O9248
$$ plain form
9549 25821 36516 59760 70055 13323 -15361 -45552 -64409 -7211 -42514 -95255 -63179 -51147
9537 -51147 -33967 19107 54706 34720 -9467 38785 80269 37597 29063 7064 -1322 -15174
9525 -15174 24361 -11235 -22439 -39934 -40339 50868 40435 72562 79013 77894 91219 81145 3651
9512 3651 4171 37997 13825 12380 9810 -21893 -11553 33580 60679 63939 -470 -20337 45569
9499 45569 34632 -11181 -24021 -42275 -18004 -42708 -43005 2524 29673 13043 5569 6956 51455
9486 51455 104209 79967 92574 99244 154876 178562 128284 113007 82319 26071 13684 15069
9474 15069 14115 2515 20300 82960 66042 -46456 -41419 -1670 19116 4068 -43514 -14438
9462 -14438 39200 51284 59101 32039 -2272 -54803 -68754 -39470 -65174 -77472 -59217 -39635
$$ packed form
9549B5821J0695K3244J0295n6732k8684l0191j8857N7198l5303n2741L2076J2032
9537e1147J7180N3074L5599j9986m4187M8252M1484m2672q534k1999q386j3852
9525a5174L9535l5596j1204j7495m05R1207j0433L2127O451j119J3325j0074p7494
9512C651N20L3826k4172j445k570l1703J0340M5133K7099L260o4409j9867O5906
9499D5569j0937m5813j2840j8254K4271k4704k97M5529K7149j6630p474J387M4499
9486E1455N2754k4242J2607O670N5632K3686n0278j5277l0688n6248j2387J385
9474A5069r54j1600J7785O2660j6918j12498N037L9749K0786j5048m7582K9076
9462a4438N3638J2084P817k7062l4311n2531j3951K9284k5704j2298J8255J9582
$$ plain form
9450 -39635 2183 44098 24188 -10972 -23135 7554 22130 19870 13674 65825 50809 67952
9438 67952 69190 37345 58618 88353 38913 -26541 -61301 -71185 -11816 22853 62508 106324
9426 106324 116989 66561 53268 76117 105968 141575 162321 158254 146342 156371 147142 131812
9414 131812 99232 73084 26015 31767 60131 100721 73998 43848 66940 2745 -42336 1341
9402 1341 21713 57941 59178 51571 25648 10010 -27237 -13914 43583 34279 21719 62895 40827
9389 40827 54352 96325 64577 51295 27282 -2637 -15476 -12733 -44634 -380 20323 26937
9377 26937 22472 46879 100760 123504 105490 71380 66425 45242 38364 11453 56991 54452 27352
9364 27352 -10476 -34217 -7185 1748 -11754 -17562 -30260 -676 78101 135416 110621 87165
$$ packed form
9450c9635M1818M1915j9910l5160j2163L0689J4576k260o196N2151j5016J7143
9438F7952J238l1845K1273K9735m9440o5454l4760r884N9369L4669L9655M3816
9426A06324J0665n0428j3293K2849K9851L5607K0746m067j1912J0029r229j5330
9414A31812l2580k6148m7069N752K8364M0590k6723l0150K3092o4195m5081M3677
9402A341K0372L6228J237p607k5923j5638l7247J3323N7497r304j2560M1176k2068
9389D0827J3525M1973l1748j3282k4013k9919j2839K743l1901M4254K0703O614
9377B6937m465K4407N3881K2744j8014l4110m955k1183o878k6911M5538k539k7100
9364B7352l7828k3741K7032Q933j3502n808j2698K9584P8777N7315k4795k3456
$$ plain form
9352 87165 101911 94265 57293 58422 93421 70889 48622 69028 134426 108340 112891 67295
9340 67295 49013 64195 127947 146603 135793 126194 97938 97848 102602 128891 184707 153710 148341
9327 148341 170290 154428 110329 70831 51636 37517 70453 17667 -24549 -6961 -11460 54835
9315 54835 107978 103938 68474 94333 101152 62392 74759 84489 75501 66575 72032 75289 71865
9302 71865 33868 44554 37097 27377 31829 125973 130270 110736 109081 108666 100240 87089 115335
9289 115335 130031 93681 85246 92762 164911 144824 109821 110707 72863 56904 70569 -12840
9277 -12840 -18864 -8427 8512 12909 -48017 -2431 67787 89676 66436 60821 50281 25816
9265 25816 8102 60586 119672 171170 240483 202076 143830 72239 41606 34578 56935 85324
$$ packed form
9352H7165J4746p646l6972J129L4999k2532k2267K0406O5398k6086M551m5596
9340F7295j8282J5182O3752J8656j0810r599k8256r0M754K6289N5816l0997n369
9327A48341K1949j5862m4099l9498j9195j4119L2936n2786m2216J7588m499O6295
9315E4835N3143m040l5464K5859O819l8760J2367R730q988q926N457L257l424
9302G1865l7997J0686p457r720M452R4144M297j9534j655m15q426j3151K8246
9289A15335J4696l6350q435P516P2149k0087l5003Q86l7844j5959J3665q3409
9277a2840o024J0437J6939M397o0926M5586P0218K1889k3240n615j0540k4465
9265B5816j7714N2484N9086N1498O9313l8407n8246p1591l0633p028K2357K8389
$$ plain form
9253 85324 140815 174786 167685 106412 83096 112133 101003 38049 32885 33946 33004 42669 67357
9240 67357 78874 93780 121457 136265 99614 71320 97881 110357 100023 95103 51364 38217
9228 38217 62422 66397 42560 38336 70680 96693 72827 82076 45647 83626 134420 81810
9216 81810 20756 15976 39195 -2125 -588 -548 -28131 -18824 -1393 12362 61196 97885 122695
9203 122695 134848 99570 134089 182491 203258 180290 143826 88776 27735 4303 44536 73447
9191 73447 121615 165325 166371 142203 95611 44750 30657 80162 154644 157402 133552 91403
9179 91403 74114 127431 161572 108220 111704 92494 77139 128078 96620 71006 57596 86862
9167 86862 133373 151089 143262 117318 89653 99842 121699 123459 73421 117642 160797 142983
$$ packed form
9253H5324N5491L3971p101o1273k3316K9037j1130o2954n164J061r42R665K4688
9240F7357J1517J4906K7677J4808l6651k8294K6561J2476j0334m920m3739j3147
9228C8217K4205L975k3837m224L2344K6013k3866R249l6429L7979N0794n2610
9216H1810o1054m780K3219m1320J537M0k7583R307J7431J3755M8834L6689K4810
9203A22695J2153l5278L4519M8402K0767k2968l6464n5050o1041k3432M0233K8911
9191G3447M8168M3710J046k4168m6592n0861j4093M9505P4482K758k3850m2149
9179I1403j7289N3317L4141n3352L484j9210j5355N0939l1458k5614j3410K9266
9167H6862M6511J7716p827k5944k7665J0189K1857J760n0038M4221M3155j7814
$$ plain form
9155 142983 128292 109139 103259 89216 96110 117141 125313 161080 178737 181575 150478 85558
9143 85558 65010 35183 49550 36860 49596 150261 205728 179958 78741 58094 111171
9132 111171 136845 137408 84707 88612 158241 172304 164395 122408 119446 68211 20876 19104 95256
9119 95256 168582 226339 233690 151749 97242 105534 125462 119789 92954 136113 140846 147155 63131
9106 63131 27697 22218 57383 17316 -2675 25617 76883 89144 105628 125317 116601 165543
9094 165543 202534 198282 172929 140727 62799 28939 43584 -17967 6091 102075 131121 118820
9082 118820 119097 40727 50947 60651 66961 67597 109789 108276 90234 38120 -36652 -29957 34704
9069 34704 50931 5979 31834 50722 98498 150765 150783 164082 166612 143378 190385 173461 181763
$$ packed form
9155A42983j4691j9153n880j4043O894K1031Q172L5767J7657K838l1097o4920
9143H5558k0548k9827J4367j2690J2736J00665N5467k5770j01217k0647N3077
9132A11171K5674N63n2701L905O9629J4063p909m1987k962n1235m7335j772P6152
9119I5256P3326N7757P351q1941n4507Q292J9928n673k6835M3159M733O309q4024
9106F3131l5434n479L5165m0067j9991K8292N1266J2261J6484J9689q716M8942
9094A65543L6991m252k5353l2202p7928l3860J4645o1551K4058R5984K9046j2301
9082A18820K77p8370J0220R704O310O36M2192j513j8042n2114p4772O695O4661
9069C4704J6227m4952K5855J8888M7776N2267J8J3299K530k3234M7007j6924Q302
$$ plain form
9056 181763 120522 33913 13287 69325 132270 48849 53694 69333 133364 127663 100792 129972
9044 129972 82855 78000 103720 156087 160349 109371 119976 179562 225809 203041 189330 104629
9032 104629 80611 131128 123423 51816 46536 83977 90000 119481 188809 168115 187406 171967
9020 171967 143022 167729 168074 159002 146133 157495 161694 169936 193600 201110 150449 155497 123524
9007 123524 117476 73589 33732 74021 160076 170099 83261 28380 48541 85999 129196 106948
8995 106948 85718 42923 88036 125802 108601 124986 98075 92028 133784 149347 74699 71755
8983 71755 114624 110417 92584 125633 225606 246432 246890 280911 211300 161502 159945 131254 104184
8970 104184 117594 114372 90110 73790 99766 122709 86342 22632 22560 62155 119925 146487
$$ packed form
9056A81763o1241q6609k0626N6038O2945q3421M845J5639O4031n701k6871K9180
9044A29972m7117m855K5720N2367M262n0978J0605N9586M6247k2768j3711q4701
9032A04629k4018N0517p705p1607n280L7441O023K9481O9328k0694J9291j5439
9020A71967k8945K4707L45r072j2869J1362M199Q242K3664P510n0661N048l1973
9007A23524o048m3887l9857M0289Q6055J0023q6838n4881K0161L7458M3197k2248
8995A06948k1230m2795M5113L7766j7201J6385k6911o047M1756J5563p4648k944
8983G1755M2869m207j7833L3049R9973K0826M58L4021o9611m9798j557k8691k7070
8970A04184J3410l222k4262j6320K5976K2943l6367o3710p2L9595N7770K6562
$$ plain form
8958 146487 161705 134675 116706 171911 222390 222313 211015 198109 187291 123327 25537 39338
8946 39338 78260 21044 52451 133395 175744 227909 201140 216254 190836 186604 169083 207251
8934 207251 149505 119120 144123 215311 243648 228466 222459 179341 198498 243002 208642 230273
8922 230273 241670 239604 223017 248874 227456 172867 137063 194092 229215 148074 134132 222287
8910 222287 208965 168474 166768 193689 169935 216001 169566 156194 142340 201441 270534 227081
8898 227081 171577 132761 126779 185839 206341 252259 215079 165491 124403 85679 140576 199840
8886 199840 273606 375056 406979 401153 376910 363927 289040 287906 235651 227572 278748 258182
8874 258182 279010 234589 147560 176324 212826 189620 189604 148143 146870 214266 244496 256964
$$ packed form
8958A46487J5218k7030j7969N5205N0479p7j1298j2906j0818o3964r7790J3801
8946C9338L8922n7216L1407Q0944M2349N2165k6769J5114k5418m232j7521L8168
8934B07251n7746l0385K5003P1188K8337j5182o007m3118J9157M4504l4360K1631
8922B30273J1397k066j6587K5857k1418n4589l5804N7029L5123q1141j3942Q8155
8910B22287j3322m0491j706K6921k3754M6066m6435j3372j3854N9101O9093m3453
8898B27081n5504l8816n982N9060K0502M5918l7180m9588m1088l8724N4897N9264
8886A99840P3766J01450L1923n826k4243j2983p4887j134n2255q079N1176k0566
8874B58182K0828m4421q7029K8764L6502k3206j6m1461j273O7396L0230J2468
$$ plain form
8862 256964 247407 203410 164725 119517 42470 85062 143579 169039 214613 263483 277287 240123
8850 240123 221365 223768 224480 141770 135684 181667 148915 148956 177226 180260 171946 152135 165738
8837 165738 162193 120147 133908 129171 128194 138369 138171 116573 135135 126796 99664 78499 101261
8824 101261 113194 68456 87938 131678 167925 220999 208150 187688 153982 124407 121715 157800
8812 157800 159064 138884 125619 124774 164589 180694 190254 210136 201752 218431 201640 190527 212586
8799 212586 191490 272326 258681 204514 207671 299475 319994 272637 248550 247526 234141 208625
8787 208625 169797 196860 189459 221031 303434 298790 323193 344528 276150 184017 206720 220809
8775 220809 235906 302290 359416 347456 315009 284270 282452 280882 325861 320458 285175 250239
$$ packed form
8862B56964r557m3997l8685m5208p7047M2592N8517K5460M5574M8870J3804l7164
8850B40123j8758K403P12q2710o086M5983l2752M1K8270L034q314j9811J3603
8837A65738l545m2046J3761m737r77J0175j98k1598J8562q339k7132k1165K2762
8824A01261J1933m4738J9482M3740L6247N3074j2849k0462l3706k9575k692L6085
8812A57800J264k0180j3265q45L9815J6105R560J9882q384J6679j6791j1113K2059
8799B12586k1096Q0836j3645n4167L157R1804K0519m7357k4087j024j3385k5516
8787B08625l8828K7063p401L1572Q2403m644K4403K1335o8378r2133K2703J4089
8775B20809J5097O6384N7126j1960l2447l0739j818j570M4979n403l5283l4936
$$ plain form
8763 250239 268643 203871 202260 258886 291162 303608 295144 318070 295473 270284 197343 152166
8751 152166 125629 145107 195345 206769 237759 227882 211141 202043 248804 249887 212163 187044
8739 187044 212677 246984 220686 187006 186956 201716 215201 221001 216163 219982 298367 323856 283497
8726 283497 259063 276470 302907 274599 252959 250405 232654 203707 259287 276407 228568 246664
8714 246664 239924 287451 336827 265858 216064 226657 279656 264454 231919 259169 256256 254300
8702 254300 188180 180619 221828 282137 332080 277559 218526 252099 285383 310909 230981 226871
8690 226871 226474 272906 347347 372494 382750 333941 285233 258619 233158 241647 318040 341604
8678 341604 311454 275537 276511 301292 332897 316511 286175 282322 364983 419003 433155 374599
$$ packed form
8763B50239J8404o4772j611N6626L2276J2446q464K2926k2597k5189p2941m5177
8751A52166k6537J9478N0238J1424L0990r877j6741r098M6761J083l7724k5119
8739A87044K5633L4307k6298l3680n0J4760J3485N800m838L819P8385K5489m0359
8726B83497k4434J7407K6437k8308k1640k554j7751k8947N5580J7120m7839J8096
8714B46664o740M7527M9376p0969m9794J0593N2999j5202l2535K7250k913j956
8702B54300o6120p561M1209O0309M9943n4521n9033L3573L3284K5526p9928m110
8690B26871l97M6432P4441K5147J0256m8809m8708k6614k5461Q489P6393K3564
8678C41604l0150l5917R74K4781L1605j6386l0336l853Q2661N4020J4152n8556
$$ plain form
8666 374599 400015 464512 437553 457220 440851 378889 360071 376512 353233 356698 363750 414582
8654 414582 426610 423806 427007 469194 492159 528300 571130 590623 574404 584661 571165 603279
8642 603279 614481 595846 549810 520612 483162 509606 555680 617816 611308 655560 675434 647500
8630 647500 617293 594909 647352 691287 742320 776356 788421 719441 755235 797932 839988 846346
8618 846346 866480 843868 794509 824840 832910 879424 956833 915530 901936 906736 936362 962376
8606 962376 996043 1055208 1119652 1166639 1198451 1211081 1265586 1278925 1351902 1401754 1485664 1616085
8594 1616085 1728189 1851323 1868527 1932514 2104506 2255062 2422204 2638438 2869171 3080703
8584 3080703 3230608 3345875 3512036 3735838 3855333 3934897 3890794 3799229 3684498 3479666
$$ packed form
8666C74599K5416O4497k6959J9667j6369o1962j8818J6441k3279L465P052N0832
8654D14582J2028k804L201M2187K2965L6141M2830J9493j6219J0257j3496L2114
8642F03279J1202j8635m6036k9198l7450K6444M6074O2136o508M4252J9874k7934
8630F47500l0207k2384N2443M3935N1033L4036J2065o8980L5794M2697M2056O358
8618H46346K0134k2612m9359L0331Q070M6514P7409m1303j3594M800K9626K6014
8606I62376L3667N9165O4444M6987L1812J2630N4505J3339P2977M9852Q3910J30421
8594A616085J12104J23134J7204O3987J71992J50556J67142K16234K30733K11532
8584C080703J49905J15267J66161K23802J19495P9564m4103r1565j14731k04832
$$ plain form
8574 3479666 3227679 3038721 2934687 2783340 2522876 2316649 2184405 2080838 1991395 1845133
8564 1845133 1727726 1687085 1633646 1553738 1524144 1501879 1438315 1432009 1472849 1433620 1386439
8553 1386439 1312925 1274574 1224313 1192693 1162932 1140007 1191764 1244252 1251763 1171043 1096815 1045655
8541 1045655 998089 1021820 1068855 1117939 1169677 1143993 1102789 1099998 1046006 1022621 1048319 1110267
8529 1110267 1128350 1138954 1133908 1131485 1083784 1061701 1088297 1136732 1131774 1133799 1173960 1211572
8517 1211572 1163900 1111971 1161948 1182291 1193631 1223231 1219138 1286401 1346454 1402615 1334963 1336399
8505 1336399 1340664 1397170 1434493 1450148 1468625 1560324 1626368 1656858 1726009 1796871 1829809 1957871
8493 1957871 2066596 2114898 2082430 2095330 2186761 2266138 2314132 2308114 2284110 2312841 2428680
$$ packed form
8574C479666k51987j88958j04034j51347k60464k06227j32244j03567q9443j46262
8564A845133j17407m0641n3439p9908k9594k2265o3564o306M0840l9229m7181
8553A386439p3514l8351n0261l1620k9761k2925N1757N2488P511q0720p4228n1160
8541A045655m7566K3731M7035M9084N1738k5684m1204k791n3992k3385K5698O1948
8529A110267J8083J0604n046k423m7701k2083K6596M8435m958K025M0161L7612
8517A211572m7672n1929M9977K0343J1340K9600m093O7263O0053N6161o7652J436
8505A336399M265N6506L7323J5655J8477R1699O6044L0490O9151P0862L2938J28062
8493A957871J08725M8302l2468J2900R1431P9377M7994o018k4004K8731J15839
$$ plain form
8482 2428680 2364104 2274839 2221963 2126787 2057009 2068075 2055955 2014169 1966666 1875496 1855499
8471 1855499 1796587 1715587 1612391 1568344 1530935 1534203 1505485 1473501 1376093 1294096 1287806 1326297
8459 1326297 1266272 1151330 1113045 1157236 1213609 1188073 1092300 1062909 1055310 1053115 1044317 1093994
8447 1093994 1090358 995607 955097 981441 980160 892879 882040 877108 872765 826724 831029 886461
8435 886461 904347 847600 805220 777035 779944 799180 804785 827418 735288 677120 690151 688231
8423 688231 635326 638519 606151 539061 547298 596657 582941 606321 654099 670585 658170 652179
8411 652179 638689 647311 628105 617986 549650 538421 557047 557382 554454 549579 502367 510037 555387
8398 555387 592839 598756 545863 518938 477510 515051 541368 521557 482268 508674 572401 602455
$$ packed form
8482B428680o4576q9265n2876r5176o9778J1066j2120m1786m7503r1170j9997
8471A855499n8912q1000j03196m4047l7409L268k8718l1984r7408q1997o290L8491
8459A326297o0025j14942l8285M4191N6373k5536r5773k9391p599k195q798M9677
8447A093994l636r4751m0510K6344j281q7281j0839m932m343m6041M305N5432
8435H86461J7886n6747m2380k8185K909J9236N605K2633r2130n8168J3031j920
8423F88231n2905L193l2368o7090Q237M9359j3716K3380M7778J6486j2415n991
8411F52179j3490Q622j9206j0119o8336j1229J8626L35k928m875m7212P670M5350
8398E55387L7452N917n2893k6925m1428L7541K6317j9811l9289K6406O3727L0054
$$ plain form
8386 602455 597333 621336 561551 514735 507257 536486 529402 488573 414541 428240 456047 438588
8374 438588 417326 395403 386659 355044 312193 320692 409399 437203 474904 445647 429187 410797
8362 410797 384488 390462 393635 344847 347229 368874 349693 393977 403515 338641 378347 489002
8350 489002 501337 472345 425411 376191 340255 390579 497890 505055 509973 511239 526383 479777
8338 479777 378624 364142 358309 373560 369652 381296 360295 449968 475118 461143 450694 439375
8326 439375 465105 428580 406239 392817 389131 339427 357938 403596 431587 364003 342968 375285
8314 375285 323883 314209 262267 241359 282648 315529 282722 237763 226313 277564 271189 277576
8302 277576 352470 348958 358173 363299 400442 406224 444486 461298 475078 453224 388488 369526
$$ packed form
8386F02455n122K4003n9785m6816p478K9229p084m0829p4032J3699K7807j7459
8374D38588k1262k1923q744l1615m2851Q499Q8707K7804L7701k9257j6460j8390
8362D10797k6309N974L173m8788K382K1645j9181M4284R538o4874L9706J10655
8350D89002J2335k8992m6934m9220l5936N0324J07311P165M918J266J5144m6606
8338D79777j01153j4482n833J5251l908J1644k1001Q9673K5150j3975j0449j1319
8326D39375K5730l6525k2341j3422l686m9704J8511M5658K7991o7584k1035L2317
8314C75285n1402r674n1942k0908M1289L2881l2807m4959j1450N1251o375O387
8302B77576P4894l512R215N126L7143N782L8262J6812J3780k1854o4736j8962
$$ plain form
8290 369526 329696 312438 315903 320933 346581 360395 369509 365781 373367 329557 276842 269872 257898
8277 257898 221178 228974 281182 312447 316065 313438 348568 381858 367299 303180 288712 268920
8265 268920 258292 285059 329041 387832 410725 365371 395568 425745 371283 361694 356107 320000
8253 320000 260456 192976 208792 225505 272013 328192 315757 312946 308642 299385 307407 288484
8241 288484 280923 281375 332496 346016 313357 283412 259651 267864 288740 251665 226850 225522 269243
8228 269243 243096 190696 228963 219119 220325 252550 245462 235275 269098 294009 234880 248247
8216 248247 300106 292152 209739 208157 230194 240976 248683 218688 205710 209969 254835 222726
8204 222726 195855 205655 212946 221279 204615 243192 293228 268408 226066 213206 216705 209342 258985
$$ packed form
8290C69526l9830j7258L465N030K5648J3814R114l728P586m3810n2715o970j1974
8277B57898l6720P796N2208L1265L618k627L5130L3290j4559o4119j4468j9792
8265B68920j0628K6767M3982N8791K2893m5354L0197L0177n4462r589n587l6107
8253C20000n9544o7480J5816J6713M6508N6179j2435k811m304r257Q022j8923
8241B88484p561M52N1121J3520l2659k9945k3761Q213K0876l7075k4815j328M3721
8228B69243k6147n2400L8267r844J206L2225p088j0187L3823K4911n9129J3367
8216B48247N1859p954q2413j582K2037J0782P707k9995j2978M259M4866l2109
8204B22726k6871R800P291Q333j6664L8577N0036k4820m2342j2860L499p363M9643
$$ plain form
8191 258985 299645 353524 334141 361989 380476 343412 325259 337471 252070 208732 158695 75931
8179 75931 133479 209567 207943 153873 138158 143831 161179 137983 142632 264038 296038 261870
8167 261870 216914 267724 327036 277810 245047 273055 319116 287154 244170 220784 219488 263638
8155 263638 275357 253326 244627 256897 277902 253552 200895 192789 145590 125042 94955 159025
8143 159025 193405 227236 232869 273084 272056 222797 184756 168343 183038 188130 215625 242897
8131 242897 244473 198152 197138 213162 188679 152524 172336 185452 100704 94729 95967 85150
8119 85150 116530 143316 117376 81434 127078 171541 233789 278327 284643 231418 187771 185632
8107 185632 142340 161886 157281 182831 190884 155993 117928 88112 154263 129398 107380 174803
$$ packed form
8191B58985M0660N3879j9383K7848J8487l7064j8153J2212q5401m3338n0037q2764
8179G5931N7548P6088j624n4070j5715N673J7348k3196M649J21406L2000l4168
8167B61870m4956N0810N9312m9226l2763K8008M6061l1962m2984k3386j296M4150
8155B63638J1719k2031q699J2270K1005k4350n2657q106m7199k0548l0087O4070
8143A59025L4380L3831N633M0215j028m9259l8041j6413J4695N092K7495K7272
8131B42897J576m6321j014J6024k4483l6155J9812J3116q4748n975J238j0817
8119H5150L1380K6786k5940l5942M5644M4463O2248M4538O316n3225m3647k139
8107A85632m3292J9546m605K5550Q053l4891l8065k9816O6151k4865k2018O7423
$$ plain form
8095 174803 104831 106311 85170 133803 179630 214680 192524 193415 179092 149041 150175 145658 149788
8082 149788 163014 104014 128206 178572 216167 205658 144838 105828 139821 161791 194670 186681
8070 186681 211509 239517 325598 344664 298528 238249 173680 124829 141967 188159 227153 266147
8058 266147 255000 243466 250285 257503 226414 208936 240195 229076 268591 262035 221627 261270
8046 261270 254568 205971 232879 332705 369773 335125 299715 275801 271462 203834 177677 169880
8034 169880 214796 240629 293930 380326 423794 418116 398246 350157 369341 407477 395026 357575
8022 357575 319261 381162 422633 450003 481797 542479 565556 562973 548626 537695 557521 556965
8010 556965 532928 556974 517910 510497 539285 520927 455132 406737 458891 461918 425337 456859
$$ packed form
8095A74803o9972J480k1141M8633M5827L5050k2156Q91j4323l0051J134m517M130
8082A49788J3226n9000K4192N0366L7595j0509o0820l9010L3993K1970L2879p989
8070A86681K4828K8008Q6081J9066m6136o0279o4569m8851J7138M6192L8994L8994
8058B66147j1147j1534O819P218l1089j7478L1259j1119L9515o556m0408L9643
8046B61270o702m8597K6908R9826L7068l4648l5410k3914m339o7628k6157p797
8034A69880M4916K5833N3301Q6396M3468n678j9870m8089J9184L8136j2451l7451
8022C57575l8314O1901M1471K7370L1794O0682K3077k583j4347j0931J9826n56
8010E56965k4037K4046l9064p413K8788j8358o5795m8395N2154L027l6581L1522
$$ plain form
7998 456859 482613 486505 530990 490626 481385 538481 606046 661956 639069 667084 721072 771368
7986 771368 802611 762772 738321 780770 869428 946789 1107245 1213141 1289067 1357591 1302941
7975 1302941 1147539 1069547 1039142 963305 928437 882019 791836 766419 764232 761168 716743 716769
7963 716769 711100 668192 696860 754675 737126 728075 665652 635621 648480 712313 708048 681533
7951 681533 728004 768963 790334 813487 855360 880995 866661 877374 934967 979377 1049115 1094616
7939 1094616 1198089 1313098 1385166 1301108 1293840 1248581 1151837 1037744 1014321 999392 938459
7928 938459 881473 824114 773578 715609 686645 705815 710190 754096 738463 675069 703529 742513
7916 742513 728551 737396 724090 675138 684491 761601 814240 781065 734349 743472 792525 795011
$$ packed form
7998D56859K5754L892M4485m0364r241N7096O7565N5910k2887K8015N3988N0296
7986G71368L1243l9839k4451M2449Q8658P7361J60456J05896P5926O8524n4650
7975A302941j55402p7992l0405p5837l4868m6418r0183k5417k187l064m4425K6
7963G16769n669m2908K8668N7815j7549r051o2423l0031J2859O3833m265k6515
7951F81533M6471M0959K1371K3153M1873K5635j4334J0713N7593M4410O9738M5501
7939A094616J03473J15009P2068q4058p268m5259r6744j14093k3423j4929o0933
7928I38459n6986n7359n0536n7969k8964J9170M375M3906j5633o3394K8460L8984
7916G42513j3962Q845j3306m8952R353P7110N2639l3175m6716R123M9053K486
$$ plain form
7904 795011 760628 778898 849722 899678 845727 856143 873941 923576 939858 890090 829999 830367
7892 830367 819497 793097 762017 778900 771684 754648 703339 709372 738701 712273 704599 730514
7880 730514 714861 706446 701638 720493 742556 802289 855364 837516 822404 867987 851688 795737
7868 795737 776261 795230 798019 787148 870645 899597 816546 786774 799589 791652 788052 833095
7856 833095 812326 775887 701071 711969 692938 681703 672042 750503 759563 668493 607412 664857
7844 664857 719109 709816 702426 761022 701055 669878 700990 700684 682461 680951 690749 679761 618323
7831 618323 599324 615583 631013 641187 683731 692640 734138 780175 710360 658959 669344 715697
7819 715697 694600 697478 697156 655172 617717 656137 675901 665608 655104 606358 570456 552346
$$ packed form
7904G95011l4383J8270P0824M9956n3951J0416J7798M9635J6282m9768o0091L68
7892H30367j0870k6400l1080J6883p216j7036n1309O033K9329k6428p674K5915
7880G30514j5653q415m808J8855K2063N9733N3075j7848j5112M5583j6299n5951
7868G95737j9476J8969K789j0871Q3497K8952q3051k9772J2815p937l600M5043
7856H33095k0769l6439p4816J0898j9031j1235r661P8461R060r1070o1081N7445
7844F64857N4252r293p390N8596n9967l1177L1112l06j8223j510R798j0988o1438
7831F18323j8999J6259J5430J0174M2544Q909M1498M6037o9815n1401J0385M6353
7819G15697k1097K878l22m1984l7455L8420J9764j0293j0504m8746l5902j8110
$$ plain form
7807 552346 501393 502339 484586 433315 414826 403841 447263 510589 487627 495369 505522 471151
7795 471151 440832 477550 478297 442081 413820 381376 335718 350381 381197 417327 428027 423421
7783 423421 464203 471427 438406 405813 348819 353361 305174 335048 326738 348183 370442 355918
7771 355918 268918 234859 282414 300703 365866 344983 291685 341523 361382 375075 330035 248350
7759 248350 248295 263473 269591 254542 267852 280606 267737 256350 241740 213811 179294 189332
7747 189332 214350 210823 162486 149527 210722 262922 264812 224138 243924 276238 303123 318732
7735 318732 279354 233944 187041 178155 145582 110850 170556 256809 263212 224009 233278 215853
7723 215853 211233 213651 186859 110893 45571 130941 173865 213943 201527 201452 204903 171521 165913
$$ packed form
7807E52346n0953R46j7753n1271j8489j0985M3422O3326k2962P742J0153l4371
7795D71151l0319L6718P47l6216k8261l2444m5658J4663L0816L6130J0700m606
7783D23421M0782P224l3021l2593n6994M542m8187K9874q310K1445K2259j4524
7771C55918q7000l4059M7555J8289O5163k0883n3298M9838J9859J3693m5040q1685
7759B48350n5J5178O118j5049J3310J2754j2869j1387j4610k7929l4517J0038
7747A89332K5018l527m8337j2959O1195N2200J890m0674J9786L2314K6885J5609
7735C18732l9378m5410m6903q886l2573l4732N9706Q6253O403l9203R269j7425
7723B15853m620K418k6792p5966o5322Q5370M2924M0078j2416p5L451l3382n608
$$ plain form
7710 165913 146192 130733 155431 145674 141301 160521 170462 157861 167285 144118 107075 20056
7698 20056 23379 77639 111382 95254 131607 127246 88174 85057 128239 101516 94282 107806 69368
7685 69368 69851 91711 125318 131228 174868 107240 44571 66894 116995 119474 88377 122803 158994
7672 158994 149824 156720 75012 60562 44268 57014 64208 90584 155766 181557 95417 51314
7660 51314 49394 109713 116616 125331 126336 121509 111065 124338 88738 107460 165121 143454 101062
7647 101062 65312 -31504 -19227 -13755 -14574 45534 90630 91254 128995 111417 110591 174304 174734
7634 174734 112452 67121 102341 140040 146486 143179 87714 55878 59655 73230 67335 118296
7622 118296 58548 76702 120807 168242 145451 86105 100049 127305 132371 117850 151919 128364
$$ packed form
7710A65913j9721j5459K4698r757m373J9220R941j2601R424k3167l7043q7019
7698B0056L323N4260L3743j6128L6353m361l9072l117M3182k6723p234J3524l8438
7685F9368M83K1860L3607N910M3640o7628o2669K2323N0101K479l1097L4426L6191
7672A58994r170O896q1708j4450j6294J2746P194K6376O5182K5791q6140m4103
7660E1314j920O0319O903Q715J005m827j0444J3273l5600J8722N7661k1667m2392
7647A01062l5750r6816J2277N472q19O0108M5096O24L7741j7578q26O3713M30
7634A74734o2282m5331L5220L7699O446l307n5465l1836L777J3575n895N0961
7622A18296n9748J8154M4105M7435k2791n9346J3944K7256N066j4521L4069k3555
$$ plain form
7610 128364 99760 68317 110298 182410 132889 51876 11705 -40022 -65317 -64195 -84239 -37507
7598 -37507 -40826 -8646 52239 75893 53787 75653 97225 79278 59252 58192 103012 112825
7586 112825 78717 77015 91673 72663 30476 13739 28191 -16991 -60276 -29872 49074 64316
7574 64316 34800 44135 -24588 11242 7034 60501 83023 37720 12504 14862 33082 37994 74846
7561 74846 109194 62832 33745 31846 59530 58639 29383 68594 61368 43077 67135 118035 166953
7548 166953 141001 77805 46140 74042 47354 41865 70070 29152 102127 109691 17820 -17607
7536 -17607 74906 118272 70705 114131 142742 141653 89328 39154 -15936 7157 42262 94854
7524 94854 121059 90090 23607 29199 46931 73783 104848 97562 109637 100036 74758 48368
$$ packed form
7610A28364k8604l1443M1981P2112m9521q1013m0171n1727k5295J122k0044M6732
7598c7507l319L2180O0885K3654k2106K1866K1572j7947k0026j060M4820R813
7586A12825l4108j702J4658j9010m2187j6737J4452m5182m3285L0404P8946J5242
7574F4316k9516R335o8723L5830m208N3467K2522m5303k5216K358J8220M912L6852
7561G4846L4348m6362k9087j899K7684q91k9256L9211p226j8291K4058N0900M8918
7548A66953k5952o3196l1665K7902k6688n489K8205m0918P2975P564r1871l5427
7536a7607R2513M3366m7567M3426K8611j089n2325n0174n5090K3093L5105N2592
7524I4854K6205l0969o6483N592J7732K6852L1065p286J2075r601k5278k6390
$$ plain form
7512 48368 49519 51823 75309 105887 145124 82214 48247 46950 56139 -4788 -58430 -38436 7606
7499 7606 -4085 -15111 -18165 -30144 -16758 -29478 -45086 13243 10560 18122 32506 46527 34608
7486 34608 51968 10788 149 -16761 -13680 39726 44101 37369 24479 -18400 -61983 -97179
7474 -97179 -119485 -167084 -144097 -116901 -38968 -1799 13124 9793 -30003 -119996 -145913 -63853
7462 -63853 -3186 32809 -5553 -16624 18796 -33292 -28044 -6586 6804 4491 -27840 -63415
7450 -63415 -79117 -78458 -82217 -104996 -118618 -108135 -104477 -96681 -145058 -107447 -39444 -48291 -75510
7437 -75510 -91895 -99100 -114370 -85137 -13997 -66280 -59906 -7735 -9536 -42224 -52901 -76150
7425 -76150 -33103 -40222 17231 67389 73173 74002 51957 22833 50798 70450 12543 1332 -15212
$$ packed form
7512D8368J151K304K3486L0578L9237o2910l3967j297R189o0927n3642J9994M6042
7499G606j1691j1026l054j1979J3386j2720j5608N8329k683P562J4384J4021j1919
7486C4608J7360m1180j0639j6910L081N3406M375o732j2890m2879m3583l5196
7474i7179k2306m7599K2987K7196P7933L7169J4923l331l9796q9993k5917Q2060
7462f3853O0667L5995l8362j1071L5420n2088N248K1458J3390k313l2331l5575
7450f3415j5702O59l759k2779j3622J0483L658P796m8377L7611O8003q847k7219
7437g5510j6385p205j5270K9233P1140n2283O374N2171j801l2688j0677k3249
7425g6150M3047p119N7453N0158N784Q29k2045k9124K7965J9652n7907j1211j6544
$$ plain form
7412 -15212 -59005 -41884 -39391 -18145 -39080 -16153 48418 96100 59767 3757 -48699 -73574
7400 -73574 -57839 -48223 6884 4753 -47668 -15020 -12382 -92702 -49787 -55979 -61667 -83445 -97045
7387 -97045 -88702 -40036 -64700 -20895 21976 60812 71469 19558 -69014 -67523 -30643 11169
7375 11169 -6031 -18114 38122 56067 38215 51604 4183 -50220 -9786 26830 39079 46022
7363 46022 -1933 -20236 -19685 -29113 -24175 74 24583 18102 16940 -13202 303 -8603 -35557
7350 -35557 959 21059 66840 65746 -5709 15237 -4463 4792 27217 50249 28946 42091
7338 42091 111110 99464 63599 39937 -18043 -43784 5165 11901 -23542 -95637 -9442 36434
7326 36434 4628 -33386 -3189 -19945 -35669 -92388 -77869 31133 68326 -14615 -28336 -29598
$$ packed form
7412a5212m3793J7121K493K1246k0935K2927O4571M7682l6333n6010n2456k4875
7400g3574J5735R616N5107k131n2421L2648K638q0320M2915o192n688k1778j3600
7387i7045Q343M8666k4664M3805M2871L8836J0657n1911q8572J491L6880M1812
7375A1169j7200j2083N6236J7945j7852J3389m7421n4403M0434L6616J2249O943
7363D6022m7955j8303N51r428M938K4249K4509o481j162l0142J3505q906k6954
7350c5557L6516K0100M5781j094p1455K0946j9700R255K2425K3032k1303J3145
7338D2091O9019j1646l5865k3662n7980k5741M8949O736l5443p2095Q6195M5876
7326C6434l1806l8014L0197j6756j5724n6719J4519J09002L7193q2941j3721j262
$$ plain form
7314 -29598 -2095 -20606 -18608 -9956 7473 -2439 62147 79447 89297 89305 65211 63994 56144 36810
7300 36810 54888 31624 -30620 -53899 -55430 -20783 -20496 -41527 -89512 -63970 -53528 -71429
7288 -71429 -112956 -94222 -47382 -49885 -49976 -13267 37732 47748 -34703 -61765 -28616 -32960 -54818
7275 -54818 -12684 2755 17572 -31316 -40649 -46829 -13565 30622 68891 7958 -62827 -61127
7263 -61127 -27061 -88 -16546 -33067 -4139 -36663 -2067 6833 -15966 -28940 -10317 10458
7251 10458 -41212 -3381 50326 42578 -14115 -70975 -123300 -142413 -48364 -22062 23882 -34530
7239 -34530 -108345 14020 125130 112206 90791 70352 69808 24467 1813 -12455 41667 87081
7227 87081 28441 2812 -17612 -23490 40398 -37715 -101732 -99922 -75501 -101682 -137706 -79436
$$ packed form
7314b9598K7503j8511J998Q652J7429r912O4586J7300R850Qk4094j217p850j9334
7300C6810J8078k3264o2244k3279j531L4647K87k1031m7985K5542J0442j7901
7288g1429m1527J8734M6840k503r1L6709N0999J0016q2451k7062L3149m344k1858
7275e4818M2134J5439J4817m8888r333o180L3264M4187L8269o0933p0785J700
7263f1127L4066K6973j6458j6521K8928l2524L4596Q900k2799j2974J8623K0775
7251A0458n1670L7831N3707p748n6693n6860n2325j9113R4049K6302M5944n8412
7239c4530p3815J22365J11110j2924k1415k0439n44m5341k2654j4268N4122M5414
7227H7081n8640k5629k0424n878O3888p8113o4017J810K4421k6181l6024N8270
$$ plain form
7215 -79436 -97120 -113894 -120614 -86603 -56320 -58037 -79558 -73529 -33559 -31689 -126894 -91066 -70295
7202 -70295 -72438 -19770 41030 29669 -12474 -45571 -5807 3157 14885 3257 -14796 28395
7190 28395 50227 -47957 -92672 -64784 -53618 -62200 -36525 -41303 -20126 -54817 -71074 -100843
7178 -100843 -95583 -65880 -81006 -37874 -9996 9680 -24157 -35424 -42839 -86412 -121930 -42638
7166 -42638 -51687 -68805 -40504 -76032 -73147 -21580 -44857 -70724 -60045 -30818 7206 -32497
7154 -32497 -100206 -50754 -6513 27899 67119 58440 18585 -37523 -101726 -49540 26903 44519
7142 44519 -30928 -106984 -109106 -71817 -42799 2782 34297 -8835 -31229 -15265 -13812 -3823
7130 -3823 39832 18080 -46642 -133046 -98622 -75106 -4860 51442 66908 42399 39944 52510
$$ packed form
7215g9436j7684j6774o720L4011L0283j717k1521O029L9970J870r5205L5828K0771
7202g0295k143N2668O0800j1361m2143l3097L9764Q964J1728j1628j8053M3191
7190B8395K1832r8184m4715K7888J1166q582K5675m778K1177l4691j6257k9769
7178a00843N260K9703j5126M3132K7878J9676l3837j1267p415m3573l5518P9292
7166d2638r049j7118K8301l5528K885N1567k3277k5867J0679K9227L8024l9703
7154c2497o7709M9452M4241L4412L9220q679l9855n6108o4203N2186P6443J7616
7142D4519p5447p6056k122L7289K9018M5581L1515m3132k2394J5964J453R989
7130c823M3655k1752o4722q6404L4424K3516P0246N6302J5466k4509k455J2566
$$ plain form
7118 52510 -15174 -51036 -76689 -45156 -25613 -20738 -5613 -38515 -77408 -66778 -95934 -98203
7106 -98203 -49130 -11501 -19640 -33310 -1867 20268 -5120 -16614 -41022 -91439 -61311 -38103
7094 -38103 -54609 -126449 -98214 -95951 -115305 -58216 -3561 -13185 -17628 -4017 -37850 -44021 -83136
7081 -83136 -68416 47147 56898 57451 83212 77697 73503 18608 -34772 -62200 -67622 -53088 10026
7068 10026 -34132 -69390 -69120 -101763 -90995 -42723 -28064 -43618 -87199 -96114 -37407 -72674
7056 -72674 -76021 -62928 -72692 -101257 -108993 -57354 -37448 -22769 -13052 -64317 -74388 -56305 -3451
7043 -3451 2831 -12284 -59362 -58586 14589 58849 51130 -6803 -63801 -30918 -3213 -54803 -84360
7030 -84360 -133265 -93894 -80137 -1757 -17420 -82908 -63626 8858 4958 47991 63621 31222
$$ packed form
7118E2510o7684l5862k5653L1533J9543M875J5125l2902l8893J0630k9156k269
7106i8203M9073L7629q139j3670L1443K2135k5388j1494k4408n0417L0128K3208
7094c8103j6506p1840K8235K263j9354N7089N4655r624m443J3611l3833o171l9115
7081h3136J4720J15563R751N53K5761n515m194n4895n3380k7428n422J4534O3114
7068A0026m4158l5258K70l2643J0768M8272J4659j5554m3581q915N8707l5267
7056g2674l347J3093r764k8565p736N1639J9906J4679R717n1265j0071J8083N2854
7043c451O282j5115m7078P76P3175M4260p719n7933n6998L2883K7705n1590k9557
7030h4360m8905L9371J3757P8380j5663o5488J9282P2484l900M3033J5630l2399
$$ plain form
7018 31222 23190 34653 56281 49195 11461 -20361 -85659 -58804 -56374 -19075 35377 39001 47799
7005 47799 40533 35492 -8496 4145 24695 -21588 -67328 -74847 -20000 -1221 -67103 -110792
6993 -110792 -89936 -17590 13495 16909 -6842 4248 -25412 -31492 26506 18148 25306 -6565
6981 -6565 -9930 -42763 -91572 -117707 -44883 3241 -17999 -24359 -34098 -27454 3714 29615 2162
6968 2162 -84188 -43812 5116 41813 37270 -12271 -29508 7810 70787 74784 33258 -17496
6956 -17496 3866 73766 28226 23825 17692 -38939 -30727 -38206 -30303 -8472 -14321 55085 92484
6943 92484 46871 -6125 -96824 -84262 -26589 23952 23301 -41767 -29139 9587 72277 46089
6931 46089 -4453 -193 -8227 -23150 -22425 -68772 -31299 -42402 -139414 -119568 -96656 -98387 -84665
$$ packed form
7018C1222q032J1463K1628p086l7734l1822o5298K6855K430L7299N4452L624Q798
7005D7799p266n041m3988J2641K0550m6283m5740p519N4847J8779o5882m3689
6993a10792K0856P2346L1085L414k3751J1090k9660o080N7998q358P158l1871
6981f565l365l2833m8809k6135P2824M8124k1240o360r739O644L1168K5901k7453
6968B162q6350M0376M8928L6697m543m9541j7237L7318O2977L997m1526n0754
6956a7496K1362O9900m5540m401o133n6631Q212p479P903K1831n849O9406L7399
6943I2484m5613n2996r0699J2562N7673N0541o51o5068J2628L8726O2690k6188
6931D6089n0542M260q034j4923P25m6347L7473j1103r7012J9846K2912j731J3722
$$ plain form
6918 -84665 -32129 5537 -2026 -43079 -86705 -95097 -64220 -46195 -46310 -68135 -55437 -27216 34658
6905 34658 78207 48936 12698 -2944 5986 -4152 -32585 -63189 -29433 -31233 -78270 -79156 -80501
6892 -80501 -105299 -111786 -41830 10647 -11539 792 2848 5469 -22422 -122051 -158121 -149046 -83045
6879 -83045 -39926 -45457 -60202 -59845 -74850 -41982 -25219 14241 -33125 -33652 -41865 21543 49833
6866 49833 32114 39776 9630 467 -11220 -20494 28570 44534 10824 -55880 -67596 -29975
6854 -29975 -26763 -46457 -73236 -107103 -47826 61807 63490 3593 -26955 8213 14543 7984
6842 7984 -22664 -30297 47152 75411 37318 43765 43759 -5550 -63762 -84373 -28203 6359 29853
6829 29853 24233 26619 53394 65970 -8445 -61536 7323 -38741 -35914 -15695 -11874 29586 80009
$$ packed form
6918h4665N2536L7666p563m1053m3626q392L0877J8025j15k1825J2698K8221O1874
6905C4658M3549k9271l6238j5642Q930j0138k8433l0604L3756j800m7037q86j345
6892h0501k4798o487O9956N2477k2186J2331K056K621k7891r9629l6070R075O6001
6879h3045M3119n531j4745L57j5005L2868J6763L9460m7366n27q213O3408K8290
6866D9833j7719P662l0146r163j1687r274M9064J5964l3710o6704j1716L7621
6854b9975L212j9694k6779l3867N9277J09633J683n9897l0548L5168O330o559
6842G984l0648p633P7449K8259l8093O447om9309n8212k0611N6170L4562K3494
6829B9853n620K386K6775J2576p4415n3091O8859m6064K827K0219L821M1460N0423
$$ plain form
6816 80009 51644 -26631 -36486 -6578 17611 -27512 16055 49809 39143 57173 53419 -28975
6804 -28975 -65172 -94923 -108559 -95041 -46122 -17987 -8963 -47208 -50948 -5913 -7544 -26024
6792 -26024 -53009 -135753 -136796 -144213 -95368 -25384 28243 -9809 5822 39424 11110 -37281
6780 -37281 -13924 60160 -13692 -80732 -72568 -35172 -33219 -104125 -119619 -100961 -63506 -47330
6768 -47330 -79145 -127759 -160150 -141324 -61348 -1642 -24386 28421 1726 -20650 44297 24458
6756 24458 53332 79019 21011 43163 41531 -4795 -572 -5828 -12214 -20315 -39421 -42013 -63734
6743 -63734 -85511 -74216 -71585 -74727 -7781 53683 25417 43821 -34757 -31560 -25886 -48808 -41375
6730 -41375 -65041 -80559 -112324 -83350 -81548 -127672 -131272 -97460 -76270 -81082 -38461 -17982
$$ packed form
6816H0009k8365p8275r855K9908K4189m5123M3567L3754j0666J8030l754q2394
6804b8975l6197k9751j3636J3518M8919K8135R024l8245l740M5035j631j8480
6792b6024k6985q2744j043p417M8845O9984N3627l8052J5631L3602k8314m8391
6780c7281K3357P4084p3852o7040Q164L7396J953p0906j5494J8658L7455J6176
6768d7330l1815m8614l2391J8826P9976N9706k2744N2807k6695k2376O4947j9839
6756B4458K8874K5687n8008K2152j632m6326M223n256o386q101j9106k592k1721
6743f3734k1777J1295K631l142O6946O1464k8266J8404p8578L197N674k2922P433
6730d1375k3666j5518l1765K8974J802m6124l600L3812K1190m812M2621K0479
$$ plain form
6718 -17982 59700 65133 -25575 -39396 -39077 -47570 26594 76817 44722 -65758 -62439 -20326 21676
6705 21676 8880 -5803 -35805 -78652 -57040 -16786 7394 9340 -23841 -33518 -39871 -31186 -77423
6692 -77423 -75770 -5000 52907 24446 -74584 -138840 -156358 -133865 -135708 -55921 -58471 -75060
6680 -75060 -84560 -91160 -67625 23425 88721 78915 90317 36472 -23475 -121308 -148817 -54179
6668 -54179 -1867 41000 -9186 16984 40787 3112 9286 22595 35184 -20319 -89838 -59268
6656 -59268 -61823 -89655 -70031 -32760 -782 -2744 23412 62634 114338 92320 35579 -6659
6644 -6659 -8792 -5320 -10196 -46501 -113237 -72450 -26821 27862 28219 12569 -26473 14480 26346
6631 26346 6495 -14214 -31862 -44273 981 8569 43172 20465 30745 29305 8072 -39035
$$ packed form
6718a7982P7682N433r0708j3821L19q493P4164N0223l2095j10480L319M2113M2002
6705B1676j2796j4683l0002m2847K1612M0254K4180J946l3181r677o353Q685m6237
6692g7423J653P0770N7907k8461r9030o4256j7518K2493j843P9787k550j6589
6680g5060r500o600K3535R1050O5296r806J1402n3845n9947r7833k7509R4638
6668e4179N2312M2867n0186K6170K3803l7675O174J3309J2589n5503o9519L0570
6656e9268k555k7832J9624L7271L1978j962K6156L9222N1704k2018n6741m2238
6644f659k133L472m876l6305o6736M0787M5629N4683L57j5650l9042M0953J1866
6631B6346j9851k0709j7648j2411M5254P588L4603k2707J0280j440k1233m7107
$$ plain form
6619 -39035 -107969 -160571 -121510 -92600 -99780 -75667 -31519 -25545 -26063 -77247 -71067 -82147 -121947
6606 -121947 -92451 -76830 -30185 -44471 -68800 -61602 -40447 -55271 -48565 -54159 -72180 -42607
6594 -42607 -20958 -22151 7846 -8507 -23064 -11939 -6341 -40140 -42626 -30158 11965 -61841
6582 -61841 -46904 -39174 -61176 -63070 -23038 -64705 -113338 -79637 -30310 -260 12821 61079
6570 61079 72177 72332 78603 90476 45367 30124 48156 4615 -3665 -54919 -88487 -49753 -36829
6557 -36829 -31055 13192 75631 38457 -3505 45883 90105 81825 27532 -2193 -7755 -75358
6545 -75358 -86740 -26909 23181 64377 53861 36796 49731 37034 14073 -23534 12405 41559
6533 41559 58836 25744 -27323 -6462 19305 54331 10258 -27559 -39171 -66345 -38395 23327
$$ packed form
6619c9035o8934n2602L9061K8910p180K4113M4148N974n18n1184O180j1080l9800
6606a21947K9496J5621M6645j4286k4329P198K1155j4824O706n594j8021K9573
6594d2607K1649j193K9997j6353j4557J1125N598l3799k486J2468M2123p3806
6582f1841J4937P730k2002j894M0032m1667m8633L3701M9327L0050J3081M8258
6570F1079J1098J55O271J1873m5109j5243J8032m3541q280n1254l3568L8734J2924
6557c6829N774M4247O2439l7174m1962M9388M4222q280n4293k9725n562o7603
6545g5358j1382N9831N0090M1196j0516j7065J2935j2697k2961l7607L5939K9154
6533D1559J7277l3092n3067K0861K5767L5026m4073l7817j1612k7174K7950O1722
$$ plain form
6521 23327 53958 38314 -3195 -9536 -9242 -45296 -69019 -89326 -74452 -72581 -64502 -239 -9152
6508 -9152 34029 79465 112818 128936 70779 18583 -39469 -90683 -73695 -45999 -83557 -99794
6496 -99794 -105279 -23383 29522 81088 79340 22915 -14834 -16075 -15546 60048 133625 18763 -44232
6483 -44232 -18398 -87693 -65648 -33044 -69988 -86608 -85989 -64952 -28116 -32597 -36755 -429 43027
6470 43027 66170 2860 -3857 29290 41706 58486 18732 18740 -40134 -81571 -38254 -60820 -82891
6457 -82891 -20038 -25378 -64859 -78394 -87302 -100339 -104110 -86920 -52213 -15289 -84202 -76916 -34226
6444 -34226 -23651 33362 26150 6761 17458 -58501 -48254 -34202 -27000 44592 79473 40242
6432 40242 11404 7446 -37589 -75342 -48729 -52491 -80404 -70796 920 13028 8994 -5503 -23983
$$ packed form
6521B3327L0631j5644m1509o341K94l6054k3723k0307J4874J871Q079O4263q913
6508i152M3181M5436L3353J6118n8157n2196n8052n1214J6988K7696l7558j6237
6496i9794n485Q1896N2905N1566j748n6425l7749j241N29P5594P3577j14862o2995
6483d4232K5834o9295K2045L2604l6944j6620O19K1037L6836m481m158L6326M3456
6470D3027K3143o3310o717L3147J2416J6780l9754Qn8874m1437M3317k2566k2071
6457h2891O2853n340l9481j3535q908j3037l771J7190L4707L6924o8913P286M2690
6444c4226J0575N7013p212j9389J0697p5959J0247J4052P202P1592L4881l9231
6432D0242k8838l958m5035l7753K6613l762k7913R608P1716J2108m034j4497j8480
$$ plain form
6419 -23983 -31532 -47921 -74142 -61210 -39216 -13618 -2791 -2560 6163 -36099 -44099 -643 -6090
6406 -6090 2033 12632 -17651 7116 41007 26607 27072 57459 89067 53674 54922 39816 -17782
6393 -17782 -896 60222 76165 9337 -11401 -58797 -72944 -42156 -43713 -41163 -21478 -31805
6381 -31805 -50465 -34007 11240 20778 -10571 -41621 -74449 -49196 50732 45429 -12986 -47469
6369 -47469 -125501 -174925 -158832 -167787 -142571 -58538 -54822 -109930 -164810 -131712 -76835 -39727
6357 -39727 -11517 -35888 -42870 -61142 -7304 9086 -87343 -98975 -80557 -115702 -92431 -47375
6345 -47375 -56567 -2208 44784 23119 30003 6391 -38161 -10501 -8450 -7694 -67443 -38804 -13586
6332 -13586 -42389 -30922 -45369 -52323 -32825 20020 73904 65344 84154 53684 64587 42439
$$ packed form
6419b3983p549j6389k6221J2932K1994K5598J0827K31Q723m2262q000M3456n447
6406f090Q123J0599l0283K4767L3891j4400M65L0387L1608l5393J248j5106n7598
6393a7782J6886O1118J5943o6828k0738m7396j4147L0788j557K550J9685j0327
6381c1805j8660J6458M5247R538l1349l1050l2828K5253R9928n303n8415l4483
6369d7469p8032m9424J6093q955K5216Q4033L716n5108n4880L3098N4877L7108
6357c9727K8210k4371o982j8272N3838J6390r6429j1632J8418l5145K3271M5056
6345d7375r192N4359M6992k1665O884k3612m4552K7660K051P56n9749K8639K5218
6332a3586k8803J1467j4447o954J9498N2845N3884q560J8810l0470J0903k2148
$$ plain form
6320 42439 58181 71576 82411 68229 -42245 -81968 -55895 -30100 5953 19637 4025 -8869
6308 -8869 31314 43924 59449 79571 57229 64679 9893 -2436 31909 57997 -9322 -58968
6296 -58968 -28871 22853 -15085 -49417 -51501 -32272 29167 38049 72102 78566 75907 92729 48006
6283 48006 2289 -54585 -84511 -88401 -3132 42459 -36975 -73304 -75798 -71960 -117869 -107272
6271 -107272 -74509 -101824 -120578 -136369 -73863 -62272 -78562 -79820 -66338 -95825 -83630 -20950
6259 -20950 1975 -44419 -60744 -60523 -66229 -80036 -75954 -147181 -103642 -23129 24774 79013 103073
6246 103073 79774 65087 113149 95002 11389 -42756 -103600 -128567 -128986 -84069 -61172 -84245
6234 -84245 -55625 -66899 -59980 -8356 -28472 -76002 -23344 61682 42475 28165 43956 21453
$$ packed form
6320D2439J5742J3395J0835j4182j10474l9723K6073K5795L6053J3684j5612j2894
6308h869M0183J2610J5525K0122k2342P450n4786j2329L4345K6088o7319m9646
6296e8968L0097N1724l7938l4332k084J9229O1439Q882L4053O464k659J6822m4723
6283D8006m5717n6874k9926l890Q5269M5591p9434l6329k494L838m5909J0597
6271a07272L2763k7315j8754j5791O2506J1591j6290j258J3482k9487J2195O2680
6259b0950K2925m6394j6325K21n706j3807M082p1227M3539Q0513M7903N4239K4060
6246A03073k3299j4687M8062j8147q3613n4145o0844k4967m19M4917K2897k3073
6234h4245K8620j1274O919N1624k0116m7530N2658Q5026j9207j4310J5791k2503
$$ plain form
6222 21453 -3144 -26096 46461 91116 80262 50504 -16597 -61693 -69477 26610 21653 -35816
6210 -35816 -127647 -66068 -49193 -73712 -49746 -40394 -16414 -16802 -34667 -33173 41465 31743 23769
$$ packed form
6222B1453k4597k2952P2557M4655j0854k9758o7101m5096p784R6087m957n7469
6210c5816r1831O1579J6875k4519K3966R352K3980l88j7865J494P4638r722p974
$$ [...]
##END NTUPLES=NMR SPECTRUM
##END=
