##TITLE=Analysis number 311075
Compound Code cc 32913
Book Reference 422/81
Project Code adrs
Chemist Name robb
##JCAMPDX= 6.0         $$ Bruker NMR JCAMP-DX V2.0
##DATA TYPE= NMR SPECTRUM
##DATA CLASS= NTUPLES
##ORIGIN= Bruker BioSpin GmbH
##OWNER= NMR
$$ XWIN-NMR		Version 3.5
$$ Thu Jun 30 14:06:50 2005 GMT Daylight Time (UT+1h)  MAYBRIDGE\NMR@NMR_250MHZ
##.OBSERVE FREQUENCY= 250.131544655141
##.OBSERVE NUCLEUS= ^1H
##.ACQUISITION MODE= SIMULTANEOUS (DQD)
##.ACQUISITION SCHEME= undefined
##.AVERAGES= 16
##.DIGITISER RES= 18
##SPECTROMETER/DATA SYSTEM= dpx250
##.PULSE SEQUENCE= zg30
##.SOLVENT NAME= CDCl3
##.SHIFT REFERENCE= (INTERNAL, CDCl3, 0, 16.522)
##AUDIT TRAIL= $$ (NUMBER, WHEN, WHO, WHERE, WHAT)
$$ ##TITLE= Audit trail, XWIN-NMR		Version 3.5
$$ ##JCAMPDX= 5.01
$$ ##ORIGIN= Bruker BioSpin GmbH
$$ ##OWNER= NMR
$$ C:\u/data/dgb/nmr/ADRS/5110/pdata/1/auditp.txt
$$ ##AUDIT TRAIL=  $$ (NUMBER, WHEN, WHO, WHERE, WHAT)
(   1,<2005-06-30 14:06:27.27 +100>,<MAYBRIDGE\NMR>,<NMR_250MHZ>,
      <created by zg, POWCHK disabled, PULCHK disabled
       configuration hash MD5:
       62 19 C7 07 E1 42 D1 B7 37 6C 3D D0 77 39 F9 E6
       data hash MD5: 64K
       0F 83 FD BB F8 0C F1 25 9F B5 35 79 32 7B 8E 8C>)
(   2,<2005-06-30 14:06:41.38 +100>,<MAYBRIDGE\NMR>,<NMR_250MHZ>,
      <Start of raw data processing
       ef LB = 0.3 FT_mod = 6 PKNL = 1 SI = 32K 
       data hash MD5: 32K
       10 8E 95 12 A2 E4 EB 37 2E 0C 6B 5C 0C D1 8B 39>)
(   3,<2005-06-30 14:06:43.24 +100>,<MAYBRIDGE\NMR>,<NMR_250MHZ>,
      <apk 
       data hash MD5: 32K
       B0 98 E0 AE DB BC 1D BA D7 90 64 96 8B 31 81 5F>)
(   4,<2005-06-30 14:06:44.02 +100>,<MAYBRIDGE\NMR>,<NMR_250MHZ>,
      <abs ABSG = 5 
       data hash MD5: 32K
       E1 DF 34 A7 FF 80 FB E7 ED 2C 84 D0 7A E6 44 4F>)
$$ ##END=
$$ 
$$ hash MD5
$$ E0 A5 56 1E 4B 50 BB C7 1C B0 36 E5 75 E7 B0 72
##$RELAX= 
##$RELAX= 
##$RELAX= 
##$RELAX= 
##$RELAX= 
##$RELAX= 
##$RELAX= 
$$ Bruker specific parameters
$$ --------------------------
##$DU= <C:\u>
##$EXPNO= 5110
##$NAME= <ADRS>
##$PROCNO= 1
##$TYPE= <nmr>
##$USER= <dgb>
##$AMP= (0..31)
100 100 100 100 100 100 100 100 100 100 100 100 100 100 100 100 100 100 
100 100 100 100 100 100 100 100 100 100 100 100 100 100 
##$AQSEQ= 0
##$AQ_mod= 3
##$AUNM= <au_zg>
##$AUTOPOS= <47 >
##$BF1= 250.13
##$BF2= 250.13
##$BF3= 250.13
##$BF4= 250.13
##$BF5= 500.13
##$BF6= 500.13
##$BF7= 500.13
##$BF8= 500.13
##$BYTORDA= 1
##$CFDGTYP= 0
##$CFRGTYP= 5
##$CHEMSTR= <none>
##$CNST= (0..31)
1 1 145 1 1 1 1 1 1 1 1 1 1 1 1 1 1 1 1 1 1 1 1 1 1 1 1 1 1 1 1 1 
##$CPDPRG= <>
##$CPDPRG1= <>
##$CPDPRG2= <>
##$CPDPRG3= <>
##$CPDPRG4= <mlev>
##$CPDPRG5= <mlev>
##$CPDPRG6= <mlev>
##$CPDPRG7= <mlev>
##$CPDPRG8= <mlev>
##$CPDPRGB= <>
##$CPDPRGT= <>
##$D= (0..31)
0 1 0 0 0 0 0 0 0 0.06 0 0 0 0 0 0 0.0002 0 0 0 0 0 0 0 0 0 0 0 0 0 0 
0 
##$DATE= 1120136785
##$DBL= (0..7)
120 120 120 120 120 120 120 120 
##$DBP= (0..7)
150 150 150 150 150 150 150 150 
##$DBP07= 0
##$DBPNAM0= <>
##$DBPNAM1= <>
$$ [...]
##$SUBNAM7= <"">
##$SUBNAM8= <"">
##$SUBNAM9= <"">
##$SW= 20.6930455092707
##$SWIBOX= (0..15)
0 0 3 0 0 0 0 0 0 0 0 0 0 0 0 0 
##$SW_h= 5175.983436853
##$TD= 65536
##$TD0= 1
##$TE= 295.16
##$TE2= 300
##$TE3= 300
##$TEG= 300
##$TL= (0..7)
0 120 120 120 120 120 120 120 
##$TP= (0..7)
150 150 150 150 150 150 150 150 
##$TP07= 0
##$TPNAME0= <>
##$TPNAME1= <>
##$TPNAME2= <>
##$TPNAME3= <>
##$TPNAME4= <>
##$TPNAME5= <>
##$TPNAME6= <>
##$TPNAME7= <>
##$TPOAL= (0..7)
0.5 0.5 0.5 0.5 0.5 0.5 0.5 0.5 
##$TPOFFS= (0..7)
0 0 0 0 0 0 0 0 
##$TUNHIN= 0
##$TUNHOUT= 0
##$TUNXOUT= 0
##$USERA1= <user>
##$USERA2= <user>
##$USERA3= <user>
##$USERA4= <user>
##$USERA5= <user>
##$V9= 5
##$VALIST= <valist>
##$VCLIST= <CCCCCCCCCCCCCCC>
##$VD= 0
##$VDLIST= <DDDDDDDDDDDDDDD>
##$VPLIST= <PPPPPPPPPPPPPPP>
##$VTLIST= <TTTTTTTTTTTTTTT>
##$WBST= 1024
##$WBSW= 4
##$XGAIN= (0..3)
0 0 0 0 
##$XL= 0
##$YL= 0
##$YMAX_a= 293505
##$YMIN_a= -467022
##$ZGOPTNS= <>
##$ZL1= 120
##$ZL2= 120
##$ZL3= 120
##$ZL4= 120
##$ABSF1= 16.522
##$ABSF2= -4.171173
##$ABSG= 5
##$ABSL= 3
##$ALPHA= 0
##$AQORDER= 0
##$ASSFAC= 0
##$ASSFACI= 0
##$ASSFACX= 0
##$ASSWID= 0
##$AUNMP= <proc_1d>
##$AZFE= 0.1
##$AZFW= 0.1
##$BCFW= 0
##$BC_mod= 0
##$BYTORDP= 0
##$COROFFS= 0
##$CY= 12.5
##$DATMOD= 1
##$DC= 0
##$DFILT= <>
##$DTYPP= 0
##$F1P= 14.0000005364418
##$F2P= -0.99999901652339
##$FCOR= 0.5
##$FTSIZE= 32768
##$FT_mod= 6
##$GAMMA= 0
##$GB= 0
##$INTBC= 1
##$INTSCL= 1
##$ISEN= 128
##$LB= 0.3
##$LEV0= 0
##$LPBIN= 0
##$MAXI= 10000
##$MC2= 0
##$MEAN= 0
##$ME_mod= 0
##$MI= 0
##$NCOEF= 0
##$NC_proc= -5
##$NLEV= 6
##$NOISF1= 0
##$NOISF2= 0
##$NSP= 0
##$NTH_PI= 0
##$NZP= 0
##$OFFSET= 16.522
##$PC= 1
##$PHC0= 127.5665
##$PHC1= 7.454439
##$PH_mod= 1
##$PKNL= yes
##$PPARMOD= 0
##$PSCAL= 4
##$PSIGN= 0
##$REVERSE= no
##$SF= 250.13
##$SI= 32768
##$SIGF1= 0
##$SIGF2= 0
##$SINO= 400
##$SIOLD= 32768
##$SREGLST= <1H.CDCl3>
##$SSB= 0
##$STSI= 32768
##$STSR= 0
##$SW_p= 5175.98343685301
##$SYMM= 0
##$S_DEV= 0
##$TDeff= 65536
##$TDoff= 0
##$TI= <Analysis number 999999
Compound Code 99
Book Reference 9
Project Code 9>
##$TILT= no
##$TM1= 0
##$TM2= 0
##$TOPLEV= 0
##$USERP1= <user>
##$USERP2= <user>
##$USERP3= <user>
##$USERP4= <user>
##$USERP5= <user>
##$WDW= 1
##$XDIM= 32768
##$YMAX_p= 480823445
##$YMIN_p= -85656
$$ End of Bruker specific parameters
$$ ---------------------------------
##NTUPLES= NMR SPECTRUM
##VAR_NAME=  FREQUENCY,     SPECTRUM/REAL,   SPECTRUM/IMAG
##SYMBOL=    X,             R,               I
##VAR_TYPE=  INDEPENDENT,   DEPENDENT,       DEPENDENT
##VAR_FORM=  AFFN,          ASDF,            ASDF
##VAR_DIM=   32768,         32768,           32768
##UNITS=     HZ,            ARBITRARY UNITS, ARBITRARY UNITS
##FACTOR=    0.157963299565203, 1,           1
##FIRST=     4132.6476996994, 0,             0
##LAST=      -1043.33573715361, 0,           0
##MIN=       -1043.33573715361, -85656,      0
##MAX=       4132.6476996994, 480823445,     0
$$ Real data points
##PAGE= N=1
##DATA TABLE= (X++(R..R)), XYDATA
$$ [...]
$$ plain form
18404 14667237 13976806 13312827 12682259 12103095 11522785 10966434 10449671 9949534 9474099
18395 9474099 9037922 8649183 8284087 7890339 7527143 7222924 6930884 6638484 6374718
18386 6374718 6138222 5903112 5700313 5505615 5313595 5139603 4965827 4798817 4650601
18377 4650601 4512887 4397444 4272064 4158709 4025295 3881458 3739787 3610945 3480054
18368 3480054 3351153 3230648 3151111 3060468 2965415 2904887 2862614 2786306 2718293 2656698 2612421
18357 2612421 2571201 2524953 2502623 2470121 2417372 2365427 2339471 2344153 2361292 2343724 2325658
18346 2325658 2325154 2317754 2315575 2317896 2323727 2312677 2331507 2377364 2416709 2458487 2522858 2570475
18334 2570475 2615791 2698225 2789808 2885911 2990977 3118809 3225698 3324685 3429265 3523469
$$ packed form
18404A4667237o90431o63979o30568n79164n80310n56351n16763n00137m75435
18395I474099m36177l88739l65096l93748l63196l04219k92040k92400k63766
18386F374718k36496k35110k02799j94698j92020j73992j73776j67010j48216
18377D650601j37714j15443j25380j13355j33414j43837j41671j28842j30891
18368C480054j28901j20505p9537r0643r5053o0528m2273p6308o8013o1595m4277
18357B612421m1220m6248k2330l2502n2749n1945k5956M682J7139j7568j8066
18346B325658n04p400k179K321N831j1050J8830M5857L9345M1778O4371M7617
18334B570475M5316Q2434R1583R6103J05066J27832J06889R8987J04580R4204
$$ plain form
18324 3523469 3600577 3657004 3684494 3696176 3721671 3726607 3724670 3767603 3836540 3915947 4059905
18313 4059905 4230473 4465634 4821687 5320088 6034993 7005723 8324253 10121872 12569679
18304 12569679 15979008 20837791 27662590 36665587 47565901 59243597 69856979 77615223
18296 77615223 80837257 79057351 73372720 64747978 54781831 45509561 38103831 32873928
18288 32873928 29289238 26796255 25036134 23813277 22982911 22443382 22091725 21873470 21783902
18279 21783902 21780438 21820461 21895190 22012068 22144513 22289088 22402731 22471885 22469300 22368247
18269 22368247 22181751 21943044 21741176 21545995 21415060 21389524 21493967 21800508 22414953
18260 22414953 23448405 25068069 27502785 31065375 36231364 43667609 54150292 68110773
$$ packed form
18324C523469P7108N6427K7490J1682K5495M936j937M2933O8937P9407J43958
18313D059905J70568K35161L56053M98401P14905R70730J318530J797619K447807
18304A2569679L409329M858783O824799R002997J0900314J1677696J0613382P758244
18296G7615223L222034j779906n684631q624742r966147r272270p405730n229903
18288C2873928l584690k492983j760121j222857q30366n39529l51657k18255q9568
18279B1783902l464M0023P4729J16878J32445J44575J13643O9154k585j01053
18269B2368247j86496k38707k01868j95181j30935k5536J04443L06541O14445
18260B2414953J033452J619664K434716L562590N165989P436245J0482683J3960481
$$ plain form
18252 68110773 85352865 104463671 123110351 138667653 148200387 150453904 145867394
18245 145867394 134860044 119780532 103815402 88786671 75963688 65842781 58260258
18238 58260258 52827702 48947018 46130550 44047643 42486670 41297496 40412453 39762240
18230 39762240 39332781 39035164 38841652 38759122 38761886 38753050 38675953 38496953 38188920 37729355
18220 37729355 37141746 36444446 35688458 34916689 34130337 33316666 32508516 31756136 31134325
18211 31134325 30664700 30450821 30565014 31088162 32168544 33972622 36807038 41063383 47239029
18202 47239029 55427350 65204800 75230984 83787823 89138978 89821709 86051287 78866607
18194 78866607 69313810 59208630 50253026 43269451 38310422 34800405 32214332 30234592
$$ packed form
18252F8110773J7242092J9110806J8646680J5557302R532734K253517m586510
18245A45867394j1007350j5079512j5965130j5028731j2822983j0120907p582523
18238E8260258n432556l880684k816468k082907j560973j189174q85043o50213
18230C9762240m29459k97617j93512q2530K764q836p7097j79000l08033m59565
18220C7729355n87609o97300p55988p71769p86352q13671q08150p52380o21811
18211C1134325m69625k13879J14193N23148J080382J804078K834416M256345O175646
18202D7239029Q188321R777450J0026184Q556839N351155O82731l770422p184680
18194G8866607r552797j0105180q955604o983575m959029l510017k586073j979740
$$ plain form
18186 30234592 28721665 27519881 26532000 25733711 25084314 24514988 24041217 23658559 23362258
18177 23362258 23132917 22960448 22789662 22561549 22289889 21923111 21467280 20942545 20343674
18168 20343674 19714996 19107796 18506066 17902001 17282159 16655639 16051427 15444184 14866364
18159 14866364 14348222 13885160 13454029 13052255 12657503 12248302 11811939 11349148 10840756
18150 10840756 10342589 9857381 9388560 8952534 8533847 8166762 7827815 7487991 7156507
18141 7156507 6854111 6582204 6325494 6065764 5812355 5563054 5343615 5189007 5041077
18132 5041077 4889280 4763069 4647688 4531281 4413663 4296225 4201359 4118290 4017192 3928214
18122 3928214 3871783 3823011 3795558 3851494 3995638 4250089 4627999 5193223 6054942 7475427
$$ packed form
18186C0234592j512927j201784r87881p98289o49397n69326m73771l82658k96301
18177B3362258k29341j72469j70786k28113k71660l66778m55831n24735n98871
18168B0343674o28678o07200o01730o04065o19842o26520o04212o07243n77820
18159A4866364n18142m63062m31131m01774l94752m09201m36363m62791n08392
18150A0840756m98167m85208m68821m36026m18687l67085l38947l39824l31484
18141G156507l02396k71907k56710k59730k53409k49301k19439j54608j47930
18132E041077j51797j26211j15381j16407j17618j17438r4866q3069j01098q8978
18122C928214n6431m8772k7453N5936J44144K54451L77910N65224Q61719J420485
$$ plain form
18112 7475427 9819360 13170792 16357591 18450563 19223601 16952378 12805225 9886992
18104 9886992 8206928 7183265 6499225 5993746 5614860 5351102 5170013 5043955 4960823
18095 4960823 4896040 4836512 4807556 4792096 4778867 4766361 4778813 4806881 4833513 4848199 4859006
18084 4859006 4883500 4890880 4865460 4820853 4751113 4711728 4703027 4692215 4678298 4600396 4514683 4423426
18072 4423426 4313678 4211375 4119422 4053369 4005616 3984341 3963927 3920238 3885173 3837263 3780986
18061 3780986 3722717 3650651 3587504 3544655 3515907 3505977 3490232 3478882 3488835 3507773 3488050 3502995
18049 3502995 3548155 3602670 3667843 3734018 3819417 3901902 4014371 4154366 4295290 4430663
18039 4430663 4544631 4699052 4887277 5074888 5288862 5553696 5870564 6245635 6706379
$$ packed form
18112G475427K343933L351432L186799K092972P73038k271223m147153k918233
18104I886992j680064j023663o84040n05479l78886k63758j81089j26058q3132
18095D960823o4783n9528k8956j5460j3229j2506J2452K8068K6632J4686J0807
18084D859006K4494P380k5420m4607o9740l9385q701j0812j3917p7902q5713r1257
18072D423426j09748j02303r1953o6053m7753k1275k0414m3689l5065m7910n6277
18061C780986n8269p2066o3147m2849k8748r930j5745j1350R953J8938j9723J4945
18049C502995M5160N4515O5173O6175Q5399Q2485J12469J39995J40924J35373
18039D430663J13968J54421J88225J87611K13974K64834L16868L75071M60744
$$ plain form
18030 6706379 7274259 7991787 8922676 10171691 11882207 14263279 17607935 21921469 26837658
18021 26837658 32225843 38162882 44235314 50060570 56028457 62316688 67404734 71230181
18013 71230181 76027369 81812350 86811974 90644213 94238398 96613260 96889049 97015986
18005 97015986 97243069 95424743 92204744 89633318 87573026 84895920 82000317 79150465
17997 79150465 74916202 69684352 65236507 61548519 57668479 53569912 50196031 47805942
17989 47805942 46151958 44982205 44101397 43429031 42937905 42535132 42170579 41902304 41747758
17980 41747758 41713963 41858887 42330577 43237284 44766142 46939287 49554161 52492065 55786893
17971 55786893 59154316 62339324 65626339 69101553 71655509 73352563 75808470 78933553
$$ packed form
18030F706379N67880P17528R30889J249015J710516K381072L344656M313534M916189
18021B6837658N388185N937039O072432N825256N967887O288231N088046L825447
18013G1230181M797188N784981M999624L832239L594185K374862K75789J26937
18005I7015986K27083j818326l219999k571426k060292k677106k895603k849852
17997G9150465m234263n231850m447845l687988l880040m098567l373881k390089
17989D7805942j653984j169753q80808o72366m91126m02773l64553k68275j54546
17980D1747758l3795J44924M71690R06707J528858K173145K614874K937904L294828
17971E5786893L367423L185008L287015L475214K553956J697054K455907L125083
$$ plain form
17963 78933553 81435834 83187238 84835522 85621830 85037991 84457103 83713396 81423727 78328799
17954 78328799 75816948 73588403 70863683 68052594 65303542 61584885 57364256 53775944
17946 53775944 50669243 47390588 44068572 41333097 39272198 37682237 36422645 35369581
17938 35369581 34462001 33648315 32907718 32187876 31504454 30820620 30162438 29440233 28689902
17929 28689902 27976196 27232367 26477245 25711386 24943751 24160375 23373534 22592054 21803377
17920 21803377 21040679 20311785 19572831 18844718 18120057 17405326 16711671 16015648 15320241
17911 15320241 14645056 14008388 13378073 12755629 12167879 11608395 11071562 10554327 10052583
17902 10052583 9571366 9101084 8676608 8260694 7886747 7544592 7199488 6853252 6524537
$$ packed form
17963G8933553K502281J751404J648284P86308n83839n80888p43707k289669l094928
17954G8328799k511851k228545k724720k811089k749052l718657m220629l588312
17946E3775944l106701l278655l322016k735475k060899j589961j259592j053064
17938C5369581r07580q13686p40597p19842o83422o83834o58182p22205p50331
17929B8689902p13706p43829p55122p65859p67635p83376p86841p81480p88677
17920B1803377p62698p28894p38954p28113p24661p14731o93655o96023o95407
17911A5320241o75185o36668o30315o22444n87750n59484n36833n17235n01744
17902A0052583m81217m70282m24476m15914l73947l42155l45104l46236l28715
$$ plain form
17893 6524537 6222166 5931460 5664159 5424143 5197503 4993051 4808776 4616957 4415930
17884 4415930 4206375 4015612 3854258 3703721 3563022 3408590 3252895 3129825 3005677
17875 3005677 2873324 2737349 2591766 2482660 2396288 2310576 2219970 2143821 2064195 1995179
17865 1995179 1933962 1854695 1804563 1766494 1714328 1650538 1604258 1568062 1524838 1484670 1454131
17854 1454131 1418422 1390327 1371495 1346890 1334228 1328681 1307732 1285857 1270536 1267190 1259378 1265949
17842 1265949 1267171 1275953 1273510 1246723 1222755 1226660 1235825 1231325 1223347 1203386 1184457 1167151 1136849
17829 1136849 1118981 1102693 1093442 1078616 1079852 1073570 1076279 1072257 1064872 1047098 1052220 1036368 1021243
17816 1021243 1031744 1013139 996467 1001154 1015712 1007499 989630 978113 983881 984639 987336 980619 982452
$$ packed form
17893F524537l02371k90706k67301k40016k26640k04452j84275j91819k01027
17884D415930k09555j90763j61354j50537j40699j54432j55695j23070j24148
17875C005677j32353j35975j45583j09106q6372q5712r0606p6149p9626o9016
17865A995179o1217p9267n0132l8069n2166o3790m6280l6196m3224m0168l0539
17854A454131l5709k8095j8832k4605j2662n547k0949k1875j5321l346p812O571
17842A265949J222Q782k443k6787k3968L905R165m500p978j9961j8929j7306l0302
17829A136849j7868j6288r251j4826J236o282K709m022p385j7774N122j5852j5125
17816A021243J0501j8605j6672M687J4558q213j7869j1517N768P58K697o717J833
$$ plain form
17803 982452 975038 961309 988640 991446 996694 978865 985670 1023671 1057987 1078596 1103104 1086543
17791 1086543 1083105 1121026 1151191 1169818 1221533 1265417 1324239 1385018 1402521 1402240 1413567 1366216
17779 1366216 1289735 1227134 1193326 1153688 1101409 1065902 1038657 1032747 1009436 984532 953700
17768 953700 960242 954239 952699 947464 939192 928071 925793 939793 942073 935901 908735 897206 887406
17755 887406 900374 903002 895660 883459 852703 837159 820679 806358 778369 783560 792377 785138
17743 785138 775962 790513 792697 812688 862725 912381 951662 1026525 1106520 1177154 1221306 1250584
17731 1250584 1234446 1180323 1107159 1006224 914809 850163 791902 735425 699934 695523 680098
17720 680098 657334 632595 610136 609745 596171 600578 622469 637222 649512 649915 667299 660914 635910
$$ packed form
17803I82452p414j3729K7331K806N248j7829O805L8001L4316K0609K4508j6561
17791A086543l438L7921L0165J8627N1715M3884N8822O0779J7503k81J1327m7351
17779A366216p6481o2601l3808l9638n2279l5507k7245n910k3311k4904l0832
17768I53700O542o003j540n235q272j1121k278J4000K280o172k7166j1529r800
17755H87406J2968K628p342j2201l0756j5544j6480j4321k7989N191Q817p239
17743G85138r176J4551K184J9991N0037M9656L9281P4863P9995P0634M4152K9278
17731A250584j6138n4123p3164j00935r1415o4646n8261n6477l5491m411j5425
17720F80098k2764k4739k2459l91j3574M407K1891J4753J2290M03J7384o385k5004
$$ plain form
17707 635910 630232 636151 649047 652509 647098 642385 624207 605497 591441 588142 572477 554189 543404
17694 543404 528979 534393 545775 564903 567040 582060 593295 622331 656027 696228 738700 758666
17682 758666 738603 718308 691138 638897 598412 564673 533018 507952 492707 485024 478119 445417
17670 445417 452920 458371 429148 428483 445521 452757 459095 459902 439127 422276 387939 382768 388258
17657 388258 380946 391412 399532 385173 381652 390794 380964 385674 384527 371484 373828 383927 363657
17644 363657 336073 346673 353866 335059 312085 326950 335474 333174 340683 352866 354155 350904 341886
17631 341886 334963 339175 321202 333175 344105 350604 370393 365255 368734 376892 397985 414307 412773
17618 412773 424813 435593 452606 454871 430919 403656 396799 375300 339525 314521 272801 246314
$$ packed form
17707F35910n678N919J2896L462n411m713j8178j8710j4056l299j5665j8288j0785
17694E43404j4425N414J1382J9128K137J5020J1235K9036L3696M0201M2472J9966
17682G58666k0063k0295k7170n2241m0485l3739l1655k5066j5245p683o905l2702
17670D45417P503N451k9223o65J7038P236O338Q07k0775j6851l4337n171N490
17657C88258p312J0466Q120j4359l521R142r830M710j147j3043K344J0099k0270
17644C63657k7584J0600P193j8807k2974J4865Q524k300P509J2183J289l251r018
17631C41886o923M212j7973J1973J0930O499J9789n138L479Q158K1093J6322j534
17618D12773J2040J0780J7013K265k3952k7263o857k1499l5775k5004m1720k6487
$$ plain form
17606 246314 255325 262213 252175 246395 238796 227916 226688 239904 246348 225432 211277 191835 192380
17593 192380 202940 211997 212136 207735 199961 206775 210321 211826 208877 186413 188529 213034 211526 208701
17579 208701 221932 223489 206605 194753 198463 177174 164002 150060 143328 145979 150080 151965 150006
17566 150006 151223 177594 175053 157495 152082 144064 142219 133785 130743 123416 134026 141247 142661
17553 142661 135656 131570 142350 125791 105510 101430 100431 101924 118827 129354 136315 147497 148845
17540 148845 144267 149164 145047 127717 127455 146654 165781 158418 153182 128819 101853 116062 138656
17527 138656 146582 152802 142348 136848 133698 137056 153514 168038 193353 235857 265111 293713
17515 293713 324699 346684 362074 399545 430010 447965 475969 498503 546245 566300 578764
$$ packed form
17606B46314R011O888j0038n780p599j0880j228J3216O444k0916j4155j9442N45
17593A92380J0560R057J39m401p774O814L546J505k949k2464K116K4505j508k825
17579B08701J3231J557j6884j1852L710k1289j3172j3942o732K651M101J885j959
17566A50006J217K6371k541j7558n413q018j845q434l042p327J0610P221J414
17553A42661p005m086J0780j6559k0281m080r99J493J6903J0527O961J1182J348
17540A48845m578M897m117j7330k62J9199J9127p363n236k4363k6966J4209K2594
17527A38656P926O220j0454n500l150L358J6458J4524K5315M2504K9254K8602
17515B93713L0986K1985J5390L7471L0465J7955K8004K2534M7742K0055J2464
$$ plain form
17504 578764 578651 596663 617563 602335 588588 569450 551884 544580 524570 507545 491444 478083
17492 478083 468907 448295 430218 413680 393611 360556 344869 337000 316712 305889 314136 332872
17480 332872 324976 320180 309241 303470 311628 312145 303761 313651 334005 349879 355459 389450 417287
17467 417287 427517 455029 486712 511828 534248 541295 546714 571286 595491 598605 595247 596760
17455 596760 600359 606819 591840 593683 598261 576051 569296 552775 530227 520972 518322 498183 499145
17442 499145 493263 480047 452290 428443 408844 401947 384167 344217 330937 324839 322143 317549
17430 317549 302716 292701 294769 301020 298036 288205 288543 281545 260589 260482 267498 255741 245333
17417 245333 247473 259932 266207 269773 268814 272095 277626 254640 241883 250076 245014 222393 194891
$$ packed form
17504E78764j13J8012K0900j5228j3747j9138j7566p304k0010j7025j6101j3361
17492D78083r176k0612j8077j6538k0069l3055j5687p869k0288j0823Q247J8736
17480C32872p896m796j0939n771Q158N17q384R890K0354J5874N580L3991K7837
17467D17287J0230K7512L1683K5116K2420P047N419K4572K4205L114l358J513
17455E96760L599O460j4979J843M578k2210o755j6521k2548r255k650k0139R62
17442D99145n882j3216k7757k3847j9599o897j7780l9950j3280o098k696m594
17430C17549j4833j0015K068O251k984r831L38o998k0956j07P016j1757j0408
17417B45333K140J2459O275L566r59L281N531k2986j2757Q193n062k2621k7502
$$ plain form
17404 194891 204306 199824 182564 173062 183523 211592 219442 208654 191579 177567 165947 176507
17392 176507 178299 150223 146635 127731 114254 125455 136417 131581 118229 114916 118944 114488 125607
17379 125607 128713 126187 108002 103953 96469 99976 105374 114160 107963 80399 50395 76144 114920
17366 114920 134445 158323 161526 136462 123946 138998 154407 154423 154568 165429 203984 192266 169579
17353 169579 174792 166312 177594 180620 175138 201089 223985 239259 244296 263287 260678 288829 332629
17340 332629 367759 437794 532144 616734 677882 699667 665102 624262 578584 536731 538500 565501
17328 565501 604920 673897 768322 846172 895607 929825 947531 942383 938586 896999 824089 762941
17316 762941 718201 670278 656166 660547 704403 764349 813581 856484 849088 802694 731982 647094
$$ packed form
17404A94891R415m482j7260r502J0461K8069P850j0788j7075j4012j1620J0560
17392A76507J792k8076l588j8904j3477J1201J0962m836j3352l313M028m456J1119
17379A25607L106k526j8185m049p484L507N398Q786o197k7564l0004K5749L8776
17366A14920J9525K3878L203k5064j2516J5052J5409J6J45J0861L8555j1718k2687
17353A69579N213q480J1282L026n482K5951K2896J5274N037J8991k609K8151M3800
17340C32629L5130P0035R4350Q4590O1148K1785l4565m0840m5678m1853J769K7001
17328E65501L9419O8977R4425P7850M9435L4218J7706n148l797m1587p2910o1148
17316G62941m4740m7923j4112M381M3856N9946M9232M2903p396m6394p0712q4888
$$ plain form
17304 647094 580448 537840 505404 490178 484970 467556 436465 423232 427530 419990 423338 434315
17292 434315 424088 414217 415026 393017 359609 371177 390112 391715 367695 338990 315893 304807
17280 304807 309286 312872 328653 323048 320911 304254 303953 294034 281191 247959 215342 214243 213981
17267 213981 228334 237764 235730 221714 210712 197453 179627 160398 131883 129116 146622 166950
17255 166950 185462 165898 133816 140908 149085 150729 119401 127233 123203 117119 114297 137923 140998
17242 140998 116061 98484 96073 86961 69831 71367 68653 68649 89525 119686 117364 127240 114262
17229 114262 88921 87020 87541 79583 64921 60274 69848 75444 87877 75222 71562 78206 86065
17216 86065 81922 88711 94051 91566 77171 65389 75992 81039 74039 55648 44703 53828 73521
$$ packed form
17304F47094o6646m2608l2436j5226n208j7414l1091j3233M298p540L348J0977
17292D34315j0227r871Q09k2009l3408J1568J8935J603k4020k8705k3097j1086
17280C04807M479L586J5781n605k137j6657l01r919j2843l3232l2617j099k62
17267B13981J4353R430k034j4016j1002j3259j7826j9229k8515k767J7506K0328
17255A66950J8512j9564l2082P092Q177J644l1328P832m030o084k822K3626L075
17242A40998k4937j7577k411r112j7130J536k714mK0876L0161k322R876j2978
17229A14262k5341j901N21p958j4662m647R574N596J2433j2655l660O644P859
17216H6065m143O789N340k485j4395j1782J0603N047p000j8391j0945R125J9693
$$ plain form
17203 73521 74096 89195 98681 71977 71410 75338 69309 73795 80104 65267 62567 58541 54629 75560
17189 75560 88268 93081 102969 105574 96176 75996 69540 74612 81176 93014 103761 101021 100734 82268
17175 82268 83640 94943 98273 93268 59553 57628 73666 69972 56383 69639 79516 84660 87683
17162 87683 69576 63470 57347 74236 76804 69800 85452 94989 105514 125819 111515 96672 100313
17149 100313 100899 82623 92245 121111 130109 122379 126455 142795 124232 120280 129909 139969 147006
17136 147006 145512 129463 133313 147686 153374 148592 135114 142091 137350 132962 116346 97500 71694
17123 71694 66349 78257 96708 90628 90421 99803 104333 93968 94845 98239 66843 39418 40470 38258
17109 38258 39687 70105 87746 112757 111016 87445 78935 87217 78214 62599 60487 60830 73884
$$ packed form
17203G3521N75J5099R486k6704n67L928o029M486O309j4837k700m026l912K0931
17189G5560J2708M813R888K605r398k0180o456N072O564J1838J0747k740k87j8466
17175H2268J372J1303L330n005l3715j925J6038l694j3589J3256R877N144L023
17162H7683j8107o106o123J6889K568p004J5652R537J0525K0305j4304j4843L641
17149A00313N86j8276R622K8866Q998p730M076J6340j8563l952R629J0060P037
17136A47006j494j6049L850J4373N688m782j3478O977m741m388j6616j8846k5806
17123G1694n345J1908J8451o080k07R382M530j0365Q77L394l1396k7425J052k212
17109C8258J429L0418J7641K5011j741k3571q510Q282r003j5615k112L43J3054
$$ plain form
17096 73884 76014 80448 96373 81953 61518 68901 58737 41566 22445 44288 79482 101103
17084 101103 113680 119571 120313 102890 78849 74045 100942 99696 75427 64847 59319 60923 62161
17071 62161 61920 65535 69697 79756 88931 104073 94796 78878 82151 94284 81656 77629 82781
17058 82781 85986 80415 93498 79009 84663 90656 86923 98959 131576 128134 105255 101172 107205
17045 107205 112727 128977 144366 144395 150772 155871 147289 143045 155846 188700 214996 257238 297827
17032 297827 325291 343535 348343 324171 320894 326896 309557 318957 324535 351609 397525 451589
17020 451589 475330 500889 496751 489431 484271 483568 484553 469918 457331 463026 455386 440242 414131
17007 414131 442242 468982 483887 467055 439341 417588 385938 385834 372831 335571 310166 304057
$$ packed form
17096G3884K130M434J5925j4420k0435P383j0164j7171j9121K1843L5194K1621
17084A01103J2577N891P42j7423k4041m804K6897j246k4269j0580n528J604J238
17071F2161k41L615M162J0059R175J5142r277j5918L273J2133j2628m027N152
17058H2781L205n571J3083j4489N654N993l733J2036L2617l442k2879m083O033
17045A07205N522J6250J5389K9O377N099q582m244J2801L2854K6296M2242M0589
17032B97827K7464J8244M808k4172l277O002j7339R400N578K7074M5916N4064
17020D51589K3741K5559m138p320n160p03R85j4635j2587N695p640j5144k6111
17007D14131K8111K6740J4905j6832k7714k1753l1650j04j3003l7260k5405o109
$$ plain form
16995 304057 268486 219602 221958 225052 213533 193865 196872 194421 195379 199715 189520 188622 191910
16982 191910 172355 141979 140862 146292 140626 140636 127703 109765 105312 104356 103109 87624 62899
16969 62899 69841 64114 64049 51712 58655 79502 80666 77583 82476 66827 39907 40477 53726 48655
16955 48655 56381 57713 75306 111227 114980 102327 110623 136481 115145 113305 122895 130352 113226
16942 113226 98779 108832 113799 103649 81140 102509 119580 119156 122756 123764 120182 111340 121791
16929 121791 148055 156467 150521 152886 144690 141541 115801 95359 79999 85664 91748 92727 93474 117640
16915 117640 136314 171003 184623 167015 149375 168060 186475 198857 225912 230325 230418 257963
16903 257963 265343 256550 248128 257071 274342 280187 290626 284837 312499 337885 358049 375306 374109
$$ packed form
16995C04057l5571m8884K356L094j1519j9668L007k451R58M336j0195q98L288
16982A91910j9555l0376j117N430n666J0j2933j7938m453r56j247j5485k4725
16969F2899O942n727o5j2337O943K0847J164l083M893j5649k6920N70J3249n071
16955D8655P726J332J7593L5921L753j2653Q296K5858k1336j840R590P457j7126
16942A13226j4447J0053M967j0150k2509K1369J7071m24L600J008l582q842J0451
16929A21791K6264Q412n946K365q196l149k5740k0442j5360N665O084R79P47K4166
16915A17640J8674L4689J3620j7608j7640J8685J8415J2382K7055M413R3K7545
16903B57963P380q793q422Q943J7271N845J0439n789K7662K5386K0164J7257j197
$$ plain form
16890 374109 372971 393385 416815 426865 419420 410161 395800 367785 355174 376270 405422 403226
16878 403226 427437 463171 478148 486038 471588 459857 460807 467739 488111 525016 549972 566683
16866 566683 577547 589969 615655 652109 675645 704134 728948 761882 805703 834420 873624
16855 873624 896090 938091 981434 1017132 1030383 1031830 1062546 1115856 1174297 1220712 1250847 1273210
16843 1273210 1325229 1372306 1396105 1426857 1456281 1492560 1531624 1542909 1543935 1564674 1605253
16832 1605253 1654454 1703720 1739243 1784457 1838811 1850374 1854005 1882018 1927604 1939527 1931268 1941096
16820 1941096 1972192 1990123 2019374 2092731 2149179 2225574 2310160 2376245 2456721 2541731 2643039
16809 2643039 2744135 2845664 2979609 3099723 3187301 3266345 3354123 3454924 3598274 3806037
$$ packed form
16890C74109j138K0414K3430J0050p445r259j4361k8015j2611K1096K9152k196
16878D03226K4211L5734J4977P890j4450j1731R50O932K0372L6905K4956J6711
16866E66683J0864J2422K5686L6454K3536K8489K4814L2934M3821K8717L9204
16855H73624K2466M2001M3343L5698J3251J447L0716N3310N8441M6415L0135K2363
16843A273210N2019M7077K3799L0752K9424L6279L9064J1285J026K0739M0579
16832A605253M9201M9266L5523M5214N4354J1563L631K8013M5586J1923q259R828
16820A941096L1096J7931K9251P3357N6448P6395Q4586O6085Q0476Q5010J01308
16809B643039J01096J01529J33945J20114Q7578P9044Q7778J00801J43350K07763
$$ plain form
16799 3806037 4060536 4370408 4699935 5049762 5404195 5750862 6088559 6431736 6863467
16790 6863467 7491183 8364519 9575431 11200373 13331573 16153684 19999762 25318426
16782 25318426 32860912 43724648 58516262 75182523 89173388 97515501 97204603 87067075
16774 87067075 74172134 65813272 63141196 65451201 72772263 85548541 102779722 120810782
16766 120810782 136617036 148498075 153783742 153538474 151667838 148146681 138625879 122409232
16758 122409232 106707877 96623787 92150143 92510833 97707691 107775501 120622591
16751 120622591 131640815 137504948 135290714 123050803 106659327 93393279 84415987
16744 84415987 78222021 73665481 70182507 67405439 65142551 63255600 61669490 60367445
$$ packed form
16799C806037K54499L09872L29527L49827L54433L46667L37697L43177M31731
16790F863467O27716Q73336J210912J624942K131200K822111L846078N318664
16782B5318426P542486J0863736J4791614J6666261J3990865Q342113l10898j0137528
16774H7067075j2894941q358862k672076K310005P321062J2776278J7231181J8031060
16766A20810782J5806254J1881039N285667k45268j870636l521157r520802j6216647
16758A22409232j5701355j0084090m473644L60690N196858J0067810J2847090
16751A20622591J1018224N864133k214234j2239911j6391476j3266048q977292
16744H4415987o193966m556540l482974k777068k262888j886951j586110j302045
$$ plain form
16736 60367445 59265224 58239183 57189895 56026232 54685975 53295715 51935073 50545168
16728 50545168 49116525 47730556 46409910 45154948 43913054 42618040 41267768 39935465
16720 39935465 38640173 37401819 36127288 34723800 33194321 31642334 30120769 28695916
16712 28695916 27366780 26156741 25065408 24051374 23110895 22171252 21209169 20193596
16704 20193596 19166551 18174905 17233782 16346083 15505282 14734672 14001142 13322885 12704578
16695 12704578 12089145 11480768 10903157 10381238 9881719 9392049 8937975 8533428 8154266
16686 8154266 7766033 7405997 7052574 6741760 6471440 6186160 5899733 5634064 5371787
16677 5371787 5145808 4914085 4675940 4461787 4275862 4075964 3891364 3732821 3575190
$$ packed form
16736F0367445j102221j026041j049288j163663j340257j390260j360642j389905
16728E0545168j428643j385969j320646j254962j241894j295014j350272j332303
16720C9935465j295292j238354j274531j403488j529479j551987j521565j424853
16712B8695916j329136j210039j091333j014034r40479r39643r62083j015573
16704B0193596j027045r91646r41123q87699q40801p70610p33530o78257o18307
16695A2704578o15433o08377n77611n21919m99519m89670m54074m04547l79162
16686H154266l88233l60036l53423l10814k70320k85280k86427k65669k62277
16677E371787k25979k31723k38145k14153j85925j99898j84600j58543j57631
$$ plain form
16668 3575190 3402468 3239732 3109193 2980307 2841365 2727402 2611775 2504648 2428506 2331389
16658 2331389 2237743 2154909 2069282 2005018 1938226 1872543 1774404 1675951 1621110 1583973 1534908
16647 1534908 1478093 1420637 1378882 1334737 1304251 1275123 1225796 1179128 1147949 1116590 1073629
16636 1073629 1003176 963407 938154 903188 877017 859943 824030 784217 759990 750168 726630
16625 726630 709080 707613 717515 699455 647601 622614 607064 587684 573832 580874 581771 581793 587518
16612 587518 609832 634006 651262 653272 651731 670906 671762 687722 700525 705815 709156 703631 712794
16599 712794 734675 760972 791737 815638 847475 890305 919354 959289 976809 996621 1002454 993730
16587 993730 992761 1025193 1051225 1056974 1066176 1086435 1096897 1125469 1146810 1129557 1113175 1117295
$$ packed form
16668C575190j72722j62736j30539j28886j38942j13963j15627j07127p6142r7117
16658B331389r3646q2834q5627o4264o6792o5683r8139r8453n4841l7137m9065
16647A534908n6815n7456m1755m4145l0486k9128m9327m6668l1179l1359m2961
16636A073629p0453l9769k5253l4966k6171j7074l5913l9813k4227r822k3538
16625G26630j7550j467R902j8060n1854k4987j5550j9380j3852P042Q97K2N725
16612E87518K2314K4174J7256K010j541J9175Q56J5960J2803N290L341n525R163
16599G12794K1881K6297L0765K3901L1837M2830K9049L9935J7520J9812N833q724
16587I93730r69L2432K6032N749R202K0259J0462K8572K1341j7253j6382M120
$$ plain form
16575 1117295 1114860 1103462 1098344 1108062 1102658 1099047 1079531 1066575 1060999 1043213 1029088 1011314
16563 1011314 1008549 998451 989062 986711 984159 978684 964124 965371 940159 911412 893335 881662
16551 881662 867944 871972 886311 888733 903977 905142 874815 844815 801083 764035 746670 739668
16539 739668 731152 715401 744622 774064 799467 826958 838364 819837 757213 704899 658476 630278
16527 630278 604061 578394 562414 565185 597393 620881 610916 599878 567926 546414 522057 500080
16515 500080 492083 492414 475421 479353 475994 468802 454692 437508 413161 378250 370934 366233 366208 354235
16501 354235 353523 350579 353562 331717 330487 318432 300689 287001 275468 260084 247504 240355 248150
16488 248150 231369 225862 213876 203694 185718 197075 222311 226163 205665 187600 187141 179523
$$ packed form
16575A117295k435j1398n118R718n404l611j9516j2956n576j7786j4125j7774
16563A011314k765j0098r389k351k552n475j4560J247k5212k8747j8077j1673
16551H81662j3718M028J4339K422J5244J165l0327l0000m3732l7048j7365p002
16539G39668q516j5751K9221K9442K5403K7491J1406j8527o2624n2314m6423k8198
16527F30278k6217k5667j5980K771L2208K3488r965j1038l1952k1512k4357k1977
16515E00080p997L31j6993L932l359p192j4110j7184k4347l4911p316m701k5j1973
16501C54235p12k944K983k1845j230j2055j7743j3688j1533j5384j2580p149P795
16488B48150j6781n507j1986j0182j7976J1357K5236L852k0498j8065m59p618
$$ plain form
16476 179523 177121 170115 167450 171530 180006 189060 177455 186546 185833 176590 178293 174406 172111 180084
16462 180084 206600 227053 233512 226494 214797 213024 188320 168943 166800 188780 226146 228060
16450 228060 232988 247559 248169 253784 227160 195682 188117 195240 200401 217679 221042 231981 241772
16437 241772 223473 212089 228079 227785 242774 253783 250129 241502 247605 252456 251244 264573 253399
16424 253399 223496 207686 210325 218147 224578 210625 198925 213201 221681 221449 228122 224968 222125
16411 222125 225355 217340 210485 193038 192024 191834 187525 182166 179814 206073 220211 223067 241564
16398 241564 232095 199912 188647 189870 193109 193498 189614 174557 156974 164734 170552 171593 170276
16385 170276 154124 130160 124075 124622 123602 123333 113069 111385 105556 120331 123841 115375 106519 91495
$$ packed form
16476A79523k402p006k665M080Q476R054j1605R091p13r243J703l887k295P973
16462A80084K6516K0453O459p018j1697j773k4704j9377k143K1980L7366J914
16450B28060M928J4571O10N615k6624l1478p565P123N161J7278L363J0939R791
16437B41772j8299j1384J5990k94J4989J1009l654q627O103M851j212J3329j1174
16424B53399k9903j5810K639P822O431j3953j1700J4276Q480k32O673l154k843
16411B22125L230q015o855j7447j014j90m309n359k352K6259J4138K856J8497
16398B41564r469l2183j1265J223L239L89l884j5057j7583P760N818J041j317
16385A70276j6152k3964o085N47j020k69j0264j684n829J4775L510q466q856j5024
$$ plain form
16371 91495 100526 88350 80628 79584 64928 64771 62188 52709 43592 36068 38735 33592 42830 52148
16357 52148 48461 29916 18029 -6696 3695 21686 29104 23695 22375 36043 45809 53526 42494
16344 42494 21657 16374 10323 6750 5243 -11839 -10221 -1422 18934 7338 23553 40561 49350
16331 49350 30881 23350 32807 38689 46538 67137 69620 68484 70417 79895 56887 35680 23056
16318 23056 22586 32552 48824 56595 41276 28210 34830 48799 62282 55817 48861 54493 35636
16305 35636 47015 68378 110854 115656 91955 94987 102305 84965 88354 80367 63042 47629 62869
16292 62869 79342 100474 110873 97997 98474 102821 98290 102250 86872 102576 93731 92369 102459
16279 102459 116628 112526 87818 84882 93436 95282 90762 75177 59880 64697 66751 59815 66950
$$ packed form
16371I1495R031j2176p722j044j4656j57k583r479r117p524K667n143R238R318
16357E2148l687j8545j1887k4725J0391J7991P418n409j320J3668R766P717j1032
16344D2494k0837n283o051l573j507j7082J618Q799K0356j1596J6215J7008Q789
16331D9350j8469p531R457N882P849K0599K483j136J933R478k3008k1207j2624
16318B3056m70R966J6272P771j5319j3066O620J3969J3483o465o956N632j8857
16305C5636J1379K1363M2476M802k3701L032P318j7340L389p987j7325j5413J5240
16292F2869J6473K1132J0399j2876M77M347m531L960j5378J5704q845j362J0090
16279A02459J4169m102k4708k936Q554J846m520j5585j5297M817K054o936P135
$$ plain form
16266 66950 94203 118186 117363 104643 92774 84067 75952 81859 98349 81319 69527 79570 86436
16253 86436 96367 77129 76879 70436 46558 50276 56989 41039 48014 59846 64768 69632 83369
16240 83369 86886 65459 64757 77381 71124 64854 50165 58834 53615 46544 67087 66925 79945 74585
16226 74585 90727 117311 119441 108439 115133 132328 141035 153879 184347 222623 269825 348686
16214 348686 468559 552359 591193 597238 569454 517973 459190 433069 451459 494949 550718
16203 550718 641860 744895 821664 883121 930833 932875 917461 905163 873863 788825 700312
16192 700312 649983 607219 596596 628085 700158 771485 820773 838135 838901 791651 706589 631981
16180 631981 580311 537146 509414 485800 482043 476597 453186 432021 431619 430066 401511 387692
$$ packed form
16266F6950K7253K3983q23j2720j1869q707q115N907J6490j7030j1792J0043O866
16253H6436R931j9238k50o443k3878L718O713j5950O975J1832M922M864J3737
16240H3369L517k1427p02J2624o257o270j4689Q669n219p071K0543j62J3020n360
16226G4585J6142K6584K130j1002O694J7195Q707J2844L0468L8276M7202P8861
16214C48686J19873Q3800L8834O045k7784n1481n8783k6121J8390M3490N5769
16203E50718R1142J03035P6769O1457M7712K042j5414j2298l1300q5038q8513
16192G00312n0329m2764j0623L1489P2073P1327M9288J7362P66m7250q5062p4608
16180F31981n1670m3165k7732k3614l757n446k3411k1165m02j553k8555j3819
$$ plain form
16168 387692 403096 415516 406742 376061 348603 345884 339045 345304 353684 322308 301574 288583
16156 288583 266174 258103 254787 256543 246189 241511 238670 235812 213585 214222 206562 192360 181788
16143 181788 171103 171532 163093 144996 134245 142277 154794 169073 146618 124526 123154 130518 139921
16130 139921 124948 113195 108738 115197 107779 100871 86496 91442 73376 65875 74200 82651 71698
16117 71698 61175 52329 66385 73519 89379 98019 110883 106300 103041 79683 28854 19000 32870
16104 32870 43065 48374 52368 56324 37037 26501 10899 15276 33694 47097 51233 45883 22485
16091 22485 -2504 -5489 10862 18407 17028 11960 -11092 -12554 -13667 -7609 6157 -1834 -4393
16078 -4393 -5559 -15788 -19691 -17466 6495 31195 42052 35435 24070 24859 40011 43229 41140
$$ packed form
16168C87692J5404J2420q774l0681k7458k719o839O259Q380l1376k0734j2991
16156B88583k2409q071l316J756j0354m678k841k858k2227O37p660j4202j0572
16143A81788j0685M29q439j8097j0751Q032J2517J4279k2455k2092j372P364R403
16130A39921j4973j1753m457O459p418o908j4375M946j8066p501Q325Q451j0953
16117G1698j0523q846J4056P134J5860Q640J2864m583l259k3358n0829r854J3870
16104C2870J0195N309L994L956j9287j0536j5602M377J8418J3403M136n350k3398
16091B2485k4989k985J6351P545j379n068k3052j462j113O058J3766p991k559
16078d393j166j0229l903K225K3961K4700J0857o617j1365P89J5152L218k089
$$ plain form
16065 41140 22552 -669 -4747 7430 10468 24090 31704 8647 -2095 6483 2740 -584 -5127
16052 -5127 -3838 5914 5975 3405 -2991 965 17005 22959 17621 795 -15491 -1680 18181 14216
16038 14216 19307 27683 29941 26071 29415 28013 22121 36832 46189 39382 30638 15403 13834 4417
16024 4417 -3958 13791 31695 34815 48237 54147 60369 40089 35126 44720 62329 62260 54083 44433
16010 44433 56646 65267 33535 4362 -6841 6051 8289 4419 -720 2757 19018 19768 10925
15997 10925 -10147 -12912 -4852 -3193 -366 10299 15489 10729 -2355 -2607 2829 10747 25932 13775
15983 13775 3785 8173 31280 20504 16278 10626 15783 19025 4132 3148 4450 11469 15897 4523
15969 4523 13147 28085 4534 -12761 -16287 -2185 -8209 -4942 4751 -5945 -5385 -1060 -8401 -10622
$$ packed form
16065D1140j8588k3221m078J2177L038J3622P614k3057j0742Q578l743l324m543
16052e127J289R752O1k570o396L956J6040N954n338j6826j6286J3811J9861l965
16038A4216N091Q376K258l870L344j402n892J4711R357o807q744j5235j569r417
16024D417q375J7749J7904L120J3422N910O222k0280m963R594J7609o9q177r650
16010D4433J2213Q621l1732k9173j1203J2892K238l870n139L477J6261P50q843
15997A0925k1072k765Q060J659K827J0665N190m760j3084k52N436P918J5185j2157
15983A3775r990M388K3107j0776m226n652N157L242j4893r84J302P019M428j1374
15969D523Q624J4938k3551j7295l526J4102o024L267R693j0696N60M325p341k221
$$ plain form
15955 -10622 -834 -4854 -4346 -4971 -8966 -12049 -21548 -29500 -32328 -35620 -15050 -1989 7210 -3650
15941 -3650 -12314 -13775 -5334 3667 -1523 -6992 -26899 -27940 -24759 -19234 39 25108 36433 37099
15927 37099 23131 4007 -2209 -4755 -20019 -21846 -10553 -7368 7019 -4586 -13367 -14339 -24338
15914 -24338 -22538 -6416 3493 -3062 -504 9523 21857 11114 -2001 -7131 -9810 -27812 -20051
15901 -20051 -6071 -17004 -24361 -25335 -8960 -1048 3684 13353 13897 6876 -6455 16654 14289 -9891
15887 -9891 -23255 -19533 1122 612 -12540 -5085 244 -1303 -2043 1560 -1915 -7512 -6498 -6823 8368
15872 8368 22155 47280 57971 42765 20518 6768 -20 13380 20376 -132 7490 2535 -2906
15859 -2906 -7312 -17444 -12829 -10918 -7509 -11545 2107 18422 18132 4007 7564 22494 27583 34983
$$ packed form
15955a0622R788m020N08o25l995l083r499p952k828l292K0570J3061R199j0860
15941c650q664j461Q441R001n190n469j9907j041L181N525J9273K5069J1325O66
15927C7099j3968j9124o216k546j5264j827J1293L185J4387j1605q781r72r999
15914b4338J800J6122R909o555K558J0027J2334j0743j3115n130k679j8002P761
15901b0051J3980j0933p357r74J6375P912M732R669N44p021j3331K3109k365k4180
15887i891j3364L722K0655n10j3152P455N329j547p40L603l475n597J014l25J5191
15872H368J3787K5125J0691j5206k2247j3750o788J3400O996k0508P622m955n441
15859b906m406j0132M615J911L409m036J3652J6315k90j4125L557J4930N089P400
$$ plain form
15845 34983 28790 27199 2179 -10350 -18440 -23109 2608 5439 -271 -2904 -12054 -19586 -12748 -17270
15831 -17270 -36656 -26344 -29724 -34420 -34473 -22128 -20724 -30888 -32026 -20580 -2410 5177 -11037
15818 -11037 -27340 -15719 -12348 -18656 -24689 -15126 6454 32246 31111 2125 -2690 -11006 7916
15805 7916 6506 -7987 -19044 -10852 7742 6949 2234 22096 26030 18446 -4421 1317 -7765 -2175
15791 -2175 14194 16110 15001 5726 5440 -19316 -23193 -19605 -11746 -6946 -13933 -23121 -24981 -27531
15777 -27531 -25456 -26567 -10941 -11500 8671 10150 6218 2541 2103 16119 -283 -12520 -12262 4840
15763 4840 14606 12443 -4229 -13356 -10271 -35558 -55651 -45364 -29278 -17146 -25722 -33043 -18696
15750 -18696 6158 10893 5332 14317 17992 24049 13428 19094 16239 -9899 -17860 -14856 -2790
$$ packed form
15845C4983o193j591k5020j2529q090m669K5717K831n710k633r150p532O838m522
15831a7270j9386J0312l380m696n3J2345J404j0164j138J1446J8170P587j6214
15818a1037j6303J1621L371o308o033R563K1580K5792j135k8986m815q316J8922
15805G916j410j4493j1057Q192J8594p93m715J9862L934p584k2867N738r082N590
15791b175J6369J916j109r275k86k4756l877L588P859M800o987r188j860k550
15777b7531K075j111J5626n59K0171J479l932l677m38J4016j6402j2237K58J7102
15763D840R766k163j6672r127L085k5287k0093J0287J6086J2132q576p321J4347
15750a8696K4854M735n561Q985L675O057j0621N666k855k6138p961L004J2066
$$ plain form
15737 -2790 4832 -14391 -27437 -5640 -1467 -7990 6778 19647 5250 -23622 -30454 -32990 -29418
15724 -29418 -1796 19733 13031 -7798 -2239 -7461 -11246 -5766 -8299 18902 11881 -11907 -12418
15711 -12418 2881 -4869 -6872 4377 -2582 -25118 -41890 -37822 -34964 -32110 -34309 -43728 -42096
15698 -42096 -35670 -33628 -16164 -12031 -27551 -17052 5395 1199 10849 4460 -16835 -31737 -44287
15685 -44287 -38529 -32322 -27434 -8762 -187 -4432 12802 20048 14938 -17368 -41936 -49389 -63234
15672 -63234 -63073 -34457 -26305 -20301 -24325 -27887 -10090 3602 1179 -3375 -25920 -44460 -45568
15659 -45568 -28509 -16698 -24483 -42250 -38580 -34539 -33380 -23766 -24532 -16904 -7406 -296 -4803 -23919
15645 -23919 -16446 -15918 -33280 -65683 -61084 -50509 -31314 -19856 -18425 9815 -4103 -1157 -13929
$$ packed form
15737b790P622j9223j3046K1797M173o523J4768J2869j4397k8872o832k536L572
15724b9418K7622K1529o702k0829N559n222l785N480k533K7201p021k3788n11
15711a2418J5299p750k003J1249o959k2536j6772M068K858K854k199r419J632
15698d2096O426K042J7464M133j5520J0499K2447m196R650o389k1295j4902j2550
15685d4287N758O207M888J8672Q575m245J7234P246n110l2306k4568p453j3845
15672f3234J61K8616Q152O004m024l562J7797J3692k423m554k2545j8540j108
15659d5568J7059J1811p785j7767L670M041J159R614p66P628R498P110m507j9116
15645b3919P473N28j7362l2403M599J0575J9195J1458J431K8240j3918K946j2772
$$ plain form
15632 -13929 -19939 -12057 -2542 3757 -4099 -17257 -5634 -30193 -49320 -48785 -19640 -17257 -33996
15619 -33996 -26485 -8859 -100 14449 19102 13091 -4924 -21043 2749 13109 18390 -207 -30571
15606 -30571 -36661 -27954 -26606 -28259 -21352 -27882 -14079 1562 -1802 -6690 -14329 4601 5494 -20745
15592 -20745 -32897 -32722 -34519 -10754 8498 -6862 -27078 -32593 -23165 -24037 -17060 -27964 -37918
15579 -37918 -33802 -25427 -28902 -16681 -20730 -19598 -15956 -27215 -32511 -16245 12821 7196 -15277
15566 -15277 -29179 -19500 -18439 -24882 -26262 -39355 -50068 -21115 12635 9237 -2295 -8743 -9478
15553 -9478 -15588 -34398 -26431 -5468 5203 8684 -8883 -45855 -44470 -28435 -14792 -14224 -8360
15540 -8360 -2187 -15172 -6488 -8966 -16930 -23116 -14520 -19245 -12795 -9721 -14808 -24957 -32050 -13846
$$ packed form
15632a3929o010P882R515O299p856j3158J1623k4559j9127N35K9145K383j6739
15619c3996P511J7626Q759J4549M653o011j8015j6119K3792J0360N281j8597l0364
15606c0571o090Q707J348j653O907o530J3803J5641l364m888p639J8930Q93k6239
15592b0745j2152J75j797K3765J9252j5360k0216n515R428q72O977j0904r954
15579c7918M116Q375l475J2221m049J132L642j1259n296J6266K9066n625k2473
15566a5277j3902R679J061o443j380j3093j0713K8953L3750l398j1532o448p35
15553i478o110j8810P967K0963J0671L481j7567l6972J385J6035J3643N68N864
15540h360O173j2985Q684k478p964o186Q596m725O450L074n087j0149p093J8204
$$ plain form
15526 -13846 8018 14228 9241 9571 29363 39010 34887 43641 44781 24466 20392 12954 -4935 8207
15512 8207 50060 45480 26244 17224 12301 29847 32107 27303 21916 12984 37891 50321 59535
15499 59535 40413 31360 32745 18704 18238 21158 28663 27346 23987 32499 50363 62413 51038
15486 51038 33819 25689 14525 8876 7496 15740 1118 -5261 26572 42865 36989 6313 3310
15473 3310 9744 29153 22417 21362 33215 33583 35343 41033 49217 35402 4956 13912 29196 31172
15459 31172 33315 17018 -9146 -14271 2869 32428 31874 19596 24432 2535 -14441 -14289 -8945
15446 -8945 11209 37417 39159 34997 16133 -3010 -14390 -2760 5296 15111 14515 9019 6314
15433 6314 -3419 -2011 7330 -3041 -11790 -13909 -7568 -746 -6781 6152 -12381 -36234 -49707
$$ packed form
15526a3846K1864O210m987L30J9792R647m123Q754J140k0315m074p438j7889J3142
15512H207M1853m580j9236r020m923J7546K260m804n387q932K4907J2430R214
15499E9535j9122r053J385j4041m66K920P505j317l359Q512J7864J2050j1375
15486E1038j7219q130j1164n649j380Q244j4622o379L1833J6293n876l0676l003
15473C310O434J9409o736j055J1853L68J760N690Q184j3815l0446Q956J5284J976
15459C1172K143j6297k6164n125J7140K9559n54j2278M836k1897j6976J52N344
15446h945K0154K6208J742m162j8864j9143j1380J1630Q056R815n96n496k705
15433F314r733J408R341j0371q749k119O341O822o035J2933j8533k3853j3473
$$ plain form
15420 -49707 -48756 -47400 -22941 -6305 -795 10349 -400 -15644 -16263 -13990 -27099 -31014 -25027
15407 -25027 -34670 -40273 -25797 -35278 -39414 -40852 -42634 -36629 -29373 -18316 -14022 -15838 -15546 -7663
15393 -7663 -6467 -10281 -16078 -12258 -24513 -48044 -48861 -27916 -26943 -8455 -2463 -20083 -21229 -23452
15379 -23452 -17139 -6649 -11279 -14742 -19661 -1128 2584 -12528 -18680 -31890 -48749 -43591 -37213
15366 -37213 -31686 -29900 -19635 -24831 -37033 -29763 -29077 -43623 -38204 -14353 -2349 -4546 273
15353 273 -7498 -7616 9374 10782 -17807 -42460 -30422 -11617 1501 -3899 4171 -13994 -35163
15340 -35163 -13372 -9986 -12149 -2476 -3651 -11465 -28352 -42542 -33579 -30817 -20880 -11840 -1059
15327 -1059 6973 993 -21174 -19833 -12284 2004 4309 -9668 -11839 -21238 -26724 -23391 -17527 -20831
$$ packed form
15420d9707R51J356K4459J6636N510J1144j0749j5244o19K273j3109l915N987
15407b5027r643n603J4476r481m136j438j782O005P256J1057M294j816K92P883
15393g663J196l814n797L820j2255k3531q17K0945R73J8488N992j7620j146k223
15379b3452O313J0490m630l463m919J8533L712j5112o152j3210j6859N158O378
15366c7213N527J786J0265n196j2202P270O86j4546N419K3851J2004k197M819
15353B73p771j18J6990J408k8589k4653J2038J8805J3118n400Q070j8165k1169
15340c5163K1791L386k163R673j175p814j6887j4190Q963K762R937R040J0781
15327a059Q032n980k2167J341P549J4288K305j3977k171r399n486L333N864l304
$$ plain form
15313 -20831 -17335 -23094 -28335 -39513 -8228 10056 752 -245 -12767 -18850 -25057 -31360 4993
15300 4993 10692 -14439 -41920 -52262 -43719 -33566 -6996 11113 3043 9239 8687 -221 22534
15287 22534 37212 35367 24109 17995 21769 8967 -2745 124 1276 -3968 4465 13119 11852
15274 11852 5814 10825 31820 31642 3840 3792 4080 1919 5878 -2561 -8143 9996 17868 16752 16845
15259 16845 -5060 -21368 -28642 -33924 -40898 -21290 -6694 -10345 -30095 -29014 -29794 -47726 -52529
15246 -52529 -38141 -24226 -32284 -37280 -33533 -29704 -27130 -33447 -57842 -63742 -61547 -50904 -55849
15233 -55849 -56091 -59712 -49910 -46874 -35360 -38461 -73723 -62388 -51451 -58972 -62513 -77222 -73014
15220 -73014 -60822 -74259 -58759 -40503 -40583 -48828 -50038 -32480 -40050 -53176 -67055 -70001 -68950
$$ packed form
15313b0831L496n759n241j1178L1285J8284r304r97j2522o083o207o303L6353
15300D993N699k5131k7481j0342Q543J0153K6570J8109q070O196n52q908K2755
15287B2534J4678j845j1258o114L774j2802j1712K869J152n244Q433Q654j267
15274A1852o038N011K0995j78k7802m8K88k161L959q439n582J8139P872j116R3
15259A6845k1905j6308p274n282o974J9608J4596l651j9750J081p80j7932m803
15246e2529J4388J3915q058m996L747L829K574o317k4395n900K195J0643m945
15233e5849k42l621R802L036J1514l101l5262J1335J0937p521l541j4709M208
15220g3014J2192j3437J5500J8256q0q245j210J7558p570j3126j3879k946J051
$$ plain form
15207 -68950 -67103 -59042 -30499 -24484 -13047 -10505 -12641 -16496 -20732 -31168 -35975 -31605 -27494 -15419
15193 -15419 -20552 -23141 -12645 -11314 -13973 -12523 -22163 -31771 -20761 -7801 -18132 -28884 -31904
15180 -31904 -21218 -23965 -23690 -26848 -20220 -33978 -35124 -33179 -51301 -59295 -50104 -36674 -31135 -45250
15166 -45250 -52054 -48859 -40646 -50637 -44872 -41621 -40220 -26204 -43068 -57304 -52455 -42274 -27518
15153 -27518 -16360 -27410 -36809 -16719 -25960 -36115 -31823 -31485 -27822 -37988 -35994 -25959 -41256
15140 -41256 -27225 -13651 -3203 -3545 -7806 3110 14717 1991 1252 -14007 -18263 -14364 -10189
15127 -10189 -231 1148 -7604 -24309 -5403 -12150 -18495 -23513 -4505 10810 -4379 -18873 -19357
15114 -19357 -18868 -28149 -26787 -20458 -11575 -5164 -10621 -7529 10125 14429 14530 -3427 -11303 634
$$ packed form
15207f8950J847Q061K8543O015J1437K542k136l855m236j0436m807M370M111J2075
15193a5419n133k589J0496J331k659J450r640r608J1010J2960j0331j0752l020
15180c1904J0686k747K75l158O628j3758j146J945j8122p994R191J3430N539j4115
15166d5250o804L195Q213r991N765L251J401J4016j6864j4236M849J0181J4756
15153b7518J1158j1050r399K0090r241j0155M292L38L663j0166J994J0035j5297
15140d1256J4031J3574J0448l42m261J0916J1607j2726p39j5259m256L899M175
15127a0189R958J379q752j6705J8906o747o345n018J9008J5315j5189j4494m84
15114a9357M89r281J362O329Q883O411n457L092J7654M304J01j7957p876J1937
$$ plain form
15100 634 -23577 -42648 -34342 -26903 -8984 -580 5726 1486 8020 11778 -2741 -7122 1622 8032
15086 8032 2328 3221 22681 21755 1675 -17533 -43147 -21146 -8014 -28756 -16808 4925 -14107
15073 -14107 -30530 -25911 -27465 -22553 -9458 -13637 -8178 -18822 -40455 -38867 -25685 -29057 -32247
15060 -32247 -43805 -20645 -13495 -3184 -1357 7264 5879 -5013 -27531 -27936 -40287 -61359 -62821
15047 -62821 -36917 -19361 -36126 -40272 -18898 -13196 -27943 -31939 -3707 5288 -10042 -10441 -4663
15034 -4663 12338 14157 -9562 -23457 -49237 -58126 -49088 -35055 -21170 -22432 -43984 -24142 5187
15021 5187 -10358 -36618 -32506 -22907 -20198 -12650 -7912 2034 -7488 -19086 -30188 -31582 -31068 -19936
15007 -19936 -24653 -12036 -2920 -20675 -37711 -29492 -21245 -19974 -4878 14637 6898 -14928 -30765
$$ packed form
15100F34k4211j9071Q306P439J7919Q404O306m240O534L758j4519m381Q744O410
15086H032n704Q93J9460r26k0080j9208k5614K2001J3132k0742J1948K1733j9032
15073a4107j6423M619j554M912J3095m179N459j0644k1633J588J3182l372l190
15060c2247j1558K3160P150J0311J827Q621j385j0892k2518m05j2351k1072j462
15047f2821K5904J7556j6765m146K1374N702j4747l996K8232Q995j5330l99N778
15034d663J7001J819k3719j3895k5780q889R038J4033J3885j262k1552J9842K9329
15021E187j5545k6260M112R599K709P548M738R946r522j1598j1102j394N14J1132
15007a9936m717J2617R116j7755j7036Q219Q247J271J5096J9515p739k1826j5837
$$ plain form
14994 -30765 -25913 -7381 8761 2187 -11142 -11687 -15868 -20157 -32661 -19586 -8711 -31570 -40144
14981 -40144 -52157 -61415 -74407 -61170 -57419 -57363 -53321 -27053 -16761 -7242 1252 -2156 -17998
14968 -17998 -28573 -45136 -32051 -31854 -41485 -38029 -18112 -15508 -23280 -35232 -41348 -47403 -37414
14955 -37414 -27271 -5368 2974 -2224 20718 16881 8418 -1533 16818 21680 32042 11618 -14729
14942 -14729 -4743 -4306 -17100 -25671 -9416 -17529 -11684 -14631 -14682 551 3726 -21223 -35806 -14760
14928 -14760 -9047 -33947 -49992 -31237 -32647 -29177 -30293 -19544 -32217 -35855 -23560 -9125 -21490
14915 -21490 -13563 -1459 -9386 -25096 -13452 23584 22281 9013 -26219 -34572 -39120 -44192 -19175
14902 -19175 7948 16150 2383 10309 22695 5985 841 6877 -1580 -26259 -33722 -28864 -25418
$$ packed form
14994c0765M852J8532J6142o574j3329n45m181m289j2504J3075J0875k2859q574
14981d0144j2013r258j2992J3237L751N6M042K6268J0292R519Q494l408j5842
14968a7998j0575j6563J3085J97r631L456J9917K604p772j1952o116o055R989
14955c7414J0143K1903Q342n198K2942l837q463r951J8351M862J0362k0424k6347
14942a4729R986M37j2794q571J6255q113N845k947n1J5233L175k4949j4583K1046
14928a4760N713k4900j6045J8755j410L470j116J0749j2673l638J2295J4435j2365
14915b1490P927J2104p927j5710J1644L7036j303j3268l5232q353m548n072K5017
14902a9175K7123Q202j3767P926J2386j6710n144O036q457k4679p463M858L446
$$ plain form
14889 -25418 -27811 -14887 909 18716 1751 -15916 -17991 -20372 -32253 -15496 -14048 -27218
14877 -27218 -40668 -41415 -14719 -6855 -32661 -39567 -40186 -42308 -29084 -10497 12867 457 -20417
14864 -20417 -35606 -32358 -18842 -445 -8425 -3935 -7357 -6620 -14596 -28497 -32633 -27984 -31084 -31022
14850 -31022 -32336 -23940 -13503 -19737 -43240 -50493 -44002 -38027 -28582 -32770 -28368 -9388 -15999 -42962
14836 -42962 -58553 -45902 -40669 -48966 -33573 -45631 -50933 -43838 -19282 -7439 -5314 -4465 -10775
14823 -10775 -9155 -20028 -36943 -34870 -14023 -10775 -30940 -36879 -40847 -30000 -19446 -22045 -32162
14810 -32162 -27079 -32821 -39633 -27225 -24246 -39405 -35598 -44353 -35072 -39270 -52672 -75268 -74234
14797 -74234 -63486 -60388 -52128 -67457 -53514 -18449 3017 16141 35965 33338 5581 -21728
$$ packed form
14889b5418k393J2924J5796J7807j6965j7667k075k381j1881J6757J448j3170
14877b7218j3450p47K6696P864k5806o906o19k122J3224J8587K3364j2410k0874
14864b0417j5189L248J3516J8397p980M490l422P37p976j3901m136M649l100O2
14850c1022j314Q396J0437o234k3503p253O491N975R445m188M402J8980o611k6963
14836d2962j5591J2651N233q297J5393j2058n302P095K4556J1843K125Q49o310
14823a0775J620j0873j6915K073K0847L248k0165n939l968J0847J0554k599j0117
14810c2162N083n742o812J2408K979j5159L807q755R281m198j3402k2596J034
14797g4234J0748L098Q260j5329J3943L5065K1466J3124J9824k627k7757k7309
$$ plain form
14785 -21728 -34326 -19378 2425 6865 -2595 -18143 -35221 -50602 -38487 -28018 -27856 -50522
14773 -50522 -64009 -46244 -34552 -34408 -32388 -12888 -17769 -29542 -19598 -30174 -38683 -43884 -30396
14760 -30396 -20292 -33342 -33383 -24516 -44265 -51025 -53923 -40079 -24546 -41196 -29975 -18333 -29818
14747 -29818 -24943 -32364 -44618 -38850 -33145 -36088 -47923 -38679 -13488 7756 6798 3956 16287
14734 16287 24262 -8636 -20949 -21530 -11696 -14286 -19112 -28346 -16957 -15650 -11495 -13100 -33280 -38367
14720 -38367 -30351 -43503 -38938 -24270 -11001 -12284 -20913 -22771 -38700 -20227 -13074 -14408 -27685
14707 -27685 -30431 -36619 -42722 -49606 -33952 -28571 -27303 -39585 -52796 -41690 -33698 -21488 -23251
14694 -23251 -27609 -15552 1700 3469 -27948 -38955 -37357 -30010 -24079 -46798 -55624 -62805 -71511
$$ packed form
14785b1728j2598J4948K1803M440r460j5548j7078j5381J2115J0469J62k2666
14773e0522j3487J7765J1692J44K020J9500m881j1773R944j0576q509n201J3488
14760c0396J0104j3050m1Q867j9749o760k898J3844J5533j6650J1221J1642j1485
14747b9818M875p421j2254N768N705k943j1835R244K5191K1244r58k842J2331
14734A6287P975l2898j2313n81R834k590m826r234J1389J307M155j605k0180n087
14720c8367Q016j3152M565J4668J3269j283q629j858j5929J8473P153j334j3277
14707b7685k746o188o103o884J5654N381J268j2282j3211J1106P992J2210j763
14694b3251m358J2057J7252J769l1417j1007J598P347N931k2719q826p181q706
$$ plain form
14681 -71511 -56319 -33045 -27834 -42937 -37719 -29960 -37000 -45551 -55224 -35991 -24411 -24244 -29580
14668 -29580 -13636 -2485 -28910 -33915 -37962 -43638 -43712 -26600 -11046 -11100 -41494 -52842 -22378
14655 -22378 -21545 -29093 -27006 -32850 -50206 -44442 -45234 -42656 -47728 -41188 -33666 -32874 -37125 -38471 -29293
14640 -29293 -26417 -27598 -36275 -38755 -30074 -34008 -34195 -38217 -31763 -30529 -32075 -26125 -36869 -54258
14626 -54258 -56746 -37715 -12539 -8095 -11254 609 -2268 -11901 -18565 -33579 -42701 -40877 -44928
14613 -44928 -56308 -49529 -47453 -43303 -48413 -55719 -39384 -31335 -40634 -53061 -46199 -47812 -49594 -66540
14599 -66540 -80673 -52758 -32380 -22520 -25013 -6342 2964 -6336 -15419 -30648 -45158 -23620 -21699
14586 -21699 -45872 -36734 -23594 -19176 -24496 -34284 -51273 -43858 -41413 -26675 -16627 -13466 -19502
$$ packed form
14681g1511J5192K3274N211j5103N218P759p040q551r673J9233J1580J67n336
14668b9580J5944J1151k6425n005m047n676p4J7112J5554n4l0394j1348L0464
14655b2378Q33p548K087n844j7356N764p92K578n072O540P522P92m251j346R178
14640b9293K876j181q677k480Q681l934j87m022O454J234j546N950j0744j7389
14626e4258k488J9031K5176M444l159J1863k877r633o664j5014r122J824m051
14613d4928j1380O779K076M150n110p306J6335Q049r299j2427O862j613j782j6946
14599f6540j4133K7915K0378R860k493J8671R306r300r083j5229j4510K1538J921
14586b1699k4173R138J3140M418n320r788j6989P415K445J4738J0048L161o036
$$ plain form
14573 -19502 -27937 -48752 -43400 -15156 -26426 -58597 -65228 -68620 -48721 -38401 -50888 -53885 -24750
14560 -24750 -17695 -17611 -25022 -34573 -33840 -44451 -42174 -30911 -31026 -25768 -25205 -41085 -32852 -30569 -32959
14545 -32959 -30238 -30894 -38647 -40939 -36447 -48967 -61709 -63223 -60430 -68231 -71444 -72853 -56804 -46122
14531 -46122 -56475 -46090 -42629 -34840 -29010 -40065 -46391 -46136 -51195 -34673 -31510 -32147 -45224 -41440
14517 -41440 -39300 -37112 -38235 -32379 -26403 -13431 -16085 -9911 -17116 -35521 -30618 -11251 -1624 -5180
14503 -5180 -200 13636 -3037 -15572 -24654 -35107 -46788 -43331 -24119 -18576 -20281 -22179 -19402
14490 -19402 -34400 -34084 -33426 -43391 -46430 -39516 -40695 -28926 -16777 -16325 -8403 -11788 -40906 -32912
14476 -32912 -12053 -4476 -13408 -29120 -23786 -18511 -15281 -16846 -17656 -11739 -21317 -27531 -21755 -19016
$$ packed form
14573a9502q435k0815N352K8244j1270l2171o631l392J9899J0320j2487k997K9135
14560b4750P055Q4p411r551P33j0611K277J1263j15N258N63j5880Q233K283k390
14545c2959K721o56p753k292M492j2520j2742j514K793p801l213j409J6049J0682
14531d6122j0353J0385L461P789N830j1055o326K55n059J6522L163o37j3077L784
14517d1440K140K188j123N856N976J2972k654O174p205j8405M903J9367R627l556
14503e180M980J3836j6673j2535r082j0453j1681L457J9212N543j705j898K777
14490a9402j4998L16O58r965l039O914j179J1769J2149M52P922l385k9118P994
14476c2912K0859P577q932j5712N334N275L230j565q10N917r578o214N776K739
$$ plain form
14462 -19016 -9051 -12195 -34877 -37374 -44153 -45203 -44225 -41507 -21121 -22200 -32374 -17715 -11572 -12417
14448 -12417 -11932 -15928 -6701 -13650 -16068 -33423 -42424 -38937 -44773 -48006 -25063 -2105 9903 -747
14434 -747 -15583 -10575 -15140 -31982 -16399 -15675 -21698 -38763 -55033 -40684 -37854 -12101 849
14421 849 16749 13989 7444 -510 -3839 -4531 -10543 -9702 -5917 4574 -10123 -21183 -20419 -41066
14407 -41066 -65798 -74803 -76083 -79419 -76275 -75132 -78421 -85656 -73073 -46926 -39854 -44985 -36612 -38673
14393 -38673 -33490 -42395 -37822 -48534 -41619 -31077 -23916 -48439 -47593 -35750 -21356 -32849 -39494
14380 -39494 -44068 -28183 -20814 -12813 -28297 -33192 -38526 -44955 -52279 -40079 -40667 -20216 -8297
14367 -8297 -16423 -22664 -13476 4966 -4083 -19014 -25993 -25824 -26226 -30431 -29361 -13624 -10541 -9894 7972
$$ packed form
14462a9016R965l144k2682k497o779j050R78K718K0386j079j0174J4659O143q45
14448a2417M85l996R227o949k418j7355r001L487n836l233K2943K2958J2008j0650
14434g47j4836N008m565j6842J5583P24o023j7065j6270J4349K830K5753J2950
14421H49J5900k760o545p954l329o92o012Q41L785J0491j4697j1060P64k0647
14407d1066k4732r005j280l336L144J143l289p235J2583K6147P072n131Q373k061
14393c8673N183q905M573j0712O915J0542P161k4523Q46J1843J4394j1493o645
14380c9494m574J5885P369Q001j5484m895n334o429p324J2200n88K0451J1919
14367h297q126o241R188J8442r049j4931o979J69m02m205J070J5737L083O47J7866
$$ plain form
14352 7972 13252 -6474 -13216 -29389 -36447 -31825 -20892 -24159 -32009 -36623 -42431 -47354 -32155 -6074
14338 -6074 -4362 -4739 -10974 -34754 -29915 -24312 -24937 -21733 -23395 -38879 -39959 -34192 -8554 1914
14324 1914 -5193 -19022 -25905 -38251 -35400 -16700 -5895 -5301 74 4366 -1955 8196 6505 -1183
14310 -1183 -4956 -17181 -7030 12033 -13466 -41635 -42145 -43150 -47414 -54147 -59287 -33094 -4784
14297 -4784 17064 18682 -4374 -16444 -5302 5003 -6054 -379 -8821 -9795 -6804 323 -10096
14284 -10096 -13229 -7103 368 13855 26889 34373 39352 33881 9408 2746 -8752 2072 35891
14271 35891 20504 27865 37719 50550 59129 64439 64560 58531 37316 7766 -7931 -15842 -14375
14258 -14375 -12931 -29166 -25205 -5716 15968 11679 15287 6825 -25012 -46097 -53097 -54259 -43402
$$ packed form
14352G972N280j9726o742j6173p058M622J0933l267p850m614n808m923J5199K6081
14338f074J712l77o235k3780M839N603o25L204j662j5484j080N767K5638J0468
14324A914p107j3829o883j2346K851J8700J0805N94N375M292o321J0151j691p688
14310a183l773j2225J0151J9063k5499k8169n10j005m264o733n140K6193K8310
14297d784K1848J618k3056j2070J1142J0305j1057N675q442r74K991P127j0419
14284a0096l133O126P471J3487J3034P484M979n471k4473o662j1498J0824L3819
14271C5891j5387P361R854J2831Q579N310J21o029k1215k9550j5697p911J467
14258a4375J444j6235L961J9489K1684m289L608q462l1837k1085p000j162J0857
$$ plain form
14245 -43402 -37343 -29763 -13488 -7441 -9866 -12147 -16261 -10661 -18384 -46877 -48784 -29249 -2097
14232 -2097 363 -7264 -28397 -30887 -23575 -33008 -23691 -34640 -37478 -28680 -26062 -39149 -37530 -30627
14218 -30627 -23680 -37746 -48813 -38010 -21547 -39587 -53344 -63552 -70152 -63595 -55291 -52752 -59477
14205 -59477 -48038 -40548 -44498 -46832 -43989 -27332 -37768 -61633 -71037 -56664 -61649 -58140 -66632
14192 -66632 -58939 -27444 -31060 -23717 -3302 4501 -7668 -6431 -9375 -3592 7241 9376 14930
14179 14930 4393 -9567 -28169 -40565 -40613 -35829 -21780 -12470 -11818 -37865 -51924 -41765 -30653
14166 -30653 -31851 -40443 -41411 -51577 -50493 -53614 -46092 -41595 -43939 -53728 -49538 -51733 -37884 -48068
14152 -48068 -50299 -39403 -54320 -43810 -43016 -39668 -55812 -61314 -49398 -56200 -53559 -42396 -29653
$$ packed form
14245d3402O059P580J6275O047k425k281m114N600p723k8493j907J9535K7152
14232b097K460p627k1133k490P312r433R317j0949k838Q798K618j3087J619O903
14218c0627O947j4066j1067J0803J6463j8040j3757j0208o600O557Q304K539o725
14205e9477J1439P490l950k334K843J6657j0436k3865r404J4373m985L509q492
14192f6632P693L1495l616P343K0415P803j2169J237k944N783J0833K135N554
14179A4930j0537j3960j8602j2396m8M784J4049R310O52k6047j4059J0159J1112
14166c0653j198q592r68j0166J084l121P522M497k344r789M190k195J3849j0184
14152d8068k231J0896j4917J0510P94L348j6144n502J1916o802K641J1163J2743
$$ plain form
14139 -29653 -24525 -17576 -23455 -29888 -11266 10424 20193 -2773 -19889 -19203 -30914 -21646 2436
14126 2436 -3891 -22805 -32534 -17532 -22212 -31465 -32971 -39045 -38892 -36557 -26356 -39448 -42754 -35462
14112 -35462 -51980 -54465 -42306 -45342 -57462 -49802 -22175 -25418 -29023 -35274 -46912 -34718 -28957
14099 -28957 -39669 -58147 -44884 -41501 -40101 -32954 -21926 -19996 -30224 -34003 -35959 -33357 -39497
14086 -39497 -45291 -45881 -35630 -26049 -43208 -39282 -31937 -34697 -21418 -26805 -56230 -72681 -52774
14073 -52774 -34648 -42376 -22654 -9527 -13435 -12116 -20366 -21967 -35203 -53346 -46486 -28954 -25342
14060 -25342 -39962 -52999 -58816 -47832 -27974 -25545 -17726 -19693 -23807 -35596 -32199 -33833 -33031
14047 -33031 -18034 -2829 -2584 -22059 -47518 -38607 -24650 -24533 -38480 -43593 -41765 -26758 -10660
$$ packed form
14139b9653N128O949n879o433J8622K1690R769k2966j7116O86j1711R268K4082
14126B436o327j8914r729J5002m680r253j506o074J53K335J0201j3092l306P292
14112c5462j6518k485J2159l036j2120P660K7627l243l605o251j1638J2194N761
14099b8957j0712j8478J3263L383J400P147J1028J930j0228l779j956K602o140
14086c9497n794n90J0251R581j7159L926P345k760J3279n387k9425j6451J9907
14073e2774J8126p728J9722J3127l908J319q250j601j3236j8143O860J7532L612
14060b5342j4620j3037n817J0984J9858K429P819j967m114j1789L397j634Q02
14047c3031J4997J5205K45j9475k5459Q911J3957J17j3947n113J828J5007J6098
$$ plain form
14034 -10660 -15479 -11811 1171 1988 -5965 -18116 -17189 -23669 -25665 -30738 -39934 -44552 -47983 -63128
14020 -63128 -52578 -21000 -6141 -17588 -20210 -26845 -29087 -34777 -45245 -45487 -39896 -35828 -32818
14007 -32818 -23248 -2152 -5420 -14919 -26785 -35136 -14672 -6724 4327 3109 9225 7159 1923
13994 1923 -1765 -16093 -19139 -4285 -1220 -5894 14111 29633 43714 53367 57220 53668 59602
13981 59602 67738 57020 55454 91174 143388 211136 288800 356825 409148 410637 361424 288345
13969 288345 230186 195900 162110 115086 93669 90434 92845 83498 73771 75507 73082 78059 92447
13956 92447 73987 68033 49502 23544 29617 46011 50050 34528 43362 59863 61387 64724 53056
13943 53056 45822 56491 61497 51411 45262 31443 32363 30221 23272 15423 13827 18621 22190 19709
$$ packed form
14034a0660m819L668J2982Q17p953j2151R27o480j996n073r196m618l431j5145
14020f3128J0550L1578J4859j1447k622o635k242n690j0468k42N591M068L010
14007c2818R570K1096l268r499j1866q351K0464P948J1051j218O116k066n236
13994A923l688j4328l046J4854L065m674K0005J5522J4081R653L853l552N934
13981E9602Q136j0718j566L5720N2214O7748P7664O8025N2323J489m9213p3079
13969B88345n8159l4286l3790m7024k1417l235K411r347r727J736k425M977J4388
13956I2447j8460n954j8531k5958O073J6394M039j5522Q834J6501J524L337j1668
13943E3056p234J0669N006j0086o149j3819R20k142o949p849j596M794L569k481
$$ plain form
13929 19709 37758 38492 6744 20177 57023 49271 16575 12786 9959 1297 198 -4230 -5674
13916 -5674 -6924 -9899 -11172 -11630 -1459 15026 15224 24180 27502 16873 23959 32066 25219 10150
13902 10150 -7913 -17813 -21290 -25374 -24830 -26223 -22840 -11961 3507 2198 1685 -7946 -4201 6578
13888 6578 25049 9883 -21237 -21330 -7912 -17787 -18025 -14640 -21710 -38278 -38957 -41852 -58993 -59992
13874 -59992 -38338 -25776 -26187 -17014 -9830 -26870 -37369 -15601 -11179 -19471 -11166 -552 -3402
13861 -3402 -5489 -21407 -24766 -20295 -12561 -21713 -20491 -38445 -19171 9041 8746 -9453 -21469
13848 -21469 -26559 -28120 -27131 -18831 -18226 229 -25550 -42607 -20867 2688 1685 3126 441 -17402
13834 -17402 -15564 -20542 -22096 -3438 31811 31638 24623 781 8993 29512 22989 24045 18894 15016
$$ packed form
13929A9709J8049P34l1748J3433L6846p752l2696l789k827q662j099m428j444
13916e674j250k975j273m58J0171J6485J98Q956L322j0629P086Q107o847j5069
13902A0150j8063r900l477m084N44j393L383J0879J5468j309n13r631L745J0779
13888F578J8471j5166l1120r3J3418r875k38L385p070j6568o79k895j7141r99
13874e9992K1654J2562m11R173P184j7040j0499K1768M422q292Q305J0614k850
13861c402k087j5918l359M471P734r152J222j7954J9274K8212k95j8199j2016
13848b1469n090j561R89Q300O05J8455k5779j7057K1740K3555j003J441k685j7843
13834a7402J838m978j554J8658L5249j73p015k3842Q212K0519o523J056n151l878
$$ plain form
13820 15016 -351 4496 11500 13799 6635 15697 17326 16715 16753 5416 1567 -22290 -42388 -37925
13806 -37925 -30735 -37205 -37007 -21825 -19927 -43932 -49058 -31125 -23039 -10894 -15341 -21558 -34066
13793 -34066 -44058 -32060 -3207 3274 -12367 -30656 -43454 -51637 -55053 -41453 -37666 -26825 -8765
13780 -8765 -21642 -30223 -32263 -35842 -45756 -37273 -18965 -5366 -16952 -31738 -33264 -53467 -48981
13767 -48981 -57239 -49829 -43009 -20509 -21929 -38400 -27485 -22393 -24576 -20033 -20583 -16844 -26573 -45230
13753 -45230 -53628 -50380 -48376 -38326 -40376 -28567 -27397 -18582 -7541 10164 -2816 -38452 -65558
13740 -65558 -70004 -46788 -27015 -30676 -42428 -41850 -26003 -14758 -11458 -13453 -19597 -37824 -44970
13727 -44970 -40951 -48932 -67501 -74530 -75009 -76222 -81460 -80437 -67114 -74294 -58817 -35283 -32660 -43197
$$ packed form
13820A5016j5367M847P004K299p164R062J629o11L8j1337l849k3857k0098M463
13806c7925P190o470J98J5182J898k4005n126J7933Q086J2145m447o217j2508
13793c4066r992J1998K8853O481j5641j8289j2798q183l416J3600L787J0841J8060
13780h765j2877q581k040l579r914Q483J8308J3599j1586j4786j526k0203M486
13767d8981q258P410O820K2500j420j6471J0915N092k183M543n50L739r729j8657
13753d5230q398L248K004J0050k050J1809J170Q815J1041J7705j2980l5636k7106
13740f5558m446K3216J9773l661j1752N78J5847J1245L300j995o144j8227p146
13727d4970M019p981j8569p029m79j213n238J023J3323p180J5477K3534K623j0537
$$ plain form
13713 -43197 -32142 -35535 -45215 -48425 -53045 -57131 -58093 -37343 -44380 -37707 -22790 -11487 -19110 -25670
13699 -25670 -19999 -30642 -25279 -18391 -17714 -17022 -15809 -23910 -25868 -18268 -8674 -15895 -21994 -37161
13685 -37161 -49094 -43125 -57685 -38261 -28346 -26068 -20128 -12040 -14888 -24310 -22812 -20813 -29772 -35954
13671 -35954 -22373 -2072 -15384 -31199 -42681 -61802 -72586 -68271 -65077 -59103 -51663 -28444
13659 -28444 -3501 -4049 -4794 -3752 -1711 2982 -4639 -40176 -57128 -56693 -36911 -12372 -5852 -21505
13645 -21505 -20196 -9583 -29506 -31706 -28035 -29445 -17044 -1701 -6273 -18302 -18710 1659 5599
13632 5599 -3369 -13335 -16316 -41219 -47924 -44195 -34972 -30158 -25813 -41178 -31996 -39081 -22696 -20452
13618 -20452 -2109 10979 -37 -20769 -31060 -39542 -38820 -39390 -49800 -26290 -17602 -11069 -8014
$$ packed form
13713d3197J1055l393r680l210m620m086r62K0750p037O673J4917J1303p623o560
13699b5670N671j0643N363O888O77O92J213q101j958P600R594p221o099j5167
13685c7161j1933N969j4560J9424R915K278N940Q088k848r422J498J999q959o182
13671c5954J3581K0301j3312j5815j1482j9121j0784M315L194N974P440K3219
13659b8444K4943n48p45J042K041M693p621l5537j6952M35J9782K4539O520j5653
13645b1505J309J0613j9923k200L671j410J2401J5343m572j2029m08K0369L940
13632E599q968r966k981k4903o705L729R223M814M345j5365R182p085J6385K244
13618b0452J8343J3088j1016k0732j0291q482P22n70j0410K3510Q688O533L055
$$ plain form
13605 -8014 -22622 -30106 -37891 -18819 10226 19601 6204 -2822 -8078 -36007 -39027 -34659 -46971
13592 -46971 -47817 -42870 -40022 -68088 -72848 -52918 -22279 -20301 -21008 -38771 -23347 -13653 -22307 -22420
13578 -22420 -25618 -23009 -7573 14996 16635 3462 3216 20453 31185 14905 -4073 -21132 -33455
13565 -33455 -16068 -13740 -19691 -30419 -26537 -24275 4416 7163 2264 8949 2676 1028 -4715 5252
13551 5252 29123 25233 -7798 -30616 -31107 -19488 -21462 -35852 -64046 -68258 -45782 -34343 -38665
13538 -38665 -25849 7136 21978 21066 9509 134 -22233 -20520 -8346 -16422 -38954 -37646 -32468
13525 -32468 -26479 -23065 509 9279 -1782 -19082 -30442 -18981 -12330 17094 18057 -5426 15977
13512 15977 22896 26898 39928 24907 9820 21104 13519 -8148 1542 436 -10574 -30251 -48085
$$ packed form
13605h014j4608p484p785J9072K9045R375j3397r026n256k7929l020M368j2312
13592d6971q46M947K848k8066m760J9930L0639J978p07j7763J5424R694q654j13
13578b2420l198K609J5436K2569J639j3173k46J7237J0732j6280j8978j7059j2323
13565c3455J7387K328n951j0728L882K262K8691K747m899O685o273j648n743R967
13551E252K3871l890l3031k2818m91J1619j974j4390k8194m212K2476J1439m322
13538c8665J2816L2985J4842r12j1557r375k2367J713J2174q076k2532J308N178
13525c2468N989L414K3574Q770j1061j7300j1360J1461O651K9424R63k3483K1403
13512A5977O919M002J3030j5021j5087J1284p585k1667R690j106j1010j9677j7834
$$ plain form
13499 -48085 -52143 -42628 -30544 -19746 -5493 -30039 -42198 -26374 2013 -2261 -21917 -27610
13487 -27610 -19981 -23329 -14828 -31848 -37229 -26352 -28499 -21597 -1331 -407 169 -5629 -14135 -10121
13473 -10121 11482 5207 -2056 -292 936 -1938 4111 7425 -15453 -17738 -8504 -10141 -30838 -31763
13459 -31763 -32211 -14021 -8902 -13691 -11573 -14775 -27743 -49100 -61669 -46888 -40954 -49474 -44626
13446 -44626 -45892 -51458 -59392 -56973 -50307 -36797 -37131 -40775 -34796 -33257 -25176 -6521 54 -10692
13432 -10692 -31127 -24620 -14152 -8166 7889 4367 -6984 -12978 -10791 -13708 -13288 -11712 -1793 -8963
13418 -8963 -20587 -5575 -17800 -31259 -22590 -21049 -36101 -50974 -51240 -38993 -43582 -37066 -38424
13405 -38424 -31101 -26023 -26497 -36011 -46723 -27789 -36175 -49287 -40915 -25049 -14478 -20490 -39196
$$ packed form
13499d8085m058R515J2084J0798J4253k4546j2159J5824K8387m274j9656n693
13487b7610P629l348Q501j7020n381J0877k147O902K0266R24N76n798q506M014
13473a0121K1603o275p263J764J228k874O049L314k2878k285R234j637k0697r25
13459c1763m48J8190N119m789K118l202j2968k1357j2569J4781N934q520M848
13446d4626j266n566p934K419O666J3510l34l644N979J539Q081J8655O575j0746
13432a0692k0435O507J0468N986J6055l522j1351n994K187k917M20J576R919p170
13418h963j1624J5012j2225j3459Q669J541j5052j4873k66J2247m589O516j358
13405c8424P323N078m74r514j0712J8934q386j3112Q372J5866J0571o012j8706
$$ plain form
13392 -39196 -42482 -41777 -43235 -20125 -8910 -13992 -10684 -11906 -12338 -5792 10410 20883 23378 8726
13378 8726 17017 5177 -26600 -46188 -41862 -33104 -23734 -32006 -29236 -39448 -44721 -34598 -46374
13365 -46374 -36855 -35043 -9190 -7450 2046 -5733 2929 18015 10186 -8849 -21682 -26069 -34212
13352 -34212 -32011 -24825 -24015 -17964 -5265 -2378 -2835 -23055 -44468 -45101 -48693 -57440 -51222 -50615 -37683
13337 -37683 -28296 -25449 -10401 -2761 -26670 -31517 -25899 -25133 -9627 -16489 -31321 -13154 -6298
13324 -6298 -25625 -30655 -21984 -24651 -24386 -16725 -17216 -21126 -23340 -20177 -22389 -27053 -4192 1080 -1164
13309 -1164 -9812 -11341 -25451 -33539 -9986 -4521 -1415 -10711 -3840 -12501 -23674 -20494 -27574 -26543
13295 -26543 -24314 -13996 -116 -8770 -5736 8257 3777 -6632 -8647 -7974 13446 28842 37287
$$ packed form
13392c9196l286P05j458K3110J1215n082L308j222m32O546J6202J0473K495j4652
13378H726Q291j1840l1777j9588M326Q758R370q272K770j0212n273J0123j1776
13365d6374R519J812K5853J740R496p779Q662J5086p829j9035j2833m387q143
13352c4212K201P186Q10O051J2699K887m57k0220k1413o33l592q747O218O07J2932
13337c7683R387K847J5048P640k3909m847N618P66J5506o862j4832J8167O856
13324f298j9327n030Q671k667K65P661m91l910k214L163k212m664K2861N272k244
13309a164q648j529j4110q088K3553N465L106r296O871q661j1173L180p080J031
13295b6543K229J0318J3880q654L034J3993m480j0409k015O73K1420J5396Q445
$$ plain form
13282 37287 38197 25237 16837 -1706 -10227 -12678 -2099 3147 -60 -1641 15727 13468 14860 22455
13268 22455 28732 29667 31898 24299 28199 41329 50326 54486 47205 32316 34725 51052 66656 59650
13254 59650 70015 73046 52786 59187 54167 42522 32167 11236 30772 46012 42820 39172 26747
13241 26747 21531 18620 6657 -6080 -12188 -12435 12540 13353 21509 17021 31480 27292 14763 -5143
13227 -5143 -28180 -2993 7458 11759 18843 19753 5264 -9068 1843 7813 19436 23964 29207
13214 29207 44469 44088 44630 46128 32354 15254 20151 34849 54348 64296 69552 54109 38807
13201 38807 41352 62084 64135 59061 49973 59090 83947 90061 97459 117692 129547 152036 196329
13188 196329 251878 285834 349254 433290 554042 702207 888174 1147327 1403997 1669281
$$ packed form
13282C7287R10j2960q400j8543q521k451J0579N246l207j581J7368k259J392P595
13268B2455O277R35K231p599L900J3130Q997M160p281j4889K409J6327J5604p006
13254E9650J0365L031k0260O401n020j1645j0355k0931J9536J5240l192l648j2425
13241B6747n216k911j1963j2737o108k47K4975Q13Q156m488J4459m188j2529j9906
13227e143k3037K5187J0451M301P084R10j4489j4332J0911N970J1623M528N243
13214B9207J5262l81N42J498j3774j7100M897J4698J9499R948N256j5443j5302
13201C8807K545K0732K051n074r088R117K4857O114P398K0233J1855K2489M4293
13188A96329N5549L3956O3420Q4036J20752J48165J85967K59153K56670K65284
$$ plain form
13178 1669281 1949154 2198961 2425251 2596829 2658375 2633534 2545833 2392765 2184523 1951857
13168 1951857 1742976 1542962 1360152 1196441 1060868 975074 912367 886627 865357 832902
13158 832902 821218 802508 806476 807068 798685 793994 792886 791473 775020 761228 749047 726818 723891
13145 723891 704089 664773 651763 658164 674787 662680 649223 637220 618998 591526 577596 584668
13133 584668 576861 555597 545416 536157 507503 461432 407397 403548 410038 383360 361728 351683
13121 351683 345205 325215 285065 278126 271588 262106 256176 259599 233096 204156 206582 205448 186565
13108 186565 152023 123162 99874 112742 127988 139314 118479 109369 94686 99036 90379 100736
13096 100736 108383 103974 101762 120411 121882 123921 114239 115848 120803 133552 148694 134577 119909
$$ packed form
13178A669281K79873K49807K26290J71578O1546k4841q7701j53068k08242k32666
13168A951857k08881k00014j82810j63711j35573q5794o2707k5740k1270l2455
13158H32902j1684j8710L968N92q383m691j108j413j6453j3792j2181k2229k927
13145G23891j9802l9316j3010O401J6623j2107j3457j2003j8222k7472j3930P072
13133E84668p807k1264j0181r259k8654m6071n4035l849O490k6678k1632j0045
13121C51683o478j9990m0150o939o538r482n930L423k6503k8940K426j134j8883
13108A86565l4542k8861k3288J2868J5246J1326k0835r110j4683M350q657J0357
13096A00736P647m409k212J8649J471K039r682J609M955J2749J5142j4117j4668
$$ plain form
13083 119909 100102 77544 58236 45877 33512 20010 10217 18250 47921 58826 48647 51643
13071 51643 51823 45497 58534 60363 55087 50027 41849 79117 104998 93841 96023 87688 64905
13058 64905 74257 92030 111163 109724 98803 59167 27457 40094 21751 5117 -5173 15526
13046 15526 26056 27400 44314 45946 33352 27187 14686 -474 -6507 -1212 11899 2118 13612
13033 13612 22635 13231 18282 12576 8145 8819 9128 9141 30901 39093 25718 23605 48292 61592
13019 61592 69255 102310 150412 190925 252419 308629 377887 466895 560760 664691 775390
13008 775390 885583 974190 1072969 1157594 1191518 1204296 1198591 1159723 1109190 1041236 1003465
12997 1003465 950807 877008 814626 767880 715192 664464 620586 581760 539960 512603 489362
$$ packed form
13083A19909j9807k2558j9308j2359j2365j3502r793Q033K9671J0905j0179K996
13071E1643J80o326J3037J829n276n060q178L7268K5881j1157K182q335k2783
13058F4905R352J7773J9133j439j0921l9636l1710J2637j8343j6634j0290K0699
13046A5526J0530J344J6914J632j2594o165j2501j5160o033N295J3111r781J1494
13033A3612R023r404N051n706m431O74L09J3K1760Q192j3375k113K4687J3300
13019F1592P663L3055M8102M0513O1494N6210O9258Q9008R3865J03931J10699
13008G75390J10193Q8607R8779Q4625L3924J2778n705l8868n0533o7954l7771
12997A003465n2658p3799o2382m6746n2688n0728m3878l8826m1800k7357k3241
$$ plain form
12986 489362 471446 467743 453381 444950 436778 422365 399245 369001 331557 295270 304772 311212
12974 311212 288851 264515 233131 196072 178606 147739 122517 104235 86645 62329 64899 85467
12962 85467 95188 76181 73189 68685 72028 93041 80177 71948 86071 95466 90456 84981 88155
12949 88155 70385 42918 38108 18226 -4039 -285 6741 -20207 -29347 -19342 -15294 -23754 -31812
12936 -31812 -17546 -3708 22480 63876 110727 134413 134300 146321 136014 120091 102288 79408
12924 79408 37660 8743 -14042 -19625 -408 -4616 -14748 -5667 12100 52363 82562 81307
12912 81307 70327 75265 85828 75213 55184 52786 43412 22380 13821 18186 16601 2688 -24221
12899 -24221 -30570 -35526 -41334 -26601 -341 18548 57274 78133 88392 122827 174573 236017
$$ packed form
12986D89362j7916l703j4362q431q172j4413k3120l0244l7444l6287R502O440
12974C11212k2361k4336l1384l7059j7466l0867k5222j8282j7590k4316K570K0568
12962H5467R721j9007k992m504L343K1013j2864q229J4123R395n010n475L174
12949H8155j7770k7467m810j9882k2265L754P026k6948r140J0005M048q460q058
12936c1812J4266J3838K6188M1396M6851K3686j13J2021j0307j5923j7803k2880
12924G9408m1748k8917k2785n583J9217m208j0132R081J7767M0263L0199j255
12912H1307j0980M938J0563j0615k0029k398r374k1032q559M365j585j3913k6909
12899b4221o349m956n808J4733K6260J8889L8726K0859J0259L4435N1746O1444
$$ plain form
12887 236017 273985 312917 374880 433589 488816 562864 623307 688613 760071 798692 794496 805125
12875 805125 828142 825326 815717 777484 729453 680940 629790 607499 567226 535202 510689 504224
12863 504224 511994 539602 556609 566733 578606 610562 649815 709223 750709 785300 809803 850138
12851 850138 899141 961043 1022777 1067099 1118351 1208808 1269647 1326742 1411417 1477832 1552265
12840 1552265 1664931 1738241 1803113 1875623 1959961 2049144 2135332 2223925 2337366 2421704 2491384
12829 2491384 2578588 2664769 2727633 2776939 2830726 2873464 2906166 2943217 3007787 3082646 3154939
12818 3154939 3237632 3331154 3399520 3472724 3529510 3558898 3594197 3618248 3625313 3634035 3657787 3691661
12806 3691661 3733188 3774237 3823870 3863182 3913058 3960770 4019704 4099895 4186564 4273237 4330642
$$ packed form
12887B36017L7968L8932O1963N8709N5227P4048O0443O5306P1458L8621m196J0629
12875H05125K3017k816r609l8233m8031m8513n1150k2291m0273l2024k4513o465
12863E04224P770K7608J7007J0124J1873L1956L9253N9408M1486L4591K4503M0335
12851H50138M9003O1902O1734M4322N1252R0457O0839N7095Q4675O6415P4433
12840A552265J12666P3310O4872P2510Q4338Q9183Q6188Q8593J13441Q4338O9680
12829B491384Q7204Q6181O2864M9306N3787M2738L2702L7051O4570P4859P2293
12818C154939Q2693R3522O8366P3204N6786K9388L5299K4051P065Q722K3752L3874
12806C691661M1527M1049M9633L9312M9876M7712N8934Q0191Q6669Q6673N7405
$$ plain form
12795 4330642 4403976 4510329 4648517 4803402 4942182 5120802 5334476 5574404 5811011 6067906
12785 6067906 6306008 6550272 6783235 6991705 7207142 7462521 7733179 8048855 8429075
12776 8429075 8944433 9585180 10378917 11370500 12585638 14047440 15815926 17936664 20430437
12767 20430437 23368264 26905570 31236184 36585067 43438651 52564571 65113057 82710975
12759 82710975 107172067 139351983 179077729 226022630 277404636 329588804 379342637
12752 379342637 423296583 457344784 476659052 480823445 470972857 448877301 416253129
12745 416253129 376036881 334216649 294504807 258665901 227276113 202031897 184089921
12738 184089921 171753601 163066125 156710318 151898276 148108716 145069764 142522276 140339222
$$ packed form
12795D330642P3334J06353J38188J54885J38780J78620K13674K39928K36607K56895
12785F067906K38102K44264K32963K08470K15437K55379K70658L15676L80220
12776H429075N15358O40747P93737R91583J215138J461802J768486K120738K493773
12767B0430437K937827L537306M330614N348883O853584R125920J2548486J7597918
12759H2710975K4461092L2179916L9725746M6944901N1382006N2184168M9753833
12752C79342637M3953946L4048201J9314268M164393r850588k2095556l2624172
12745D16253129m0216248m1820232l9711842l5838906l1389788k5244216j7941976
12738A84089921j2336320q687476o355807m812042l789560l038952k547488k183054
$$ plain form
12730 140339222 138442561 136743338 135181253 133663153 132120679 130514065 128758921 126770240
12722 126770240 124570163 122143096 119533818 116729628 113776391 110731655 107623365 104481403
12714 104481403 101329553 98217220 95185526 92241958 89340636 86446878 83537841 80617805
12706 80617805 77684576 74681609 71598855 68449473 65244658 62052030 58905308 55837436
12698 55837436 52863826 50047600 47387711 44875061 42508863 40264661 38154253 36189823
12690 36189823 34323106 32546992 30908903 29399257 27972834 26628884 25362216 24166244
12682 24166244 23059623 22008411 21007614 20052419 19121236 18209747 17354509 16558325 15800506
12673 15800506 15066500 14362240 13679334 13052047 12449477 11887480 11360030 10864701 10394396
$$ packed form
12730A40339222j896661j699223j562085j518100j542474j606614j755144j988681
12722A26770240k200077k427067k609278k804190k953237l044736l108290l141962
12714A04481403l151850l112333l031694k943568k901322k893758k909037k920036
12706H0617805k933229l002967l082754l149382l204815l192628l146722l067872
12698E5837436k973610k816226k659889k512650k366198k244202k110408j964430
12690C6189823j866717j776114j638089j509646j426423j343950j266668j195972
12682B4166244j106621j051212j000797r55195r31183r11489q55238p96184p57819
12673A5800506p34006p04260o82906o27287o02570n61997n27450m95329m70305
$$ plain form
12664 10394396 9919902 9464668 9063521 8683986 8299245 7934656 7606156 7286445 6994240
12655 6994240 6701914 6430122 6169649 5908175 5673302 5437032 5214721 5041525 4854655
12646 4854655 4667802 4471987 4295115 4128489 3987598 3865402 3754679 3644344 3522650
12637 3522650 3421896 3341133 3260069 3186995 3114379 3043911 2987315 2930331 2870131 2811254 2730798
12626 2730798 2630083 2531927 2434026 2299947 2177410 2070199 1950758 1836920 1738787 1648657
12616 1648657 1584469 1522151 1505144 1521881 1527517 1512780 1528624 1540083 1522253 1522281 1544086 1550674
12604 1550674 1547957 1532905 1501952 1467675 1443918 1420656 1403044 1422725 1453951 1470463 1465007 1472801
12592 1472801 1492921 1511561 1537912 1554293 1578336 1642119 1714294 1791427 1870597 1944826 2007324
$$ packed form
12664A0394396m74494m55234m01147l79535l84741l64589l28500l19711k92205
12655F994240k92326k71792k60473k61474k34873k36270k22311j73196j86870
12646D854655j86853j95815j76872j66626j40891j22196j10723j10335j21694
12637C522650j00754q0763q1064p3074p2616p0468n6596n6984o0200n8877q0456
12626B730798j00715r8156r7901j34079j22537j07211j19441j13838r8133r0130
12616A648657o4188o2318j7007J6737N636j4737J5844J1459j7830K8K1805O588
12604A550674k717j5052l0953l4277k3757k3262j7612J9681L1226J6512n456P794
12592A472801K0120J8640K6351J6381K4043O3783P2175P7133P9170P4229O2498
$$ plain form
12581 2007324 2054182 2099568 2173750 2208309 2218222 2230725 2221498 2255515 2260993 2249306 2264535 2291680
12569 2291680 2320140 2366466 2417613 2465886 2510454 2564107 2601155 2664018 2700537 2703155 2690349
12558 2690349 2662565 2621112 2578600 2556811 2496033 2428174 2349894 2284185 2245978 2210201 2183281
12547 2183281 2154381 2111074 2079133 2048142 2014228 1980685 1979959 1946898 1915582 1885130 1847781 1807075
12535 1807075 1769988 1742898 1693359 1645207 1603997 1579243 1550221 1526111 1476006 1420542 1377169
12524 1377169 1333828 1268619 1214399 1179997 1134379 1104741 1065764 1034338 1024815 1037172 1034656 1023877
12512 1023877 1022579 1031092 1029610 1033100 1036007 1037099 1053878 1056529 1082507 1105379 1102885 1077652 1055391
12499 1055391 1043466 1022451 994238 952897 909838 892469 867045 828234 785294 748499 711056
$$ packed form
12581B007324M6858M5386P4182L4559R913J2503r227L4017N478j1687J5229K7145
12569B291680K8460M6326N1147M8273M4568N3653L7048O2863L6519K618j2806
12558B690349k7784m1453m2512k1789o0778o7859p8280o5709l8207l5777k6920
12547B183281k8900m3307l1941l0991l3914l3543p26l3061l1316l0452l7349m0706
12535A807075l7087k7090m9539m8152m1210k4754k9022k4110n0105n5464m3373
12524A377169m3341o5209n4220l4402m5618k9638l8977l1426r523J2357k516j0779
12512A023877j298Q513j482L490K907J092J6779K651K5978K2872k494k5233k2261
12499A055391j1925k1015k8213m1341m3059j7369k5424l8811m2940l6795l7443
$$ plain form
12488 711056 709991 709179 723066 753869 773775 796227 794211 797175 793522 756429 727580 706226 677191
12475 677191 659140 626264 599536 565480 536715 520860 507611 482895 461990 462345 468176 453379
12463 453379 429802 426066 406196 412146 427696 434597 425421 428631 423527 418319 430560 416621 419869
12450 419869 433212 431656 422707 429949 443493 446748 455004 473662 502253 510725 497162 479100 475483
12437 475483 471518 484883 499942 503339 523409 542257 548451 565751 576223 572480 576335 576978 578297
12424 578297 575802 575161 587090 595252 587062 606622 625263 610815 584676 577038 547123 543014 526063
12411 526063 519495 521863 505892 495221 476389 490687 494546 473119 482718 469946 473302 475321 478310
12398 478310 484875 496394 497668 478569 473109 456810 445450 455053 448291 438655 430928 399412 386809
$$ packed form
12488G11056j065q12J3887L0803J9906K2452k016K964l653l7093k8849k1354k9035
12475F77191j8051l2876k6728l4056k8765j5855j3249k4716k0905L55N831j4797
12463D53379k3577l736j9870N950J5550O901r176L210n104n208J2241j3939L248
12450D19869J3343j556q949P242J3544L255Q256J8658K8591Q472j3563j8062l617
12437D75483l965J3365J5059L397K0070J8848O194J7300J0472l743L855O43J319
12424E78297k495o41J1929Q162q190J9560J8641j4448k6139p638k9915m109j6951
12411E26063o568K368j5971j0671j8832J4298L859k1427R599j2772L356K019K989
12398D78310O565J1519J274j9099n460j6299j1360R603o762r636p727l1516j2603
$$ plain form
12385 386809 402692 416730 410893 389687 409512 427509 430724 436398 445964 425181 426126 434927 419543
12372 419543 409721 417205 413163 409961 411674 402522 397722 415096 414505 406738 372568 336472 314199
12359 314199 308962 306418 295107 290541 284034 265249 254539 239468 231285 222770 210661 195251 206748
12346 206748 219118 189992 173973 173304 173984 152748 158317 175540 191186 203839 226934 254684
12334 254684 273773 316481 336313 372251 430740 525590 670060 850446 1055267 1298112 1568238
12323 1568238 1831668 2096660 2345548 2540947 2660751 2692792 2643702 2523369 2347360 2132313
12313 2132313 1925777 1736977 1558167 1412759 1277742 1166361 1127994 1117538 1123769 1114708
12303 1114708 1108450 1121532 1124358 1132652 1132328 1121150 1092425 1064284 1038247 1010382 976983 962021
$$ packed form
12385C86809J5883J4038n837k1206J9825J7997L215N674R566k0783R45Q801j5384
12372D19543r822P484m042l202J713r152m800J7374n91p767l4170l6096k2273
12359C14199n237k544j1311m566o507j8785j0710j5071q183q515j2109j5410J1497
12346B06748J2370k9126j6019o69O80k1236N569J7223J5646J2653K3095K7750
12334B54684J9089M2708J9832L5938N8489R4850J44470J80386K04821K42845K70126
12323A568238K63430K64992K48888J95399J19804L2041m9090j20333j76009k15047
12313B132313k06536j88800j78810j45408j35017j11381l8367j0456O231r061
12303A114708o258J3082K826Q294l24j1178k8725k8141k6037k7865l3399j4962
$$ plain form
12291 962021 946472 930006 901317 875819 856728 849653 850659 846461 829257 809916 789520 760836
12279 760836 759748 761374 750264 744498 732532 728350 705094 684967 676372 674706 667055 652620 640233
12266 640233 642958 630465 616306 619832 627429 619138 605013 587349 563273 520822 505708 487446
12254 487446 461172 444056 442558 436396 431175 388604 376136 371412 371781 362523 340087 335869 314818
12241 314818 306518 311830 322185 350555 352683 348677 368094 383213 385841 362962 362637 357180 347473
12228 347473 316818 301392 317045 321561 311394 299183 298362 281627 233850 193200 169553 163529
12216 163529 164951 166896 165006 154486 142155 136054 135062 139304 131668 117731 119996 115437 104889
12203 104889 102666 101997 105048 94505 98628 119226 110026 103459 85081 62822 76262 89470 86137
$$ packed form
12291I62021j5549j6466k8689k5498j9091p075J006m198j7204j9341k0396k8684
12279G60836j088J626j1110n766j1966m182k3256k0127q595j666p651j4435j2387
12266F40233K725j2493j4159L526P597q291j4125j7664k4076m2451j5114j8262
12254D87446k6274j7116j498o162n221m2571j2468m724L69r258k2436m218k1051
12241C14818q300N312J0355K8370K128m006J9417J5119K628k2879l25n457r707
12228C47473l0655j5426J5653M516j0167j2211q21j6735m7777m0650k3647o024
12216A63529J422J945j890j0520j2331o101r92M242p636j3937K265m559j0548
12203A04889k223o69L051j0543M123K0598r200o567j8378k2259J3440J3208l333
$$ plain form
12190 86137 83825 90573 96383 103752 94082 82624 82336 84785 104998 115652 108772 95158 86370 85531
12176 85531 81909 82228 82016 90538 122643 124965 107207 89637 86037 77889 93809 103125 89486 81302
12162 81302 89987 96463 100616 111422 97753 100239 86742 66666 89368 111987 102691 97723 88189
12149 88189 89572 106510 108663 99877 95296 109759 111415 124234 115817 123971 125408 105746 93501
12136 93501 91093 109910 140094 130376 121792 117067 124779 128091 124679 124983 120997 115766 108485 91784
12122 91784 93054 106492 98272 108105 104021 94579 98475 100213 107905 113263 113675 135680 157967 174758
12108 174758 192468 188626 187132 178793 176016 171456 175285 173427 172618 155543 151416 142929 139521 150741
12094 150741 134742 133167 140259 136145 123505 115547 101665 117695 134076 118744 130834 136138
$$ packed form
12190H6137k312O748N810P369r670j1458k88K449K0213J0654o880j3614q788q39
12176H5531l622L19k12Q522L2105K322j7758j7570l600q148J5920R316j3639q184
12162H1302Q685O476M153J0806j3669K486j3497k0076K2702K2619r296m968r534
12149H8189J383J6938K153q786m581J4463J656J2819q417Q154J437j9662j2245
12136I3501k408J8817L0184r718q584m725P712L312l412L04l986n231p281j6701
12122I1784J270J3438q220R833m084r442L896J738P692N358M12K2005K2287J6791
12108A74758J7710l842j494q339k777m560L829j858q09j7075m127q487l408J1220
12094A50741j5999j575P092m114j2640p958j3882J6030J6381j5332J2090N304
$$ plain form
12082 136138 123053 135065 137694 150886 169320 169493 151654 136404 121295 102815 116138 115971
12070 115971 86943 59780 57256 60476 75325 85235 92761 79926 76157 89328 92563 81784 71809
12057 71809 90757 87951 94783 100004 95006 77066 64257 65974 87931 79851 68258 61344 67520
12044 67520 57706 60056 76268 86525 72670 80075 83256 101741 119916 125140 112702 117146 107789
12031 107789 103612 89434 76206 57214 66829 67119 70530 67820 76545 81206 72234 78717 65338
12018 65338 57499 55628 57363 52177 62938 78763 88095 93227 76365 54804 49122 65164 60113
12005 60113 52867 58969 44693 51395 69129 57693 64702 68123 54397 73518 82376 72986 68469
11992 68469 63730 71719 69732 74196 72605 62969 49362 51087 70548 84791 94266 92597 76668
$$ packed form
12082A36138j3085J2012K629J3192J8434J73j7839j5250j5109j8480J3323j67
12070A15971k9028k7163k524L220J4849R910P526j2835l769J3171L235j0779r975
12057G1809J8948k806O832N221m998j7940j2809J717K1957q080j1593o914O176
12044F7520r814K350J6212J0257j3855P405L181J8485J8175N224j2438M444r357
12031A07789m177j4178j3228j8992R615K90L411k710Q725M661q972O483j3379
12018F5338p839j871J735n186J0761J5825R332N132j6862k1561n682J6042n051
12005F0113p246O102j4276O702J7734j1436P009L421j3726J9121Q858r390m517
11992F8469m739P989j987M464j591r636j3607J725J9461J4243R475j669j5929
$$ plain form
11979 76668 71087 95390 88836 75535 78453 64188 55773 52279 50472 51852 29288 35432 37781
11966 37781 38784 35673 50013 41428 15419 13019 23793 24368 18866 15460 30708 15567 1139
11953 1139 -12734 -15043 -8403 2368 -4392 -6660 5866 21630 24465 25945 -5159 -2323 26582
11940 26582 50879 42671 28780 28878 19476 26665 30134 36251 38272 32283 42380 55979 65990 54268
11926 54268 30553 32669 29781 25289 12478 1808 -5571 4861 31202 35345 39875 19467 -1967
11913 -1967 -16072 -20412 -11071 11564 14797 20035 21323 26450 42242 51066 56731 57657 44936 28275
11899 28275 9810 8040 16341 14631 15629 26275 34634 25231 5662 -2514 5604 14635 25247 45287
11885 45287 59944 59522 61628 51506 40056 40426 16896 4107 2068 -2127 23281 33772 34134
$$ packed form
11979G6668n581K4303o554j3301K918j4265q415l494j807J380k2564O144K349
11966C7781J003l111J4340q585k6009k400J0774N75n502l406J5248j5141j4428
11953A139j3873k309O640J0771o760k268J2526J5764K835J480l1104K836K8905
11940B6582K4297q208j3891R8r402P189L469O117K021n989J0097J3599J0011j1722
11926E4268k3715K116k888m492j2811j0670p379J0432K6341M143M530k0408k1434
11913a967j4105m340R341K2635L233N238J288N127J5792Q824N665R26j2721j6661
11899B8275j8465j770Q301j710R98J0646Q359r403j9569q176Q118R031J0612K0040
11885D5287J4657m22K106j0122j1450L70k3530j2789k039m195K5408J0491L62
$$ plain form
11872 34134 34515 21430 4008 7684 22949 32157 24947 25240 24284 23587 40000 34946 23869 25893
11858 25893 28531 26325 21698 8972 21603 10593 3150 -5683 1307 12242 23116 35902 31369
11845 31369 3769 -1003 -24356 -38045 -29844 -15533 -16853 -15023 -13057 -813 23340 29649 8644
11832 8644 8980 16611 25049 12641 4994 17455 31890 19506 19322 19316 13191 -13568 -19003 -24612 -19546
11817 -19546 -19433 -297 -5599 -20974 -38279 -30629 -22883 -19256 -22703 -1678 16441 35481 22027
11804 22027 -1385 3799 -10430 -19820 -21277 -12098 -20286 -22857 -18375 8084 23451 27127 19387
11791 19387 22734 34796 34926 37826 31064 37247 45622 31816 26435 32528 42055 35661 24916 4565
11777 4565 6122 21483 35371 50521 54293 57927 75820 106391 117175 123853 122877 129710 123116
$$ packed form
11872C4134L81j3085j7422L676J5265R208p210K93r56o97J6413n054j1077K024
11858B5893K638k206m627j2726J2631j1010p443q833O990J0935J0874J2786m533
11845C1369k7600m772k3353j3689Q201J4311j320J830J966J2244K4153O309k1005
11832H644L36P631Q438j2408p647J2461J4435j2384j84oo125k6759n435n609N066
11817a9546J13J9136n302j5375j7305P650P746L627l447K1025J8119J9040j3454
11804B2027k3412N184j4229r390j457R179q188k571M482K6459J5367L676p740
11791A9387L347J2062J30K900o762O183Q375j3806n381O093R527o394j0745k0351
11777D565J557J5361J3888J5150L772L634J7893L0571J0784O678r76O833o594
$$ plain form
11764 123116 114725 136343 160215 172726 165906 188480 181059 158865 164026 175057 163920 153346
11752 153346 134987 143481 162435 151160 126338 110741 111769 114685 104050 87795 91446 105299
11740 105299 90674 77161 87382 91172 84125 90452 95536 82070 73640 88101 82696 60915 57837
11727 57837 58505 48368 33784 35304 35538 29238 17071 27646 46160 43578 30975 27868 28849 31819
11713 31819 31083 37179 37112 47816 44584 46191 56710 43126 46924 50548 41972 32801 51104 55060
11699 55060 46137 43652 31427 6204 11920 29291 42893 36278 34572 24327 11213 15124 25390
11686 25390 40066 44325 28020 10559 1387 12859 17268 21258 28880 25116 14013 20375 4438
11673 4438 11343 11729 17735 18773 34166 30601 30670 41523 42270 18758 9055 5455 -5302 -3850 5741
$$ packed form
11764A23116q391K1618K3872J2511o820K2574p421k2194N161J1031j1137j0574
11752A53346j8359Q494J8954j1275k4822j5597J028K916j0635j6255L651J3853
11740A05299j4625j3513J0221L790p047O327N084j3466q430J4461n405k1781l078
11727E7837O68j0137j4584J520K34o300j2167J0575J8514k582j2603l107R81K970
11713C1819p36O096o7J0704l232J607J0519j3584L798L624q576r171J8303L956
11699E5060q923k485j2225k5223N716J7371J3602o615j706j0245j3114L911J0266
11686B5390J4676M259j6305j7461r172J1472M409L990P622l764j1103O362j5937
11673D438O905L86O006J038J5393l565O9J0853P47k3512r703l600j0757J452R591
$$ plain form
11658 5741 -9057 -25967 -20314 1476 30163 24068 9068 3643 27630 32131 13961 13109 16753
11645 16753 19100 32798 49811 50824 38301 50968 46872 45848 50679 62827 75069 71583 80143
11632 80143 101676 95354 84870 73735 71043 88022 94487 88597 90326 76451 62480 65104 56446
11619 56446 50380 51707 56589 35477 44709 61654 68778 66285 71644 49020 31034 22856 30383
11606 30383 51391 58324 53466 38430 26311 28575 33586 30391 48372 65530 60070 45074 66975
11593 66975 86921 115142 131876 117747 128663 141980 140106 123678 107107 93178 115526 115318
11581 115318 107870 105572 106460 111851 106228 95940 95996 100036 93948 105627 105385 99698 102361 102777 98377
11566 98377 93413 83927 92037 96004 85360 70490 46538 53870 62857 64634 45048 38381 50805
$$ packed form
11658E741j4798j6910N653K1790K8687o095j5000n425K3987M501j8170q52L644
11645A6753K347J3698J7013J013j2523J2667m096j024M831J2148J2242l486Q560
11632H0143K1533o322j0484j1135k692J6979O465n890J729j3875j3971K624q658
11619E6446o066J327M882k1112R232J6945P124k493N359k2624j7986q178P527
11606C0383K1008O933m858j5036j2119K264N011l195J7981J7158n460j4996K1901
11593F6975J9946K8221J6734j4129J0916J3317j874j6428j6571j3929K2348k08
11581A15318p448k298Q88N391n623j0288N6M040o088J1679k42n687K663M16m400
11566I8377m964r486Q110L967j0644j4870k3952P332Q987J777j9586o667J2424
$$ plain form
11553 50805 55263 59379 45545 56044 45266 46527 69794 81070 80985 72285 69930 55589 47101
11540 47101 20449 21266 36755 47479 36095 13414 2999 -4479 9649 20916 10135 -5058
11528 -5058 -12399 6726 29837 41606 35631 21097 16591 31684 32651 848 -8538 -12334 3406
11515 3406 12079 12744 16134 16180 13341 9397 -7926 -30497 -10037 4074 4076 -7796 -7129 3664 10344
11500 10344 15610 22168 4381 -17123 -27089 -23676 -2252 22342 13857 -3234 -34568 -29773 -26064
11487 -26064 -6624 -3895 -2875 6052 -3056 -3864 1825 6689 413 2406 6653 -530 -16927 -16107
11473 -16107 -13192 -8439 -20402 -28069 -30560 -41900 -20076 4458 5211 -89 -11263 -29744 -27812
11460 -27812 -9516 -9916 -18216 -22375 -29171 -46816 -52357 -55166 -58543 -50153 -50892 -39781 -24012 -5325
$$ packed form
11553E0805M458M116j3834J0499j0778J261K3267J1276q5q700k355j4341q488
11540D7101k6652Q17J5489J0724j1384k2681j0415p478J4128J1267j0781j5193
11528e058p341J9125K3111J1769n975j4534m506J5093R67l1803r386l796J5740
11515C406Q673O65L390M6k839l944j7323k2571K0460J4111Kj1872O67J0793O680
11500A0344N266O558j7787k1504r966L413K1424K4594q485j7091l1334M795L709
11487b6064J9440K729J020Q927r108q08N689M864o276J993M247p183j6397Q20
11473a6107K915M753j1963p667k491j1340K1824K4534P53n300j1174j8481J932
11460b7812J8296m00q300m159o796j7645n541k809l377Q390p39J1111J5769J8687
$$ plain form
11446 -5325 -10940 -14247 -27170 -39261 -45897 -42036 -24344 -3934 -13909 -17555 8337 24364 29772
11433 29772 7062 -16758 -17320 -22289 -9541 -8876 -20193 -26789 -18185 -5944 -18988 -39050 -41721
11420 -41721 -18204 -18742 -9164 -4763 -11685 -17958 -13440 1765 -3272 -18500 -7568 384 -9764
11407 -9764 -24902 -8325 -9029 -24056 -37598 -39501 -25197 -10110 -21104 -5461 -27163 -46794
11395 -46794 -39293 -14838 -60 -5069 -23267 -23880 -18752 -28351 -31568 -35252 -13269 -6222 -15985 -10781
11381 -10781 -1529 -18622 -22292 -10014 -3085 -10302 -8278 -2558 -10290 1617 -11171 -19463 -30597
11368 -30597 -34584 -29052 -31395 -22949 -20550 -29757 -13812 -12661 -20293 -5507 -12332 -2158 -13773
11355 -13773 -67 775 -20057 -17773 -20474 -21823 -23336 -29552 -36117 -32449 -15824 -14706 -25411 -20290
$$ packed form
11446e325n615l307j2923j2091o636L861J7692K0410r975l646K5892J6027N408
11433B9772k2710k3820n62m969J2748O65j1317o596Q604J2241j3044k0062k671
11420d1721K3517n38R578M401o922o273M518J5205n037j5228J0932P952j0148
11407i764j5138J6577p04j5027j3542j903J4304J5087j0994J5643k1702j9631
11395d6794P501K4455J4778n009j8198o13N128r599l217l684K1983P047r763N204
11381a0781R252j7093l670J2278O929p217K024N720p732J1907j2788q292j1134
11368c0597l987N532k343Q446K399r207J5945J151p632J4786o825J0174j1615
11355a3773J3706Q42k0832K284k701j349j513o216o565L668J6625J118j0705N121
$$ plain form
11341 -20290 -25180 -26218 -8830 -7593 -25198 -31389 -21942 -28063 -34580 -34450 -12749 4512 -4742 -7541
11327 -7541 -9849 -1950 -13681 -23566 -41453 -42088 -31499 -13946 4516 4909 -2010 -22731 -20215 -14620
11313 -14620 -35254 -27048 -25238 -26937 -30421 -23167 -24443 -8320 -17319 -10609 -24866 -47599 -55035
11300 -55035 -31899 -15137 -18186 -23156 -22321 -1929 -24201 -55856 -51357 -47508 -40522 -34626 -36182
11287 -36182 -38683 -39635 -24762 -8202 -8639 977 6793 -10392 -28714 -29536 -19375 -17378 -12051 -27705
11273 -27705 -10716 1912 6319 -15015 -9310 -6415 -1328 9554 14183 20743 23976 33067 45593
11260 45593 38833 22562 16319 14237 15918 15676 23433 38205 30971 38333 42504 46848 54088 38418
11246 38418 27396 26803 33366 30425 23890 13599 20568 23206 10461 884 24699 37118 26165
$$ packed form
11341b0290m890j038J7388J237j7605o191R447o121o517J30K1701J7261r254k799
11327g541k308P899j1731r885j7887o35J0589J7553J8462L93o919k0721K516N595
11313a4620k0634Q206J810j699l484P254j276J6123q999O710j4257k2733p436
11300e5035K3136J6762l049m970Q35K0392k2272l1655M499L849O986N896j556
11287c6182k501r52J4873J6560m37R616N816j7185j8322q22J0161J997N327j5654
11273b7705J6989J2628M407k1334N705K895N087J0882M629O560L233R091J2526
11260D5593o760j6271o243k082J681k42P757J4772p234P362M171M344P240j5670
11246C8418j1022n93O563k941o535j0291O969K638j2745r577K3815J2419j0953
$$ plain form
11233 26165 35004 21792 5756 13970 30531 15776 30241 36234 32742 39337 48468 37958 42462
11220 42462 51076 51907 44870 66119 57433 64599 77750 78982 65287 45107 31883 23346 18379
11207 18379 20417 15668 25276 38087 43702 51112 58640 70695 74225 90906 113477 123144 119763
11194 119763 121308 134110 139523 143261 161500 151905 127564 124145 120359 103288 94154 109288 114663
11181 114663 125347 120827 104588 118220 105080 85793 68850 65090 46333 36853 49607 71030
11169 71030 76536 91394 95618 85127 63635 53167 52061 53467 58873 61580 65585 53673 64376
11156 64376 61333 69418 63167 41992 30939 35752 29637 39418 41659 54160 60837 60434 48209 41178
11142 41178 51586 71617 63093 45301 51751 33210 14745 16546 32429 45802 75381 77897
$$ packed form
11233B6165Q839j3212j6036Q214J6561j4755J4465N993l492O595R131j0510M504
11220D2462Q614Q31p037K1249q686P166J3151J232j3695k0180j3224q537m967
11207A8379K038m749R608J2811N615P410P528J2055L530J6681K2571R667l381
11194A19763J545J2802N413L738J8239r595k4341l419l786j7071r134J5134N375
11181A14663J0684m520j6239J3632j3140j9287j6943l760j8757r480J2754K1423
11169G1030N506J4858M224j0491k1492j0468j106J406N406K707M005j1912J0703
11156F4376l043Q085o251k1175j1053M813o115R781K241J2501O677m03j2225p031
11142D1178J0408K0031q524j7792O450j8541j8465J801J5883J3373K9579K516
$$ plain form
11130 77897 85996 88496 80407 85432 78882 77316 79007 73605 77099 95490 107493 116681 122441 116286
11116 116286 103679 95604 90708 85936 89920 84088 60398 51011 50187 53399 53674 44590 23700 23786
11102 23786 44648 56179 65932 36854 33220 32435 22197 15454 28185 18981 23820 25723 31388
11089 31388 17264 12539 20617 11097 -364 2044 -1084 10958 14015 6302 -3792 14760 25286
11076 25286 39327 53822 50874 31220 43325 50923 52179 44233 35056 50274 70486 94217 118295
11063 118295 120372 102759 101727 93771 90587 94074 93580 74164 57227 36350 55501 63925 40559
11050 40559 28935 26628 38223 58285 70299 67373 54735 41432 31754 19283 27645 16879
11038 16879 4047 4811 35983 62349 67855 49818 43115 43047 42360 44069 48990 69083 95005 107786
$$ packed form
11130G7897Q099K500q089N025o550j566J691n402L494J8391J2003R188N760o155
11116A16286j2607q075m896m772L984n832k3690r387q24L212K75r084k0890Q6
11102B3786K0862J1531R753k9078l634p85j0238o743J2731r204M839J903N665
11089C1388j4124m725Q078r520j1461K408l128J2042L057p713j0094J8552J0526
11076B5286J4041J4495k948j9654J2105P598J256p946r177J5218K0212K3731K4078
11063A18295K077j7613j032p956l184L487m94j9416j6937k0877J9151Q424k3366
11050D0559j1624k307J1595K0062J2014k926j2638j3303r678j2471Q362j0766
11038A6879j2832P64L1172K6366N506j8037o703o8o87J709M921K0093K5922J2781
$$ plain form
11024 107786 108888 113546 112720 118972 121789 125901 108154 89051 83890 77657 77428 50558 38775 29558
11010 29558 14239 24693 28017 23198 31000 24830 -2752 -12513 -4159 22836 26989 20694 38575
10997 38575 50209 44456 56703 41645 45951 62214 58038 55581 62320 85571 106534 113395 98590
10984 98590 82912 88580 86324 80478 81167 81354 74778 69679 57342 54625 47533 55522 53241 42225
10970 42225 24709 15274 27097 31889 -1838 -25073 -33986 -14840 17011 12754 -21558 -42659
10958 -42659 -55072 -35809 7683 20034 12369 2315 103 4102 7643 16449 12463 5964 7156
10945 7156 9391 377 -3710 1307 4701 11174 1741 3297 11423 33896 53589 38420 19983 3595
10931 3595 -7745 -9336 -19394 -25657 -6591 4031 4194 -8245 -869 -11858 -16089 -5486 -24720
$$ packed form
11024A07786J102M658q26O252K817M112j7747j9103n161o233k29k6870j1783r217
11010B9558j5319J0454L324m819P802o170k7582r761Q354K6995M153o295J7881
10997C8575J1634n753J2247j5058M306J6263m176k457O739K3251K0963O861j4805
10984I8590j5678N668k256n846O89J87o576n099j2337k717p092P989k281j1016
10970D2225j7516r435J1823M792l3727k3235q913J9146L1851m257l4312k1101
10958d2659j2413J9263M3492J2351p665j0054k212L999L541Q806l986o499J192
10945G156K235r014m087N017L394O473r433J556Q126K2473J9693j5169j8437j6388
10931C595j1340j591j0058o263J9066J0622J63j2439P376j0989m231J0603j9234
$$ plain form
10918 -24720 -29653 -21068 -11201 9346 32588 21454 13395 20500 28183 12693 -9027 -9653 -1379
10905 -1379 2500 -4486 361 -4400 853 1562 -6079 1312 13424 20112 34546 36564 11797 8093
10891 8093 -14898 -7854 -11868 -7768 -8837 -10566 -12270 -18211 -8771 1848 7137 15177 32539 10521
10877 10521 11017 18772 1120 -6042 -4473 -10721 -3463 -1013 3599 -11363 2822 14466 -10130
10864 -10130 -28784 -27208 -3208 -3234 -2959 8199 28074 26290 16294 2629 4090 1834 10858 15708
10850 15708 9140 -3460 4708 -7345 -13142 -8968 -15476 -20200 -9682 6610 3215 -4419 -4805 -8410
10836 -8410 -13584 -1870 5799 21646 17301 28767 21601 18632 -15633 -37164 -18125 -9586 -16829
10823 -16829 3164 17180 15005 16833 16660 -6244 -20487 -22852 -13556 -18607 -13708 -5610 -15677
$$ packed form
10918b4720m933Q585R867K0547K3242j1134q059P105P683j5490k1720o26Q274
10905a379L879o986M847m761N253P09p641P391J2112O688J4434K018k4767l704
10891H093k2991P044m014M100j069j729j704n941R440J0619N289Q040J7362k2018
10877A0521M96P755j7652p162J569o248P258K450M612j4962J4185J1644k4596
10864a0130j8654J576K4000k6K75J1158J9875j784r996j3665J461k256R024M850
10850A5708o568j2600Q168j2053n797M174o508m724J0518J6292l395p634l86l605
10836h410n174J1714P669J5847m345J1466p166k969l4265k1531J9039Q539p243
10823a6829J9993J4016k175J828j73k2904j4243k365R296n051M899Q098j0067
$$ plain form
10810 -15677 -24396 -30015 -38999 -24748 -10082 -6278 -2912 -6631 -13408 -8660 6277 2500 3750 15017
10796 15017 33667 30239 36666 23109 12581 30099 36398 33969 29635 33537 31542 18287 5097
10783 5097 9130 16423 12690 7241 528 6159 18480 16025 7724 2955 13020 -1133 -17698 -12792
10769 -12792 -6498 9370 6573 9595 13140 -4910 -21786 -12707 5466 11435 17712 12663 11339
10756 11339 851 -8086 -1844 16848 30797 28648 20181 21829 10679 -915 19115 26859 21467
10743 21467 3589 7589 19946 3591 2800 -1576 11291 15923 8716 7715 17792 33376 43634
10730 43634 40015 26801 18973 14876 17393 16280 18171 23971 5071 -16479 -11300 -12055 -15144 -11370
10716 -11370 -342 2693 -11041 -34961 -50304 -45735 -28717 -29896 -33085 -17374 -8132 -10351 -4660
$$ packed form
10810a5677q719n619q984J4251J4666L804L366l719o777M748J4937l777J250J1267
10796A5017J8650l428O427j3557j0528J7518O299k429m334L902j995j3255j3190
10783E097M033P293l733n449o713N631J2321k455q301m769J0065j4153j6565M906
10769a2792O294J5868k797L022L545j8050j6876R079J8173N969O277n049j324
10756A1339j0488q937O242J8692J3949k149q467J648j1150j1594K0030P744n392
10743B1467j7878M000J2357j6355p91m376J2867M632p207j001J0077J5584J0258
10730D3634l619j3214p828m097K517j113J891N800j8900k1550N179p55l089L774
10716a1370J1028L035j3734k3920j5343M569J7018j179l189J5711R242k219N691
$$ plain form
10703 -4660 4518 -1381 -15811 -20794 -186 16057 2804 8659 19004 15304 -5299 -18587 -26727
10690 -26727 -16117 -10215 -10056 -26173 -28274 -15789 -25772 -32135 -28735 -15649 -5504 21278 34897
10677 34897 35249 26388 2156 -25213 -21738 -15695 -4526 -6525 -3329 8652 10977 -3888 -22671
10664 -22671 -6134 9434 29494 12925 -6247 -5625 -9170 -4407 -2519 -2603 1566 18293 22264 6526
10650 6526 4314 -4514 -3987 21674 18762 -5629 -16860 -25848 -23836 -10678 -3735 16915 13253 -286
10636 -286 -4426 14675 30477 27618 43822 30445 18923 35392 43795 51853 72441 72180 107743
10623 107743 144424 213056 310116 396685 426088 396780 317800 233814 189069 154431 120175
10612 120175 85255 77556 68733 61181 69228 74279 63546 45402 67238 83286 70013 58307
$$ packed form
10703d660R178n899j4430m983K0608J6243j3253N855J0345l700k0603j3288q140
10690b6727J0610N902J59j6117k101J2485r983o363L400J3086J0145K6782J3619
10677C4897L52q861k4232k7369L475O043J1169j999L196J1981K325j4865j8783
10664b2671J6537J5568K0060j6569j9172O22l545M763J888q4M169J6727L971j5738
10650F526k212q828N27K5661k912k4391j1231q988K012J3158O943K0650l662j3539
10636b86m140J9101J5802k859J6204j3377j1522J6469Q403Q058K0588k61L5563
10623A07743L6681O8632R7060Q6569K9403k9308p8980q3986m4745l4638l4256
10612A20175l4920p699q823p552Q047N051j0733j8144K1836J6048j3273j1706
$$ plain form
10600 58307 47523 48677 63765 72665 56176 44368 38293 36915 38905 43999 58594 73041 55317
10587 55317 39592 45502 51596 57979 68725 71566 57869 51321 57406 74877 80677 76256 68903
10574 68903 37363 39790 43258 18894 10322 27128 29796 23105 3775 -6269 -7090 -8116 -20696
10561 -20696 2754 -4326 -7025 2633 -4553 -9450 -13891 -16967 -14579 -4669 3357 7077 -14406 -13491
10547 -13491 724 -10394 -4155 4363 -15030 -16325 -23396 -14472 -13757 1412 10707 9760 24774 1768
10533 1768 -12063 -30111 -48372 -44260 -34315 -26045 -16964 -16936 -28839 -35330 -46376 -57366 -25887
10520 -25887 -5528 2667 -7431 59 8342 -3529 -11292 -15187 -14542 -16775 -30346 -27391 -17240
10507 -17240 -5362 -3445 -10464 -25700 -37587 -19840 -1168 -17693 -7942 10048 16794 32612
$$ packed form
10600E8307j0784J154J5088Q900j6489j1808o075j378J990N094J4595J4447j7724
10587E5317j5725N910O094O383J0746K841j3697o548O085J7471N800m421p353
10574F8903l1540K427L468k4364q572J6806K668o691j9330j0044q21j026j2580
10561b0696K3450p080k699R658p186m897m441l076K388R910Q026L720k1483R15
10547a3491J4215j1118O239Q518j9393j295p071Q924P15J5169R295r47J5014k3006
10533A768j3831j8048j8261M112R945Q270R081K8j1903o491j1046j0990L1479
10520b5887K0359Q195j0098P490Q283j1871p763l895O45k233j3571K955J0151
10507a7240J1878J917p019j5236j1887J7747J8672j6525R751J7990O746J5818
$$ plain form
10495 32612 12540 203 -4458 -31652 -36056 -33830 -27489 -27504 -19581 -817 7708 -7999 -38171
10482 -38171 -41449 -20373 -14388 -27709 -37138 -32435 -4762 14683 13017 11350 6895 -1520 -6570
10469 -6570 -5922 -226 698 670 -15575 -19507 -17655 -10785 -10144 -5415 12912 27550 28449 34498 15999
10454 15999 16932 3927 -1823 -303 6807 12365 6235 19442 31097 53177 89101 118138 148812
10441 148812 208898 302488 411971 525848 618424 664553 613297 514338 403362 338263 296304
10430 296304 253267 208571 145067 103604 93026 99356 94264 90151 99267 115436 119088 113991 116946
10417 116946 115439 108949 106267 115573 128414 119347 135122 140995 128022 85954 73765 80739 85805
10404 85805 83948 99922 116443 120475 120207 117691 128904 114777 90082 72891 84833 87234 82729
$$ packed form
10495C2612k0072j2337m661k7194m404K226O341j5P923J8764Q525j5707l0172
10482c8171l278K1076N985j3321r429M703K7673J9445j666j667m455q415n050
10469f570O48N696R24k8j6245l932J852O870O41M729J8327J4638Q99O049j8499
10454A5999R33j3005n750J520P110N558o130J3207J1655K2080L5924K9037L0674
10441A48812O0086R3590J09483J13877R2576M6129n1256r8959j10976o5099m1959
10430B96304m3037m4696o3504m1463j0578O330n092m113R116J6169L652n097K955
10417A16946j507o490k682R306J2841r067J5775N873j2973m2068j2189O974N066
10404H5805j857J5974J6521M032k68k516J1213j4127k4695j7191J1942K401m505
$$ plain form
10391 82729 83791 77398 65365 48442 25519 34422 32850 23451 47900 57903 48583 50199 58711
10378 58711 44893 16198 -5448 -5576 638 12067 -1208 -6150 17196 25760 22361 21969 39292
10365 39292 32271 42139 57582 79784 123268 156296 182198 214267 244882 270599 299008 323909
10353 323909 342417 363422 348151 349537 336470 324545 313461 268996 242068 219445 226134 249952
10341 249952 260463 260632 248289 250448 257848 258284 251349 225990 206016 182480 150232 113910 92139
10328 92139 111303 114829 106946 106580 121549 131225 127279 129682 152540 166147 173680 182247 198533
10315 198533 196856 189539 184332 178320 172494 140003 113406 99071 92274 90330 89987 75897 73639
10302 73639 73730 64592 57947 44332 54067 56100 54525 61937 70667 77828 60049 48707 60675 73301
$$ packed form
10391H2729J062o393j2033j6923k2923Q903j572r399K4449J0003r320J616Q512
10378E8711j3818k8695k1646j28O214J1429j3275m942K3346Q564l399l92J7323
10365C9292p021R868J5443K2202M3484L3028K5902L2069L0615K5717K8409K4901
10353C23909J8508K1005j5271J386j3067j1925j1084m4465k6928k2623O689K3818
10341B49952J0511J69j2343K159P400M36o935k5359j9974k3536l2248l6322k1771
10328I2139J9164L526p883l66J4969R676l946K403K2858J3607P533Q567J6286
10315A98533j677p317n207o012n826l2491k6597j4335o797j944l43j4090k258
10302G3639R1r138o645j3615R735K033j575P412Q730P161j7779j1342J1968J2626
$$ plain form
10288 73301 76742 58395 47588 42413 23243 7481 19899 28135 29893 22511 14818 24244 34252
10275 34252 14155 19960 10281 15989 12784 7060 11027 19085 21898 15537 6087 21941 36628 36952
10261 36952 37320 41548 27101 31366 43918 43337 25115 3792 2423 -1663 17320 8364 -9830
10248 -9830 -2247 2874 11195 4134 -2815 -7160 -23035 -22823 265 24901 15247 18389 -934 -11172
10234 -11172 -21785 -28039 -10293 -6327 -18411 -33850 -22138 3703 447 10585 10260 10236 5726
10221 5726 -12066 -12339 -12710 -1450 2558 5982 13439 12585 26813 38280 42342 53772 58360 65543
10207 65543 53878 34538 32608 30977 25288 24495 23326 20843 37802 54939 64546 52479 45124
10194 45124 45481 42301 44612 55888 45640 24776 3888 9836 9038 10161 13988 20457 32793 59557
$$ packed form
10288G3301L441j8347j0807n175j9170j5762J2418Q236J758p382p693R426J0008
10275C4252k0097N805r679N708l205n724L967Q058K813o361r450J5854J4687L24
10261C6952L68M228j4447M265J2552n81j8222k1323j369m086J8983q956j8194
10248i830P583N121Q321p061o949m345j5875K12K3088K4636r654L142j9323j0238
10234a1172j0613o254J7746L966j2084j5439J1712K5841l256J0138l25k4m510
10221E726j7792k73l71J1260M008L424P457q54J4228J1467M062J1430M588P183
10207F5543j1665j9340j930j631n689p93j169k483J6959J7137R607j2067p355
10194D5124L57l180K311J1276j0248k0864k0888N948p98J123L827O469J2336K6764
$$ plain form
10180 59557 59716 58631 54456 40920 44010 39617 46486 60903 65624 69374 94276 103611 100827 98378
10166 98378 100459 122893 146582 168865 193360 225031 266076 302368 335995 359885 378529 373164
10154 373164 359534 335786 302397 256265 206719 171402 151673 146551 169372 178986 148971 141354
10142 141354 132411 136668 141743 137771 154175 153501 154532 151283 124556 103422 98175 125034 117371
10129 117371 114114 133336 133983 117475 116834 112327 130683 130331 112322 112166 98457 81022 82725 85194
10115 85194 79101 69663 62584 60704 76174 83064 98332 79753 59288 65745 87406 82981 53922
10102 53922 36288 56934 57041 67999 69253 73104 83601 85412 61281 35222 40045 55324 51380
10089 51380 40222 26920 21503 37407 38437 27944 37186 57044 82525 64248 56212 50527 41583
$$ packed form
10180E9557J59j085m175j3536L090m393O869J4417M721L750K4902R335k784k449
10166I8378K081K2434K3689K2283K4495L1671M1045L6292L3627K3890J8644n365
10154C73164j3630k3748l3389m6132m9546l5317j9729n122K2821R614l0015p617
10142A41354q943M257N075l972J6404o74J031l249k6727k1134n247K6859p663
10129A17371l257J9222O47j6508o41m507J8356l52j8009j56j3709j7435J703K469
10115H5194o093r438p079j880J5470O890J5268j8579k0465O457K1661m425k9059
10102E3922j7634K0646J07J0958J254L851J0497J811k4131k6059M823J5279l944
10089E1380j1158j3302n417J5904J030j0493R242J9858K5481j8277q036n685q944
$$ plain form
10076 41583 27121 25053 24090 16001 18111 22729 39039 52112 53204 42405 27948 37571 45729
10063 45729 52110 55115 46622 57651 44544 36018 55318 71452 72059 78709 70573 54895 57738
10050 57738 55876 50685 53503 47957 48398 41212 40087 35181 19518 25408 13739 10728 21943 45117
10036 45117 43941 66227 70231 70971 55200 34395 26849 31570 34009 33780 13419 1034 19934
10023 19934 45162 51109 46129 46646 30374 11880 9366 15612 19692 19010 6223 23272 31522 13041
10009 13041 1073 8243 14981 28530 42347 63318 47657 30452 46889 52014 46157 49324 46650
9996 46650 54245 53112 44431 33828 21914 -5247 -7656 -9222 -7682 -3131 13072 18540 24546 21167
9982 21167 10518 24601 31198 23468 31784 26017 19258 8329 -7550 10767 13055 4529 24233
$$ packed form
10076D1583j4462k068r63q089K110M618J6310J3073J092j0799j4457R623Q158
10063D5729O381L005q493J1029j3107q526J9300J6134O07O650q136j5678K843
10050E7738j862n191K818n546M41p186j125m906j5663N890j1669l011J1215K3174
10036D5117j176K2286M004P40j5771k0805p546M721K439k29k0361j2385J8900
10023A9934K5228N947m980N17j6272j8494k514O246M080o82j2787J7049Q250j8481
10009A3041j1968P170O738J3549J3817K0971j5661j7205J6437N125n857L167k674
9996D6650P595j133q681j0603j1914k7161k409j566J540M551J6203N468O006l379
9982B1167j0649J4083O597p730Q316n767o759j0929j5879J8317K288q526J9704
$$ plain form
9969 24233 16940 4432 13959 12189 15369 38154 38473 16515 5427 12583 37747 50259 50452 60524
9955 60524 66749 66599 48899 45730 62998 72166 84046 122304 152010 169668 164480 163756 148050
9942 148050 142028 129704 126506 137783 151934 148335 130068 111909 117282 110427 80329 66356 69871
9929 69871 75158 75369 87291 81061 75847 75778 61535 42436 41095 53001 66318 76597 93260 92097
9915 92097 75255 74576 86302 74988 67944 61193 58469 49654 55461 63588 66635 47756 51415 49861
9901 49861 24128 18046 22164 27841 24101 24384 30160 38927 35364 34456 25222 35471 36779 31030 46281
9886 46281 45249 41123 57188 50025 44667 54857 63013 48985 34880 46227 69555 71952 66521
9873 66521 84800 94797 97570 101506 98699 95076 99745 108102 143615 183854 236364 291325 329861
$$ packed form
9969B4233p293j2508R527j770L180K2785L19k1958j1088P156K5164J2512J93J0072
9955F0524O225j50j7700l169J7268R168J1880L8258K9706J7658n188p24j5706
9942A48050o022j2324l198J1277J4151l599j8267j8159N373o855l0098j3973L515
9929F9871N287K11J1922o230n214o9j4243j9099j341J1906J3317J0279J6663j163
9915I2097j6842o79J1726j1314p044o751k724q815N807Q127L047j8879L659j554
9901D9861k5733o082M118N677l740K83N776Q767l563r08r234J0249J308n749J5251
9886D6281j032m126J6065p163n358J0190Q156j4028j4105J1347K3328K397n431
9873F6521J8279R997K773L936k807l623M669Q357L5513M0239N2510N4961L8536
$$ plain form
9860 329861 352073 351535 312630 239230 183491 154018 151115 136492 117014 107416 115433 114336 90446
9847 90446 89345 95950 112597 132445 153811 134206 121030 110953 108905 107730 114442 115036 117105
9834 117105 92654 84617 76591 88247 74331 50716 49139 57563 68921 66581 91081 86259 71411
9821 71411 43611 31087 45123 53748 44808 51729 46589 50675 51252 53256 56034 40433 44255 55168
9807 55168 63823 68961 68532 73218 83156 77323 67245 67590 51205 28507 19309 20191 30928 43298
9793 43298 60804 59384 60349 63072 61054 62350 43698 20003 7319 30610 64645 74653 91516
9780 91516 94875 57693 43687 60277 70325 95849 103225 102778 104765 100882 90318 86175 83251
9767 83251 92512 93724 64788 46392 38256 50202 65086 76168 99100 86240 82865 76748 80159
$$ packed form
9860C29861K2212n38l8905p3400n5739k9473k903j4623j9478r598Q017j097k3890
9847I0446j101O605J6647J9848K1366j9605j3176j0077k048j175O712N94K069
9834A17105k4451q037q026J1656j3916k3615j577Q424J1358k340K4500m822j4848
9821G1411k7800j2524J4036Q625q940O921n140M086N77K004K778j5601L822J0913
9807E5168Q655N138m29M686R938n833j0078L45j6385k2698r198Q82J0737J2370
9793D3298J7506j420R65K723k018J296j8652k3695j2684K3291L4035J0008J6863
9780I1516L359l7182j4006J6590J0048K5524P376m47J987l883j0564m143k924
9767H3251R261J212k8936j8396q136J1946J4884J1082K2932j2860l375o117L411
$$ plain form
9754 80159 87319 85317 87252 83608 93015 102760 134118 150947 141710 123268 105598 93109 103653
9741 103653 96358 77478 66445 73369 89805 80291 66435 48796 36781 50713 44020 21456
9729 21456 19896 22076 25283 42750 54331 70307 67251 74460 61557 47867 56151 51312 47305
9716 47305 62720 70381 76297 81216 84988 96980 117510 105514 92759 115151 92789 80907 75017
9703 75017 83277 77668 51490 56519 62553 60767 63385 83145 90067 78380 50891 29733 22816
9690 22816 20337 39082 42672 38882 58063 61346 57082 66404 67280 75051 68491 64046 66236 67390
9676 67390 62581 54355 45267 53601 73360 84829 87884 89077 83176 80338 74399 53053 49531 56099
9662 56099 79543 92694 94215 94860 100007 83318 80118 70494 74013 67526 64270 83913 81938 84995
$$ packed form
9754H0159P160k002J935l644R407R745L1358J6829r237j8442j7670j2489J0544
9741A03653p295j8880j1033O924J6436r514j3856j7639j2015J3932o693k2564
9729B1456j560K180L207J7467J1581J5976l056P209j2903j3690Q284m839m007
9716D7305J5415P661N916M919L772J1992K0530j1996j2755K2392k2362j1882n890
9703G5017Q260n609k6178N029O034j786K618J9760O922j1687k7489k1158o917
9690B2816k479J8745L590l790J9181L283m264R322Q76P771o560m445K190J154
9676F7390m809q226r088Q334J9759J1469L055J193n901k838n939k1346l522O568
9662E6099K3444J3151J521O45N147j6689l200r624L519o487l256J9643j975L057
$$ plain form
9648 84995 96522 70916 67839 63569 38862 46779 72813 75134 74582 73552 63522 68056 95498
9635 95498 106890 110927 136732 146075 147508 135929 112375 109418 114598 101650 86752 83506 78546
9622 78546 77646 79488 88542 105623 115603 139974 143523 134352 142710 143068 137422 145538 124393 93733
9608 93733 113295 131353 128054 131995 128926 103473 87662 97704 107872 114469 122759 127106 141684
9595 141684 133194 114060 106201 115751 118061 129403 139460 131872 130340 135880 134348 112853 103393
9582 103393 121658 119855 136096 133667 135684 121141 96028 86223 102494 111844 111123 102813 104549
9569 104549 103321 116314 116883 136983 141866 131607 138838 135338 118472 120975 123239 132118 125244 112293
9555 112293 119840 135428 150906 158245 160247 137386 133630 136438 129750 141223 146115 136040 112551
$$ packed form
9648H4995J1527k5606l077m270k4707P917K6034K321n52j030j0030M534K7442
9635I5498J1392M037K5805R343J433j1579k3554k957N180j2948j4898l246m960
9622G8546r00J842R054J7081R980K4371L549r171Q358L58n646Q116k1145l0660
9608I3733J9562J8058l299L941l069k5453j5811J0042J0168O597Q290M347J4578
9595A41684q490j9134p859R550K310J1342J0057p588j532N540j532k1495r460
9582A03393J8265j803J6241k429K017j4543k5113r805J6271R350p21q310J736
9569A04549j228J2993N69K0100M883j0259P231l500j6866K503K264Q879o874j2951
9555A12293P547J5588J5478P339K002k2861l756K808o688J1473M892j0075k3489
$$ plain form
9542 112551 112594 100537 105716 101742 102087 96808 100655 108736 125603 128291 137519 131148 122617 133420
9528 133420 125716 107801 100575 104387 111539 117255 130147 137866 132167 117885 116770 128069 136857
9515 136857 137129 135485 142981 152094 160134 155907 141845 124806 117581 120356 137121 150911 145622 132141
9501 132141 124582 126909 143221 151594 149687 135146 124039 131642 155958 159126 159428 163147 142858
9488 142858 150537 147631 146510 147140 151018 147237 143932 160292 160288 164087 163945 151162 134323 154019 175845
9473 175845 195148 205902 187665 167193 164594 161261 166877 159888 168559 178790 164103 153092 179588
9460 179588 200866 205555 181441 167720 188810 196707 198809 215797 220674 212656 204988 228737 240093
9447 240093 253716 249271 230633 215746 218282 210364 210282 240108 258874 283137 269762 250922 249062
$$ packed form
9542A12551M3j2057N179l974L45n279L847Q081J6867K688R228o371q531J0803
9528A33420p704j7915p226L812P152N716J2892P719n699j4282j115J1299Q788
9515A36857K72j644P496R113Q040m227j4062j7039p225K775J6765J3790n289j3481
9501A32141p559K327J6312Q373j907j4541j1107P603K4316L168L02L719k0289
9488A42858P679k906j121O30L878l781l305J6360mL799j42j2783j6839J9696K1826
9473A75845J9303J0754j8237k0472k599l333N616o989Q671J0231j4687j1011K6496
9460A79588K1278M689k4114j3721K1090P897K102J6988M877q018p668K3749J1356
9447B40093J3623m445j8638j4887K536p918q2K9826J8766K4263j3375j8840j860
$$ plain form
9434 249062 235706 231940 225189 236284 251274 260517 276743 263316 266066 247547 241763 259950 256197
9421 256197 242714 251403 249283 243306 236989 237104 249903 268893 283016 274846 273644 288378 272994
9408 272994 274296 255668 239481 246047 260959 288009 293458 273851 251392 233260 222480 223203 226894
9395 226894 232533 258947 264677 275701 278149 277887 262664 254312 240799 238405 250581 264807 275445
9382 275445 292212 280275 278156 287432 280264 276408 274042 293502 296099 290611 303885 301136 305970
9369 305970 314803 302476 321588 336291 327329 349784 348506 326428 312562 326238 321309 321299 342164
9356 342164 340768 331012 354342 363453 365295 365464 370695 382722 390670 389014 389827 401027 418952 402093
9342 402093 374718 384458 395451 397900 393206 378930 386273 398563 384598 388998 413985 437271 448362
$$ packed form
9434B49062j3356l766o751J1095J4990R243J6226j3427K750j8519n784J8187l753
9421B56197j3483Q689k120n977o317J15J2799J8990J4123q170j202J4734j5384
9408B72994J302j8628j6187O566J4912K7050N449j9607k2459j8132j0780P23L691
9395B26894N639K6414N730J1024K448k62j5223q352j3513k394J2176J4226J0638
9382B75445J6767j1937k119R276p168l856k366J9460K597n488J3274k749M834
9369C05970Q833j2327J9112J4703q962K2455j278k2078j3866J3676m929j0K0865
9356C42164j396r756K3330R111J842J69N231J2027P948j656Q13J1200J7925j6859
9342D02093k7375R740J0993K449m694j4276P343J2290j3965M400K4987K3286J1091
$$ plain form
9329 448362 438875 432357 431018 427739 433033 422618 411704 407930 411098 411781 407009 411730 416363 415923
9315 415923 409485 408469 422563 424084 444691 488048 498025 498443 522447 530808 511225 489824 478174
9302 478174 489375 502683 511043 506141 498669 510255 513467 520306 507514 494268 504212 514285 518146
9289 518146 510505 510938 491522 485733 494768 500113 500072 481422 475211 488298 504075 502656 499068 509265
9275 509265 491206 496660 495366 501353 511618 496854 497590 513493 546911 567518 560432 565707 568095
9262 568095 582091 589027 574451 578151 574380 555565 557389 567549 550994 557390 559913 559627 538135
9249 538135 522002 516228 516033 530265 555282 555722 553866 567646 566830 573248 571420 560553 568098 563694
9235 563694 559992 583758 603040 618471 615000 607045 609457 627650 644532 653979 664247 649305 640780
$$ packed form
9329D48362r487o518j339l279N294j0415j0914l774L168O83m772M721M633m40
9315D15923o438j016J4094J521K0607M3357R977M18K4004Q361j9583k1401j1650
9302D78174J1201J3308Q360m902p472J1586L212O839j2792j3246R944J0073L861
9289E18146p641M33j9416n789R035N345m1j8650o211J3087J5777j419l588J0197
9275E09265j8059N454j294N987J0265j4764P36J5903L3418K0607p086N275K388
9262E68095J3996O936j4576L700l771j8815J824J0160j6555O396K523k86k1492
9249E38135j6133n774j95J4232K5017M40j856J3780q16O418j828j0867P545m404
9235E63694l702K3766J9282J5431l471p955K412J8193J6882R447J0268j4942q525
$$ plain form
9222 640780 640653 649602 662919 666962 661768 652640 664037 685292 693253 681305 702721 700937 724555
9209 724555 739274 747711 720596 709848 737955 751005 766173 785745 799007 788795 767469 777780
9197 777780 801812 804726 827467 852476 872152 880530 885656 906919 919175 933564 961651 984426
9185 984426 1006368 1041071 1084034 1132166 1163802 1192586 1228079 1258072 1261987 1280004 1289766 1309472
9173 1309472 1343378 1367402 1387043 1412778 1425990 1441207 1474052 1500041 1497070 1479122 1438604 1432871
9161 1432871 1433883 1432379 1422698 1395492 1371067 1359740 1365360 1396958 1394734 1375939 1368332 1351579 1350077
9148 1350077 1328648 1336440 1335943 1342728 1351062 1340833 1345366 1336644 1314113 1299472 1297190 1304784 1317514
9135 1317514 1310875 1333500 1363735 1381317 1402033 1424762 1435579 1437726 1430724 1408801 1411057 1404231
$$ packed form
9222F40780j27Q949J3317M043n194r128J1397K1255P961j1948K1416j784K3618
9209G24555J4719Q437k7115j0748K8107J3050J5168J9572J3262j0212k1326J0311
9197G77780K4032K914K2741K5009J9676Q378N126K1263J2256J4389K8087K2775
9185I84426K1942L4703M2963M8132L1636K8784L5493K9993L915J8017R762J9706
9173A309472L3906K4024J9641K5735J3212J5217L2845K5989k971j7948m0518n733
9161A432871J012j504r681k7206k4425j1327N620L1598k224j8795p607j6753j502
9148A350077k1429P792m97O785Q334j0229M533q722k2531j4641k282P594J2730
9135A317514o639K2625L0235J7582K0716K2729J0817K147p002k1923K256o826
$$ plain form
9123 1404231 1410176 1411060 1409196 1419180 1425018 1422353 1426697 1423602 1449827 1462880 1452247 1458443 1484938
9110 1484938 1500363 1524014 1532151 1530685 1533175 1517527 1516627 1529486 1548928 1574974 1591509 1614254
9098 1614254 1641907 1655213 1681198 1709620 1735310 1764273 1771552 1765695 1760359 1790035 1827935 1847776
9086 1847776 1857075 1855920 1870987 1902954 1932038 1949599 1961767 1975139 1977069 1995093 2015700 2052193
9074 2052193 2087034 2113385 2150665 2182446 2227125 2284202 2325402 2370482 2402018 2398159 2422085 2477351
9062 2477351 2524504 2578167 2617471 2658557 2687247 2742530 2813005 2872177 2930826 2973077 3029298
9051 3029298 3085053 3138717 3181910 3228494 3299192 3356959 3421991 3491916 3555261 3583887 3627511
9040 3627511 3678651 3726973 3777798 3831820 3890733 3959182 4023030 4087039 4159176 4224907 4295935
$$ packed form
9123A404231N945Q84j864R984N838k665M344l095K6225J3053j0633O196K6495
9110A484938J5425K3651Q137j466K490j5648r00J2859J9442K6046J6535K2745
9098A614254K7653J3306K5985K8422K5690K8963P279n857n336K9676L7900J9841
9086A847776R299j155J5067L1967K9084J7561J2168J3372J930J8024K0607L6493
9074B052193L4841K6351L7280L1781M4679N7077M1200M5080L1536l859K3926N5266
9062B477351M7153N3663L9304M1086K8690N5283P0475N9172N8649M2251N6221
9051C029298N5755N3664M3193M6584P0698N7767O5032O9925O3345K8626M3624
9040C627511N1140M8322N0825N4022N8913O8449O3848O4009P2137O5731P1028
$$ plain form
9029 4295935 4386689 4478847 4558506 4658017 4756594 4847773 4948028 5038888 5129648 5223964 5334092
9018 5334092 5439010 5562664 5689706 5811763 5970087 6129788 6254395 6377593 6516313 6675382
9008 6675382 6830348 6979949 7135445 7314467 7482339 7655014 7839621 8016527 8193926 8380996
8998 8380996 8568510 8765445 8960087 9170926 9393180 9620114 9869314 10103526 10313313 10554769
8988 10554769 10812254 11068666 11335655 11614623 11893160 12190560 12522611 12847543 13171943
8979 13171943 13497228 13859224 14229403 14599989 14986419 15407784 15861471 16335764 16812646
8970 16812646 17328992 17855171 18409557 19009896 19633334 20303716 21014162 21746167 22511040
8961 22511040 23312333 24217074 25150059 26137527 27216552 28353214 29550292 30822926 32177680
$$ packed form
9029D295935R0754R2158P9659R9511R8577R1179J00255R0860R0760R4316J10128
9018E334092J04918J23654J27042J22057J58324J59701J24607J23198J38720J59069
9008F675382J54966J49601J55496J79022J67872J72675J84607J76906J77399J87070
8998H380996J87514J96935J94642K10839K22254K26934K49200K34212K09787K41456
8988A0554769K57485K56412K66989K78968K78537K97400L32051L24932L24400
8979A3171943L25285L61996L70179L70586L86430M21365M53687M74293M76882
8970A6812646N16346N26179N54386O00339O23438O70382P10446P32005P64873
8961B2511040Q01293R04741R32985R87468J079025J136662J197078J272634J354754
$$ plain form
8952 32177680 33629402 35176719 36844250 38644164 40573084 42657446 44920803 47364832
8944 47364832 50014662 52856554 55943210 59305442 62938838 66906104 71194049 75852912
8936 75852912 80912523 86384917 92275857 98597712 105393399 112626437 120245066 128243071
8928 128243071 136534778 145030566 153589205 162042142 170179848 177787311 184649283 190588093
8920 190588093 195396212 198956881 201172320 202025548 201625864 200102737 197623092 194351936
8912 194351936 190499484 186221158 181679030 177028627 172375798 167774869 163309055 159042307
8904 159042307 154969380 151094207 147427211 143970337 140702410 137613550 134673177 131858000
8896 131858000 129146792 126540320 123992571 121517551 119099418 116713611 114334957 111960244
$$ packed form
8952C2177680J451722J547317J667531J799914J928920K084362K263357K444029
8944D7364832K649830K841892L086656L362232L633396L967266M287945M658863
8936G5852912N059611N472394N890940O321855O795687P233038P618629P998005
8928A28243071Q291707Q495788Q558639Q452937Q137706P607463O861972N938810
8920A90588093M808119L560669K215439Q53228l99684j523127k479645l271156
8912A94351936l852452m278326m542128m650403m652829m600929m465814m266748
8904A59042307m072927l875173l666996l456874l267927l088860k940373k815177
8896A31858000k711208k606472k547749k475020k418133k385807k378654k374713
$$ plain form
8888 111960244 109602667 107263182 104915668 102540987 100183472 97852366 95550963 93232606
8880 93232606 90902983 88597018 86316740 84038795 81789810 79560606 77323361 75138157
8872 75138157 72976732 70808237 68658815 66562456 64513944 62475646 60466492 58513667
8864 58513667 56614050 54754062 52946067 51190063 49485517 47832590 46232358 44680487
8856 44680487 43190741 41759741 40379309 39029665 37722323 36460817 35250284 34084816
8848 34084816 32998252 31926588 30870928 29870942 28918535 27985173 27084851 26235687 25414617
8839 25414617 24636074 23876773 23133457 22422323 21737150 21097743 20499571 19909842 19343042
8830 19343042 18785063 18262291 17778701 17331183 16917548 16565651 16283066 16086510 16000215 16043680
$$ packed form
8888A11960244k357577k339485k347514k374681k357515k331106k301403k318357
8880I3232606k329623k305965k280278k277945k248985k229204k237245k185204
8872G5138157k161425k168495k149422k096359k048512k038298k009154j952825
8864E8513667j899617j859988j807995j756004j704546j652927j600232j551871
8856D4680487j489746j431000j380432j349644j307342j261506j210533j165468
8848C4084816j086564j071664j055660r99986r52407r33362r00322q49164q21070
8839B5414617p78543p59301p43316p11134o85173o39407n98172n89729n66800
8830A9343042n57979n22772m83590m47518m13635l51897k82585j96556q6295M3465
$$ plain form
8820 16043680 16129829 16134181 15943623 15451173 14690056 13914548 13248269 12714741 12264649 11869081
8810 11869081 11529475 11209706 10925483 10651674 10381212 10149683 9927554 9734094 9536979
8801 9536979 9317305 9098041 8925506 8758151 8596000 8407649 8207708 8022963 7868334 7702197
8791 7702197 7527824 7384164 7234919 7094296 6957260 6806142 6675945 6551402 6439133 6320951
8781 6320951 6197074 6067747 5942050 5836748 5746941 5651008 5575222 5498627 5420105 5343811 5271864
8770 5271864 5190845 5092583 5035131 4965236 4904512 4861369 4832661 4786624 4751797 4722248 4667601
8759 4667601 4630048 4592894 4586955 4587591 4570488 4542914 4521199 4506855 4488672 4461701 4435202 4404150
8747 4404150 4392535 4388986 4379180 4357208 4346391 4335550 4312989 4290319 4266506 4248180 4223596 4193469
$$ packed form
8820A6043680Q6149M352j90558m92450p61117p75508o66279n33528m50092l95568
8810A1869081l39606l19769k84223k73809k70462k31529k22129j93460j97115
8801I536979k19674k19264j72535j67355j62151j88351j99941j84745j54629j66137
8791G702197j74373j43660j49245j40623j37036j51118j30197j24543j12269j18182
8781F320951j23877j29327j25697j05302q9807r5933p5786p6595p8522p6294p1947
8770E271864q1019r8262n7452o9895o0724m3143k8708m6037l4827k9549n4647
8759D667601l7553l7154n939O36j7103k7574k1715j4344j8183k6971k6499l1052
8747D404150j1615l549r806k1972j0817j0841k2561k2670k3813j8326k4584l0127
$$ plain form
8735 4193469 4173566 4160403 4148906 4112384 4076575 4045457 4018521 3993801 3958268 3907650 3863836
8724 3863836 3854341 3841947 3833925 3805131 3776040 3717865 3675219 3636865 3587518 3544476 3518639 3481612
8712 3481612 3437131 3397089 3368539 3327899 3290418 3253658 3211563 3179648 3141226 3105180 3063118
8701 3063118 3032285 3006238 2989148 2954322 2878715 2810000 2777546 2746786 2725346 2693532 2666989
8690 2666989 2646471 2599756 2545416 2527254 2503053 2478858 2440939 2407056 2377997 2367152 2353665
8679 2353665 2339165 2310688 2270627 2268562 2275517 2269253 2265297 2247614 2221946 2187714 2152282 2148817
8667 2148817 2144326 2120673 2096840 2080132 2045399 2004889 1980093 1956980 1926667 1924506 1917222 1896463
8655 1896463 1885696 1861347 1834668 1823531 1794713 1788804 1792763 1787384 1762602 1748899 1731098 1721544
$$ packed form
8735D193469j9903j3163j1497l6522l5809l1118k6936k4720l5533n0618m3814
8724C863836r495j2394q022k8794k9091n8175m2646l8354m9347m3042k5837l7027
8712C481612m4481m0042k8550m0640l7481l6760m2095l1915l8422l6046m2062
8701C063118l0833k6047j7090l4826p5607o8715l2454l0760k1440l1814k6543
8690B666989k0518m6715n4340j8162k4201k4195l7919l3883k9059j0845j3487
8679B353665j4500k8477m0061k065O955o264l956j7683k5668l4232l5432l465
8667B148817m491k3653k3833j6708l4733m0510k4796k3113l0313k161p284k0759
8655A896463j0767k4349k6679j1137k8818n909L959n379k4782j3703j7801r554
$$ plain form
8643 1721544 1709603 1691639 1683572 1672975 1673309 1665572 1647503 1637851 1630849 1632972 1627374 1621750 1604311
8630 1604311 1607813 1597588 1579409 1590675 1597962 1590319 1578343 1572506 1592724 1609614 1598095 1565958
8618 1565958 1558195 1568399 1588714 1591263 1609304 1626092 1620294 1604744 1600012 1613464 1623842 1624405 1631991
8605 1631991 1638435 1624078 1627385 1641091 1666623 1681864 1692792 1698283 1692648 1675495 1686089 1699006
8593 1699006 1705293 1712226 1721543 1751844 1767193 1777857 1785837 1801905 1802215 1796573 1792095 1803580 1817809
8580 1817809 1833307 1836980 1871787 1925985 1940926 1980933 2028954 2045349 2066638 2083092 2087306 2128732
8568 2128732 2143714 2182809 2226489 2272807 2300211 2353081 2430183 2522510 2621142 2701751 2770325
8557 2770325 2874345 2985047 3107526 3230507 3349634 3473752 3577310 3623351 3615705 3554381
$$ packed form
8643A721544j1941j7964q067j0597L34p737j8069r652p002K123n598n624j7439
8630A604311L502j0225j8179J1266P287p643j1976n837K0218J6890j1519l2137
8618A565958p763J0204K0315K549J8041J6788n798j5550m732J3452J0378N63P586
8605A631991O444j4357L307J3706K5532J5241J0928N491n635j7153J0594J2917
8593A699006O287O933R317L0301J5349J0664P980J6068L10n642m478J1485J4229
8580A817809J5498L673L4807N4198J4941M0007M8021J6395K1289J6454M214M1426
8568B128732J4982L9095M3680M6318K7404N2870P7102R2327R8632Q0609O8574
8557B770325J04020J10702J22479J22981J19127J24118J03558M6041p646o1324
$$ plain form
8547 3554381 3469472 3339894 3197520 3076255 2980361 2877596 2774529 2688927 2617061 2553105
8537 2553105 2490859 2421973 2378986 2354360 2335374 2294414 2253031 2239533 2222099 2224180 2219910 2214415
8525 2214415 2179285 2123975 2084657 2040653 1987511 1947270 1917387 1901141 1867589 1805439 1761506
8514 1761506 1736450 1716667 1715346 1693477 1669009 1629142 1596364 1570919 1551279 1518362 1468521 1438145
8502 1438145 1424649 1411955 1397598 1389944 1363033 1330745 1312803 1287329 1260962 1223427 1197148 1191903
8490 1191903 1185803 1188936 1181204 1172928 1165994 1153239 1137928 1122415 1120333 1155088 1214173 1289315 1358891
8477 1358891 1412523 1445863 1414832 1335458 1231145 1170643 1116439 1090346 1064969 1055409 1045648 1028152
8465 1028152 1036499 1015622 983823 979743 961238 952090 974257 965149 951484 928173 906164 908548
$$ packed form
8547C554381q4909j29578j42374j21265r5894j02765j03067q5602p1866o3956
8537B553105o2246o8886m2987k4626j8986m0960m1383j3498j7434K081m270n495
8525B214415l5130n5310l9318m4004n3142m0241k9883j6246l3552o2150m3933
8514A761506k5056j9783j321k1869k4468l9867l2778k5445j9640l2917m9841l0376
8502A438145j3496j2694j4357p654k6911l2288j7942k5474k6367l7535k6279n245
8490A191903o100L133p732q276o934j2755j5311j5513k082L4755N9085P5142O9576
8477A358891N3632L3340l1031p9374j04313o0502n4204k6093k5377r560r761j7496
8465A028152Q347k0877l1799m080j8505r148K2167r108j3665k3311k2009K384
$$ plain form
8453 908548 913737 916190 918559 912393 914827 916707 909571 908195 878149 856965 853489 862162 872845 871222
8439 871222 877361 876919 851941 826917 805664 808536 810892 796712 775228 770101 767873 757308 744116
8426 744116 740255 755287 764042 768750 761521 724117 700961 698315 700267 704502 701406 690865 677130
8413 677130 673605 668800 653759 650257 660744 674075 672133 644109 614765 610190 594232 599958 610729
8400 610729 612469 616270 611075 605938 617768 626764 615638 601611 577579 580521 588558 592658 573186
8387 573186 564714 554389 566518 585621 590704 591979 590148 582074 575831 540588 529051 537047 531720
8374 531720 501713 501504 524605 532216 550906 568568 558091 527814 505137 500426 497938 509969 524243
8361 524243 517060 514989 519081 498345 485960 496714 499043 490066 503297 526843 527644 522513 507409
$$ packed form
8453I08548N189K453K369o166K434J880p136j376l0046k1184l476Q673J0683j623
8439H71222O139m42k4978k5024k1253K872K356j4180k1484n127k228j0565j3192
8426G44116l861J5032Q755M708p229l7404k3156k646J952M235l096j0541j3735
8413F77130l525m805j5041l502J0487J3331j942k8024k9344m575j5958N726J0771
8400F10729J740L801n195n137J1830Q996j1126j4027k4032K942Q037M100j9472
8387E73186q472j0325J2129J9103N083J275j831q074o243l5243j1537P996n327
8374E31720l0007k09K3101P611J8690J7662j0477l0277k2677m711k488J2031J4274
8361E24243p183k071M092k0736j2385J0754K329q977J3231K3546Q01n131j5104
$$ plain form
8348 507409 512344 521400 511828 512602 521474 526802 519107 512234 518316 520131 511133 513003 522918 537776
8334 537776 525034 507505 509398 493379 481226 484423 478562 489156 496987 490749 489307 488112 495212
8321 495212 498685 476507 468801 472311 479124 482784 476348 473979 470757 464938 468768 479660 488391 486747
8307 486747 485958 482591 475322 488127 479089 472600 474317 475374 449200 447393 465336 464092 453908 451871
8293 451871 453362 460200 449144 458804 474279 480961 458572 433018 418843 405633 411356 423056 434557
8280 434557 439844 449120 442214 420289 418709 424215 437701 447359 455419 452575 442786 424367 389670
8267 389670 368345 386500 400200 389268 372512 373473 379529 356275 338459 343733 351125 353225 351925
8254 351925 376508 389913 390461 384266 372342 389750 369362 365455 360980 341984 343836 366561 369038
$$ packed form
8348E07409M935R056r572P74Q872N328p695o873O082J815q998J870R915J4858
8334E37776j2742j7529J893j6019j2153L197n861J0594P831o238j442j195P100
8321D95212L473k2178p706L510O813L660o436k369l222n819L830J0892Q731j644
8307D86747p89l367p269J2805r038o489J717J057k6174j807J7943j244j0184k037
8293D51871J491O838j1056R660J5475O682k2389k5554j4175j3210N723J1700J1501
8280D34557N287R276o906k1925j580N506J3486R658Q060k844r789j8419l4697
8267C89670k1325J8155J3700j0932j6756R61O056k3254j7816N274P392K100j300
8254C51925K4583J3405N48o195j1924J7408k0388l907m475j8996J852K2725K477
$$ plain form
8241 369038 351814 345320 372008 365307 351572 341236 335241 338200 341721 341111 357138 365206 362645
8228 362645 353799 363408 352259 361412 376442 371266 372599 372300 376480 387347 393183 374728 354973
8215 354973 351899 361219 349109 326844 321287 320518 317581 320249 317804 317625 336116 336387 339496 331588
8201 331588 314897 315686 319636 313682 324612 348137 337764 331988 349158 364250 350816 354235 353578
8188 353578 329369 309050 299711 308105 331627 339046 321549 326868 350951 348438 316275 305557 317688
8175 317688 321604 317888 301519 285515 322803 345264 325953 329846 329100 318246 294101 297597 305309
8162 305309 286841 284248 287464 284638 280834 296839 299694 299398 288372 286134 293276 268282 253452
8149 253452 256409 267888 276583 267449 252980 248591 276516 280618 278975 278119 268135 264711 270867 278505
$$ packed form
8241C69038j7224o494K6688o701j3735j0336n995K959L521o10J6027Q068k561
8228C62645q846R609j1149R153J5030n176J333k99M180J0867N836j8455j9755
8215C54973l074R320j2110k2265n557p69k937K668k445j79J8491K71L109p908
8201C31588j6691P89L950n954J0930K3525j0373n776J7170J5092j3434L419o57
8188C53578k4209k0319r339Q394K3522P419j7497N319K4083k513l2163j0718J2131
8175C17688L916l716j6369j6004L7288K2461j9311L893p46j0854k4145L496P712
8162C05309j8468k593L216k826l804J6005K855k96j1026k238P142k4994j4830
8149B53452K957J1479Q695r134j4469m389K7925M102j643q56r984l424O156P638
$$ plain form
8135 278505 286470 279084 256801 260685 278903 282744 274905 276839 279520 278477 269491 272988 264310 272324
8121 272324 250338 238151 266435 269793 249510 253502 247398 243743 254426 273978 298560 308832
8109 308832 295189 281975 286337 279502 280976 270201 271534 270526 278698 292596 290575 270972 243082
8096 243082 243743 234439 246109 272406 287619 294624 288747 272162 259594 269124 268008 250649 246092
8083 246092 261169 265481 247732 254643 263871 294679 288992 282236 278585 285937 285892 280084 280636 264603
8069 264603 255890 245986 244784 259015 281899 299892 308099 309627 278733 259445 256356 271318 272437
8056 272437 260519 256937 249396 262415 290954 306419 322660 331441 337086 331207 333847 340588 338468
8043 338468 347131 348190 323784 307987 320092 330689 327715 316100 316613 326027 328581 319552 318353
$$ packed form
8135B78505P965p386k2283L884J8218L841p839J934K681j043q986L497q678Q014
8121B72324k1986j2187K8284L358k0283L992o104l655J0683J9552K4582J0272
8109C08832j3643j3214M362o835J474j0775J333j008Q172J3898k021j9603k7890
8096B43082O61r304J1670K6297J5213P005n877j6585j2568R530j116j7359m557
8083B46092J5077M312j7749O911R228L0808n687o756l651P352m5n808N52j6033
8069B64603q713r904j202J4231K2884J7993Q207J528l0894j9288l089J4962J119
8056B72437j1918l582p541J3019K8539J5465J6241Q781N645n879K640O741k120
8043C38468Q663J059k4406j5797J2105J0597k974j1615N13R414K554r029j199
$$ plain form
8030 318353 309669 307809 294489 285485 291830 305889 320037 326870 325690 327978 336870 353003 352301 326616
8016 326616 328403 334953 350650 380576 383497 381029 382851 400664 416031 422793 430013 425119 419796
8003 419796 412718 435107 459765 472421 477448 488985 503458 501829 496377 494957 531813 557519 570529
7990 570529 597269 612635 598347 559698 543548 540583 547152 572317 595927 592351 596484 595337 602488
7977 602488 598908 589382 609972 620740 611967 617085 630710 659955 678920 701180 714350 746242
7965 746242 770436 765543 771280 783590 813750 831576 861247 901522 940653 970887 980313 992437
7953 992437 1012048 1026965 1019002 1014953 1011529 1001990 999720 998137 1006805 1019692 997144 949087 925959
7940 925959 916153 903064 876276 877027 885775 879472 869670 865146 873070 865143 854703 866338 896276
$$ packed form
8030C18353q684j860j3320r004O345J4059J4148O833j180K288Q892J6133p02k5685
8016C26616J787O550J5697K9926K921k468J822J7813J5367O762P220m894n323
8003D19796p078K2389K4658J2656N027J1537J4473j629n452j420L6856K5706J3010
7990E70529K6740J5366j4288l8649j6150k965O569K5165K3610l576M133j147P151
7977F02488l580r526K0590J0768q773N118J3625K9245J8965K2260J3170L1892
7965G46242K4194m893N737J2310L0160J7826K9671M0275L9131L0234R426J2124
7953I92437J9611J4917p963m049l424r539k270j583Q668J2887k2548m8057k3128
7940I25959r806j3089k6788P51Q748o303r802m524P924p927j0440J1635K9938
$$ plain form
7927 896276 913623 915881 908328 928440 950426 962537 966150 985913 985154 1000272 1022422 1010491 994691
7914 994691 1008786 1022429 1041790 1036079 1057673 1051982 1027064 1019204 1029676 1018367 990133 970788
7902 970788 941560 900762 892093 876299 840034 824077 824328 797552 790105 786069 772136 765749 760990
7889 760990 747760 746049 755426 762657 752118 741853 742315 736572 707576 711199 732446 723419 707900
7876 707900 696379 672066 663585 679141 691100 703076 678806 662492 666790 646464 628642 605014
7864 605014 586366 568284 556723 559550 572459 564370 543449 522096 501054 485588 460102 458077
7852 458077 452271 445448 455896 451854 443335 453673 450663 458321 441847 433106 425553 425704 414798 409739
7838 409739 421203 410511 378039 366880 359501 357117 343380 321677 304984 312974 310679 315856 321926
$$ packed form
7927H96276J7347K258p553K0112K1986J2111L613J9763p59J5118K2150j1931j5800
7914I94691J4095J3643J9361n711K1594n691k4918p860J0472j1309k8234j9345
7902I70788k9228m0798q669j5794l6265j5957K51k6776p447m036j3933o387m759
7889G60990j3230j711R377P231j0539j0265M62n743k8996L623K1247r027j5519
7876G07900j1521k4313q481J5556J1959J1976k4270j6314M298k0326j7822k3628
7864F05014j8648j8082j1561K827J2909q089k0921k1353k1042j5466k5486k025
7852D58077n806o823J0448m042q519J0338l010P658j6474q741p553J51j0906n059
7838D09739J1464j0692l2472j1159p379k384j3737k1703j6693P990k295N177O070
$$ plain form
7825 321926 325348 317600 317533 306956 292284 285234 287602 291159 303509 303782 290865 271926 244960 240141
7811 240141 250107 257767 267717 265874 248757 233374 247717 248951 240517 224729 220864 219624 217582
7798 217582 211926 215341 231613 244865 225908 238617 237606 223995 221721 224323 229098 218228 203524
7785 203524 207668 204982 202392 196361 215860 217593 212284 209450 203952 199216 212322 204908 188105 179752
7771 179752 183344 176817 157748 162813 191005 196515 182734 182684 168753 166109 159178 147084 177298
7758 177298 193571 167403 140560 154719 154370 157791 189754 182102 158014 144527 126231 129769 135608
7745 135608 138249 132476 122337 131855 162855 156576 142797 152970 153922 147922 137940 128560 139260
7732 139260 155861 166350 151114 129525 114680 110556 129608 149033 144241 134628 138920 133123 122389
$$ packed form
7825C21926L422p748o7j0577j4672p050K368L557J2350K73j2917j8939k6966m819
7811B40141R966P660R950j843j7117j5383J4343J234q434j5788l865j240k042
7798B17582n656L415J6272J3252j8957J2709j011j3611k274K602M775j0870j4704
7785B03524M144k686k590o031J9499J733n309k834n498m736J3106p414j6803q353
7771A79752L592o527j9069N065K8192N510j3781n0j3931k644o931j2094L0214
7758A77298J6273k6168k6843J4159l49L421L1963p652k4088j3487j8296L538N839
7745A35608K641n773j0139R518L1000o279j3779J0173R52o000r982r380J0700
7732A39260J6601J0489j5236k1589j4845m124J9052J9425m792r613M292n797j0734
$$ plain form
7719 122389 118358 119628 120441 111041 110474 113516 122120 122223 125246 98838 91320 110935 112663 107536 113719
7704 113719 130146 136935 128463 99090 89789 77589 84365 105650 103554 96758 82201 96366 115454
7691 115454 136217 122141 114622 131278 128988 106716 93561 91773 92420 78264 72614 79054 71637
7678 71637 54683 81508 105361 130794 119561 104697 111035 87483 77151 80917 74247 46095
7666 46095 57857 61365 67553 71742 54149 67009 83101 94841 95463 80875 71062 98217 111553
7653 111553 110754 114261 128038 111177 87101 97608 93371 92097 88900 77330 77719 70985 49339
7640 49339 56022 55840 84053 81901 77058 62210 54540 66766 63660 61799 63746 52721 39528 59120
7626 59120 56716 34971 20052 22927 23841 33269 67623 68073 73700 68721 79011 93392 95728 93019
$$ packed form
7719A22389m031J270Q13r400n67L042Q604J03L023k6408p518J9615J728n127O183
7704A13719J6427O789q472k9373r301j2200O776K1285k096o796j4557J4165J9088
7691A15454K0763j4076p519J6656k290k2272j3155j788O47j4156n650O440p417
7678G1637j6954K6825K3853K5433j1233j4864O338k3552j0332L766o670k8152
7666D6095J1762L508O188M189j7593J2860J6092J1740O22j4588r813K7155J3336
7653A11553p99L507J3777j6861k4076J0507m237j274l197j1570L89o734k1646
7640D9339O683j82K8213k152m843j4848p670J2226l106j861J947j1025j3193J9592
7626E9120k404k1745j4919K875R14R428L4354M50N627m979J0290J4381K336k709
$$ plain form
7612 93019 81855 79619 84782 80466 66076 80360 68412 60119 45700 25965 38920 62351 66495
7599 66495 68430 57623 32717 45711 45078 44254 41169 68711 84900 80420 74653 94801 107861
7586 107861 119446 87505 71265 71561 71941 78063 71067 64415 69067 80629 81193 61193 65885 63005
7572 63005 63411 57334 55397 54745 46139 36753 41030 33929 52068 60685 69107 58036 29109 26222
7558 26222 57846 63090 60093 56794 40365 48091 53581 53180 46591 37338 55208 69642 72229 83222
7544 83222 70287 54577 42394 56939 66865 71825 63276 57374 63490 61155 61859 65639 60623 41079
7530 41079 39489 33188 51200 66265 84351 53480 18472 10324 7847 19802 12796 18290 33328
7517 33328 37615 38556 25024 32373 43023 42007 45370 33482 41717 54967 70653 69409 41246
$$ packed form
7612I3019j1164k236N163m316j4390J4284j1948q293j4419j9735J2955K3431M144
7599F6495J935j0807k4906J2994o33q24l085K7542J6189m480n767K0148J3060
7586A07861J1585l1941j6240K96L80O122o996o652M652J1562N64k0000M692k880
7572F3005M06o077j937o52q606r386M277p101J8139Q617Q422j1071k8927k887
7558B6222L1624N244k997l299j6429P726N490m01o589r253J7870J4434K587J0993
7544H3222j2935j5710j2183J4545R926M960q549n902O116k335P04L780n016j9544
7530D1079j590o301J8012J5065J8086l0871l5008q148k477J1955p006N494J5038
7517C3328M287R41j3532P349J0650j016L363j1888Q235J3250J5686j244k8163
$$ plain form
7504 41246 40291 22364 24520 44101 37541 49087 72293 90310 87401 75450 86131 71624 51450
7491 51450 51164 55768 70672 83405 95677 61257 41710 37968 34906 31627 50879 42533 35200
7478 35200 60425 62801 44564 26978 35707 39240 50290 71677 62868 57872 49135 53509 47845
7465 47845 42570 40207 34415 39209 53956 60864 56324 52424 30419 29746 37745 13491 14739 15073
7451 15073 37788 62076 56173 49599 37146 41812 32865 27515 32707 49815 52293 60902 34241
7438 34241 24045 29378 53298 67161 57148 56074 60163 44718 40830 27682 15515 45000 56138
7425 56138 47494 26933 20192 42313 59932 54999 36463 17688 12170 36377 55927 45081 41660
7412 41660 61142 75296 68535 32430 138 -35626 -44176 -22039 -15992 -24863 -11257 -4041 22671
$$ packed form
7504D1246r55j7927K156J9581o560J1546K3206J8017k909j1951J0681j4507k0174
7491E1450k86M604J4904J2733J2272l4420j9547l742l062l279J9252q346p333
7478C5200K5225K376j8237j7586Q729L533J1050K1387q809m996q737M374n664
7465D7845n275k363n792M794J4747O908m540l900k2005o73P999k4254J248L34
7451A5073K2715K4288n903o574j2453M666q947n350N192J7108K478Q609k6661
7438C4241j0196N333K3920J3863j0013j074M089j5445l888j3148j2167K9485J1138
7425E6138q644k0561o741K2121J7619m933j8536j8775n518K4207J9550j0846l421
7412D1660J9482J4154o761l6105l2292l5764q550K2137O047q871J3606P216K6712
$$ plain form
7399 22671 40155 62458 54016 48449 48049 46709 43431 19784 9531 17166 18610 12120 26315 49082
7385 49082 45224 35316 38029 26607 26839 1572 -20235 -17605 -8833 -11558 13112 40995 42423 23402
7371 23402 24478 23904 28724 28891 32214 32413 38495 28274 10747 23598 28259 33721 20061 17132
7357 17132 3523 8738 32560 46183 42280 33156 21161 11412 18062 17829 23820 47185 45392 32330
7343 32330 35393 45205 55405 59433 43988 31340 29330 39490 31601 23537 14059 16021 11678 21660
7329 21660 40417 55948 46310 20299 10498 11670 14455 -1964 -7657 -4823 -6585 -2482 1452 1147
7315 1147 -7565 -12175 1286 15690 28664 54604 60681 63497 65374 76452 81899 60999 48137
7302 48137 40371 55238 56662 47953 7467 341 9843 25743 37339 44329 48492 27460 11521
$$ packed form
7399B2671J7484K2303q442n567m00j340l278k3647j0253P635J444o490J4195K2767
7385D9082l858r908K713j1422K32k5267k1807K630Q772k725K4670K7883J428j9021
7371B3402J076n74M820J67L323J99O082j0221j7527J2851M661N462j3660k929
7357A7132j3609N215K3822J3623l903r124j1995r749O650k33N991K3365j793j3062
7343C2330L063R812J0200M028j5445j2648k010J0160p889q064r478J962m343R982
7329B1660J8757J5531r638k6011r801J172K785j6419n693K834j762M103L934l05
7315A147q712m610J3461J4404J2974K5940O077K816J877J1078N447k0900j2862
7302D8137p766J4867J424q709m0486p126R502J5900J1596O990M163k1032j5939
$$ plain form
7289 11521 -2239 -4047 -6680 -4418 16379 22217 43993 49535 39527 17692 14056 25480 26454
7276 26454 41116 16566 -1437 -10994 -13140 -13242 -4246 -5832 -20931 -41492 -30289 -16621 2431
7263 2431 7631 15959 13960 15009 19446 35910 62556 80238 81284 76309 78949 73918 58227 68090
7249 68090 64964 42701 43419 46510 11993 -3397 486 -8741 -12508 -16560 -34215 -37920 -22245 -9483
7235 -9483 9913 19446 16379 10176 16543 45673 34905 39126 48429 25087 -4603 12170 20577
7222 20577 13097 11423 -1483 14120 7201 -11269 -45381 -51460 -44495 -30558 -18572 -22715 -15801
7209 -15801 -2187 -917 41635 70992 66950 42671 34322 38364 55124 48431 39375 46757 36810
7196 36810 12821 3087 3585 3356 14 3183 23894 51471 54192 47676 21615 8679 7899 20418
$$ packed form
7289A1521j3760j808k633K262K0797N838K1776N542j0008k1835l636J1424R74
7276B6454J4662k4550j8003r557k146j02Q996j586j5099k0561J1203J3668J9052
7263B431N200Q328j999J049M437J6464K6646J7682J046m975K640n031j5691R863
7249F8090l126k2263P18L091l4517j5390L883r227l767m052j7655l705J5675J2762
7235i483J9396R533l067o203O367K9130j0768M221R303k3342k9690J6773Q407
7222B0577p480j674j2906J5603o919j8470l4112o079O965J3937J1986m143O914
7209a5801J3614J270M2552K9357m042k4279q349M042J6760o693r056P382r947
7196C6810k3989r734M98k29l342L169K0711K7577K721o516k6061j2936p80J2519
$$ plain form
7182 20418 4666 22128 29425 32634 35471 28157 39126 34929 40963 42300 50826 58848 45975 34436
7168 34436 39634 39040 25103 22134 19657 31301 28034 10103 -426 3655 22510 23585 24422 13108
7154 13108 18165 9803 14287 11843 6264 -2817 -2902 -930 -2414 5813 1309 13804 32200 31800 26394
7139 26394 13863 13145 24620 35712 26982 30390 22148 16220 27225 17521 -5386 -12091 -15132 -11785
7125 -11785 -11392 9336 18416 9799 18454 21179 17558 2225 -7831 -1185 13515 23760 35258
7112 35258 36564 18778 2123 -11013 -12034 10117 22927 20305 2029 -281 -6479 3060 -6943
7099 -6943 -3092 7533 -6136 -10566 2324 11780 9918 23335 23060 22977 14288 14773 21741 16327 22474
7084 22474 22262 2885 -3949 760 18142 18406 -4377 15977 29803 22715 19293 20596 29527 17093
$$ packed form
7182B0418j5752J7462P297L209K837p314J0969m197O034J337Q526Q022j2873j1539
7168C4436N198n94j3937k969k477J1644l267j7931j0529M081J8855J075Q37j1314
7154A3108N057q362M484k444n579r081q5J972j484Q227m504J2495J8396m00n406
7139B6394j2531p18J1475J1092q730L408q242n928J1005r704k2907o705l041L347
7125a1785L93K0728R080q617Q655K725l621j5333j0056O646J4700J0245J1498
7112C5258J306j7786j6655j3136j021K2151J2810k622j8276k310o198R539j0003
7099f943L851J0625j3669m430J2890R456j862J3417k75q3q689M85O968n414O147
7084B2474k12j9377o834M709J7382K64k2783K0354J3826p088l422J303Q931j2434
$$ plain form
7070 17093 32212 36426 9230 7673 7089 4966 7711 9315 661 -20501 -45371 -47256 -42427 -23463
7056 -23463 14182 27548 20662 3247 3634 745 19100 23744 22435 28254 14400 13423 23100 30975
7042 30975 49815 39850 32372 16993 9261 -18816 -12066 14153 11270 -18803 -28816 -7242 -359
7029 -359 6167 13509 27866 28443 32149 24407 7094 -6413 10603 29641 14323 5463 19911 7063
7015 7063 2742 -3067 -2487 -5327 -6670 -18346 379 23857 32115 28995 17164 -14923 -28603 -21991
7001 -21991 -7806 4498 10399 1020 1140 9847 13804 13899 12743 4483 -9051 2469 7229 -13395
6987 -13395 -14808 -2796 7698 1033 1140 22028 35678 40092 19101 12170 -3671 -8653 -11410
6974 -11410 12895 16287 15746 -292 7485 26410 19726 8203 2713 -2157 10005 -4095 2148
$$ packed form
7070A7093J5119M214k7196j557n84k123K745J604q654k1162k4870j885M829J8964
7056b3463L7645J3366o886j7415L87k889J8355M644j309N819j3854r77R677P875
7042C0975J8840r965p478j5379p732k8077O750K6219k883l0073j0013K1574O883
7029c59O526P342J4357N77L706p742j7313j3507J7016J9038j5318q860J4448j2848
7015G063m321n809N80k840j343j1676J8725K3478Q258l120j1831l2087j3680O612
7001b1991J4185J2304N901r379J20Q707L957R5j156q260j3534J1520M760k0624
6987a3395j413J2012J0494o665J07K0888J3650M414k0991o931j5841m982k757
6974a1410K4305L392n41j6038P777J8925o684j1523n490m870J2162j4100O243
$$ plain form
6961 2148 15580 14258 29635 28131 24041 253 26145 30921 23134 19766 15775 11297 29516 21870
6947 21870 30105 47805 41498 26794 33638 34853 25033 19765 30148 33206 7988 -3877 -6623
6934 -6623 -14137 -16332 -25607 -29755 -20125 -18457 -22562 -13249 8758 16041 22901 15484 27400 37342
6920 37342 21419 -7568 -7103 -18065 -18828 9559 24416 13791 10905 10174 1486 -21888 -20787 -4821
6906 -4821 14119 26171 12453 25665 32197 19855 -7061 -9634 -7458 6078 14345 11309 -6811
6893 -6811 -14602 -20593 -11372 -9069 -9403 -13230 -13664 7426 9121 5289 3791 1127 5969 3085 -2614
$$ packed form
6961B148J3432j322J5377j504m090k3788K5892M776p787l368l991m478J8219p646
6947B1870Q235J7700o307j4704O844J215r820n268J0383L058k5218j1865k746
6934f623p514k195r275m148R630J668m105R313K2007P283O860p417J1916R942
6920C7342j5923k8987M65j0962p63K8387J4857j0625k886p31q688k3374J101J5966
6906d821J8940J2052j3718J3212O532j2342k6916k573K176J3536Q267l036j8120
6893f811p791n991R221K303l34l827m34K1090J695l832j498k664M842k884n699
$$ [...]
##END NTUPLES=NMR SPECTRUM
##END=
