##TITLE=Analysis number 327602
Compound Code sb 01130
Project Code adrs
Chemist Name stores
##JCAMPDX= 6.0         $$ Bruker NMR JCAMP-DX V2.0
##DATA TYPE= NMR SPECTRUM
##DATA CLASS= NTUPLES
##ORIGIN= Bruker BioSpin GmbH
##OWNER= nmr
$$ XWIN-NMR		Version 3.5
$$ Tue Mar 27 15:50:23 2007 GMT Daylight Time (UT+1h)  MAYBRIDGE\nmr@NMR_250MHZ
##.OBSERVE FREQUENCY= 250.131544655141
##.OBSERVE NUCLEUS= ^1H
##.ACQUISITION MODE= SIMULTANEOUS (DQD)
##.ACQUISITION SCHEME= undefined
##.AVERAGES= 16
##.DIGITISER RES= 18
##SPECTROMETER/DATA SYSTEM= dpx250
##.PULSE SEQUENCE= zg30
##.SOLVENT NAME= CDCl3
##.SHIFT REFERENCE= (INTERNAL, CDCl3, 0, 16.522)
##AUDIT TRAIL= $$ (NUMBER, WHEN, WHO, WHERE, WHAT)
$$ ##TITLE= Audit trail, XWIN-NMR		Version 3.5
$$ ##JCAMPDX= 5.01
$$ ##ORIGIN= Bruker BioSpin GmbH
$$ ##OWNER= nmr
$$ C:\u/data/dgb/nmr/ADRS/2310/pdata/1/auditp.txt
$$ ##AUDIT TRAIL=  $$ (NUMBER, WHEN, WHO, WHERE, WHAT)
(   1,<2007-03-27 15:49:58.21 +100>,<MAYBRIDGE\nmr>,<NMR_250MHZ>,
      <created by zg, POWCHK disabled, PULCHK disabled
       configuration hash MD5:
       49 4B E0 1D 92 C2 6B 37 9F E6 65 BC 52 41 86 1D
       data hash MD5: 64K
       7C 49 C4 4B 5C F0 C7 CF 48 28 B8 2E CE 44 5B DC>)
(   2,<2007-03-27 15:50:13.33 +100>,<MAYBRIDGE\nmr>,<NMR_250MHZ>,
      <Start of raw data processing
       ef LB = 0.3 FT_mod = 6 PKNL = 1 SI = 32K 
       data hash MD5: 32K
       11 1A 9C 0E 1A A7 D0 90 E9 E1 66 7C 3B E8 0C AE>)
(   3,<2007-03-27 15:50:15.08 +100>,<MAYBRIDGE\nmr>,<NMR_250MHZ>,
      <apk 
       data hash MD5: 32K
       33 E7 46 ED 2A 35 FA DD 92 A0 9E 7F CA 27 17 D0>)
(   4,<2007-03-27 15:50:15.96 +100>,<MAYBRIDGE\nmr>,<NMR_250MHZ>,
      <abs ABSG = 5 
       data hash MD5: 32K
       29 E1 3C 76 06 C7 84 86 34 D9 06 E2 D3 64 41 75>)
$$ ##END=
$$ 
$$ hash MD5
$$ 52 84 F1 21 7D 21 3A 68 B0 00 21 2A A5 2B AC F2
##$RELAX= 
##$RELAX= 
##$RELAX= 
##$RELAX= 
##$RELAX= 
##$RELAX= 
##$RELAX= 
$$ Bruker specific parameters
$$ --------------------------
##$DU= <C:\u>
##$EXPNO= 2310
##$NAME= <ADRS>
##$PROCNO= 1
##$TYPE= <nmr>
##$USER= <dgb>
##$AMP= (0..31)
100 100 100 100 100 100 100 100 100 100 100 100 100 100 100 100 100 100 
100 100 100 100 100 100 100 100 100 100 100 100 100 100 
##$AQSEQ= 0
##$AQ_mod= 3
##$AUNM= <au_zg>
##$AUTOPOS= <52 >
##$BF1= 250.13
##$BF2= 250.13
##$BF3= 250.13
##$BF4= 250.13
##$BF5= 500.13
##$BF6= 500.13
##$BF7= 500.13
##$BF8= 500.13
##$BYTORDA= 1
##$CFDGTYP= 0
##$CFRGTYP= 5
##$CHEMSTR= <none>
##$CNST= (0..31)
1 1 145 1 1 1 1 1 1 1 1 1 1 1 1 1 1 1 1 1 1 1 1 1 1 1 1 1 1 1 1 1 
##$CPDPRG= <>
##$CPDPRG1= <>
##$CPDPRG2= <>
##$CPDPRG3= <>
##$CPDPRG4= <mlev>
##$CPDPRG5= <mlev>
##$CPDPRG6= <mlev>
##$CPDPRG7= <mlev>
##$CPDPRG8= <mlev>
##$CPDPRGB= <>
##$CPDPRGT= <>
##$D= (0..31)
0 1 0 0 0 0 0 0 0 0.06 0 0 0 0 0 0 0.0002 0 0 0 0 0 0 0 0 0 0 0 0 0 0 
0 
##$DATE= 1175006996
##$DBL= (0..7)
120 120 120 120 120 120 120 120 
##$DBP= (0..7)
150 150 150 150 150 150 150 150 
##$DBP07= 0
##$DBPNAM0= <>
##$DBPNAM1= <>
##$DBPNAM2= <>
$$ [...]
##$SUBNAM7= <"">
##$SUBNAM8= <"">
##$SUBNAM9= <"">
##$SW= 20.6930455092707
##$SWIBOX= (0..15)
0 0 3 0 0 0 0 0 0 0 0 0 0 0 0 0 
##$SW_h= 5175.983436853
##$TD= 65536
##$TD0= 1
##$TE= 683.16
##$TE2= 300
##$TE3= 300
##$TEG= 300
##$TL= (0..7)
0 120 120 120 120 120 120 120 
##$TP= (0..7)
150 150 150 150 150 150 150 150 
##$TP07= 0
##$TPNAME0= <>
##$TPNAME1= <>
##$TPNAME2= <>
##$TPNAME3= <>
##$TPNAME4= <>
##$TPNAME5= <>
##$TPNAME6= <>
##$TPNAME7= <>
##$TPOAL= (0..7)
0.5 0.5 0.5 0.5 0.5 0.5 0.5 0.5 
##$TPOFFS= (0..7)
0 0 0 0 0 0 0 0 
##$TUNHIN= 0
##$TUNHOUT= 0
##$TUNXOUT= 0
##$USERA1= <user>
##$USERA2= <user>
##$USERA3= <user>
##$USERA4= <user>
##$USERA5= <user>
##$V9= 5
##$VALIST= <valist>
##$VCLIST= <CCCCCCCCCCCCCCC>
##$VD= 0
##$VDLIST= <DDDDDDDDDDDDDDD>
##$VPLIST= <PPPPPPPPPPPPPPP>
##$VTLIST= <TTTTTTTTTTTTTTT>
##$WBST= 1024
##$WBSW= 4
##$XGAIN= (0..3)
0 0 0 0 
##$XL= 0
##$YL= 0
##$YMAX_a= 692168
##$YMIN_a= -850577
##$ZGOPTNS= <>
##$ZL1= 120
##$ZL2= 120
##$ZL3= 120
##$ZL4= 120
##$ABSF1= 16.522
##$ABSF2= -4.171173
##$ABSG= 5
##$ABSL= 3
##$ALPHA= 0
##$AQORDER= 0
##$ASSFAC= 0
##$ASSFACI= 0
##$ASSFACX= 0
##$ASSWID= 0
##$AUNMP= <proc_1d>
##$AZFE= 0.1
##$AZFW= 0.1
##$BCFW= 0
##$BC_mod= 0
##$BYTORDP= 0
##$COROFFS= 0
##$CY= 12.5
##$DATMOD= 1
##$DC= 0
##$DFILT= <>
##$DTYPP= 0
##$F1P= 14.0000005364418
##$F2P= -0.99999901652339
##$FCOR= 0.5
##$FTSIZE= 32768
##$FT_mod= 6
##$GAMMA= 0
##$GB= 0
##$INTBC= 1
##$INTSCL= 1
##$ISEN= 128
##$LB= 0.3
##$LEV0= 0
##$LPBIN= 0
##$MAXI= 10000
##$MC2= 0
##$MEAN= 0
##$ME_mod= 0
##$MI= 0
##$NCOEF= 0
##$NC_proc= -3
##$NLEV= 6
##$NOISF1= 0
##$NOISF2= 0
##$NSP= 0
##$NTH_PI= 0
##$NZP= 0
##$OFFSET= 16.522
##$PC= 1
##$PHC0= 228.9498
##$PHC1= 4.885711
##$PH_mod= 1
##$PKNL= yes
##$PPARMOD= 0
##$PSCAL= 4
##$PSIGN= 0
##$REVERSE= no
##$SF= 250.13
##$SI= 32768
##$SIGF1= 0
##$SIGF2= 0
##$SINO= 400
##$SIOLD= 32768
##$SREGLST= <1H.CDCl3>
##$SSB= 0
##$STSI= 32768
##$STSR= 0
##$SW_p= 5175.98343685301
##$SYMM= 0
##$S_DEV= 0
##$TDeff= 65536
##$TDoff= 0
##$TI= <Analysis number 999999
Compound Code 99
Book Reference 9
Project Code 9>
##$TILT= no
##$TM1= 0
##$TM2= 0
##$TOPLEV= 0
##$USERP1= <user>
##$USERP2= <user>
##$USERP3= <user>
##$USERP4= <user>
##$USERP5= <user>
##$WDW= 1
##$XDIM= 32768
##$YMAX_p= 478673893
##$YMIN_p= -56413
$$ End of Bruker specific parameters
$$ ---------------------------------
##NTUPLES= NMR SPECTRUM
##VAR_NAME=  FREQUENCY,     SPECTRUM/REAL,   SPECTRUM/IMAG
##SYMBOL=    X,             R,               I
##VAR_TYPE=  INDEPENDENT,   DEPENDENT,       DEPENDENT
##VAR_FORM=  AFFN,          ASDF,            ASDF
##VAR_DIM=   32768,         32768,           32768
##UNITS=     HZ,            ARBITRARY UNITS, ARBITRARY UNITS
##FACTOR=    0.157963299565203, 1,           1
##FIRST=     4132.6476996994, 0,             0
##LAST=      -1043.33573715361, 0,           0
##MIN=       -1043.33573715361, -56413,      0
##MAX=       4132.6476996994, 478673893,     0
$$ Real data points
##PAGE= N=1
##DATA TABLE= (X++(R..R)), XYDATA
$$ [...]
24585 137 -3787 3075 14730 20823 29770 30975 20278 5707 -1200 2085 -2488 -16919 -26398 -24987
24571 -24987 -7260 -4558 -4145 -8169 -7535 -930 4774 1128 8680 14407 5673 -1346 6309 20532
24557 20532 10792 5451 8257 6930 743 9962 25469 18974 4811 -4051 -2005 -8747 -8136 -2104
24543 -2104 -1134 936 -1664 -8983 -10006 3619 12489 4445 890 -13507 5821 21816 18316 12636
24529 12636 7926 10289 18265 19109 2871 4674 4525 6550 11058 5972 544 2637 18065 16621
24515 16621 17095 13050 19898 27909 38842 37639 25605 8412 1049 6057 -5112 -14323 -6046 2641
24501 2641 8678 2902 8675 -2064 -13354 -9473 1788 2607 -2944 -20540 -4483 2877 -3588 -14644
24487 -14644 -14203 -28647 -14523 -6359 -11726 -5467 -1227 934 -5853 -13943 -20582 -10756 -10122 -11138
24473 -11138 -18179 -30976 -24865 -20596 -13436 -6172 -8963 -13674 -19068 -16102 -5931 3060 6253 10477
24459 10477 15963 24657 18928 7486 6310 4651 -1056 -12426 -10124 -1593 1540 14813 28866
24446 28866 13764 -2602 -2833 843 2265 7286 -11629 -28837 -23735 -12508 -5232 -16084 -23338
24433 -23338 -13375 -3812 65 -9953 -11788 -34187 -47883 -32115 -22893 -20586 -16512 -24340 -31146
24420 -31146 -36928 -29425 -33492 -25609 -13648 -17183 -19287 -19420 -13873 4213 3755 948 1969 1713 2367
24405 2367 20379 19914 25531 28807 22495 22870 25596 21669 4197 -3132 6410 3838 -3182 -5867 -5769
24390 -5769 6598 16345 5568 -17096 -12270 -1527 -5095 -10343 -406 7696 6069 5063 -15023
24377 -15023 -8107 -10496 -5693 -1102 -9839 -19303 -25035 -27793 -19908 -4380 752 6926 6470 697
24363 697 -5579 -9042 -13266 -20127 -18234 -6055 -4703 -13978 -11125 -5022 -14153 -15468 -9237 -6539 7750
24348 7750 22699 22160 13119 18047 21986 15983 22562 9272 11824 9864 10599 10722 6213 11072 -3336
24333 -3336 3981 4978 2271 -13872 -8276 7640 15944 12926 18978 22188 27966 23719 20816 23241
24319 23241 21485 18161 25694 25029 5966 -5128 -3136 -8025 -8493 -14219 -11922 -1065 7306 17002
24305 17002 13335 6436 4560 -238 -9639 -1906 6706 5296 4450 6532 8297 12974 21174 25571 18993
24290 18993 17579 12668 1439 -2152 -15310 -16205 -18552 -2132 5428 8137 22084 11505 -7898
24277 -7898 -1301 310 10009 -1028 -9249 -13327 -22038 -15007 -15956 -18631 -16802 -17627 -20331 -8044 275
24262 275 -5525 -4182 4985 10730 10994 165 -16415 -9888 -13676 -16009 -8846 -1235 -10054 -19900 -22385
24247 -22385 -23289 -21688 -4285 3924 -3937 -10272 -14087 -3524 4352 14815 18037 20953 29914 21155
24233 21155 1201 -11918 -13434 -5189 -7349 -24128 -34602 -31585 -28328 -29509 -19558 -13085 -20793
24220 -20793 -16514 -17681 -8388 3174 11226 16695 11779 1846 -1607 6344 11891 4139 6726 13469
24206 13469 9662 5186 1110 -3990 -12422 -5656 -7814 -2863 1612 -8960 -13824 -7733 503 4571
24192 4571 1310 -16126 -8332 -8732 -13187 -20052 -21418 -4926 218 11082 15607 11499 9389 13057
24178 13057 12802 5698 4663 3501 5031 13534 14271 14633 3635 3025 -4605 -11264 -13128 -8987 -7445
24163 -7445 839 8873 -2312 -8745 -3885 471 -10950 -18693 -14369 -9495 -16050 -22393 -9897 2004
24149 2004 4897 6060 12020 -5488 -12072 -10367 -6332 -4119 -11450 -20004 1694 9597 7125 -3910
24135 -3910 2057 129 -7249 -15138 -11212 -15270 -6056 1512 -10104 233 1069 -4299 -11792 -6726
24121 -6726 -7355 -7163 8422 -630 -2369 13665 18416 20338 6538 -2832 -1031 4710 1700 16621
24107 16621 19308 13563 7834 9861 5500 -1727 2868 -2310 -1239 -7251 -21652 -19118 -5616 9204
24093 9204 12509 23462 33518 26520 23771 18570 18248 16533 10117 -4400 -9340 2134 352 -1095
24079 -1095 -7253 7497 -1939 -12032 -19160 -28939 -28600 -23910 -21561 -15568 -12146 -19212 -29756 -22829
24065 -22829 -11087 -9629 -15470 -17367 -17590 -13446 -13815 -9840 6757 16648 9371 10844 10905 -5193 -19910
24050 -19910 -5859 5124 -3633 -3225 6283 4396 5999 -6113 -14060 -7940 10862 19880 4403
24037 4403 5774 6845 9105 14510 21088 14258 -3211 -10079 -20174 -27389 -33709 -17540 -6329 2391
24023 2391 4515 4448 -6318 -18825 -24802 -26129 -29060 -26500 -16469 -7753 7191 6406 -5514 -11324
24009 -11324 -18779 1584 15767 -3941 -13390 -9320 -10563 -20143 -11247 3930 9819 2752 -9426
23996 -9426 -27102 -11567 -3010 -720 -15088 -25009 -15714 -5706 -11581 -18070 -18643 -7833 320 19528
23982 19528 22975 8424 -4506 -7721 -1742 3844 -6281 -8222 -4911 -2808 -2014 709 -1798 11947
23968 11947 16853 3283 -134 8164 12413 14911 2245 -15585 -11570 -11016 -8440 -2367 889 -1479
23954 -1479 15640 24386 12760 6096 5739 6576 18199 11038 14465 18337 23328 24856 14502 17175
23940 17175 3725 -14149 -18628 -15747 -6550 6353 5623 6844 -2278 8618 23986 9526 -18306
23927 -18306 -29494 -12803 3329 6061 17320 13932 5147 -5259 -16947 -19182 -13078 4739 13773
23914 13773 11668 3451 -2352 25 -2561 -392 8363 14909 22460 10583 2110 -5660 -999 6067
23900 6067 15119 17198 11910 7877 16045 19458 21296 19303 19029 16689 9741 7972 1929 2742 7420
23885 7420 17818 16187 3505 -2075 -7021 -16120 -7127 7602 4256 9471 4467 11714 1652 2641
23871 2641 -4704 -5818 -1217 -5304 2260 12898 8871 -4187 -14238 -8723 -1331 753 120 2507
23857 2507 -23299 -13314 1414 -5527 -10659 -9048 -9245 7322 -4827 -16929 -6870 2833 5490
23844 5490 11934 3804 -7483 -23715 -28571 -32001 -28952 -16462 232 6860 9482 7985 1774 -1621
23830 -1621 656 2957 16337 8269 -12676 -8737 -12368 -6553 -7976 -14820 -17161 -24441 -32590 -15189
23816 -15189 -912 13093 1201 1703 1923 5658 17199 10699 -727 2928 8415 -959 -7683 -10208
23802 -10208 -18651 -9515 -9769 -20740 -16868 -1302 9692 13844 1906 -4149 -11934 -12627 7853 20032
23788 20032 12696 5236 7167 -6073 -19452 -6441 -4187 4793 -4759 -20875 -32537 -36997 -18141
23775 -18141 5614 6342 11480 13285 1952 -3675 -2955 -3525 -7776 -21318 -19000 -1095 8749 14004
23761 14004 8567 3078 1959 6436 3431 -484 -5742 3421 2353 -1096 -4533 3201 10504 5281
23747 5281 4097 -4876 -11380 -10670 -23500 -35913 -38005 -31598 -18673 -8906 -5355 3568 11435 16172
23733 16172 17835 18655 19600 7905 2813 -1229 -8713 -4703 -14024 -32903 -34929 -22817 -18576 -20864
23719 -20864 -21810 -14226 -6960 -14208 -18907 -3680 17882 20233 4330 -12487 -18240 -23463 -21106 -1526
23705 -1526 10725 10688 19926 24342 22742 33734 36492 29862 13993 4715 10164 9284 1341 -3259 -14098
23690 -14098 -17533 -10337 5095 7485 2013 -2717 1672 -3460 1175 -2629 -10766 -12936 -21397 -24045
23676 -24045 -19824 -9737 -6117 -4579 -10020 -7709 40 9060 1257 4065 4536 -156 -6407 -6539 -8550
23661 -8550 -9761 926 -3894 -3800 -5635 -8577 -940 12287 9724 -4004 452 -1857 -9180 -9940 1908
23646 1908 2249 -6909 -23738 -27818 -17917 -8936 -14288 -24871 -17199 -17225 -27426 -21441 -11030 3781
23632 3781 5878 -5918 -6739 -1642 -12789 -18149 -8197 7339 21703 6739 1717 12951 2845
23619 2845 -9129 359 8974 -1324 -4319 4619 3671 -4279 -10154 571 2404 -5281 4764 28616
23605 28616 27286 24127 16441 12313 6255 5784 13111 9429 -10269 -17519 -18677 -6674 -931 -18471
23591 -18471 -18870 -22253 -15585 91 6157 20262 19994 7209 -4061 -15791 -20964 -7835 -11869
23578 -11869 -12338 -5709 -17428 -16617 -25002 -32070 -30425 -17795 -6330 1936 3131 3251 2031 -1976
23564 -1976 -5328 -7411 -2469 -2275 -5054 3128 3113 12854 20746 10695 9276 9792 -2998 -3916 -7518
23549 -7518 -6800 -19768 -27798 -31889 -40417 -41580 -32490 -20553 -7507 3077 -2937 -7667 1713 10210
23535 10210 2887 -4087 14945 39767 43625 32588 14105 4542 -9700 -15541 -3550 624 -2417
23522 -2417 4780 6786 -538 1896 -10777 -15138 20 8234 -4305 -13006 -4705 270 -5984 -926
23508 -926 675 975 491 -8284 -12596 -11876 -7796 -5483 9228 718 -15271 -21052 -15680 -11884 -11453
23493 -11453 -7121 7778 4366 -7029 -2017 -1391 2308 13631 15266 394 -8280 5479 16272
23480 16272 14119 -8519 -9921 7885 9539 -8567 -1206 -388 -14588 -13703 -4479 593 -8557 -9932
23466 -9932 13761 24945 6239 -7629 -11447 -26116 -15238 -5640 -10514 -1477 -4247 -12749 -19028
23453 -19028 -11278 1045 -2172 -3078 -7092 -10154 -16401 -15599 -1274 -4813 10150 17619 12321 15342
23439 15342 6039 -7206 -21687 -12355 2739 3635 1597 -14126 -13717 -15866 -11958 -2380 -10622 -18489
23425 -18489 -19036 -12201 -9907 -9754 -12548 -1894 3230 2203 -853 148 3409 2711 -9466 -19526
23411 -19526 -14297 -16302 -10149 -1987 5427 16048 2925 8352 20493 17612 3189 -3868 -10223
23398 -10223 -2541 -6013 -13685 -15506 -9025 -12696 -7061 -3143 3197 6192 -331 -9289 -3938 4831
23384 4831 -4506 233 13737 22964 5041 -12773 -11047 5444 8354 11206 12270 10040 16439 5932
23370 5932 1246 9142 16558 20120 8922 2911 -11351 -16142 -2264 1445 13739 7517 -3098
23357 -3098 -12908 -15991 -14437 -3330 1618 -5368 2111 11767 -1587 -2739 9264 530 4112 8862
23343 8862 34 2691 -6871 -18206 -14067 -22994 -26643 -27409 -27673 -9536 -13761 -18633 -19701 -17456 -10346
23328 -10346 -9169 3894 6743 3651 -6493 -12015 -19102 -20430 -25354 -23053 -14006 -3626 -6742 -5018
23314 -5018 -14148 -24368 -24443 -24708 -16280 -7142 -15514 -25936 -22125 -12038 -3864 6601 14586 9905
23300 9905 2553 -2038 -3733 -1285 -3587 -9167 -4808 -8680 -21867 -24285 -18002 -9475 -12644 -17972
23286 -17972 -10909 -4480 -13006 -3813 -13735 -20541 -9388 -11902 -15363 -16053 -17872 -15232 -7277 -15561
23272 -15561 -31778 -33627 -23238 -25915 -16132 -3644 -9191 4401 5845 7109 9559 13081 3589
23259 3589 561 598 -4108 -11456 -5962 -8811 -18756 -6427 10185 10731 -3057 -6770 -4371 6041
23245 6041 1880 -17510 -15956 -15343 -15942 -9390 692 -2156 1489 -789 -3492 -10947 8681 10910
23231 10910 15814 13513 22048 31662 23924 13629 1718 6493 -1628 -9714 -12208 2028 10245 16849
23217 16849 19437 21979 16458 16250 7283 10559 606 -3788 6743 15740 12954 522 -17677 -18667
23203 -18667 -18033 -14488 -16075 -7978 -6903 -4286 4072 -3457 2295 -2427 -15549 -7083 -11644 -13629
23189 -13629 -7407 5410 3243 -1678 -9293 -8879 -11116 -9273 -10978 -23156 -21780 -9076 8250 2334
23175 2334 1475 6722 -14574 -19049 -17927 -15891 -12708 -8832 -10900 -4609 -9820 -4858 -3094 -3451 -9324
23160 -9324 -6669 -371 -11684 -17724 -13803 -19348 -13501 -1725 -9064 -6842 -841 -3461 9657 26489
23146 26489 8996 -2531 -8858 -15950 -15459 -14103 -11613 -10758 -3304 2278 12136 20374 14475 5540
23132 5540 -7246 -12733 -6142 1728 -6463 -14734 -14324 -7905 -1823 1154 -16879 -20968 -11023 612
23118 612 50 1726 6872 12005 7400 3569 -5458 -7173 -12194 -16288 -16495 -4872 -2834 -9390 -1788
23103 -1788 16977 14750 342 4377 7476 1514 1065 -5219 -6139 -2683 3928 4294 -3711 -13605 -12132
23088 -12132 182 13770 3170 -2050 12378 13833 9116 7696 2983 -1584 -5522 -9351 -8914 -8205
23074 -8205 -2013 -3296 -5605 -7469 2260 3674 -1603 -3811 -9301 -4485 1068 -1918 931 -553 -8778
23059 -8778 -8207 -19267 -20765 -16776 -22001 -12462 -3447 1193 -5936 -6090 -3308 -5775 -21350 -29522 -20794
23044 -20794 -20756 -22523 -28402 -21645 -15213 32 5090 857 -6063 -16823 -17616 -176 2312 6286
23030 6286 2904 3507 6384 10771 17540 -1451 -13728 -15265 551 7007 7436 12628 6370 -8227
23016 -8227 -18315 -2971 5148 3087 -8939 -7660 8267 7123 11504 19339 19676 20991 15730 19770
23002 19770 24687 14197 -113 -2034 6257 5358 14104 21010 19600 15779 8336 6005 5299 7310
22988 7310 3395 -8707 -15925 -15528 -19325 -12239 -12097 7005 9573 -11508 -6962 -8347 -23927 -18175
22974 -18175 -20379 -17115 -15262 -12260 -12112 -19601 -7020 1235 -10536 -14490 -484 -7875 -10304 -5791
22960 -5791 -7616 -4742 -13428 -2381 6118 12709 14442 21103 4855 -6532 -10215 5121 -5494
22947 -5494 12532 15584 1406 -5197 -2050 5065 10165 18320 24242 18767 17329 4797 -18220 -13178
22933 -13178 -796 3164 15771 10538 1284 -10334 -21251 -16407 -12609 -11403 -5305 -519 -8533
22920 -8533 -12813 -21112 -19923 -18049 -22917 -23803 -31410 -34021 -31436 -18862 -19778 -23970 -12911 -1604
22906 -1604 -21 -2860 -6725 -7511 2228 535 5970 9273 8750 5844 -1369 -7631 -5229 -1960 -6923
22891 -6923 -3103 6445 -5609 -8280 -1573 6492 16206 10515 3168 3205 -7713 -23864 -23903 -23615 -11008
22876 -11008 -7327 -17041 -17760 -14501 -12772 -4246 -19780 -35654 -40613 -20075 -5826 -1179 -9621 -13066
22862 -13066 -9803 -1756 -12892 -16721 -10535 -1013 -3430 -12915 -5346 10356 2611 -8449 -3390 -1656
22848 -1656 -9538 -17985 -18092 -11998 -8731 -4142 4909 -7934 -21813 -34538 -28548 -10832 -9629 -29595
22834 -29595 -40956 -40466 -36230 -29707 -16704 -8578 -9981 -17962 -14475 -28 -4336 -6721 -368 -632
22820 -632 -9870 -1990 2356 -1726 -1542 5247 9136 6563 -3955 -18667 -13222 -969 2691 4564
22806 4564 7331 1260 -7285 -7969 -2444 -14000 -21686 -19160 -19301 -25042 -14323 -11835 -20511 -23204 -20481
22791 -20481 -22393 -6477 11720 11205 2505 -8242 -1078 530 -6267 -13200 -7837 -2764 -12830 -23284
22777 -23284 -33905 -34323 -33960 -36634 -29058 -12501 -22124 -28306 -19974 -19006 -11755 2838 4043 -12858
22763 -12858 -20187 -6689 13133 10123 6353 4411 2469 1940 -4520 -8089 -21767 -25679 -16094 -11198
22749 -11198 -15469 -15722 -13750 -14126 -22453 -27298 -23498 -13972 -2102 -5130 -5466 -12614 -2068 -162 -4692
22734 -4692 -14570 -13807 -10926 -10633 -2048 7760 1281 -5661 -15108 -16529 -5886 -6279 -15771 -27201 -28966
22719 -28966 -22693 -17962 -15527 -17451 -10427 -4614 -1061 5638 3770 164 -1219 -2088 -6564 -19677
22705 -19677 -18412 -7810 3699 -9143 -22656 -22026 -9067 1277 8502 4608 11066 13186 -5862
22692 -5862 -9021 -2071 -4489 1746 -2993 -11299 -17964 -17436 -14238 -1544 -9906 -16009 -5673 -3403
22678 -3403 -2825 -7589 -8113 -16864 -10598 -10324 -4424 -14406 -19660 -13969 -3996 4309 -6769 -7905 -15609
22663 -15609 -6480 -392 7261 -4103 -8675 3288 5957 12385 10043 374 5205 9966 12634 2228
22649 2228 -475 7650 9193 8231 8855 4152 -11683 -16623 -17969 -18148 -14851 -16775 -23396 -23080 -25414
22634 -25414 -31109 -21859 -2488 -2430 -4508 1992 -734 -9125 -400 4866 -10230 -21777 -12972 -9561
22620 -9561 -7125 -7052 -1388 1741 7921 9868 247 -469 9339 2477 -1735 738 -3405 -335 -616 -9575
22604 -9575 -5930 -2899 -2606 -4944 -14003 -13763 -15458 -14736 -3363 -3066 2645 2633 6321 2072 1141 -1395
22588 -1395 179 -4947 -2959 -1890 4904 -10429 -28463 -11614 -2 -19954 -18723 -12038 -583
22575 -583 -1180 -14794 -16680 -27440 -19744 -4594 -2312 -6779 -1833 -3214 -8888 -17396 -22498 -21113
22561 -21113 -16377 -17984 -33779 -38174 -27889 -15424 -14043 -9451 -6862 -5866 3060 10246 11619 -3227
22547 -3227 -8286 -14145 -10622 1490 2913 -7203 -490 -93 -6593 -7006 459 6866 10452 6027 -1409
22532 -1409 -1428 -81 10297 -5523 -13236 -21061 -21918 -12331 -2771 -5920 -12882 -9590 4044 3726 4284
22517 4284 2333 3618 2307 -5758 -4229 4994 3261 -2178 -12779 -18359 -20617 -16485 -9187 -7366
22503 -7366 -17896 -12099 -10936 -12571 -17138 -4978 -6658 -9879 -14680 -12622 -18691 -20277 -14882 -9126
22489 -9126 -11615 -9326 -14843 -19135 -19424 -16378 -16274 -14418 -20169 -15200 -3791 -215 -7371 -22270 -20800
22474 -20800 -4141 1786 956 -3010 -5685 -7572 -453 -9576 -8416 7030 7217 -5537 -4666 7022
22460 7022 11634 6939 12188 22833 18771 19041 9709 -2012 -7667 -23629 -34102 -31250 -18569 -22917
22446 -22917 -25571 -18550 -19536 -13365 -7712 8030 6772 -14879 -19576 -15661 -29272 -25264 -13790 2385
22432 2385 8839 3976 1512 1207 -16337 -15982 -4554 9679 6274 5061 8080 666 -6800 -7242 -7218
22417 -7218 -7917 -13675 2310 11098 2542 11739 9607 8928 20175 20547 18067 23856 31389 24209 19532
22402 19532 -10554 -37519 -27112 -16812 -3778 7419 17231 21638 28504 25981 22285 5259 6651
22389 6651 19222 16120 3704 -6630 -4424 4487 7717 744 5913 6162 8556 6804 1621 -11624
22375 -11624 -27589 -20361 -13493 -9568 -7277 -1131 -3716 -12270 -2601 10139 18830 -2735 -16686
22362 -16686 -13442 -8692 -15862 -22203 -17751 -8307 217 -7770 -4303 -350 -740 10357 23057 23416
22348 23416 19435 29870 52201 78190 129167 194835 272490 303706 292894 257882 177444 101350
22336 101350 49291 18367 2715 -15510 -5735 5116 6264 12348 15653 7741 -596 2930 351
22323 351 14351 11292 -8379 -15458 -22944 -26375 -16633 -14339 -5132 5140 21408 23880 19917 17667
22309 17667 16451 7481 10562 -2035 -23399 -34277 -23448 -12954 -10456 -17699 -27441 -14454 773
22296 773 8512 2499 3860 13291 8012 7348 11450 12170 19746 18655 4178 1411 3083 9482 3912
22281 3912 5313 -6747 -15750 -16078 -5947 8879 19443 9409 -1397 -7331 -8233 -8974 -2056 7238
22267 7238 7131 13834 24494 24629 15637 -7810 -18878 -17477 -25707 -25753 -27086 -25268 -23386 -27206 -14573
22252 -14573 -16414 -16518 -12989 -4681 -5660 -12680 -20095 -13060 -11547 -150 5432 11722 462 -13872
22238 -13872 -9471 10886 6490 -5535 -559 1755 -9780 -9345 3700 -3771 8932 4836 -5902
22225 -5902 4748 15857 11408 4537 5155 8182 -5527 -1336 672 -11343 -23174 -21216 -11572 -774
22211 -774 2201 17313 9577 2671 -1539 -6413 -12702 -10308 -9888 -6509 2001 5525 4154 3380 1143
22196 1143 -14270 -20717 -11390 8692 10902 -628 -7964 499 709 12972 9173 -6216 -10341 2087
22182 2087 8735 15469 4479 -1895 -1524 -12293 -17545 -9806 4871 6759 -984 -3881 3605 12853
22168 12853 7384 1498 1154 11446 6689 -4512 -5535 5408 8171 -9038 2457 20612 33660
22155 33660 25452 10430 10644 -2447 -7899 -8339 -7510 6751 23795 24690 27525 17456 12979 1983
22141 1983 -4197 6138 6877 -1200 -7530 2302 -3102 -6221 -9579 -5160 9046 9552 -4100 -6043
22127 -6043 6935 4899 -11083 -22922 -25592 -29826 -28165 -30488 -22116 -9210 3222 -3462 -10760
22114 -10760 -9286 -2652 -714 -10963 -18743 -23946 -22582 -5395 -8139 -14835 -15015 -16828 -18605 -18555 -6004
22099 -6004 8640 9134 12440 -1593 -14186 -8184 6919 11699 -5245 -17164 -7244 -11940 -23344
22086 -23344 -29019 -22881 -20479 -18610 -19765 -18249 -16033 -10801 -3811 -5748 -7378 3523 7820 5553
22072 5553 8901 -6117 -12569 -12493 -15304 259 11137 -1149 -13986 -21396 -10918 -7497 -6259 -341
22058 -341 -2681 -356 -3300 -1266 -82 -11889 -18916 -32664 -29249 -24265 -17357 -3398 4574 5670
22044 5670 2914 2335 -4363 -19490 -24165 -15682 -22416 -29753 -21830 -11443 -7749 -10798 -19511 -14600
22030 -14600 2603 -1824 -10210 -20832 -21819 -20101 -23213 -14165 -3547 -3599 -15217 -14675 -393 -8098
22016 -8098 -3001 -16632 -19449 -16654 -9729 -5499 -4253 -12043 -18202 -1810 1503 1453 -797 -12970
22002 -12970 -14848 1038 18653 -3968 -14092 -7511 -5954 1951 -2784 -4184 6657 6094 1024
21989 1024 1668 -12407 -19066 -12118 2372 -16758 -22620 -3867 -3032 -10545 -14569 -14464 -18073 -4560
21975 -4560 -13148 -30726 -31681 -7458 -7241 -20290 -19835 -18663 -16939 -17557 -18947 -17511 -16735 -12603 -12262
21960 -12262 -2486 -8791 -12394 -14849 -26004 -16127 -10670 -6452 -7909 -10471 -15700 -21896 -15934 -6279
21946 -6279 -5239 -2528 -11401 -9013 -2619 -8651 -9107 -5117 -11010 -18906 -18310 -9532 -13430 -20826 -1708
21931 -1708 -3795 -7217 3315 13 -816 -365 -1110 -10701 -14881 -6953 117 3772 9448 5336 -10601
21916 -10601 9345 10143 -1921 7313 9175 2830 -8320 1324 7366 -5146 -11918 78 2086
21903 2086 14564 12837 6324 -13457 -29146 -28988 -17339 -8970 -10375 2706 -53 -2757 2220 3073
21889 3073 8025 13469 4649 -12668 -16714 -12046 477 10169 17576 9064 42 8688 9422 2318
21875 2318 -2518 -3088 6559 2790 -3159 -7050 -17043 -1993 3636 -8627 -14425 -15427 -15575 -22572 -21656
21860 -21656 -18539 -28019 -32522 -32608 -25870 -13716 -8276 -13785 -13873 -15869 -27295 -22967 -28448 -36051 -30530
21845 -30530 -14772 -769 5147 9129 2528 -1927 1001 -632 -2473 -2741 -520 8699 6088 2148
21831 2148 -733 -5636 -1618 4558 12692 6021 -9035 -9739 -7175 -11248 -20530 -18267 -22089 -24903 -23954
21816 -23954 -13796 -14215 -19983 -24983 -21429 -17321 -15204 -12911 -8321 -21590 -29072 -28347 -27850 -14503
21802 -14503 6574 16778 9556 -5754 -15442 -16713 -2257 8873 8025 -8029 -21280 -14464 3780
21789 3780 8608 4416 2043 -12525 -15851 -6862 957 2187 -5724 3915 19819 18597 8816 -3097
21775 -3097 803 13184 580 -18065 -13193 -2072 -789 -16328 -16619 -20159 -34915 -28849 -21163
21762 -21163 -22197 -23487 -25478 -16378 -20919 -25110 -4882 7375 1213 6499 11252 -6629 -5937 -3795
21748 -3795 -6575 -6581 -4765 -5101 -12540 -9757 -6549 -9002 -14306 -23053 -18243 -16143 -17164 -20472 -16482 -16168
21732 -16168 -15289 -9296 -1936 -7486 -7846 1929 9151 14043 10162 7342 5800 2504 4948 7732 2542
21717 2542 11976 15784 563 -6472 -22585 -19030 -23220 -18902 -10185 3472 2491 -11035 -19935 -19148
21703 -19148 -24314 -19669 -23515 -36260 -20085 -10877 -16829 -13433 -12503 3909 4228 5706 1170 -4525
21689 -4525 -916 3886 148 -12894 -17551 -11317 -13006 -11530 -7226 -2655 -3116 -9072 -5891 5545
21675 5545 3841 5994 -1516 -5750 -16152 -17683 -16968 -15394 -14866 -13926 -5238 7820 8801 1465 1894
21660 1894 -15976 -4475 14987 8179 711 4931 13464 14387 7712 5029 13545 17510 5606 -10459
21646 -10459 -8579 -1577 5463 17913 16722 13533 17945 7066 -4550 -9418 5942 19357 26565
21633 26565 21924 11609 6206 -2307 -6589 -17823 -14448 625 12914 25218 14885 6045 -6412
21620 -6412 -20772 -8859 -8829 -13523 -3394 -6749 -9683 -13342 -12973 -8076 -12508 -6917 -3697 -5558 -9987
21605 -9987 -15362 -24132 -16919 -19885 -19265 -2221 4686 3701 -7300 -13501 -3214 -5754 -17333 -16703
21591 -16703 -12637 7163 18017 16004 10748 -2694 1729 6214 18569 14742 -1484 -13096 -14540
21578 -14540 -9226 -5300 -4019 -4480 -7154 125 27779 28601 20377 9274 12910 4869 1133 -3862
21564 -3862 -9038 -2416 -4476 -8487 -9206 -8891 -4007 -16208 -13297 -10503 -9218 963 -4912 -4029 9005
21549 9005 4796 2125 -8179 -3298 -16781 -24204 -15972 -4969 -13026 -26531 -27235 -26595 -25794 -14904
21535 -14904 -9919 -6713 -7245 -6757 -5479 -19499 -19343 -6182 1490 15631 11152 -4806 -16135 -21492
21521 -21492 -16008 -4569 -4151 -2754 -1374 -1696 -5896 -25862 -26630 -11807 -17161 -15591 14692 33849
21507 33849 24502 13645 18761 9946 9403 -938 -11887 -12724 -1528 -4755 -13693 -13851 -21756 -18583
21493 -18583 -22518 -21301 -5560 3813 5392 -1851 -9871 -11206 -13365 -9855 -5586 -6499 335 2166
21479 2166 3095 -6162 -10530 -8491 -11993 -7326 -20244 -26585 -16082 -20891 -25040 -22211 -17692 -24730
21465 -24730 -28163 -25668 -25495 -16849 -11604 1343 5666 5893 3501 5376 6924 3981 -7915 -18512
21451 -18512 -20378 -12927 -2023 -6376 -22129 -20592 -4001 -6512 -8610 -16562 -29647 -28183 -24439
21438 -24439 -7440 -7199 -10179 -6929 -2422 3219 6028 4284 9215 9161 1324 -10429 -9828 -21818 -17094
21423 -17094 -16902 -5822 -2202 -9801 -11710 -13382 -11601 -13858 -24344 -24891 -15151 -5569 2872 12684
21409 12684 14989 6244 -16688 -10045 -10638 -24280 -34109 -21144 -13367 -15231 -16626 -10738 7594 11354
21395 11354 7719 8559 -3164 -8535 2316 10664 8701 -867 -10847 2936 -1562 -13823 -6167 12785
21381 12785 17722 11646 861 14862 18254 4353 -14350 -9507 2953 2808 -2434 -167 10986
21368 10986 17184 2354 5145 1410 -2222 -6436 -20172 -18205 -31994 -34577 -26214 -22333 -28411 -10166
21354 -10166 -1020 -4919 -4016 -4722 -2881 -9914 -10500 -13299 -10939 -15757 -11259 -2779 4381 -2769 -2460
21339 -2460 4608 -5249 -14596 -18745 -15626 -7198 -12205 -13838 -8762 5384 6818 10408 -8779 -18423
21325 -18423 -4453 -10628 -13227 -21462 -20812 -16993 -24020 -12381 939 12242 19381 14778 -3137
21312 -3137 -3970 -3496 -13035 -8862 -4660 -2942 -9541 -24976 -21636 -14253 -14746 -19188 -21988 -3207 -57
21297 -57 9119 8845 -2077 -11266 -1281 -5435 -6220 5344 -8343 -17849 -9379 -4145 -7540 -3920 -5636
21282 -5636 -14432 -13060 -14496 -17433 -21954 -24455 -26598 -17501 -10011 1498 -15539 -24012 -27622 -21082
21268 -21082 -11636 -3930 6344 17801 14124 -1034 -6758 -10201 -15369 -24086 -24730 -19758 -21345 -24140
21254 -24140 -29467 -28459 -24362 -29870 -24792 -17320 -10556 -10427 -7667 -6735 -12130 -2881 -156 729 -690
21239 -690 -7021 -16025 -39122 -43604 -26221 -20978 -14922 7655 16516 17034 15238 7066 13086 24447
21225 24447 28835 15113 6865 6312 -8372 -12014 -15500 -6997 1945 967 9948 20307 8551 515
21211 515 -4558 -3966 1119 526 3574 1710 1234 -2711 -22518 -22267 -20572 -21155 -26052 -12642 -11151 -7053
21195 -7053 -5308 -3633 5208 -1154 -8351 -14318 -4301 11161 2347 -8032 -11103 -13247 -19684 -12131
21181 -12131 -7464 -2964 -14707 -6177 -6670 -8269 -7355 -113 -7681 -529 10323 10959 1170 -8840
21167 -8840 -1625 5869 -2637 -167 2219 19772 21884 17586 3639 -10956 -20387 -35066 -25523 -9705
21153 -9705 -4754 6765 2484 -10652 -13396 -18646 -23277 -21297 -17443 -964 18358 3113 -9221
21140 -9221 -17153 -5385 -12527 -18782 -12868 -19327 -7748 -1721 408 -2633 -581 5771 -100 -5185
21126 -5185 3412 14836 16013 11495 -2971 -6657 17196 26269 14202 6910 13697 11354 2478 -2721
21112 -2721 -1594 1678 2564 4085 -605 -7720 -26750 -30291 -26702 -18919 -14751 -6858 -12556 -18622 -27573
21097 -27573 -14984 5525 23888 22558 16961 10634 -4271 -20867 -3400 -370 4615 4533 -4161
21084 -4161 -13263 -6302 2232 2974 -2749 -14392 -10832 -5964 12015 21275 15389 20438 33548 34941
21070 34941 34383 35485 21705 2556 -9393 -6522 1193 946 -4506 -7706 -17029 -19117 -20837 -10742
21056 -10742 -18539 -12093 -2007 628 -1138 -14286 -20952 -14340 -6228 -6242 10366 11265 7459 8147 -39
21041 -39 1099 -936 -6511 -10121 -8407 -11082 -12305 -4494 -4760 -11537 -10314 -24629 -31963 -8017 -1872
21026 -1872 -14865 -19558 -14608 -22029 -22072 -25155 -32191 -32739 -20703 -11595 -10434 -17652 -25034 -25678 -21557
21011 -21557 -17874 -16034 -15679 -17684 -22432 -16069 -13627 -15929 -4303 11116 3068 -17485 -10408 -4525
20997 -4525 -19785 -19724 -12928 -2405 -4302 -14447 -14028 -20261 -33448 -34032 -42904 -30909 -7485 6238
20983 6238 7060 2270 -3797 -5378 -5488 -2835 204 863 6086 6323 -3882 -6163 -11897 -5045 -4043
20968 -4043 -14281 -30414 -21388 -106 6645 -1438 -3490 6520 4664 -5554 -8136 -22633 -26553
20955 -26553 -28317 -30670 -13462 -2683 -3054 -929 -7234 -18107 -15752 -10428 -7106 -22265 -17649 -6634
20941 -6634 -2702 -3366 -1295 -14435 -15564 -19870 -5336 5742 6944 2208 12319 27204 23410 10362
20927 10362 925 7668 14927 9006 -1296 -6794 1707 1217 210 -6979 -2189 8540 -225 489
20913 489 10040 394 -11156 -2605 -330 -233 -6144 5284 9553 -3656 1549 -8572 -19749 -13589
20899 -13589 -14561 -19499 -11120 3870 5985 4428 -7283 -19413 -26436 -21859 -11043 -10234 -6801 -22500
20885 -22500 -24215 -15150 -6901 -9555 -6922 -6812 -3396 14541 15965 6114 -1624 606 2490 -3712
20871 -3712 -3858 -1500 1637 1723 6140 12378 6724 -2898 -9691 -15187 -14370 -10261 -12697 -17579 -1055
20856 -1055 13864 13137 4025 1178 -6891 -24831 -28415 -19704 -26646 -27913 -21726 -16740 -12723 -15087
20842 -15087 -21521 -16767 -8325 -10470 -7125 572 -2717 -11373 -16122 -11920 -3761 5592 7202 -4920
20828 -4920 -9212 -13887 -7336 -2907 4218 7634 1233 -12952 -9351 13607 26346 18162 -5146 -9109
20814 -9109 -2394 6176 17681 21206 12613 8931 997 -4302 -101 -5340 -5377 -2216 7912 9714 6315
20799 6315 7535 7121 -1448 -10765 -7709 -9657 -25220 -23155 -15186 -17506 -21465 -26517 -20711 -11127 -19298
20784 -19298 -25417 -26295 -28430 -23480 -7229 -3284 -14892 -11725 5491 24958 29970 31251 19262
20771 19262 6338 3640 17986 24398 28634 21862 4978 -10173 -9479 -5899 -1513 -5439 -4201 -4574
20757 -4574 -7874 -6396 -13414 -7429 -13354 -10248 -10445 -9093 -21850 -12546 9450 2387 -10033 -15909
20743 -15909 -14899 -23203 -28092 -29912 -21843 -13453 -4712 4901 8097 10443 9345 8126 -3888 -6622
20729 -6622 -4719 1010 -5625 -9182 11805 -3493 -18267 -14143 -8485 -4187 1230 1166 1026 4469 -1124
20714 -1124 -3771 3354 1797 -6178 -4232 -7986 -11061 -19889 -17649 -9490 -11663 -16542 -21715 -20527 -17152
20699 -17152 -9954 1680 -7059 -11254 -13537 -8757 -15452 -17014 -5218 -10070 -10791 -16774 -16144 -6435
20685 -6435 -15824 -19523 2617 18752 19828 6988 -561 4522 -5453 -18013 -32689 -38191 -34588
20672 -34588 -32624 -35972 -22701 -13662 -13188 -8057 -9991 -1651 -7133 -12883 -17827 -40117 -41588 -26175
20658 -26175 -16760 -13783 -9321 -3139 -14151 -35731 -33694 -25471 -12478 -3916 7655 14062 3742
20645 3742 -11547 -8104 -5845 7985 9677 -4280 -13945 -17604 -22346 -17127 -8449 -5309 -3131 -15253
20631 -15253 -21318 -17904 4115 6920 -749 -4831 4358 7475 4451 5317 3185 -5573 -3115 -3320 2665
20616 2665 15497 15330 3916 2199 2556 -8042 -18086 -18966 -16714 -16384 -15356 -6982 -778 -809 -10330
20601 -10330 -15264 -10710 -10047 -7345 -7724 -5094 -8557 -7930 -7929 -10349 -3175 -3504 -5741 -8772 -4101 -5337
20585 -5337 -1344 -9400 -15725 -23589 -20785 -13120 -16408 -7562 -1070 3725 6951 -6515 -1613 8617
20571 8617 -2873 -2964 5620 7916 10019 8624 6737 9253 9202 17559 16243 15185 22379 17870 6033
20556 6033 6006 1421 -1151 -7713 -5326 5980 14220 12965 20369 22059 1058 -9045 -10092 -7511
20542 -7511 -11561 -16289 -7461 -10769 -16757 -10631 943 13193 12609 -964 865 -17712 -23768 -29443
20528 -29443 -10916 9744 31596 28822 17680 -914 -10198 -6756 -13969 -11900 -6812 -2984 -3949
20515 -3949 -6281 -11015 -15000 -20079 -12297 -10489 -30252 -34398 -27539 -23777 -28973 -14326 -4539 -14713
20501 -14713 -23097 -22533 -19053 -17241 -15286 -4293 2219 5401 12305 -1576 1391 15208 21058 17319
20487 17319 18776 18551 13725 8009 2637 3849 969 922 4664 14389 22693 14485 7550 -5644 -16095
20472 -16095 -29434 -32141 -15806 -7570 -14333 -6960 -4407 -4582 -10088 -22751 -28489 -17994 -8140 1794
20458 1794 4538 -8803 -7605 2061 2272 -15452 -18743 -13573 -2432 -4686 4055 14759 9827 -1409
20444 -1409 -27460 -25635 -14159 -15901 -29568 -15199 -2050 -8488 -297 4506 -7645 -10476 -10963
20431 -10963 -8566 -16156 -17232 -5619 920 1425 3363 10898 4582 -793 -2325 -4600 -8623 -1066
20417 -1066 10856 10477 4111 4596 1753 6116 -378 10727 16797 9937 9665 6231 5636 6953 -1470
20402 -1470 -4218 -12376 -10798 -3732 -6456 -7508 582 6829 12028 11353 16937 16558 -3059 -9050 5347
20387 5347 14232 -5021 -11278 -16566 -15673 -6929 5142 14463 9779 -4976 -10307 -6828 -3841 5029
20373 5029 9220 7581 3939 17594 25041 26127 21987 5495 -3268 -1978 -630 7544 841 -9666
20359 -9666 -21430 -23874 -17666 -4493 -6870 -586 16488 5628 -6083 -5600 8789 8684 123 4922
20345 4922 -39 4812 1613 -7457 -23850 -21104 -11215 -16699 -6553 -7339 -13793 -227 4226 4725
20331 4725 6604 -968 3262 5504 -4475 -11793 -9969 -13717 -12442 3774 2594 1286 -6392 -10298
20317 -10298 -7065 -15214 -29399 -26825 -12261 -18169 -16193 -13104 234 9856 6362 -642 -7859 -18600
20303 -18600 -28909 -28756 -18316 -10075 -2132 -18852 -25664 -19090 -11546 3762 8598 -1230 -6526 -1099
20289 -1099 7950 769 -14979 -10297 2074 20142 23028 18380 16896 2743 -11658 -8227 -13434
20276 -13434 -17732 -14684 -1563 11122 14022 -2133 -18417 -17781 -14930 -1323 6648 13639 20482
20263 20482 10002 24608 25562 18147 20438 14235 2239 -4513 414 3305 11358 16196 18030 6310
20249 6310 -1160 -9758 -14936 -2108 10869 9268 5962 3146 1357 -521 -6440 -7751 -15262 -14076
20235 -14076 -12152 -7102 7957 8115 -2788 -916 4583 8775 3528 -2332 1659 5460 -4403 -7462
20221 -7462 -11971 1847 14701 12350 21149 16935 4971 2741 -1140 -4092 -2802 5054 15340 12685
20207 12685 7697 7217 9282 28022 20741 978 -2747 3119 -87 825 -5045 -3067 6891 16565
20193 16565 13575 5727 -5574 -6951 -7034 -13775 -9913 -9308 -6455 -11375 -15380 -5890 485 139 13653
20178 13653 8951 4502 -2743 1421 -6623 -13648 -11598 202 4442 -10773 -21784 -9096 -12040
20165 -12040 -2824 -10459 -9802 6018 11277 3821 -2485 -858 20066 22725 19723 13097 10563 7637
20151 7637 2347 5089 -2434 -10481 -8817 -3066 -3221 -2618 -6979 -16561 -19108 -34023 -31097 -23084 -15108
20136 -15108 -10167 -6348 -19777 -18105 -9728 -2384 2398 -255 -310 2211 -1523 -5224 -4169 -1241 -4559
20121 -4559 -4389 -2461 15235 6711 13568 5114 -11130 -7247 -13942 -16142 -5589 5243 1574 -429
20107 -429 7960 12538 15825 -4087 -7235 -450 -24 -11195 -10091 -11376 -4138 3220 13804 11206
20093 11206 13132 12085 6422 7777 5591 15265 23380 25202 19879 5920 1170 -2061 3170 -6991
20079 -6991 -3318 14809 13981 4185 -6780 -5134 2608 -648 -9656 -7499 11269 23046 23220 13796
20065 13796 9975 -2653 1170 12567 2542 9679 442 4063 -100 -6003 -4641 -12947 -5927 1220
20051 1220 17897 22964 25913 16367 9158 19109 8189 -8186 -3721 11150 7264 11645 20959 19781
20037 19781 21228 27995 17513 15911 6924 1701 -2342 82 1472 2170 9020 11523 6963 1456
20023 1456 -14249 -13802 -18631 -7131 -6583 4824 2148 2163 7228 8613 4739 457 -1144 -6531 -1774
20008 -1774 1361 6945 5011 6152 10661 16699 2106 -4740 -14831 -8072 -3075 -4735 -16908 -28659
19994 -28659 -20130 -10884 -7188 -3509 -14402 -12930 7766 9495 4798 -5908 -455 -10160 -18781 -8088
19980 -8088 -9554 -1972 3018 -4443 -3786 3886 6833 6552 -1706 -6994 -15965 -25633 -19474 -8940 2474
19965 2474 5508 -3071 -11480 -7697 -5410 -8551 -13020 -5475 -3192 -4961 -4168 -7694 -12089 -17585 -9830
19950 -9830 -5078 4065 8452 4858 2072 -4481 -4983 -3478 -16462 -15404 -20756 -11983 -2299 4247 -368
19935 -368 4875 4322 5566 9579 2678 9757 15981 11812 7181 3795 -2921 -2207 3123 609 7182
19920 7182 -2534 1555 15073 8754 8558 12942 -4703 7770 17196 17017 5476 3795 -3065 -3512
19906 -3512 8018 16001 10923 4831 11751 10232 21074 25554 15788 16164 15093 11405 11321 9770 2847
19891 2847 11941 14045 -2323 -14811 -6608 -4888 8132 437 -7090 -8780 -11212 -4517 -11910 -20280
19877 -20280 -16436 -1929 5568 2331 -11848 -12002 -17237 -13666 -4638 5029 13751 23522 16588 13270
19863 13270 14239 21091 2582 -8272 2486 17493 11704 12652 3978 -3118 -97 6406 -5651 -18425
19849 -18425 -10823 5604 7143 15507 5212 3331 4421 -10669 -7304 -4931 5198 12264 14889
19836 14889 6799 1854 3814 12784 15351 8400 -3322 -761 -1074 -3989 -8974 -886 -7057 5262
19822 5262 9370 17052 22445 9480 -6549 -3644 7708 -319 -8841 -6348 2085 1012 -1950 1707
19808 1707 -5835 -10055 -4250 1921 5254 17402 20385 6332 -2171 1612 -5432 -1646 -8301 -14059
19794 -14059 -13910 -16871 -22830 -26231 -16328 -16642 -16262 -13015 -14974 -2465 6688 745 124 8653 9868
19779 9868 8524 19937 25490 28678 24814 20395 5365 -538 -4466 1856 -10073 -24360 -20962 -12731
19765 -12731 -3721 -8399 -13614 -13533 -23703 -22046 -16563 291 2135 936 -13276 -13454 -910 -3381
19751 -3381 3706 5254 10065 13213 13641 12335 7046 10137 16305 6352 -5562 -16238 -16148 -10026 -3843
19736 -3843 2542 -6148 4595 8613 -11608 -9798 3119 4919 11474 8298 11786 -785 -10305 550
19722 550 6288 1776 4353 8435 -2594 -2243 -584 -5042 -8129 -1882 -8628 -5592 2077 11396 19563
19707 19563 17397 22591 27626 11599 6096 14937 19468 14629 8952 813 7718 22963 18834 10804
19693 10804 8659 22326 29826 38021 41182 29187 12044 -1037 -6991 -7990 -420 7045 -969 -10109
19679 -10109 8990 6983 -1062 -204 -1420 -3181 8974 702 -2297 4679 -136 -3260 2270 2698
19665 2698 10054 17723 16844 11362 6293 -9327 -18624 -5476 -1040 -19187 -22472 -13768 1778 19030
19651 19030 15261 -5091 2161 6618 5618 5932 12990 5720 -6347 -15727 -21951 -14903 -21506 -12788
19637 -12788 -4781 5157 1375 -820 -2392 -7377 11602 27414 20921 3335 -4365 -11447 -15665 -18678
19623 -18678 -15539 -17333 -20622 -19802 -15124 -8202 15780 27889 23767 14049 7768 10503 12877 5442
19609 5442 3862 12403 10921 10340 10509 9496 14003 534 -6542 -8073 -1758 6701 12810 9542 9786
19594 9786 20686 27288 17173 5759 892 2219 2473 16550 14061 5595 -2604 8674 16113 8517
19580 8517 8274 15970 15354 30285 34724 35467 27874 26350 19815 22104 25836 30584 25991 9002 -12867
19565 -12867 -16704 -7852 8688 13798 24151 26270 24327 23452 18321 9018 6180 8939 7855 -35
19551 -35 9208 12088 5385 8732 17232 17030 1220 -11299 1293 8060 6978 7555 -3799 -8920 -13332
19536 -13332 -12259 -14434 -6889 16038 29985 22908 19060 17008 16633 12361 12949 8773 8130 9989 9964
19521 9964 20236 15969 16810 12354 10244 8049 11231 8096 4538 8969 13275 10767 8053 8765 -4193
19506 -4193 -3789 12721 29281 24188 6902 -8254 -3121 15831 28401 35492 18023 13443 12540
19493 12540 19164 12887 4503 1555 6837 12960 13458 13310 17906 20292 18007 22587 28120 24897 5345
19478 5345 -8131 -12180 -3468 13544 14903 12788 19355 26964 26039 20602 24668 33280 32651 24556 20873
19463 20873 7805 1783 -5982 -6556 1889 20181 27299 12341 2065 13236 13501 18739 21729 19953
19449 19953 8157 6570 19542 26892 20209 13323 9671 16278 17798 14909 16329 10989 -8326 -7496
19435 -7496 6676 23902 13283 3147 1554 -6505 7402 15947 4943 3845 2523 5332 7703
19422 7703 9830 33600 39175 45575 33231 36480 24373 26887 35152 36807 21873 19394 8306
19409 8306 9924 37272 35703 15493 9367 16405 28782 24969 27648 24839 24659 30878 17422 9534
19395 9534 -2377 -9171 -2335 -4658 2184 5472 17567 17268 -4280 2431 23751 42230 34394 29296
19381 29296 27169 20593 23009 14290 9817 3044 6369 10326 6697 5891 152 -1004 -1572 17715 26618
19366 26618 20551 7943 6144 8501 13626 588 5535 11401 6356 17613 23160 17708 20750 22554
19352 22554 28859 26932 23381 24740 26963 23826 26296 11649 9452 738 22995 23731 16090 22325
19338 22325 27501 50872 47447 57955 92289 119557 119493 120144 120706 100053 71057 70954 85732 106628
19324 106628 127471 147979 162767 183307 204349 195335 174857 149671 123471 89135 76068 81411
19312 81411 81341 99004 136032 156567 147382 132781 121676 103208 66090 48318 52691 38884 20313
19299 20313 15154 16465 22352 18143 23386 28296 23056 16795 17652 30670 33335 44141 52196 52692
19285 52692 53447 61422 73806 73343 81429 92277 94634 89317 82939 68308 56809 45840 51074 54083
19271 54083 60533 65523 82171 86893 95074 97069 85464 83709 93673 66548 30102 29889 42679
19258 42679 55300 54968 57985 57697 60705 62789 57340 41436 39605 42769 34907 40695 31809 25118
19244 25118 30870 32090 33350 34763 40572 32448 28340 32327 13718 21925 31658 24159 22130 24792
19230 24792 22863 18122 33416 36517 20100 25839 30739 29526 17461 8669 7691 12878 30281 53503
19216 53503 70683 66350 75898 72251 60854 64960 71270 83685 122094 158711 160626 147073 135604
19203 135604 114456 91291 78495 82750 83272 81664 84399 72999 48666 35874 48004 57552 54491
19190 54491 45090 40602 35817 27632 31423 39367 40126 35310 26097 27954 21688 11218 13964 12423
19176 12423 16657 32478 39973 38428 16834 18510 32255 47175 51011 62311 88302 110459 111527
19163 111527 100886 93384 85688 102542 135719 166453 172962 154301 154148 119433 90502 87247 82701
19150 82701 84538 110285 123653 118777 89884 53535 38719 31321 30107 28031 20176 14604 25568
19137 25568 37234 41638 40179 64199 84282 86703 82104 75516 71843 85884 83279 82007 93217
19124 93217 86048 74928 62734 43691 45237 47001 49050 61968 85239 85368 70963 54472 51360
19111 51360 42846 34039 29955 19114 23788 24519 21565 31386 39599 42877 50021 57681 61715 63822
19097 63822 58729 44918 35883 41403 40649 38655 42355 40227 36041 30819 33114 36312 54932 71438
19083 71438 65397 58182 67169 79360 83761 87233 107738 108320 85215 63903 48308 51143 46258
19070 46258 47607 69636 71043 78389 73531 59955 51649 49707 50813 48119 37061 30276 22759 35682
19056 35682 39197 38790 36766 37066 30729 16139 24324 23869 21315 21217 27674 22480 31380 41541 39707
19041 39707 66953 81540 76910 76389 62500 63593 71735 61963 70212 94086 107326 112106 106312
19028 106312 118664 137150 140910 126000 100629 109628 96650 91110 94432 91386 104720 108589 107696
19015 107696 99862 92366 85408 67212 46083 37681 49891 55260 48419 43829 63327 71265 60733
19002 60733 52473 48933 57333 55246 50380 52008 59923 60762 73455 68346 64565 58239 61897 53697
18988 53697 46159 41823 42263 49977 47931 34040 27914 25344 27416 26496 19157 14313 18382 17873 24484
18973 24484 26752 28231 35192 39138 42810 47022 55592 51177 37803 37946 46745 46392 39765 33464 35729
18958 35729 36302 42446 43654 38064 35950 32362 38377 43852 35152 26038 31929 30065 34245 50347
18944 50347 58807 52653 42053 38948 48150 55599 55795 38681 29909 29733 42061 35854 33456 41431
18930 41431 48211 48386 54851 51262 58144 50770 53763 44288 35895 32405 39333 41733 41592 42553 56032
18915 56032 86899 98328 86296 73041 79138 70366 68737 82690 112484 124743 118720 94985
18903 94985 86821 76108 70304 77460 94428 101119 93538 78282 70147 80684 69804 56840 48938
18890 48938 56512 58857 72201 76635 61750 56630 54050 45803 47333 55235 52489 46112 40904 55622
18876 55622 76899 79946 73595 71399 59065 56935 59027 69248 96696 111930 115379 112654 105675
18863 105675 98725 82041 81494 98502 134658 147044 141509 133418 116216 111667 103705 110266 110240 123114
18849 123114 136244 116160 87240 69181 58754 39400 46600 70850 79572 71306 77414 85035
18837 85035 80289 62667 48623 50787 57798 57518 37524 34355 47342 52684 43697 47695 63967
18824 63967 57332 36210 39104 48459 57040 51603 43106 39456 50795 64728 65201 69093 64989 63822
18810 63822 49675 45003 33469 39547 46633 52192 62715 66069 74139 78995 89001 90162 88762
18797 88762 100028 99198 80892 72119 79263 79696 71687 66501 68446 72378 78689 73316 67270 77271
18783 77271 90505 80203 74795 84833 93408 89184 98168 103827 101918 102821 90944 88166 90228 99272
18769 99272 121618 148755 194371 242640 231223 170252 134525 120124 112825 110025 111749 100503
18757 100503 89850 97365 113700 143905 135654 130876 146248 185398 238431 275627 274624 309653
18745 309653 375384 450580 497408 492896 521385 591927 679441 711351 692038 687195 719982 787774
18733 787774 820543 825069 832146 846336 862856 901608 958861 944680 856711 754930 709842 700181
18721 700181 647235 556400 488129 472995 459443 403120 346931 301269 292647 258640 217335 182132
18709 182132 169165 170999 151767 144539 150633 152258 149314 139644 123499 119895 119578 122215 127160 139424
18695 139424 129588 120117 115780 112575 115528 110738 139529 163720 182246 194688 195707 181633 182394
18682 182394 218488 292056 368883 454612 536394 582025 588946 544400 470709 404005 330002 265890
18670 265890 228390 203097 192561 182315 174555 174599 171169 158923 160906 157092 148906 153687 156950
18657 156950 156589 168051 179084 208147 240672 280025 312695 344133 362633 375155 365687 347176
18645 347176 346515 354792 357765 385727 445261 509224 560266 593971 610055 652295 700657 706198
18633 706198 720112 796594 922923 1094653 1275581 1435537 1526637 1495550 1354550 1167039
18623 1167039 975046 811704 673150 558929 467204 412679 369799 347809 344476 344851 331374
18612 331374 305011 296247 302927 312611 322806 330728 344963 382116 416829 436296 456337 496131
18600 496131 524404 489328 471383 483272 498126 517138 549779 600747 646931 708243 727136
18589 727136 706953 718011 766527 781837 767568 789696 856727 937350 1067921 1216194 1346887
18578 1346887 1412648 1436316 1408237 1336026 1225599 1090287 987034 927613 902295 875085 821173
18567 821173 755551 703271 675107 678265 693808 689542 641383 617620 608202 613330 599749 545762
18555 545762 495971 466002 449334 413981 333959 283793 263264 263578 266339 267764 290462 333053
18543 333053 394322 419533 391315 384623 420506 445337 448696 456737 473610 470747 456143 434843
18531 434843 427840 457252 492733 515996 489816 441375 426593 429741 443402 440597 431300 411877
18519 411877 396426 395888 411025 405220 411538 446460 529765 629454 710325 722150 665772 641858
18507 641858 659877 690067 720543 725301 714067 673037 618807 572374 561256 557345 562909 549301
18495 549301 488051 440716 423409 416590 424320 433073 435865 449623 467720 462524 471095 508006 541440
18482 541440 531810 489317 485652 497515 515356 514790 490201 491441 527097 567411 564697 503420 455081
18469 455081 438966 424063 386216 341284 316356 316685 317029 317925 322845 336358 340034 352652 352122
18456 352122 354380 368720 384074 392982 410825 426709 415701 395257 372465 351389 331747 317957
18444 317957 305245 293740 293869 309000 315651 311807 299931 293373 286385 283566 284416 302662 321723
18431 321723 303718 306270 314140 299699 290316 277240 282738 288783 276195 269095 284553 291063 281407
18418 281407 287151 306708 312001 317164 334778 354277 359856 345378 319733 290069 293798 308944
18406 308944 321060 327120 342320 329310 336549 360426 381237 401249 401731 396929 404904 404780 434768
18393 434768 462095 473962 476519 466081 456456 439357 445721 459348 452442 455078 477866 482457 507516
18380 507516 547485 558062 552652 547224 549376 574661 607105 633093 667582 713476 729646 731536
18368 731536 747837 769743 798965 804571 781677 767294 782145 831300 884888 932986 972621 992385
18356 992385 991373 973438 952954 968821 963135 898755 817484 738096 680437 633400 614824 605666
18344 605666 600267 587382 578506 586525 592109 629372 687401 724821 735596 748225 755745 765326 736398
18331 736398 679022 647367 647720 674626 698352 711324 696136 692199 700259 685781 655173 618555
18319 618555 591164 586727 597082 601522 613753 640625 647173 665216 679849 696361 716941 765120
18307 765120 809227 864891 914531 932922 928173 911286 892985 860787 827573 799115 815422 823647
18295 823647 803184 796338 827339 853318 856873 865923 880077 866770 866759 859436 864013 904463 948199
18282 948199 992052 1037612 1088271 1144125 1188118 1199709 1214157 1216404 1228187 1238675 1268138 1341891
18270 1341891 1430253 1539038 1660911 1743379 1819879 1912861 1992324 2035745 2068296 2090293 2100848
18259 2100848 2164900 2268005 2403436 2548494 2680878 2853326 3132889 3511664 3981937 4440888
18249 4440888 4752054 4888070 5022247 5323492 5829232 6436962 7082623 7777740 8645038
18240 8645038 9758926 11111617 12951552 15898077 20619459 27320815 33630518 37490179
18232 37490179 42630109 53796421 67828488 73002026 69914754 72688521 85750792 97092105
18224 97092105 96380399 93239148 97862664 106554095 113494829 120340899 133120190 146410562
18216 146410562 149974042 147811768 151726006 162587488 162289779 147728889 133910784 125900327
18208 125900327 118393318 105825098 92545940 83956047 81553011 79890192 69548815
18201 69548815 55804262 48369731 45356921 39792355 30741716 23056040 18228015 15162829
18193 15162829 13084288 11617796 10573685 9796259 9198088 8836478 8780797 9179682 10257921
18184 10257921 12305161 14833898 16239509 16273436 17098137 19662387 21422557 19411024
18176 19411024 14663166 10458517 7938510 6592171 5821802 5339089 5011919 4831830 4746459
18167 4746459 4727913 4832327 5035300 5157122 5116499 5038739 5142502 5478562 5847160 5872548
18157 5872548 5635554 5471619 5480913 5639293 5909518 6268255 6602858 6777422 6948104 7404982
18147 7404982 8264569 9117127 9465248 9684180 10509032 12249510 15162347 19624749 24641293
18138 24641293 28510913 33484383 44100969 63059019 87484370 103374183 99562979
18131 99562979 87955688 86981556 94300305 92033978 73667515 52245162 38531701 31994653
18123 31994653 29586874 29747063 32328227 38112505 48237997 61905623 74625711 85659338
18115 85659338 92431786 88157259 78602105 68883648 58680968 53324215 56328231 68150529
18107 68150529 81835902 87643399 89481697 95800952 106272639 113778573 121596572 140993651
18099 140993651 178744424 243482353 315603294 347407536 331262055 286786594 232398092
18092 232398092 197845039 201956015 236888723 253644854 231298780 210049180 201324039
18085 201324039 184561055 152814270 113644675 80071011 58180643 45275759 37633436
18078 37633436 32826438 29437461 26588387 23935918 21694455 20260497 19907428 20754204
18070 20754204 23046417 26909137 30853074 34254060 37322686 37687245 36053874 35318179
18062 35318179 35039878 35131411 36268194 36901080 36942454 38761206 42175026 44945952 45961175
18053 45961175 42780385 35499782 29122418 24249443 19245694 15314004 13049699 11788548
18045 11788548 10995007 10493104 10190456 10129532 10380288 10942271 11816693 13223322 15635983
18036 15635983 19591133 25828114 35331057 46506613 53184650 56135383 64247742 77568466
18028 77568466 81163380 71667064 65030545 67964186 72950537 73104281 68293768 64241785
18020 64241785 67681469 75179161 74571970 64494343 56361583 54846894 53373199 48449875
18012 48449875 45854081 48512010 53259968 58829473 62506814 60864458 58580965 58483635
18004 58483635 57745473 56821095 58718069 60168117 56700632 53301801 51191887 44692857
17996 44692857 36285964 32083174 33338989 38535183 40299411 34451358 27901270 25780958
17988 25780958 27582119 30632881 31611439 30490763 27820539 24969744 25050882 29196380
17980 29196380 35582659 37222734 33384262 31872546 34498904 37567358 38602214 38655273
17972 38655273 38241681 34919849 30373578 28812921 29701501 29969293 28575355 26434312
17964 26434312 26005641 28890643 30658061 27041658 22102478 20051912 18590486 15071267
17956 15071267 10969694 8194931 6526443 5484898 4838846 4386978 4052221 3876614 3840495
17947 3840495 3818243 3645365 3376156 3211478 3235549 3455113 3644526 3397930 2912367 2601746
17937 2601746 2467218 2469571 2581489 2639243 2511125 2220512 1921244 1744385 1698168 1800818
17927 1800818 2020396 2129502 1907454 1572778 1364652 1283547 1289666 1351455 1353960 1232783
17917 1232783 1044125 902371 836056 789025 721046 674094 634792 598765 576742 565927 552043
17906 552043 542949 536562 522048 516984 520948 531813 525798 515541 514254 506629 482223 472018 475006
17893 475006 474148 460387 440665 425534 430354 428001 413777 406216 402909 412633 413251 386437 376565
17880 376565 371107 370131 387907 399912 373615 350479 342607 327107 334048 343895 356620 349139 329817
17867 329817 305426 296706 287661 270895 276664 277193 267660 251107 250105 255459 255399 246377 254080 246017
17853 246017 235786 225516 233081 230925 221940 210535 220281 242219 248000 243243 247985 250929 257393
17840 257393 255341 234126 223951 210293 204666 201667 203800 200299 188894 184047 179848 181331 179103
17827 179103 175792 164019 160841 159626 167027 184251 185538 181342 182621 191662 191391 183316 180352 184536
17813 184536 183070 185165 186261 178506 172614 167736 168604 168980 164086 156995 160477 159075 155935 143966
17799 143966 135414 138727 139150 129463 112352 89692 83409 83439 91884 96845 80972 62815 53283 66662
17785 66662 69710 77999 89727 96780 89627 85614 91647 93881 95141 122525 125640 118620 120158 123058
17771 123058 117860 115051 111507 108287 112765 123687 132216 128618 121047 116450 110063 113737 114740 105862
17757 105862 94897 81036 91377 84999 61715 49273 60490 62533 56881 46328 51946 50075
17745 50075 47033 44311 62365 71132 61435 50668 50175 46892 58474 76735 84969 77409 67056
17732 67056 63266 61844 75815 79297 66101 66715 62098 54894 59851 59642 70832 95057 97000 93273
17718 93273 92671 107204 141791 187447 226301 262795 287249 331852 419423 506945 527074 520535
17706 520535 546579 609020 644479 630507 610150 632285 661035 702388 759857 815748 838401
17695 838401 851677 877837 905824 882527 779808 694066 658604 651982 627691 567766 489217
17684 489217 455691 452096 443724 401761 334296 287818 262294 244230 212628 178132 152954 118205
17672 118205 96272 82013 79206 93947 83735 78868 83249 78802 67363 70544 82295 98747
17660 98747 102202 109077 115447 114207 129484 163843 213060 308312 427195 550784 637481 685579
17648 685579 675962 614713 517978 404055 302607 225885 174668 132270 111900 90723 75008
17637 75008 61939 62964 70615 63931 51088 45012 56763 64542 44967 41575 25677 25521 41757
17624 41757 48709 51687 51353 51848 40632 35023 50057 69663 82774 86003 86701 84540 81356 94426
17610 94426 115814 131835 144138 188435 245670 332176 455327 628704 840645 1056986 1223925
17599 1223925 1304803 1289656 1196223 1037383 829740 661519 558531 499632 459218 443251
17589 443251 465207 497437 498727 487792 489006 479680 472334 444991 389983 374023 361817 361957 366380
17576 366380 381323 391235 370042 321977 285114 247039 199617 164494 152384 133209 120747 118357
17564 118357 115279 105160 108438 120776 117394 112794 118650 140198 159149 193073 259066 357309
17552 357309 471309 575882 632735 645503 626844 585464 504983 433727 394498 373303 348479
17541 348479 333415 345166 387074 417823 419840 420339 419129 418924 404117 374771 359144 377542 412813
17528 412813 443143 455698 475624 518780 542623 501702 440346 380642 359661 350104 328994 309834
17516 309834 312592 338060 386918 427484 433383 423301 443861 467973 439309 378512 358450 342453
17504 342453 328975 307629 297676 307522 307036 262814 219009 204477 191333 152087 128684 122137
17492 122137 125440 123327 132786 163787 174867 159958 151506 176171 225411 250593 239461 194328
17480 194328 191136 212020 238030 246709 237283 223498 237679 289017 341265 384361 385088 377185 366723
17467 366723 361697 338855 303709 276795 258807 242280 233870 233092 239970 251484 229216 176115
17455 176115 153826 153346 155388 115455 77495 47693 31147 32895 24355 19342 35542 49716 64824
17442 64824 93716 144120 178838 143829 86413 62912 43275 15892 5198 5065 1845 -7963
17430 -7963 124 -785 -2649 -5030 -6073 -9611 -16553 -19343 -4284 5530 15887 19202 5369 496
17416 496 6966 18179 18494 11615 26231 22073 9426 -4454 -4365 6218 13020 21626 14131 5542
17402 5542 -5246 -8789 -20871 -14805 -12299 -14050 -27583 -23787 430 10107 12431 11136 16425 37665
17388 37665 37866 14545 7843 -5297 -13912 -3575 7124 1921 -11382 -2971 10708 14042 -3581
17375 -3581 -19055 -9009 -15475 -17636 -4929 -9848 -6371 -5690 -8036 -12923 -24804 -17736 -118 7793
17361 7793 9686 1989 1859 -7508 -7113 -7877 -971 -3251 -17015 -5891 -10555 -11491 -10595 -5431 -19481
17346 -19481 -30906 -34827 -26465 -26556 -38268 -36566 -26018 -644 -4025 -19483 -19839 -3664 4238 7427
17332 7427 -450 919 -825 -4175 -1060 -21866 -34856 -30058 -31587 -33917 -28073 -16746 -22308 -23477
17318 -23477 -24930 -11198 1094 -15383 -24794 -32159 -34218 -26048 -14568 -24382 -23276 -21616 -13841
17305 -13841 -3032 -3386 668 -5034 -7606 -11577 -2627 5754 -8446 -16548 -27636 -29651 -26779 -13540
17291 -13540 -11265 -11152 -10338 -12613 -27600 -26594 -25381 -17478 -13535 -13719 -19116 -10916 -8873 -1895 242
17276 242 7352 6994 7026 13160 5244 717 2716 1286 -7902 -575 2399 2688 2600 4923 3311 4713
17260 4713 2628 -428 -1275 -3817 -11156 -8553 -5586 -5953 -11495 -10489 -16634 -29951 -28514 -10007 -12275
17245 -12275 -24031 -23752 -21490 -32219 -32053 -25294 -26219 -16655 -15511 -10654 -15615 -6294 -2280 3836 -6664
17230 -6664 -13215 -22664 -20983 -15660 -9765 2039 12452 12325 -2286 -3697 -2189 -10010 -11349 -10749
17216 -10749 -22663 -23408 -21505 -22419 -13185 -28423 -45826 -51848 -55254 -50915 -41566 -31029 -31218 -30083
17202 -30083 -28143 -19960 -17207 -27355 -28498 -15512 -9952 -13821 -18494 -18589 -20076 -22021 -27626 -22076
17188 -22076 -29000 -25169 -18548 -24460 -31507 -22965 -16868 -6142 -2489 -9887 -31050 -37969 -32370 -29459
17174 -29459 -23469 -4649 -12580 -25402 -22863 -17765 -12194 -6116 -13648 -15766 -18562 -7023 -7614 -5291
17160 -5291 -11643 1328 913 -10164 -8685 10751 21551 8771 14846 24899 45712 86229 128886
17147 128886 181241 226405 238216 217446 190405 146698 90221 50932 36330 19402 14264 6639
17135 6639 2606 1460 8466 4998 1343 1603 -124 -1735 -6462 -18281 -10348 -10079 177 10265
17121 10265 -13052 -35613 -30520 -29253 -19797 -16119 -12998 -6878 -9052 9146 13657 6052 -4290
17108 -4290 -14533 -23191 -21125 -25129 -36197 -26651 -27040 -33292 -32237 -18253 -15872 -17267 -11459 -3599
17094 -3599 -4615 256 6165 9299 8754 7158 -6404 -20968 -24669 -14538 -22546 -25391 -23147 -10636
17080 -10636 -2781 -21558 -21772 -14241 -16165 -13790 2620 -9763 -10085 -5673 1714 2756 -13241 -13847
17066 -13847 392 -1650 5104 3275 -6193 -16325 -17432 -4287 -9325 -13748 -21371 -31083 -35612 -23592
17052 -23592 -21864 -21652 -20786 -26180 -16354 -7033 -4013 -4725 -9452 -15251 -10550 -5156 -3780 -12091 -13848
17037 -13848 -24181 -33139 -41003 -56413 -44449 -24870 -749 -2251 -4138 -8117 -17796 -18263 -11860
17024 -11860 -8902 -10964 -18333 -22105 -9892 -14594 -21664 -27469 -26687 -20336 -21360 -33146 -30105 -20666
17010 -20666 -14887 -19142 -30103 -26051 -18516 -15101 -35872 -36532 -31791 -18098 -1094 -6667 -7713 806
16996 806 -7976 -18594 -10093 -5560 -8812 -16921 -16486 -10432 -4499 -8651 -18523 -13726 -1639 -18843
16982 -18843 -31621 -28140 -11478 -3244 -6674 -7777 -8928 -4717 -4471 -15418 -18848 -23113 -31064 -34267
16968 -34267 -31005 -37490 -31659 -26973 -24386 -19143 -7677 -7601 -24029 -17433 -16398 -18217 -23062 -38314
16954 -38314 -50820 -40891 -32739 -16695 -4449 -9740 -14664 -12365 -12456 -7421 -7028 -9632 -15655 -23606
16940 -23606 -32465 -27346 -24838 -27509 -15645 -12111 -14332 -15706 -19310 -10318 -5290 -6455 -20231 -28310
16926 -28310 -22231 -16478 -16493 -24944 -17623 -5342 -8744 -25194 -31769 -28753 -18552 -9709 -2083 -7531
16912 -7531 -19597 -20731 -5408 2675 2575 -7037 -24690 -29458 -18224 -15885 -15291 -16160 -25399 -30448
16898 -30448 -17783 -14211 -6765 -1804 -10862 -21502 -13828 -12552 -14729 -9724 -13604 -19612 -12297 -28190
16884 -28190 -41168 -32116 -28308 -20013 -4360 -6874 -6537 -2739 4340 -7253 -4522 -504 -12750 -24437
16870 -24437 -18341 -25841 -19454 -28042 -21912 -13068 -5836 -10478 -18249 -18306 -19827 -17694 -12016 -1722 -4357
16855 -4357 -9935 -21424 -22291 -10241 -1884 9321 -1017 -2000 -4544 -9456 -10863 -9906 -12245 -11299 -7418
16840 -7418 -21658 -26530 -12644 -469 427 -280 -4025 -13485 -20937 -36332 -42397 -34886 -25825 -42504
16826 -42504 -50997 -42383 -22142 -7049 -5658 -15924 -17030 -24469 -33690 -36299 -35762 -35554 -28297 -22422
16812 -22422 -27500 -25020 -15679 -6534 1897 4461 1398 -6513 -5158 -10957 -20414 -19938 -19078 -21511 -35850
16797 -35850 -34921 -28169 -20434 -13251 -13309 -8020 -4042 -10688 -6230 -9283 -16755 -22275 -28266 -23674 -10708
16782 -10708 -9812 -19425 -34763 -49594 -40828 -29901 -18853 -9526 -14311 -17294 -18657 -15544 -14560 -3713
16768 -3713 4940 -916 -6988 -3973 -3002 353 2373 1869 -6939 -18621 -23353 -31439 -34399 -28618 -16142
16753 -16142 -6157 11906 17987 4490 11431 11482 -1137 -626 -839 1073 -6275 -18311 -14031 -3096
16739 -3096 -4938 -73 1339 672 -3654 7023 3186 -16251 -14530 -16035 -6019 6719 7914 931
16725 931 -10639 -7347 -11733 -19738 -2145 8573 4343 -5494 -16131 5400 16724 -3130 -18033
16712 -18033 -25972 -21678 -19643 -17061 -21637 -14332 -2826 683 -17211 -32413 -23745 -31962 -26871 -18977
16698 -18977 -14931 -7221 -15887 -19991 -17710 -20807 -19296 -18566 -14536 -10576 -176 -452 9843 7382
16684 7382 -616 -2721 -16371 -24722 -14750 3255 4009 -12660 -2693 8918 121 -17891 -14650 -18476
16670 -18476 -15006 -19797 -17621 -22856 -22385 -17178 -26889 -24054 -28398 -38879 -23135 -1181 3154 -7319
16656 -7319 -6952 3954 895 7075 872 -12815 -17473 -23275 -35533 -46656 -51142 -22920 -3601
16643 -3601 -7644 -2509 -1855 -4179 574 -2795 -9193 -18430 -12277 -810 -3300 -10573 -16233 -12139 -12382
16628 -12382 -15833 -18507 -19503 -7985 -6681 -14394 -4994 -3154 -9323 -13561 -10554 -518 15723 22750
16614 22750 -934 -7498 -3355 5052 -4156 -8016 -1508 -1980 -4812 -9291 -12879 -7209 6702 -8764
16600 -8764 -7732 5542 4749 15342 20932 9167 6085 -40 18977 15380 -15842 -18076 -11275 -14821
16586 -14821 -21046 -18133 -15213 -4254 -6692 -9822 -605 1741 -7615 -3988 -2767 -6760 -20210 -26520
16572 -26520 -23587 -7803 5568 537 14497 11153 -884 10306 26230 14113 4692 10534 16270
16559 16270 10421 969 -536 -9445 -21823 -20761 -17478 -21843 -17844 -19206 -37312 -39584 -13978 -638
16545 -638 4105 871 3947 10534 1019 -4349 -7324 4966 15746 14911 8081 7501 5022 1345 4268
16530 4268 8564 6401 1378 1868 -2887 -23991 -22142 -2506 -337 -256 -7266 -15844 -23264 -39161 -35962
16515 -35962 -30540 -28457 -38920 -45420 -35446 -15974 -21159 -27875 -12024 -16762 -11494 -22675 -25680
16502 -25680 -25459 -18375 -12781 -16187 -21297 -24953 -17711 -4989 -11401 -16464 -16236 -6385 -10097 -22865
16488 -22865 -23789 -20849 -15362 -16767 -24381 -26628 -24782 -11372 -4031 -4785 -2615 -11302 -15964 -11152 -16322
16473 -16322 -17781 -34635 -31150 -28968 -36298 -13811 -12321 -2681 -9195 -14959 -14615 -21413 -25189 -26805
16459 -26805 -23922 -9795 -17409 -12605 -10141 -16365 -25273 -29557 -24081 -16106 -7864 -13049 -7274 -9545
16445 -9545 594 5807 11478 13123 6867 -4092 -17241 -18903 -23530 -22489 -16680 -15589 -18429 -17202
16431 -17202 -19700 -21441 -6442 -607 321 -10132 -13500 -5340 728 507 -6940 -13870 -10314 -13333
16417 -13333 -23737 -16149 -747 9992 -3368 -20014 -34765 -41208 -37520 -30440 -16487 -89
16405 -89 -10980 -18103 -21797 -13405 -6212 -19151 -21888 -17420 -3004 4897 5716 5281 10520 14142 1006
16390 1006 -18281 -20321 -9014 4038 10625 972 -15844 -40232 -42420 -29752 -16996 2496 11329
16377 11329 5179 5819 3013 -6426 -2324 3905 5797 2115 -5610 355 9875 5366 1887 -16865
16363 -16865 -24454 -27647 -31142 -13405 -6342 -14368 -20066 -17255 -7674 -12570 -7600 1806 -1076 16932
16349 16932 22690 22789 23433 16987 162 -9742 -15118 -10154 -2114 -1714 3733 -2815 -5396 -6089 -5257 9918
16333 9918 6820 11091 13017 -1242 -8101 -6398 -16100 -30216 -24583 -22175 -4462 4501 677 929
16319 929 -17155 -24694 -15356 -5934 -537 -5968 6 -4446 11251 2084 -1180 -332 -89 -3676 457
16304 457 5870 11496 2389 10542 9875 2481 -1258 1158 714 4364 4934 -5748 -15520 -21603 -9174
16289 -9174 -7469 -14584 -12901 -5182 -8392 1245 8346 -14501 -8047 -9415 -10510 -21014 -18773 -7798
16275 -7798 -6510 -19042 -33952 -38329 -30763 -8833 2229 -5265 -5770 941 -745 -1696 -2188 1320
16261 1320 8043 4344 11722 9152 9591 -2436 -3427 -4597 -12753 5860 2718 -9528 1141 59
16247 59 -12176 -27383 -28479 -34588 -37793 -36929 -28640 -12913 3992 5170 570 5237 9450 23589
16233 23589 21281 7820 9531 11016 1113 -11063 -10517 -6475 -3486 2907 5273 5116 3002 348
16219 348 -5795 -8997 -6179 -20133 -12664 1231 -1666 -14478 -18693 -21225 -16230 -1700 -1497 3517
16205 3517 -697 -5659 3452 5048 -8072 -22755 -20616 -26382 -28019 -20843 -26963 -24968 -15010 -18386
16191 -18386 -15926 -12935 -10945 -14558 -10946 8269 19124 12273 -3966 -3266 1798 7852 9571 6477
16177 6477 9895 11807 15604 15403 3812 -7508 -17147 -26925 -22701 -8065 -1764 -6550 -23711 -31765
16163 -31765 -29938 -23721 -19123 -6543 114 13724 561 -8941 -5951 5472 19377 18445 18486 17663
16149 17663 11688 6624 6560 10341 6534 8725 2345 6673 13575 16838 14995 5651 -1073 -1766 573
16134 573 1406 -17575 -36930 -37092 -28163 -13502 -16928 -12359 1669 3186 -11576 -21259 -19933 -9621
16120 -9621 9334 8901 -3521 -14999 -23083 -14906 1474 9655 7455 519 -7086 -10401 -18869 -17602
16106 -17602 -5251 -12034 -10960 5028 3742 4945 -4018 8247 19213 14218 -6394 -6820 -6192 -5332
16092 -5332 5735 10337 14188 -2101 -12615 490 5047 -391 7209 7615 10780 -802 -9301 -10973
16078 -10973 -21518 -12494 -10541 3311 14265 3083 4491 4319 -11644 -14343 -6235 -18373 -27179
16065 -27179 -15688 -1831 -2831 -7652 -19051 -12936 -12475 -14150 -3076 9578 1370 -4950 -393
16052 -393 -4324 3097 17340 22737 15642 13688 8742 2130 -3182 -12002 -6393 -3829 -8901 -13010 -18049
16037 -18049 -15636 4813 10061 -288 -2229 -8998 3274 10668 16038 3247 -3251 -8285 -11182
16024 -11182 -14010 -9573 -3970 -8632 -12700 -3027 -1574 -7549 2724 -3493 -12900 -17801 -13220 -8972
16010 -8972 -17190 -12276 2093 11301 10661 7025 -2541 -20796 -24867 -15154 -17145 -27219 -35067 -31550
15996 -31550 -16865 -3224 -351 398 -10986 -10204 -2059 -10504 -5780 -7178 -9467 -3145 -8081 -4510
15982 -4510 -2312 2303 -836 3555 -1564 -2746 -4686 6515 5579 -18359 -33169 -13860 -8778 -5207
15968 -5207 -7984 -6480 10917 25150 28462 17088 3064 788 14611 15656 2856 3854 -5458
15955 -5458 -14974 -32866 -37146 -18278 -448 -2661 -5268 -9699 -8836 10502 9782 -604 -3479 -207
15941 -207 -2815 -3260 -9049 -14324 1867 4483 -2206 -12151 -22481 -9307 -12841 -23048 -20685 -13804
15927 -13804 -2635 -9640 -8654 -2403 1885 1217 3572 -8160 -14237 -2233 -511 -14417 -6537 -10269
15913 -10269 -6367 4396 16194 -463 -10411 -17184 -25820 -29639 -22589 -17448 -10679 267 14679
15900 14679 14812 18311 14051 9817 13016 11340 4927 -1348 3419 -2587 -10085 4726 5800 835
15886 835 8630 8742 3552 2741 -1827 -10178 -18814 -17002 -7536 -7520 -7793 -881 5582 4857 -7704 -23551
15870 -23551 -33328 -26768 -19165 -9529 -13450 -8366 -10268 -11124 -20704 -24775 -12265 -11966 -8376 8181
15856 8181 16184 24465 30832 19104 2066 -19704 -22780 -16394 -17457 -4860 11309 13644 1421
15843 1421 -4581 -5598 -5519 -12097 -17886 -9190 7990 -1712 -15420 -8648 -8545 -19188 -31306 -45396
15829 -45396 -46575 -36532 -18872 -6157 -10564 -8488 666 4391 1128 -7997 -3804 2199 4604 -1520
15815 -1520 -4362 -15475 -4239 6325 1466 -5846 -15727 -3913 6146 4357 1517 368 -2405
15802 -2405 9351 31072 29970 18371 3660 11745 23859 34540 36310 25105 -6613 -16880
15790 -16880 334 5717 8018 18759 8956 -5974 5986 10760 16855 15986 18433 10675 -3611
15777 -3611 -13481 -9956 -2425 -12948 -20047 -14599 -5356 -1604 1360 -7978 -1631 -5693 -12536 -12725 -13233
15762 -13233 -10604 -4843 -15332 -24976 -23689 -8054 -6433 -13387 -5499 -2204 -2493 -3622 -5622 -1482
15748 -1482 3614 -1202 -3501 -12789 11485 26271 18011 12074 -3144 -20 -2864 -2090 -1473 122
15734 122 1467 -17875 -22695 -12642 -15975 -24490 -25396 -22063 -3540 18459 16564 10017 -5171 -7104
15720 -7104 -5489 -2922 -14600 -27128 -21217 -14377 -16506 1226 -4170 -6667 -8701 -16148 -22434 -7622
15706 -7622 12510 21472 23857 20379 12584 15367 11161 6552 1826 -7554 -13013 -16788 -12653 -10606
15692 -10606 184 7426 14870 35241 44610 34318 20382 27874 29250 24700 33580 41087 38292
15679 38292 36411 35655 46168 49909 59152 83130 112907 133309 180590 247172 345183 480289
15667 480289 615918 767368 893699 997922 1094562 1125277 1087622 988619 879065 755554
15657 755554 613286 457166 332366 247464 164124 119216 111322 93706 79513 66693 50122
15646 50122 50774 61357 62168 53525 39551 46099 58548 67609 79227 85749 101122 89419 95554
15633 95554 101739 99150 94293 72048 52721 25555 19754 15300 8852 2236 805 -4627 -8979 -20850
15619 -20850 -15160 -7213 -9981 -11404 -1379 -17132 -18714 -7908 1844 12367 12622 5990 11147 15794
15605 15794 19416 20550 5917 -5616 350 16869 22024 16166 14629 7735 -4005 -718 9426
15592 9426 20441 7339 -4823 -2923 -5121 3279 20917 5038 -3196 4025 13973 16068 23215
15579 23215 22039 17021 12453 6200 22080 22530 4421 -10685 -3339 -346 -17903 -21836 -18523 -6953
15565 -6953 -4645 -5226 -8436 -1528 -3436 -10603 -703 653 -1073 288 6415 -2647 566 -4004 2853
15550 2853 16188 4296 -7247 -11674 -10002 2720 3721 502 -2240 -5195 -150 -2755 -18575
15537 -18575 -20453 -26468 -27988 -18932 -16505 -8064 -15680 -27149 -28182 -3662 -7352 -10018 -5558 7992
15523 7992 13516 24587 29155 25653 16684 19878 22503 19116 7759 3658 -2250 6933 21204 19464
15509 19464 25968 12454 19775 15763 -1130 -3472 184 -4718 7348 -3602 -8855 -3942 -4424 -9605
15495 -9605 -11034 -2349 319 17547 27048 29135 25395 -603 -4199 -6419 -2680 -742 2444 -13621
15481 -13621 -16459 -11469 3477 6122 12469 14009 8678 2024 3291 26 -1147 5481 14388 1340
15467 1340 249 -1735 -10040 -16369 -11660 -4626 93 6086 -3057 -4077 -15218 -17232 -19948 -20228 -10334
15452 -10334 963 4908 5008 450 9723 23871 21516 13316 5341 6671 9750 6046 -2760 3896
15438 3896 3338 390 2363 3507 2081 -224 -10860 -11898 -13347 26 5816 9428 10441 -4333
15424 -4333 2919 7700 5615 4995 9287 1223 2593 10959 2266 -145 13806 27777 22418 11768
15410 11768 -2867 -14074 -6046 2722 5218 9548 13109 6992 2186 18145 14837 12474 8163 1102
15396 1102 677 -8718 -8543 1245 703 -5621 -19377 -26726 -14848 -2629 9618 18567 9793 3472
15382 3472 -2947 701 -1440 -6772 -1616 9360 23035 31423 9401 8283 7603 492 -9039 -6817
15368 -6817 -4292 -7066 -9487 -11218 -10222 -4229 -10524 -18219 -364 -1348 -4854 -7028 -15937 -12203 106
15353 106 8417 1204 -17636 -22604 -11540 -5423 -10338 -9786 -2764 10520 19992 4473 10237 20412
15339 20412 3647 -9296 -14564 -14541 -6741 -4838 5588 712 -3367 -10622 -12955 -9281 -1776 -15926
15325 -15926 -17438 -6187 -3124 1698 -82 13580 16330 14130 16560 12636 13950 8572 -536 -4135
15311 -4135 -9401 -13200 -13008 -12713 4455 12294 -3826 594 -3063 -14536 -18856 -26980 -18419 -3716
15297 -3716 11510 27146 20315 -3175 -6976 -577 3127 7476 25234 20811 17942 16449 11757 720
15283 720 -5072 4406 21590 8594 15780 16620 20704 27719 25987 22005 2600 -4308 -12462 -3365
15269 -3365 -4853 -10811 -13804 -7510 -2978 -5995 1317 1577 8144 430 -8914 -7420 -19679 -24660 -7594
15254 -7594 -13805 -17803 -23982 -17127 -8646 -4957 -5156 -9266 -15251 -18701 -15543 -2704 6911 7723 2196
15239 2196 -11235 -9080 -5118 -2283 -14817 -13010 -2672 -19 9912 130 -7824 -4859 -1412 4199
15225 4199 6618 -5996 -6566 1916 768 3523 9149 2678 2736 10790 17000 11036 5436 -197 5322
15210 5322 7064 2158 6755 6084 10016 28634 34986 22136 9586 3735 6800 -7552 7280 21791
15196 21791 22091 12112 -2122 -4346 1260 19679 19498 24197 9005 88 6510 7199 4529 31966
15182 31966 42688 25276 15497 28823 13957 5382 11465 16926 6785 -770 -7127 -14318 -4184
15169 -4184 10190 9334 14907 21218 25668 19261 11747 9678 18353 18644 26027 17581 6316 3604 14822
15154 14822 10897 9155 13818 20537 24012 21687 13687 18262 22433 31828 34192 26053 26804 23123 24075
15139 24075 20718 18429 14162 9084 15586 28183 5430 13636 18326 12174 7339 19017 22215 28835
15125 28835 29758 25759 13460 10556 5772 12695 18223 10153 5685 695 5016 3885 1716 5271
15111 5271 13668 9985 9222 26 16059 17498 3075 2034 14200 12778 20640 24117 29339 34823
15097 34823 33834 32358 24173 16533 16398 24297 25243 17081 16826 22573 18809 -2429 -15670 -17298 -10139
15082 -10139 -8163 -9150 -9933 1700 -1146 -3359 10559 15753 14503 32976 47836 38489 30764 30988
15068 30988 36292 36248 26750 33408 25505 16983 14747 10507 11917 6265 -4218 -8647 -11732 -16001 -10931
15053 -10931 -12883 -8887 8917 28046 25849 30870 45731 49300 44008 29350 11020 4464 16035
15040 16035 24060 19734 6291 -7026 6628 11196 15606 11222 14212 29385 37284 31867 22360
15027 22360 23858 34163 40476 55136 67992 86848 120736 176472 256260 363746 483756 578228
15015 578228 638523 674968 697347 683851 612409 508293 405158 310431 221551 164426 136386
15004 136386 112001 97570 84848 77417 72529 53250 52907 52902 35104 34274 43920 37693 16394 -11859
14990 -11859 858 11753 11168 20497 26144 22049 19233 19154 23725 15318 13005 16766 8569 -8124
14976 -8124 -14493 -9206 4383 6954 5614 18417 17996 7508 -3932 -700 29039 46307 45856 52431
14962 52431 59002 53537 37527 42145 39849 31658 19629 7144 14342 19565 10132 6178 4008 12492
14948 12492 23650 30340 21315 14368 13860 19037 25240 26796 14256 -3003 2736 23997 34855
14935 34855 29048 26414 28577 27314 27912 35739 28339 25158 24113 30521 22256 6803 -5673 8523
14921 8523 9511 913 13574 35878 36518 24395 16139 7896 -2568 -2639 990 13935 20624 26158
14907 26158 20314 28786 25843 12706 9619 12653 661 14100 24985 17263 15328 18047 17862 17998
14893 17998 18332 6640 1107 -1679 16902 22436 24180 24941 11294 3931 7132 9075 1832 -4540
14879 -4540 -10380 -11960 -7692 12417 16498 19555 10092 -5395 -5809 5035 6163 3721 -1151 1945
14865 1945 8956 8328 7374 4352 18849 27053 28799 22042 18590 27717 40682 34248 28651 36156 43411
14850 43411 35074 14084 14478 15198 10753 12695 26909 30821 22653 15127 18986 25689 24158 16840
14836 16840 -3043 -6357 2085 2057 8066 23455 14365 8250 13396 16179 20477 32349 22926 19567
14822 19567 19109 13409 27982 30879 21188 20651 13680 -1762 4052 -1297 -31 -523 17031 27140
14808 27140 24862 20081 17831 23101 17403 33891 46560 42895 28171 31103 32418 21089 17971
14795 17971 28093 28772 26744 23249 24984 28952 23918 34493 30428 18700 14212 14209 26837 44335
14781 44335 43864 26942 25000 36522 43179 46758 53387 66518 51379 27925 16990 27596 44254
14768 44254 45952 39290 19858 16643 22153 19807 26841 30768 24791 22609 20510 17739 15882 7966
14754 7966 21256 37060 34394 36201 48573 46311 34761 23509 11374 7096 10322 5791 2664
14741 2664 8756 8755 12233 17650 29411 24678 31959 40969 44729 46510 41695 36848 33434 24514 20783
14726 20783 32735 31617 25225 14424 11741 17128 12721 24997 25322 23960 38199 36015 19128
14713 19128 21811 37736 37551 39027 35671 36379 48078 53675 58706 51380 54068 42220 36013 49343
14699 49343 45288 45833 41312 41623 48859 47150 39500 33929 32042 31201 30793 55363 48886 42344 24861
14684 24861 17272 23576 27412 27578 19121 15375 19759 23446 25334 47166 50414 34844 21550 35189
14670 35189 32553 25637 31320 28701 31628 30755 38435 32657 17943 13660 15517 6771 9069 10253
14656 10253 20735 18171 21357 19207 13870 25165 28033 22229 15754 13925 6640 12928 30914 36483
14642 36483 37197 26641 27895 29106 26238 33500 16887 20196 21592 24771 32028 29395 29412 35751 49003
14627 49003 59139 50618 41211 47765 45040 50603 54275 60358 76489 83516 87039 87713 109978 124116
14613 124116 137488 158950 174834 202384 207491 179095 147000 122869 105533 90342 80024 72471
14601 72471 61715 46748 56159 53249 42503 35810 34640 30520 28497 33601 29263 28904 27726 35105
14587 35105 55721 36235 14421 8553 3674 17633 46508 52542 41760 40712 48140 57894 51802
14574 51802 42870 47192 51940 46728 39838 36366 29248 14310 15736 20191 29422 23659 11368 20582
14560 20582 36379 37202 41812 33466 30040 30004 36799 36907 42225 41956 45619 40897 28279 15029 11723
14545 11723 36511 57177 55709 36931 36191 40863 47957 44610 44032 43151 56221 61865 57331 47983
14531 47983 40487 49558 45590 39792 42857 40120 47527 51464 50207 56719 61521 55021 49891 55207
14517 55207 64476 73679 62544 54753 69564 85486 74936 72662 84397 92510 85504 75389 68389
14504 68389 62237 71692 86741 75144 55068 45660 52744 64566 69069 66015 62367 53003 46254
14491 46254 65869 64508 67886 74294 75369 68874 68228 74302 67511 46818 50462 67035 83242 78496
14477 78496 78830 74528 65114 51531 55670 50351 49100 42963 44970 39726 40805 46691 62490 58203
14463 58203 50879 51235 56451 63486 77452 65102 59494 63551 69033 65978 54697 55317 66227 74597
14449 74597 74182 80249 76486 77143 73674 70771 70326 65858 65007 61677 66444 58901 57009 60853 72168
14434 72168 74935 87321 95229 88467 108241 111400 115936 126453 136556 170634 187534 209946 239178
14421 239178 259478 258280 248016 239506 221770 197743 187706 172207 150214 143071 144876 142072
14409 142072 131832 113800 100339 98474 102405 101972 97605 96525 102293 104981 97592 103843 115938
14396 115938 118428 132691 146376 128198 130820 150176 161405 166038 182051 203298 218767 244354
14384 244354 260938 284080 312580 344606 375708 424813 499690 578618 680759 826331 1012240
14373 1012240 1254736 1547710 1841698 2113703 2350668 2530970 2650832 2678973 2609982 2427115
14363 2427115 2161021 1886421 1622850 1368578 1108906 891265 736210 605500 519464 454436
14353 454436 405928 369873 340446 302126 264508 243189 217192 200661 171928 158027 145642
14342 145642 138077 131250 123346 115904 108403 104616 108144 116081 118087 120309 109150 98627 93366 86063
14328 86063 84096 80193 79080 82383 69721 67327 78199 90160 99147 107823 119546 117508 103035
14315 103035 99406 103281 105734 102797 106812 108231 98339 105172 99657 80620 68345 68497 75338 83093
14301 83093 99650 92118 97117 105403 118452 106980 95389 98090 100063 100052 108984 113399 115467 113098
14287 113098 107178 101662 100100 95398 95750 110206 121674 115920 121435 134433 142410 140421 146060 144155
14273 144155 124625 107869 111359 120500 122530 121027 126482 126332 120394 120764 113275 107921 116721 135615
14259 135615 141531 131010 127200 114237 103793 93753 102068 88947 87841 87956 100051 113625 121034
14246 121034 103164 92571 95961 102164 112896 111660 100271 96122 115640 120212 117713 120001 127917
14233 127917 132935 146739 141305 141711 151787 185587 205923 203178 208158 215168 232473 231429 222453
14220 222453 227637 219926 200094 174034 162713 155084 146876 153165 154219 154822 150389 144328 145245 151303
14206 151303 174083 188197 201680 204447 210928 221002 227801 245545 264107 269409 265557 256812 244445
14193 244445 244852 252236 243620 243059 244365 244653 253323 259184 255368 245239 251732 267033 262316 264327
14179 264327 278776 291041 290963 292542 297356 300556 307223 304120 295347 294115 302162 307302 302147 291972
14165 291972 283427 278414 266740 265582 272277 274036 268373 267528 251859 258042 258670 256008 250269 243156
14151 243156 245171 256308 267541 250599 245312 262100 258862 251551 252028 250231 239525 236304 241483
14138 241483 240057 241998 234382 242123 246106 243719 260471 264938 246304 236413 251834 276472 295162
14125 295162 304853 319856 338750 346089 359821 356226 345364 350980 358758 370361 391899 425035
14113 425035 468410 524133 591182 663669 717161 754347 778244 789224 783577 761438 718398 674047
14101 674047 635399 594117 542406 482451 430373 398608 369577 355717 345608 328982 305858
14090 305858 281480 275325 275870 272539 282361 291186 294870 302401 298128 296571 291119 287663 277908 289364
14076 289364 299261 312919 321708 322777 322057 337279 354565 378741 407060 423831 441907 462543
14064 462543 492286 498220 504352 516696 517603 528088 537421 536657 528589 524566 533758 538517 546696 553220
14050 553220 562877 568191 574217 596300 604946 598776 607920 624985 636332 650098 645430 630935 626509
14037 626509 623135 627478 636260 643120 645864 661230 665660 681076 695342 696908 719602 728544 752848
14024 752848 781125 788170 783086 775637 771727 788239 809910 825416 820357 827917 846508 872525 892956
14011 892956 902828 931798 966434 981514 1001733 1028726 1062862 1101024 1122702 1147892 1172427 1206641
13999 1206641 1242136 1278714 1300670 1316603 1341541 1403565 1463032 1508648 1547845 1581896 1625677
13988 1625677 1675240 1725778 1765190 1816027 1878782 1953374 2019997 2106184 2209921 2316887 2409966
13977 2409966 2503409 2603693 2696905 2773140 2847842 2916732 3014620 3115274 3200323 3296736 3412821
13966 3412821 3522415 3643713 3796296 3945199 4094434 4263130 4428165 4604971 4809368
13957 4809368 5039838 5295415 5573456 5891742 6251567 6653159 7096220 7606513 8166172
13948 8166172 8779725 9472097 10243647 11111892 12107706 13235536 14504248 15957644 17628583
13939 17628583 19557728 21841364 24538209 27750048 31554999 35972612 41047435 46995484
13931 46995484 54133614 62902705 73859450 87910407 106435247 131312616 164718353
13924 164718353 208225971 260484493 315279488 364675099 405502464 439367640 465835142
13917 465835142 478673893 470986693 442836881 401246736 354461873 307427485 260941367
13910 260941367 215401188 173960133 139986570 114063366 94730276 80123803 68759179
13903 68759179 59602700 52007578 45554642 40044830 35302030 31193456 27633089 24555034
13895 24555034 21930916 19731309 17887025 16327757 14998447 13854064 12850518 11952348
13887 11952348 11149653 10437270 9807783 9227370 8690076 8179441 7718405 7298168 6911477
13878 6911477 6547266 6212529 5893145 5607334 5368353 5133874 4894032 4678759 4479723
13869 4479723 4296234 4102154 3896512 3709190 3521651 3336532 3164179 3012644 2856496
13860 2856496 2711821 2587467 2492201 2413323 2334854 2272158 2224063 2176288 2129832 2079194 2034735
13849 2034735 1981193 1933323 1881500 1821638 1772804 1723978 1682383 1637716 1580954 1541145 1506805
13838 1506805 1465415 1436979 1380433 1326834 1284354 1245636 1226490 1188032 1146680 1119057 1106438
13827 1106438 1088420 1078996 1073537 1067643 1044771 1035226 1023236 995811 971898 968809 971950 974939 981884
13814 981884 992296 1003573 1004134 1008404 1033911 1066506 1104558 1136736 1166183 1201428 1269421 1372130
13802 1372130 1501086 1696529 1982160 2317768 2650769 2967536 3329973 3770121 4165868
13793 4165868 4406730 4452149 4398153 4302900 4104272 3765428 3351355 2929344 2563383 2244921
13783 2244921 1953404 1675282 1437058 1260289 1126624 1030799 959305 897335 848570 811004
13773 811004 776244 768745 813727 901435 1004101 1103908 1167664 1224735 1300277 1336445 1275931
13762 1275931 1172653 1059231 951831 850927 754565 655446 585751 528538 495196 487642 480150
13751 480150 458111 431417 417560 411256 398970 389965 388433 391182 393128 373645 362386 337338
13739 337338 318301 302144 291738 288085 283166 275100 266702 272445 267929 262722 260740 254975 254143 241850
13725 241850 228825 245200 233650 222694 216242 218605 211106 207460 210065 204307 182543 181032 183866
13712 183866 185899 183103 179164 181132 181893 186727 187659 180469 163765 163965 162059 162060 160774 144994 123574
13697 123574 103181 101786 108828 100614 89818 73828 62133 60892 60051 77433 78969 94924 118688
13684 118688 126033 138769 160115 184761 189636 192692 192241 188858 193701 172481 150612 138814 132998
13671 132998 125512 117375 108278 110383 121431 114895 116136 113325 118008 118801 115676 96428 86587 74088
13657 74088 68330 72797 65759 77284 85355 89637 85161 76563 75140 63946 64071 82810 70179 58997
13643 58997 74557 92659 98763 98316 108554 110038 100900 108542 102428 88524 100770 107650 110390
13630 110390 115524 112754 103809 112217 108425 114014 116576 123216 120786 95722 57112 40740 24443
13617 24443 11481 3159 7885 6578 10662 15129 13048 18140 20322 36681 58481 99170 136876
13604 136876 163810 200844 259457 324545 385842 427100 449429 477698 499318 466447 413051
13593 413051 380406 336361 292712 229307 177613 129788 94346 84002 97294 104100 102780 94737
13581 94737 79001 58347 54821 47930 50309 55882 49556 29304 18938 16891 9256 -18 -1740
13568 -1740 5779 16574 19857 22789 20985 23660 34428 41748 31238 27027 34203 42963 37783 26432
13554 26432 19325 24591 26470 18505 12036 20556 27489 -1370 -7267 828 9178 5695 -1769 -3929
13540 -3929 17563 30118 18458 21108 21011 10733 -1521 1269 16957 27712 31953 42358 55551
13527 55551 45737 35831 29082 33488 35886 29697 26898 22138 21578 29252 30090 18079 15312 21030 30412
13512 30412 23294 33511 33810 25746 21411 20453 27190 21969 15651 15350 18142 22403 43588 45179 56797
13497 56797 55362 40827 48808 56452 53508 49361 55374 50253 57033 60629 58929 62326 89398 101307
13483 101307 111203 128693 151756 160852 174750 194883 207842 230899 267976 319231 379924 454347
13471 454347 549508 677425 864449 1095415 1364825 1672231 1961117 2199160 2392648 2549145
13461 2549145 2637311 2619542 2470801 2241460 1990109 1716565 1441701 1183503 960236 765322
13451 765322 620152 513422 433963 378509 327730 280152 245442 215127 192809 167481 165966
13440 165966 156166 131078 112003 99786 80331 72815 87097 89006 91319 85599 65957 56163 50152
13427 50152 49743 48243 51525 45079 35496 28708 20745 22381 27595 23503 21827 24995 28764 45026
13413 45026 35095 24346 6132 6562 13735 17760 10078 -4882 -9498 -307 11782 13174 6656 951
13399 951 3223 1159 20826 23404 25144 28987 18804 482 -5199 -5775 -10232 -2293 -9604 -29573
13385 -29573 -29455 -25181 -17161 -5372 1331 8250 6509 -54 7986 6385 3613 -17817 -29302 -27243
13371 -27243 -17041 -15825 -13666 6438 16230 18591 14638 -6983 -22509 -18167 -7787 -8432 -7571 -18654
13357 -18654 -21074 -24494 -25719 -30729 -27396 -19779 -4872 7162 9353 11221 -2359 4600 5672 9562
13343 9562 10712 14788 14052 9938 12028 7612 -3864 -14929 -19502 -8929 5677 4652 -6929 -14864
13329 -14864 -3386 -3557 -6270 -9168 -19745 -33974 -24349 -26056 -13486 -10234 -25388 -3866 13429
13316 13429 29032 34409 4599 -9190 -12268 -12152 160 12435 21092 22984 16323 1936 13132
13303 13132 6832 699 -2952 -14937 -14700 -11658 -4621 -12149 -15580 -18623 -22357 -14599 -1347 -4631
13289 -4631 -5771 -9590 -5602 2191 929 -1014 -1835 -1956 -10598 -17197 -6622 -2421 -14454 -8959 -3562
13274 -3562 -11598 -14959 -13250 -14975 -19339 -21808 -24344 -19559 -6698 -8041 -19804 -22473 -14704 -10975
13260 -10975 -8068 -21964 -22249 -12975 -8554 -12412 -8094 -21905 -26459 -24935 -31510 -24883 -19980 -23874
13246 -23874 -15208 -12320 -18504 5373 18255 6816 8631 25651 16990 1840 5142 22321 18051
13233 18051 7869 -359 -4780 -1415 -1806 -2411 1483 12350 20727 31821 24793 11531 5993 981
13219 981 2825 -219 1813 7805 12440 17797 8512 8670 17949 23595 6664 -2680 -9226 -10451 1290
13204 1290 -7479 -100 6105 18901 24797 16166 7505 18750 27588 14207 8978 6117 7537 13414
13190 13414 12272 4163 3497 -8730 -9222 -812 5155 2735 -4412 -2066 -7652 -12605 -8410 -2393 -11339
13175 -11339 -19899 -17450 -11156 -3579 -2603 -3219 -6326 -6764 -7566 -4443 -5210 -8626 -15850 -15922 -10977 2575
13159 2575 -821 -34019 -49640 -46767 -41666 -37298 -30650 -26099 -20490 -16201 -10917 -20912 -33513 -31688
13145 -31688 -23988 -26354 -16460 -13500 -10864 -9949 -12657 -11049 2849 661 -7657 -11937 -6539 -4664
13131 -4664 -14278 -10384 1709 4749 -4159 4951 7153 -12148 -27828 -26513 -22454 -36862 -34005 -26896
13117 -26896 -25009 -15932 -15963 -6975 566 -5675 -17047 -19926 -2505 8904 11285 15050 10913 19683
13103 19683 12106 6819 9793 6531 -314 -4629 -872 13777 16749 5712 2941 30 4789 9885
13089 9885 4107 158 20016 21463 5802 9157 4257 -1776 -492 -1210 12491 20406 21947 24804
13075 24804 18771 7643 585 3121 10995 14497 17058 10078 3188 4501 -500 1102 -6667 -11656
13061 -11656 -6861 2647 8027 13016 11059 7049 -5846 -12892 -7718 -15352 -23585 -13769 -5049 -7176
13047 -7176 8893 9354 10206 16669 -7287 -6815 -553 2976 7578 10299 19223 20459 14791 14071 14266
13032 14266 6032 17496 25749 29194 26151 19526 1707 -6519 -14612 -35500 -41938 -40700 -53901
13019 -53901 -41725 -32674 -28743 -30945 -27116 -19868 -26593 -22715 -16635 -25176 -24033 -21956 -19000 -5188
13005 -5188 9341 17052 20103 12493 -1889 -5294 -9846 -12057 -18248 -27517 -20863 -5135 -9197 -23466
12991 -23466 -34747 -37686 -24057 -8270 2893 18376 20822 9207 8594 8774 10534 4269 -4540
12978 -4540 -7695 -17502 -20108 -6901 -4990 -18006 -11797 -2086 -2025 -1446 -3985 -21200 -10577 -11775
12964 -11775 -13695 -23990 -43847 -25163 -8136 666 -8163 -14788 -14415 -4023 -1319 -1833 -7711 -8113
12950 -8113 -4959 -12987 -13933 -33266 -31168 -18304 -10423 -8754 4824 15628 31309 26701 11649
12937 11649 -11064 -12057 -9358 -13286 -9675 11137 20666 16405 7349 26257 34723 27800 23357 12173
12923 12173 14422 6833 8943 9728 5784 1110 -6746 -220 -6872 -13252 -10172 -4297 -12574 -14747 -15069
12908 -15069 -5420 -345 -5595 -21419 -27420 -23515 -22440 -31945 -30461 -25690 -21907 -6805 -7570 -8469
12894 -8469 -2653 -1676 1753 -836 -568 2825 -215 7272 4353 -7181 -3531 -204 1073 -725 -2038
12879 -2038 -5123 -17099 -19115 -11093 -9934 -16556 -10725 -10182 -6879 -5485 -8738 -9421 6517 3941 -21995
12864 -21995 -34410 -32380 -30928 -27361 -20240 -24304 -22581 -20134 -22024 -28566 -19742 -9014 -7131 324
12850 324 -12505 -11363 -9081 -27410 -36164 -26738 898 -11782 -31563 -49972 -47354 -47044 -46768 -38204
12836 -38204 -28970 -13988 1188 126 6204 2062 -5015 -11248 -22220 -6548 8202 7125 16300
12823 16300 14359 1323 -2007 -7148 -20147 -19916 -11219 3364 13457 5930 912 -3405 -1642 -2657
12809 -2657 -9096 -1267 -2463 14930 42066 49401 82204 114422 99655 55333 46510 33523 17572
12796 17572 14412 4730 -17999 -30752 -39260 -25767 -13399 6265 9258 3872 5322 -3735 -7277
12783 -7277 -7636 -10276 -3841 495 2482 -2791 -13147 -14718 -13864 -27828 -31157 -21601 2441 10464
12769 10464 -2363 -13885 -20900 -12124 -5701 -6435 -14445 -17099 -14270 -21178 -17018 -5355 -6809 -11066
12755 -11066 -16693 -15518 -18017 -17361 -22287 -18247 -25580 -10724 14099 8692 1289 -4375 -14797 -14623
12741 -14623 688 11680 13609 14937 1130 621 22 -100 4548 7764 4400 5095 2960 7405 6567
12726 6567 2874 -6447 -4312 -11829 -17333 -9150 -6227 -10554 -8718 -15566 -21342 -19152 -7050 -2102
12712 -2102 5827 14631 30253 25919 22949 25528 24358 14632 7095 13350 17739 12144 6998 -10727
12698 -10727 -20295 -20166 -14885 -2567 18250 9044 2754 7150 10395 16735 5571 -17671 -17756 -11707
12684 -11707 -13123 -24013 -26840 -16230 -3857 -9679 -23098 -21511 -24703 -27215 -22072 4588 15201
12671 15201 7062 -236 6008 17934 26411 23701 22594 21611 18311 14006 14558 3607 -136 6017
12657 6017 3856 -9326 -22833 -27849 -31989 -31097 -24324 -33163 -40236 -34735 -27796 -27253 -20272 -21811 -17484
12642 -17484 -13828 -9318 -7301 -10929 -3516 -5801 -17493 -10750 -11303 -17113 -28723 -11149 7966 6744
12628 6744 -634 940 978 2128 9142 10309 220 -5543 -5274 -9779 -16069 -11016 -21045 -24723 -24036
12613 -24036 -23232 -17824 -13326 -10418 -1570 -6384 -6367 4174 4532 9432 -45 3651 6380 4025 -9734
12598 -9734 -17682 -20151 -7725 2939 12642 8974 -2081 -19675 -20225 -13064 -3121 -10516 -3244 -298
12584 -298 -8460 -17892 -17522 -14549 -14589 6949 19374 1611 -4382 -13176 -6092 3913 2672 760 15516
12569 15516 19106 16991 8250 -1855 -11548 -17266 -25895 -33237 -23643 -643 19684 13142 14042 11489
12555 11489 1941 -9556 -8769 -9292 -12193 -6776 8186 14631 -188 -11445 -13495 -18130 -19135 -16578
12541 -16578 -9410 -4550 1191 -6326 47 4990 -83 5390 4929 -8086 -6739 -8985 -13012 -21453
12527 -21453 -21379 -9774 -2914 3723 19721 30502 34136 35113 42407 42523 31857 22198 5926 1230
12513 1230 9828 15889 6491 -6841 -14330 -15651 -538 10376 28947 55811 46856 37280 29940
12500 29940 20137 25698 22923 16009 4098 -12169 -17321 -3028 1415 -7406 -887 2127 17938
12487 17938 21406 3593 10283 28671 37295 33928 11001 3456 12637 -1346 -11345 -11562 -13928 -21632
12473 -21632 -23070 -12259 -3899 -2285 -4808 -2048 7333 17097 2370 -5744 -1161 9427 16083 13186
12459 13186 13490 3303 -3463 -17665 -24286 -19720 -10697 -2403 -1358 3296 11700 14529 14795 11502
12445 11502 18826 35964 42611 53008 57996 64693 64930 49009 30084 28221 25565 19660 2498
12432 2498 -1958 -5181 -3690 -8206 -5457 -6396 -7364 -992 3139 -13718 -21798 -12289 -4122 -9346 -31618
12417 -31618 -29318 -12781 -9372 -5899 -19173 -26876 -20332 -16486 -20068 -5345 13701 19836 30824
12404 30824 31012 27451 31906 33745 41574 41549 43833 54928 43252 16169 14070 12956 9219 1038
12390 1038 -8151 -6511 -10617 -10279 -20306 -27959 -34714 -29943 -20584 -16268 -23014 -20528 -15797 -11003 -11743
12375 -11743 -19519 -14454 -1906 -5282 -13198 -7228 2816 5825 20916 22257 16775 15292 -5347
12362 -5347 -3551 463 -5961 2429 5697 42 -4612 -22419 -9058 1507 13372 16530 14929 9538
12348 9538 -11165 -22729 -30825 -19040 -13951 -22472 -23560 -19925 -21542 -22127 -17611 3425 18875 4937
12334 4937 237 2154 1940 -11814 -12554 9229 24272 22750 24707 26703 21860 8373 -1583 5296
12320 5296 6272 -1929 -3010 4723 2108 -454 9188 6191 -3997 -10868 -4917 -6296 -7294 -13930 -18224
12305 -18224 -25366 -30377 -21393 -18247 -22728 -17896 -12956 -8680 -17443 -11654 -4604 -1087 -1390 10515
12291 10515 18118 17772 22610 42632 65824 70389 73616 64223 37201 22052 25900 22235 18359 18037
12277 18037 26836 15635 9876 19310 13846 10956 10270 8402 7177 20239 22073 16430 5533 -3857
12263 -3857 9414 133 -8349 -107 -1867 4809 8427 -1967 -21685 -13815 2184 13821 10092
12250 10092 8695 -973 -11790 -22507 3580 17120 26303 24671 14974 8563 4578 2952 -4672
12237 -4672 -2391 14950 13966 -1204 -10093 -9296 -3174 -7917 -12871 -10755 -5725 710 -9432 -7241
12223 -7241 7491 14372 13316 7936 -2385 -18547 -25795 -19497 -15847 -2396 -9489 -15230 -10159 -19091
12209 -19091 -4062 9467 13218 3842 -8273 -20052 -18582 -20106 -15425 -11393 -6696 -5932 -5093 -8180
12195 -8180 -11721 -706 -2781 -11180 -6445 3218 -13549 -24051 -26650 -42904 -26461 -8930 -11678
12182 -11678 -20821 -11882 -13914 -9831 -836 -3830 -14553 -658 17168 2940 -19092 -21040 -6281
12169 -6281 -97 4351 -3888 -9117 -4626 -8441 -2435 4450 -5329 -11636 -6269 -1777 5403 -104 -16130
12154 -16130 -22370 -4322 12097 8751 8578 7499 -2656 -4263 4885 -5286 -19500 -10797 -17638
12141 -17638 -21930 -27386 -37314 -26055 -12306 -8610 -2374 -9325 -23954 -18253 -15726 -18350 -12874 3037
12127 3037 -10122 -20855 -17723 -23152 -13906 -7957 -18380 -28669 -18814 -8457 -418 -2007 7202
12114 7202 -1836 -2344 15195 14662 6570 5154 11395 6787 -9513 -17220 -21216 -18000 -4730 -233
12100 -233 -1797 -1983 -11411 -28817 -24303 -12622 -4992 17959 26751 22422 46569 61267 52933 37254
12086 37254 20139 -6254 -11074 87 -3982 1390 6713 4918 -6873 4575 3848 7651 6018
12073 6018 6754 2031 2617 832 1194 9421 7772 -5959 -18523 -18630 -13650 1321 -9494 -5693 -759
12058 -759 2182 9351 6002 -6583 -1501 9536 -400 -16001 -12689 -8895 -6090 -4209 -3904 -3525 -690
12043 -690 14051 10737 -3360 -9662 -1771 12088 14118 10301 12595 9692 20423 29524 31449 40192
12029 40192 48697 82729 114325 90496 47940 9463 1352 15689 21601 22573 21865 22738 27130 10436
12015 10436 6244 481 -1482 -2175 -1629 -2881 -11132 -18072 -14278 -1855 7287 3399 -3014 -8755 -5419
12000 -5419 1657 5589 1647 -1200 -1256 43 -724 -1402 -5798 -11069 -4325 6316 2250 2168 -6973 -22705
11984 -22705 -7909 533 -14480 -13863 -11466 -26800 -18995 -3940 -11041 -9511 -8993 -6983 -4784 6461
11970 6461 11297 24160 22314 24508 37813 30186 29488 45833 71346 102287 125877 177641 303731
11957 303731 500649 822931 1168269 1184730 830458 474874 282138 188808 131785 93655
11947 93655 77754 55728 42402 28914 18935 6246 -2379 3968 13506 21943 24331 17773 5695
11934 5695 1880 12255 29294 31078 12871 7592 12480 3542 6990 5765 15235 22202 12732 -570
11920 -570 717 5114 5015 -799 -2020 -3710 -6766 10311 20023 15823 6405 -4528 -9841 -10870 -12507
11905 -12507 -8919 1099 8264 12210 590 -1132 11482 14873 25450 10728 -347 -386 -3485
11892 -3485 -4899 -2293 -6415 -13060 -9692 -3957 -8678 -31177 -34163 -18630 -9882 -8147 -4223 -3534
11878 -3534 -7310 2999 5699 166 -8013 -12695 -11816 -2535 6854 6854 3708 -10813 -27093 -24171 -17286
11863 -17286 -9015 -502 -1826 3966 2416 -1135 544 -9750 1312 9104 1084 -578 3305 3520
11849 3520 -678 796 -2166 4492 6037 4891 16983 31623 31682 33003 34509 25811 14070 8388
11835 8388 -2802 -12038 -12463 -5946 -5454 -6020 6568 14801 12093 15655 2609 -4968 9544 8658 10862
11820 10862 9461 11158 -323 -9923 -6415 -2241 -10928 -22289 -18276 -21582 -23911 -22877 -16492 1641
11806 1641 1729 -9526 -8597 -500 5268 -10091 -11841 -8584 -15572 -11374 1308 21870 23845 6171
11792 6171 427 -2091 5164 14812 9617 -9896 -24113 -14271 -26031 -18032 -14090 -15972 -12420 -6300
11778 -6300 -4313 -3338 -12209 -12620 -18038 -5644 -4752 -6492 -3935 -860 -4412 -8359 -4767 4429 -4581
11763 -4581 -5930 -4458 4271 2250 -5195 -11969 6208 15557 19324 19890 24196 8074 -5244 -3623
11749 -3623 -1779 -3572 -4559 -9616 -25912 -14978 -13389 -10579 -10480 -12869 -11905 -12594 -6973 -5942 -20959
11734 -20959 -28600 -22869 -13109 -17702 -14739 -14459 -10868 -8342 -8943 4099 11610 15173 12877 1267
11720 1267 1269 4811 7318 10428 -598 -22886 -15276 -2894 -6704 4782 13051 13868 5623 -2650 -761
11705 -761 8204 7882 -9488 -12935 -5110 2723 2172 -7426 -20865 -17075 -7077 -28850 -10381 1695
11691 1695 -2352 -2826 2580 -5341 -10880 -9593 -3836 -5700 -15324 -21176 -11256 -1154 113 1103 6368
11676 6368 1533 -2970 -6751 -21331 -17527 -17055 -21711 -19856 -11662 1174 -6144 -4509 6777 -2117
11662 -2117 -14127 -12786 -8926 4629 15920 12846 13967 15621 -2134 -1939 1751 7780 11661 -47
11648 -47 -12220 -10132 1586 -648 13032 17533 1553 -3152 -7087 10969 11272 -714 -12267 -21463
11634 -21463 -28265 -29836 -24287 -16147 -2025 843 6344 1056 -9504 -11323 -12532 -10000 -20154 -13236
11620 -13236 -2762 1196 3324 22696 30984 22235 29238 32397 18042 13621 6166 8681 9861 3233
11606 3233 12090 20188 20799 28176 22903 25218 28768 16094 21254 9986 15182 7647 -13454 -16713
11592 -16713 7627 25074 22425 17183 5856 -1240 215 8209 14657 8534 9807 9322 2718 4342
11578 4342 3624 3867 327 6701 10791 1506 -7603 10846 21858 18350 5978 -3301 3731 9051
11564 9051 7659 10045 12710 19845 12332 18063 24633 15343 10597 6502 -1366 15499 6945 -8192
11550 -8192 -18270 -7011 5887 5505 12732 19845 17905 6733 -8210 1936 16071 19600 21567
11537 21567 24418 32426 26414 12760 -1677 4186 1162 -9265 -8654 1291 4298 7942 10714 3225
11523 3225 -16105 -26377 -31541 -20990 -11155 -13108 -11121 7738 -3282 -8718 3099 16382 20198
11510 20198 15034 980 -6296 288 10415 16864 17238 11288 11357 14977 12277 18087 17515 26822 29774
11495 29774 3354 -482 -772 1424 21222 31066 21572 10221 12213 8460 10280 9852 -3455 -767
11481 -767 6505 4163 11370 12438 2568 2488 13460 12386 16499 13449 13405 10092 12579 11310 14090 15931
11465 15931 -3650 -8517 -2518 8032 -1990 -9987 -4337 -441 1458 9485 17907 16272 7222 -2464
11451 -2464 -2993 -4511 -11134 4611 22200 30971 23182 14697 14355 16014 13426 4590 14251 16139 15165
11436 15165 15602 13941 23311 43789 33877 28840 29748 17226 2500 411 -2331 7075 12900 20779
11422 20779 33524 27244 4387 -2966 9651 18696 10957 19632 12609 -10948 -19004 -10480 -3891
11409 -3891 -7113 -20608 -24536 -14131 -20091 -10291 1876 11472 10174 3727 7096 3269 16312 26232
11395 26232 17753 3657 13184 10294 -1532 4721 -1980 -6663 -5448 -792 -4121 -658 -4253 15222
11381 15222 27265 24159 14190 11549 20736 23801 17257 12250 -8818 -14166 -6246 -1335 7461 10109
11367 10109 4963 -969 4577 4795 2172 6807 904 -3507 -2037 -3876 7815 23214 22713 6205
11353 6205 3123 5225 -352 1635 13137 5383 2520 9262 16752 19905 17797 12351 18976 34165
11339 34165 30651 12963 2995 -4681 12048 29753 38774 33049 29843 35741 29248 33423 36953 44746
11325 44746 48269 37245 27618 41074 52470 44384 24961 17521 29203 30960 23537 20982 29574
11312 29574 22533 30114 53829 53469 41226 43447 44389 30741 27074 31768 28799 24988 18167 4108
11298 4108 887 -11135 -5589 21769 24491 22630 20580 10116 4964 20935 32589 36910 28147
11285 28147 15865 5588 6244 9375 -6648 -10405 622 1552 1217 13401 -1628 -5887 2779 7590
11271 7590 21670 31030 21549 28915 34834 36138 37015 31089 28669 33558 28652 23852 30819 18158
11257 18158 5972 10546 29146 27201 27770 24456 13163 16811 16158 4959 3655 10847 9896 22550
11243 22550 26849 27936 20793 23357 29010 38181 31419 28356 30657 20965 25096 26162 35266 36675
11229 36675 23247 20307 26643 24372 22124 29201 22351 -7754 2387 11178 19259 28828 17822
11216 17822 5880 3873 6463 5688 3572 12170 6904 14578 18649 26733 28953 32929 26311 18398
11202 18398 11733 13226 12571 15163 18479 21427 9692 3963 -7220 332 22466 33332 26340 21280
11188 21280 17013 3852 5580 29636 45104 53048 36675 32169 31753 25660 21616 16598 19344 25632
11174 25632 37568 36964 47669 49868 38679 39458 39974 33221 32589 28578 20909 27543 32821 39045 29424
11159 29424 8977 19594 25596 20640 21369 27085 37676 34209 40222 41014 41442 34451 24010 17086
11145 17086 24938 43529 25216 26328 23776 11371 18546 14727 12267 27725 35676 37626 36078
11132 36078 27984 30912 30870 28063 29408 29814 38513 47218 28354 17211 20067 25270 13627 21208
11118 21208 22023 21002 29092 41853 42429 32363 31997 25378 36191 43886 41006 33411 51561 56288
11104 56288 49075 44921 49942 53500 55523 52715 50240 43896 39038 44533 47653 44609 57260 66522
11090 66522 66544 56246 54237 48046 45595 56129 50965 46976 55170 51669 41397 43342 40734 46901
11076 46901 54110 70785 57876 37666 43113 62210 57920 45577 47459 51545 51064 59387 69307
11063 69307 64572 57584 56978 61250 53537 38452 41353 47046 47041 30399 13895 20622 37794 42771
11049 42771 64915 69453 63411 58684 54411 67580 70996 69808 56322 53372 65310 75491 68010
11036 68010 63758 55725 50112 53247 55286 52288 54707 54066 70892 62719 51688 53666 61809 70235
11022 70235 79701 72275 60938 50657 46222 48597 55999 49934 40448 43587 53789 48599 54074 57337
11008 57337 49071 43829 51397 55130 57192 53587 49528 48220 60367 68065 67479 57716 46832 56849
10994 56849 63948 68595 69115 75485 81565 82772 70196 64600 55568 51300 57616 69288 83699 75181
10980 75181 55614 48829 57478 61066 67901 75362 76491 77315 77169 73425 66024 72161 62103 54822
10966 54822 56672 59298 66648 66696 70136 93126 94214 85212 72112 74327 82511 86008 96341 83785
10952 83785 80649 78849 74242 75893 87283 94777 95623 95865 94252 104660 96677 72433 72727 79161
10938 79161 85059 81970 81472 71501 64695 62530 75756 88862 96483 95508 91992 100984 109733 107533
10924 107533 115326 125425 119771 112371 104115 101843 97579 76790 81094 91593 100492 100882 102320 110431
10910 110431 108809 94214 85653 92885 103271 103937 112158 116323 115948 129761 135283 126738 117892 115342
10896 115342 115459 113881 113701 110446 116612 110153 114550 110476 113651 126649 137636 132274 130270 121516
10882 121516 117338 116329 131834 144431 139877 144132 152783 154964 150935 148688 147842 141229 131961 142916
10868 142916 145317 153676 160475 158696 160751 168230 154316 158391 161205 161188 163232 157633 161407 169561
10854 169561 181136 183647 192586 198894 188419 176356 179651 190521 183299 186533 199324 209143 207580
10841 207580 195157 182594 185016 182936 182498 187663 197039 206585 208213 204200 198514 191758 196392 201940
10827 201940 213256 224796 230597 221569 215528 216078 224369 227410 228103 230382 231046 233140 229675 229877 236347
10812 236347 243610 249472 248005 242205 239091 243073 240772 253943 275093 271370 259041 260670 271128
10799 271128 285268 288608 293259 297446 299442 304705 293882 293665 298420 293864 295113 308253 316914 310082
10785 310082 315847 320142 306161 298100 315760 333317 330093 331580 328573 322490 311992 303544 309288
10772 309288 308735 306746 318976 343847 342696 341673 340475 336076 330033 325822 329354 336853 344974 350204
10758 350204 359647 363880 356974 359854 378701 393077 376336 378084 378084 377479 384451 393998 403326 402229
10744 402229 404079 389366 392808 403943 405700 405940 404720 418499 425714 445415 453866 461494 472167
10731 472167 465631 466599 488958 505474 511338 503525 502959 513184 539404 560066 551992 536671 533031
10718 533031 526217 534595 537334 536448 529564 537082 569299 586057 583065 581571 567198 561139 581190
10705 581190 581963 568137 574942 598743 625491 623123 627115 633070 643780 643055 641015 657080 661633
10692 661633 666582 704879 720240 719747 720633 732503 747909 766205 775433 776612 790802 809903 821185
10679 821185 839616 854460 863834 873190 894711 916691 922828 936783 956304 961427 978115 997436
10667 997436 1017390 1039178 1046829 1057391 1078258 1086024 1092645 1094829 1107122 1147207 1180781 1199086
10655 1199086 1222994 1238785 1250460 1272424 1297496 1319689 1338849 1351649 1364658 1397061 1438051
10644 1438051 1461503 1482687 1500904 1525668 1559465 1600784 1629336 1659087 1680873 1708167 1753813
10633 1753813 1794555 1827933 1859962 1904747 1952688 2001285 2041953 2080944 2123187 2166319 2216584
10622 2216584 2272288 2340364 2396712 2451310 2519565 2573769 2638150 2710718 2775025 2852855 2925776
10611 2925776 3008671 3084601 3159806 3239197 3310702 3392175 3495836 3595320 3702674 3811713 3912084
10600 3912084 4022229 4141054 4268840 4401080 4530239 4670202 4821661 4962764 5120062
10591 5120062 5292671 5473591 5657379 5866008 6074843 6294295 6516158 6759562 7007747
10582 7007747 7251523 7518132 7824401 8136943 8445324 8774766 9137633 9513612 9913408
10573 9913408 10334689 10788658 11268430 11797168 12355899 12937361 13586361 14260772 14962073
10564 14962073 15731775 16556566 17428832 18374901 19398319 20485645 21652346 22905471 24250304
10555 24250304 25696390 27242432 28910769 30704971 32615072 34655477 36844412 39169796
10547 39169796 41630310 44240249 46988575 49864370 52833762 55885841 58979826 62064255
10539 62064255 65082520 67986103 70686360 73122321 75195340 76847385 78028592 78681761
10531 78681761 78769652 78304459 77317324 75843320 73949329 71691592 69131699 66374814 63492788
10522 63492788 60511969 57520844 54553579 51654994 48836285 46132968 43553302 41120049
10514 41120049 38818759 36655290 34629230 32731305 30957534 29288384 27699844 26229433
10506 26229433 24859264 23553582 22345646 21202510 20126767 19147381 18224536 17375774
10498 17375774 16590482 15837019 15119642 14450416 13818178 13243612 12706102 12187550 11698372
10489 11698372 11230296 10795195 10394907 10003539 9625219 9273813 8939309 8616920 8319753
10480 8319753 8026188 7752178 7502193 7270849 7040756 6821145 6606291 6388169 6202399
10471 6202399 6030375 5858621 5691621 5535837 5375852 5239181 5092690 4938929 4804092
10462 4804092 4674078 4564603 4452594 4339906 4237300 4133747 4046066 3951398 3846721 3739655
10452 3739655 3659260 3596300 3521651 3445676 3379522 3308017 3234334 3157156 3088556 3030474 2960065
10441 2960065 2890915 2841306 2798283 2740299 2693609 2651097 2610319 2569379 2530554 2484257 2453658
10430 2453658 2421461 2378900 2335157 2301986 2271863 2241673 2194725 2132304 2083068 2045536 2026926
10419 2026926 2005505 1983264 1956254 1922072 1869989 1839075 1813429 1779827 1738783 1711787 1698526
10408 1698526 1669875 1643947 1633809 1607116 1577816 1559839 1538467 1508536 1483429 1476464 1465558
10397 1465558 1449268 1432805 1420924 1413652 1390641 1370831 1358618 1320321 1301501 1284143 1276655 1266313
10385 1266313 1240948 1222636 1200990 1186127 1177004 1167442 1159538 1141804 1127606 1110862 1093259 1086066
10373 1086066 1075943 1066499 1051163 1027679 1022152 1025017 1010867 988451 976421 964876 952292 954108
10361 954108 945187 935675 929956 915936 884022 880005 889530 885037 871373 864362 848838 842322 838221
10348 838221 839077 833603 831316 826036 809635 795467 778799 785257 800179 796732 791223 779759 768594
10335 768594 768430 752295 739572 729162 722134 717144 691736 686530 692246 695421 687735 679695 679665 679617
10321 679617 691354 693277 678249 671749 664874 656571 643167 636805 620954 614757 601371 590677 587460
10308 587460 567856 569172 558816 542141 534620 544740 546976 557706 543989 541555 534091 520029
10296 520029 522784 525053 517246 508404 512065 517010 500847 492703 480086 480144 482212 485362 491428 498792
10282 498792 499856 472596 462694 476523 479926 473021 474593 461575 460665 462783 468870 459059 448802
10269 448802 435548 432223 439155 434099 438075 444253 443727 443383 445445 433631 421494 421644 424602 429029
10255 429029 438729 446527 439105 417760 393051 383690 393557 392889 391583 406716 412851 409069 405904 399113
10241 399113 395078 392203 388635 391413 386334 383286 385237 382999 376699 377480 379148 377580 370660 362417
10227 362417 366683 361883 350890 348967 367696 375202 380120 371092 363257 372887 374393 365914 362989 357200
10213 357200 354082 345716 342275 326758 329100 340807 340478 335534 326366 325048 320578 322718 333238 345817
10199 345817 336327 311750 301990 311041 309772 315047 320378 324383 325626 317040 299416 295240 298699 296606
10185 296606 290529 288198 291130 298305 289103 288788 294526 308042 314636 298036 295232 290498 283004 285455
10171 285455 279511 276667 283106 280364 270671 272763 281862 281658 287964 283567 280579 283387 278328 276942
10157 276942 272902 277186 285965 283036 279258 282136 271176 266415 279546 286636 279100 271321 270717 280142
10143 280142 278740 255796 250626 263659 273171 279755 274946 267778 268803 279424 280590 276621 284835
10130 284835 290076 290664 290791 292754 294989 285197 282689 283656 285202 274666 274086 271955 274348 273376 268961
10115 268961 263344 254037 254583 246187 255797 265713 260429 258177 263531 256956 250998 250192 252858 269843
10101 269843 260761 263814 267714 267548 264449 266229 264376 266884 271783 264254 268005 260597 263183 263036 264270
10086 264270 272586 266674 258109 257657 258270 265761 274445 274228 274280 269807 261598 254981 248966 250028 257279
10071 257279 257991 265030 272909 269590 249859 253868 259203 257354 250065 243215 233657 236218 251752 262250
10057 262250 264322 256937 249314 242363 229846 231105 245634 241847 239119 241119 250054 257982 259070 231504
10043 231504 222095 219856 223797 236735 239964 245102 255006 246504 243198 249198 261633 267896 265615 267296
10029 267296 265145 266896 266073 272887 272590 279610 278833 296403 318504 355118 414911 522892 708078
10016 708078 1014080 1139636 887147 583067 436491 387759 350675 315563 294362 286700 279361
10005 279361 278266 280225 275164 263901 264964 264055 264717 271215 276024 266016 257610 251171 249228 244585
9991 244585 244794 250521 236245 229294 245659 259334 254838 250408 245321 245904 250246 260506 264628 257789
9977 257789 255473 260606 267470 268436 250335 257451 246286 233818 223871 226114 229599 235820 240638 251946
9963 251946 252843 262957 273416 262983 261044 260287 254816 244235 243333 250486 248292 244724 245217 247168
9949 247168 259879 275001 273072 263830 278640 287023 303865 329660 371675 435069 551364 655681
9937 655681 661574 553339 441823 355337 318825 284381 268920 269637 279188 289688 287001 281519
9925 281519 272299 266289 255949 242574 244832 259737 248100 229930 222408 239274 247229 247873 253332
9912 253332 259313 270380 274243 274055 262458 246701 236517 242139 246849 247426 240037 235682 233794 231742
9898 231742 244848 254332 247358 239498 247736 259471 271911 271406 264461 255120 256058 259179 273050 275239
9884 275239 271347 259159 244709 250560 273716 290984 281861 270758 275688 264172 261943 270282 267227
9871 267227 273154 254733 251767 266510 272218 265644 264218 259546 254542 248589 248292 257868 265623 249206
9857 249206 242489 246809 256823 263184 268330 280497 264578 256768 271489 292102 294882 293856 293445
9844 293445 288741 278192 278147 273361 265307 263072 275395 283262 279175 278140 277249 279853 298693 301476
9830 301476 291734 284118 288351 291812 289777 288072 282295 277558 273254 269930 282532 301843 309027 321992
9816 321992 321544 319215 312686 298603 288374 282549 284876 289510 294431 289066 278916 292012 302865
9803 302865 293047 296749 293826 266662 252959 260936 260817 255018 269024 280794 286253 280557 266985
9790 266985 266516 275717 288273 277236 279666 284060 286794 301427 295194 283304 297294 296830 294173 284829
9776 284829 276297 283443 295389 269296 249855 258850 269867 275771 272283 268301 266458 270694 271353 270656
9762 270656 260807 252349 249296 235315 232746 239185 249049 267051 271605 255151 257523 275339 286512
9749 286512 294886 292568 282431 271095 284901 288744 288681 299599 309003 305750 303925 297843 299569 297673
9735 297673 276712 259468 251972 243221 238550 247049 249382 256440 248267 251806 256844 255708 276697 283737
9721 283737 270135 274167 279500 275627 283880 280526 264359 253415 241142 243445 244427 246783 254246 269816
9707 269816 270752 274972 283081 282016 270171 260617 240178 237430 230003 218441 221142 217307 229564 227674
9693 227674 214686 226074 235152 232118 229414 232132 229729 213344 196235 191500 206552 212548 207646
9680 207646 216622 235098 232354 230069 237548 232238 226318 214021 208844 219519 220863 219987 238781 238225
9666 238225 242106 242244 219893 207797 204204 209191 216254 212666 205845 202172 187256 190609 207260 210980
9652 210980 218785 224643 222716 224795 229934 224044 225429 221802 212794 204679 210639 210283 204596 209963 203567
9637 203567 194192 193929 196864 189926 190969 202419 196244 197807 195291 189007 184682 182387 183490 190659
9623 190659 209715 220223 213102 192906 186792 178968 174461 160900 155268 154773 168063 177572 165911
9610 165911 164759 171358 172559 178208 175284 151387 151428 170836 182226 178009 173550 172628 168765 159381
9596 159381 159718 165246 157086 151131 161281 149344 133907 145030 144882 151919 150818 155485 155308 154917
9582 154917 153323 150584 146427 136918 108338 101324 118611 135992 136763 128230 128795 141315 138963 122940
9568 122940 118100 126955 150497 145482 131543 133101 117440 113618 114179 111266 108313 101494 113262 130530
9554 130530 141029 138629 138217 120300 104891 112427 109712 111985 117345 118572 130436 132326 114538
9541 114538 110218 116579 115260 99251 92039 109497 111663 103381 113691 103288 88431 92212 93760
9528 93760 96213 105940 106936 98807 101091 98919 95384 96254 98964 100122 108737 110847 108636 112179 103789
9513 103789 97974 90555 89109 86974 80364 70786 67585 66525 72550 64943 64398 66616 89956 99279
9499 99279 102362 97845 89931 74731 85500 101013 105268 104714 90750 92375 83080 88079 87658 83911
9485 83911 78515 79399 68611 80526 91380 79997 77814 78019 75586 75815 75026 64612 71519 72723
9471 72723 73457 74728 67831 73197 85066 102605 105609 90554 76501 67656 74017 84403 71018
9458 71018 67474 64414 75620 88108 81570 69550 56695 52999 58204 73493 88732 94073 84510
9445 84510 71185 60201 57361 60623 69194 76398 75898 65751 62300 54674 51217 75385 85407 71603
9431 71603 76797 75466 85061 86083 71791 71148 70445 70868 63781 68335 71703 75563 67765 69480 80134
9416 80134 87982 84570 88914 96417 67861 62467 50319 53856 63075 53827 42608 43394 59160 66626
9402 66626 49108 49255 47196 44569 41100 45973 53828 56514 37663 42458 50923 48376 50711 68724
9388 68724 68318 63302 67360 58706 52510 54179 68758 59981 33038 20173 29316 41744 38684 43469
9374 43469 44772 48224 45991 49148 48788 42404 43565 43872 33279 36230 29639 13984 25117 38342
9360 38342 48304 48912 45192 52204 66240 64530 63126 67872 71520 68534 57330 63742 61932 70088
9346 70088 62820 58125 57277 58289 54473 58910 67757 69657 56322 50429 44312 49317 42690 34873 23691
9331 23691 27737 44519 61031 59234 44284 37214 51678 45442 26495 24586 24555 31917 35649 37400
9317 37400 44705 50031 52045 55112 73054 77440 69026 55977 46756 32005 31628 34835 34053 35489
9303 35489 32600 29524 34204 25888 33718 43147 42963 45450 47740 27726 6914 17834 35201 31188
9289 31188 34555 50925 51091 38838 38223 31230 27042 42122 35500 33263 46209 60969 72620 61976
9275 61976 50914 32140 32028 35683 27688 36383 42349 42125 43516 40891 27573 23983 23787 8478
9261 8478 12835 29730 42150 33220 19222 23295 42125 59807 39048 16481 19173 25553 30426
9248 30426 44444 49696 44335 35703 43072 45557 39478 28183 16386 9247 16492 18988 27359 30382
9234 30382 22553 26365 25779 34380 44580 41016 41644 40464 42515 40917 38417 37634 28912 28510 37799
9219 37799 42875 44109 53674 58146 65563 78012 90072 110580 126200 131733 119586 89184 58980
9206 58980 35458 30608 24676 28173 35205 29696 27625 28846 34540 34481 39338 37749 31769 26662 25613
9191 25613 10390 6436 15770 34965 44602 42217 33669 32657 51601 56907 59408 60336 62040 52710
9177 52710 43439 41227 36730 33442 27925 26379 30363 30192 36918 30867 38542 43105 41052 44259 30613
9162 30613 17371 24806 33084 25269 22059 25079 28115 22702 15482 5428 3629 -1951 6665 4141
9148 4141 -5009 -2067 6844 27092 33195 28402 21237 27062 42861 46811 25459 13501 14251 23345
9134 23345 27292 14067 -6573 -2739 10198 15465 11760 13912 17422 28271 32958 27568 28878 28561
9120 28561 31492 45827 55370 47848 34490 26311 6757 -1661 -2895 -6326 -2263 2637 12887 10770
9106 10770 12903 10079 8560 10972 4328 11334 20672 30061 34327 21188 20111 21284 38199 40136
9092 40136 34412 30476 35760 37157 21800 11449 18675 38318 42826 39542 35159 37090 38169 31663
9078 31663 40913 41913 34052 30166 11452 2457 13865 8292 6758 8213 10967 16635 13600 19655
9064 19655 28174 35681 30200 22254 22322 33175 19467 20535 27070 17193 13589 12419 3111 -4161 1046
9049 1046 151 7567 6096 12031 14123 20244 19570 16579 13327 8911 5267 3770 15148 28939 31325
9034 31325 34089 55204 64633 80126 79380 71167 63005 60276 56447 48935 55673 65977 79547 85441
9020 85441 94432 76332 62638 60803 62681 62070 45735 42649 30947 27380 38676 57000 80962
9007 80962 79292 69063 56647 56463 53434 45372 27115 35667 38002 34775 30140 25802 21094 23561
8993 23561 22535 37279 46661 55820 53279 53235 53129 43624 30638 25751 28006 41249 53157 72896
8979 72896 49285 37632 31858 17361 7979 17866 19648 15140 9655 15613 30885 43700 38641
8966 38641 36752 46749 51121 37496 34600 36989 47410 45368 40176 58757 98575 159415 198255
8953 198255 201611 165756 120643 85466 62019 53133 41855 16394 14596 29361 45180 41508
8941 41508 39603 43708 45981 53541 54139 67511 78028 107866 158767 213853 283453 317758 263564
8928 263564 178856 125081 99054 72386 62421 65607 67022 66592 51700 58455 63694 73079 99106
8915 99106 120744 150770 166876 148070 111223 84500 64589 51332 53340 65624 82293 76483
8903 76483 71229 72556 69204 69574 64146 68763 85574 97735 100346 95832 95301 142033 222486 307955
8889 307955 328465 263122 176152 115957 78537 45782 29733 28927 26696 38817 29643 11201
8877 11201 18193 20958 18818 24347 19492 19486 16855 11768 8977 11886 15575 23157 27268 30810 33199
8862 33199 30760 31555 32322 21592 11026 5598 12110 18898 15593 15817 16192 22016 40130 66065 94239
8847 94239 110282 135745 159927 178066 193825 207112 218513 229240 239323 238112 231666 192423
8835 192423 157309 135816 124374 109724 88358 65326 55759 47350 31287 33281 67932 84928
8823 84928 83713 84794 69434 69446 59154 45287 33235 24443 25318 50358 64799 58770 49486 38150
8809 38150 25400 21530 24230 17123 4401 -3113 -2286 -6561 -4496 -4386 1820 9406 12267 13453 21213
8794 21213 15900 3324 8945 32211 51641 53396 48385 53435 68961 84153 95230 105305 113334
8781 113334 109345 107952 114111 97394 63511 50435 56905 64568 48713 33603 42121 46589 44532
8768 44532 41072 51178 47436 24408 28981 28903 17619 18000 18899 6865 -1907 -3184 13157 31549
8754 31549 39946 41348 28386 19120 13181 9614 11077 14152 21312 22753 35186 37329 39223 39745
8740 39745 46686 29753 17506 19182 37158 33163 48533 84092 90601 83678 83280 74331 71988 73639
8726 73639 83799 103262 115970 129747 131736 148785 189423 226098 253615 280461 313586 322476
8714 322476 307259 285297 250227 209222 172593 140243 126865 116859 103686 90452 77932 80319
8702 80319 86081 94206 95304 86560 69287 60278 55446 60879 57340 51168 60955 68553 69967 63930
8688 63930 64517 66439 63360 67428 76775 77077 73044 63719 53309 54183 58083 66229 72401 85170 96560
8673 96560 107516 108985 118795 132767 142165 157609 161646 162080 152505 127457 115240 104749 115117
8660 115117 123385 139127 136002 133255 158111 172573 199213 232870 289604 325152 358860 385791
8648 385791 361707 313705 253863 209003 199649 197989 190316 196119 208329 217682 242510 284528 300148
8635 300148 310187 325481 329750 336878 356214 365376 381126 401441 409362 429233 445255 468263
8623 468263 496249 543544 616546 702786 763047 772192 731662 689539 658064 652902 656144 675036
8611 675036 691619 676304 616849 541972 473002 420119 370735 332206 286880 235917 203842 188719
8599 188719 166094 151187 133933 132135 123852 121812 119275 112074 96236 81447 75181 70338 69503
8586 69503 70196 69167 70082 80055 77112 64929 51669 29758 18481 30493 28634 31146 39765 61359
8572 61359 64975 65055 63539 73497 64032 58159 61037 73683 102963 145159 173413 190122 216811 268340
8558 268340 338387 337128 269562 184459 132335 96163 97991 118815 119580 117940 110385 104883 103185
8545 103185 93314 82664 65637 43100 23884 26580 28117 39641 45156 43757 49711 59859 75843
8532 75843 113105 134899 120942 106028 100656 89650 75527 83255 99308 116850 148212 204998
8520 204998 309247 390129 413780 368855 282690 200145 156809 119997 94741 91086 100250 107367
8508 107367 118756 146088 160558 180739 234650 263659 302932 381876 474129 563497 646265 761457
8496 761457 807073 650006 452763 327767 258388 209314 159914 123168 99509 89252 74768
8485 74768 71940 82021 80895 73290 60684 53339 48130 39037 38263 56846 61367 64761 82403 94817
8471 94817 80137 65006 53878 45024 65712 67686 52266 60503 83246 121796 159070 217372
8459 217372 312740 429800 477215 362040 205561 124577 91105 76554 63295 55818 50261
8448 50261 37033 33330 37967 38579 34918 31750 21737 8378 -5408 -8367 2299 13243 18103
8435 18103 6832 -4500 -10879 4915 19051 16910 17640 18624 20572 40764 41219 56623 69611 75604
8421 75604 79380 91101 110823 102794 71559 44147 39051 42021 28700 13413 12031 28273 32149
8408 32149 22749 26965 24075 19007 6795 9495 10938 11255 18435 21222 27041 24176 27639 36845 40830
8393 40830 35664 42459 48031 62787 64882 56493 65092 78401 84380 65432 76622 78654 90223
8380 90223 119214 147064 196058 271191 376282 486867 524663 428061 308969 212812 147119
8369 147119 111870 100689 93923 64541 37779 17332 21810 20648 12591 9497 11123 10242 -1445
8356 -1445 -1530 4162 16864 22580 20987 19555 20400 17686 17433 23960 30959 32747 39938 45499 62324
8341 62324 98070 136139 191400 251344 356394 460641 487244 393612 274937 190314 143781
8330 143781 107909 70451 54150 45986 36061 13543 4644 10768 5830 19954 23475 13839 3977
8317 3977 4138 9085 3545 -3899 2060 7777 364 -12165 -21533 -17737 -4321 8450 12977 16487
8303 16487 11245 6387 8816 5649 3522 2269 1210 12285 8569 -6126 -12323 -16006 -11898 932
8289 932 9117 5170 7792 11708 9797 8614 6855 -11646 -30498 -29574 -25780 -12511 -1704 -5444
8275 -5444 -5546 -8371 -15815 -18190 -15984 -14557 -17108 -19551 -24325 -26016 -28154 -30634 -17430 -13241 -5122
8260 -5122 2492 -3359 -11576 -7373 -10047 -7962 -2073 2645 10222 -617 -2166 -11304 -18100 -13332 -26169
8245 -26169 -34443 -23648 -9320 -14436 -23376 -31819 -27436 -11022 -7489 -9599 -12481 6307 16494
8232 16494 13396 1501 -8648 -10503 -3349 6685 14526 20024 9612 -9256 -23251 -23059 -6612
8219 -6612 -11767 -15394 -7638 2878 -1482 -8270 -5651 4227 4462 559 2520 5785 15574 21015 31078
8204 31078 34643 23443 25186 26389 647 -19445 -24476 -28339 -23274 -19130 -9670 -8574 -26651 -22473
8190 -22473 325 4284 -5283 -16509 -12814 -449 2574 4163 -1307 -2371 1350 -13612 -15573 -6794
8176 -6794 -3548 -5128 -15523 -11074 -2327 -2726 -4238 -15474 -5416 4979 -4493 1370 6336 7011
8162 7011 -22055 -33949 -32383 -33256 -28028 -8762 22 588 3150 7080 11816 15133 12196 149
8148 149 -4500 3338 4542 2 -2580 -2847 5837 11407 4611 -14214 -28522 -22329 -15557 -10301 -4294
8133 -4294 2943 4137 -5679 -17419 -28505 -10328 3819 8359 9699 10209 6254 4381 7611 5035
8119 5035 4236 9098 8822 4523 10079 7506 4478 1740 8057 15918 23801 19024 12816 1724 18394
8104 18394 30086 40210 32371 14231 8560 13727 9941 1700 -2269 13118 22773 21673 1469
8091 1469 -12466 -15648 -6103 -1190 10110 2460 -3525 -9035 7699 20066 22699 13946 22691 21351
8077 21351 22823 33994 32859 18658 18218 14152 22609 26209 20111 22797 48471 53426 51858 54901
8063 54901 68275 77162 75825 54723 47429 42568 44916 48936 42602 30540 27959 19744 27068 44541
8049 44541 56736 52435 34424 25697 22631 28434 33944 22042 22819 35778 33182 24167 45137 61380
8035 61380 58178 37576 28363 28690 37985 44147 48809 48356 66404 79408 66949 68156 64955 70920
8021 70920 86398 86630 96647 132312 146052 155426 144993 115511 105883 84396 72912 69311 75536
8008 75536 87799 80976 55653 43446 39119 31347 24046 48075 53470 41746 31535 22553 16416
7995 16416 16396 20285 20036 21694 27164 26766 25792 38728 55979 63853 66104 51293 38346 33935 35782
7980 35782 38292 32112 38084 49126 55976 45930 57491 74983 80857 69322 62038 58208 60957
7967 60957 52850 44389 32478 30919 29752 14491 12087 7562 7486 18149 28192 33884 45274 44975
7953 44975 44861 40229 22701 28648 33175 20320 -881 2009 16993 25025 27289 29162 29065 27222
7939 27222 11566 14778 15459 8300 18340 26322 16851 9855 4136 -2747 4903 13321 23619 24609
7925 24609 14889 9944 6186 6508 21647 14694 16452 8446 -890 10666 1646 -8525 -15322 -12024
7911 -12024 1079 1765 -1200 1973 4946 7011 1650 -3885 -5282 6560 22364 29801 17548 -4324
7897 -4324 -6604 -14017 -16204 -18267 -10188 3349 8631 2123 13231 6724 -5472 -13856 -12606 -1434
7883 -1434 4226 2890 -1017 -2182 899 -2611 -11481 -20264 -31303 -41145 -37497 -24410 -5294 7981
7869 7981 7714 1266 2020 10085 11669 -6853 -10756 283 4013 4074 -9417 -10031 -1800 -6336 -20731
7854 -20731 -13762 -8530 -7751 4456 -1409 -7997 -8878 -8853 -7776 -5070 -10286 -13995 -12942 -22584 -27623
7839 -27623 -23125 -11664 5628 18981 18270 5831 -1210 -38 1936 2281 -1805 -1457 5943 -674
7825 -674 -10565 -4626 -6084 5932 12773 13485 18873 19440 10977 1793 -5097 -2609 1576 9010 -9499
7810 -9499 -19091 -24017 -10254 -13114 -10369 3978 1199 516 9222 3827 -4322 714 -1338 -4488 -5119
7795 -5119 -383 10489 7579 4012 -2811 -20031 -15217 -14390 -11475 3846 -6905 -9571 -22001 -24939
7781 -24939 -11709 -2808 -9942 -30146 -25551 -17693 -23057 -16543 -9718 -21020 -11885 -5899 -6038 -5589
7767 -5589 -240 -9327 -19518 -24513 -26447 -22131 -18493 -14377 -14818 -20937 -32309 -32080 -19530 -28203 -19626
7752 -19626 -10673 -19968 -10614 2437 -1064 2511 -758 -15739 -29985 -33977 -23495 -22304 -21173 -8879
7738 -8879 -1978 10312 10838 2770 8139 517 -10594 -15851 -14682 -21270 -17791 -13660 -18369 -21710 -18607
7723 -18607 -19788 -15365 -12038 1520 8170 8480 4346 9129 6350 -536 -587 -747 10032 11492 10172
7708 10172 4556 -3260 2120 -5789 -13292 -15542 -17995 -13938 -18945 -17526 -19575 -28910 -25563 -15268
7694 -15268 -14671 -16016 -8172 -14124 -14482 -7798 -28 13534 14561 -2669 -14007 -1123 10283 12659
7680 12659 15878 -2517 -12207 -8234 -15056 -26203 -21214 -1939 -6053 -21679 -19209 -13784 4051
7667 4051 -41 -853 1934 -12659 -14194 -9983 -21149 -22986 -18556 -14170 -17323 -25376 -17514 -4541
7653 -4541 -76 4660 2309 -1461 -6195 -20707 -25044 -36957 -24671 -12965 -21442 -21248 -12054 -16452
7639 -16452 -21404 -22306 -31970 -39414 -38271 -26925 -18257 -7780 2778 -5219 -22299 -20294 -2856 -7976
7625 -7976 319 1605 -5808 -17399 -26647 -23252 -21385 -20860 -8425 3544 11375 8455 2262 2455 7647
7610 7647 12126 21628 14224 -2245 -8609 -8450 -14022 -8814 -13186 -16904 -1451 4764 5385 -455 -15746
7595 -15746 -18290 3367 14490 -5586 -20528 -21905 -15503 -18847 -22583 -15731 -21282 -29891 -27400 -17607
7581 -17607 -12623 -3686 -7787 -17670 -21625 -13758 -10385 5789 7157 -16680 -17679 -4126 4905 8694
7567 8694 12129 6006 2015 1046 -779 -12434 -7061 -4891 1047 7850 13257 5871 -10223 -25750
7553 -25750 -20259 -17817 -23954 -13501 -18920 -23568 -13616 -12965 -22818 -18822 -10887 -9126 -2295 10071
7539 10071 5389 -8711 -8749 5318 263 -4530 -7912 -18550 -433 7733 -327 814 -2740 5631
7525 5631 7665 -1677 -5367 -60 1704 -10763 -21807 -31453 -10630 13143 14065 10710 -3597 -20976
7511 -20976 -17415 1816 10895 381 -4539 -2977 -3137 -10127 -18708 -18901 -9814 -5378 -8228 -5059 -19198
7496 -19198 -25673 -34620 -39644 -28126 -8075 -8381 -7599 8374 14749 2240 -6995 -160 -4771 -19020
7482 -19020 -15711 -19612 -26574 -26377 -22920 -17447 -23567 -21935 -18309 -15254 -12028 -3992 -3167 -19783 -24592
7467 -24592 -25461 -17042 -14098 -20335 -17117 -10126 -16223 -21900 -14787 -16563 -16536 -11133 -5919 -6947 -5343
7452 -5343 1961 -353 -8881 -12927 -11209 -24507 -22647 -20061 -32963 -31023 -16463 -6753 -3650 -7692
7438 -7692 -7487 -7419 -1825 7121 10675 6484 7546 3466 926 2828 8288 -2788 -15148 -16092 -18895
7423 -18895 -29871 -14312 -13022 -15865 -19281 -21480 -17814 -24341 -17963 -25122 -19913 -7019 3007 -5550
7409 -5550 -7340 -8361 -11738 -16698 -23740 -15416 -6139 -4600 -7942 -12897 -26957 -9747 7691 5247
7395 5247 -20388 -30910 -20528 -14780 -11647 -13810 -19207 -16762 -23476 -14016 -11684 -12173 -20388 -21690
7381 -21690 -11009 -14264 -21375 -15190 -28686 -31068 -22951 -11565 -19944 -26371 -12113 -5913 -4437 -7050
7367 -7050 -12232 -6668 1925 13505 8004 -13419 -27562 -19822 -12131 -16057 -14513 7327 21030 15758
7353 15758 15166 15776 16242 8006 -10576 -10607 -1661 -13045 -18592 -10060 -4385 -3323 -15431 -21732 -18502
7338 -18502 -16572 -21625 -27390 -29312 -14148 -20352 -19963 -16415 -12397 -10589 -15425 -16000 -5054 -4531 -4036
7323 -4036 -7102 -12242 -18135 -20643 -13484 1467 12841 7647 3889 -972 -7891 -23412 -32679 -19507
7309 -19507 -8464 -12632 -20462 -28130 -28337 -24802 -17423 -12041 -16707 -13735 -18834 -17244 -14998 -18349 -28222
7294 -28222 -29759 -26111 -12183 -9182 1280 15460 13229 8769 2647 -1474 -738 1731 1635 -4735 -16469
7279 -16469 -26501 -29751 -28396 -17561 -199 11169 5329 -9139 -178 -3836 -24787 -30405 -23962
7266 -23962 -27723 -32016 -24209 -17010 -280 7244 4247 -16042 -24311 -23839 -18973 -14851 -13257 -10756
7252 -10756 -12435 -26626 -13579 2275 14656 10990 545 -11820 -11781 -13946 -23345 -18916 -10786 -4049
7238 -4049 4321 12519 8430 -1549 -1539 -12946 -10077 113 77 -11812 -8700 2610 8267 3861 -7767
7223 -7767 -13096 -14277 -16303 -25912 -16414 -6157 -1259 -22777 -20878 -11818 -2310 -9498 -4073 -7794
7209 -7794 -12292 -12701 -8078 -136 -5325 -2298 -2448 -1798 -7043 4875 3026 -20616 -23637 -24991 -21957
7194 -21957 -7216 -6163 1890 -6215 -5610 -7311 -6954 -8521 5798 18633 -124 -3245 -3457 8213
7180 8213 15576 1866 -9229 -6600 -23668 -20107 -8173 -4284 6890 14507 6786 6389 -1411 -3819
7166 -3819 -6566 -19106 -14923 -454 -5598 -4124 -7072 -15223 -24255 -10984 -17108 -27421 -23803 -26994
7152 -26994 -29540 -32174 -29083 -8410 -24174 -31793 -16670 -848 -13616 -23080 -20890 -14478 -5901
7139 -5901 -3826 -20765 -28243 -28664 -27394 -25542 -27128 -18161 -18665 -26253 -10265 6444 8550 8381 -2703
7124 -2703 -13632 -19119 -24679 -25379 -22499 -20976 -27390 -28687 -34636 -37616 -22778 -13692 -18888 -11782 -4186
7109 -4186 -10706 -22992 -28020 -18153 -8761 -13634 -19508 -23167 -18946 -26071 -21419 -18244 -13953 -3570
7095 -3570 -2132 -4434 1132 2983 314 -4820 -10734 -20157 -24358 -23835 -21984 -14494 -10352 -10198 -4251
7080 -4251 2880 -3448 3051 6726 -4611 -8636 -12555 -26865 -21404 -15044 -18513 -21853 -24292 -28226
7066 -28226 -25049 -17199 -17923 -23876 -23552 -21165 -21842 -29941 -32179 -31748 -29616 -25553 -18352 -12484 -14147 -20217
7050 -20217 -12266 -2798 -10772 -13246 -13531 -10838 -15711 -7433 -3022 1005 -3056 -20194 -34305 -25875
7036 -25875 -17644 -10936 -12524 -1402 3754 -11024 -16722 -14866 -8891 -10776 -22681 -27044 -26869 -20254
7022 -20254 -9856 -17128 -23462 -34955 -23101 -22464 -10686 6588 9987 2329 6015 13394 12585 -1391
7008 -1391 1454 8171 8826 -8072 -18779 -16782 -2120 -2444 -9295 -9280 -14221 -12381 -16445 -11618 -5361
6993 -5361 -10482 -13377 -6207 -10400 -14873 -20408 -10781 -14353 -27308 -31188 -20677 -22915 -24103 -28716
6979 -28716 -26015 -21525 -21270 -28750 -16772 -4851 2453 -4630 -18433 -19648 -19539 -15257 -10928 -4947
6965 -4947 1720 -4335 -7233 -844 2444 -3814 212 4802 -4377 -3914 -6654 -8923 -6773 1741 6999
6950 6999 -9204 -6966 3946 -4962 1173 6628 -3729 -2979 3888 -10326 -18729 -19499 -15760 -6705
6936 -6705 -95 3483 -619 5825 -4279 -4221 2854 4866 2755 -4424 -13617 -17210 -25233 -21529 -23661
6921 -23661 -25771 -26495 -13672 -8388 -13894 -25045 -14940 -6687 -17783 -21119 -15480 -8432 -4061 -18576
6907 -18576 -23829 -22173 -19544 138 36 1253 -11319 -25355 -22858 -19597 -12672 -8435 -10739 -24427
6893 -24427 -20847 -22510 -18731 -28252 -35099 -34650 -28803 -13922 -13234 -6254 1971 11253 20026 32865 37155
6878 37155 54804 101649 115130 85028 44989 24100 17192 18876 -8699 -23077 -14470 -7382 -7809
6865 -7809 -17915 -22110 -17707 -11573 -12421 -14375 -13477 -11657 7126 9930 9272 1877 -16263 -9421 14718
6850 14718 12177 -1578 -15819 -24294 -15626 -26721 -26241 -19769 -10251 -7874 -14393 -18287 -15164 -12751
6836 -12751 -24004 -28608 -23984 -21856 -19937 -24034 -16740 -4011 8342 -1123 1168 15841 19232 21144
6822 21144 19541 14964 13096 21476 20237 11224 17208 12097 -673 839 9395 12138 -1362 -6316
6808 -6316 10721 3912 -1593 -21779 -37087 -25175 -11398 4575 287 -20120 -34920 -26211 -15859
6795 -15859 -9057 396 17980 6876 3177 10843 21320 25024 24474 13188 -5784 -9116 -12531 -16080
6781 -16080 -12091 -17972 -18768 -10685 -6015 -7735 -12547 -21708 -30089 -33912 -42741 -34108 -22562 -16744 -27861
6766 -27861 -38394 -26338 -10255 -11155 -14218 -15614 -14097 -17193 -10525 -14732 -13173 -6803 -10708 -18230
6752 -18230 -7523 11687 12081 9764 16784 17532 20991 19840 -6173 -9841 -8333 -20266 -33446 -25661
6738 -25661 434 2623 -8760 -968 -3707 -1276 9711 11800 2695 275 -2955 9223 12074 9378
6724 9378 10980 -1040 -13243 -10911 -911 6083 9370 10976 15191 5109 -4512 -7786 -4528 3542
6710 3542 1396 -4971 6285 9696 9184 18613 662 -16918 -20784 -14772 -5356 -14790 -24764 -19838
6696 -19838 -10495 -4935 -9502 351 -6306 -12286 -13778 -16832 -20370 -18120 -12157 -6891 -11797 -7518 -3403
6681 -3403 539 9540 5401 -4416 -7666 -7114 -6082 2611 201 4538 -4129 -956 -1723 -8373 -11451
6666 -11451 -19238 -10147 -6250 -2357 -4624 -7844 -3937 137 4651 19193 16324 21983 12257 1691
6652 1691 -739 966 2757 -13157 -17720 -14366 -5788 -8841 -14121 -9883 -14104 -20828 -25421 -34775 -16876
6637 -16876 -6217 -13398 -25748 -16689 -14687 -22145 -3289 5218 -5194 -11940 -15743 -6934 -8392 -12230
6623 -12230 -19614 -21833 -22620 -27118 -13621 -8351 260 -2828 -6962 -5684 -5786 -4653 -16878 -23569 -12144
6608 -12144 -8339 -12339 -19323 -22938 -20579 -14778 -14418 -16237 -9756 6888 15967 7422 -712 -3100 -1847
6593 -1847 909 -8559 -13503 -1034 812 -9758 -17088 -6141 2103 2332 275 885 -7287 -19546
6579 -19546 -20157 -19371 -25674 -30654 -29445 -25733 -23944 -13157 688 -2438 -7595 -12328 -20407 -26586 -17835
6564 -17835 -10994 -1144 -5661 1802 9142 -2567 -9499 -7253 -6493 -6523 -5524 403 10384 14419 3635
6549 3635 -10 8926 7308 7096 13908 19616 14892 14055 19450 29656 22714 5169 -5249 -10577 -4225
6534 -4225 -4019 -2467 -4883 -5939 -10107 -19577 -15406 -13740 -19820 -27301 -23060 -18203 -23595 -12552 -11686
6519 -11686 -8622 -13346 -18007 -13404 -12053 -1146 -5036 -6791 1410 -8334 -10422 -5290 -9030 -4464
6505 -4464 316 1494 -7302 -13898 -20796 -16324 -19364 -21769 -17104 -2335 6261 3421 -5270 3749 10673
6490 10673 2751 7466 28465 36087 21728 9698 918 -18744 -14689 -9598 -7516 -7156 5267 -6813
6476 -6813 -13743 -14689 -11363 -2742 -1002 2306 5120 -2439 6545 -2885 -18143 -18140 -9706 -8938 -15799 -11751
6460 -11751 -19056 -16538 -15566 -12410 -592 6220 -4508 -5850 -5428 -6753 6149 18993 17433 4210
6446 4210 375 -9387 -5690 3687 -9241 -10366 978 319 -1798 -9699 -5412 -5595 10557 9136 6709
6431 6709 5359 -785 -15820 -19234 -21496 -21162 -14918 -7686 2986 8350 9865 14233 12526 1894
6417 1894 11703 6428 -945 -89 4695 3974 -2157 -1356 5013 23716 21364 7064 -14024 -16952 -13914
6402 -13914 -19754 -18096 -18260 -22617 -6312 3137 -8184 -17914 -20899 -8540 -9653 -4595 -620 2175
6388 2175 -3038 -11525 -13922 -9816 -8253 -13553 -16694 -19576 -33787 -24778 -11944 -7333 -11649 -18022
6374 -18022 -33176 -25641 -16322 -8835 -11652 -10145 -10856 -10913 -12861 -8383 -15387 -6467 -4572 -10744 -22205
6359 -22205 -24254 6487 19341 8290 -849 16337 25019 24437 24836 12540 3643 1259 -9844 -7779
6345 -7779 -6270 -8930 -20025 -21770 -3598 2616 460 -16562 -17907 -16857 -11488 -24944 -17969 -9761
6331 -9761 -5331 -1671 -6499 -6653 -1726 7787 8092 25899 28114 25002 12960 995 3189 -1121 -8061
6316 -8061 -9485 -2224 3388 -2201 -2375 5957 8717 4116 -703 -768 3629 5631 -4437 -19581 -13101
6301 -13101 -7984 -13909 -15777 -22687 -20834 -17987 -16049 2771 463 6051 -2623 -11679 -7566 -4980
6287 -4980 -5404 -4286 918 1867 4431 3107 -4188 7059 12359 17788 16188 11519 7624 1930 6557
6272 6557 6542 -300 -1894 -5763 -2155 -9018 -6917 -1934 -14161 -13755 -16890 -24209 -25924 -20250 -26434
6257 -26434 -37894 -36084 -14889 6448 2740 2530 -4418 -6698 2726 1376 -1818 -12041 -18013 -20324
6243 -20324 -23543 -12643 -458 4773 1064 -8336 -2874 5913 11690 17322 13502 9036 2619 1373
6229 1373 -10598 -9826 -19908 -8937 381 -400 4698 8350 622 -16032 -23230 -10728 -5027 -8228
6215 -8228 -9372 -14091 -17022 1207 -3171 -2798 5548 11953 -10765 -15344 -2921 14633 23653 5999
6201 5999 -3849 1214 -6697 -788 -1144 -16598 -17098 -21764 -23431 -12159 -9859 -7101 -6843 -1463 13054
6186 13054 4144 -7343 -8874 -15733 -1865 4786 -1652 -10081 -15331 -11089 -21133 -31712 -21261
6173 -21261 -21112 -4747 6251 4689 6309 18400 18712 12586 10071 2878 7724 3843 563 3699
6159 3699 -7188 -9872 -3373 -12376 -3086 -966 -3533 -4323 -8725 -12574 -11027 -11190 -14318 -5576 -12627
6144 -12627 -15363 -11515 -3470 -9916 -1768 13384 10008 9537 12115 9893 -5883 -13540 1468 3178
6130 3178 596 13124 15529 1708 -12501 -14770 -2392 9100 24619 10707 3832 -9042 -5548
6117 -5548 -605 -6342 -11704 -9317 -17317 -20533 -18089 -13965 -14541 -19269 -20837 -16721 -12438 -15006 -25844
6102 -25844 -23383 -16884 -6209 -38 -2955 11292 6484 -2949 7183 8812 -10646 -13420 -22968 -40648
6088 -40648 -44755 -29158 -14798 -13829 -15069 -13151 -14408 -12761 -10415 -7270 -11729 -2842 -744 -10113
6074 -10113 -12780 -14058 -22328 -27369 -24502 -12830 -15560 -20107 -3471 -5977 -9438 1913 13934 8686
6060 8686 15444 8940 10419 11072 21995 19141 8191 15947 28324 17949 9541 6015 4429 9248
6046 9248 10432 -3461 2253 1280 -6562 -7720 -12042 -9108 834 -886 -7835 -9269 -4412 -14571 -14464
6031 -14464 -18389 -12095 -812 -5382 -11700 -8398 3589 4370 -13571 -23449 -20488 -25094 -27706 -26935
6017 -26935 -17165 2535 16534 14093 20444 22550 23733 9385 -899 -5606 -11233 -14519 -22293 -19056
6003 -19056 -16546 -23290 -21728 223 3362 -8253 -17675 -16773 -13930 -3709 -338 703 -960 -2576
5989 -2576 3250 -793 -9473 -7542 -10165 -23259 -23020 -11829 -1705 -7228 -12103 -9139 -4193 -1032
5975 -1032 -1853 -72 -8504 9747 30164 16478 6362 -3128 4384 12742 9053 11780 11153 12613
5961 12613 25783 19214 2255 -3485 6907 9646 7444 5045 8 4793 6234 -2274 886 2568
5947 2568 8629 13119 4225 972 -5061 -4576 -9229 -18112 -14340 -9804 -8857 -5080 191 -5892 -7138
5932 -7138 450 10225 5771 -10505 -13436 -18446 -9859 -8270 -9762 -168 2326 5779 52 99 3223
5917 3223 8147 13706 5081 2191 -7650 -4307 -1313 -6079 -12085 -15184 -19112 -15628 -8954 -3115 606
5902 606 -5457 -20250 -11506 2140 9712 16183 5876 7562 11918 3261 -11701 -13178 -8833 -5179
5888 -5179 -6048 -7206 -1558 -5866 -13077 -13026 -13322 -5165 -2379 -10532 -15888 -20687 -18233 -21520 -22624 -15006
5872 -15006 -9473 -12086 -18104 -13193 -29772 -26683 -4161 730 1437 4675 4578 -1580 5847 5482 -5432
5857 -5432 3580 16863 7936 -7274 -14775 -5437 3434 6293 7461 7224 -3608 -12446 -9836 -5355
5843 -5355 7651 9890 2489 -8791 -16412 -12448 -9809 -6241 -1206 7956 18040 30127 13595 4714
5829 4714 10741 16479 11477 3766 6486 5170 5214 4142 4837 9125 7173 4712 8440 11705 5481 -12362
5813 -12362 -19647 -11363 -6821 -3188 5194 9764 20104 19993 7571 -1046 3994 25350 18454 4833
5799 4833 -2023 -7561 -14076 -23111 -20416 -10348 -13892 -20479 -25375 -12426 -1874 6936 4977 3468
5785 3468 -10053 -17971 -20410 -14711 -2448 614 5375 -7277 -23189 -24005 -18492 -17488 -14276 -6443
5771 -6443 -12604 -15734 -2141 -10434 -11433 -16077 -15166 2257 -7566 -14542 -19637 -11200 -8925 -6804 2460
5756 2460 6487 19990 24512 -4627 -25582 -33279 -20334 -6233 -11399 -11769 9373 4298 -16205
5743 -16205 -4573 -2202 -4457 -674 -5383 -1320 -8939 -10525 -10615 -10472 -5220 9426 15672 12874 12983
5728 12983 11700 11190 2556 9893 12896 -2032 -9878 -8069 3657 7224 2836 3323 7492 1156 -22324
5713 -22324 -14053 -10820 -2853 2125 -4174 -3665 5592 9935 4342 -454 -20887 -25591 -6240 -1234
5699 -1234 5510 7233 6474 221 7230 5192 1912 -3792 2742 -8807 -8415 -6353 -12739 -14236 -27213
5684 -27213 -24064 -9979 -4086 6531 13597 6982 -6569 -16469 -18416 -12093 -7489 12265 13908 8950
5670 8950 13700 12583 -6226 -22168 -18299 -15995 -12996 2162 -4621 -24085 -25457 -8802 -6444 -5430
5656 -5430 -12343 -5287 -5503 -3289 6003 10605 18417 18651 12994 1278 -1686 -9466 -5779 5887 18358
5641 18358 3062 99 -7720 -7896 -617 2935 -9182 -19547 -30122 -23605 -14591 -12830 -7333 -2007
5627 -2007 2456 -6373 -4643 -7838 -12101 -6788 -7624 -20155 -16824 -1402 -9647 -14829 -13052 -4322 -6235
5612 -6235 -10824 -8200 -20052 -18544 1405 4756 4606 11224 19389 16610 354 -667 -257 -12395
5598 -12395 -20709 -13896 -956 -6517 -14201 -16596 -13666 -839 -4348 -25539 -35409 -30140 -14836 -20802
5584 -20802 -21700 -10949 -1138 8980 17924 10505 16455 11703 -1307 -5915 -20190 -31367 -39650 -38608
5570 -38608 -24237 -19233 -8153 -5332 -11310 -2534 5092 -1968 -11277 -21572 -25697 -23675 -24468 -9104
5556 -9104 -1097 -4836 -2308 772 -1871 -2975 966 2817 7212 11146 23621 23571 15040 17057 22722
5541 22722 9112 2844 -4639 -3198 -2221 -6356 -4883 -1466 -9178 -10420 -15364 -19153 -16123 -16279 -15213
5526 -15213 -28904 -32920 -19706 -20340 -29481 -23167 -24538 -14575 -10518 917 10126 447 553 7642
5512 7642 3333 1171 676 -2737 -788 -1570 -1385 469 -2748 -7149 16570 19295 16590 1249 1176 3728
5496 3728 7806 17599 6005 5141 521 -8644 -7373 -510 -9305 379 10802 8966 9224 22386 15172
5481 15172 13524 21472 24316 10698 14343 11369 2167 2153 -9332 -8194 -3718 -6929 -8696 5934
5467 5934 10418 4447 -2140 -166 2256 7952 5368 5005 16256 26305 28182 26753 16860 22640 17358
5452 17358 4622 3800 2222 -823 3667 -7430 -4553 6113 11067 12273 -4626 -19247 -18671 -12536
5438 -12536 -18723 -14201 -11007 -9803 -5032 -26 7949 15824 12566 10659 16430 3142 189 330 3792
5423 3792 3807 -8748 -17039 -7111 6626 11212 9340 4478 2969 16464 10827 -7388 -4488 5657
5409 5657 6926 2862 6861 8409 13546 -613 -8709 451 -1505 8602 14286 16329 14621 8854
5395 8854 2675 3306 -739 -7836 -3738 -8272 195 1286 1352 11358 4197 5327 -3244 -3627 -1882 -5405
5379 -5405 -15215 -16465 -11502 -576 5280 -4629 -2204 -9752 -10314 -8060 11375 31709 22185 5960
5365 5960 -3526 -1363 -11617 -14382 -17010 -15118 -1894 -11878 -10483 -10855 -17896 -1790 20818 25902
5351 25902 22303 5637 -398 4547 3847 815 18231 29130 27638 14047 6683 5207 -7133 -8759
5337 -8759 -17034 -15089 -4134 2728 4927 4827 13618 33981 27215 19973 7951 -3070 -1941 -4476
5323 -4476 -19614 -13484 -7298 -5187 -5075 -6783 4002 5207 -3203 -5009 -9301 -3446 -10751 -10689 -1917
5308 -1917 -5142 -8891 -11184 -19384 -35566 -28661 -11131 -8806 -7287 -10867 -17456 -18645 -14724 -19575
5294 -19575 -17211 -16453 -18485 -12260 -6209 4355 8534 5112 -2177 14844 10981 -9655 -4771 660
5280 660 -6854 -5460 -690 -7164 -21106 -26355 -16560 -3566 -5016 -2345 -8313 -8957 -12495 -17826 -18472
5265 -18472 -18572 -1586 3223 -14363 -6354 -9041 -11691 -6875 4756 4382 -1221 -6583 -12380 -14522
5251 -14522 -10901 -10970 -12229 -7066 -3280 13953 16672 14696 26283 24236 7980 -4454 -12488 -1617
5237 -1617 2647 1322 10764 14385 20084 17163 9260 7982 4015 -831 -10358 -11466 614 2973 4739
5222 4739 7844 6480 -8538 -14836 -19815 -16733 -12450 -14098 -24314 -16071 -7665 -8268 -4699 -2678 -3686
5207 -3686 2000 2834 -1358 3809 7072 1114 430 -6241 -2097 6380 19590 19895 22265 9571 13612
5192 13612 15291 6915 -7207 -15026 -13800 -3349 6538 10247 -4550 -15663 -17197 -16957 -6202 -2145
5178 -2145 -2037 -8276 -4979 -491 5625 7455 13764 8378 15654 5818 -1028 -10951 -10614 -14154 -15689
5163 -15689 -11595 -4578 -3208 1901 4736 -440 -11731 -14329 -12658 -9210 -4816 -4274 -7242 -8257 1917
5148 1917 12413 22560 24772 5851 -14188 -23427 -28720 -11279 3635 5985 9635 5603 -9302
5135 -9302 -15841 -14484 -8768 -17461 -8257 -550 6242 2989 -7664 -9317 -3085 -6352 -5562 -6443 297
5120 297 1304 3379 2553 -6434 -3239 4990 4677 -3893 -968 7009 -785 -19742 -11392 -6633 -11449
5105 -11449 -13496 -23267 -24338 -17568 -19363 -10330 19898 20775 6683 -2509 -11518 -9975 -16501 -28779
5091 -28779 -13955 -2397 3242 13185 9198 6064 -4735 -13658 -9306 -9734 -14455 -19022 -21947 -24576
5077 -24576 -20506 -1355 -837 430 588 -9030 6565 7585 -2790 581 3769 11934 16044 -2589
5063 -2589 -4336 -1455 -1840 -4874 -9052 -9639 -7898 -13183 -14693 -16187 -12183 3338 11554 25186 32291
5048 32291 23124 9032 -3347 -12656 -1083 5884 3747 4153 12719 13788 14103 20261 16017 5598
5034 5598 -3545 -9305 -14326 -17292 -10680 -7282 2038 7353 6482 -10262 -9886 -10447 -12691 -5253 5651
5019 5651 9107 3558 688 9930 10532 9232 -2805 -10863 -11648 -19041 -27976 -10313 -2907 5392 -2675
5004 -2675 -470 -1530 748 1386 -1459 -901 -2718 -8383 -14359 -13241 1279 8455 4915 1876 5949
4989 5949 2121 -4502 6313 8553 17955 18439 4414 -9687 -3695 -1415 8562 17380 20709 16545
4975 16545 2616 -4771 -6895 -9704 -13365 -16111 -14604 -25264 -22218 -17108 -23293 -14256 3574 14484
4961 14484 7484 7221 383 4523 -911 3787 9740 9303 7945 3238 -8680 -10608 -3896 -10072 -11456
4946 -11456 139 2299 974 -6455 -2276 -2799 -2145 6971 19721 31571 40828 19709 -6158 -2522
4932 -2522 -1481 -4073 -777 318 -6754 -12687 -17169 -6163 -512 10610 12976 8974 12322 9182
4918 9182 10015 3907 2268 4627 7733 -1958 -2690 3145 8662 7596 11700 8361 -5178 -12439 -7958
4903 -7958 -11533 -19128 -15003 -3416 -5812 -4930 -2689 2456 2035 -787 -9189 -10048 -18071 -25360 -19929
4888 -19929 -15232 -7584 -3402 4698 2627 172 10709 16187 16097 -3816 -9382 -9977 -17183 -20198 -21772
4873 -21772 -24667 -25144 -33572 -31262 -19487 -13220 -17007 -10484 -9886 -17955 -12493 -14202 -8225 2430 -1662
4858 -1662 8351 12976 -3638 -5540 3145 3093 1043 12387 13589 -434 -15326 -5025 8537 20846
4844 20846 15993 8855 4142 4678 7509 -4187 -13089 -15883 -16675 -6736 -1141 -16519 -16233 -6379 3777
4829 3777 -4136 1940 -13188 -9187 6394 1609 -15761 -24978 -28212 -23184 -13592 8699 19312 9266
4815 9266 1086 -6605 -12566 -8246 -9002 -10184 2969 7058 -25 -6002 -7933 -7575 4743 15615 11033
4800 11033 1439 -14426 -19195 -8651 2826 9343 -181 -15513 -5957 4107 15102 28885 24334
4787 24334 14487 2463 1514 4456 3074 -801 -2776 3350 7262 14859 21106 11964 5372 -457 6041
4772 6041 8547 2931 2715 -520 -1751 -1418 1051 10504 -2812 -7624 -10166 -20505 -21145 1585 18253
4757 18253 5921 -1196 1178 -5792 -22932 -17366 -16799 -24788 -10717 -2390 200 -9232 -25867 -16731
4743 -16731 3205 20638 21455 8661 6472 -4824 4547 4919 7976 18727 16033 24113 23075 13720
4729 13720 14091 5712 -3346 6201 8762 9203 2789 -16309 -14533 -5602 7372 8963 10115 10766 9346
4714 9346 2947 -2368 -3577 1911 -3424 -9 3577 300 -20092 -16954 -17243 -11109 3783 18229
4700 18229 7373 -8472 -33375 -30982 -15587 -5663 8594 7064 4794 -822 -539 15309 10594
4687 10594 5814 10825 15649 16686 6553 -9045 100 -11826 -13915 -27426 -30165 -24860 -7857
4674 -7857 -1478 -19857 -16688 -13728 -20472 -12660 -4615 -7801 -15601 -19306 -15113 -17472 -14623 -2266
4660 -2266 -139 -6668 -13631 -5946 2489 10471 11227 7593 7400 6055 8154 10774 12087 15671 20597
4645 20597 11975 4160 -255 -2429 -10203 -1158 -3221 10806 22659 10566 -890 -1790 -3744 -16290
4631 -16290 -3059 9028 3886 -1193 5224 7206 3276 3705 -12750 -9346 99 4301 11285 4124
4617 4124 -13511 -21471 -26280 -13186 9504 16137 11272 21928 44222 29869 23859 20620 9522
4604 9522 -6190 -2728 7318 15678 16293 -4075 92 4424 4395 752 -4901 -3752 -11597 -25078 -33817
4589 -33817 -25830 -11915 3022 5092 -7689 -18191 -10339 4907 10344 26792 11752 4228 1685
4576 1685 -5963 -13491 -16827 -10623 -7765 13194 23269 30178 25488 4864 -192 2365 4527 18550
4562 18550 11033 10425 10508 2802 11736 33989 38654 27730 9479 3388 3211 -6721 3857 14862
4548 14862 6464 -9751 -4361 3229 -8594 -20939 -19183 -7634 -14595 -16478 -1797 -9953 -15473
4535 -15473 -10931 -2707 5580 8837 5375 -2272 -412 -12732 -15334 -10847 -8159 -14878 -19060 -4596
4521 -4596 13988 31918 33990 17789 10510 -149 -10335 -8653 -1615 3111 12249 -2196 -9796
4508 -9796 -6396 -615 8315 5068 9257 4354 5096 4395 -8205 -14336 -22679 -21139 -12150 8960 16220
4493 16220 16422 18003 19993 11892 981 13348 24473 21295 6563 1903 -6192 1656 8474 3720
4479 3720 5015 1770 3379 253 -1930 -6739 -6694 -3605 -13527 -12768 7153 5429 4988 -9074 -11109
4464 -11109 -16081 -28204 -24691 -7706 8247 6335 3144 -12505 -11958 -6462 -11067 -10048 -3094 -1229
4450 -1229 5506 13968 7745 -1981 -15028 -15114 -518 3015 -1881 -1633 -5966 -16748 -19992 -14596 -13920
4435 -13920 -22352 -16948 1860 7866 9387 14553 14182 9415 8794 10276 8386 -586 3794 -180 -8768
4420 -8768 -10842 -11555 -20873 -16517 -17218 -2614 4403 1797 -5788 1803 4953 1329 -1394 10040 11354
4405 11354 3613 -2646 -2919 -384 5405 17309 13033 11111 2063 -7370 -6520 -10803 -14036 -6440 6929
4390 6929 14458 21496 20680 13886 12773 -1291 -15122 -18482 -10637 -15815 -8768 927 2548 8778 11912
4375 11912 17062 13110 2556 12707 13474 4643 -4337 7574 10166 1790 9329 17398 -828 -13613
4361 -13613 -378 7065 5200 67 -5498 -3994 -4634 -1567 -7549 -4580 2233 2799 -8982 -5249 303
4346 303 16496 9813 9618 9478 7960 5703 7604 -880 2805 4686 -7938 -21777 -27809 -15436 3018
4331 3018 11352 19547 25360 20573 10078 -6023 2421 -2892 -13262 -18378 -10139 -10344 -4955 -6809
4317 -6809 -3546 8577 8674 5550 9484 12143 1283 -20747 -19502 -10649 -4034 -9301 -4160 6080
4303 6080 -2015 2479 -7292 -15258 -9556 -3244 2931 -739 4332 23719 12253 4949 14608 23881
4289 23881 11502 -11764 -4469 1246 4006 9396 1436 -5418 -9561 -3513 -1248 4173 4858 4997 10984
4274 10984 -5909 -23422 -24031 -28594 -15703 -8713 465 3034 3954 -2357 -1988 -828 -3924 -4962 -2838
4259 -2838 3221 -584 -5425 -2288 1087 4345 6066 4912 3311 7238 3514 24965 25420 12892 -851
4244 -851 -9532 -2463 3613 -3196 -6519 -2120 -4104 -3486 -510 3336 17987 21109 14749 2875 8637
4229 8637 24112 29965 16990 9141 14050 14573 15158 20872 30136 15821 10149 2338 -4640 -5430 3075
4214 3075 1096 -12917 -13065 -2604 -12604 -17081 -21626 -24289 -18088 -856 13001 -3204 -12165 -8951
4200 -8951 6145 6053 -5072 -9222 -7986 -10166 -16329 -14530 -15216 -2391 6399 12389 5548 6475 11633
4185 11633 5067 9222 8723 8763 8264 7923 15246 21704 14035 -12273 -13386 -13408 -5570 1591 -498 12083
4169 12083 21229 13981 4251 8817 12633 12198 8032 5020 443 5553 8177 12313 6424 -781 -7451
4154 -7451 -11502 892 13921 10189 3798 6052 8021 -6505 -11279 -8547 8373 2872 -3822 -3879
4140 -3879 4255 8817 16577 10505 8991 -7846 -19855 -9341 -11482 -9410 -9844 1157 10157 7096
4126 7096 9160 18688 15189 3010 -1696 -4573 -12803 -13718 -5340 -3144 -6551 -15926 -12660 -3060 11933
4111 11933 16610 6622 5799 -1702 -15315 -4725 6288 14768 3737 -4447 -13829 -18250 -16595 -17356
4097 -17356 -15018 -17678 -5733 -2966 5865 6698 6623 -9964 -5533 -10202 -1520 -5296 -5356 -2058 -1025
4082 -1025 -1756 9946 16863 15537 11848 5099 -7223 -25467 -36384 -18238 -4184 -1463 8750
4069 8750 1599 -3851 -438 9652 10679 -1620 2052 8310 6018 8887 23396 13074 6327 9193
4055 9193 15394 3187 -2775 -2646 -2161 -2355 -4245 9883 4868 15881 17292 6716 -480 -5819 -4582
4040 -4582 4468 9713 16907 10965 -1324 -6436 -19026 -20719 -4794 6985 9115 18956 33827 28505
4026 28505 23697 10229 7208 1509 -2848 -8774 -11058 -16653 -17214 -7747 -3369 -3385 535 1047 3276
4011 3276 -2434 -5783 -6131 16782 21183 18225 8358 -15726 -15229 -17165 -16947 -17529 -20182 -16780 -21679
3996 -21679 -21716 -2929 12778 13297 -1856 -11274 -11714 -13739 -14892 -13240 -3029 660 -51 285 -14210
3981 -14210 -14132 6364 536 -17175 -18898 -2375 14041 20644 18589 2316 -14113 -10024 -12867 -2493
3967 -2493 -6668 -7687 5123 5922 8218 12957 4744 18482 20408 17037 11653 -12441 -9746 -3442
3953 -3442 10964 13071 657 -4408 -5256 -1376 2418 -997 -20572 -31107 -26999 -21686 -23278 -19783
3939 -19783 -5412 6772 18579 3636 -16347 -25457 -20751 -17396 -16807 2008 22257 35351 28291
3926 28291 24896 29732 21413 10568 7908 -1568 -7374 -20169 -17878 -19948 -17270 -9520 -10079 -8955
3912 -8955 931 2620 6854 12091 9709 9701 2503 -10103 -4348 -8431 -10471 -12815 5493 16636 8653
3897 8653 5450 3338 -1962 -1196 -1060 -7992 5420 20335 25405 17290 3711 -975 12893 21949
3883 21949 16935 8655 6000 -2408 -18176 -11743 -14540 -15006 -7730 4836 9528 10994 14034 6423
3869 6423 -3485 -11565 -1221 17153 22086 16840 10036 12490 20169 27658 18211 12459 4525 2485
3855 2485 16533 10578 -3209 2314 -1589 -9249 -14437 -15697 -20028 -7640 -1825 -1766 -3737 -3214 -7190
3840 -7190 -11528 -22328 -12633 -8861 -3323 -4078 -2018 3805 1932 7822 13937 4744 -1550 5762 4114
3825 4114 -1020 9276 15358 4595 -5528 -14565 -1352 3755 -281 -1515 -606 10543 23291 17568
3811 17568 -5730 -8631 398 1388 9564 7871 3649 17631 16581 -3594 -12098 -17949 -11275 -263
3797 -263 -769 7341 4961 665 6676 10765 23277 29480 32399 9551 1323 11875 8645 -8327
3783 -8327 -19122 -4272 7824 11004 18216 19213 12609 11538 18064 16560 3600 -13759 -14974 -3545
3769 -3545 5732 8073 9222 10004 14582 15471 2888 -7300 -4777 -2747 -3713 -11447 -11318 -12294 -17025 -8189
3753 -8189 -8986 -2372 -5843 -5348 -13367 -17076 -15752 2579 6642 -3314 -21157 -33177 -19831 -9344
3739 -9344 -8464 4809 8954 8295 3546 7404 2252 -1290 5683 -2416 -15921 -13398 -1218 -4667 -2623
3724 -2623 9952 16221 12886 10233 17105 18899 5744 -1025 -9734 -13842 4965 20964 16418 9572
3710 9572 -6160 -14379 -5179 6485 8486 8031 6527 12244 2666 9377 13392 817 -2660 8487
3696 8487 16024 7693 3718 -9014 2354 9535 -1516 -13927 -6340 -3653 -9106 -8071 -4695 -16495
3682 -16495 -8720 2794 4360 8102 16961 15965 10739 12914 7943 -3739 -4754 5940 2589 -1571
3668 -1571 -11664 -12927 -18524 -18846 -18760 -17156 -27601 -18149 -11286 -15463 -8377 3817 16437 2182
3654 2182 -12869 -8245 5990 3962 7695 2056 394 -435 1135 -4024 115 9000 36959 44042
3640 44042 21679 6694 -8927 -25326 -19347 -5246 391 -5513 -6701 -872 1987 -12015 -17978
3627 -17978 -6778 4229 4814 10864 18550 11304 -1773 -5478 9549 5180 1640 -9639 -14520 -6916
3613 -6916 -14897 -10912 -1925 6760 5903 3383 1345 4341 8041 -3070 -11706 -12780 -9424 -10014 -25773
3598 -25773 -24494 -16289 -13603 -7990 6642 3176 8619 6204 22082 9654 -2304 -4785 -1535 3104
3584 3104 2874 -614 -15493 -7025 5734 -2305 -6197 -8271 -17123 -10521 -6545 3659 15945 15585
3570 15585 7987 5976 -4020 2916 5543 8377 3012 -5530 -8917 -15271 -17044 -8941 -2978 7626
3556 7626 15161 22499 24301 17095 2659 -178 -1835 -3590 -3738 -4856 -4301 -1846 1715 -10741 -12939
3541 -12939 -18022 -30466 -17144 -11442 -1750 11841 17753 4259 4680 -6137 -6176 -10799 -10784 -2792 -3419
3526 -3419 -5064 -1994 817 1693 15596 4212 -5802 -7451 -11246 -5526 2978 14718 8213 8308 -4762
3511 -4762 -9796 1765 -2007 -416 -12804 -18357 -25797 -22928 -5495 5450 1665 -7129 -8339 -4199
3497 -4199 360 643 -4204 -12872 -2085 791 3755 20231 22300 26191 23286 16704 16271 18090 13402
3482 13402 -1546 -5406 -10186 -2423 -4835 -10184 -16035 -9600 -10056 -2479 2992 -5345 -13738 -23903
3468 -23903 -33393 -18476 -10342 -12566 -18519 -19379 -2969 -2817 7665 9050 14960 20883 14425 11385
3454 11385 5893 6856 7566 15985 22756 17567 27754 28659 29417 26816 28597 27688 24029 20856 10921 -2580
3438 -2580 14159 26430 19346 14288 13184 22563 19070 5873 -11623 -15881 -18361 -26979 -20717 -6676
3424 -6676 -3978 -786 5110 1991 -1252 -17540 -18816 -8535 9932 5901 -2714 -8531 -3300 5113
3410 5113 8729 24730 19690 11530 4479 671 9186 -301 -5105 -3199 4502 4921 -4418 -15629 -7475
3395 -7475 496 3885 -9839 -29035 -25303 -17793 -6100 -1348 727 -7470 -17853 -20465 -21146 -18418
3381 -18418 -22016 -27749 -20458 -17302 -13764 -14806 -21516 -21421 -17579 -19774 -6517 8314 -1586 -11778
3367 -11778 -10012 -932 15797 12188 -4550 -5734 14288 18093 13689 16761 15117 7208 8915 14378
3353 14378 12753 13323 4948 -4219 6220 14082 4488 885 -8404 2309 369 2318 13051 23306
3339 23306 8141 -3180 3985 18614 11762 12276 21256 5108 -14668 -11872 -19073 -10052 -21749
3326 -21749 -32354 -22079 -10412 -5559 -3668 -5329 -9191 -16002 -5569 3858 -3417 -9268 -8385 -486
3312 -486 8772 12460 9670 3433 7809 22372 22443 25781 17113 1878 6988 4791 4380 9184 8756 145
3296 145 5553 59 3201 16830 22851 8814 -4067 3176 9961 17343 17587 15817 18930 10309 1072
3281 1072 7097 10531 5276 14683 16656 9252 5267 6209 7834 11984 5515 15853 24368 1000 -3079
3266 -3079 -457 1471 -782 -542 -1704 -3436 -612 -1172 6010 8688 8729 6798 -8799 -3901 14737
3251 14737 14102 14996 19669 4001 -6252 -4905 1516 10417 2426 -11932 -22774 -8638 -2810 -6259
3237 -6259 -3428 -4867 -2312 16651 25477 20132 -1507 -15010 -14774 -13228 -13344 -24717 -26086 -21514
3223 -21514 -15489 2857 16418 20202 9980 436 -8753 -12076 -6139 6479 11786 7502 5648 7735
3209 7735 11804 12310 13964 11970 5823 13640 17239 22104 15406 12357 11374 1862 11695 11344 -4440
3194 -4440 -1835 3105 4457 -6234 -19152 -27221 -14551 9080 15403 8355 7395 6400 10534 17244
3180 17244 21830 19492 17233 12563 1622 -705 -2763 -10113 173 26783 34682 27200 15450 12444
3166 12444 10956 24860 25194 24272 16203 17523 13001 -4291 -8190 -5106 -11133 -11682 -16650 -11354 -8185
3151 -8185 -3739 4487 3517 13756 14557 14368 18983 13485 4431 3469 9258 7600 -4595 -16834 -4163
3136 -4163 13594 3262 -1060 -8429 -10184 -12446 -750 3791 -3051 904 -9498 361 3336 11852
3122 11852 5501 2085 9810 15275 13144 8773 1072 -12593 -13368 -11182 -14735 -7166 -2579 -5376 -2076
3107 -2076 13323 16577 18163 12239 7165 -5768 -9431 -12288 3098 10278 4925 5254 -1532 -5399
3093 -5399 -4226 -9351 -2656 12345 18180 18668 12424 4082 6656 10879 13391 7891 12506 20037 28050
3078 28050 27459 32578 32683 29721 21134 25363 31576 33019 18047 2495 195 9229 18096 8360 -11690
3063 -11690 -9324 -1126 2448 -4721 -14270 1229 -285 -14191 -30611 -13683 -2073 7690 23363
3050 23363 1909 -5129 -438 3985 2540 7651 5857 6532 4911 10507 4338 1221 3275 -5257 -3880
3035 -3880 420 -8489 3212 2142 6930 -3808 -6372 -13103 -13828 -16146 -13981 8199 13502 20830
3021 20830 30783 40072 34962 31199 29923 24222 19486 16993 19819 27317 34943 37256 33467 27802 10276
3006 10276 4282 351 -5466 -9411 -9504 -2589 6725 4968 7602 11613 14477 13513 5528 897 2134
2991 2134 7114 6307 14096 6312 1740 -4877 2872 -198 -8051 1380 8390 5149 5418 -4714 -17754
2976 -17754 -16639 -10432 -1526 1726 6556 -4897 -20006 -12336 -9282 -4913 -45 -4615 -12337 -10221
$$ [...]
##END NTUPLES=NMR SPECTRUM
##END=
