##TITLE=Analysis number 327438
Compound Code sb 01504
Book Reference 150526
Project Code adrs flr03
Chemist Name jom
##JCAMPDX= 6.0         $$ Bruker NMR JCAMP-DX V2.0
##DATA TYPE= NMR SPECTRUM
##DATA CLASS= NTUPLES
##ORIGIN= Bruker BioSpin GmbH
##OWNER= nmr
$$ XWIN-NMR		Version 3.5
$$ Fri Mar 23 12:54:42 2007 GMT Standard Time (UT+0h)  MAYBRIDGE\nmr@NMR_250MHZ
##.OBSERVE FREQUENCY= 250.131544655141
##.OBSERVE NUCLEUS= ^1H
##.ACQUISITION MODE= SIMULTANEOUS (DQD)
##.ACQUISITION SCHEME= undefined
##.AVERAGES= 16
##.DIGITISER RES= 18
##SPECTROMETER/DATA SYSTEM= dpx250
##.PULSE SEQUENCE= zg30
##.SOLVENT NAME= DMSO
##.SHIFT REFERENCE= (INTERNAL, DMSO, 0, 16.522)
##AUDIT TRAIL= $$ (NUMBER, WHEN, WHO, WHERE, WHAT)
$$ ##TITLE= Audit trail, XWIN-NMR		Version 3.5
$$ ##JCAMPDX= 5.01
$$ ##ORIGIN= Bruker BioSpin GmbH
$$ ##OWNER= nmr
$$ C:\u/data/dgb/nmr/ADRS/1840/pdata/1/auditp.txt
$$ ##AUDIT TRAIL=  $$ (NUMBER, WHEN, WHO, WHERE, WHAT)
(   1,<2007-03-23 12:54:14.16 +000>,<MAYBRIDGE\nmr>,<NMR_250MHZ>,
      <created by zg, POWCHK disabled, PULCHK disabled
       configuration hash MD5:
       49 4B E0 1D 92 C2 6B 37 9F E6 65 BC 52 41 86 1D
       data hash MD5: 64K
       AB 57 E2 43 57 A4 FF E2 7F E6 D1 40 96 CA F2 7C>)
(   2,<2007-03-23 12:54:32.07 +000>,<MAYBRIDGE\nmr>,<NMR_250MHZ>,
      <Start of raw data processing
       ef LB = 0.3 FT_mod = 6 PKNL = 1 SI = 32K 
       data hash MD5: 32K
       FB BA 85 44 05 5C 9F 29 28 E4 48 CA 24 A6 F3 77>)
(   3,<2007-03-23 12:54:34.05 +000>,<MAYBRIDGE\nmr>,<NMR_250MHZ>,
      <apk 
       data hash MD5: 32K
       D3 0F FF 05 4D 62 D5 D7 00 16 DA 6D FB AC FC 9B>)
(   4,<2007-03-23 12:54:35.04 +000>,<MAYBRIDGE\nmr>,<NMR_250MHZ>,
      <abs ABSG = 5 
       data hash MD5: 32K
       B5 AA 6D 11 E1 CF 75 06 F3 9F 0A E9 A8 08 26 ED>)
$$ ##END=
$$ 
$$ hash MD5
$$ 38 4F 64 BC 74 82 D2 41 FB 5C C7 48 00 DF 00 76
##$RELAX= 
##$RELAX= 
##$RELAX= 
##$RELAX= 
##$RELAX= 
##$RELAX= 
##$RELAX= 
$$ Bruker specific parameters
$$ --------------------------
##$DU= <C:\u>
##$EXPNO= 1840
##$NAME= <ADRS>
##$PROCNO= 1
##$TYPE= <nmr>
##$USER= <dgb>
##$AMP= (0..31)
100 100 100 100 100 100 100 100 100 100 100 100 100 100 100 100 100 100 
100 100 100 100 100 100 100 100 100 100 100 100 100 100 
##$AQSEQ= 0
##$AQ_mod= 3
##$AUNM= <au_zg>
##$AUTOPOS= <36 >
##$BF1= 250.13
##$BF2= 250.13
##$BF3= 250.13
##$BF4= 250.13
##$BF5= 500.13
##$BF6= 500.13
##$BF7= 500.13
##$BF8= 500.13
##$BYTORDA= 1
##$CFDGTYP= 0
##$CFRGTYP= 5
##$CHEMSTR= <none>
##$CNST= (0..31)
1 1 145 1 1 1 1 1 1 1 1 1 1 1 1 1 1 1 1 1 1 1 1 1 1 1 1 1 1 1 1 1 
##$CPDPRG= <>
##$CPDPRG1= <>
##$CPDPRG2= <>
##$CPDPRG3= <>
##$CPDPRG4= <mlev>
##$CPDPRG5= <mlev>
##$CPDPRG6= <mlev>
##$CPDPRG7= <mlev>
##$CPDPRG8= <mlev>
##$CPDPRGB= <>
##$CPDPRGT= <>
##$D= (0..31)
0 1 0 0 0 0 0 0 0 0.06 0 0 0 0 0 0 0.0002 0 0 0 0 0 0 0 0 0 0 0 0 0 0 
0 
##$DATE= 1174654452
##$DBL= (0..7)
120 120 120 120 120 120 120 120 
##$DBP= (0..7)
150 150 150 150 150 150 150 150 
##$DBP07= 0
##$DBPNAM0= <>
##$DBPNAM1= <>
$$ [...]
##$SUBNAM6= <"">
##$SUBNAM7= <"">
##$SUBNAM8= <"">
##$SUBNAM9= <"">
##$SW= 20.6930455092707
##$SWIBOX= (0..15)
0 0 3 0 0 0 0 0 0 0 0 0 0 0 0 0 
##$SW_h= 5175.983436853
##$TD= 65536
##$TD0= 1
##$TE= 683.16
##$TE2= 300
##$TE3= 300
##$TEG= 300
##$TL= (0..7)
0 120 120 120 120 120 120 120 
##$TP= (0..7)
150 150 150 150 150 150 150 150 
##$TP07= 0
##$TPNAME0= <>
##$TPNAME1= <>
##$TPNAME2= <>
##$TPNAME3= <>
##$TPNAME4= <>
##$TPNAME5= <>
##$TPNAME6= <>
##$TPNAME7= <>
##$TPOAL= (0..7)
0.5 0.5 0.5 0.5 0.5 0.5 0.5 0.5 
##$TPOFFS= (0..7)
0 0 0 0 0 0 0 0 
##$TUNHIN= 0
##$TUNHOUT= 0
##$TUNXOUT= 0
##$USERA1= <user>
##$USERA2= <user>
##$USERA3= <user>
##$USERA4= <user>
##$USERA5= <user>
##$V9= 5
##$VALIST= <valist>
##$VCLIST= <CCCCCCCCCCCCCCC>
##$VD= 0
##$VDLIST= <DDDDDDDDDDDDDDD>
##$VPLIST= <PPPPPPPPPPPPPPP>
##$VTLIST= <TTTTTTTTTTTTTTT>
##$WBST= 1024
##$WBSW= 4
##$XGAIN= (0..3)
0 0 0 0 
##$XL= 0
##$YL= 0
##$YMAX_a= 225772
##$YMIN_a= -268211
##$ZGOPTNS= <>
##$ZL1= 120
##$ZL2= 120
##$ZL3= 120
##$ZL4= 120
##$ABSF1= 16.522
##$ABSF2= -4.171173
##$ABSG= 5
##$ABSL= 3
##$ALPHA= 0
##$AQORDER= 0
##$ASSFAC= 0
##$ASSFACI= 0
##$ASSFACX= 0
##$ASSWID= 0
##$AUNMP= <proc_1d>
##$AZFE= 0.1
##$AZFW= 0.1
##$BCFW= 0
##$BC_mod= 0
##$BYTORDP= 0
##$COROFFS= 0
##$CY= 12.5
##$DATMOD= 1
##$DC= 0
##$DFILT= <>
##$DTYPP= 0
##$F1P= 14.0000005364418
##$F2P= -0.99999901652339
##$FCOR= 0.5
##$FTSIZE= 32768
##$FT_mod= 6
##$GAMMA= 0
##$GB= 0
##$INTBC= 1
##$INTSCL= 1
##$ISEN= 128
##$LB= 0.3
##$LEV0= 0
##$LPBIN= 0
##$MAXI= 10000
##$MC2= 0
##$MEAN= 0
##$ME_mod= 0
##$MI= 0
##$NCOEF= 0
##$NC_proc= -5
##$NLEV= 6
##$NOISF1= 0
##$NOISF2= 0
##$NSP= 0
##$NTH_PI= 0
##$NZP= 0
##$OFFSET= 16.522
##$PC= 1
##$PHC0= 220.589
##$PHC1= 5.624575
##$PH_mod= 1
##$PKNL= yes
##$PPARMOD= 0
##$PSCAL= 4
##$PSIGN= 0
##$REVERSE= no
##$SF= 250.13
##$SI= 32768
##$SIGF1= 0
##$SIGF2= 0
##$SINO= 400
##$SIOLD= 32768
##$SREGLST= <1H.DMSO>
##$SSB= 0
##$STSI= 32768
##$STSR= 0
##$SW_p= 5175.98343685301
##$SYMM= 0
##$S_DEV= 0
##$TDeff= 65536
##$TDoff= 0
##$TI= <Analysis number 999999
Compound Code 99
Book Reference 9
Project Code 9>
##$TILT= no
##$TM1= 0
##$TM2= 0
##$TOPLEV= 0
##$USERP1= <user>
##$USERP2= <user>
##$USERP3= <user>
##$USERP4= <user>
##$USERP5= <user>
##$WDW= 1
##$XDIM= 32768
##$YMAX_p= 564826761
##$YMIN_p= -465623
$$ End of Bruker specific parameters
$$ ---------------------------------
##NTUPLES= NMR SPECTRUM
##VAR_NAME=  FREQUENCY,     SPECTRUM/REAL,   SPECTRUM/IMAG
##SYMBOL=    X,             R,               I
##VAR_TYPE=  INDEPENDENT,   DEPENDENT,       DEPENDENT
##VAR_FORM=  AFFN,          ASDF,            ASDF
##VAR_DIM=   32768,         32768,           32768
##UNITS=     HZ,            ARBITRARY UNITS, ARBITRARY UNITS
##FACTOR=    0.157963299565203, 1,           1
##FIRST=     4132.6476996994, 0,             0
##LAST=      -1043.33573715361, 0,           0
##MIN=       -1043.33573715361, -465623,     0
##MAX=       4132.6476996994, 564826761,     0
$$ Real data points
##PAGE= N=1
##DATA TABLE= (X++(R..R)), XYDATA
$$ [...]
19316 4715975 4864910 4798465 4833551 5118496 5279301 5403731 5594717 5837424 6045341 6241084
19306 6241084 6468755 6623844 6905191 7188918 7491028 7697071 7909470 8109163 8435793
19297 8435793 8809299 9061586 9425427 9778989 10223901 10777821 11278034 11633168 12155790
19288 12155790 12748414 13387625 13987752 14472075 15150524 15766626 16373783 17180372 17965739
19279 17965739 18844175 19813771 20822630 21904123 22818703 23821523 24951853 26066731
19271 26066731 27304068 28414982 29699223 30863433 31962669 33121924 34444752 35728439
19263 35728439 36801743 37908031 38881305 39847600 40717683 41607321 42335088 42729321 43135758
19254 43135758 43235927 43315646 43254722 43141132 42822780 42303687 41479043 40680706 39928259 39029670
19244 39029670 38028691 36793953 35657535 34528506 33347081 32110761 31061209 29943431
19236 29943431 28815437 27670466 26582964 25508445 24465546 23412700 22412541 21380662
19228 21380662 20449195 19773918 18954163 18150880 17299093 16577852 16088002 15350812 14622042
19219 14622042 14013883 13596136 13145408 12577698 12048368 11561592 11193885 10804912 10483980
19210 10483980 10230749 9811581 9529207 9068020 8635546 8515946 8362566 7908141 7590619
19201 7590619 7474751 7313789 7067660 6854928 6441411 6274643 6274530 6110860 5822796 5618247
19191 5618247 5576720 5377736 5169417 5046069 4910101 4850452 4730251 4616747 4445675 4451370
19181 4451370 4377862 4262873 3987730 3842963 3969467 3880770 3688037 3626552 3459206 3383353
19171 3383353 3363051 3245373 3087738 2954344 2859009 2677362 2624621 2627270 2810387 2830779
19161 2830779 2705870 2697277 2739126 2704329 2525986 2466221 2300270 2189323 2228663 2305918 2277276
19150 2277276 2169080 2169784 2029200 2062298 2071449 2057798 1940897 1898753 1896431 1875896 1891063
19139 1891063 1774141 1702652 1681956 1670904 1595461 1442815 1337400 1402087 1395475 1487277 1622677
19128 1622677 1503462 1459546 1527554 1527198 1481931 1388556 1340305 1442941 1507724 1436447 1344982
19117 1344982 1320116 1192086 1009249 1110886 1244330 1110072 1007472 1117273 1162456 1146388
19107 1146388 1157267 1082620 1056068 963306 854478 884940 844420 905259 999326 936296 958378
19096 958378 1020082 1039440 769166 700741 701211 610446 704370 805247 840121 855970 880053
19085 880053 883654 838747 729372 731983 620531 515873 595957 619803 638937 751075 830722
19074 830722 798593 623289 548354 582341 645029 609071 621393 605475 623077 543696 493220
19063 493220 499894 444608 382350 362007 514690 573271 633292 696264 691992 696498 744651 706699
19051 706699 706189 572645 480777 348528 329919 373966 445695 416986 457904 387259 307906
19040 307906 297058 325007 255854 293088 359341 408356 325653 241970 315590 428545 506826
19029 506826 654468 596422 506642 461302 386049 443590 452679 554092 551720 423973 296644
19018 296644 240134 157380 212184 283309 309838 361011 506343 506098 556119 491579 400341 500150
19006 500150 473727 372591 393336 372009 417624 369269 285549 301030 456779 503852 608638
18995 608638 667810 644622 699003 719379 528812 424432 337547 314468 476636 466068 391008
18984 391008 396097 473913 430507 277223 184725 309957 237942 81093 87955 40906 86706
18973 86706 83025 192824 261302 297658 244613 185698 175132 123138 115521 108951 156061 360971
18961 360971 389979 279429 304591 404899 536321 422436 429267 451662 317553 241333 211928
18950 211928 157362 34802 -104306 -102623 -81884 -39431 -16119 -32330 14569 128751 79687
18939 79687 64937 124784 209987 144129 38836 79292 138058 126022 131605 58364 15630 73790
18927 73790 28377 -42426 -85902 -90598 -11609 88096 258252 99598 -43626 -56488 -90662
18916 -90662 54961 25880 -18517 109819 298212 301906 254324 190276 164997 220439 182616
18905 182616 262662 334738 153151 35465 315007 351584 221686 131445 141898 130368 2547
18894 2547 -65006 -52421 11260 -51005 -91381 16980 67577 90730 48614 77218 209816
18883 209816 108266 -3476 -577 72477 112654 985 30827 99496 68747 26909 -32373
18872 -32373 -85900 -109453 -86959 -17906 -30946 -56851 -50893 22942 260611 166270 12288
18861 12288 -27695 -88344 -49282 28778 -64219 -39224 76052 93913 17340 -24768 51160
18850 51160 93847 86112 276791 345971 243951 215683 301165 171668 50785 92669 76155
18839 76155 37486 -69701 -51134 -70095 -143514 33730 121149 156616 190009 125937 11983
18828 11983 175558 165329 59569 97835 131608 257687 251478 237327 322048 336609 223680
18817 223680 142369 99141 65650 182194 167703 117188 40961 138950 91821 102660 120107
18806 120107 197965 301919 265046 240986 226930 235490 247606 209397 118400 79116 87668 101685
18794 101685 166867 47289 71922 169643 203102 223417 144955 26898 -132177 -188235 -130500
18783 -130500 -69825 -147792 -70277 -150864 -310296 -381668 -287646 -188147 -109131 -147811 -166630
18772 -166630 2088 93706 95629 224682 171045 36791 -2657 6326 9767 -45579 -111109
18761 -111109 -131369 -224971 -209620 -227810 -189157 -316396 -300018 -188352 -156432 -69328 -46824
18750 -46824 -6771 -10243 23287 118098 189237 107419 57259 23345 43355 -57463 -85544 149046
18738 149046 259193 202475 38545 -108303 60423 49676 -32562 43872 -145 -98970 -99968
18727 -99968 147095 144341 77851 50046 -108658 -66413 -151467 -191786 -213965 -164518 -207016
18716 -207016 -221554 -113189 -84849 -83177 -98282 -145122 -198768 -192313 -71317 -38628 -81417
18705 -81417 -84529 -147285 -193932 -142510 -158229 -99508 -106211 -86240 -87062 -77504 85465 96664
18693 96664 154318 115813 60077 34689 66049 199530 178545 139563 131138 70633 39220 -36664
18681 -36664 -17743 22062 23483 197111 361598 189862 -70335 -98134 -113246 -106604 -192280
18670 -192280 -213148 -124267 -64833 -1917 91496 149087 65760 132515 210914 287121 312812
18659 312812 307470 334694 270353 307682 368740 260724 63627 105067 251732 273704 41359
18648 41359 -79616 -47376 54299 133424 126193 74518 63252 89220 205448 311823 367675
18637 367675 336132 291866 259601 205480 125186 143478 192263 191732 251115 277883 221905 184117
18625 184117 211432 235128 241219 263817 144259 -11597 -20232 1311 -64658 20213 219379
18614 219379 163200 39478 130447 140002 265805 486581 549564 510061 283529 291205 390754
18603 390754 346190 132152 80823 129255 147258 155762 88474 74931 54818 41598 25300
18592 25300 131124 285010 429225 305416 302007 382108 339572 239899 314796 321042 341239
18581 341239 380075 515349 537235 498320 453557 404855 491848 447048 368912 488364 639800
18570 639800 517582 561033 592951 645507 612407 705558 739064 627311 693498 583636 521627
18559 521627 470300 374066 506509 523250 469711 395694 276252 209004 120858 149243 81865
18548 81865 29258 179365 153593 91875 308 116591 188601 249877 193007 178734 128517
18537 128517 136953 139200 114585 46681 30566 84918 206331 442844 621290 623640 443663
18526 443663 361146 392168 353996 315521 321309 275138 323542 431150 410120 330420 219551
18515 219551 83083 -57792 -123324 -166369 -58590 -53360 -160245 -115162 -99983 -43189 67953
18504 67953 -2402 -37085 -36299 -89431 -35359 -1209 11552 219603 375209 395339 228139
18493 228139 194967 147977 84339 101172 119866 47616 -49750 -24344 53469 29102 124892
18482 124892 113566 90003 73572 -92708 -197242 -100299 96678 146344 91708 83710 -12495
18471 -12495 -66265 -125613 -140922 -145034 -85585 -57769 -42648 125434 108267 17517 45427 146713
18459 146713 146921 92500 135964 213441 50346 -231835 -243245 -142051 -190427 -206101 -126160
18448 -126160 35418 79741 183598 184135 144972 200614 118011 -29304 -125143 -61486 -129470
18437 -129470 -124116 -85870 -104143 -113028 -195916 -126032 -140070 -348221 -399581 -311406 -236785 -223262
18425 -223262 -212147 -223547 -205595 -263770 -322874 -310970 -413977 -334825 -168020 -11503 18701
18414 18701 40033 92148 103065 23060 -89838 -118766 -54248 -75603 17601 8204 21351 64155
18402 64155 191165 254636 284236 277765 195984 -49531 -222702 -324765 -304821 -120287 663
18391 663 51545 172168 202792 213337 -28699 -64017 64588 105904 142957 108459 138856
18380 138856 244010 252953 213800 64571 -12189 9127 84488 82991 -154018 -235442 -205369
18369 -205369 -278092 -229668 -223167 -170019 -142025 -137057 -55684 -120530 -200307 -128109 -42953 81491
18357 81491 83952 88262 85838 55671 65122 24677 62566 96697 138542 121201 27154 134631
18345 134631 53821 -72305 2720 63825 55587 120424 257690 121628 -55808 -42292 48837
18334 48837 162030 154824 74251 -23129 -77987 9213 20110 -131907 -90905 9455 105788
18323 105788 87181 63140 25825 32676 -57017 -71127 -62194 -47437 44831 30379 -18082 86593
18311 86593 248763 300643 226496 173211 107841 29860 70823 157848 93089 14582 -66481
18300 -66481 -237809 -241447 -125981 -192625 -278914 -253782 -223560 -162107 12680 74110 168984
18289 168984 48373 -62967 22644 18797 -76906 21180 48439 -1040 143760 120389 73267
18278 73267 33165 10433 47434 78246 112365 107455 58808 -2457 -90299 -79310 -90376 40495
18266 40495 136547 -24488 -115648 -3058 -17595 -35578 -32775 13647 -23687 -63014 66461
18255 66461 49432 -10374 92040 31897 -18801 -87011 -72911 -84122 -173550 -81693 114734
18244 114734 207025 197452 109800 133647 61839 52407 32522 172167 357619 380813 261644
18233 261644 199957 132676 215299 166591 103961 134863 14140 11919 91977 111607 116507 127427
18221 127427 203720 169496 24631 88026 110350 92605 82466 82137 102739 172339 273628
18210 273628 316399 243528 42845 -23987 96947 190425 179682 64985 125381 197974 198601
18199 198601 185996 198720 276623 441584 381470 297860 332846 454133 438714 341273 262360
18188 262360 308521 239906 115445 110561 201063 245011 352280 367770 411941 537762 443928
18177 443928 284058 258332 377738 562485 458225 358487 342751 457209 557266 681619
18167 681619 735135 808286 829419 959267 1108807 1178254 1379584 1471634 1583332 1647868 1786623
18156 1786623 1918378 1971120 2049923 2046940 2078108 2257647 2286159 2391330 2793078 3350844
18146 3350844 4016662 4884948 5943034 7233912 9016771 11434337 14552350 18512377
18138 18512377 23197778 28130476 32515784 35861855 38460391 39631964 39297309 38191177
18130 38191177 36418588 33762477 30810133 28887100 28291871 29140045 31666148 35783447
18122 35783447 41372378 47633917 53212608 57414345 60028475 60686237 59114911 55672162
18114 55672162 50799414 44045368 36507946 29986605 24687795 20237298 16838073 14321085
18106 14321085 12550965 11243209 10108522 9225198 8702061 8210236 7846359 7844875 7845343 7883833
18096 7883833 8129401 8441674 8684484 9198700 9808610 10604109 11860352 13432222 15266214
18087 15266214 17638673 20298359 23288927 26491650 29112393 31039043 32408338 33187212
18079 33187212 33473936 33551820 33561097 33501111 34139044 36503117 40595823 46894202 55666750
18070 55666750 66990518 80574944 95146986 109116819 122111597 134148675 145050902
18063 145050902 154712234 163070692 168549720 170768189 171557513 170913003 168653934 164967704
18055 164967704 159236798 151745464 142544755 132076764 120826213 108465010 96592554
18048 96592554 88181957 83604443 81206996 79162752 77311157 75620205 73713070 71909776
18040 71909776 69630771 66260380 61321432 54855602 48180832 41689874 35402591 29728296
18032 29728296 25127569 21373065 18274212 15678730 13756275 12182081 10829847 9747618
18024 9747618 8856324 8078498 7459579 6781052 6235784 5872226 5372735 4944687 4669680
18015 4669680 4292833 4083752 3872698 3549724 3358550 3106380 3022185 2871700 2778824 2710265
18005 2710265 2671147 2528758 2328494 2298172 2436644 2460731 2314958 2294535 2174625 1970696
17995 1970696 1767030 1720315 1708708 1720051 1697519 1574348 1535871 1608183 1583503 1422973 1318182
17984 1318182 1250908 1251987 1154278 1096904 1071857 1041683 1098071 1068797 982845 1027951 1101350
17973 1101350 999514 931925 872647 838625 927115 894052 786560 829304 858706 859952 678524
17962 678524 612501 682559 728841 827827 769261 739351 747627 704809 727216 763359 861285 852132
17950 852132 932959 895597 853889 740189 656413 657809 738994 774048 739711 765225 850361
17939 850361 791844 720571 602581 575182 500360 441843 513514 510156 465350 472027 541063 531560
17927 531560 445339 351036 234775 313561 430535 431797 262403 158036 146919 136826 116361
17916 116361 182311 244413 203626 232196 233493 207082 222439 214580 294862 362451 419951 509998
17904 509998 489062 461450 361690 329063 439795 253506 128300 239739 412850 568060
17894 568060 561121 438528 404338 344028 328075 453355 410377 385755 449782 388592 254914
17883 254914 267611 363949 323439 294220 338424 430245 479999 412089 502002 377487 302735
17872 302735 264410 260263 269802 377927 354849 301740 361180 449592 407979 389282 385096 403099
17860 403099 374409 312433 279999 130398 89931 188067 130567 104957 31641 -42738 -57914
17849 -57914 84423 128957 98125 232903 233837 156342 164407 267285 271371 195997 9723 55159
17837 55159 362510 421966 392991 436712 397560 309035 275249 146289 172247 216924 221677
17826 221677 232079 212368 191690 201360 267087 277387 263484 287302 322880 306615 271990 184200
17814 184200 167698 222043 293126 359772 346712 303833 270428 299305 347860 298480 269052
17803 269052 316773 385492 384825 143002 160876 170126 226091 279161 402085 445464 358162 271135
17791 271135 210855 184173 200737 138865 181550 179632 -29800 -15774 93650 60480 145006
17780 145006 303051 354680 357343 417327 318375 412552 417470 273147 337572 436557 275986
17769 275986 128980 -20374 120633 210769 71880 57640 35596 -14659 39991 161593
17759 161593 114017 57350 -6412 -194743 -150318 123456 200275 234825 320568 337928 242328
17748 242328 109834 104636 136154 208852 331984 380206 420888 396924 350100 356190 433997
17737 433997 440220 570476 550689 483213 393369 293784 237381 205178 181617 212417 235147
17726 235147 116552 -74490 -134698 -29609 -4296 -133830 -239520 -235618 -91297 -29324
17716 -29324 -70088 -66932 -40375 65054 7358 111782 83659 54916 126282 118284 149158 133475
17704 133475 91338 144813 301956 327896 266752 310277 494092 450624 415756 449584 560449
17693 560449 552258 532693 436199 486843 400591 263450 339129 382592 434871 498111 456606
17682 456606 185475 160837 277087 321263 402871 347937 199722 175466 238491 324916 366060
17671 366060 374488 418038 381901 222151 256690 270718 351070 295555 361314 529358 430908
17660 430908 399039 428713 483909 635733 771118 776415 833321 870833 889212 927595 998300
17649 998300 1035653 1182146 1251480 1248516 1389424 1568351 1819009 1960176 2088309 2338812
17639 2338812 2521762 2677685 2890678 3260616 3533175 3627024 4026217 4651844 5261352 5715977
17629 5715977 6219945 6650988 7023022 7362863 7419791 7569240 7712894 8055968 8602614 9455080
17619 9455080 10433040 11729932 13363589 15569903 18439233 22440418 27712241 34592403
17611 34592403 43337273 53998426 66195528 78895067 90740429 100278805 106096593
17604 106096593 107432520 104407778 97348505 87198105 75324155 63157440 51751742
17597 51751742 41915257 33976217 27672665 22947562 19315534 16509470 14528402 12948750
17589 12948750 11594374 10527731 9773398 9195632 8558975 8148118 7891167 7745133 7714463
17580 7714463 7670639 7598868 7542420 7588586 7775592 7749930 7805162 7959441 8121364 8268718
17570 8268718 8640976 9125118 9705144 10321343 10907671 11610274 12786939 14569918 16980798
17561 16980798 20254038 24633289 30477930 38014647 47128223 57481973 68133715 78011753
17553 78011753 85625717 89819747 90250643 86905676 80343212 71323314 61034427 50841080
17545 50841080 41445970 33529815 27237170 22422791 18754055 15859744 13630457 12054394
17537 12054394 10845648 9776042 8915523 8393187 7953694 7606236 7517415 7479719 7402180
17528 7402180 7243055 6854231 6415209 5979356 5539797 5045754 4668666 4314178 3980046
17519 3980046 3783240 3640014 3457198 3207722 3060658 2849970 2612418 2511259 2529876 2323087
17509 2323087 1992905 1882697 1775174 1692371 1567861 1427597 1342025 1352069 1267047 1232959
17499 1232959 1312899 1315303 1100200 1142741 1076549 997171 1133756 1040990 902498 913856 926423
17488 926423 870391 888991 982364 956551 827847 731222 743426 789518 778778 700518 666340
17477 666340 689023 625079 434355 449696 449885 493650 418048 459526 580357 501271 401708
17466 401708 417162 479653 435832 498398 524214 395651 371760 445670 454986 373395 422951
17455 422951 462740 327553 235203 170458 284971 333507 300048 321867 298861 255916 243013
17444 243013 233900 285567 164529 120290 89589 153867 266881 303024 347163 368136 363701
17433 363701 407994 377547 204013 121996 46598 116460 167203 207531 186601 97756 177827
17422 177827 166227 67909 2809 11150 -4429 74885 138081 138975 154564 86457 66799 109236
17410 109236 177315 300172 165306 134774 227761 210714 264034 198245 98670 189517 263126
17399 263126 318225 314795 240998 126642 50427 127777 167513 185432 216864 277898 312144
17388 312144 313054 292933 193684 182453 152316 78725 -9676 -2383 105712 80748 23729 -41351
17376 -41351 -2700 99101 72394 122591 123343 111913 137847 199597 163868 59107 110237 152239
17364 152239 158754 239516 246020 194563 108041 57353 -30122 62844 47209 122098 285914 245222
17352 245222 148244 61651 -48601 6969 17018 71031 69491 64416 36397 -79106 58867
17341 58867 157795 141655 14950 -18413 23447 100646 180947 45524 36762 26983 150054
17330 150054 139022 183123 168226 77601 146751 185462 180657 249920 138534 174206 83736
17319 83736 -50928 -91341 -7156 3758 -9241 9393 143287 122526 161706 172525 155188
17308 155188 227933 198810 185779 108716 126364 144154 211521 246058 306873 407866 280561
17297 280561 116442 96958 104768 92003 66243 28533 86105 189452 125354 114891 125508
17286 125508 72396 68865 -3435 83677 132218 -70991 -140845 -124943 -62395 -43755 18898
17275 18898 223321 269530 152356 51947 -23564 8196 75307 -37400 -13259 121892 137391
17264 137391 -77795 -9370 -45270 -134909 -127895 -17059 20314 -23857 -121184 -83395 119733
17253 119733 225487 121416 -118942 -238557 -209892 51936 66488 -52782 -138211 31467
17243 31467 99308 -140169 -197225 -116314 -162534 -253797 -117955 20421 86652 89814 118871
17232 118871 -4372 -102397 -119978 -121314 -213248 -133885 -8397 102481 244362 257694 177101
17221 177101 235209 234602 265696 259322 262289 225205 279895 370742 395112 352535 229138 157465
17209 157465 32457 -28002 -81813 54774 129914 194448 194777 149926 198630 170345 75156
17198 75156 242586 257477 252615 192594 124545 73823 64056 -99533 -34937 135603 127106 91480
17186 91480 35489 -38656 -25269 -5713 47033 -55724 -141919 -40618 51420 -66367 -96732
17175 -96732 -19008 84649 84055 181180 195071 59907 -68896 -197554 -246716 -161706 217571
17164 217571 411720 378526 284247 171155 218968 248061 100499 -2360 94880 162035 91851
17153 91851 -100979 -92876 -107767 32654 44376 9498 12354 -21810 -70824 76540 63322
17142 63322 -44322 -152015 -163103 -52035 20257 98052 69136 96372 46756 -123639 -213229
17131 -213229 -166075 -163701 -95165 35462 91229 6421 -89719 -110973 -43598 -2150 -12660
17120 -12660 -30224 26005 93767 112320 55475 -90699 -171513 -179750 -133143 69658 243140
17109 243140 92970 89923 83865 55943 189499 319193 318130 248143 219871 247654 258731
17098 258731 232724 436575 599399 644671 692594 649433 614486 515317 374352 177272 177085
17087 177085 135554 165312 326099 372550 135946 34200 12215 83846 192522 226094 344379
17076 344379 259872 144006 14512 -107416 -42497 -31703 -40243 119087 -16649 6383 -11623
17065 -11623 -26662 90772 158210 226537 231832 94852 71644 161403 68636 -93526 -45299
17054 -45299 -21299 -12061 7722 69627 -16049 52620 19445 64495 73961 215266 309352 375007
17042 375007 269266 65298 56446 241491 264377 216930 174023 213309 294300 301110 298099
17031 298099 258715 318100 181701 171101 207256 149949 2415 19162 152537 249020 316612
17020 316612 200367 98109 5877 -29348 21601 -80103 -205593 -129223 72158 154889
17010 154889 154412 124216 189740 135306 66833 115820 24704 145553 51311 -90312 -86146 3116
16998 3116 172275 132537 96493 36852 -14173 56400 66808 34346 146889 107809 110618 233605
16986 233605 297984 153603 82701 9898 -148189 -174774 -213672 -241630 -213482 -248545 -320650
16975 -320650 -320862 -374100 -321658 -241575 -231282 -265072 -354259 -349625 -255882 -134474 -60739 76754
16963 76754 22943 34723 -20704 -153884 -96586 -86859 -67437 23570 5914 -93575 -38640 -104922
16951 -104922 -130755 -31522 -94868 -51855 -7525 72316 -24450 -249400 -323954 -334166 -180764
16940 -180764 -39723 -21673 136556 210269 164510 108896 68673 90355 36789 -99780 -194037
16929 -194037 -220611 -242823 -242905 -129585 -159785 -174092 -89944 71476 125852 117850 129103 170867
16917 170867 159809 168345 64592 -65232 -88675 -47332 -95710 5287 11889 64259 -23758
16906 -23758 -18737 116829 75463 -76882 17694 82904 39450 -43063 -44887 -39371 -41719 84588
16894 84588 27514 1811 42649 58982 96123 126471 2451 -66092 -35590 95382 43842
16883 43842 -13836 -48661 -68747 47981 59608 44891 46515 195150 71922 72998 -47009
16872 -47009 -187359 -158481 -83097 -40982 -9529 -36563 -24194 54733 52495 -73769 -140162
16861 -140162 -135352 -120164 -173925 -111850 25251 51924 33444 -102517 -216651 -157489 -142525
16850 -142525 -193523 -77522 -29387 41054 141807 97950 86438 -15050 -82479 -308403 -304165
16839 -304165 -151752 -95167 -54155 -73964 -106698 -50082 -95749 -129743 -158619 -10607 140141
16828 140141 187324 196085 145209 70878 61306 49000 -54709 -53299 -54286 -53575 35951 44599 80370
16815 80370 94836 103225 74949 57979 137193 158503 183919 145342 -66684 -191392 -173870
16804 -173870 -181906 -145849 -74491 26880 9124 -93600 -110974 -175043 -208728 -138234 -56962
16793 -56962 -123223 -111187 -128071 -97231 -42564 25674 -49516 -91804 -49103 -73572 10686 72008
16781 72008 37455 -56320 -111223 18121 17171 -158085 -177407 -145088 -121141 -87413 -63786 -114328
16769 -114328 -47473 -76857 5153 43757 -1576 -29751 -34768 -219751 -226951 -42657 86794
16758 86794 109801 36853 -72780 -41210 -47649 -110168 -99132 -64297 -3944 170338 256208
16747 256208 279525 135686 45511 90932 131693 89194 58666 108760 199691 290986 189929
16736 189929 6612 -102962 -93 37850 56184 12619 120963 106993 6052 -147403
16726 -147403 -202799 -125810 -92382 8336 -21598 -65018 -42163 32618 39976 24145 81206
16715 81206 136311 -13028 28127 75545 88398 67160 104473 55070 -48132 -91475 -53167
16704 -53167 -29482 -57994 -85649 -137778 -184049 -232537 -261900 -156220 -114447 -118310 -147655 -181044
16692 -181044 -168146 -198368 -128439 -80689 -103717 -113372 -191563 -90018 -69001 -33806 121849
16681 121849 138538 50659 -41404 -93671 -190668 -97155 7705 35603 7789 -15729 11928
16670 11928 -14893 -38658 -38702 40361 44620 -63593 -81841 -178140 -172486 -36702 -64754 23488
16658 23488 150247 86330 55694 24261 66922 90809 37167 -35892 -177563 -156892 -60798
16647 -60798 1669 93441 188527 134757 -22603 -21860 -7957 29997 3309 46199 6399 -72582
16635 -72582 -197659 -257484 -199646 -166130 -144467 -70407 -63886 -54494 -3766 1676 96962 61392
16623 61392 71474 24560 -122819 -198535 -52464 46402 -72676 -135402 -190901 -205827 -232809
16612 -232809 -161484 -21909 4005 -87051 -78405 -88304 -48065 -116977 -33703 -32048 -1028 -29859
16600 -29859 -99118 -114347 -180195 -222756 -283707 -241690 -131303 -126895 -247826 -310103 -324853
16589 -324853 -272211 -245808 -172450 -169815 -146508 -227253 -126215 -73695 -131674 -164703 -217584
16578 -217584 -176983 -173182 -62064 1677 -115456 -193172 -150930 -153978 -101476 -97909 -126967 -76379
16566 -76379 2453 21216 -82643 -182857 -266553 -108397 -105567 -119652 -56858 -138556 -148053
16555 -148053 -195214 -115912 -14022 -100379 -92009 -71079 -78249 -63225 -45509 -184316 -223190
16544 -223190 -214613 -193781 -301141 -242656 -181487 -28133 -43012 -150717 -285130 -267983 -51088
16533 -51088 -61691 -30016 -70423 9209 86680 237289 258367 253695 260916 210906 102452 -55405
16521 -55405 -114600 -76063 -95828 -138011 5338 29181 -145571 -200207 1386 4612 -63715
16510 -63715 -82002 -98508 -53260 -146816 -71143 -9910 23703 24229 165941 187390 106239 -13138
16498 -13138 -51716 -21617 15096 63669 40696 -165867 -229322 -246419 -148896 -46642 85618
16487 85618 182928 100742 71070 87127 173520 178934 76989 -7360 -130580 -217473 -172280
16476 -172280 -162678 -146375 -64478 18314 64523 14414 -2385 37524 42712 -89110 -128000 -74527
16464 -74527 51948 56389 7000 -39004 -171630 -245509 -285172 -208215 -189262 -43083 53499
16453 53499 43045 -72067 -101355 -103294 -217265 -246924 -176832 -157996 -182769 -205412 -271473
16442 -271473 -227433 -90139 36450 5479 -26968 -118693 -104373 -92466 -167393 -16546 64588
16431 64588 30397 10951 5775 -71055 -145427 -204984 -130596 -5455 -73395 -137697 -165241 -225457
16419 -225457 -236247 -261055 -244388 -157450 17081 150022 96946 88176 -40227 -198631 -328259
16408 -328259 -421091 -352921 -218658 -154425 -215900 -267230 -139199 55889 -12756 -74149 -204941
16397 -204941 -349559 -332716 -343649 -425527 -370837 -358416 -310440 -136382 -76609 -54520 -94118
16386 -94118 -30328 -87995 -73221 -70012 -100485 -30843 -84565 -178188 -223145 -201544 -102930 -110032
16374 -110032 -89178 -179101 -182435 -107786 -84727 -155553 -173076 -215295 -167957 -105909 34399
16363 34399 14126 -75719 -156812 -234403 -184510 -129052 888 90409 155757 185255 231246
16352 231246 203033 -48462 -225029 -204278 -137995 11867 76689 14185 -42006 15356 4484
16341 4484 -69273 -49723 16002 6496 -160055 -257365 -137329 -114606 -158056 -222560 -180291 13233
16329 13233 22469 -33367 -107201 -181286 -216642 -128205 -113005 -135552 -66158 -52886 -203401 -211312
16317 -211312 -257400 -252522 -240057 -213708 -187572 -182567 -126195 -259049 -195819 -139404 -153797 -296181
16305 -296181 -262400 -117605 -189502 -221163 -225584 -296107 -319824 -211861 -171077 -193786 -153822
16294 -153822 -207694 -55456 59596 114784 60227 104044 77634 83203 28260 -28501 -46001
16283 -46001 -84244 -121760 -81455 2654 -156138 -94545 -65507 -148744 -258846 -311189 -254086
16272 -254086 -222195 -66754 45645 663 130036 90543 -143436 -200114 -202969 -188127 -65948
16261 -65948 -153284 -116135 -8191 -106873 -133191 -187898 -254914 -145602 44295 87446 74126
16250 74126 -14046 -107610 -164924 -257256 -258587 -176968 -56462 -16833 13686 42819 -33499 -107689
16238 -107689 -198737 -254961 -195448 -87682 -98672 -112981 96993 161766 100395 57952 -30016
16227 -30016 8176 -73490 -114474 -107196 -124823 -114515 -73227 29678 162925 14176 -118566
16216 -118566 -171030 -221509 -205397 -120086 -91772 -108529 -118785 -128833 -134325 -57153 130281
16205 130281 127346 -133731 -129104 -88185 -74649 -32301 -37163 -14831 89906 66309 30437 -33959
16193 -33959 -144392 -161248 -46934 -31339 -120166 -122420 -153219 -170144 -94380 -56596 -106398
16182 -106398 -130726 -66156 -85729 -153613 -268705 -256351 -163687 -149726 -162539 -106756 -122627
16171 -122627 -123718 -248743 -272663 -104278 -81843 -133598 -274561 -294172 -98723 -81716 -124121
16160 -124121 -145488 -63593 56221 53015 -6811 -113874 -146509 -55233 -99007 -59120 37719
16149 37719 140937 238130 62434 -101732 -199327 -201375 -61501 -72730 -112896 -99978 -195290
16138 -195290 -122075 -49835 -93429 -92312 -36461 -85460 7082 95395 78834 -84655 -114912
16127 -114912 -33878 30693 -76170 -123732 -69862 -55520 53954 72170 -502 -236166 -191466
16116 -191466 -93924 -244797 -374806 -344075 -86226 -62619 -96674 55086 67704 24822 -13620
16105 -13620 -69809 -197641 -228300 -169895 -135648 10438 113414 73906 100168 22443 -72571
16094 -72571 -86082 -120363 -69564 -155605 -267770 -275177 -244543 -189260 -166364 -129033 -11862
16083 -11862 159537 71768 -36200 -95118 -11770 -55862 -16699 19625 41570 -58580 -152664
16072 -152664 -136204 -73438 42231 22793 120454 245796 142297 169034 157812 -9516 -72083
16061 -72083 -10643 67985 46971 -36002 -83821 -78507 -93171 -118586 -29945 -27694 -29788 -10487
16049 -10487 61818 59019 90303 -49708 -92346 -110436 -86165 -72237 23594 41874 -4857 123643
16037 123643 144872 57410 11477 37767 -22942 -82401 -290587 -282420 -132201 12216 27389
16026 27389 85034 25825 -13183 68389 86057 119555 73035 -14382 55676 101927 106512 126128
16014 126128 158761 46039 -56627 -135152 -170070 -40350 34420 93913 88571 -15750 -119222
16003 -119222 -28526 -36260 -17377 -150961 -182426 -35207 57200 129235 95555 197710 288381
15992 288381 286025 276933 174205 124957 37621 -48063 60939 60314 87090 161688 173416 180880
15980 180880 82401 -42121 11465 189527 248908 204372 107159 -19339 -78074 -94581 33682
15969 33682 127267 191689 361675 287913 173342 59182 -44382 -67046 -76186 -58046 38973
15958 38973 -31750 -75324 -91098 -136138 -72821 -191973 -216629 -37739 72512 69804 21691
15947 21691 8604 -90465 -84075 -42217 -148656 -159122 -28722 -68251 -234747 -186061 -130598
15936 -130598 -83827 60136 41342 106876 66369 -46408 -100659 -92991 -167877 -346769 -399648
15925 -399648 -249605 -265686 -205072 -50009 -30143 4468 51410 52702 196600 314158 187634
15914 187634 27247 -126606 -111393 -42101 -132810 -221609 -73883 31891 124580 124859 108973
15903 108973 78790 28466 -40325 19194 221076 184298 7876 -35387 -5889 -103761 -120928
15892 -120928 -48469 48551 -23972 -98630 -13853 5534 -17291 -23170 11302 -77174 -103085 -50975
15880 -50975 -86517 -36790 -29208 -37742 -126751 10958 65948 136323 24821 19482 95434 84115
15868 84115 26474 47705 75847 12169 -44483 13413 -47131 -68810 -20678 -10581 117704
15857 117704 63609 -61148 -113267 -111674 20863 13284 -112072 -166131 -127140 -58818 -79882
15846 -79882 -47644 13999 -81345 -60334 -22027 -83450 -52405 -11332 138291 100217 35409
15835 35409 99801 32948 -54253 20466 8980 111987 145594 -28437 -149022 -47682 223951
15824 223951 198730 161657 91563 -15506 -34980 -209359 -244460 -189810 33105 128475 92618
15813 92618 13619 -111249 -38477 -18831 10093 12455 -72928 -38654 4734 -101167 -65689
15802 -65689 -56777 -11434 11089 -110444 -160984 -143038 -56703 -32465 -48592 -26287 -52925 41057
15790 41057 17928 6422 -35017 -72078 -164731 -75312 -73881 -11466 62742 -34177 -135946 -150911
15778 -150911 -142473 -115159 -114296 -28882 22551 105095 109534 51451 4044 -128019 -86607 -56510
15766 -56510 18067 90204 77351 -164572 -288794 -106919 122767 61112 -64738 -92344 -178240
15755 -178240 -272051 -274379 -237626 -151693 -63965 -18774 -20181 -110126 -45836 33845 22173 -55961
15743 -55961 -50496 27309 50402 55435 50566 -61757 -167608 -120183 -111995 -162791 -116774 -5713
15731 -5713 -63038 -60666 5914 59396 112649 58541 114839 91450 -45378 -31939 -114105 -135510
15719 -135510 -78369 -63673 -188833 -298498 -284678 -228149 -220452 -158099 -35469 19733 49433
15708 49433 -29895 38221 152020 124797 -76104 -80044 -95290 -127045 -157121 -75712 -1577
15697 -1577 45992 -3780 -44353 -174572 -138449 -68967 -116121 -219491 -313727 -381659 -225152
15686 -225152 -159827 -194497 -201277 -161063 -261968 -97474 -34419 45202 163390 38263 -120152
15675 -120152 -105913 -41772 66471 161561 121572 159092 142770 27908 28408 -87032 -128963
15664 -128963 -126026 -21560 -73350 -25241 -35926 -201163 -201240 -64419 -108562 -164015 -165133 -22303
15652 -22303 72341 38290 25964 109381 142278 66259 56871 70042 146746 203732 138175 59502
15640 59502 14163 24174 -8384 -54720 -136350 -262361 -123719 -41481 -82206 -74344 -87835
15629 -87835 -112400 -35565 59639 85303 81559 -95448 -132032 -142190 -108756 -81357 -149784 -253267
15617 -253267 -183695 -187687 -133172 -61953 -152480 -104640 -46169 40348 -12138 56293 104367 55941
15605 55941 103456 14338 29401 56298 11579 10019 170151 237767 114867 -151515 -193437
15594 -193437 -208113 -243187 -168174 -88559 -33521 97571 86441 67453 18779 -72785 -14877
15583 -14877 27117 276 79602 271530 297695 235972 201805 3489 990 88332 126634
15572 126634 150480 182519 115889 -15195 -171645 -158394 -19699 60302 145341 102423 -149850
15561 -149850 -195991 -124574 -97819 -271917 -358530 -204932 -61482 -108218 -240277 -280213 -144182
15550 -144182 -70930 -3073 -106740 -145182 -15972 -39268 -45971 -69886 -79451 -79894 -117663 -111312
15538 -111312 -23538 32431 42067 8744 -12402 83160 45978 88114 96282 44799 -26341 38795
15526 38795 -24248 -111607 -96067 42804 36042 -101845 -191178 -68914 50896 140350 257013
15515 257013 190691 128850 69489 -11114 -10864 -96361 -143921 -199972 -227977 -203663 -157838 -115303
15503 -115303 -132133 -47313 -41824 -24998 67129 45511 -70656 3880 -507 -27690 -13291 -57211
15491 -57211 14342 -17711 -20138 -91618 -170533 -188637 -236843 -245751 -98604 -34413 -25174 -51213
15479 -51213 -96431 -58082 -20460 -61501 -66365 -12625 -180110 -193147 -45471 27756 -74582
15468 -74582 -97372 -123773 -12976 -62173 -67767 -49781 7555 44978 27112 82667 -5663 -160865
15456 -160865 -118732 -18779 -137796 -192366 -106112 -87216 -133663 -78799 19719 87457 80798
15445 80798 -26821 -82944 -15540 75914 -16003 -85228 -16328 65805 68560 39138 34785 -97417
15433 -97417 -141645 -109850 -108328 -77555 41318 89104 69399 -50009 -91492 -7686 778 -196519
15421 -196519 -156848 -102422 -8513 -74945 -59455 11640 -73753 -26167 14549 63393 58225 -42978
15409 -42978 -111033 -125540 -155895 -134115 -57097 5819 48984 -35912 -114092 -176699 -155688 -78693
15397 -78693 -16746 -25212 -174727 -315051 -273141 -102267 -76772 -58804 -40651 -26043 -77850
15386 -77850 -29608 141149 127021 2969 -108331 -119556 -70043 -175765 -217282 -134346 -212236
15375 -212236 -262392 -269478 -275724 -265203 -200477 -105463 -88574 -232697 -328244 -361210 -171265
15364 -171265 -108564 -190480 -269957 -417871 -355525 -211970 -161898 -182500 -166632 15274 -40688
15353 -40688 -57206 -138066 -240765 -200782 -98226 -21922 -33097 42242 129107 111002 90525
15342 90525 88083 98047 -59660 -284393 -463415 -437248 -262012 -166916 -46889 -18403 -67448
15331 -67448 -5589 43684 -27058 -120035 -155499 -185604 -172043 -88918 -31537 -14469 86307
15320 86307 65135 1112 -25661 -86179 -106905 -64398 -1945 98226 118720 14384 56650
15309 56650 -21121 -79516 -156039 -266503 -322571 -271425 -118677 -53959 -150471 -205719 -91636
15298 -91636 -153004 -103021 -59116 -15518 4749 -83390 -81614 -71417 140401 191012 117015 49274
15286 49274 -89377 20183 30316 -49247 -115461 -44822 4961 198687 82350 72108 10012
15275 10012 11547 31807 -48746 -199685 -171409 -107536 -39162 -171661 -227487 -236631 -247924 -4002
15263 -4002 119360 31612 -8215 44130 63251 -112346 -176040 -70817 20667 -13549 -60451
15252 -60451 -79526 -174734 -132290 -80025 -118124 -94700 2736 -26020 -126723 -130996 -14388
15241 -14388 -12838 -56182 -62642 -138054 -151040 -175828 -73448 -61395 5170 34862 -40486 -52410
15229 -52410 -147110 -193801 -196215 -323791 -341755 -321259 -333242 -230054 -190784 -112821 -145557
15218 -145557 -120582 -111245 -76912 56389 94293 178441 162618 127767 191871 99522 -23868
15207 -23868 23415 137494 86913 126136 129095 99666 56442 136450 115218 113095 111666 136705
15195 136705 -5007 -205967 -283765 -267753 -86199 -83391 -110184 -122890 -140264 -49461 -10255
15184 -10255 -10138 -21593 -61532 445 -16605 -44634 1627 61059 28993 -30437 -35819 -95032
15172 -95032 -213570 -195544 -197348 -176481 -171226 -296346 -224447 -81163 -19886 172532 152131
15161 152131 391 -39772 4126 31684 8618 38087 -38176 -63385 -11069 -80939 -217636
15150 -217636 -289961 -317633 -217887 -182810 -268623 -262674 -184648 69976 84776 -74253 -91476
15139 -91476 -75223 -98884 -65933 30280 63705 81557 90266 -111566 -229783 -115048 24604
15128 24604 45076 49855 45679 -44180 -125708 -47935 65868 -10219 -7748 146248 186272 223456
15116 223456 37734 -95741 39090 -54013 -177274 -202963 -102610 21554 18713 79194
15106 79194 112319 79812 -72773 -143907 3613 79275 -28476 -21551 24244 -70077 -120860
15095 -120860 -41516 -129962 -138013 -110378 -72572 -39389 63804 18060 -39147 63052 -79843
15084 -79843 -134326 -89707 -198965 -266628 -183766 -105833 -144717 -146507 -79264 -93579 -52225 -49938
15072 -49938 -39370 -28995 -69340 33845 -56642 -187370 -163996 -73170 -82350 -120278 -47519
15061 -47519 -12781 -94822 -68914 -66119 -147959 -150792 -123836 -164014 -188959 -199126 -154591 -34941
15049 -34941 -26002 -130567 -77348 -138771 -307280 -335579 -226496 -113722 13395 123854 110724
15038 110724 53679 -89739 -313 189837 175129 -47691 -128970 -99450 -1248 122460 55574
15027 55574 -93155 -36595 109494 183176 112061 -62350 -75163 -36619 66647 129893 92021
15016 92021 42130 54006 -10308 24424 99563 -40726 -118783 -217643 -211106 -105917 -253720
15005 -253720 -335670 -184989 -38147 71500 185258 129294 19111 -66853 -198395 -231758
14995 -231758 -232758 -294354 -431026 -337507 -231994 -297152 -323471 -276754 -308778 -166066 -71809
14984 -71809 -78371 -100504 -82712 -98120 -153576 -120910 -86065 62506 136561 183911 212568 127184
14972 127184 72818 24282 63856 53519 -26637 -11888 19315 13307 37429 -116140 -43580
14961 -43580 99312 5276 -89114 -168225 -214615 -68279 17302 89358 72832 12011 -9320
14950 -9320 -14139 -140543 -143042 -89210 -30640 79269 23387 825 -24725 -137392 -141547 -27023
14938 -27023 -35685 -51827 -16972 -16428 13267 142539 114936 144971 221950 194894 207829 221154
14926 221154 193945 161618 155397 183050 63775 -2554 -72850 -79679 -73768 -44456 -130940 -158162
14914 -158162 -70209 67405 -46289 -108273 -115914 -31628 82420 110944 70428 13302 -27427
14903 -27427 4607 48068 -123446 -230038 -169118 -54146 -130344 -130720 -162578 -225612 -285369
14892 -285369 -146607 -103861 -175374 -140128 -119467 -46895 -54424 -186615 -176749 -28254 14431
14881 14431 -15740 -141406 -279759 -364221 -252582 -23961 -15768 -93427 -93410 -9761 111920
14870 111920 -30110 -93892 -85275 -52938 4195 84491 52913 122151 176604 129542 100142
14859 100142 -20982 -41456 -57694 -101706 13457 103977 14549 -82841 -169863 -118014 28579
14848 28579 101126 69122 97346 103460 -9703 -11826 -102555 -59772 -57282 -111548 -94832 -138148
14836 -138148 -254926 -364695 -138594 4030 48667 -34573 -132550 -25036 -68252 -147512
14826 -147512 -88452 -39196 -96127 -74056 -131064 -229611 -149598 -57243 -48339 -136392 -151663 -95510
14814 -95510 506 -62643 -65379 26288 19350 -71429 -30927 -100633 -160754 -192997 -30481 101851
14802 101851 100760 52389 106548 60197 -21216 61060 62813 58464 131880 210363 295277 306447
14790 306447 132565 -59294 5884 53191 -10260 83063 92172 23143 -13057 141042 188009
14779 188009 180935 59776 -93425 -124339 -125701 -176857 -110293 -66117 2998 -46045 -173701
14768 -173701 -125900 -18736 -18965 -145985 -187021 -162520 -99882 -61868 -93915 -138467 -226944
14757 -226944 -177767 -86538 -45769 -125195 -159827 -89865 -162448 -333107 -209966 -135959 -39848
14746 -39848 -109309 -117959 -168754 -242849 -213518 -117230 -215610 -169748 -42877 -86277 -108112 -10416
14734 -10416 158522 163318 121284 33841 -4891 -62660 -75373 -49822 -72219 -229525 -141740
14723 -141740 125121 136229 91440 100770 -25246 -143589 -146365 -103805 -128468 -81529 -71160
14712 -71160 -77537 -110728 -129762 -50615 -155030 -103091 -46268 -81942 -142190 -64979 -372 69282
14700 69282 39899 -5443 -118415 -198887 -220199 -299530 -366505 -395552 -348490 -299222 -154524
14689 -154524 -37425 -46347 13404 -13573 -15855 24255 -34309 -157245 -100447 -28972 22553
14678 22553 35236 -89763 -65975 34045 -34114 -40846 -5440 -14251 -64488 -121198 -51895 103888
14666 103888 149403 141525 205580 131578 70176 170201 168823 111754 189071 184998 137060 228170
14654 228170 291044 316229 248062 172774 165174 147035 120132 -9481 -164125 -180223 -223032
14643 -223032 -354838 -310117 -161182 -74632 -29652 -101878 -124097 -123890 -120386 -143726 -41299
14632 -41299 124518 7384 -95190 -164357 -184940 -200416 -104017 -56908 -55152 17637 -1008
14621 -1008 5466 86440 122066 150370 105180 70602 -24054 11376 18433 -63948 -110611 19555
14609 19555 26391 137607 119167 173991 141701 124778 93210 125715 139811 -7116 28319
14598 28319 109981 260827 146335 2969 38735 111906 27787 -83493 -53234 -125969 -46018
14587 -46018 9904 -124259 19072 87221 97493 69689 35154 95864 88758 -14748 1270
14576 1270 29944 43255 36077 28714 -54156 29768 52981 -70340 -132982 -56011 31621 -478
14564 -478 -64687 78460 87079 129441 107102 23669 -90343 6805 10164 72155 102793 136230
14552 136230 156793 32472 -22800 -17648 83530 -1370 -99458 -21730 -29638 17981 -14478
14541 -14478 -137293 -293180 -113945 -22315 83184 190842 121381 84412 -53754 -101541
14531 -101541 -207274 -266289 -189855 -187293 -132976 -102710 -49315 -118370 -67360 -42401 -96556
14520 -96556 -59324 -109725 -188862 -115886 -130029 -85463 58998 102777 48279 -21547 69388
14509 69388 95568 -31465 -52300 -124381 -249853 -262565 -317076 -244015 -103280 -3975 954
14498 954 -35575 -23043 157216 88243 15164 17422 6718 -30057 -99033 -185862 -276071 -180482
14486 -180482 -73633 -172246 -247251 -309669 -280256 -233508 -243747 -245142 -184150 -51054 85154
14475 85154 130904 -36343 -35094 -37496 34480 211912 173098 91455 39243 59707 -128154
14464 -128154 -91360 -54086 -7891 48628 -123277 -185254 -183573 -123027 -66472 77051 275281
14453 275281 231481 201761 111969 46529 -5671 29711 122951 290634 324079 312108 489051
14442 489051 395729 234968 77388 -3958 -20437 62589 183736 154078 19550 -86412
14432 -86412 -228002 -173308 -171481 -91755 29056 -78914 -136350 -115564 -196337 -264209 -128226
14421 -128226 -96557 -155035 -173345 -183364 -187839 -186377 -81285 -104201 -24831 -62953 -392 100685
14409 100685 20249 -58241 -26909 -17732 43020 -58995 -208141 -156562 -29437 -62547 -208712
14398 -208712 -116560 30812 107295 44742 -12241 15580 4288 -56038 -95167 -97087 -157992
14387 -157992 -33379 112856 116191 79762 185825 221613 4530 -121919 -54416 -174477
14377 -174477 -237351 -185956 -258247 -386395 -361190 -208592 -170856 -115457 92837 30180 -35980
14366 -35980 42941 43264 102238 92138 559 -181150 -236473 -255987 -190499 -238392 -145257 22821
14354 22821 66349 52378 -60137 -53935 -19660 -24745 39843 39791 7030 123381 31422 33176
14342 33176 -2647 41173 41968 -102954 -143369 -210743 -253564 -147169 -143803 -102330 18208 -23950
14330 -23950 -24676 88067 134374 8029 4389 53581 25522 43927 -957 -5224 65613 38640
14318 38640 -59182 -31890 -16010 80152 73835 73915 110745 112509 191381 186523 106678 3968 -156738
14305 -156738 -217421 -77489 44724 -497 85778 146609 165184 173393 69500 -127803 -124617
14294 -124617 31277 85263 -19189 -199619 -213658 -100710 -91924 -17993 27934 -65362 -25683
14283 -25683 94082 98574 91495 262584 254043 189509 171434 45311 -129159 -198353 -204668 -78819
14271 -78819 -94440 -206269 -124435 9819 15108 -4275 -2246 -24884 -6267 -25115 83788
14260 83788 226791 198273 148890 75322 31363 111060 114343 150429 41961 -25601 -13602
14249 -13602 6059 13723 71981 -36962 -83627 -122513 -66126 -52920 35608 82341 56181 48600
14237 48600 -36147 -142296 -169123 -14912 22692 -15877 15262 16756 44313 -45148 -151976
14226 -151976 -183353 -150815 -11817 29201 54236 130020 137425 123871 191714 205981 38795
14215 38795 3345 25293 -95887 -125795 -311050 -295041 -273691 -248403 -40511 -72873 -110545
14204 -110545 -123915 -132040 -177025 -196725 -94430 -87884 -83395 -84974 -109742 -161544 -172807 -77429
14192 -77429 -79269 -178391 -198993 -208709 -209486 -131437 103108 114234 -8775 -129721 -103139 5788
14180 5788 69440 40508 -210500 -308133 -230455 -18110 31846 -130851 -162926 -49035 -49765
14169 -49765 3551 -11821 65995 24211 11394 114598 45975 26348 140449 12623 22997
14158 22997 14319 -34461 -209136 -198066 -146355 -216931 -196925 -109190 -87430 -110276 11255
14147 11255 134931 75460 -180674 -365183 -409994 -291978 -163339 -106688 -101637 -65652 -130966
14136 -130966 -142570 -157745 -71487 112015 218495 108424 121017 159832 126549 85851 121625
14125 121625 144349 -104169 -225219 -109175 -28616 -67512 3123 33842 63884 82620 172235
14114 172235 98142 -14679 -132970 -241678 -20665 202595 282979 234920 200286 196460 29807
14103 29807 -5517 -2367 -18227 50474 -3116 -33515 -67151 -100113 15594 -132742 -95730
14092 -95730 63603 108995 79098 107164 174168 266972 152205 120296 142107 213562 207492
14081 207492 74138 -128661 -151819 -28941 -249765 -443098 -290420 -76961 -4850 41359
14071 41359 86813 107387 63231 57497 117701 112208 57863 845 13086 58644 -9609 -113146
14059 -113146 -89831 -121171 -56435 24954 38061 56628 97775 117756 42119 -6327 114988
14048 114988 164637 43470 -44346 -73971 -125302 -226052 -114129 37588 111682 53310 -20495
14037 -20495 52901 66388 -41169 -66074 -115652 -51423 -58411 -46980 -223446 -264389 -214347
14026 -214347 -240335 -74748 70702 209792 161737 -46768 -59574 19716 -65456 -10398 -7828
14015 -7828 231 14013 -6513 16024 -47003 -147844 -127031 -9715 -3502 76416 -87704 -113684
14003 -113684 -62235 -52442 39162 73318 97819 -21553 -49971 -42697 -34926 83153 88988 -50181
13991 -50181 -233803 -95825 872 4598 -11636 -19023 -41378 -123858 -186365 -153877 -88057 -202639
13979 -202639 -188688 -239695 -268883 -335846 -188854 -125142 -43391 89824 17341 97127 -19995
13968 -19995 -31063 -57606 -74119 -54621 -110423 -101355 -149391 -124967 -146444 -183184 -178188 -54000
13956 -54000 83644 92593 973 -91707 -159738 -210836 -181714 -56513 58180 148854 85300
13945 85300 -1596 50528 5952 -41822 12230 -55028 -118463 -217989 -203824 -232814 -233987 -306620
13933 -306620 -208163 -78048 -100102 -13724 -44968 -117238 -197152 -124395 -115794 -193115 -118449
13922 -118449 -82252 -76612 -133847 -66313 -48223 -95366 -17947 -16585 1505 -11726 -90103 -152802
13910 -152802 -59176 -23501 -3582 69704 -24144 -8159 -10296 20687 -33837 -89505 -27024 21341
13898 21341 99462 194446 236116 286103 177959 109945 86695 55237 -99085 -51549 -53938
13887 -53938 -84605 -24503 -85544 -205443 -104736 26747 -120949 -75186 86484 54729 -29511
13876 -29511 -21294 8554 -71251 -37878 91583 119849 111999 34871 -37954 68054 117221 -510
13864 -510 11146 77300 -11218 -169672 -195268 -198175 -148723 -180698 -194966 -111248 -64989 -64691
13852 -64691 -19608 3133 -16137 -41771 51371 84036 10099 29751 -11602 -69117 -132165 -84967
13840 -84967 -20274 88489 74845 124242 280826 249265 58280 144515 201190 97517 7806
13829 7806 -60711 -50426 14227 94640 52111 14020 26093 9344 45867 113406 -10324 -41095
13817 -41095 -124978 -223516 -127919 -86701 -49626 -176701 -175787 -70331 8720 9251 6561 -53395
13805 -53395 -45197 -31609 -73072 -17040 -134884 -66968 43430 74396 -88647 -80849 -48296
13794 -48296 -72486 -70903 -69381 -4563 -6415 -94275 -113448 -184873 -246158 -170457 -109683 -9517
13782 -9517 -27471 8447 -195679 -218833 -148262 -73161 -14479 44971 -102496 -173952 -51716
13771 -51716 -70566 -132542 52710 27638 -15929 -100375 -92580 -94516 5201 98792 101317 35810
13759 35810 16925 55426 55612 32313 -62814 -10162 -76672 -98686 -52233 -212166 -258871 -150343
13747 -150343 96728 17099 -47041 -60346 -129417 -77727 20067 117678 55928 -32350 -30560
13736 -30560 69670 56721 -43637 -71794 -9009 -5616 -46789 -78721 -60505 20511 -28662
13725 -28662 -97377 -136864 -59999 -5492 -54612 -38978 -27768 9928 30265 -6703 -22364 27155
13713 27155 98592 145807 84952 24280 51525 20996 -95238 -136894 -182526 -225709 -219479 -113896
13701 -113896 -51239 124498 259785 323484 334319 224517 104013 130466 130220 60643 95017
13690 95017 91395 49854 19285 63465 124243 211258 76493 59484 154129 101560 41618 40058
13678 40058 38501 -17315 46554 15323 -70778 -38491 -220435 -279442 -119936 -58706 -63164 43531
13666 43531 26288 -169658 -278403 -212719 -240218 -271562 -161422 -116825 -232408 -161516 -45301
13655 -45301 -33422 -39545 -70403 -68673 13891 47297 59409 -15535 -23393 -85509 -216028 -131264
13643 -131264 -91466 25971 53913 34605 42067 -15467 13189 -100041 -169579 -130864 -132566
13632 -132566 -88897 12445 15504 -55450 19424 -1019 -118476 -128793 -2675 -14254 4848
13621 4848 -21273 -52090 -60179 -54959 -79407 -157804 -21044 -13204 -68894 -79888 -101463 -47359
13609 -47359 -62704 -42504 44022 60612 -74399 -132973 -127857 -51537 74762 33065 -73837
13598 -73837 14656 -9971 47499 -39221 -41277 -20701 16457 127628 133896 56670 127261 35940
13586 35940 -111058 -121283 -87929 -68839 80076 108134 69844 -97139 -153317 -185992 -136969
13575 -136969 29051 -53912 -99394 -47281 -173934 -147404 -63034 -123105 -37326 -442 37596
13564 37596 33089 103343 50287 8405 -59690 -33565 -4116 -16909 -52650 -40410 -46083 58253
13552 58253 171107 130798 151167 36043 -54584 -113029 21245 -2353 -110741 -145334 -185839
13541 -185839 -170132 -161978 -165553 -159657 -160667 -17087 89348 -1077 8988 -23444 -49548 -79397
13529 -79397 -74036 39064 156715 51783 -105786 -100284 -125083 -57724 132028 248656 246577
13518 246577 330883 302446 164460 169051 140106 -23659 -84979 -1319 21833 70821 123511
13507 123511 -52779 -57327 -53055 -74254 -81199 -59854 -145013 -146477 -57724 -124135 -119433 -59898
13495 -59898 -25936 -99880 -152234 -71704 -73801 -40774 -108046 -164725 -85816 -135812 61179 -13060
13483 -13060 -6403 19734 37113 45019 -43673 54238 144520 77041 21031 2852 -126863 -317980
13471 -317980 -336300 -266008 -87519 -53811 -123127 139587 103089 -54075 -59644 -89520 -149103
13460 -149103 -48064 45269 38932 -1097 -34765 -101726 -145887 -152616 -118537 -267106 -146175
13449 -146175 -17152 82041 20053 -47910 32764 130699 123711 97932 29882 13351 58111
13438 58111 18779 39939 53081 -3969 -75543 -114204 -165662 -300324 -275314 -267437 -211559 -126598
13426 -126598 -17090 68775 49057 -1994 -34652 29095 15683 63348 83499 63018 70277
13415 70277 81361 -28875 -62445 -48882 1592 -73670 -138478 -29492 67684 156536 81264
13404 81264 -17631 -103831 -147058 -203500 -290155 -183655 -119275 -107533 -23212 -1490 -87978
13393 -87978 -25709 64201 46905 -46106 -51546 74008 111575 141375 214840 197242 102674 181565
13381 181565 194108 121396 -2239 -168410 -309259 -321314 -208278 -64063 -84961 -106101
13371 -106101 -24907 57467 270052 413710 317405 339133 290565 317390 293628 175572 83794
13360 83794 87873 15202 -19759 6032 59147 78834 -8112 -69365 -20381 -13062 -57966 -238800
13348 -238800 -465623 -302902 -224953 -49279 83141 -10895 -43914 -57879 -118809 -69126 31035
13337 31035 -49919 -120129 -22822 -68821 -40522 -95673 -220123 -214530 -251697 -318763 -247751 -213895
13325 -213895 -260456 -136364 201 18971 71791 93841 72100 124275 245046 298823 315346
13314 315346 208564 109876 -13180 -76408 -9568 52360 71965 47940 -18178 -42172 46146
13303 46146 110574 82556 58218 38276 101405 233293 50829 -16558 119748 199739 270510
13292 270510 258949 66906 -25995 -85276 -94185 -164134 -187103 -63327 -45527 -124786 -145668
13281 -145668 -50710 -44322 -63546 3392 -75452 -120151 -135296 -66028 -59455 -41716 -60698 -88504
13269 -88504 -61 80173 171903 166397 144925 41415 37774 -64005 -35989 -140036 -243152
13258 -243152 -182219 -29334 25666 -78631 -219318 -226591 -224842 -97890 114988 119733 113231
13247 113231 167420 74180 -50149 -126633 -34775 87840 108506 89817 96274 -95266 -141647
13236 -141647 -167832 -171431 -130756 24365 56367 -39643 -55371 -95523 -195230 -107908 82250
13225 82250 15587 -122583 -45335 7260 -123299 -122398 -49014 23254 -95493 -137108 9517
13214 9517 178698 74254 -129568 -210628 -111901 -111159 -107637 3340 31442 96747 53735 -66584
13202 -66584 -105788 -43781 -28194 -38525 50947 106976 15641 -134067 -272001 -214763 -99327
13191 -99327 -95119 -168528 -102300 -159211 -155264 -199757 -217526 -198602 -167390 -126601 -100386 -132059
13179 -132059 -81522 104799 189013 230691 201851 134548 104399 25431 -15707 80372 -34419
13168 -34419 -93055 -82020 -14885 59493 17257 -95544 -76840 -158429 -223098 -75077 -40530
13157 -40530 -95773 -153145 -151274 -178958 -200172 -72518 -5165 -66032 -168513 -97010 -20077
13146 -20077 -69941 7317 -10946 -169495 -290586 -193719 -67686 614 -111949 -124474 -3904
13135 -3904 120696 94874 144256 -35692 -186086 -148229 -111227 -141491 -204189 -119329 -13656
13124 -13656 -89628 -123764 -138006 -55855 24880 82813 61412 25244 -53609 -63985 131838
13113 131838 232817 283256 191185 -28015 2623 109375 100887 90859 17695 42178 -8373
13102 -8373 -8404 -29670 112828 179179 2815 -131079 -182490 -10164 35787 32280 49940 101298
13090 101298 -31739 -89043 -76892 -131276 -226832 -199343 -89295 -82227 -88411 -197271 -154424
13079 -154424 -208345 -179076 -8945 171233 -8076 -46553 -8699 -117087 -128552 -61095 -142917
13068 -142917 -138766 54000 172520 128394 102458 196424 161208 52667 -187797 -308254 -317945
13057 -317945 -275270 -249983 -314629 -289025 -290037 -281734 -317139 -184251 -126350 -164915 -127058 -60950
13045 -60950 -35220 5028 -27580 -1025 -133933 -154923 -184308 -112263 -19429 65955 29910
13034 29910 -115459 -134832 -105200 83645 185266 138336 188166 136859 169608 77042 -76485
13023 -76485 -94905 -65053 -62094 -74840 -36139 21852 -10208 -45733 -42002 -53898 -216846 -271445
13011 -271445 -122522 -16760 61574 53340 82018 76814 -21689 -212369 -231035 -55842 9276
13000 9276 55366 56928 45747 -36965 -28523 60048 9107 -133424 -87180 -4031 -51632 -102023
12988 -102023 -108537 -111607 -27344 21096 -9507 -127425 -182615 -154859 -196555 -211776 -134651 7425
12976 7425 77265 106465 169299 100425 155434 221914 274441 159916 146786 112029 132443 55561
12964 55561 59675 82234 117682 156881 81447 125906 212415 128110 22733 58711 27588 -13570
12952 -13570 44613 76447 45738 -46707 -44722 72496 1513 43954 3516 12560 -65953 25687
12940 25687 13319 -71289 -110944 -108762 12000 170473 286343 235900 138370 195257 196835
12929 196835 54454 -12470 -57799 -99902 -33756 -157488 -144976 -143600 -229959 21939 214270
12918 214270 194919 169885 177969 209582 151425 71819 20106 2468 -39193 -19648 -27867 -123380
12906 -123380 -121334 -149326 -202143 -153186 -43367 -130058 -44490 -59301 59850 68485 119341
12895 119341 147991 105694 66073 68507 -31824 -67722 65560 144064 52824 43070 91390
12884 91390 205850 209890 139123 45665 17293 11213 -3679 -103789 -155887 -62784 -51064 -34115
12872 -34115 -822 -7183 -6572 32075 159430 306306 270049 62219 -34756 88131 114351
12861 114351 214967 415264 404678 192421 28006 34378 23251 -8578 -8105 67246 40766
12850 40766 -11278 -151686 -154840 -156927 -149063 -92501 5105 -4826 32443 35823 20117 136485
12838 136485 204275 181101 242793 195789 46922 -66046 -136654 -103259 -34022 -67181 -164857
12827 -164857 -133003 -182840 -137071 -102095 -143264 -141365 -107370 96383 119164 -128676 -144729
12816 -144729 -42408 -44959 -253183 -339385 -260323 -71600 -12892 3831 32980 -8620 -33875
12805 -33875 -108585 -148684 -144399 -140501 -50351 27162 15734 89233 -9594 34839 50523 21719
12793 21719 -28685 -111815 -120415 -48982 -85683 22835 105346 144258 153364 227255 295880 252292
12781 252292 83609 58100 78083 7424 63154 236761 238177 46097 -93079 -130863 -124573
12770 -124573 -68640 -11557 9155 -59213 -33323 -56467 -47099 -70735 -50173 -24332 909 21063
12758 21063 11512 -37118 -110036 -174334 -160331 -121644 -34952 44735 117428 22825 -74538 -90480
12746 -90480 -102939 48587 216900 272319 252601 195618 211906 285189 196459 258249 224222
12735 224222 159316 69165 82590 73634 -60453 -194481 -121305 -101586 -114041 -29905 131496
12724 131496 254656 233456 230012 226932 180937 187237 62731 96589 92232 71438 111861 151055
12712 151055 245778 95302 -18581 126932 201138 136275 41220 68382 174259 113937 65202
12701 65202 227504 358107 362218 347698 414546 278033 187826 185542 236583 240351 85375
12690 85375 94064 36588 118778 144887 18126 132839 96377 -132363 -175109 -91573 -35535
12679 -35535 2106 -20879 -56077 70973 112566 42072 -32382 -55970 37074 35695 9179 69076
12667 69076 144722 174540 115319 58877 129750 144819 38268 -1742 39923 58 -3887 -28384
12655 -28384 24706 128253 207708 260547 349472 365406 312000 263372 168484 71763 -80366
12644 -80366 -138395 -4375 32010 42488 -90570 -194673 -245703 -233381 -8056 173914 99236
12633 99236 133908 -6696 57945 222505 319802 312964 172422 41798 -27798 -15103 32627
12622 32627 262662 406455 380594 265609 182521 222609 119334 65987 10574 102236 203843
12611 203843 207076 194603 87382 1627 73667 122629 148982 142498 123229 69959 52642 112564
12599 112564 173077 198290 334281 264097 231695 155176 189684 111334 34273 200421 233132
12588 233132 105887 163515 176829 95351 -60462 -71559 -77978 -33676 55646 82266 231289
12577 231289 323209 304291 223997 202147 119424 112107 115445 143102 189255 119754 99707 56446
12565 56446 5041 91443 99753 84241 172425 235218 308235 287438 331868 368222 234258 127793
12553 127793 162565 172621 224008 203282 322714 282724 179802 87538 211775 274511 289588
12542 289588 277441 166834 152785 134206 179445 194636 272167 276711 198074 266986 259174 272446
12530 272446 203941 183408 206157 323743 418236 532904 456354 318599 232950 308878 387761
12519 387761 404203 261977 205743 229432 116510 117861 211147 370381 363796 313675 313354 221633
12507 221633 139903 145301 258597 397587 447447 425296 451176 412788 342810 204473 208732
12496 208732 247533 253906 326924 289178 155802 105022 88225 176902 204725 78129 185048
12485 185048 132629 -26156 134076 357070 315561 224622 177843 91020 -41880 42765 155555
12474 155555 213290 287460 296382 134665 99511 263301 341798 370604 391352 297311 294019
12463 294019 433290 388306 326113 342556 403575 375271 312394 293056 340240 308830 259207
12452 259207 151923 60060 123376 155459 160905 146868 148493 94883 9899 12432 90397 195529
12440 195529 104378 50758 110070 231806 318558 312372 295136 183196 286652 348622 290800
12429 290800 279551 258343 286071 284704 249251 237643 203971 235157 361320 332891 201924
12418 201924 95402 191956 289463 273881 367579 435124 412934 288628 302710 438539 583793
12407 583793 526106 538587 536226 489948 347679 229217 139623 205733 268863 367889 308063
12396 308063 330969 280925 308784 351674 532028 520594 516017 519505 650112 675096 671997 733073
12384 733073 643164 536923 453971 422881 381719 386186 451176 424586 340846 427926 554533
12373 554533 441300 411741 401697 489757 462047 439068 391986 371698 408747 490529 496519
12362 496519 611910 629261 627824 774471 790340 616817 433652 499669 548231 509095 450844
12351 450844 351705 323579 391079 417914 464589 327529 218035 250122 389756 497961 544377
12340 544377 491428 427946 401459 437102 582044 596350 452512 341023 470432 512095 472218
12329 472218 416128 467666 482511 371374 270269 255976 375439 535243 583573 565174 434522
12318 434522 443033 540949 531275 451316 474470 676816 848451 830949 661634 600041 564855
12307 564855 584707 578534 585901 660826 797432 845982 777667 658295 641720 742055 807294
12296 807294 772200 760375 692447 620284 696298 853107 982455 1012417 1065349 1057262 1027161
12285 1027161 947429 935909 790666 546023 474982 625385 774959 914416 883106 914402
12275 914402 921140 953920 1060945 991144 975293 892321 799159 796337 804218 784568 712958 657451
12263 657451 768872 716590 710870 801604 786450 896344 837249 633023 566235 596883 696308
12252 696308 758020 761001 995674 975814 993612 1016931 997856 932835 994225 980546 1053381
12241 1053381 1163253 1009285 914483 921259 895661 849193 879171 998469 1062692 1217394 1244705
12230 1244705 1230780 1355365 1397909 1345506 1328637 1389602 1361678 1456892 1463389 1405692 1475951
12219 1475951 1452422 1423083 1308382 1149967 1071615 1060306 1114109 1265560 1470226 1590935
12209 1590935 1480777 1477426 1519760 1537778 1557881 1692180 1717545 1713513 1612883 1663683 1606434
12198 1606434 1538710 1597599 1618720 1691791 1697756 1589929 1512425 1633107 1837950 1997915 2062487
12187 2062487 2050213 1918080 1752206 1746234 1738179 1883416 1912223 1882069 1865634 1935758 2096561
12176 2096561 2097209 1997808 1957268 2082774 2142191 2263536 2296306 2265330 2215381 2360122 2424274
12165 2424274 2364078 2390731 2501684 2610283 2606057 2539953 2525969 2609201 2595300 2635821 2771875
12154 2771875 2854348 2882704 2842426 2870102 2892212 2819188 2906102 2949088 3085889 3084963 3129189
12143 3129189 3373812 3405536 3432475 3407346 3408401 3395147 3450882 3578458 3663748 3696275 3732147
12132 3732147 3641283 3617074 3697824 3827147 4056948 4103246 4097463 4225948 4366571 4361748 4382693
12121 4382693 4537653 4639740 4709707 4817046 4814428 4785033 4642499 4583872 4826624 5019814
12111 5019814 5223967 5434228 5460817 5469750 5584684 5720708 5885782 6002826 6089924 6117421
12101 6117421 6181905 6258238 6325494 6555658 6738252 6833862 7044536 7279692 7263284 7392635
12091 7392635 7683821 7841100 7964836 8200694 8491319 8682063 8868891 9067359 9240812
12082 9240812 9348253 9487830 9815680 10167234 10432485 10569660 10716522 11060898 11455731
12073 11455731 11643318 11924643 12169279 12525797 12874395 13233947 13597477 13983068 14369598
12064 14369598 14840981 15211487 15494800 15916424 16293581 16823130 17337891 17805894 18270381
12055 18270381 18804205 19468827 20155616 20730804 21315196 21963441 22515212 23145338 23858146
12046 23858146 24638027 25511568 26277526 27016510 27784435 28551802 29305283 30094637 31008414
12037 31008414 31755625 32562673 33556088 34623606 35597868 36464024 37249337 38197312 39279171
12028 39279171 40198469 40994040 41763163 42555480 43355004 44192808 44968146 45792561 46558755
12019 46558755 47247511 47763176 48147259 48647022 49054553 49377467 49444059 49415994 49533419 49415746
12009 49415746 49292328 49234809 48996008 48619196 48174042 47734434 47279104 46736111 46074319
12000 46074319 45319697 44416488 43693391 42944357 41986258 41035673 40164925 39303814 38424095
11991 38424095 37410449 36332850 35518326 34721886 33908798 32918106 31888628 30989661 30084488
11982 30084488 29270915 28534366 27679891 26779138 26006659 25425565 24770436 24057115 23376047
11973 23376047 22656170 22052910 21472400 20888109 20256091 19692674 19078582 18650059 18198272
11964 18198272 17649705 17167443 16700571 16303386 15832516 15432577 14935817 14447363 14182374
11955 14182374 13966667 13569714 13180753 12950089 12614209 12223793 11874370 11632493 11461127
11946 11461127 11173845 10797762 10556127 10345578 10240165 10014638 9779011 9603824 9432561
11937 9432561 9225473 9055904 8841082 8568346 8315360 8213472 8069426 7772937 7597660
11928 7597660 7407623 7107335 6891717 6916167 6896566 6785517 6762922 6686314 6584677 6491255
11918 6491255 6373613 6221002 5843923 5637745 5541217 5498431 5407867 5479052 5547604 5332343
11908 5332343 5141337 5002827 4904042 4956606 5040995 5025248 4861699 4759984 4728289 4569698
11898 4569698 4342270 4191555 4171553 4154483 4005390 3986326 3921207 3858128 3821246 3651229
11888 3651229 3593048 3498017 3444254 3475672 3588577 3637684 3663872 3394396 3108546 3187349 3227125
11877 3227125 3142690 3043236 3040839 3086207 3115919 2959971 2832365 2861289 2954357 2948428 2954739
11866 2954739 2936076 2796871 2710821 2647668 2477427 2292368 2129031 2184612 2176022 2305001
11856 2305001 2258068 2119037 2174409 2339484 2348856 2237119 2046418 1904601 1913442 1899091 1980249
11845 1980249 2005137 1986635 2093860 2167297 2075226 1901701 1654876 1644403 1737294 1933535
11835 1933535 1916145 1720009 1623838 1565488 1639238 1664093 1764293 1732515 1606318 1467268
11825 1467268 1464257 1465476 1374470 1303926 1346154 1310581 1412525 1558467 1594532 1635229 1618742
11814 1618742 1584142 1415017 1418807 1455580 1425387 1439293 1598871 1545389 1409936 1457503 1513678
11803 1513678 1378628 1321492 1242645 1210934 1211559 1145569 1178097 1116652 1059557 1052633 1067185 1070969
11791 1070969 1090080 1219310 1251230 1255004 1302082 1297854 1218107 1217408 1177498 1228705 1178337 1204239
11779 1204239 1208544 1175447 1088532 945077 1025090 1062959 1171347 1127917 1012468 977226 976355
11768 976355 887659 839850 814277 811927 982532 868774 809255 740470 707062 819445 872941
11757 872941 895207 797774 744135 691147 717824 755120 765624 790423 776280 717355 742381
11746 742381 676181 590035 677857 741487 754204 763521 738030 837919 826810 774477 818842 809327
11734 809327 844664 833653 865972 905105 927106 793120 734507 765941 716675 708731 828513
11723 828513 846579 705033 523346 481168 537266 674651 788683 827755 848767 782240 800649
11712 800649 732315 489339 463607 600132 641650 521196 455415 500559 465909 703808 846739
11701 846739 820559 783972 712575 726513 822124 841934 784965 541813 353664 278788 473055
11690 473055 528980 500579 542985 539770 546905 628071 669153 635928 653120 507526 488170 516429
11678 516429 498949 609412 671110 691961 549378 370849 391152 498530 665374 687869
11668 687869 622479 592046 555971 477352 464341 516350 562798 632457 640107 576323 660365 731237
11656 731237 680067 648438 637493 550911 422532 421530 455210 349702 357141 467069 563514
11645 563514 478452 418318 435366 453395 447782 424242 337724 415436 507752 517112 472743 475891
11633 475891 472634 539971 447669 381707 439573 445973 388857 351301 344069 247331 374645 482089
11621 482089 449396 473824 644252 493742 442266 294255 271916 183392 100602 101360 134275
11610 134275 152214 105070 82707 98248 55531 162011 240165 245741 218447 277596 392762
11599 392762 314434 313024 383525 382451 429860 402148 302231 329620 434253 411041 450388 505258
11587 505258 525105 453736 423592 375790 310205 313190 202237 44059 53225 247058 296365
11576 296365 306742 160179 36025 -6777 -44748 -152330 -87344 -7397 66079 90340 130558
11565 130558 192269 152164 79156 66558 24121 46380 260025 431379 387644 314357 327043
11554 327043 287189 258478 34456 -107081 -78202 30317 54561 45863 97676 85006 69986
11543 69986 80228 -4330 72253 291088 302047 188644 267092 262184 155714 88654 185299
11532 185299 251467 330671 472296 441106 345869 204092 86358 110084 103628 -1063 13922
11521 13922 109400 123282 143421 1482 173 119375 1978 -14267 -21989 25161 97048
11510 97048 3066 -36100 -22480 -19415 21823 148494 240914 273398 344495 313109 192206
11499 192206 165387 159404 224862 222940 255511 325619 322597 284172 226612 420640 402082 339105
11487 339105 359351 320514 228631 183571 273302 306374 271853 284719 306309 150836 131000
11476 131000 73217 95455 58133 -35592 -63000 -11030 136637 166888 166108 232049 224855 123541
11464 123541 117235 93626 90731 -19888 25791 19723 94089 144365 54447 142046 136954 150135
11452 150135 154233 91090 21088 64114 -103621 -106299 177896 232809 343138 414357 287854
11441 287854 275189 239554 60524 189395 94142 58697 170171 194713 232969 292637 352266
11430 352266 389064 345092 192747 225518 295529 238960 122724 170114 73348 48935 12932
11419 12932 37123 118765 -46037 -65429 36107 -10880 -40409 -7955 80069 203364 199781
11408 199781 263519 261958 168317 168648 117535 176424 320313 348776 361232 295722 202553 67566
11396 67566 -38408 16766 -111669 -148705 -154255 -104812 -77670 -30272 41617 103029 89577
11385 89577 81072 58284 122879 46179 -13699 -72592 56247 107522 37971 3168 -34088 81660
11373 81660 139733 113550 -14860 6086 159343 101409 46984 58916 3868 101274 170678
11362 170678 156375 162326 146436 50432 137235 92916 75155 112572 110724 -41216 16915 27750
11350 27750 28709 -14172 32561 -3879 -105618 -160830 -71708 -21581 68455 161862 75550 -153934
11338 -153934 -199181 -204301 -32832 -17032 -120297 -94760 -78525 -119806 -85070 -78494 -60861
11327 -60861 132085 120631 131242 129797 50737 -23892 -60067 -113731 -82831 119849 67656
11316 67656 -24701 -31517 27765 66031 79859 -4822 -15301 -58516 -101782 -8101 115243 85983
11304 85983 81959 83946 93095 200299 120486 92650 -36722 -69333 27179 192221 304758
11293 304758 340092 182113 99720 178561 154317 76203 4929 -87222 -194540 -239602 -106995
11282 -106995 -49141 84726 79851 83730 51612 -85554 -100191 -138554 -47273 60667 47201
11271 47201 -3390 67448 12896 -53839 -39462 47244 107111 134405 173490 169238 132275 32001
11259 32001 -121039 -176676 -72165 -11344 -39083 -77977 -136755 -90509 -30894 6923 77080
11248 77080 44945 21871 44314 53715 -35963 -71600 -83501 77226 181131 162909 121239
11237 121239 62872 105604 190108 128126 108276 145307 106724 -23124 -140745 -216508 -208935
11226 -208935 -160292 -60366 -149609 -218185 -146858 -32930 -75031 -84367 -9772 12367 6449 -16145
11214 -16145 -24249 -150779 -155434 -242638 -51436 70160 119874 146709 -8967 -60918 -10224
11203 -10224 -24073 -62361 -77688 11254 27214 18372 -89966 -184039 -58286 -97937 -91415 -70191
11191 -70191 -78216 6625 122217 89022 -22900 -110534 -12614 -25679 -149725 -159119 -334574
11180 -334574 -285934 -153027 -29779 110771 59944 153968 187763 90231 -37142 22500 16465
11169 16465 -30656 2382 19963 -15402 96922 95600 116212 22743 5663 -44386 -31314 -134802
11157 -134802 -174890 -106715 -119619 -152672 -178264 -101172 -160415 -118649 5452 -9468 29956
11146 29956 19718 -68880 -166498 -159290 -122123 -71468 62897 172151 53643 -40076 -25712
11135 -25712 -99658 -170533 -79438 -9501 8395 46492 128838 154930 83341 -97436 -175793
11124 -175793 -78720 47584 63488 151206 168849 176505 143969 33888 -127621 -208304 -88406
11113 -88406 -107899 -91216 -256400 -208309 -79019 -30106 -144888 -267807 -254630 1012 111728
11102 111728 -29590 -70552 -54713 -15683 21779 71894 191516 196685 181639 79651 63197
11091 63197 214654 250952 165751 77565 74240 -71685 -204581 -163155 -68803 -48041 -44364
11080 -44364 -73627 -15100 2871 -69029 38496 104245 145121 98549 25378 64613 73574 134090
11068 134090 167999 104506 -9927 -109589 -211865 -216643 -110940 -28405 -93670 -6385 73145
11057 73145 -3481 -47268 -33765 60217 172413 247297 343664 389275 453011 431805 394178
11046 394178 374569 297339 218674 223178 378193 432375 380643 411017 453249 489993 611654
11035 611654 719252 892294 1081936 1307952 1398245 1181265 964703 1003713 1059562 945797
11025 945797 913141 975604 1230449 1599656 1802894 1814370 1774254 1602563 1336945 1151322
11015 1151322 1046526 891492 975619 1020690 1233334 1409263 1325768 1141365 1078334 993232
11005 993232 898239 708513 660017 677587 593489 482744 585605 680066 708416 659622 458743
10994 458743 200848 96106 184237 255583 275235 328811 327348 261395 283218 207985 124800
10983 124800 14974 -59067 -94656 -35954 -40346 51443 127642 154238 214881 152023 71687
10972 71687 90214 -27233 -18875 -93255 -79949 14854 27471 49846 57143 -53560 -7633 69479
10960 69479 102032 126222 78456 -53303 -45565 -108177 -121234 -64586 55626 -24084 -32508 -69465
10948 -69465 -170525 -213225 -211495 -177269 -200267 -206819 -173920 -154815 -139078 -40139 -110978 -213343
10936 -213343 -183433 -62398 -50913 -74589 -14188 -3242 -4125 9101 -48136 -127950 -262616
10925 -262616 -311626 -292160 -321500 -283175 -175605 -152862 -40542 -23808 -27155 -10530 -100820
10914 -100820 -90245 -146658 -168324 -186130 -172293 -94055 -108157 -108014 -4373 119711 138655
10903 138655 39205 -75631 -107984 -106967 -2982 58502 114820 -55968 -113308 -49376 57598
10892 57598 -41896 -103150 -67993 -77940 -173807 -156451 64077 263039 179187 50695 113324
10881 113324 74373 33789 -45467 -144833 -115931 -192912 -258820 -271405 -282476 -269007 -193069
10870 -193069 -187266 -133634 30735 -47808 -44089 -72488 -13599 82123 -10819 -70133 -77592 -80668
10858 -80668 -119084 -85646 -13531 -73430 -95715 14107 28606 -27250 -44767 -35353 77207
10847 77207 21352 -122732 -35160 84958 125956 148315 74203 -2487 21515 8593 121050
10836 121050 162639 152467 120834 89312 51906 -136520 -44350 44316 128974 278058 203620
10825 203620 78149 108070 160322 109623 58173 11701 17832 -147242 -17297 175800 131168
10814 131168 44241 -27537 -73524 9171 150976 279134 170308 5220 -180494 -159893
10804 -159893 -107040 -38370 -10749 42716 -102767 -159938 -232886 -410888 -331538 -228901 -267021
10793 -267021 -210596 -197278 -255205 -70630 -12565 -108763 -46233 -35672 -65316 -73635 -112485
10782 -112485 -58602 -39227 -206124 -187004 -148239 -129299 -158128 -142981 -148516 4668 67687
10771 67687 -70342 -258620 -280270 -157103 -84583 -55726 -190729 -184033 -126135 -122249 -124034
10760 -124034 -149036 -34265 -52648 -78072 -148183 -90900 -74680 -112508 -112433 -53351 -36209 -37977
10748 -37977 -87370 -111755 -4066 29834 -15230 -113731 -86044 -96317 -93078 -98001 10625 68069
10736 68069 21075 161047 341184 378739 456680 444723 423727 447952 388301 256949 317042
10725 317042 389946 447796 524364 497280 480793 423957 297637 345856 400891 428213 432768
10714 432768 530840 667203 854542 1139561 1387776 1528606 1751220 1975728 1957324 1965822
10704 1965822 1857178 1659993 1439191 1170945 1001787 666999 444340 477704 537649 398515
10694 398515 296921 176811 269880 375392 273981 81499 139385 206429 190130 274853
10684 274853 289517 136766 74801 115844 97650 44845 -12317 50404 199530 273807 187306
10673 187306 10070 -73051 -69353 16917 135588 131944 2321 -39020 97102 271642 347092
10662 347092 376139 373512 314942 305095 505458 622451 524329 366481 232065 194305 174373
10651 174373 311669 471903 585153 499512 558594 577238 697811 799073 873079 996000
10641 996000 1049749 1109999 1283263 1479384 1710414 2081976 2395735 2726229 3393587 4039230
10631 4039230 4466714 4916467 5398524 5843724 6489427 7369059 8607760 10338513 12584396
10622 12584396 15718138 20289150 26689818 35212217 46639898 60706280 76015871 89525147
10614 89525147 98553594 101838841 99746087 94871645 90989621 90933138 96600499 109038835
10606 109038835 129431703 156936584 187175483 212395161 225595527 224399952 210192237
10599 210192237 190194227 173452231 165577689 168611168 183464535 209911014 245689959
10592 245689959 283115812 310388552 318447315 305015465 273764438 235277568 202279661
10585 202279661 180747345 171329604 173114730 184725185 203190605 222002024 232744186
10578 232744186 230125400 213351369 185696965 155081706 129526323 112201307 102869904
10571 102869904 99920473 101576871 105911016 109872142 110312858 105292448 94499523 79935887
10563 79935887 64589181 51027016 40635597 32978705 27358864 23221089 20059174 17723708
10555 17723708 15800701 14258496 12873168 11783463 10860360 10152154 9360141 8583141 8072959
10546 8072959 7584448 7140236 6768275 6515041 6397360 6227591 5811574 5380860 5013298
10537 5013298 4814422 4687585 4564490 4219783 4105002 4015535 3819349 3626160 3575152 3494110
10527 3494110 3390719 3215380 3059986 2977694 2855381 2846724 2794437 2656592 2437553 2251406
10517 2251406 2296829 2250953 2182655 2053092 2024124 2129535 2112910 1972053 1777448 1709624
10507 1709624 1786129 1816423 1803386 1851826 1894946 1762840 1695464 1663346 1584817 1615971 1605431
10496 1605431 1436071 1457414 1627842 1694063 1671690 1613646 1553761 1616574 1737875 1823177 1794315
10485 1794315 1954088 2294034 2595899 2881112 3150218 3343422 3477604 3556089 3628346 3553807
10475 3553807 3365038 3193335 3053072 2891472 2682113 2400891 2137117 2022144 1866144
10466 1866144 1599512 1290844 1016578 944330 927238 968022 985592 936040 935912 996957 995800
10455 995800 918914 776712 689372 707196 674454 635240 590593 452387 423787 588114 706529
10444 706529 744738 816213 766890 735291 908903 1007085 1033468 937697 854515 962952 1007493
10433 1007493 918199 775336 722388 616982 500705 625513 636793 698185 748391 714520
10423 714520 672055 688911 804642 783705 727132 650340 468528 427763 413040 489385 550031
10412 550031 544147 553269 556016 478182 527631 456458 300988 325163 297762 277214 243894 276303
10400 276303 292284 376563 404458 290797 158785 240588 154259 193901 227095 220446 224773
10389 224773 278785 401863 508381 519316 348162 167497 159079 147452 234580 228410 311098
10378 311098 242631 196418 218108 348221 417416 353234 312545 327952 342490 303620 231862
10367 231862 189491 217780 328481 344657 238816 123158 120240 311618 462825 341213
10357 341213 257226 199469 211334 189085 279839 306331 420248 358750 298374 343856 395331
10346 395331 466213 505518 579090 662510 587460 540279 552427 463628 350552 433341 569948
10335 569948 544880 434939 444439 480134 442798 360537 374163 408440 357977 277974 271657 304491
10323 304491 261538 351438 436914 388842 366266 272747 325617 354409 414513 367966 336123
10312 336123 335039 330135 269972 173730 215344 191438 201710 210141 441433 648483 636677 594379
10300 594379 441621 275463 236851 276171 313418 205258 186802 324609 358392 316652 373657
10289 373657 441937 319455 275350 229229 219785 275728 311870 325154 383317 444907 602633
10278 602633 642033 653459 698123 705663 677039 658453 632082 623029 527564 411280 495300 580486
10266 580486 563898 533275 633022 624121 523643 457480 535868 423449 483533 711969 842127
10255 842127 970967 1062385 1089648 1048134 999265 929840 790791 654755 436179 227766
10245 227766 92557 98272 171110 95989 8788 105289 137489 81011 41884 62057 76974
10234 76974 222885 282267 270102 394828 547811 622811 549930 383594 485873 530575 608972
10223 608972 762427 869638 891137 873297 926110 848332 912074 891532 726388 755557 917968
10212 917968 916295 848731 733004 846990 900159 837016 771667 827844 945345 984800 941193
10201 941193 800416 655018 548364 533930 515634 508316 462065 604021 574873 495788 477876
10190 477876 512380 490520 464058 676969 827794 858509 787177 625261 652915 649438 659144
10179 659144 765726 943112 1055809 1189344 1362379 1322350 1295446 1289757 1386859 1583747
10169 1583747 1729213 1884832 2102907 2152869 2131940 2129911 2099265 2028093 1992779 1986463 2039379
10158 2039379 2119754 2354265 2680231 2911267 3049607 3061373 2982714 2834850 2534239 2389688
10148 2389688 2393789 2376543 2392866 2409655 2545109 2596745 2655465 2784267 2722941 2675719 2621127
10137 2621127 2540681 2374240 2381389 2368817 2405283 2550685 2653553 2661279 2720085 2763732 2912137
10126 2912137 2967854 3087261 3211017 3266539 3328628 3581630 3868274 3997802 3993351 4161323
10116 4161323 4380775 4699151 5011257 5266212 5605427 5889513 6240810 6698609 7327633
10107 7327633 8091034 8906571 9859152 10791705 11865103 13146053 14687194 16451580 18246150
10098 18246150 20253698 22536187 25290044 28576400 32121686 36092167 40456667 45519878
10090 45519878 51955046 60124818 70753798 84972620 104227324 130379799 165406845
10083 165406845 210602969 264652595 323940844 384508364 442378892 493527814 534095460
10076 534095460 558940687 564826761 550926700 518908464 473094447 419134188 361390508
10069 361390508 302715847 246837853 197990730 159098360 129836152 108202645 92038505
10062 92038505 79649053 69923466 62217148 55789979 50333795 45702168 41712355 38241132
10054 38241132 35050759 32013206 29329979 26861961 24610372 22501946 20587269 19061546
10046 19061546 17790208 16592542 15563951 14704470 14044308 13391025 12509659 11810235 11242142
10037 11242142 10720231 10353725 9832090 9268755 8874298 8515236 8107639 7857056 7478553
10028 7478553 7180090 6985899 6768918 6483745 6235603 6069563 5844559 5469514 5309140
10019 5309140 5156604 4857802 4667017 4563122 4480769 4375446 4279447 4167846 4014687 3775486
10009 3775486 3653920 3480462 3474612 3545881 3474649 3371574 3269387 3125163 2967323 2778834
9999 2778834 2636590 2635093 2660353 2494798 2385202 2296730 2282990 2330942 2454943 2360344 2221275
9988 2221275 2165766 2105085 2124500 2048808 1858108 1966839 2044262 2029397 2107095 1882020 1777177
9977 1777177 1760667 1816635 1789671 1759210 1704369 1565719 1582113 1630030 1625580 1607071 1617925
9966 1617925 1539338 1540194 1612510 1667535 1699514 1747866 1932415 1980168 1875819 1838849 1801965
9955 1801965 1716944 1753702 1838390 1670884 1541318 1477181 1292856 1120692 1097257 1194455 1171272
9944 1171272 1094634 1011066 1124819 1274047 1221769 1135267 1037725 910451 712054 653841 749133
9933 749133 765452 793459 811040 928467 924888 940266 966515 906050 977368 901724 786727
9922 786727 888162 1043411 1095525 1033447 1135772 1072661 918720 966251 1014291 1034259 945167
9911 945167 775623 735758 711593 620017 514053 519930 606677 628333 751729 810628 838699
9900 838699 747424 586625 486424 478897 569136 526539 459616 463256 508997 487063 480967 437620
9888 437620 406818 414113 359085 384595 482551 418997 422515 388021 372172 524064 476051 452331
9876 452331 506391 655938 741876 610391 566070 399028 345625 446986 527950 587753 659865
9865 659865 773145 613756 593731 491060 431844 412774 366741 450208 562530 470350 276518
9854 276518 209083 236552 373135 425268 438147 439887 548143 627877 690113 579511 414036
9843 414036 377394 359096 367877 439919 411295 404167 377954 274492 287461 291293 388086 396365
9831 396365 395087 444739 585814 522576 386421 379449 407836 470926 454463 488103 532377 594216
9819 594216 547321 447669 405219 595546 615815 539465 428155 473302 442675 280431 183112
9808 183112 78731 214166 468087 544323 531296 463603 392358 357230 357441 384664 392296 414317
9796 414317 323319 307732 284838 249600 310109 368416 309675 279720 257241 263843 161460 124538
9784 124538 79763 -79242 -123393 58185 84516 198144 298391 387765 371974 401616 395551
9773 395551 439243 482548 319610 234796 273894 294271 270760 252492 303309 223042 197987
9762 197987 190416 153052 146029 336262 398033 382586 304139 280714 306321 352874 348285 378194
9750 378194 407350 449182 355364 254109 172573 208545 411812 424413 377055 426298 411754
9739 411754 195032 95041 24165 26228 4437 4293 12455 60083 30496 -12485 78993 140677
9727 140677 176332 120927 57834 83727 160054 329010 458694 445329 323929 177431 75154
9716 75154 231753 169030 58982 123277 239924 67463 1023 43275 -93378 63442 105202
9705 105202 125906 170283 279668 374605 266873 142434 72272 173332 156985 111656 52136
9694 52136 190834 326335 317342 326979 298501 295155 443580 514969 438532 239205 334805 448380
9682 448380 520795 568703 649893 745017 852146 1124772 1478554 1799002 2048115 2376884
9672 2376884 2735712 2908137 2917933 3068514 3133594 3033517 2822496 2625907 2428631 2168372
9662 2168372 1879573 1601160 1469499 1312609 1295397 1041843 769637 678830 814968 1060351
9652 1060351 1574330 1786428 1766146 1607446 1251907 950222 745841 685258 527522 391392
9642 391392 415200 481296 442595 324692 279944 198171 272896 171065 124342 294957 382805
9631 382805 391895 360044 111506 -23195 156362 160142 158001 207343 217428 221821 165673 148790
9619 148790 191816 152278 -13154 31615 147448 216534 347436 457664 417007 167399 244816
9608 244816 255309 178449 157006 200322 157804 137217 175672 255492 219029 222614 70944 117068
9596 117068 126874 40117 59187 142409 193617 200881 260550 268370 249506 355913 332183 188771
9584 188771 164200 108029 -112691 -98076 25219 283170 243586 153547 100604 135480 188335
9573 188335 380251 526075 417441 246603 166286 97508 158471 203611 199854 182513 156592
9562 156592 71091 138079 131492 77523 38195 116894 304886 189993 26232 147406 202150
9551 202150 127853 114112 46434 26228 189782 366976 294643 199717 330126 320260 194513
9540 194513 206460 211118 322485 400608 388527 441541 451396 484928 395806 190103 76918
9529 76918 102270 237980 219001 193990 39704 -1322 -8364 14716 -79696 -113289 23164
9518 23164 162302 88582 67135 168470 165996 151441 141710 44362 15491 2310 76373 54224
9506 54224 -114427 -29706 7258 28900 138812 211553 137567 88139 39409 44625 75200 146630
9494 146630 279331 418374 293289 242339 152787 83956 -21282 17282 110918 26629 -44977
9483 -44977 81409 96582 127916 184731 278308 265876 173463 193051 179002 214592 243830 144861
9471 144861 131752 109640 124089 186232 177199 179994 5005 -18907 -27071 -30289 -35706 56098
9459 56098 100913 173739 154536 246488 267734 201375 170942 211270 207410 159669 134092 20767
9447 20767 29331 101815 49898 -124704 -100433 55979 26218 46861 99291 249626 290579
9436 290579 196755 110991 40971 68918 67304 105850 112491 187984 247554 259783 79798 18965
9424 18965 92023 44879 -34188 -89973 4875 51659 -76894 -219016 -101125 56805 149241
9413 149241 147895 266173 448133 458041 341350 171065 86552 101634 193865 195653 104717
9402 104717 169640 214472 313815 304115 88472 34562 11634 -16354 -27938 -20473 -9238 88918
9390 88918 179362 57998 -3716 50748 94988 139288 192406 170823 187533 215298 283355 257365
9378 257365 183036 130600 171881 290506 298267 259510 165731 260082 279738 244210 259429 192624
9366 192624 25012 48185 12167 6543 -44118 -28109 -53610 -9544 120279 228105 250304
9355 250304 293795 324505 369858 303499 144529 139319 129002 83837 10984 23358 87373 -50590
9343 -50590 -13265 13252 -77539 -116981 -26473 5586 66488 141372 253583 195874 -57609
9332 -57609 -45254 233605 286587 305356 329204 233306 211444 252490 266534 266347 192434 188918
9320 188918 293489 340670 354826 246184 175662 54201 50708 56158 151664 195642 118897
9309 118897 119166 226778 167291 7208 -10189 14922 -12394 26422 60081 20428 -37857 -130075
9297 -130075 -96404 -81368 59141 206950 12139 -17178 -133303 -254127 -140474 8111
9287 8111 83405 190880 168148 98352 24225 117212 111852 171617 -29019 -87751 10570 -17087
9275 -17087 -131780 -220187 -277094 -247663 -172495 -79803 62175 82686 77467 147434 350495
9264 350495 255535 138801 107984 45003 -31382 -11886 -36910 -27266 -75274 -135432 -123981 -68061
9252 -68061 -75447 53485 132861 135200 41516 14275 -43097 -79436 16492 136785 82222 -64492
9240 -64492 114190 362463 288830 137738 37565 139885 216916 155308 223971 183663 145942
9229 145942 142622 144922 146895 266920 204528 179998 208309 174986 170203 258156 309620 315979
9217 315979 301968 268960 192483 268716 207434 224167 102397 -55287 -98066 -106138 -25631
9206 -25631 164550 210149 115763 95931 243562 331572 422130 375051 262139 127614 177676
9195 177676 169149 46702 46489 95573 141137 105548 -17589 -29267 -7939 183798 275369 60655
9183 60655 -45964 14876 174828 158856 -2067 -59073 36618 -18571 -118166 -98419 -88857
9172 -88857 -127115 -101031 -124022 -81022 -120435 -194514 -145606 9884 163671 225425 204803
9161 204803 223199 112142 101360 128467 338585 390642 313164 251830 157512 56496 -34546
9150 -34546 6867 116751 62588 131326 95058 71965 -114421 -259584 -297213 -209011 -125679
9139 -125679 -12906 47732 116587 111734 -8828 -176085 -179352 -109553 -19388 23349 -15054
9128 -15054 14658 35303 18203 -34695 -41330 156179 202676 114536 113980 77899 88848 52069
9116 52069 -9111 -52139 -28751 25342 121982 167628 144616 57643 -6305 132829 271360
9105 271360 300544 210057 214410 186497 122711 164810 193879 146154 137833 -24731 -20563 52880
9093 52880 24501 131482 164201 221016 318343 258755 261671 399595 428684 306357 250100
9082 250100 -4068 -92716 -11815 82770 132545 217838 97385 22788 108215 257910 123923
9071 123923 150892 169351 7620 -68301 -22754 -37378 12230 21530 12588 -60958 -39960 -74335
9059 -74335 -93419 -177338 -73870 -79426 -37940 -42391 -11891 44195 20806 -135468 -149328 -160925
9047 -160925 -260558 -185477 -149683 -55533 -20347 -145239 -57810 -132039 -133769 -74613 -108488 256
9035 256 70896 25222 -1981 -7882 -11770 -100771 22084 59395 81587 126659 103887 25701
9023 25701 8264 17375 -107636 -163186 -143466 -146227 -28847 47813 41289 -18350 171 21799
9011 21799 92125 -9231 38733 108797 8786 133804 168661 120301 83339 103537 71115
9000 71115 14196 39000 6265 34191 108341 58995 -81131 -103765 41840 14553 78146
8989 78146 195832 251536 282262 141727 40824 9039 66366 63088 36975 46267 92900 185330
8977 185330 114042 43578 -25491 76203 144281 36177 26819 25791 3181 -31521 5323 120411
8965 120411 150047 160757 153745 91909 -72437 -133445 44134 55492 60268 69404 54445 45129
8953 45129 67465 114352 -74363 -79737 -132160 -134853 -69051 -17863 -11679 106128 293151 325427
8941 325427 162296 131949 214056 305416 269930 139568 39164 -78052 364 55611 -29195
8930 -29195 14993 -38396 3300 132437 111444 41665 -6078 -57603 -159698 -56282 -32129
8919 -32129 -28441 26689 -52159 -102625 -105174 -57146 155161 134161 52711 48268 16300 -64376
8907 -64376 -40929 16859 28747 19882 -46184 32767 51991 -13783 -18474 -38926 -46215 -76571
8895 -76571 -35134 21502 15235 -36882 -87963 25998 -13454 41463 148154 38852 -64770
8884 -64770 -182692 -149350 -99465 -2154 -4549 36931 23798 -130410 21551 71862 -18890
8873 -18890 -25098 -86720 47573 -14572 -189652 -134980 -101502 -121078 -33003 -24336 7060 -62400
8861 -62400 -43176 -57910 -82997 -12393 64445 57070 -22194 -24416 -15043 11397 108697 220794
8849 220794 183315 74517 -8456 -89627 -71863 -88826 -43012 91669 121708 -3535 15760
8838 15760 130708 269625 87764 -8634 11550 -47457 -84676 -37560 -26473 30528 12783
8827 12783 -4825 72778 99584 -44742 -175663 -140601 52084 231392 267667 209192 116420
8816 116420 132041 222266 91109 112044 201543 250546 198415 64830 98568 73130 40228
8805 40228 78587 -33066 -11010 -976 7326 -7078 21958 99033 151878 10637 -39395 -63084
8793 -63084 -5847 35674 71182 98376 63430 142071 199093 156350 63405 23200 -43161 -183941
8781 -183941 -270079 -359302 -366200 -236495 -96007 -39758 -125844 -29037 13309 -30805 -14810
8770 -14810 23310 17235 91275 176259 130285 46609 -80664 -244472 -158424 -91862 -65314 109660
8758 109660 287287 310119 234665 146993 179969 197798 172107 251136 338617 197304 122324
8747 122324 130820 4262 16879 196729 155243 -36552 223 8619 -72706 -30740 25555
8736 25555 142925 145760 81866 169471 109776 55262 46686 -73594 -103670 40067 134499 126063
8724 126063 45231 18717 5118 -103578 -36757 -14997 -656 30609 245301 354583 291557
8713 291557 167178 48143 -63571 942 101899 152171 153833 156589 103135 37801 54784
8702 54784 65131 -11340 -18502 138380 122790 21796 25496 -81389 -48393 89097 156397
8691 156397 2213 -19706 86053 3914 36826 144630 178709 182345 73609 -82301 -100226
8680 -100226 3672 21390 -50880 34524 76323 24578 -8738 68060 20302 16743 36424 47011
8668 47011 57925 -46568 111453 146150 169044 131639 166068 41252 -15803 -55119 -37016
8657 -37016 -6933 53683 177371 93270 -41018 -21590 -30237 -82366 -105581 -57824 16110 83700
8645 83700 79221 177559 231565 280729 223367 201099 151355 198235 142598 5786 -119816 -150898
8633 -150898 89823 245513 274568 239117 180460 160086 69259 -96361 -236986 -196514 18804
8622 18804 142335 264213 320385 118028 -5436 -99081 -107258 2327 167445 227201 123790
8611 123790 153550 149524 147812 124484 36703 93060 112021 189524 147642 121797 80529 14727
8599 14727 -8803 -58441 -37492 -46321 21709 98761 117477 26232 -94206 -52093 129620 160995
8587 160995 199204 118195 82847 194647 222560 225024 156821 12617 -57034 -11138 -17291 -30772
8575 -30772 -1794 38985 80237 57293 -62282 -64448 -70445 -27902 -107754 -104407 -87670 -118381
8563 -118381 -113816 -85593 76591 140785 202506 245799 193659 192800 123880 163963 77299 -52867
8551 -52867 -8726 -24734 10265 46558 156341 113511 13675 -95336 -32699 80194 7873
8540 7873 -21332 -129614 -168765 -257631 -287588 -149202 -62509 -93782 2753 123731 95314
8529 95314 90431 3012 126789 210410 196544 267545 254008 98257 75888 194206 191294 143839
8517 143839 54941 98750 103123 46448 119581 15746 -18384 -133869 -182320 -16011 74223
8506 74223 74975 7335 -101277 -24877 92457 130112 236304 169410 87287 25627 -33681 -113510
8494 -113510 -133083 -101726 -54043 50601 -15852 -117293 -60069 -29078 -90918 92683 201320
8483 201320 117691 -32797 -77990 -133366 -147028 -217996 -248068 -143112 -39240 -142726 -219078
8472 -219078 -198840 -64891 -44428 -80355 32948 167663 206231 68582 48928 128755 198904
8461 198904 227806 262298 212406 232051 211165 163631 203957 148577 93669 27779 -24070 -12293
8449 -12293 -18176 -219539 -228860 -106570 32346 91088 70565 -10370 -35255 73797 -7748
8438 -7748 54332 175078 167429 170009 226522 203244 88864 -65178 -169385 -152681 -120605 -84299
8426 -84299 -81422 -23729 102390 187062 142448 87882 76368 111373 86538 96585 71113 10311
8414 10311 28344 71076 154025 137941 42177 -30199 -159441 -152740 -14471 63454 189307
8403 189307 87831 11821 42924 -2599 -47392 -115455 -15729 198910 150517 47354 -4196
8392 -4196 -169108 -288747 -304155 -292065 -214069 -116096 -84792 -32989 100464 8887 -45251
8381 -45251 24383 70904 100293 256167 195040 48487 -9707 -56200 -73144 -69434 -102419 6892
8369 6892 34286 -27749 -19908 93105 99712 6043 118935 152967 97637 52595 38599 124380
8357 124380 98264 177016 193542 181651 165701 164637 119872 34522 -91987 -67567 85865
8346 85865 13616 -138071 -266777 -305141 -150516 -79032 -70721 68744 137320 40875 -47501
8335 -47501 -82205 25165 14357 69252 148819 140244 95134 -24543 -202355 -331946 -298812
8324 -298812 -132647 -116923 -114210 61239 116800 119472 90274 82069 203286 324956 363218
8313 363218 249639 309461 242767 124080 -39333 -17379 158777 194097 123416 144466 -1101
8302 -1101 -106721 -22232 108276 -27809 -57181 83160 142853 88199 30853 136807 227226
8291 227226 167545 42144 13452 20860 -95997 -218371 -252563 -143096 -3372 39822 148496
8280 148496 325967 338230 197912 119027 35675 -101178 -103567 -195664 -225857 -251782 -275662
8269 -275662 -189618 -136813 -162269 -70262 -57614 -122128 -159677 -159549 -108079 -65112 -73195 -109646
8257 -109646 62998 61869 -26676 -65187 7925 47303 114607 156670 95743 311 42981 118469
8245 118469 61340 111474 -26385 -127444 -130820 -81656 -2577 133717 245820 244048 161838
8234 161838 49601 24753 16143 30805 49277 -45085 59900 132169 16408 -75667 -114425
8223 -114425 -62724 -35347 -59791 -35558 -141108 -222791 -165308 -128550 -158278 -216243 -144466
8212 -144466 -191508 -200548 -74759 -89482 -81888 -50988 -146572 -152862 6044 -28110 -131573 -121366
8200 -121366 -46392 -3583 -67903 -27805 -27647 -147955 -168523 -70204 -2915 -26067 31454 100079
8188 100079 127415 113809 197458 181604 226465 353486 190437 -23922 -121020 -119416 124696
8177 124696 263445 171849 145171 67479 18870 -77596 -123932 -157173 9111 95251 108766
8166 108766 193870 133922 103390 167492 214089 71166 170209 125114 53179 -17067 -89605
8155 -89605 -84281 -46927 16316 182182 186287 201136 169864 176772 181445 223641 29632 -35219
8143 -35219 -58103 -50439 -14843 76009 70121 -34246 -91670 -24671 2075 11538 58629 44255
8131 44255 -74592 -73545 9249 -90462 -153867 -49228 -75915 -204640 -227342 -171945 -81146
8120 -81146 -72144 -126029 -155397 -149792 -177416 -144182 -21355 53298 147882 33301 -167221 -204240
8108 -204240 -134321 -60736 106317 22411 99106 186814 7598 -94199 -137301 -153984 -13567
8097 -13567 59776 115561 211951 188704 128175 112221 -100503 -256126 -240937 -122382 -209908
8086 -209908 -177872 -104167 -65443 -142349 -94147 -15486 -112690 -232259 -194291 -58234 17321
8075 17321 -28929 17640 21680 -69367 -57558 -28756 18449 9121 44622 12027 -116403 -160102
8063 -160102 -107656 -74914 -132175 -85031 -52757 -103510 -83513 -3007 -24208 -57408 -49196 51029
8051 51029 99320 108414 78136 -14402 77890 88183 68905 19255 85181 143085 31814 54220
8039 54220 123444 18157 87508 161707 196605 102686 23865 64306 78004 82633 58856 -92448
8027 -92448 -81216 -46831 -102235 -175221 -95149 33257 3265 -1035 28689 8110 62715 93765
8015 93765 201303 240605 83269 -18182 840 29342 81799 70131 44549 -38853 -39052 89333
8003 89333 17025 38140 107980 52012 92083 257301 444647 481724 453788 506502 269949
7992 269949 83872 188841 206544 219062 196604 224132 199727 78655 -40528 29205 -37631
7981 -37631 -84151 -32210 54560 13219 43274 112262 153416 14321 -82078 -105932 -135108 -148209
7969 -148209 22037 135900 84815 61381 71310 78037 126396 41840 -63976 -117332 -171930
7958 -171930 -156223 -161255 -82442 11507 43935 123251 137384 145238 191156 93806 89567 195507
7946 195507 88570 43098 111539 146480 78937 82817 104368 142182 223199 113267 -26159
7935 -26159 -53103 117570 68292 -147852 -187283 30468 173791 -1290 -98140 -189926 -220911
7924 -220911 -218076 -243155 -146703 -40874 -14893 -25659 94851 179416 79716 167020 45175
7913 45175 -72701 -42336 -14765 11175 -39126 69012 71203 -43580 -82729 -124365 -237442
7902 -237442 -110691 73389 58877 83635 154127 80075 -6758 -41262 -29990 -24324 115611
7891 115611 119428 16684 -45553 -83385 769 95654 113546 38624 55437 -12007 -49538 -46110
7879 -46110 -71986 -69442 -77002 -93008 -123508 -158712 -69248 21613 102944 56676 73951 46070
7867 46070 41101 19219 27126 39656 33480 38616 -19847 -183640 -233489 -144322 -68665 -3183
7855 -3183 -27047 -17940 97669 48544 35686 6474 -81838 -316124 -313561 -420424 -358907 -142944
7843 -142944 -29880 -122038 -160371 -45169 61219 123968 171607 249757 185819 175344 169712
7832 169712 -22119 52837 166666 258358 174214 130420 56225 -15402 -68916 -64149 -118991
7821 -118991 -31020 118692 100096 22013 4882 32917 -51881 -22289 -32739 39106 -154058
7810 -154058 -300879 -267193 -150715 -47887 -52299 -80343 -18472 -139011 -113024 -33717 43688
7799 43688 120723 85479 42603 -22513 34564 9100 38610 -61462 -200541 -208531 -46634
7788 -46634 76078 10035 -102059 -35270 153943 125109 88583 101720 88401 137512 189441
7777 189441 136243 68081 -16286 -82066 -230844 -206563 -58589 37936 -14789 122067 129274
7766 129274 46546 89732 168009 81974 -24371 -25961 3536 67808 -3561 -42342 55547 242909
7754 242909 177958 96639 207576 205510 56925 -115274 -213932 -132868 -109028 -168276 -70705
7743 -70705 8845 -67370 -46815 128090 137555 54201 -64208 63334 320836 386265 361091
7732 361091 283823 160163 -68770 -127664 -93797 -32610 35016 251516 245259 100898 40733
7721 40733 11514 42607 86665 12620 -43579 33827 155736 190019 136352 37930 -72264
7710 -72264 -44321 -43749 -86581 -16406 -49663 91833 64666 139599 67863 -27981 -86893 40704
7698 40704 115281 137863 227570 204986 142202 54011 71643 172808 158225 -21031 -22424 -49974
7686 -49974 -180089 -68628 -62301 -64578 -40900 -117668 -56843 -69367 -73788 -55668 -146642 -199373
7674 -199373 -108415 -38191 -116386 -149532 -167980 -97217 -93206 -111418 -48872 36076 207320 238781
7662 238781 200220 86672 27678 35816 69625 5097 -44004 -61252 98984 167023 125991
7651 125991 164453 240975 144778 3635 -121994 51130 15297 -26342 -35318 -155125 -102927
7640 -102927 -30314 -60979 -191133 -165258 -136534 -143514 -115206 -131483 -50241 62093 -9505
7629 -9505 -54025 11017 90567 -25258 -159669 -168953 -107926 -118869 -148923 -175385 -37227 -37173
7617 -37173 -57964 103642 210287 231265 313564 297344 214458 -19270 -123193 25265 107791
7606 107791 98720 -28225 -139890 -144921 -46060 47167 64294 35219 -54982 -65370 -54200 -104028
7594 -104028 -69166 88176 149413 164685 27433 -52583 -33302 -84527 -35693 69715 -1110
7583 -1110 54103 119576 106713 157011 51407 64018 60791 31171 -35770 -14243 21127 89233
7571 89233 99802 196936 272895 398467 399704 369905 296588 141784 79208 85838 82427 -123965
7559 -123965 -302090 -95325 -59012 -88320 -96117 -110061 -60510 56131 -23728 -94083 78524
7548 78524 39827 -84737 -46148 -89972 -96837 -124150 6295 120944 139573 106925 351
7537 351 -126383 -167284 -17169 45554 -24170 1266 73393 104639 125651 50323 75910 106870
7525 106870 53928 59610 109129 29841 -66473 -85456 35223 57752 -2823 34784 -144833
7514 -144833 -215489 -247030 -82579 -6861 40615 24959 -60755 -91891 -94332 31827 23270 87932
7502 87932 65438 -81971 -82372 -22616 55643 -33587 -13526 116015 190399 73757 88065 48794
7490 48794 17983 -21736 -129027 -164219 -108176 -4535 -84726 -41390 -1146 26672 -58247
7479 -58247 -144659 -248848 -281557 -265733 -233724 -22025 138816 131946 16947 -74870 -70574
7468 -70574 -105927 -111915 -129827 -68413 -17426 39919 -68914 -139277 -132461 -93001 6468 1426
7456 1426 -94603 -108284 -68494 -122795 -253694 -164384 -103110 -4877 21637 27347 -18656 -2559
7444 -2559 -45257 -101734 -2838 -1536 15852 -81246 -124595 -131977 -72488 -33222 -145228 -206679
7432 -206679 -95207 -186256 -154888 23045 -13990 -146483 -108028 -190886 -71879 -40010 -124725
7421 -124725 -156048 -96412 -74444 28832 -12560 -11937 129994 194421 234590 182072 128903 70714
7409 70714 29336 -78020 -94419 -160331 -131297 -124428 -154338 -125494 -78006 -122945 -56775 -67159
7397 -67159 -171828 -243976 -134689 -18559 -69454 -49759 -51364 -148382 -133850 -108242 -18708
7386 -18708 -87109 -108469 38742 137169 67609 172698 156366 132986 150406 357370 400031
7375 400031 392534 412210 363706 339702 270466 114833 147471 51556 -8096 136833 177949
7364 177949 131122 89825 52854 -85100 -115013 -214838 -176088 -105217 -75820 -68835 58304
7353 58304 25992 -1107 23256 -43817 17944 11407 12398 -46464 -50722 -38301 -104945 -234170
7341 -234170 -288125 -32862 -43057 -163692 -234387 -209069 -192975 -218205 -137439 -21555 -4219
7330 -4219 -83654 -83803 35655 31716 -6320 92119 92627 33173 34833 41590 54433 109185 -24067
7317 -24067 -64396 24566 67498 98815 8723 6561 18801 -36641 -59684 81033 40912 -169575
7305 -169575 -245298 -179278 -18456 117145 193119 79319 69232 39118 -24643 -53979 -153276
7294 -153276 -30721 107426 89844 -8938 -48754 -202017 -130772 -69144 -20128 5031 42661
7283 42661 -16381 27543 51313 -38718 80663 118819 7236 1961 5128 -74685 -116252 -142290
7271 -142290 -87472 -16786 58801 83584 218822 181995 164556 21202 -130437 -85217 -103961
7260 -103961 -76438 17053 54518 25583 14007 65478 -25684 -46124 -31139 -83805 -123852 -38149
7248 -38149 102432 7992 -143000 -124260 -202341 -217279 -154831 -18550 -28878 -118071 -124188
7237 -124188 -68062 -96299 -168761 -32040 11508 43681 65996 112612 49740 -11663 -83970
7226 -83970 -54711 -147090 -180879 -214441 -170919 -91468 -11580 25297 20166 12041 134078 169805
7214 169805 212187 254090 255390 204162 166940 181783 151550 6560 -48098 -2590 15152 24254
7202 24254 -20442 -23932 7379 -72211 -79415 -2510 90033 154901 204180 90170 -20665 -27554
7190 -27554 -77283 -102227 -122953 -211478 -240845 -156776 -73298 -2571 32628 6250 -80368 -32259
7178 -32259 -93627 -87394 -13362 71780 78995 56889 70066 81614 167065 181535 164608 -67990
7166 -67990 -227730 -184462 -34097 121798 140821 54735 -135211 -106570 -11783 51236 28374
7155 28374 5745 -22565 -77557 -279829 -381009 -313631 -185520 -62090 19622 -20879 -127209
7144 -127209 -78369 -73862 -81140 -66621 -32315 37859 -3060 -26900 12560 -8658 -10517 -10079 -62732
7131 -62732 -32522 -29325 -88622 -117218 -99159 -65295 21401 79679 137498 116304 28809 55106
7119 55106 88341 176 -13269 -71926 -52293 7199 86694 129336 55873 -6188 50274 81626
7107 81626 65463 69784 45312 144542 240410 317005 194855 18 -149998 -57144 -31968
7096 -31968 -41478 -116420 -93258 -102347 -37780 -24552 -9947 16911 -96949 -143751 -247288 -120832
7084 -120832 -34482 57945 19788 -55159 -80500 36598 289059 308078 233029 126256 131564
7073 131564 172425 126795 37352 16597 -46802 -53809 86149 -87932 -100413 -115607 -166160
7062 -166160 -195738 -113555 -60788 -183065 -153483 -163912 -146208 -51467 -607 -16751 -5277
7051 -5277 34600 -73816 -266405 -160560 -2547 70329 -61044 -211417 -76519 7278 -34635
7040 -34635 84963 146926 55235 71402 -28703 -72374 -68939 -226736 -240872 -54013 47750
7029 47750 127347 121749 -34042 -119275 -90095 -19835 -10876 -34058 -7622 95398 32447 -9302
7017 -9302 -35650 -36847 -57775 -125976 -189190 -272175 -287118 -117704 -89060 -146261 23703 56624
7005 56624 89527 11544 29243 95810 150756 51029 137931 185583 124611 34710 -30632 -72691
6993 -72691 -63400 9430 -128423 -90630 47047 -55296 -153330 -250472 -135520 -77040 96597
6982 96597 111895 -19143 -151711 -148664 -25211 -107243 12423 67863 167265 89943 87729
6971 87729 170169 110315 61687 63703 14554 -10055 -29660 -11462 72299 74510 178627 309249
6959 309249 408322 432511 254886 187756 197616 251687 263098 188176 118505 226953 217478 119773
6947 119773 171565 4994 67224 137284 120942 91114 17548 19716 30184 -6776 5177 -24188
6935 -24188 -55978 -116361 -9160 43512 -137840 -142633 -178037 -332308 -209952 -146462 -84186
6924 -84186 -7086 95317 -22906 4851 144271 171182 48584 -66619 -112618 -107115 -28755
6913 -28755 -172003 -282553 -203216 29874 129505 -2428 -34470 50660 12060 19169 94031
6902 94031 148240 53463 31472 98653 53373 -98314 -186161 -116203 -150537 -154927 -74207 47908
6890 47908 65682 129234 106923 -4684 -83593 -128482 -46417 -105799 -214087 -307508 -166479
6879 -166479 -133761 -171531 -141485 -79658 -70874 -92261 -17977 39014 51901 -10228 -96117 -141579
6867 -141579 -156089 -265096 -344372 -211898 -22492 -28984 -15977 95984 159903 42491 10320
6856 10320 123972 15887 -211641 -249373 -265880 -132676 -53648 31399 -14345 -73728 -111475
6845 -111475 -147146 -9914 21426 59346 4079 -20798 -1972 1176 -38070 -79867 -95290 10429
6833 10429 40174 -37549 -49753 -97459 -21388 1960 47671 67243 39874 59650 54906 11919
6821 11919 32763 27003 218498 284861 88426 -66331 -47472 -122934 -237303 -299231 -287697
6810 -287697 -223331 -80312 -98249 -110373 -64677 -70111 -142580 -102792 61337 181031 135134
6799 135134 183825 241135 326617 343772 243526 127558 40688 42016 -12784 -93532 -88231 -47235
6787 -47235 -920 -133594 -106913 36878 -41485 -149739 -163418 -135099 -231934 -244118 -181243
6776 -181243 -245103 -139591 -190071 -151213 -15102 122486 76120 -32084 -128314 -168437 52299
6765 52299 99357 -2609 106101 133547 5964 -71785 -26560 18441 -79228 -143309 -261554
6754 -261554 -247663 -208051 -79606 -74255 -138636 -182411 -266597 -191296 -2145 57479 -92389
6743 -92389 -178868 -81825 -141389 -152519 -43204 -106189 -124104 -4601 2582 56386 -20182 -155983
6731 -155983 -235122 -403987 -299534 -198140 -66650 -96077 -176690 -83861 98789 -21603
6721 -21603 -41535 66168 121089 47489 20550 27580 84098 83264 -41510 -172196 -171627 -133991
6709 -133991 -23429 35296 -5244 29989 -60210 -79009 -24228 -28615 -1548 52269 30735 -7983
6697 -7983 -123915 -192233 -142495 -135685 9469 141880 116239 107121 65508 -46695 58164
6686 58164 204631 153482 129522 172689 80315 10118 80563 129797 57137 49360 44030 2893
6674 2893 -50822 -92875 28990 12677 -144410 -132485 -68947 -48440 58393 -3702 -3307 38613
6662 38613 -82476 -62414 -29638 55195 48686 -28437 -9097 67808 22693 -42272 -5033 44125
6650 44125 79854 50053 23002 22534 42693 -23614 -60980 11256 4403 93720 112987 146300
6638 146300 30234 -120696 -33035 -115688 -103815 -13521 43691 20383 -2611 -1170 -68096
6627 -68096 -29835 11134 144403 88211 115773 54181 -39322 -20916 76843 78301 -36617 -92825
6615 -92825 34380 77516 76440 109249 176359 167202 44525 17769 -120400 -136249 -115557 -193522
6603 -193522 -122580 -98304 -4881 118825 82895 18733 -30138 -20636 30578 90677 194941
6592 194941 164052 98882 16776 -126984 -118161 -18140 -85255 -65283 -136467 -357212 -384538
6581 -384538 -318887 -171990 -129556 -109751 -140003 -111135 -204462 -105253 -8856 -36575 59081
6570 59081 106047 34442 72605 77026 55124 122431 96639 98803 199779 216649 315253 218009
6558 218009 -19715 -30051 -70632 -112692 -81561 61977 58064 -42274 26353 88355 47961
6547 47961 51565 8937 23832 -135399 -109130 -44559 -3136 74082 100228 27497 65762 61172
6535 61172 11376 -30629 -175441 -232290 -167903 -69986 11673 121721 72388 -9868 -7705 -22946
6523 -22946 -67990 10181 -132617 -261625 -274967 -327096 -223006 -70478 -51075 -63523 -64837
6512 -64837 -124152 -10798 137079 12669 116365 216538 109422 -103717 -208750 -179062
6502 -179062 -54865 8961 49183 27217 126549 240856 243805 161011 104068 137846 160854
6491 160854 109661 63644 81373 173692 138705 147065 203920 114755 -85575 -78021 -207556 -322066
6479 -322066 -312643 -233038 -155592 -212413 -296443 -203021 -168941 14550 62949 57284 47227 89307
6467 89307 115014 68693 81157 258694 287368 125950 32161 27005 7316 -81750 -47721 1065
6455 1065 -16746 -42057 33617 16669 -125822 -158830 -95064 -165712 -138184 -99984 -123631 -63553
6443 -63553 -136744 -67260 23850 -28480 -101380 -152922 -94845 -21484 71218 69614 22061 8143
6431 8143 -29591 -68783 -10166 70481 -23379 -147217 -198357 -253290 -115574 -44067 -4418 -100844
6419 -100844 -156985 21613 31412 38200 -72610 -80119 -24671 55689 32271 49775 4168 -138904
6407 -138904 -180365 -49675 -58304 -86853 -103371 -184766 -199204 -56519 51220 15209 53955
6396 53955 -79556 -28061 14897 -49221 -72898 -217844 -159462 -137107 40442 76636 53938
6385 53938 83360 -13422 -72160 -29239 62993 -8911 -186083 -168393 -87528 -80167 -87187 -64791
6373 -64791 27350 86372 23872 -31033 55188 24605 -4936 -58198 -100055 -85584 49669 529
6361 529 -163390 -165411 -87558 -71427 -107772 -188448 -205092 -103037 -45053 21825 147841 43578
6349 43578 4341 -146132 -62940 108036 150088 136639 224019 257255 146401 35197 -14417
6338 -14417 -35810 -107023 -164725 -154351 -90209 9175 20410 -56393 -29451 30793 -50644 -194552
6326 -194552 -212126 -130889 117792 178795 96776 114263 87789 220746 200053 -23904 -107664
6315 -107664 -127404 -38656 -195538 -367272 -143482 5978 -74126 -177046 -199417 -205774 -87730
6304 -87730 -56553 23990 31570 16981 28670 -30487 -135561 -133504 -30162 -58853 -29034 -63445
6292 -63445 -62168 -70361 -114443 -116989 -72559 -106585 -124517 -79216 -76584 -97812 -43653 17324 118566
6279 118566 69738 2881 43381 47147 -22219 30596 -34064 -12060 -43051 -120397 -134945 -41733
6267 -41733 -63106 -150157 -104642 69281 123668 50708 30157 29104 -19267 45659 51386 -19316
6255 -19316 -1598 134826 178320 215417 150764 77157 161345 207726 129759 117282 41548 -33456
6243 -33456 -120655 -146616 -128363 -68811 -32182 78 -86431 -33474 -24528 -126082 -186744 -91046
6231 -91046 -119605 -16073 43550 -76278 -31466 66947 231836 183686 -64196 -115587 -58582
6220 -58582 -144898 -165826 -121101 -65199 -117684 -112145 -75158 -70270 51507 109826 33260 50192
6208 50192 22326 -56752 -164825 -112069 -152820 -216133 -233251 -199353 -214861 -97383 29381
6197 29381 -72975 -204065 -250266 -158375 -26923 43657 37531 -53260 -174637 -105326 -7452
6186 -7452 -3010 -5345 43120 116937 71940 79553 1956 -69652 -46709 -14759 -35549 20541 78895
6173 78895 29054 26134 -75580 -73778 -92676 -155649 -163747 -169110 -246455 -299151 -128632 51928
6161 51928 8987 8139 105628 205401 325841 251993 177897 71154 -98398 -150807 -182032 -197114
6149 -197114 -205528 -218448 -207261 -86709 11443 -12164 -36408 -137943 -161017 -85108 -17358
6138 -17358 -27846 54094 46873 57905 -32706 -115855 -45335 96241 104147 34022 -96649 -17421
6126 -17421 69477 72328 27462 120656 81806 31228 61362 57637 94801 11094 -23639 -122570
6114 -122570 -287401 -222987 -152418 -52991 91670 159728 38061 -18677 61526 94142 95452
6103 95452 122241 185001 45555 -11240 -50554 -30717 -82940 -67205 -78735 -85648 6277 118691
6091 118691 99604 59184 -44530 -50536 27492 -8466 -105585 -177840 -209713 -219573 -130288 -70917
6079 -70917 101829 119884 -29592 -172072 -174937 -179154 -141877 -118122 -227651 -73586 101333
6068 101333 1019 -115306 -164450 -243119 -220596 -175272 -19890 92287 102723 239353 114351
6057 114351 -21221 -125668 -299093 -206113 -32536 103467 273672 228036 156927 -3459
6047 -3459 -52073 64654 -48277 -186589 -145254 -3570 84941 8597 30753 79426 55507
6036 55507 145058 178897 51088 -90552 -87471 -7744 -23099 -1317 -11970 49084 -6290 -22384
6024 -22384 -83847 -52625 -190996 -143200 -56058 -121787 -258221 -200093 -124569 -141285 42598
6013 42598 73618 -27334 -66051 -64733 -32053 134327 134689 114811 38235 85167 -63348 -252871
6001 -252871 -195488 -101737 129042 244178 75335 -17756 27750 98037 72727 72121 43605
5990 43605 31187 96066 85226 82729 39427 -7315 69820 177578 232549 211918 63348 43961
5978 43961 146308 192583 107242 -4973 -77394 -54961 38832 106397 11552 -2721 142297
5967 142297 110443 44120 -34352 -42403 2080 168664 176451 -23741 33608 14615 -61096 -101927
5955 -101927 -99038 -104132 -15115 -112484 32649 109642 42374 -21516 -91422 -18121 -19949 -142547
5943 -142547 -185235 -178362 -234595 -374180 -323325 -227612 -132215 -70994 -19890 -115626 -187752 -108291
5931 -108291 -79462 -103062 -37612 20161 -27866 -97663 -124869 -177742 -188089 -99013 -83271 -158686
5919 -158686 -111491 -49534 -113918 -155732 -30045 16494 35488 203988 198387 131365 93628
5908 93628 151636 99735 -30829 -79252 -131641 -191071 -169237 -236807 -252431 -215277 -158242 -234330
5896 -234330 -219855 -74712 49864 35880 5062 -10336 -7375 -35579 -21306 -22628 -79753 73327
5884 73327 155657 112618 66189 51039 -52973 -100698 -39637 31740 -30117 -48711 -78842 -99922
5872 -99922 -250489 -203757 -109747 70157 127770 95462 -34936 -34451 -1898 -4869 -145000 -112430
5860 -112430 -127909 -124236 -231369 -285602 -251545 -117760 -51782 -60391 -128519 -201293 -222897 -128332
5848 -128332 16850 122879 67957 29014 67576 109236 149177 180421 310001 302333 267544
5837 267544 205313 109648 61422 -16795 24536 -35284 -89302 -102345 -70164 29903 -38169
5826 -38169 -70915 -94573 -32550 -56616 -198985 -171397 -128064 114264 172729 20048 -47247
5815 -47247 -17824 -16019 -65470 -211495 -195423 -249953 -360952 -265939 -197051 -177225 -100675 -97700
5803 -97700 -67055 -113352 -8289 108203 157147 257613 239829 231374 156498 -19352 38522
5792 38522 -51814 -113910 -174275 -272324 -195908 -33382 119583 102795 -25001 -16483 70116
5781 70116 14339 -77750 -151775 -249788 -233003 -142009 -57177 -106905 -191074 -266289 -141417 -162756
5769 -162756 -269620 -117181 -34704 -92509 -90802 -148252 -135848 -157092 -171567 -58300 -60233
5758 -60233 18076 64628 118940 149505 173480 123211 70883 -18279 32351 11505 -96956 55062
5746 55062 179613 158416 108775 72694 22136 9574 72679 161410 138312 132659 160241 7229
5734 7229 -103787 -28008 77734 42092 -9674 -67286 -160081 -53192 -3308 86236 78154 -94236
5722 -94236 -135339 -9475 87700 -34523 -174487 -204855 -72583 -12016 -55802 57317 39486
5711 39486 12167 36879 38700 -75986 -74295 -140760 -69532 -49494 -127716 -226908 -186038 -206834
5699 -206834 -179612 -202956 -260258 -250016 -145308 -16310 55745 -2892 -117164 -159044 -144178
5688 -144178 -137689 -194461 -230279 -106427 -111183 2680 28807 92286 84009 -81626 -124395 -77374
5676 -77374 -113491 -153951 -16240 40821 23261 -29886 -161475 -158872 -89086 -17873 13673 31602
5664 31602 10773 -45356 -62446 -49569 5309 35611 59076 39902 422 29583 125030 211006
5652 211006 218810 181728 110022 83812 6202 10052 39820 69591 5353 -30934 -24376 81615
5640 81615 57205 44285 50279 26938 -176019 -230059 -100217 70999 10037 44107 54455
5629 54455 77184 79989 58089 -15540 -145535 -156320 -40680 -13973 -70705 -36035 15906 148570
5617 148570 201378 129705 93370 105828 228103 334099 211315 226929 191679 32508 11151
5606 11151 42158 -29328 -44496 -108029 32174 206602 246343 199241 185905 59561 -28959
5595 -28959 -78504 -108173 -86097 -19068 58567 77576 69555 -203930 -262560 -162527 41605
5584 41605 66830 -69931 -151502 -234331 -174418 -128404 -76517 -55864 -88805 42491 172958
5573 172958 186419 185478 -17182 -40427 -24861 -161749 -122024 78159 47030 -22927 31261
5562 31261 47103 -4462 -32730 -104076 -104472 -47304 -60069 -11323 -28450 -136911 -238335 -278109
5550 -278109 -231922 -126764 -225032 -200347 -178462 -161749 -126443 -154042 -324682 -300227 -170515
5539 -170515 -192321 -114549 -34477 197563 342678 147450 58322 60536 128014 115743 26287
5528 26287 -12342 -12325 -115638 -110135 -180230 -190574 -98267 -127362 -144192 1241 -101023 -104047
5516 -104047 70053 35664 -7080 82965 173930 154072 98875 -7325 -5630 -133452 -134354 17424
5504 17424 23698 78984 101229 212382 194660 152635 116195 81589 172186 242114 150399 -15342
5492 -15342 -142331 -114939 -220114 -290865 -79448 -47750 -14680 21685 -32414 -7370 -47182
5481 -47182 -98024 -87274 -188971 -125143 -69099 66333 92204 -14394 -88808 -14678 116455
5470 116455 166985 98652 -32124 12454 -15177 -9426 86425 126299 233346 249454 236931
5459 236931 246146 126470 8651 -31728 -62216 -118834 -49344 -11896 -47516 -64012 -17311
5448 -17311 -66690 -59790 -26391 -114433 -193002 -143798 -82585 19864 -46694 -7104 34063 -8523
5436 -8523 45095 108238 152359 184385 70345 22735 132906 110118 16309 -86724 -145319
5425 -145319 -200779 -150576 -68985 -55674 -112285 -86304 -88317 -89475 -103113 -194073 -166297 -160569
5413 -160569 -154773 -31755 65 15226 -140489 -50253 -21874 79277 40885 14203 17421
5402 17421 144416 11824 -116177 -8754 14158 3321 34201 99485 208852 117167 -9503
5391 -9503 63798 92501 58134 130178 223316 184861 215599 95139 -11071 -104881 -229393
5380 -229393 -257395 4156 74547 -38681 -27810 9387 -56910 -20652 -208981 -221587 -182568
5369 -182568 -156270 -33911 -111525 -185876 -190967 -90627 -93857 48844 -25211 15199 -12527
5358 -12527 -5019 2254 1114 132755 132991 141021 -11450 -72794 -60347 -30959 -106459 -119619 -125410
5345 -125410 -788 13033 -127393 -214267 -206054 -208034 -265213 -332141 -271940 -229208 -192164 -201126
5333 -201126 -67324 -17909 -28236 -25126 -12237 -41601 -5330 -72728 -52144 -31816 -229076
5322 -229076 -106967 63088 71347 45901 80705 200033 156949 53538 -106389 -199402 -218703
5311 -218703 -198509 -202423 -195390 -120020 -77911 -68975 -72820 -47448 -92274 -142157 -95204 117191
5299 117191 145607 131844 99655 151628 120092 23365 -13345 78220 120700 68762 142531 200150
5287 200150 227884 396355 323042 110331 78784 104655 91816 63808 124702 -80288 -180364
5276 -180364 2704 52766 41004 -51920 -31533 -50378 -19543 49549 109656 135053 93301
5265 93301 89672 116672 92595 102285 62692 -63584 -162307 -227205 -79116 -79630 -46546 -117731
5253 -117731 -131064 -194878 -204660 -19255 116581 159136 112809 11852 -14715 17178 -34484
5242 -34484 -103523 -96053 -89384 26918 -103837 -161720 -192913 -111601 -1043 -9161 3396 26067
5230 26067 24956 -41973 -39277 -33026 18805 -12420 39641 124883 103254 73468 28576 -104411
5218 -104411 14691 109845 152387 57127 -55958 -66759 -87738 -145010 -162413 -106403 -81945
5207 -81945 -117941 -212474 -216790 -135466 -80434 -74861 -105975 19553 93133 -27711 28618 144561
5195 144561 164882 152784 64402 48070 23775 54735 109190 265761 272819 51955 -83378
5184 -83378 2454 -30190 -44320 -62010 43548 158965 128248 273528 272188 143180 95501
5173 95501 -36380 11777 -67102 -52827 -41234 -97174 -4958 -1803 31564 92116 49006 -12121
5161 -12121 -118227 -174153 -205100 -152705 -160171 -115201 12454 21401 83092 26581 22930 -94093
5149 -94093 -191268 -64905 5424 64301 14683 82640 -5539 -77470 -217445 -131797 -48714
5138 -48714 -43932 -22245 -45423 -43029 -25373 -58251 -120343 -165498 -186862 -117157 -51616 94996
5126 94996 249180 233248 311834 347157 235627 137985 167458 162328 188476 177481 87737 113100
5114 113100 142447 111858 78481 166326 118563 -7401 -9568 106655 47421 -59937 -187086
5103 -187086 -104702 -136950 -159825 -143386 -63227 45136 -20483 126723 181289 162115 38787
5092 38787 -94494 -140715 -192981 -139590 -138666 -187949 -89862 -69699 9144 34037 -24337 127169
5080 127169 176027 107101 215262 244378 133019 136196 212099 118479 47073 30950 29462 -33187
5068 -33187 -87207 -44653 -31685 -106532 -34559 -96501 -119621 -98724 -140699 -151923 -202362 -121325
5056 -121325 2762 38923 -12913 -104663 -86460 106883 210224 145088 140987 -3229 -172248
5045 -172248 -155733 -153316 -125230 -62781 -154641 -148473 -175097 -21414 -48340 -136718 -207871 -53259
5033 -53259 77183 -69166 -170679 -158141 -18055 143328 140992 28669 40158 52323 -119430
5022 -119430 -150043 -121719 -97460 -109332 -19811 127141 108756 73146 101165 165118 190342
5011 190342 156875 122244 109971 73873 39627 82622 127709 88160 35018 6910 -61450 -104651
4999 -104651 -275017 -232675 -82736 100879 115489 52263 -112178 -215618 -131142 -37280 -119433
4988 -119433 -41846 101359 115456 110093 36406 -52683 -3104 28462 -37636 -13432 -119610
4977 -119610 -203679 -238023 -263119 -183544 -214292 -166023 -106280 -101450 -1787 65577 11588 -40280
4965 -40280 -180495 -80956 104822 218814 201994 157439 143170 326187 306087 131800 151718
4954 151718 127938 -17432 -51607 38198 92065 146135 35310 -49181 -13692 -5022 124924
4943 124924 170694 -66689 -138729 -218676 -227444 -140595 -82327 -49884 53125 119517 274859
4932 274859 287082 119770 78117 -21463 -88047 -102972 53632 236529 253812 112934 -41311
4921 -41311 35839 -52370 -63277 -108685 -57833 32900 -72181 -61643 -83259 -143428 -133014 -142428
4909 -142428 -61276 -48626 -85960 -127032 -174675 5352 126118 203757 145022 237224 307313
4898 307313 254977 303951 275520 163412 -44811 -92177 -173804 -182265 -185678 -289050 -260212
4887 -260212 -251723 -361926 -335412 -225638 -231376 -204397 -178530 -199349 -42906 16686 -63358
4876 -63358 -255457 -146809 -77400 -108674 -35465 23037 8976 -29418 -58238 -151984 -49015
4865 -49015 253231 185469 -87787 -206642 -284531 -352221 -448413 -388137 -202794 -66766 -23238
4854 -23238 -41898 -156650 -163248 -127149 45353 147290 118182 34237 100031 184468 171161
4843 171161 75644 29294 -137350 -77859 -106822 -105861 -146101 -65777 9917 -123109 -225393
4832 -225393 -175291 -150036 -106399 -95902 26471 156596 245235 200443 37523 -15601 -56837
4821 -56837 -183886 -121776 -84521 -126486 -104212 -44536 -103094 -47339 -62460 -11148 -12953 33699
4809 33699 246910 225299 118668 132271 68493 17331 17168 38969 65187 14464 -100286 -76970
4797 -76970 77078 138492 177777 329554 310916 219544 114780 113791 57031 145267 24867
4786 24867 -58657 -72211 -140897 -263235 -297395 -206284 -213381 -186017 -170448 -138830 -55835 68536
4774 68536 -20202 -42503 -199264 -225955 -83230 -59419 -15622 124445 243419 69404 -40969
4763 -40969 9579 188344 257877 253234 200163 95665 124537 42898 -38943 -161387 -266714
4752 -266714 -78448 -36004 -102030 -51445 1783 -71154 -43647 -132484 -220378 -131663 -134617 -1153
4740 -1153 42888 -99885 -77949 -106055 -173434 -139707 -345266 -388601 -198990 -73027 -52008
4729 -52008 -28675 7747 69771 16623 -127412 -96849 -104085 -65954 -92458 -191991 -232658 -167956
4717 -167956 -52993 -16420 12928 80156 48472 28150 -20197 449 -9491 -19628 -124234
4706 -124234 -147571 -60798 -36769 74079 59933 -97209 -239240 -146615 -34725 67723 31644
4695 31644 133716 82290 10638 287 58741 90347 -31237 -41976 25914 88421 160601
4684 160601 121583 154917 176483 94576 -80038 -143540 14530 147208 158485 -85487 -129776
4673 -129776 -133333 -139286 -28391 36866 -22908 -29141 -129573 -161562 -102268 -162548 -84780 -42457
4661 -42457 -102453 -68255 -9654 -31870 -96488 -5480 -19507 -17835 50826 76068 44829 -28670
4649 -28670 -69592 -133342 -121034 -28404 -36273 -13801 41221 -46782 -127219 -84880 34408 53698
4637 53698 -63156 -56761 -141848 10869 -15117 -9393 115297 237943 238488 152297 82445 7412
4625 7412 15787 54668 20975 101212 90180 180513 242806 151817 106334 121073 123148 43830
4613 43830 -43083 -107145 -97946 -39066 -65651 9435 -718 61715 81858 60590 116706 159975
4601 159975 49755 70197 158231 186934 149499 36355 -169420 -142091 -69256 2766 22053
4590 22053 78013 -9855 -147940 -110673 42279 -99944 -268099 -156890 -174716 -167542 -195407
4579 -195407 -172432 -108735 -47446 -47965 -65669 -113588 -195299 -59424 -41582 -162752 -184118 -141552
4567 -141552 3549 -7164 -73546 -143034 -256159 -136125 -77590 -142967 -90030 -114852 -24498
4556 -24498 29963 71529 30042 30862 145817 261597 161595 107912 114972 102338 25933 -73803
4544 -73803 -185437 -153181 -117079 -143425 -178318 -100175 -77092 -118381 -12633 57532 120653
4533 120653 92029 -19973 -2876 87333 225378 241438 51671 -52262 51458 -6577 -49942
4522 -49942 14271 105899 201079 178235 91142 115853 82236 67037 149053 125915 101338 40493
4510 40493 -49664 -77932 63261 160227 204475 259974 136112 -51496 -117003 10804 36557
4499 36557 -7678 81334 41342 -76070 -66177 -87436 -51414 18727 -975 6114 -11925 76089
4487 76089 -7614 -138572 -93159 -101270 -4997 12842 115649 199901 199454 118914 60116 49850
4475 49850 70543 -55839 -88960 -8449 23563 5614 -91143 -58141 78523 155081 130532
4464 130532 115455 174692 60108 64186 80199 -19473 -67391 -117428 -215878 -143206 5095
4453 5095 80542 34888 -22693 -11765 -67836 -35088 38363 47775 -29159 -89841 -27621 103940
4441 103940 79761 11591 -131114 -185369 -169037 -139957 -157802 -147926 -95028 -21389 -154783
4430 -154783 -34448 -62426 -137705 -83822 -213643 -165314 -135375 -155190 -58354 108643 121923
4419 121923 66694 95524 166861 125741 107975 129066 112127 90489 129495 99700 39820 182289
4407 182289 311221 184332 68469 -67101 -77456 -53794 3220 -90516 -200298 -149767 32307
4396 32307 75407 88722 85464 2512 -26678 35452 114236 191247 77057 -51787 -44088 3394
4384 3394 18383 92193 153394 202171 218668 145219 88312 141224 78568 73582 -16070 -177104
4372 -177104 -206171 -43294 55005 88896 59889 51091 98149 51161 9388 63486 119690 -36288
4360 -36288 -109338 -111989 -198509 -208948 -80549 -101537 -41348 83304 29805 17247 28136 5499
4348 5499 -23591 -121780 -27399 18325 44328 90467 122666 -23941 -104175 -25465 66920 41790
4336 41790 101628 139698 62073 2216 -84181 -436 -42685 -66152 -116984 11507 78090 63053
4324 63053 79567 222011 290292 196820 102323 164415 115863 -32326 -77379 -5586 55686
4313 55686 -1851 -91351 -20552 -66778 -90741 -157171 -158676 -97521 -176920 -90598 4634 22882
4301 22882 -105001 -165299 -227746 -308131 -326509 -296903 -209951 -274147 -237783 -290950 -201548 -105995
4289 -105995 -70650 5825 128288 143707 57083 34948 70857 136753 182783 71238 -75984
4278 -75984 -42981 -97752 -133456 -25929 69282 -6777 -71190 16224 82760 34015 56973 21091
4266 21091 28589 23112 2050 -120602 -122786 -170321 -117133 -173291 -222924 -224708 -231261 -184725 -97719
4253 -97719 -49439 -103690 65188 26985 -14482 -118629 -90654 5619 74510 -109484 -41830
4242 -41830 -123679 -301701 -302136 -321611 -289907 -191791 -134302 -75060 -16059 66256 2892 -41027
4230 -41027 -178382 -201694 -220189 -172227 -52362 17987 9864 9338 128813 200443 223604 232336
4218 232336 179115 230450 177041 121014 -28919 -46214 -82414 -46657 -69938 -72413 22896 96130
4206 96130 219946 157520 60548 -11801 -5957 9797 102736 160925 53141 10540 118421
4195 118421 168629 124097 65469 132403 209398 143546 35075 137485 172593 16923 -194539
4184 -194539 -200569 -55117 -39637 62437 36704 81179 137722 76820 -54007 -65693 5838
4173 5838 119328 143408 74096 96979 129334 202234 203287 269395 267315 86662 23941 19215
4161 19215 127242 139172 266656 270677 163971 -77536 -165697 -87956 -26605 37943 68342
4150 68342 109625 77473 -148961 -93703 -147106 -331966 -349976 -100397 35303 -47467 -122290
4139 -122290 -239623 -311477 -356794 -270139 -39797 22401 86097 72370 -36040 -281802 -293212
4128 -293212 -139396 -67518 -40141 -116985 -50238 -21031 39775 102245 141701 135361 13233
4117 13233 9355 100548 -1981 -1270 -141393 -275306 -301352 -303244 -252414 -174064 -177440 -118674
4105 -118674 -66626 -123395 -136720 -140185 -165661 -209400 -189633 -177966 -162994 -191243 -167435 -57900
4093 -57900 -60727 -124987 -180769 -182492 -180459 -144698 -151411 -142618 -173144 -70416 94809 172539
4081 172539 62905 55473 -59528 -56658 1907 -14282 -22466 -85796 59928 81281 56089 123429
4069 123429 53549 32978 112821 144788 111175 105855 -26512 -12534 -74866 8784 -47573 -94844
4057 -94844 -169545 -153561 -142695 -96652 35916 3170 -106508 -136782 -151981 -204694 -96608
4046 -96608 11826 -107854 -199566 -126370 42536 1060 -66356 -106666 -211446 -128711 7932
4035 7932 -68161 -43016 -16497 118265 135278 144135 38146 105546 222583 232934 233412 141233
4023 141233 -42460 -12063 6932 -917 -30997 -73451 -142027 -27324 -57909 -165413 -295946
4012 -295946 -361481 -424184 -322442 -145896 -143998 -188694 -164152 -44529 -23414 -43758 6234
4001 6234 146497 108969 6409 -81517 -86491 -145442 -46423 -40131 -67784 -111059 -215234 -227590
3989 -227590 28693 159297 124520 -34791 570 -69037 -117178 -176841 -102589 -6031 110478
3978 110478 105904 -2516 -45802 -29631 27998 -1168 89756 118591 82404 -32978 -41543 8002
3966 8002 103155 76428 87749 52938 -46525 -20827 89024 30942 -117384 -134126 -129954 -115997
3954 -115997 -15114 10293 -93119 -82779 -85696 -111478 -148465 -216500 -304437 -236101 -136831
3943 -136831 -169727 -102216 9115 60644 111881 146306 66728 -35528 -50948 7998 -119646
3932 -119646 -15438 -40854 -119919 -129230 18346 27316 137614 165584 107088 -127029 -139095
3921 -139095 -65724 -89135 -28218 -22952 -129453 -234348 -180861 -117883 -33201 -47030 -113133
3910 -113133 -35714 18002 -65443 -133471 -100806 -54617 84355 207300 137383 96265 52541
3899 52541 -24795 -51863 7758 95111 -45392 -18976 22037 -26254 -52917 -74278 -153016 -236944
3887 -236944 -400377 -348995 -142145 -24060 -77494 -153755 -24612 600 40824 133231 237642
3876 237642 143005 47692 -52097 -60344 33376 1599 135852 161627 35053 -59301 -126768
3865 -126768 -152141 -139932 -44780 20591 -50596 -21122 -44133 98730 200507 63757 56442
3854 56442 107786 56246 80724 -17249 -96057 -131763 19499 136744 101900 77400 33999
3843 33999 26666 143481 229521 169139 101291 40407 -42775 -17543 -91899 -99367 -152453 -134060
3831 -134060 -138933 -201865 -187287 1663 65503 49301 -93687 -115534 -12550 -38587 -1933
3820 -1933 125563 93181 78192 203293 178120 69014 8537 36116 115987 157294 255568
3809 255568 366118 264346 103411 -87203 -104343 -10203 80737 133410 72746 29418 -62355
3798 -62355 -138956 -40983 47173 97835 120991 46756 -36839 -125323 -16122 96152 -6094
3787 -6094 -1499 -65548 100558 44779 -32180 9705 11468 -121953 -96988 -25818 -205177 -145158
3775 -145158 1148 -6687 40568 2927 -73061 -30481 13508 40235 7640 88119 34655 126386
3763 126386 190949 123117 61503 87517 -37416 -104473 -39966 -93991 -210274 -240774 -182392
3752 -182392 -69593 41798 69662 150580 90048 58392 105486 63638 100748 180610 165918
3741 165918 63906 78739 -62372 -91449 -49409 -44411 -8062 24836 69481 -150006 -114583
3730 -114583 -46837 -54378 -61349 -142100 -161077 -117486 -100281 17110 -134683 -194816 19004
3719 19004 46236 416 -32112 -84344 -63056 -116684 -100980 -32257 -12506 -97595 -209594 -226912
3707 -226912 -221905 -288093 -192720 -115102 -146779 -168239 -92314 -77860 -149626 -61828 -2640 19686
3695 19686 33746 -11575 -132471 -151994 -189552 -53072 31100 -27063 -130533 -121306 -144988
3684 -144988 -274927 -263821 -189149 -4756 -49275 -247994 -243283 -106392 8866 -60402 -197384
3673 -197384 -235949 -106393 13102 16715 31001 122736 195891 111342 -62801 -176948 -229825
3662 -229825 -229263 -138830 -118633 -147761 -141507 -74884 -1822 -24761 56508 113984 -1811 -96381
3650 -96381 -174106 -13432 -88679 -170602 -38522 43235 39414 30038 -113389 -196687 -40245
3639 -40245 106175 117220 112583 78581 90114 28447 -38480 -101515 -45653 -69334 -48382 -148060
3627 -148060 -156703 -103768 -25673 42169 108103 39943 38216 33248 -23912 -97074 -141612 -114347
3615 -114347 73264 35306 -196963 -266823 -276389 -306791 -264600 -152383 31298 13444 13303
3604 13303 -88788 -175958 -249826 -156663 -76295 -47807 3140 35211 -8741 -168288 -62433
3593 -62433 -6151 27989 91175 114064 34846 -34367 23239 54216 35215 -23680 -25136 175223
3581 175223 256641 295617 203955 181608 77335 -36591 -10304 -101057 -93392 -87384 -154581 -285409
3569 -285409 -348789 -218100 -176406 -138593 -58905 35949 -63598 55657 157220 154780 144301
3558 144301 37017 -62254 -107995 -134408 -145072 -176175 -245366 -269420 -135518 -3157 89576
3547 89576 156765 156936 111386 -82892 -191496 -56465 80097 107057 134068 96522 149432
3536 149432 86856 53733 -55637 -132860 -255638 -324701 -228996 -182690 -83239 -64019 105562
3525 105562 160859 132834 115947 185629 200017 142004 -47628 -233763 -320804 -201685 -227924
3514 -227924 -257384 -130523 -96722 -121598 -186628 -249173 -315702 -305493 -236244 -131336 -243573
3503 -243573 -299893 -221895 -179986 -216583 -124801 14814 -177687 -181538 -93226 -20642 -19025 63854
3491 63854 -31231 -205293 -183313 -289170 -296660 -163433 -41377 115131 143472 131877 72853
3480 72853 -54612 -21081 -21066 -64508 -28840 -38691 -18331 119 -45785 -54236 65027 166092
3468 166092 180480 110888 123895 70615 98128 171555 175650 103476 198179 15675 -204507
3457 -204507 -199811 -94595 20104 104782 108737 167192 195877 144332 40910 -10119 -89134
3446 -89134 -115202 -31473 32059 23197 76142 150613 192819 99988 144715 119779 70122 209590
3434 209590 284496 211164 181809 134537 156777 188125 211390 113512 116283 -4151 8816 78314
3422 78314 151740 135772 37793 -27059 -25903 -5457 89265 210447 95873 49911 26693 32357
3410 32357 64285 24079 -71118 -71904 9022 73913 36309 -41138 -98963 -116287 14892 107774
3398 107774 -1974 -49163 -112784 -173450 -173785 -220997 -284686 -276306 -255499 -101555 108452 175286
3386 175286 262091 184993 101367 35109 48309 -20388 -58547 -28829 -74151 -18658 84747
3375 84747 220672 305289 239203 154988 96061 37810 -163768 -95480 11189 -64116 -78328
3364 -78328 -1829 149 -92770 -45856 -103377 -72237 -129506 -167514 -90629 -24491 -102222 -125268
3352 -125268 1019 -100187 -215440 -222361 -205327 -199328 -238461 -295844 -164136 -79333 -101298
3341 -101298 -65033 -92847 -46735 -6184 43801 19388 43830 12819 14292 28677 28568 46403
3329 46403 160692 250443 202765 213165 220140 163839 109083 58323 -95143 -142924 -48216 -17169
3317 -17169 3527 73954 -45393 17342 105091 138243 73115 82732 163829 117751 136438 73844
3305 73844 -63166 -70020 129627 176461 187402 211281 208908 29331 -10137 13360 -48775 -42323
3293 -42323 40812 117200 62770 54380 98602 141808 8826 33394 134123 210216 202935 166720
3281 166720 49249 79010 212389 279316 325125 305481 246772 182988 158976 78348 77314
3270 77314 -15770 -100040 -82782 -28740 104398 184696 68265 75419 28108 -53609 -54830 8184
3258 8184 4553 47700 16230 -51310 -58683 -132175 -144249 -194023 -224925 -252872 -182154 -114993
3246 -114993 -165212 -190446 -176733 -137926 -85083 4477 123106 142856 104096 109130 36512 54494
3234 54494 1511 52362 161844 236508 265026 158922 64392 65102 75080 -16357 8273 109458
3222 109458 61815 -43998 -145439 -119387 5250 64904 16001 -51014 -50591 50416 42464
3211 42464 146683 70763 45042 46792 13434 93357 124878 -950 -104939 51339 133668
3200 133668 74025 -122823 -159801 -32058 -35655 -160989 -203600 -220015 -66381 129367 196838
3189 196838 156421 99141 160118 162044 77374 54234 -22711 102010 21029 116862 128353 95072
3177 95072 40002 95755 57990 17826 -29548 48655 95175 -19403 -22861 -37495 -157866 -130604
3165 -130604 -62452 -3420 -93625 -95372 46727 198589 334846 312165 212913 92020 -80206
3154 -80206 -141599 -163461 -64237 -35651 -91021 -93280 -134037 -41022 33801 85171 -5242 -59741
3142 -59741 -100248 -108574 -129234 -55985 -81291 58117 -44089 -106102 -66541 -45218 53650 26658
3130 26658 -50451 -156607 -221338 -168479 -173614 -146400 -160662 -233040 -105088 -40402 -74307 -47477
3118 -47477 122465 188683 114877 210414 328767 259968 29002 -110978 -186751 -179514 -192656
3107 -192656 -166071 -85675 -31845 -20949 -34274 -99192 -266772 -353713 -208349 -99130 58141
3096 58141 -2784 -176376 -203794 -122816 -42161 -17486 -19631 -58277 -107974 -154590 -196000 -103732
3084 -103732 4961 58061 65190 -4064 -39956 10030 9015 -77327 -3189 -117318 -91741 -90837
3072 -90837 -43631 36923 105739 80770 43027 -2342 -78613 4304 38471 84027 94286 85873
3060 85873 59937 133771 159927 90394 26525 -59321 -83488 90637 149956 143159 233734 229623
3048 229623 157422 166239 156535 246041 358546 259809 30079 -88458 -198445 -239062 -262441
3037 -262441 -306790 -203902 -225085 -117441 18503 -78858 -36940 49846 -15766 50744 -44625
3026 -44625 33332 10192 18063 58423 -98095 -135123 -65137 -56548 -98773 -112278 69966 128913
3014 128913 72761 83333 22285 -76175 43622 111221 77006 -37409 -134466 -158878 -52769
3003 -52769 -31054 -52067 3035 -37332 -83585 -29770 47507 34409 -26341 10883 -8170 4752
2991 4752 109719 184367 154430 120104 36830 -146543 -137867 -147110 -107566 82881 133524 52314
2979 52314 76622 157630 142683 196630 153251 84810 26991 122679 164613 210694 307183 321123
2967 321123 310319 269892 240207 136527 55553 -42454 41709 138864 83280 101766 30728
2956 30728 -127528 -209535 -96728 -76071 -49185 -151849 -136524 -58787 -29445 82290 111153
2945 111153 89277 85055 -9834 58411 144510 189229 201943 138974 -9836 -35638 -3418 52785
2933 52785 68046 152335 51559 23454 60502 -82220 -76217 80163 49157 -43391 -69182
2922 -69182 -47358 -109997 -95341 80137 49728 -128044 -117164 -86471 -179902 -324619 -180368
2911 -180368 -56200 -66287 -75452 15772 59049 70831 -4837 -91812 -18061 214528 318384
2900 318384 315751 254342 148109 -52332 -74470 -146526 -100556 40658 136518 211957 152580
2889 152580 17703 24334 33373 -55627 -109004 -101363 -74649 -7520 12824 -34144 15372 -55357
2877 -55357 -75197 76315 77098 -20673 18929 93619 26060 7280 -19500 137676 224795 16215
2865 16215 16789 57719 22589 -11522 66313 193135 272421 276865 144706 258509 296992 216995
2853 216995 264790 154682 81939 107354 1650 -98011 -107352 6630 158710 150467 22615
2842 22615 -23421 -13360 -23755 -150960 -110740 -112415 -121189 -186256 -56274 -494 83468 64508
2830 64508 -31864 40041 214283 168093 45618 83987 122132 141405 54900 164441 179590
2819 179590 118527 96613 38153 -59509 -84503 -87324 -62357 33559 94309 135019 159863 3174
2807 3174 20607 162491 182421 111622 70750 22218 61005 159998 209647 276963 254188 218738
2795 218738 170023 162533 58419 -170781 -162816 -72796 60063 1313 -93510 -113099 -118215 -117576
2783 -117576 -206990 -234753 48109 130781 37619 -133741 -95877 92633 85248 97928 135317
2772 135317 247367 336498 316556 100082 -55413 16370 52915 124767 134410 187692 185068
2761 185068 82658 78781 151640 54635 -53711 -10856 -55825 -188245 -207889 -81976 44397
2750 44397 47559 14050 -19946 70131 -44445 -100496 -1942 -53736 -41698 -104856 -150062 -206456
2738 -206456 -67359 38113 5266 4779 -88663 -238042 -263791 -265681 -137086 36399 -69439
2727 -69439 -156087 -43805 -35457 -98995 -55400 -35909 -36996 -6377 51936 25381 121121 108302
2715 108302 125354 111110 61082 71024 128166 146285 54520 -93702 -194575 -224454 -166338
2704 -166338 -103617 -113331 -47769 82994 165152 241701 180771 90084 91799 176532 178020 200917
2692 200917 86342 49619 -18423 -183205 -151884 -15621 -21410 72356 237134 204366 76218
2681 76218 2744 27117 52496 220247 205066 227603 113355 77812 108310 121875 129681 211623
2669 211623 187633 204802 150488 13219 4609 67932 47716 36474 -11038 -46781 -14464 72150
2657 72150 -11887 -72339 -90706 -50272 111868 121629 57946 183411 2794 -160444 -121260
2646 -121260 -15955 5381 -51277 47171 72925 49488 -3425 -13150 66747 55759 54929 -2893
2634 -2893 -166528 -251598 -130560 -44288 20615 85169 8876 61281 11048 -51879 -28464 186014
2622 186014 178768 227200 93203 12663 35317 -69154 -31990 117527 278797 237283 174475
2611 174475 80218 -60232 -121355 3469 41413 -118363 -19288 71687 53591 33902 54691
2600 54691 -39073 94856 65338 67883 168464 179399 173871 288894 331751 82223 -5790
2589 -5790 -94261 -235237 -10581 7868 83851 72812 93339 219774 255731 265171 209024 131927
2577 131927 170309 201825 169561 34713 26087 -4229 -143395 -180468 -178717 -238851 -77348
2566 -77348 38783 91698 143662 120224 69105 37034 -57205 -113160 -109922 -140106 -60239 -109770
2554 -109770 -54534 73155 107788 29054 24360 146436 69385 109139 225407 175384 154467
2543 154467 177954 74150 -16035 -8496 -157751 -245526 -267295 -345122 -347114 -303682 -188994
2532 -188994 -23651 135378 234371 188050 201067 102897 -38468 -65706 -18989 -22554 -66649
2521 -66649 -49143 82049 106106 126978 13819 -110870 -271890 -329558 -267823 -175587 -107464
2510 -107464 -117686 -71434 -9876 -37138 -126640 -181624 -194616 -136844 -53867 -23163 148417
2499 148417 169724 104018 -48107 -127971 -85626 13829 72918 210858 61524 -78542 -33184
2488 -33184 13712 -5051 -100623 -193685 -87030 126785 184010 185766 143362 -12889 -110773
2477 -110773 -77708 69891 166418 201347 175242 154198 115737 189176 191218 151697 88300 63614
2465 63614 -35480 -131037 -67198 41387 -15756 -70285 -21 18501 39593 -14744 -87647 -78679
2453 -78679 -49074 -17609 -99817 -114719 -218917 -148784 -117687 5189 -2937 1621 68196 22092
2441 22092 46910 44181 -30341 -133082 -139333 -46694 -100930 -111386 -32202 -45313 -54965 63314
2429 63314 142588 92086 10971 13328 128161 234326 163592 120908 220846 149465 26345
2418 26345 -28150 28056 -46008 -89333 -61968 -127110 -201765 -175053 -47437 157827 215628
2407 215628 132478 143535 125794 106297 13986 -128584 -90394 -77262 -166703 -72896 -29860
2396 -29860 64217 105128 123456 106993 54842 -29399 -104633 -120037 -141139 -70774 88163 102231
2384 102231 158737 190959 126475 -17588 -50021 31681 66383 -27280 -81198 -48880 -188836
2373 -188836 -161084 -74505 -65298 -64012 -6384 37806 76281 18039 46795 -24772 74663 126434
2361 126434 25490 25282 72805 -47889 -27021 51542 133256 321598 423964 362356 153637
2350 153637 57846 17545 -18069 126023 93377 69806 -30095 -43974 -56130 2003 54043
2339 54043 17588 -98276 -187387 -171125 -94573 -105985 -120506 18392 198507 135233 135080 162880
2327 162880 313713 289109 144293 31819 -62230 -104046 -9677 -7551 -86146 -156011 -49759
2316 -49759 5416 -92817 -15549 18052 68661 103404 47514 165861 151299 89277 169671 253565
2304 253565 245386 120209 46370 104902 151871 99644 84570 137291 116136 164755 198968 259894
2292 259894 155881 -17908 -118779 -48341 -4527 -42591 -38192 -126837 -215556 -327129 -191445
2281 -191445 -127790 -78453 -52084 15209 51761 -44566 -60289 -44596 -68482 -110881 -113873 -19511
2269 -19511 21093 76190 63623 -3573 72011 87977 179649 113915 35133 -16534 -83209 -220623
2257 -220623 -232983 -223785 -185760 -118995 57071 100599 83388 173177 161598 -21515 -50288
2246 -50288 -71068 -127379 -146176 -79897 29267 12645 -24831 -58520 -110348 -189779 -185491 -79733
2234 -79733 -6122 58186 53400 -16713 -85171 50335 -5535 -56430 -101137 -116137 -132080 -83488
2222 -83488 -59553 -62079 -172445 14332 43286 88165 75588 -19642 -95425 -210911 -208646 -41992
2210 -41992 66641 157323 260902 215595 160936 159784 147818 20790 -17087 32873 29723 -62357
2198 -62357 -105441 -1154 19294 -8367 -1202 54590 138965 217909 154395 -22153 -236658
2187 -236658 -221064 -76364 -1039 58232 207341 273463 97415 24763 -20822 -112874 -114556
2176 -114556 -66526 -60799 -152647 -166416 -130124 -103480 93474 49404 -67493 -192058 -316584
2165 -316584 -342679 -216536 -161825 -11614 -16851 -129558 -28173 22066 123823 207070 113431
2154 113431 -52589 -162854 -39445 74976 14610 -58005 1080 76761 62387 42445 1357
2143 1357 190941 205662 73470 -7240 125816 39747 -42290 -73310 -15510 68950 113158
2132 113158 92361 137499 105781 147488 220876 149423 -51181 -173730 -174837 -75075 -39279
2121 -39279 -20005 65298 45926 153571 59292 -11376 90852 105279 3578 17919 27197
2110 27197 60623 -21229 -14501 -103089 -220829 -174330 -254062 -272714 -266849 -268246 -244011 -135589
2098 -135589 -11343 -27022 50005 151605 231445 -10440 -265942 -276708 -193224 -54946 -42754
2087 -42754 -43811 -69323 -80628 71653 -2033 -156484 -321912 -252915 -280654 -214366 -109552
2076 -109552 -8068 -41408 -62553 -23584 -44021 -142441 -79466 48065 134582 70640 -59702
2065 -59702 -18055 -596 -52007 38059 138358 127810 50293 25483 1172 -91598 -28402 104535
2053 104535 91517 -5889 -110168 -178625 -121175 -90244 -100062 -113164 -275482 -322923 -293902
2042 -293902 -222386 -136166 85408 98177 -58469 -215952 -117571 48792 27872 46942 77763
2031 77763 58727 49841 30789 -65770 -143095 -88042 -100929 -104106 -117671 -99420 -104011 -44452
2019 -44452 36600 -6729 -45587 -123522 -25297 80163 136931 5533 -47076 -43503 12856 39702
2007 39702 -27862 -65234 -12578 121823 -1149 -157831 -107134 -22702 16555 82421 120322
1996 120322 156007 100684 -102001 -167604 21116 27132 58061 84186 81613 90657 189155 133232
1984 133232 -25250 -176566 -247170 -162023 -43400 37615 117359 176448 128312 46898 -84489
1973 -84489 -58931 38688 16101 -28170 -59568 -9733 100921 99310 190585 46125 -90300
1962 -90300 -27931 75168 77953 -13148 -130275 -148198 -245645 -264102 -301169 -223963 -73269
1951 -73269 9824 77742 106337 150264 193994 64661 25656 -41338 -32375 -14271 -8690 12492
1939 12492 -43320 -105112 -91566 -109401 -169157 -90299 -146185 -212859 -143553 -24183 7893 -56225
1927 -56225 -23652 74812 -8486 66616 39743 29129 48418 -77054 -76580 -14524 93800 17951
1915 17951 -137741 -213028 -97995 31086 247 -24835 57309 48103 -29047 -88691 -183867
1904 -183867 -214556 -190815 -3794 67649 86662 47614 -83931 -150351 9241 101037 30337
1893 30337 -61175 -113298 -155275 -154236 -205170 -124887 -91147 -25361 70574 119444 -36106 -153791
1881 -153791 -55948 59985 194658 177635 61463 31591 52578 117674 -4629 -98659 -44150
1870 -44150 -10866 -111792 -96223 -53319 -89276 -146995 -169189 -125834 -44888 -44177 -20432 -120284
1858 -120284 -95043 16280 151067 131710 -8182 -59663 -26193 -105336 90383 173567 25843
1847 25843 -97865 -181045 -272259 -169467 -79248 1322 94656 145355 204333 116712 189211
1836 189211 224841 169222 155093 118494 154080 149549 19087 47396 114545 165138 55088
1825 55088 25808 132519 26440 -15158 -15176 -110348 -80734 -188237 -180357 -110542 -61281 -114458
1813 -114458 -136760 -38458 -26716 52293 91877 119985 107000 7107 -158322 -265589 -51588
1802 -51588 60290 109599 162822 9600 26659 136365 135784 145796 178357 19253 4051
1791 4051 -25730 -100639 -50411 -33312 97139 145450 -7413 -78966 -29389 87092 43400
1780 43400 -64048 -178191 -198341 -148966 -161129 -108209 82500 48393 6851 -107089 -138567
1769 -138567 -114493 -101800 -120255 -93979 -49168 9852 66218 135811 242107 60557 -110454
1758 -110454 -109399 135086 65160 -85736 -19910 29317 -6743 -97717 -122599 -61993 -47562
1747 -47562 -52233 -38727 17921 43113 -56797 -26532 49830 32210 23069 53272 64191 159484
1735 159484 246341 269792 165471 -21615 -164980 -233757 -189687 -96224 -76808 -23180 -73208
1724 -73208 -63821 795 113371 179556 169879 186805 83469 106177 80205 59794 82207 71793
1712 71793 173299 223048 242160 227937 292297 234855 127299 174310 45867 -36212 7494
1701 7494 -102146 -78612 -98001 12911 -15186 44669 117692 109875 156090 175480 161183 77943
1689 77943 32778 49225 -25396 -17371 44880 -5814 -29697 -135951 -222613 -178878 -63835 113188
1677 113188 182997 190100 150017 -49444 -96358 -32029 -27153 -38696 5463 16972 187001 287696
1665 287696 178230 96359 -45904 27504 139695 124682 63391 51699 -22149 -5554 -61673
1654 -61673 -57313 -47665 45850 111786 84527 63250 -20761 4371 25165 79570 63755 105807
1642 105807 14342 -21051 -43949 -9400 65789 25922 -92225 -172416 -120407 74329 194480
1631 194480 45687 67510 135360 146340 -20112 -130622 -14825 -97773 -208193 -190405 -133011
1620 -133011 -112387 -69355 13863 7525 38944 147156 51320 11316 70907 -92254 -162889
1609 -162889 50387 175092 51602 -151353 -171116 -87322 -23502 -7526 24645 67575 132963
1598 132963 181847 160930 55635 -67248 -33005 -6904 4556 -28175 27338 139099 66096
1587 66096 -49309 -90356 -27306 29370 -70218 56802 226707 292229 49711 -119594 -290296
1576 -290296 -246537 -142702 -210031 -75644 38483 42997 117388 153551 123403 288472 277057
1565 277057 187510 159669 114345 -15068 41373 -1356 -68538 -193271 -277005 -311078 -238574
1554 -238574 -206349 -153514 -79451 43908 2702 163615 236965 221272 176057 63858 -3583
1543 -3583 -138203 -180661 -72655 -114140 -138676 -136818 -132140 82362 191241 119531 -80647
1532 -80647 -111205 -141284 -99695 -66921 -55093 -119763 -3535 34291 -6243 -4316 34034 125036
1520 125036 148894 257424 127391 16577 94126 85144 41892 -131378 -116766 -3103 12336
1509 12336 13044 14286 -85167 -134626 -137233 -260990 -230019 -200841 -104298 -18044 114147 104995
1497 104995 8731 78941 138756 -26846 -63176 -40924 -16370 24808 6024 19093 105222
1486 105222 140010 71539 -99425 -124384 -39103 34934 -12360 -51472 48127 -50854 -89784
1475 -89784 -30222 -83107 -241694 -298045 -205467 -61054 -88327 -156546 -91850 -14428 -15729 -36515
1463 -36515 -116339 -137539 -98143 -34742 110242 169393 163455 171976 234638 292101 145512 31818
1451 31818 49038 -26502 -37497 -12829 -158320 -112599 134231 245792 154143 105493 122888
1440 122888 100848 173848 397168 364051 267058 91938 80451 15580 -31376 -54237 -86670
1429 -86670 5841 123373 21934 22291 70627 251462 301680 221345 199070 141875 194005 53216
1417 53216 -63033 -122741 -11676 55268 31777 27622 85283 101869 130342 156097 143113 83398
1405 83398 -135137 -148186 -124409 -20326 82291 44918 -44947 -157598 -191934 -93130 42953
1394 42953 23389 85510 154878 56070 -134975 -75519 77344 15815 -97415 -80436 -120331
1383 -120331 -120757 -37268 35689 43219 48195 -41025 -104522 -84934 -161203 -62305 51460 94600
1371 94600 39647 -17874 -40629 -18235 -49408 -100877 -97574 -10213 -3771 978 -33684 -34838 -90964
1358 -90964 -217360 -158880 -82472 -9649 -26270 26302 -53526 -93160 -27426 158080 157701 -66817
1346 -66817 -140870 -146611 -166010 -159177 -154734 -58760 -178232 -248319 -40437 17733 65609 77237
1334 77237 -2202 -120596 -131084 81116 152347 65786 14383 -38765 -35212 -5500 -49275 -75499
1322 -75499 -36527 1994 58299 88219 99878 -5835 -19508 -60143 -91388 -63115 -58776 -149001
1310 -149001 -251599 -238277 -106886 -64282 -111247 20861 15962 -119266 -104236 -131713 -51827
1299 -51827 -63165 -170346 -169117 -140669 -66796 -26661 11161 144875 241850 75200 -5380
1288 -5380 -119357 -257452 -175240 -21267 64135 -4900 -100699 -8307 -93208 -85550 -38595 -16316
1276 -16316 59893 9373 12553 -16505 4557 218720 247100 197557 192972 265942 263185 135209
1264 135209 -8855 -75005 -54570 -47748 -21039 4170 8645 174149 273440 334474 179125
1253 179125 156309 -3778 -20707 -99167 -24144 107964 102908 -34199 -184921 -156011 -148923
1242 -148923 -162422 -121115 -133653 -115692 59904 95105 29322 -46397 -96100 -212183 -204422
1231 -204422 -124490 -156598 -138052 -144415 -111697 54622 6531 32019 249638 363667 441410
1220 441410 337988 219124 255901 333214 209363 119880 47990 -16627 64283 130981 106623
1209 106623 -9733 -37562 1351 128720 59152 42804 117759 62738 103995 126313 53367
1198 53367 188326 237442 174693 143178 69751 115883 171876 117775 44884 -5460 -86980 -160203
1186 -160203 -142092 -21010 -73257 -156533 -177325 -209849 -95403 -77993 -12120 128072 173398
1175 173398 263227 184571 148383 155390 27493 88143 72415 16039 19572 45212 19926 93893
1163 93893 33133 5269 92866 125677 161064 178201 168610 28464 -59147 35988 -4085 -141913
1151 -141913 -8870 84747 7427 49178 46845 -36082 -51440 109974 216778 261825 150675
1140 150675 18775 82814 -12940 -91947 -118081 -98595 82549 278211 230033 113894 76792
1129 76792 77690 116226 109196 -21993 -70209 -21551 -54310 -145222 -257247 -260046 32318 157032
1117 157032 26192 -125528 -34030 34148 -53292 32711 147035 31619 -122982 -130849 -84867
1106 -84867 -8727 69801 85128 53889 -47857 -9036 -378 26118 17953 24662 27867 120019
1094 120019 154972 257624 197008 77353 -21551 34439 84034 13304 -44228 15164 1471
1083 1471 28991 -46196 -87982 -12171 34526 144490 268991 219051 -804 11312 12346 29629
1071 29629 21978 12994 -143515 -144170 -118144 -174915 -124587 -135255 -32567 114960 204014 153467
1059 153467 67696 95016 111318 144054 88932 54585 102180 284749 327058 359274 336214
1048 336214 143916 82966 30674 126054 163081 75488 -6499 -103603 -27466 38756 59472
1037 59472 90408 8422 2538 149848 183904 -14600 -20772 684 75571 5642 -40999 57216
1025 57216 148941 96563 36467 59497 138922 178550 165954 131855 16382 -83888 -38412
1014 -38412 80514 15141 -131102 -67984 85888 184465 169640 219565 167319 22363 -13134
1003 -13134 141025 129351 -1183 -58775 -126858 -61385 32777 37591 25574 153158 35371
992 35371 -76116 -102657 7541 -74365 -96440 -59674 54262 133045 179568 64645 9494
981 9494 92715 83762 91004 168331 105939 -21819 -313 119884 182483 217575 143935 81154
969 81154 106397 132391 191690 208542 194837 314964 401253 382991 267124 152785 134734
958 134734 75804 34430 -137997 -203504 12819 98907 128601 160280 168560 114797 6634
947 6634 -79142 -28683 -40485 -94181 -90856 79990 174949 202829 225611 188016 90776 108265
935 108265 106914 213836 234228 84608 -101184 -101175 -89943 -61725 -60452 76656 94320 84589
923 84589 -87621 -170247 -62169 -12642 -104212 -176222 -90583 -47362 -7529 -17042 7768 -88821
911 -88821 -240792 -221265 -143791 -217588 -117003 -73307 -118188 -105481 -115064 -9846 48175 93859
899 93859 36380 -52679 -29251 -112046 -201038 -142310 -62706 -91237 -94381 -41797 62352 56155
887 56155 1782 60376 857 5227 961 -17561 -52352 -24565 106137 -11757 -29669 -85615
875 -85615 -79175 47676 -7434 54010 49328 -3743 -186619 -174027 -72330 -104850 -7798 47244
863 47244 165680 97151 -79043 -1850 47262 -23793 -54092 -154416 -210425 -203420 -209985 -126464
851 -126464 -67233 31888 288809 429252 375932 300189 309174 261027 66856 -89570 -54323
840 -54323 35780 44404 66778 37101 -65649 -14855 -36230 -168761 -216742 -126200 -54563 -9358
828 -9358 -36760 -45366 90605 154479 76398 42447 -22062 -42868 37977 91843 43492 121307
816 121307 188796 147721 87468 163508 182830 220330 298896 239187 156088 85714 55737 -42729
804 -42729 40108 59414 52494 117062 68381 141724 180170 162532 97280 124254 118541 45676
792 45676 84677 7802 -34805 61802 231638 148274 31894 45131 215367 275234 217653
781 217653 75199 -27138 -64723 -10815 37051 85447 142058 155394 191987 270891 234851
770 234851 179840 183087 216094 178707 22236 -4388 103633 208303 367131 325578 104619
759 104619 53751 161586 166706 178053 162610 32965 21898 98092 15525 8196 27537 17105
747 17105 46414 31282 -86103 -107678 40033 135294 170372 130915 86981 57390 245276
736 245276 250864 205650 198729 283237 181881 77190 63150 62003 26716 24913 9658 81178
724 81178 157848 122525 159441 240417 236034 235511 170075 104845 109283 110172 171058 196743 222595
711 222595 234278 150595 230548 319166 350414 423655 408921 324100 241122 65996 -48805
700 -48805 -83032 -9549 65322 120443 98262 202460 87685 -137818 -85924 8444 55216
689 55216 97491 41484 -8861 -44408 45528 192147 187759 195132 369631 328204 272917 176652
677 176652 162784 227427 216411 219798 101652 58533 154056 138196 77674 147809 209289 216109
665 216109 211744 246453 251376 194299 283131 176346 61017 -84069 -31669 50957 64189 45535
653 45535 153837 193582 155354 118234 111555 86579 -32506 -105757 -18439 94587 128454 130234
641 130234 220835 241487 146377 86518 -22741 14386 156724 193436 298337 401987 343896
630 343896 231540 215703 280617 238294 129231 152370 197286 169599 161963 95685 152954 278393
618 278393 357688 270364 187621 115579 25366 97785 37451 56934 180441 111353 -65722
607 -65722 -93961 -28848 50975 5384 -27780 679 118732 230333 205929 230558 211272 191028
595 191028 148820 79621 72967 41122 45571 -75455 -47987 -64282 -16447 95749 225262 364915
583 364915 299334 65466 15341 59405 29485 -29798 -11888 61548 102719 83815 -3686 -68932
571 -68932 5854 137536 99570 149630 67445 42092 25212 34283 221507 117451 -39944
560 -39944 -25122 -1168 20955 -36869 81609 268368 365184 380345 308092 230087 138395 55091
548 55091 -28657 -83143 -58393 82261 279588 274562 319977 276466 167907 151819 275347
537 275347 205826 130535 182182 209427 127155 27405 2046 93549 231355 290281 237373 269651
525 269651 295990 256714 203333 198069 159939 197579 222184 193770 303143 440730 479205 327781
513 327781 217880 262433 230705 145284 87895 180643 259654 241182 227577 205554 150342 -12671
501 -12671 41278 180995 211887 226426 141798 200887 225305 195849 180365 155899 155957 155422 88666
488 88666 52515 -51355 -77505 -70597 83312 107148 96224 160880 175842 316072 223963 85631
476 85631 -67944 6227 148298 194839 32859 11453 101998 119315 12611 -62726 -64604
465 -64604 -116627 -146602 -103463 52834 184756 183163 125185 27594 -14656 17229 61991 83513
453 83513 48229 3887 41572 47634 191786 321231 250252 164606 108069 84803 104910 124060
441 124060 -5887 -35982 75199 71025 93495 96992 62444 75225 155198 121032 75077 197307
429 197307 232852 323700 391911 345316 307205 231435 112939 11697 -59249 -85485 -3805
418 -3805 52682 87559 61678 2237 -23580 -53953 -41606 55333 63452 69116 25884 209395
$$ [...]
##END NTUPLES=NMR SPECTRUM
##END=
