##TITLE=Analysis number 327441
Compound Code sb 01578
Book Reference 37176
Project Code adrs flr03
Chemist Name jom
##JCAMPDX= 6.0         $$ Bruker NMR JCAMP-DX V2.0
##DATA TYPE= NMR SPECTRUM
##DATA CLASS= NTUPLES
##ORIGIN= Bruker BioSpin GmbH
##OWNER= nmr
$$ XWIN-NMR		Version 3.5
$$ Fri Mar 23 13:18:24 2007 GMT Standard Time (UT+0h)  MAYBRIDGE\nmr@NMR_250MHZ
##.OBSERVE FREQUENCY= 250.131544655141
##.OBSERVE NUCLEUS= ^1H
##.ACQUISITION MODE= SIMULTANEOUS (DQD)
##.ACQUISITION SCHEME= undefined
##.AVERAGES= 16
##.DIGITISER RES= 18
##SPECTROMETER/DATA SYSTEM= dpx250
##.PULSE SEQUENCE= zg30
##.SOLVENT NAME= DMSO
##.SHIFT REFERENCE= (INTERNAL, DMSO, 0, 16.522)
##AUDIT TRAIL= $$ (NUMBER, WHEN, WHO, WHERE, WHAT)
$$ ##TITLE= Audit trail, XWIN-NMR		Version 3.5
$$ ##JCAMPDX= 5.01
$$ ##ORIGIN= Bruker BioSpin GmbH
$$ ##OWNER= nmr
$$ C:\u/data/dgb/nmr/ADRS/1870/pdata/1/auditp.txt
$$ ##AUDIT TRAIL=  $$ (NUMBER, WHEN, WHO, WHERE, WHAT)
(   1,<2007-03-23 13:17:45.89 +000>,<MAYBRIDGE\nmr>,<NMR_250MHZ>,
      <created by zg, POWCHK disabled, PULCHK disabled
       configuration hash MD5:
       49 4B E0 1D 92 C2 6B 37 9F E6 65 BC 52 41 86 1D
       data hash MD5: 64K
       73 34 AD D7 CF 22 3B 5F 31 E0 17 B2 7F C0 94 56>)
(   2,<2007-03-23 13:18:10.79 +000>,<MAYBRIDGE\nmr>,<NMR_250MHZ>,
      <Start of raw data processing
       ef LB = 0.3 FT_mod = 6 PKNL = 1 SI = 32K 
       data hash MD5: 32K
       D3 58 E7 DF 36 23 41 68 09 EC 9B 7E B0 08 C5 CC>)
(   3,<2007-03-23 13:18:12.89 +000>,<MAYBRIDGE\nmr>,<NMR_250MHZ>,
      <apk 
       data hash MD5: 32K
       5D AF AE 03 60 15 0E AE 2D 3A 08 5F 9B C6 AD 6C>)
(   4,<2007-03-23 13:18:13.82 +000>,<MAYBRIDGE\nmr>,<NMR_250MHZ>,
      <abs ABSG = 5 
       data hash MD5: 32K
       D6 C6 CF EC 07 61 1F 0E 39 40 74 D9 99 D0 1E 78>)
$$ ##END=
$$ 
$$ hash MD5
$$ 56 61 5C BC B0 CD CA 84 60 31 87 3D 08 34 75 1E
##$RELAX= 
##$RELAX= 
##$RELAX= 
##$RELAX= 
##$RELAX= 
##$RELAX= 
##$RELAX= 
$$ Bruker specific parameters
$$ --------------------------
##$DU= <C:\u>
##$EXPNO= 1870
##$NAME= <ADRS>
##$PROCNO= 1
##$TYPE= <nmr>
##$USER= <dgb>
##$AMP= (0..31)
100 100 100 100 100 100 100 100 100 100 100 100 100 100 100 100 100 100 
100 100 100 100 100 100 100 100 100 100 100 100 100 100 
##$AQSEQ= 0
##$AQ_mod= 3
##$AUNM= <au_zg>
##$AUTOPOS= <39 >
##$BF1= 250.13
##$BF2= 250.13
##$BF3= 250.13
##$BF4= 250.13
##$BF5= 500.13
##$BF6= 500.13
##$BF7= 500.13
##$BF8= 500.13
##$BYTORDA= 1
##$CFDGTYP= 0
##$CFRGTYP= 5
##$CHEMSTR= <none>
##$CNST= (0..31)
1 1 145 1 1 1 1 1 1 1 1 1 1 1 1 1 1 1 1 1 1 1 1 1 1 1 1 1 1 1 1 1 
##$CPDPRG= <>
##$CPDPRG1= <>
##$CPDPRG2= <>
##$CPDPRG3= <>
##$CPDPRG4= <mlev>
##$CPDPRG5= <mlev>
##$CPDPRG6= <mlev>
##$CPDPRG7= <mlev>
##$CPDPRG8= <mlev>
##$CPDPRGB= <>
##$CPDPRGT= <>
##$D= (0..31)
0 1 0 0 0 0 0 0 0 0.06 0 0 0 0 0 0 0.0002 0 0 0 0 0 0 0 0 0 0 0 0 0 0 
0 
##$DATE= 1174655864
##$DBL= (0..7)
120 120 120 120 120 120 120 120 
##$DBP= (0..7)
150 150 150 150 150 150 150 150 
##$DBP07= 0
##$DBPNAM0= <>
##$DBPNAM1= <>
$$ [...]
##$SUBNAM7= <"">
##$SUBNAM8= <"">
##$SUBNAM9= <"">
##$SW= 20.6930455092707
##$SWIBOX= (0..15)
0 0 3 0 0 0 0 0 0 0 0 0 0 0 0 0 
##$SW_h= 5175.983436853
##$TD= 65536
##$TD0= 1
##$TE= 683.16
##$TE2= 300
##$TE3= 300
##$TEG= 300
##$TL= (0..7)
0 120 120 120 120 120 120 120 
##$TP= (0..7)
150 150 150 150 150 150 150 150 
##$TP07= 0
##$TPNAME0= <>
##$TPNAME1= <>
##$TPNAME2= <>
##$TPNAME3= <>
##$TPNAME4= <>
##$TPNAME5= <>
##$TPNAME6= <>
##$TPNAME7= <>
##$TPOAL= (0..7)
0.5 0.5 0.5 0.5 0.5 0.5 0.5 0.5 
##$TPOFFS= (0..7)
0 0 0 0 0 0 0 0 
##$TUNHIN= 0
##$TUNHOUT= 0
##$TUNXOUT= 0
##$USERA1= <user>
##$USERA2= <user>
##$USERA3= <user>
##$USERA4= <user>
##$USERA5= <user>
##$V9= 5
##$VALIST= <valist>
##$VCLIST= <CCCCCCCCCCCCCCC>
##$VD= 0
##$VDLIST= <DDDDDDDDDDDDDDD>
##$VPLIST= <PPPPPPPPPPPPPPP>
##$VTLIST= <TTTTTTTTTTTTTTT>
##$WBST= 1024
##$WBSW= 4
##$XGAIN= (0..3)
0 0 0 0 
##$XL= 0
##$YL= 0
##$YMAX_a= 347875
##$YMIN_a= -340216
##$ZGOPTNS= <>
##$ZL1= 120
##$ZL2= 120
##$ZL3= 120
##$ZL4= 120
##$ABSF1= 16.522
##$ABSF2= -4.171173
##$ABSG= 5
##$ABSL= 3
##$ALPHA= 0
##$AQORDER= 0
##$ASSFAC= 0
##$ASSFACI= 0
##$ASSFACX= 0
##$ASSWID= 0
##$AUNMP= <proc_1d>
##$AZFE= 0.1
##$AZFW= 0.1
##$BCFW= 0
##$BC_mod= 0
##$BYTORDP= 0
##$COROFFS= 0
##$CY= 12.5
##$DATMOD= 1
##$DC= 0
##$DFILT= <>
##$DTYPP= 0
##$F1P= 14.0000005364418
##$F2P= -0.99999901652339
##$FCOR= 0.5
##$FTSIZE= 32768
##$FT_mod= 6
##$GAMMA= 0
##$GB= 0
##$INTBC= 1
##$INTSCL= 1
##$ISEN= 128
##$LB= 0.3
##$LEV0= 0
##$LPBIN= 0
##$MAXI= 10000
##$MC2= 0
##$MEAN= 0
##$ME_mod= 0
##$MI= 0
##$NCOEF= 0
##$NC_proc= -6
##$NLEV= 6
##$NOISF1= 0
##$NOISF2= 0
##$NSP= 0
##$NTH_PI= 0
##$NZP= 0
##$OFFSET= 16.522
##$PC= 1
##$PHC0= 215.2127
##$PHC1= 13.34155
##$PH_mod= 1
##$PKNL= yes
##$PPARMOD= 0
##$PSCAL= 4
##$PSIGN= 0
##$REVERSE= no
##$SF= 250.13
##$SI= 32768
##$SIGF1= 0
##$SIGF2= 0
##$SINO= 400
##$SIOLD= 32768
##$SREGLST= <1H.DMSO>
##$SSB= 0
##$STSI= 32768
##$STSR= 0
##$SW_p= 5175.98343685301
##$SYMM= 0
##$S_DEV= 0
##$TDeff= 65536
##$TDoff= 0
##$TI= <Analysis number 999999
Compound Code 99
Book Reference 9
Project Code 9>
##$TILT= no
##$TM1= 0
##$TM2= 0
##$TOPLEV= 0
##$USERP1= <user>
##$USERP2= <user>
##$USERP3= <user>
##$USERP4= <user>
##$USERP5= <user>
##$WDW= 1
##$XDIM= 32768
##$YMAX_p= 485828334
##$YMIN_p= -814212
$$ End of Bruker specific parameters
$$ ---------------------------------
##NTUPLES= NMR SPECTRUM
##VAR_NAME=  FREQUENCY,     SPECTRUM/REAL,   SPECTRUM/IMAG
##SYMBOL=    X,             R,               I
##VAR_TYPE=  INDEPENDENT,   DEPENDENT,       DEPENDENT
##VAR_FORM=  AFFN,          ASDF,            ASDF
##VAR_DIM=   32768,         32768,           32768
##UNITS=     HZ,            ARBITRARY UNITS, ARBITRARY UNITS
##FACTOR=    0.157963299565203, 1,           1
##FIRST=     4132.6476996994, 0,             0
##LAST=      -1043.33573715361, 0,           0
##MIN=       -1043.33573715361, -814212,     0
##MAX=       4132.6476996994, 485828334,     0
$$ Real data points
##PAGE= N=1
##DATA TABLE= (X++(R..R)), XYDATA
$$ [...]
26251b63864P4208J17346L6820L2122N8084q9553p2281m9720l8675l0487M1428
26240a84572P1603J47669n9884o044k07384K1349J90701q552j0162K6600j21016
26229a39692q296J36861k2664n6247L780L4929k5689O9342Q9899m2299j3881K532
26217B8575Q3143R9913p6477m9993m2169L9223J24525O7764j36372j63303J6030
26206i141k7619j45660n5053q3246R7922J25874L1143q9274k91K90657J57597
26195B92909O0874l364p2338q3543j2503j03222j6402L663K2426P747p3687l3919
26183a1359K4446j8741L4355O5362R748k7366k13302m3721j27761R3434K27970
26172A3065L8234p0209n756K6504Q3176l3089j89387J26525J68181o1285o3567
$$ plain form
26251 -263864 -189656 -72310 -35490 -3368 54716 -34837 -107118 -156838 -195513 -226000 -184572
26240 -184572 -112969 34700 -25184 -31228 -238612 -217263 -26562 -35114 -45276 -18676 -139692
26229 -139692 -147988 -11127 -33791 -90038 -86258 -51329 -77018 -7676 82223 39924 26043 28575
26217 28575 111718 211631 135154 85161 42992 82215 206740 274504 138132 -25171 -9141
26206 -9141 -36760 -182420 -237473 -320719 -222797 -96923 -65780 -155054 -155345 135312 292909
26195 292909 353783 350419 278081 194538 182035 78813 62411 66074 88500 96247 22560 -11359
26183 -11359 13087 -5654 28701 94063 103811 76445 -136857 -180578 -308339 -214905 13065
26172 13065 51299 -18910 -24666 1838 85014 51925 -137462 -10937 157244 95959 32392
26161C2392M4151o8886J3463K6955L695J35818J37975j7755k6602J5644q1725
26150B15125n7929j4528o7273p4201q2786J29768L7553l8374r6065n6751k6721
26139a32182N5299p6093J5377J44103K1027m4584j8923k06487p1101J67938N2743
26128i2883J112N7945l8632M1102l7795l2588K30441Q2583m3427k38825j96703
26117b67670J0982N067J6084J06038j664j21619j16016J35820J55571r1856R8149
26106g1114J65648p9318q5415j4916q8042J66935O2793n2199m8092j05265j20531
26095b69516l0884O1988J64625J44436q0955Q5659J3442p9134q9101n2237q281
26084a39958R279N2873j19472K8361q172m4948J50471L9052R9036J79919j15841
$$ plain form
26161 32392 76543 7657 21120 48075 51770 187588 325563 307808 281206 296850 215125
26150 215125 157196 142668 75395 1194 -81592 48176 85729 47355 -48710 -105461 -132182
26139 -132182 -76883 -152976 -137599 6504 27531 -17053 -35976 -242463 -313564 -145626 -92883
26128 -92883 -91771 -33826 -72458 -31356 -69151 -101739 128702 211285 167858 -70967 -267670
26117 -267670 -256688 -251621 -235537 -129499 -131163 -252782 -368798 -232978 -77407 -169263 -71114
26106 -71114 94534 15216 -70199 -85115 -173157 -6222 56571 4372 -43720 -148985 -269516
26095 -269516 -300400 -238412 -73787 70649 -10306 75353 88795 9661 -79440 -131677 -139958
26084 -139958 -130679 -77806 -197278 -168917 -177089 -222037 -71566 -32514 66522 246441 130600
26073A30600k04890k094N2943j06792p7084L2888Q5173K5468j73581N4836J21949
26062f0584P0011N0888l9434n7985O4739P0369k0322n6316m7838j07802K3919
26051a10355J06749J49366k3568o2041J17818P9172k77274j97592m2698q7911
26041c48334O6636L0616J15843J04908N7842R741K0353k5187P7063k9792N6787
26030A36476K7940q7102j26889J9979n8681J3215j2056P372R0454j3771J5835
26019A2772o5878o804M9136R1515m3798r0519j41009m9275P748J73134J54187
26008I1209q6746l6365l4155l7068r8719N5649M6074o5685P5594M4850J10675
25997F5313M0658P8230p2621o9736J71200q5560j84036k6463J2256R7639k8019
$$ plain form
26073 130600 -74290 -76384 -23441 -130233 -207317 -174429 -89256 -63788 -237369 -182533 -60584
26062 -60584 9427 60315 20881 -37104 27635 98004 77682 21366 -26472 -134274 -110355
26051 -110355 -3606 145760 122192 60151 177969 257141 -20133 -217725 -260423 -348334
26041 -348334 -281698 -251082 -135239 -30331 27511 37252 57605 32418 109481 79689 136476
26030 136476 164416 77314 -49575 -29596 -88277 -75062 -87118 -79746 10708 -3063 12772
26019 12772 -53106 -59910 -10774 80741 36943 -53576 -194585 -243860 -236112 -62978 91209
26008 91209 4463 -31902 -66057 -103125 -201844 -146195 -100121 -165806 -90212 -45362 65313
25997 65313 105971 184201 111580 41844 213044 127484 -56552 -83015 -70759 26880 -1139
25986a139r6511j3818P4916n977o7548q3809Q5283J4794k7615n6416Q6274J51511
25974E9945P8926n2286j06262J0480k3817M7903r100J6953l8912q5024n8037J95581
25962C6350J81194j46729j22324n1285P585r3242n1690j07096J69081N7004j14664
25951b35816o5985J43350J57559J29229p0044j29588j2756O5350J1297n8202n1148
25940a16754l852N8576Q6421j3796N846o1477K1751n1858P0900K0921p8799o9580
25928a31701j14791K5651L675q8811O6385J27704j731O0449p5316j45445P4358
25917a99573K6333m6123O1351K7345J803J86568Q7036l9461j7039r6916n759L7540
25905B3105J01062j15843o1382O3511P220j55492q097L0830j27278O213O5226
$$ plain form
25986 -1139 -97650 -111468 -36552 -42529 -110077 -193886 -108603 -93809 -121424 -177840 -91566 59945
25974 59945 138871 86585 -19677 -9197 -33014 14889 5789 22742 -16170 -101194 -159231 36350
25962 36350 217544 70815 -51509 -102794 -95209 -188451 -240141 -347237 -178156 -121152 -235816
25951 -235816 -301801 -158451 -892 128337 58293 -71295 -84051 -18701 -7404 -65606 -116754
25940 -116754 -120606 -62030 24391 10595 16441 -45036 -23285 -75143 -4243 16678 -62121 -131701
25928 -131701 -246492 -220841 -217166 -305977 -239592 -111888 -113619 -53170 -128486 -273931 -199573
25917 -199573 -173240 -219363 -158012 -130667 -128864 57704 144740 105279 88240 -8676 -14435 23105
25905 23105 124167 8324 -53058 10453 17673 -137819 -145916 -115086 -242364 -236151 -170925
25894a70925O5513l2574j58151J2727k3930K412J04768j23996J44920Q5421J87546
25883I3731N1380j12346k313J02658N2415J0306j00362r7426n4068M837j12578
25872a63766k1869m7861m6529P5435K74J3613N8237M0724K5704J8908M986L4620
25860g524P7905r8420j910p9580l1844N6902Q820Q4742p1408J84365J9503k20616
25848g9065j06902Q5008M9256M3429l3933K9745J81702J7874m6524J6651M8242
25837B05483k27248k10460L0685J28725J76560J119m1010p8094j00018o0416j37035
25826c11709l4810K5267J53845J03173k8562R2724Q1275K4114q4717q1065N5147
25815e318J42138p1753j04806K6023L0151J1168r7016m1995K16765l5650j04623
$$ plain form
25894 -170925 -105412 -137986 -296137 -283410 -307340 -304928 -200160 -324156 -179236 -93815 93731
25883 93731 145111 32765 30452 133110 185525 195831 95469 -1957 -56025 -51188 -163766
25872 -163766 -185635 -233496 -280025 -204590 -204316 -190703 -132466 -91742 -66038 -47130 -42144 -7524
25860 -7524 70381 -28039 -29949 -109529 -141373 -84471 -75651 9091 -62317 122048 141551 -79065
25848 -79065 -185967 -100959 -51703 -8274 -42207 -12462 169240 187114 140590 157241 205483
25837 205483 -21765 -232225 -201540 -72815 103745 104864 63854 -14240 -114258 -174674 -311709
25826 -311709 -346519 -321252 -167407 -64234 -92796 -72 81203 105317 20600 -60465 -5318
25815 -5318 136820 65067 -39739 -13716 16435 27603 -69413 -111408 105357 69707 -34916
25804c4916P6592k42j05036n9790q2758j1264J6142O798Q0666J52038K18743p6924
25792A80049n9969P7075J9123j69057j46843J74771J59607p1293j45533j9637
25782a707J17093k3254j47486k74435p2646J47837K39316J29529l1586P9019N0600
25771B12280r8290k38321K1949K12104l8617o5379Q4970M2740p5795k8888j25286
25760i6533j83892k8832K1601K02443P8260j21291o1746J5961R0350Q7577j41190
25749a37292m5389J51316K238j90519k5073K52702L3420k6033j29814q2934M5832
25738a51546J0047K8486l764l4883o9399j5494P0576j44116q1019O3996J206L3827
25726b92083J05416J14463L3459J50062J53463j31019j32425n0144l8031p0273
$$ plain form
25804 -34916 41676 41434 -63602 -123392 -206150 -217414 -201272 -194474 -113808 38230 256973 180049
25792 180049 120080 197155 216278 47221 -99622 75149 234756 163463 17930 -1707
25782 -1707 115386 92132 -55354 -329789 -402435 -254598 -15282 114247 82661 161680 212280
25771 212280 113990 -124331 -102382 109722 71105 5726 90696 133436 57641 28753 -96533
25760 -96533 -280425 -309257 -287656 -85213 -6953 -128244 -189990 -174029 -83679 3898 -137292
25749 -137292 -182681 -31365 -29127 -219646 -244719 7983 41403 15370 -114444 -197378 -151546
25738 -151546 -141499 -113013 -116777 -151660 -221059 -236553 -165977 -310093 -391112 -327116 -325910 -292083
25726 -292083 -186667 -72204 -38745 111317 264780 133761 1336 -48808 -86839 -157112
25716a57112M610J18480l0143o4482K5508l2518j42553j15702J8512K2170K5732
25705c27498R8018L3242Q0996K0951J50094K1741O6479L9249j32965L1470j10535
25694b8758q623J2893j19947N6627M3097j25304Q1789P6173p7365r4229J16990
25683f6657J28458L5883j75231j94614L5366J72148K65976j37220k04632J15992
25673b4531O5419j11391K8083k1539K5046R2231L3381j0783q2896m1257Q6890
25662C8653J05879k6093M0099K6091Q7253l6360L1571j40753j83361j51575M6673
25651a61923J39639O5740Q1208j8650o4789j5606r832M0144R9635j57565q7811
25640h9810k3532Q907N6517L3510o8492k51268l4907R4214R6435R2324J4979l0397
$$ plain form
25716 -157112 -152502 -34022 -64165 -128647 -103139 -135657 -278210 -393912 -375400 -353230 -327498
25705 -327498 -229480 -196238 -115242 -94291 55803 77544 144023 183272 50307 81777 -28758
25694 -28758 -37381 -24488 -144435 -87808 -44711 -170015 -88226 -12053 -89418 -183647 -66657
25683 -66657 61801 97684 -77547 -272161 -236795 -64647 201329 64109 -140523 -24531
25673 -24531 40888 -70503 -42420 -63959 -38913 53318 86699 75916 -6980 -48237 38653
25662 38653 144532 118439 158538 184629 271882 235522 267093 126340 -57021 -208596 -161923
25651 -161923 -22284 43456 124664 106014 41225 25619 15787 55931 155566 -1999 -89810
25640 -89810 -113342 -104435 -47918 -14408 -82900 -334168 -369075 -274861 -178426 -86102 -71123 -101520
25628a01520m2764j1757j19989j08800p855K50964P7913j0869M9570J8684J5311
25617H888J9687k1815K2723L9713J10986j20207r4177N0400O3734j04278N7029
25606C2683Q3812J82625K5379n9435j18239n2275Q8314o9631j29125M9596L6711
25595G0415P428L7374P0298k5720J50850M6278p3227j37326j87974k17709q5590
25584c44903O4976l9127J52614K60309J88911P5865j60033j20954L0346j02394
25574E610O458j39262q4173N445O4560J20458J33191O7610L3527j51057p5613
25563a3246q3066J25872J25567o9977J8287J2797Q1629J4947k2182p9030j25271
25552a3673j02691j02110r8391J6433R4913l0241j40182P491Q2187P4733m7709
$$ plain form
25628 -101520 -144284 -156041 -276030 -384830 -392685 -141721 -63808 -74677 -25107 -6423 8888
25617 8888 28575 6760 29483 69196 180182 59975 -34202 16198 79932 -24346 32683
25606 32683 116495 299120 324499 265064 146825 94550 182864 113233 -15892 33704 70415
25595 70415 77843 115217 185515 159795 310645 356923 283696 146370 -41604 -259313 -344903
25584 -344903 -279927 -319054 -166440 93869 282780 358645 198612 77658 108004 5610
25574 5610 12068 -127194 -211367 -205922 -141362 -20904 112287 179897 213424 62367 -13246
25563 -13246 -96312 29560 155127 85150 103437 116234 197863 212810 190628 111598 -13673
25552 -13673 -116364 -218474 -316865 -300432 -205519 -235760 -375942 -368451 -286264 -211531 -259240
25541b59240n6887J99888K49450J35567M6133r7715j46898j48197j07303Q4277
25531a00925R3249m1499m1080l399J71631J32736p5753q4143j81p1706j7879J01696
25519F2747j6929n719j1195p7330l2476n0418j8651l6142K2947N7573J09364k1855
25507a8084m0502M14M3615O9637j609L8622j91524j19000o0863O4342J23781J01680
25495A0509J12704P5887k54842j64729P9052J21685M7981K2073L2323k6757p6099
25484b0213M8114q2144n5083J08720j22606k20174Q5840K61508J2641k2303kK5300
25472A9598J24633j62521n374Q634j5309j01977m5928K3583r5200J26851J1393
25461a11617k7488k3420K3128J00732L0726n0458l0418k7968O3394r9096M4009
$$ plain form
25541 -259240 -316127 -116239 133211 268778 314911 217196 70298 -77899 -185202 -100925
25531 -100925 -7676 -49175 -90255 -93654 77977 210713 134960 50817 50636 -21070 -38949 62747
25519 62747 45818 40099 28904 -48426 -80902 -131320 -149971 -186113 -163166 -105593 3771 -18084
25507 -18084 -58586 -58172 -14557 55080 53471 92093 -99431 -218431 -279294 -214952 -91171 10509
25495 10509 123213 199100 -55742 -220471 -141419 -19734 28247 50320 82643 55886 -20213
25484 -20213 27901 -54243 -109326 -606 -123212 -343386 -257546 3962 16603 -5700 -5702 19598
25472 19598 144231 -18290 -23664 -15030 -30339 -132316 -178244 -154661 -249861 -123010 -111617
25461 -111617 -139105 -162525 -139397 -38665 -7939 -58397 -88815 -116783 -53389 -152485 -108476
25450a08476J16495P9136M940M100n8976j34975n8635K7508k1176K1419o1620
25439a90260m4873n044j4856M1506J9616J02320N6891j3094j6163p450k6262K2453
25427g5216J35147o0369j05365O4943j3001Q3277J18766O1705j13875P7618o9601
25416A04029o4366J9601p6304j30970P4979R7157k5589q3117J61419J68576j06708
25405A38707p9727j05826r6577J61601M2607N1599l9367J4133j37204N0022j3935
25394a3967n7760N1098k699m7333Q322j19125J69906j7060q8059J42155J7248
25383D2726j19730j12662p8720j4517O7769N9170m3282N7334j9781L9471L5187
25372h7035J75308n5518J7569K387r6629r0475j0686J364N6569Q074L5084j60246
$$ plain form
25450 -108476 8019 87155 92095 96195 37219 -97756 -156391 -128883 -150059 -128640 -190260
25439 -190260 -235133 -240177 -255033 -213527 -193911 -91591 -34700 -47794 -63957 -71407 -97669 -75216
25427 -75216 59931 -438 -105803 -40860 -53861 29416 148182 209887 96012 173630 104029
25416 104029 39663 59264 -17040 -148010 -73031 24126 -1463 -84580 76839 245415 138707
25405 138707 58980 -46846 -143423 18178 60785 112384 73017 87150 -50054 -32 -13967
25394 -13967 -71727 -20629 -23328 -70661 -62339 -181464 -11558 -28618 -116677 25478 42726
25383 42726 -77004 -189666 -268386 -282903 -215134 -155964 -199246 -141912 -161693 -122222 -87035
25372 -87035 88273 32755 50324 52711 -43918 -134393 -145079 -143715 -87146 -79072 -43988 -204234
25360b04234Q6480J6756r9544j50444r4785J07360J81505J05456k7387l4852j4657
25349a28346J0401K4241l7246k7527o7712J73504J60520m4694j41823N1185L9442
25338A1945L9002M574M286R0744Q9389q6118q7691m4943j04268M2598N3767P8962
25326I2247M587j32431l3675o2756k5676J7828J67158J20751M2325j0827j45956
25315C3575j42804J5354j2750r088k5615P8307R6470Q4602o1139p4490j28374
25304a45952J37404J536j5743j02064r1998m4019m4426j9733R651O0176O5197
25293a89971P9464j13135P4990J76499l6932K5330M0101j12480p3956L0893j0567
25282a09764J22538L4197j65197O1343O7685M6681n1048j7811q1658o4211N8914
$$ plain form
25360 -204234 -117754 -100998 -200542 -350986 -445771 -338411 -156906 -51450 -78837 -113689 -128346
25349 -128346 -117945 -93704 -130950 -158477 -226189 -52685 107835 63141 -78682 -27497 11945
25338 11945 50947 55521 59807 150551 239940 153822 66131 21188 -83080 -40482 13285 92247
25326 92247 96834 -35597 -69272 -132028 -157704 -139876 27282 148033 190358 179531 33575
25315 33575 -109229 -93875 -106625 -115713 -141328 -63021 33449 118051 56912 -17578 -145952
25304 -145952 -8548 -7012 -22755 -124819 -216817 -260836 -305262 -324995 -315344 -255168 -189971
25293 -189971 -110507 -223642 -148652 27847 -9085 16245 56346 -56134 -130090 -99197 -109764
25282 -109764 12774 46971 -118226 -56883 10802 57483 6435 -11376 -93034 -157245 -98331
25271i8331p1570n9050l9705j250l8444N6611J63033J26447O8961j77284j18536
25260a89118K2447K70865O9683p7011m6832k7452j40624O120J14663J78597o974
25249A74364j40516J38555O1292m8625k7352n6553o1827N0457n668j96241n5680
25238a67794R9348O7486j2869j40380K8900m3750P8439N9007p0298O2671J56030
25227A16790J3295j70950k4777J4386m6687L8079q7877p4808J18620o4029j6971
25216a84929n3187N5477J8388N8395O1900M58j9973j4996J05133O1156J02410
25205A90232j11687R498r5733j39593r6194q3681J75634N9144o497N5916J10811
25194F7850J1919j38184P0615j12746j78451r350K9677q7452J14071J89437N4667
$$ plain form
25271 -98331 -169901 -228951 -268656 -269906 -308350 -251739 -88706 37741 106702 -70582 -189118
25260 -189118 -166671 104194 173877 96866 50034 22582 -118042 -111922 2741 181338 174364
25249 174364 33848 172403 233695 185070 157718 101165 39338 89795 84127 -112114 -167794
25238 -167794 -68446 -960 -13829 -154209 -125309 -169059 -90620 -31613 -101911 -39240 116790
25227 116790 130085 -40865 -65642 -51256 -97943 -59864 -147741 -222549 -103929 -167958 -184929
25216 -184929 -238116 -182639 -164251 -105856 -43956 -43498 -63471 -78467 26666 87822 190232
25205 190232 78545 88043 -7690 -147283 -243477 -327158 -151524 -92380 -98877 -42961 67850
25194 67850 79769 -58415 12200 -100546 -278997 -288347 -258670 -346122 -232051 -42614 12053
25183A2053P233m5638M287n0510r3882K6038m2091l6979L8424j6742J8957n0804
25171b29654M210o0898l6804o2454J88925N8227Q7564J05133k5943K1743j66916
25160a16867j68089k4988J2807J6478J28575N5482j0811L1434n8467q4765M5411
25149a73800N5069o7720n8243K7768l0449m3443J15379J20177o4539j09301J59810
25138f9292K63263K2474r2777p561j20315j08242M5802R9215k10459j45906J13406
25127b10392K80271O2551Q154J41556l5582q9094j04404m4469N4621J23682M5985
25116B32879r02J5841k555o6733L4798j63573j03282J12857J58678o5140j63942
25105a1074l1013N1110K0616J1501j9504j10651j2113q7983J12384J73768q5530
$$ plain form
25183 12053 19286 -26352 -22065 -72575 -166457 -140419 -182510 -219489 -181065 -197807 -178850 -229654
25171 -229654 -225444 -286342 -323146 -385600 -196675 -138448 -50884 54249 28306 50049 -116867
25160 -116867 -284956 -309944 -297137 -280659 -152084 -96602 -107413 -75979 -134446 -219211 -173800
25149 -173800 -118731 -186451 -244694 -216926 -247375 -290818 -175439 -55262 -119801 -229102 -69292
25138 -69292 193971 216445 123668 116107 -4208 -112450 -66648 32567 -177892 -323798 -210392
25127 -210392 69879 132430 140584 282140 246558 157464 53060 8591 63212 186894 232879
25116 232879 231977 247818 245263 178530 213328 49755 -53527 59330 218008 152868 -11074
25105 -11074 -42087 9023 29639 41140 21636 -89015 -101128 -189111 -76727 97041 11511
25094A1511n494P1803M6098j6297O6564L2940m8468M3671j24793l5779J02954
25083A44710j8164n7811l9155m795R6385j63184k63257m7860P0011J9663L7676
25072b25781J79157M4318k52024o8485n8148m2057J13830K49025L1253l0231J08117
25061D8974J65879j02967p8950o4269J07959p0836j36662q1546J5259O3633j11019
25050b44545n66J96693R671j76372l1693J2165J9945R3050p5654j03830j6566
25039c17702J83495J33963L7741N9356Q3022r6149j24850R2159P2441N5528k7038
25028A51966l8526m5685j40484M0J33262r4135L0171j50109j44896M9834N1653
25017a96909J37659m4802p4288P8622M9426K99J09729j08411j4711R7631k2047
$$ plain form
25094 11511 6017 77820 123918 107621 174185 207125 158657 202328 77535 41756 144710
25083 144710 126546 68735 29580 24785 121170 -42014 -305271 -353131 -283120 -263457 -225781
25072 -225781 -46624 -2306 -254330 -322815 -380963 -423020 -309190 -60165 -28912 -59143 48974
25061 48974 214853 111886 32936 -31333 76626 5790 -130872 -212418 -197159 -133526 -244545
25050 -244545 -245111 -48418 -38747 -215119 -246812 -234647 -214702 -121652 -197306 -301136 -317702
25039 -317702 -134207 -244 37497 96853 179875 83726 -41124 51035 123476 179004 151966
25028 151966 113440 67755 -72729 -72689 60573 -33562 -3391 -153500 -298396 -248562 -196909
25017 -196909 -59250 -104052 -178340 -99718 -50292 -49993 59736 -48675 -63386 34245 12198
25006A2198j02299J02236J59710R0026j52957r3874j00311Q998J55445K03228
24996B82400l7542K758n1163j13518j80857J8666Q4552q681L0030o7051p0197
24985a10603k6542K4508N2348Q7717O9299J41360k06535k01009R5571K70845k8311
24974A68648k35162j02037J338O9195J13691P7027j37557j70108j4234P5758K2461
24963a30980K1130M3065m6086J33800J5879n2239r7837q5157j45924J92778J57050
24952E479l8987m8098j03979J14198M6098P3476j16758R1019J25820l1696j07341
24941I231r2310j73734n4415J06522R7633J7434M8723j25968O902q042L6066M6636
24929h5322J7401m5483O1633J37193P0865M9844o545q2717n9006k18349j12020
$$ plain form
25006 12198 -90101 12135 171845 261871 108914 15040 -85271 -76273 79172 282400
24996 282400 244858 247616 196453 82935 -97922 -79256 5296 -3385 26645 -40406 -110603
24985 -110603 -137145 -112637 -60289 27428 96727 238087 31552 -169457 -73886 196959 168648
24974 168648 -66514 -168551 -167213 -98018 15673 92700 -44857 -214965 -229199 -153441 -130980
24963 -130980 -109850 -66785 -112871 20929 36808 -15431 -113268 -198425 -344349 -151571 5479
24952 5479 -33508 -81606 -185585 -71387 -25289 48187 -68571 22448 148268 116572 9231
24941 9231 -83079 -256813 -311228 -204706 -107073 -89639 -40916 -166884 -159982 -168024 -131958 -85322
24929 -85322 -67921 -113404 -51771 85422 156287 206131 199586 116869 57863 -160486 -272506
24918b72506N2735L4366N0292L6270K0033r5688j15687k6414j208P0422J18203
24907a29182k3170p203L6382o1935L8175J65395L1605m0026m8047j8872K0348
24896c6530n9176j2623N9485j03396j08122q0335Q4395M7979J1764J68820J5262
24885a2477j58373j13029K088r3938L9937n7950J09449K9969Q3722m0284J83651
24874b7235J05829J4207n2811O486q3373j06133j52242k5385J49025J34397M2220
24863D985q66l8320r7323L7059K4911j89457J1841J87293m2607j29715j39493
24852c71692m0122J17868K55023k5649o8283K4863J60402m8141j17009P5992K7781
24841h967l1125M5258J128j31220q8092N2852J50891K2729j3226r0895r6470j4475
$$ plain form
24918 -272506 -219771 -185405 -135113 -98843 -78810 -174498 -290185 -316599 -317807 -247385 -129182
24907 -129182 -152352 -159555 -123173 -185108 -146933 18462 50067 10041 -38006 -56878 -36530
24896 -36530 -95706 -108329 -48844 -152240 -260362 -340697 -256302 -208323 -196559 -27739 -12477
24885 -12477 -170850 -283879 -281791 -375729 -335792 -393742 -284293 -254324 -170602 -210886 -27235
24874 -27235 78594 92801 39990 46476 -36897 -143030 -295272 -320657 -171632 -37235 4985
24863 4985 4119 -34201 -131524 -94465 -69554 -259011 -247170 -59877 -102484 -232199 -371692
24852 -371692 -411814 -293946 -38923 -64572 -132855 -107992 52410 4269 -112740 -36748 -8967
24841 -8967 -40092 5166 6294 -124926 -213018 -160166 -9275 13454 228 -90667 -187137 -201612
24829b01612J22475K1599q454N1402q5336p1800p8071P4181j04284J21497J14303
24818d4100P4608O6072l673j05298p1302L8805O2191N9607K6961o6956R460j28
24806D6247N896L7046K6379p1898q7365M2502K0113j6134J21968K4333m448j02835
24794D1804q8705P5601j13012K6680J65967N735j04314L636o3577M1230N1726
24783D2771j02853r4123J07893o5629O4943J301j79925P2864Q881P580j693o3525
24771b01515K5288J25431j3185K18731O4997j44784j8670Q0392J44279j88308
24761I2656j21070n1769k2866J48528L5679j06121j49375O6637J59564K2190r5844
24750b1791l1116M0174L3860r7729j36874Q8431K11910n4117n4534j69546o5576
$$ plain form
24829 -201612 -79137 -57538 -65992 -14590 -99926 -171726 -249797 -175616 -279900 -158403 -44100
24818 -44100 30508 96580 92907 -12391 -83693 -44888 17303 76910 103871 36915 46375 46247
24806 46247 52143 89189 115568 43670 -43695 -1193 18920 2786 124754 149087 144639 41804
24794 41804 -46901 28700 -84312 -57632 108335 114070 9756 13392 -50185 -8955 42771
24783 42771 -60082 -154205 -46312 -111941 -46998 -45697 -225622 -152758 -143877 -136297 -137990 -201515
24771 -201515 -176227 -50796 -63981 154750 219747 74963 56293 136685 280964 92656
24761 92656 -28414 -80183 -103049 45479 81158 -24963 -174338 -107701 51863 74053 -21791
24750 -21791 -52907 -12733 21127 -76602 -213476 -125045 86865 32748 -21786 -191332 -256908
24739b56908P474N3375K4136N9886j0202j8879k1570O0961o103o1649j06980R6833
24727a79626R6513j00864j829O7009M7220j06730q7694R3200J40108L4554j8502
24716a6641P387R6615L6419j29838K5067o385M4492M5884k8393L136q6486o6960
24704g5703m4953M0911R3790j15130o1211M0658K4313K3256k6808o1220k537J9403
24692a45231l9288j1637R686K26601J21994n0146r0670p0335j0198J1963R3228
24681D5967l4923J3462r7778m5940L1637J67846M498j62999o848M3660L7127N6447
24669E2156J05393m3184m7166M6j01615R5712J86487J7263L0390k0848n5696j83086
24657C5852J4620Q6772P0142j58191N3025l8662k1983O6681K6941K744j11315
$$ plain form
24739 -256908 -249434 -196059 -171923 -112037 -122239 -141118 -162688 -101727 -107830 -169479 -276459 -179626
24727 -179626 -83113 -183977 -185806 -118797 -71577 -178307 -266001 -172801 -32693 1861 -16641
24716 -16641 -9254 87361 123780 -6058 19009 12624 57116 103000 74607 77743 -8743 -75703
24704 -75703 -120656 -79745 14045 -101085 -162296 -121638 -97325 -74069 -100877 -162097 -164634 -145231
24692 -145231 -184519 -196156 -186470 40131 162125 111979 21309 -49026 -59224 -47261 45967
24681 45967 11044 24506 -73272 -119212 -87575 80271 84769 -78230 -85078 -41418 -4291 52156
24669 52156 157549 114365 67199 67245 -34370 61342 247829 265092 295482 274634 218938 35852
24657 35852 50472 137244 207386 49195 102220 63558 41575 108256 135197 137941 26626
24646B6626m5559J9667p2188n4729K17227P7805j96228r160J1338j09367N2182
24635h2386J65541o5500q8802n9225o6879p8149M6066M7041J43517r9851k12532
24624c51159Q9841K8396Q9879Q9546m7512q2915k9983k8206L2055q94n6339l6309
24612c03600j055P1626J26583K08216P9444j64573M1351M2875m7075K8976Q2753
24601A65521O8397o281k39299p2773R9573r5452J43454J42957j5506j24102r1089
24590b4600o0092q2425o5706K1032J70657J87611Q1003m0729k12191M7262K34021
24579B55843j64681q7541n431k28889j09217J74315K06756m3977l2071J11867
24569G6974Q0146r8866q442n2719k883j17939N3681Q1312P0600j62419j8458K2541
$$ plain form
24646 26626 -18933 734 -71454 -126183 91044 168849 -27379 -36539 -25201 -134568 -82386
24635 -82386 83155 17655 -71147 -130372 -197251 -275400 -229334 -182293 -38776 -138627 -351159
24624 -351159 -261318 -232922 -143043 -53497 -101009 -183924 -213907 -242113 -210058 -210952 -267291 -303600
24612 -303600 -304655 -233029 -106446 101770 181214 16641 57992 100867 53792 82768 165521
24601 165521 233918 227637 -11662 -84435 15138 -80314 63140 206097 190591 66489 -24600
24590 -24600 -84692 -167117 -232823 -211791 -41134 146477 227480 186751 -25440 21822 255843
24579 255843 91162 3621 -1810 -230699 -339916 -165601 41155 -2822 -34893 76974
24569 76974 157120 58254 49812 -2907 -5790 -123729 -70048 11264 81864 -80555 -99013 -76472
24557g6472l3183q7096J05259N7512j25534r9013N394K33738k7309J69307J3680
24546A36283k6775j56063j39737M9236K16519J44911j63026j80079k9621N1986
24536i6366j03289j14520J35367J09518l392O0072k2173k14671j19218j1241J62343
24525b17570J89460R864L8167L6999p3980m0015r5546N6583L4798K5380m2893
24514g8753J02979o2723o2246o2419n4341K20901K53145j84312j15466l2789P8152
24503B128k80281k9718N7094K8824J35670J91350K3780j975j06405l4663m4133
24492e8329J04583Q0369L9098j35674n9303m6707j52247J12234P3808j5489M4295
24481a3362q3097j1210l1232j06068j19069l3696O4000m5349j4160N3776L3221
$$ plain form
24557 -76472 -109655 -196751 -91492 -33980 -159514 -258527 -253133 -19395 -46704 122603 136283
24546 136283 109508 -46555 -186292 -137056 79463 224374 61348 -118731 -148352 -96366
24536 -96366 -199655 -314175 -178808 -69290 -72682 -12610 -34783 -249454 -368672 -379913 -217570
24525 -217570 -28110 -18246 19921 56920 -17060 -57075 -152621 -96038 -61240 -35860 -78753
24514 -78753 24226 -38497 -100743 -163162 -217503 3398 256543 72231 -43235 -76024 2128
24503 2128 -278153 -307871 -250777 -221953 -86283 105067 128847 126872 20467 -14196 -58329
24492 -58329 46254 126623 165721 30047 -29256 -75963 -228210 -115976 -42168 -57657 -13362
24481 -13362 -96459 -107669 -138901 -244969 -364038 -397734 -333734 -379083 -393243 -339467 -306246
24470c06246O656J8907J31050R7430O362K9753J12398J63353j71219l3078r9274
24459d3908j33543J46169M2200o1852N8183j2181J9100o7395o1682O6105L2517
24448a6287N7864q3026O3536K2970L012l1651j16005J21421P0208k12700o0361
24437a81019Q4646Q2174l2766j25211J32853j7789j92488m1268J41113n6967J44662
24426f2060J9268J1219j9153Q5015l0595q5680j23099P0512Q3642K03464l1722
24415A20811k12395n3769k8831M9192N6011n1369q9122q4818K2478L4777R9077
24404a37958K69265J09215r0558Q290j32496k50953J5003K09895J44207K4519
24394A68429j41818o0546K7685M7537r5077n9206L7109R9874j3037j01682m8472
$$ plain form
24470 -306246 -299590 -280683 -149633 -52203 -45841 -16088 96310 259663 88444 55366 -43908
24459 -43908 -177451 -31282 10918 -50934 7249 -4932 14168 -53227 -114909 -48804 -16287
24448 -16287 41577 -41449 22087 45057 48069 16418 -99587 21834 92042 -120658 -181019
24437 -181019 -96373 -14199 -46965 -172176 -39323 -57112 -249600 -290868 -149755 -206722 -62060
24426 -62060 -42792 -31573 -50726 34289 3694 -81986 -205085 -134573 -50931 152533 120811
24415 120811 -91584 -145353 -174184 -124992 -68981 -120350 -209472 -294290 -271812 -237035 -137958
24404 -137958 131307 240522 149964 158254 25758 -225195 -210192 -297 143910 168429
24394 168429 26611 -33935 -6250 41287 -53790 -112996 -75887 23987 10950 -90732 -139204
24383a39204J21346J19938m0598J11311j46607l58q8520J01759N0873R325Q116
24372A07381O7664P7541p4466k3209j06429n2478L5312N1298q6276k74238J02821
24361a75079J90390Q3664k01169N0723J62380J03138m3001j19601L1549k9687
24351E3307p1282J39155l4685j00917j4676Q8132p4380j8893K0086q6401j37853
24340b38407m6417J96481L2767P319P4669k4388L1075j1575j42292j1928o356
24329a39052q7484o6822n4720l1341L9109Q32R617N1432Q3872m9667q2857J24616
24317b02465J62509J7086L0946k0158L5927o7506p8617j02288p844M3557J23071
24306f5782Q3858J2318j57548K5033n7265R4819J03460R8438j5165M4224o43j1481
$$ plain form
24383 -139204 -17858 102080 61482 172793 26186 25828 -62692 39067 89940 99265 107381
24372 107381 175045 252586 178120 154911 48482 -3996 31316 82614 -3662 -277900 -175079
24361 -175079 15311 98975 -102194 -51471 110909 214047 171046 51445 82994 53307
24351 53307 -17975 121180 86495 -14422 -29098 59034 -15346 -34239 -14153 -100554 -238407
24340 -238407 -284824 -88343 -55576 -48257 26412 2024 33099 21524 -120768 -132696 -139052
24329 -139052 -226536 -293358 -348078 -379419 -340310 -339478 -329861 -278429 -194557 -244224 -327081 -202465
24317 -202465 -39956 -22870 8076 -12082 23845 -43661 -122278 -224566 -232410 -188853 -65782
24306 -65782 18076 30394 -127154 -102121 -159386 -64567 38893 137331 122166 166390 165747 154266
24294A54266j12676j21923n9799P779N7529P0051k9947l5509L6771L9441j0104
24283d121l0797O4467J64840k3526j31412p9581O3882n7056n3255j4950n3461
24272a54970N8657J29658j9845Q732Q8184j35776j84090q5710J00466K15194O7348
24261H7848L2768j53993m4973l2395m9856K1938P0851j5636n3573j05961N1717
24250a91265J34512N9213j15627O5653r7349j61789N8167K80947N406j79143n6233
24239a97508N8210J5749o3894j19727J43573L6822n4301j39J67383O1861q4477
24228c6448k9041O1178k7038o3784n1260J2023N9056K13283M0259n1373r7566
24217B9289r3029J32030O5209n6230j0220L8295j18436l1579N6974M1706O8734
$$ plain form
24294 154266 41590 -80333 -140132 -132353 -74824 -4773 -34720 -70229 -33458 5983 -4121
24283 -4121 -34918 29549 194389 170863 39451 -40130 23752 -33304 -86559 -101509 -154970
24272 -154970 -96313 33345 13500 22232 110416 -25360 -209450 -295160 -194694 20500 87848
24261 87848 120616 -33377 -78350 -110745 -160601 -138663 -67812 -83448 -137021 -242982 -191265
24250 -191265 -56753 2460 -113167 -47514 -144863 -306652 -248485 32462 37868 -141275 -197508
24239 -197508 -139298 -123549 -187443 -307170 -163597 -126775 -181076 -181215 -13832 48029 -36448
24228 -36448 -65489 -4311 -31349 -95133 -146393 -134370 -75314 137969 178228 126855 29289
24217 29289 -63740 68290 133499 77269 67049 105344 -13092 -44671 12303 54009 122743
24206A22743r4827r8207l3696q321R3486j6786j2183q894J30667N7941k8980M6794
24194A49737J6955P8965n3553p0288j00754J41873O6367k32352k8707k5838j6301
24183g3896N5534q9961l5122j7543k9729J09371K61674k447K7645j5485k16433
24172b6392n6309Q0465P6648K3220m4213Q3049R7191J2123j01170j99646o6604
24161a21638O2754Q4255j02842l9503j62163K1499M021q3453J24356K24946J06862
24150A19094R237L3558o2615j11664O0223J17244j6537l7206L3682P7601o5607
24139A57010j17204j33738J5052R6814K3841J40471j55451j31730L2070j3469
24129h6334N9247l6513p7355P4088O7276O2947J16067j85505j49602j32883J40569
$$ plain form
24206 122743 27916 -70291 -103987 -112308 -18822 -35608 -47791 -56685 73982 131923 102943 149737
24194 149737 166692 245657 192104 121816 21062 162935 229302 -3050 -31757 -57595 -73896
24183 -73896 -18362 -108323 -143445 -160988 -190717 -81346 180328 177881 205526 190041 -26392
24172 -26392 -82701 -2236 74412 97632 53419 136468 233659 245782 144612 -55034 -121638
24161 -121638 -58884 25371 -77471 -116974 -279137 -257638 -253617 -337070 -212714 12232 119094
24150 119094 128331 161889 99274 -12390 47833 165077 148540 111334 145016 222617 157010
24139 157010 39806 -93932 -78880 17934 41775 182246 26795 -104935 -72865 -86334
24129 -86334 -27087 -63600 -140955 -66867 409 63356 179423 -6082 -155684 -288567 -147998
24118a47998J96463l290m2440p7916J91963m5113p8954j4964k9403J4459K101
24107c5092N6751l7918L0197O8834l0949j20950j6668l5878K7731J26713R3016
24096A25787j34650j23655n8719Q7009P1289m32p884r5852J7651o1568j21826
24085c02850P2577n898p7497M0366L2594P3792N3489j25471p5853J13504k625
24074b03872J24194L3811n4879R0378k8541L6366N255L3549O4309k3557m3742
24063C3271k214j6714r1034K1275J49080j9170j41770j05811j8099J51643M1232
24052A689p8933r2064K1038j14081J22339J03655R1957L4218m0992k0335J1415
24041C9906n2064k5782j01489K4484j50508j11256J9650L7228N8783N6784J66556
$$ plain form
24118 -147998 48465 45175 2735 -75181 116782 71669 -7285 -22249 -51652 -37193 -35092
24107 -35092 21659 -16259 13938 82772 51823 -69127 -85795 -121673 -93942 32771 125787
24096 125787 -8863 -132518 -191237 -104228 -32939 -33371 -41255 -137107 -119456 -181024 -302850
24085 -302850 -230273 -236171 -313668 -273302 -240708 -166916 -113427 -238898 -314751 -201247 -203872
24074 -203872 -79678 -45867 -100746 -10368 -38909 -2543 2712 36261 100570 77013 33271
24063 33271 31057 14343 -76691 -55416 93664 74494 -67276 -173087 -191186 -39543 1689
24052 1689 -77244 -169308 -148270 -262351 -140012 -36357 55600 89818 48826 28491 39906
24041 39906 -12158 -37940 -139429 -114945 -265453 -376709 -357059 -319831 -261048 -204264 -37708
24030c7708J522j20364K6592J87339P9027k11748l9503N6709J68288J88013O1949
24019C60116k21457k46115j7892q688m5723P6833M9088N5995J8747j9678L235
24008D461J04264r4944j14885L6214O2640l1528K8166o676Q452j49554j68632
23997c22022J9057J65584J07319j3167N8664N9000q4949K5805M0505O7671q7438
23986C6029J81521j3787p3714m9678l3543J35233O3490O9050J25906L3191j75717
23975B97981n4620j02162l0437j1351r1353q8101j87514N9920J39075K5903N4780
23964A2121J16037M1252q6121j66806p9707M4384R3872J16670M8989p8218l3827
23953B8646K8454p0812o9298L2491p526R5895J36496j031Q5J04225j03036k90112
$$ plain form
24030 -37708 -36186 -156550 -129958 57381 136408 -75340 -114843 -58134 110154 298167 360116
24019 360116 138659 -107456 -125348 -134036 -179759 -102926 -53838 2157 20904 1226 4461
24008 4461 108725 13781 -101104 -64890 -2250 -33778 -5612 -12288 -3836 -153390 -322022
23997 -322022 -302965 -137381 -30062 -43229 15435 74435 -10514 15291 55796 123467 36029
23986 36029 217550 203763 130049 80371 46828 182061 245551 314601 440507 473698 297981
23975 297981 243361 141199 110762 99411 8058 -80043 -267557 -207637 -68562 -42659 12121
23964 12121 128158 169410 83289 -83517 -163224 -118840 -24968 91702 140691 62473 28646
23953 28646 57100 -13712 -83010 -50519 -58045 37850 174346 173315 173400 277625 174589 -115523
23941a15523R2053J24505P7621p2616K8076j73793r2738R2053K1642l4017r6893
23930a49630r0741L0146j968Q7666J37161j29210J00152O3626r7667N4033J02170
23919A05738K8594r2553m2944N4519K8044Q6801J769j5654j3334j74821k03972
23908b37813K65043J93052r5534j07607o0900l5111P407j1004K42266J2244j75323
23897c280k5646J4650j3048j2898l209J9356q2884J1463M4309K1352N9218n896
23885B3487j03773j10623n1693n7946J36087Q3718q7185o9576O1238L7540L0170
23874a08556M0935o5183L050J5497M453Q6246J79886J49889q0468j02713p1808
23863E1228j8122o5769P8001J05562j0546j37209k6046L3251q2013J2402J10010
$$ plain form
23941 -115523 -23470 101035 178656 106040 134116 -39677 -132415 -40362 -18720 -52737 -149630
23930 -149630 -240371 -210225 -212193 -124527 12634 -116576 -16424 47202 -50465 3568 105738
23919 105738 134332 41779 -1165 53354 81398 168199 169968 154314 140980 -33841 -237813
23908 -237813 27230 220282 124748 17141 -43759 -78870 -71463 -82467 159799 172043 -3280
23897 -3280 -28926 -14276 -27324 -40222 -43431 -24075 -106959 -95496 -51187 -29835 29383 23487
23885 23487 -80286 -190909 -242602 -300548 -164461 -80743 -167928 -237504 -176266 -138726 -108556
23874 -108556 -67621 -132804 -129754 -114257 -109804 -23558 156328 306217 225749 123036 51228
23863 51228 33106 -32663 45338 150900 140354 3145 -22901 10350 -71663 -59261 50749
23852E0749K834L415r8201K5510P0258P0573L0542p2814j07811Q4639Q8100Q449
23840A56243J46087M2321l7340j69122j28990j49399L9785J23184o7661N929J8890
23829b0073n9693K4314M2512K25424j67104k3003l1474M6719J5475k7994j63903
23818a38800q8621k6622Q6838J07541m2237q5961J8465Q8707P6990j55543K1269
23807a37974M6241L7749k8830M841J06211q503p4355J07156J19478p6934j39467
23796d4387O151k657n1113k1123P3836K7667n6149P218P1980O937O311J09805
23784A34476k4303m544o7125j65509l7673Q38o6961j8033K4175p447p2173P9855
23772b24424Q8878n3740j41664q66N1626J67729m4352l5247N333j45573p1779
$$ plain form
23852 50749 53583 56998 -41203 -15693 54565 125138 155680 82866 -24945 59694 147794 156243
23840 156243 302330 344651 307311 138189 9199 -140200 -100415 22769 -44892 -38963 -20073
23829 -20073 -79766 -55452 -12940 212484 45380 22377 -9097 37622 53097 25103 -138800
23818 -138800 -227421 -254043 -167205 -59664 -101901 -187862 -169397 -80690 -3700 -159243 -137974
23807 -137974 -91733 -53984 -82814 -77973 28238 19735 -54620 52536 172014 95080 -44387
23796 -44387 -38236 -40893 -92006 -113129 -39293 -11626 -67775 -60557 11423 18360 24671 134476
23784 134476 110173 105629 38504 -127005 -164678 -163840 -230801 -248834 -224659 -232106 -304279 -224424
23772 -224424 -135546 -189286 -330950 -331816 -280190 -112461 -156813 -192060 -186727 -332300 -404079
23761d04079K00153K03190l0417m5367N347o6986k4758Q3330J67983j91741k20175
23750c23520N0696J5475o5937J40282L5226L2689M4541M289j41751j7422K9446
23739a95986R2488N0789r1569l2220L1104J13814J09148m7268k0251j34595m176
23728a28722o6920j10406n0964J57030Q7495R6558J47088J0234j24602k22362
23718b05571K5169M2206J87137j127K0236M9009o6873o2851L331J36543J10420
23707B37629j14192R6853r637j37827L795l6234j8900K2596j40815j66040K5353
23696b37419P3652p2251Q8762M3158J21043J85307J8254j44585r7070K0891L619
23685C361j60039L6960q040L7004J13716J25101J16544j10801n1614o541q6657
$$ plain form
23761 -404079 -203926 -736 -31153 -76520 -71173 -138159 -162917 -79587 88396 -103345 -323520
23750 -323520 -272824 -257349 -323286 -183004 -147778 -115089 -70548 -66259 -208010 -225432 -195986
23739 -195986 -103498 -52709 -144278 -176498 -145394 -31580 77568 30300 10049 -124546 -128722
23728 -128722 -195642 -306048 -357012 -199982 -112487 -15929 131159 141393 16791 -205571
23718 -205571 -180402 -138196 48941 47814 68050 117059 50186 -12665 -9334 127209 237629
23707 237629 123437 220290 210653 72826 76621 40387 21487 44083 -96732 -262772 -237419
23696 -237419 -163767 -236018 -147256 -104098 16945 202252 220506 75921 -21149 -258 3361
23685 3361 -156678 -119718 -127758 -90754 22962 148063 264607 153806 102192 95651 8994
23674H994N795J11235P1909k572P309N7378j04917j90888k63096Q6714J14881
23663i7258L1177k2630J1988Q7301K6311J6979l9745M6808n2682r0435q0459M7448
23651a15197K29488O6081j00968m3007R7441n3988l2330R3469p4383q5423k7002
23640d5819J16100K495K4540l2824l5930l2842j5678L843Q8754l7400J9665j45579
23628i0675k01964K7152L2558J63566J60925P3170j7574j09513j14995J1789O9993
23617D432J68732p5092j92100Q723N8019J88842r5472o2221m119j48940p3931
23606b23127K14393K0653L1504N1741q6662k16407n9958R4042J07729q1764o5319
23595b13175J31506J26137L2828n6521J4521L360K1037N6919R1706J31153k4310
$$ plain form
23674 8994 14789 126024 197933 195361 202670 260048 155131 -35757 -298853 -212139 -97258
23663 -97258 -66081 -88711 -76723 10578 36889 53868 14123 60931 8249 -82186 -162645 -115197
23651 -115197 114291 180372 79404 36397 133838 79850 47520 140989 66606 -18817 -45819
23640 -45819 70281 72776 97316 64492 28562 -4280 -19958 -16115 72639 35239 54904 -90675
23628 -90675 -292639 -265487 -232929 -69363 91562 164732 147158 37645 -77350 -65561 4432
23617 4432 173164 98072 -94028 -85305 -27286 161556 66084 3863 -256 -149196 -223127
23606 -223127 -8734 11919 43423 95164 8502 -207905 -267863 -173821 -66092 -147856 -213175
23595 -213175 -81669 44468 77296 20775 35296 38656 59693 116612 208318 339471 315161
23584C15161p3853n4731n7075J4509J0465r7432j01206R709n0558R2665J67422
23573A75076J2960j35j67109o1581l2717j6594q3245j17870p081P0599J14246
23562a13451J30429J34819Q9384o3018j7019j32520k0895j11153k2840k4652K1796
23551a29120J17983m0924J1278j51373J04321K7294J1448l5804j19801J44007
23541f0691M7029l6801m005l3310N4857J29252J37864m4577m5461j65073p1106
23530i2022k5759R1121J15379j03140M1583n8746p4736q9094K0830k8406J07828
23519i5162M0608j09207L9915Q7539r7320m7721j8670J07747J69797J04013k9320
23508A52219j50235j07542M2009q8455j6287j15021R605Q4211n0916Q1494q3364
$$ plain form
23584 315161 241308 186577 129502 144011 154476 57044 -44162 -34453 -85011 7654 175076
23573 175076 188036 187901 20792 -40789 -73506 -90100 -173345 -291215 -298296 -227697 -113451
23562 -113451 16978 151797 241181 178163 161144 28624 7729 -103424 -126264 -150916 -129120
23551 -129120 -11137 -52061 -40783 -192156 -87835 -60541 -49093 -84897 -204698 -60691
23541 -60691 -13662 -50463 -54468 -87778 -32921 96331 234195 189618 144157 -20916 -92022
23530 -92022 -117781 -26660 88719 -14421 27162 -31584 -106320 -195414 -174584 -202990 -95162
23519 -95162 -54554 -163761 -123846 -36307 -133627 -181348 -200018 -92271 77526 181539 152219
23508 152219 1984 -105558 -63549 -152004 -168291 -283312 -273707 -189496 -240412 -158918 -242282
23497b42282m230J70989J53045Q2560n3512j43937k11360q9102Q1591J04984o5333
23486b16587j06776M0911M1575P0812J24528l1837j2967k1610p0476p6397M8129
23475b10695N3752p1107K10867J51302J2439r5695j55629j8107J5381m8942J38649
23464a7785M6398r3025j05353L8166j45162p8098R5341J94526J89888p895k2462
23453I4539Q8388j5591j62338j15525r5603r2332J45885L7662k6292P3230J03040
23442C5063O0518q9451j58297M8837k7139J21418J5818r637j641q5910Q0227p0215
23430h0409l8941q2394P533Q5565j3674L5013l9428r7398M6675q0257Q872R284
23418b39559M9389J86332k0841k44216M108J36830k3333J08470P6211q140j08557
$$ plain form
23497 -242282 -246512 -75523 77522 160082 106570 -37367 -248727 -337829 -256238 -151254 -216587
23486 -216587 -323363 -282452 -240877 -170065 -45537 -77374 -90341 -111951 -182427 -258824 -210695
23475 -210695 -156943 -228050 -17183 134119 146558 50863 -104766 -122873 -107492 -156434 -17785
23464 -17785 28613 -64412 -169765 -131599 -276761 -354859 -259518 -64992 124896 117001 94539
23453 94539 182927 167336 4998 -110527 -206130 -298462 -152577 -114915 -141207 -67977 35063
23442 35063 95581 6130 -152167 -103330 -130469 -9051 6767 -2870 -4511 -90421 -10194 -80409
23430 -80409 -119350 -201744 -194211 -108646 -122320 -87307 -126735 -224133 -177458 -257715 -248843 -239559
23418 -239559 -190170 -3838 -24679 -268895 -264787 -127957 -151290 -42820 33391 25251 -83306
23407h3306J0820M3341L5940r286J45258N5279j02398j21022j27983o7402O8160
23396a52599q897o1323Q1510J37053O1253p657p3199J1279L5329j5778K8396n1157
23384a5790m9921L883M6899J7249q9468P3219Q3519j7154O181P9419Q0880p4869
23372A44047r8380K1435K0676j9348j9832n2046j17639k8418M4895K6228l7939
23361a16321m2074J72336L6070q0827J9734K7790J6340L1023n6704O4410l2819
23350C8958m7961k4086J4531m2237J2135j3973N7423j15394k21272L4512O0467
23339b46897j8086R5287J48416l5566j93519o5816J69267J82875J02665o7586
23329G1040p1801n3965N280K3144P580M8561L1453J7823p5816o2097o8581r8907
$$ plain form
23407 -83306 -72486 -29145 6795 -2491 142767 198046 95648 -25374 -153357 -220759 -152599
23396 -152599 -161496 -222819 -141309 -4256 56997 49340 -23859 -12580 22749 6971 35367 -15790
23384 -15790 -65711 -61828 -14929 2320 -87148 -13929 69590 52436 58617 138036 218916 144047
23372 144047 45667 67102 87778 68430 48598 -3448 -121087 -149505 -104610 -78382 -116321
23361 -116321 -158395 13941 50011 -30816 -11082 16708 33048 64071 7367 71777 38958
23350 38958 -9003 -33089 -18558 -60795 -48660 -62633 -5210 -120604 -341876 -307364 -246897
23339 -246897 -264983 -169696 -21280 -56846 -250365 -316181 -146914 35961 138626 71040
23329 71040 -761 -54726 -49446 -26302 -18722 29839 61292 79115 3299 -58798 -127379 -226286
23317b26286K6119k3276P6661R1270l832m8822j8745N4538p8475Q9262O0678l1379
23305c2287j10155P7426K23284j8025m0269P2390j04720j90790m8257M907J3569
23294a52927J33768J18347J9623j6250p4959j54006K93K21822J0227j37433q7579
23283a19074j03471M189R1433K67096J11299r1155J5021J55585N1457r7986j9395
23272B64999k31797l0504J3595m8053p1254j9380J27156J73394L037j8139O9330
23261B32384j63122j08447q444q6756l9938j01967m2413M5368O9491N1962m1156
23250a93038L1245N4660P5173q543j31296J7360J51438N6734j7358J8718n266
23239D9827k3975n3734P0519m8570p3204j0726l5841p4834J33813J41588k7940
$$ plain form
23317 -226286 -200167 -223443 -146782 -55512 -59344 -108166 -126911 -72373 -150848 -61586 -908 -32287
23305 -32287 -142442 -65016 158268 140243 99974 172364 67644 -123146 -171403 -166496 -152927
23294 -152927 -19159 99188 118811 102561 27602 -126404 -126111 95711 105938 -31495 -119074
23283 -119074 -222545 -218356 -126923 140173 251472 160317 175338 330923 382380 284394 264999
23272 264999 33202 2698 16293 -31760 -103014 -122394 4762 178156 181193 163054 232384
23261 232384 69262 -39185 -47629 -134385 -174323 -276290 -318703 -273335 -203844 -151882 -193038
23250 -193038 -161793 -107133 -31960 -40503 -171799 -154439 -3001 53733 36375 55093 49827
23239 49827 25852 -27882 42637 -5933 -79137 -89863 -125704 -200538 -66725 74863 46923
23228D6923L041j06369p1366M730q5926J9319K9652j08088L2097K2952K4704j01893
23216b90224Q4231J47026J14713Q2989J8894q8039j99254R6373N4651r5424j138
23205g5202n0819R011J16071m0603l846K07906m2819o2895p9917J9042o4237j604
23193f9912Q0331o8391r5185o2154n0609K921n2219M7270J81334J36796L7603
23182H7785k6009j14522j3512Q9067j42421N7074O8003O2716L959p8951j68651
23171a75462O3681L3381k88217N2656J72507l4151p7720Q1893M5115N0448N6403
23160a9466M0376J01747j1704n2331N2696n6823K0213p1175j39731n0251P1098
23149a15351P5264L2081Q515j4177k3823o8168k9115o1132Q0973O5083o4196r8241
$$ plain form
23228 46923 49964 -56405 -127771 -123041 -208967 -189648 -159996 -268084 -235987 -213035 -188331 -290224
23216 -290224 -205993 -58967 55746 138735 157629 69590 -129664 -33291 21360 -74064 -75202
23205 -75202 -126021 -117010 -939 -41542 -45388 162518 119699 56804 -23113 -4071 -68308 -69912
23193 -69912 10419 -57972 -153157 -215311 -265920 -262999 -315218 -267948 -86614 50182 87785
23182 87785 61776 -52746 -66258 22809 -119612 -62538 5465 68181 72140 -6811 -175462
23171 -175462 -111781 -78400 -366617 -313961 -141454 -175605 -253325 -171432 -126317 -75869 -19466
23160 -19466 20910 122657 110953 58622 111318 54495 74708 3533 -136198 -186449 -115351
23149 -115351 -40087 -8006 509 -13668 -37491 -105659 -134774 -195906 -114933 -49850 -114046 -212287
23137b12287J01218K2431j03420n0597j02236p21K30811J10939j54190j01548
23127b59600J12882l5822P0766M0950k5674k1719J0463J1009J10436J16472m4173
23116H5990k01492K1229R5330N6068N352L483q2050q4869J06809k8480j1240J17547
23104H3677J00877l9059j58896k8079N0937k8162k3313r1814P1299M7218r1481
23093a06796j00500k2469j32349o8331J66683P8001R4479J33564N941l9114m4741
23082c5632J31239L4969Q940p2544k27554L6212P6933k5181J45843M4275k1455
23071I6045J8803j39614j67325J18333J74237j1693J10489o0710k13306n6275
23061a31016Q3777J39241q6416j8462K2241k4994m0472P0388R2716J50587j01146
$$ plain form
23137 -212287 -111069 -88638 -192058 -242655 -344891 -345612 -114801 -3862 -158052 -259600
23127 -259600 -146718 -182540 -111774 -70824 -96498 -118217 -107754 -96745 13691 130163 85990
23116 85990 -115502 -94273 1057 57125 62477 65960 -16090 -100959 5850 -22630 -33870 83677
23104 83677 184554 145495 -13401 -41480 9457 -18705 -42018 -133832 -62533 -15315 -106796
23093 -106796 -207296 -229765 -362114 -430445 -263762 -185761 -91282 42282 48223 9109 -35632
23082 -35632 95607 130576 139516 66972 -160582 -124370 -47437 -72618 73225 117500 96045
23071 96045 114848 -24766 -192091 -73758 100479 88786 199275 138565 -74741 -131016
23061 -131016 -47239 92002 5586 -12876 9365 -15629 -56101 14287 107003 257590 156444
23050A56444R987K4624k07276P0313P9756j16984k12597L4954J09959M4944n3193
23039e9069P2157K9667j998J16822K6947r6159q840j7683N0690j41090j68068
23028a96624J8339M7626J29Q8994O3923m5944J7040p9158j03759j91423j48305
23017e29162M7693N0950K08545J09745p7094k3995J40302O5818q7156k5809N1795
23006f8368q7994j9483M2139r5993O2756r1454K8632P8519m8470K8013K48800
22995G7097J39551j13018J56J6329j65089l3046J09375k8235k7464N7602o4807
22984c1549J8666J913J68085J30617l6463r5502j4618j05242j47042J17460J01699
22973A08024p8075K5432J6295j43668L6285R4420K7320j47899Q971j04122p4532
$$ plain form
23050 156444 166431 191055 -16221 54092 133848 16864 -195733 -160779 -50820 -5876 -59069
23039 -59069 13088 42755 40757 157579 184526 88367 79527 61844 112534 -28556 -196624
23028 -196624 -178285 -130659 -130530 -41536 22387 -23557 -6517 -85675 -189434 -380857 -529162
23017 -529162 -481469 -430519 -221974 -112229 -189323 -213318 -73016 -7198 -94354 -120163 -68368
23006 -68368 -156362 -175845 -133706 -229699 -166943 -258397 -229765 -151246 -199716 -171703 77097
22995 77097 216648 103630 103786 120115 -44974 -78020 31355 3120 -24344 33258 -31549
22984 -31549 -12883 -10970 157115 287732 251269 155767 141149 35907 -111135 6325 108024
22973 108024 29949 55381 71676 -71992 -35707 58713 86033 -61866 -52895 -157017 -231549
22962b31549k3162J13653K5683N3499j16104J51630M1807j08100l1131R8519J0796
22951a4459L0485o7970j12167n067K5755Q733n2924R970J7471K0654L1729J10613
22939B823q033j41028j5301J93138R6584l9480k5055j05123p8886L4625n9215
22928a44951O840j9792K1645j12475J5717K33985J82863O8032j07248J6438k12562
22917e1508j77728l0935J04844M3694M9386k8654n8849L5271M0072j07704Q6549
22906i5562P0024o4514j24360L3559R8734O5473j323J1377p1229K2902O798r2957
22894a41078O8399N7544j02753j2496r702j9270o769Q8918J45527J19366r7316
22883I0370j14573p1651M6877n0980j35724k63M6819L9418J6118k8909q0712m6087
$$ plain form
22962 -231549 -254711 -141058 -115375 -61876 -177980 -26350 15457 -92643 -123774 -25255 -14459
22951 -14459 16026 -51944 -164111 -169178 -143423 -134690 -187614 -177644 -160173 -139519 -107790 2823
22939 2823 -5210 -146238 -161539 31599 128183 88703 63648 -41475 -120361 -85736 -144951
22928 -144951 -138111 -157903 -136258 -248733 -233016 969 183832 251864 144616 161054 -51508
22917 -51508 -229236 -260171 -155327 -111633 -62247 -90901 -149750 -114479 -74407 -182111 -95562
22906 -95562 -25538 -90052 -214412 -180853 -82119 -16646 -17969 -6592 -77821 -54919 -48121 -141078
22894 -141078 -72679 -15135 -117888 -130384 -140086 -159356 -166125 -77207 68320 187686 90370
22883 90370 -24203 -95854 -48977 -99957 -235681 -235944 -189125 -149707 -133589 -162498 -243210 -289297
22871b89297K4597J11377K4901K01496J68064o3610p9024n4682j82407K9P2714
22860f5842M2497o4266k6085K78600M4805j45945K0258J00639M2621n6314j10388
22849F0580j54145m2573n7891K5229R4277M3153K3456j9169Q0892K01449K4516
22838B79774k31816q8752R172R0046J36023J01247o5118j55770k045j67642k9056
22827a23937M6225L824N0064j32063n8069Q7357L750J5511J0385K2809k53j36973
22815b11370R172O1629J63848J45060R4068R889k3061p6345n1781o5472o7312
22804a1675j65566j4517J20046m3430l2824N4687O1432r9914l4058K47132J17395
22793A98708J8442N3289q7834j05619r1598k2557L6487O6398K6052j20180j05088
$$ plain form
22871 -289297 -264700 -153323 -128422 73074 241138 177528 98504 43822 -138585 -138556 -65842
22860 -65842 -23345 -87611 -113696 164904 209709 63764 84022 184661 227282 170968 60580
22849 60580 -93565 -136138 -194029 -168800 -74523 -31370 -7914 -27083 53809 255258 279774
22838 279774 47958 -40794 -31622 58424 194447 295694 230576 74806 72761 -94881 -123937
22827 -123937 -77712 -73888 -23824 -155887 -213956 -126599 -122849 -107338 -96953 -74144 -74397 -211370
22815 -211370 -202198 -140569 23279 168339 262407 272296 249235 172890 121109 55637 -11675
22804 -11675 -177241 -191758 -71712 -115142 -147966 -93279 -31847 -131761 -165819 81313 198708
22793 198708 217150 270439 182605 76986 -14612 -37169 -682 65716 91768 -28412 -133500
22782a33500R697n4928j8739R0602O9148j82167o1645J96410J32452L0724k1426
22771E6628Q3355o7993q2512k4719o5070J1344J12459j2863r1155K5468J13423
22760E8365k5219J2364P5334j5364K2633j22635q7502O6851J3902p8689J9331
22749f0629J17439k09416m2600k376j6131L3300O9610N3216o7433o1339k58o1717
22737b48334o6244K0312J60991K9330P3067K7609o4060O4883L7902o3964l5805
22726f4313j11758p6897J55297J47397J59801k1773O0837l4301l5149P171j34455
22715E1857j97890J50066J661j38542q0093M9034J529N4674o7899k5654R1865
22704a09392J38472j12384l815K9749J53045J9914j82903J22308K16393O793j21908
$$ plain form
22782 -133500 -123803 -178731 -197470 -106868 -37720 -219887 -281532 -85122 47330 78054 56628
22771 56628 139983 71990 -10522 -35241 -100311 -88967 23492 10629 -80526 -55058 58365
22760 58365 33146 45510 120844 105480 128113 5478 -82024 -15173 -1271 -79960 -60629
22749 -60629 56810 -152606 -195206 -197582 -213713 -180413 -110803 -57587 -125020 -186359 -186617 -248334
22737 -248334 -314578 -294266 -133275 -103945 -30878 -3269 -67329 -2446 35456 -28508 -64313
22726 -64313 -176071 -252968 -97671 49726 209527 187754 248591 214290 179141 186312 51857
22715 51857 -146033 4033 5694 -132848 -212941 -163907 -162378 -107704 -175603 -201257 -109392
22704 -109392 29080 -83304 -87119 -57370 95675 115589 -67314 54994 271387 278180 156272
22693A56272k31892n4882L7753k9919L3790n9008R8363K15112l370q4610k5522
22682E2087j48541Q107R2559K9965J07861q7529q7474q4710Q7617J12746l9404
22671D3284l0417q1264p6758K5032J07292l0853m9950m5079K9110O6102k34654
22660b78155Q4214N6987q9558n8514Q9025M871J07238J63682N6791j52791n313
22649b1523J29211l3982j92691r7196Q8145J08532R8698o0994L2935M9056Q9751
22638A89942L4812P6868p9045j05839p3481j37490j22423j43487o267J09186L8020
22627b19204p146p959J54106j7772M5227o2739q9340P5646M7590J1179O4115q970
22615a5267j06784j10714m8252n5957N412J47784J08371J26425Q1214j17942n8618
$$ plain form
22693 156272 -75620 -130502 -92749 -122668 -88878 -147886 -49523 165589 162219 77609 52087
22682 52087 -96454 -88347 4212 34177 142038 54509 -32965 -117675 -30058 82688 43284
22671 43284 12867 -68397 -145155 -120123 -12831 -43684 -93634 -138713 -109603 -43501 -278155
22660 -278155 -193941 -136954 -226512 -285026 -196001 -191130 -83892 79790 136581 -16210 -21523
22649 -21523 107688 73706 -118985 -216181 -128036 -19504 79194 18200 51135 100191 189942
22638 189942 224754 301622 222577 116738 43257 -94233 -216656 -360143 -366410 -257224 -219204
22627 -219204 -226350 -234309 -80203 -97975 -52748 -115487 -204827 -129181 -81591 -70412 -6297 -15267
22615 -15267 -122051 -232765 -281017 -336974 -331562 -183778 -75407 51018 132232 14290 -44328
22604d4328N8572o4261j37551m0139L2547k0270j14219q338N4627R4099o7921
22593b57182J15963J24231Q5965M3352L0287j62307j1421K5032n5291m2875L588
22582a00658k2030M4085M6475m6845r042n5006l6723Q2444N8885L4131K3690K475
22570B1881M7268L142r2407N3988m9492L1768M2230l9690N4929N6650p0609J19807
22558A79465L2547n6557n7896p6544p8539N8138J2241Q676q4644o0563K8106N6298
22546c9272n7089l0263p5103K3185J65528j1566M2116N1119j37319J5776J55189
22535A02301O0995n9301k6528M1163J01067j67543m6613l6856L2203o4682J08130
22524D4336K47292P4744k43162j04684l8534R2908j9181q8604O8784k3240O3777
$$ plain form
22604 -44328 14244 -50017 -187568 -227707 -195160 -215430 -329649 -337987 -283360 -189261 -257182
22593 -257182 -141219 -16988 68977 112329 142616 -19691 -31112 -6080 -61371 -104246 -100658
22582 -100658 -122688 -78603 -32128 -78973 -88015 -143021 -179744 -97300 -38415 -4284 19406 21881
22570 21881 69149 72291 -20116 33872 -15620 16148 58378 18688 73617 130267 59658 179465
22558 179465 212012 155455 97559 21015 -57524 614 12855 21531 -63113 -123676 -95570 -39272
22546 -39272 -96361 -126624 -201727 -178542 -13014 -24580 17536 68655 -68664 -52888 102301
22535 102301 163296 103995 77467 118630 219697 52154 5541 -31315 888 -63794 44336
22524 44336 291628 366372 123210 18526 -20008 72900 53719 -34885 33899 10659 74436
22513G4436r6904o1250J41401n2843m4688J4045R2727j5278r8040k5207L8523
22502c3078l2298K7319P4246P061o6003M7786n408J21152l4621L342m6672p5346
22490a2520J58361n539j05420j10613j70503l1654J24375J92131j2850M1648N4077
22479A21493j37586o3068J6739J06416Q0569N5178m06j51908j59454n4768k9858
22468b16653m2177R7043J24784J1662k6467n3817o0165J5336R8263p7791J7780
22457a12202J07995O6999J1619l8638K8400J2767p4425j52473o0334J40280K8235
22446d1777k29306N0601P8757O6612J02550n0441K9166k3001m3089p9866k8875
22435a68669J08063n8624p61J19354n1778J2993J14081J03647J4738o0869j2877
$$ plain form
22513 74436 -22468 -83718 57683 4840 -39848 -25803 66924 51646 -46394 -71601 -33078
22502 -33078 -65376 -38057 36189 43250 -22753 25033 19625 140777 106156 109498 62826 -12520
22490 -12520 145841 140302 34882 -75731 -246234 -277888 -153513 38618 25768 67416 121493
22479 121493 -16093 -79161 -62422 43994 124563 179741 179335 27427 -132027 -186795 -216653
22468 -216653 -258830 -161787 -37003 -25341 -51808 -105625 -165790 -150454 -52191 -129982 -112202
22457 -112202 -4207 62792 74411 35773 64173 76940 2515 -149958 -210292 -70012 -41777
22446 -41777 -271083 -220482 -141725 -75113 27437 -23004 6162 -16839 -59928 -139794 -168669
22435 -168669 -60606 -119230 -119991 -637 -52415 -39422 74659 178306 193044 132175 119298
22424A19298o9372j18018J02683R0278O2124q3191o0000p9047R27K721Q4428Q3709
22412A36540p5944j10504R1794L1125k3688J51365J5919j34671L0297J0046p4581
22401D7698K16850k9736n8148O9137P9296J029j51141j79416j59638J19760K6860
22390a7449K3437p4578R7066L3146j7202k0341R6571l1187J14622M2258j41987
22379A04356j64072k7440J11683O7375J07053j18463j43955p3779j83808j03265
22369d24315J67122K04832J00061J86892Q7266r9452n5643n2172M9986L5185J6096
22358B15858j69751Q260Q5065j01429r0333n7668m1518J22760J52168J61057p5210
22347B09259j24856j11214o6246J2610N0099L9213O0364j11623j23816k0453M4070
$$ plain form
22424 119298 49926 -68092 34591 124869 186993 103802 43802 -35245 -34318 -31597 52831 136540
22412 136540 60596 -49908 41886 73011 49323 200688 216607 81936 112233 122279 47698
22401 47698 264548 234812 176664 245801 325097 326126 174985 -4431 -164069 -44309 -17449
22390 -17449 5988 -68590 28476 61622 44420 24079 120650 89463 204085 246343 104356
22379 104356 -59716 -87156 24527 91902 198955 80492 -63463 -137242 -321050 -424315
22369 -424315 -257193 -52361 47700 234592 321858 222406 166763 114591 164577 199762 215858
22358 215858 46107 54367 139432 38003 -52330 -109998 -151516 -28756 123412 284469 209259
22347 209259 84403 -26811 -93057 -80447 -30348 8865 69229 -42394 -166210 -186663 -142593
22336a42593J10206L6633J666P6198j1404n8422p3688P5338J06725M569j06589
22325A8639o2600O958R2980j44454k3814R2226O3155L7394j2313p9086L736r9437
22313a06616l3700P2194N4474Q7124R2388q5607j66208L2586Q2684p1865m6472
22302h9018o0843P735r296k6693R1547O5793R945J883J02066N755r3298O19Q0939
22289H7134J23349m5152k2268q0109l8703q1338j33906j07524P6751J59133P782
22278e4851J41145n0820J4903k2784m4008n5891q9869R5799N8948O522j5361n8799
22266g5066q3302m0587J31629J53699J16630J19887r1059j3070j69138R4272M3410
22255A87305m6508k9684p2770r0698R0173R2548j09402o3899L0117M3399l6392
$$ plain form
22336 -142593 -32387 4246 5912 82110 70706 12284 -61404 13934 120659 125228 18639
22325 18639 -43961 -37003 55977 -88477 -112291 -20065 43090 80484 68171 -10915 -7179 -106616
22313 -106616 -140316 -68122 -13648 73476 165864 80257 -85951 -53365 29319 -42546 -89018
22302 -89018 -149861 -142126 -151422 -178115 -86568 -20775 -10830 -8947 93119 98874 5576 6195 87134
22289 87134 210483 165331 143063 62954 24251 -57087 -190993 -298517 -221766 -62633 -54851
22278 -54851 86294 35474 50377 27593 -16415 -72306 -162175 -66376 -7428 -906 -16267 -75066
22266 -75066 -158368 -198955 -67326 86373 203003 322890 231831 218761 49623 143895 187305
22255 187305 140797 111113 38343 -52355 37818 130366 20964 -42935 -12818 30581 -5811
22244e811P0943L281M0214N9861n0488j22361J9463o5634l52J44524r5888k34441
22232b36689n1178K39944Q2882L4172j35255L5716q5546N0759K7078j2077o734
22221e6928n3055m204J1316k9014J26082k6815j26078J47927Q0208N096M8801
22210A23336p6965m3124j0042k9839k6895O6261J6429p6616n7537L1215J2764
22199g1013j46468j74404J7812Q9331J7988j16090n7909M5801J23983L79j7083
22188b87673P0346M1533J22512j7086K7391k6589o5891J17524K0116n6848j08264
22177a62929m8823l5966M023k9317J08749O0657P1162J13984N9708k4680m6470
22166G0098q1506k748J0622q5721r5936p2936K8943M6357P7575J2108N3233J21011
$$ plain form
22244 -5811 65132 68413 108627 168488 118000 -4361 15102 -50532 -50884 93640 -2248 -236689
22232 -236689 -287867 -47923 34959 69131 -66124 -30408 -115954 -65195 -38117 -50194 -56928
22221 -56928 -109983 -114187 -102871 -131885 -5803 -32618 -158696 -10769 69439 74535 123336
22210 123336 46371 3247 -6795 -36634 -63529 2732 19161 -57455 -114992 -83777 -71013
22199 -71013 -217481 -391885 -374073 -284742 -266754 -382844 -440753 -394952 -270969 -270590 -287673
22188 -287673 -217327 -175794 -53282 -70368 -42977 -69566 -135457 -17933 2183 -54665 -162929
22177 -162929 -211752 -247718 -243695 -273012 -164263 -103606 -32444 81540 141248 116568 70098
22166 70098 -11408 -14156 -3534 -89255 -185191 -258127 -229184 -182827 -105252 -93144 -39911 81100
22154H1100j05651q4268N3004N8643j61901j38746P7253J05238Q4903j81211n3771
22143b65407J66126J46471J43590L3143q7956k1752j49920M278J27339p649K1559
22132A09822q483J22797M1428l8935K1467O8912p4004r4825j5828j80139j15360
22121a63148n8170J2950J22998J47952P8831l4008o911l7348O5287o4107k13821
22110a49495N9673J06624p3694k0882L4589J17514J8692J64121K609M2722j4731
22099B87742j66468j46041M5122o9316L2173J69151K01567J23198j89243k33443
22089E4442n6009M7295P714q3219m1158p424J88114J26061p8886j60347M101N5620
22077E6304j03278J32720j6070L9660o3484n0583J22115k800n2364M492o5814
$$ plain form
22154 81100 -24551 -108819 -55815 2828 -159073 -297819 -220566 -115328 -30425 -211636 -265407
22143 -265407 -99281 47190 190780 223923 135967 114215 -35705 -31427 95912 88263 109822
22132 109822 101339 224136 265564 226629 248096 317008 243004 148179 132351 -47788 -163148
22121 -163148 -221318 -208368 -85370 62582 141413 107405 100494 63146 128433 64326 -149495
22110 -149495 -89822 16802 -56892 -77774 -43185 74329 93021 257142 259751 302473 287742
22099 287742 121274 -24767 20355 -48961 -16788 152363 353930 477128 287885 54442
22089 54442 -1567 45728 53442 -29777 -70935 -78359 109755 235816 156930 -3417 684 56304
22077 56304 -46974 85746 69676 109336 45852 -4731 117384 114584 62220 66712 898
22066H98Q830Q2573p4361L4070J39174L1029j85815j10662j3905P6880J53128
22055A41839k3902j46396j17925K11233J27267j07106p431R5933J7252j46163
22045D4601r9153O8016N5713J013l3791M0737J84077K0845j66430L5249j06796
22034D4081L7643K4590R3056p6367r8571q9663k162P7061M1907M3472q837n6916
22022B9294l3806l2200K3392P6779j07244q6944P1785J01535K6569l8970o9806
22011c9616J5697M8957J00083k12083j57988J07374J32300J3048M6736j15267
22001f0759K4017L05687L0554j27167j53500K8757J9574n234n9713L449J5232
21990B0897j09209k2411J15643p412j8427q0725Q1039J08766L7198m6902j07338
$$ plain form
22066 898 9728 92301 17940 52010 191184 222213 36398 -74264 -88169 -11289 141839
22055 141839 117937 -28459 -146384 64849 192116 85010 77579 173512 190764 44601
22045 44601 -54552 13464 69177 70190 36399 77136 261213 282058 115628 150877 44081
22034 44081 81724 106314 199370 123003 24432 -65231 -67393 9668 51575 95047 86210 29294
22022 29294 -4512 -36712 -13320 63459 -43785 -130729 -58944 42591 69160 30190 -39616
22011 -39616 -23919 25038 125121 -86962 -244950 -137576 -5276 7772 54508 -60759
22001 -60759 -36742 268945 299499 172332 18832 47589 67163 61929 2216 5665 20897
21990 20897 -88312 -110723 4920 -2492 -20919 -101644 -20605 88161 125359 78457 -28881
21979b8881j424J08828O0175o1720j05124n9283K1806Q3461M9105M4763P6623
21968A88329j53480l1696j7890j40776L578p0054O646P0795J27541O5450K2288
21957G0731l8090J49523J25472k04543q9365r0971J35850J21058j50502m2692
21947a3529N992J4377K4032Q5650o0592m5754j36596m5234J36494K24527J62717
21936C52084r8265j67384p4293j4194l4337j8139r2757J02505L8918j9049J64602
21925A39691Q8992L581j70757j13936j31627o5111J8456J04915k6053M0231P260
21914a04358O239k4598Q0335R3434P0634J24592n5284J6273O3709m9295j28960
21903I2721q3243m0956k6471N7544J72902o4357N606L6748P9912P000n4158P395
$$ plain form
21979 -28881 -30305 78523 138698 76978 -28146 -87429 -65623 17838 66943 111706 188329
21968 188329 34849 3153 -14737 -155513 -151935 -221989 -215343 -144548 -17007 48443 70731
21957 70731 32641 182164 307636 103093 13728 -77243 58607 179665 29163 -13529
21947 -13529 -7537 6840 30872 116522 55930 10176 -126420 -171654 -35160 189367 352084
21936 352084 253819 86435 12142 -2052 -36389 -54528 -147285 -44780 -5862 -24911 139691
21925 139691 228683 232264 61507 -52429 -184056 -249167 -230711 -125796 -151849 -111618 -104358
21914 -104358 -98119 -122717 -42382 51052 121686 246278 190994 207267 270976 221681 92721
21903 92721 9478 -31478 -57949 -405 172497 108140 113746 150494 230406 237406 183248 190643
21891A90643P544j24670O6330j5630j56287r9155M8632L113J43692J18126P7155
21880B59493j8333n026j06670p1100O2223J05132q8891r6124p6928n8273l5326
21869a29823J28315J28680k8386L9251o2786m4025j871J47800L3498K8479N8699
21858B97831L9478J7637J8857o169r9238r1255k7926P7049O4019j6712n6384m6595
21846A70592P6022L8778n5787j34373P4666o145j04417o4369N6420j08070q9322
21835a46005J00517K84965J74412J0464j4771k9541k51057o4798L8656o9875r2959
21824e9992J38592j41898R9633J79497R6625J7289j17670N159j33084j15439p8022
21813a09310m6796O378O9790N6947N7526k8270M9237n0181Q2973p0006L7038J7706
$$ plain form
21891 190643 198187 73517 139847 124217 -32070 -131225 -82593 -79480 64212 182338 259493
21880 259493 241160 236134 129464 58364 120587 225719 136828 40704 -36224 -94497 -129823
21869 -129823 -1508 127172 98786 138037 75251 31226 29355 177155 210653 239132 297831
21858 297831 337309 354946 373803 367634 268396 177141 149215 226264 290283 273571 217187 170592
21846 170592 246614 285392 229605 95232 169898 163753 59336 -5033 51387 -56683 -146005
21835 -146005 -45488 239477 413889 424353 409582 380041 128984 64186 102842 32967 -59992
21824 -59992 78600 -63298 36335 215832 312457 329746 212076 217235 84151 -31288 -109310
21813 -109310 -156106 -149728 -79938 -22991 34535 6265 55502 5321 88294 18288 55326 73032
21801G3032r284k667J90551m8666j35459J03334J6818j26192J661J29698M5661
21790B38487j24411k9827j6835k4381j5765q5729q194J44990J40211M1035k06098
21779E3483j40236l790N0955K36518K69529l8245j97669o4326o1076Q9036J5504
21768B09683k9718J25362o8826k15966q2710p0256o490p997L9255j9749Q6769
21757d0643J38027k8871J124P9962M7438L3450m2806l8379J04502Q0415r9024
21746B35195J4262o4425L1927J06492p5815j77926j51207L2262J69887J56533
21736B77185L3290L9059j64263k41912j29119o3698J68539J30434K3803P4239
21726A47557P4901O1510O5709R4225l5459k07305m9009P8697k0754k8024J25825
$$ plain form
21801 73032 63748 61081 251632 202966 67507 170841 187659 61467 63128 192826 238487
21790 238487 114076 84249 67414 43033 27268 -58461 -66655 78335 218546 259581 53483
21779 53483 -86753 -90543 -39588 196930 466459 428214 230545 166219 105143 194179 209683
21768 209683 179965 305327 236501 20535 -62175 -132431 -138921 -146918 -107663 -127412 -40643
21757 -40643 97384 68513 69637 149599 197037 230487 187681 149302 253804 334219 235195
21746 235195 249457 185032 216959 323451 247636 69710 -81497 -49235 120652 277185
21736 277185 310475 349534 185271 -56641 -185760 -249458 -80919 49515 73318 147557
21726 147557 222458 283968 349677 443902 408443 201138 152129 230826 210072 182048 307873
21715C07873J1168p6348N9632j5670N5236J8896O199L5993r4144P2788L03330
21704F84953m722k3494J85401J70601K32626L11714O3755J19471K25679Q1059
21694B047043Q2633P6803m3817o944r5792O9548q3524P1490p4709j41137k11694
21683A689900k63916j66730j36215j53707n5003q2622j75059k47270l8439k901
21673C68038O6249q2377Q234M5919l6611j43951o0427L4575Q298k2436n4126k9212
21661A02173K11445J23853j63464l4367J44386p0052j58709j45045J6264k7341
21651h57J15472R2018M3126r594k10664M8880j01902J02008J96229L0691M794
21640C10201k7406r2838j57636m8137j06660M8060Q9470K9799N12O6752J49733
$$ plain form
21715 307873 319041 242693 302325 286655 341891 360787 366986 402979 308835 381623 684953
21704 684953 680231 656737 842138 1012739 1245365 1557079 1620834 1740305 1965984 2047043
21694 2047043 2129676 2206479 2162662 2155718 2059926 2129474 2045950 2117440 2042731 1901594 1689900
21683 1689900 1425984 1259254 1123039 969332 914329 831707 656648 409378 370939 368038
21673 368038 434287 351910 360144 406063 369452 225501 165074 199649 207947 185511 131385 102173
21661 102173 313618 437471 274007 239640 384026 313974 155265 10220 26484 -857
21651 -857 114615 206633 249759 240165 29501 78381 -23521 78487 274716 305407 310201
21640 310201 282795 189957 32321 -15816 -122476 -74416 15054 44853 45365 112117 261850
21629B61850j94243n6001N6092M6228J02964N5335j48876Q4630O3777J4119k107
21618B83768q1804k8511J4825N230r1241O9089k0564Q2351K0605P4841j57661
21607A70928q4006r0667O1476j32680j60086Q2468K00945j421n9938q4670Q8377
21596i274J00087p0210P4538L3190q9014J54156M7635p3835n7580J77752n3498
21585B33947j97715j04470P7564J18878k7969K9973J47803l4252k6285J85264
21575D02738p5936j03900j16134o2507P4825l447k4778K2955K5741j15641O806
21564C0722R5153p0566o5798J79978M8656K5510j40616n0201l5728J57671J82500
21553C57281J85843M4044k0605p0577q4532j99593Q456J0702r1486L7916k4741
$$ plain form
21629 261850 67607 11606 67698 113926 216890 272225 123349 207979 271756 285875 283768
21618 283768 201964 173453 188278 193508 102267 171356 150792 233143 253748 328589 170928
21607 170928 86922 -3745 57731 -74949 -235035 -152567 48378 46957 -12981 -97651 -9274
21596 -9274 90813 20603 95141 128331 39317 193473 241108 167273 109693 287445 233947
21585 233947 36232 -68238 9326 128204 100235 130208 278011 243759 217474 402738
21575 402738 326802 222902 106768 44261 119086 115639 90861 113816 139557 23916 30722
21564 30722 125875 55309 -10489 169489 218145 243655 103039 52838 17110 174781 357281
21553 357281 543124 587168 566563 495986 411454 211861 220317 231019 139533 177449 152708
21542A52708j3145N159J03159K2187r8144J32813Q0641r1994p8663r1869k6036
21531I6816r0525n4216r2976k4993N6423K0400R3733Q0214J27779k811Q2109J37562
21519D29515J54443n3955j33456m3429R2430n3843j5130j82570j36721N6482j6163
21508I7603P392N8217J09776j13528j5489j25813k08848R3593P5868J29629R8040
21497B06440K7262j35318L9319O2660N2858q8257J0492J05461m3541M005J14393
21486C55774O3697P3457o8584j2j07501j17232q2552k3596j41479R0689K8710
21475G1371n3310o6509L1638J10683r3262q769L6331R8608K5092J20398m3354
21464B28917q253M7861N3035R2249O2405j40412o2541r4587j3259Q5774j9780
$$ plain form
21542 152708 139563 144722 247881 270068 171924 304737 385378 293384 214721 122852 96816
21531 96816 6291 -47925 -140901 -165894 -109471 -89071 4662 84876 212655 209844 291953 429515
21519 429515 583958 530003 396547 353118 445548 391705 376575 194005 57284 113766 97603
21508 97603 104995 163212 272988 159460 143971 18158 -190690 -97097 -21229 108400 206440
21497 206440 233702 98384 137703 200363 253221 164964 175456 280917 237376 241381 355774
21486 355774 419471 492928 424344 424332 316831 199599 117047 93451 -48028 42661 71371
21475 71371 18061 -48448 -16810 93873 611 -8158 28173 126781 151873 272271 228917
21464 228917 220664 268525 321560 413809 476214 335802 273261 178674 165415 251189 231409
21453B31409M7612k778l3076r5821l9262J1381Q6115N9356M25N1024j08847j0201
21441A97337m645m4416J27512J05726l9823q4057j49651n1303M8232k008J53637
21430B56541J04517j92236K0541O4861j04304J5932K02887J73350n0544j52835
21420C38710j07503J18692m1812M2258k6637j18578K2444Q8706r1641j5540M3484
21409B52583R0732j0825r5439K5673L0824O5896k2862J4206l7283J0433j09485
21398B14453j5902Q8727R6103J7478j33116j48014j04428N2017P6267M8221j11676
21387H0130j0493J36366J67008l16q8856q6344J1021L9467q1333j56747p3232
21376f3329J41896J9505N6377J6498j88950j05938N2485J22926J05613J64788
$$ plain form
21453 231409 279021 276243 243167 147346 108084 119465 205580 264936 265361 316385 207538 197337
21441 197337 192692 148276 275788 381514 341691 257634 107983 56680 104912 102904 256541
21430 256541 361058 168822 189363 254224 149920 165852 368739 542089 491545 338710
21420 338710 231207 349899 308087 350345 323708 205130 227574 316280 224639 209099 252583
21409 252583 343315 332490 237051 262724 293548 359444 336582 350788 313505 323938 214453
21398 214453 198551 287278 383381 400859 267743 119729 15301 67318 143585 191806 80130
21387 80130 69637 206003 373011 372695 283839 197495 208516 247983 166650 9903 -63329
21376 -63329 78567 98072 154449 170947 -18003 -123941 -71456 51470 157083 321871
21366C21871Q799m1067p5747J12281J02591p4147m7114O6568o4527J2982Q6033
21355D08523m3085j41058P3Q8048P4458p5831j39194P4341P7257P4035P948k32225
21343A73290j04849o3538j7123n83J62044k3628K18537Q1074q8943j20327o5955
21332A49999K0626J30464k0116m6339P1601k1118J6572M9004P4432J15872r3014
21321D47983L0433j32l6470m5730p4711J12441l3741q0532J04089J26515K9879
21310E80024r0465Q2682J3759j16351j15409p9543J02853Q5563j16705k25162
21300A21246P7086J39292N7560j9461j7920j08998j7404Q9859N3661j3281K9678
21289C91318n1728J0961N0785K4502p4214P0716J21528k7318o4473k81412P1642
$$ plain form
21366 321871 330670 289603 213856 326137 428728 354581 307467 374035 309508 322490 408523
21355 408523 365438 224380 224453 312501 386959 311128 171934 246275 323532 397567 405515 173290
21343 173290 68441 4903 -12220 -12803 149241 125613 344150 425224 336281 215954 149999
21332 149999 170625 301089 280973 234634 306235 285117 301689 350693 425125 540997 447983
21321 447983 478416 478284 441814 396084 321373 433814 400073 319541 423630 550145 580024
21310 580024 489559 572241 586000 469649 354240 274697 377550 463113 346408 121246
21300 121246 198332 337624 395184 375723 357803 248805 231401 321260 374921 361640 391318
21289 391318 339590 350551 401336 425838 351624 422340 543868 516550 452077 170665 242307
21278B42307K21296J03023M3891m1624m4112L2473j29206K3132J15987k1762j66489
21267C78916O9267K5328j1822K5179k5801K9781J2528l3534j57070j06621N4459
21256B60610K24200J28550n4750j69533L9345L1666N2736Q2390M9983o3175N853
21245E87875k5709K5123R8505j18012j19619k9234j2639k1833q0237N2111j7785
21234C38546P3094m3856K8093m063j08065O5902k6780k0939O7448J17718r467
21223D77631j27119p6880K9085O6130M4617N1017j63436J1930l8616J288J31055
21212D06702J18547q7598j20037J05158J64780l6788L2432j04050P8546J03746
21202F61438J06558r5995j1824Q1311o8072j11267l9231j17090N7665N8457K3095
$$ plain form
21278 242307 463603 566626 610517 568893 524781 557254 428048 451180 567167 545405 378916
21267 378916 448183 473511 461689 486868 461067 490848 503376 469842 312772 206151 260610
21256 260610 484810 613360 558610 389077 428422 460088 512824 595214 645197 582022 587875
21245 587875 562166 587289 685794 567782 448163 418929 406290 384457 304220 356331 338546
21234 338546 411640 367784 395877 391814 283749 349651 322871 301932 369380 487098 477631
21223 477631 350512 273632 302717 368847 413464 464481 301045 312975 274359 275647 406702
21212 406702 525249 437651 317614 422772 587552 550764 583196 479146 557692 661438
21202 661438 767996 672001 660177 741488 673416 562149 522918 405828 463493 521950 545045
21191E45045K3445j1851M2529j19101M4249j56392j6733K2837K25482R5243j1758
21180F82995J66309p4876p7770n9616J5928N2996M0390m5183l4100n1951k615
21169F12507K9191j00134k9039N1971K0362P5353l8467M6691K6268P9252J84295
21158I58250o2984j32754m290j27221j28951J89538J08179O1900q2882J85226
21148I64011K46426l6863j10662o6219j27877R4026P6135J5433l7267k23419p5685
21137G18039J08110L7479k1742L0334J2500j81994o9743J03502L7799J07200L724
21126H85208j68117j77750m680K8778p4307k8582K44717L0265l722P1274J45920
21115I49004o279Q5202q685J0757j505M2764l7724m8826J25577J73184j07196
$$ plain form
21191 545045 568490 556639 599168 480067 524316 367924 351191 374028 599510 694753 682995
21180 682995 849304 774428 696658 637042 652970 705966 746356 701173 667073 615122 612507
21169 612507 641698 541564 512525 564496 584858 660211 621744 668435 694703 773955 958250
21158 958250 895266 762512 758222 631001 502050 691588 799767 861667 778785 964011
21148 964011 1210437 1173574 1062912 996693 868816 962842 1038977 1054410 1017143 793724 718039
21137 718039 826149 863628 841886 872220 884720 702726 632983 736485 774284 881484 885208
21126 885208 717091 539341 534661 563439 489132 460550 705267 735532 731810 803084 949004
21115 949004 942725 1027927 1019242 1029999 1028494 1071258 1033534 984708 1110285 1283469 1176273
21104A176273j5482m6664K8289N1964J05501j19979j60466r383Q3557P8775p3795
21093A098590J6488J00797O4042Q0110O6571J3432Q5273J6286n9228M0626K2390
21082A545377k34775J4127K51220Q6814J07056J00775Q853N2531J88647Q9094
21072B209719k1791L5304M6257j21226l1083K19570J91139K7562p5002Q3872J18085
21061B682406J83742J65534o5929J61146P3003k6750N7319K08584J26340J50631
21051C716026K47252R5282O0528Q2168J68786J70030J60205K58645M51426K56368
21041E666716J73415K11934K49551L13936M06584L90454N84578N27897O31202
21032I156267O84747O84002Q77674R31919J163602J535044J643740J933831K322286
$$ plain form
21104 1176273 1160791 1114127 1142416 1194380 1299881 1179902 1019436 1010053 1093610 1172385 1098590
21093 1098590 1115078 1215875 1279917 1360027 1426598 1440030 1525303 1541589 1482361 1522987 1545377
21082 1545377 1310602 1324729 1575949 1662763 1769819 1870594 1879447 1931978 2120625 2209719
21072 2209719 2187928 2223232 2269489 2148263 2117180 2336750 2527889 2555451 2480449 2564321 2682406
21061 2682406 2866148 3031682 2965753 3126899 3199902 3173152 3230471 3439055 3565395 3716026
21051 3716026 3963278 4058560 4119088 4201256 4370042 4540072 4700277 4958922 5410348 5666716
21041 5666716 5840131 6052065 6301616 6615552 7022136 7412590 7997168 8525065 9156267
21032 9156267 9841014 10525016 11402690 12334609 13498211 15033255 16676995 18610826 20933112
21023B0933112K447225K213597K307670K437931K676783L184576L991776N276589
21015D5469259O630192Q198091J0061374J3141979J7229303K2909310L0859302
21008A54498810M1062748N3577653O7464155P5728405O4261249K8527533j0555042
21001D74565511l3943567l5491091j7686136P258536K9135206L8745572K3244303
20994D85828334j6057037n4469689p5692175p6303429o1395865m4680883l1781831
20987A25447425k2654850j6593975j2476888r693787q137686o642584n562210
20980D3685445m723306l913658l057088k363710k054496k131795k391382k449506
20972B0600504k219115k094320j574847j167295j052375r09440p92094o95024
$$ plain form
21023 20933112 23380337 25593934 27901604 30339535 33016318 36200894 40192670 45469259
21015 45469259 52099451 60297542 70358916 83500895 100730198 123639508 154498810
21008 154498810 195561558 249139211 316603366 392331771 456593020 485120553 474565511
21001 474565511 440621944 405130853 387444717 394703253 423838459 462584031 485828334
20994 485828334 469771297 415301608 339609433 263306004 201910139 157229256 125447425
20987 125447425 102792575 86198600 73721712 64027925 55890239 49247655 43685445
20980 43685445 38962139 35048481 31991393 29627683 27573187 25441392 23050010 20600504
20972 20600504 18381389 16287069 14712222 13544927 12492552 11583112 10791018 10095994
20964A0095994p89150p14897n64940l69036m29689n01153k94999k43895l34002
20955E854233m5003j47038k33062k29796k43248l40742k12156j45796k00784p8769
20945C977839k16427j11684j26825p0559k48658j92584r5233J22576j01153k73195
20935B664097j15054j45306m7141j65544j18995j6713j34185j1418j117J23812
20925B032436P9072j74530j7297J32681O493N0863j6809j53155l7691j7316j2948
20914A871799j90414m9413j3419j75706j47011L8575J55143k2613j26524j81311
20904A159106L17K68665N2399j23754j4366j05038q3579P1934P2868N9568L9238
20893A397358p2698Q2992j00488j36579l8440n9091M996L189L3695j6972j51246
$$ plain form
20964 10095994 9306844 8591947 8027007 7657971 7228282 6727129 6432130 6188235 5854233
20955 5854233 5809230 5662192 5429130 5199334 4956086 4615344 4403188 4257392 4056608 3977839
20945 3977839 3761412 3649728 3522903 3452344 3203686 3011102 2915869 3038445 2937292 2664097
20935 2664097 2549043 2403737 2356596 2191052 2072057 2055344 1921159 1909741 1908624 2032436
20925 2032436 2111508 1936978 1919681 2052362 2058855 2109718 2092909 1939754 1902063 1884747 1871799
20914 1871799 1681385 1631972 1618553 1442847 1295836 1334411 1489554 1466941 1340417 1159106
20904 1159106 1159423 1428088 1480487 1356733 1342367 1237329 1153750 1225684 1298552 1358120 1397358
20893 1397358 1324660 1407652 1307164 1170585 1132145 1073054 1078050 1081239 1114934 1097962 946716
20882I46716l1566K4233J29080K48915K52864J10875j8649O9958j29468K7480
20872A630438J28909M7490n5529p9427o6266Q6980p5712j34680j03837q9150k10052
20861A079164O7234P5755k12285j17140j6450P0261L298m2530n8960n235p8523
20850G64589q6063p6209j8559K5179O420K7761o9700J10686P0437o3518K859j01655
20838E92227j0300J33085R2997K7693q1330j55279o0737J03930P9304P7962j34556
20827F64996m3783l0140K4716J72368m0655j8162O6181j27392k0831J21419n0922
20816G17795j35984M714J00722N7831M0855o1742j32760P6389l9720P2772j32980
20805E67892j67018L7941J00608J9583p1639J74789J95510K6073p0259j19569
$$ plain form
20882 946716 915150 939383 1068463 1317378 1570242 1681117 1662468 1732426 1602958 1630438
20872 1630438 1759347 1806837 1751308 1671881 1605615 1692595 1616883 1482203 1378366 1289216 1079164
20861 1079164 1146398 1222153 1009868 892728 876278 946539 949837 907307 848347 843112 764589
20850 764589 678526 602317 583758 608937 615357 643118 573418 684104 754541 691023 693882 592227
20838 592227 581927 715012 808009 835702 754372 599093 538356 642286 721590 799552 664996
20827 664996 621213 591073 615789 788157 747502 729340 795521 668129 647298 768717 717795
20816 717795 581811 586525 687247 745078 785933 724191 591431 667820 628100 700872 567892
20805 567892 400874 438815 539423 559006 487367 662156 857666 883739 813480 693911
20795F93911K545J35331k5967j40876o8438j39382J93447J27318j6231k3499N171
20784G43330P903J49833P844j58158Q9497J98264l1211J0006O2379n9783k00544
20773H19360o0254l8027l3532J79952J49077K2693k56670M1201P721j7738J419
20762H15202M0553j7670j6377o6308j8907M859J67945j14598p9206R7383m1804
20751G71072O70m964j29453J15N8589J53098J09976n9446j09562j08025k3031
20740F59039j8549Q6903K0292N3243q3598k9157O8354N0499p8095o9897r370j3558
20728F36106j45529p9723P7990J74179K15415K8691r2141M5592m1813M5533M9916
20717I14216j17379M6655L8434r9407r0202j019q4952L8128O2429N7846K4412
$$ plain form
20795 693911 696456 831787 805820 664944 596506 457124 650571 777889 761658 738159 743330
20784 743330 751233 901066 908910 750752 840249 1038513 1007302 1017308 1079687 1019904 819360
20773 819360 759106 721079 687547 867499 1016576 1039269 782599 823800 831521 813783 815202
20762 815202 855755 838085 821708 755400 736493 741352 909297 794699 715493 812876 771072
20751 771072 771742 766778 637325 637440 696029 849127 959103 899657 790095 682070 659039
20740 659039 640490 727393 747685 800928 717330 688173 756527 807026 728931 659034 649664 636106
20728 636106 490577 410854 488844 663023 878438 907129 814988 860580 818767 864300 914216
20717 914216 796837 843492 881926 782519 692317 691298 606346 644474 706903 764749 789161
20706G89161q7995j0413q384N9485N4244j2318O0714l7701n8293n7291m2398j50940
20694D97871M4190K4600R2852J26912P5693k7050q3586J2153K9118j27390K9792
20683F95155J07774L5230j37370o6544P6494q189j71036n4088N9180O6056J47470
20672G50132m7307j1597N0255o256j4326Q936j48795k10321P2230L8447n0254
20661D31144K4882J17817J30188J68128n7903J20850J28863m9836j61507N6397
20651I09023p1977j65193J15842P0675N1157J05509K3934j45349j08239j50372
20641F35010j7580J02523J47957j20645j77769K7729J64606m5848J282j5431L5687
20630G37521n8190L3422R9777J01530q3111p8306j45996L380K03749J72958P4353
$$ plain form
20706 789161 701166 690753 682369 741854 796098 783780 844494 806793 748500 691209 648811 497871
20694 497871 542061 566661 659513 786425 862118 835068 751482 763635 792753 665363 695155
20683 695155 802929 838159 700789 634245 710739 702550 531514 477426 536606 602662 750132
20672 750132 702825 691228 741483 735227 720901 729837 581042 370721 442951 481398 431144
20661 431144 456026 573843 704031 872159 814256 935106 1063969 1014133 852626 909023
20651 909023 837046 671853 787695 858370 909527 1015036 1038970 893621 785382 635010
20641 635010 617430 719953 867910 747265 569496 597225 761831 715983 717265 701834 737521
20630 737521 679331 712753 812530 914060 830949 752643 606647 610027 813776 986734 1061087
20619A061087o9131q5387L9228J8860n8775J32858Q285p6035l6683L7437M9874
20608A021618p5179K6357Q3292K56440n9927j86497j3787j53791m529J72582q1374
20597I85205j26775j86685j6427N1536J8968J48289m324n2721R4782J03591l8746
20586I76693j52827L24K8687P8898r3717k4675J91422P2519q8835n1380j8099
20575I19010q863p3973N1317K1656N2337J41002k6818p36J991r5826m3479P5074
20563A012692Q0352l3390M2713J1020r3192o663Q0046K5693p3342j27118P5236
20552I94047M7125K027p6125k3132J02809n7616m7406j25901j40523k1840J39216
20541G92681R9164j8152O1302P1089P7697n2212N4795R0486L9933M9968K0606
$$ plain form
20619 1061087 991956 906569 945797 964657 905882 1038740 1047025 970990 934307 971744 1021618
20608 1021618 946439 972796 1056088 1312528 1252601 1066104 1052317 898526 893997 1066579 985205
20597 985205 858430 671745 655318 706854 725822 874111 869787 817066 911848 1015439 976693
20586 976693 823866 824190 852877 931775 838058 813383 1004805 1077324 988489 937109 919010
20575 919010 910147 836174 887491 909147 961484 1102486 1075668 1074932 1076923 981097 937618 1012692
20563 1012692 1093044 1059654 1102367 1113387 1020195 1013532 1093578 1119271 1045929 918811 994047
20552 994047 1041172 1043199 967074 943942 1046751 989135 941729 815828 675305 653465 792681
20541 792681 891845 873693 934995 1006084 1083781 1031569 1086364 1176850 1216783 1266751 1287357
20530A287357j68820j43397n2109J00477Q2285k3294j272N7891J1141p6903n7875
20519A015481J28201l5827m3093m8239Q7738N0507o9269j8270R6981R4230j21831
20508A136609K3691Q5908Q2231m3471r2383j31144j45147J63919M6436J27415
20498A254064J30058P4565n4589n3924R7728J05234q4176j43106j9077P270k144
20487A311903l4830O6721R6065N6116j11072J72403L1613n6973O2684j13514j05804
20476A375312j6625j2211j70781j26037j4043k006R1168J03530Q8248K0035n0677
20465A285913J2022L7941K12891J74715j5505j43312m0326O5997l3342j11810
20455A445184p0596J04348J34000J35487j91244r7035N647j3828L5472N3919n6339
$$ plain form
20530 1287357 1118537 975140 923031 1023508 1105793 1082499 1081227 1139118 1150259 1073356 1015481
20519 1015481 1143682 1107855 1064762 1016523 1104261 1154768 1085499 1067229 1164210 1258440 1136609
20508 1136609 1160300 1246208 1328439 1284968 1192585 1061441 916294 1080213 1126649 1254064
20498 1254064 1384122 1458687 1404098 1350174 1447902 1553136 1468960 1325854 1306777 1314047 1311903
20487 1311903 1277073 1343794 1439859 1495975 1384903 1557306 1588919 1531946 1594630 1481116 1375312
20476 1375312 1358687 1346476 1175695 1049658 1035615 1033609 1124777 1228307 1316555 1336590 1285913
20465 1285913 1297935 1335876 1548767 1723482 1707977 1564665 1524339 1590336 1556994 1445184
20455 1445184 1374588 1478936 1612936 1748423 1557179 1460144 1465791 1451963 1487435 1541354 1485015
20444A485015J04894j06667m9572J27481L278K4563J32675N8954j31918j2888
20434A635815K05096J8265o7108j55923M2130K22458k9702p4539M5815q9628j11161
20423A641518k62607l5447R893o711N7265o4537O7116J80791O4997M1032m5885
20412A647425m5919P4550P4510Q0530k04275m6387J22815K2444j22393j27824
20402A475476J07688K23441M7402N4718K2566o1338r66J10808l1377j40940N2118
20391A859596J54353n3282j1748L6944J38933J34437l115r4856j23783J8259N4717
20380B110455L3804r4815j22230P9162K6382j8790R0715N4585l4564j48004R029
20369A985729J17891m1447l0354N8511Q2407n4995J07843J43342J45342J98603
$$ plain form
20444 1485015 1589909 1483242 1433670 1561151 1564429 1588992 1721667 1780621 1648703 1635815
20434 1635815 1840911 1859176 1792068 1636145 1678275 1900733 1871031 1796492 1842307 1752679 1641518
20423 1641518 1378911 1343464 1353357 1346646 1403911 1339374 1406490 1587281 1652278 1693310 1647425
20412 1647425 1601506 1676056 1750566 1831096 1626821 1580434 1703249 1725693 1603300 1475476
20402 1475476 1583164 1806605 1854007 1908725 1931291 1869953 1868987 1979795 1948418 1807478 1859596
20391 1859596 2013949 1960667 1948919 1985863 2124796 2259233 2256118 2161262 2037479 2055738 2110455
20380 2110455 2144259 2049444 1927214 2006376 2032758 2013968 2104683 2159268 2124704 1976700 1985729
20369 1985729 2103620 2062173 2031819 2090330 2172737 2117742 2225585 2368927 2514269 2712872
20359B712872j07664j41055k05716q2432r4391R2457P0744k2956l0285J15565
20349B307139J03282o4489j9190l2301J12553q7271j9209r5904q587j6035K0048
20338B200036l1469J15438R3067Q5298J40400J35440k6488n4137Q847r5168o7043
20327B504221l8664K4873K8577Q0865K7204J04268L1151J95016l245j19346K08592
20316C043512R8523j6036K78776K49905J07711p177K50486J14911P8383K75416
20306D474410K73081R9273n0502j1846p029J02823j51216K7568P0313O6916n1983
20295D841808j37705j60827r2174j41934o5947j05395k08230j60708k9147q660
20285C731081j55415K4743J8576j15982M534k7075l2751J51785l190j25042j75616
$$ plain form
20359 2712872 2605208 2464153 2258437 2176005 2081614 2174071 2244815 2221859 2191574 2307139
20349 2307139 2410421 2345932 2326742 2294441 2406994 2319723 2300514 2204610 2196023 2179988 2200036
20338 2200036 2168567 2284005 2377072 2462370 2602770 2738210 2711722 2657585 2666432 2571264 2504221
20327 2504221 2465557 2490430 2519007 2599872 2627076 2731344 2762495 2957511 2954266 2834920 3043512
20316 3043512 3142035 3125999 3404775 3654680 3762391 3755214 4005700 4120611 4198994 4474410
20306 4474410 4747491 4846764 4796262 4784416 4777387 4880210 4728994 4756562 4826875 4893791 4841808
20295 4841808 4704103 4543276 4451102 4309168 4243221 4137826 3929596 3768888 3739741 3731081
20285 3731081 3575666 3600409 3618985 3503003 3507537 3480462 3447711 3599496 3596306 3471264 3295648
20274C295648o4661O9604J78573N5009o3762L1962Q4012O0475M4503K9939p5203
20263C646099r2921J7377L4305J18122k696J40945Q5315l6167N111Q674j50436
20252C773728j26276J89935K838j09605N6591R1584l394M8489O993O9688j9560
20241C981011K7824Q6141L1477m7699J73480Q3058J05687J09624L359m99n2028
20230D501435J0613J49572j2820j13468p4222Q7178J8708J23582J46187o1544
20220D775221O073L7810K9800J28546R3317j01554P5663J9664n1558P3556q225
20209E078313N2259O4730J20812m0966j21637j60775J81813J91309O8399J19416
20199E553673K9964L4410J06617J07517O3397j4765N5359J20135j3294M2194l3220
$$ plain form
20274 3295648 3230987 3300591 3479164 3534173 3470411 3502373 3586385 3646860 3691363 3721302 3646099
20263 3646099 3553178 3570555 3604860 3722982 3720286 3861231 3946546 3910379 3915490 3924164 3773728
20252 3773728 3647452 3837387 3840225 3730620 3787211 3878795 3875401 3923890 3930883 4000571 3981011
20241 3981011 4008835 4094976 4126453 4078754 4252234 4335292 4440979 4550603 4553962 4553463 4501435
20230 4501435 4512048 4661620 4648800 4535332 4461110 4548288 4566996 4690578 4836765 4775221
20220 4775221 4781294 4819104 4848904 4977450 5070767 4969213 5044876 5064540 5012982 5086538 5078313
20209 5078313 5130572 5195302 5316114 5275148 5153511 4992736 5174549 5365858 5434257 5553673
20199 5553673 5583637 5618047 5724664 5832181 5895578 5880813 5936172 6056307 6043013 6085207 6051987
20188F051987j3573L1449R9720L858P0576n5436j2870L9164J42816Q9722L3270
20177F480683J56106P8499o3917K34028K02465Q3720j68154n4119o2056j5850
20167F871405O5590N7573J10695K18804J20609l7831q8355R1000R8950l4922O4525
20156G538043K5685J26702Q8664J4438P1066P0360J09335K06288p288O6659J63578
20145H473530K68908J61550J5478L5965N6433J26991O3944K2000k7241L0793K13371
20134I441722J28733N3007J75644Q1628k8163K339l0628O4416J22701Q5287Q3800
20123A0180486O6489Q157N8258J78761J88335L08631J35704N6713m4908l6786
20113A1099840J51919K25202M5191J46485j31583Q4432J71402K30201K34306k116
$$ plain form
20188 6051987 6038414 6069863 6169583 6173441 6244017 6188581 6175711 6214875 6357691 6447413 6480683
20177 6480683 6636789 6715288 6651371 6885399 7087864 7171584 7003430 6949311 6887255 6871405
20167 6871405 6936995 6994568 7105263 7324067 7444676 7406845 7318490 7409490 7508440 7473518 7538043
20156 7538043 7563728 7690430 7779094 7793532 7864598 7934958 8044293 8250581 8243293 8309952 8473530
20145 8473530 8742438 8903988 8919466 8955431 9011864 9138855 9202799 9224799 9197558 9228351 9441722
20134 9441722 9570455 9623462 9799106 9880734 9852571 9854910 9824282 9888698 10011399 10096686 10180486
20123 10180486 10246975 10255132 10313390 10492151 10680486 10989117 11124821 11181534 11136626 11099840
20113 11099840 11251759 11476961 11522152 11668637 11537054 11621486 11792888 12023089 12257395 12255279
20103A2255279M5903J57367J31851J28266K01316J8097J90663K79961J58329J86843
20093A3753875J59574M7793m3919R3128J52571J80775J27684K88673J83586R5763
20083A5039503J61096K34044J94905m712L8328L77813N66368K47263K7534n0037
20073A6832105L0704R8006L45157M41122J64458J40404J68861J15955K22168M32821
20063A8991761K89354L51860L53602L00249J58592K23741J29524J55368L59601
20054B1313652M06298J91544J45410L42464L90675L53533L02266L26664M17745
20045B4190251M92211L74398K59848K76673L92993L54257M91140N63578M53025
20036B7848374N31684M23579J90554M35804N40667M99794N13620N14577L26447
$$ plain form
20103 12255279 12301182 12458549 12590400 12718666 12919982 12938079 13128742 13408703 13567032 13753875
20093 13753875 13913449 13961242 13917323 14010451 14163022 14343797 14471481 14760154 14943740 15039503
20083 15039503 15200599 15434643 15629548 15624836 15663164 16040977 16607345 16854608 16882142 16832105
20073 16832105 16862809 16960815 17305972 17747094 17911552 18051956 18220817 18336772 18558940 18991761
20063 18991761 19281115 19632975 19986577 20286826 20445418 20669159 20798683 20954051 21313652
20054 21313652 21719950 21911494 22056904 22399368 22790043 23143576 23445842 23772506 24190251
20045 24190251 24682462 25056860 25316708 25593381 25986374 26340631 26831771 27395349 27848374
20036 27848374 28380058 28803637 28994191 29429995 29970662 30470456 30984076 31498653 31825100
20027C1825100M06926M55374N44895O98458O67442P07750N55622O12607N31618
20018C7005792N82600N66069P17810O75786P08689O94061O84398P29670P26936
20009D3091811P92934P47588R28705P97063Q91094P96050P17605Q00771J004076
20000E0567697J085192R50870R34259J050689J048135J221395J105592R56894
19992E8920723R86823J172973J052773J182274J240442J336508J391762J398998
19984F8683276J343120J206118J359449J635466J570279J540863J457814J310395
19976H0106780J486761J599826J526715J712773J591412J487918J655660J879485
19968I3047330J793344J767024J797853J776166J650411J676398J972103J770504
$$ plain form
20027 31825100 32232026 32687400 33232295 33930753 34598195 35305945 35861567 36474174 37005792
20018 37005792 37588392 38154461 38872271 39548057 40256746 40950807 41635205 42364875 43091811
20009 43091811 43884745 44632333 45561038 46358101 47249195 48045245 48762850 49563621 50567697
20000 50567697 51652889 52603759 53538018 54588707 55636842 56858237 57963829 58920723
19992 58920723 59907546 61080519 62133292 63315566 64556008 65892516 67284278 68683276
19984 68683276 70026396 71232514 72591963 74227429 75797708 77338571 78796385 80106780
19976 80106780 81593541 83193367 84720082 86432855 88024267 89512185 91167845 93047330
19968 93047330 94840674 96607698 98405551 100181717 101832128 103508526 105480629 107251133
19960A07251133J738496K015224K098021J877483J705857J715647J838185J879780
19952A22119826K046208J955485J906438J896984J841281J732726J660614J563424
19944A36722986J775911J747121J704357J566538J747242J707603J667798J490196
19936A50129752J483221J592947J511983J436227J201192J367378J443127J243471
19928A61409298J109281J026835R29982J170736J008279Q51352Q59081P91257
19920A69156101P02107N51163M01560L71671L56324L23195K39450J36748O3052
19911A72301371j21756j12631l5639j84914l96608n81790n12932q06578p43926
19902A68804597o50866p65754o79311p85920j138978j156368j228795j200986
$$ plain form
19960 107251133 108989629 111004853 113102874 114980357 116686214 118401861 120240046 122119826
19952 122119826 124166034 126121519 128027957 129924941 131766222 133498948 135159562 136722986
19944 136722986 138498897 140246018 141950375 143516913 145264155 146971758 148639556 150129752
19936 150129752 151612973 153205920 154717903 156154130 157355322 158722700 160165827 161409298
19928 161409298 162518579 163545414 164475396 165646132 166654411 167505763 168364844 169156101
19920 169156101 169858208 170409371 170810931 171182602 171538926 171862121 172101571 172238319 172301371
19911 172301371 172179615 172066984 172031345 171846431 171449823 170868033 170355101 169548523 168804597
19902 168804597 168153731 167387977 166708666 165922746 164783768 163627400 162398605 161197619
19894A61197619j004202j252280j331682j434555j514601j450958j602364j592072
19886A50014905j470121j540284j667343j723154j446136j613493j787156j779743
19878A36987475j683222j684055j816464j895371j810908j801212j931069j725439
19870A22639735j925209j852118j948059j827437j797285j881823j929173j872489
19862A07606142j794392j860435j859616j771181j743198j735217j780856j855194
19854I3206053j800727j721833j746899j722965j656537j636278j618959j602968
19846G9698887j605637j457128j323769j495117j530028j399446j517620j303481
19838F8066661j132168j314147j394440j347070j255341j269617j287162j099324
$$ plain form
19894 161197619 160193417 158941137 157609455 156174900 154660299 153209341 151606977 150014905
19886 150014905 148544784 147004500 145337157 143614003 142167867 140554374 138767218 136987475
19878 136987475 135304253 133620198 131803734 129908363 128097455 126296243 124365174 122639735
19870 122639735 120714526 118862408 116914349 115086912 113289627 111407804 109478631 107606142
19862 107606142 105811750 103951315 102091699 100320518 98577320 96842103 95061247 93206053
19854 93206053 91405326 89683493 87936594 86213629 84557092 82920814 81301855 79698887
19846 79698887 78093250 76636122 75312353 73817236 72287208 70887762 69370142 68066661
19838 68066661 66934493 65620346 64225906 62878836 61623495 60353878 59066716 57967392
19830E7967392j066504j071076j054796j049022j047249r78061r15669q17825
19822D9967190r81862j118525r96244p87659p14732p65480r07596q71568q54138
19813D1969386p66129p03890n34519n49720o87434p79797p50787o74033n15563
19804C6007514n87076o67582o34656n45094o37752o62746n14762m41501o05783
19795C0710562n31546n03275m50979m49793l44904j79748m51461m62584m87830
19786B6848442m99625k81298l35820m80952l57562k07331k65716k87670l08634
19777B3823834n53906o01676k53353k17268l07478l18528k29380l59389l34754
19768B0648102l86552k12507j27737k74056k66636k38726k20727j89631k60659
$$ plain form
19830 57967392 56900888 55829812 54775016 53725994 52678745 51700684 50785015 49967190
19822 49967190 48985328 47866803 46870559 46082900 45368168 44602688 43695092 42823524 41969386
19813 41969386 41203257 40499367 39964848 39415128 38727694 37947897 37197110 36523077 36007514
19804 36007514 35420438 34752856 34118200 33573106 32935354 32272608 31757846 31316345 30710562
19795 30710562 30179016 29675741 29224762 28774969 28430065 28250317 27798856 27336272 26848442
19786 26848442 26348817 26067519 25731699 25250747 24893185 24685854 24420138 24132468 23823834
19777 23823834 23269928 22668252 22414899 22197631 21890153 21571625 21342245 20982856 20648102
19768 20648102 20261550 20049043 19921306 19647250 19380614 19141888 18921161 18731530 18470871
19759A8470871k52622k61038k94482l31252j87197j56260j93863k60482k40046
19750A6293629p0291j10283k41864k88660k5439j56913j93930l59562j14146M4457
19740A4776998j56320k69247r4416k23113k81372o5829j15574k13895j74112j37470
19730A3045650j33626j3937k36965j11755p0414o7005k51207j09205J8195j12205
19720A1957526j19041r9064o1239p3108k00740j41683j05147j93076o3679K6968
19710A0927717j55048n1929j77082j75436j26212m2932p4944k71657o2492k2823
19700I767162n5092N4221j04679M0042l9348k48910j97240q0156J219k17982p4872
19689H844365Q7969p8858j65352j28881j22855n7709j973J8548j01052j30021
$$ plain form
19759 18470871 18218249 17957211 17662729 17331477 17144280 16988020 16794157 16533675 16293629
19750 16293629 16223338 16113055 15871191 15582531 15557092 15400179 15206249 14846687 14732541 14776998
19740 14776998 14620678 14351431 14257015 14033902 13752530 13686701 13571127 13357232 13183120 13045650
19730 13045650 12912024 12898087 12661122 12549367 12478953 12411948 12160741 12051536 12069731 11957526
19720 11957526 11838485 11739421 11678182 11605074 11404334 11262651 11157504 10964428 10900749 10927717
19710 10927717 10772669 10720740 10543658 10368222 10242010 10199078 10124134 9852477 9789985 9767162
19700 9767162 9712070 9766291 9661612 9701654 9662306 9413396 9216156 9136000 9137219 8919237 8844365
19689 8844365 8932334 8853476 8688124 8559243 8436388 8378679 8376706 8395254 8294202 8164181
19679H164181K7918m9643j14842j37038q8064J8901l843j39658k29711j42947
19669G305254j22008N3849j3082j81107j35447L1038N7443K4061O4107j68289
19659F915819j92657k8009q0276j36768N0304j1005q1702L6101K4785l6369j69515
19648F290708j066K4837m4063p5099O5181K3953o2566q2517j47996R822p6190
19637E925004j53963L4134m6469q4561j3159j86559P39k8112k9924K7536o9196
19626E375470o6339j10200q8518l0507j1627p054l3380P348N3557j0665p2337
19615E005748n419r3454r3982r9487j13893o340j06878k5878O3500N9036P2310
19604D655263m8703k9997k17547m7267P332O9684k9074k57341J209J61788J00369
$$ plain form
19679 8164181 8192099 8142456 8027614 7890576 7802512 7821413 7817570 7677912 7448201 7305254
19669 7305254 7183246 7237095 7224013 7042906 6907459 6938497 6995940 7020001 7084108 6915819
19659 6915819 6723162 6695153 6614877 6478109 6528413 6517408 6435706 6471807 6496592 6460223 6290708
19648 6290708 6289642 6314479 6270416 6195317 6260498 6284451 6221885 6139368 5991372 6001194 5925004
19637 5925004 5771041 5805175 5758706 5674145 5660986 5474427 5475166 5447054 5417130 5444666 5375470
19626 5375470 5309131 5198931 5110413 5079906 5068279 5061225 5027845 5035193 5088750 5078085 5005748
19615 5005748 5000329 4906875 4812893 4713406 4599513 4593173 4486295 4460417 4523917 4582953 4655263
19604 4655263 4606560 4576563 4359016 4311749 4319081 4388765 4359691 4102350 4103559 4265347 4365716
19593D365716m8086k60783k09148p5573l2711j25292J16034J07330K0297q6007
19583C771777R1709L518J21953m7440j79105R601n6162p0397j3557q6561R2656
19572C637992m7448k12101p4621J25597K42027N627n4066l8720o6779m5212m9700
19561C422596j31357R4501P6189j59509l947n7642j940O4499R2992j7766j36442
19550C242174j42019j03111N0494j6110M452j4145j47906K5777m1238j30636p2248
19539B655484K7048J00395J75861M6890J60521q2819n1358P7267j45874r3770
19529B869645j23350j08617L8412J63288P3009l4285j23544l9721J15222P20O6433
19518B897212j19029r7509j31924O1203K1579p7360J34907m314o0313N6021j06399
$$ plain form
19593 4365716 4317630 4056847 3847699 3772126 3739415 3614123 3730157 3837487 3857784 3771777
19583 3771777 3863486 3867004 3988957 3941517 3762412 3772013 3715851 3645454 3631897 3545336 3637992
19572 3637992 3590544 3378443 3303822 3429419 3671446 3677073 3623007 3584287 3517508 3472296 3422596
19561 3422596 3291239 3385740 3461929 3302420 3298473 3240831 3238891 3303390 3396382 3378616 3242174
19550 3242174 3100155 2997044 3047538 3031428 3035880 3021735 2873829 2899606 2858368 2727732 2655484
19539 2655484 2682532 2782927 2958788 3005678 3166199 3083380 3032022 3109289 2963415 2869645
19529 2869645 2746295 2637678 2676090 2839378 2912387 2878102 2754558 2714837 2830059 2830779 2897212
19518 2897212 2778183 2680674 2548750 2609953 2631532 2554172 2689079 2684765 2624452 2680473 2574074
19507B574074n1316o2556L3072J92634o2369j62074j09029M07L027p4588J04140
19496B385422L7895j00130p756L9851m4901q9003k8610j61414n1543J09322J35478
19485B224611l3477n9142K7458j175O6375k2788k8727j6583q0287L733N1183l3144
19473B098037m2310j37270q5412J40586K8410R442J59424J83530o5344j62082
19463B127011j09767o2801q6569r618M762j04749R5802l968p3446N0030j7756
19452A808931l1540r0371J8724R4514r9587j36205P2815J12663r4755p5440O65
19441A580414N1350R2046J04189p1209j74370k8691L7935j844J01174j7482j3499
19430A660013J1521R895O2710j47264p3697N9945r0400j16419P9421J37531j30516
$$ plain form
19507 2574074 2522758 2460202 2493274 2685908 2623539 2461465 2352436 2352843 2355870 2281282 2385422
19496 2385422 2423317 2323187 2315431 2355282 2310381 2221378 2192768 2031354 1979811 2089133 2224611
19485 2224611 2191134 2131992 2159450 2158275 2224650 2201862 2173135 2156552 2076265 2079998 2131181 2098037
19473 2098037 2055727 1918457 1833045 1973631 2002041 2011483 2170907 2354437 2289093 2127011
19463 2127011 2017244 1954443 1867874 1858256 1863018 1758269 1854071 1850103 1776657 1826687 1808931
19452 1808931 1777391 1687020 1705744 1800258 1700671 1564466 1637281 1749944 1655189 1579749 1580414
19441 1580414 1631764 1723810 1827999 1756790 1582420 1553729 1591664 1589820 1690994 1673512 1660013
19430 1660013 1671534 1681429 1744139 1596875 1523178 1583123 1492723 1376304 1455725 1593256 1462740
19419A462740P4884l1392p5186m1749k400L9511k2464J1332k400K23J18103j9410
19407A511792j07840N1315R1411J2700K5364O457J2776j1824k2914q3025j68329
19396A317883n7501Q5624Q5513k9611j27489L9258K4224L9986j25809M2895N3761
19385A348734m4158J27745L8422J0676J26645L4057j45692j41652M454M4549n2642
19374A351138q3042j28494k8124K48577J00594p4769J7876M7205J38746R5609
19364A685316n7069l326o2439J6613m1295j95471j82749P5570m1840k7626R5561
19353A261245Q196O5213K06590o6162k84443l9039o3022L7759J44688J61754j08961
19342A323818j28457L9674J7292K9299p8106m6421J15905k6767o6779n1791n2862
$$ plain form
19419 1462740 1537624 1506232 1431046 1389297 1386897 1426408 1403944 1415276 1412876 1413099 1531202 1511792
19407 1511792 1403952 1455267 1546678 1559378 1584742 1591199 1603975 1592151 1569237 1486212 1317883
19396 1317883 1260382 1346006 1431519 1401908 1274419 1313677 1337901 1377887 1252078 1294973 1348734
19385 1348734 1304576 1432321 1470743 1481419 1608064 1642121 1496429 1354777 1359231 1403780 1351138
19374 1351138 1268096 1139602 1111478 1360055 1460649 1385880 1403756 1450961 1589707 1685316
19364 1685316 1628247 1624921 1562482 1579095 1537800 1342329 1159580 1235150 1193310 1165684 1261245
19353 1261245 1269441 1334654 1541244 1475082 1190639 1151600 1088578 1126337 1271025 1432779 1323818
19342 1323818 1195361 1235035 1252327 1281626 1203520 1157099 1273004 1246237 1179458 1127667 1074805
19331A074805P538m5528L1678l6665j6220J5438r9522j21594o1273J94757K52007
19320A195421J5367j45952k4532J12325r7154j05264K8490J08738o1072n4096
19310I72271Q7168N6244j0352o4234j71632q0295N79J42195K5173m7285O0279
19299I70111n5247J56132M5335o0618O7227m9347q5619R6566l559J46145l6474
19288A190652l36452j05568M7317L3069l1300M2381J13604J6507J11996J06929
19278A189135K060q5495j11281j75318N9115J8640j10974l1815Q6272J53966J14634
19267A108939q2656j38567n837n7423L4682q6440j06239J42523J40427N3404M8677
19256A051490k13321n3541M6633P7431Q5430k32812q9772N7843R7236L5836j973
$$ plain form
19331 1074805 1082343 1036815 1068493 1031828 1015608 1031046 931524 809930 748657 943414 1195421
19320 1195421 1210788 1064836 1040304 1152629 1055475 950211 978701 1087439 1026367 972271
19310 972271 1059439 1115683 1105331 1041097 869465 789170 789749 931944 957117 909832 970111
19299 970111 914864 1070996 1116331 1055713 1122940 1073593 987974 1084540 1080981 1227126 1190652
19288 1190652 854200 748632 795949 829018 797718 840099 953703 970210 1082206 1189135
19278 1189135 1191195 1105700 994419 819101 878216 896856 785882 754067 840339 994305 1108939
19267 1108939 1026283 887716 881879 824456 859138 772698 666459 808982 949409 1002813 1051490
19256 1051490 838169 784628 831261 908692 994122 761310 671538 729381 826617 862453 860480
19245H60480m922j00829O9203R0020l9326j76717N6212p0515j11677J42709J54502
19234H69140q1321P5776J35451l2891j43653m8065l3337M4137M5383j42942p4864
19223F12814O4490L3330J51358J14282j3761o4704l6447j35920l8315J84093J19151
19212I90371r7377M8926Q4414P2608p208j19603j7113K8430R8643J83297Q7461
19201A352849k1274m6914P0760J0120J50210K05921K15838q9556Q0874J86847
19191B115675L0390k8301M2681n3366J24637J57494J46557K0868L7252J3705N8620
19180B666212j60658j64090l8942m8831k13754l55847k72227m9464p7050j56144
19170A129205j79874j10915j16310j11632N859K8300L0530r4817M8231L9078L8670
$$ plain form
19245 860480 855558 754729 823932 913952 874626 697909 754121 683606 571929 714638 869140
19234 869140 787819 863595 999046 966155 822502 774437 741100 785237 830620 687678 612814
19223 612814 677304 710634 861992 976274 962513 897809 861362 725442 687127 871220 990371
19212 990371 892994 941920 1026334 1098942 1091734 972131 955018 983448 1082091 1265388 1352849
19201 1352849 1331575 1284661 1355421 1365541 1515751 1721672 1937510 1847954 1928828 2115675
19191 2115675 2146065 2117764 2160445 2107079 2231716 2389210 2535767 2556635 2593887 2607592 2666212
19180 2666212 2505554 2341464 2302522 2253691 2039937 1684090 1411863 1362399 1285349 1129205
19170 1129205 949331 838416 722106 610474 616333 644633 675163 580346 628577 667655 706325
19159G06325Q650k7742j03849K0903P7320J00744L6992n9601N9344J0033j48260
19148F80859Q4075l3611m3175n5017n1952j811k7941q469O6019k4839O9152K66337
19136I19627q4446j99151n6406Q1735l1477n1449O3338L757J11817L9813n0758
19125G46400p1588k1194J9438j27108j69168j7388J6380p282P0977L3433j5841
19114D57059M0838J29773j4796j61759j6084K4740J26832M8088Q4583l9808j92131
19103D87335j04383P731m4240N0318K01570M3695k58867m8864Q3495Q2989R8769
19092E99548J33967o0558M1619J3805j64404m1845q8001O2693L6960P5223p0571
19081E38436K8753J1300Q9685J2301J7094j40383m9429l2843M2084j02111j40557
$$ plain form
19159 706325 714975 687233 583384 604287 681607 782351 819343 759742 819086 829119 680859
19148 680859 764934 731323 688148 633131 581179 579368 551427 542958 608977 584138 653290 919627
19136 919627 835181 636030 579624 661359 629882 578433 641771 645528 757345 797158 746400
19125 746400 674812 653618 673056 545948 376780 359392 375772 368490 439467 472900 457059
19114 457059 497897 627670 612874 451115 435031 459771 586603 634691 719274 679466 487335
19103 487335 382952 390683 346443 396761 598331 642026 383159 334295 417790 500779 599548
19092 599548 733515 672957 714576 728381 563977 522132 434131 496824 533784 609007 538436
19081 538436 567189 578489 668174 680475 697569 557186 507757 474914 516998 414887 274330
19070B74330K66671K50196M6614j20212j06168L6956o6238o992j1553j09279j0563
19059D43762K5922j2688L9354O6729K984M8104j27080J07670j6436j28032m9283
19048D01006j25484k1820J3560o022N4194M7553j2328K0932M5986N8004L4594
19037E10175J3682N2391Q7080p4219K6708j44743m2688M5475N4891q8810P2160
19026E12102M009K3077Q3522J0358O3248L9793p2497q3558k06003k4330J00115
19015D49836M3081l3503l7258N2490K4192j3792N1930K9125q5737r5684j00963
19004B83717J2201J66416n3667j21994m5332P5618O0329J07184P0144j52226l0428
18993C71962r7258R1806J31640R1041j22650j84230P3063J27096R0917j40503
$$ plain form
19070 274330 541001 791197 837811 717599 611431 648387 582149 575157 563604 454325 443762
19059 443762 469684 456996 496350 563079 566063 614167 487087 594757 578321 450289 401006
19048 401006 275522 253702 267262 261240 315434 362987 350659 371591 417577 475581 510175
19037 510175 523857 576248 663328 589109 615817 471074 428386 473861 528752 439942 512102
19026 512102 516111 539188 622710 633068 696316 736109 663612 580054 374051 349721 449836
19015 449836 492917 459414 422156 474646 498838 485046 536976 566101 480364 384680 283717
19004 283717 295918 462334 408667 286673 241341 316959 377288 484472 554616 402390 371962
18993 371962 274704 366510 498150 589191 466541 282311 355374 482470 573387 432884
18983D32884j02579N2477M123l5886J8249K04950P9345j06715j44526r6575N0868
18972C56615J44197p0994p616K5486o136J8821J122n8543k00485n6945J86998
18961C32520n3363k0932J27544P5537J02941q0989j92182r605J01066N6011R5895
18950E34443j41497l7731J27501k9017p3700j6541j02965j29792j12903J16592
18940A34390J81742J05952P0951J7450r4414K0870J34930K4238j30967l1531o3560
18929C70051J7295n145j18503q8677r0712J22254J844Q7642O525Q4036m5914j06094
18917B34602j80522J51075K18555j29340j18593l8313o2679J16968J56583j18945
18907B29391j49757M5140o8025r1864k2620Q2988K5842Q0567Q5448o1966J12996
$$ plain form
18983 432884 330305 382782 386905 351019 369268 574218 653563 546848 402322 305747 356615
18972 356615 500812 429818 422202 447688 441552 460373 461495 402952 202467 145522 332520
18961 332520 279157 258225 385769 461306 564247 483258 291076 281471 382537 438548 534443
18950 534443 392946 355215 482716 453699 379999 363458 260493 130701 17798 134390
18940 134390 316132 422084 493035 510485 416071 436941 571871 596109 465142 433611 370051
18929 370051 387346 382201 263698 175021 84309 206563 208407 296049 302574 386610 340696 234602
18917 234602 54080 205155 423710 294370 175777 137464 74785 191753 348336 229391
18907 229391 79634 124774 56749 -35115 -57735 25253 51095 131662 217110 155144 268140
18896B68140J93893R8004k1266q2917l9110q2206m3772k5997R4939Q882J80452
18885E49042J33267j9812p7528o4587J3829j4213j51693j7113r1090m3062J20842
18874C37882J01246j31536M8172q7817O5595Q5996o7421J7334Q4298J4555j07776
18863C60528j74265N089P3738M0852p3723K9806J33715o2796j13453P8314J38943
18852D36748k2542l840q4797m7738K8667n6695O1284r464q2880K0458n015j77285
18840E6901j51273J2523J73033K9549J5483K8418J62177k8905j37863J8285K14160
18829C92488J36647J66406J39682L1797k28277k38717J07501J10128L6782J0639
18819F65076m8792j19442j4541K4354m6517p6423J05793J04130r8869m6525M5249
$$ plain form
18896 268140 462033 560037 538771 455854 416744 334538 290766 264769 359708 368590 549042
18885 549042 682309 662497 584969 520382 534211 519998 368305 351192 260102 217040 337882
18874 337882 439128 307592 355764 267947 333542 419538 352117 369451 453749 468304 360528
18863 360528 186263 191352 265090 305942 232219 262025 395740 332944 219491 297805 436748
18852 436748 414206 410366 325569 277831 306498 249803 311087 301623 218743 239201 234186 56901
18840 56901 -94372 -81849 91184 120733 136216 164634 326811 297906 160043 178328 392488
18829 392488 529135 695541 835223 867020 638743 400026 507527 617655 654437 665076
18819 665076 616284 496842 482301 506655 460138 383715 489508 593638 494769 448244 493493
18808D93493J49263N8972l293M7375p9594j6042q7703j73985J57108L9136j2831
18797E71899p5761o7450j55422j29488J25898J86864J1286p9769j20837K4184
18787B91404M5279o5618l5689k718o3484r7509k4934O0523L1981r534R1669K1430
18775B42800J9997J35219J52577j42189m194L3662O1731n1384l464n5331j84892
18764B04532j38800K0128O5913J85537l0760l2191k7578R7387K9952m3371p1121
18753B59628m6709j26624j1005J75937L7348J9502K0712n4196o9267N7453P4575
18742C37354J37649r7005j2434p9778p380Q8928J25382n5671r7383n4711P1161
18731C56112j465j37940K8776J16481O3308O4989N2423M5206l8105n8469k773
$$ plain form
18808 493493 642756 701728 698435 745810 666216 650174 562471 388486 545594 584730 571899
18797 571899 496138 428688 273266 143778 269676 456540 467826 388057 267220 291404
18787 291404 336683 271065 235376 232658 169174 71665 46731 107254 139235 129701 221370 242800
18775 242800 262797 398016 550593 408404 404210 437872 499603 448219 444755 389424 204532
18764 204532 65732 85860 151773 337310 306550 274359 246781 344168 374120 330749 259628
18753 259628 212919 86295 75290 251227 288575 308077 328789 274593 205326 262779 337354
18742 337354 475003 377998 365564 285786 278406 367334 492716 437045 339662 284951 356112
18731 356112 354647 216707 245483 361964 425272 490261 542684 587890 549785 491316 488543
18720D88543j1624P5840L7038Q8564k0230M2055j0894J6873j39541j60475J38768
18709E44917O4136j07856p034P6823J24481K9996p6890K0757k2170k9245K4096
18698F42011J1390J18706O827l8464j13871J8352M8762j62954M137j0235l9094
18687D85567r11K2989j57882j19472M9857M9426o4001k7286N8760M5189k11850
18676A30386J18885J38960l2118J34832J60928L5680l260j71664m467Q5399J05402
18665F98963M9125l8377p2071r2452j02615J23760L5272j22602L4247J39740Q8243
18654G41233L5223J52925J40610M0879J2942j14159j01835k8580J82297j6314
18644A045221j03391M5988P581Q2445M4627n8262R5913j47161O3986J21236l8573
$$ plain form
18720 488543 476919 552759 589797 678361 658131 700186 689292 706165 566624 406149 544917
18709 544917 609053 501197 494163 570986 695467 725463 648573 669330 647160 617915 642011
18698 642011 653401 772107 778934 740470 626599 644951 693713 530759 534896 524661 485567
18687 485567 484656 507645 349763 230291 280148 329574 265573 238287 297047 342236 130386
18676 130386 249271 388231 356113 490945 651873 687553 684293 512629 508162 593561 698963
18665 698963 748088 709711 637640 545188 442573 566333 601605 479003 513250 652990 741233
18654 741233 776456 929381 1069991 1110870 1123812 1009653 907818 879238 1061535 1045221
18644 1045221 941830 987818 995399 1077844 1122471 1064209 1160122 1012961 1076947 1198183 1159610
18633A159610j06837L8869J77850J9843Q8389J32319K9739R4475L574j22988R1873
18622A606716Q0315J01181J41972J36330J82068o0971n0954J44595K33109J55163
18612B669524j06993J28799J87236J54168J65015L37724K06386L15699K51749
18603D309307J48037L25153L97557M98013O49431N44806N34215N21127L26933
18594H254579L37006O09806O24985P45019P57650O69968P97089R26070Q12833
18585A4535005R20052J114236J501279J621281J803872K065846K444057L219603
18577B9225231M023538M804682N704766P177598R376578J2300380J5730364J9695263
18569A08038400K4167854K8612778L2253615L5137931L8273766M1257480M2007707
$$ plain form
18633 1159610 1052773 1091642 1269492 1289335 1377724 1510043 1539782 1634257 1637831 1514843 1606716
18622 1606716 1687031 1788212 1930184 2066514 2248582 2187611 2136657 2281252 2514361 2669524
18612 2669524 2562531 2691330 2878566 3032734 3197749 3535473 3741859 4057558 4309307
18603 4309307 4457344 4782497 5180054 5678067 6327498 6872304 7406519 7927646 8254579
18594 8254579 8591585 9201391 9826376 10571395 11329045 11999013 12796102 13722172 14535005
18585 14535005 15455057 16569293 18070572 19691853 21495725 23561571 26005628 29225231
18577 29225231 33248769 38053451 43758217 50935815 60312393 72612773 88343137 108038400
18569 108038400 132206254 160819032 193072647 228210578 266484344 307741824 349749531
18562C49749531L5533293J9926846M471920j627044j62843K575107M001983L878520
18554D18347313O10064r371323k6318982m0257955m3023887l9231078l4522346
18547B26231806l1577162k9591282k7105164k3517401j9368359j5499196j2076108
18540F7497134r451914p611914o114316m938204m046334l473027k921970k375044
18532B6564411k201984j991801j671473j270146j200833j202847r80641p98279
18524A5246407o95458p38513q13855n90206n84810o08893n86604l69575l05611
18515I952882n33029n61455o90403o06811l76503l61306m03819l77140l78115
18506E664301n08807l04790k58182k82607j98682j52199k27915l2408o5127j68808
$$ plain form
18562 349749531 385282824 405209670 409681590 408054546 407891703 410466810 414468793 418347313
18554 418347313 418957377 409586054 383267072 343009117 299985230 260754152 226231806
18547 226231806 194654644 165063362 137958198 114440797 95072438 79573242 67497134
18540 67497134 58045220 50433306 44318990 39380786 35334452 31861425 28939455 26564411
18532 26564411 24362427 22370626 20699153 19429007 18228174 17025327 16044686 15246407
18524 15246407 14550949 13812436 12998581 12408375 11823565 11214672 10628068 10258493 9952882
18515 9952882 9419853 8858398 8167995 7561184 7184681 6823375 6419556 6042416 5664301
18506 5664301 5155494 4850704 4592522 4309915 4111233 3959034 3731119 3698711 3633584 3464776
18496C464776k29904k23083j19768j49012j70429p9721P2385o7719p6541L7190
18486B458174p54l8673l3653M7973k02478k52431j16674J1415p518k4014p0377
18475A770990L5783P8499o3065r6281j38261m9793J6010n4558m125j05923o652
18464A382624J03191j1468N4824k3567j9257r6072m3622J41681L1503j84505j04243
18453A231089j9945N2963M0420p7950j9835l5188j32514j85416N27k6806J6611
18442H43956K19437J17850j15623Q4027J81831J22189n5503k6477R1889l0365
18432A433211n1595q5013J06292o118P6592Q847r2978j81560m1804O8952j38039
18421A096787R4648M7619j01037k00440k08725Q3092N6442r8167p0109k2751J37737
$$ plain form
18496 3464776 3234872 3011789 2892021 2743009 2572580 2492859 2565244 2497525 2420984 2458174
18486 2458174 2457420 2418747 2385094 2433067 2230589 1978158 1861484 1872899 1865381 1841367 1770990
18475 1770990 1806773 1885272 1822207 1725926 1587665 1537872 1553882 1499324 1495199 1389276 1382624
18464 1382624 1485815 1474347 1529171 1505604 1486347 1390275 1346653 1488334 1519837 1335332 1231089
18453 1231089 1211144 1264107 1304527 1226577 1206742 1171554 1039040 853624 854151 827345 843956
18442 843956 1063393 1181243 1065620 1149647 1331478 1453667 1398164 1371687 1463576 1433211
18432 1433211 1381616 1296603 1402895 1396777 1473369 1482216 1389238 1207678 1165874 1234826 1096787
18421 1096787 1191435 1239054 1138017 937577 728852 811944 868386 770219 700110 677359 815096
18410H15096K01881Q389j76604k00334j05533q3341J8103q6435r1783R120J62243
18399D70802O8190q3312l3163p2706Q9139k4133p1601k8034K0173M8413o2026
18388C21742N9891Q7903K5066l8825Q2100k4495K559L9549K7845j08700l7955
18377D36680O0601k1854j89087m5692J75457J59346q6204O0699O9643Q6590k3587
18366F82592q9154P7214Q201j67358r610L090n4722j37879k088l702j79141P7405
18354B04848O5093p2364k3335l079j6608Q1882m851m8365K8546P1202p223p2382
18342B03364J24754L3706P5696m1314N2976J92859p1557r2163r1433k2083J07311
18331D72116J3629j5560m355j03679n1544j49055Q0747M2250o4251r2494Q5942
$$ plain form
18410 815096 1016977 1025366 848762 648428 542895 459554 477657 391222 299439 308559 470802
18399 470802 538992 455680 422517 349811 438950 414817 343216 315182 335355 383768 321742
18388 321742 381633 469536 494602 455777 537877 513382 515941 555490 583335 474635 436680
18377 436680 497281 475427 286340 240648 416105 575451 489247 549946 619589 706179 682592
18366 682592 593438 670652 678853 511495 501885 504975 450253 312374 310286 306584 127443 204848
18354 204848 269941 197577 174242 171163 154555 236437 231586 183221 211767 282969 275746 203364
18342 203364 328118 361824 437520 396206 449182 642041 570484 478321 386888 364805 472116
18331 472116 485745 470185 465830 362151 310607 161552 242299 284549 220298 127804 213746
18320B13746j5469r1920j27009R3500K57888J02710l8318p6339j09114R2224Q9884
18309C91783r5135o0183N5233P8462r4092m929K36798o4900j3618L1004l0183
18298D30240l8503K6547o2909q8497j04100N3850J88145J11295k7532p8958J03859
18287E13437n7304j42373k9751j29653N1003k5182N8358R2391M7615r8866m3181
18276B36494J83232o3728K5772m170j21563l1282j05358l3943N67j2692q3990
18265a0661k1632Q8514J9784J11356M05j36589Q152J12625J17122k2406p8605
18254A88065j46650p0137m835N4371R3907n113J631p4317n0797j62238o5172Q5459
18242a55826Q9518J29801R7238J66009j26344q5929N1591O4844J04263j29755
$$ plain form
18320 213746 198277 106357 -20652 72848 330736 433446 395128 318789 209675 301899 391783
18309 391783 296648 236465 291698 370160 276068 271139 507937 443037 429419 460423 430240
18298 430240 391737 418284 355375 266878 162778 216628 404773 516068 488536 409578 513437
18287 513437 456133 313760 284009 154356 205359 180177 238535 330926 378541 279675 236494
18276 236494 419726 355998 381770 377600 256037 224755 119397 85454 86021 73329 -10661
18265 -10661 -32293 56221 76005 187361 187766 51177 59329 171954 289076 266670 188065
18254 188065 41415 -28722 -33557 20814 114721 109608 111239 36922 -13875 -176113 -241285 -155826
18242 -155826 -66308 63493 160731 326740 200396 114467 166058 230902 335165 205410
18232B05410j07173n858J43523j20752k8798J13197P2590k9939n7170P2996N3747
18221C11773K4247k9446o9680J538o8652j4661q1639J5658l977J42765k0316K2785
18209B30395R646P4506q3807k7821j96396J05998K11103j3258l7891j24266o0600
18198H7609M2875m4985Q7484j04951j32123j6604P120J34764P5533k7580O6543
18187A75685Q466M5800p7369R7035j13377j44039o7068J97666J87921q2514k88933
18176f0727j47575N5279J71229p8477J1761N7146J66033k4773J1559K6917j0833
18165A77539J04497M9245J01267j36785j98771k3809J40034j03289q7381J28426
18155A50973p6460r1455j03105J04360J37035J75416L9222j93369J3815J5125
$$ plain form
18232 205410 98237 92379 235902 115150 86352 199549 272139 242200 185030 258026 311773
18221 311773 336020 306574 236894 238432 169780 155119 73480 89138 85161 227926 207610 230395
18209 230395 240041 314547 230740 202919 6523 112521 323624 310366 272475 148209 87609
18198 87609 130484 85499 172983 68032 -64091 -80695 -73575 61189 136722 109142 175685
18187 175685 184151 229951 152582 249617 136240 -7799 -74867 122799 310720 228206 -60727
18176 -60727 -208302 -153023 18206 -60271 -48510 8636 174669 149896 161455 188372 177539
18165 177539 282036 331281 432548 295763 96992 73183 213217 109928 22547 150973
18155 150973 74513 -16942 -120047 -15687 121348 296764 335986 142617 156432 171557
18145A71557m1999l6731j07399k8921K5652j37381p2723J05653N2800Q613L6264
18134b4615R4834N5567j83030J80O377j010J8796J3059Q0238k6279n0638R0244
18122G3723P3466l3775j9327J03648j3135j52013j30759R6105Q6430j04653M3178
18111B2888J46874r136L6491J01071j76478p4298K5352j03665L7174m0637Q904
18100b5460Q2724m8639m1661q9904J6730N5348R9630N7256L6913q3488K4563j3564
18088G0448J6666R8024o0123N7347Q9216j65119k11266K429J13561J13213j18659
18077E737o9752l1773o633Q3532R6813j7492n5910p584r7151J01031J46983p4800
18065G3001p0560N5617k408m865j28765l6129L0160L0820l5182k0297j681R7786
$$ plain form
18145 171557 129558 92827 -14572 -43493 -17841 -155222 -227945 -122292 -69492 -60879 -24615
18134 -24615 70219 125786 -57244 -57064 -50687 -51697 -32901 -19842 60396 34117 -16521 73723
18122 73723 147189 113414 94087 197735 184600 32587 -98172 -2067 84363 -20290 22888
18111 22888 169762 160626 197117 298188 121710 47412 72764 -30901 6273 -34364 -25460
18100 -25460 57264 8625 -33036 -122940 -106210 -50862 48768 106024 142937 59449 84012 70448
18088 70448 87114 185138 125015 182362 271578 106459 -104807 -102378 11183 124396 5737
18077 5737 -64015 -95788 -102421 -18889 77924 60432 4522 -3062 -100213 818 147801 73001
18065 73001 2441 58058 55650 50785 -77980 -114109 -83949 -53129 -88311 -108608 -110289 -12503
18053a2503k585j66391r2932J06413R5763m4166j62300J61427K15889l2867Q3312
18042A49060J00310q2820k3612Q0081M9500L1333O543p5082p5960r4156N5748
18031A20945J70994L4961j09030N5595R8278k14249j03653Q5359K29116Q7021
18021D55337l039k37458j53620J42226l93j24359j13187j04190j5245J1385K4204
18010a18339L9507K43819o4604N8111J89198j80377k41621q5059J74658N3061
18000F8354O665N8863m5943L0700o0906m0703N7331Q3437O8921O2954R2713N2870
17988D35256j17416j57336P533J5560k5503n3494j03252P229M4027P3394J5446
17977A41444O1350k7970q4800j50489K176K6381K9109J0737P221M9981M6666m5015
$$ plain form
18053 -12503 -15088 -181479 -274411 -167998 -72235 -116401 -278701 -117274 98615 65748 149060
18042 149060 249370 166550 142938 223019 272519 303852 310395 235313 159353 65197 120945
18031 120945 291939 326900 217870 273465 371743 157494 53841 139200 368316 455337
18021 455337 452298 214840 61220 203446 203053 78694 -34493 -138683 -153928 -142543 -118339
18010 -118339 -78832 164987 100383 158494 347692 167315 -74306 -159365 15293 68354
18000 68354 75019 133882 87939 118639 57733 17030 74361 157798 226719 289673 382386 435256
17988 435256 317840 160504 168037 183597 158094 104600 1348 8577 52604 125998 141444
17977 141444 202794 174824 90024 -60465 -58289 -31908 -2799 7938 15159 65140 111806 66791
17965F6791l9869j05334j234J2146Q662J60577J0885j13902j12279M1471O0370
17954a1716j2668j4998m595M3011r0470J34732J62970J6362J18955k8927j25414
17943A87242m6121p2997J30148O2518j35112O7941N7467J78451K00230m5174K7192
17932F11785J88814L03855J34844J65816J02999p0326J40488J49178j2073O1540
17922A776920L5587O1562r0121m3247j03798O1567n2515k9740j64796k14650j57924
17911A078845j36358M0353j04662k84303j01624p5397o127r9468j23297J17739
17901C05701J57377q8876r4445j12272R725O0530j72909n2172o880K0055K0430
17890D6264j7948L0862q0833P1598j853j6813n2866j70963l2495M8193J69008
$$ plain form
17965 66791 26922 -78412 -79646 -67500 -58838 101739 112624 -1278 -113557 -72086 -11716
17954 -11716 -24384 -39382 -43977 -966 -91436 43296 206266 222628 341583 312656 187242
17943 187242 141121 68124 198272 260790 125678 193619 251086 429537 629767 584593 611785
17932 611785 800599 1104454 1239298 1405114 1508113 1437787 1578275 1727453 1715380 1776920
17922 1776920 1812507 1874069 1783948 1740701 1636903 1698470 1645955 1616215 1451419 1236769 1078845
17911 1078845 942487 982840 878178 593875 492251 416854 410727 311259 187962 305701
17901 305701 463078 374202 279757 167485 177210 237740 64831 12659 5779 25834 46264
17890 46264 28316 59178 -21655 49943 48090 31277 -21589 -192552 -225047 -176854 -7846
17879g846m2449r4642O1343J27936J45206j24930k20510N2252J31459Q6831j2259
17868A02391o3165M0525o4856q1543N7287L6069m8467K1321N7703o3710L288M166
17856A009P6416n2212o3084L1808m6487P7021J78647j08274j58424j01179O0098
17845a04661K09076J41815j12198J1073m9232J8654N9496j8534j6778o3062j55756
17834h0107n7339M3507J0771J12445J29620m3841j63082p1025R0778K0260q0691
17823h8704m0261o7500J12373J82894k995q7404k4123j62113N8463M6658L410
17812f9302p0929K4265J399j29971J53748O3519m1892j05052J8296J31764J23614
17801I9459K140m8394J2975L0351j72609j75820k7516K9961J09379M2789J09812
$$ plain form
17879 -7846 -50295 -144937 -83594 44342 189548 64618 -155892 -103640 27819 114650 102391
17868 102391 39226 79751 14895 -66648 -9361 26708 -21759 -438 57265 -6445 -3157 1009
17856 1009 77425 25213 -37871 -6063 -52550 24471 203118 94844 -63580 -164759 -104661
17845 -104661 104415 246230 134032 145105 95873 114527 174023 155489 138711 75649 -80107
17834 -80107 -137446 -93939 -83168 29277 158897 115056 -48026 -119051 -28273 -8013 -88704
17823 -88704 -128965 -196465 -84092 98802 95807 8403 -15720 -177833 -119370 -72712 -69302
17812 -69302 -140231 -115966 -114567 -244538 -90790 -27271 -69163 -174215 -155919 -24155 99459
17801 99459 101599 53205 66180 96531 -76078 -251898 -279414 -249453 -140074 -97285 12527
17790A2527J48498J5786k4408Q2641L1251L5344j32701j31354N6818O9174q709
17779A54867l2121M9187M5894Q4271p3292p9534m7080j72171j11406J65040K91656
17768B75311P3210q4520p5224n4693k6595n6987j26806n3103l9760j02778O4375
17757b07570J32423r0551L5308P2155P0394k7340k7522N0059P5420r3109n8940
17746f9273P7756J49582J1641l6579o3434p093l5386j84015Q7482O6653j04206
17735a06872M6407J70756J77821L6039R491k74704j00192P9381p6666k7669K53752
17724A87544n1300k93603j41315P4248K1592N3349m9045j75222L2056L3035J08612
17713b00049L8062J36575K45279j1474j37468k18459l139J68730J50840q9995
$$ plain form
17790 12527 161025 176811 152403 235044 266295 301639 168938 37584 94402 163576 154867
17779 154867 122746 171933 217827 302098 228806 149272 102192 -69979 -181385 -16345 275311
17768 275311 348521 264001 188777 134084 107489 50502 -76304 -129407 -169167 -271945 -207570
17757 -207570 -75147 -165698 -130390 -58235 12159 -15181 -42703 7356 82776 -10333 -69273
17746 -69273 8483 158065 169706 133127 69693 62600 27214 -156801 -69319 -2666 -106872
17735 -106872 -60465 110291 288112 324151 333642 58938 -41254 38127 -38539 -66208 187544
17724 187544 136244 -157359 -298674 -224426 -202834 -149485 -198530 -373752 -341696 -308661 -200049
17713 -200049 -161987 -25412 219867 208393 70925 -147534 -150673 18057 168897 78902
17703G8902J3380o1033j26905O6756o6799K3606r561j3089k8367K4699J35716
17692C7305m2467l5717p9688m4555l272j08825m01P9964P6444K8106m6598o4234
17680b03938k243q6924L7616J94574R1030j9577J2823N7158k20583k6776R634
17669a57206J0360m4582j53403J29887P1743J24854J38776J7774o191K8601q0256
17658H0357k51394m3919J48351l8174n8096J35292J46377p0758j18240K1182R9113
17647E0091q0881o8546m2189L4582j62222m3052J56147J44649n7115r7362n943
17636a71841O8166J48170J06444r5293q4500J0887j14417P9567J2426j27486N5305
17625a12572R1946M253J18954n4734j56192m9685K5900q2634k2312N9794J58528
$$ plain form
17703 78902 92282 31249 -95656 -28900 -95699 -72093 -81654 -94743 -123110 -98411 37305
17692 37305 -5162 -40879 -120567 -165122 -168394 -277219 -277620 -197656 -121212 -93106 -139704 -203938
17680 -203938 -206181 -293105 -255489 -60915 30115 10538 23361 80519 -140064 -166840 -157206
17669 -157206 -146846 -191428 -344831 -214944 -143201 -18347 120429 138203 132012 160613 80357
17658 80357 -171037 -214956 -66605 -104779 -162875 -27583 118794 48036 -70204 -49022 50091
17647 50091 -30790 -99336 -141525 -106943 -269165 -312217 -156070 -11421 -68536 -165898 -171841
17636 -171841 -103675 44495 150939 55646 -28854 -17967 -132384 -52817 -40391 -167877 -112572
17625 -112572 -20626 -16373 102581 47847 -108345 -158030 -132130 -214764 -237076 -177282 -18754
17614a8754J93905k3139j08587j86578R65J2282Q8891K5408P9623j20076o959
17603f3019q4863m7052P1504R0312J6514l6045k3588l4063L8775L1619m7753o2776
17591a50435J38172n339j18358N1949n8803J40072M2731L8251L7765J854m7374
17580G0485K1003j61223n3259M6068p6485p4042O2476J34061O2382N540j16817
17569g9811m4327j27046n4540J17966l7469O9244L9956l6825l0586J757j309J7015
17557a65975J39000l6301p9733j38862k7296J52086O6562N0007k7340P9638K4874
17546C6660M2406J5999j34577k035j95205k18842R9664N5862J51799J12237r7361
17535a33393N3660N7513R3139j01039r4240P318J53400J05580o2971r5139K1003
$$ plain form
17614 -18754 175151 152012 43425 -143153 -142188 -129906 -41015 -15607 64016 -56060 -63019
17603 -63019 -147882 -194934 -123430 -33118 -16604 -52649 -76237 -110300 -71525 -39906 -87659 -150435
17591 -150435 -12263 -17602 -135960 -84011 -142814 -2742 39989 78240 116005 117859 70485
17580 70485 91488 -69735 -122994 -76926 -153411 -227453 -164977 -30916 31466 37006 -79811
17569 -79811 -124138 -251184 -305724 -187758 -225227 -155983 -116027 -152852 -183438 -181681 -182990 -165975
17557 -165975 -26975 -63276 -143009 -281871 -309167 -157081 -90519 -40512 -67852 11786 36660
17546 36660 79066 95065 -39512 -41547 -236752 -455594 -355930 -300068 -148269 -36032 -133393
17535 -133393 -79733 -22220 70919 -30120 -124360 -117042 36358 141938 78967 -16172 4831
17524D831K0241P487j3940n0158R4524K856j04962P5342L3090q6553l9095M5465
17512a0872Q932J8527q6185k9947J37279p3983M410l4634q860p7270k5148N059
17500a72692J57616R3853r047k5036j17819n8128n7471R2289J93229R3158k57178
17489f7226j17077J01790K9917J7706R6230j66891P0783J0460n6816j17161P6908
17478a21377j0555J62204R7939r3714j09452k9419m8856J2830o1456J09379Q2900
17467i577K14475o6453j46700K2136m9667M3057J39064k191k48923j14771Q2033
17456a37517L2437J3362J74642P2286l2107l797j28927j57985j355o525j55345
17445c30831p1065K14699K3330K5137Q9275M4760r3828n4394k8617j1008M7651
$$ plain form
17524 4831 25072 32559 18619 -31539 62985 65841 -39121 36221 69311 -17242 -56337 -10872
17512 -10872 -1940 16587 -69598 -99545 37734 -36249 -31839 -66473 -75333 -152603 -177751 -172692
17500 -172692 -15076 78777 69730 44694 -73125 -131253 -188724 -96435 96794 189952 -67226
17489 -67226 -184303 -82513 -52596 -34890 61340 -105551 -34768 -24308 -81124 -198285 -121377
17478 -121377 -131932 30272 128211 34497 -74955 -104374 -153230 -140400 -201856 -92477 -9577
17467 -9577 204898 138445 -8255 13881 -35786 7271 146335 144144 -104779 -219550 -137517
17456 -137517 -105080 -91718 82924 155210 123103 119306 -9621 -167606 -168961 -175486 -330831
17445 -330831 -401896 -187197 -163867 -138730 -49455 -4695 -98523 -152917 -181534 -192542 -144891
17434a44891J3522J39435j9905k8299j57255p2889J64173K89585J9459j90161
17424A2774j33211J13070r969q8665j28690l4061J23934p84p03R0115O1871o4052
17412e8371J69969J8777J9323L271m2955j06868q8902j99235j9992J09458l8335
17401b33860l4891J62083M2806q9083J31952N740P044j59413j2348O7781Q3668
17390b8521N1948O4345j2670j1180k4446l5464l0847j67499R3680j133r4374J16892
17378g9269M261j76922j8359M076P6371p9909J17590o0360m5969Q4920J29790
17367d3780M516k14705j41957N4060J65459K73810o3562j34518j07526r763k8009
17356b45975N0890O0751j15667J04957J07941j3469Q928P1373j01282j3616l8834
$$ plain form
17434 -144891 -131369 8066 -11839 -40138 -197393 -270282 -106109 183476 202935 12774
17424 12774 -120437 -7367 -17336 -106001 -234691 -268752 -144818 -145602 -146305 -56190 5681 -58371
17412 -58371 111598 130375 149698 152969 110014 3146 -85756 -284991 -304983 -195525 -233860
17401 -233860 -268751 -106668 -63862 -152945 -20993 -15253 -8209 -167622 -179970 -112189 -28521
17390 -28521 23427 87772 75102 63922 39476 4012 -26835 -194334 -100654 -101787 -196161 -79269
17378 -79269 -75008 -251930 -270289 -266213 -189842 -269751 -152161 -212521 -258490 -173570 -43780
17367 -43780 -39264 -253969 -395926 -341866 -176407 97403 33841 -100677 -208203 -217966 -245975
17356 -245975 -195085 -134334 -250001 -145044 -37103 -50572 -41644 29729 -71553 -85169 -124003
17345a24003m0003K740j6794m7271j59520k643J62131L7455o4072N0897L6616
17334a64467j11045r4951K8314O5834J31938J06784l5774L0560M5450k8110O6770
17323D1303N2789J03482J71293j6769o8839j19078j07045R7390J09635m0652j42769
17312H0740j35519J20481j1511n8152N1574p8674q9107r3605Q2937J55082O2402
17301H6648j3312n0571p9521j09277R60J75226l5906j64210o518n1756K7739R9448
17289a21050M0083r2195o4899k270J09118p1462m002M8476k774k7082J1765j3291
17277a89583m6225o8604p1460K7773P6608J48890O8282L3801J02201M9077n9595
17266G1165j23193K9682j2394o0681j23119p8067K9457P9486K4579m7796j06780
$$ plain form
17345 -124003 -164006 -161266 -178060 -225331 -384851 -387494 -225363 -187908 -251980 -201083 -164467
17334 -164467 -275512 -370463 -342149 -276315 -144377 -37593 -73367 -42807 2643 -25467 41303
17323 41303 94092 197574 368867 352098 283259 164181 57136 154526 264161 223509 80740
17312 80740 -54779 65702 54191 -3961 47613 -31061 -120168 -213773 -130836 24246 86648
17301 86648 73336 22765 -56756 -166033 -165073 10153 -25753 -189963 -196481 -248237 -220498 -121050
17289 -121050 -80967 -173162 -238061 -240331 -131213 -202675 -206677 -158201 -160975 -188057 -176292 -189583
17277 -189583 -235808 -304412 -375872 -348099 -271491 -122601 -54319 -20518 81683 130760 71165
17266 71165 -52028 -22346 -34740 -95421 -218540 -296607 -267150 -187664 -163085 -210881 -317661
17255c17661k4465R8084M4740o7724j81094K5076L0309N059M6019j9769n1465
17244d12891J25751p2767p24l9897R4777J31531n2826q4402K37961J48303j20158
17233d5342j22105l7519q1793P3675m8981m3254J76862Q2858k8254M461o5583
17222a34975p0932J0177J48172J55031p3730k28416j44734P5461K9340P570j05522
17211c32558K6856P9093J36668p4208P355O3658R6713j80975k7339n0483j1398
17200b66618P9553J51674P8826j16351l6131m1880n8373k9880q1028J11549J48256
17189f0403L1333P8352m7715p8566j6555l4707m3129N2234k0001j43784M4289
17178b38652J16548P5331R3564L7967j57081r7276K9736Q1308o0227J32157J01006
$$ plain form
17255 -317661 -342126 -244042 -199302 -267026 -448120 -423044 -392735 -387676 -341657 -361426 -412891
17244 -412891 -287140 -359907 -360631 -400528 -305751 -174220 -227046 -311448 -73487 74816 -45342
17233 -45342 -167447 -204966 -286759 -213084 -262065 -305319 -128457 -45599 -73853 -69392 -134975
17222 -134975 -205907 -195730 -47558 107473 33743 -194673 -339407 -263946 -234606 -227036 -332558
17211 -332558 -305702 -226609 -89941 -164149 -156794 -93136 3577 -177398 -204737 -255220 -266618
17200 -266618 -187065 -35391 43435 -72916 -109047 -150927 -209300 -239180 -320208 -208659 -60403
17189 -60403 -29070 49282 1567 -76999 -93554 -128261 -171390 -119156 -139157 -282941 -238652
17178 -238652 -122104 -46773 46791 84758 -72323 -169599 -139863 -58555 -118782 13375 114381
17167A14381J39917p8746j25883l6365j04370o1977M8697K8292j8811q3810M581
17156a74094j57636j38554J2284R5718R5779J85503R8410L2578j1910o4761l18898
17145c45581m4831P5889N3969K31326O8139q250q8899j33235K6222Q7400j4714
17134i2565P3578J27660p1354N5867p3793j0699p4919n1361k0604O9309k1917
17123i0798k48884M3397J39581O0013O1121O0383j30759O332Q5053j32947J07958
17112c9550J76370m8814M7950j21133j97372r9684O758P4149j08349J22461J38864
17101d8350r7603l548K5921N433J61835P7112k2857Q6320j65924J3479q4988p0542
17089a23712n8668M9204L8186R974J19600j13430k33072J64966K44896N9806k32509
$$ plain form
17167 114381 254298 175552 49669 13304 -91066 -153043 -104346 -76054 -94865 -178675 -174094
17156 -174094 -331730 -470284 -458000 -362282 -266503 -81000 17410 49988 38078 -26683 -345581
17145 -345581 -390412 -314523 -260554 -29228 38911 30661 -58238 -191473 -165251 -77851 -92565
17134 -92565 -18987 108673 37319 93186 19393 8694 -66225 -117586 -138190 -68881 -90798
17123 -90798 -339682 -296285 -156704 -96691 -35570 24813 -105946 -99614 -14561 -147508 -39550
17112 -39550 136820 88006 135956 14823 -182549 -282233 -275475 -201326 -309675 -187214 -48350
17101 -48350 -145953 -149501 -123580 -118147 43688 120800 97943 184263 18339 31818 -53170 -123712
17089 -123712 -182380 -133176 -94990 -85016 34584 -78846 -311918 -146952 97944 157750 -74759
17078g4759r5269J56866j013l6654M297J9604M1269N6619L7980m0657o5064O6915
17066G0134K8058l9270L54O735j13484j19965r3226J63505J26669j7739r5713
17055h3942j85435j00470J6288J31529J06815q135l2312l3750J29425O4997m2181
17044c7171m4628L7521o037j89871o0137K22925j4223j16644N7876J29614R5556
17033G4781j09899r4594j6164O9733m5959Q6258L5087o1406n3802r97J27470J36175
17021A46683O1339j41874q8022P0434j828r7851M1407J31881j49625M6108R9143
17010A17795l3124j57476J7559J10245j08783M6306K0706R682n2943p5918p0157
16999a76108J16192J16654Q1234J1878Q0486j03948q0372o7755r2532j71542j1115
$$ plain form
17078 -74759 -170028 -13162 -14175 -50829 -46532 -26928 14341 70960 108940 68283 3219 70134
17066 70134 98192 58922 59276 66011 -47473 -167438 -260664 -97159 29510 11771 -83942
17055 -83942 -269377 -369847 -353559 -222030 -115215 -123350 -155662 -189412 -59987 5010 -37171
17044 -37171 -81799 -44278 -50315 -240186 -300323 -77398 -91621 -208265 -150389 -20775 74781
17033 74781 -35118 -129712 -145876 -76143 -122102 -35844 -757 -62163 -115965 -116962 10508 146683
17021 146683 208022 66148 -21874 48560 46732 -51119 -9712 122169 -27456 18652 117795
17010 117795 84671 -72805 -55246 54999 -53784 -7478 13228 22910 -30033 -105951 -176108
16999 -176108 -59916 56738 137972 149850 230336 126388 46016 -21739 -114271 -285813 -296928
16988b96928k5095l8468l7720O8985N7873j06228j2983j8153O7892L8522N7304
16977b44999l0080j8824P0156M6791j06225j69470J28726K22262M0973Q4275K9593
16966E3178K344j06613R1829N3600k7256L0057N8558P0653j46391m2990l8381
16955a412j221l6121j16804j35372Q7771J78910K1627r7001L7747n9043j3409
16944a34328j15546l2783J29583n8315N6567N343j43471M941J20812j932J1702
16933a57427l9199Q840J43661J09638l6357N775j15313j52301R5612J21022K9839
16922A3790j25938O1554P4577j5667l8283k6364L4276L6652o5562o8271K1878
16911i7358J45919O671p7986j16523q2466K9697m4872J4560o9495j80725M8568
$$ plain form
16988 -296928 -322023 -360491 -398211 -329226 -271353 -377581 -390564 -408717 -340825 -302303 -244999
16977 -244999 -275079 -293903 -223747 -176956 -283181 -452651 -323925 -101663 -60690 23585 53178
16966 53178 55522 -51091 40738 94338 67082 97139 155697 226350 79959 36969 -1412
16955 -1412 -2633 -38754 -155558 -290930 -203159 -24249 -2622 -99623 -61876 -120919 -134328
16944 -134328 -249874 -282657 -153074 -211389 -154822 -149479 -292950 -288009 -167197 -169129 -157427
16933 -157427 -196626 -187786 -44125 65513 29156 34931 -80382 -232683 -137071 -16049 13790
16922 13790 -112148 -50594 23983 8316 -29967 -56331 -22055 14597 -50965 -119236 -97358
16911 -97358 48561 55232 -22754 -139277 -221743 -192046 -236918 -222358 -291853 -472578 -424010
16900d24010J62094J71211r9940j46224M7125P1600R0195n4875J2442j6789K8659
16889a58512k2200n7580J03099N6329m6797m6616n9335j8604J45094J1127q6354
16878a80349m8554l2980j57182J1060J32392J5858L1838J39508o9152p7499J32957
16867a02103l4394j68942j51638J57601J46647N8414P5584k07000l7099L7580
16857b25350n0126J28879J61894p3540l3438j16195Q794J18239J5050J07511R9960
16846A41678k2489l4121j05498j4962m1991n4675j8042Q0146P4905K5889j09434
16835g8594n3404p0354l2453J9920q589P0502J68566j1301l7038p1746o4626n011
16823a74128o1262J38j4640q0529n9069R1236o2932Q5196K7973K839N2338l5757
$$ plain form
16900 -424010 -261916 -90705 -190645 -336869 -289744 -218144 -127949 -182824 -170382 -187171 -158512
16889 -158512 -180712 -238292 -135193 -78864 -125661 -172277 -231612 -250216 -105122 -93995 -180349
16878 -180349 -228903 -261883 -419065 -408005 -275613 -259755 -227917 -88409 -157561 -235060 -102103
16867 -102103 -136497 -305439 -457077 -299476 -152829 -94415 -18831 -225831 -262930 -225350
16857 -225350 -275476 -146597 15297 -58243 -91681 -207876 -199082 -80843 -65793 41718 141678
16846 141678 119189 85068 -20430 -35392 -77383 -132058 -150100 -69954 4951 30840 -78594
16835 -78594 -131998 -202352 -234805 -214885 -223474 -152972 15594 4293 -32745 -104491 -169117 -174128
16823 -174128 -235390 -235252 -249892 -330421 -389490 -298254 -361186 -275990 -248017 -245178 -192840 -228597
16811b28597K0805K5921O5901r2087j21878P294M6471K1667J00242l3403L2024
16800a55640j4177K4727J9434K9672j8179k0133k6932j99166K8282J77488J6938
16789a37686J1043P8819K8320R4077J0903k59980j20779J57703p2361P3862J34073
16778b006j41837q4495J19187J70123o907j80198K1570K68876M3950K0096n4036
16767A74323k14926p9108p149n0601P9028R3245o7681L0304J01696p9907k09802
16756b30578j11165p2843J25725j3035m9781M5237J8050R6763R8105Q1243j21931
16745a34210j0556j6464J35578J81149o9352j00560O0958m4345n7508P8663O1538
16734H4891l27698p6579L7486Q898K4340O5018P5814P7661l5089j83197j06655
$$ plain form
16811 -228597 -207792 -181871 -115970 -208057 -329935 -322641 -276170 -254503 -154261 -187664 -155640
16800 -155640 -169817 -145090 -125656 -95984 -114163 -134296 -161228 -360394 -332112 -154624 -137686
16789 -137686 -126643 -47824 -19504 74573 85476 -174504 -295283 -137580 -209941 -136079 -2006
16778 -2006 -143843 -228338 -109151 60972 54065 -126133 -104563 164313 208263 228359 174323
16767 174323 -40603 -119711 -126860 -177461 -98433 -5188 -72869 -42565 59131 -20776 -230578
16756 -230578 -341743 -414586 -288861 -301896 -351677 -306440 -288390 -191627 -93522 -12279 -134210
16745 -134210 -144766 -161230 -25652 155497 86145 -14415 46543 2198 -55310 23353 84891
16734 84891 -242807 -319386 -281900 -273002 -248662 -183644 -107830 -30169 -65258 -248455 -355110
16723c55110J41227N38r8458R338J79041k9269q8908M0989K4841J21782M1895
16712a2094j15098j44266j17846K6412J3040Q408L6913q79O4574j29953L485k9081
16700c96385J27018J2186j02181L4946N7494L9329Q5337L5864j15074j45011p9513
16689d45990R8531j8874r06l2003J18688r9982J0679N6292R4580n2604M4666l1829
16677b58752N9982o7943q848m1370J1634M0582Q2577O0067l8676r0977k9277j8171
16665b99172m8795j04981J3720M3340P1575O6603J05971K02000j27981J13125
16655C5405k6003l7876Q68Q78m6559o2119m9440R0463j5408j18302K860l7062
16643b62295m9093o4973N3235K1355k3214n0355K4935Q0389M7258J6221l6167
$$ plain form
16723 -355110 -213883 -213345 -311803 -302465 -123424 -152693 -241601 -200612 -175771 -53989 -12094
16712 -12094 -127192 -271458 -389304 -362892 -349852 -341444 -304531 -305410 -240836 -370789 -367304 -396385
16700 -396385 -269367 -257181 -359362 -324416 -266922 -227593 -142256 -106392 -221466 -366477 -445990
16689 -445990 -347459 -366333 -367239 -399242 -280554 -380536 -369857 -313565 -218985 -271589 -226923 -258752
16677 -258752 -198770 -266713 -275561 -316931 -305297 -264715 -182138 -122071 -160747 -251724 -281001 -299172
16665 -299172 -347967 -452948 -439228 -395888 -324313 -257710 -151739 50261 -77720 35405
16655 35405 9402 -28474 -27606 -26728 -73287 -135406 -184846 -94383 -109791 -228093 -225233 -262295
16643 -262295 -311388 -376361 -323126 -301771 -324985 -375340 -350405 -270016 -222758 -206537 -242704
16632b42704J39452J46883R2523m9075l1102J0611J8084K9440m2750j41284m1264
16621a11186J36436L6474m5931j35293J9743k0751L5073j73970j36399P2670J9760
16610c03374J36991J3368j21421j03735Q7097p275K6099j30270L238O1370J8977
16599c18935n6523J443J74779J98094k2631K7217J34488j6395m2488j41942K8952
16588c3941K3363j82321j62317p0628J12180J28224O3124j15585j08708m133r0
16577c50832R9150p264M950N970P643O5399R8292p2920J9732J22263M4853M4024
16565H1260l1718k7471n8196m2732O3827M7021r2372o0770O282k0947m0659j6424
16553a92899j612r2433K04930p5720j93981N0292K50949L5215j34963k2674q687
$$ plain form
16632 -242704 -103252 43631 136154 87079 55977 66588 84672 114112 71362 -69922 -111186
16621 -111186 25250 61724 15793 -119500 -99757 -120508 -85435 -259405 -395804 -323134 -303374
16610 -303374 -166383 -153015 -274436 -378171 -291074 -298349 -272250 -402520 -399282 -337912 -318935
16599 -318935 -375458 -374015 -199236 -1142 -23773 3444 137932 121537 79049 -62893 -33941
16588 -33941 -10578 -192899 -355216 -425844 -313664 -185440 -122316 -237901 -346609 -350742 -350832
16577 -350832 -251682 -258946 -253996 -248026 -240383 -174984 -76692 -149612 -129880 -7617 37236 81260
16565 81260 49542 22071 -36125 -78857 -15030 31991 -60381 -121151 -114869 -135816 -176475 -192899
16553 -192899 -194511 -286944 -82014 -157734 -351715 -301423 -50474 -15259 -150222 -172896 -181583
16542a81583m378L6507k5133k11096j16506J21918J59731J21088K1501n6437p4436
16531b08824m2852o5770l5062j0413R2496J22938J09428N3451k2055r8742r571
16520a14976k2627Q6810J32606P0347K4279j26099m2293j9474n0424p8601l7458
16509a77910J2985O0312R5311k51394r2620J11197K29p5483j37767K6136Q9170
16498c39834L0664j31749n5142P9175J24581J39383O9140K6334k6584K3734q4052
16487a44350J03158j8689j80963P699j5258j98207J03377l2408k5918J38687J00273
16476a62599k1902L7433k5142j72967n9226j8393J98014J99139l5027J47352K17240
16465C03922k8960j95616o7548p9965k3447o5057j07908J3066O3665l58L2414
$$ plain form
16542 -181583 -185961 -149454 -174587 -385683 -502189 -380271 -220540 -99452 -77951 -134388 -208824
16531 -208824 -251676 -317446 -352508 -362921 -270425 -147487 -38059 15392 -6663 -105405 -114976
16520 -114976 -137603 -50793 81813 152160 176439 50340 8047 -11427 -61851 -140452 -177910
16509 -177910 -164925 -104613 -9302 -260696 -353316 -242119 -241890 -317373 -455140 -429004 -339834
16498 -339834 -309170 -440919 -496061 -416886 -292305 -152922 -83782 -57448 -84032 -60298 -144350
16487 -144350 -41192 -59881 -240844 -233145 -248403 -446610 -343233 -375641 -401559 -262872 -162599
16476 -162599 -184501 -147068 -172210 -345177 -404403 -422796 -224782 -25643 -60670 86682 303922
16465 303922 274962 79346 11798 -68167 -91614 -156671 -264579 -251513 -187848 -188206 -155792
16454a55792j00041j0202q792j36643L1292J5800K18018J15907j6591j0407J0939
16443d6512Q042L296k8786R5858J0817j21671k09646O2482J20520n3117r2415
16432b51132J50925O4799L3173l9530l6540q6000M9230L709r1111J7754m0847
16421b25570j48304l2883P7667j01589P0026l8947P3001Q8795N4975m3997M3785
16410a83041r4263J23395J15254m7702J32914O3551j16688n5067J1076l8176n9132
16399a47879P2792j45623k60275J9539m2512L1922J35031J01962J32661P4409
16389b7973m2724p2104m0813P3517K3420O8366j26570q7858P974K743J05189L1542
16377h5291P7104m8164j58140l5134j436j01932J27659m0625p1069P3744n308
$$ plain form
16454 -155792 -255833 -266035 -274827 -411470 -380178 -364378 -146360 -30453 -47044 -57451 -46512
16443 -46512 -38470 -35174 -63960 31898 42715 -78956 -288602 -226120 -105600 -158717 -251132
16432 -251132 -100207 -35408 -2235 -41765 -78305 -164305 -115075 -111366 -202477 -184723 -225570
16421 -225570 -373874 -406757 -329090 -430679 -360653 -399600 -326599 -237804 -182829 -226826 -183041
16410 -183041 -277304 -153909 -38655 -86357 46557 110108 -6580 -61647 -50571 -88747 -147879
16399 -147879 -75087 -220710 -480985 -461446 -503958 -472036 -337005 -235043 -102382 -27973
16389 -27973 -70697 -142801 -183614 -110097 -86677 -18311 -144881 -232739 -224765 -222022 -116833 -85291
16377 -85291 -8187 -56351 -214491 -249625 -251061 -352993 -225334 -265959 -337028 -263284 -268592
16366b68592K6103K41765J1836p0627k8234k1392J24406L2377L1650n624j00923
16355b7255J7502P3050R1244m0980j09459r2135Q6313j32367L0390J0348J1571
16344h1778L2407J21281l5185l13178m9648K3039m5227q3215q544L9736J33429
16333b66883j8928j7717j1038k1409j12886k5603M3920k5894M9040R516J09508
16322b88374L7833M1798p8480j7972O6016j09596l6297n2750l140J02962J36927
16311b01073P1550k2008n5961K7536L885j730J15019j0155N7415r9651r916K12773
16299H7684J01291k09950l32281k082J21629K262N2930R9748q850j32510J13923
16288a06206J06061K9412o1607j07074K0507L2584j34891k3699j91754p8414J51083
$$ plain form
16366 -268592 -242489 -724 11112 -59515 -87749 -109141 15265 47642 79292 73668 -27255
16355 -27255 -9753 63297 154541 113561 4102 -88033 -1720 -134087 -103697 -93349 -81778
16344 -81778 -49371 71910 36725 -276453 -326101 -303062 -348289 -431504 -440048 -400312 -266883
16333 -266883 -285811 -303528 -314566 -335975 -448861 -474464 -430544 -456438 -407398 -397882 -288374
16322 -288374 -250541 -208743 -287223 -305195 -239179 -348775 -385072 -437822 -440962 -338000 -201073
16311 -201073 -129523 -151531 -207492 -179956 -176071 -177801 -62782 -72937 -15522 -115173 -125089 87684
16299 87684 188975 -20975 -353256 -355338 -233709 -231447 -178517 -78769 -87619 -220129 -106206
16288 -106206 -145 29267 -32340 -139414 -118907 -86323 -221214 -244913 -436667 -515081 -363998
16277c63998J93112Q9968r4205l9413n0699J6324l7685k02596Q8362K02733O6098
16266a31999l4876n513N2617k6767M9936r506P1613n227m6446k08227N475J96022
16254i2898J09261k3111j73844l9559R5160O6969j7083j21668J508j6813N7365
16243a54713J43622J17553O9131k04O8067L5147p0025j95855l2737J06518j08333
16232b1829o1379N490n6092j00258j31295O3320J68259P7374q6004o5981M8526
16221a59869N4269m6031q0730m554J7244L8195j3260l8419N4543J87772N9040
16210F8200j80666j7655m528j52655q7543P9779L6179O7534Q0010p9316J6039
16199a74622N9237m2994q6290j7010J47428L6304m7880K5842k2598n2169J41626
$$ plain form
16277 -363998 -170886 -80918 -175123 -214536 -265235 -248911 -286596 -489192 -400830 -198097 -131999
16266 -131999 -166875 -172388 -119771 -146538 -96602 -106108 -34495 -39722 -86168 -294395 -288920 -92898
16254 -92898 16363 -6748 -180592 -220151 -124991 -58022 -75105 -196773 -195265 -212078 -154713
16243 -154713 -11091 106462 175593 175389 243456 278603 208578 12723 -20014 86504 -21829
16232 -21829 -83208 -77718 -133810 -234068 -365363 -302043 -133784 -56410 -142414 -208395 -159869
16221 -159869 -105600 -151631 -232361 -236915 -219671 -181476 -194736 -233155 -178612 9160 68200
16210 68200 -112466 -130121 -134649 -287304 -374847 -295068 -258889 -191355 -111345 -190661 -174622
16199 -174622 -115385 -158379 -244669 -261679 -114251 -77947 -125827 -99985 -122583 -174752 -33126
16188c3126R1308n7482r0771k3939R4451R4362N6662j41131j40068M289j4396
16177a59841j034k4570J66867J07940o5229p4605J1552n0029m9147P2781j64733
16166b30048k22019j29269Q8822J31064M4381Q5179j41285j23910J0039J63237
16156c23809N3369L9627R4387J87512Q9780p0103k23660l7562k2859m1044J58906
16145i5456J29515j27391j67578j0201j5935k085J27019o8160j3089J5524k3473
16134b51310o772p2756O6616J91953Q0651j11915q6134q9102K29947O7942P0743
16123H9863P0297j19992j03388K1417j45816J24192K10754O2570j71358K7675
16113F6214R7058Q2699j25621L8109q82k13735j15689l7242k2817J6139N5738
$$ plain form
16188 -33126 58182 700 -90071 -114010 -19559 74803 131465 -9666 -149734 -145445 -159841
16177 -159841 -160875 -185445 -18578 89362 24133 -50472 -38920 -88949 -138096 -65315 -230048
16166 -230048 -452067 -581336 -492514 -361450 -317069 -231890 -373175 -497085 -487046 -323809
16156 -323809 -270440 -230813 -136426 51086 140866 70763 -152897 -190459 -213318 -254362 -95456
16145 -95456 34059 -93332 -260910 -271111 -287046 -289131 -162112 -230272 -243361 -227837 -251310
16134 -251310 -258082 -330838 -264222 -72269 8382 -103533 -189667 -278769 -48822 19120 89863
16123 89863 160160 40168 -63220 -41803 -187619 -63427 147327 209897 38539 66214
16113 66214 163272 245971 120350 158459 157577 -56158 -171847 -209089 -231906 -215767 -160029
16102a60029j9832l670K12759Q0414j90128j32423p6416k3634J05007o0724l0322
16091b98998K5847N1852m5353p0514l8020M7216o4844K4863o646j28131J93961
16080c08767N9318K9338o8857l4642p233J0348O1994p1693Q1860L2847N1318K6434
16068a37735K3379m4921j5309o7632j0696L6950O0054P6809j34425j25620O7864
16057b71282k3809l4985R347N5619J20108M1251m1588l8249r4519k6218R6972
16046b07353N7250k9312l0462o0274O552R2748J22049J50707o0381k5534j20576
16035a04586r0510J54954J11838N5697o3400k9986J1668R0566j76893r4879P9404
16024e6127j7317M783J0133q8363r8025N2274j73235j65311Q8017P0416P0948
$$ plain form
16102 -160029 -179861 -183531 29228 109642 -80486 -212909 -289325 -312959 -207952 -268676 -298998
16091 -298998 -273151 -221299 -266652 -337166 -375186 -327970 -392814 -367951 -374597 -502728 -308767
16080 -308767 -249449 -220111 -288968 -323610 -330843 -320495 -258501 -330194 -248334 -215487 -164169 -137735
16068 -137735 -114356 -159277 -174586 -242218 -252914 -215964 -155910 -79101 -213526 -339146 -271282
16057 -271282 -295091 -330076 -320729 -265110 -145002 -103751 -145339 -183588 -278107 -304325 -207353
16046 -207353 -150103 -179415 -209877 -270151 -263599 -170851 -48802 101905 41524 15990 -104586
16035 -104586 -195096 -40142 71696 127393 63993 34007 45675 136241 -40652 -135531 -56127
16024 -56127 -73444 -68661 -58528 -146891 -244916 -192642 -365877 -531188 -443171 -372755 -301807
16013c01807j36817K2346J78212k5229k8085L9580N3221L3997J18600l0876r2015
16002a68873P7153P246p6320L5355K5507j33318k214n756J73569J17378l3270
15991A6457j09312K1279K5098K5578K7507p4464m8537L2871K6798O3659r4100
15980h7166r0810J10523j3682j93647m0586O3974R6993j5908R6071P0906k5153
15969b8485j38794l9675R3408P0398l951j1830j38269j34003L4565J80106N5055
15958f1475j05461n4718N1206J39215O7847J2412n4200L5758j1301K591j6681
15947E193j05303j99097R0458J54531K9898j16195O423M0929Q307J6461k9656
15936i8051j67396J06707J69402n3442j1468J50726O785l7928j28189l8827j78992
$$ plain form
16013 -301807 -438624 -416278 -238066 -263295 -291380 -251800 -198579 -164582 -45982 -76858 -168873
16002 -168873 -91720 -84474 -160794 -125439 -99932 -233250 -235464 -241220 -67651 49727 16457
15991 16457 -92855 -71576 -46478 -20900 6607 -67857 -116394 -83523 -56725 6934 -87166
15980 -87166 -177976 -67453 -81135 -274782 -315368 -251394 -154401 -170309 -74238 -3332 -28485
15969 -28485 -167279 -206954 -113546 -43148 -47099 -58929 -197198 -331201 -296636 -116530 -61475
15958 -61475 -166936 -221654 -170448 -31233 36614 49026 -5174 30584 19283 21874 5193
15947 5193 -100110 -299207 -208749 -54218 -24320 -140515 -134092 -93163 -84856 -68395 -98051
15936 -98051 -265447 -158740 10662 -42780 -54248 96478 103263 65335 -62854 -101681 -280673
15925b80673o0416K05984J88597K5759q9841L1043M070n1308q1174o6539K8876
$$ plain form
15925 -280673 -341089 -135105 53492 79251 -10590 20453 24523 -26785 -107959 -174498 -145622
$$ [...]
##END NTUPLES=NMR SPECTRUM
##END=
