##TITLE=Analysis number 327359
Compound Code sb 01670
Book Reference 68320
Project Code adrs flro3
Chemist Name jom
##JCAMPDX= 6.0         $$ Bruker NMR JCAMP-DX V2.0
##DATA TYPE= NMR SPECTRUM
##DATA CLASS= NTUPLES
##ORIGIN= Bruker BioSpin GmbH
##OWNER= nmr
$$ XWIN-NMR		Version 3.5
$$ Thu Mar 22 12:39:30 2007 GMT Standard Time (UT+0h)  MAYBRIDGE\nmr@NMR_250MHZ
##.OBSERVE FREQUENCY= 250.131544655141
##.OBSERVE NUCLEUS= ^1H
##.ACQUISITION MODE= SIMULTANEOUS (DQD)
##.ACQUISITION SCHEME= undefined
##.AVERAGES= 16
##.DIGITISER RES= 18
##SPECTROMETER/DATA SYSTEM= dpx250
##.PULSE SEQUENCE= zg30
##.SOLVENT NAME= DMSO
##.SHIFT REFERENCE= (INTERNAL, DMSO, 0, 16.522)
##AUDIT TRAIL= $$ (NUMBER, WHEN, WHO, WHERE, WHAT)
$$ ##TITLE= Audit trail, XWIN-NMR		Version 3.5
$$ ##JCAMPDX= 5.01
$$ ##ORIGIN= Bruker BioSpin GmbH
$$ ##OWNER= nmr
$$ C:\u/data/dgb/nmr/ADRS/1670/pdata/1/auditp.txt
$$ ##AUDIT TRAIL=  $$ (NUMBER, WHEN, WHO, WHERE, WHAT)
(   1,<2007-03-22 12:38:54.11 +000>,<MAYBRIDGE\nmr>,<NMR_250MHZ>,
      <created by zg, POWCHK disabled, PULCHK disabled
       configuration hash MD5:
       49 4B E0 1D 92 C2 6B 37 9F E6 65 BC 52 41 86 1D
       data hash MD5: 64K
       6A D1 4D FF 31 CE 7D 56 99 20 72 47 91 D5 E4 08>)
(   2,<2007-03-22 12:39:11.80 +000>,<MAYBRIDGE\nmr>,<NMR_250MHZ>,
      <Start of raw data processing
       ef LB = 0.3 FT_mod = 6 PKNL = 1 SI = 32K 
       data hash MD5: 32K
       92 81 53 2E E0 D1 40 5A 14 7B EB B2 4F D2 21 EF>)
(   3,<2007-03-22 12:39:17.64 +000>,<MAYBRIDGE\nmr>,<NMR_250MHZ>,
      <apk 
       data hash MD5: 32K
       72 A4 5F BD 61 97 21 99 6D CC 4A 3C D4 00 E8 01>)
(   4,<2007-03-22 12:39:19.24 +000>,<MAYBRIDGE\nmr>,<NMR_250MHZ>,
      <abs ABSG = 5 
       data hash MD5: 32K
       6A 0B 14 7F 5F 2E 7B 08 45 B9 A1 F1 04 0B 96 2B>)
$$ ##END=
$$ 
$$ hash MD5
$$ 88 93 7F EA 0D D1 AB 76 88 A4 23 EF 09 59 4A 10
##$RELAX= 
##$RELAX= 
##$RELAX= 
##$RELAX= 
##$RELAX= 
##$RELAX= 
##$RELAX= 
$$ Bruker specific parameters
$$ --------------------------
##$DU= <C:\u>
##$EXPNO= 1670
##$NAME= <ADRS>
##$PROCNO= 1
##$TYPE= <nmr>
##$USER= <dgb>
##$AMP= (0..31)
100 100 100 100 100 100 100 100 100 100 100 100 100 100 100 100 100 100 
100 100 100 100 100 100 100 100 100 100 100 100 100 100 
##$AQSEQ= 0
##$AQ_mod= 3
##$AUNM= <au_zg>
##$AUTOPOS= <26 >
##$BF1= 250.13
##$BF2= 250.13
##$BF3= 250.13
##$BF4= 250.13
##$BF5= 500.13
##$BF6= 500.13
##$BF7= 500.13
##$BF8= 500.13
##$BYTORDA= 1
##$CFDGTYP= 0
##$CFRGTYP= 5
##$CHEMSTR= <none>
##$CNST= (0..31)
1 1 145 1 1 1 1 1 1 1 1 1 1 1 1 1 1 1 1 1 1 1 1 1 1 1 1 1 1 1 1 1 
##$CPDPRG= <>
##$CPDPRG1= <>
##$CPDPRG2= <>
##$CPDPRG3= <>
##$CPDPRG4= <mlev>
##$CPDPRG5= <mlev>
##$CPDPRG6= <mlev>
##$CPDPRG7= <mlev>
##$CPDPRG8= <mlev>
##$CPDPRGB= <>
##$CPDPRGT= <>
##$D= (0..31)
0 1 0 0 0 0 0 0 0 0.06 0 0 0 0 0 0 0.0002 0 0 0 0 0 0 0 0 0 0 0 0 0 0 
0 
##$DATE= 1174567132
##$DBL= (0..7)
120 120 120 120 120 120 120 120 
##$DBP= (0..7)
150 150 150 150 150 150 150 150 
##$DBP07= 0
##$DBPNAM0= <>
##$DBPNAM1= <>
$$ [...]
##$SUBNAM7= <"">
##$SUBNAM8= <"">
##$SUBNAM9= <"">
##$SW= 20.6930455092707
##$SWIBOX= (0..15)
0 0 3 0 0 0 0 0 0 0 0 0 0 0 0 0 
##$SW_h= 5175.983436853
##$TD= 65536
##$TD0= 1
##$TE= 683.16
##$TE2= 300
##$TE3= 300
##$TEG= 300
##$TL= (0..7)
0 120 120 120 120 120 120 120 
##$TP= (0..7)
150 150 150 150 150 150 150 150 
##$TP07= 0
##$TPNAME0= <>
##$TPNAME1= <>
##$TPNAME2= <>
##$TPNAME3= <>
##$TPNAME4= <>
##$TPNAME5= <>
##$TPNAME6= <>
##$TPNAME7= <>
##$TPOAL= (0..7)
0.5 0.5 0.5 0.5 0.5 0.5 0.5 0.5 
##$TPOFFS= (0..7)
0 0 0 0 0 0 0 0 
##$TUNHIN= 0
##$TUNHOUT= 0
##$TUNXOUT= 0
##$USERA1= <user>
##$USERA2= <user>
##$USERA3= <user>
##$USERA4= <user>
##$USERA5= <user>
##$V9= 5
##$VALIST= <valist>
##$VCLIST= <CCCCCCCCCCCCCCC>
##$VD= 0
##$VDLIST= <DDDDDDDDDDDDDDD>
##$VPLIST= <PPPPPPPPPPPPPPP>
##$VTLIST= <TTTTTTTTTTTTTTT>
##$WBST= 1024
##$WBSW= 4
##$XGAIN= (0..3)
0 0 0 0 
##$XL= 0
##$YL= 0
##$YMAX_a= 300052
##$YMIN_a= -445832
##$ZGOPTNS= <>
##$ZL1= 120
##$ZL2= 120
##$ZL3= 120
##$ZL4= 120
##$ABSF1= 16.522
##$ABSF2= -4.171173
##$ABSG= 5
##$ABSL= 3
##$ALPHA= 0
##$AQORDER= 0
##$ASSFAC= 0
##$ASSFACI= 0
##$ASSFACX= 0
##$ASSWID= 0
##$AUNMP= <proc_1d>
##$AZFE= 0.1
##$AZFW= 0.1
##$BCFW= 0
##$BC_mod= 0
##$BYTORDP= 0
##$COROFFS= 0
##$CY= 12.5
##$DATMOD= 1
##$DC= 0
##$DFILT= <>
##$DTYPP= 0
##$F1P= 14.0000005364418
##$F2P= -0.99999901652339
##$FCOR= 0.5
##$FTSIZE= 32768
##$FT_mod= 6
##$GAMMA= 0
##$GB= 0
##$INTBC= 1
##$INTSCL= 1
##$ISEN= 128
##$LB= 0.3
##$LEV0= 0
##$LPBIN= 0
##$MAXI= 10000
##$MC2= 0
##$MEAN= 0
##$ME_mod= 0
##$MI= 0
##$NCOEF= 0
##$NC_proc= -4
##$NLEV= 6
##$NOISF1= 0
##$NOISF2= 0
##$NSP= 0
##$NTH_PI= 0
##$NZP= 0
##$OFFSET= 16.522
##$PC= 1
##$PHC0= 218.8338
##$PHC1= 7.658285
##$PH_mod= 1
##$PKNL= yes
##$PPARMOD= 0
##$PSCAL= 4
##$PSIGN= 0
##$REVERSE= no
##$SF= 250.13
##$SI= 32768
##$SIGF1= 0
##$SIGF2= 0
##$SINO= 400
##$SIOLD= 32768
##$SREGLST= <1H.DMSO>
##$SSB= 0
##$STSI= 32768
##$STSR= 0
##$SW_p= 5175.98343685301
##$SYMM= 0
##$S_DEV= 0
##$TDeff= 65536
##$TDoff= 0
##$TI= <Analysis number 999999
Compound Code 99
Book Reference 9
Project Code 9>
##$TILT= no
##$TM1= 0
##$TM2= 0
##$TOPLEV= 0
##$USERP1= <user>
##$USERP2= <user>
##$USERP3= <user>
##$USERP4= <user>
##$USERP5= <user>
##$WDW= 1
##$XDIM= 32768
##$YMAX_p= 339889518
##$YMIN_p= -138476
$$ End of Bruker specific parameters
$$ ---------------------------------
##NTUPLES= NMR SPECTRUM
##VAR_NAME=  FREQUENCY,     SPECTRUM/REAL,   SPECTRUM/IMAG
##SYMBOL=    X,             R,               I
##VAR_TYPE=  INDEPENDENT,   DEPENDENT,       DEPENDENT
##VAR_FORM=  AFFN,          ASDF,            ASDF
##VAR_DIM=   32768,         32768,           32768
##UNITS=     HZ,            ARBITRARY UNITS, ARBITRARY UNITS
##FACTOR=    0.157963299565203, 1,           1
##FIRST=     4132.6476996994, 0,             0
##LAST=      -1043.33573715361, 0,           0
##MIN=       -1043.33573715361, -138476,     0
##MAX=       4132.6476996994, 339889518,     0
$$ Real data points
##PAGE= N=1
##DATA TABLE= (X++(R..R)), XYDATA
$$ [...]
17486C621480O2089O1605O5308J13063Q9571O9076P5475J21966Q8399R8591J14486
17475D581109J22082R6032J14899J00402J46345J44925J40897J82284J60620J53504
17465E943099J22980J41545J88526J80389J60208J78261K54191K39285K10997
17456G619481K11121K46862K57450K82952K69590K91809L20546L00261L16899
17447A0116971L29450L73934L89002L98058M24250M44996M52327M71400M96418
17438A3896806M94926M76644N58940O13010N48855N37986N94674O37820O51179
17429A9010840P03710P09708P09213P17614P08238P31469P39607P17422P32355
17420B5480176P11131P19597O89561O60394O61059O34672N84707N65702N02823
$$ y = [3621480, 3683569, 3745174, 3810482, 3923545, 4013116, 4082192, 4157667, 4279633, 4368032, 4466623, 4581109, 4703191, 4799223, 4914122, 5014524, 5160869, 5305794, 5446691, 5628975, 5789595, 5943099, 6066079, 6207624, 6396150, 6576539, 6736747, 6915008, 7169199, 7408484, 7619481, 7830602, 8077464, 8334914, 8617866, 8887456, 9179265, 9499811, 9800072, 10116971, 10446421, 10820355, 11209357, 11607415, 12031665, 12476661, 12928988, 13400388, 13896806, 14391732, 14868376, 15427316, 16040326, 16589181, 17127167, 17721841, 18359661, 19010840, 19714550, 20424258, 21133471, 21851085, 22559323, 23290792, 24030399, 24747821, 25480176, 26191307, 26910904, 27600465, 28260859, 28921918, 29556590, 30141297, 30706999, 31209822]
17411C1209822M57576M10320L54180L01721K43490K08363J38208O4448K6215j75
17401C3414168n8101j73132k00444k28583k90507l76734l77069m40589m76783
17392C0792226n45083n99731o27144o24522o50832o78933p18207p20024p42950
17383B4884800p23468p33993p10123p08173p12181o86834p00056o83211o77619
17374A8549142o65705o07817n38212n67893n51622n39022n65296n43129m86447
17365A3483999m50381m67013m67654m39983m02365l51205l60251l27578l03445
17356I914124l24365k97870k63519k33592l01138k84777k17882k18425k33971
17347G538585k10022j94160k14546j79938j76095j79120j95360j74809j49001
$$ y = [31209822, 31667398, 32077718, 32431898, 32733619, 32977109, 33185472, 33323680, 33388128, 33414343, 33414168, 33356067, 33182935, 32982491, 32753908, 32463401, 32086667, 31709598, 31269009, 30792226, 30247143, 29647412, 29020268, 28395746, 27744914, 27065981, 26347774, 25627750, 24884800, 24161332, 23427339, 22717216, 22009043, 21296862, 20610028, 19909972, 19226761, 18549142, 17883437, 17275620, 16737408, 16169515, 15617893, 15078871, 14513575, 13970446, 13483999, 13033618, 12566605, 12098951, 11658968, 11256603, 10905398, 10545147, 10217569, 9914124, 9589759, 9291889, 9028370, 8794778, 8493640, 8208863, 7990981, 7772556, 7538585, 7328563, 7134403, 6919857, 6739919, 6563824, 6384704, 6189344, 6014535, 5865534]
17338E865534j34589j55201j54598j74797j14655q5245j12520j23306j09398j05014
17328D596211r5499j05835j20354j45873p3416q0014r1654n2238l0101k4127m9802
17317C727298m5554n6052j8109L007j4851r4689n5603j8512j5535o9659o9188
17306C272553q2014o8886n0946m0448l0440m9103l0541j4784r6902j02532r525
17295B696432J8903j8182O410k1994l0327l4619k4819m694N86k1156o6732m4048
17283B455760k5588j1390j7451m9569J0277M7199m251O5261J5521L723l203M2398
17271B528687O9921J04063P6890N4285P8455P6318P0834P5625J05742J30765J02884
17260C474469O9672L6119K005k3030m5352j6916Q3058J28101J93325K35021K83872
$$ y = [5865534, 5730945, 5575744, 5421146, 5246349, 5131694, 5046449, 4933929, 4810623, 4701225, 4596211, 4500712, 4394877, 4274523, 4128650, 4055234, 3975220, 3883566, 3831328, 3801227, 3777100, 3727298, 3681744, 3625692, 3607583, 3610590, 3595739, 3501050, 3445447, 3426935, 3411400, 3341741, 3272553, 3190539, 3121653, 3070707, 3030259, 2999819, 2950716, 2920175, 2905391, 2808489, 2705957, 2696432, 2715335, 2697153, 2703563, 2681569, 2651242, 2616623, 2591804, 2587110, 2587696, 2566540, 2499808, 2455760, 2430172, 2418782, 2401331, 2351762, 2362039, 2409238, 2404987, 2470248, 2485769, 2489492, 2486289, 2528687, 2598608, 2702671, 2779561, 2833846, 2912301, 2988619, 3059453, 3135078, 3240820, 3371585, 3474469, 3544141, 3580260, 3582265, 3559235, 3513883, 3496967, 3580025, 3708126, 3901451, 4136472, 4420344]
17249D420344M16767N06594O14796Q18150R43957J132278J345736J565405J880867
17240A3644894K350313K962256L440492L147180J468677j190725k807785k571665
17232B0443637j454412j98178R61144K164239L472259N202025P677658J1180687
17224D9449059J5779386K1161274K7613477L5019552M0511267L7062396J6669365
17217B43265776j4476767l4269090l6766517l2185066k6564190j9593052j2349474
17210F7061620o359339j886478J372112L663491M531082K654119k629358q837407
17202E9569842j1599127j0439592p853655n468845l687852k409929j544909j026191
17194A5539742p59314o23461n22477l20847p6396J87670L36002N63541J002722
$$ y = [4420344, 4837111, 5343705, 5958501, 6776651, 7720608, 8852886, 10198622, 11764027, 13644894, 15995207, 18957463, 22397955, 25545135, 27013812, 25823087, 23015302, 20443637, 18989225, 18791047, 19752191, 21916430, 25388689, 30590714, 38268372, 49449059, 65228445, 86389719, 114003196, 149022748, 189534015, 226596411, 243265776, 228789009, 194519919, 157753402, 125568336, 99004146, 79411094, 67061620, 60702281, 58815803, 60187915, 63851406, 68382488, 71036607, 68407249, 59569842, 47970715, 37531123, 29677468, 24208623, 20520771, 18110842, 16565933, 15539742, 14780428, 14156967, 13634490, 13313643, 13237247, 13424917, 13760919, 14324460, 15327182]
17185A5327182J663832K638206L833644N117678O542416Q117983R109744Q274415
17177F0625100M237943j664808n189306m299799p34197L746069Q561569J3750309
17169G9032880J8930819K2903472K4360791K3504792K0130115R522930j2026918
17162A86358881l4761692m0846655l2470508k1971342j4051825q970330n934455
17155B7352074m046806k876293k056687j392733p07785j3563O62073J255330J519049
17146A9694659J015311n06432k397784l144616k759422j999782j416761j079447
17138G405726r04244q08586o75783m90158m18299l86767l17387k70142k81151
17129B853209k21510j63644j37324j31683j63187j19264r6467n6233p3356q7054
$$ y = [15327182, 16991014, 19629220, 23462864, 28580542, 35122958, 43240941, 52350685, 60625100, 64863043, 63198235, 58008929, 53709130, 52974933, 56721002, 65282571, 79032880, 97963699, 120867171, 145227962, 168732754, 188862869, 198385799, 186358881, 151597189, 110750534, 78280026, 56308684, 42256859, 33286529, 27352074, 23305268, 20428975, 18372288, 16979555, 16271770, 16258207, 16920280, 18175610, 19694659, 20709970, 20203538, 17805754, 14661138, 11901716, 9901934, 8485173, 7405726, 6501482, 5692896, 5017113, 4526955, 4108656, 3721889, 3404502, 3134360, 2853209, 2631699, 2468055, 2330731, 2199048, 2035861, 1916597, 1820130, 1763897, 1690541, 1603487]
17119A603487p6586n3295j26328p5746L85k395j5742p3114k5454n5615q6733r6160
17107I16704m4028j7860j9371k7193k9048l0978k6538J4196Q502k5911j6239m8362
17095F53874l1274j3358J7429K991l7572K772k7078q75n7852J0051L0926K0231
17083E70265K440J8992J3425j1251j7288P495q251J0035j1654K3448m094p943
17071E85619j8440l9140j7775k1117o1169q311j223M7862O3138j9763m8011p130
17059D54540J9219J7249l7990m425l5152m0535l2767L3519J6997R121p479J7495
17047D09792p24k6184k756j2582k4548j1400j1256m6402r435J6228R284n817J4606
17034B98806q243l5623K511N755K8057m450M4232M4523J7152P070N204p0220k5550
$$ y = [1603487, 1526901, 1473606, 1347278, 1271532, 1271917, 1269522, 1253780, 1180666, 1155212, 1099597, 1012864, 916704, 872676, 854816, 835445, 808252, 779204, 748226, 721688, 735884, 744386, 718475, 702236, 653874, 622600, 609242, 626671, 629662, 592090, 594862, 567784, 566909, 509057, 519108, 550034, 570265, 572705, 591697, 605122, 593871, 576583, 584078, 575827, 585862, 574208, 597656, 593562, 585619, 567179, 528039, 510264, 489147, 427978, 419667, 418444, 466306, 529444, 509681, 461670, 454540, 473759, 491008, 453018, 448593, 413441, 372906, 340139, 373658, 390655, 399776, 392297, 409792, 409068, 382884, 380128, 367546, 342998, 331598, 320342, 273940, 264505, 280733, 290017, 284200, 298806, 290563, 254940, 257451, 263206, 291263, 286813, 331045, 375568, 392720, 399790, 404994, 334774, 309224]
17021C09224N7576K7716j5147k0926j086j0774j9383k5421k1862k7178j1813k1776
17009B19150J1058L8093M069Q03l1463J9921k4975J7410L672l5529k7491k6960
16997A67758L6441M698j5418J26N3196k1118J989k2601j0466o72p322K876Q537
16984A98024J1260J7482k104n5187j5274J0961j5476J3072K4769o957J5731q450
16972A87851K0418j6668M034J9592M2051N520M001j5816r63m3042p813J8371R366
16959B26902k2481J8168j133Q878L974m6164l1034J090K4801j929n0380k0982
16947A09710j1094M783L0584K327k5207l154J814J0253K4016K5683k570l5565
16935A31580k2069j5840N015J6586M4873K5377n925M7367Q395n2723m544L8901
$$ y = [309224, 366800, 394516, 379369, 358443, 357357, 346583, 327200, 301779, 279917, 252739, 240926, 219150, 230208, 268301, 272370, 273173, 241710, 261631, 236656, 254066, 257738, 222209, 194718, 167758, 204199, 208897, 193479, 193605, 246801, 225683, 227672, 205071, 194605, 193933, 186611, 189487, 198024, 209284, 226766, 224662, 169475, 154201, 165162, 149686, 162758, 187527, 180570, 196301, 187851, 208269, 191601, 195635, 215227, 257278, 262798, 266799, 250983, 250020, 206978, 199165, 217536, 226902, 204421, 222589, 221456, 230334, 234308, 188144, 157110, 158200, 183001, 181072, 130692, 109710, 98616, 103399, 133983, 136310, 111103, 107949, 109763, 120016, 144032, 169715, 167145, 131580, 109511, 93671, 98686, 115272, 160145, 185522, 179597, 226964, 235359, 182636, 178092, 216993]
16923B16993l689k0582k8626J491M073j1740l4510m8792M794L123J2330l839N1494
16910A42520J004J6407j4755P38Q991K2144J6937o941l7954r227j2089J7755J2075
16897A57605k2612k1172j2697k354q461j0290j2926L9155J2863J290k7821R933
16885A02513o743Q063j4099k4035j8308j3820J1758Q1767J8020k7096r925m0263
16873F7832o045R616M671O545p680l510k0757Q063R369J3034K6647K224J2456
16860A22465r863K0521n580p217o719K0426R356j4165m6764m8070J551J7208k0683
16847C2466N0720L2933k496O359J482q651j9936k5354R097J0797l022J6416R326
16834A10137m9726m7227L1590M9436m3645j1538n907K1900L0399k0733K0046J8150
$$ y = [216993, 213304, 192722, 164096, 165587, 169660, 157920, 123410, 74618, 79412, 82535, 94865, 91026, 142520, 143524, 159931, 145176, 145914, 154905, 177049, 193986, 187045, 149091, 139864, 127775, 145530, 157605, 134993, 113821, 101124, 98770, 90309, 80019, 67093, 106248, 119111, 120401, 92580, 102513, 95770, 103833, 89734, 65699, 47391, 33571, 45329, 127096, 145116, 118020, 108095, 67832, 61787, 71403, 76074, 82619, 74939, 71429, 50672, 58735, 68104, 81138, 107785, 110009, 122465, 112602, 133123, 127543, 120326, 113607, 134033, 143389, 129224, 82460, 34390, 35941, 53149, 32466, 83186, 116119, 113623, 119982, 121464, 112813, 92877, 67523, 76620, 87417, 84395, 100811, 110137, 60411, 13184, 44774, 94210, 50565, 39027, 33120, 55020, 85419, 64686, 84732, 102882]
16822A02882k2490j8425k3716r427J3060M265k7077j4442l2258M0892K2547Q602
16810D4413O934J5665M0446J1877j8295J2386K0420m3605k1700J1641K1323p713
16798I3792m9210o624J38r95K8689K0420M134j9294k6843l2646R85L5155r105
16785C8596K3092J3155J2828j9j2280l1450j1042J720J9770O882k0886j5575L5828
16772F0619k845O276J7255k4442j5352K343M8497K1908n6512l5912J033k7576
16760d708k9958J7286K4215R483k1586M241L2497K6192M150Q294K030p22P068
16747G8482L5063M066k0183j071J1135l834j2204J079M296L4772l002l0921O958
16734A04636N4732J0522J1184L4262Q4545N7650L5053O3148O1151K4927j3995
$$ y = [102882, 80392, 61967, 38251, 28824, 41884, 46149, 19072, 4630, -27628, 13264, 35811, 44413, 51347, 67012, 107458, 119335, 101040, 113426, 133846, 90241, 68541, 80182, 101505, 93792, 44582, 37958, 38096, 37101, 65790, 86210, 90344, 71050, 44207, 11561, 12546, 47701, 38596, 61688, 74843, 87671, 87652, 75372, 43922, 32880, 34600, 54370, 61252, 40366, 24791, 60619, 57774, 64050, 81305, 56863, 41511, 43854, 92351, 114259, 57747, 21835, 22868, -4708, -34666, -17380, 6835, 16318, -5268, -1027, 31470, 57662, 61812, 70106, 72136, 71414, 78482, 113545, 117611, 97428, 96357, 107492, 103658, 91454, 92533, 96829, 131601, 128599, 97678, 104636, 159368, 169890, 181074, 215336, 299881, 357531, 392584, 455732, 516883, 541810, 527815]
16723E27815k8944k2927M1509j1994r484j8838p9097l5786M2393N5470J3591O5323
16711E39031L3305k5354k7088l4007o8569n2988j3158k9026J9686m3415m1616
16700B56801J086j8664o1431n4714J6052J2684J7881p877o789P121m404j4684
16688A43062m587K1434j985o944J4178M3966M5775K2996Q3118K121L7582N1191
16676D51907Q6175P8482M9580k5271l1701l6507P128j3554q5005q9517q0232m7561
16664B63924m6056k7984l096K6290Q2126Q3178O4290J004k0845K8022k2741O8115
16652D96227N069l6564m4582m9898k4290l0097l6654n1749m9227m0881o2750k4679
16640D9925J4569k1059j2306R398M60j0990J1706J5966n975l5254K0193L1819
$$ y = [527815, 498871, 475944, 517453, 505459, 495975, 477137, 398040, 362254, 404647, 460117, 473708, 539031, 572336, 546982, 519894, 485887, 417318, 364330, 351172, 322146, 341832, 298417, 256801, 257887, 239223, 177792, 123078, 139130, 151814, 169695, 161818, 155029, 162150, 157746, 143062, 138475, 159909, 157924, 150980, 165158, 209124, 254899, 277895, 361013, 363134, 400716, 451907, 538082, 616564, 666144, 640873, 609172, 572665, 579793, 566239, 481234, 391717, 311485, 263924, 217868, 189884, 186788, 213078, 295204, 378382, 442672, 443676, 422831, 450853, 428112, 496227, 501296, 464732, 420150, 370252, 345962, 315865, 279211, 227462, 178235, 137354, 74604, 49925, 64494, 43435, 31129, 40527, 40987, 29997, 41703, 57669, 51694, 16440, 36633, 68452]
16628F8452j1543k0889q058L5751k4030k2296J2728m733n725m7351r983O286K3897
16615g494P182Q344P381L7409M467l4536P688k5113l3444r987O854J2000J0580
16602h669j2097M1053J0620R408N9795j1045k6327m6358p402j7481J2393j0709
16590f819j8097k0251l1991o148l264L9715N3391J7920l3399p462K9142K1198
16578C3935k1449j2512m619k3221k91K533K94K2147K4000L0276K5993J3704n6499
16565C4291j0742K1023j3703j1427P371p160n190j082J9538J8937j6229m1867
16553f240k2557j1972k630j7132j0285M1673p14m6747l7609P5876O7206K9917
16541E8786Q794k5555k2079l0118j5831J0507n251L2061J7737k5739M671j3270
$$ y = [68452, 56909, 36020, 27962, 63713, 39683, 17387, 30115, 25382, 19657, -27694, -37677, -31391, -7494, -312, 8032, 15413, 52822, 57289, 22753, 30441, 5328, -28116, -38103, -31249, -19249, -8669, -20766, 20287, 30907, 40315, 100110, 89065, 62738, 16380, 8978, -8503, 3890, -6819, -24916, -45167, -77158, -83306, -86570, -46855, 6536, 24456, -8943, -16405, 12737, 33935, 12486, -26, -4645, -27866, -28157, -25624, -25330, -3183, 20817, 51093, 77086, 90790, 34291, 23549, 44572, 30869, 19442, 26813, 19653, 14463, 13381, 32919, 51856, 35627, -6240, -28797, -40769, -43399, -60531, -70816, -29143, -29857, -76604, -114213, -38337, 28869, 58786, 67580, 42025, 19946, -10172, -26003, -15496, -20747, 11314, 29051, 3312, 7983, -5287]
16529e287P430L8378L2315K0994Q474l4194r213o4195q616l3092J2110j0847K3239
16516b2504J615L7339L856l8853j9117m139J2811M2285K9355k7856k8473J0887
16504b794L7193L3920J0558o5852n2140j651j9445j8409M7388l1462j2529J7196
16492e8027k1257m44K6602L3963M1012r879m3804J8530k4112j4246K7734L2576
16480H648N381K1220J2965J0797l5123l4107l2145M259J0294O814j4555M5976
16468A0424J1879m7561j8886J667r707R582N203l895K2182Q242J4495j2287n840
16455a4502J5560O965L758R763r202k2177m5047K8056L7113Q588N808J8301o097
16442C6887M163J3562k2921j49k1365l4118K1096R764k7200Q620M3310m4825k141
$$ y = [-5287, 2143, 40521, 72836, 93830, 102304, 68110, 58897, -5298, -13914, -47006, -34896, -45743, -22504, -20889, 16450, 20306, -18547, -37664, -41803, -28992, 13293, 42648, 14792, -13681, -2794, 34399, 68319, 78877, 13025, -39115, -40766, -60211, -78620, -31232, -62694, -75223, -58027, -79284, -79728, -53126, -19163, 21849, 11970, -31834, -13304, -37416, -51662, -23928, 8648, 14029, 35249, 48214, 59011, 23888, -10219, -42364, -38105, -27811, -20997, -35552, 10424, 22303, -25258, -44144, -42477, -52184, -42602, -37399, -41294, -19112, -10870, 3625, -8662, -14502, 1058, 8023, 11781, 21544, 12342, -9835, -54882, -26826, 10287, 18875, 24683, 42984, 36887, 41050, 54612, 31691, 31542, 10177, -23941, -2845, 6919, -20281, -11661, 31649, -13176, -15317]
16429a5317M4836j348k6532q548n246j7167K0530q938N121K1569j9199n0183J5998
16416d4424J4297J4477L5559J8193N478l1133l2006p601m5919K3442N4493K7088
16404C1944k2080n6727J7465J4604J4411J7616p137J8184j7528m5388P865N0636
16392B3865k2739j5496l01k2860o610K8664j4831K4221K4035M303L372J3838J804
16379D1265j1144O234j5159j057K0362j34k7224m0820j5853J9736R451J8739j6617
16366a2221J912K5725M255k1985m624J4219M2041j7012l0680k3287k5036M291
16354d2402J3331J1674k4242m6028Q290K3518n1467N322N005J592L8682L8747
16342a7978N824K826J4743k2866k3737K8403L0385k9564j4422L0146M2256K3176
$$ y = [-15317, 29519, 28171, 1639, -6909, -12155, -29322, -8792, -17730, -12609, 8960, -10239, -60422, -44424, -30127, -15650, 19909, 38102, 43580, 12447, -19559, -27160, -73079, -49637, 4856, 31944, 9864, -46863, -29398, -14794, -383, 17233, 10096, 28280, 10752, -34636, -26771, 23865, 1126, -14370, -14671, -37531, -44141, -15477, -30308, -6087, 17948, 22251, 25623, 39461, 41265, 30121, 36355, 21196, 20139, 40501, 40367, 13143, -27677, -43530, -23794, -14343, 4396, -12221, -10309, 15416, 19671, -2314, -6938, 7281, 49322, 32310, 1630, -21657, -46693, -42402, -29071, -17397, -41639, -87667, -79377, -55859, -107326, -102004, -96999, -95407, -56725, -17978, -12154, -9328, 5415, -17451, -41188, -12785, 17600, -11964, -26386, 3760, 46016, 69192]
16330F9192l122m3780l3795j7367k3828L4398K9649j5695j4387k1283K2901N849
16318a1268K777J2559K8036N589l5930q766j6933R498j245j103L6610L1041j2188
16305C8677m660k2817l7085M193K6913L9298K9345k229J4034o369l7445m7893
16293f038m9110J0838k8289l6113J8144L3659j5575k0570J7837M456M1305K9713
16281B57n839L699J3289k0909j8097k863Q21j274J2528L568J155j795j2508M987
16267b2981j898j1970K7751J2928j0792K2400n3829k7195L5222l6453J5685K7313
16255b3819K0446j0234p409K2919L6443m557J20k5267k0474J0650j0623r532k3262
16242d4599K1800L3832l0212l8288M1447O1652j5234n515J7161M424m785k3401
$$ y = [69192, 66070, 22290, -11505, -28872, -52700, -18302, 11347, -4348, -18735, -40018, -17117, -11268, -8491, 4068, 32104, 37693, 1763, -7003, -23936, -14438, -15683, -16786, 19824, 50865, 38677, 34017, 11200, -25885, -21692, 5221, 44519, 73864, 71635, 85669, 79300, 41855, -6038, -55148, -44310, -72599, -108712, -90568, -56909, -72484, -93054, -75217, -70761, -29456, 257, -5582, -1883, 11406, -9503, -27600, -30463, -29642, -30916, -18388, -14820, -13665, -15460, -27968, -22981, -24879, -36849, -9098, 3830, -6962, 15438, -38391, -65586, -30364, -66817, -51132, -23819, -3373, -13607, -21016, 1903, 38346, 33789, 33909, 8642, -11832, -1182, -11805, -21337, -44599, -22799, 11033, -19179, -57467, -16020, 45632, 30398, 24883, 42044, 46468, 41683, 18282]
16230A8282j5820Q137K4688J4064J4028j8522k1499J7476K396m6111K0871j3402
16218D588k0640j0007j2919J4862K1324j6538k2058j1826l6872j653K8913N3228
16206i598K1692J9198M051j4161m0166J318K2642l4754m7916M4626K7262L6469
16194C0663Q068m1637l8457K103J3296j9798k129K4560J3922J3550J1846m1273
16182b5286j328J6550j122L164j0063o676j6299K2440J7410m103L1393m8544n3679
16169g6143M12J0781K9047K4335l5055k8830J7162L1546P992J0781m6888l5464
16157i0324J0974J6026J0102O974Q144j7177l263K8089p468l496j1317J8688o039
16144d0087J0622K2462k5593l1227j1250R095M1526J8468k3371M1206J5824o6697
$$ y = [18282, 2462, 10599, 35287, 49351, 63379, 44857, 23358, 40834, 43230, -2881, 17990, 4588, -16052, -26059, -38978, -24116, -2792, -19330, -41388, -53214, -90086, -91739, -62826, -9598, 12094, 31292, 35343, 21182, -18984, -17666, 4976, -29778, -77694, -33068, -5806, 30663, 38731, -2906, -41363, -39260, -25964, -45762, -47891, -23331, -9409, 4141, 15987, -25286, -26614, -10064, -11186, -8022, -18085, -24761, -41060, -18620, -1210, -5313, 26080, -22464, -76143, -75731, -64950, -35903, -11568, -46623, -75453, -58291, -26745, -18753, -7972, -54860, -90324, -79350, -63324, -53222, -46248, -38104, -55281, -58544, -30455, -37923, -41419, -52736, -34048, -40087, -29465, -7003, -32596, -63823, -75073, -65978, -24452, -5984, -29355, 11851, 27675, -39022]
16132c9022m8923L0697L3495m707k9703j6352j3778K7435K1164K1371j4846P159
16120b6010M9649j0798J4061n99P22m4370k3353P266l660o99K2080k715J3284
16107e142J9430l020j9022m441q216o024j6581O85l2563j40M2053K5583l203m124
16093a4725k2723P641J2598j5008p340r088j898j5368Q946K8753R490j3908k6789
16080e9419K5021q857n244k81O23m6558K2983J6839P654K7409l995K1233M2094
16067C9502j4451l4560N557m2183m9300K2189r446j0364l965o108M6976N0517
16055e636M6308k963k6641l310p112k0990K561K4677L967j163j1420j035k325
16042e082l2392K0205L2014N868k3834k987J1935m466j3759l465Q202k118p871
$$ y = [-39022, -87945, -57248, -23753, -28460, -58163, -74515, -88293, -60858, -39694, -18323, -33169, -26010, 23639, 12841, 26902, 26303, 27025, -17345, -40698, -33432, -37092, -37791, -15711, -18426, -5142, 14288, 11268, -7754, -12195, -20411, -26435, -43016, -42331, -74894, -75034, -32981, -7398, -10601, -14725, -37448, -29807, -17209, -32217, -39557, -48645, -50543, -65911, -56965, -28212, -18722, -32630, -59419, -34398, -43255, -48499, -48780, -48157, -94715, -71732, -54893, -47239, -19830, -23825, -2592, 39502, 25051, -9509, -3952, -46135, -95435, -73246, -82692, -93056, -97021, -103129, -56153, -5636, 40672, 37709, 11068, 7758, 646, -20344, -17783, 6894, 10861, 9698, -1722, -2757, -5082, -37474, -17269, 14745, 20613, -3221, -6208, 5727, 1261, -12498, -15963, -7761, -9879, -17750]
16029a7750n292L0705o884K5742j61n7690J3250K4845L779n731r124M509K229
16016B427l811n66N2041K5597k3553n1947l4628j4632J5048M2734J4493K3098
16004D6301l9335k6718k2545J5694J0528k4517J2537L2729J4188k1619j0479L8817
15992B5581k3491J0122l589k0574j9061o638j7630J9704M0155N47j1991j6996
15980b3861K2097J5852l630J3553j2582o133q275K658J2727K0812l5134l8228
15968d0144N596J0353M357P63k5672k7738r48L3023j1726K223p225J4329P079
15955c5730L1664Q571j83J6601P628K533m882J055j7354o736J9479j316k8207
15942f877j7591J084r120j3014J9792L945j641j7605j7494J78K5027o181O320
$$ y = [-17750, -23042, 7663, 779, 26521, 26360, -31330, -18080, 6765, 10544, 4813, -4311, 198, 2427, -1384, -1950, 50091, 75688, 52135, 188, -34440, -49072, -34024, 8710, 23203, 46301, 6966, -19752, -42297, -26603, -16075, -40592, -28055, 4674, 18862, -2757, -13236, 25581, 2090, 12212, 8623, -11951, -31012, -37650, -55280, -35576, 4579, 5126, -6865, -23861, -1764, 14088, 10458, 24011, 11429, 5296, -2979, -321, 12406, 33218, -1916, -40144, -34548, -24195, -19838, -19075, -44747, -72485, -73433, -40410, -52136, -49913, -57138, -42809, -35730, -4066, 4505, 4322, 20923, 28551, 31084, 26202, 27257, 9903, 3167, 22646, 21330, -6877, -24468, -23384, -32504, -45518, -25726, -21781, -23422, -41027, -58521, -58343, -33316, -39497, -33177]
15929c3177M9997K0276j5419j7970P603K3815J6722M5798R851l3120m1101j6564
15917A6711n57n704M267J0799p37j0105Q374M578j6470l3266K627J8323J5916
15904A4756j9639K1134J4711K5191J8138O870m0834o1949o985R694K0384J3013
15892A4484m44L7861j612O080m2361k7049M6375J5549L7979K007k031l6759n8415
15879h336m8177R459K9601q33M691o523j1123K4797M1107K877l9970k7660l444
15866c3534l18J5080l2468O191j5985P281j819J5089N0513L3535K128j0012k9409
15853F272k5923j4031o441J0420K304K8191j49l3178L351l1474L505J2099j9137
15840f4191L9619K8443k6822k6424l337q779K1298J0785j3087m704O205p050J7565
$$ y = [-33177, 16820, 37096, 21677, 3707, 11310, 35125, 51847, 97645, 107496, 74376, 33275, 16711, 16154, 10450, 14717, 25516, 24779, 14674, 23048, 27626, 11156, -22110, -19483, -1160, 14756, -4883, 16251, 30962, 56153, 74291, 81161, 40327, -21622, -28607, -18913, 1471, 14484, 14040, 51901, 50289, 56369, 14008, -13041, 33334, 48883, 86862, 88869, 86838, 50079, -8336, -56513, -47054, -17453, -18286, -13595, -20118, -31241, -6444, 34663, 37540, -2430, -30090, -33534, -33852, -18772, -51240, -45049, -61034, -53753, -55572, -40483, 10030, 43565, 45693, 35681, 6272, -19651, -33682, -40123, -29703, -27399, 792, 643, -32535, -29184, -60658, -57153, -45054, -64191, -24572, 3871, -22951, -49375, -52712, -61491, -40193, -29408, -42495, -47199, -40994, -48044, -30479]
15827c0479K8118k6052P234j9049L39K0036L311j8375K958Q712O486K1360m4834
15814d0235k641k958r116M7354N2597J3907m5119N052J8978J9750k9442k850O721
15801C1998K1224m2426k1871k7787k0815J2161J6948j2632J9229L751O561P229
15789f430J6574O462m4320m195q959j2265K8820M697n919M0073p605k8494k609
15776b4170J7511j7205j0241j5993J9162l078p175Q591K377l8575O044K3652R38
15763c8162J6075j1122L1470L641j6650K747K5466j8637l3452K8819K7506J4484
15751C2185p973J3767M9482m2688k3957J7198j3545j0814j0096j673k3809L474
15739a8449k2042L0771r6P085R046J3560o601j6558j3533O30k257K5124j0583
$$ y = [-30479, -2361, -28413, -21179, -40228, -39889, -19853, -16542, -34917, -31959, -23247, -16761, 4599, -40235, -42876, -45834, -54950, -7596, 45001, 58908, 13789, 18841, 37819, 57569, 28127, 25277, 31998, 53222, 10796, -11075, -38862, -59677, -47516, -30568, -43200, -23971, -20220, -13659, -6430, 10144, 16606, -27714, -31909, -40868, -53133, -24313, -19616, -25535, 14538, 6933, -21561, -24170, -6659, -23864, -34105, -50098, -30936, -34014, -41189, -32598, -30221, -68796, -62752, -39100, -38162, -22087, -33209, -1739, 1902, -14748, -12001, 13465, -5172, -38624, -9805, 17701, 32185, 24212, 37979, 87461, 44773, 20816, 38014, 24469, 13655, 3559, 1886, -21923, -18449, -40491, -9720, -9816, -2731, 6315, 19875, 13274, -3284, -16817, -16187, -18444, 6680, -3903]
15726c903j6687K5143J0300q7N951m050N59r060k8501M920M8476j9128P465M1839
15712F3237j8488l3578k7227k4223N22M1520K6252k4543m3177J0658J980J3179
15700a3888n0527k7243M6075N6961J2003p1899l6571J5376M6639P5832o361l2884
15688A3513k4295j4192L5407J5484n7169m604M395M869M3840K7022j1521n54K762
15675C4957k1645K5233l1908k7728m61k393J3092L334j7761k5449j0509Q620L1616
15662b1002J9635j6135j4152K802m243j1587j2248j420M6418L5506J0864J2507
15650D6945j4822k6511J5325k5683m2740l940J4850N0237l2366j5034l4495n2944
15638a21178J325M0585L9989m320R186k0712k7902N684K3229L6301j88O486k2775
$$ y = [-3903, -20590, 4553, 14853, 14766, 20717, 16667, 17226, 8166, -20335, -15415, 33061, 13933, 21398, 63237, 44749, 11171, -16056, -40279, -39757, 1763, 28015, 3472, -39705, -29047, -27067, -13888, -64415, -91658, -45583, 11378, 23381, -48518, -85089, -69713, -23074, 52758, 46397, 13513, -10782, -24974, 10433, 25917, -31252, -35856, -31461, -26592, 17248, 44270, 32749, 32195, 34957, 13312, 38545, 6637, -21091, -21552, -23945, -10853, -7519, -25280, -50729, -61238, -52618, -21002, -1367, -17502, -31654, -28852, -33095, -44682, -56930, -58350, -11932, 23574, 34438, 46945, 32123, 5612, 20937, -4746, -47486, -51426, -36576, 13661, -18705, -33739, -68234, -121178, -119853, -79268, -39279, -43599, -34413, -55125, -83027, -77343, -54114, -17813, -18001, -11515, -34290]
15625c4290q586k881o428k0650J9090J9882J7654j1412k9915k0766L0745K9543
15613a8014k8492k9751q012J0479N1274N0665K3251m0706k0278J8678K2028p931
15601B3191k1002j6009L4059J3839J4776j1067k4711l5407j6022K095j5555J0389
15589d1424K4651j9310m4221O68J4073K0384O3513J069k6010l3185K8173M2384
15577C0765k009k2628m3625K787N581K6651k920r663J5343K4393m3565j8882M1606
15564C834L5763m1427l2523J0166J8070q408J0116M1901O537m2944l0263K2282
15552f896k3081j2432M814J5014j85o424K3931J8867K443j1238j2712M3544J5420
15539E1065j5099P727k3207k9576K8572N5528k5077m0308k1102j7106J3119L7328
$$ y = [-34290, -42876, -45757, -52185, -72835, -53745, -33863, -16209, -27621, -57536, -78302, -47557, -18014, -46506, -76257, -84269, -73790, -22516, 28149, 51400, 10694, -9584, 9094, 31122, 23191, 2189, -13820, 20239, 34078, 48854, 37787, 13076, -22331, -38353, -36258, -51813, -41424, -16773, -36083, -80304, -79636, -65563, -45179, 18334, 19403, -6607, -39792, -11619, 30765, 28756, 6128, -37497, -34710, -29129, -2478, -5398, -15061, 282, 24675, -18890, -37772, 3834, 39597, -1830, -34353, -24187, -6117, -14525, -4409, 37492, 44029, 1085, -29178, -6896, -29977, -42409, -37595, -22581, -22766, -29190, -5259, 13608, 16051, 4813, -7899, 35645, 51065, 35966, 43693, 20486, -9090, 19482, 75010, 49933, 9625, -11477, -28583, -15464, 21864]
15527B1864j8307k4651m821J8455J7097l707J1681J371j5055O78q821l4166J5754
15514b2628J480m0450K2140M4363k695l1306j6984J8614k4840K7636K3206j9202
15502b0666l998k4021k5491J5141O5183q455o038j4540k2350N9457L6812j2057
15490C8977k9215l1867j3273J4995J2565K7115j0425n70K2926J6295j4770M489
15478C7242Q466j1093j1580j1088j6802o15L1189L1576k373r149L6912M987N76
15465H8248J276l4165j6432m9137j2009j617k1178k139K6310J4471l4697m60N5915
15452A4386J4546J5460k2138j3723j5762k3780n803q338k6976r547J6184M2303
15440b3188j3400p946K2344n818R396l9395m434L7781j5767R513K7898j0583k5831
$$ y = [21864, 3557, -21094, -25915, -7460, 9637, 5930, 17611, 18982, 3927, 4605, -4216, -38382, -22628, -21148, -61598, -39458, 4905, 2210, -29096, -46080, -27466, -52306, -24670, -1464, -20666, -24664, -48685, -74176, -59035, 6148, -2307, -8345, -22885, -45235, 14222, 51034, 38977, 9762, -22105, -35378, -20383, -7818, 19297, 8872, 8302, 31228, 47523, 32753, 37242, 45708, 34615, 23035, 11947, -4855, -5470, 25719, 57295, 54922, 45773, 82685, 87672, 88248, 89524, 55359, 38927, -10210, -22219, -23836, -45014, -47153, -20843, -6372, -41069, -41529, 14386, 28932, 44392, 22254, 8531, -7231, -31011, -36814, -45152, -72128, -81675, -65491, -23188, -36588, -44534, -22190, -28008, -18612, -58007, -62441, -24660, -40427, -30914, -3016, -13599, -39430]
15427c9430k026r90m86Q835M7882l4476o8871K4113N435n46M371N627j0266J6668
15413d4160K0485J8697k1034l2583q005p157o249R419J6359M288L0053K1409K1385
15400B2907p148j0152O107L1813N399m4309k1225J3844L3421Q594m2655m1589
15388d4993M1435O0733k1743l6164k6125Q656r936P781J8355j3284q605n375O97
15375b8568J6708J7839l5932l5784j1960K5000K4226o461j4527J963n0364J6125
15363h1735N2742K5673J3766l4340j1730j0041L221O291K9240J0959M255j9218
15351a0917n5514K4376J5714M953J4707k0357j2455J1605r371l8655Q757K0591
15339d6566j7396Q167l765J8972r838l9938J3647N4626n291l1982j5362K6314
$$ y = [-39430, -41456, -42446, -42932, -34097, 13785, -20691, -89562, -65449, -60014, -60560, -56189, -50562, -60828, -44160, -23675, -4978, -26012, -58595, -66600, -73757, -80006, -70587, -54228, -49940, -19887, 1522, 22907, 15759, 5607, 11714, 43527, 48926, 4617, -16608, -2764, 30657, 39251, -3404, -44993, -3558, 57175, 35432, -732, -26857, -18201, -28137, -20356, -2001, -15285, -23890, -29265, -28568, -11860, 5979, -29953, -65737, -77697, -52697, -28471, -34932, -49459, -47496, -97860, -81735, -28993, -3320, 10446, -23894, -35624, -45665, -42444, -36153, -6913, 4046, 8301, -10917, -66431, -42055, -26341, -21388, -6681, -27038, -39493, -27888, -37259, -75914, -67157, -46566, -63962, -55795, -59560, -40588, -50426, -90364, -76717, -22091, -27382, -59364, -74726, -48412]
15327d8412N4393J1982m5786l7478K6490K6511k5327l2215K165K6668J0455k4588
15315e5142j996O2531K0923q79j6297j7050N2394J0556j1079K3972K9577l3665
15303F3845L062l7093m1398l1033j4522j5790J3537K8080J6911l615K2779L4563
15291C9326j6521l1108k3214M643m394L1592o602l4890K815k401q418K245J2178
15278c4749J1093k2647m185l480j757K8420K0041J0043P245n582l1180j0981J788
15265c5931k4526K5793K8673n567J4688R798J1518p059n147J2315l090k3283j5502
15252a7320P645K4752j4730l5060J4427q241k696R46j0426Q95L8239m558l4031
15239d0158m2434j90K9030N0983j6038k6914p910k0340J3269L3966J5895j002
$$ y = [-48412, 5981, 17963, -27823, -65301, -38811, -12300, -37627, -69842, -67677, -41009, -30554, -55142, -57138, 5393, 26316, 25437, 9140, -7910, 44484, 55040, 43961, 67933, 97510, 63845, 66907, 29814, -11584, -42617, -57139, -72929, -59392, -31312, -14401, -18016, 4763, 39326, 22805, -8303, -31517, -26874, -31268, 324, -6278, -41168, -38353, -40754, -49172, -46927, -34749, -23656, -46303, -50488, -53968, -55725, -27305, -7264, 2779, 10024, 4442, -26738, -37719, -35931, -60457, -34664, -5991, -11558, 3130, 12928, 24446, 17387, 12240, 24555, 21465, -1818, -17320, -9675, 15077, 347, -34713, -20286, -28527, -31223, -30277, -40703, -39808, -1569, -6127, -40158, -82592, -82782, -53752, -2769, -18807, -45721, -53631, -73971, -60702, -26736, -10841, -11843]
15227a1843J1746J6276J4416k1010J1548l5349k8270M277L7514q774j1480J9292
15215a657R233O883l9507J9750R708k3954k9203j4928K6005K8408r636k5084k7211
15202g1193r805j8478j3013J6720L5330J2624k2710K5562N8470K046k5843J4766
15190D476N401k797j2207l8017m4021J3286J1476K333L9444K80j2125p317k616
15177d2404L6792J513N109K6983j0144k5303J6472P150o3407k2072J9723N199
15165d4389n878o411J8256O8218J7427k9623l0675q998m41L2149J8146l7162j2767
15152b2148J7607N139k8092J4292J0314j6042m041l0595q309O653L0976K9999
15140E753L8747K6662R440j8204J4496R946k2939l4299k0429K1313r896k0087
$$ y = [-11843, -97, 16179, 30595, 9585, 21133, -14216, -42486, -38209, -695, -9469, -20949, -1657, 7576, 14459, -25048, -5298, 4410, -19544, -48747, -63675, -37670, -9262, -18898, -43982, -71193, -80998, -99476, -112489, -95769, -60439, -47815, -70525, -44963, 13507, 15553, -10290, 4476, 9877, 7080, -5127, -43144, -87165, -73879, -62403, -60070, -20626, -20346, -32471, -39788, -42404, -5612, -4099, 1010, 27993, 17849, -7454, 9018, 16168, -47239, -69311, -49588, -44389, -50267, -56678, -38422, 29796, 47223, 17600, -13075, -22073, -22514, 9635, 27781, -9381, -22148, -4541, 598, -27494, -13202, -2888, -18930, -22971, -53566, -61875, -55222, -24246, 5753, 44500, 71162, 80602, 62398, 76894, 86840, 63901, 29602, 9173, 30486, 20590, 503]
15128E03J0488j6893k3548o81j5686o06k0890L7837K7054p145q437J4116j3300
15115a7188j4971k2379k6778j7640k5551Q399K8595O8678K2969q881K1069K4805
15103D1127k3895n1735n707R914j52k2336j6405k042j881L013L4387J4811m6633
15090f7534k2029L2999L3247N2367l3540r472l4552j226K0703K1469K4198J1724
15078B8354K3201j858p7859o0946l2444M820K4387M1037J7413J3534K4454r695
15066e602o57J0144n505J69L6296N39m755k3383K3273j4023l1017k6656M98J3328
15052b7351L0032k2300j6456k38L0262j2298J7009K856K3269k2712k9117K3492
15040c552Q095L703j3887J4730m41j9010L420j2314m825L4564J3603N076r844
$$ y = [503, 10991, -5902, -29450, -30131, -45817, -46423, -67313, -29476, -2422, -9567, -18004, -3888, -17188, -32159, -54538, -81316, -98956, -124507, -116108, -87513, -18835, 4134, -4747, 16322, 41127, 17232, -34503, -40210, -30296, -30448, -52784, -69189, -71231, -73112, -70099, -35712, -20901, -67534, -89563, -56564, -23317, 29050, -4490, -13962, -48514, -49740, -29037, -7568, 16630, 28354, 51555, 49697, -28162, -89108, -121552, -116732, -92345, -51308, -33895, -20361, 4093, -5602, -6259, 3885, -1620, -1451, 34845, 35384, 30629, 7246, 30519, 16496, -14521, -41177, -40679, -27351, 2681, -19619, -36075, -36313, -6051, -18349, -1340, 1516, 24785, 2073, -27044, -3552, 4543, 8246, -5641, 9089, 8648, -10362, -6942, -19256, -24081, 10483, 24086, 29162, 19318]
15027A9318l2061J7980k026L4629J7097l362j5416o4719j6061M4214P835j0907
15015c479j0187n270k4260P487k990L27K7723k9637k2449Q371M168l2032j8812
15002a01040L640J1722K7085J5724L0283k9440n927J4596k854m594j3315K9371
14990b4749K4221o02m505N578j1965m853Q756k248k6616K2979J9646n0774j2400
14977e7532K0076k613Q704R801J0580N217L3321K108m1847K0604j8837m4295j1127
14964f5840M223J2234Q566N0210j99o52L8012L985j3772m7900k2837J2578K5582
14951D190j3260j2529r68r715J3128k2771j5059J755K5301J8542j8224J104p903
14938c6409j1769k2031J0922M571L3357J4432q231l4385j4423N349l412K2450
$$ y = [19318, -12743, 5237, 3211, 37840, 54937, 51575, 36159, -28560, -44621, -407, 7428, -3479, -13666, -18936, -43196, -35709, -38699, -38372, -10649, -40286, -62735, -54364, -50196, -82228, -101040, -97400, -85678, -58593, -42869, -12586, -42026, -47953, -33357, -36211, -40805, -54120, -24749, -528, -1130, -5635, -57, -12022, -16875, -8119, -10367, -36983, -14004, 5642, -45132, -57532, -37456, -40069, -31365, -21564, -10984, -5767, 27554, 29662, -12185, 8419, -10418, -54713, -65840, -61617, -49383, -40817, 9393, 9194, 8542, 46554, 50539, 36767, -11133, -33970, -21392, 4190, -9070, -21599, -22567, -32282, -19154, -41925, -56984, -55229, -29928, -11386, -29610, -28506, -36409, -48178, -70209, -59287, -54716, -21359, -6927, -15158, -49543, -63966, -58617, -62029, -39579]
14926c9579J7620J0043j5226k2034l2325j0324K0400L8237J9036j431J6270n87
14914A00l5854j2970J8471K4844N573k2892j8024j1088N897K6059J7816N051j9859
14901a6876K5242R51k7507J4381j3135j2339K4297k5076l5409O254p699p435l7913
14888a12264L2057N1989J3577J324k8953r987K817J0826k1147j0245J242L9128
14876b9636L8294k0459r031L486L2626j9854j3325j0811l3227l54K671k5492N797
14863g9315M5703P323l085l778K5194L8171K2685j8897k8499k5413K161j1775
14851b9525o896J2066o989P723q442J966L3126K1572j5587m7786K203J9563K9531
14838A2525r064Q849k5572j0440m5209k8815M7016M1008L3941J2517K6800l72
$$ y = [-39579, -21959, -11916, -27142, -49176, -81501, -91825, -71425, -33188, -14152, -15583, 687, 100, -35754, -48724, -30253, -5409, 164, -22728, -40752, -51840, -45943, -19884, -2068, 2983, -16876, 8366, 9317, -18190, -3809, -16944, -29283, -4986, -30062, -65471, -59217, -66916, -74351, -112264, -80207, -28218, -14641, -13317, -42270, -52257, -49440, -38614, -59761, -70006, -68764, -29636, 8658, -11801, -20832, -17346, 15280, -4574, -17899, -28710, -61937, -62291, -59620, -85112, -79315, -33612, -26289, -29374, -33152, -7958, 30213, 52898, 34001, 5502, -19911, -17750, -29525, -36421, -24355, -31344, -23621, -32063, -30097, 3029, 24601, 9014, -38772, -36569, -17006, 12525, 3461, 12310, -13262, -23702, -68911, -97726, -50710, -9702, 24239, 36756, 63556, 63184]
14826F3184k6498K0659M1465n0865j6683q445j9705l2802N078P073k8103n618
14814e1260L4737K9019J9404n541p279j0041J323M2180L825j0595k237J4190L3616
14801I1341m3495n4669J4484K9885Q13m909J2898l9484j9396J0689J950j2158
14789a2051l0178k3409K3029J4443m040k7672j1286k2450K0125P0227j1825k7869
14777d2956r78l2718K6564r031j2848l475j9741J1148K0662q30K6965P257k273
14764c2254N200j3322j115j5541j0700k119K0264o802k7708R15M7314L4640M609
14751C381j2608r229J879J0315M0J0541R303k0104o442L7118P23j5327j1844j3580
14737a5834K2799K4875j1353j4342m120K0873k6j2088k1774K3671K037j4451J0600
$$ y = [63184, 36686, 57345, 98810, 47945, 31262, 22817, 3112, -29690, -24612, -17539, -45642, -51260, -16523, 12496, 31900, 26359, 19080, 9039, 10362, 52542, 56367, 45772, 43535, 57725, 91341, 47846, -6823, 7661, 37546, 38359, 33450, 46348, 6864, -12532, -1843, 107, -12051, -42229, -65638, -42609, -28166, -32206, -59878, -71164, -93614, -73489, -3262, -15087, -42956, -43934, -76652, -50088, -59119, -71967, -75442, -95183, -84035, -63373, -64203, -37238, -29981, -32254, -27054, -40376, -41491, -57032, -67732, -69851, -49587, -56389, -84097, -83182, -35868, -1228, 3381, -9227, -18456, -16577, -6262, -6222, 4319, 13622, -6482, -12924, 24194, 24917, 9590, -2254, -15834, 6965, 31840, 20487, 6145, 2025, 22898, 22872, 10784, -10990, 12681, 14718, 267, 10867]
14724A0867J0741o414j6476k1280L4032L422q831k633k3272L8538M9222R943K919
14711H0778r193k2569o5184m6924L4810N1376l655M935j0112l1838K4639k864
14699D199j1669k904K4207J5020j749J0110m0685k6105J1021J6263J4360k2083
14687a0015k9000L5706J1278j6339l43j4011J272J5797m067o489J2534K6207J3159
14674C5689j8815K8896l555k5177J238k9100j2458j4624o477K7734l6582n7029
14662a10260J6314L5750N8789K4914m2337J6999J6016N469M911j1754J6776L1267
14650F2854j0031O773l6137m4294l2230P011N6923M779l5854l4512j9867M9227
14638b5358L4275J0382j3577k5355K3332J0004p655P395N280k5625k4984j4726
$$ y = [10867, 21608, 15194, -1282, -22562, 11470, 14892, 6061, 3428, -19844, 18694, 67916, 77859, 80778, 71585, 49016, -16168, -63092, -28282, 23094, 19439, 24374, 14262, -17576, 7063, 4199, -7470, -10374, 13833, 28853, 27104, 37214, -3471, -29576, -18555, -2292, 12068, -10015, -39015, -3309, 7969, -8370, -8713, -22724, -21452, -5655, -9722, -16211, -3677, 22530, 35689, 16874, 45770, 42215, 17038, 18276, -10824, -23282, -37906, -44383, -16649, -53231, -110260, -93946, -58196, 593, 25507, -16830, 169, 16185, 21654, 26565, 14811, 31587, 62854, 52823, 59596, 23459, -20835, -53065, -46054, 10869, 15648, -20206, -54718, -74585, -25358, 8917, 19299, 5722, -19633, 3699, 13703, 6048, 13443, 18723, -6902, -31886, -46612]
14626d6612J3153J7016J2675P73k6216j5186k9828l306K8939K1349k6646P622
14614d6267j8000J3372L0914M0416j1524m935Q107l0450K2769J8629K2566l0573
14602A5024n650l9627J1114j956j3339J0280K4250j8268n2578k5193K2842L6111
14590c6990J7895L5690J1871l2891L329q600j3023J679n753l5650J1939N1105
14578F01M9337l4358l2036l3073M646K3165K1617n991K2773Q590k1695k6544l1283
14565e4251k1365j9530K4721R994N3996n146k2817K1437R765m5669k9740K6434
14553e2171J0709L2478m807m7748q098K1158J6734K8447O39o986K2104J5100k2697
14540D862k0438J0088K2227k6000k5781l991j7725K8104K6136r831j3442J0869
$$ y = [-46612, -33459, -16443, -3768, -2995, -29211, -44397, -74225, -77531, -48592, -27243, -53889, -46267, -64267, -50895, -19981, 20435, 8911, 3976, 12083, -18367, 4402, 23031, 45597, 15024, 9374, -30253, -19139, -21095, -34434, -24154, 96, -18172, -70750, -95943, -73101, -36990, -19095, 16595, 28466, -4425, -1096, -9696, -22719, -21040, -26793, -62443, -50504, 601, 49938, 15580, -16456, -49529, -44883, -21718, -101, -6092, 16681, 25271, 3576, -22968, -54251, -75616, -95146, -70425, -60431, -6435, -11581, -34398, -12961, -3196, -48865, -78605, -52171, -41462, -8984, -13791, -61539, -69637, -48479, -31745, -3298, -2659, -9645, 12459, 27559, 4862, -15576, -5488, 16739, -9261, -35042, -39033, -56758, -28654, -2518, -12349, -25791, -14922]
14528a4922j1082K0526M9394m9469n1179R424K1850K5859j0623j0554M8698J305
14516B9227m0651o80J9249J4927q611M995L7958k9894j794J9645J2598j2751j8488
14503B5730k9670J6246J3517J4546k4163m336q1n567k8504l0214L1887J0091K5727
14490A5209J6434j4702l4140j1343o750O691J774k7994J0902P751L6594K2944
14478B3370J407k4090J6983j9486l2836K9250M7107K8777j8501k8888J5287k4428
14466A3952j6735L160K2162N686m192m0011l5764O534L6724J1216q480M791J1079
14453A0122k8934k5857o631L9377j860l6395J7048M2896k1896j3793K3236L0893
14441B8206P96n2189l2956M1235J3575j5758j8923n555l542P083J7315m65L0484
$$ y = [-14922, -26004, -5478, 43916, -5553, -56732, -47308, -25458, 401, -10222, -20776, 27922, 29227, -11424, -12104, 7145, 22072, 13461, 18456, 56414, 26520, 24726, 44371, 56969, 44218, 25730, -3940, 12306, 25823, 40369, 16206, 11870, 11789, 6222, -22282, -52496, -20609, -10518, 15209, 31643, 16941, -17199, -28542, -35292, -28601, -26827, -54821, -43919, -36168, 426, 23370, 24777, 687, 17670, -1816, -34652, -5402, 41705, 70482, 51981, 23093, 38380, 13952, -2783, 377, 22539, 28225, 24033, -15978, -51742, -45208, -8484, 2732, -5748, -957, 10122, -18812, -44669, -51300, -11923, -13783, -50178, -33130, 9766, -12130, -25923, -2687, 28206, 29002, -23187, -56143, -14908, -1333, -17091, -36014, -41569, -45111, -38028, -20713, -21178, 9306]
14428I306J0759M173m315k674j596L5586J7122L1346r245n2315m9772k6017K523
14415c5119J9790M2627K6301l0155m1213j9498j7717M4934K3054K0184k432l8993
14403h237m699m460j9235K0222L8804O528j1553j7520j5511K0730M8010J5993
14391F9072j3873k5513m9360j1185K352k6121k661R919K0391K1024J3404j9730
14379a2281J9006L6784k9708n848R258k5815j5417j5172k0350K3106J3072L7803
14367A4438k3196K3234q042m475j1844l6213O837K8901L6254L901m2634k3170
14355c6009J777j1159J0270J9405j4817j5451M0294K5754l6685k7754l090k147
14343d9612K3983L1073L189J821K8114K6437K8399l6152l2059j2874N500Q15o635
$$ y = [9306, 20065, 24238, 19923, 17249, 15653, 51239, 68361, 99707, 90462, 38147, -11625, -37642, -35119, -15329, 27298, 53599, 23444, -17769, -37267, -54984, -10050, 13004, 33188, 30756, -8237, -12936, -17396, -36631, -16409, 22395, 28923, 17370, -150, -15661, 5069, 53079, 69072, 55199, 29686, -19674, -30859, -28507, -54628, -57289, -47370, -26979, -5955, 7449, -12281, 6725, 43509, 13801, 7953, 17211, -8604, -24021, -39193, -59543, -36437, -23365, 14438, -8758, 14476, 6434, 1959, -9885, -46098, -39261, -10360, 25894, 29795, -12839, -36009, -34232, -45391, -35121, -15716, -30533, -45984, -5690, 20064, -16621, -44375, -47465, -49612, -25629, 5444, 8633, 10454, 38568, 65005, 93404, 57252, 25193, 12319, 17819, 18634, 11999]
14330A1999r494l5955O492K0417k1884l4437J5947N0314J1694n154k77Q682K877
14317B1221l4219j8963O316j0667L7424N94o523J1763j8201N2P861k2801k986
14304b9129Q424k5279K8658M846j7355j1976N839K2325L7894K5191k9174o1516
14292d1252j5189L9801L4603K1211j245j0967O361J8549m306j8695j9478K8022
14280C7415L7146j9119Q325l9871j4496q738K158Q724j0775o186K5449P159j0588
14267A6603p8N048j3679L573j1394k4795J8622l762j6111J9125L809j0075L211
14254i903p885j4247J4304l056o06K1308j0817o966J6900l1677k6268J9052K9919
14241i942K8300M3322o737k2706l0299K2294L2114J3402O563k4591j6405j9791
$$ y = [11999, 2505, -33450, -26958, -6541, -28425, -62862, -46915, 3399, 15093, 9939, 9662, 18344, 21221, -12998, -31961, -25645, -36312, 1112, 1706, -4817, 6946, -11255, -11203, -3342, -26143, -29129, -20705, -45984, -17326, -12480, -29835, -41811, -35972, -13647, 24247, 49438, 20264, -41252, -56441, -16640, 17963, 39174, 37929, 26962, 33323, 51872, 47566, 28871, 9393, 37415, 74561, 55442, 63767, 23896, 9400, 662, 2820, 11544, 769, -5417, 20032, 27191, 16603, 16525, 21573, 7894, 11467, 73, -24722, -6100, -9862, -25973, -6848, -3039, -13114, -9903, -17788, -32035, -17731, -20787, -21393, -85, -10902, -17868, -968, -32645, -58913, -39861, -9942, 18358, 61680, 54943, 32237, 1938, 24232, 56346, 69748, 76311, 51720, 35315, 15524]
14229A5524j9958K2744K120j3134m6691L8946J6593l0988k9314K4598k8803k2050
14217g0413L5205J9578J3530J6129k719J1990L883l4096R282J3876l847L460K3560
14204C9418K2348j9238k2099l32j4626o809k091l6067j2507K9589K3784j8433
14192a7063l3317L3162j6419j26K2251j914m082K8212k1815j4697L2205L2071
14180C8468R73K0856r008l6771J3646J3190J0765j4390l6604j2181K7648K9960
14168D6552k8415J9743Q732j0687J0167P171j307k1136m1822k3558O307J7994
14156a0259R824j1300j7464K0523O6383k5944p3750n550L0456m155k0000r021
14144e0257K0503J8359q701k8699O881P139M199R387R824m4609m353J7471J0544
$$ y = [15524, -4434, 18310, 20430, 7296, -39395, -449, 16144, -14844, -44158, -19560, -48363, -70413, -35208, -15630, -2100, 14029, 11310, 23300, 27183, -6913, 2369, 16245, 12398, 15858, 39418, 61766, 42528, 20429, 20097, 5471, -1338, -3429, -39496, -52003, -22414, 1370, -17063, -50380, -17218, -33637, -33763, -11512, -13426, -17508, 10704, -11111, -25808, 6397, 38468, 39441, 60297, 51289, 14518, 28164, 41354, 52119, 37729, 1125, -11056, 16592, 46552, 18137, 37880, 46612, 35925, 46092, 53263, 51956, 30820, -11002, -34560, -28253, -10259, -435, -11735, -29199, -8676, 57707, 31763, -41987, -47537, -17081, -21236, -41236, -50257, -29754, -11395, -20096, -48795, -41914, -34775, -30576, -21189, -11365, -55974, -60327, -42856, -32312]
14131c2312l3185j0918p153j232P89L1569M1425J0949K9012Q156l3855l3541j3906
14118d4202j0670J1365K1847J26L425R514l4002J3239L187L5500M1294k759l7400
14105A0464l0249L9294Q919q878l7561O636m125P397o771q21j0873L7590K2502
14092C3524k0385l4061j6629K4330j1582j6575J6026J4121J7255K0172Q09j5512
14080A1493k1388J0250K2881j707J1525J1347l7935l5960n1039J661M7964L1739
14068H31L1828p327j3741N0551J5303l7724m4711K1902J9444j8255j6868k5205
14056b3972k8491J2702j614J5642k965k1119k7959L4170M7950K4230L7635J53
14044F6362l286j7795j9646m4377l9942K880K0271L9916R429K9563j1066j4801
$$ y = [-32312, -65497, -76415, -83568, -84800, -84011, -52442, -11017, -68, 28944, 37100, 3245, -30296, -44202, -54872, -43507, -21660, -21534, -18109, -8595, -42597, -29358, -26171, 9329, 50623, 47864, 10464, -19785, 19509, 28428, 19550, -18011, -11375, -15500, -8103, -14874, -15695, -26568, 11022, 33524, 13139, -20922, -37551, -13221, -24803, -41378, -25352, -11231, 6024, 26196, 27005, 11493, -9895, 355, 23236, 21529, 33054, 44401, 6466, -29494, -80533, -78872, -30908, 831, 32659, 25332, 11591, 62142, 77445, 39721, -4990, 16912, 36356, 18101, 1233, -23972, -52463, -39761, -41375, -25733, -28698, -49817, -77776, -43606, 4344, 28574, 66209, 66362, 63076, 45281, 25635, -18742, -58684, -55804, -35533, 4383, 13812, 43375, 32309, 17508]
14032A7508k0890L110J9960O8m801K2718p669l5722j114J0560N658k048K250J532
14018A1120J810M232r467j538L7120J8226n5856k6185K4314R604j8377j600j8358
14005b4955l1505K0155M9680n88k9645j4538o518K1038m1371k615L5638N960R283
13992i981J9583n958j0106m6087M2703J9371o053j3261K9236J2059j4814J1123
13980B7815Q491p120j6276L0279K3330j1401n1187J5036Q921j8934n070p852P974
13967D006J8341K1581K6960p998l9170k9967k5045L5394k6864n800M014j4807
13955c9355J5040M4364k2966n382j4310r766K6903r879r760L432p731q389K4072
13942a3727q894p45J1765J0517O446q872P466J143J624k2988j778J9093J6414
$$ y = [17508, -3382, -272, 19688, 19756, 14955, 37673, 30004, -5718, -6832, 3728, 9386, 7338, 9588, 11120, 12930, 17162, 7695, 6157, 43277, 61503, 5647, -20538, 3776, 13380, -4997, -6597, -24955, -56460, -36305, 13375, 12787, -16858, -31396, -37914, -16876, -58247, -60862, -25224, -19264, -9981, 9602, 3644, -6462, -52549, -9846, 9525, 3472, -9789, 19447, 31506, 16692, 27815, 36306, 29186, 12910, 43189, 66519, 55118, 3931, 18967, 27888, 8954, 3884, -3968, 4006, 22347, 43928, 70888, 62890, 23720, -6247, -31292, 4102, -22762, -28562, -24548, -39355, -24315, 20049, -2917, -8299, -22609, -32375, -5472, -15351, -25111, -21679, -29410, -37799, -13727, -22621, -23366, -11601, -1084, 5362, -3510, 3956, 5099, 6723, -16265, -18043, 1050, 17464]
13929A7464k9587m747P162K0285j7589m6366j3302L5427K3992J4610M3913m660
13917D6602k4248k8547n279j5690N102K7238L088j4323l5775K4562Q825R201k898
13904b142q10m660r490k9296K4515Q255j083N124K8869J3264m468J2907O115l5334
13890A1766m8287j7432J0511o206m636n331j4098J9205j7488j8719J4671M1706
13878c4338K9591P742r392J8663l6387m5980j7048O427Q100j8280m620K7166J9213
13865d9143n820J9080K2023J3280k2360L2834K1141l247K0402o923k0383L883
13853B4767J745p016J930k7056K2275n1427j6810J0151L0551J9831m4480J4935
13841b0604j1397j4611r715K3045M9741J9605l4340k3311J4479K7748o251l8635
$$ y = [17464, -12123, -16870, -9708, 10577, -7012, -53378, -66680, -31253, -7261, 7349, 51262, 46602, 22354, -6193, -11472, -27162, -22060, 5178, 8266, -6057, -41832, -17270, -8445, 756, -2142, -2952, -7612, -17102, -46398, -21883, -13628, -14711, -9587, 19282, 32546, 28078, 40985, 47100, 11766, -36521, -53953, -43442, -49648, -54284, -59615, -73713, -54508, -71996, -90715, -76044, -34338, -4747, 2995, -6397, 12266, -24121, -70101, -87149, -80722, -72622, -90902, -95522, -68356, -49143, -54963, -35883, -13860, -580, -22940, 9894, 31035, 27788, 48190, 41267, 20884, 24767, 26512, 19496, 21426, -5630, 16645, -34782, -51592, -41441, -10890, 8941, -35539, -20604, -32001, -46612, -56327, -33282, 16459, 36064, 1724, -21587, -7108, 20640, 14389, -24246]
13829b4246j4033j1411O040J3790N763k1319j4831J0457K1713l884M8633m047
13817A2625l4666j572k3688K9487M379j1382k5192m003n882O082L8144N0070k6172
13804H230k2186p969K839o40J8114R686k9956j2803K0115J7942k4025k612l0013
13791e3278j6896J1283K5689M1955j0496l2832K3982j8626j8919K8352J1125k9364
13779c8025J0541k067q746M2487L2342L4448l533m2516J718J8677k4266L1150
13767E2210m291j4922n9347l5691J0731N7909r134Q303P334L6798k1176J1748
13755D0472o105k0424K030j1157k1101J6029K293k6282L9868K3120r092l0722
13743a071J416J0454K0184j099k0301j2834K1482J2766j3916M440j1828K540K7540
$$ y = [-24246, -38279, -49690, -43650, -29860, -24097, -45416, -60247, -49790, -28077, -31961, 16672, 12625, -22041, -23613, -47301, -17814, -13435, -24817, -50009, -54012, -59894, -53812, -15668, 34402, 8230, -13956, -21925, -19086, -19726, -1612, 8074, -21882, -34685, -14570, 3372, -20653, -23265, -53278, -70174, -58891, -33202, 8753, -1743, -34575, -10593, -29219, -48138, -19786, -8661, -38025, -27484, -29551, -38297, 4190, 36532, 70980, 67447, 24931, 26649, 45326, 21060, 52210, 47919, 32997, -26350, -62041, -51310, 6599, -2535, 5768, 13102, 49900, 28724, 40472, 34367, 13943, 15973, 4816, -16285, -256, 2037, -24245, 15623, 38743, 29651, -1071, 345, 10799, 30983, 29884, 9583, -3251, 18231, 30997, 17081, 21521, 9693, 12233, 39773]
13730C9773k4531j0358L2950j6664k3811j1520l9773k993M509j0320k2574L6460
13718d8852J9464K3131K7835n748l1510j4626L7529R779O484l1924k795j3935
13706b5168k3606l709r677N140L0936M3123K199j930L910J9869k665k9135j9909
13693a0622l5774P178L7783L996j2545J6501j4891l2559L640L5492Q609Q365j4863
13680C10j0788J7652K978l765l7231J694M7175N3373K390o5350l3971K6695O450
13667G612m567J9415p081m777J3501L101k4326k2567j1418J4003m117l1193j5401
13654f7815J2106j0871L2955N6691j0293k1155R10j5398l265L3583j5192j1299
13642a9043p47O339j5640M6786M4691O382o537m8117m1932j585k8200l4922j2187
$$ y = [39773, 15242, 4884, 37834, 21170, -2641, -14161, -53934, -56927, -52418, -62738, -85312, -48852, -29388, -6257, 21578, 15830, -15680, -30306, 7223, 17002, 23486, -8438, -11233, -25168, -48774, -52483, -62160, -57020, -26084, 17039, 19238, 17308, 21218, 41087, 38422, 9287, -10622, -46396, -39218, -1435, 2561, -9984, 6517, -8374, -40933, -37293, -1801, 6808, 15173, 310, -10478, 7174, 10152, 6387, -30844, -29150, 18025, 71398, 73788, 8438, -25533, 1162, 7612, 3045, 22460, 15379, 10602, 24103, 27204, 2878, -19689, -31107, -17104, -21221, -52414, -67815, -55709, -66580, -33625, 23066, 12773, -8382, -7472, -22870, -26135, 7448, -7744, -19043, -19790, -13451, -29091, 17695, 62386, 68768, 62231, 14114, -27818, -29403, -57603, -92525, -104712]
13629a04712L0338L5610L0108m0696l3441J2060K0121L9988Q421L925O247r678
13617a709J237N901J9244J9373L4p075K6141j3750l8112J8441K4061j6965k2402
13604A4419r340j7177k4112J1847k562j4118K3915J7547J4534q833K356R36R499
13591A8911J7147k3071k0481M696J8378o798j8022j6310L0308J7694j7008j1467
13579f023O789R549K7961K2133k6925j7917r745j1201O813K2148k4614k3959j0218
13566c5209L2924K4414l0329J3677L7797j8040l9519L03K1368k910K5212P650
13554C7338l7794K8296R590n5120m0667j6881J8333L7270j1935J5150J2894j985
13542e511J4132k1537j0848J8661J2340J8910k3010j0966j9797k9252K3025M462
$$ y = [-104712, -74374, -38764, -8656, -49352, -82793, -70733, -50612, -10624, -2203, 1722, 7969, -1709, -472, 5429, 24673, 44046, 44080, 37005, 63146, 49396, 11284, 29725, 53786, 36821, 14419, 5079, -12098, -36210, -24363, -26925, -41043, -17128, 419, 14953, 6120, 8476, 9412, 18911, 36058, 12987, -7494, -2798, 15580, 8782, -9240, -25550, 4758, 22452, 5444, -6023, 766, 10315, 38276, 60409, 33484, 15567, 5822, -5379, 1434, 23582, -1032, -24991, -35209, -2285, 22129, -8200, 5477, 43274, 25234, -14285, -13982, 7386, 4476, 29688, 37338, -456, 27840, 37430, -17690, -58357, -75238, -56905, -19635, -31570, -16420, -3526, -5511, 8621, -12916, -23764, -5103, 7237, 26147, 3137, -7829, -27626, -56878, -33853, -29391]
13530b9391L5958j3872J2232J8251p094M557J1596J478r032j5914K5361J2788
13518D6918j9118N04j4125k1071k096j0380J4875J7375j2889J7521J7577j5901
13506A9190k1400q241K4311K1819j4775j851J9650J9553p070m7312k6702N5089
13494C2261l05p318K235J9368L3716n446o1705j474K7635j7895O356J7538j8573
13481B6393o2520P43J0565n171K2277R213j5229M1982M2817k4501j4250j9281
13469A3038N34J9954j3890j9144n179L3529j3860n434k0806J2210L2543j8975
13457A4520L5114L6329r729k101l1706n6212j1298K1695L6832n32j571j3441n2970
13444c5070m722L5505l6101k1098j982K5193M6800K1942P374l5239l5049K2310
$$ y = [-29391, 6567, -7305, 4927, 23178, 16084, 20641, 32237, 33715, 24683, 8769, 34130, 46918, 27800, 28304, 14179, -6892, -8988, -19368, -4493, 12882, -7, 17514, 35091, 19190, -2210, -10451, 13860, 35679, 20904, 19053, 38703, 58256, 51186, 3874, -22828, 32261, 31956, 24638, 26873, 46241, 79957, 74511, 12806, 11332, 38967, 21072, 27428, 44966, 26393, -36127, -35384, -24819, -29990, -7713, 1500, -13729, 28253, 71070, 46569, 32319, 13038, 13572, 33526, 19636, 492, -4687, 28842, 14982, 9548, -11258, 952, 33495, 14520, 49634, 85963, 76234, 74133, 42427, -13785, -25083, -3388, 33444, 32912, 31341, 17900, -35070, -39792, -4287, -40388, -61486, -63468, -38275, 8525, 30467, 37841, 2602, -32447, -10137]
13432a0137K7841o286m4927J2691L1689J0436J3709j7465l6975j5025j912j5320
13420e1681M1762K2279j4834l9196J3985L6493j6898j4654J5654J6590j5059K0863
13408A5304L298k4831k745L319r294J7013J4951j9221J6085J9409m7930k3137
13396c7779l482k0839M148O1869l849l7210K1955J326k3571L877j0664k8348Q09
13383g1758K1881L6753j43J8099j7908j536J55j6008j2678N907N8782J4339n7568
13370b1683m5302r8M8212J0420J0541n2742Q540N3727K2497K1834J9834j0247
13358F5533m7402k2921J4270O883j2164k2742n696K9423K4065J3309j76j9925
13346B2457k7345j7813M451n027J6992J4237K8425m546n4121j4135M862j703R545
$$ y = [-10137, 17704, 11418, -33509, -20818, 10871, 21307, 35016, 17551, -19424, -34449, -36361, -51681, -9919, 12360, -2474, -41670, -27685, 8808, -8090, -22744, -7090, 9500, -5559, 15304, 18602, -6229, -8974, -5655, -14949, 2064, 17015, -2206, 13879, 33288, -14642, -37779, -41261, -62100, -57952, 3917, 68, -37142, -15187, -13861, -37432, -33555, -44219, -72567, -71758, -49877, -13124, -13267, 4832, -13076, -14612, -14457, -30465, -43143, -37236, 21546, 35885, -21683, -66985, -67083, -18871, -8451, 2090, -50652, -42112, 11615, 34112, 55946, 75780, 65533, 18131, -4790, 9480, 16363, 4199, -18543, -24239, 5184, 29249, 42558, 42382, 22457, -4888, -22701, -18250, -23277, -6285, 7952, 36377, 31831, -22290, -36425, -31563, -33266, -23721]
13333b3721J9556k5640j4665j509K3413j8254o885J2881K1278N721N34k7013j6537
13320e0841J2753K8118J0824j3587r582l6662R797M603M2529k6186k815J1193
13308a9856m135j7561O434k318k2666j2146L3892K0861j5135K2045j2548L0859
13296G726K8962j003k7638R112P629O389k4831k3903j3284j3396J2460k3943j9403
13283g5123L2539J6206k4978K2148K5467N385k9802J0966p841m324J5218p678
13271b1817k0943N771O143O672k5572r283j1045k259J6081M3075J8308R453K2219
13258C6803j6451j938j9603l3829m1628J034K8538M4210k2926K0451o54P088j005
13245I0j742l6216K3560K9676j4603l9814o73J5803j6999L1181M0628p831j803
$$ y = [-23721, -4165, -29805, -44470, -45979, -22566, -40820, -47705, -34824, -13546, -7825, -7291, -34304, -50841, -38088, -9970, 854, -12733, -22315, -58977, -49180, -44577, -2048, -28234, -31049, -19856, -23991, -41552, -35118, -37436, -60102, -72248, -38356, -17495, -32630, -10585, -23133, 7726, 36688, 35685, 8047, 17159, 24788, 31177, 6346, -17557, -30841, -44237, -31777, -55720, -75123, -42584, -26378, -51356, -29208, -3741, 1644, -28158, -17192, -25033, -29357, -14139, -21817, -42760, -36989, -30846, -24174, -49746, -59029, -70074, -72333, -56252, -13177, 5131, 14584, 36803, 20352, 18414, -1189, -35018, -76646, -75612, -47074, -2864, -25790, -5339, -5993, 1095, 90, -1652, -37868, -14308, 15368, 765, -39049, -39722, -23919, -40918, -9737, 30891, 23060, 21257]
13232B1257J1304k1770q588M153j0724P76j575J7058q243K1441j4832m1306j3773
13219d4822P4387J999l57J3291n0743k1256M761J31L894q19K1501L0514n524j5656
13205A1301l5955k2248K484j4110K3405J2587j0986k3807J224M2251N6898L964
13193D7008n659N818j8188j8434J3514J8270k3810l6698K769J8831j467p579j4279
13180a9904j8644K963J8416j7989O175K4197q692q763K3257K5386K5374K0464
13168G2240l1541l3475l0061k4184J1613K7293j4488J0727M2001J6872P582k0585
13156C3994j5994k9440j0550L4838L9449l7526k209J5839Q13J9313J5716q744
13144E5499k2904o4664R818q897k3765M0416N5454J2795j1840m273r43k2231j7641
$$ y = [21257, 32561, 10791, 2203, 6356, -4368, -3592, -5167, 11891, 3648, 25089, 10257, -31049, -44822, 29565, 31564, 31207, 44498, -6245, -27501, -22740, -22609, -18715, -19534, 1967, 32481, 26957, 11301, -24654, -46902, -44418, -58528, -35123, -22536, -33522, -57329, -56105, -13854, 43044, 47008, 41349, 47167, 28979, 10545, 24059, 42329, 18519, -18179, -15410, 3421, 1954, -5625, -19904, -38548, -35585, -17169, -35158, -28983, -4786, -13478, -22241, 1016, 26402, 51776, 72240, 40699, 7224, -22837, -47021, -35408, -8115, -22603, -11876, 30125, 46997, 54579, 33994, 18000, -11440, -21990, 12848, 52297, 14771, 12562, 28401, 29214, 48527, 64243, 55499, 32595, -32069, -22251, -31148, -54913, -14497, 40957, 53752, 41912, 37639, 36696, 14465, -3176]
13131c176M0887K8823j7628k7271p625r529q841L879J9907r314j3756m5406q300
13118e7350J2405L059J7226Q409j2336L3649L9368K5180j5914k3358l8644j0431
13106a8737L0670N851N598k9541k2397k6367J5179J754K5548O453Q63J5926m214
13093F586M7432K3712J0306n4541k5890q730Q549k3755j496J4830K2848j3237
13081F614j7746k2405J959M500j3287N4815M5009m0234j7144p13J7585L7904o156
13068E0701k0536J5643L475O966k1859k5990l7350l8356J6753n303l304n26J1566
13055d8120k747L4618n411j2688J3947J6227j417J658L1129N5380J0848l9419
13043E4005k4672Q830L9875j0170k7072q664k1415o239J9193K6763r161Q11J7144
$$ y = [-3176, 37711, 66534, 48906, 21635, 14010, 4481, -4360, -481, 19426, 10112, -3644, -49050, -57350, -44945, -41886, -24660, -16251, -28587, 5062, 44430, 69610, 53696, 30338, -8306, -18737, 11933, 17784, 23382, -6159, -28556, -54923, -39744, -37990, -12442, -5989, -5126, 10800, 6586, 54018, 77730, 88036, 33495, 7605, -1125, 7424, -16331, -17827, -2997, 19851, 6614, -11132, -33537, -31578, -27078, -40365, 14450, 59459, 19225, 2081, 1368, 18953, 56857, 50701, 30165, 45808, 49283, 56249, 34390, 8400, -28950, -67306, -50553, -55856, -59160, -59686, -48120, -50867, -16249, -21660, -34348, -20401, -4174, -5591, -3933, 27196, 82576, 93424, 54005, 29333, 38163, 78038, 67868, 40796, 32132, 10717, 4478, 23671, 50434, 41273, 42084, 59228]
13030E9228j5903j5412n4922k2470K7490J4855m1794Q447M4458j5477L4188k676
13018B0012J5863j2208k1113r411j1774P817K1557J3762J6720j1370n597J41L4640
13005E9039K0284l9033l8392j6608j5085L6033J7691o628L3783J3134q933J4116
12993F9401L3140l0243k3257j9883J2144l5309k4613K769J4944M0032l506j1665
12981B3954l7622n8448J6907M3316k1024k4185j2437O732P9816R059J2480O269
12969D4817j4854P42L2809k4596j4761j2117M061Q961j3648n724M246J0697l9810
12956a9177j5807j6974J9924M1651K3293j1939m716R815R76J0865n287Q449J0210
12943E1283J7797j4797l0924m6125L154M0393M6089j4691m0194k5472q798r557
$$ y = [59228, 43325, 27913, -27009, -49479, -21989, -7134, -48928, -40481, 3977, -11500, 22688, 20012, 35875, 23667, 2554, -6857, -18631, -10814, 10743, 24505, 41225, 29855, 24258, 24399, 59039, 79323, 40290, 1898, -14710, -29795, 6238, 23929, 17301, 51084, 64218, 55285, 69401, 102541, 72298, 49041, 29158, 41302, 5993, -18620, -15851, -907, 39125, 35619, 23954, -13668, -72116, -55209, -11893, -32917, -57102, -69539, -62807, 17009, 26068, 38548, 44817, 29963, 30705, 63514, 38918, 24157, 12040, 16101, 25062, 11414, 5690, 9936, 20633, -19177, -34984, -51958, -32034, 9617, 32910, 20971, 16255, 26070, 27046, 37911, 32624, 41073, 51283, 69080, 54283, 23359, -22766, -19612, 20781, 66870, 52179, 11985, -13487, -22285, -31842]
12931c1842l374J9799K1937J7486m0459J1605K7423O841j6972j4356n2697J0432
12919d4177Q5170J8373j8282n4509k5171L3161r546m9894m038L2606j7587j8827
12907g2721J8504K8033L7897L0706n068j8885j620J4520m3248l9186J4822L3861
12895b385L0519J3114J9437J0393l2979k742L9306K809j3841J3300r983l4011
12883C2937k5521k0578L7125L7355j3313l4945J7499p665L1333K3039O079k6111
12871E7234k3886n646j6809n507k0465k3662J625Q131K6058k3777k4334p673K7974
12858c0737K0262l854J9303K1197K6109k367m9491l8810K5933K8116k6907k6655
12846c7901o847P198l1628l8011K6424L1823M098k1890K5882J3276j9278K1158
$$ y = [-31842, -35216, -15417, 6520, 24006, -16453, -4848, 22575, 29416, 12444, -1912, -54609, -44177, 40993, 59366, 41084, -13425, -38596, -5435, -14981, -64875, -68913, -36307, -53894, -72721, -54217, -26184, 11713, 42419, 37351, 18466, 16846, 31366, -11882, -51068, -36246, -2385, 28134, 41248, 60685, 71078, 38099, 35357, 74663, 77472, 63631, 76931, 66948, 32937, 7416, -13162, 23963, 61318, 48005, 13060, 30559, 22894, 54227, 77266, 83345, 57234, 33348, 27702, 10893, 5386, -15079, -38741, -37116, -28985, -2927, -26704, -51038, -58711, -30737, -10475, -14329, 4974, 26171, 52280, 49913, 422, -38388, -12455, 15661, -11246, -37901, -44748, -37550, -69178, -107189, -80765, -48942, -44844, -66734, -40852, -27576, -46854, -25696]
12834b5696K0330P383J27K4962m1584j8099L7289N7644L9031j8925l3201n0096
12822h35K5187j2875j0509J8298P384J7145L4587j8857m2366J9427K2680j7504
12810D1762j3722k6579J8938q202j7720K0344J5423K3747k131m1032k4711K3842
12798I959n517L4939j3147k3762P2405J5433o1401J1131K2707j2247n4922K1180
12786A6758L9654N043n5517K4703k1118k2948j2628J9969K2172N523J8915j4816
12774B5710n4770O319J9194m0997m540N0714K7079l283j8095j4352J7826K0965
12762C1770l0219o258j7575J252j3336M1758J1670M02Q944j5833J0547K8610p051
12749D4681N093o101n6939K71R404K6278N2274M762P059j4968k1467k4319k0710
$$ y = [-25696, -5366, 2017, 2144, 27106, -14478, -32577, 4712, 62356, 101387, 82462, 49261, -835, 24352, 11477, 968, 19266, 26650, 43795, 78382, 59525, 17159, 36586, 59266, 41762, 28040, 1461, 20399, 12197, -5523, 14821, 30244, 53991, 51860, 10828, -13883, 9959, 4442, 39381, 26234, 2472, 74877, 90310, 28909, 40040, 62747, 50500, -4422, 16758, 56412, 61455, 5938, 30641, 9523, -13425, -26053, -6084, 16088, 21611, 40526, 25710, -29060, -22741, -3547, -44544, -49084, 1630, 28709, 25426, 7331, -7021, 10805, 31770, 1551, -4707, -22282, -21030, -34366, 7392, 19062, 19464, 28408, 12575, 23122, 51732, 44681, 49774, 43673, -13266, -12995, -3591, 22687, 74961, 79723, 86782, 71814, 50347, 26028, 5318]
12736E318n780m1469J3464K5812k3735k8561K0775O243r024O626J4084K9236j0927
12723B062l288k2566N876p39P392J780k6206j0028O660k4308j607K5068J8765
12710b1139K7655j2735m5195m3790L483L7672N7325L066O030J3004k8848r650
12698a3122R170k4435K111L5590R430j8246j5857R502K3688K76j0523j3989J351
12685e054k666j9658q039n160M1763R70J608k3887l4589J6372K9551K0416k4908
12672a3281K3397P668k113N979j044k9370J0761K7310K0388k957K113O981K9425
12659H5257k7203k0048o769M0409J1825k8378k5088k8920j6075J4471p109J9902
12647A2274L0051J6409K6579J5413m2850j7329k069j5695K7929O549J472N29j6301
$$ y = [5318, -462, -41931, -28467, -2655, -26390, -54951, -34176, -27933, -36957, -30331, -16247, 12989, 2062, -1226, -23792, -17916, -18655, -11263, -9483, -35689, -45717, -39057, -63365, -64972, -39904, -21139, 6516, -6219, -51414, -95204, -91721, -54049, 3276, 6342, 12372, 25376, -3472, -13122, -3952, -28387, -26276, 9314, 18744, 498, -15359, -5857, 17831, 18107, 7584, -6405, -5054, -7720, -27378, -35417, -40577, 1186, 2156, 3764, -20123, -54712, -38340, -8789, 11627, -13281, 10116, 17784, 15671, 21650, 20606, -8764, 1997, 29307, 49695, 46738, 48851, 55832, 85257, 58054, 38006, 31237, 71646, 83471, 55093, 30005, 1085, -14990, -519, -7628, 12274, 42325, 58734, 85313, 100726, 57876, 40547, 38478, 22783, 50712, 57261, 58733, 59262, 42961]
12634D2961k1104O628L6663k9249k1168N161k7O97j4639n049K8314K9070j7987
12621D0271j4582m729n628J0218l7043Q216L2232L16K6034j199k1037k2328O488
12608A7229k3495j4360J049L6183K8056K6667j1273m521K6647M0703m564o9441
12596D8880k1861K9208L202k407k2173j3987k1369M0207J2348k3637j1551L7121
12584E3981r363k8738q715J4463L8546K0574k3781j6599p971q617l4534l0963
12572d1717l296R173J5609J0290J2862j09L616l599N710J2915j3780k259L6582
12559D1997J4829p514L340p593j2070k3404l0932j252O523M4737J1787K294j1397
12546C1345L8046j3788l1492j5811l091N283n775J9276R944o852j5253j9269M3926
$$ y = [42961, 21857, 28485, 65148, 35899, 14731, 19892, 19865, 20562, 5923, 874, 29188, 58258, 40271, 25689, 20960, 15332, 25550, -11493, -3277, 28955, 29271, 55305, 54106, 33069, 10741, 17229, -6266, -20626, -19577, 16606, 44662, 71329, 60056, 55535, 82182, 122885, 118321, 48880, 27019, 56227, 59429, 57022, 34849, 20862, -507, 39700, 52048, 28411, 16860, 53981, 44618, 15880, 7165, 21628, 60174, 80748, 56967, 40368, 32397, 23780, -10754, -41717, -45013, -35840, -20231, -9941, 2921, 2812, 6428, 2829, 8539, 21454, 7674, 5415, 41997, 56826, 49312, 52652, 45059, 32989, 9585, -21347, -22599, -16076, 28661, 40448, 42742, 31345, 69391, 55603, 24111, 8300, 5209, 10492, 4717, 23993, 33937, 27085, 11832, -7437, 36489]
12533C6489J5616k7477j3310M4781J439O629k2951J1418R975j8499r444L4161
12521F8827O16J4306K3162o689l3511Q160M0736j554k8795n1047l6602k9195J5168
12508a6418N4247J0805n244P148K698k9965j8771L562K0928P142j5503j4820j0713
12495d904K690k0496J800J6716M650K7183k381K524k1701n273L0708J4102k2151
12482B3467j6644K5908L231l0731q228J9953L274j0293m140L016k0929j3088p961
12469c3165K2532K0484L4782j5262k5917L7665J5964n740j4499q381j9770K8763
12457C7456N195j7230R68k2495p258k1904K4519R9J8835L8005q913J1816P549
12444F6642L149K3460j1212k6998k099q134M69k4372L1682J0637m6090M8580R859
$$ y = [36489, 52105, 24628, 11318, 56099, 57538, 64167, 41216, 52634, 62609, 44110, 34666, 68827, 69443, 83749, 106911, 100222, 66711, 74871, 115607, 114053, 85258, 34211, -2391, -31586, -16418, 37829, 48634, 43390, 50538, 53236, 23271, 4500, 8062, 28990, 36132, 20629, 5809, -4904, -2214, -22710, -20910, -4194, 456, 27639, 25258, 27782, 6081, 808, 31516, 45618, 23467, 6823, 32731, 35962, 5231, -2997, 16956, 20230, 9937, 5797, 8813, -12116, -25204, -33165, -10633, 9851, 44633, 29371, 3454, 41119, 57083, 51343, 36844, 28463, 8693, 37456, 42651, 25421, 26389, 3894, -3364, -25268, -749, -650, 18185, 56190, 47277, 59093, 66642, 69791, 93251, 82039, 55041, 52942, 44808, 45277, 20905, 52587, 63224, 17134, 65714, 75573]
12431G5573j4890k9266k8125J6943J402k2423L2346M4824L494k6114k9005j3294
12419A1465K1841J6941o793k5333O554J8094P206k3301k74n273J6221j3419o098
12406A7831p893O39R682L0872K1091k8799l2925K8336l404k100J089q32r097m382
12392B0108J757K7008p814m7309k2376K9351K3126R361J6352K9626l0501j8249
12380C0440k663K0607L50l0703j7207p897l731M7121K4842M152k6488J2119N3700
12367A04642l627l185J7748l149j9978m5825m2721M0408N3104L7037K4780m082
12355A55152n1145m2402q867K1197L4165K296j6065p710Q555j5996O660N6657
12343A42497k1723n2249N29o55J5832J2292k620j9695O222l8392j2631K8516J0309
$$ y = [75573, 60683, 31417, 3292, 20235, 21637, -786, 31560, 76384, 79878, 53764, 24759, 11465, 33306, 50247, 43454, 18121, 24675, 42769, 49975, 26674, 26400, 21127, 37348, 23929, 17831, 9938, 10577, 20259, 51131, 72222, 43423, 10498, 38834, 35430, 33330, 34419, 33587, 24490, 20108, 21865, 48873, 41059, -6250, -28626, 725, 23851, 33212, 49564, 79190, 48689, 30440, 27777, 48384, 48734, 18031, 824, -7073, -10804, 36317, 61159, 65311, 38823, 50942, 104642, 101015, 97830, 115578, 112429, 92451, 46626, 3905, 44313, 97417, 134454, 159234, 155152, 104007, 61605, 52738, 73935, 108100, 110396, 94331, 86621, 95176, 79180, 85840, 142497, 120774, 68525, 69054, 68399, 84231, 96523, 93903, 74208, 80430, 42038, 29407, 57923, 68232]
12330F8232k1512k1642j3690K4340L2912n001k2017n8198m636L8022K1547J3228
12318E1585P559J6691N141J6896L241k6025o209K6287l6928k0685J7684J2890
12306F8127r927J7367k9849o329k7021O680K5601J5016L741k8941Q179p027j3175
12293B2442o201m473m2039p700M859K4475K6305P73R280P184J5987K8869J7670
12280I7431m4072J5844j396l6002J1580p428J728o38K7580j1335k7399K9322J9159
12267G4374j4211j1753J2664n262l433j6254P461K8208J6843J405j6567N250N629
12254H4354j0348k509K6359M393j9965q65P68l2842j5779J9143o805K7742J5170
12241H8816k29M75m99k155j783K2301l335j004J6213m602l1983K3458q691J1876
$$ y = [68232, 46720, 25078, 11388, 35728, 68640, 63639, 41622, -16576, -21212, 16810, 38357, 51585, 59144, 75835, 80976, 97872, 101113, 75088, 68879, 95166, 58238, 37553, 55237, 68127, 58200, 75567, 45718, 39389, 12368, 19048, 44649, 59665, 63406, 34465, 42644, 35617, 22442, 16241, 11768, -30271, -37971, -33112, -8637, 17668, 18441, 27721, 34905, 50892, 79761, 97431, 53359, 69203, 67807, 31805, 43385, 35957, 37685, 37047, 64627, 53292, 25893, 55215, 74374, 60163, 48410, 61074, 55812, 52379, 36125, 43586, 71794, 88637, 90042, 73475, 78725, 84354, 74006, 71497, 97856, 102249, 82284, 81419, 82187, 49345, 33566, 52709, 45904, 73646, 88816, 88587, 89062, 88563, 86408, 84625, 106926, 103591, 102587, 118800, 114198, 82215, 105673, 96982, 108858]
12227A08858M625k3302R825K7373k1797q974m005j5347M971J64Q597l154J5735
12214A03569J2988J2655Q337k6870l3042K3412J3903r310J476O276j868j0666
12202A00860j9264J238m025J988N6162K9131N828K230J019r219j8597k9957K8743
12189A46137L1102j0863N2208p246p0304J1958j0718K9552n839K1134J4704N915
12177B07740r287j1452k9778k612J0514j7876l3448J5Q836k9481o016r462m074
12164G3619J3524K8290K6407Q222J1106L0411M0700M3278l738M498q853k8535
12152B38929J8374K1208J7339L7868M0860l8399N4081O3997O4158Q3808N9698
12141F61921Q0297J01153J21291J24280J33856J60098J50560R0597O4905L6029
$$ y = [108858, 113483, 90181, 100006, 127379, 105582, 96608, 92603, 77256, 82227, 82391, 90988, 87834, 103569, 116557, 129212, 137549, 110679, 77637, 101049, 114952, 105642, 107118, 113394, 111526, 100860, 81596, 82834, 78809, 80797, 136959, 166090, 171918, 174148, 175167, 165948, 147351, 117394, 146137, 177239, 166376, 218584, 211338, 141034, 152992, 142274, 171826, 165987, 187121, 201825, 207740, 198453, 187001, 157223, 154611, 165125, 147249, 113801, 113816, 122652, 93171, 87155, 77693, 73619, 87143, 115433, 141840, 150062, 161168, 191579, 232279, 275557, 271819, 276317, 267464, 238929, 257303, 278511, 295850, 333718, 374578, 336179, 390260, 454257, 518415, 602223, 661921, 742218, 843371, 964662, 1088942, 1222798, 1382896, 1533456, 1624053, 1688958, 1724987]
12131A724987j9193p8474j26694r2695j23581j43755j50012j39484r9227q4646
12121F67226n7782m7540k7680n4723m6907j4931o845m960j0285n3716k8562M0580
12109C53875r912j7739j5470J4778J1995l6404k9745k5899M9024J1405l5502K8241
12097B98647j0801k5127l2014K2596J8225M760R440K9536K3119l1942j0439K0279
12085C16279k8931k3187m7361j3227r333n217L9928K2979N7410K9467n798o285
12073C26724J2183M259K7134K3494P585k1576l0181j9172J4930K4936K2349k4836
12061C67829j4404j0397j166K8014L6384r221j0326J5588n16j7952p404J4139
12049C90568r883K2047K1642o603Q302K5875O15j4348j4024J8393L8541L6120
$$ y = [1724987, 1705794, 1627320, 1500626, 1407931, 1284350, 1140595, 990583, 851099, 751872, 667226, 609444, 561904, 534224, 479501, 432594, 417663, 410818, 405858, 395573, 341857, 313295, 353875, 343963, 326224, 310754, 325532, 337527, 301123, 271378, 245479, 294503, 305908, 270406, 298647, 287846, 262719, 230705, 253301, 271526, 276286, 285726, 315262, 338381, 306439, 296000, 316279, 287348, 264161, 216800, 203573, 194240, 189023, 228951, 251930, 309340, 338807, 333009, 326724, 338907, 343166, 370300, 393794, 401379, 379803, 349622, 330450, 345380, 370316, 392665, 367829, 353425, 343028, 341862, 369876, 406260, 397039, 386713, 402301, 401785, 383833, 376429, 390568, 380685, 402732, 424374, 417771, 426073, 451948, 452563, 438215, 424191, 442584, 481125, 517245]
12037E17245O5379O89o75M3384K4375j5275L269l0023K9914L1633M2038l910N5688
12024G63731K8614J3484K113k099N6674P2864M0112J614L1249O3905P8935P2082
12012A223278O3435K0393O383M2164L7251M1805J19293O7843M7537P1769R9114
12001A840265P9401O1795M5267R2933J51259J68060J58033J87036J89682J95289
11991C169020K15745K60551K55936K93718L31128L44500M47553N19041O29767
11982F466959P50421R33525J063107J232387J481209J814626K211612K662304
11974A8616150L148716L813852M378219N028500N647668O423885P215544Q180259
11966F2452793R304492J0326976J0681053R565355O062703Q7472o859117j2091819
$$ y = [517245, 582624, 583313, 582638, 626022, 650397, 635122, 638391, 608368, 638282, 669915, 711953, 708043, 763731, 792345, 805829, 807942, 805843, 862517, 935381, 975493, 977107, 1008356, 1072261, 1151196, 1223278, 1286713, 1307106, 1313489, 1355653, 1392904, 1434709, 1554002, 1621845, 1669382, 1741151, 1840265, 1919666, 1981461, 2026728, 2119661, 2270920, 2438980, 2597013, 2784049, 2973731, 3169020, 3384765, 3645316, 3901252, 4194970, 4526098, 4870598, 5318151, 5837192, 6466959, 7217380, 8150905, 9214012, 10446399, 11927608, 13742234, 15953846, 18616150, 21764866, 25578718, 29956937, 34985437, 40633105, 47056990, 54272534, 62452793, 71757285, 82084261, 92765314, 102330669, 108393372, 108480844, 101621727, 89529908]
11958H9529908j4086517j3321749j1268130r059391p148184n593295m449316l543462
11950B1059864k843419k324607j899280j562488j347069j115722r48932q19427
11942H198920p27637n83330n16855m69698l79016k84450k61535k48285k25903
11933D502211k34471j62114j60179r9803o4182q7421j45528j38639j28863j26500
11923C154511j49812j40165j40167j14678j10618r2418j17036j60284j39649r6552
11913A893132j04631q7673o5935l5444j09780o1898p5938p5662q5716m1424m6214
11902A102817m5093j6098K4829O907l5295m8782l2382J744l573k7589o0714m2012
11890H24759K3076n5136l3198L814q927j6616L3289M0853L714n563J7416L843
$$ y = [89529908, 75443391, 62121642, 50853512, 41794121, 34645937, 29052642, 24603326, 21059864, 18216445, 15891838, 13992558, 12430070, 11083001, 9967279, 9018347, 8198920, 7471283, 6887953, 6371098, 5901400, 5522384, 5237934, 4976399, 4728114, 4502211, 4267740, 4105626, 3945447, 3845644, 3781462, 3694041, 3548513, 3409874, 3281011, 3154511, 3004699, 2864534, 2724367, 2609689, 2499071, 2406653, 2289617, 2129333, 1989684, 1893132, 1788501, 1700828, 1634893, 1599449, 1489669, 1427771, 1351833, 1276171, 1190455, 1149031, 1102817, 1057724, 1041626, 1066455, 1073362, 1038067, 989285, 956903, 958647, 955074, 927485, 866771, 824759, 847835, 792699, 759501, 763315, 754388, 737772, 771061, 811914, 815628, 810065, 827481, 831324]
11878H31324j4078J0825j5151k6918J0035k7255M464O2963M3332J726J46K7985
11866I09398L8647L3630J5044L8119N4801O5100M9200M6381L2829j5668J6685
11855A284166j1666m3278J3235P106J1941R847j4406n0538k9853j1174l444m2987
11843A118949p556p238o625m0661n9500o886k27J7447o984k3920j5029K3926M7587
11830A033283J9300j882P913J506j3239j6486m6773k2156L1818M5602Q0J2856
11818A051822J8008o048m979L648J19J0915K3600M0096K8272J7874J2474q611
11806A187190M8931L8156K7642O4758L3145k3923k4862j4204J2306J5303L0593
11795A395035N7382L5536P0093L3321N4102Q4715J02849P8189L6188J05402R5599
$$ y = [831324, 817246, 828071, 812920, 786002, 796037, 768782, 773246, 836209, 879541, 881267, 881413, 909398, 948045, 981675, 996719, 1034838, 1089639, 1154739, 1203939, 1250320, 1283149, 1267481, 1284166, 1272500, 1229222, 1242457, 1249563, 1261504, 1271351, 1256945, 1206407, 1176554, 1165380, 1161936, 1118949, 1111393, 1104155, 1097530, 1056869, 997369, 990483, 990256, 1007703, 1000719, 976799, 961770, 985696, 1033283, 1052583, 1050701, 1058614, 1060120, 1046881, 1030395, 983622, 961466, 993284, 1038886, 1038966, 1051822, 1069830, 1063782, 1058803, 1062451, 1062570, 1073485, 1097085, 1137181, 1165453, 1183327, 1195801, 1187190, 1236121, 1274277, 1301919, 1366677, 1399822, 1375899, 1351037, 1336833, 1349139, 1364442, 1395035, 1452417, 1487953, 1558046, 1591367, 1645469, 1730184, 1833033, 1911222, 1947410, 2052812, 2148411]
11784B148411M9105N4090R6892O4146P2221R0715J39579J27678J04646J18605
11774C066088J51790J42052J51126K35728K38557K42115K58335K84445L06758
11765E076994L39684M36843M78684N40464O36869P37434Q38994R63734J173188
11756A1222888J320444J422820J618121J773487J919740K085931K258001K480633
11748B6102065K874904L378085M158366N291368O811736Q975046J1748527J5244273
11740H4584370J9376527K3944695K8364181L1975421L4163831L4265227L1628818
11733B88303070K6066521J7835436P684491l235361j3767568k3001016k9882030
11726B70003543l3803494l4763190l3198553k9873051k5503746k0777815j6355172
$$ y = [2148411, 2197516, 2251606, 2348498, 2412644, 2484865, 2575580, 2715159, 2842837, 2947483, 3066088, 3217878, 3359930, 3511056, 3746784, 3985341, 4227456, 4485791, 4770236, 5076994, 5416678, 5853521, 6332205, 6872669, 7509538, 8246972, 9085966, 10049700, 11222888, 12543332, 13966152, 15584273, 17357760, 19277500, 21363431, 23621432, 26102065, 28976969, 32355054, 36513420, 41804788, 48616524, 57591570, 69340097, 84584370, 103960897, 127905592, 156269773, 188245194, 222409025, 256674252, 288303070, 314369591, 332205027, 339889518, 336654157, 322886589, 299885573, 270003543, 236200049, 201436859, 168238306, 138365255, 112861509, 92083694, 75728522]
11719G5728522j2554307r476433p194038n571880m417420l526058k954121k544585
11711B7489680k278939k145527j983741j875585j740872j630945j569384j431012
11703A2833675j240401j103862r74210q46086p58892o28636n19117m49233m08652
11694E904586l64819l12746k54008k82930k79169k14675k11055k30475j73458
11685C581251j42962j44123j49372j66463j26408q3179r0964j17951j11586r5491
11675B352752r5429j01850q5139o1615j09082j17861l6913l5978m0574n5628m6644
11664A566039j8178k4872l9317q8448p7699n2730L413J4438n4827n8967j4559
11653A154293j8635o0862l5854l4180k6996m8105m3582j2563j9768o313J1842
$$ y = [75728522, 63174215, 53697782, 46503744, 40931864, 36514444, 32988386, 30034265, 27489680, 25210741, 23065214, 21081473, 19205888, 17465016, 15834071, 14264687, 12833675, 11593274, 10489412, 9515202, 8669116, 7910224, 7281588, 6762471, 6313238, 5904586, 5539767, 5227021, 4973013, 4690083, 4410914, 4196239, 3985184, 3754709, 3581251, 3438289, 3294166, 3144794, 2978331, 2851923, 2768744, 2677780, 2559829, 2448243, 2352752, 2257323, 2155473, 2070334, 2008719, 1899637, 1781776, 1744863, 1708885, 1668311, 1612683, 1566039, 1547861, 1522989, 1483672, 1395224, 1317525, 1264795, 1268208, 1282646, 1227819, 1168852, 1154293, 1135658, 1074796, 1038942, 1004762, 977766, 929661, 886079, 873516, 853748, 847435, 859277]
11642H59277j7513k4413n3424k5253p0902l5055K429J2480j3903k1502K6751P1065
11630G10037m726l5797l4629Q93J348k8212k3144j2107r55l1458k747j0369K650
11617E30784J6986J6970j0977o4052j1984q681k5782P294K3392o114R967o883
11605D70920k4383l6463p738M7633N6591J8788q328l010L0763M8161K6299j6594
11593F02639J3783l745K3353l930l8299n8932j3709l3015k2050K9317J9887k5436
11581D89863l9794J4586k2773j9372j1960r640j2918R415M71k4824K930N986k021
11568C79949l0413j4990l3105j3833J7850K7131j521k0865K9502J2355k7735n5594
11556B68731n8037K1942r541l057J2776N60J4956J191l2365k9729j4089K0103
$$ y = [859277, 841764, 817351, 763927, 738674, 667772, 632717, 635146, 647626, 633723, 612221, 638972, 710037, 705311, 669514, 634885, 635778, 637126, 608914, 585770, 573663, 572708, 541250, 538503, 528134, 530784, 547770, 564740, 553763, 489711, 477727, 469046, 443264, 450558, 473950, 467836, 477803, 470920, 446537, 410074, 402336, 449969, 506560, 525348, 517020, 514010, 544773, 592934, 619233, 602639, 616422, 612677, 636030, 632100, 593801, 534869, 521160, 488145, 466095, 495412, 515299, 489863, 450069, 464655, 441882, 422510, 410550, 400910, 387992, 397407, 397878, 373054, 375984, 381970, 379949, 349536, 334546, 301441, 287608, 305458, 332589, 331068, 310203, 339705, 352060, 324325, 268731, 210694, 232636, 223095, 220038, 232814, 233374, 248330, 249521, 217156, 187427, 173338, 193441]
11544A93441P231r972L8919J7171J3336k32k4952k1083j0645j6811k4611M0132
11532B01924N3466L57k847j3470J4534M3548q002k0231l9473k7426j8919k2454
11520A61007m9594J0514L9690k968N441K3314j9689M0072j7287l7604p311M1789
11508A87374q845k7209L7445M4879J5306n4922l2901r423L9523K5606Q138J6590
11496B41561j9902j8513k7795N643K5552o550k4569j1853m5063j3026L3586K1637
11484A60708R139r453J5829K0557j376p118m231j0204J1575m49M185J0875q693
11471A91344L591L0464j2510k7197n077q704j7862J7949J0027r035l9564j5817
11459A17609K2947L0874M755m9904n6788L8457M4885k0392K4659K0526J3157j5192
$$ y = [193441, 200672, 190700, 229619, 246790, 260126, 259894, 234942, 213859, 203214, 186403, 161792, 201924, 255390, 255747, 252900, 239430, 253964, 297512, 289510, 269279, 229806, 202380, 183461, 161007, 111413, 121927, 161617, 158649, 164090, 187404, 167715, 207787, 190500, 152896, 145585, 187374, 178529, 151320, 188765, 233644, 248950, 194028, 161127, 151704, 191227, 216833, 224971, 241561, 221659, 203146, 175351, 180994, 206546, 199996, 175427, 163574, 118511, 105485, 139071, 160708, 169847, 160394, 176223, 196780, 195404, 188286, 184055, 173851, 185426, 184977, 189162, 200037, 191344, 194935, 225399, 212889, 185692, 180615, 171911, 154049, 171998, 182025, 172990, 133426, 117609, 140556, 171430, 176185, 126281, 69493, 107950, 152835, 132443, 157102, 177628, 190785, 175593]
11447A75593j0159j8702k1729m6734j941j5038L4792M2352r823N42k059P506k9620
11434A04980K5596M3504l6997j8005M0484l7455k7639L8923j0782j9097P156l0643
11422H0025N238j5697K816K5257K3884L6367l8187o3923k4401K0526J8724p129
11410F3500Q036l449K448J5117M395j2032J2896L9276J1063m528j5726l6282j9187
11397F5527K8283N0888L895k4731k5879O371j5076k2325K363r630O889M5903j2541
11384I9937j9366M9045k57K1288L5871K6455m3430m3151j7812J0j3368j3156j921
11371H0145j0871Q743K8924l2140j1813M0847j1376j9389Q464o290k6808L2333
11359H0769K2767O487j515j0786m255k2562J7098J8697m1205k5755M0097J7447
$$ y = [175593, 165434, 146732, 125003, 78269, 76328, 61290, 96082, 138434, 128611, 129153, 127094, 134600, 104980, 130576, 174080, 137083, 119078, 159562, 122107, 94468, 133391, 122609, 103512, 110668, 80025, 85263, 69566, 72382, 97639, 121523, 157890, 119703, 55780, 31379, 51905, 70629, 63500, 71536, 68087, 70535, 85652, 90047, 78015, 90911, 130187, 141250, 136722, 120996, 84714, 65527, 93810, 144698, 148593, 123862, 97983, 104354, 89278, 66953, 69316, 59686, 66575, 112478, 99937, 80571, 129616, 129359, 150647, 186518, 212973, 169543, 126392, 108580, 108590, 95222, 82066, 80145, 69274, 78017, 106941, 74801, 62988, 103835, 92459, 73070, 81534, 75244, 48436, 80769, 103536, 110023, 108508, 97722, 93467, 70905, 88003, 106700, 65495, 39740, 79837, 97284]
11347I7284M652k0903J0634J5353M0053Q1068J6618L4042M1975M4751J1846K6137
11335D03510R0516J25710R8184O6076J46169J50325J53944J52096J00477O7255
11325A554262M4097J8238k1037r2438r4869j32768j39949j39287j51321j21793
11315G23135r0438p4003m2403n9297n1875q460j8359l4237m8243p8352l6473m6851
11303A34144k9626k0372L5673L9275J2343J7922o8538l2101J6661m955q096O3662
11291A55992L0975j4879m9065p032k0723j4669k1901L323o484j0672j9864J1691
11279C6692L1181P571k1391k465J90K088L4054J795o689K5810j9834m2645R450
11266E5807l619m5222J51K6562J2592O228M78j023l0673k7386J1960J5458k0896
$$ y = [97284, 101936, 81033, 91667, 107020, 147073, 228141, 244759, 278801, 320776, 365527, 377373, 403510, 494026, 619736, 717920, 783996, 930165, 1080490, 1234434, 1386530, 1487007, 1554262, 1598359, 1616597, 1595560, 1503122, 1408253, 1275485, 1135536, 996249, 844928, 723135, 632697, 558694, 516291, 456994, 405119, 396659, 378300, 344063, 295820, 217468, 180995, 134144, 104518, 84146, 119819, 159094, 171437, 189359, 120821, 88720, 105381, 100426, 92330, 155992, 186967, 172088, 123023, 115991, 95268, 80599, 58698, 62021, 55537, 44865, 25001, 36692, 67873, 75444, 54053, 51588, 51778, 53866, 87920, 89715, 83026, 108836, 89002, 46357, 55807, 52188, 6966, 7117, 33679, 46271, 52499, 52977, 51954, 21281, -6105, 5855, 21313, 417]
11253D17k0939J4531N0166K292j2282J054L0911m60j64k0813j5231o102k0860
11240B520j2277L884M7390K5375k6139j6057J3568j563j8991K7968K1883j5133
11228E2428k1045k2912o343J3418N593N0514j970m7247m7941r750M26J4292K0210
11215c27K841J5715J1952K9191J6687P730J8322j4948m1620j0473M1887R457l1275
11202E5139q240Q314M8230o649J3408j4868j1908K7877l520j0881K678m1056k6399
11189C2125L2465J5575j3871O675M7089j3112l2334l3157m3022P352L2436J4533
11177E2754k0087p901L4748p154l0126L9536J3449M821p4369n9481K0352P061
11165b6397J4345L6056k3241N118k4385k0294K8416J4947k4029M738K7974L0381
$$ y = [417, -20522, -5991, 44175, 46467, 34185, 35239, 66150, 65690, 65526, 44713, 29482, 23380, 2520, -9757, -5873, 41517, 66892, 40753, 24696, 38264, 36701, 17710, 45678, 67561, 52428, 31383, 8471, 2128, 15546, 21139, 71653, 69683, 22436, -25505, -35255, -34829, -20537, -327, 2514, 18229, 30181, 59372, 76059, 83789, 102111, 87163, 45543, 35070, 76957, 86414, 55139, 46899, 55213, 103443, 96794, 110202, 95334, 83426, 111303, 107783, 96902, 99580, 58524, 32125, 64590, 80165, 66294, 72969, 120058, 106946, 74612, 41455, -1567, 5785, 38221, 52754, 32667, 24766, 59514, 52360, 22234, 61770, 75219, 80040, 5671, -53810, -33458, -26397, -12052, 24004, 763, 5881, -18504, -38798, -10382, 4565, -19464, -14726, 13248, 43629]
11153D3629N242K735M6346K8889Q13j8633M1198m253o9807n0558M962J0102k8396
11140A2269j1983J7049j3792k6414J8904J8700N1128N8612K0194k1800j8515n1504
11128E2848j8603q132j7682J4014p527o205q152m229J4957r314r85o477P107K6483
11114B8103p09M1505L3923m5203n4697P548L9703L4854j1462k6956o97j842j731
11101D2339m1501K7230L5573N015j8919k1983j9715k9902P479J5123J7734j2476
11089E997l3985q644J0555L5758k469j678L0792O601k8963j391j9367M883L5052
11076C3141q205J903J5067k1454j8413K3718L8184J955q980n45j2024p562j6884
11063A9901L5056R636l9113k5411k7788K8625J7090p695q821J1207K2797K8332
$$ y = [43629, 48871, 51606, 97952, 126841, 127654, 109021, 150219, 145966, 76159, 25601, 30563, 40665, 12269, 286, 17335, 3543, -22871, -3967, 14733, 65861, 124473, 144667, 122867, 104352, 52848, 34245, 26113, 8431, 22445, 14918, 8713, 561, -3668, 11289, 1975, 990, -5487, 1620, 28103, 27394, 68899, 102822, 57619, 2922, 10470, 50173, 85027, 73565, 46609, 45912, 44070, 42339, 838, 28068, 63641, 68656, 49737, 27754, 8039, -21863, -14384, 739, 18473, 5997, -27988, -36632, -26077, 9681, 7212, 5534, 36326, 42927, 13964, 12573, -6794, -1911, 33141, 24936, 26839, 41906, 20452, 2039, 25757, 63941, 65896, 56916, 56371, 44347, 36785, 19901, 54957, 64593, 25480, 69, -27719, 906, 17996, 10301, 1480, 12687, 35484, 63816]
11051F3816K0335k630J2566O844L6346M0159K0512j3115Q233j4337k1776L131
11039A60084o510M4965L0208K4859M0393M4104Q8837P1626j406k1268l2488n0485
11027C92919j0338K5586K9420M4823L6834O9498N6768j9875k2596m4769o8485
11016D89785l7617n9417l5502k6071M087N4867M1536M6896J7723p9919j24693
11005B91675m6973l3132m4283k7099K7438M8670N1350k8679q776m10O468l4567
10993B01682j4455p9099n9583K4711K8839k0727l3216l3849j1358M544N2723K2313
10981H2525P583J5672m8378m6442k0579J6650L8857k4998n055J4355m936l427
10969B1827j019k7587n0033J4751N6692O24j4781N239P348k2005l592M3858M9963
$$ y = [63816, 84151, 81521, 94087, 100931, 137277, 177436, 197948, 184833, 193066, 178729, 156953, 160084, 153574, 198539, 228747, 253606, 293999, 338103, 426940, 498566, 497160, 475892, 443404, 392919, 382581, 408167, 437587, 482410, 519244, 588742, 645510, 625635, 603039, 558270, 489785, 452168, 392751, 357249, 331178, 335265, 390132, 431668, 478564, 496287, 416368, 291675, 244702, 211570, 167287, 140188, 167626, 216296, 267646, 238967, 230191, 229781, 236249, 201682, 187227, 108128, 48545, 73256, 102095, 81368, 48152, 14303, 2945, 7489, 60212, 82525, 90108, 105780, 57402, 10960, -9619, 7031, 45888, 20890, 15835, 30190, 25254, 21827, 20808, -6779, -56812, -42061, 14631, 15255, 474, 5713, 13061, -8944, -12536, 31322, 81285]
10956H1285J153k822j2320P926K1987J9139k1060l4160J8977N240j4444L547M335
10943G8783j714m493j0518o540k4024l6457O196K8757r224j4374Q912j7366P76
10930a286J7161P881j6702J1941J0377j1042p630j5756L1619K2856m4183m6257
10918d1021l354M8800L0885k6000r251J2802j6467J9058P140l2825m8579j9724
10906g8536j6757J5350j4682M7732N3005L8562l2038k4475K4559R27N159K8912
10894D7718K7291m421j936j58J487l243J1513R919L7981j4581j5579j8309k1709
10881E5973J8199j6755k3936l2400k8069K5522O5385K9456o7706l6073J3822K7331
10869C0749K3387J4678j7574k0549j7589L5108m957j2729j3464n727j8409k2234
$$ y = [81285, 82438, 79616, 67296, 75222, 97209, 116348, 95288, 61128, 80105, 85345, 70901, 74448, 78783, 77069, 72576, 62058, 55518, 31494, -4963, 1233, 29990, 20766, 6392, 15304, -2062, -1286, 15875, 23756, 7054, 18995, 29372, 18330, 10700, -5056, 26563, 49419, 5236, -41021, -44375, 4425, 35310, 9310, 59, 12861, -3606, 15452, 22592, -10233, -58812, -78536, -95293, -79943, -94625, -46893, 6112, 44674, 12636, -11839, 12720, 13647, 18806, 47718, 75009, 70588, 68652, 68494, 69981, 66738, 78251, 88170, 126151, 111570, 95991, 77682, 55973, 74172, 57417, 33481, 1081, -26988, -1466, 63919, 93375, 25669, -10404, 3418, 30749, 54136, 68814, 51240, 30691, 13102, 48210, 43253, 30524, 17060, 11333, -7076, -29310]
10857b9310p327L6526P130K7833K6732M3834k1045l5080N902K4337M892K9516
10845A13940J9847j5382m9267n6986l1036K0821N6377K1417m3020k8748l254J133
10833E842Q238N5944K1630l3146j9608j2666J4623k8696J0033K704J057J0408
10821C6363j9242l9586J0558N531J6872N361k3934k0913K1365k123k2087K928
10809b8907M3144p273K4390j158l340j1666J8569J6089J5857R944m752M396L375
10796G8668m9776m0515l0042j4467J9825K6630L6172L0112p967k7970l2847l1694
10784d3871J9643K0487L8698r903n483M4509j4431l1839J8940j2919k065j9408
10772B358K2572N4856J9043R010k652j8013l3489n7132P734N4089J0035k7809
$$ y = [-29310, -36637, -111, 7019, 34852, 61584, 105418, 84373, 49293, 55195, 79532, 84424, 113940, 133787, 118405, 69138, 12152, -18884, 1937, 58314, 79731, 36711, 7963, 4709, 5842, 14080, 70024, 91654, 58508, 38900, 26234, 40857, 12161, 22194, 24898, 25955, 36363, 17121, -22465, -11907, -6376, 10496, 15857, -8077, -28990, -7625, -9748, -31835, -28907, 14237, 6964, 31354, 30196, 26856, 15190, 33759, 49848, 65705, 75649, 70897, 75293, 78668, 28892, -11623, -41665, -56132, -36307, -9677, 26495, 56607, 48640, 20670, -12177, -43871, -24228, -3741, 34957, 25054, 19571, 64080, 49649, 17810, 36750, 23831, 21766, 2358, 24930, 79786, 98829, 107839, 105187, 87174, 53685, -3447, 4287, 58376, 68411, 40602]
10760D0602o821K9575l230m9897k4406M1520L2594K8333J2738k398m1473l846
10748E3291P862K0855J7776k5868K667m373j728j8414J1050M3590l5201o2314
10736I193k90q681l6597J4053L6862J6737J6868L3369L7294J3637J5575k4792
10724A23228n3956j0982R225J987J6838J0384l253N4678M0008l6803j3115j058
10712A37181o150j3442M172P07L100K3125J2460o670K7692j6965l2207j0430K1786
10699A44359J1774j8140j2110J0287R595O6072J4232k2069K617l9232p1071m4935
10687E1379J8450N2985p924j9343p223K4815M5211M4138p086L970K5928R419R39
10674B35658j3340p8355m9494K3015M2082K7852K5046N14k943K071k5699L180
$$ y = [40602, 33781, 63356, 60126, 10229, -14177, 27343, 59937, 88270, 101008, 98610, 57137, 53291, 61153, 82008, 99784, 73916, 76583, 72210, 70482, 52068, 63118, 106708, 71507, 9193, 8903, 222, -36375, -22322, 14540, 31277, 48145, 81514, 118808, 132445, 148020, 123228, 69272, 58290, 67515, 69502, 86340, 96724, 93471, 148149, 188157, 151354, 138239, 137181, 131031, 117589, 121761, 122468, 125568, 148693, 161153, 154483, 182175, 165210, 133003, 122573, 144359, 156133, 137993, 125883, 136170, 145765, 211837, 226069, 204000, 206617, 167385, 96314, 51379, 69829, 122814, 114890, 95547, 88324, 113139, 158350, 202488, 195402, 199372, 225300, 234719, 235658, 222318, 143963, 94469, 117484, 159566, 187418, 212464, 212978, 210035, 212106, 186407, 189587]
10662A89587L1456L1129K9199M364J3045N839l1618J3304L7686M1816q023j891
10650C55893J1415K9540k4067L2700N0281Q1735O5845M0219J8857J9998L29J8421
10638G01166L9227Q5969J03106J28764J75324J67012J72812J99245K37928J72486
10628B183039J72282K11756L02741L60013N33442P95323J115585J443811J950590
10619I068582K633350L372764M104925M777763M878617L871148J633652p20746
10611C3620055j769124j402909q0136J637252L659001N821847P870366R496745
10603E8853097R652319O723247O72063n319583p450219n882208k769055O69937
10595E5149598M121702P346430J0186231J1985826J1329519O069615l396258j1723210
$$ y = [189587, 221043, 252172, 281371, 285735, 298780, 304619, 273001, 286305, 323991, 365807, 357784, 355893, 367308, 396848, 372781, 405481, 455762, 537497, 603342, 643561, 662418, 682416, 682745, 701166, 740393, 826362, 929468, 1058232, 1233556, 1400568, 1573380, 1772625, 2010553, 2183039, 2355321, 2567077, 2869818, 3229831, 3763273, 4558596, 5674181, 7117992, 9068582, 11701932, 15074696, 19179621, 23957384, 28836001, 32707149, 34340801, 33620055, 31850931, 30448022, 30367886, 32005138, 35664139, 41485986, 49356352, 58853097, 68505416, 75228663, 75900726, 70581143, 63130924, 57248716, 54479661, 55149598, 59271300, 66617730, 76803961, 88789787, 100119306, 106188921, 102792663, 91069453]
10587I1069453j3846021j1214545p246953l349248O5887K885122N095354O233092
10579F9692141N307686J313559n138795j0144692j0878584q702320n781078l247695
10571C2420222j252896K05364J195751J494637P81221j029969l421101n122821
10563B5270408n321778m517044l430225k487342j772804j342437j017194p74145
10555D607439n84521m50143m01646k98709l04334k36787j87419j82226j82813
10546A778841j72812j60942j42297j22268q0795n5489l8470l3322k9966o9575
10536H72905q3154o4919n5345k477l5097n3593k2125l447j8032M449M0847j6883
10524E63129l8498k8879n7344j1507l6547m6256j0942j0225J6773N11P102j7222
$$ y = [91069453, 77223432, 66008887, 58761934, 55412686, 55478573, 58363695, 63459049, 69692141, 74999827, 76313386, 71174591, 61029899, 50151315, 41448995, 35667917, 32420222, 31167326, 31372690, 32568441, 34063078, 34844299, 33814330, 30393229, 25270408, 19948630, 15431586, 12001361, 9514019, 7741215, 6398778, 5381584, 4607439, 4022918, 3572775, 3171129, 2872420, 2568086, 2331299, 2143880, 1961654, 1778841, 1606029, 1445087, 1302790, 1180522, 1099727, 1044238, 1005768, 972446, 942480, 872905, 789751, 724832, 669487, 667010, 631913, 578320, 556195, 552748, 534716, 539165, 580012, 563129, 524631, 495752, 438408, 426901, 390354, 344098, 333156, 322931, 339704, 340215, 347317, 330095]
10512C30095n2212O954j1230k9307k4122n421K0021M4643j597n1271k4475q420
10500A93658J2945j3939l6679j3170l6561q772L1588K8444O020O8816K6115m9214
10488B09251m4071j2692k4152j2545J4693J302j14l8926n999M1582J9242j7390
10476A30181L1071J1581N766q074j2958J3034k766K263m4926L553R5p841j7073
10463A03906J6154j0141j0829j0215J7216Q463J7098K5135J0202m860j6680k139
10451A43310O381J3288j2675J4222J2414j0768n084K0210m687J1282J1686o561
10439A93018m489l1549R965l512l386K2359K478q766q547j6341m1722J9882j6539
10426A12851o1283J4739M753p721J7455q771j0759L201M897q831K727m047J2690
$$ y = [330095, 277883, 284837, 273607, 244300, 220178, 214757, 234778, 279421, 277824, 226553, 202078, 193658, 206603, 192664, 155985, 142815, 106254, 97482, 129070, 157514, 163534, 232350, 258465, 209251, 165180, 152488, 128336, 115791, 130484, 131786, 131672, 92746, 86747, 128329, 147571, 130181, 161252, 172833, 178599, 170525, 157567, 170601, 167835, 170098, 125172, 128725, 128820, 120979, 103906, 120060, 109919, 99090, 88875, 106091, 114554, 131652, 156787, 166989, 162129, 145449, 143310, 149691, 162979, 150304, 164526, 176940, 166172, 161088, 181298, 176611, 187893, 199579, 193018, 188529, 156980, 166945, 163433, 160047, 182406, 184884, 176118, 167571, 151230, 109508, 129390, 112851, 51568, 66307, 71060, 63339, 80794, 72023, 61264, 64465, 69362, 60531, 63258, 59211, 71901]
10413G1901M0045M605k3972q373N1995L0231k6754k5529J1642j5298m5629l3836
10401C1028J241L246j8050j3453K123Q091L480Q760K5190M2237Q810o711j4800
10388H1192R486l355j1458j325L1070l646l8297m0649j5308K6379J591J0698k4862
10375B1516k6500K9516j9768J867J0381K9508j1746J3972J5256K336l5558L091
10363C3871K1397N9686K2527j8317k7657k3607m3902J5576M3316K235o824N345
10351H3646o829J9635j944j8948k7077k2162N781J1483N2618j671n4188j4540
10339B5804R169J4873J064R448L8481K6336j3900j6117k4112r007j4939p201N148
10326D5047L0215J0694j3176m1005k3660n363N72m92M6524j2491p593K1599J7235
$$ y = [71901, 111946, 116551, 92579, 84206, 136201, 166432, 139678, 114149, 125791, 110493, 64864, 31028, 32269, 35515, 17465, 4012, 6135, 14226, 17706, 26466, 51656, 93893, 102703, 95992, 81192, 90678, 87323, 75865, 74540, 105610, 101964, 63667, 23018, 7710, 34089, 35680, 46378, 21516, -4984, 24532, 4764, 6631, 17012, 46520, 34774, 48746, 64002, 66338, 30780, 33871, 55268, 114954, 137481, 119164, 91507, 67900, 23998, 39574, 82890, 85125, 78301, 83646, 76817, 96452, 94508, 75560, 48483, 26321, 32102, 43585, 96203, 94532, 40344, 25804, 34973, 49846, 50910, 60358, 98839, 125175, 111275, 95158, 71046, 62039, 47100, 39899, 45047, 75262, 85956, 72780, 31775, 8115, 2752, 3324, 2832, 49356, 36865, 29272, 50871, 68106]
10313F8106n839M567m384m1408m3370l3177M536L5629N0931L5397k386l2567Q210
10300D4245N4271K8033n3736n8022r996k470J235k0513j1833J7459O085m7832
10288e3074k2079k006o545Q598M5576L0733L2471l1931J9362L7263J9705p213
10276G0860l1760k8228J1710J2431q3p050J0534o659l3194O314M2409p184P51
10263D0851N223k2351J6959j5259J4175R581j4307j9068J7758k987m275J4284
10251D0584r935K6545j251P429L5648j9606L817q370L15q738l97J1903j5515K0739
10237H3168N764n2620l2042K353j2325J2712N1534m7570P019K3427J4919k5577
10225C0762l0674K3299q752j8210J9132J2495J5037j555J6541k4090j4356J878
$$ y = [68106, 62267, 66834, 62450, 21042, -22328, -55505, -50969, -15340, 35591, 70988, 68602, 36035, 44245, 98516, 126549, 72813, 14791, 4795, 2325, 3560, -16953, -28786, -11327, -5242, -53074, -75153, -77159, -83704, -75106, -29530, 1203, 33674, 1743, 21105, 58368, 78073, 70860, 39100, 10872, 22582, 35013, 34930, 27880, 38414, 31755, -1439, 4875, 47284, 40100, 40851, 46074, 23723, 40682, 25423, 39598, 49179, 34872, 15804, 33562, 30575, 26300, 40584, 30649, 57194, 55943, 63372, 99020, 79414, 83231, 74861, 75176, 66438, 66041, 77944, 62429, 83168, 88932, 36312, 4270, 6623, -5702, 7010, 58544, 10974, 17993, 41420, 56339, 30762, 88, 23387, 14635, -3575, 15557, 28052, 43089, 41534, 58075, 33985, 19629, 21507]
10213B1507O135N750m901L4834M7557k7316m9385j7935j9241r341m838o007J2236
10200a0945L6169k4648j376J8861k7855R26K9754O790J0392m742k519l3044J8818
10187A6581L4044J975j5311J5626L6907L7631Q575r336M8847K2867k3532Q770
10175A83644N1667r075j4258k4341K8183J4605K2092K4598O1531R2033L8020l6112
10163D32587o6669o7300n583j077J8174N7866L0998L3626R4212O2667k716m2778
10151E44007o7648n9229l2147m945l4524l8167K0996R91K1952M4007J4675o2835
10139C47133r9745m3112M780O129m9238k8606j8196L5828p748j3968L2744q604
10127A57397k6677k7547j8239R39q120k9327k9046j1046j5884o917m946K4342
$$ y = [21507, 27642, 33392, 28491, 63325, 110882, 83566, 34181, 16246, -2995, -12336, -17174, -23181, -10945, 25224, 576, -800, 18061, -9794, -8868, 20886, 27676, 38068, 33326, 30807, -2237, 16581, 50625, 52600, 37289, 52915, 89822, 127453, 136028, 126692, 175539, 198406, 174874, 183644, 235311, 226236, 211978, 187637, 215820, 230425, 252517, 277115, 338646, 430679, 468699, 432587, 365918, 298618, 293035, 291958, 310132, 367998, 398996, 432622, 526834, 589501, 586785, 544007, 476359, 417130, 384983, 380038, 345514, 307347, 328343, 329334, 351286, 395293, 409968, 347133, 247388, 204276, 209056, 215185, 165947, 137341, 119145, 154973, 147225, 133257, 166001, 157397, 130720, 103173, 84934, 85873, 77753, 48426, 19380, 8334, -7550, -14467, -19413, 4929]
10115D929K2619J3877J66l3218q284j609J1487L1326M405j9789K1542j5141K2846
10102E5156J5613O788j0857k2488o3551m7376K7007j0351n288K8707J5780l1204
10090d2064l3249p887K9118L6001L5849L4663k6860l5053K6590J3248K9584j6549
10078D3391K286P665j5447J0370k1421K3826l798J1937j3045p234L9444J311k0588
10065E8697k4200J1682L0630k1498j3715O767j6218k4021l3834M2967j9444k4418
10053b6605k5852k7114J9032P670k309M2543L2465L2607j378k4961o806o651k769
10040I872l7194K6841K9446j1482Q35l2549k3708L3032K3811R489j8668o99M0624
10027D9650l2023m6751J175O9135L2706j699O752l542j8957l1452j1024j0163
$$ y = [4929, 27548, 41425, 41591, 8373, 89, -1520, 9967, 41293, 45698, 25909, 47451, 32310, 55156, 70769, 77557, 66700, 44212, -19339, -66715, -39708, -50059, -55347, -26640, -10860, -42064, -75313, -83200, -54082, -18081, 17768, 52431, 25571, -9482, 17108, 30356, 59940, 43391, 45677, 53342, 37895, 48265, 26844, 50670, 46872, 58809, 45764, 38530, 77974, 79285, 58697, 34497, 46179, 76809, 55311, 41596, 48363, 32145, 8124, -25710, 17257, -2187, -26605, -52457, -79571, -60539, -52869, -55178, -12635, 19830, 52437, 51059, 26098, 19292, 12641, 9872, -27322, -481, 28965, 17483, 18318, -14231, -37939, -4907, 18904, 28393, 9725, 9026, 49650, 17627, -29124, -27949, 41186, 73892, 72193, 78945, 75403, 56446, 24994, 13970, 3807]
10015C807M976K9267K7828k5968j031Q122q846p785m0392k2950M875K0792M059
10002c246L450K6188J6780l5136k3276O905k0176k1271N483K6826J2790P341O853
9989I511k2709n928N2849L6002j0652J4565j7422k5896l0284Q677J9994Q945j3265
9976B4387J1959K4813L2998r055o022m0534k2486j110o584k0397J433L6525K1783
9963D7710o355k1566l3403q677J6839L1865j6353j486j9007k0592l9705j0168
9951h0898K7452J3768L2454k730j1867K9049n64q947p701o950K3097J6978p666
9938A5475l4613n556M0732K0712K2720K4314J6485N0735O8518J08707J9449j47143
9926B00535p6575l0862R793l070l0856k4108Q839N167l7254j2458K1465J9615
$$ y = [3807, 8783, 38050, 65878, 39910, 38879, 47001, 38155, 30370, -10022, -32972, -28097, -7305, -3246, 204, 26392, 43172, 8036, -15240, -8335, -28511, -49782, -44299, -17473, -4683, 2658, 9511, -13198, -19126, 33723, 69725, 59073, 73638, 56216, 30320, 36, 8713, 28707, 37652, 24387, 36346, 61159, 94157, 85102, 79080, 38546, 16060, 14950, 8366, -12031, -10598, 25927, 47710, 41355, 19789, -13614, -22291, -5452, 26413, 10060, 8574, -10433, -31025, -70730, -80898, -53446, -39678, -7224, -9954, -21821, 7228, 6664, -2283, -9984, -16934, 6163, 23141, 15475, -19138, -24694, 16038, 36750, 59470, 83784, 100269, 151004, 219522, 328229, 347678, 200535, 123960, 93098, 102891, 99821, 68965, 44857, 53696, 58863, 21609, 9151, 30616, 50231]
9914E0231k7319j7888j1600l9575k9875J8087K7144L8190K1745m605K2057L0084
9902G6676m2n5145j7213K4086N595k5448L1936J3411j7112r755M226l3047k6300
9889b8132k229j2750K9255K2931l1485M09K3943N910m5678J4340J9699J2533l7195
9876b8449n7688R788L4278J8167J7900q660J1410k1757K604K3953p613L3546R684
9863C7163k5447j7387j3639l2K9658P2726k7563k9982j0065J4050P477j9249j1893
9850E817j1486j4732r043J7186j1355j8931O404K8348p854q895K8734P792J3231
9837B5216J0991R661j8588K5935L4958L4061p315j9838j528m1161o2710m748L1940
9824A6874L5813p429K0250r491l6399k1280l710l7012j4978j2119J4817L0421
$$ y = [50231, 22912, 5024, -6576, -46151, -76026, -57939, -30795, 7395, 29140, 24535, 46592, 76676, 76634, 21489, 4276, 28362, 33957, 8509, 40445, 53856, 36744, 26989, 31215, -1832, -28132, -30361, -43111, -13856, 9075, -22410, -22001, 1942, 7852, -37826, -23486, -3787, 8746, -28449, -86137, -76349, -42071, -23904, -6004, -14664, -3254, -25011, -22407, 1546, -6067, 27479, 37163, 11716, -5671, -19310, -19342, 10316, 83042, 55479, 25497, 15432, 29482, 36959, 17710, 5817, -5669, -20401, -29444, -12258, -23613, -42544, -36140, -7792, -15646, -24541, 4193, 11985, 25216, 36207, 45868, 27280, 53215, 88173, 122234, 114919, 95081, 93553, 52392, -10318, -15066, 16874, 52687, 45258, 65508, 56017, 19618, -1662, -5372, -42384, -57362, -69481, -54664, -24243]
9812b4243N382L02k566J7787K1140r806l3595K7039J3733l9140l213K0942q488
9799a4726L4019K2739J8406l2248o4729J3266Q929j7741J6424R013k366l2969
9787d1983J8197K6610J3398n136k7155J251m587J5573k1703l4970K6235J5119
9775a9151K3396q908l0037l2936k0149P01L2686L5410m527j347N9022J8583l3815
9762A8928l5055N421m050J6746K7295j4061k5604n946j7549r099M3890L6230l9078
9749a932j2001m727K4210q877j8984J0894K4837K2515o336j1292R513l7866j1471
9736b1517P533J1052M7652j5184m6737M844M0801k3790j3976O571j7542p007J6209
9723a1091K585o246M40J1084L0987L3076P843J0108l8223n0869L6J3108o555L092
$$ y = [-24243, -18861, -18559, -21125, -3338, 17802, 7996, -25599, 1440, 15173, -23967, -27180, -6238, -14726, 19293, 42032, 60438, 28190, -36539, -23273, -14344, -32085, -15661, -6648, -9014, -41983, -23786, 2824, 16222, 11086, -16069, -14818, -19405, -3832, -25535, -60505, -34270, -19151, 4245, -4663, -34700, -67636, -87785, -87084, -54398, -18988, -23515, -24862, 34160, 52743, 18928, -16127, -10706, -14756, 1990, 29285, 15224, -10380, -16326, -33875, -42974, 916, 37146, -1932, -13933, -18660, 5550, -3327, -22311, -11417, 13420, 35935, 29599, 18307, 27820, -10046, -21517, -13984, -2932, 44720, 29536, -17201, -12357, 28444, 4654, -9322, -2751, -20293, -27300, -11091, -8506, -14752, -14312, -3228, 27759, 60835, 68678, 78786, 40563, -10306, -10270, 2838, -3717, -625]
9709f25o91L413K027O520J837j4581m5677q94P1089P688l1003n4007J908L5420
9695a7576p306K0316M221R899j2915m006K1400j5758q253K4054K8549m035j3933
9682B4657k3751l12K4072k0764k2440k4567L4285k2936L58r210J5292L2477J8764
9669B5925k0948J0069o171O442j5948o3473q124J2086K8100J7352J0210J2334
9657G854r206L7665M6891j0915j9553m0560r276o792N001j4398j0894M986J9461
9644B64K007l097K030j2008K5637K4002k0945j4692K1682o270j2556n021j3524
9631a2491k3411N5j7988L0398K7261j0253K0390K0204k8672k0320J2139N960l7798
9618c4526K7019l400K7805r530K1119p709r184P195N890j8020j722J8072K1350
$$ y = [-625, -1316, 2097, 4124, 10644, 12481, -2100, -47777, -48671, 22418, 30106, -897, -54904, -52996, -17576, -24882, -4566, -345, 9554, -3361, -7367, 14033, -1725, -9978, 14076, 42625, 38590, 24657, 906, 594, 24666, 3902, -18538, -43105, -8820, -31756, -31398, -40608, -25316, 7161, 25925, 4977, 15046, 8875, 15317, -631, -64104, -72228, -60142, -32042, -14690, -4480, 7854, -1352, 36313, 83204, 72289, 52736, 12176, 2900, -3892, 1109, -13289, -24183, -19197, 264, 2271, -826, 1204, -10804, 14833, 38835, 17890, 3198, 24880, 18610, 6054, 1033, -12491, -35902, -35847, -53835, -23437, 3824, -6429, 13961, 34165, 5493, -14827, -2688, 3272, -34526, -7507, -10907, 16898, 7368, 28487, 20778, 11594, 18789, 24679, 6659, 4937, 23009, 44359]
9605D4359K3330n579J3698k3755O68o178k2549p942j0161k736j5808j0020J5461
9592g212M756P577j8238K3001N0674J1132r269q826p934M576M3370M893j6182
9579H2318J7500J6211L452K4870J0403J0234L9288q525J019K4656N0359J9596
9567B91381J137N8885M6532K8464N7518K0627m05l6484o9117n2973k4000m4353
9555B77212J527l9091j6981n8440o7929k1188J1582J9746n64j5864k6439Q575
9543G2146j3385p323J5720j8117l4765J2215J7749N8327K626l7242l607p132j1477
9530D5735j3997M351J4430r209J7380L0885k2015j5688m1944M0435N3776L203
9518A07342l2232l9499L992n174N889J9704M3693J2761m1392j9616m2795j8996
$$ y = [44359, 67689, 62110, 75808, 52053, 52721, 46543, 23994, 16052, 5891, 3155, -12653, -22673, -7212, -2456, 5121, -13117, 9884, 60558, 71690, 62421, 53595, 45661, 50237, 93607, 98500, 82318, 99818, 116029, 119481, 144351, 154754, 164988, 204276, 195751, 196770, 221426, 271785, 291381, 292518, 351403, 397935, 426399, 483917, 504544, 504139, 467655, 398538, 345565, 321565, 277212, 278739, 239648, 222667, 164227, 96298, 75110, 86692, 106438, 105874, 90010, 63571, 72146, 58761, 51438, 67158, 49041, 14276, 26491, 44240, 102567, 105193, 67951, 64344, 57212, 45735, 31738, 36089, 50519, 41310, 58690, 89575, 67560, 51872, 9928, 50363, 104139, 107342, 75110, 35611, 39603, 34429, 40318, 60022, 103715, 116476, 75084, 55468, 12673, -6323]
9506f323M286K7209P362J233k5087m8082k1246J295L0170J7971K1462J7087J6599
9493D3936k6202k0408R384K7539L6155J767l1383n9479J7144L3499M463j3977
9481B2438k0686J1397l3373L0181K677K9968m546N531j2689n9599k758K4247J195
9468f017K7297N0677J3405k8365n2561r183M891p872k1129K056k4066L463L4285
9455a3119Q69j5023n289J3700N2470K9694K5701k2833j7713k8881j394M002J1518
9442C3702l1366m134l6913K7741R413L421J563J4676K5972M6043L990m3281o8315
9429a7488l7165K5214O927J7225R051k1511O969K2386k7465j0393P906K303L8233
9416B2192R82j3060j1812k8080L8461J4891j4427Q023k7111K1681o311Q393j3455
$$ y = [-6323, -2037, 25172, 32534, 33767, 8680, -39402, -60648, -59353, -29183, -11212, 10250, 27337, 43936, 17734, -2674, 6710, 34249, 70404, 72171, 40788, -18691, -1547, 31952, 36415, 22438, 1752, 13149, -20224, 9957, 12634, 42602, 38056, 43587, 30898, -28701, -31459, -7212, -6017, 21280, 71957, 85362, 56997, 4436, -4747, 144, -7728, -28857, -26801, -50867, -47404, -13119, -12250, -27273, -32562, -18862, 33608, 63302, 89003, 66170, 48457, 19576, 18182, 22184, 33702, 2336, -1798, -38711, -10970, -1557, 1864, 3427, 18103, 44075, 90118, 94108, 50827, -17488, -54653, -29439, -22512, -5287, 3764, -17747, -10778, 11608, -15857, -26250, -18344, -16041, 22192, 23174, 10114, -1698, -29778, 8683, 23574, 9147, 17170, -9941, 11740, 5429, 13822, 367]
9403C67R708n044K2830J9296k9992l2499J0568l836Q977O415K0321N869n257j4419
9389A3304n0999r631L7860L8127J1740k2941m5898J4039J8220L581J3517p390
9377A3529M1224R410r791l9722p481J6714k0236j3420J844m3115l73J3504N184
9364c2729j6639j4629p117N1520K5744k7415J054M439J2937k2274o502J3835q231
9351b6007n776J8207L3032o543p120L192O447j0334l1703n0682J6988K8324K0341
9338a1634k4874J9523k498L1036J9208k6680n0390l3432R201J945J3360K3379
9326c1856l5250J396L6871m11j1133K977M1415N9088N825q58K2235m4153n4115
9313g969n577K5742J144j3643j0250M565k6814j3615O3678J9748P934K3089o3588
$$ y = [367, 10075, 5031, 27861, 47157, 17165, -15334, -4766, -8602, 375, 6790, 27111, 32980, 27723, 13304, -37695, -47326, -9466, 28661, 40401, 17460, -28438, -14399, 3821, 7402, 20919, 13529, 54753, 64163, 54372, 14650, 7169, 23883, 3647, -9773, -7929, -51044, -51417, -37913, -32729, -49368, -63997, -71114, -19594, 6150, -21265, -20211, -15772, -2835, -25109, -31611, -17776, -26007, -31783, -13576, 19456, 12913, 5793, 8985, 15432, 5098, -26605, -77287, -60299, -31975, -11634, -36508, -16985, -19483, 11553, 30761, 4081, -46309, -79741, -70540, -68595, -55235, -31856, -67106, -65710, -28839, -29250, -40383, -37406, 4009, 63097, 68922, 68064, 90299, 46146, -7969, -13546, 12196, 13340, -303, -10553, -5988, -32802, -46417, 17261, 37009, 44943, 68032, 4444]
9300D444k8232K9140K730L435O764K5042k084r715L8589N416j731M249l2648m6060
9286f61l105J2948K520p293j0624M3966L7846k942m9568l4135j3027p906k7401
9273e9382K8078L8411M5154L21j3637p414k853M603j1369k2784l206K0017L0206
9260D6145k3922k3304J3947N079p902k2173j8004k5709J6863N9804L9507j6930
9248D3401n3103l4407K3995K2570L4218P381L651m8669M531Q851k9530o1808k701
9235h1620L6006N0052K0194N680l0841k289K5702M935j5620k3392J171J2925j9083
9222a6180l0844j0280M207m931K0117K4513M9109J4898k8298J1771j45j0992j5827
9209G118j9676k0739k6633J0835L7195N1961o443k4496P378O416n126q411m788
$$ y = [4444, -23788, 5352, 8082, 11517, 18281, 43323, 41239, 31524, 70113, 75529, 73798, 78047, 45399, -661, -3766, 9182, 11702, 4409, -6215, 37751, 75597, 72655, 23087, -11048, -24075, -31981, -59382, -31304, 7107, 52261, 52582, 38945, 31531, 28678, 33281, 21912, -872, -4078, 15939, 46145, 22223, -1081, 12866, 17945, 10043, -12130, -30134, -55843, -38980, 20824, 60331, 43401, -9702, -44109, -20114, 2456, 36674, 44055, 47706, -963, 3568, 12419, -17111, -78919, -81620, -45614, 4438, 24632, 30312, -529, -2818, 22884, 27819, 12199, -11193, -10022, 2903, -16180, -47024, -57304, -53097, -58028, -37911, -13398, 35711, 50609, 22311, 34082, 33937, 22945, 7118, -12558, -33297, -59930, -49095, -11900, 40061, 33618, 9122, 16500, 22916, 17790, 9379, 4591]
9196D591J469l580j6125j9059k0326L0947o242p564j0699K6806m120m1179K9464
9183c5617L0747q433l6844m6627M965o784M4952L7616K6803p967J504M4362L1878
9170H0555l6041K175j6464j4115o6J324l079j6754m0715j9453L7585P0336R423
9157E4711l5587k8144k6345K5484J9544j782k6267k5927K1116K0469J5829J1499
9145B4600k8890q231j1646r183J5166Q70j6793O140j5462j3648L077J2807K1466
9132a9727k87J154J6560J5996l2834m7569K9430N2452O214N659L6494J1320n2256
9119B2606l4448l3697k4597J510K8908L9124j1817j8047P661J418J9839M3897
9107D2357k8539k7776J0723k2024m8925k8464M5088L4104l966K4609r570k7300
$$ y = [4591, 6060, 2480, -13645, -32704, -53030, -22083, -28325, -35889, -46588, -19782, -23902, -65081, -35617, -4870, -13303, -50147, -96774, -91809, -98593, -53641, -16025, 10778, 2811, 4315, 48677, 80555, 44514, 46689, 30225, 16110, 16044, 17368, 14289, -2465, -43180, -62633, -25048, 45288, 54711, 19124, -9020, -35365, -9881, 9663, 7881, -18386, -44313, -23197, -2728, 13101, 24600, -4290, -12521, -24167, -33350, -18184, -17314, -34107, -27967, -43429, -57077, -54000, -41193, -19727, -20014, -18860, -2300, 13696, -19138, -66707, -37277, 15175, 21389, 27048, 63542, 74862, 22606, -11842, -45539, -70136, -68626, -39718, -594, -12411, -30458, -22797, -21379, -1540, 42357, 13818, -13958, -3235, -25259, -74184, -102648, -57560, -23456, -27422, -2813, -12383, -39683]
9095c9683j4154k3754J7735K6988J5563K0642L6949j6006l7894l1099O78M7524
9083C489L9331L915k4482R416k120K8682j2112k5524J8753n453n8048k7743J2951
9070c8945M244k5175J2417J840l2330J5257L4203P308k6585j2184O572M1454J5116
9057C192j6303l4228j197R990K1407L4847p972l5496k018j2128m134m145J3139
9044c5046q941p882K7022L2216j912o453p968m70N232M5531M5814L0345l6038
9031H1450q5546k2129l792j4425O70R071K191r869l0615j9586L5843P689K724
9018d6324J9142K6520J6262k2477k4943L617L5411l304k576J036J3559R270q134
9005A7059n292k3168M292k4165k2332n903L692o038L119p83L0822M3248L2659
$$ y = [-39683, -53837, -77591, -59856, -32868, -17305, 3337, 40286, 24280, -13614, -44713, -44035, 3489, 42820, 46735, 22253, 31669, 29549, 58231, 46119, 20595, 39348, 33895, -24153, -51896, -38945, -34701, -59876, -47459, -45619, -77949, -62692, -28489, -21181, -47766, -59950, -53378, -11924, 3192, -13111, -47339, -48536, -38546, -17139, 17708, 9736, -25760, -27778, -39906, -44040, -48185, -35046, -43987, -51869, -24847, 7369, 5457, -996, -8964, -9434, -4202, 41329, 87143, 117488, 81450, -4096, -26225, -30017, -44442, -43772, -34701, -32510, -42379, -72994, -92580, -56737, -49048, -46324, -27182, -662, 15600, -6877, -31820, -28203, 7208, 3904, 1328, 2364, 15923, 25193, 17059, 11767, -11401, -7109, -31274, -53606, -59509, -55817, -61855, -58736, -59519, -28697, 14551, 47210]
8992D7210k9077m4434K7379j0709k8239o171K711L7602J2121K4536m6047r140
8980b2258K2698L2366J4129l0086j7485j7346q581q265J6253K2679j5177l121
8968a4194K0202j0150l1575J5861J5865m34r209j0525K4170J7192p791n7505j2739
8955f0832M8238J2133j6741Q949K6292l9194k3130J2509M3996K1298m7666o3725
8943g7873J9392L4171K2487p813K8425L5262l826j1548n7681K3375J9905Q995
8931C3271L094j7994l0006j0102l304J110k872K1442j0926J2600M37J174j6428
8918a8504J3087K3431J6073K8216j7025k4265l3862O626N2937o7824j7721J2822
8906b6009K864J9668J7743M4K888M309l0114J0945j18k414n568k8685O766M3332
$$ y = [47210, 18133, -26301, 1078, -9631, -37870, -44041, -41330, -3728, 8393, 32929, -13118, -22258, 440, 32806, 46935, 16849, -636, -17982, -26563, -34828, -18575, 4104, -11073, -14194, 6008, -4142, -35717, -19856, -3991, -4425, -13634, -24159, 11, 17203, 9412, -48093, -60832, -12594, -461, -17202, -8253, 18039, -21155, -44285, -31776, 12220, 33518, -14148, -77873, -58481, -24310, -1823, -9636, 18789, 54051, 50225, 38677, -19004, 4371, 24276, 33271, 36365, 18371, -11635, -21737, -25041, -23931, -26803, -5361, -16287, -3687, -3250, -2076, -18504, -5417, 18014, 34087, 62303, 45278, 21013, -12849, -6223, 46714, -21110, -38831, -26009, -23145, -3477, 14266, 14310, 17198, 21507, -8607, 2338, 2220, -194, -5762, -34447, -27681, 15651]
8892A5651j6462J3786L108q83K0812K6718m456N762k5391o784k2828j143j9210
8879a1320L0531L8328K5538o7726q756J4055j9825J6834l885l085l2856l5658
8867e7825o847K6846J7269k2893j7609K4409l944J2716J5526R898j1121P431j474
8854g618l2198J4705K0444K7304K4860j2045o687k6463J0251L811k109J9936p026
8841B7165l4949K0975K1294p854k2059j3737k8357k0792K9621K0279O404J03j2511
8828a4418j6796K7526L0791k2155l4501K373K0590K2981j8519l2658K5167L7484
8816B7865J7642k9078l2041k2169J2323L9117K1923k6047j8104r652R582l0456
8804c9095K795o227K0181J5997K7627J7386r782k3824j5208J6539J158k3790k4314
$$ y = [15651, -811, 12975, 16083, 15200, 36012, 62730, 58274, 64036, 38645, 31861, 9033, 7890, -11320, 19211, 57539, 83077, 15351, 6595, 20650, 825, 17659, 13774, 10689, -22167, -57825, -64672, -37826, -20557, -43450, -61059, -36650, -40594, -27878, -12352, -2454, -13575, -6144, -7618, -39816, -25111, -4667, 22637, 47497, 35452, 28765, 2302, 12553, 16364, 14255, 34191, 27165, -7784, 13191, 34485, 26631, 4572, -9165, -37522, -58314, -28693, -8414, -2010, -1907, -14418, -31214, -3688, 27103, 4948, -29553, -27180, -6590, 16391, -2128, -34786, -9619, 27865, 45507, 16429, -15612, -37781, -25458, 13659, 35582, 9535, -8569, -18221, -8639, -39095, -36300, -42527, -22346, -6349, 21278, 38664, 28882, 5058, -10150, 6389, 7547, -16243, -40557]
8791d0557k9202R664K3459K1168K762J6325R895k841j239j7052K3522O623k6599
8778d072L42k2068J7624k966j8544l682K3858j6061j5414k2964J0002L7719K8619
8765A2393J2586o160J8661N376j9086m4609j6418J2508K1475J1533O308M91j9999
8752d941n6m5291P442P1079Q707j8177n677j5016j8202J1023j2392l1376j7854
8739g0731Q640l883J5136N34K598L4227J3945l6767L1180K3302q436J9917k3481
8726F181j8256j726K5906J5964k9496k9888K2169J0703k0618M920K3973j0376
8714e44J5330L036L8068L5880l4861l2297k0424q280m0477K4553K3184J611p66
8701D013j1315m850l2857k3317P658p978P596K2865O5066K9086J1030j7307J2414
$$ y = [-40557, -69759, -60095, -36636, -15468, -12706, 3619, 13514, 10673, 9434, -7618, 15904, 22527, -4072, -3730, -25798, -8174, -11140, -29684, -33366, -9508, -25569, -40983, -63947, -53945, -16226, 12393, 24979, 18819, 37480, 42856, 23770, -20839, -37257, -24749, -3274, 8259, 14567, 15058, -4941, -4997, -50288, -42846, 28233, 36940, 18763, 13086, -1930, -20132, -9109, -21501, -52877, -70731, -62091, -65974, -50838, -50304, -47706, -13479, 466, -36301, -5121, 18181, 9745, 29662, 6181, -12075, -13801, 12105, 28069, -1427, -31315, -9146, 1557, -19061, -14141, 9832, -544, 14786, 17822, 55890, 91770, 56909, 24612, 4188, -4092, -44569, -20016, 3168, 4779, 4013, -7302, -12152, -45009, -68326, -60668, -68646, -61050, -38185, 26881, 55967, 66997, 49690, 62104]
8688F2104j8122l2744o051K0688J2178K2286J0560j2390m7162J8038j2394j2236
8676D755p542P314J0060k390J5376L800j2772r14P939J9283J7669k8847j6536
8663A7195K1650J3271L347j2579k5890j3771J7803j7207l2193J1149J8581M854
8651F210J393j0623L1235O918j3005k762K2874L989l9470J5968J4529j7988j7784
8638A484j9332K0683j0461l0432j243R753L1026p183m790J3480L3829k8440l9296
8625c0922M53L1214J6085K501K31l7430K380n707L5913j5669J1891M421o519k6511
8611a7669J183L8155M0000n7513j300j3292k3796Q41K4904m2326l7330K4793N7948
8598e402K0264m352J169k7170J1865J606j5478J0254j8174J3733o812K29K8190
$$ y = [62104, 43982, 11238, 5187, 25875, 38053, 60339, 70899, 58509, 11347, 29385, 16991, 4755, -2787, 4527, 14587, 12197, 27573, 31373, 18601, 17687, 25626, 44909, 62578, 33731, 17195, 38845, 52116, 55463, 42884, 16994, 3223, 21026, 3819, -28374, -17225, 1356, 6210, 7603, -3020, 28215, 35133, 22128, 19366, 42240, 46229, 6759, 22727, 37256, 19268, 1484, -17848, 2835, -7626, -38058, -39301, -29548, 1478, -5705, -10495, 2985, 36814, 8374, -30922, -30469, 745, 16830, 19331, 19562, -17868, -15488, -21195, 14718, -951, 10940, 15361, 8842, -17669, -16486, 21669, 61669, 4156, 2856, -10436, -34232, -33391, -8487, -50813, -88143, -63350, -5402, 14862, 10510, 11679, -15491, -3626, -2020, -17498, -7244, -25418, -11685, -18497, -18268, 9922]
8585I922K4643m259K079l4572J985M0130q765o733j2617L1020Q032m623k1055
8572B5187J7555N8126l118o021m631k6108l5302k1230J9024j9596J749q696L0532
8559B7471J4510r343p924R331j1528j7001K1054j4157L088o118J2809j4008o1029
8546e2845k3931N812L8313M4900l2925m1982k146J8722O330L4130K3509K954j6605
8533D236J2959K4807j3696j5564k7058J2117j2743k0305r023n713L2117R158K372
8520f336K7851k0947o602r899J531k0060J1478K0605J6452r323R236K1426n746
8507B9666l3102P934M242j8519J5306N735J0598J7741o439n555q371K476l1334
8494i622k9656o611m834J894j2061J0888j45J6053j2262J2170J2939K032L0349
$$ y = [9922, 34565, 30306, 32385, -2187, -202, 39928, 31163, 24430, 11813, 42833, 50865, 46242, 25187, 42742, 100868, 97750, 91729, 87098, 60990, 25688, 4458, 23482, 3886, 5635, -3061, 27471, 41981, 32638, 24714, 34045, 22517, 5516, 26570, 12413, 15501, 9383, 22192, 8184, -52845, -76776, -70964, -32651, 12249, -20676, -62658, -64804, -46082, -39752, -5622, 17887, 20841, 4236, 17195, 42002, 28306, 12742, -14316, -2199, -14942, -35247, -44270, -49983, -17866, -8708, -6336, 21515, 568, -6034, -15933, -14402, -34462, -22984, -2379, 14073, 4750, 13986, 35412, 29666, -3436, 4498, 8740, -9779, 5527, 11262, 21860, 39601, 33162, 27607, 19236, 21712, -9622, -39278, -45889, -50723, -48829, -60890, -50002, -50147, -34094, -46356, -34186, -21247, -19215, 11134]
8481A1134j4077k270j5926J4553q47j4362M157K4232K69J3417j3806j2797N5173
8468D8850K9293O896l2221m9112J0745R659J9797n826l2939m4852L5031L2461
8456B7782q574m0349K1015K1986K4382l354J5383J1608l2671l982K675k8012n028
8443B861M1472J3415n174j0459K6316q897l8376LJ2780L0167k5389n5072K2239
8430E886L4228J5247L681j6171K9959L6695n8496k1139P166k6863K41J882N688
8417A8004M668k940j6021J5912K33q216p16N867J778o724p92J2769K1801J263
8403D6886k9765q9L8357P732J8277l4201n4261k2845J0040J1377p340K1519L419
8390I106j2062n0667k9141Q328M3282P816j1013o74K3106N908J1742N770j4342
$$ y = [11134, -2943, -5213, -21139, -6586, -7433, -21795, -17638, 6594, 6863, 20280, 6474, -6323, 48850, 78143, 85039, 52818, 3706, 14451, 24110, 43907, 38081, 5142, -39710, -4679, 27782, 19208, -21141, -126, 21860, 46242, 42888, 58271, 69879, 37208, 33226, 35901, 7889, 2861, 44333, 57748, 52574, 42115, 68431, 59534, 21158, 21161, 33941, 64108, 38719, -16353, 5886, 40114, 55361, 59042, 42871, 72830, 109525, 51029, 29890, 37056, 10193, 10434, 12316, 18004, 22672, 19732, 3711, 19623, 19856, 11640, 10924, 16791, 18569, 11845, 11053, 23822, 45623, 46886, 17121, 17032, 55389, 63121, 81398, 47197, -7064, -29909, -19869, -8492, -15832, 5687, 9106, -2956, -53623, -82764, -74436, -31154, -23338, -34351, -35025, -11919, -6011, 5731, 11501, -2841]
8377b841n295J0897J7898j8986j8371l021L6191R622j3525J1742j1274m2868j3870
8364d3701M0633M0739j0265k8460j4391L1540Q434J7525l991J496m613j4100J4972
8351C5818n513j3802k4970j8909j196K9096K3110n5155l9881P694L006Q79N347
8338e4476N5428k554J1967j5099k2378j3682l258O303j1015o541L2175K2003Q708
8325G581j382k3375L5545R470l3499o285j1255J4179J6995K7447J4750Q71j8392
8312C2650k4684p77J0267n059J1388l2173j3518L4667J1832q108J5813j990j4434
8299A5874J324j0645j9572K004k1807j51L1170J3853K3364n356n3654m5478K0578
8286d8496J7206O220Q400J7683j2551K864K2889j6531k2655q611k4557K5964L3449
$$ y = [-2841, -8136, 2761, 20659, 1673, -16698, -19719, 16472, 26094, 12569, 24311, 13037, -29831, -43701, -3068, 37671, 27406, -1054, -15445, 16095, 24529, 42054, 38063, 39559, 34946, 20846, 35818, 30305, 16503, -8467, -27376, -28572, 524, 23634, -31521, -71402, -63708, -60702, -59823, -54476, 952, -1602, 10365, -4734, -27112, -40794, -44052, -37749, -48764, -55305, -23130, -1127, 7581, 6199, -17176, 18369, 27839, -5660, -11945, -23200, -9021, 7974, 35421, 50171, 51042, 32650, 7966, 7189, 17456, 12397, 23785, -8388, -21906, 12761, 24593, 16485, 32298, 30308, 15874, 17198, 6553, -13019, -11015, -32822, -32973, -1803, 12050, 35414, 30058, -23596, -69074, -48496, -31290, -25070, -16670, 1013, -11538, -8674, 14215, -2316, -24971, -33582, -58139, -32175, 1274]
8273A274J3857M451p385K7294L0773j1082q878n6699j4992J0116J9820J4134J1536
8260C4219j6137k3344O12K8967L8032j731j7746J4551m9295k4313K0737j9463
8248a4911j0763J8654Q747M7643N3551k2584J3346k6621l3270l6616j3521j0134
8236b6479L2175o258j4545L057k563K4004n173j8237j6204k0013J8898j9963J3975
8223c7326M7570j3031j8624k0116L642M11j0322K3062J0831Q69P581Q158j6972
8210a4267k6753l1495K9699L9193M316k0695j2788j007k1375J3415J1920m3955
8198g3792k5651L1003N7782K7681l2740q463Q225L6584j6395l825J540m204K0939
8185A8684j5259N498l331j9656P050l031r061j7418O201O750q794Q589J1004L0726
$$ y = [1274, 15131, 19582, 12197, 39491, 70264, 59182, 50304, -6395, -21387, -11271, 8549, 22683, 34219, 18082, -5262, -4650, 24317, 62349, 60618, 42872, 57423, 8128, -16185, 4552, -14911, -25674, -7020, 1727, 49370, 102921, 80337, 93683, 67062, 33792, -2824, -16345, -26479, 5696, -562, -15107, -12050, -14613, 9391, 4218, -14019, -30223, -50236, -31338, -51301, -37326, 10244, -2787, -21411, -41527, -37885, -37474, -47796, -24734, -13903, -13034, -5453, 2705, -14267, -41020, -72515, -42816, -3623, 693, -20002, -32790, -33797, -55172, -41757, -29837, -73792, -99443, -68440, -10658, 17023, -15717, -24180, -15955, 20629, 4234, 409, 1949, -2255, 18684, 3425, 8923, 5592, -14064, -7014, -10045, -19106, -36524, -30323, -23573, -32367, -23778, -12774, 17952]
8171A7952p737k6919l8865k1801J6422j4544N472J5922M2395N003K07k0478q807
8158c5778l4266K2546O4957M667k790m3030K200p475k0969J591M3643l420o880
8145a5004L0288n013k2277J2787k0854L9283L5281k0288n339J0923K3812J1618
8133G5217K252j9716k5023j2163k2800n5238j8277K0987L7802K1927m242k0066
8121a9340j7231r653P447N6378K0116j5239l5j9511l048k1448k512J9873j0099
8108a4302Q210L4779k489k1002k3132q689K6485J0366R90k851K2418j238J766
8095C1311K160j0952k6461K060j6024m0116k8266j3135M2566P2321L1385j603
8083D5246k2231k7341L4188j2685J5328L3901j3832n241j8959m6989k6915K3155
$$ y = [17952, 10215, -16704, -55569, -77370, -60948, -75492, -70020, -54098, -11703, -6700, -6493, -26971, -35778, -70044, -47498, 17459, 22126, 19336, -23694, -21494, -28969, -49938, -48347, -4704, -8124, -15004, 15284, 10271, -12006, 781, -20073, 19210, 54491, 34203, 28864, 39787, 63599, 75217, 77469, 57753, 32730, 20567, -2233, -57471, -75748, -54761, -16959, 4968, 726, -19340, -36571, -46224, -38777, 17601, 37717, 22478, 22443, 2932, -116, -21564, -24076, -4203, -14302, -6092, 28687, 26198, 5196, -17936, -26625, -140, 10226, 11216, 8365, 30783, 29545, 31311, 33471, 22519, -3942, -1882, -17906, -58022, -86288, -99423, -56857, 15464, 46849, 45246, 23015, -4326, 29862, 17177, 32505, 66406, 52574, 47333, 28374, -18615, -45530, -22375]
8071b2375J2186m8041r888K4482J4626L5426L40k9311l7363M9051Q0044M740n79
8058G3338j6620o1254m4209q758l307J5112M967P395M1003J0215l896M33K2695
8045C7114K8142k9461m3133m0870L448N063j7340O767j2026J1454K9830K5776
8033D764j1263j4987N0738M8757k333J669k0292j061k4082l4456k317M315J0327
8020I779L2673J639j3639k5425K186N5222o058l9110N0l598p181p2830m217N1057
8006a9452L2648n048K9865K772j2846k2430K3395K3007p424l9618J9352k2810
7994A411R17K9070Q67k0635L1656R410k2427k1688K0016p80k736J9980K2384j6639
7980E0806l851m7k7027j1329k9627l158O709j4683O328J739L5483K1113R85J2637
$$ y = [-22375, -10189, -58230, -68118, -43636, -29010, 6416, 6756, -22555, -59918, -10867, 69177, 73917, 73338, 56718, -4536, -48745, -57503, -60810, -45698, -40731, -33336, 7667, 17882, 13986, 14419, 37114, 65256, 35795, -7338, -48208, -44760, -39697, -57037, -50270, -62296, -50842, -21012, 4764, -6499, -21486, 29252, 78009, 75676, 77345, 57053, 55992, 31910, -2546, -4863, -548, 9779, 42452, 44091, 30452, 5027, 7213, 62435, 56377, 17267, 17317, 13719, 6538, -66292, -70509, -19452, 13196, 8148, 38013, 40785, 27939, 5509, 28904, 51911, 44487, 4869, 24221, 1411, 2328, 31398, 32265, 11630, 43286, 52696, 30269, 8581, 28597, 27817, 25081, 45061, 67445, 50806, 46955, 46908, 19881, 8552, -21075, -24233, -17524, -32207, -25879, -24140, 11343, 32456, 33441, 46078]
7966D6078J2064k3377L288J9973l687k9415n976j0431k311K3147k1041j0140J5428
7953A3600L3038Q915j8899j1906J3824J2953J8104l4074k0206O309O37k594k5263
7940e562k0997k9553l5848J2245J3554N2876N7380n355p69P983L775j0706m964
7927C4059J3937j5235k7246k3110p0829J0916Q5574J5188j890j5940p867k3914
7915b6357M3936K6781j9901j4651K920J5419k05J2011K589j9422k7454L029K2661
7902B1356k1601k6552J6141J5212k973k4790P479M901L3999n926j1769k67k903
7889B307j8916K4211K7672k7111r381J6281m241l4130N090R828j1940j4469j4817
7876d9616k6411R712J9545P2488J5560j5467Q767P215k2498m3503J3604K2021
$$ y = [46078, 58142, 34765, 38053, 58026, 54339, 24924, 18948, 8517, 6206, 29353, 8312, -1828, 13600, 46638, 55553, 36654, 24748, 38572, 51525, 69629, 35555, 15349, 21658, 22295, 19701, -5562, -26559, -56112, -91960, -79715, -66161, -13285, 44095, 38740, 37971, 45954, 49729, 39023, 34059, 47996, 32761, 5515, -17595, -88424, -77508, 8066, 23254, 21364, 5424, -2443, -26357, 17579, 44360, 24459, 9808, 12728, 28147, 27942, 39953, 42542, 23120, -4334, -1305, 21356, -245, -26797, -10656, 4556, 1583, -23207, -15728, -10827, 23172, 17246, 5477, 5210, 2307, -16609, 7602, 35274, 8163, -1218, 15063, 10822, -23308, -18218, -8390, -20330, -34799, -49616, -76027, -66315, -46770, 25718, 41278, 25811, 34578, 41793, 19295, -24208, -10604, 11417]
7864A1417l8175M3676L1468J854k1634k9875k2394L5359M8031K2351n8494n9229
7852c5645j9449m789J9185j166J9994j9267l8946K0347R716j3522j3050J5452
7840f1140M898P165M4731L1696m8663m0735J1416J7864l060n885j1123J5392N5294
7827A7850r507k6288j9427M1973J1914m3254P074j6707j6752m106l58k6691j1143
7814i5422O365m406j1554J1416K0668L2745N8214L778k9724K5916K5839K113R631
7801E5579J1274k7057l2807l7172k3343l4362J7164N1944K9965K5010M781k7143
7789A3833N190j27J3904q00k5595n9N4628l488R206j9900j8903j2935l0761k2146
7775c7953m4706K1974N6794r062j8810M6597k955j9518j2518j5602p161j6349
$$ y = [11417, -26758, 16918, 48386, 50240, 28606, -1269, -23663, 11696, 59727, 82078, 23584, -35645, -55094, -59883, -40698, -41864, -21870, -41137, -80083, -59736, -50020, -63542, -76592, -61140, -56242, -49077, -4346, 27350, -21313, -62048, -50632, -32768, -35828, -41713, -52836, -37444, 17850, 8343, -17945, -37372, 4601, 16515, -26739, -19665, -36372, -53124, -57230, -57588, -84279, -95422, -89057, -93463, -105017, -93601, -72933, -40188, 18026, 21804, -7920, 17996, 43835, 45948, 55579, 66853, 39796, 6989, -30183, -53526, -87888, -70724, -18780, 11185, 36195, 40976, 13833, 19023, 18896, 32800, 32000, 6405, 6346, 60974, 57486, 66692, 46792, 27889, 14954, -15807, -37953, -82659, -60685, -3891, -12953, -31763, 14834, 11879, -7639, -20157, -35759, -42920, -59269]
7763e9269L9748P800J2224m287M351O427q744J279L720j752j1521q318N7477J9464
7749E8599l6673k3234k5393k7547N477L1511M7457L0751j1795l3278J9537J0482
7737D5894o9827k6815K9277J9646Q807p083k8995J1697K2010j6641j4999k597
7725b9626L6989L3166k0213m251J6693J8057k1384k8385K6035j1863k6022p670
7713a8474J1778K300k0079N057M1914J4149Q93m0806q447k932J0946j8692L8873
7700A6480J6599j1774K3752L4896j8016p4329L856O7400J5416l6947j8728q442
7688A0163l1438q481j0839j7554R513N2408L6409k9469K983k1486k8810k4045
7676f0646J2638L1393p0L8851J4545j651j2300k1480K5427o297k7565j1241l4681
$$ y = [-59269, -19521, -11721, 503, -3784, 567, 6994, -1750, -471, 3249, 1497, -10024, -18342, 39135, 58599, 21926, -1308, -26701, -54248, -48771, -17260, 30197, 60948, 49153, 15875, 35412, 45894, -23933, -50748, -21471, -1825, 6982, -101, -29096, -17399, 4611, -12030, -27029, -29626, 7363, 40529, 20316, 16065, 32758, 50815, 29431, 1046, 27081, 15218, -10804, -18474, -6696, -4396, -24475, -19418, 22496, 36645, 37538, -3268, -11715, -14647, -3701, -22393, 16480, 33079, 21305, 45057, 79953, 61937, -12392, -8536, 58864, 74280, 37333, 18605, 10163, -21275, -29756, -40595, -58149, -48636, 3772, 40181, 10712, 13695, -7791, -36601, -60646, -48008, -16615, -16685, 22166, 36711, 35060, 22760, 1280, 26707, 20410, -7155, -18396, -53077]
7663e3077O964N0542L9110L0382J2074j2557k3217n6414K943K14R487J671N149
7650A3271r902j5767r967R436M5852l6660k0810K7192J7142j0492K8915J9139
7638E7349k1615l0179k1328J4873q346j9782L3582j4853Q128K3425r256m7902
7626c5904k0545J4048k3780L2797M0043K8397M889k9189k6931k8629R367J2343
7614b3094k1059J2147k773j9575M5182J2236n651k3978J1391j2535k756j1403
7602d1868O8801K9611L094R252j8704j8024l2974m2082L0L6350M422q23k2302
7589b5217m481J3640m570p820N5436J9304j3974N164K3129j9064m6781m3212J2080
7576c6366L0253J6759m499j6813j1245j6224m446Q813K0904L142j0385J8283m2521
$$ y = [-53077, -46113, 4429, 43539, 73921, 85995, 73438, 50221, -6193, -3250, -3036, 6451, 8122, 13271, 3369, -12398, -22365, -12929, 32923, -3737, -24547, 2645, 19787, 9295, 38210, 57349, 35734, 5555, -15773, -900, -9246, -29028, 4554, -10299, -2171, 21254, 11998, -35904, -56449, -42401, -66181, -33384, 6659, 35056, 39945, 10756, -16175, -44804, -35437, -23094, -44153, -32006, -34779, -54354, -9172, 3064, -2587, -26565, -15174, -27709, -30465, -41868, 26933, 56544, 59638, 68890, 50186, 32162, -812, -42894, -42864, -6514, -2092, -2915, -25217, -29698, -16058, -20628, -28448, 26988, 46292, 32318, 37482, 60611, 41547, -5234, -48446, -36366, -6113, 10646, 6147, -10666, -21911, -38135, -42581, -33768, -12864, -9722, -20107, -1824, -44345]
7563d4345q549K4657J5702j4173k734M173j801k0842L4517J4647q806L1518J169
7550B5133K2317k2292l7849J2849R668j5123l5333J6430L7249K1009m008k4351
7538E699j3802l3911J6320R81J2324L2695K4105l0010m9581l76M7013J9870k5148
7525F179J0888q275j8867M848K2964J9641l1991J0192K087J1976j5347l4412j4333
7512c4450j3843J8845K5730k498j1594m480J3673K5693J1316k004j1645j5975
7500a232J3192m1079M2K5671K5066q866j0301J0536o143r606k4650K3697K5865
7487B2192J54K5499j2877l5437r94O566n546L998M7443n556n4074k787m0250n397
7473e7066j0178k9604n797J723M9055N5508M695q718j896l5J6659o504J59j5726
$$ y = [-44345, -52894, -28237, -12535, -26708, -29442, -25269, -27070, -47912, -13395, 1252, -7554, 23964, 25133, 47450, 25158, -12691, 158, 9826, -5297, -40630, -24200, 13049, 34058, 30050, 5699, -8103, -42014, -25694, -24713, -12389, 20306, 44411, 14401, -35180, -35556, 11457, 31327, 6179, 17067, 8792, -10075, -5227, 17737, 37378, 5387, 15579, 17666, 29642, 14295, -20117, -34450, -48293, -29448, -3718, -6216, -17810, -22290, -8617, 17076, 28392, 26388, 14743, -1232, 11960, -29119, -29077, -3406, 21660, 12794, 2493, 13029, 6886, -2720, -27370, -3673, 22192, 22346, 47845, 34968, -469, -1463, 5103, -443, 3555, 50998, 45442, -8632, -11419, -51669, -57066, -67244, -96848, -102645, -100922, -51867, 3641, 8336, -382, -2278, -2313, 14346, 7842, 8001, -7725]
7459g725m7782L1514K3914K6808K373l3553j4987N14j4879n370K1183k5957J538
7446d2409L8762J5315L9378n226n4738l7172K029J6469L5061J5861j5002o377
7434A951n572K9964j1557l6979j0986P93J9112K517R859J1163L3494K5224J877
7421G0860m2499k0982R990j5174r171M3524j2640j8971J2098K8553K8777j7929
7409E6436j5539j2351J9598j2613K0213j0467j4640n66j7795l5086k4628P29p017
7396e3726L6323K2817O482N6868K689N635l6490j9877k6473n191N2277K2574k4015
7383C9893M28L9859k875m5555j0188l0600m3614j1937J6030K8430J1906l1609
7371c9832n540K8523J829j2997l3349J4415j709j8286O387K9549J1592J5355j5050
$$ y = [-7725, -55507, -23993, -79, 26729, 29102, -4451, -19438, -18924, -33803, -39173, -17990, -43947, -42409, -3647, 11668, 51046, 45820, -8918, -46090, -44061, -27592, 7469, 23330, 8328, 1951, -3621, 26343, 14786, -22193, -33179, -32386, -13274, -10757, -898, 10265, 43759, 68983, 70860, 28361, 7379, 17369, 2195, -6976, 36548, 23908, 4937, 17035, 45588, 74365, 56436, 40897, 28546, 48144, 35531, 55744, 45277, 30637, 30071, 12276, -22810, -47438, -46709, -53726, -17403, 5414, 11896, 68764, 71453, 77088, 40598, 20721, -5752, -10943, 41334, 63908, 39893, 40321, 80180, 77305, 31750, 21562, -9038, -52652, -64589, -48559, -20129, -8223, -39832, -45372, -16849, -15020, -28017, -61366, -46951, -48660, -66946, -60559, -31010, -19418, -4063, -19113]
7358a9113J4882j0446K7462J4956r385p335K0366j2536k5790l4362J4277L6690
7346I666K1419l3111r968j9030j472K3658J9918P811k9491q421L5130k1320j7125
7333b2336K9454m6700j5485k6471J7007J3299L144K3016K6103M6705o93j364J0499
7320E6178j3756l586m2307M434K0604k24R597p195K0163q84l5730J947l3510j8520
7306d2789k486l5201P682L9970M2483j5191J3147K9021l5524p940q14K0804m3241
7293c0079n6311L3560N6410r582j5450o524k694m2009K2426j261j2152L9298K10
7280b4158J3322K852N819j431N502P630K662l5422L8321J8016j8158j2923R783
7267A1815k9338m078J1494k0806K0070k1982k7279N271K1959M0010J9057q088
$$ y = [-19113, -4231, -14677, 12785, 27741, 18356, 11021, 31387, 18851, -6939, -41301, -27024, 9666, 31085, -2026, -11994, -31024, -32496, -8838, 11080, 18891, -10600, -19021, 16109, -5211, -22336, 7118, -39582, -55067, -81538, -64531, -51232, -48088, -25072, 1031, 47736, 47043, 45679, 56178, 42422, 38836, -3471, 963, 21567, 21343, 30940, 23745, 43908, 43024, 7294, 9241, -24269, -42789, -45275, -80476, -72794, -32824, 9659, -5532, 7615, 36636, 1112, -6828, -7642, 13162, -30079, -86390, -52830, 3580, -6002, -21452, -27976, -30670, -72679, -50253, -51514, -63666, -24368, -24158, -10836, -7984, -2165, -3596, 1906, 9536, 12198, -23224, 15097, 33113, 14955, 2032, 11815, -17523, -21601, -10107, -30913, -10843, -32825, -60104, -54833, -32874, 7136, 26193, 18105]
7255A8105J078j2514L903Q11k1730k4276K5337J4063K634K9210j883Q176k421
7242D0493j6791m6816j7736L630k379j2757K1743K6954k0246l2369l1260L7171
7230e0363N3406J6747o920J342k4351k6950J3767k226j4669K2123L4375j9818
7218c537k3011M343K0703K4996J2495j1255k4809j5153J554j54Q846l809J7104
7205H313K1252J1222n024N568J0564o0726j5870P076k33Q384j8519L5073J9420
7192B6500l793j9283L227j2311K6970J2668j2015j8826K092j3389k1894m8554
7180g8608n868J2483N408K7930N964o551j4813N328j5776j8960j1001J5509L8651
7167d0304J7632J3190L5038l0065l8145J4713J8032j996m8895k4460L032N3731
$$ y = [18105, 19183, 6669, 10572, 11383, -10347, -34623, -9286, 4777, 7411, 36621, 34738, 42914, 40493, 23702, -23114, -40850, -37220, -39599, -52356, -30613, -3659, -23905, -56274, -87534, -50363, 3043, 19790, 12870, 14212, -10139, -37089, -23322, -25548, -40217, -18094, 16281, -3537, -26548, -22205, -1502, 23494, 35989, 24734, -75, -15228, -13674, -13828, -4982, -8791, 8313, 29565, 40787, 35763, 41331, 51895, -8831, -24701, -17625, -17858, -9474, -27993, 7080, 26500, 22707, 3424, 6651, -5660, 21310, 33978, 21963, 3137, 5229, -8160, -30054, -78608, -84476, -71993, -66585, -38655, -32691, -39242, -54055, -48727, -64503, -83463, -94464, -78955, -40304, -22672, -9482, 25556, -4509, -42654, -27941, -9909, -11905, -60800, -85260, -82228, -28497]
7155b8497k2809r23J0429k149q665l992K7168K4278J9951J5013o0518N758M1208
7142A6252k0334j4039q370j6412M03K1057J6225j2826k8683p7J0100N301j334
7129c2737P578m002j3339J8130K5771L581j925k9236k962j2313K662J9891l2092
7116e0993L4864L6852J2579k4507Q797j1013j1824Q376k117m0730n386M689J1653
7103b8760o340K1130J1538l4110M784K8760J8530L6232J4562n3821k5568J0569
7091b494K8233J730k2007q793L0327J4933J0955j1965l7331K769l5158m0084J9018
7078d9867K4446l237q594J7532q318J5161k6909k3252K5017m701J7249k6983m8979
7065a01435R468R328K1520L8695k907L7631l1880j6976J7962J5591l9535p593
$$ y = [-28497, -51306, -52229, -41800, -43949, -52614, -56606, -29438, -5160, 14791, 29804, -30714, -24956, 16252, -4082, -18121, -26491, -42903, -42500, -21443, -5218, -18044, -46727, -46804, -36704, -31403, -32737, -25159, -29161, -42500, -24370, 1401, 4982, 3057, -26179, -29141, -41454, -38792, -18901, -50993, -16129, 20723, 33302, 8795, 17592, 6579, -5245, 3131, 1014, -39716, -45102, -40413, -28760, -35100, -13970, -2432, -36542, -31758, -2998, 15532, 51764, 66326, 12505, -13063, -2494, 25739, 27469, 5462, -3331, 26996, 41929, 52884, 40919, 3588, 6357, -28801, -68885, -49867, -25421, -28658, -37252, -19720, -28038, -12877, -39786, -63038, -38021, -42722, -25473, -52456, -101435, -91967, -82639, -61119, -22424, -25331, 12300, -19580, -36556, -18594, -3003, -42538, -50131]
7053e0131L7984L8165q36m0947K936J1734J0183j7586K5638J1225J1587K1464
7041F1416l9682l9451k754K6986L9899K1492k2246m2417O12j0279L2168K5828
7029E1572r887k4988n6117k582M5573M1903q352k3596M026l755j1368M542j0136
7016c165n535L2176J1011m4639m711L0419L739l8421J0147q891J883P984K2609
7003A4606J2660j2204l7956j2994J4061k8283J1550O0838R399m9841n624N1041
6991B7253J9091O017Q452k3883Q647L3589j2176m5073J1515o463m4680l7009Q283
6978d6437k628M858K1312j6586m275N709L0726o233j8643k7260O5634k4864p487
6965b6174J0832l0297n6034j2883M6339r580L8927M3244J767N007q541k0329K5708
$$ y = [-50131, -12147, 26018, 25182, -15765, -12829, -1095, 9088, -8498, 17140, 28365, 39952, 61416, 21734, -17717, -20471, 6515, 46414, 67906, 45660, 3243, 3855, -6424, 25744, 51572, 41685, 16697, -39420, -42002, 3571, 45474, 37122, 13526, 17552, 13797, 2429, 6971, -3165, -8700, 23476, 34487, -10152, -14863, 15556, 19295, -19126, -8979, -17870, -15987, -8003, 14606, 27266, 15062, -22894, -35888, -21827, -50110, -38560, 22278, 31677, -18164, -23788, 27253, 46344, 52361, 60813, 36930, 45577, 79166, 66990, 21917, 33432, 26969, -17711, -54720, -46437, -49065, -44207, -22895, -39481, -43756, -38047, -7321, -13554, -32197, -59457, 6177, -18687, -26174, -15342, -45639, -101673, -114556, -68217, -77797, -38870, 4374, 6141, 11148, 2607, -17722, 7986]
6952G986M477j9893p286K7136K3812Q667n443M1218p383k0779r777j8394l467
6939B0874k201J23l1203k1179o262K3227o187j6800j7257n16J499M2729K3346
6926A0193m974O558l0148m3191p642J3343R989J9023n648J0946M362m6887r54
6913f5030j1484K1778O3545K970k978K120Q248k6372N604K0451j6622q497J8600
6900A2333J4339P746m6605l676k5691K5585K3775j3227L929J9696O953j1858J0214
6887B3513K1688k796j6208k5546K772q768J476J5957R193l6166j0790j6459J3529
6874b8605K547N568q041m76K4729J6849r922K8666q887N880j3442P700j86k9820
6860g440k2433K2820K6320O327l357L894m8080L961K4158k0166j138m07m3242
$$ y = [7986, 12463, -7430, -14716, 12420, 36232, 44899, 39456, 80674, 73291, 52512, 42735, 24341, 20874, 18673, 18796, -12407, -33586, -39848, -16621, -22808, -39608, -56865, -57381, -55882, -13153, 10193, 5219, 11777, -18371, -61562, -69204, -55861, -45872, -26849, -32497, -21551, -17189, -64076, -65030, -76514, -54736, 8809, 11779, 8801, 10921, 19169, -7203, -1599, 18852, 2230, -6267, 12333, 26672, 34418, -12187, -15863, -41554, -15969, 7806, -5421, -1492, 18204, 25157, 13299, 23513, 45201, 42405, 26197, 651, 3423, -5345, -3869, 12088, 21281, -14885, -25675, -42134, -28605, -26058, -20490, -28531, -29007, -4278, 12571, 2649, 31315, 22428, 28308, 14866, 22566, 22380, -7440, -29873, -7053, 19267, 25594, 22237, 26131, -21949, -17988, 6170, -13996, -15134, -15541, -58783]
6847e8783Q317J6765L5023L1660L7689r038j5261m6524l6884K1194Q979N390k59
6834a732L43L3756l074j0052J3003j0571P057n2508J631M8985n0840k2062P272
6821c8792k25M834l911M1290j4718m1072K0190L1308m299J9051j8956M115j6042
6808a7227k26J3139M1921J4691p415o823p2595m5891L7938Q946L173K3986n76
6795f959o905Q77k1856j9793J8813L6705Q14k1387n431j7214P36J9649J6680j4022
6781a9293j7267l5104n770k206J8480N8177L20k7251K4456J9053P185N1826J0488
6768H3094l7383l8062l8081J0899j9804l8714L4896L1218j9152k9018J8373P490
6756c4244J7946J1733m4196p5N916l587j7856J0722l091K8161L8822k60N81k738
$$ y = [-58783, -50466, -33701, 1322, 32982, 70671, 61633, 46372, -152, -37036, -15842, -6863, -1473, -1732, -1389, 32367, 29293, 19241, 32244, 21673, 28730, -23778, -22147, 26838, -24002, -46064, -38792, -39017, -34183, -38094, 3196, -11522, -52594, -32404, -1096, -5395, 13656, -5300, -1185, -17227, -17453, -4314, 37607, 52298, 44883, 38060, -34535, -80426, -42488, -33542, -30369, -6383, -6959, -13864, -12987, -34843, -54636, -35823, 882, 1696, -19691, -25122, -42336, -41600, -21951, -5271, -19293, -36560, -71664, -77434, -79640, -61160, -2983, -2663, -29914, -5458, 13595, 20780, 72606, 83094, 45711, 7649, -30432, -19533, -39337, -78051, -43155, -11937, -31089, -60107, -41734, -34244, -16298, -4565, -48761, -48836, -42920, -46507, -64363, -53641, -56732, -28571, 10251, 9991, 10572, 7834]
6742G834L0963j7867o029l3179k099L1587j1828J7581J1867K7483r301k2140m1252
6729a6380q180M4541J6049K759J5342j9213k8474j8727N958l034J791l0755l5926
6716g4249j478L5666K0211J0379j6639k506K3654j4082k825K2846P029n6579k8582
6703g7155L631M0786M0875M9852K368k5249k5757J3704J8192J8222j6792m5155
6691b478J0664L0950r912J3849J858P083l670j0184k2913j0279j0111m490L0897
6678B1264M2942j7504j3560j8903p014p487p801j174J2975k338j6622n35l4177
6665d9934j7520N407L8160K2724o413R520K2501j2760j6857m4878P909P4J2543
6652b9524k1216j8138J105J4457k110J8254J6685J8695O092J8234k8776m2133
$$ y = [7834, 38797, 20930, 14901, -18278, -20377, 11210, -618, 16963, 28830, 56313, 47012, 24872, -16380, -24560, 19981, 36030, 38789, 54131, 34918, 6444, -12283, -6325, -9359, -7568, -38323, -74249, -75727, -40061, -19850, -9471, -26110, -28616, -4962, -19044, -21869, 977, 8006, -48573, -77155, -73524, -32738, 8137, 57989, 60357, 35108, 9351, 23055, 41247, 59469, 42677, -2478, 8186, 39136, 29224, 43073, 44931, 52014, 48344, 38160, 15247, 4968, -5143, -9633, 21264, 64206, 46702, 33142, 14239, 7225, -262, -8063, -9237, 3738, 1400, -15222, -15757, -49934, -67454, -62047, -23887, -1163, -7576, 1944, 24445, 11685, -5172, -50050, -42141, -42067, -29524, -50740, -68878, -67773, -53316, -55426, -37172, -20487, -1792, 4300, 22534, -6242, -48375]
6640d8375k0346O596O3861M3334k3523k5543k3060J5556M637P737P976J5869r328
6627A5391o121j6301r093l3686Q920K1789J0341j2580L6987L7346J2124l7403
6615B7714j8793K7295L2035K3587k9569l0242j3936J2349K29J1326p799j5480
6603A8716l4052L3279L5658p502N842J3704j9912J5036P519j1754j1449N674M810
6590E5569k4374l7573p399n2612r690K3863L3313J1399k26P672K573k2901l019
6577b3405J9565j4242L0186K6420L083p17J7430k2717k9817j3482J1480K8872
6565C2656K0525l7497j2635K7185j6830k0888j6880l3870m534J2057j6200J788
6553f5123K3832L6622m1873k3945J607K7288K7293o993K4507j9630o922K7212
$$ y = [-48375, -68721, -62125, 1736, 45070, 21547, -3996, -27056, -11500, -6863, 874, 8850, 24719, 15391, 9270, -7031, -16124, -49810, -40890, -19101, -8760, -21340, 15647, 52993, 65117, 27714, 8921, 36216, 68251, 91838, 62269, 32027, 18091, 30440, 30669, 41995, 34196, 18716, -15336, 17943, 53601, 46099, 51941, 65645, 45733, 60769, 68288, 56534, 45085, 50759, 55569, 31195, -6378, -13777, -66389, -76079, -52216, -18903, -7504, -7730, -58, 2515, -20386, -23405, -3840, -18082, 12104, 38524, 41607, 40890, 58320, 35603, 5786, -7696, 3784, 32656, 53181, 15684, 3049, 30234, 13404, -7484, -24364, -58234, -62768, -50711, -66911, -65123, -41291, -4669, -46542, -70487, -68880, -41592, -14299, -21292, 3215, -16415, -23337, 3875]
6541C875r389M63K3698j9233J3524j643O590K7798J6186j9368j5128j9298P59
6528H834j0296l5741J5834J8113j2486k828L0691J0438k7202j3844p189q565J5269
6515a8972J2265m495L81j6821j998J6893K8782o0035j3640J3883n030O130K0321
6502b2336J9833P906j1961M374k722j7387N108j5424J1426K9867l9232j6022L7556
6489i014J0509p5067k0402O4070K3893l2776J8253K799k651k9213j0828L3999
6477b6428N0336K7831k1287J7516k6789n6204K534K5118L2792L3917l0399k1561
6465G376k3068l8070N320P4825J3033m4118k6634Q813j0733k052m1323l8264M5536
6452f9359M7440J5808j4002j7960m587j2270J4831M4759J7347J6336r861l9764
$$ y = [3875, -5514, -5051, 18647, -586, 12938, 11295, 17885, 45683, 61869, 42501, 27373, 8075, 8834, -1462, -37203, -21369, -3256, -15742, -18570, 12121, 22559, -4643, -18487, -25676, -34241, -18972, -6707, -11202, -10821, -27642, -29640, -12747, 16035, -44000, -57640, -43757, -48787, -42657, -22336, -2503, 5403, -6558, -2184, -4906, -22293, -17185, -32609, -21183, 8684, -30548, -46570, -9014, 1495, -73572, -93974, -29904, -6011, -38787, -20534, -17735, -20386, -49599, -60427, -26428, 23908, 51739, 30452, 47968, 21179, -35025, -32491, -7373, 25419, 59336, 28937, 7376, -15692, -53762, -48442, 26383, 39416, -4702, -31336, -22523, -33256, -35308, -76631, -114895, -69359, -21919, -6111, -20113, -38073, -42660, -54930, -40099, 4660, 22007, 38343, 28482, -11282]
6440a1282L557l8382q928m14L473j3259J0195p124P051K0361o616J3623q787K6540
6426i992J9807k9208j1015L7053J8407l3751j6753j35J6709M7514K8511l7547
6414B9600m9310j3604L310j5975J5020J2312q786N627K1429L628O21K4130l425
6401B4577m5592l7591k6935Q410o228O043J3599J4107K0260R65k4314k976M1058
6388a4617P481j0650j852m796K2854M850M050J7077j2420l6531k1444l3432k1211
6375a00641K8910L2333K2238P461j2823o372o266L175k5143L828J7058o047J5018
6362b7271j0324L2911O003l9989k774J348J3609K5676K7959j7141r049N543l244
6349C257J070J0913o333L3130o5766k8359J9186n782Q42j7279J5439L2430M7867
$$ y = [-11282, -7725, -46107, -55035, -55449, -51976, -65235, -55040, -62164, -55113, -34752, -41368, -27745, -36532, -9992, 9815, -19393, -30408, 6645, 25052, -8699, -25452, -25587, -8878, 38636, 67147, 29600, -19710, -33314, -30004, -45979, -30959, -18647, -27433, -21806, -377, 3251, 3872, 28002, 24577, -21015, -58606, -85541, -77131, -83359, -77316, -63717, -49610, -29350, -28385, -52699, -55675, -14617, -7136, -17786, -19638, -24434, -1580, 3270, 7320, 24397, 11977, -24554, -45998, -79430, -100641, -71731, -39398, -17160, -9699, -22522, -28894, -35160, -31985, -57128, -53300, -36242, -42289, -27271, -37595, -4684, 1319, -38670, -41444, -40096, -26487, -811, 27148, 10007, 958, 6501, 3257, 4327, 15240, 8907, 42037, -23729, -52088, -32902, -38684, -37842, -55121, -39682, -7252, 40615]
6336D0615j957l311o264k1386k9892l1320l2815M4271K4372N657p951l4027J1919
6323d2089J2362O429j8901m4699l316M069K0427L965J3243J0739k1352P996J3453
6310c7674K9204K6838P587J2513J58J7390J6340j4013j5226J124j59j6128l103
6297B4851j5311k348L3929p818j1926k4284J274J5191K3563J2662k2523l3240
6285e980O125p257r685J7011k0239R619L6648J1061n1533m6336J7842L924n413
6272d4213N0471N6803K8022k5746o3318l4014k3571j1445J0691O519J9610j126
6260c1317P175M290J4540R474j9071n8K3682L1047r108L3806J3873k22Q322j7063
6246F9370k1499k2502k3394R010L3822J3653n2375j6536n23p037j9481M569K9996
$$ y = [40615, 38658, 35347, 29083, 7697, -22195, -53515, -86330, -42059, -17687, -12030, -19981, -54008, -42089, -29727, -23298, -42199, -86898, -90214, -86145, -65718, -61753, -48510, -37771, -59123, -51127, -37674, -8470, 18368, 25955, 38468, 38626, 56016, 72356, 58343, 43117, 44241, 44082, 27954, 24851, 9540, 7192, 41121, 33303, 21377, -2907, -1633, 13558, 37121, 49783, 27260, -5980, 145, -7112, -16797, 214, -20025, -10406, 26242, 37303, -14230, -60566, -42724, -38800, -44213, 6258, 63061, 91083, 65337, 2019, -31995, -55566, -67011, -56320, -49801, -30191, -31317, -24142, -19852, -5312, 4162, -14909, -14967, 8715, 39762, 30654, 64460, 78333, 78111, 86433, 69370, 47871, 25369, 1975, 10985, 44807, 58460, 6085, -10451, -10974, -18011, -37492, -32923, -2927]
6233b927j5744J6331r880m4607J7385L8948N871J0009j7298j9370K6494M1233
6221D6445n326k5027L1913L4391k9986n0143k7350J5870L9393k5571k7441J0686
6209a2146R416m4478q451L0941l357j0573j3494k0113j5869k607M2571M6963M321
6196C124l7186l3028L6727L0720J1338O316K0210j006l7328J1562J9509j5647
6184A5311l6582K1935M0606J6730k200k4395k8633p565l2980k7404K488J4238
6172d8451K7765J1024K4859R454p124k2032j428J0424j0113K651J0382l8721q315
6159c9625J8857J0710K1549K3628j6255j2210K919k3107K1655k6081o2375j146
6147h1481O1840j0483n240n341j8996M655J5714M4075P109m1546l6474Q548K3408
$$ y = [-2927, -18671, -2340, -12220, -56827, -39442, -494, 5377, 15386, -1912, -21282, 5212, 46445, 41119, 16092, 48005, 82396, 52410, 2267, -25083, -9213, 30180, 4609, -22832, -12146, -2730, -47208, -55659, -24718, -28075, -38648, -52142, -72255, -88124, -90731, -48160, -1197, 3124, -34062, -67090, -30363, 357, 11695, 18011, 38221, 37215, -113, 11449, 30958, 15311, -21271, 664, 41270, 58000, 55800, 31405, 2772, -4793, -37773, -65177, -62689, -48451, -20686, -9662, 15197, 24651, 17527, -4505, -5933, 4491, -5622, -2971, 7411, -31310, -39625, -20768, -10058, 11491, 35119, 18864, 6654, 9573, -13534, 8121, -17960, -80335, -81481, -19641, -30124, -35364, -40705, -59701, -55046, -39332, 4743, 11852, -29694, -66168, -57620, -34212]
6134c4212K8861L4964l965j5495l1832o823n827j5564j312L6755K1711L88j3754
6121f105M7184k1701o6560j0545J2652o587m255J3081l925m117j1533L2952o378
6108c5837M642m537J1321M8852J5375k2624m3142j1838K8828J6951K388n7683
6096d7304J5672j4071K4222J0247j2460J5156Q123q519k1186k9127k0517L0729
6084d9035J1456J5265m7260O121P952K5969N6351K705L770K6568J8919k4851j4622
6071C9308k5538k7224J7064m5485L0144j0166P767j2195J1456L1886K0895n1255
6059a3343l9982L1057k708j8284K7610J9007j6446m734P816l8762k8502J6754
6047f0517N597P84o216n301p895J4241Q79K2584j5716K732L3121l993l076L0007
$$ y = [-34212, -5351, 29613, 25648, 10153, -21679, -28502, -34329, -49893, -51205, -14450, 7261, 7649, -6105, 41079, 19378, -47182, -57727, -45075, -51662, -55917, -42836, -46761, -50878, -62411, -29459, -35837, -31195, -35732, -24411, 24441, 39816, 17192, -25950, -37788, -8960, 7991, 10379, -47304, -31632, -45703, -21481, -11234, -23694, -8538, -415, -8934, -30120, -59247, -79764, -49035, -37579, -22314, -69574, -63453, -55501, -29532, 26819, 29524, 33294, 59862, 78781, 53930, 39308, 13770, -13454, 3610, -41875, -11731, -21897, -14130, -26325, -14869, 17017, 37912, -13343, -53325, -22268, -24976, -43260, -15650, 3357, -13089, -17823, -10007, -48769, -77271, -60517, -54920, -54136, -60352, -65653, -73548, -59307, -58428, -35844, -51560, -48828, -15707, -19700, -22776, 7231]
6033G231J1562j7694m523r842J0765j2764J6158j1605k1176J0562K1364k2866
6021b2828J0906n335o853p953l9861K3105K8892K4024J0333l9298j0027K0336
6009a4559m633o571j3053r828J5371k4440l330K3497N006j1112J749K7997M4652
5996C0746p018j6825k2057j1066K0777m614R075R820l7888q108j1093j4464M229
5983e8486o687L4192N2515K2076k0487j7786k5923k2j8860m3067J0808J9300N3937
5970A510J9197m8131P151J7953K0347J4120J0779K306p311l3382O420J7532l8792
5957a0301j8134Q945K0454k9729j4360m422J3154J6814J3315J0023m184N80j6372
5944a4217K0891m288k5876j4411M846j9622K7887j392J8678K6817J1001N612J274
$$ y = [7231, 18793, 1099, -3424, -13266, -2501, -15265, 893, -10712, -31888, -21326, 38, -22828, -11922, -17257, -24110, -32063, -71924, -48819, -19927, 4097, 14430, -24868, -34895, -14559, -19192, -25763, -38816, -48644, -33273, -57713, -61043, -37546, -32540, -43652, -41903, -13906, 30746, 23728, 6903, -15154, -26220, -5443, -10057, -982, 8838, -29050, -37158, -48251, -62715, -58486, -65173, -30981, 21534, 43610, 23123, 5337, -20586, -20608, -39468, -82535, -71727, -52427, 1510, 20707, -27424, -20273, -2320, 18027, 32147, 42926, 45232, 37921, 4539, 10959, 28491, -10301, -28435, -19490, 964, -28765, -43125, -47547, -34393, -17579, -4264, 5759, 1575, 2155, -14217, 6674, 2386, -23490, -37901, -33055, -52677, -24790, -26182, -7504, 19313, 30314, 35926, 37200]
5931C7200J683j7798j7359R450K0387m309k1207j7251O846k784m8452j0457J6639
5918d7412q86o151J6114M807J9952j9183R099N4543K2017o796j4275n2923L0837
5905I743J821j2694P460J8771O641j3527q975K1664j3509k632q585k9490J5157
5892h155M0029L3401l283l1302k2535K820K6939j3477k4717M295O45J6659o785
5879A4534j6426j0437P043l5238J7719K5543J0747j3805l906n203K296P882N001
5866E750J3037J4128l880J7311j1016j0401q703l5995m882M5450m4629K276K0225
5853a329o341m0646P255j3903l7829N849L5111J9897K1128j8318j0619J3490M1928
5840A5673l811m9251j7426P674r715J4824L5833q126p065M516l376J9587l1998
$$ y = [37200, 38883, 21085, 3726, 13176, 33563, 29254, 8047, -9204, -2358, -5142, -53594, -64051, -47412, -48298, -54449, -38335, -33528, -13576, -32759, -23660, 30883, 52900, 46104, 31829, -21094, 9743, 11564, -1130, 6330, 25101, 31742, 18215, 9240, 30904, 17395, 14763, 6178, -23312, -8155, 31874, 65275, 61992, 30690, 8155, 10975, 37914, 24437, -280, 4015, 4660, 21319, 14534, -1892, -12329, -5286, -40524, -22805, 2738, 13485, -320, -4226, -9429, -7133, 749, 5750, 18787, 32915, 29035, 46346, 35330, 24929, 16226, -19769, -24651, 20799, -23830, -21554, -1329, -7670, -48316, -41061, -54964, -92793, -86944, -51833, -31936, -10808, -29126, -39745, -26255, 15673, 11862, -37389, -54815, -47141, -56856, -42032, -6199, -14325, -21390, -16874, -20250, -663, -32661]
5827c2661j2033q657M3602Q084m229r921P093j5247J4316M681O088j4548J3237
5814a95K0651K5890n893J7038m795l3587p36J8484j1391l5377k8755J6992l824
5801b5498J32M3983K7947l4094j1214K5691P370k521q754J4085J5329k2465l8862
5788h871k4911M3294K877L978O314J8782M187k072p636k0977j9872K428J7015
5775A4536K3604j5845k4667K712n839N160J7893K782Q222k7499o266K6216J3630
5762C4639J2337j1339j7370j8998L120J2222L804n090J2450J3550k0086J064O916
$$ y = [-32661, -44694, -53351, -9749, -1665, -5894, -15815, -8722, -23969, -9653, -4972, 1116, -13432, -195, 20456, 46346, 40453, 57491, 52696, 19109, 18373, 36857, 25466, -9911, -38666, -21674, -25498, -25366, 18617, 46564, 12470, 1256, 26947, 34317, 31796, 23042, 37127, 52456, 29991, -8871, -33782, 9512, 12389, 16367, 22681, 41463, 45650, 43578, 35942, 14965, -4907, -2479, 14536, 38140, 22295, -2372, 340, -5499, -339, 17554, 20336, 28558, 1059, -5207, 21009, 34639, 46976, 35637, 18267, -731, 2389, 14611, 18415, 13325, 25775, 39325, 19239, 20303, 27219]
$$ [...]
##END NTUPLES=NMR SPECTRUM
##END=
