##TITLE=Analysis number 327692
Compound Code sb 01810
Book Reference 93774
Project Code adrs flro3
Chemist Name jom
##JCAMPDX= 6.0         $$ Bruker NMR JCAMP-DX V2.0
##DATA TYPE= NMR SPECTRUM
##DATA CLASS= NTUPLES
##ORIGIN= Bruker BioSpin GmbH
##OWNER= nmr
$$ XWIN-NMR		Version 3.5
$$ Mon Apr  2 09:25:56 2007 GMT Daylight Time (UT+1h)  MAYBRIDGE\nmr@NMR_250MHZ
##.OBSERVE FREQUENCY= 250.131544655141
##.OBSERVE NUCLEUS= ^1H
##.ACQUISITION MODE= SIMULTANEOUS (DQD)
##.ACQUISITION SCHEME= undefined
##.AVERAGES= 16
##.DIGITISER RES= 18
##SPECTROMETER/DATA SYSTEM= dpx250
##.PULSE SEQUENCE= zg30
##.SOLVENT NAME= CDCl3
##.SHIFT REFERENCE= (INTERNAL, CDCl3, 0, 16.522)
##AUDIT TRAIL= $$ (NUMBER, WHEN, WHO, WHERE, WHAT)
$$ ##TITLE= Audit trail, XWIN-NMR		Version 3.5
$$ ##JCAMPDX= 5.01
$$ ##ORIGIN= Bruker BioSpin GmbH
$$ ##OWNER= nmr
$$ C:\u/data/dgb/nmr/ADRS/30/pdata/1/auditp.txt
$$ ##AUDIT TRAIL=  $$ (NUMBER, WHEN, WHO, WHERE, WHAT)
(   1,<2007-04-02 09:25:24.57 +100>,<MAYBRIDGE\nmr>,<NMR_250MHZ>,
      <created by zg, POWCHK disabled, PULCHK disabled
       configuration hash MD5:
       49 4B E0 1D 92 C2 6B 37 9F E6 65 BC 52 41 86 1D
       data hash MD5: 64K
       A3 C0 A4 32 45 33 E2 DA 78 95 5B 52 E5 C7 E4 DF>)
(   2,<2007-04-02 09:25:45.59 +100>,<MAYBRIDGE\nmr>,<NMR_250MHZ>,
      <Start of raw data processing
       ef LB = 0.3 FT_mod = 6 PKNL = 1 SI = 32K 
       data hash MD5: 32K
       0D 18 C5 AE 8B B3 26 74 24 22 33 D3 14 7E 2F 97>)
(   3,<2007-04-02 09:25:47.95 +100>,<MAYBRIDGE\nmr>,<NMR_250MHZ>,
      <apk 
       data hash MD5: 32K
       FA E3 2C 0F 41 99 A2 A1 4F F9 3E 93 60 75 17 A4>)
(   4,<2007-04-02 09:25:48.79 +100>,<MAYBRIDGE\nmr>,<NMR_250MHZ>,
      <abs ABSG = 5 
       data hash MD5: 32K
       4B 64 61 2A BB 21 37 53 99 6C D9 36 6A 30 F4 D8>)
$$ ##END=
$$ 
$$ hash MD5
$$ 0D 7C 85 0A 5B E5 24 F9 3B 59 38 B8 09 38 45 E7
##$RELAX= 
##$RELAX= 
##$RELAX= 
##$RELAX= 
##$RELAX= 
##$RELAX= 
##$RELAX= 
$$ Bruker specific parameters
$$ --------------------------
##$DU= <C:\u>
##$EXPNO= 30
##$NAME= <ADRS>
##$PROCNO= 1
##$TYPE= <nmr>
##$USER= <dgb>
##$AMP= (0..31)
100 100 100 100 100 100 100 100 100 100 100 100 100 100 100 100 100 100 
100 100 100 100 100 100 100 100 100 100 100 100 100 100 
##$AQSEQ= 0
##$AQ_mod= 3
##$AUNM= <au_zg>
##$AUTOPOS= <5 >
##$BF1= 250.13
##$BF2= 250.13
##$BF3= 250.13
##$BF4= 250.13
##$BF5= 500.13
##$BF6= 500.13
##$BF7= 500.13
##$BF8= 500.13
##$BYTORDA= 1
##$CFDGTYP= 0
##$CFRGTYP= 5
##$CHEMSTR= <none>
##$CNST= (0..31)
1 1 145 1 1 1 1 1 1 1 1 1 1 1 1 1 1 1 1 1 1 1 1 1 1 1 1 1 1 1 1 1 
##$CPDPRG= <>
##$CPDPRG1= <>
##$CPDPRG2= <>
##$CPDPRG3= <>
##$CPDPRG4= <mlev>
##$CPDPRG5= <mlev>
##$CPDPRG6= <mlev>
##$CPDPRG7= <mlev>
##$CPDPRG8= <mlev>
##$CPDPRGB= <>
##$CPDPRGT= <>
##$D= (0..31)
0 1 0 0 0 0 0 0 0 0.06 0 0 0 0 0 0 0.0002 0 0 0 0 0 0 0 0 0 0 0 0 0 0 
0 
##$DATE= 1175502322
##$DBL= (0..7)
120 120 120 120 120 120 120 120 
##$DBP= (0..7)
150 150 150 150 150 150 150 150 
##$DBP07= 0
##$DBPNAM0= <>
##$DBPNAM1= <>
$$ [...]
##$SUBNAM7= <"">
##$SUBNAM8= <"">
##$SUBNAM9= <"">
##$SW= 20.6930455092707
##$SWIBOX= (0..15)
0 0 3 0 0 0 0 0 0 0 0 0 0 0 0 0 
##$SW_h= 5175.983436853
##$TD= 65536
##$TD0= 1
##$TE= 683.16
##$TE2= 300
##$TE3= 300
##$TEG= 300
##$TL= (0..7)
0 120 120 120 120 120 120 120 
##$TP= (0..7)
150 150 150 150 150 150 150 150 
##$TP07= 0
##$TPNAME0= <>
##$TPNAME1= <>
##$TPNAME2= <>
##$TPNAME3= <>
##$TPNAME4= <>
##$TPNAME5= <>
##$TPNAME6= <>
##$TPNAME7= <>
##$TPOAL= (0..7)
0.5 0.5 0.5 0.5 0.5 0.5 0.5 0.5 
##$TPOFFS= (0..7)
0 0 0 0 0 0 0 0 
##$TUNHIN= 0
##$TUNHOUT= 0
##$TUNXOUT= 0
##$USERA1= <user>
##$USERA2= <user>
##$USERA3= <user>
##$USERA4= <user>
##$USERA5= <user>
##$V9= 5
##$VALIST= <valist>
##$VCLIST= <CCCCCCCCCCCCCCC>
##$VD= 0
##$VDLIST= <DDDDDDDDDDDDDDD>
##$VPLIST= <PPPPPPPPPPPPPPP>
##$VTLIST= <TTTTTTTTTTTTTTT>
##$WBST= 1024
##$WBSW= 4
##$XGAIN= (0..3)
0 0 0 0 
##$XL= 0
##$YL= 0
##$YMAX_a= 556326
##$YMIN_a= -435798
##$ZGOPTNS= <>
##$ZL1= 120
##$ZL2= 120
##$ZL3= 120
##$ZL4= 120
##$ABSF1= 16.522
##$ABSF2= -4.171173
##$ABSG= 5
##$ABSL= 3
##$ALPHA= 0
##$AQORDER= 0
##$ASSFAC= 0
##$ASSFACI= 0
##$ASSFACX= 0
##$ASSWID= 0
##$AUNMP= <proc_1d>
##$AZFE= 0.1
##$AZFW= 0.1
##$BCFW= 0
##$BC_mod= 0
##$BYTORDP= 0
##$COROFFS= 0
##$CY= 12.5
##$DATMOD= 1
##$DC= 0
##$DFILT= <>
##$DTYPP= 0
##$F1P= 14.0000005364418
##$F2P= -0.99999901652339
##$FCOR= 0.5
##$FTSIZE= 32768
##$FT_mod= 6
##$GAMMA= 0
##$GB= 0
##$INTBC= 1
##$INTSCL= 1
##$ISEN= 128
##$LB= 0.3
##$LEV0= 0
##$LPBIN= 0
##$MAXI= 10000
##$MC2= 0
##$MEAN= 0
##$ME_mod= 0
##$MI= 0
##$NCOEF= 0
##$NC_proc= -4
##$NLEV= 6
##$NOISF1= 0
##$NOISF2= 0
##$NSP= 0
##$NTH_PI= 0
##$NZP= 0
##$OFFSET= 16.522
##$PC= 1
##$PHC0= 92.15221
##$PHC1= -12.5729
##$PH_mod= 1
##$PKNL= yes
##$PPARMOD= 0
##$PSCAL= 4
##$PSIGN= 0
##$REVERSE= no
##$SF= 250.13
##$SI= 32768
##$SIGF1= 0
##$SIGF2= 0
##$SINO= 400
##$SIOLD= 32768
##$SREGLST= <1H.CDCl3>
##$SSB= 0
##$STSI= 32768
##$STSR= 0
##$SW_p= 5175.98343685301
##$SYMM= 0
##$S_DEV= 0
##$TDeff= 65536
##$TDoff= 0
##$TI= <Analysis number 999999
Compound Code 99
Book Reference 9
Project Code 9>
##$TILT= no
##$TM1= 0
##$TM2= 0
##$TOPLEV= 0
##$USERP1= <user>
##$USERP2= <user>
##$USERP3= <user>
##$USERP4= <user>
##$USERP5= <user>
##$WDW= 1
##$XDIM= 32768
##$YMAX_p= 517772176
##$YMIN_p= -129166
$$ End of Bruker specific parameters
$$ ---------------------------------
##NTUPLES= NMR SPECTRUM
##VAR_NAME=  FREQUENCY,     SPECTRUM/REAL,   SPECTRUM/IMAG
##SYMBOL=    X,             R,               I
##VAR_TYPE=  INDEPENDENT,   DEPENDENT,       DEPENDENT
##VAR_FORM=  AFFN,          ASDF,            ASDF
##VAR_DIM=   32768,         32768,           32768
##UNITS=     HZ,            ARBITRARY UNITS, ARBITRARY UNITS
##FACTOR=    0.157963299565203, 1,           1
##FIRST=     4132.6476996994, 0,             0
##LAST=      -1043.33573715361, 0,           0
##MIN=       -1043.33573715361, -129166,     0
##MAX=       4132.6476996994, 517772176,     0
$$ Real data points
##PAGE= N=1
##DATA TABLE= (X++(R..R)), XYDATA
$$ [...]
18218 -42366 -35896 -32965 -35608 -41132 -48011 -53524 -48328 -42073 -37697 -25624 -16264 -11169 -10730 -10783 -22290
18203 -22290 -36413 -49439 -50265 -37753 -25345 -40284 -48475 -46599 -45039 -32248 -18403 -21079 -32069
18190 -32069 -32167 -30681 -24750 -16234 -22687 -35464 -46927 -42710 -41852 -43753 -47302 -52460 -43847 -27998
18176 -27998 -25656 -30717 -28632 -27865 -28127 -36941 -42495 -53858 -68351 -74310 -71882 -77659 -73715 -78459
18162 -78459 -87599 -94338 -94564 -88675 -78404 -68210 -51726 -58442 -64958 -39452 -32492 -34170 -49092
18149 -49092 -63961 -79561 -85177 -75246 -70888 -74409 -78765 -76368 -66125 -47802 -38260 -45120 -54662
18136 -54662 -50061 -39606 -33832 -31347 -20608 -11909 -2867 3764 8506 15321 11009 16597 36212 64671
18122 64671 106293 161852 227037 311681 411421 559652 776257 1098685 1596176 2402360 3889083
18111 3889083 6847691 12965053 23357492 28551527 24135215 16276130 9717076 6233256
18103 6233256 4420682 3363868 2674464 2198411 1867319 1605559 1404643 1246036 1113134
18094 1113134 992715 878257 801800 724483 645105 576929 530808 492227 465705 429742 401321
18083 401321 384361 382457 390298 392287 403153 422920 395863 343620 284078 262299 252283 248737
18071 248737 242634 251435 264590 277960 276886 259906 222897 199386 192696 191109 189102 170807 156607
18058 156607 142090 144238 133960 137529 149400 162537 187066 216633 222237 194996 172061 158510
18046 158510 162737 166937 171151 165345 188439 231206 242609 223527 183785 149860 128747 96034
18034 96034 90063 102100 102719 88803 76416 66081 59140 58793 71607 81027 82655 77780 76348 63638
18020 63638 60606 69411 79434 73292 64952 59291 66807 80174 75898 63074 71492 82410 73268
18007 73268 71440 75045 65942 60813 53144 50292 58550 66848 58411 55123 50896 46862 48517 43779
17993 43779 64165 67089 70642 70480 60541 55365 49812 31673 20579 38044 55523 54849 35465
17980 35465 24921 30607 51726 53687 47487 29722 24425 35968 44308 46963 46453 37941 33855 22572
17966 22572 8633 4595 15156 14426 15524 20599 29012 32908 17455 7938 11528 23672 30041 32892
17952 32892 31336 31783 24947 28855 40341 40305 35867 29693 29437 25864 32910 37688 31807 29171 31285
17937 31285 26866 24789 31184 27075 17970 24503 23960 25233 38711 38423 35706 35758 21350 17147 26131
17922 26131 39572 49322 44832 44180 50963 47407 39935 47559 57175 42503 29638 23644 19667 21745
17908 21745 25378 31522 27239 34899 41932 47929 42304 42297 30034 33332 34000 23522 10453 8540 23664
17893 23664 21904 19907 27711 34459 36800 32023 28815 37530 33547 21994 27857 20406 15777 41176
17879 41176 41942 29645 26302 23110 31367 30192 34764 47549 49097 49417 38284 12427 17796 30387
17865 30387 23735 22234 13146 11840 24452 36727 37792 23257 15520 20614 25091 15764 7802 8565
17851 8565 16495 17576 15284 20864 30581 28875 27029 19170 24122 31164 31815 22265 16444 7442 4280
17836 4280 7657 2960 -5939 870 12543 13137 14584 27398 27610 31005 36609 29495 28530 30027 26336
17821 26336 13526 15910 17218 20499 13354 7342 3858 18105 35793 28246 25407 36959 34556
17808 34556 25874 16063 12071 10338 3829 -4284 -454 6293 7456 -3141 5982 20635 23371 28157
17794 28157 29820 24608 31606 27425 20598 24322 26453 24988 3414 5556 17207 11842 10444 20313
17780 20313 17998 15063 8079 -1336 6013 11797 -838 -6515 2102 9194 3862 878 4308 5351
17766 5351 15246 17744 12333 15895 16583 16235 19441 21224 23395 23548 26826 14493 19558 27171 18348
17751 18348 14591 12737 20750 21837 30878 42974 34180 16087 4457 76 10748 10468 19608 32444
17737 32444 33972 34184 26628 34140 33778 21290 15362 11156 7822 1479 13843 23860 15508 7353
17723 7353 11736 5863 -189 -901 -3712 -13412 -9088 425 -1110 147 4333 7017 1168 -293 9789
17708 9789 17566 15433 22453 29001 31968 22288 8039 9900 15411 13490 11493 -4940 -12552 466
17694 466 4534 9514 22228 17430 1788 -1976 2651 -154 -3460 755 7118 9156 -373 -9308
17680 -9308 -1617 16931 27799 24791 21391 22917 18420 12677 11362 19576 27273 32541 28530 19638
17666 19638 20257 18411 21006 14668 -4946 -11061 -1867 14994 13881 -1333 5444 2638 3725 3500
17652 3500 6813 9010 4604 8016 19239 15506 11387 16555 11997 14445 10700 15294 10699 5023
17638 5023 7217 15659 25687 36951 54068 40442 29959 25804 16372 -1174 -14464 -6224 13042
17625 13042 29908 39702 26090 8743 2963 6886 -2572 -12188 -480 12613 -294 5955 9269
17612 9269 14383 10464 8152 3573 -7373 -7717 -5896 -16701 -4156 -2106 -4048 -5436 5100 -372
17598 -372 -22 8349 12975 6305 2685 7122 8706 -827 -19235 -4845 9726 13133 11208 9214
17584 9214 12161 15743 13273 2708 10059 4591 -534 2731 7401 6737 4469 15506 28423 30730
17570 30730 24792 13853 15822 18657 15649 12938 23308 24635 17901 13291 13645 10801 5550 779
17556 779 -6274 -11804 -20054 -25434 -28178 -23215 -21043 -18390 -6910 -6816 -4406 0 7858 -10535 -22178
17541 -22178 -22246 -13831 2019 13762 3414 11034 14160 10717 1583 -9403 -6047 -7754 -10330 -13173
17527 -13173 -10846 -15334 -10644 -11735 -9297 -7377 -20646 -21994 -12868 -5114 3266 4680 219 -1853
17513 -1853 47 4456 11957 16351 16824 8921 11526 7444 9331 17053 19953 8124 26 10748
17499 10748 5761 7663 17997 18326 13365 2567 1983 -9053 -21864 2195 17516 13380 3671
17486 3671 3402 -7472 -11908 -16316 -4285 528 2747 11176 -1468 8038 17195 10574 9126 2856
17472 2856 -7247 -15526 -17540 -7968 1533 4248 1567 5646 20635 22288 7352 797 -751 11662
17458 11662 15170 2747 2669 5637 2713 2336 10687 250 -7782 9014 24215 29975 25925 26996
17444 26996 27767 55387 103075 154432 140128 102708 60279 39685 36747 31640 41500 43825 43823 26211
17430 26211 22045 23428 12763 4278 19299 22468 15936 15557 17656 21255 14658 12202 -1791 -1891
17416 -1891 16263 19105 12331 4060 -4635 -1801 -1340 3125 5732 5075 -9136 -3949 6701 4329
17402 4329 7278 14926 22977 20844 18654 12616 -4074 -14419 -19514 -16852 -8275 -6058 -4349 -2631
17388 -2631 -528 3719 -5038 -7858 -10876 -4166 1901 16208 13188 11898 5828 -121 -6812 -4556
17374 -4556 747 6744 -5649 36 2795 -239 -3477 -1723 9924 1266 3766 -4982 -7164 -2831
17360 -2831 1644 -5399 -8685 -807 8870 10733 15876 16062 12739 6837 13946 22467 8226 -15687
17346 -15687 -19752 -20218 -12170 -14608 -9321 -5803 -8604 -9812 2744 15800 10929 -10764 -23301 -16291
17332 -16291 -11105 -6901 -19918 -11054 -3639 -6169 -7857 -4547 6014 7076 5068 5132 7923 10506
17318 10506 9295 10243 28994 24960 18820 23927 12753 16635 15311 13634 154 2157 6857 13970
17304 13970 14293 18588 6142 3521 7195 15227 11643 10384 6712 4652 33 1807 6562 1693
17290 1693 -16633 -13846 -8818 2172 -643 -6267 -6561 -9919 -17705 -14897 -19479 -15183 -7165 -9878
17276 -9878 -3775 6982 19374 15964 6914 7805 -1978 72 9924 -59 6375 9538 5836 7107
17262 7107 10324 285 -3072 2872 -4184 -3165 -7826 -8968 11247 13785 8123 1863 -11798 -24031
17248 -24031 -22816 -9631 2140 -3381 -3365 2026 -1076 -11318 1034 20799 16514 19680 18431 19344
17234 19344 2562 -14429 -21575 -1860 16274 19896 6570 9049 13258 16002 11083 8252 6238
17221 6238 -4439 568 2204 -6348 -6210 -3696 2225 2738 2345 3706 8834 6564 -8063 -5969 3378
17206 3378 7992 6284 7486 12465 17651 13498 9090 7233 3407 -3056 2325 -650 -9647 -13469 -8945
17191 -8945 -6348 -12671 -13296 -9243 479 3244 5067 11860 967 -3127 325 13382 14457 10997
17177 10997 13051 3935 12738 8512 6311 10763 5849 10161 6771 10807 1816 -5763 6710 16551
17163 16551 16545 6029 -5863 -11138 -13968 -20241 4820 4535 5302 6918 11614 6639 -10743 -11562 770
17148 770 12628 15515 8311 -9656 -21446 -10281 -13570 -3921 -3391 -4662 -10410 -10865 -8837 -822
17134 -822 -2351 4034 10758 2570 -2120 2939 -3239 -4344 -1192 -5214 1764 3396 -4505 -5477 1363
17119 1363 -9454 -17584 -16648 226 9437 24347 16712 1489 -8927 -448 7008 13661 15880 30928
17105 30928 31501 20237 6743 4075 10662 8279 9562 13156 -1934 -12605 -6010 -19800 -18815 -9768
17091 -9768 -2961 10039 5790 10588 16153 11539 10167 16553 10407 4603 -6770 -15 10208 8008
17077 8008 13982 16079 4930 -896 -3423 -3171 5417 4219 -8645 -10059 1293 -1184 -13955 -13636
17063 -13636 -4135 -7832 -639 7433 11454 7470 9751 14556 7815 9336 22166 19179 8716 4390
17049 4390 10745 14563 11292 13925 12000 8662 8963 1975 2770 1180 -939 5688 2341 -5019 720
17034 720 2337 10409 21213 13966 15080 6886 -7549 -7486 -8621 6336 12383 15870 4150 -2228
17020 -2228 1593 16720 20307 16642 13245 10200 6452 2522 -6363 -10048 -10323 -15176 -18278 -11960 -9641
17005 -9641 -1465 -809 -5966 -56 903 -8560 -14421 -10988 -10728 5433 9458 -97 -8569 -8907 -16516
16990 -16516 -20874 -20746 -16184 -7554 4471 360 -445 -1670 -7364 7405 22046 20191 18345 14678
16976 14678 3641 -4258 7469 8907 12027 12280 -45 6370 6532 1752 -9279 -22791 -29104 -27980
16962 -27980 -15844 -10761 5663 8536 6205 4678 -2097 -14500 -21104 -21556 -8172 49 312 -1542
16948 -1542 -12876 -8378 1595 -253 -6663 -13589 -896 14041 12832 12965 12928 11016 910 -2439
16934 -2439 -766 11394 30995 27805 3933 3446 2625 -878 -19067 -13865 -11094 -9191 -3534 1579
16920 1579 3237 -6579 -15838 -6659 5862 9552 19763 12102 -16 -10535 -21177 -20957 -14683 -2179
16906 -2179 -6056 -2193 7902 5758 -1465 -6340 2384 -4099 -11197 -13633 -19705 -15103 -6665 694
16892 694 8779 14857 13368 4167 5827 4396 3100 -4006 -9508 -6226 1265 -1695 9951 14522 10146
16877 10146 8062 4633 2263 -11126 -5831 4983 -3156 -3732 9523 4375 1221 -10758 -17323 -16773
16863 -16773 -16027 -23500 -21469 -18911 -19406 -12846 -3382 -3896 -13170 -7758 5800 -874 5213 8674 7058
16848 7058 14397 18570 17744 10496 3135 -8758 -19139 -6526 -2975 -4002 2959 4070 2396 3682
16834 3682 -718 187 -9574 -5332 11777 10079 8655 519 -2081 -4084 -17740 -23215 -24659 -25671
16820 -25671 -19153 -12788 -12108 -2039 5553 1103 -2452 414 3706 6010 13791 21684 14795 8925
16806 8925 2278 -4053 -5086 6027 14701 9613 10151 7965 -4610 -8708 -14737 -26913 -29455 -25700
16792 -25700 -24476 -16444 -16697 -6838 -6886 -11944 -5719 3408 783 -14546 -9586 -6988 -3366 -17118 -13597
16777 -13597 -3618 -1294 -7659 -19066 -20246 -9492 -485 4033 1227 -1385 -10223 -5247 -7952 -22300
16763 -22300 -14487 -7590 -9688 -6089 3620 1295 3740 9114 9210 14297 3864 7370 1316 -12311
16749 -12311 -12746 -8398 1213 -3229 -18112 -21831 -17240 -19001 -6289 3046 3835 -839 -4095 -4914 -6904
16734 -6904 -13973 -17509 -10196 2507 809 3208 -355 -4275 -400 8701 5617 -9862 -5760 -3535
16720 -3535 -8099 2552 945 -5147 -7964 -16682 -12391 -8495 -1288 5053 9214 299 -2922 -1961 -1206
16705 -1206 4527 1434 9554 10963 11364 14986 11190 5156 -4088 -5948 -10150 -16356 -1157 5396 -13059
16690 -13059 -22326 -10169 -9797 -11799 -18101 -11383 -2009 1912 3738 3474 9218 5470 4258 -3827 -1837
16675 -1837 8031 6646 5477 3434 6797 11821 9965 3921 -9737 -18854 -6015 -852 -3497 -9570
16661 -9570 -6790 8376 3408 -8864 -18099 -18343 3022 13207 2893 3400 6617 8438 1640 -7488
16647 -7488 -11220 -11706 -9244 -4468 -7821 1721 13931 9125 858 -1676 -9280 -19989 -20169 -7749
16633 -7749 -1934 10079 14159 13300 9188 -6571 -21664 -27117 -27127 -16103 -10411 -2997 -2487 -3159 -18553
16618 -18553 -23941 -26011 -12675 -7126 -617 -2052 -9252 -16584 -9295 -12271 -12363 -16116 -10244 -6031 793
16603 793 1369 14938 18868 15426 9054 2405 8502 12987 13946 14878 19266 9188 7067 -2888 5394
16588 5394 -5877 -9220 -2576 -320 -19255 -14685 -6710 -2762 -12570 -13080 -7033 2927 -2094 -16745
16574 -16745 -21482 -14471 -9912 -9259 -12595 -4347 2007 -13990 -19467 -13741 -16341 -17324 -14052 -8808 -5068
16559 -5068 2377 5326 169 -8861 -13557 -19679 -10089 -5270 -6498 3824 1826 -6082 -5466 1822 -457
16544 -457 1363 -3219 -5298 -4861 -13442 -10460 -6210 -14023 -7067 -4150 4174 8830 8456 -3019 -108
16529 -108 -8865 -23311 -19607 -18215 -16465 643 2378 4280 77 676 -3856 -3549 -5991 -17014 -14310
16514 -14310 1673 838 3020 9432 5075 1772 -6447 -8883 -6024 -10225 -2223 -7451 -10488 -5785
16500 -5785 -11595 -5174 -12380 -15839 1639 1642 563 -1294 220 -7318 -14603 -15768 -11954 -10974 -7897
16485 -7897 -4450 -8397 1141 295 1523 -5985 -10956 -9028 -6146 7509 19583 2473 -7327 3601
16471 3601 -225 -21299 -42155 -43358 -30044 -17185 -7180 -5973 -2264 -1386 -7596 -20090 -19535 -1165
16457 -1165 2620 12252 10501 13753 17804 8965 14695 14196 8527 2564 -1468 -8633 -17213 -7898 8563
16442 8563 12746 4742 -7789 -14042 -8119 -5278 -14230 -8832 -11655 -18195 -13473 -6369 -10441 -21645
16428 -21645 -19384 -12729 -149 6183 -2921 144 10651 7099 7935 5611 2834 -1155 1744 7355
16414 7355 7166 5455 -4761 -12132 -15963 -23519 -25252 -14699 -4654 7384 15448 16211 13366 9829
16400 9829 672 -6168 1431 10110 18870 19549 9069 370 -3971 1974 9896 26549 29425 10078
16386 10078 10075 9838 17158 14406 10646 10373 5417 1936 -10130 -7181 -11344 -5083 -2996 -2919 6247 15455
16370 15455 5298 -3914 -5065 -2672 -5734 -617 543 2455 6806 10089 9316 1956 -6461 -4409
16356 -4409 -1244 5237 -1077 -5289 1614 3674 4340 6945 13916 9420 3194 -4869 -7485 -7668 -826
16341 -826 -9997 -9049 -7773 -11942 -6500 -2602 -1798 -10653 -15861 -2740 -9621 -1205 18843 19224 18538
16326 18538 13677 -4368 1388 6384 4721 9715 10866 2107 5176 8729 -9746 -32060 -28853 -10639
16312 -10639 -41 -11340 -13230 -15164 -15053 -2939 6667 11920 -1240 -1372 -793 -3844 -8396 -488
16298 -488 5349 4092 -7156 -23909 -26284 -12702 -15004 -15567 -3748 -6032 -8432 -16138 -23617 -26086
16284 -26086 -19352 -3756 -12625 -11653 -14395 -20928 -14623 -9308 -2645 7068 3187 -5147 1117 2911
16270 2911 190 -10288 -24918 -32417 -32790 -28888 -20590 -9110 -891 7714 -124 -10667 -21002 -25797
16256 -25797 -17362 -9729 2543 6054 4932 -2567 -20198 -10471 -5453 -5233 6602 12068 2787 -1086
16242 -1086 -15958 -14188 -2647 627 -1540 -5930 -7220 -7592 -18871 -21705 -28877 -28107 -6105 4384
16228 4384 2804 16550 16935 14528 13404 6272 -14892 -19628 -14601 -10473 -14498 -12520 -6462 -1820
16214 -1820 5584 8966 10090 6414 -7509 -8472 -11231 -18026 -13668 2063 -10067 -2697 7553 3959
16200 3959 4774 -11663 -27307 -30108 -22803 -16035 -8624 -5384 -663 -3841 -8406 -14899 -22399 -10944
16186 -10944 8721 8313 2163 2619 4403 -4408 -14646 -6979 1443 -5331 -9127 -1275 -5584 -5717 936
16171 936 -9249 -19228 -20572 -4141 -1925 -13762 -13051 -4001 6823 -494 -4706 -15954 -15762 -11354
16157 -11354 -14683 -15967 -8764 -4939 -5630 -10195 -14940 -8433 -605 4320 4485 5825 7657 317 -7632
16142 -7632 1590 6762 4580 310 -3509 -8326 -5811 -13300 -13265 823 8245 6019 192 -5026 2637
16127 2637 2973 -6571 -3655 -5924 -13019 -15652 -13220 -1718 -4431 -902 -424 -11764 -19017 -13242 -8963
16112 -8963 -8719 2805 7153 -1508 2591 2843 -6800 -16530 -14831 -6556 3365 6527 -8785 -21670
16098 -21670 -11895 -9883 -25809 -36591 -28994 -7280 7527 -1916 -9846 -16950 -20893 -20432 -12320 -7161
16084 -7161 -9069 -14248 -5320 -934 -3727 -4845 1039 -10428 -17898 -4429 11176 17023 13567 9302
16070 9302 11620 16857 19622 21061 13249 989 -7314 -10886 -17875 -26522 -22961 -12959 -175 3297
16056 3297 -5301 -9616 -3566 -7284 4341 7950 5999 1111 -7123 3601 4892 -979 5365 4342
16042 4342 3850 -1077 -6297 3152 5197 6426 2186 -627 1328 9807 16546 8016 6166 8935 15136
16027 15136 16536 13166 15902 16311 4811 -7072 -17442 -16078 2 -6144 -20245 -16551 -12879
16014 -12879 -16783 -16660 -7713 -5097 -16383 -7575 -3365 -4519 3823 3105 -8310 -10061 3877 8985
16000 8985 11812 19817 20992 -2140 -8794 -14821 -253 1606 -10698 -19755 -29004 -31138 -31470 -19012
15986 -19012 -8957 -4899 673 -952 5833 15002 14732 8948 -1119 3088 4400 -5950 -2559 298
15972 298 -2528 -2168 8721 17322 21605 19644 9848 11972 10388 -3694 -3366 5025 -2591 -17570 -20274
15957 -20274 -6714 -4722 -16458 -17936 -8062 3008 13913 13033 2777 3440 18351 12675 -1101
15944 -1101 -5204 6953 18245 22678 19632 11407 968 -2203 -9496 -8011 -9078 -2763 5872 5367
15930 5367 -7014 -14159 -4618 1244 1166 3420 4177 5364 1792 3621 12442 19938 13827 8210 -1283
15915 -1283 -11565 -14375 -7362 404 447 7073 1542 -9983 -8904 1850 -4517 -6186 -9295 -11127
15901 -11127 -11363 -4087 7249 17699 18370 11856 4931 2748 -5968 1 -23 2367 8000 11906 16099
15886 16099 18048 15282 11752 7301 -6878 -14251 -21661 -21937 -8722 -7586 -7549 -10866 -10515 -22025 -24477
15871 -24477 -12545 -10830 -17467 -19778 -4602 4549 1157 15772 13667 19866 24073 7694 430
15858 430 -7592 2855 9668 6764 -3208 3423 10059 -2022 -10527 -19763 -18328 -7799 -115 -8773
15844 -8773 -9376 -12505 -11201 -19002 -21648 -19214 -6938 2250 7308 10241 -1366 1899 4708 -4300
15830 -4300 -6612 -13426 -6118 -24 -8306 -19979 -25674 -23558 -20713 -8189 -3718 1448 -10275 -25032
15816 -25032 -19188 -5306 -2915 -6267 -7522 3855 5580 -659 533 -5961 7200 -3099 -17886
15803 -17886 -21700 -18977 -10163 1683 7675 -2134 -8705 -19328 -17228 -10289 -8726 -10341 -10194 -3865
15789 -3865 -3366 -562 12444 9541 15559 11932 127 -5742 -8133 -17173 -18739 -12133 4370 8530
15775 8530 24046 23918 20909 21801 22956 21853 12486 -4411 -5810 -8366 -10944 -6900 -3358 -1703 6207
15760 6207 15650 21304 10959 7945 2767 -773 -12396 -24475 -25498 -27304 -21919 -6871 -5629 3754
15746 3754 5482 3321 -7876 -17876 -594 -485 -11442 -7148 1422 6693 3936 -6803 -13438 -10724
15732 -10724 -13081 -16805 -7100 -4721 2692 17528 24684 29641 29402 22986 17849 7124 1862 -427
15718 -427 -5647 -279 15328 22419 18487 8294 -3274 -7945 2124 10344 13277 20159 16545 -1574
15704 -1574 -19060 -18555 -14392 -14826 -14525 -15081 -18808 -20518 -19176 -19630 -22246 -18880 -7436 1147 -9804
15689 -9804 -7096 -5875 -823 -6492 -8514 3482 8653 12234 1235 -203 -246 2855 1723 -7298 -431
15674 -431 -7579 4481 10608 3348 2477 4379 4015 4802 10486 12129 -7102 -21398 -9352 -12157 -4017
15659 -4017 6803 1032 6924 -461 -8119 -10823 -2152 -1441 -4143 -6585 -1012 16410 15810 6061 922
15644 922 -1525 -1601 -9623 -16572 -19746 -4127 5977 10301 6394 7870 -153 317 -6483 -4650 -4187
15629 -4187 -14923 -8940 470 3926 7184 1461 -7038 -9125 -16291 -8260 6802 9113 -7873 -23911
15615 -23911 -18119 -9486 -6002 -4116 6054 6277 3776 4716 4515 -3906 3178 11109 14446 23682 21103
15600 21103 1768 -14613 -11788 -6018 -4150 -1241 -11175 -17492 -12751 -29086 -24784 -24333 -15850 -2556
15586 -2556 13279 7632 -354 -1802 9847 8369 2255 -6050 -9395 -15604 -20692 -27121 -31233 -22519
15572 -22519 -14964 -5995 -9723 -1329 15848 27502 27816 22075 8707 -1332 -6696 -3140 -6588 -7473
15558 -7473 -3637 -17189 -19221 -18282 -9975 -8889 -631 -8960 -12338 -11746 -8189 -8130 -8964 -15012 -17554 -8797
15542 -8797 5871 11399 15225 5918 5283 3786 -4536 -12323 852 3019 -250 -2607 -4272 -1824
15528 -1824 9983 16183 14455 9833 7627 3475 -9381 -14774 -5801 -11003 -23894 -18076 -8841 -8404
15514 -8404 -10966 -17318 -13108 -15117 -5144 12680 7326 -11711 -14896 -10603 -11170 -14837 -24069 -14606
15500 -14606 -4469 -6533 331 8368 6790 10600 14640 11101 415 -9201 -8554 -3436 -5877 -20263
15486 -20263 -26126 -25515 -9933 -4516 -7858 2244 10424 6180 -8403 -1909 4582 15679 13877 171
15472 171 -10971 -16545 -12324 -9212 -17493 -18565 -26681 -17612 -4880 -7348 -1114 4110 4434 3089 13089
15457 13089 684 -11381 -7295 -13671 -19061 -23543 -22680 -22742 -27911 -21203 -23002 -15798 -8304 -6308 -5850
15442 -5850 -224 413 -3988 -2782 -5881 -2250 -12520 -13888 -3377 -4389 -11799 -8897 -9612 2698
15428 2698 8326 -665 2415 4229 -3744 -10219 4133 16636 2424 -730 -5542 9814 16722 10948
15414 10948 492 -9158 -10516 -2428 15 -7488 -4001 152 4123 4852 -542 6509 14847 12401
15400 12401 7658 4434 12428 9864 10252 4241 6714 5103 2208 -8067 -1709 -12181 -19966 -23783
15386 -23783 -24487 -27903 -27322 -27655 -24911 -23096 -22059 -12224 -16253 -15288 -3329 -2452 -3227 1362 3768 215
15370 215 -3073 4672 -4745 -11299 1431 -4751 -10824 -11896 -6628 5768 -2638 -7225 -4794 390
15356 390 -2742 -2976 2650 2347 -6387 -14872 -14324 -6192 -12485 -25580 -24532 -34422 -27417 -15388 -4758
15341 -4758 -4550 -1194 -133 5738 5073 7715 7296 351 8344 14566 389 -12769 -16705 -11055 -7478
15326 -7478 -22303 -16696 -7718 -11837 -7598 -7068 -20480 -19466 -9697 3135 8346 12790 8331 3832
15312 3832 8757 16967 13467 -5473 -31509 -28827 -25725 -6768 -6117 -5456 -708 -6630 -11651 -1504
15298 -1504 -1607 -2649 -12202 -25230 -29407 -19367 -7138 -6946 1177 6662 4953 2324 2188 -4948 -3270
15283 -3270 -5510 -6360 -4618 -2920 -7940 -24626 -23339 -12614 -13267 -20170 -22971 -26630 -34682 -35081 -25983
15268 -25983 -8611 -1167 1993 -3284 -1517 431 -3 -7618 -3327 -1283 -4528 -23456 -20385 -14229
15254 -14229 -9623 -13390 -7532 -12142 -20075 -7467 -410 -4933 -8729 -4725 -456 914 -1403 -3179
15240 -3179 -10223 -9068 -9186 -9049 -13974 -9792 -11565 -5451 -5290 -20284 -27542 -14888 -18137 -24703 -20196
15225 -20196 -12201 176 5961 -3524 -8919 -10187 793 2617 598 -2837 -7455 -8255 -13340 -9581
15211 -9581 -10362 -14443 -9000 -16390 -24148 -12922 -7427 -8651 -1787 -10324 -11884 -4963 -8327 -813 9798
15196 9798 11515 -4962 -15449 -18671 -32524 -31309 -23370 -7880 -4229 -4984 -2922 -3534 -10739 -10510
15182 -10510 -18634 -23793 -28053 -24776 -13957 -10880 -12329 -16919 -16020 -2419 7969 -7153 -9768 -5533
15168 -5533 -7039 -5476 -6690 4126 9202 9294 3159 3635 1709 -3291 -8318 -22364 -25753 -13243 -1778
15153 -1778 477 -8797 -17759 -25634 -21463 -16978 -13362 -2406 -112 -8337 -7561 253 -5443 -22099
15139 -22099 -36593 -34426 -34596 -38417 -35811 -46565 -47168 -34501 -29442 -23557 -16611 -8720 -10310 -16455
15125 -16455 -18351 -23542 -20705 -27724 -37252 -34254 -20671 -10763 -6152 -6068 5530 3842 3139 4050 -1710
15110 -1710 -8277 -14202 -4133 5579 -1262 -2591 -3964 -6978 -3601 2091 2041 2540 3825 -1179 -1377
15095 -1377 -483 10354 10469 9125 14442 9916 -2298 -8081 -9888 -6288 -7505 -2842 -11986 -14499 -11408
15080 -11408 -13496 -12382 -13963 -3619 4947 16670 12982 6722 3640 1320 -9937 -13452 -21718 -26262
15066 -26262 -26143 -30915 -23398 -34126 -36049 -27615 -11719 -15504 -23833 -17564 -4314 1795 13375 15466
15052 15466 8322 3710 3662 13773 21275 22091 14597 13544 5072 4314 1812 -3511 -5654 -7796 -1801
15037 -1801 280 -8079 -10936 -6422 -6022 8561 5788 3020 -440 -9152 -12211 -8849 -3471 -13334 -6158
15022 -6158 2994 4903 1554 -4000 -10258 -97 2890 4245 -5247 -3540 -6895 -9766 6975 12827
15008 12827 -10610 -17830 -6440 9644 15405 9527 9313 -4315 -8102 -238 76 -1079 -12637 -24498
14994 -24498 -24544 -7622 -5964 -21242 -27138 -19696 -11413 -8347 -3278 2450 -6019 -20138 -15013 -8941
14980 -8941 -11129 -25598 -25973 -20534 -8555 3690 12478 3528 -7162 -4129 -6121 -8784 -2318 3673
14966 3673 104 -3733 5109 1677 2667 -8915 -7409 -6863 -8699 -11590 -17854 -26103 -15287 -13269 -14508
14951 -14508 -15445 -17486 -3186 -5526 -18843 -28802 -28575 -22712 -23667 -22115 -9717 -4267 -11599 -11006 -14279
14936 -14279 -15419 -2587 3637 -1487 -12800 -22429 -11867 -4142 7363 6203 754 -10072 -23985
14923 -23985 -18006 -20244 -16449 2530 831 -3919 4030 19422 24171 19187 7368 5772 2103 -2366
14909 -2366 -22329 -28892 -27184 -26392 -10496 -9184 -2702 16097 13157 -2620 -16818 -26335 -14013
14896 -14013 -15005 -14800 -11191 -4071 -2908 -4596 -4894 -4584 -11503 -10517 -4595 -12593 -14236 -13745 -15137 -13853
14880 -13853 -16373 -14461 -11223 -13132 -23427 -23113 -17340 -2316 5819 -2784 -10253 -8951 7752 6199
14866 6199 -9747 -19296 -28666 -33122 -32959 -36027 -33948 -25627 -16967 -27079 -36842 -41852 -42656 -25720
14852 -25720 -15307 -9527 -8641 -1916 5333 -2812 -16310 -15342 -1622 -1940 781 6073 12943 9758
14838 9758 1038 -2324 2306 2632 744 -7461 -22838 -33917 -37167 -26979 -19285 -17584 -4833 -2415
14824 -2415 -921 12 -19541 -22824 -27476 -30826 -19830 -9099 -7157 -12523 -19026 -16304 -19880 -22339
14810 -22339 -17223 -21892 -15477 -15236 -24838 -30610 -35086 -30859 -14597 -9495 -4173 -9446 -17231 -5097
14796 -5097 -6072 -16291 -20613 -24286 -30132 -24975 -19880 -15912 -15696 -19112 -26396 -19233 -21489 -13886 -14579
14781 -14579 -28826 -25781 -23529 -11507 -8839 -6573 -10551 -10458 -14597 -31531 -24433 -17321 -22858 -27118
14767 -27118 -35422 -41427 -27800 -14638 -8856 -15601 -18914 -16648 -16510 -17362 -30862 -30986 -19510 -25743
14753 -25743 -17781 -6797 -9402 -12649 -26201 -32792 -21919 -18240 -18055 -1037 11706 1045 -3348
14740 -3348 -3390 2617 6217 -20 -3161 -1785 1569 -5817 -7260 -6304 -16936 -20356 -12004 -7997 -3504
14725 -3504 -6197 -11290 -6118 -6371 -12853 -12850 -23490 -30243 -24750 -25673 -11367 -1457 -2888 -1902 306 -9377
14709 -9377 -11117 -10236 -11262 -8316 -21615 -17739 -18440 -12630 -20411 -21553 -27411 -17817 -23205 -20171 -6211
14694 -6211 -8858 -5104 -6113 -21253 -14660 -10813 -6230 -14508 -17952 -9865 -7775 -4679 -9661 -13808
14680 -13808 641 1775 4560 9603 -247 -5752 3154 -13335 -13418 -11041 -5715 -9554 -4650 -10282
14666 -10282 -28097 -37312 -32738 -15154 9721 11683 6144 11025 8242 8792 -182 -7387 -14886 -16178
14652 -16178 -7636 -5489 -48 4881 4126 1780 -3624 -10133 -12917 -24873 -26828 -20047 -23105 -16353
14638 -16353 -17444 -28789 -29599 -22994 -9589 4750 -4811 -17902 -17823 -14074 -16361 -1210 17031 13881
14624 13881 -643 3401 6909 18713 3708 -6105 1805 -8333 -15409 -23889 -24523 -24076 -12232 -15994
14610 -15994 -18362 -11642 -11658 -5766 -15258 -12013 -12860 -7878 -1544 3879 2201 -8232 -13979 -16455 -23187
14595 -23187 -21245 -24586 -15496 -691 -1128 -10287 -9779 -8374 -1416 -10664 -18337 -14379 -16656 -24823 -26651
14580 -26651 -24250 -34034 -35621 -28436 -13070 1872 277 -1593 -9337 -15153 -26021 -27973 -15802
14567 -15802 -20329 -19205 -14794 -19768 -31729 -39375 -31895 -23786 -23837 -21581 -20260 -14944 -3172 2260
14553 2260 -3244 -11756 -20049 -25741 -29518 -25152 -25094 -20804 -15339 -15617 -30322 -36737 -22859 -14214 -13592
14538 -13592 -15493 -19365 -11779 -18127 -15840 503 -972 -7162 -18296 -31384 -36424 -31055 -28269 -4423
14524 -4423 10698 4224 -8091 -16556 -13858 -20875 -29556 -16296 -16265 -14325 -15001 -15456 -2048 2549 -8944
14509 -8944 -10133 -21652 -13752 -655 19492 8559 -14317 -18637 -11887 -22227 -19563 -28927 -22719
14496 -22719 -15837 -18724 -22867 -18883 -1905 3553 -1001 -12463 -8809 1480 -4936 -14200 -5775 -15229
14482 -15229 -21169 -11820 -8611 -7118 -319 2169 5106 9458 14108 10313 1253 -7160 -20916 -44191
14468 -44191 -52471 -38937 -25153 -19598 -20306 -28466 -40478 -39230 -28054 -21943 -31915 -21613 -11456
14455 -11456 -22239 -31049 -27287 -15832 -12692 -11415 -12820 -17847 -14774 -15143 -20477 -25166 -23266 -17964
14441 -17964 -26615 -22985 -16222 -8276 -13160 -11617 -5573 -3261 -7740 -6694 -17287 -26339 -17806 -18315
14427 -18315 -31772 -32646 -23584 -26521 -27794 -33749 -33984 -34970 -36755 -31133 -21598 -14440 -11879 -21458 -27392
14412 -27392 -32610 -41035 -31107 -32595 -39712 -35250 -23459 -17771 -24429 -26993 -43042 -44817 -48839 -40985
14398 -40985 -27720 -17498 -27640 -35396 -28012 -13762 -17751 -30756 -36035 -29535 -22145 -21743 -14351
14385 -14351 -18131 -24770 -30918 -31372 -22808 -13082 -22098 -26126 -20664 -9200 -15044 -29713 -28074 -23005
14371 -23005 -907 17223 14839 -2315 -4762 -14796 -15451 -20908 -10432 -8163 -12788 -15468 -10652
14358 -10652 2259 1130 -3437 -14556 -11238 -1525 -8834 -7316 -6166 -7617 -20208 -13050 -3565 5850
14344 5850 12043 70 -10084 953 12414 16249 20479 20482 17683 6970 1350 5328 -1215 -5332
14330 -5332 -5962 -8759 -3878 2482 -1621 -8645 -11304 -23541 -25972 -26047 -23052 -20792 -8900 -8654 -4746
14315 -4746 -5001 -10022 -17468 -24592 -22229 -25841 -13214 -13291 -32983 -45522 -40024 -36238 -38512 -42467 -40989
14300 -40989 -37783 -32708 -30313 -29683 -27344 -30548 -29288 -21712 -29624 -26006 -24901 -11117 -8849 -21115
14286 -21115 -30610 -35922 -42461 -23699 -6225 -8162 -18357 -21326 -23807 -25229 -4777 -3919 -13569 -16959
14272 -16959 -25855 -15881 -7347 -25973 -28182 -20545 -26161 -32097 -31781 -29751 -28550 -27155 -18272 -25112
14258 -25112 -36644 -30404 -24004 -19993 -27740 -11359 5723 -2287 -13257 -14578 -18860 -15761 -19599
14245 -19599 -22046 -5371 9990 14437 14663 977 -7689 -9561 -20932 -27521 -18042 -3945 110
14232 110 3864 -8939 -13656 -11024 -7978 -20122 -28453 -40434 -49326 -53217 -55370 -56396 -52066 -28705
14218 -28705 -12049 -3845 -12088 -11430 -14151 -18133 -15815 -25993 -44681 -40295 -18235 -6992 -4121
14205 -4121 -10590 -17672 -15912 -12695 710 -4683 -17196 -19973 -19101 -20862 -32424 -34816 -36350 -39378
14191 -39378 -35543 -30733 -33337 -38228 -34631 -35659 -31498 -27756 -27992 -22345 -19233 -15926 -22028 -26359 -29031
14176 -29031 -32811 -45377 -47905 -33359 -25792 -42098 -42437 -29964 -32698 -47192 -47945 -35466 -34346
14163 -34346 -46166 -37900 -29447 -38001 -43420 -35921 -28032 -35431 -34157 -33339 -27226 -26778 -37055 -40483
14149 -40483 -39051 -38991 -34459 -27391 -16754 -10931 -1781 -3569 -14794 -24507 -20832 -21423 -29748 -30795 -43465
14134 -43465 -39584 -22466 -9690 -4692 -7907 -14042 -34627 -30354 -21174 -21246 -23551 -22670 -24144 -14409
14120 -14409 -8882 -10152 -19084 -15917 -20031 -36306 -24584 -26749 -28363 -28736 -35505 -40800 -40200 -42491
14106 -42491 -36881 -29050 -24125 -29556 -33755 -34450 -30854 -26504 -13866 -6252 -14010 -25134 -27020 -30063
14092 -30063 -15955 -11338 -10883 -21399 -30768 -41711 -55639 -46425 -16617 -14361 -23237 -30662 -33753
14079 -33753 -34745 -32610 -32369 -18866 -10301 -7804 -11282 -10937 -16631 -16001 -16480 -12682 -14087 -13063 -17525
14064 -17525 -14208 -12889 -19142 -14193 -12263 -21012 -12528 -2634 -9520 -16846 -6993 -9159 -16368 -14420
14050 -14420 -18547 -28465 -26514 -14819 -22614 -30047 -22811 -28775 -34545 -30807 -21905 -23134 -32478 -35732
14036 -35732 -38523 -30781 -34063 -35992 -24500 -15515 -16920 -25177 -37534 -51656 -51572 -44944 -36964 -31649
14022 -31649 -36070 -37066 -27113 -25135 -24344 -27550 -32917 -47444 -48478 -34759 -17977 -8359 -13379 -24191
14008 -24191 -17572 -12905 -12397 -13846 -4915 1001 -12019 -17210 -26633 -30420 -20970 -26257 -35259 -41002
13994 -41002 -32016 -27504 -38237 -31051 -17537 -17281 -34699 -37243 -36861 -20973 -26077 -33449 -20580 -22153
13980 -22153 -20523 -22634 -42741 -49115 -34806 -42144 -37508 -23243 -22368 -23485 -19374 -18210 -14893 -20567
13966 -20567 -23016 -30439 -28618 -16579 -18484 -22950 -25754 -25824 -23746 -24626 -17170 -14098 -19280 -16823 -27790
13951 -27790 -35843 -28290 -14929 -22546 -31640 -37254 -38540 -47429 -53258 -46385 -41926 -37759 -34211 -26694
13937 -26694 -30296 -31121 -22545 -14418 -26320 -26656 -33566 -35283 -29871 -31186 -7742 -19700 -42858 -49237
13923 -49237 -47943 -34544 -37129 -58419 -60575 -54361 -45508 -40837 -33830 -25381 -34944 -33818 -35329 -33478
13909 -33478 -45584 -44543 -32363 -21187 -17593 -17170 -13815 -19723 -18807 -25015 -16871 -26908 -31596 -29750
13895 -29750 -40564 -26786 -22146 -25048 -22815 -24343 -28053 -29703 -18852 -18359 -22501 -27951 -41412 -30596
13881 -30596 -17896 -9892 -13041 -26442 -40561 -47404 -53654 -58064 -43108 -39173 -39679 -27276 -28218 -30110
13867 -30110 -37955 -34346 -32465 -20698 -17355 -16018 -9543 -11834 -14529 -19011 -11124 -6959 -16723 -12531
13853 -12531 -5844 -4357 -2382 -15493 -28133 -32356 -32933 -44223 -49807 -47173 -30129 -20268 -13439 -14764
13839 -14764 -7010 -151 -3557 -18703 -30637 -19866 -5369 -15951 -18053 -15131 -15884 -15927 -20277 -28342
13825 -28342 -30425 -39529 -33620 -35848 -43596 -37359 -27771 -20518 -33282 -48485 -40678 -33461 -28802 -38142
13811 -38142 -32470 -30443 -36031 -38351 -36930 -29263 -33298 -31995 -18747 -29332 -41223 -31466 -24015 -16622
13797 -16622 -21454 -25198 -28274 -39995 -39518 -30072 -34101 -30254 -24824 -29766 -28150 -40403 -33870 -17512
13783 -17512 -15175 -11112 -22416 -43091 -39201 -38345 -34403 -35912 -47870 -40437 -36025 -32954 -30385 -17574
13769 -17574 -10735 -19644 -37730 -33698 -22215 -26569 -23250 -16891 -26483 -27415 -29558 -22263 -19565 -28436
13755 -28436 -26743 -27853 -33540 -31308 -31385 -14683 -17419 -21128 -22885 -23994 -20572 -8804 2792 11979
13741 11979 3464 4448 -624 -5167 -15031 -23862 -23342 -18033 -14812 -12055 -22261 -21732 -15074 -20369 -12998
13726 -12998 -10348 -14631 -25370 -33187 -34974 -29461 -28524 -20960 -19327 -19210 -22699 -32707 -34982 -29756
13712 -29756 -28468 -25444 -20795 -13716 -17439 -19842 -27551 -26897 -20931 -12044 1906 -6562 -17859 -33359
13698 -33359 -42274 -34867 -16645 -8901 -7131 -3241 -11178 -9405 -2490 -15408 -19923 -27268 -46756 -53993
13684 -53993 -45597 -45135 -36082 -39617 -27342 -26767 -23179 -7670 -17577 -22132 -14332 -11505 -23444 -22147
13670 -22147 -14854 -24173 -12902 -14142 -31071 -29808 -24972 -22226 -18227 -29858 -31499 -22341 -20673 -16901
13656 -16901 -4172 2473 6149 22888 26752 26359 27691 39123 46014 40900 35836 27563 19720 23622
13642 23622 37453 46211 47342 53339 54400 62732 65539 75950 100815 106621 109288 109628 110602 118714
13628 118714 125323 122830 129384 140793 152497 154102 157941 153946 158718 169989 161365 144716 157614
13615 157614 172419 179191 184510 204495 227743 252971 289551 347555 432546 531121 586671 570024
13603 570024 480267 399403 336373 293824 281496 275932 260588 249013 234553 236851 236565 225439
13591 225439 215496 205797 220346 225192 212563 200939 202724 183913 171989 174531 182609 187363 190114
13578 190114 185485 202708 206036 179239 167569 180458 186621 200395 206162 219010 233059 247273
13566 247273 277805 335756 421940 567425 802368 1104710 1322604 1306749 1084796 826357
13556 826357 604084 464303 380943 324710 292631 269992 263860 244586 219627 219806 224561 225720
13544 225720 226740 220938 215516 206605 209253 196550 194991 204345 197715 191049 198170 201263 212062 219144
13530 219144 222719 233049 240875 246059 251021 261044 280604 313646 344440 379561 437986 533952
13518 533952 676172 897226 1195620 1435379 1446101 1238828 966650 724873 570392 467331
13508 467331 410049 360528 321350 314334 292057 268249 249184 239151 229022 223281 213107 202908
13496 202908 208664 202554 182373 178535 177924 170648 162321 151111 152145 147366 117013 93103 98239
13483 98239 105191 113421 119067 121666 125932 122678 117871 117217 131654 150656 182716 242390 340009
13470 340009 422553 424827 364094 282109 202100 141911 108449 95617 70156 51963 26382 20282
13458 20282 21560 20815 14208 3761 -815 3447 -1717 -14668 -10572 -7889 -14203 -9219 -6691 -9733
13444 -9733 -7821 -9169 540 8496 -5424 -2135 2317 4906 6151 2782 -4074 -14124 -29780 -45566
13430 -45566 -67787 -70906 -55798 -55661 -51666 -55623 -56031 -40141 -36318 -32718 -35163 -54090 -73108 -76956
13416 -76956 -76055 -64407 -59318 -50152 -45046 -52550 -63083 -50826 -36085 -38613 -48362 -40185 -51626
13403 -51626 -60265 -52313 -34408 -22351 -6694 2584 19291 16289 6606 -8006 -24019 -26398 -35422
13390 -35422 -43340 -52260 -51556 -52702 -59550 -59781 -72577 -64687 -58857 -55616 -54031 -49161 -50534 -49014 -58939
13375 -58939 -75945 -60786 -44268 -34340 -30121 -38219 -45222 -43334 -45469 -49233 -57438 -47730 -34759
13362 -34759 -30092 -14723 -29619 -31666 -33940 -41416 -37507 -13964 13122 54763 84473 77874 65453
13349 65453 51834 32203 7203 -4158 -7030 -14085 -30149 -44970 -47869 -50743 -59035 -49152 -26783
13336 -26783 -46890 -66805 -60627 -54506 -49691 -50257 -61041 -58824 -52409 -49328 -48815 -58139 -72352 -80887
13322 -80887 -88285 -84795 -75167 -67847 -80293 -75823 -60457 -50340 -48315 -46405 -45865 -35720 -22097
13309 -22097 3790 40493 71048 82797 75352 59171 36540 7682 -26751 -40615 -53492 -63060
13297 -63060 -60277 -61859 -55790 -61541 -75476 -83631 -65885 -59947 -64825 -67896 -54745 -48599 -46709 -50306
13283 -50306 -60055 -52872 -47633 -35959 -37651 -29719 -26922 -48173 -53947 -52418 -23360 8780 7247
13270 7247 3188 -12869 -37473 -64480 -79098 -86212 -77762 -52580 -39573 -36211 -44840 -71288 -88126
13257 -88126 -98685 -106881 -107417 -88721 -86142 -91500 -78337 -76465 -86389 -90374 -99423 -100542 -66251 -10090
13243 -10090 23524 45556 35758 6818 -14716 -18517 -25028 -36471 -47372 -44881 -43794 -30324 -14028
13230 -14028 10069 56443 96521 150514 185265 189792 136040 48072 -34062 -87640 -100871 -102560
13218 -102560 -107425 -121312 -129166 -126231 -107615 -105186 -111516 -111038 -102112 -86966 -83215 -70205 -60626
13205 -60626 -66065 -67455 -68680 -77681 -75236 -44311 11268 72886 114090 112462 73274 45979 52543
13192 52543 58006 60596 96383 132554 168212 189417 202970 229960 264647 315634 375851 435229
13180 435229 476104 469866 428022 436151 522657 674616 873511 1061899 1127131 1036186 873858
13169 873858 728580 655898 636918 644550 677826 703481 744538 789986 872269 997752 1167621
13158 1167621 1371962 1640885 2011991 2508475 3167245 4001197 5003369 6219484 7807418
13149 7807418 10177867 14061883 20708983 32010857 49088703 67165899 75289224 68317842
13141 68317842 52466282 36651984 25393913 18498943 14312045 11694519 10023571 8876623
13133 8876623 7969264 7230453 6722306 6579904 6797566 7136657 7127833 6555298 5695633 4910954
13123 4910954 4376440 4086482 3938915 3866205 3857787 3888513 3964285 4097614 4338278 4744787
13113 4744787 5326049 6086859 7094356 8431023 10215415 12549716 15409586 18920163
13105 18920163 23496255 30170927 40902782 59060742 90024091 139138630 198473675
13098 198473675 233832216 220014640 171228562 118366836 79717622 56452090 42672183
13091 42672183 34149062 28683016 24981232 22071084 19500281 17340994 15769444 14845474
13083 14845474 14351417 13742722 12609965 11128430 9722100 8643684 7903742 7400332 7054717
13074 7054717 6813927 6688644 6602407 6569255 6650736 6922541 7398811 8091501 9005333 10247396
13064 10247396 11943921 14162218 16934213 20331220 24743295 31085030 41107132 57978688
13056 57978688 86790512 133360661 193517437 236133542 230320534 184010321 128761647
13049 128761647 86275826 60311438 45070708 35707486 29710027 25695010 22579895
13042 22579895 19767473 17258819 15231607 13705356 12587925 11613182 10568835 9463451
13034 9463451 8413957 7513170 6812227 6269197 5846303 5521871 5286520 5110739 4951779
13025 4951779 4821190 4763150 4808567 4942412 5167197 5510189 5983711 6630671 7474154 8548246
13015 8548246 9954063 11977492 15144341 20444631 29530679 44334082 63803582 78741144
13007 78741144 78785756 64995897 46936692 32197559 22746735 17057708 13542160 11275641
12999 11275641 9766508 8587130 7541478 6614435 5824719 5188002 4684875 4257761 3870686
12990 3870686 3524570 3198883 2922119 2682652 2479967 2315801 2188348 2086150 2008016 1919503
12980 1919503 1827389 1735198 1673444 1613772 1566735 1533641 1518626 1483651 1409064 1322985 1242937
12969 1242937 1190308 1169824 1140471 1106119 1068657 1047779 1039635 1025552 1005428 983438 974176 973826
12957 973826 967035 960812 935545 909385 888819 869230 859404 845638 838450 818805 793312 785294
12945 785294 777693 759639 751876 740977 736333 722437 719039 721264 712699 711672 704748 693930 683328
12932 683328 679799 672993 684601 704537 699352 674782 624190 566807 518638 501936 517112 537818
12920 537818 536102 532702 523149 514815 512554 520545 509534 500636 495616 492510 501831 496172 475741 471223
12906 471223 472594 481756 479333 468709 457872 442950 442357 447093 444855 448791 444302 445221 468144 470742
12892 470742 470049 472984 462905 451162 448553 448223 446027 452293 468147 480777 456206 427353 414594
12879 414594 407331 391321 390191 395187 388427 386812 388898 383350 365387 358549 347319 339491 343847
12866 343847 350938 352088 338668 331317 332954 338454 330278 327881 338339 328576 317675 314966 312549
12853 312549 300985 305620 319448 323590 312556 315706 334009 344568 344288 331688 340374 337340 326533
12840 326533 322516 304704 298892 305620 301892 298758 296038 297359 317835 328380 310122 299337 308205
12827 308205 322275 323046 308683 294066 291655 305142 308536 304607 300897 290497 296411 314070 311825
12814 311825 288904 290416 282172 266455 254072 261824 274090 278886 267640 264052 268144 272588 273943
12801 273943 276460 283572 286027 288392 274290 265508 259521 254353 271262 273178 268464 258148 262567
12788 262567 262908 260601 263855 278986 288717 292967 303125 318535 306536 298061 310466 322800 315715
12775 315715 293869 280156 275767 283473 300766 301822 290302 290345 299226 309122 322265 321887 317713 323491
12761 323491 323119 313597 322586 333315 342042 343474 365123 360260 365369 376371 385340 390133 395876 403138
12747 403138 403823 399312 393515 391147 392586 393183 398928 418460 448543 472935 471857 444161 427912
12734 427912 443527 456282 456784 453470 451085 448406 440081 435964 441878 436595 422686 414556 397354
12721 397354 401565 403855 409311 407875 395146 386234 377045 371041 378526 367398 357419 353984 348507 351819
12707 351819 351554 359822 375883 373102 361884 355432 364640 359497 341235 334223 337056 340527 352147
12694 352147 354564 344400 332488 330174 322594 328273 345607 340039 328302 341406 338934 344765 348321
12681 348321 366445 388005 402410 418972 444628 510533 595839 681346 712160 702403 648186 568923
12669 568923 507247 469943 451829 437294 415225 402153 404014 412625 424715 434970 439115 444519
12657 444519 454078 456756 444110 455746 455548 448197 445339 449658 440458 450862 461002 459512 466646
12644 466646 470905 468561 469304 480392 488524 501881 501183 502945 519822 539821 562130 599099 685677
12631 685677 827013 1052215 1345020 1561611 1555137 1335477 1069777 853443 715379 619302
12621 619302 568153 537092 516853 484344 441407 428239 419457 407000 404250 404586 386575 363244
12609 363244 351059 346683 338396 330291 331157 327734 322993 317926 311240 304282 292057 292474 302198 298801
12595 298801 306707 307327 314583 325936 343783 364743 379819 421795 510924 635014 839645 1130559
12583 1130559 1372974 1415818 1240688 964353 721682 568091 472685 422684 372935 346076
12573 346076 325612 307020 282525 269228 253272 244553 231872 227366 229968 220409 206103 204800
12561 204800 210113 224918 222938 212271 206694 206012 194692 176986 175721 180021 182330 190424 197306
12548 197306 192024 187734 190893 204090 218511 242336 254413 297950 362013 461724 561423 587994
12536 587994 541039 452530 370648 316767 272548 253852 238911 222353 223624 222755 208429 200334
12524 200334 196931 198119 198820 198816 193610 184265 184640 174812 169236 173068 176547 178132 183064 197957 199036
12509 199036 198991 197136 194371 190191 178190 185721 192361 189921 181982 168933 171098 169590 169243 180516
12495 180516 188780 163994 162941 173222 174394 172475 168258 161212 154083 156656 165990 175600 183218 185402
12481 185402 176138 156089 169995 172670 159138 152706 149230 154026 157462 151904 164947 180347 176177
12468 176177 169994 167057 163742 164857 153388 144099 140165 147113 141709 134546 130399 125997 137118 148412
12454 148412 148598 148270 147207 154684 148505 132109 129740 140760 133160 133182 132922 136385 142735 149279 138668
12439 138668 153381 185508 219670 250520 299159 359730 464857 653923 1005764 1573823 2011462
12428 2011462 1913118 1471520 1010451 708889 535142 429944 355325 317507 285581 255966
12418 255966 230878 215394 215578 200925 194822 199249 200710 194536 178160 172962 178428 182984 179975
12405 179975 182266 178477 185175 187116 195066 199886 213753 237430 257309 283751 310018 343072 405134
12392 405134 489893 599858 753407 1006838 1450052 2249246 3640312 5419787 6012051
12383 6012051 4975691 3426091 2165735 1457988 1078704 871853 747199 656639 593078
12374 593078 535105 480238 437278 423799 413203 415987 414698 417789 457917 553982 758880 1142939
12362 1142939 1593952 1799277 1625923 1240826 863906 627419 506031 456930 424282 417599
12352 417599 413793 414758 439029 480992 556304 659434 783915 961922 1301537 1925889 3051702
12341 3051702 4796858 6164203 5697158 4211208 2699707 1743100 1246899 966806 783365
12332 783365 653111 570285 506328 454078 408520 375719 344899 324156 303266 288070 281073
12321 281073 281203 258778 234623 229149 226170 214271 204014 199365 205459 206754 203331 199483 195836
12308 195836 197650 209264 230878 254928 264290 301125 339000 391495 490292 661023 963023
12297 963023 1477024 2042979 2128628 1727348 1189253 792258 564255 440297 366764 336831
12287 336831 309144 274518 239935 234928 235641 221528 193607 183343 177893 174617 174742 176228 166849
12274 166849 153400 151304 157406 159391 149418 159349 157525 153105 148285 161109 156144 152622 141648
12261 141648 129333 124767 133487 127820 126958 127568 132027 136857 134514 118403 122021 125770 135087 135979
12247 135979 129743 138962 142673 133215 128719 127297 120243 115132 112260 110592 108225 107702 117143 117041 114986
12232 114986 120960 136513 137244 125272 119973 126267 134085 129410 121230 122014 119106 118716 124653 128670
12218 128670 127719 127473 124868 123086 130520 145292 146431 141240 131063 121376 118788 127344 134834 142253
12204 142253 141523 138277 139185 151466 148351 137231 136159 135327 118635 108277 121857 126519 148154
12191 148154 150247 137460 117782 116763 137055 144719 134633 132671 135190 139086 134401 140290 131074
12178 131074 124718 125085 131644 130168 131672 127102 127542 122083 126560 126025 121722 113917 121549 118453 125253
12163 125253 123885 108886 108311 111988 112782 107108 111888 127324 134469 129110 135366 134302 134108 131802
12149 131802 129786 141105 135141 129082 130840 134477 134552 127156 121502 124602 133028 140981 136200 115701
12135 115701 115035 123129 114750 104232 107728 107770 113055 110482 115524 123241 129861 138142 140616 132523 133398
12120 133398 123599 130773 133521 129753 118669 122886 122096 107557 107045 114230 118334 131767 131222 119858
12106 119858 129529 138729 127042 123461 122009 127262 123731 114786 109096 103586 107142 100952 92309 94601
12092 94601 86552 90371 104036 106679 112676 104563 102280 106736 103739 109403 114149 96499 89938 97373
12078 97373 96429 102531 115056 113643 113979 113415 106553 93963 95407 113586 107733 104666 97886 76802
12064 76802 66709 82309 91363 94713 103516 100705 102461 104732 108378 106662 104849 99492 99382 95008
12050 95008 102557 90587 76104 82771 88895 87282 90134 104252 118700 118952 108923 93135 98542
12037 98542 110834 114606 109666 106331 93880 97582 103322 99238 106434 101436 93393 91656 107131 109788
12023 109788 99874 106097 117204 113352 107843 106090 110357 113539 110124 118585 120494 117064 125874 126897
12009 126897 120377 119437 122049 120733 107230 99896 98631 93251 95139 100975 104416 98513 88855 93681
11995 93681 77666 61867 87041 95415 95237 96753 92560 99105 103034 100516 94227 78106 80752 88364
11981 88364 88186 93898 93933 91385 94540 106061 119899 123171 124053 134705 162482 182974 178486 151398
11967 151398 118211 101676 99138 107784 102690 99768 101984 103279 104247 104773 93535 96838 101998 86288
11953 86288 88270 103235 103630 111447 101296 94842 92651 93148 85476 67509 80132 97384 107446
11940 107446 108638 119311 126108 129252 147799 157261 167408 166197 159083 143328 133959 148991 166054
11927 166054 184887 201841 206351 227309 237820 246607 247491 258088 273896 273793 252438 248251 245337
11914 245337 240259 228036 229770 222842 218180 228757 232106 253147 256887 278018 291374 309010 329805
11901 329805 358444 377505 393532 406723 411045 421673 435666 427818 424946 409552 377322 352524
11889 352524 335386 301765 277909 257737 239363 224698 217742 219098 226671 242335 250750 254619
11877 254619 252416 258966 266646 250709 232837 231601 239243 241600 245749 232755 220753 209277 197100
11864 197100 187010 164314 153184 149867 147194 144533 149383 145298 151378 163865 173224 175012 176358
11851 176358 180926 192581 221165 247243 255604 266020 272863 275287 268577 282825 295042 305313
11839 305313 301396 296330 291844 285783 272617 254302 247502 252399 257245 270245 281460 293371 306743
11826 306743 330646 351772 377130 399860 419275 448006 478224 490983 495268 476576 458783 449360
11814 449360 451403 445323 422853 396720 367720 334460 305449 282141 259165 261552 277820 276162
11802 276162 281834 285634 285203 299359 304995 313878 324091 329941 324976 314980 306837 288402 273498
11789 273498 263737 255659 246767 228519 212194 201725 188370 183318 173793 163301 174341 176753 178956
11776 178956 191245 194616 196821 213408 217997 223475 227810 231495 237526 240268 237335 233295 225581 223163
11762 223163 213503 207688 199057 195456 201939 201032 218909 222623 216900 225462 219897 212321 210384 209314
11748 209314 213525 206066 180625 182043 179078 168283 152762 139445 148050 149805 152703 153480 149995
11735 149995 135843 128891 113765 114209 127442 134727 141073 141504 147569 158309 157963 149489 142841 144092
11721 144092 141760 144916 158323 170811 166837 164008 165359 167993 166407 177192 191618 186482 190825
11708 190825 199385 211211 213280 214353 231095 251205 253837 257788 262764 248042 241068 241357 228507
11695 228507 212263 216416 215924 207969 222605 242231 252785 259610 268335 262870 244812 229187 214839
11682 214839 203856 200330 202143 193315 169494 161393 166046 184658 178316 171787 170450 165722 160176
11669 160176 156299 172297 183918 178602 180062 169502 178629 177798 167515 168066 169285 172226 171115 153463
11655 153463 145779 142773 152494 159581 164358 163146 179383 188655 193089 211987 206766 212598 214652 211955
11641 211955 207430 204515 203597 215063 221664 196070 189692 191855 192175 194101 202142 199794 208435 209581
11627 209581 230976 244843 247897 243907 227570 222714 244059 270002 275159 268693 279857 279921 275660
11614 275660 281988 300455 310313 301419 293837 293557 288308 296451 302775 304510 313048 314903 318091 329018
11600 329018 334983 342242 363485 383382 410543 414067 408333 406546 402149 392475 391990 402741 413937
11587 413937 422502 437337 448158 464842 476719 489007 507390 546883 574476 625153 691659 746512
11575 746512 784674 825073 861203 881330 903141 912284 914491 901732 909629 909114 884414 864190
11563 864190 846813 859075 866311 881023 915026 972627 1028710 1091281 1168097 1225933 1276147 1319863
11551 1319863 1348034 1354548 1342058 1313200 1295167 1272469 1243806 1204223 1163095 1133033 1109497
11540 1109497 1090643 1086302 1106990 1132358 1141946 1149240 1169102 1195322 1209527 1219250 1227986 1249205
11528 1249205 1266450 1289205 1319545 1336007 1365660 1396446 1436383 1482564 1529702 1598520 1694152
11517 1694152 1778316 1881005 1970716 2047446 2136072 2231039 2332700 2442716 2578031 2758305
11507 2758305 2985753 3278079 3636928 4102896 4670021 5376475 6258611 7423772 8971409
11498 8971409 11005046 13644062 16958921 20797112 24753280 28267392 30867284 32372315
11490 32372315 32951758 32946053 32606303 31949257 30858006 29266354 27292784 25217512 23373784
11481 23373784 21981665 21205045 21116177 21703632 22945638 24886969 27570986 31050474 35378099
11472 35378099 40650574 46699827 52944364 58582246 62872718 65205046 65403262 63766943
11464 63766943 60807651 57081817 52992695 48737566 44382969 39958606 35657466 31736155
11456 31736155 28421657 25915023 24276173 23508073 23587223 24453429 26003573 28028335 30248643
11447 30248643 32347178 34180355 35712531 36797438 37174699 36609943 35087969 32887130
11439 32887130 30450494 28034220 25614395 23044948 20291916 17604615 15278800 13436314
11431 13436314 12039430 10970030 10165708 9584397 9257999 9225215 9483612 10074601 11010234
11422 11010234 12285996 13944109 16077497 18765861 21824647 24992011 28119621 31208139
11414 31208139 34357060 37473918 40193630 42096338 42873852 42601422 41440145 39599930
11406 39599930 37283949 34652955 31951475 29510673 27682653 26711395 26703985 27687177 29699137
11397 29699137 32726385 36607145 41159843 46200910 51594441 57226750 62924360 68437773
11389 68437773 73422442 77447082 79865149 79934752 77371255 72489711 66018034 58894853
11381 58894853 51979519 45780576 40463214 36064203 32637382 30183547 28612197 27862768
11373 27862768 27927020 28812950 30484154 32762801 35279300 37624444 39463309 40731679
11365 40731679 41604043 42277426 42675534 42332057 40708732 37577458 33203892 28295910 23572843
11356 23572843 19469896 16142305 13509298 11477069 9926448 8728435 7767355 6954360
11348 6954360 6268156 5675821 5174758 4756181 4411235 4117713 3865972 3646327 3433373
11339 3433373 3248608 3069148 2903897 2738894 2598246 2452453 2329875 2209143 2086632
11330 2086632 1989275 1904070 1807336 1727651 1655638 1586218 1529259 1453861 1388000 1357440 1322305
11319 1322305 1281620 1254184 1233201 1211394 1196770 1173657 1147829 1132892 1101957 1077110 1063984
11308 1063984 1031052 994271 964806 929536 909833 901801 883755 861822 836247 832477 820398 809938
11296 809938 782874 773530 766807 737429 714733 716359 728498 732309 717575 704090 694631 686428 675576
11283 675576 671187 654738 644869 643451 634851 617422 625307 625807 629746 625956 614728 591965 575256
11270 575256 567995 571915 573220 565301 552973 547479 543559 542763 537453 535970 536891 550224 566821 564005
11256 564005 568837 575867 560979 552406 533426 529292 528399 533597 538602 538226 530690 527325 528316 506590
11242 506590 492301 496548 504162 510804 514159 513931 514680 508045 498321 483902 479039 489055 497486 487906
11228 487906 478820 485544 490642 496141 495690 478492 457749 443228 440208 433385 445771 434578 423118
11215 423118 419636 424751 426527 438240 446386 441638 447160 437518 431019 428972 430957 438930 456333 458201
11201 458201 464283 479941 486916 504249 555475 610446 640406 666800 679770 690089 656580 607290
11189 607290 590954 575952 551446 544259 533646 520791 504479 512004 531212 560527 600628 646814
11177 646814 701362 741736 756147 732946 696910 649288 611657 569868 550221 539560 535772 532405
11165 532405 524924 526089 516735 517951 502716 480781 474455 465166 461875 448584 442406 449017 447296
11152 447296 454224 455402 452859 457463 455148 453665 441066 438199 430325 434336 431311 429110 427369 406572
11138 406572 416895 422337 427574 423259 426381 428221 435460 445027 436869 438475 446645 460491 477908
11125 477908 519435 574355 649677 718697 753070 776777 789175 771475 756863 752338 744322 728811
11113 728811 706476 675386 650632 628352 626976 633303 642905 679798 717486 764361 805325 822530
11101 822530 812094 783128 763748 746951 724981 706108 672920 632523 600745 576809 550051
11090 550051 541329 530408 515019 503863 498003 481583 470130 473693 464200 445048 434779 431305
11078 431305 423503 414823 413900 413477 416722 424895 437994 450255 452513 446910 447715 458380 474074 477015
11064 477015 469588 476119 483692 489261 504782 522663 533496 543187 558479 573717 581317 590227 611667
11051 611667 635249 662593 686371 694588 692637 707695 726176 753611 803115 831006 831007 827393 808793
11038 808793 809373 816512 836158 858025 866360 884560 901892 917606 930843 941890 955865 976319
11026 976319 1005247 1024719 1024088 991222 943807 889283 823783 761093 712843 692360 679350 673095
11014 673095 673657 680346 690069 688298 686417 668616 650368 632283 615602 602266 593003 607908 602437
11001 602437 586730 578157 567617 542793 519453 510654 495493 489859 486930 489451 492554 485421 485446
10988 485446 494851 496514 502776 518482 532125 538641 549807 564405 587238 624864 655794 660074
10976 660074 689049 715719 729489 745348 747237 738684 741921 748518 736131 736742 756754 763419 766726
10963 766726 789622 802415 800753 815658 851747 882976 926137 967252 996551 1018688 1037810 1035111
10951 1035111 1035343 1025467 1001210 999862 991894 971465 939335 900331 874614 849751 824237 793936
10939 793936 758914 737486 730727 727457 721560 711219 705356 692249 687980 688207 692581 690261 682633
10926 682633 677810 675895 659712 631373 617875 587162 557075 533217 512802 500711 493470 499558
10914 499558 507839 510124 522544 531685 526533 513800 510807 503683 496895 485922 480071 480199 469879
10901 469879 448670 448281 448985 453794 461300 470475 489932 516349 535183 546736 577206 606888 607706
10888 607706 588516 573976 559046 558396 562889 561782 565437 567352 560643 543771 542013 547831 536534
10875 536534 546263 558225 571798 585842 580059 583271 595014 595880 610087 634685 663400 679202
10863 679202 665946 659725 643372 617630 591263 555540 554020 550595 547666 557860 564022 569788 585354
10850 585354 601686 615137 623981 633564 653181 665594 652916 642829 655352 674522 686930 705942
10838 705942 715504 733010 757983 779155 793313 816231 845423 859246 861623 867297 875318 894177
10826 894177 923948 965533 996659 1019579 1046432 1091967 1143497 1207918 1276092 1355153 1442504
10815 1442504 1502408 1552787 1597505 1667198 1727840 1789023 1843294 1885801 1934360 1987724 2035248
10804 2035248 2072280 2123951 2205055 2297853 2422066 2615180 2858272 3157253 3548561 4050992
10794 4050992 4684126 5508184 6580732 7906154 9468605 11251125 13308831 15905588
10786 15905588 19476255 24487447 31147106 38928731 46304407 51278466 52482262 50057393
10778 50057393 45318055 39793435 34502468 29980471 26490186 24104694 22825001 22649805
10770 22649805 23606309 25773463 29204900 33908027 39774024 46281196 52043692 55085842
10762 55085842 54062968 49373800 42739463 35985522 30186858 25527274 21790301 18745740
10754 18745740 16253896 14188394 12423736 10886829 9565995 8467262 7576998 6875005
10746 6875005 6324273 5882693 5517897 5231982 5027964 4877846 4794372 4778484 4803229 4861618
10736 4861618 4921964 4956804 4952583 4923062 4911470 4931998 4987730 5086427 5224242 5415362 5670868
10725 5670868 5982768 6399496 6936517 7647253 8575956 9778532 11284394 13072460 15108288
10716 15108288 17418854 20234983 24012426 29366010 36833035 46306330 56285558 64309042
10708 64309042 68953712 70888351 71684782 72201237 72527197 72502157 71721029 69518140 65518224
10699 65518224 60450481 55758270 52722463 51927094 53449104 57210333 62936999 69757043
10691 69757043 75881326 79421135 79801344 77871769 74815181 71494025 68429454 65581246
10683 65581246 61990907 56430855 48881048 40644848 33225579 27383293 23013838 19721501
10675 19721501 17140999 14986084 13150247 11559674 10217731 9124497 8241262 7550466
10667 7550466 7017601 6590135 6218190 5887236 5590390 5310985 5076707 4892744 4754464
10658 4754464 4671530 4623195 4558695 4469246 4394432 4340030 4308409 4308286 4356226 4440403 4552567
10647 4552567 4705108 4914104 5211837 5615978 6164954 6902977 7853458 9038638 10434633
10638 10434633 12030918 13864675 16063151 18762800 22130744 26463145 31941051 38168472
10630 38168472 43903175 47352696 47238530 43774860 38479587 33027809 28367564 24767651
10622 24767651 22260931 20851454 20513368 21183879 22841472 25491123 29110271 33501394
10614 33501394 38295453 42973384 46528114 47673539 45563826 40418084 33658725 26995842
10606 26995842 21525198 17513551 14706501 12701600 11123269 9744001 8471635 7326709
10598 7326709 6355903 5556856 4927569 4436518 4031001 3701863 3434254 3199731 2991812
10589 2991812 2811364 2652917 2499809 2369272 2244067 2131983 2051005 1986771 1933559 1869767
10579 1869767 1789971 1703518 1615174 1524122 1429686 1361392 1309545 1253582 1210995 1175029 1144602
10568 1144602 1116757 1081756 1076113 1057034 1045206 1046740 1056312 1059685 1080670 1118990 1169100 1235101
10556 1235101 1300228 1338944 1335165 1297724 1221633 1126240 1047556 975085 910342 860655 828817
10545 828817 806794 782723 763585 756772 759174 747962 742023 732444 729483 734672 747235 771282 796227
10532 796227 823697 862191 887224 896110 884136 859849 823005 791438 748365 702961 677583 668413
10520 668413 654974 645552 669084 689217 696518 716648 742606 763001 767155 757263 736542 704101
10508 704101 668447 633633 604119 553219 518990 499863 492476 484109 477361 475217 497470 502693
10496 502693 499186 522769 557338 584345 619883 653535 695820 736522 776789 801957 798761 780996
10484 780996 750992 714539 662281 618761 581043 564728 562186 542165 527504 523739 513132 519762
10472 519762 524649 547478 566490 579501 598425 619402 635124 665243 695173 714884 748009 762831
10460 762831 767816 761055 749554 750454 762282 783399 783147 788809 796120 823082 858558 909443 973715
10447 973715 1063655 1170764 1282659 1410078 1560526 1776510 2062349 2451881 3032574 3893313
10437 3893313 5110959 6755716 8692145 10558929 11881703 12267733 11598585 10132732
10429 10132732 8356903 6707296 5379470 4432495 3821319 3454507 3258809 3191976 3224384
10420 3224384 3324587 3486849 3731257 4085776 4634918 5469317 6737333 8650054 11405255
10411 11405255 15023195 19093688 22784613 25065523 25216515 23190615 19679599 15730263
10403 15730263 12187324 9460832 7540141 6248948 5397796 4839087 4456803 4194887 4049207
10394 4049207 3969055 3957673 4041589 4246172 4633078 5282116 6338373 7904069 9948244
10385 9948244 12195270 14123033 15135499 14900154 13505690 11434244 9265419 7445007
10377 7445007 6133727 5305845 4829205 4602946 4546705 4620480 4839704 5208006 5809933 6741330
10367 6741330 8138376 10196334 13159757 17075755 21511052 25479894 27801719 27729387
10359 27729387 25359661 21557165 17483073 13978948 11343748 9489638 8260673 7520598
10351 7520598 7143239 7036881 7114998 7380968 7829678 8492802 9470069 10905384 13060337
10342 13060337 16320743 21239290 28198809 37001604 46328716 53826031 57161888 55268134
10334 55268134 48866428 40066431 31191666 23828388 18439884 14767932 12333526 10707645
10326 10707645 9592894 8847438 8376986 8083075 7956254 8012108 8301952 8924056 9984558
10317 9984558 11643272 14126767 17596838 21889535 26241175 29451494 30460469 28919808
10309 28919808 25377926 20914312 16616293 13108346 10503195 8642396 7360156 6469740
10301 6469740 5867030 5462743 5268116 5237760 5402558 5803554 6541291 7811135 9758033
10292 9758033 12270460 14921969 17012777 17885756 17252424 15329310 12769523 10257559
10284 10257559 8221138 6777753 5805752 5178366 4790664 4581897 4532558 4588613 4739732
10275 4739732 5005660 5432857 6067495 7007371 8426587 10561856 13728078 18083258 23300211
10266 23300211 28435347 32067281 32981666 30899437 26557046 21314772 16407832 12537627
10258 12537627 9808472 7963962 6748640 5926400 5360925 4985090 4735378 4589158 4547216
10249 4547216 4630638 4850427 5264701 5961610 7086010 8763015 11013967 13588998 15924883
10240 15924883 17329691 17313820 15852529 13424125 10713515 8279228 6369216 5009404
10232 5009404 4056129 3399077 2933561 2586198 2314157 2104836 1931645 1772369 1620995
10223 1620995 1496695 1377671 1271015 1187754 1129389 1074297 1040062 1007536 998048 989766 994252
10212 994252 1003535 1015826 1007138 961698 914412 864095 805253 759890 733300 706567 678137 651523
10200 651523 654026 661314 678979 703525 730478 760766 799202 828838 827400 815829 787371 742136
10188 742136 704884 673572 636167 609178 593255 580097 564627 554538 534939 512707 487488
10177 487488 457048 448687 454206 457821 461760 477477 494837 506577 516253 510430 500776 500252 481502
10164 481502 477647 465734 444494 431567 438256 438866 431149 422516 411704 398785 402966 409311 406687
10151 406687 400951 409097 404683 400039 390283 377760 375761 377543 390954 405398 407009 412474 415218
10138 415218 412280 415291 406261 392910 394888 413329 403795 390392 403817 410138 414604 422338 430649
10125 430649 445999 451474 441005 427478 412905 402290 397428 405971 409878 418249 439983 478155
10113 478155 540089 585591 573119 517865 461244 419767 400423 398277 391215 385804 381009 403163
10101 403163 411085 417992 428555 423924 421636 413943 398773 383976 368141 357381 359858 344390 331243
10088 331243 337460 337846 344225 328584 330122 325740 330811 329918 333799 335594 340420 345900 358098 351774
10074 351774 341370 338886 340126 345826 350413 346845 348772 347606 342297 331517 320222 321873 312465
10061 312465 309028 317943 327698 342034 336513 357014 376297 383273 375226 368100 354634 338189 319898
10048 319898 313207 306224 308008 321768 329653 323387 325446 319287 311949 304033 308984 317240 321338 313108
10034 313108 307439 315596 330175 339530 347286 355995 374722 383531 389900 386505 376640 364241 347198
10021 347198 342026 335787 335307 326706 313577 304795 308178 318977 329995 333000 314608 317356 324559
10008 324559 341522 353108 363330 378528 399780 423336 436323 422927 405300 389327 361278
9997 361278 356554 365228 364846 361410 364098 365481 369482 374190 377031 377638 386483 401565 419563 437228
9983 437228 459737 491679 538258 599291 668615 793325 1037011 1515307 2089209 2027148 1604263
9972 1604263 1145659 861128 734793 663050 627236 607592 596982 588270 570920 568138 571925
9961 571925 568837 569103 578191 608977 633774 651528 652707 651471 629768 597492 580820 579334 581426
9948 581426 571662 559150 554524 548899 538716 530208 515448 503645 498359 515467 527066 523607 550908
9935 550908 586087 618083 654190 693420 713202 699426 656765 606100 554804 512414 474135 454545
9923 454545 433456 418435 398959 381222 371679 363883 373430 385683 391421 402579 400947 415437 432755
9910 432755 454527 495789 520777 523720 520741 511497 499417 488150 473304 449497 443751 449923 451312
9897 451312 464772 483009 494192 495111 496862 495540 503538 521423 537079 549731 566582 585773 610592
9884 610592 626734 634276 627076 608845 598322 605621 602511 606855 615739 621402 624633 628822 630501 618294
9870 618294 608845 609938 607053 608584 611078 613254 625829 646066 666820 704853 723255 718445 715069
9857 715069 703125 685866 655886 620337 618006 625324 625724 622637 610553 589542 572098 547523 534670
9844 534670 516052 490140 485936 483197 482476 479707 479954 491721 487209 483404 489243 488949 490148 481146
9830 481146 449724 448651 443153 431103 421866 412734 398445 393446 392206 388512 385794 384020 385452 374229
9816 374229 377350 379930 384876 390272 391066 377966 377848 384050 393324 403184 394847 380527 369370 358340
9802 358340 367320 375259 370033 362587 359566 360671 366697 374298 385005 386737 390807 393313 385010 382986
9788 382986 389323 376219 382868 398489 407081 413905 431766 434621 418438 400058 390823 388748 386401
9775 386401 375147 385095 386505 383076 395225 407116 393804 380806 386080 401697 424416 435980
9763 435980 438582 440355 439052 432998 433875 454790 465043 455584 458477 456172 461212 477530 484617 478369
9749 478369 473053 467415 464189 476535 482829 481679 485673 479756 479918 503118 525604 519940 518870 526816
9735 526816 545461 559936 562401 567424 571054 575532 583778 589170 602924 610451 615692 623786 615226 606355
9721 606355 605799 626049 623549 618444 616124 610691 616773 629802 641944 659518 669937 678463 673868
9708 673868 680689 703057 711430 715336 726514 729842 731685 747632 750783 752949 760112 770338 779973
9695 779973 791609 808545 830834 831717 831159 839412 857129 884241 901563 928259 958037 973127 989909
9682 989909 1009547 1028100 1053672 1064733 1077233 1095740 1093574 1096577 1109336 1126031 1151236 1168116
9670 1168116 1178068 1193049 1214189 1233869 1244568 1248290 1245426 1251531 1256480 1245052 1248658 1260343 1268807
9657 1268807 1285582 1286988 1288787 1302623 1299803 1281763 1264072 1267505 1270834 1286017 1301411 1298408 1300123
9644 1300123 1311430 1312939 1318592 1301322 1294688 1294480 1286509 1284818 1279955 1276876 1269190 1267768 1271778 1276484
9630 1276484 1273045 1266929 1271027 1272826 1279595 1289726 1294842 1309779 1321801 1335824 1362433 1396878 1426598
9617 1426598 1461073 1497879 1530965 1557267 1582104 1613305 1644638 1684342 1746868 1793007 1848489
9606 1848489 1907840 1980915 2070089 2167089 2252622 2351473 2467603 2600691 2753785 2886132 3001313
9595 3001313 3166058 3373193 3634177 3966554 4387255 4927201 5578425 6390165 7413537
9586 7413537 8676989 10055292 11357376 12491993 13456907 14130192 14406183 14396131 14459468
9577 14459468 14843315 15558322 16548465 17684073 18539490 18809337 18677701 18501046 18598599
9568 18598599 19291151 20803279 23004259 25576556 28320492 30889535 32920635 34470944
9560 34470944 35737106 36613072 37076344 37505712 38022104 38309439 38199904 37944297 37543047
9551 37543047 36774818 35763491 34767364 33907825 33372632 33211857 33164880 33148662 33463461 34184723
9541 34184723 35058280 36096243 37342977 38376448 38721332 38617483 38507335 38155778 37330059
9532 37330059 36382638 35531570 34505507 33205654 31734544 29955905 27688152 25170944
9524 25170944 22891691 21318219 20594122 20401823 20223378 19888470 19446614 18794951 17891725
9515 17891725 17004627 16375394 15933492 15596880 15539043 15886086 16385252 16736960 16965377 17298977
9505 17298977 17834504 18649748 19686549 20604190 21238280 21699284 21874742 21619549 21272872
9496 21272872 21310573 21740596 22381028 23405283 24949653 26606061 27831785 28618285 29066350
9487 29066350 29079922 28987853 29527230 31088797 33649474 36988824 40489756 43624635 46445936
9478 46445936 48921851 50759718 52133603 53668560 55276051 56258620 56687090 56969221 56801408
9469 56801408 55639756 53811287 52002571 50404440 49083115 48304864 48010017 47917828 47998154
9460 47998154 48315263 48842915 49681747 50834689 51744839 52158070 52448042 52803440 52980819
9451 52980819 52769543 52402396 51906989 50939668 49499405 47686664 45207907 41827879 37967631
9442 37967631 34257371 31059844 28573397 26866351 25827626 25308233 25009411 24486653 23468082
9433 23468082 22138343 20791160 19636979 18905558 18754379 18913209 18882687 18280446 17123526
9424 17123526 15617414 13939145 12185657 10490560 8951990 7641787 6584471 5740964
9416 5740964 5043029 4446017 3951018 3526568 3166813 2885514 2654889 2480057 2325091 2181041
9406 2181041 2044527 1923447 1821712 1734330 1641930 1576104 1503954 1446986 1409354 1377239 1329631
9395 1329631 1269488 1226816 1190018 1147196 1115167 1089008 1066306 1050459 1030273 1010242 983675
9384 983675 982153 986362 989332 991485 999273 1014144 1027057 1029012 1026210 1032738 1042838 1061868 1069185
9371 1069185 1070664 1060325 1045029 1032197 1008035 984223 971167 964622 962964 964437 969079 986087
9359 986087 986093 984499 990187 996523 982632 983190 998561 1013948 1007764 1017085 1023782 1001441 999153 1015788
9345 1015788 1025881 1022650 1008950 992699 969730 948094 932553 928352 926681 932817 950432 966355
9333 966355 972685 971634 973103 978746 975986 970238 968031 970955 973458 987165 976688 973882 967973 959483
9319 959483 961796 951480 943966 942631 938867 948830 953926 957427 973178 1000971 1029803 1058287 1082753
9306 1082753 1090113 1095028 1102507 1112140 1126190 1131540 1133741 1155613 1175196 1191579 1212237 1224178 1235034
9293 1235034 1247470 1242838 1239703 1242978 1243403 1245889 1250576 1252841 1262787 1274510 1287319 1309040 1341590
9280 1341590 1381520 1415717 1426833 1422032 1432702 1464913 1498926 1517464 1531031 1548825 1564266 1560674
9268 1560674 1543521 1538262 1529853 1536085 1530232 1522028 1527883 1535943 1536871 1540354 1555082 1570567 1588595
9255 1588595 1619438 1662534 1695266 1712918 1728391 1735133 1746566 1762757 1753070 1753688 1751123 1750368 1767953
9242 1767953 1797270 1810991 1815830 1828859 1841899 1840957 1861543 1880071 1886045 1892048 1923888 1943849
9230 1943849 1972870 2021135 2069597 2124681 2170326 2218318 2279971 2347170 2422699 2496450 2568748
9219 2568748 2658400 2780930 2922791 3088605 3241939 3403317 3571039 3740675 3923824 4127714
9209 4127714 4378401 4657892 4965296 5323290 5747845 6280221 6978919 7937887 9290364
9200 9290364 11145365 13570286 16506964 19957910 24127710 28904099 33028266 34810122
9192 34810122 33934764 31369401 28069509 24698778 21658241 19071836 16840107 14886166
9184 14886166 13250425 11979745 11084462 10521680 10238951 10207354 10424127 10943742 11870727
9175 11870727 13363164 15570446 18404859 21582725 24851012 28247597 31520639 33417523
9167 33417523 32891254 30377344 27128644 24081741 21608435 19796842 18341258 16683450
9159 16683450 14658407 12608800 10900328 9651361 8809885 8231092 7825272 7539582 7323501
9150 7323501 7175364 7120923 7131669 7181550 7229008 7237554 7225439 7231078 7272336 7327461 7419458 7570243
9138 7570243 7783303 8093263 8493139 8992207 9654300 10503807 11586270 12999251 14897985
9129 14897985 17499458 21075665 25765748 31332261 37437115 44177726 51455607 57825399
9121 57825399 60970320 59992555 56083920 51097938 46505870 42962874 40470724 38698925
9113 38698925 37467715 36919567 37221778 38241179 39187732 38860105 37012186 34590397 32575134
9104 32575134 31498038 31654567 33351863 36719083 41509018 47252648 53564530 59801721
9096 59801721 64371187 65395813 62724585 58007101 53016663 48797486 45491933 42711794
9088 42711794 40090239 37820682 36351865 35899418 36246250 36495027 35609345 33582463 31197183
9079 31197183 29054025 27192498 25495657 24064084 23049068 22460259 22236299 22300259 22603890
9070 22603890 23112335 23809115 24673894 25721517 26966699 28434936 30119578 32009396 34158991
9061 34158991 36568255 39272375 42318911 45764977 49710151 54262174 59463110 65169063
9053 65169063 71142854 77388774 83849774 89897872 94404059 96820746 97752195 98139174
9045 98139174 98630733 99264109 99544485 99117004 98325441 97834702 97982259 98533931 98354797
9036 98354797 95848787 90579075 83611159 76377533 69702563 63856842 59087346 55686209
9028 55686209 53771442 53177014 53684936 55039134 56376814 56299498 54321342 51233777 48125591
9019 48125591 45750323 44273350 43461955 43137149 43522759 44850618 46996273 49513172 51102438
9010 51102438 50066973 46130476 40660364 35110294 30079530 25675421 21957681 18972468
9002 18972468 16661777 14879723 13477640 12346834 11420925 10668566 10039727 9486121 8985370
8993 8985370 8528475 8125932 7763360 7428717 7151285 6911785 6699048 6527379 6363628 6192841
8983 6192841 6030773 5902418 5818624 5801078 5845697 5943597 6110935 6390091 6860764 7571815
8973 7571815 8601517 9839658 11013213 11996987 12954641 14095504 15549493 17388727 19380569
8964 19380569 20714229 20666111 19328748 17229265 14849503 12470634 10359781 8689488
8956 8689488 7493858 6683893 6162144 5872225 5741431 5759625 5908300 6242310 6778899 7554917
8946 7554917 8564839 9735319 11076938 12647491 14439768 16274843 17998055 19229283
8938 19229283 19117642 17375146 14776437 12237283 10094239 8320801 6854278 5709643
8930 5709643 4858609 4237551 3781891 3449271 3200741 3030659 2906144 2835907 2812707 2862977
8920 2862977 3053750 3494547 4181398 4558241 4229545 3519148 2818434 2339569 2038613 1832228
8910 1832228 1680999 1578830 1514382 1463812 1410545 1363958 1326354 1286302 1267391 1248882 1225165
8899 1225165 1186118 1154585 1142177 1121084 1092773 1071789 1061275 1052063 1044693 1039866 1050606 1061797
8887 1061797 1052745 1044001 1022415 987322 950888 919598 909147 908867 907207 933743 980778 1061292
8875 1061292 1203640 1429165 1757807 2015732 1969959 1704973 1396925 1173129 1039145 969312
8865 969312 928478 914771 913729 892416 858891 825923 788874 768779 749537 727776 709135 680881
8853 680881 664034 661229 632131 614233 620279 615551 601094 599692 602004 602015 605627 604990 607865 612952
8839 612952 616678 619179 613763 611146 602577 580448 569337 571437 576872 589793 584892 590680 613988
8826 613988 629972 627047 631293 642683 661559 677992 708623 749241 793234 827147 813882 762300
8814 762300 711902 674248 640400 612514 602541 587211 558990 537716 529589 531551 539314 551623
8802 551623 554456 553717 549008 543164 534331 522126 511670 512278 515205 524741 540601 550294 550590 558225
8788 558225 566966 587503 632585 678716 706949 735968 753466 732267 703102 663274 623509 608742
8776 608742 625126 660503 721996 800853 863749 869982 829883 783556 718891 663230 622207 613280
8764 613280 607879 600495 607786 611916 613626 646824 672292 695826 709408 686051 652168 613786 585071
8751 585071 570051 552154 531338 533791 545198 555397 558735 559538 552142 525160 501479 506592 496591
8738 496591 502652 520850 534266 526589 512913 518163 524303 522960 557977 591299 636243 672518 690283
8725 690283 678462 653238 630991 609472 582212 578788 574027 597771 638543 663251 693173 723900
8713 723900 765662 803239 852608 886788 885925 837777 771322 721943 707625 723557 766261 798329
8701 798329 802107 786858 778595 779676 793350 803144 819543 831262 868710 917415 980934 999538
8689 999538 951793 884101 834955 854894 901824 917981 888237 833689 791423 745707 708948 699461
8677 699461 717673 733780 759655 782891 808528 808898 801895 783599 739893 698963 679581 691829
8665 691829 717842 722649 727203 724317 714896 732488 763070 775969 770569 740156 723555 736490 777635
8652 777635 828754 903382 992926 1118140 1243162 1352603 1451532 1476074 1350589 1179136 1052032
8641 1052032 995735 1000640 1037272 1068068 1074904 1074870 1064358 1068201 1111498 1163058 1205107 1212595 1228882
8628 1228882 1271198 1321618 1338954 1305551 1252363 1210401 1179199 1157287 1156760 1170125 1195839 1226064
8616 1226064 1259772 1311798 1376755 1431158 1510977 1619889 1715298 1788361 1838030 1825485 1816234
8605 1816234 1850763 1952626 2102153 2224160 2330274 2424667 2452137 2440601 2429234 2453874 2534702
8594 2534702 2653206 2785506 2943072 3159770 3416232 3737754 4140978 4563496 4889499 5086468
8584 5086468 5226303 5434050 5734019 6149599 6812387 7814885 9256993 11205623 13297437
8575 13297437 14829342 15759736 16769361 18630686 21912910 27109161 35055453 47666053
8567 47666053 68773537 104885132 163708344 234032539 260469435 224742355 161725041
8560 161725041 105601174 70366560 50198615 38117764 30472379 25465298 22038100
8553 22038100 19489085 17539127 15989528 14807766 14017713 13379283 12699659 11991625 11379068
8544 11379068 10990646 10868144 10946184 11117054 11253087 11382847 11625591 11986124 12573028 13590308
8534 13590308 15258909 17824522 21533639 25856197 29084303 30715862 32221963 35258224
8526 35258224 40985577 50252905 64376550 86652414 123986484 188797813 299827447
8519 299827447 448814902 517772176 456695027 333457799 217860313 145376314 104536432
8512 104536432 79017751 61594734 49503742 41282582 35376713 30937776 27421892 24590423
8504 24590423 22551581 20929169 19053145 16911179 14865761 13218658 11996066 11101919
8496 11101919 10473051 9986623 9670451 9516922 9441524 9429960 9603767 10135380 11120159 12593634
8486 12593634 14395245 15985121 16954799 17777628 19178248 21787941 26035023 32534064
8478 32534064 42710357 59558975 88378999 136878984 204809689 250810319 234097266
8471 234097266 179367869 122913313 86207342 63687477 47665953 35754303 27591711
8464 27591711 22342123 18745750 16089618 14037864 12417747 11181734 10195016 9142522
8456 9142522 7964958 6802269 5817176 5030680 4374801 3839787 3413372 3104032 2892666
8447 2892666 2718795 2530558 2327950 2140845 1998447 1886752 1793060 1719230 1660550 1601746
8437 1601746 1532050 1455752 1397561 1343124 1297147 1272893 1342874 1498601 1679116 1986910 2580767
8426 2580767 3658260 5376813 6589755 6041923 4525557 3015704 2067185 1540489 1217182
8417 1217182 1020645 894087 804433 721656 643775 570558 513254 500360 506601 493831 462021
8406 462021 429685 406920 392995 386314 384718 370514 340329 314864 310210 299118 297524 309071
8394 309071 345677 360202 292783 186902 100853 65337 71647 69833 53700 43279 35200 44355
8382 44355 57613 58926 57582 72369 102492 122957 114683 96980 85878 73909 77365 83844 83394
8369 83394 90489 84363 55748 44207 50070 55512 68199 88381 89409 77535 84226 82933 78434
8356 78434 65625 61670 65071 79301 99746 120668 143806 174844 169711 130891 58525 2096
8344 2096 -25686 -25219 -12942 2098 958 -18715 -16606 -7015 -10821 -19524 -38179 -43721 -40837 -44309
8330 -44309 -26451 -14825 -8024 -13914 -17328 5122 20621 20653 -5638 -33339 -51179 -54129 -51554
8317 -51554 -54758 -48138 -38044 -23967 -9150 11979 28791 40179 14163 -5648 -1190 5063 18103
8304 18103 20491 4159 -3189 -15849 -7776 13880 3376 -7596 -20437 -11956 14945 45453 47189
8291 47189 30825 32718 74270 151149 251154 291658 261989 202588 142970 88994 57719 48686
8279 48686 39445 23624 -2546 -8146 -18408 -28735 -28278 -16265 -21029 -20186 -27693 -12206 12128
8266 12128 33906 38881 32934 8051 -4901 -13554 -10188 -23326 -25143 -27508 -34810 -28696 7649
8253 7649 33226 36556 26872 13350 10803 31599 49506 74185 126157 209755 336009 521267
8241 521267 651892 633633 514460 358998 244034 166244 110071 72360 37266 -4678 -10427
8230 -10427 -7272 -6090 -14814 -21049 -24657 -19773 -13483 1007 5338 -2042 -14770 -16393 -15524 -31704
8216 -31704 -35061 -28502 -42402 -46973 -53533 -53080 -53027 -54220 -42680 -36289 -9843 16953 33335 44900
8202 44900 61008 70168 84421 114823 149659 205121 272069 318389 314592 272194 204822 162260
8190 162260 133817 115531 118882 169223 253715 351091 468374 572047 563019 473135 345072
8179 345072 227880 153718 110728 83572 66148 60016 61032 69161 77871 89215 107337 110733
8167 110733 119750 149483 180789 230492 311036 460051 703226 1039284 1329668 1323581 1053747
8156 1053747 717200 472003 331894 261464 231592 205079 177801 161096 152952 165705 181759
8145 181759 224408 313617 424733 542284 620966 571795 447733 318475 220829 155465 104298
8134 104298 69580 54141 53841 50130 62314 74704 101812 129429 147755 161819 169087 172969 194106
8121 194106 257449 342031 441410 594152 838060 1270467 1984105 2668058 2675340 2129390 1450189
8110 1450189 939119 632249 455137 346447 271501 222557 179397 140904 105211 77289 76865
8099 76865 73337 75623 62909 46198 40704 42341 30533 22700 23483 21483 22749 27463 42436 46541
8085 46541 43631 46918 49007 61065 76066 95022 92386 89928 93450 104355 131874 194183 273584
8072 273584 395907 606761 927177 1267004 1334426 1103080 781452 500564 316480 219647
8062 219647 164369 121153 80182 61374 55838 44653 40953 38600 25832 15056 8555 2962 -78
8049 -78 1402 -7311 -8498 -8094 -11737 -10184 -3810 -14896 -22156 -27959 -31844 -36126 -21422 -13790 -21084
8034 -21084 -19141 -19800 -15852 410 -1062 -8773 -8582 -13967 505 6232 9184 -4299 -9481 -17956
8020 -17956 -30511 -45248 -39813 -41425 -34868 -20153 -19695 -21009 -5267 -8917 -13410 -12592 -13065 -28558
8006 -28558 -36499 -38346 -27602 -19172 -12389 -1317 6130 6422 -3604 -14975 -12512 -5288 -8994 -12622
7992 -12622 -12195 -12676 -11155 -15098 -9408 -1712 1382 657 -11953 -20575 -19792 -29713 -29156 -31056 -40102 -31373
7976 -31373 -40139 -45825 -38089 -34222 -21369 -19656 -21233 -26967 -29030 -27651 -34219 -49125 -47029 -41058
7962 -41058 -49060 -38098 -19587 -13228 -4504 831 -2368 4176 -7271 -19659 -15789 -17373 -8414 -5799
7948 -5799 -22810 -24419 -25971 -39174 -33650 -36894 -41976 -34530 -24977 -30697 -41644 -61077 -65191 -58476
7934 -58476 -47133 -47375 -44299 -33961 -33259 -43092 -54882 -53945 -44943 -48510 -57635 -71894 -53019 -41825
7920 -41825 -35815 -40393 -30472 -19824 -18156 -28078 -18588 -14839 -18677 -31982 -40857 -42890 -31300 -8551
7906 -8551 -14722 -29781 -43544 -44929 -55994 -47369 -38371 -39223 -33628 -27241 -15947 -16156 -7483 3317
7892 3317 1907 600 9345 10806 -8637 -8559 8613 11373 9991 4181 -6228 -15355 -15162 -20011 -18303
7877 -18303 -12993 -6492 4850 13539 9272 -1272 -1023 -818 2557 1341 -838 12649 -940 -6645
7863 -6645 -2994 -3361 -15613 -12929 -3065 -10077 -30048 -27201 -19024 -27962 -29320 -22091 -14680 -9526 -8119
7848 -8119 -23708 -23632 -30322 -21536 -222 12950 14477 -899 -11530 -10329 -6551 440 4855 12104
7834 12104 18128 8501 -9668 -23026 -22103 -32866 -44106 -51426 -40524 -29985 -22673 -22799 -30988 -31254
7820 -31254 -23165 -21244 -9011 -1448 -2730 -5481 -16536 -16954 -15335 -28919 -28813 -16109 -8437 -2084
7806 -2084 -4695 -18117 -35634 -40171 -43722 -49247 -32751 -18204 -23382 -35125 -28282 -19177 -12081 -11350
7792 -11350 -15500 -3045 -13509 -19894 -25675 -27818 -37091 -35076 -34962 -43514 -34562 -22389 -29245 -29130
7778 -29130 -32179 -24155 -22660 -24002 -24286 -32482 -32124 -29998 -20376 -24027 -30243 -23412 -7528 -12218 -13396
7763 -13396 -6385 -6608 -15640 -23410 -19322 -9174 -20167 -20229 -5825 -112 -11301 -6049 -11363 -19014
7749 -19014 -24725 -21855 -24271 -28196 -23270 -15715 -12857 -7987 -17156 -37178 -29645 -9204 -12569 -22059
7735 -22059 -21587 -13135 -12095 -16706 -20642 -31072 -43346 -54430 -45851 -35453 -32412 -34778 -40474 -27908
7721 -27908 -15696 -19525 -25327 -24021 -28210 -32501 -35365 -34698 -24580 -18423 -16666 -20952 -21853 -18125 -21404
7706 -21404 -20617 -12350 -13570 -14691 -18301 -11790 -3733 -12797 -21129 -18774 -23936 -21749 -36362 -46207 -41668
7691 -41668 -32919 -23126 -15840 -31202 -49562 -52350 -34667 -24074 -30334 -29510 -20650 -20415 -13881 -13721
7677 -13721 -24421 -26139 -26419 -19613 -3135 -15963 -23091 -21832 -28906 -39859 -38699 -37077 -42209 -45051
7663 -45051 -42717 -23818 -23010 -19428 -24454 -19920 -18955 -13429 -9839 -21472 -29991 -26703 -26077 -25630 -24164
7648 -24164 -22692 -21247 -22557 -31838 -36292 -46445 -45353 -44295 -38683 -21048 -21614 -32353 -43088 -38854
7634 -38854 -27112 -32877 -41852 -35544 -17302 -28443 -33999 -32548 -37884 -31754 -21698 -19089 -18260 -10277
7620 -10277 -24361 -27365 -31619 -29364 -17669 -17258 -20183 -11629 -13587 -17822 -13599 -1979 -6327 -12902
7606 -12902 -22319 -34920 -30098 -29090 -29815 -25232 -8777 -8456 -11554 -22660 -32740 -29683 -15707 -13486
7592 -13486 -28095 -29037 -36016 -32672 -42934 -37248 -23837 -35507 -31701 -18088 -15470 -17620 -37169
7579 -37169 -45729 -50592 -42360 -32261 -30655 -29225 -34084 -31279 -28147 -20863 -11005 -18661 -25624 -33167
7565 -33167 -34978 -30139 -17648 -6928 -8391 -11895 -10010 -6006 -6509 -1660 -14833 -33191 -40891 -29854
7551 -29854 -19712 -15242 -16070 -27603 -31281 -34810 -40196 -31336 -29193 -17729 -12801 -20693 -16296 -16040
7537 -16040 -17978 -12807 -16513 -13304 -24681 -32300 -25061 -28714 -39450 -33502 -34925 -29841 -23731 -19996
7523 -19996 -21111 -22181 -17154 -5238 2463 10214 16078 21448 9549 9967 9304 -4283 -13500 -29149
7509 -29149 -27051 -16808 -29201 -21995 -22168 -16322 -12683 -9950 -9298 -13933 -18897 -21879 -23736 -17853 -13224
7494 -13224 -13595 -17573 -15844 -13872 -14574 -13266 -12599 -20634 -24759 -26794 -25036 -30520 -34163 -30117 -27216
7479 -27216 -28237 -16577 -14319 -22145 -14319 -20055 -21895 -13626 -15095 -22184 -17654 -15219 -9372 -4586
7465 -4586 -4802 -16595 -16050 -12694 -13715 -15494 -27054 -23272 -26469 -26627 -21244 -14818 -15062 -16463 -26989
7450 -26989 -34654 -37322 -31957 -26496 -15160 -2599 -2372 -8829 -12909 -9189 -10976 -2516 -1502 -5135
7436 -5135 1191 -3400 -8960 -11249 -13720 -23542 -28498 -15039 2204 4295 8110 -2052 -4957 -11958
7422 -11958 -19403 -25875 -28255 -26353 -20767 -19723 -10680 -13335 -17904 -21300 -20883 -16619 -10053 -3838 -13883
7407 -13883 -32119 -34094 -19978 -13510 -1924 533 6819 10657 -4944 -17351 -6780 845 71
7394 71 -12173 -7655 -5854 -8935 -10262 -5004 -4603 -17792 -26637 -29104 -28837 -29121 -31323 -23110 -9933
7379 -9933 -1487 -913 -6082 -4627 -1503 3763 2081 -8660 -17675 -16666 -12074 -16807 -20046 -15703 -13685
7364 -13685 -13299 -10130 -8339 -14817 -18224 -15399 -11865 -7735 -7936 259 -7476 -14199 -26650 -28108 -19348
7349 -19348 -15915 -20954 -9143 -3317 -10131 -16715 -11378 -10708 -19139 -37941 -31787 -19978 -20781 -19267
7335 -19267 -10754 -10836 -15844 -32253 -27603 -17330 -7875 -3173 -5704 -5313 -3969 -10988 -8403 -8594 -11659
7320 -11659 -5224 -8085 -28306 -41172 -29086 -12867 -2906 -3322 -26805 -43013 -48924 -34610 -28000
7307 -28000 -28503 -21536 -28024 -18410 -2606 -3764 -10297 -5847 -6270 -15185 -19811 -7968 9120 23044
7293 23044 26384 25615 10432 5713 12209 8584 6508 -12054 -18974 -16935 -13483 -15775 -13698 -22621
7279 -22621 -23127 -22210 -11102 -9340 -7086 -4134 -14571 -15093 -4726 -1413 -9960 -11329 -5132 -7369 -10632
7264 -10632 -5844 380 -4713 -4295 -13077 -16359 -23158 -17279 -1078 16169 12489 10540 1501 -6437
7250 -6437 -7009 7332 756 4706 2681 -2648 -19641 -14659 -6722 -5688 -1957 -7842 -10752 -6617 -384
7235 -384 3678 15274 22847 17301 2144 -6279 -8708 -12518 -6691 -13878 -24868 -12428 2490 6622
7221 6622 4532 -44 -647 -5225 -16165 -22559 -9982 -13400 -11985 3718 9761 -43 -13622 -20893
7207 -20893 -22409 -27528 -23964 -12778 -6937 -9125 -801 1236 -13700 -21105 -28353 -34989 -20616 -11183
7193 -11183 -1962 -290 -4923 -3835 -6118 -8296 -4695 5460 4713 -8152 -18298 -22875 -24068 -20940
7179 -20940 -25027 -24917 -24768 -17396 -22123 -24132 -24257 -24050 -17904 -21312 -17551 -16268 -23808 -23532 -11873 -1282
7163 -1282 -5231 -3770 -3058 5815 17585 517 -14158 -5621 -2004 -5279 -18075 -12468 -15052 -22290
7149 -22290 -27320 -28826 -24628 -23708 -18310 -13815 -22146 -19231 -8498 -4958 -8599 -2531 19650 25024
7135 25024 13834 19674 16843 3670 7649 13341 -5285 -10126 -13249 -5962 -8938 -11483 -4398 12266
7121 12266 33761 24478 14712 8656 10508 -5274 -17215 -43184 -39145 -21639 -15024 -11145 3378
7108 3378 6387 9723 20113 6772 -5509 -1887 -1118 -13878 -17744 -17275 -12003 -13207 -16254 -15930 -21458
7093 -21458 -26750 -14765 756 5365 1171 -879 -10169 -13093 -5726 -9662 -15353 -26231 -31591 -26781
7079 -26781 -17370 -17311 -16195 -18436 -11210 -4768 -8559 -19292 -20253 -27497 -13351 -3446 -1267 -11453 -25291
7064 -25291 -29287 -15232 -15166 -11645 -21575 -35700 -30261 -11790 -14334 -27872 -30726 -20756 -15060 -1204
7050 -1204 -1579 -14361 -22962 -17164 -14270 3953 15152 10803 7982 7052 -3546 -17313 -13737 -12807
7036 -12807 -21692 -19187 -18942 -22371 -30723 -29517 -25658 -18120 -11932 -17691 -17835 -13051 -8746 -8856 -12943
7021 -12943 -24710 -25805 -20926 -33804 -32349 -12054 3997 1996 -517 11776 7923 -13723 -5048
7008 -5048 550 -228 -2392 -3432 -2613 -5603 -5121 -292 -5732 -8860 716 4808 -1118 1054 -2460 -13596
6992 -13596 -14398 3952 14983 16093 21900 19600 15767 15054 15816 11401 3811 2383 -3363 -13318 1511
6977 1511 6527 -3666 -6937 -18619 -27939 -29718 -22481 -19036 -13066 -8958 -12638 -9962 -2476 -6883
6963 -6883 -4469 -13954 -17882 312 18263 3047 -211 -5928 -7293 -8137 4076 10250 12821 12177
6949 12177 7478 7417 -4272 -10203 -14145 -1303 3481 3394 1262 9290 11474 11262 4136 -2639 -2536 -153
6933 -153 -1614 3988 23582 39802 32478 13349 -327 -5381 -17658 -21215 -8153 1400 1472 487
6919 487 5986 12261 9798 4830 3001 186 5550 19056 18612 16081 8577 4581 10437 16056 4891
6904 4891 -2921 -6893 -12991 -19522 -18370 -6340 -3331 -13223 -8058 -9825 -8100 -8298 2470 14158
6890 14158 3933 -3354 -13513 -13752 -8474 2252 6352 9495 18365 19606 19101 13281 6090 5113 9282
6875 9282 11424 13614 23676 26042 18143 13902 20512 20317 1346 -5890 -4173 -6281 5709 12971
6861 12971 944 -10173 -16955 -13307 6444 7494 973 5005 12002 22398 18716 -619 -7706
6848 -7706 -5890 1221 739 -8353 -11447 -3425 -3414 -3751 -7814 -19677 -14307 -20935 -17657 -10072 970
6833 970 4733 4335 9382 9253 -4163 -8356 -1430 -851 11562 11234 7350 -5394 -18178 -22004 -23981
6818 -23981 -12583 -13132 -14664 1966 6533 980 9444 8232 15576 18335 16189 13057 5016 -7025
6804 -7025 -13307 -6442 1858 -7348 -10014 -1009 -11651 -16708 -1232 -6159 -22934 -7315 3664 -4679
6790 -4679 -6407 -2181 -3820 -2442 -113 -1412 -4536 -8059 -7517 1651 6556 7957 6017 -4396 -15804
6775 -15804 -10941 4089 19827 20706 5027 735 -8103 -12578 -20105 -14094 -2180 2538 1377 -15685
6761 -15685 -9614 -7385 638 -5669 -6405 -241 -4695 -4106 3013 -5592 -8668 1663 11189 7763 -8970
6746 -8970 -4122 1968 2043 -3558 1023 2304 759 -2798 -56 -2746 5840 16535 11370 1631 -6411
6731 -6411 -25138 -25140 -12138 -7914 1369 3901 8683 11736 8526 -3412 -5033 9582 14325 12836 2188
6716 2188 -7880 -11135 -6016 -6888 -4275 -13488 -5231 -6564 -9777 -10968 -5209 6734 10227 1721 -4928
6701 -4928 -520 6560 11176 20284 18320 16782 8081 -4040 -14301 -8234 2072 5357 5701 2668
6687 2668 -7682 -13224 -16939 -16794 -20848 -14530 -3636 -7727 -10166 -17430 -12301 -2429 4506 9438 1619
6672 1619 -13469 -21155 -18110 -3373 17226 11007 -12134 -10291 -8671 -3308 7176 3448 -6954
6659 -6954 -316 -2441 -492 6908 1913 4984 9238 60 -1386 -13190 -8594 -881 6907 4801 4252
6644 4252 8019 4675 156 -5539 -7474 -13562 -13904 -7808 -831 2672 2055 -1567 2080 5889 12079
6629 12079 21941 15653 8770 -6520 -16289 -21347 -9066 -4181 -12069 -9526 -2096 -5213 -5152 -478 -3843
6614 -3843 5312 24256 18540 15341 18241 21122 28844 23554 12576 10912 13172 4039 8611 7960 11180
6599 11180 9993 6492 -11741 -13633 -17855 -17294 -4206 2130 -7532 -20710 -10991 -13938 -5089 2588
6585 2588 -9521 -29056 -24399 -22297 -13343 -8871 -9935 -10074 -11590 3029 -6009 -11145 -13599 -15885
6571 -15885 -16230 -18664 -18611 3677 16852 8201 -4062 -11518 -19378 -18748 -14562 2110 13523 21942
6557 21942 8379 8234 11240 1234 -2895 5151 2746 -1040 2617 4768 10307 21775 5411 -3216
6543 -3216 -11324 -17572 -510 412 -10451 -10567 -4124 855 -4601 6006 5878 9449 8542 7616 11200
6528 11200 9126 7100 -1753 -2003 2053 -3330 -15903 -18693 -10964 -14885 -13140 -18611 -23418 -29989 -17348
6513 -17348 -22879 -23029 -16043 -11438 -3502 6650 5414 5458 544 -430 -759 -4864 -12568 -5949 4111
6498 4111 1041 -1020 -4052 -24185 -25041 -21669 -23314 -18328 -11983 -7258 -10376 -15133 -5588 1284 -7643
6483 -7643 -5474 4136 14843 8936 4678 13199 7178 5188 5372 -5235 3360 8079 5020 -1324 -4131
6468 -4131 -7888 -11449 -6271 -5991 -1305 -3773 -7438 -4451 2439 -7139 -9642 -4178 -11076 -10456 -2199
6453 -2199 1651 -5459 -308 2703 -3268 -2403 -6092 -544 2611 -10720 -9590 -7128 -14207 -13248 -20422
6438 -20422 -14505 -2629 -17842 -25073 -12756 -12826 -17751 -19101 104 11565 998 -4258 2509 1237
6424 1237 -9691 1784 7866 7677 -600 -4989 -17143 -22630 -19230 -16804 -17286 -5929 3844 10432
6410 10432 22581 20695 15600 21445 25901 2568 1772 956 -1544 -2942 2644 10861 6396 -6851
6396 -6851 -5906 -4243 -23065 -21288 -15735 -14281 -6257 1448 14439 2957 -5957 -7495 -3577 -6126
6382 -6126 -3657 10580 15783 10232 -5234 -19255 -22736 -21072 -12601 -7877 -4812 541 -6204 -8246
6368 -8246 -10719 -19363 -15154 -6271 5729 18109 24081 12512 7168 12700 23196 13912 7114 5909
6354 5909 -309 -2861 -2629 -9632 -5476 -3128 -2220 -1540 -2720 -1089 714 2593 2618 4360 4369 3222 3355
6337 3355 3830 -6794 -3870 10621 24654 13791 9287 7803 9163 16093 7734 7991 12595 4664
6323 4664 -1130 -13719 -10497 -13031 -10973 -11894 -11275 -21321 -22611 -25959 -25692 -21483 -5162 631 -1557
6308 -1557 -6115 -13615 -10543 895 861 6194 2004 1951 -4370 -959 2604 13802 5643 -2363 -5127
6293 -5127 289 8858 21852 19468 4671 7149 21746 16905 10377 4333 -6197 -9550 -6369 -1695
6279 -1695 3281 16164 21860 16249 16221 20991 9342 4643 7537 11373 2471 289 2961 2988 -1768
6264 -1768 1391 15494 40943 29902 16981 16766 28785 10510 2791 8355 3466 12811 15572 4600
6250 4600 -2286 -8839 -7623 3580 14805 25223 27345 24259 23070 13056 1083 -1520 -4385 5700
6236 5700 1353 2246 1525 1768 464 -7719 -10417 -1075 7662 -2711 5409 -4119 -14744 -10314 -6666
6221 -6666 -6068 -9147 -5120 -80 -8300 -14931 -8236 -3980 -2386 -10068 -5939 -2368 -5782 -3568 3990
6206 3990 3380 -6143 -7677 -1926 -133 -7326 -10297 -8919 -11346 -10598 -13912 -20873 -23402 -21453 -21194 -17507
6190 -17507 -10032 -9770 -3262 1973 -6311 -7350 5810 16455 10931 209 -1882 -341 11288 12726
6176 12726 21946 23195 27561 26837 19365 15724 1635 -5625 5182 14222 12267 9285 7253 1133
6162 1133 373 6096 -2893 -4667 10399 7901 5930 3266 9825 -3607 -9816 -11188 -2859 11675
6148 11675 22265 20490 21410 9866 -1478 -6165 -7660 -9079 -5366 -4116 5816 13097 1483 -3135
6134 -3135 2653 15204 7396 -3434 1800 925 -7465 -9982 -4888 2652 14532 1553 -4709 1847
6120 1847 3518 13544 7922 8038 9381 6384 11568 6466 6540 -156 4944 9967 15823 10445 10258 6737
6104 6737 9407 5785 -17353 -17246 -10845 -10123 -2842 11218 11465 2744 1644 4525 12540 6538 940
6089 940 -6237 555 6566 6342 6335 -880 2493 -2642 -9806 -12637 -6052 10917 12623 13225 17030 11547
6073 11547 -7515 -10608 5720 12749 11061 14026 18713 17073 6107 -1679 -2648 6671 15269 5901
6059 5901 2090 5397 4438 -8287 -8932 3074 -3333 -206 7104 -8793 -20277 -7069 8840 14585
6045 14585 15477 14726 20630 27325 23180 26209 14951 -4609 -15034 -2136 3227 658 863 5785
6031 5785 756 -2813 -3468 -9531 -23052 -34742 -26439 -5164 12888 28578 15283 -1975 -2969 -11581
6017 -11581 -14877 -1698 1952 11712 14324 12816 7047 8524 20166 20999 21225 30840 18606 13421
6003 13421 23850 18027 -1120 -10434 -13784 -11498 -10550 -13918 3453 8187 9066 -2319 -8412 -39
5989 -39 1508 2280 8996 19210 9931 8055 12221 10968 17518 17616 11967 12978 8942 381 2420 16557
5973 16557 9621 7506 9371 10887 5868 12312 15764 23777 29807 26623 33775 27225 9962 1613
5959 1613 12269 23028 18236 7146 8843 16101 17649 12173 9705 13345 24391 25051 11998 5718
5945 5718 8651 280 -10317 -5292 5687 5187 12620 23742 22337 9392 13223 8636 5243 -6020
5931 -6020 -8887 -7362 -16800 -10681 -2065 -680 3738 2821 5526 20215 10807 47 9722 7516 15898
5916 15898 16472 9186 10023 10587 13680 5544 -3825 -8479 -9780 -9642 536 -5269 -16206 -16051 -167
5901 -167 -323 -10118 -12619 -4643 4691 14019 11346 566 -2021 790 -5869 -9710 -6357 6593 2206
5886 2206 -10287 -8976 -1787 3141 -2953 -3320 274 4667 -19 5262 7351 4230 -5177 746 1439
5871 1439 -813 10088 8319 15159 28844 28680 25327 19084 8243 -3256 -7742 -17300 -24214 -17311
5857 -17311 -6385 3441 13293 -2502 -11798 -11177 -14478 -9632 -225 11868 13999 -6165 -14097 -5859
5843 -5859 -527 -7082 -8230 -2620 -4318 -12506 -10593 7691 10337 12109 7173 50 -7986 -6658 -5111
5828 -5111 -6221 -1220 14299 17742 -2461 -304 6188 785 -7923 -231 15320 24467 11543 8086
5814 8086 22627 23446 19674 31812 27789 15101 9100 12457 7908 323 12112 6658 -10156 -16344
5800 -16344 -22511 -19870 -6656 2129 -9551 -12529 -14162 1685 8882 18081 21837 18253 9921 12008
5786 12008 6975 -4410 -9436 -1972 4039 6032 18102 21835 8873 9858 9589 3687 5093 -2318
5772 -2318 3010 9071 -2377 -16526 -31859 -15824 -10959 -13079 -8713 6459 14859 7302 13389 14997
5758 14997 7527 10666 21505 26912 17255 19688 17054 8531 6484 376 2050 -1041 9882 12858
5744 12858 10709 2745 -15203 -10083 6622 13762 10818 9625 15264 11683 3844 -672 -149 9744
5730 9744 21266 34839 24555 8830 19754 24280 24028 13472 7519 -3353 -6819 -6304 530 7413
5716 7413 2749 3205 -1744 -8267 -10065 -4773 -4294 1084 3278 -2302 6866 6711 6960 12869 2088 -5868
5700 -5868 -2054 -3053 -14345 -24026 -14088 -9662 -5862 -9119 -11822 -13544 -24364 -10626 5676 9730
5686 9730 11053 19431 5040 -11940 -17320 -17282 -13998 -7056 2841 9263 14748 24281 11828 -2909
5672 -2909 -8013 -7166 -3572 -6005 9205 11226 7692 7964 14754 16375 9067 1139 -2279 -5976 -7242
5657 -7242 -5807 3333 10010 12177 13403 7624 6297 -5900 -6068 6291 1745 8360 24606 37743
5643 37743 27846 20298 20352 13005 614 -1791 -8355 -2329 -9711 -24496 -10089 12068 -3401 -4449
5629 -4449 7167 17393 14332 15925 18955 25909 18880 23597 28796 36424 24938 12283 13065 27073
5615 27073 22628 16171 16228 15539 5848 5307 5079 354 -249 2780 3092 17383 21461 15771 9856 9990
5599 9990 -3124 -15925 -3218 4191 -2816 -911 5046 18238 23352 24119 19961 14916 18252 5992
5585 5992 -2741 4512 11699 -3978 983 2499 1625 -687 -2249 -13386 -10245 -6244 -2059 -5266 -10654
5570 -10654 -14166 -14981 -15721 -14047 -17360 -4728 -8165 -14142 -16807 -19034 -7959 -3002 -17005 -14319
5556 -14319 -3912 -12103 -15638 -6239 876 -537 -7928 -4567 -7272 -4644 -2427 -4846 4302 6061
5542 6061 10859 23519 30130 30547 27039 25675 24678 18472 7071 8799 1142 235 12016 18079 11025
5527 11025 10168 -1286 1459 12014 11335 -10159 -35645 -33476 -20372 -4773 1506 806 5686 4352
5513 4352 14805 21141 20260 15037 -746 4140 3124 1674 5873 10626 9800 -1329 -2062 14264 14988
5498 14988 3986 11977 10996 7451 7365 9086 11546 -3296 -9161 -1974 19494 25363 26271 17094 17644
5483 17644 13531 5046 2022 5759 -9063 -7599 -9793 -8180 1857 8310 8769 18194 28388 23835
5469 23835 16635 7652 7177 9701 9698 16126 16216 22816 27129 26984 4678 1867 -4788 -12507 -12622 -13371 8020
5452 8020 22262 13212 10556 19121 21241 17528 21818 20261 13230 8898 -569 13165 27144 17865
5438 17865 16713 17274 6358 7410 -1226 4004 9235 8249 8643 5147 -388 -71 -4883 -10399 7243
5423 7243 11808 16256 6395 -1931 9472 7630 -12832 -15763 -17416 -5718 -3703 -2845 -2799 -2194 -2181 -1012
5407 -1012 2581 10548 -3801 -2227 -3496 -6024 -3986 -4679 -5355 2323 12010 12531 16047 12246 2889
5392 2889 -3903 -15488 -3013 2480 -2411 -1687 3260 16532 28105 24222 21776 14795 12708 23492
5378 23492 26127 15019 10298 14738 785 -7812 -5501 -768 -2612 6862 -326 -603 402 -318 4102
5363 4102 8654 9862 15782 16222 10629 7015 1514 -8597 -14871 -15024 -15235 -21287 -27632 -19564 -17232
5348 -17232 -520 16699 24053 14002 1737 -1285 -4491 -12521 -9030 -10410 -4372 5107 5178 -596
5334 -596 -5698 -10691 -5716 -4604 220 -2818 5783 11896 13081 17586 17648 14283 10615 11727 6653 6778
5318 6778 16587 9978 10328 -691 -7194 -11442 10941 17976 16924 10099 4445 5185 16610 25128 29206
5303 29206 40843 39918 34648 33051 25467 15373 -4023 -3269 -7966 -3133 890 -4399 1159 9396
5289 9396 -7153 -3847 3722 4311 4747 -4855 -7362 -1723 -3935 -831 -3242 -11376 -5945 3991 1619
5274 1619 2564 3842 -1005 -1270 -7332 -8900 2701 -1154 4429 -1516 1936 11947 8454 1350 -827
5259 -827 12935 16320 6168 -12095 -20180 -10629 1990 6948 5450 11075 13976 9793 14305 16498
5245 16498 14881 7754 3918 2932 6895 8123 7158 1507 -7034 -2019 3352 -9858 -13258 3010 13724
5230 13724 20813 25406 20341 9459 -22 4657 7329 856 9914 2256 -6579 1029 3044 8857
5216 8857 10712 18490 18572 21190 29760 39068 30014 7606 3270 18507 19804 19810 20042 23684 14580 -176
5200 -176 -12117 -7755 78 7708 2094 -1010 -9113 -6809 511 2427 1006 -1404 6265 10653 16181
5185 16181 15591 6423 4971 24214 26333 17976 15726 8564 10615 10665 -958 -8951 -9167 -6587 -4413
5170 -4413 -3704 3408 6358 12291 8439 8766 12234 -97 -4050 -9900 -12402 -10017 -13802 -23008 -12874
5155 -12874 2983 3494 620 4649 428 57 11579 18629 29553 25007 24127 35038 23298 18102
5141 18102 25634 17053 2464 -4290 -452 -2361 -457 2575 6463 875 -5752 -7414 -10277 -10414 1868
5126 1868 4137 -636 2571 541 -2023 3701 12771 16968 22852 26070 21530 22050 17300 25064 29145
5111 29145 28160 16040 -441 8325 18127 12224 10995 7491 19629 15221 4896 5933 3697 -3882
5097 -3882 3476 14022 21515 21468 16001 15725 9007 -4579 -8622 -10176 -11604 -12662 -16099 -26556 -29428
5082 -29428 -18770 -21194 -13605 -4356 -8483 -7638 -1380 6581 -1785 1892 14997 8189 10696 7249
5068 7249 5044 6761 10510 10511 -4262 5838 12483 13934 22994 28695 25648 15198 10822 396 6317
5053 6317 15772 15137 9349 10198 8577 -470 -11350 -8488 -7547 -8426 -11257 456 15042 19493 8348
5038 8348 7733 11050 16251 17104 17939 12073 9161 1412 -4759 -2189 -7279 198 12917 12391 -1484
5023 -1484 -7197 -13644 -9048 -13144 -15026 3730 9631 19984 26335 36428 31821 40439 45062 42205
5009 42205 17379 12875 9342 14490 13758 6559 -4240 4222 -819 8037 11069 3414 -4231 -9487
4995 -9487 -8613 -10723 -7672 5187 12798 7746 5080 9892 8005 -4699 -16575 -8053 2558 8798
4981 8798 16952 23070 24784 22450 22010 30267 15419 5778 9126 16093 11288 8872 4477 10100 7471
4966 7471 12438 26820 25254 16256 14143 10455 8937 10971 -3805 -14242 -7367 1834 5947 14043
4952 14043 17438 13620 22607 27378 20250 5418 1344 7208 2638 12406 13295 13926 21492 30873 13756
4937 13756 16176 22872 7468 1540 5854 21101 36354 38600 43804 45485 34526 23086 20197
4924 20197 19062 6918 2369 5010 7448 -313 13082 18990 7990 4511 391 13197 29359
4911 29359 45438 39787 33082 7730 -5841 -13515 -5845 7485 12524 18523 20739 22243 1721
4898 1721 -11057 -2176 7086 7470 7940 15995 18320 19312 4864 1098 5725 4371 5358 11628 11874 20820
4882 20820 9564 5146 6487 -4965 -7888 -2685 -2546 -8575 -26664 -24258 -3133 5644 16996 25918
4868 25918 20719 13267 9209 7032 8199 8369 -2959 4799 13232 6250 -5376 -18814 -21399 -9319
4854 -9319 -1129 4137 8053 14070 23566 16464 18490 27088 17126 13394 15448 9788 -5630 -10068 -15811
4839 -15811 -25864 -20813 -11137 -6234 -4591 -2000 -257 3313 -3888 -8098 14459 14330 10753 8875
4825 8875 18847 16815 8672 10877 11671 5794 -2947 -4138 -1876 3664 11412 4955 -2865 -2005 4857
4810 4857 10181 13422 11340 3753 6260 10853 16833 9160 12825 11508 -3115 -24626 -25952 -18454
4796 -18454 -6304 10683 7871 2609 5424 9962 5195 1626 -1374 6724 -1528 -6468 -2445 -1393
4782 -1393 -7056 2774 13662 21763 16609 11553 1727 -423 893 -2801 -4742 -9130 -3093 -6217 6621
4767 6621 12165 9286 3714 3920 -2208 -3371 3061 19840 24118 18582 10826 5958 1356 5986 3745
4752 3745 -435 -863 -5594 -7748 1569 -3336 1339 -2589 -11817 -882 932 744 14923 20051 -2927
4737 -2927 -10581 -6164 -11479 -3440 -626 -2012 4998 9357 19168 17488 12740 3900 -590 -1196 -1578
4722 -1578 -447 2634 -5884 -7646 -8415 -3220 1334 1073 -10879 -13953 -3836 -465 -1106 5309 11502
4707 11502 9192 2323 12636 21066 21659 18144 13308 11634 16234 14924 10478 5130 4196 6445 8961
4692 8961 9544 -6613 -5945 13570 23118 13529 9115 14375 9600 15245 13788 17906 18788 9344 5277
4677 5277 12383 7101 899 4307 3931 -519 8373 19642 30177 21328 12024 13235 14048 3863 -7663
4662 -7663 -4227 -6736 -13017 -296 11587 14174 19249 15590 12611 15223 11161 8207 13358 3558
4648 3558 -5424 1151 1179 6043 -2525 -6803 -117 1203 -8544 -8979 5292 7962 5502 15097 21187
4633 21187 11560 16287 15246 14833 19434 10974 13438 16692 22552 14781 10780 13388 10035 7764 19635
4618 19635 19825 10480 4892 -4300 -7543 14 15323 9876 15253 12816 19164 15726 450 -9310
4604 -9310 -19709 -15707 -8276 1471 2323 4052 2161 12767 11715 6425 940 -4566 5003 11306 8784
4589 8784 3025 -4022 7463 20893 6716 -6407 -5347 -1326 5154 6217 11471 21378 21783 19322
4575 19322 19368 19236 14862 3297 5197 10909 4317 -10110 -13015 -4522 10035 18137 19274 19150 26177
4560 26177 17534 2915 -845 32 -877 13090 22075 21137 14921 11225 15501 17197 19721 15803 13556
4545 13556 17251 17157 12526 19014 14601 14598 4472 5042 8249 3982 6139 11266 18572 19739 9922 2364
4529 2364 7639 3556 -6728 -3164 4179 8645 12555 3172 -5719 -13251 -9431 7845 5756 2108
4515 2108 20457 21023 16899 11227 6291 -7538 -19549 -9356 11349 21148 28191 25133 23808 24499
4501 24499 26992 21913 11423 10879 3041 -5189 429 3447 5623 22874 27061 14304 -4527 -4362
4487 -4362 7566 5534 12009 5288 -2334 -11371 -12168 -4700 532 -5882 2676 4156 -3689 -11339 -12806
4472 -12806 -10556 -8800 3450 10497 13095 26571 32974 20900 6562 673 1829 12337 14107
4459 14107 7509 10239 1995 -15291 -4049 9914 -5831 -22011 -11331 -8625 -13691 -14670 -11714
4446 -11714 -11800 -4720 1080 -775 -11491 -19856 -9225 5974 2754 1806 -5026 -11050 -16919 6205
4432 6205 19367 18210 14040 8941 4752 9072 13250 4254 17265 31317 29668 21168 11567 104
4418 104 1501 10200 3413 1221 -2190 -1762 1670 -7729 -8319 -10113 -2013 2795 8101 14876 18467 18699
4402 18699 18881 24185 18872 6035 1100 -656 -7204 -2574 3073 9154 2810 -1462 -16737 -20841
4388 -20841 -12275 -9841 -7409 -12643 -5646 -4511 3268 9794 4102 4909 12322 15617 11262 190 -2661
4373 -2661 -7346 -9836 -2718 -395 -3859 -11735 -23563 -11376 -1106 -1030 -6459 -13917 -12560 -1150
4359 -1150 7076 3696 -8710 -22479 -20175 -17992 -18372 -16649 -5374 6706 10028 5735 11509 4543
4345 4543 -3042 -1520 -8984 13888 22316 18082 27824 23115 17161 7790 5443 7462 3092 6076 4573
4330 4573 5505 5302 10184 10885 7115 16298 15657 10442 8504 8329 8378 9727 12084 4125 3335 7964 16538
4313 16538 9127 -3565 2619 10297 7967 16769 16492 11602 6896 18193 20955 18405 14906 24210
4299 24210 23687 20392 20684 23121 17815 28232 19458 6115 -6557 -6016 -246 14445 14957 4727
4285 4727 -3461 -7327 -928 15782 15262 11080 8667 -5718 -4145 -13566 -19127 -7446 14929 20122
4271 20122 13998 8502 10610 13545 1127 5322 19747 29075 30665 21508 18472 9326 5632 14862
4257 14862 27341 22498 25429 28907 34399 41894 13779 2988 15965 23537 21719 19933 11421 4298
4243 4298 -4206 -15902 -24329 -20524 -6951 -3766 -4831 879 10108 11376 -755 -11201 -10642 -6633
4229 -6633 -4052 1290 2787 -600 -8392 -4737 3717 6293 -1474 -17684 -11237 -6508 -1294 -3051 -6379
4214 -6379 4051 8890 -7213 -14009 -17246 -17457 -6607 -137 -1172 4973 4287 -834 -12307 -7357
4200 -7357 6721 8009 14565 12812 853 -3908 706 2028 -365 2969 10000 15167 10519 2595
4186 2595 5985 12375 9915 -770 475 11645 9649 14969 16453 5692 2183 -3964 11405 20304
4172 20304 18714 24604 23238 11456 10663 2909 -597 14261 16005 14969 16675 12610 15895 23143
4158 23143 17194 10409 8310 15609 19062 7332 3551 -3021 -2238 5130 14213 4145 -8883 -20682
4144 -20682 -20746 -9278 1685 12649 1922 2906 2286 -434 -4134 -6326 -7443 6353 13100 15018
4130 15018 9061 7210 9850 12620 12792 11976 14362 29007 38573 27716 11193 -4075 -5484 1691
4116 1691 1764 -13637 -15907 -18831 -2648 1585 8005 -1720 -4669 6083 16555 11905 -1880 -3552
4102 -3552 -693 -573 5107 5788 8980 17116 30956 34211 33358 32060 18517 13111 10584 -318 -4513
4087 -4513 -1190 -977 -950 4060 8905 3297 3713 7881 9458 10376 9868 6659 1516 152 -2412 -8783
4071 -8783 -15282 -6304 -8340 -16179 -14327 -11636 -16726 -18006 -18046 -9183 13938 15504 22445 25257 22058
4056 22058 15327 10822 7451 21752 28404 29968 29752 22037 18378 6094 3699 -4490 -13624 -5603
4042 -5603 9279 8345 -5943 -13273 -14810 -14873 -4816 -3561 3724 -2445 -9268 -8856 4652 39323 48314
4027 48314 20256 8876 25770 27971 11190 -7473 -8040 -5962 -12650 -16604 -9804 -12978 -16872 -16429
4013 -16429 -14624 -29828 -35749 -23758 -15925 -2755 1606 -8462 -16334 4820 15869 19535 20115
4000 20115 16080 957 363 4990 11183 16909 10746 -898 -8320 -16596 -9045 3435 190 4475
3986 4475 40759 87952 120277 143175 114643 41140 -2329 -8 16691 23598 20279 31955 25527
3973 25527 7588 -8790 -10143 -5627 -17858 -18499 -4518 2854 -4998 -18738 -15037 -10419 -3355 -1128
3959 -1128 -12283 -14702 -17635 -30116 -30140 -24109 -26894 -13880 2915 12496 14236 -685 -5025 -2292
3945 -2292 -1897 13646 -362 179 40681 87741 123076 147370 115027 43524 -14572 -31907 -17046
3932 -17046 -9056 -8451 -10060 -18610 -29844 -29188 -20868 -1792 10866 2367 1084 -13598 -20214 -6457
3918 -6457 -1105 679 3702 -3561 -9501 -16184 -13970 -10516 1081 -3201 -4990 -899 13556 14461 23838
3903 23838 28254 27608 17117 1452 8609 12477 16144 21878 32906 40839 40303 33664 10361 -1338
3889 -1338 10673 17577 5150 -1901 7125 7112 -4690 -14152 -4708 -2052 -3676 -8141 -5098 -292 3439
3874 3439 17937 17658 -4958 5900 9757 -2926 -17764 -14712 -11489 -4243 -4486 -8588 431 9883
3860 9883 16507 22120 20492 5267 -884 -10167 -8551 -1601 -6097 -20703 -42548 -41034 -30300 -27357
3846 -27357 -18611 7231 15426 6238 430 -268 19161 23300 11657 11581 17897 21395 19464 24460 21666
3831 21666 10173 8393 7365 11452 12410 6648 1216 9412 10750 7867 9187 11178 20657 25320 8144
3816 8144 11346 15790 9677 -2750 -5388 7488 2545 -616 10589 17990 28306 26220 6082 -4077
3802 -4077 -1919 -7227 -13105 -5369 -478 -10179 -15582 -11846 -5475 -1026 -7352 -9176 -2661 -8149 -21087
3787 -21087 -16305 -8228 -1052 1029 -1620 5925 2376 -1225 -10927 -2244 11531 24033 24711 18025
3773 18025 5992 4487 -6860 -6057 735 -10728 -9857 -10015 3984 9685 -1498 -14288 -22255 5629
3759 5629 11382 5132 14525 5726 13828 15126 10718 18027 31499 27072 16934 5803 4311 9083
3745 9083 14403 20225 22224 19884 -5211 -15690 -10843 -15250 -6234 -498 4447 18480 16482 7499
3731 7499 18523 18226 12919 14547 15536 4385 -3372 -14869 -2470 21897 22776 17147 6576 3377
3717 3377 -195 -10891 -14551 -15486 4169 21052 28885 12023 4469 -3301 -2781 -89 -10089 -11326
3703 -11326 -9686 -7025 1862 10351 5780 4880 -3263 886 198 -573 11773 21171 19721 16465 18486
3688 18486 18562 14030 10758 17143 19685 13137 19287 17920 15334 16183 22401 29064 18749 15716 7335
3673 7335 4692 7747 8497 13066 30099 32714 21476 12949 23001 19789 6239 -5400 -12804 -8867
3659 -8867 -6275 -5406 1068 5601 4360 9932 11061 -1691 -5622 -3292 -1039 1081 15536 22175 29487
3644 29487 31517 29083 15277 15162 1731 -9818 -1441 10207 22226 8776 2173 1509 -9771
3631 -9771 -1196 20249 25369 28532 23331 17783 13629 -2371 -1725 2154 6229 10134 10971 6764 7963
3616 7963 1876 3117 1793 3245 11651 4683 18432 14881 14228 9643 12680 9998 12551 5573 6874
3601 6874 1628 -2599 5246 6782 5863 4107 -12146 -18572 -10956 -10765 -13642 3586 17218 28785
3587 28785 32836 22330 10920 6809 15466 20549 18333 12334 8282 8365 -11074 -21692 -17722 -23381
3573 -23381 -23683 -1680 15257 18721 10867 4229 8242 8252 5099 10573 19977 20359 22282 27048 12439
3558 12439 -1348 -6101 -5019 -12752 -2239 7190 10794 11433 21121 25387 18943 17251 12640 6618
3544 6618 1926 -2226 -933 6657 892 -11665 -16742 -17730 -4751 12504 24200 21790 16136 12177
3530 12177 -948 3512 97 1480 14814 19947 22350 2735 -3695 -1439 -3880 2070 13875 10494
3516 10494 -3106 6989 13344 11001 530 -3861 3731 83 7245 7443 -4199 -13335 -20208 -11501
3502 -11501 1960 6213 -7461 -27609 -11933 -6697 -5419 7258 15515 -4245 -8195 -4092 274
3489 274 -2530 -8917 3254 6789 -1750 -6562 -1907 3596 4543 -6050 -2997 921 -4714 -8939 -4287
3474 -4287 -15788 -12984 5949 8828 6101 8646 22285 21782 15128 -4494 -9907 -10914 -3778 2543
3460 2543 -4301 -12133 -7610 -976 -1498 -1585 -2902 1055 10723 10596 17521 17482 857 -18001 -7097 1539
3444 1539 6499 15288 10202 4258 4091 22923 30295 32927 22998 21367 14189 13808 25546 26174 29468
3429 29468 17737 13697 17314 20466 24287 20551 17181 21631 21229 9224 10806 2376 -12908 -21061
3415 -21061 -17983 -6016 3321 11114 5743 3151 8368 -13 -8596 -13061 -8860 -10676 -9030 5518
3401 5518 -2135 -3087 1045 5457 -420 6453 5408 -914 -2113 -1598 -2435 -3328 5281 9810 15013 5865
3385 5865 7568 16909 13570 8814 6260 1675 -628 -2897 -7972 -7372 -15783 -14768 1098 13210 5297
3370 5297 7624 13098 16153 11781 14406 982 4379 17255 12103 7629 6729 2533 6732 13488 15814
3355 15814 5605 -12246 -21528 -16024 -6277 3062 -6873 -2362 3710 9421 17251 22368 18337 15005
3341 15005 15050 12646 10429 11802 14743 5088 -7513 -14970 -15791 -12238 -9451 -7668 -14107 -13363 -18904
3326 -18904 -10616 -5186 7069 15368 7402 7869 2971 -4453 -2464 3328 -7574 -2123 -2114 -8901 -6656
3311 -6656 890 -2760 -1699 1867 3578 -7972 -26110 -22813 -26045 -19938 -19042 -18376 -19199 -24885 -18632
3296 -18632 7680 6155 8115 13820 5000 9286 10604 6102 5332 5322 14867 17283 23968 11239 11623
3281 11623 11504 3924 2681 3675 -3509 -3409 -2116 -2999 2035 5079 -9424 -17058 -6600 3728 -8597
3266 -8597 -20048 -22721 -14484 -5631 -7327 -11921 -13903 -11971 -16585 -10889 -12478 -19587 -22218 -7833
3252 -7833 -3495 5300 5367 -875 -1261 7378 7493 2269 4810 6272 9330 4190 -10379 -21646 -19221
3237 -19221 -13922 -565 12807 18885 27324 13621 9095 11930 11479 1281 1441 1694 -4620 -7091
3223 -7091 -3809 -475 11868 7079 91 8373 17940 6492 4513 20750 16147 17395 17636 12734
3209 12734 14927 23741 33422 28388 23743 17220 6543 4919 152 -2439 -4466 -2695 3297 258
3195 258 -8541 -10984 4475 10350 10932 8091 6540 3247 2226 2432 3672 5555 2211 4484 4678 -4849
3179 -4849 -1736 12475 8586 9051 7981 4863 5447 6640 -431 -8905 -8933 176 19499 22681 18942
3164 18942 11610 12664 9619 1200 -11935 -19596 -4955 5737 7299 11388 15217 24664 23508 25522
3150 25522 24376 17970 21497 19922 7881 -1499 -6553 -5882 4765 9807 3507 6693 9933 9237 10321
3135 10321 5288 12570 13553 10453 -1262 -17061 -13746 -5358 290 9216 8478 3733 2299 -956 5789
3120 5789 -5119 -15503 -5992 -6524 -2425 10003 12388 13214 15005 2485 -565 -6127 -7379 -5782
3106 -5782 2790 5261 12870 12559 -2040 -7627 1138 7797 17481 18581 9548 -8641 -2835 10096
3092 10096 1732 -5568 -7686 -11865 -3364 6479 19664 26178 22335 19357 5414 11224 14583 6985
3078 6985 -6829 -18776 -12713 -7116 5942 6915 2790 -505 2921 9826 13796 20126 18638 14475
3064 14475 25718 36906 36729 31976 31162 23719 15183 12108 8164 7263 12509 14857 17991 15774 22313
3049 22313 15171 588 -5592 6896 21739 19647 16703 21043 14488 653 1771 2446 7570 5463
3035 5463 -10327 -15894 -11196 1454 -871 -2846 9979 7727 -2446 -10343 -18071 -25756 -17933 -7068
3021 -7068 -264 1135 3695 -3786 -3350 1349 4801 11511 12798 17845 18120 18495 12716 2715 8396
3006 8396 3943 2371 -7970 -10316 -10558 -5246 3404 7575 2743 15773 21956 31245 29992 31624 31264
2991 31264 32132 23670 14200 18559 7650 -75 -3463 -8782 -2743 2055 4385 9398 12460 13878 7640
2976 7640 356 6064 2601 -4874 -251 -1323 2338 -55 1620 -1563 -5444 4081 -3076 -14427 -12581
2961 -12581 -4724 -3589 -1788 393 14286 14976 10372 8853 7910 5852 5735 19911 20770 18354 27204
2946 27204 33481 26082 15806 -6492 -10277 4748 9538 5961 4277 7357 11273 11206 3307 -941
2932 -941 5310 8079 -16999 -29734 -21779 -6600 -7264 -12023 -6411 -4738 -12330 -15632 2366 24636
2918 24636 25734 3582 -9779 -1952 2613 11032 3742 -3636 1096 103 6435 9785 17449 13018
2904 13018 1781 7668 11609 19164 17828 9012 -941 -6208 1253 8487 11463 12615 16787 6046
2890 6046 1987 -10651 -8211 -722 614 -6580 -15810 -14856 -16920 -6998 7727 5565 -10837 -15272
2876 -15272 -20240 -15980 -8795 -4834 -12401 -25499 -22386 -3388 9563 9396 8760 7522 10405 14000
2862 14000 330 -3328 -9808 -18349 -22833 -18823 -6336 -6362 1837 8336 10064 1683 520 5129 -3640
2847 -3640 1915 112 -11171 -15662 -5272 6023 1624 -5183 -4432 -3211 12541 21366 16977 13008
2833 13008 -4028 -2522 -4679 9204 20368 66 -7923 918 1711 -7021 -17378 -17268 -16710 -4525
2819 -4525 -2238 1069 12552 22638 15971 8231 2377 9487 10125 6066 -3345 3058 -1378 -1097 -3835
2804 -3835 -4676 -4435 -3096 -7442 -13086 -6095 -8628 -9050 -10357 -3663 -2178 -7675 -1945 -503 2245 -791
2788 -791 -397 7035 8628 -2786 -12005 -8800 -13511 -7194 -9245 -9308 -11988 -12736 1206 7014 1394 -1499
2772 -1499 3410 7623 11926 8001 2008 11903 20185 17024 7555 2908 -2258 -3379 -3612 -11419 -17803
2757 -17803 -14988 -24926 -19844 -8015 407 -6534 -4806 -2303 4183 18892 33112 26841 15021 -5033
2743 -5033 -1512 4611 6797 6240 -7641 -13656 -13095 -5489 5211 5773 -6598 -18963 -17397 -8818 8960
2728 8960 14073 1028 -50 3760 -8337 -5725 6590 -6117 -14900 -13013 2029 7718 3348 -581
2714 -581 6000 1050 344 -2309 -238 -3037 2545 7646 7323 6407 1694 -250 13165 16051 16559 22961
2698 22961 16225 17372 4679 -9315 -5093 15044 18486 18230 18443 29560 27735 23157 22962 7156
2684 7156 2813 -1496 6202 8558 9781 13689 10765 11893 18045 8702 3671 -3172 -9349 -13733 -1209
2669 -1209 6854 11274 3973 6844 7135 2115 -4182 -1916 5560 3813 12252 21290 22345 16114 9696
2654 9696 2017 -15 -531 -9632 -10252 -5541 -12184 -18563 -21954 -11832 -5450 -7281 -6855 -7218 -9229 -5767
2638 -5767 -1846 641 269 7597 2064 7719 18453 11993 1277 3608 -2886 -5458 -7220 -5773 1385
2623 1385 2082 -3605 7213 7804 -152 14004 18107 19128 3881 -10456 -10794 -5506 3365 3306 -5150
2608 -5150 6679 10950 20873 22073 8190 -1318 -8958 -4167 11888 12977 11709 7508 9326 -164
2594 -164 -4749 -6259 -13920 -24764 -21501 -13302 -19887 -3541 15364 8317 11518 21973 15358 -5087
2580 -5087 1956 16032 15841 20134 18520 14622 10728 -3520 -6958 -7586 -14688 -11446 -1811 1700 -6914
2565 -6914 -16070 -16246 -14291 -11162 -3240 -15258 -13284 -8845 -8868 -7344 -1444 6631 12404 4399 7663
2550 7663 14942 17512 18592 15617 20859 16052 5623 7380 5535 -1007 -1266 11835 3695 -4932 -3288
2535 -3288 1291 -5608 -3616 -2119 -3147 7583 13838 5889 20 -4107 1166 -5486 -4191 -1490 2809
2520 2809 15542 1033 -3133 1822 9860 11508 5364 -3697 6431 10768 -3813 -6862 -2149 -5061
2506 -5061 1586 2058 4009 11911 14912 16360 7197 2497 7953 5420 -2692 -23385 -20068 -13304 -3778
2491 -3778 -16262 -26763 -20815 -12645 -8510 -19761 -33547 -31004 -16025 -6508 -6604 -9048 -10559 -6018
2477 -6018 3595 3284 10519 11970 13508 11689 14364 18028 17471 10368 -11725 -10804 -5161 3005 6517
2462 6517 10463 9308 3241 2462 7636 2967 -10457 3440 15901 14632 2902 -15613 -16569 -10094
2448 -10094 -8282 -11279 -10679 -13426 -16507 -10488 -8183 -5857 4449 6232 6617 1197 1018 -2669 4247
2433 4247 4864 18420 12814 60 -1405 8038 5403 13041 18948 28392 41891 43921 24773 15040
2419 15040 8191 -5814 -1219 -412 -5332 5792 5335 -5246 -91 6721 11565 15101 19014 11501
2405 11501 3826 -4376 -9040 -14646 -26832 -20005 -6651 -5362 -8754 -10208 -12323 -11277 -8478 -6663
2391 -6663 -9166 6235 6937 10028 13497 22958 26292 12187 10296 2336 -7421 -7467 -10148 -15346 -20709
2376 -20709 -10596 -3693 3390 -1239 -6289 -7785 20047 31312 23210 17659 11707 -6251 -11200 -507
2362 -507 6482 8991 -6515 -18905 -22845 -15237 -10346 -10706 -1493 2288 -2168 2081 -9818 -15628 -5085
2347 -5085 -2148 -7162 -16094 -20512 -8156 -2497 2847 -7114 -14192 -20495 -11996 -8376 -7910 -4792 7272
2332 7272 769 -9473 -725 1406 2753 4249 6940 928 3154 19432 19774 9110 1237 -4249
2318 -4249 2385 12544 21298 27222 22776 21921 27978 29858 22884 18844 20104 30426 18075 12660
2304 12660 18008 13427 15831 16392 906 -14501 -14582 -5205 9593 1686 -3338 6942 8662 6063
2290 6063 9346 5489 6888 9239 6372 1692 -6799 -19108 -22130 -12245 7783 4452 5868 -456
2276 -456 1573 -3250 548 10783 12858 9382 5081 4662 5458 -4053 -15747 -11495 -14227 -17960 -2370
2261 -2370 7655 6023 -3537 -14811 -21245 -24770 -25199 -17327 -12354 -7116 -10273 -636 10614 7604
2247 7604 1042 2018 16278 24239 21272 11311 -3253 -10244 -12677 -13976 -17106 -20105 -19763 -18903 -8413
2232 -8413 22 -2838 -16258 -3117 4776 -325 -4326 -4315 3600 7562 -793 -7410 -3071 17320 13471
2217 13471 12004 22154 23481 2052 -5851 -14732 -3097 5297 10222 14152 21281 16720 15001 11193
2203 11193 12114 8148 -825 -14540 -21411 -15019 -10053 -23429 -21029 -19787 -13007 -9495 -17171 -30115
2189 -30115 -21353 -8537 4197 9273 -2510 -22540 -8142 -11061 -18100 -13568 -1529 4900 -17231
2176 -17231 -26572 -13140 3580 4766 1456 11578 6906 -11143 -28049 -21748 -19558 -25680 -37354
2163 -37354 -30785 -19176 -10851 -6603 -3142 14875 16081 15939 8859 17853 15313 4097 9051 6083
2149 6083 -3347 -1319 -7001 -22098 -15441 -9405 -4753 -4835 -17868 -20408 -19464 -4823 6768 6861 6091
2134 6091 20140 11350 12537 15403 17555 10370 -400 -12972 -18505 -13367 -3258 -3465 -6550 -16671
2120 -16671 -11332 -5366 -338 -6256 -17163 -18915 -11808 -7736 1844 1632 5338 6671 5226 -1585 -12564
2105 -12564 -4943 135 6001 6005 3786 3971 5306 -2130 -10896 -9253 -13602 -13027 -11709 -4708 -1673 -3120
2089 -3120 7109 8749 7444 -12711 -27821 -31185 -21968 -15806 -25267 -18287 -7975 109 17260 7840
2075 7840 2756 -4318 -13809 -19596 -16225 -4190 423 1337 -107 1737 15276 15122 14499 11207 7558
2060 7558 5516 -1007 -2262 -2013 -18893 -10540 -8282 -7382 -725 -10343 -9748 -37 11096 14924 17318
2045 17318 18729 160 -6646 2164 7728 8502 9402 5664 -8645 -8837 -8053 4190 -1399 -13575 -12659
2030 -12659 -9212 -21187 -17639 138 3737 5035 1263 1994 2434 17210 9409 -241 5585 -1547
2016 -1547 -7679 -659 -4270 -16777 -14180 -3283 -3149 8640 12106 13871 -129 -5083 3835 8657
2002 8657 12203 17168 6350 6225 10306 8846 1635 748 -582 -684 7991 11682 3157 -6011 -6602 4750
1986 4750 4086 -10430 -17038 -12739 -3458 422 -8318 -6208 649 6922 10110 -1158 -7682 -7431 -18417
1971 -18417 -18740 -12795 -2654 -7711 -11543 -3702 -5926 -3982 -12409 -5759 -6349 -11266 7756 15816 15070
1956 15070 19949 16267 3047 -8970 -13958 -16135 -8651 -6555 10553 12866 23117 24415 12078
1943 12078 -6520 -12446 -12769 -1231 2495 10057 10688 4592 3023 17616 22271 9270 3589 1366
1929 1366 7265 11525 7348 -3541 -8125 -11519 -4868 -1935 -5429 -11696 -10498 -14498 -15981 -2234
1915 -2234 1887 6388 8220 9155 -516 -3052 17 10028 11974 6277 -951 -7007 -22721 -26001 -14178
1900 -14178 -10539 -13946 -17901 -11165 -11301 -10528 -17152 -25499 -10748 2513 -12892 -16814 -9815 -13355
1886 -13355 -11458 -697 2036 5524 19895 17108 6612 -2567 2433 6496 8577 18074 1308 -121
1872 -121 -3580 -6138 -4868 -82 4849 2139 8024 -195 -18285 -23068 -16661 -14728 -16860 -20168 -6735
1857 -6735 1494 4996 4195 2233 -5512 -11284 -1160 3311 -2296 -17092 -16689 -5123 -2800 1500 -4833
1842 -4833 1437 437 4011 -125 -1312 -8838 -6769 -1592 -1385 6819 4396 -4951 -16537 -11067 -2652
1827 -2652 1177 -2619 -723 16550 24363 12243 -7379 -20972 -17966 -13490 -17842 -16167 -13228 -8695
1813 -8695 -8180 -18919 -18544 -6509 889 2670 3407 -6463 -9534 -24665 -10151 1189 10613 3352
1799 3352 -1191 4622 19487 5870 5002 6476 16265 9538 2210 4034 -3068 -6768 1330 5298 -1943
1784 -1943 -13803 -15436 -4062 -741 2175 6163 13516 23830 21563 18328 25543 21750 4830 644
1770 644 1792 -7146 -8606 4965 76 -2532 -17103 -10876 -6009 6117 9651 -954 1926 536
1756 536 -9244 -17406 -17169 -5642 -3509 -11204 -12682 -2970 3542 -3052 -416 3620 -13425 -16087 -11123
1741 -11123 -271 9627 12725 4125 10215 13902 11270 7994 14043 16706 9713 8051 -4386 -3736
1727 -3736 7616 10054 4526 1425 5909 2145 -7556 -19455 -21229 -16829 -5803 -9371 -7133 -4075
1713 -4075 -5888 -13595 -10981 -8756 -9538 -4171 -1855 6575 25241 28092 14568 -7923 -9024 -7370
1699 -7370 -54 -7303 -15572 -21357 -23066 -21342 -17468 -1704 16185 17423 11698 10984 13091 16693 7994
1684 7994 3166 6604 7755 3215 -7404 2677 2134 -2860 -905 6325 6816 17750 28162 24950
1670 24950 17927 12293 3750 1909 -3790 -14047 -6129 6445 7094 2622 12200 14843 5367 3712
1656 3712 -4407 -11389 -11978 -4908 -5789 -13786 -12219 -14054 4413 5402 -15872 -23646 -15144 -18382 -15952
1641 -15952 -10796 -12945 -8115 -1491 4936 4074 -2664 -8434 -19383 -15449 -8493 -5711 -8218 -10800 -9166
1626 -9166 -1528 6074 -2670 -14845 -26430 -27316 -19245 -2126 15606 21039 33497 33285 13612 -4238
1612 -4238 -9719 -27872 -24498 -5334 -14228 -20524 -8082 -4852 -8089 -13943 -8550 -10809 -14014 -15380
1598 -15380 -12667 -16837 -14840 -18426 -18897 351 16837 9653 555 2256 2783 -10199 -14412 -3002
1584 -3002 -5983 -5166 5942 -2993 1030 3678 200 7962 15474 6250 694 -983 -8500 -14229 -9764
1569 -9764 -5284 -1497 626 -3132 -6421 -9493 -13660 -21457 -30860 -32452 -26078 -20706 -28603 -22251 -12932
1554 -12932 713 7691 6851 7789 4546 -2548 -6402 -6645 3432 2509 8297 -6373 -12483 -15555 -16882
1539 -16882 -8104 -11585 -13432 -5920 3463 121 375 4198 -822 -2478 -9263 -21157 -19708 -10660 -6399
1524 -6399 1060 14501 7251 5039 18252 28907 19754 6723 4948 4757 -1788 -9957 -13159 -18056
1510 -18056 -5536 -8289 814 11777 211 -1611 -9673 -15310 -10361 -7186 -7732 -12323 -1063 -2287
1496 -2287 -6583 2560 7727 7808 5949 13139 14085 5499 1857 -8472 -9734 -5462 -4769 -3797 2833 1082
1480 1082 14289 6302 -758 -480 -5309 -8444 -7494 -8959 -14350 -22087 -23129 -7817 7757 -14 -7070
1465 -7070 -10321 -3536 9401 7569 -2371 -2991 -3993 1035 3896 -752 11678 24483 8943 -4848
1451 -4848 -4593 -17387 -7186 6688 -3773 -9942 -438 2962 -4755 -1491 -7841 -14528 -3805 -9828
1437 -9828 -7878 -9543 -1303 1269 -9243 252 7051 3604 2523 20820 19715 7346 13829 13996
1423 13996 13412 3619 -6357 -16298 -22636 -17402 -11110 1176 9872 17225 20768 14718 4014 9030
1409 9030 1317 -15559 -29468 -26861 -24100 -19641 -15160 -4774 -5137 -13606 -27930 -27609 -13380 -11179
1395 -11179 -2052 -9289 7212 10880 -7158 -8889 -1079 3342 5373 8535 3376 -9052 -11503 -7911
1381 -7911 -4747 -9405 -9760 -7978 -17564 -10409 -3750 -457 998 -35 3227 1922 -2131 -4824 -2462
1366 -2462 7748 9401 -1220 -14430 -5901 -2951 3202 8635 -4006 -6342 -437 868 4718 4019
1352 4019 5294 1118 -3409 -13835 -22756 -20318 -6605 -3648 803 3489 6218 -4925 -13435 -6956
1338 -6956 -517 -9157 -3992 2625 991 -5328 -7631 -2066 6659 13225 7525 11742 19001 17380 4694
1323 4694 3127 1623 404 -2619 -6402 -11753 -16486 -15331 -9804 -15682 -21200 -16506 -15686 -10462 -2048
1308 -2048 -1572 -1169 -8511 -13233 -8366 -904 410 -14869 -13386 -12814 -7786 -3769 -2614 -7420 -3098
1293 -3098 5358 3612 -6162 -10236 -22493 -14608 -8903 -5019 4014 8312 9541 994 -4165 -18111
1279 -18111 -14982 -7674 -1986 -11923 -1701 1320 -4245 -17697 -18275 -5470 -3576 -8845 -12923 -6580
1265 -6580 7259 603 -10887 -9596 -663 -4671 -9359 -13726 -29919 -31650 -27088 -16728 -14049 -12225
1251 -12225 -5270 1018 -6942 -5072 -357 -8984 -7277 -9129 -10167 -23943 -17898 -6582 -18768 -24322
1237 -24322 -28122 -18907 -8128 -9395 -2789 -1095 1373 5032 10120 5984 9153 13610 6200 -4440
1223 -4440 -5028 1427 959 -6764 -6878 -1701 11540 5996 -478 -868 -2658 5680 2029 8536 7229 11833
1207 11833 11467 2302 -15124 -9075 -2111 -10589 -1540 -3272 -15762 -19786 -13743 -2348 -1051 -1459
1193 -1459 -3916 -1855 -5269 -13002 -17127 6000 2867 -6781 -5262 -4696 -11433 -15674 -27209 -23732 -26128
1178 -26128 -16123 -13364 -12736 -7754 -12561 -11057 -6217 -10953 -10894 -9127 -7310 6382 -335 -2426 -7748
1163 -7748 -13697 -18021 -16091 -17747 -19348 -24226 -25332 -18623 -18086 -16746 -16707 -20499 -18356 -19314 -17277 -8119
1147 -8119 -6352 -13550 -16682 -15028 -14714 -11613 -659 -9709 -17544 -20431 -17344 -6272 -12365 -4866 -4740
1132 -4740 -3769 4235 1671 -2647 -12491 -19919 -17968 -17029 -19889 -6520 -1586 -18013 -15954 -3486 -2912
1117 -2912 2255 4007 -552 -3335 -6039 -17190 -22244 -17363 -10080 -7243 48 1674 -3815 -4502 3807
1102 3807 10520 12466 20443 20702 14337 98 -17347 -1223 4286 1790 7425 6619 1237 -7206 -12286
1087 -12286 -5367 -4144 9540 14588 2258 -10392 -13442 -3672 1275 4795 1374 6008 20690 7810
1073 7810 -3524 -15382 -15094 -11280 307 1342 -586 4731 1346 -10689 3966 -6456 -8579 147
1059 147 11180 14188 10631 9606 2046 -3485 -1822 1118 -1558 2289 10227 13746 -579 -12546
1045 -12546 -6556 -1400 -2633 -5547 -15033 -9582 -5752 -11620 -4861 -3122 -1249 554 -4663 -12358 -4931
1030 -4931 1556 1189 -7540 -13794 -11094 -10026 -11989 -20791 -14743 -16127 -6954 -6131 -3239 -2990 -11295 -12943
1014 -12943 -11988 -16808 -22650 -17095 -7090 -17445 -19295 -12059 -10071 -16976 -23868 -19520 -16846 -12858
1000 -12858 -4407 -4547 -5735 -8310 -6321 -2185 -12474 -25290 -30309 -28775 -18715 -17575 -13336 -19115
986 -19115 -20000 -13864 3568 16038 4707 -9050 -18297 -16692 -12995 -4404 -1204 1553 -10742 -13402
972 -13402 -16807 -15517 -5249 -11049 3524 -8781 -20038 -15731 -13024 -929 1683 -5310 5046
959 5046 9432 16091 22149 22112 12732 14617 12830 -107 -969 5974 -4897 -13145 -7503 6986 16737
944 16737 16931 5894 7829 -6996 -7759 629 3245 -5300 -3406 7347 8905 7892 7624 5856 -5990
929 -5990 -6174 524 -8570 -14333 -27598 -18819 -8403 -1008 -2627 -2779 2629 -7483 -8400 -1677 -5519
914 -5519 -10995 -18695 -16637 -3236 2353 -3821 -6278 -9231 -9573 -11522 -9809 -2478 -11436 -13473 -16827
899 -16827 -14581 -7596 16 526 -10703 -20142 -23322 -16577 -22623 -24076 -25322 -18613 -15319 -16721 -17503
884 -17503 -4800 4466 13044 16190 12643 10624 3402 -11168 -2984 -6158 -12103 -15216 -20708 -19840 -20015
869 -20015 -13918 -13459 -11992 -8658 -5970 -17095 -24537 -20005 -17308 -18874 -7605 -7338 -14850 -12536 -17467
854 -17467 -17316 -15193 -11990 -17936 -7240 -2189 -6904 -17904 -29708 -22256 -22047 -1899 16489 -693
840 -693 3151 5718 1867 3289 6927 -6453 -16472 -7738 -6948 -2752 1291 -67 7139 -3138 -3699
825 -3699 -13124 -15630 -14026 -23851 -21743 -13047 8487 7150 -5746 251 12125 19788 8578 -6229
811 -6229 -8245 -244 103 -1888 932 -583 -4082 -15486 -16577 -6660 -3632 -9272 -9187 -4368 5099 2694
795 2694 2944 1518 1800 5791 7990 8111 7208 -389 4646 -4144 -5940 -15339 -17852 -15368 -4610 -4264
779 -4264 -10010 -13783 -8727 -12430 2757 13701 4597 -6894 -17018 -11898 12603 13380 10887 8114
765 8114 3077 -1183 2724 898 -9748 -13433 -3408 -5184 -4307 -598 -296 15224 18256 11766 4409
750 4409 4079 11243 25751 11819 -9028 -16429 -5562 4457 4040 -9806 -11827 2137 18312 3308
736 3308 -4080 -3794 1120 -9898 -11335 -9699 3391 10435 -4151 -880 367 -6918 -9075 -8314 -8256
721 -8256 -6252 -8371 -12578 -28397 -32754 -26537 -13645 -1349 6747 8433 18050 22750 5263 -3374
707 -3374 -4265 -5996 -1101 -3807 -3659 -10430 -5653 7357 7141 5147 1200 -2406 19149 32071 30526
692 30526 16393 11066 7689 12188 15867 12277 8695 8066 6538 820 -524 -93 -4456 4492 5738
677 5738 6698 9821 17596 11339 -119 -10591 -9194 -21119 -28907 -18722 -16404 -10625 -11576 -13522 -12856
662 -12856 -20492 -26744 -19493 -13776 -21205 -31843 -22116 -4786 3266 16298 26289 31889 18794 12827
648 12827 6113 7341 8429 7732 -812 -8775 1832 6211 11477 15196 -1629 -15619 -15083 -12369 -13310
633 -13310 -32332 -46592 -32221 -8081 5196 -1174 1644 -1508 2883 11087 19103 25323 25831 13520
619 13520 9959 6586 -1607 -7209 -2028 -1845 5120 6807 -2944 -6558 -3413 -21117 -42865 -38862 -18300
604 -18300 -3780 -5606 -13781 -25850 -19528 -12643 556 14712 22943 24956 15859 20653 3058 -9234
590 -9234 3316 4264 4550 -92 -8893 -12662 -6185 -541 5616 9388 5626 -3420 -230 6813 4820
575 4820 9675 21882 26312 18592 13858 -3519 -11133 -1061 -1239 -868 -15710 -17224 -13087 -19014 -16163
560 -16163 -7680 -1587 2555 -3563 -19329 -25298 -19443 -9650 -7877 -4389 1673 -7816 -13151 -4943 23331
545 23331 38509 44852 31645 4928 4961 7241 5335 8996 3669 -7877 -21569 -25833 -25643 -28857
531 -28857 -26145 -13286 -9253 -13241 -17181 -18882 -18437 -14427 -10220 -2254 4818 10150 5764 7104 3223
516 3223 1330 -173 -8868 -439 11292 11159 -5754 -17786 -5261 5326 15376 12481 -3088 2470
502 2470 1725 -5538 102 10526 6347 2778 198 -4391 -3123 2075 -10553 -11992 -5966 -2304 -5487
487 -5487 -5354 1629 356 7192 6851 3296 7468 11141 4236 6095 3263 -551 -2525 -3736 1626 19373
471 19373 10084 9987 4958 954 2177 -12581 -23687 -34602 -34793 -18839 -107 4306 3031 -719
457 -719 6490 12465 9185 1197 -198 -10899 -12997 -7532 -1274 -11676 -7359 2870 -1916 -13374
443 -13374 -10871 -10223 -7564 -4528 593 5057 3145 -12972 -15970 -10942 -18192 -10633 -3979 3207 3173
428 3173 -7723 -11188 -4381 721 1346 3130 536 -2713 227 -7897 -6360 -3482 -6405 -4388 -10793
413 -10793 -9398 5537 10604 12376 24144 13591 -7559 -15704 -13745 -78 12183 2768 -12247
400 -12247 -5719 4825 2578 1142 5389 2855 6715 7684 2995 -2204 1279 1327 -8202 -12996 -5098
385 -5098 -10565 -16579 -8920 -3195 -8051 -11595 -19678 -21744 -22172 -23395 -8257 9390 10439 11893 8477
370 8477 6208 -845 5171 8068 8681 2438 -9175 -7511 -4483 272 3267 -7707 -14112 -9416 -5251
355 -5251 5552 8321 -2999 -10321 -10419 217 9614 9496 -2631 -8179 -5653 -2214 7602 -885 -8798
340 -8798 -11467 -10457 -6778 -4140 -3900 -7974 -12082 -16524 -5979 -3144 4691 11992 16305 11538 10789
325 10789 3368 9846 13918 4622 -3788 -4955 -8519 -13155 -15789 -19800 -25607 -19015 -8704 -4514 -15843
310 -15843 -13673 -13637 -18273 -19514 -19958 -6439 3075 -9872 -13784 -8128 4639 13823 8862 2462 3755
295 3755 3205 8127 6858 3758 10150 16905 10871 5886 3073 4537 9116 14726 7504 -3895 -1909
280 -1909 4595 5513 -6542 -10865 -7332 -19174 -24487 -24370 -20442 -20982 -14563 -16394 -16088 -7644 -5636 -7034
264 -7034 -10219 -8651 -12634 -13860 495 8356 7068 7338 9517 24924 32755 23294 19250 6356 -5353
249 -5353 -9479 -6389 -6492 -16654 -27121 -28650 -22623 -9438 -4327 3302 4254 7001 11027 8878 6355
234 6355 8712 2165 -4427 -5156 -2147 -1542 -846 2872 -3319 145 -148 -6581 -7821 -9793 -12603 -10984
218 -10984 1906 -8146 -11515 -10832 -3550 8895 13238 19343 18894 12575 23923 10744 4413 -1924
204 -1924 2038 1293 -11548 -9529 -8545 -4935 -6070 -12220 -16261 -29176 -28839 -31596 -21543 -3570 -5487
189 -5487 3765 12476 17689 16361 12967 5205 -1379 -563 -2873 -11887 -13244 -13211 -8344 -6103 -3467 -1589
173 -1589 -2831 -2833 -6518 -9971 -4422 -988 -2731 -1064 -7846 -6210 2226 5400 1470 9436 8951 6654
157 6654 2658 3817 10052 8431 584 -1938 3091 8715 2100 -1446 -1956 -7985 -3729 -4398 -4955 -10225
141 -10225 -11996 -14100 -11676 -12191 -12626 -13568 -15228 -14026 -10358 -14488 -14742 -6797 -1166 4682 16292 13877
125 13877 4343 -2460 -8735 -11956 -2880 4067 -5521 2350 3098 -1135 -8248 -11933 -8094 -7136 -758
110 -758 -507 412 -2071 -13519 -25259 -23098 -16428 -16039 -14715 -28662 -22671 -14402 -13962 -13217 -15897 -14304
94 -14304 -12932 -5664 -5122 10721 16831 10730 5173 -3676 -8092 -13910 -5960 -2074 735 857 5289
79 5289 7866 3952 -1055 -9978 -6805 -7306 -26184 -44076 -34549 -18211 -9154 -6952 -5822 -5041 -5173
64 -5173 2949 2816 -340 2368 1425 2909 810 -489 3963 12047 5340 -1589 -5603 -5183 -953 1281
48 1281 -983 4692 -1318 -694 -4723 -9421 -8064 -1083 2178 -4429 -5550 -6688 -7720 -11125 -9357 -10183
32 -10183 -8124 -2756 -5547 -3918 -1849 -7938 -10439 -2570 -7193 -1591 -2631 5228 11118 8940 8172
17 8172 10231 12168 5245 -1942 -15599 -14450 -13047 -15479 -8863 599 4192 2958 6448 4652 -6192
2 -6192 -20372 -27424
0 -27424
$$ Imaginary data points
##PAGE= N=2
##DATA TABLE= (X++(I..I)), XYDATA
32767 -67924 -75870 -79010 -84940 -83880 -70882 -71914 -82144 -77081 -64339 -62171 -63407 -57665 -50591 -53393
32753 -53393 -50989 -43745 -46529 -36695 -37576 -40187 -39593 -32451 -39839 -44347 -32747 -31605 -32254 -33212 -37023
32738 -37023 -30459 -28100 -23693 -17645 -15444 -13542 -11649 -11102 -14054 -7593 1410 10871 21338 17995
32724 17995 11941 10762 8842 17575 19491 8732 9189 8476 19448 31157 41159 34078 30530 27936
32710 27936 23250 27438 26746 31673 43376 47481 49855 61140 66433 59337 62713 78025 80743 72168
32696 72168 77778 83022 76919 66575 70851 75101 81506 90246 90323 89242 94473 97407 88841 91114 94177
32681 94177 104101 113706 104285 99255 107814 107418 104248 111273 114406 114062 114743 116930 112685 113903 114164
32666 114164 111596 115115 121752 120476 128242 124291 127392 133525 136254 140425 139486 141908 146741 156383
32652 156383 161778 155153 149803 154769 152519 154131 164740 173756 172447 186560 188704 175360 176716
32639 176716 186565 182766 175419 181609 192335 197667 202297 202711 198673 198728 196946 198087 201128 207030 203935
32624 203935 203752 207521 211353 218855 220442 222470 226095 224030 223229 223120 221370 228864 244923 239262 239829
32609 239829 238894 239785 244397 250290 238420 233231 248877 261594 260312 254038 257454 269903 273954 275334
32595 275334 273242 265081 268967 262751 271647 271981 274012 278943 270871 261568 263707 274589 277754 282956
32581 282956 282461 274274 269669 271088 277569 301689 303594 299948 296861 296396 286462 284786 292682 288891
32567 288891 287038 290381 297384 286489 285313 285683 284856 297038 308270 324277 330346 333254 348403
32554 348403 338396 332600 331607 328275 319794 318435 329355 334890 332350 334049 338572 343268 349307 351531
32540 351531 355348 350289 365100 363207 357256 357968 369393 375692 371327 363910 366523 367702 352590 350114
32526 350114 358688 366316 379706 378148 374427 369074 377021 372008 379222 382448 380451 380597 380106 380494 393883
32511 393883 393039 377551 366358 370225 371868 383740 387256 390097 395385 400805 390648 397794 413494
32498 413494 423366 425220 423685 426043 423942 412487 413733 417883 419789 418916 430167 431444 431413 430060
32484 430060 427592 419407 420214 413346 415220 412963 410097 422138 421482 420091 418674 430737 436201 437668
32470 437668 438519 442584 447517 442609 440552 439851 422907 422771 415139 421590 430815 428534 436505 449750
32456 449750 448236 447859 458449 459539 459782 464446 466751 465951 463809 467484 477523 481988 473247 476094
32442 476094 482114 481465 489175 488636 489132 477935 469837 468609 460873 462549 468918 472379 464936 473728 473143
32427 473143 465225 468703 466947 475066 483450 484983 485284 483669 476451 463219 465917 477095 486529 493649
32413 493649 488062 487837 489958 492717 489142 498048 506642 509294 497277 491379 503344 510543 502657 501389
32399 501389 500407 503605 502868 497087 499681 503248 504350 503546 510341 515518 512091 517333 510834 503521 514302
32384 514302 528290 538923 534392 533462 521943 519301 513009 517371 524382 525395 524046 518877 524150 536616
32370 536616 545036 546383 551036 546140 538579 540571 532980 531351 530123 533795 531488 521465 525740 535523
32356 535523 537353 530965 532192 540214 539546 555118 555886 535733 527130 532053 546999 569018 573311 568475
32342 568475 568384 553714 553409 561313 567005 572514 556193 551082 539633 549145 562226 568794 555312 550054
32328 550054 544904 545988 546044 535912 529518 528822 523416 530022 541320 545786 548854 553391 561654 564364
32314 564364 562115 559087 556454 555100 554425 564981 569037 557709 553729 560636 559641 560199 566642 562755
32300 562755 550133 551909 552491 549888 560413 571528 571976 573626 575743 574346 578783 579255 586718 583731
32286 583731 587698 580481 572712 571156 576277 572780 575086 580032 575958 579052 582037 581415 581152 571382 570034
32271 570034 574351 576839 570974 558918 559544 557658 565518 571980 572903 581337 587077 577937 574004 569786
32257 569786 566512 567748 559364 555604 565824 576201 580987 587427 594983 584316 585052 595242 596157 601217
32243 601217 604754 588303 581568 585558 593005 587060 576199 576572 579406 582508 591043 590656 591306 588650
32229 588650 596658 594378 594595 590236 595254 594802 573452 554587 551524 567672 584693 587277 589205 593052
32215 593052 587726 581998 579790 574214 574748 584504 593787 595372 608851 601903 585925 587344 589464 590478
32201 590478 594355 584921 582195 595548 611488 614807 608243 589872 587508 585152 595739 598133 600646
32188 600646 599773 597549 594100 587911 586381 592378 593312 597139 595818 580580 575752 576000 585883 592915 591092
32173 591092 580222 584765 581537 579872 583234 578902 577017 583894 587489 582206 576751 579712 578585 574932
32159 574932 579858 593020 598541 602464 608709 604617 612772 610378 594420 589663 602028 603006 610832 617602
32145 617602 625382 625350 623138 621155 618014 615706 600366 585612 581724 584232 585835 592354 590937 587604
32131 587604 589691 592735 594783 591438 592713 603149 610052 610044 604840 594416 609985 604891 598056 593902
32117 593902 598317 604331 597685 593988 585524 591463 603279 597339 605428 608608 616084 616644 619870 615962
32103 615962 604983 603562 618833 622227 607742 593810 594090 604784 611113 624182 616709 628131 627512
32090 627512 616101 611457 606904 609133 615567 605863 598178 593578 592185 588059 595291 599583 601666 611164
32076 611164 614703 605469 599697 592721 600402 610019 603738 599871 611303 623709 611556 610745 614946 619650
32062 619650 606257 612005 625968 642118 625667 615895 614939 600134 592879 598880 598185 600685 602929
32049 602929 595927 602439 613169 610754 603668 603479 606362 620110 629671 611988 592558 590475 583208
32036 583208 586419 593452 593398 594214 594355 602834 603899 602777 608099 610860 617834 613217 603950 613601 611980
32021 611980 610120 624641 615315 600123 607498 618492 622318 619611 621969 638423 641010 631195 621435
32008 621435 617193 611487 616317 621744 629031 627323 620179 619386 622871 627491 623922 619759 613293 616392
31994 616392 613387 620779 629475 638200 637348 629490 614342 595813 593401 590071 592015 581373 566900
31981 566900 564710 574072 585189 593407 616061 620747 617401 619119 613092 611471 615294 612251 611857 620392
31967 620392 622362 622578 619960 630376 626134 610082 599637 597985 597119 596320 607569 622547 620843 613946
31953 613946 609508 596177 598408 614243 621929 618517 610890 615777 634799 639066 635270 636735 627587
31940 627587 613048 616832 620941 630288 624719 621764 609112 608134 606301 610699 615445 617024 626961 612884
31926 612884 603602 600557 606211 600416 605170 608909 614832 607182 609633 619469 626828 624505 622073 606912
31912 606912 614976 629171 631253 624320 616368 620868 606389 601489 607746 620820 627972 623636 626719
31899 626719 613316 605564 608131 620567 618001 621204 617466 617491 624208 640343 633126 618420 605700
31886 605700 594554 590875 594471 606190 605510 604032 599001 596666 595806 604529 611940 610927 608161 606191
31872 606191 613794 615892 611434 606209 606382 609312 618421 614339 599342 610300 618168 616936 616268 617954
31858 617954 601562 595613 597201 592967 593735 594973 602482 606383 607621 615917 618090 619714 617082 622213
31844 622213 624825 617881 607977 603460 613875 611531 615863 613961 612697 612634 607281 603243 606788 613711
31830 613711 614365 607610 609540 616839 615396 615372 616521 629337 632570 632079 614408 618540 611057 617810 616277
31815 616277 614907 610656 607223 608239 606359 615894 616881 606699 601510 611012 616942 624802 615194 609163
31801 609163 599491 603614 608167 616781 615513 608153 610017 616432 616178 618476 613018 600973 597165 604026
31787 604026 609269 615666 615177 621116 624117 620074 607163 604735 605817 608578 615320 628582 622912 603157
31773 603157 593424 598521 594654 602696 624473 630112 631216 630165 621955 610307 606571 614840 618322 628463
31759 628463 633359 628198 622981 605672 622012 628799 633968 636421 638245 634193 624559 615282 613144 623061
31745 623061 640863 644548 644042 630660 618802 609663 608682 614914 613257 614977 611167 598914 601243 600994
31731 600994 612810 609999 621144 624580 630305 628109 633808 623639 606607 621676 632740 625854 617885
31718 617885 616913 616900 622764 621085 620291 623801 624488 624041 619065 620148 622365 614279 602049 615514 613105
31703 613105 597057 596358 599657 605937 609328 613408 616261 607968 613385 620827 618333 607164 604310 615843
31689 615843 631741 642541 648367 648169 629985 605289 596380 599518 609833 606388 610306 615028 620036
31676 620036 629481 635214 619516 603435 630555 642904 623620 604525 614020 615900 608962 612024 617678
31663 617678 602794 607335 611258 620125 623305 608190 618155 623866 624004 613573 607057 623760 620611
31650 620611 613292 620936 618835 621151 624179 616213 617364 628144 631115 632153 629923 628833 628491 624556
31636 624556 625574 642038 642292 624554 605575 598439 596053 594111 597912 607963 620935 619160 624920
31623 624920 617106 614527 622516 619805 602393 604166 607902 615185 624931 626143 632056 628807 617888 606172
31609 606172 608183 613766 623272 627640 627696 621299 625509 631380 630847 623879 622237 617671 616596 622348 628177
31594 628177 619437 624191 623071 624866 640324 654177 641693 632438 628097 616277 613017 625513 623537
31581 623537 629956 635178 621355 620119 617004 611410 595721 600504 608840 617912 621292 619682 620199 606697
31567 606697 603603 618136 618571 614040 620825 631206 626430 612495 619022 637754 656353 650345 644008
31554 644008 631957 629004 644648 639768 648728 650640 642593 627273 627590 640608 654160 655501 637801
31541 637801 631002 628829 613450 610853 619169 617275 622570 624983 632637 632224 620522 614571 623440 633656
31527 633656 638046 629610 616220 613396 624505 628842 626379 625559 624343 645660 650657 638763 623090
31514 623090 626146 620899 622899 627996 628440 623237 626601 616927 613789 620591 634633 644194 633236 620925
31500 620925 619848 624318 631965 631845 630565 623490 625999 624565 616665 611248 618307 622047 612919 612530 629396
31485 629396 629464 634163 626994 629372 625990 615630 606692 598597 602864 611910 627285 632320 630989 630110
31471 630110 617739 614398 598455 604906 617107 611022 601380 608952 622481 617408 604003 609132 600630
31458 600630 594964 598362 604757 613005 620577 619486 610593 615117 621537 628202 628727 627903 627227 627024 618349
31443 618349 617677 628959 631956 643123 654418 659096 654692 644159 639021 640358 645660 652044 635236
31430 635236 626404 616270 624885 638831 648610 647210 631491 624991 634786 631732 625982 620668 620014 615035
31416 615035 621687 629912 638546 637283 637785 648075 630640 622245 616283 623827 646620 641430 638309 640377
31402 640377 655477 658412 655688 651914 644715 650981 656459 646842 636594 643051 637290 636830 644331 641848
31388 641848 641548 641006 640291 640066 634566 632506 639618 650159 641909 634760 622096 615570 617756 616131 620512
31373 620512 626436 627599 629607 629841 635397 636458 638679 623580 616330 622397 628793 630951 631409 638784
31359 638784 644174 628883 619093 614999 610055 617896 625966 636776 649009 651945 647721 634786 630699
31346 630699 629810 625821 629401 625261 610991 613879 621531 632167 629648 625008 627579 622750 627538 629388
31332 629388 631861 640003 647571 648213 634622 630017 624877 616858 632904 652457 651600 635315 629728 623250
31318 623250 622926 624389 626806 620159 617018 613855 612614 611492 617687 636484 637829 641844 640531 637602
31304 637602 633551 632093 626485 622856 631573 627507 624819 626562 628362 616086 602122 611216 624498
31291 624498 627511 622197 616091 598237 601344 609938 626283 629346 631475 637608 643477 643725 638200 625249
31277 625249 623221 627528 631806 622794 608468 611068 624826 631381 632064 626692 616028 618481 631588
31264 631588 625117 615689 619504 630662 625081 616800 608114 605845 609723 613671 618583 618890 627644 637574
31250 637574 644012 643747 634556 624712 636385 634787 632324 625004 617130 631927 637132 632619 644734 667581
31236 667581 661595 644649 625053 646515 653328 653197 646384 653901 651730 651213 644541 636388 627081 635703
31222 635703 651333 640563 622241 617892 635523 643730 638242 631090 616411 618333 624549 631061 645736
31209 645736 652872 658052 659427 656884 639964 628732 625526 630112 635007 647514 642068 639098 626197
31196 626197 633050 636400 649193 651355 638076 642834 639264 636932 630535 631656 626652 634716 649304
31183 649304 642214 629319 616093 621304 623096 632836 639565 643477 637871 625504 620673 621691 633402
31170 633402 642833 649776 636322 630810 642060 647560 627611 623205 636076 645548 647077 643069 637107
31157 637107 650230 647322 638951 631026 632006 628178 633670 635157 634556 630921 636083 646707 652265 649919
31143 649919 648192 642597 642639 640027 639087 644832 648176 663758 660938 644005 633516 636787 649099 647431
31129 647431 647721 639668 637077 642666 643285 629693 624634 635811 643282 631237 628106 642072 653323
31116 653323 648922 642382 640056 637265 637228 646913 646858 639074 639809 640546 633256 630410 644013 648575 648881 648217
31100 648217 651614 660283 662124 661578 655736 661132 662186 670146 655439 647053 656018 672977 674778 664607
31086 664607 661986 660737 655552 648592 647976 647409 646473 641008 632781 643127 643647 645077 649068 638886 636887
31071 636887 645686 656158 659329 650530 649482 647724 650506 651125 645559 633601 624312 623382 635648 638927
31057 638927 634161 641480 646076 636344 627260 633556 644529 646519 647753 645864 645918 643837 650035 649507 644568
31042 644568 643792 645336 637069 638091 637819 625758 623744 629426 630884 628019 638576 649001 658346 662515
31028 662515 656611 644000 635524 639043 647304 658970 659110 646045 637333 634812 636428 632307 627516 619767
31014 619767 631122 643602 639276 632990 638102 639405 638768 654009 642614 629878 639124 636217 624978
31001 624978 628210 627731 632330 646266 665264 655303 644578 625963 617753 625867 628612 635543 634361
30988 634361 629859 635783 640044 637749 640481 640253 645613 647642 653572 645698 638298 637524 630491 638290 638750
30973 638750 636844 630390 626647 628522 636323 641397 633187 636743 641240 640006 638571 638520 644370 643872 618123
30958 618123 621524 621507 610537 609012 614868 619932 628071 642056 655051 659100 656036 665076 650714 644407
30944 644407 638856 632626 635663 621591 624632 644792 649033 640265 625514 629968 643764 636776 628745
30931 628745 635205 651570 659597 647836 635274 636819 642134 652755 650393 657780 669724 671446 661316
30918 661316 634607 623174 628001 636442 648842 656079 649627 654012 655451 659657 656679 657676 653710 656793
30904 656793 660791 656396 634996 636505 643042 642640 648774 646398 641871 646136 657726 657162 657164 647210 649289
30889 649289 653335 652566 637858 639670 643080 641859 637483 636338 623923 630180 646927 660731 664576
30876 664576 663189 664144 662359 652147 650447 651108 652521 645295 640800 650002 654362 665936 672247 658639
30862 658639 655583 657417 654237 638527 640511 634710 637114 651552 656471 654470 649295 650422 649040 652881
30848 652881 655754 652721 649460 663953 673018 666349 647070 638510 637079 629447 630622 642195 653750
30835 653750 674982 684521 673771 659639 660973 657395 656394 643922 641137 636354 640322 632846 622971
30822 622971 629665 635816 651525 658921 658510 651586 638762 635856 645113 646973 644110 652044 663449 660925
30808 660925 651683 643539 634105 644662 646248 652202 655125 667131 678766 663007 660097 667499 665138
30795 665138 661079 649230 640384 635298 636584 634302 636691 647016 659834 670593 663457 652220 635407
30782 635407 631214 639306 644230 646711 653214 660871 659409 656423 664276 662019 637083 636732 644679 648007
30768 648007 641885 636704 648660 653490 654803 653651 659491 657495 658984 644895 640112 648047 643103 651133
30754 651133 648224 648562 649928 645158 639604 646836 650485 648115 646843 651333 660766 668365 671176 662675
30740 662675 659006 674329 668734 661253 664557 664770 657981 667350 659236 653979 653682 650281 643750 633338
30726 633338 635684 649101 644837 644674 631679 627073 647182 659104 648058 643008 640993 632010 623843
30713 623843 625536 637989 645455 644871 639368 633878 640706 640625 637282 641749 649448 637807 635044 645391
30699 645391 653023 655295 648080 635404 639978 640962 648510 665309 665247 653808 660139 654375 658500 660703
30685 660703 647254 643767 641280 642453 629734 625662 638400 641081 640545 634246 638807 644231 647262 652770
30671 652770 650039 644655 644488 637849 631739 648658 670675 666393 653799 649521 653245 648405 648695 654364
30657 654364 654385 660195 661460 657110 647467 643341 639973 633680 641639 647664 646287 648238 642529 641155 649572
30642 649572 663356 658568 666611 677247 676294 679624 671732 672917 663326 650030 655603 661472 655017 652318
30628 652318 642713 641150 650286 648668 647810 657476 670707 676268 674912 667992 671505 663113 646746 649921
30614 649921 650475 643047 658564 659400 650739 650182 651291 648223 664833 677445 680452 661272 655196 656417
30600 656417 653185 656826 666470 663447 668026 678940 686383 690288 696154 684690 677205 668412 667547 666535
30586 666535 657440 655758 665337 667280 667448 658601 657338 665272 659461 665049 664714 657921 648413 647024 654073
30571 654073 655282 649206 645736 643370 638049 639425 644359 648626 647401 650629 660850 655043 647058 642804
30557 642804 639605 636445 633082 629887 636352 646584 644673 645964 647106 653211 655934 662197 672414 667393
30543 667393 661615 659839 655672 668958 675725 676741 672203 662758 656854 652918 648825 651684 653762 641890
30529 641890 643935 650243 661095 655520 654372 654576 666187 672852 668726 672462 683708 685626 678822 665153
30515 665153 654131 664955 670452 665612 657297 646255 647605 653738 657305 671284 679729 670715 654518
30502 654518 665841 657290 653420 652987 647991 653435 648839 640683 644727 648427 654166 673307 681446 667312
30488 667312 670787 665512 666593 671056 666632 656228 641907 638650 640353 642854 644103 654598 663208
30475 663208 660079 654231 649175 658199 663351 657762 658502 657385 654458 649271 657093 666006 669811 672287
30461 672287 674907 671907 664706 677880 685872 688506 667986 667039 669832 673210 681949 684752 682653 665485
30447 665485 653610 661830 655207 646825 646648 649160 645069 644488 649998 649101 646585 643373 642376 636105 645662
30432 645662 647697 654585 674624 689494 685084 670979 668009 662867 672779 686959 679843 662457 665429
30419 665429 664818 659452 654480 656668 665288 662946 664992 654403 644622 654455 669271 659282 654262 649256
30405 649256 655318 667331 661057 651349 644584 644030 641201 631251 631149 638221 657814 662946 667532 667967
30391 667967 674849 684267 680825 665005 661818 675626 671113 677873 678875 668493 666067 671319 661577
30378 661577 662111 671261 682004 683631 685234 667485 655318 640291 644494 647015 645169 641300 649254
30365 649254 661405 657864 661094 662737 663356 662158 664991 665776 670495 672023 664497 667531 674910 678652
30351 678652 665192 659330 654725 659178 667252 670521 678325 682024 668688 662453 670463 683511 683222 672098
30337 672098 662903 664889 660228 669662 670788 674753 679113 674121 668996 651706 648976 645921 645484 662059
30323 662059 666339 662794 667081 670348 666086 669434 667762 657735 656373 661835 667520 669478 665527 664374
30309 664374 669918 670424 665402 664215 660885 657820 670537 672448 677248 676462 690955 680420 675795 676145
30295 676145 672677 668268 663367 667450 678880 675185 669103 669933 670518 666559 657710 663130 659860 661734
$$ [...]
##END NTUPLES=NMR SPECTRUM
##END=
