##TITLE=Analysis number 327326
Compound Code sb 02070
Project Code adrs
Chemist Name stores
##JCAMPDX= 6.0         $$ Bruker NMR JCAMP-DX V2.0
##DATA TYPE= NMR SPECTRUM
##DATA CLASS= NTUPLES
##ORIGIN= Bruker BioSpin GmbH
##OWNER= nmr
$$ XWIN-NMR		Version 3.5
$$ Wed Mar 21 12:35:16 2007 GMT Standard Time (UT+0h)  MAYBRIDGE\nmr@NMR_250MHZ
##.OBSERVE FREQUENCY= 250.131544655141
##.OBSERVE NUCLEUS= ^1H
##.ACQUISITION MODE= SIMULTANEOUS (DQD)
##.ACQUISITION SCHEME= undefined
##.AVERAGES= 16
##.DIGITISER RES= 18
##SPECTROMETER/DATA SYSTEM= dpx250
##.PULSE SEQUENCE= zg30
##.SOLVENT NAME= DMSO
##.SHIFT REFERENCE= (INTERNAL, DMSO, 0, 16.522)
##AUDIT TRAIL= $$ (NUMBER, WHEN, WHO, WHERE, WHAT)
$$ ##TITLE= Audit trail, XWIN-NMR		Version 3.5
$$ ##JCAMPDX= 5.01
$$ ##ORIGIN= Bruker BioSpin GmbH
$$ ##OWNER= nmr
$$ C:\u/data/dgb/nmr/ADRS/1440/pdata/1/auditp.txt
$$ ##AUDIT TRAIL=  $$ (NUMBER, WHEN, WHO, WHERE, WHAT)
(   1,<2007-03-21 12:34:52.19 +000>,<MAYBRIDGE\nmr>,<NMR_250MHZ>,
      <created by zg, POWCHK disabled, PULCHK disabled
       configuration hash MD5:
       49 4B E0 1D 92 C2 6B 37 9F E6 65 BC 52 41 86 1D
       data hash MD5: 64K
       00 A3 9A 23 88 FB C3 5D F2 77 CA 2A 90 D7 CD 92>)
(   2,<2007-03-21 12:35:07.60 +000>,<MAYBRIDGE\nmr>,<NMR_250MHZ>,
      <Start of raw data processing
       ef LB = 0.3 FT_mod = 6 PKNL = 1 SI = 32K 
       data hash MD5: 32K
       F9 8A CB 52 D2 81 45 48 90 51 22 03 68 4F 87 32>)
(   3,<2007-03-21 12:35:09.24 +000>,<MAYBRIDGE\nmr>,<NMR_250MHZ>,
      <apk 
       data hash MD5: 32K
       88 82 3B 86 37 BF 36 80 4F 82 0A 23 EB F5 96 B6>)
(   4,<2007-03-21 12:35:10.07 +000>,<MAYBRIDGE\nmr>,<NMR_250MHZ>,
      <abs ABSG = 5 
       data hash MD5: 32K
       FD 0C E5 F7 B0 CC DC F3 A6 BE F5 C6 25 CC FB E0>)
$$ ##END=
$$ 
$$ hash MD5
$$ 8B E2 16 09 1B C8 2D DA 58 50 03 BA C0 0C E0 8D
##$RELAX= 
##$RELAX= 
##$RELAX= 
##$RELAX= 
##$RELAX= 
##$RELAX= 
##$RELAX= 
$$ Bruker specific parameters
$$ --------------------------
##$DU= <C:\u>
##$EXPNO= 1440
##$NAME= <ADRS>
##$PROCNO= 1
##$TYPE= <nmr>
##$USER= <dgb>
##$AMP= (0..31)
100 100 100 100 100 100 100 100 100 100 100 100 100 100 100 100 100 100 
100 100 100 100 100 100 100 100 100 100 100 100 100 100 
##$AQSEQ= 0
##$AQ_mod= 3
##$AUNM= <au_zg>
##$AUTOPOS= <19 >
##$BF1= 250.13
##$BF2= 250.13
##$BF3= 250.13
##$BF4= 250.13
##$BF5= 500.13
##$BF6= 500.13
##$BF7= 500.13
##$BF8= 500.13
##$BYTORDA= 1
##$CFDGTYP= 0
##$CFRGTYP= 5
##$CHEMSTR= <none>
##$CNST= (0..31)
1 1 145 1 1 1 1 1 1 1 1 1 1 1 1 1 1 1 1 1 1 1 1 1 1 1 1 1 1 1 1 1 
##$CPDPRG= <>
##$CPDPRG1= <>
##$CPDPRG2= <>
##$CPDPRG3= <>
##$CPDPRG4= <mlev>
##$CPDPRG5= <mlev>
##$CPDPRG6= <mlev>
##$CPDPRG7= <mlev>
##$CPDPRG8= <mlev>
##$CPDPRGB= <>
##$CPDPRGT= <>
##$D= (0..31)
0 1 0 0 0 0 0 0 0 0.06 0 0 0 0 0 0 0.0002 0 0 0 0 0 0 0 0 0 0 0 0 0 0 
0 
##$DATE= 1174480490
##$DBL= (0..7)
120 120 120 120 120 120 120 120 
##$DBP= (0..7)
150 150 150 150 150 150 150 150 
##$DBP07= 0
##$DBPNAM0= <>
##$DBPNAM1= <>
##$DBPNAM2= <>
##$DBPNAM3= <>
$$ [...]
##$SUBNAM6= <"">
##$SUBNAM7= <"">
##$SUBNAM8= <"">
##$SUBNAM9= <"">
##$SW= 20.6930455092707
##$SWIBOX= (0..15)
0 0 3 0 0 0 0 0 0 0 0 0 0 0 0 0 
##$SW_h= 5175.983436853
##$TD= 65536
##$TD0= 1
##$TE= 683.16
##$TE2= 300
##$TE3= 300
##$TEG= 300
##$TL= (0..7)
0 120 120 120 120 120 120 120 
##$TP= (0..7)
150 150 150 150 150 150 150 150 
##$TP07= 0
##$TPNAME0= <>
##$TPNAME1= <>
##$TPNAME2= <>
##$TPNAME3= <>
##$TPNAME4= <>
##$TPNAME5= <>
##$TPNAME6= <>
##$TPNAME7= <>
##$TPOAL= (0..7)
0.5 0.5 0.5 0.5 0.5 0.5 0.5 0.5 
##$TPOFFS= (0..7)
0 0 0 0 0 0 0 0 
##$TUNHIN= 0
##$TUNHOUT= 0
##$TUNXOUT= 0
##$USERA1= <user>
##$USERA2= <user>
##$USERA3= <user>
##$USERA4= <user>
##$USERA5= <user>
##$V9= 5
##$VALIST= <valist>
##$VCLIST= <CCCCCCCCCCCCCCC>
##$VD= 0
##$VDLIST= <DDDDDDDDDDDDDDD>
##$VPLIST= <PPPPPPPPPPPPPPP>
##$VTLIST= <TTTTTTTTTTTTTTT>
##$WBST= 1024
##$WBSW= 4
##$XGAIN= (0..3)
0 0 0 0 
##$XL= 0
##$YL= 0
##$YMAX_a= 538786
##$YMIN_a= -495822
##$ZGOPTNS= <>
##$ZL1= 120
##$ZL2= 120
##$ZL3= 120
##$ZL4= 120
##$ABSF1= 16.522
##$ABSF2= -4.171173
##$ABSG= 5
##$ABSL= 3
##$ALPHA= 0
##$AQORDER= 0
##$ASSFAC= 0
##$ASSFACI= 0
##$ASSFACX= 0
##$ASSWID= 0
##$AUNMP= <proc_1d>
##$AZFE= 0.1
##$AZFW= 0.1
##$BCFW= 0
##$BC_mod= 0
##$BYTORDP= 0
##$COROFFS= 0
##$CY= 12.5
##$DATMOD= 1
##$DC= 0
##$DFILT= <>
##$DTYPP= 0
##$F1P= 14.0000005364418
##$F2P= -0.99999901652339
##$FCOR= 0.5
##$FTSIZE= 32768
##$FT_mod= 6
##$GAMMA= 0
##$GB= 0
##$INTBC= 1
##$INTSCL= 1
##$ISEN= 128
##$LB= 0.3
##$LEV0= 0
##$LPBIN= 0
##$MAXI= 10000
##$MC2= 0
##$MEAN= 0
##$ME_mod= 0
##$MI= 0
##$NCOEF= 0
##$NC_proc= -3
##$NLEV= 6
##$NOISF1= 0
##$NOISF2= 0
##$NSP= 0
##$NTH_PI= 0
##$NZP= 0
##$OFFSET= 16.522
##$PC= 1
##$PHC0= 223.3385
##$PHC1= 5.12747
##$PH_mod= 1
##$PKNL= yes
##$PPARMOD= 0
##$PSCAL= 4
##$PSIGN= 0
##$REVERSE= no
##$SF= 250.13
##$SI= 32768
##$SIGF1= 0
##$SIGF2= 0
##$SINO= 400
##$SIOLD= 32768
##$SREGLST= <1H.DMSO>
##$SSB= 0
##$STSI= 32768
##$STSR= 0
##$SW_p= 5175.98343685301
##$SYMM= 0
##$S_DEV= 0
##$TDeff= 65536
##$TDoff= 0
##$TI= <Analysis number 999999
Compound Code 99
Book Reference 9
Project Code 9>
##$TILT= no
##$TM1= 0
##$TM2= 0
##$TOPLEV= 0
##$USERP1= <user>
##$USERP2= <user>
##$USERP3= <user>
##$USERP4= <user>
##$USERP5= <user>
##$WDW= 1
##$XDIM= 32768
##$YMAX_p= 513690425
##$YMIN_p= -150170
$$ End of Bruker specific parameters
$$ ---------------------------------
##NTUPLES= NMR SPECTRUM
##VAR_NAME=  FREQUENCY,     SPECTRUM/REAL,   SPECTRUM/IMAG
##SYMBOL=    X,             R,               I
##VAR_TYPE=  INDEPENDENT,   DEPENDENT,       DEPENDENT
##VAR_FORM=  AFFN,          ASDF,            ASDF
##VAR_DIM=   32768,         32768,           32768
##UNITS=     HZ,            ARBITRARY UNITS, ARBITRARY UNITS
##FACTOR=    0.157963299565203, 1,           1
##FIRST=     4132.6476996994, 0,             0
##LAST=      -1043.33573715361, 0,           0
##MIN=       -1043.33573715361, -150170,     0
##MAX=       4132.6476996994, 513690425,     0
$$ Real data points
##PAGE= N=1
##DATA TABLE= (X++(R..R)), XYDATA
$$ [...]
15086A5207o913m605j5971r388Q567j2867j910J1902R851N620J022K836o070J6597
15072A3878m10q193M251j1087q116P21N221j6634k129k049K951R567J3185O663
15058G819l123j3396n829J1554M316k375l766J726K1597J981r801k1319m703P809
15044g510l708m509P075J8789M057n942J5252J489p890m018L390J854l450j3091
15030A788m591J387L850O633j908m447J805J8333R555l264p083q076J1833M404
15016C0219m868j3287n253P80J4691K086q438J930r183k202n564M219J983j410
15002E703N543m735k452P938M982j339r305P548M889q934K601j8219o059o78J8420
14987E903J2989n250K777q178o262l73r808l625P141J479L9l504j1314P378P488
$$ plain form
15086 15207 8294 3689 -12282 -21670 -13103 -25970 -27880 -15978 -6127 -507 515 3351 -2719 13878
15072 13878 13468 5275 9526 -1561 -9677 -8956 -3735 -20369 -22498 -24547 -21596 -12029 1156 7819
15058 7819 4696 -8700 -14529 -2975 1341 -1034 -4800 -3074 18523 20504 10703 -10616 -15319 -7510
15044 -7510 -11218 -15727 -8652 10137 14194 8252 23504 24993 17103 13085 16475 18329 14879 1788
15030 1788 -2803 -1416 2434 9067 7159 2712 4517 22850 32405 29141 22058 13982 25815 30219
15016 30219 25351 12064 6811 7591 22282 24368 15930 17860 8677 6475 911 5130 7113 5703
15002 5703 11246 6511 4059 11997 16979 15640 6335 13883 18772 9838 12439 -5780 -11839 -12517 5903
14987 5903 18892 13642 16419 8241 1979 1606 -8202 -11827 -4686 -3207 -3168 -6672 -17986 -10608 -3120
14972c120N871j1218n353m915r999Q438n997N233J880r921K234J1002L064O257
14958f544J0972j961r103m870n649Q600J4385m620q809j840j3087n082N729M77
14944b1402n178J1536R312M340M443j403r225K838Q492K561K313j6676j5909N829
14930a8129R380M32J9710K528n242j1916k080n709p463P750K626n991j807K252
14916a3659o570j0637l89J9361P831O165j0258N17O527p332q218M559Q806r310
14902a2607k645J216j0745o647P407k078O514K415O68R63n917q567K0241M333
14888e449j2476k639o701j6702l280J3388J9508J501j41Q404j1714L924O002J990
14874d385n810J0937L988J2465j5409r255j5659O448J3599Q656j857r608J483
$$ plain form
14972 -3120 2751 -8467 -13820 -18735 -28734 -20296 -26293 -21060 -19180 -29101 -26867 -15865 -12801 -6544
14958 -6544 4428 2467 -6636 -11506 -17155 -8555 5830 1210 -7599 -9439 -22526 -27608 -21879 -21402
14944 -21402 -26580 -15044 -5732 -1392 3051 1648 -7577 -4739 3753 6314 8627 -8049 -23958 -18129
14930 -18129 -8749 -8317 11393 13921 8679 -3237 -5317 -11026 -18489 -10739 -8113 -14104 -15911 -13659
14916 -13659 -20229 -30866 -31255 -11894 -4063 2102 -8156 -7639 -1112 -8444 -16662 -12103 -3297 -12607
14902 -12607 -15252 -14036 -24781 -31428 -24021 -26099 -19585 -17170 -16502 -15539 -21456 -30023 -9782 -5449
14888 -5449 -17925 -20564 -27265 -43967 -47247 -33859 -14351 -12850 -12991 -4587 -16301 -12377 -6375 -4385
14874 -4385 -10195 742 4730 17195 1786 -7469 -23128 -16680 -3081 5575 3718 -5890 -4407
14861d407o806j0089J0254R983j5359j1943J3725M417K454J0290J605o370r843
14848a2089Q651m414m332m422n157R15O080L230L937J545l585j1263J1350O496
14834c058J0939J0636J3065r377j1810p86k0918o329M001K027j7377q521j124
14821c8632K807J2487J0509j702K945J6371M459J1836M838j0138j900P249r881
14808A1248j4573j0356j067O637N169n201M136k739r742Q358J7826O102j2485
14795C313J170J727P688p72J663M518m041j0233j3451j3110k755M586J1283J1240
14781B826k03p669p978J0414l058q36q515m380J3125P704L950n544l814K04q117
14766a1891n647J1441J1469l274L38n346L368r92j0944l553J0041P026n63j0293
$$ plain form
14861 -4407 -11213 -21302 -11048 -1065 -16424 -28367 -14642 -10225 -7771 2519 4124 -2246 -12089
14848 -12089 -3438 -7852 -12184 -16606 -21763 -20848 -14768 -11538 -7601 -6056 -9641 -20904 -9554 -3058
14834 -3058 7881 18517 31582 22205 10395 9609 -11309 -17638 -13637 -11610 -28987 -37508 -38632
14821 -38632 -35825 -23338 -12829 -14531 -11586 4785 9244 21080 25918 15780 13880 21129 11248
14808 11248 -3325 -13681 -14748 -8111 -2942 -8143 -4007 -6746 -16488 -8130 9696 15798 3313
14795 3313 4483 6210 13898 13126 14789 19307 15266 5033 -8418 -21528 -24283 -19697 -8414 2826
14781 2826 2623 -5046 -13024 -2610 -5668 -6504 -15019 -19399 -6274 1430 5380 -164 -3978 -3774 -11891
14766 -11891 -17538 -6097 5372 2098 2436 -2910 458 -534 -11478 -15031 -4990 2036 1473 -8820
14752h820k709j223K924k522j235l104k504J5535q736P393J7094m373j0998J155
14738b123k801o447J02M431J1962k785M820P098M346n960j0257J2675J543j0789
14724E815q034P29K5n280J481J9482l608j4173J154l327R249P950M89n270o53
14709F029o501M314L618K535O780n980j4837J191O165j4210k139K209P487j075
14695d414j7002O234J2449l962O285l709o372o3O032n105K778q867o864J0008
14681a2572M658n358j1706O838J5299Q180m010P658j5234k955P164m894p558p972
14667b2462M516M387j164j2859J4717m444M895Q251p901J024Q775o75q658m119
14653a5717K682Q807J7205q92k0256k525J2210J4495p477k0101J300J0600M415
$$ plain form
14752 -8820 -11529 -12752 -9828 -12350 -13585 -16689 -19193 -3658 -12394 -5001 12093 7720 -3278 -2123
14738 -2123 -4924 -11371 -11269 -6838 5124 2339 7159 14257 18603 12643 2386 15061 16604 5815
14724 5815 -2219 -1490 -1465 -6745 -5264 14218 10610 -3563 -2409 -5736 3513 11463 11952 6682 6029
14709 6029 -472 3842 7460 9995 16775 10795 -4042 -2851 3314 -10896 -13035 -10826 -3339 -4414
14695 -4414 -21416 -15182 -2733 -6695 -410 -4119 -10491 -10554 -4522 -9627 -6849 -15716 -22580 -12572
14681 -12572 -7914 -13272 -24978 -18140 -2841 5339 1329 8987 -6247 -9202 -2038 -6932 -14490 -22462
14667 -22462 -17946 -13559 -14723 -27582 -12865 -17309 -12414 -4163 -12064 -11040 -2265 -2940 -11598 -15717
14653 -15717 -13035 -4228 12977 12085 -8171 -10696 1514 16009 8532 -11569 -10269 331 4746
14640D746R170J884j0881O757j079l492q020J2101J3122J1218l875j2224k612
14627A6815n492n588J102K142n305j1785p071o469O414O323N968Q40k158q772
14613a3036j4025M392P155q6L836j46j1183n70l726j69M490L915M396K480m261
14598a6538n015O650K2595M666o243J959n162r924k530Q850R224j2841j1606L076
14584a2839J3096M816p784q323q239l689M083R397N75j0709L975J4313J2915p592
14570C995j2956n08P512L056k641j9217m202J5792J0963j3l412k643O626n289
14556b937k3322n432R697R117j151j482P549N620p322q923p64N799m926J4670
14542c807J8243l50k0992j232j988m785O228J042K689j037L596L436l940j689
$$ plain form
14640 4746 13916 15800 4919 11676 10597 7105 -915 11186 24308 35526 31651 19427 16815
14627 16815 11323 5735 6837 8979 3674 -8111 -15182 -21651 -15237 -8914 -2946 -2106 -4264 -13036
14613 -13036 -27061 -22669 -15514 -15600 -11764 -11910 -23093 -23663 -27389 -27558 -23068 -19153 -14757 -12277 -16538
14598 -16538 -21553 -14903 7692 12358 6115 8074 2912 -7012 -9542 -692 8532 -4309 -15915 -12839
14584 -12839 257 5073 -2711 -11034 -19273 -22962 -18879 -9482 -8907 -19616 -15641 -1328 11587 3995
14570 3995 -8961 -9469 -1957 1099 -1542 -20759 -24961 -9169 1794 1781 -1631 -4274 2352 -2937
14556 -2937 -26259 -31691 -21994 -12877 -14028 -15510 -7961 -2341 -9663 -18586 -19350 -13551 -18477 -3807
14542 -3807 14436 14086 -6906 -8138 -10126 -14911 -8683 -7641 -4952 -5989 -2393 1043 -2897 -4586
14528d586N859p48n468r090q83J1526P290J1219k665n960p356N406J668Q29L352
14513A0393N393m331j4380r601O990J0933J922r598r342j444K168Q170K917k967
14499b777m943n476q311J6352J5304Q733M420k578p109l920l676j767Q07J0564
14485A5623J704k1352r012M260l542O165J823J8579K1560M530k0271r318n258
14472E491p151o831L299N735Q737n293O212j948L4K932J1459J492k7246j5263
14458a8341n289J1486J4389r04n364j0272K1912N356m245J0424j4322j1918J702
14445e386M240J0583q017j2775J088r962P870M549L803J8580Q632j483j492j6699
14431C531j5168J0734m331p62l036L999M409L883O566r245p192M42M170J0649
$$ plain form
14528 -4586 1273 525 -4943 -14033 -14916 -3390 3900 15119 12454 6494 -862 4544 6212 7041 10393
14513 10393 15786 11455 -2925 -12526 -5536 5397 7319 -2279 -11621 -13065 -10897 -2727 190 -2777
14499 -2777 -7720 -13196 -21507 -5155 10149 18882 23302 20724 13615 9695 6019 4252 5059 15623
14485 15623 17327 -4025 -13037 -8777 -12319 -6154 -4331 14248 35808 40338 20067 10749 5491
14472 5491 -1660 -8491 -5192 543 9280 3987 10199 8251 8285 11217 22676 24168 -3078 -18341
14458 -18341 -23630 -12144 2245 1341 -4023 -14295 7617 12973 8728 19152 4830 -7088 -5386
14445 -5386 -1146 9437 1420 -11355 -10267 -20229 -12359 -7810 -4007 14573 23205 21722 20230 3531
14431 3531 -11637 -903 -5234 -5996 -9032 -5033 -624 3259 9825 580 -6612 -6170 -2000 8649
14417H649l421J721l649k804L67j1130N499M261P030P505P32P59j0126J3079L575
14402B2047j9566j3735j046Q180M437J633P725R75k452l021J9083o883n415L568
14388A5530J958k900m583l475J060K985o895p060j0303q815O2O197J1244O156
14374A161l193N591O225q958r051n015M053n4o309N267J895j0039n803L899k052
14359b2383n069j22J4427m866j343R335j0584L901J283l690k031Q524Q4k72M702
14344h104k705M824k609n748j91J133J6621P058r106K281J2334j3470m083j5723
14330a7488N970M406j470m091k396P344J0662j3662j0065k276l70R586P842P94
14316e214p444j3183O533K1493r074r905N149l551Q701j817Q851M774K754o723
$$ plain form
14417 8649 5228 6949 3300 496 863 -10267 -4768 -507 6523 14028 14760 15519 5393 18472 22047
14402 22047 2481 -11254 -12300 -4120 317 1950 9675 10650 8198 5177 24260 17377 11962 15530
14388 15530 17488 14588 10005 6530 7590 10575 3680 -3380 -13683 -22498 -22436 -16239 -4995 1161
14374 1161 -2032 3559 9784 826 -8225 -13240 -9187 -9241 -15550 -10283 -8388 -18427 -24230 -20331 -22383
14359 -22383 -27452 -27574 -13147 -18013 -19356 -10021 -20605 -16704 -15421 -19111 -21142 -12618 -12534 -12806 -8104
14344 -8104 -10809 -5985 -8594 -14342 -14533 -13400 3221 10279 1173 3454 15788 2318 -1765 -17488
14330 -17488 -11518 -7112 -8582 -12673 -15069 -7725 2937 -10725 -20790 -23066 -23436 -13850 -6008 -5214
14316 -5214 -12658 -25841 -19308 2185 -6889 -16794 -11645 -15196 -6495 -8312 539 5313 8067 1344
14302A344j164p075j2952m267r091o036M276P430J6341K5186M007r651r494p89
14288a935r238j0024Q992j455M251O714n495n372p235O064l026L392l971M956
14274a3382Q695R537o975m278r357j407r23L053P605L967Q546j1672l096o310
14260a5997j2739O179N898j906N966R004J522q502j819J935M520j856R785M962
14246F952J07q042j5078N226L851m939p806j6416q016K494J1986J9440Q937P41
14232e63L880l794K602K882K980L956n116l339l845j1487L332p426k321J4975
14218c284M968L727O302J186o880k804L717R12p539n374J098J987j207J3145p68
14203I186j4146k1523J0274J6973o90n988p814n597J676q463P802J9177j0129
$$ plain form
14302 1344 180 -6895 -19847 -24114 -33205 -39241 -34965 -27535 -11194 13992 17999 8348 -1146 -1935
14288 -1935 -11173 -21197 -12205 -13660 -9409 -2695 -8190 -13562 -20797 -14733 -17759 -14367 -18338 -13382
14274 -13382 -4687 4850 -2125 -6403 -15760 -17167 -18090 -15037 -7432 -3465 5081 -6591 -9687 -15997
14260 -15997 -28736 -22557 -16659 -18565 -12599 -3595 -2073 -10575 -12394 -10459 -5939 -7795 1990 6952
14246 6952 7059 -983 -16061 -10835 -6984 -11923 -19729 -36145 -44161 -41667 -29681 -10241 -1304 -563
14232 -563 3317 -477 2125 5007 7987 11943 6827 3488 -357 -11844 -8512 -15938 -18259 -3284
14218 -3284 1684 5411 11713 12899 6019 3215 6932 7844 305 -5069 -3971 -1984 -3191 9954 9186
14203 9186 -4960 -26483 -16209 764 74 -5914 -13728 -19325 -17649 -26112 -18310 867 -9262
14190i262q882n176R863P38M810K150m093o344J581Q352N475j0451m900J4894
14176a245O28k243N570o335j826p74L567R1L611N607l731q257j4061j0251j285
14161c0934J4851K074J6704o884O005k801k3669R58J3122N251J4069o751k05R691
14147A1481O598p987n076K776k321q572o118J2N965O612J0146M389j1403l575
14133B927r065j3460n084j0617K894J6658o050q553J7851J3367k353R95Q200Q704
14119A6414J329n624l581r542r21N126k118J1461j1506k864N980n754k723M245
14105g8o663P979J2107J861M780m449q316m929j341m556j3624M096O021J864Q691
14090C443O257M042j2536j9772l911J121p957j5549k924L212K0420L403j323j113
$$ plain form
14190 -9262 -18144 -23320 -13457 -12719 -7909 -5759 -9852 -16196 -14615 -6263 -788 -11239 -16139 -1245
14176 -1245 -617 -2860 2710 -3625 -5451 -6225 -2658 -2567 1044 6651 2920 -5337 -19398 -29649 -30934
14161 -30934 -16083 -14009 2695 -4189 1816 -985 -24654 -23696 -10574 -5323 8746 1995 1790 11481
14147 11481 18079 10092 5016 7792 5471 -3101 -9219 -9207 -3242 3370 13516 17905 6502 2927
14133 2927 -6138 -19598 -24682 -35299 -32405 -15747 -21797 -30350 -12499 868 -1485 -490 7710 16414
14119 16414 17743 12119 8538 -1004 -1925 3201 1083 12544 1038 -1826 4154 -1600 -4323 -78
14105 -78 -6741 1238 13345 15206 19986 15537 7221 2292 951 -3605 -17229 -13133 -7112 -5248 3443
14090 3443 9700 13742 1206 -18566 -22477 -21356 -29313 -44862 -47786 -44574 -24154 -20751 -22074 -23187
14076b3187R996N835L150j1006j3803o788N117J1442Q984N064J3893R714O490
14063B4901j4465j0130P743J2282k34j1784P804Q100m180j0015p252j3731P103
14050c858J5144l451m785r418j440j0788J1057J4237R461j2663j3950J7223J663
14037H432j0510k0220j197k290J8190k699K173j32K8N546j093o370n057N414j1823
14022b1608o149N998O349L803j207O677j88Q660l043L609k864o917N634k456k609
14007f311j3556P14Q472m105P399J2744k054n583k6668l074J1467K1038L231o833
13993c119r068M621K174p541J316j179O174J7461J0505J0q92K022j5382j6386
13979i284j1139J096P702J594q826O671J5426P046J793l134l226j008p101N655
$$ plain form
14076 -23187 -13191 -7356 -4206 -15212 -29015 -35803 -30686 -19244 -10260 -5196 8697 18411 24901
14063 24901 10436 306 8049 20331 20097 8313 16117 24217 20037 10022 2770 -10961 -3858
14050 -3858 11286 7835 3050 -6368 -7808 -18596 -7539 6698 16159 3496 -10454 6769 8432
14037 8432 -2078 -22298 -23495 -25785 -7595 -10294 -8121 -8253 -8225 -2679 -3772 -10142 -15199 -9785 -21608
14022 -21608 -27757 -21759 -15410 -11607 -12814 -6137 -6325 2335 -708 2901 37 -6880 -1246 -3702 -6311
14007 -6311 -19867 -19153 -10681 -14786 -7387 5357 3303 -2280 -28948 -32022 -20555 483 3714 -3119
13993 -3119 -12187 -7566 -5392 -12933 -11617 -12796 -6622 10839 21344 21354 20462 22484 7102 -9284
13979 -9284 -20423 -19327 -11625 -10031 -18857 -12186 3240 10286 12079 8945 5719 4711 -2390 3265
13965C265n08P781N585q152M331R005M525n819k2694k0180j1207J4073J2315Q03
13951f877K983r227O067M673N91o323J5877M265j6758n183O494J554j1162j114
13937a4140K950P122r370Q557P450L484n662o361q267p600k501L741P653n03J779
13922a1668j4132j388R123K2175k547l024j2873j3794l738O589J625Q738k859
13909a7773L431O712R105P637J523j139j9396j0044Q542j292P570j4251j964o353
13895b7692J11J8831J2274j398o766n314j0904N088J0555N276j3315p999O580
13882a4673n193n310J678O522L10k662j481P871k757J240M334J1599k474j3936
13868a4932p621J4856n908j686n143j3449p879k40o099j567J5744P979J5460J1537
$$ plain form
13965 3265 2757 10538 16123 7971 12302 21307 25832 20013 -2681 -22861 -34068 -19995 -7680 -6877
13951 -6877 -3894 -13121 -7054 -2381 -1790 -8113 7764 12029 -4729 -9912 -3418 -1864 -13026 -14140
13937 -14140 -11190 -4068 -13438 -4881 2569 6053 391 -5970 -14237 -21837 -24338 -20597 -12944 -13447 -11668
13922 -11668 -25800 -27188 -18065 4110 1563 -1461 -14334 -28128 -31866 -25277 -23652 -14914 -17773
13909 -17773 -14342 -7630 1475 9112 10635 9496 -9900 -19944 -11402 -12694 -5124 -19375 -21339 -27692
13895 -27692 -27581 -8750 3524 2126 -4640 -9954 -20858 -15770 -5215 61 -13254 -21253 -14673
13882 -14673 -19866 -25176 -23498 -16976 -16666 -19328 -20809 -12938 -15695 -14455 -10121 1478 -996 -14932
13868 -14932 -22553 -7697 -13605 -15291 -20434 -33883 -41762 -42002 -48101 -49668 -33924 -25945 -10485 1052
13854A052j680K719j90j1344N116j0264M181R628N483m409r958o508K123N277
13840h774n001j2304L543J5606K4099R618j6480j5635m033k704q952l152L973
13827b0196K990J2320J1141j0663k461l011L701m379j5228O351J2608o143Q520
13814d450O143k6K104N542l852m425J630j8137k551j143n770n021J0593P584L584
13799h195J856l707J3634J71j0645k760j237J745j068N380P224l439O60r044o004
13784a5429j179o130M782J6660o27j178m847O430K121q41l281p177k284q982l755
13769b5717q44O226P280R357M594j1860p717P473N872q91j1679o441L465J1865
13755i017J0964J430o273r751j822J3081L507Q725n673r680j6652N752J2687l923
$$ plain form
13854 1052 -628 2091 1901 -9443 -4327 -14591 -10410 -782 4701 292 -9666 -16174 -14051 -8774
13840 -8774 -13775 -26079 -22536 -6930 17169 26787 10307 -5328 -9361 -12065 -21017 -24169 -20196
13827 -20196 -17206 -4886 6255 -4408 -6869 -9880 -6179 -10558 -25786 -19435 -6827 -12970 -4450
13814 -4450 1693 1667 3771 9313 5461 1036 2666 -15471 -18022 -19165 -24935 -29956 -19363 -11779 -8195
13799 -8195 -6339 -10046 3588 3759 -6886 -9646 -10883 -9138 -10206 -4826 2398 -1041 -381 -9425 -15429
13784 -15429 -16608 -22738 -17956 -1296 -1923 -3101 -7948 -1518 603 -238 -3519 -10696 -12980 -21962 -25717
13769 -25717 -26561 -20335 -13055 -3698 896 -10964 -18681 -11208 -5336 -6227 -17906 -24347 -20882 -9017
13755 -9017 1947 3377 -2896 -12647 -14469 -1388 2119 10844 5171 -4509 -21161 -15409 -2722 -6645
13741f645j2405j622K593J1927m130J787R176P528k158J4485j2041j2172o605
13728a0282N416Q396j579Q384R825k727j6774K144J0850k246K41J713q856N408
13714I913n858r306j0546N027J435P165N89m45j992n486K97O515J0257r013m211
13699e659o723M54m482J579J2796r156j7768L677J4010j0506j560O452J2747J7391
13685A3252N9j146K607O040k011p174o335O042j945N72p355m534j79J404J143
13670D40O528k379j0458r569k586K910L217N063K194o408m222J0626P202j5144
13656a2586N284N506N570n494M891J0042l093r329L028j0425q575J816o191m393
13642b3949Q360P394J2499o465N299P593r460J964O045N015j520J2851O756j5517
$$ plain form
13741 -6645 -19050 -20672 -18079 -6152 -10282 -8495 681 8209 6051 20536 8495 -3677 -10282
13728 -10282 -4866 3530 1951 10335 20160 17433 659 2803 13653 11407 11648 13361 4505 9913
13714 9913 4055 -5251 -15797 -10770 -9335 -2170 -1581 -2026 -4018 -9504 -9207 -2692 7565 -1448 -5659
13699 -5659 -12382 -11928 -16410 -14831 -2035 -11191 -28959 -25282 -11272 -21778 -23338 -16886 -4139 13252
13685 13252 13311 12165 14772 20812 18801 11627 5292 11334 9389 9961 2606 -1928 -2107 -703 440
13670 440 6968 4589 -5869 -15438 -18024 -15114 -11897 -6834 -4640 -11048 -15270 -4644 2558 -12586
13656 -12586 -7302 -1796 3774 -1720 3171 13213 10120 791 3819 -6606 -15181 -13365 -19556 -23949
13642 -23949 -15589 -8195 4304 -2161 3138 10731 1271 3235 9280 14295 12775 25626 32382 16865
13628A6865j874L559j2955l750r45n459q042L41R83J1789j0234n823k327J545
13614a6327n770M361j998j253J0859J058n618J039O047l476J0143r725l8N461
13600e237o617P879J0542M196l592j294j7076j5492M342N126k792Q961J2865K366
13586D177j1453M450K5290M364r517j5237m465P77K546r311K228K836M055l762
13572c022J30j5620j2001j919n52L147J6310j176p787L365J2281J88m618R353
13558a921m718p104L03J0024J150N503N222K541K545j3544k056N228M024O266
13544A3463q025j4462q365J0189J2413o554l298m782q000K333P787P716R799J082
13530A1296m140j1741l062N655j719q25J173p286l738J447J307J1727p908q232
$$ plain form
13628 16865 14991 18550 5595 1845 900 -4559 -12601 -12260 -11277 512 -9722 -15545 -17872 -16327
13614 -16327 -22097 -17736 -19734 -20987 -10128 -9070 -14688 -13649 -7602 -11078 -935 -10660 -10698 -5237
13600 -5237 -11854 -3975 6567 10763 7171 5877 -11199 -26691 -22349 -17223 -20015 -11054 1811 4177
13586 4177 -7276 -2826 22464 26828 17311 2074 -2391 -1614 932 -8379 -6151 -3315 740 -3022
13572 -3022 -2892 -18512 -30513 -32432 -32984 -29837 -13527 -14703 -22490 -19125 -6844 -6656 -11274 -1921
13558 -1921 -6639 -13743 -13440 -3416 -2266 3237 8459 11000 13545 1 -2055 3173 7197 13463
13544 13463 5438 -9024 -17389 -7200 5213 -1341 -4639 -9421 -17421 -15088 -7301 415 10214 11296
13530 11296 7156 -4585 -7647 -1992 -3711 -4536 -3363 -10649 -14387 -12940 -11633 94 -7814 -16046
13516a6046J1195N977o140k6O736R558n460l573Q791q943k590Q39l271K497o977
13501g433j99O628K101p55q530l841M036J086j677J3783o835k200M694j092l361
13486c595L926j536k965n256P450J7676m649j9280o059O730M166L525n447j2323
13472a7637N868j299j499J3486J5373m099l0037j616O128Q739J6648q47O07L344
13458A3159N102p459p241n01j2876K485J3410q894j2078L030r031r462k528L571
13444b9313O742r09m732K732P077M846R425O21q289J854r69l2j447M659L957l732
13428g510j2082p215Q343O624K208j448k1489l731J4359P433L151Q219n240Q322
13414e6p945j707o08J0908L367j0430r020n73M561Q264m460J855K885n834K994
$$ plain form
13516 -16046 -4851 1126 -5014 -5040 1696 11254 5794 2221 11012 2069 -521 318 -2953 -456 -7433
13501 -7433 -7632 -1004 1097 342 -8188 -12029 -7993 -6907 -8584 5199 -1636 -3836 858 -234 -3595
13486 -3595 331 -1205 -4170 -9426 -1976 15700 11051 -8229 -14288 -7558 -3392 133 -5314 -17637
13472 -17637 -11769 -13068 -14567 -1081 14292 10193 -19844 -21460 -15332 -6593 10055 9208 9815 13159
13458 13159 18261 10802 3561 3060 -9816 -7331 6079 -2815 -14893 -11863 -20894 -30356 -32884 -29313
13444 -29313 -22571 -23480 -28212 -25480 -18403 -13557 -4132 -3511 -11800 -9946 -10915 -10947 -12394 -7735 -3778 -7510
13428 -7510 -19592 -26807 -18464 -11840 -9632 -11080 -32569 -36300 -21941 -14508 -11357 -3138 -8378 -56
13414 -56 -8001 -9708 -10316 592 3959 -6471 -15491 -16064 -11503 -3239 -7699 -5844 -2959 -8793 -5799
13399e799l238q456L203J0955J754k594K001m930m552K944j145O49j0279M070
13385a5417J448K773J098J1268N158J0613N690j548j015N190Q24O461q029p436
13371A7078j3264n800L496J1798j0122p613K071L983n247r237k44J838M568J6170
13357I475M415J74J1561L529j6196j2543r443j2748N581K777K011Q893J5107k874
13343I719o049o222l605k038R793J894j2232R405j0949j4536r247L857J869J1512
13329a6829J668O238J2876p533j9423j3626J4456Q856l029p922M777J0614N796
13316c081J4295r957j8779Q655k625N238m852m492q415J0859K2278N259r403j2894
13302g914l329O068J2474m957j55o341K857k098Q072L774l089m497k438l423r208
$$ plain form
13399 -5799 -9037 -17493 -14290 -3335 -1581 -4175 -2174 -7104 -11656 -8712 -9857 -9208 -19487 -15417
13385 -15417 -13969 -11196 -10098 1170 6328 16941 22631 21083 20068 25258 26082 32543 24514 17078
13371 17078 3814 -1986 1510 13308 3186 -4427 -2356 1627 -3620 -12857 -13101 -11263 -6695 9475
13357 9475 13890 14064 25625 29154 12958 415 -9028 -21776 -16195 -13418 -11407 -2514 12593 9719
13343 9719 3670 -2552 -6157 -8195 1598 3492 -8740 665 -10284 -24820 -34067 -30210 -28341 -16829
13329 -16829 -15161 -8923 3953 -3580 -23003 -36629 -22173 -13317 -16346 -24268 -19491 -8877 -3081
13316 -3081 11214 1257 -17522 -8867 -11492 -6254 -11106 -15598 -24013 -13154 9124 14383 4980 -7914
13302 -7914 -11243 -5175 7299 2342 2187 -4154 -1297 -3395 4677 8451 5362 865 -1573 -4996 -14204
13287a4204K936M818m303q692j49O406k990m017P345O979m302K5918J1903j2135
13273A5513k792m748r065j6011j1704L918q36n904L513Q510J1069N936j118l319
13259g038l558p170K166J0963o328O482L472K001k44n68J993J5867o742m394J4830
13244B1732P87j3778j0734l218n093K641J3186L624n705j1230J091L513J2248
13231I064j6048j973n31J504J4816J618p734l450k779m505r776M791l981L462
13217a5522J3221m06P42j1230L120K320P474K367j659K341R621j1656j3559J4305
13203A479P105j4276l95J091J48O266M445l745r80p292P096P865n851j0680j4622
13188b2346K75P447p207R975K3957m318j5984q498N614m65L511N324j0977k474
$$ plain form
13287 -14204 -11268 -6450 -10753 -19445 -19594 -13188 -16178 -20195 -12850 -5871 -10173 15745 27648 15513
13273 15513 12721 7973 -1092 -17103 -28807 -24889 -25725 -31629 -28116 -19606 -8537 -2601 -3719 -7038
13259 -7038 -10596 -17766 -15600 -4637 -10965 -4483 -1011 990 746 178 2171 18038 11296 6902 21732
13244 21732 22519 8741 -1993 -5211 -10304 -7663 5523 9147 3442 -7788 -6697 -3184 9064
13231 9064 -6984 -8957 -9488 -7984 6832 8450 716 -2734 -5513 -10018 -19794 -15003 -18984 -15522
13217 -15522 -2301 -2707 -1965 -13195 -10075 -7755 -281 2086 427 2768 12389 733 -12826 1479
13203 1479 8584 -5692 -6087 -4996 -4848 1418 5863 2118 1138 -6154 942 8807 2956 -7724 -22346
13188 -22346 -22071 -14624 -21831 -11856 12101 7783 -8201 -16699 -11085 -11550 -8039 -2715 -13692 -16166
13174a6166O691J2671O549j0179j7112L229R034k303j1643J8475O720n629j962
13161a625l906O862L878r679Q484Q46j232Q45O656l83k301o880k162o130R057
13146B330o505l302J746O771J7231N588K00j25l753r681k3660k1268J435J0418
13132b2575J0753q590K598J501j013K186M93m758L280P158P959N532p491o220
13118i187n68Q727k166j0609L047M320q647J881K287M425Q540k902j519n310m77
13103h158l109R72j094l749J7076M973R33P318n72q555j2931J36J3321k896k1801
13088a8136m074J2536j968j510J4647n352j9626J0542J3407m320j756M58J9317
13075A4165P006N548N250j74o870j3164j8304j0304j3564J3731R156m515J495
$$ plain form
13174 -16166 -9475 3196 9745 -434 -17546 -14317 -5283 -7586 -19229 -754 5966 337 -1625
13161 -1625 -5531 1331 5209 -4470 4014 4860 3628 4473 11129 10746 8445 1565 -597 -6727 2330
13146 2330 -4175 -7477 -5731 1040 18271 23859 24059 23934 20181 10500 -13160 -34428 -32993 -22575
13132 -22575 -11822 -20412 -17814 -16313 -17326 -15140 -14647 -19405 -16125 -8967 -1008 4524 -2967 -9187
13118 -9187 -9755 -1028 -3194 -13803 -10756 -6436 -15083 -13202 -10915 -6490 2050 -852 -2371 -7681 -8158
13103 -8158 -11267 -10295 -11389 -15138 1938 6911 7844 15162 14590 6035 -6896 -6760 6561 3665 -18136
13088 -18136 -22210 -9674 -11642 -13152 1495 -3857 -23483 -12941 466 -3854 -5610 -5152 14165
13075 14165 21171 26719 31969 31795 24925 11761 -6543 -16847 -30411 -16680 -7524 -12039 -10544
13062a0544L430J2143J1081R711p180m809l702K834J3783m27Q90l49P456n556
13048B8761r39j5120k1337n678M224J6508J3872L114o728J436k106M77l8J531
13034A7977J20J4363L36O594J7849J3563K7037O717K70p278o050k4085l3137k1776
13020A2500l13l65j1541p110R666M948j2475N940R513J4442J6j7857k511p405
13006b552n653J9348J2519j3844j4751l250L986j3713p290K7482J0815N886K294
12993B1277j5573k7080m855R192J0668J0161K1314M674J0869J3181K2160L2172
12981A08160K2618n939k8589l0233k5892j1479O543j4730m634p612J459L814r042
12968D444M50m15n947p921N884m719k440k374l016r465R317J7306J9584R268j4641
$$ plain form
13062 -10544 -7114 5029 16110 25821 18641 13832 10130 12964 26747 26320 27210 26861 34317 28761
13048 28761 27822 12702 -8635 -14313 -10089 6419 20291 23405 16677 18113 16007 16484 16446 17977
13034 17977 18097 32460 32796 39390 57239 70802 97839 104556 104826 97548 91498 67413 34276 12500
13020 12500 12187 11822 281 -6829 2837 7785 -4690 1250 10763 25205 25221 7364 4853 -2552
13006 -2552 -8205 11143 23662 9818 -4933 -8183 -4197 -17910 -25200 2282 13097 18983 21277
12993 21277 5704 -21376 -26231 -17039 -6371 3790 25104 29778 40647 53828 75988 108160
12981 108160 130778 124839 96250 66017 40125 28646 35189 20459 15825 8213 9672 13486 4444
12968 4444 4894 4479 -1468 -9389 -3505 -8224 -10664 -13038 -16054 -25519 -16202 1104 20688 29956 15315
12953A5315j3929M618R4L852p3L847K165K851L66j1894n694O981L816j147N933
12938A7101J0354R958k142k074j2460M42o660K27n927q326J349j1251k414N399
12924f424J5759J6563m119r367k195n643P293N941j0719l828N879j3786j5326
12911a9972q558J3214k738J4002J9294p301l671N183j182j0403J139o731M169
12898c555p127P015J569J2900q12k302K281q203q658P908J2497J3163j3857Q35
12884A3654J0690J707J1442j5901j6780m855J1214J3854j76P547n206j9814j8103
12871a0727Q820R662K601O334M016K896j5166J900q49R49k915n798J2134q732
12857E125m644k302n138j537o610n013O715J1582J0213N891p56m819k77J260j498
$$ plain form
12953 15315 1386 6004 6098 9950 9877 13724 15889 18740 19106 7212 1518 8499 12315 11168 17101
12938 17101 27455 37413 35271 33197 20737 21179 14519 14746 8819 493 1842 -9409 -11823 -6424
12924 -6424 9335 25898 21779 12412 10217 4574 11867 17808 7089 3261 9140 -4646 -19972
12911 -19972 -28530 -15316 -18054 -4052 15242 7941 4270 9453 8271 -2132 -993 -7724 -3555
12898 -3555 -10682 -3667 -2098 10802 9990 7688 9969 1766 -6892 1016 13513 26676 12819 13654
12884 13654 24344 26051 37493 21592 4812 -43 11171 25025 24849 32396 27190 7376 -10727
12871 -10727 -1907 7755 10356 16690 20706 23602 8436 10336 9487 10436 7521 1723 13857 5125
12857 5125 481 -1821 -6959 -8496 -15106 -20119 -13404 -1822 8391 14282 13526 8707 8430 9690 8192
12842H192m995K319Q556P76P498k723j1779m103J204M995L62k2304k977M531j108
12827a1556l526O835N513J077J2316P087j1368p984R107L591m390J0027R219j1027
12813A4921j1383O391K214j0372j0354m843R016J0095k233Q986P699r149l044
12800G944K718j3518l494J0596j2861m739P372O708j371J1270L517M64P90r468
12786E928P445J2475k66n085j497J545j8488o055n088r754L149P426P994P75r81
12771d77l791p935L76K1632R331o275p578r437o483p633j686R184J1635o843j0819
12756a6799R975J3880M344R508j0885q948J244N363o869j4245p995J4737K193
12743d497p74J143j859O460P619Q098N733r775k123l993k33n116N631k093m561
$$ plain form
12842 8192 3197 5516 14072 14848 22346 19623 7844 3741 4945 9940 10302 -12002 -14979 -10448 -11556
12827 -11556 -15082 -8247 -2734 -1657 10659 17746 6378 -1606 7501 11092 6702 16729 25948 14921
12813 14921 3538 9929 12143 1771 -8583 -13426 -4410 5685 3452 12438 20137 10988 7944
12800 7944 10662 -2856 -6350 4246 -8615 -13354 -5982 726 -645 10625 14142 14606 15396 5928
12786 5928 13373 25848 25582 20497 19000 20545 2057 -3998 -9086 -18840 -15691 -8265 -271 504 -477
12771 -477 -4268 -12203 -11827 9805 19136 12861 5283 -4154 -10637 -18270 -19956 -10772 863 -5980 -16799
12756 -16799 -6824 7056 11400 20908 10023 1075 2319 7682 813 -13432 -21427 -6690 -4497
12743 -4497 -5271 -4128 -5987 473 8092 16190 21923 12148 10025 6032 5799 683 6314 4221 -340
12728c40L514k335Q25P830L036j6341q654k449J8001J978M181R848J0153J776
12714C1023q646L566K322n237j0885j2228m274r12P376j0821n326k41N479N500
12700c304k195n703J550l446j3982J3896q21q356o012J4073J9643J329M484o888
12686D268J639l320k685j457r264J2447J3471M206m252L044K172k877j5838p823
12672f269m823N99N014O295n907j745J2343L030J173L187J934r282o879j607P1
12657b866J512k570o77l953p14k716R341R798j461m525O037l421j1682P506J0249
12642I858m589p354k449Q411o462o248K176P62j3566j0193L60R601J2894J0868
12628D069j535n482J370j3182J725O372Q30J743L437O879j762M789M831r359N323
$$ plain form
12728 -340 3174 839 1664 9494 12530 -3811 -12465 -14914 3087 5065 9246 19094 29247 31023
12714 31023 22377 25943 28265 23028 12143 -85 -4359 -5271 2105 -8716 -14042 -14283 -8804 -3304
12700 -3304 -5499 -11202 -9652 -13098 -27080 -13184 -14005 -22361 -28373 -14300 5343 6672 11156 4268
12686 4268 5907 2587 -98 -1555 -10819 1628 15099 19305 15053 18097 20269 17392 1554 -6269
12672 -6269 -11092 -10493 -5479 816 -5091 -6836 5507 8537 9710 12897 14831 5549 -1330 -2937 -2866
12657 -2866 -1354 -3924 -4601 -8554 -9268 -11984 -2643 7155 5694 1169 7206 3785 -7897 -391 9858
12642 9858 5269 -2085 -4534 3877 -2585 -8833 -6657 -5895 -19461 -29654 -29294 -19693 -6799 4069
12628 4069 2534 -2948 -1578 -14760 -13035 -6663 -5833 -4090 -653 6226 4464 9253 14084 4725 10048
12613A0048N094n478M801O399j039j3966r194J511R52J0240Q051m342j614P037
12599A8500j948J452j2679r007o718J6056J1184l617j2985n34Q963L006j2045
12586c72M306M777J046p439O926R233K72q789r250L19L221p669j1761K40J6585
12571A645j317j2295K439Q428J6913J2124m405j4099j3104j3977J6776J3630N589
12558A8347M421K503l963J1352j567l488J716m594j2998n132m991N43N118j721
12544E546K442J7357l953n375q579J246M207j1538J1606J2766K405k801K782J3505
12530D1616j2637l016Q47L887O813J1512l879j2818m977k44M663r245r515N76
12516A3583O415o868j223o692q672J0040Q726O142Q066J767j518p918j4252j2996
$$ plain form
12613 10048 15142 9664 14465 20864 19825 5859 -3335 -1824 -872 9368 17419 13077 11463 18500
12599 18500 16552 18004 5325 -3682 -10400 5656 16840 13223 238 -296 8667 11673 -372
12586 -372 3934 8711 9757 2318 9244 18477 18749 9960 710 1029 4250 -3419 -15180 -14940 1645
12571 1645 328 -11967 -9528 -1100 15813 27937 23532 9433 -3671 -17648 -872 12758 18347
12558 18347 22768 25271 21308 32660 31093 27605 29321 24727 11729 6597 1606 2149 7267 5546
12544 5546 7988 25345 21392 16017 7438 8684 12891 1353 12959 25725 28130 25329 28111 41616
12530 41616 28979 25963 26810 30697 37510 49022 45143 32325 27348 27104 31767 22522 13007 13583
12516 13583 19998 13130 11907 5215 -3457 6583 15309 21451 29517 31284 29766 21848 7596 -5400
12502e400J2280k727o068j240J807O033O591R812P890K1725L567l668n428n637
12488C9537k273o114j516k13l609O109j515M468l544R352L093j148O976j4429
12474C5174j4373j010p09k697R581P843j85J018m107O606N366j393j2233K411
12460C1292R692J5490M670j9311n104j5674j297j1286K554R435q50M373j180m953
12446A7851j055o161m559O169o330k085Q478k056R513R907J4393o983j0450j0591
12432A6041m091m280r55J9587N091n836M538Q002p143j0337Q268J0674l518N593
12418D1634q989r902M283J0645l218k357k84n865P996K835l174M128j710N35M971
12403D1528M248r215q026J083K2467O890j4538o648m574K939L543P033j0830p235
$$ plain form
12502 -5400 6880 4153 -1915 -3155 -1348 4685 11276 21088 28978 50703 54270 50602 45174 39537
12488 39537 37264 31150 29634 29421 25812 31921 30406 34874 31330 40682 43775 42627 49603 35174
12474 35174 20801 19791 19082 16385 25966 33809 33624 34642 30535 37141 42507 41114 28881 31292
12460 31292 40984 56474 61144 41833 36729 21055 19758 8472 11026 20461 19611 23984 22804 17851
12446 17851 16796 10635 6076 12245 5915 3830 12308 10252 19765 29672 44065 37082 26632 16041
12432 16041 11950 7670 6715 26302 31393 25557 30095 38097 30954 20617 28885 39559 36041 41634
12418 41634 32645 22743 27026 37671 34453 32096 31812 25947 33943 36778 33604 37732 36022 36557 41528
12403 41528 45776 36561 28535 29618 52085 58975 44437 37789 33215 36154 39697 46730 35900 28665
12389B8665q014J4883J232J1492Q171j0411M348K2111R382p345j1269j5740M912
12376E2417m736r166l317j196Q457J551J2575O136j28K741m14r858j2788j4206
12362B8068Q558J2451R378k26j4847j806J2328J5091J5112k0660J56L063r535
12349E7131o644q280p003J780J6365J963p349k095k272J3328J1883K705p678k747
12335F1087l339j786M642J1556k082j1444l478q663R66K2999k004N343N200m506
12321G4491K040R040k434j0405j6128J224R291J100L832Q39l423J900J589m987
12307F7969N155J205J0177r544q488J010N884J5541q018j8720k40N392Q57j2644
12293E5536L581j195Q04N126O446L276J5784J772j3866K851N661j794l520k793
$$ plain form
12389 28665 20651 35534 36766 48258 56429 46018 50366 72477 81859 74514 63245 47505 52417
12376 52417 47681 38515 35198 34002 42459 44010 56585 62721 62593 65334 64920 55062 42274 28068
12362 28068 36626 49077 58455 58229 43382 41576 53904 68995 84107 63447 63603 66666 57131
12349 57131 50487 42207 35204 36984 53349 55312 47963 45868 43596 56924 68807 71512 63834 61087
12335 61087 57748 55962 60604 72160 70078 58634 55156 46493 47459 70458 68454 73797 78997 74491
12321 74491 76531 85571 83137 72732 56604 57828 67119 68219 72051 72890 69467 71367 72956 67969
12307 67969 73124 74329 84506 74962 66474 67484 73368 88909 80891 62171 61931 67323 68180 55536
12293 55536 59117 57922 58726 63852 70298 73574 89358 91130 77264 80115 85776 83982 80462 77669
12279G7669k448L117J4732J3818j4343k773N840J8706k288N891l105R48o086j4661
12265I5017m668K2065Q07j9791j2349J0521P901K274L443j3300k5752O505j2682
12252E9991O435J6021P408M296o281Q87J0589Q255k324O353p579k787J9827N187
12238A26278j1362j0088R173m955l363j984q598M176R242K811M446k335p912Q546
12224A14075J6141M62j8847m236j091k896J4225J1836J1106P370l747l737j2261
12211A28400o778j4450j1634M86J3859K2576J311k822k250j552J0751J5021M896
12198A57814p571l926j377j1703j387J5698r618L833J2146O582K775j0162k449
12185A50655J4758P143K507q675k3591k936J6438R030o623K496N137j1391J3898
$$ plain form
12279 77669 75221 78338 93070 106888 92545 89772 95612 114318 112030 117921 114816 115764 109678 95017
12265 95017 90349 112414 113221 93430 81081 91602 99503 101777 105220 91920 66168 72673 59991
12252 59991 66426 82447 89855 94151 87870 88757 99346 107601 105277 111630 104051 101264 121091 126278
12238 126278 114916 104828 114001 109046 105683 103699 95101 99277 108519 111330 115776 113441 105529 114075
12224 114075 130216 130678 111831 107595 106504 103608 117833 129669 140775 148145 144398 140661 128400
12211 128400 121622 107172 95538 96024 109883 132459 133770 130948 128698 127146 137897 152918 157814
12198 157814 150243 146317 144940 133237 131850 147548 137930 141763 153909 160491 163266 153104 150655
12185 150655 165413 172556 175063 166388 142797 139861 156299 165329 158706 161202 166339 154948 168846
12172A68846J1897j09k296j296O674J2426J3954o145M305j4168l971L952K583
12159A96652j1030n605M314L140J0840M291R383n189O022J058J932P063q248p875
12145B06748P832R114r127J3163K486l766P359J288L508l771R494J1500l598j311
12131B50919n337p162N087J8255K4583o24j5111j950m350M520n056K651J8320
12118B84745R951P620O320o8K225l5k729j5096o573K902J6607J6991J0479r388
12104C23951q185K910J6901J8060m585r938J7590J0061n230Q99k452r003n998
12091C44981j430J2283L4068P246k0791p052K0051M866P867K467l445Q697J1027
12078D20835J0917N560M980J1865N924p131J217J0753P483R662N587L766J0821
$$ plain form
12172 168846 180743 180634 178338 177042 183716 196142 210096 203951 208256 194088 190117 194069 196652
12159 196652 185622 180017 184331 187471 198311 202602 211985 206796 212818 213876 215808 222871 214623 206748
12145 206748 214580 223694 214567 227730 230216 226450 233809 235097 238605 234834 244328 255828 252230 250919
12131 250919 245582 238420 243507 261762 286345 285721 270610 268660 264310 268830 263774 266425 284745
12118 284745 294696 302316 308636 308568 310793 310758 308029 292933 286360 289262 305869 322860 333339 323951
12104 323951 315766 318676 335577 353637 349052 339114 356704 366765 361535 362434 359982 350979 344981
12091 344981 343551 355834 389902 397148 376357 369305 389356 394222 402089 404556 401111 409808 420835
12078 420835 431752 437312 442292 454157 460081 452950 454167 464920 472403 482065 487652 491418 502239
12065E02239P557k616Q179J6627l937J4710R867j844m033O089J8360K146J6491
12052E89835J2763M977L931L819K2613J8491Q641j217P43O842J6372O193R629
12039G03632J1747L466k406R625Q466J2308O182P129J8162J6314Q881J5985J1066
12026H30557J1101J65M963J3278K9952K7510J8292J4431K6656K8330P916p398
12014A005753P986J7701J9838K3918N210O522J4406P585P127K2298L7454J9326
12002A195124K0450J5902J0131J7044K8798L5596K6365L0905K3615R696J5062
11991A428688K3796J8230K3104L2331K4695K3170J6498K0016J6795K1669K8574
11980A677566L7054L0820J7123J7684J6796L5031L8775L5263K8892M5953K8381
$$ plain form
12065 502239 509796 507180 515359 531986 528049 542759 552626 550782 546749 552838 571198 573344 589835
12052 589835 602598 607575 611506 615325 637938 656429 665070 663853 664596 671438 687810 694003 703632
12039 703632 715379 718845 716439 726064 734530 746838 753020 760149 778311 794625 803506 819491 830557
12026 830557 841658 841823 846786 860064 890016 917526 935818 950249 976905 1005235 1013151 1005753
12014 1005753 1013739 1031440 1051278 1075196 1080406 1086928 1101334 1108919 1116046 1138344 1175798 1195124
12002 1195124 1215574 1231476 1241607 1258651 1287449 1323045 1349410 1380315 1403930 1413626 1428688
11991 1428688 1452484 1470714 1493818 1526149 1550844 1574014 1590512 1610528 1627323 1648992 1677566
11980 1677566 1714620 1745440 1762563 1780247 1797043 1832074 1870849 1906112 1935004 1980957 2009338
11969B009338J8047L7068L1754J7226J8998K5435K4262K9374L4048K5924J6378
11958B287852K9780L6074K6622M1099L9291J7599K0001K3687K6082K3975J4342
11947B586404J3629K9475M6157K6807K0715J7267J5345J9091J3920O391L589Q79
11935B799669m883O236R795K0233P750O255J642j809p246k7057j0485K2227n785
11922B816542j9303p384j0587J0911K872r979l5798k0660j4206r105j4662k9579
11910B659062k1670j4161k3146k4267j8808j4537l1699k9468k9678l5011l4620
11899B381997k3697k7024k0118k5176k9624j5820k9738k4781k9488k7193l3367
11888B095971l4103k4400l1352l6234l3477k6964l0529l8305k3409k2229k8034
$$ plain form
11969 2009338 2027385 2064453 2096207 2113433 2132431 2157866 2182128 2211502 2245550 2271474 2287852
11958 2287852 2317632 2353706 2380328 2421427 2460718 2478317 2498318 2522005 2548087 2572062 2586404
11947 2586404 2600033 2629508 2675665 2702472 2723187 2740454 2755799 2774890 2788810 2795201 2798790 2799669
11935 2799669 2794786 2801022 2810817 2831050 2838800 2845055 2846697 2844888 2837642 2810585 2800100 2822327 2816542
11922 2816542 2797239 2789855 2779268 2790179 2793051 2783072 2747274 2726614 2712408 2703303 2688641 2659062
11910 2659062 2637392 2623231 2600085 2575818 2557010 2542473 2510774 2481306 2451628 2416617 2381997
11899 2381997 2358300 2331276 2311158 2285982 2256358 2240538 2210800 2186019 2156531 2129338 2095971
11888 2095971 2061868 2037468 2006116 1969882 1936405 1909441 1878912 1840607 1817198 1794969 1766935
11877A766935l0168l2101k3947k3893k0674k8005k5325k1656k0469m817j5915
11866A519965k7443k8670m1858k0018j3396k4097l0090k3452m679k2757k6783
11855A256722k0550j4680j0704k2230k3205j0903k5297k8736j4159o573k1795
11844A057890j5974k1192p733J1269R72j6050j2102j8285k1044j3123k0665l1367
11832H92596j6722r424j5910j6089k3807k223O514j3052k1013j1885Q861j0853
11820G66993j6844k3295j8760q24j080q149j4674j1812j655j2514J783n030k3006
11807F31133r434q962K116k806J867N592k1768k8275j2094p413Q82r117j7035
11794E24686j5936O194K705q471j837l560j1675j3963q746j5928n088M580m58
$$ plain form
11877 1766935 1736767 1704666 1680719 1656826 1636152 1608147 1582822 1561166 1540697 1535880 1519965
11866 1519965 1492522 1463852 1421994 1401976 1388580 1364483 1334393 1310941 1306262 1283505 1256722
11855 1256722 1236172 1221492 1210788 1188558 1165353 1154450 1129153 1100417 1086258 1079685 1057890
11844 1057890 1041916 1020724 1012991 1024260 1025232 1009182 997080 978795 957751 944628 923963 892596
11832 892596 875874 866450 850540 834451 810644 808421 814935 801883 780870 768985 777846 766993
11820 766993 750149 726854 708094 707270 706190 698041 683367 671555 669900 657386 659169 654139 631133
11807 631133 621699 612737 614853 612047 613914 619506 597738 569463 557369 549956 550838 541721 524686
11794 524686 508750 514944 517649 509178 507341 503781 492106 478143 469397 453469 448381 452961 452503
11781D52503l573M356j1690n845j2419m594M770j316m457l762N740J154p208j2699
11767D00960r662M648l3888j1330J1307O193M8k044r549n476j3840n47q87N546
11753C41479N42j3625j9102o156J3384j386j2991m782M924J4233o463p858n786
11740B96413J554p409p804N734n809r164j0704n052n428P152J6341j0442j9347
11727B46035p481r353L035N884j877m70J1195m558k1111j998K3127k455r781O881
11713B37073k690j569q823q707k76N782j6723k2734P896K318J1606K713j3732
11700A92134j8891l683L885J6260J3300K180J222j2869q386O317J5842p897j6364
11687A83050K027j3322l685m7q487J620k81j403j3582L263J2128r40q897j965
$$ plain form
11781 452503 448930 453286 441596 435751 423332 418738 423508 422192 417735 413973 419713 420867 413659 400960
11767 400960 391298 395946 362058 350728 362035 368228 368276 366232 356683 351207 337367 336820 335933 341479
11753 341479 342021 328396 309294 303138 316522 315136 302145 297363 302287 316520 310057 302199 296413
11740 296413 297967 290558 282754 288488 282679 273515 262811 257759 252331 259483 275824 265382 246035
11727 246035 238554 229201 232236 238120 236243 235773 246968 242410 221299 219301 242428 239973 230192 237073
11713 237073 234383 232814 223991 215284 215008 220790 204067 181333 189229 191547 203153 205866 192134
11700 192134 173243 169560 173445 189705 203005 205185 206407 193538 185152 191469 207311 199414 183050
11687 183050 185077 171755 168070 168023 159536 161156 160875 159472 145890 149153 161281 160341 151444 149479
11673A49479n863m31M968N880L622o021r38k236r426j4392M178J0742N310o655
11659A38217j0841J1962J3861j2496K029j224n32Q660M734r109p948L169M794
11646A45276J0274j0117p724m097j401Q605M39j6294j7888l453N37R293o152r79
11632A06319k648j4990j1441O786Q425o95J4613o637j2939R071m777p42M181j0987
11618H3539q221M778O543M528n150q246O433Q391R544R98O419n074q997K944m57
11603I7972O181k0776n747K945k6k084L888O058N995K27r44K911r602p733n679
11588G3586r762M222Q129O878l361L323j0022J578j983j375m114q680k050O594
11574F2963J088q347K044Q333J1355l88j4287m55j2907Q344k027K577O907J3468
$$ plain form
11673 149479 143616 143185 148153 154033 157655 151634 150696 148460 139034 124642 128820 139562 144872 138217
11659 138217 127376 139338 153199 140703 142732 141508 140976 149636 154370 145261 137313 140482 145276
11646 145276 155550 145433 137709 133612 132211 140816 141255 124961 107073 103620 104157 113450 107298 106319
11632 106319 103671 88681 77240 84026 92451 91756 106369 99732 86793 95864 91087 90345 94526 83539
11618 83539 75318 80096 86639 91167 86017 77771 84204 92595 102139 103137 109556 104482 95485 98429 97972
11603 97972 104153 83377 77630 80575 80549 78465 82353 88411 94406 94633 93689 96600 86998 79265 73586
11588 73586 63824 68046 76175 83053 79692 83015 72993 74571 72588 71213 67099 58419 56369 62963
11574 62963 64051 55704 57748 66081 77436 77048 62761 62306 49399 57743 55716 58293 65200 78668
11560G8668L272r867o042j6237n764N961P15J0525M663j0599O65r156L078q870
11546D1012M825P212l50k363J9j3994l526K0559J1934j3237j3526j926p964m299
11532B4376J170k60J272K3399K1294J370n810j734K861j8605j0155l984m463K239
11518C2970J6239J8774l959q314q634j454J413j521N535L76p536m339K84j173
11504C8661J0311q85j8327n645M014J315J0823j478n960N317j335P361P205L796
11490E5173l10N129m612l854j9560j648N801r13J0930j018K115J039J1564m959
11476E4877j5503p980J0438m120L236l682L325M959j3281p108Q241M147K013R034
11462D8596j0699p419N151J182q562K311r88O264q480q320N733R218l201j0597
$$ plain form
11560 78668 81940 72073 66031 49794 44030 49991 50706 61231 65894 55295 55960 46804 49882 41012
11546 41012 45837 53049 52699 50336 50355 36361 32835 53394 65328 52091 38565 36639 28675 24376
11532 24376 25546 25286 26558 49957 71251 72621 66811 65077 67938 49333 39178 35194 30731 32970
11518 32970 49209 67983 64024 55710 47076 45622 47035 45514 51049 51425 43889 39550 39834 38661
11504 38661 48972 48087 29760 24115 28129 29444 40267 38789 32829 38146 36811 44172 51377 55173
11490 55173 54863 59992 55380 51526 31966 30318 36119 35206 46136 45118 47233 48272 59836 54877
11476 54877 39374 31394 41832 37712 40948 37266 40591 45550 32269 25161 33402 37549 39562 48596
11462 48596 37897 30478 35629 36811 28249 30560 29572 35836 27356 19036 24769 33987 30786 20189
11448B0189p867m08J1846J3065J0208R372J5511K351j5981n366r2j1486j0879
11435C0463J648l568j414R157J4335n520j0903r861j045J0837R492p061j306r523
11421B5731m242O95o173J346L976j1047o314J1370J0108J204M354o187M975j971
11407B7825j7717m86K236O000q795l82Q87n07L462l421O948k186l583n854J558
11392E985N885P001p916J8048J0425L923l45N024j1737r119j2644n489l692M287
11378I636O251J2547o256m224l583n74l07J4204l6j5656J3712k218j5159k61R166
11363A7242o668R270J5412M30q925j0554q027M226q233L500N057k182n858N779
11349A0469Q944j4563j630L401J1381K523l388R294o941j7443j0936N531Q768
$$ plain form
11448 20189 12322 11914 23760 36825 47033 56405 71916 74267 58286 52920 52828 41342 30463
11435 30463 32111 28543 27129 36286 50621 45101 34198 24337 23292 34129 43621 36560 35254 25731
11421 25731 21489 22184 16011 17357 21333 10286 3972 15342 25450 26654 31008 24821 29796 27825
11407 27825 10108 9622 11858 17858 9063 8681 9568 9061 12523 9102 16050 13864 10281 4427 5985
11392 5985 11870 18871 10955 29003 39428 43351 43006 48030 36293 27174 14530 9041 5349 9636
11378 9636 15887 28434 22178 17954 14371 13797 13490 27694 27658 12002 25714 23496 8337 8076 17242
11363 17242 10574 19844 35256 35686 26761 16207 8180 12406 4173 7673 12730 10548 4690 10469
11349 10469 19413 4850 3220 6621 18002 20525 17137 26431 19490 2047 -8889 -3358 5410
11336E410J1792O25o016m314K234l180L792k126N337J5959K294j7798j6162L485
11322A332J285l84o429N491J8970q026j881O398r919m339N730K703o607R113l647
11307I790m388R304P562n055j134J0682N95l607j694j4852j0691J972J660L39
11293D83K636N193n096j602P180R819k1477m893K534J1052Q240q969n149j123
11279a172L333J2480K015j219l500l523r07J2649K399j0306p340M617O85o105
11265D106p1O911o25r568j1615R967J5075J1877M163N500j4406j0536m527N437
11251A1688J2125j096j4899J957l260K62N521J493L987j0162k073q904j2858J378
11237a4841J770J2354J9719j763n764k219k041q673n65J3557M056j2215j2351
$$ plain form
11336 5410 17202 17827 11811 7497 9731 6551 10343 8217 13554 29513 31807 14009 -2153 1332
11322 1332 2617 2233 -4196 1295 20265 12239 10358 16756 6837 2498 8228 10931 4324 13437 9790
11307 9790 5402 14706 22268 17213 16079 26761 27356 23749 22055 7203 -3488 -1516 144 483
11293 483 3119 8312 3216 1614 8794 18613 -2864 -7757 -5223 5829 14069 5100 -49 -1172
11279 -1172 2161 14641 16656 15437 11937 8414 7507 20156 22555 12249 4909 9526 10211 4106
11265 4106 4035 10946 10321 753 -10862 -895 14180 26057 30220 35720 21314 10778 6251 11688
11251 11688 23813 22717 7818 9775 6515 6777 12298 13791 17778 7616 5543 -3361 -16219 -14841
11237 -14841 -13071 -717 19002 17239 11475 9256 7215 -1458 -2023 11534 15590 3375 -8976
11224h976l571m712j2158K0301K2522J488l609Q757l084j8926r351L917N686p381
11210i097N113N742J6064R578j6691k0999n842N766l906n68q97J582Q53J1539
11196a763R133R299n76k523n959K300M209L699k071k285j3217k675P894k495k193
11181G77j4784q329m359l544N112P446J2993L888K827Q310k080j2613J1234L740
11167A0618o51k664n304J895j0084j3298Q374K3478j1554j5605j4774O447J1982
11154a1140J3767j594J1767J5575q967k460n510k657Q013N839j7817p099n73k913
11140e769L164l63M274O805L945P77j181J0489M916j8443j6903M461P256J3958
11126A7386o001j6797m336n104K90q639K33M31R362J9024j7779j5475R178J4627
$$ plain form
11224 -8976 -12547 -17259 -29417 -9116 13406 14894 11285 20042 16958 -1968 -11319 -7402 -1716 -9097
11210 -9097 -3984 1758 17822 27400 10709 -10290 -16132 -10366 -14272 -14840 -15737 -14155 -13302 -1763
11196 -1763 7370 16669 16093 13570 7611 9911 14120 17819 15748 13463 246 -2429 5465 2970 777
11181 777 -14007 -22336 -26695 -30239 -25127 -17681 -4688 -800 2027 10337 8257 -4356 6878 10618
11167 10618 9967 7303 1999 3894 -6190 -19488 -11114 12364 810 -14795 -29569 -23122 -11140
11154 -11140 2627 1033 12800 28375 19408 16948 11438 8781 16794 22633 4816 -2283 -2856 -5769
11140 -5769 -2605 -2968 1306 8111 12056 12833 11652 22141 27057 8614 -8289 -3828 3428 17386
11126 17386 11385 -5412 -9748 -14852 -14562 -23201 -22968 -22537 -13175 5849 -11930 -27405 -18227 -3600
11112c600J5113P966j4324q720k085K277j0374j847J88K979R64J211k171J1195
11098a228J4013J50o387m616j1630j215Q390m99j738q71p486P037K596O758L726
11083G000q678k230j500J377j966n211J146J8198l133j0888m431j4281q148J0410
11069b2335k26J3013Q107M086n031N073m72M144l454J4861P73r053q75k839K986
11054H758k407p819L466J2758L374R5J1589N202j913P757J2849O37N583n819q197
11039D5913j6686R382J1588k099J4809K0917K0680J0137N091r429j1346L598n153
11026I7402n636O265J2637K4110K9237K5371L650j5197p372l1948l7874q971L297
11013I4971P271Q733m959J3774K0014k373k398k8917k2405j2931n530j1396j4911
$$ plain form
11112 -3600 11513 19479 5155 -3565 -5650 -3373 -13747 -15594 -15406 -12427 -11463 -10252 -12423 -1228
11098 -1228 12785 12935 6548 1932 -9698 -10913 -2523 -3022 -4760 -5631 -13117 -6080 -3484 3274 7000
11083 7000 -1678 -3908 -5408 -4031 -5997 -11208 -10062 8136 5003 -5885 -10316 -24597 -32745 -22335
11069 -22335 -22561 -9548 -1441 2645 -2386 2687 2215 6359 2905 17766 18539 9486 8611 5772 8758
11054 8758 6351 -1468 1998 14756 18130 18225 29814 35016 33103 40860 53709 54346 59929 54110 45913
11039 45913 29227 38609 50197 48098 62907 83824 104504 114641 119732 110303 98957 102555 97402
11026 97402 91766 98031 110668 134778 164015 189386 193036 177839 170467 138519 100645 91674 94971
11013 94971 102242 110975 106016 119790 139804 137431 135033 106116 83711 70780 65250 53854 38943
11000C8943O25J127R524K1108j7620j4947N602j6904j9287p024p81P883M019J8571
10986C0839k200j0963j2850m659Q518R620o309k3058q349P397J3007l71p735p883
10972a4996J7255M428q226J0771P620j1142n396k525L471nJ117L011q278M11j647
10957d131q976N247l810l732j9063L939R740K761J2246O204O501k268j0936o525
10943a2803l766p390J3791J8228M563r595j0663k720j663L376Q724Q621J483j6406
10929f220m770L721J3168P232j632j7830q744n34L486j9J966P007K991j779j076
10914c033q464j0351M133J054L840P668J0416o380j0794L041P886m044L017p316
10900i327l146K991L338k335J2619J9965o229j6271K097R504L428j0911j6546
$$ plain form
11000 38943 39568 40695 50219 71327 53707 38760 44362 27458 8171 1147 366 8249 12268 30839
10986 30839 28639 17676 4826 167 8685 18305 11996 -11062 -19411 -12014 993 622 -7113 -14996
10972 -14996 2259 6687 -1539 9232 16852 5710 314 -2211 1260 1255 2372 5383 -2895 -2484 -4131
10957 -4131 -13107 -7860 -11670 -15402 -34465 -30526 -20786 -18025 -5779 425 6926 4658 -6278 -12803
10943 -12803 -16569 -23959 -10168 8060 12623 3028 -7635 -10355 -12018 -8642 82 8703 10186 -6220
10929 -6220 -10990 -7269 5899 13131 11499 -6331 -15075 -15609 -12123 -12142 -10176 -3169 -178 -1957 -3033
10914 -3033 -11497 -21848 -17715 -16661 -12821 -5153 5263 -1117 -11911 -8870 -984 -5028 -2011 -9327
10900 -9327 -12473 -9482 -6144 -8479 4140 24105 17876 1605 3702 13206 16634 5723 -10823
10887a0823O236j0466j428k282l293r601L48K4422n305j172J2112R265j6391j1217
10873a9595J746J3175R694k65N627P506m630n540j1760J968p153j914p115R262
10859h994J0308P983P020o528N940q18j2229N18N763l638k3408j1892N950l97
10845b4422L744J1858J3189R05m074N121L81M69P501J158j6080R041m165p508
10831b882R809m498j0341O143j976L529M722r933j753M847n065m861j3549m475
10817c0283J0017J0220N535Q801q020l376J0476J2319J3539r27q968j5201q511
10804d379k163m601k415p884r97J1635R877n194j095j0261N915k147L908M700
10790e101O088P861p792q587m053m616j462K646n652R429m993J172M299J6797
$$ plain form
10887 -10823 -4587 -15053 -16481 -18763 -22056 -31657 -31309 -6887 -12192 -13364 -1252 8013 -8378 -19595
10873 -19595 -17849 -4674 5020 4755 10382 17888 13258 7718 -4042 -2074 -9227 -11141 -18256 -8994
10859 -8994 1314 9297 16317 9789 15729 14911 2682 3200 8963 5325 -18083 -29975 -24025 -24422
10845 -24422 -20678 -8820 4369 5274 1200 6321 6702 7171 14672 15830 -250 8791 4626 -2882
10831 -2882 6927 2429 -7912 -1769 -3745 -216 4506 -5427 -7180 -2333 -7398 -12259 -25808 -30283
10817 -30283 -20266 -10046 -4511 4290 -3730 -7106 3370 15689 29228 28301 19333 4132 -4379
10804 -4379 -6542 -11143 -13558 -21442 -22439 -10804 -927 -6121 -7216 -17477 -11562 -13709 -9801 -5101
10790 -5101 987 8848 1056 -7531 -11584 -16200 -17662 -15016 -20668 -11239 -16232 -15060 -10761 6036
10776F036N331k697o679q946m102j0000M926J1243J946r620j3433j0216L528R115
10762b3568j0599R060J9987Q531j751r375K4458J418j3169j1133j3671m807O151
10749a8468P880J1605k61p082j2881n529R589J5898J24K573R300o406k572P307
10735A1077K738L226P904j0338M850R024q06j3108M034J2513M739n680j4005m105
10721A2063P063N796J3027K643j2776j2742j5502K423J5355J3874L565p382N657
10708C3064m586j1638p639j0369J261L423R337K112L788J0275N214k024j6851
10695A5367j2876L735R643J0118L158j0292j0588m128k664M112q682J1729M280
10682A2912J6586J4241K957k30j0707K075m701Q472N80O909L521m80M726q762
$$ plain form
10776 6036 11367 8670 1991 -6955 -11057 -21057 -16131 -4888 -2942 -12562 -25995 -36211 -32683 -23568
10762 -23568 -34167 -25107 -5120 3411 1660 -7715 16743 18161 4992 -6141 -19812 -24619 -18468
10749 -18468 -10588 1017 756 -6326 -19207 -24736 -15147 751 875 3448 12748 6342 3770 11077
10735 11077 13815 17041 24945 14607 19457 28481 27675 14567 18601 31114 35853 30173 16168 12063
10721 12063 19126 24922 37949 40592 27816 15074 -428 1995 17350 31224 34789 27407 33064
10708 33064 28478 16840 9201 -1168 93 3516 12853 14965 18753 29028 34242 32218 15367
10695 15367 2491 6226 15869 25987 29145 18853 8265 4137 1473 5585 -3097 8632 12912
10682 12912 29498 43739 46696 46466 35759 37834 33133 41605 42185 49094 52615 52135 56861 48099
10668D8099j0634J349J0584R648j042M686P77n750J8258o53o066J8241J4571O423
10654A08491J828O420q33k265N488J2423O466q298J7840J9729L0048J9818J916
10641B19071J4529L4319K3784J6576K2756J8258L5254M9826N3606P3615Q6769
10630F48363Q2023P7878N6119P9338J25413J43455J82961K40989L35815M64237
10620B436591O33830Q37219J098097J388855J619618J608549J226313N48714j05704
10611A1292082m51310m01023o2046M63709J102530J853011K636914L230099L147212
10602B2811178K040097K19964j410628k085789j806014r84552N3858J161375K323842
10593B2323331L404119M058426L635145J729181j051632l310228m096562l544070
$$ plain form
10668 48099 37465 38814 49398 59046 58004 62690 63467 57717 75975 75322 69256 87497 102068 108491
10654 108491 110319 116739 115906 113641 119129 131552 138018 129720 147560 167289 197337 217155 219071
10641 219071 233600 267919 291703 308279 331035 349293 384547 434373 487979 561594 648363
10630 648363 730386 808264 864383 943721 1069134 1212589 1395550 1636539 1972354 2436591
10620 2436591 3070421 3907640 5005737 6394592 8014210 9622759 10849072 11397786 11292082
10611 11292082 10840772 10439749 10377703 10841412 11943942 13796953 16433867 19663966 22811178
10602 22811178 24851275 25071239 23660611 21574822 19768808 18784256 18838114 19999489 22323331
10593 22323331 25727450 29785876 33421021 35150202 34098570 30788342 26691780 23147710
10585B3147710k459410j302342j97823Q37855J671378K053884J635472K40455
10577B5627179j635728k986508l298692k784521j966670j197720n58022m2322
10569A1156996L26112M39283J89520l82687j082324j581592j669546j467383j173091
10560D755288q91472o56166m98502l82531k90095k17129j70101j41995j24419
10551A382878j22788j10798r2309r0143p7659n9446n4706o2579m6316l5572l8202
10540E92360l9221j9934o780k8084k6957l5438j2424j5052k5497l3639j2480n018
10528C31836j9807m826p653j6360j8444m433P247m221k7803k0734j4074J0933
10516B11661L228r264j5516j3288j0515m788k43q240j0021K945L414j0290j3319
$$ plain form
10585 23147710 20688300 19385958 19188135 20025990 21697368 23751252 25386724 25627179
10577 25627179 23991451 21004943 17706251 14921730 12955060 11757340 11199318 11156996
10569 11156996 11483108 11922391 12111911 11729224 10646900 9065308 7395762 5928379 4755288
10560 4755288 3863816 3207650 2709148 2326617 2036522 1819393 1649292 1507297 1382878
10551 1382878 1260090 1149292 1056983 966840 889181 829735 775029 712450 666134 630562 592360
10540 592360 553139 533205 526425 498341 471384 435946 423522 408470 382973 349334 336854 331836
10528 331836 312029 307203 299550 283190 264746 260313 267560 263339 235536 214802 200728 211661
10516 211661 214889 205625 190109 176821 166306 161518 161275 153035 143014 145959 149373 139083 125764
10503A25764r899o639j19K047J3670J9556j93k3399j1634j0417j3646p75J3709
10490I8025J2491j7148j9330R558J0369j5883l994O077M297J27N973l396n992
10477H1174J211O865J2702O40p403n846q786o043R739k941p892L974l520j1128
10463F2746j0232k359K1434J6392m633j8032j3768O934J0423M865r799L585J3478
10450H1034J5443r704k5440l694O708j136j2551j0856K266L705q526j0675J5762
10437D2336N709n027N261J5835n01j3685r208K547P226P748l133j1568j0249l592
10423B9699j205j523j6448q991K715M46M407j760l382J6577P985l353O397q203
10409B3361r010p029n588J3875J088l897k265J6791P022p169p021j6231m271J6612
$$ plain form
10503 125764 115865 109226 109107 111154 124824 144380 144187 120788 109154 98737 85091 84316 98025
10490 98025 110516 93368 74038 83596 93965 78082 74088 80165 84462 84589 90562 87166 81174
10477 81174 82385 89250 101952 102592 95189 89343 80557 74514 84253 81312 73420 77394 73874 62746
10463 62746 52514 50155 71589 87981 83348 65316 51548 58482 68905 73770 63971 67556 81034
10450 81034 96477 86773 61333 57639 64347 63211 50660 39804 42070 45775 37249 26574 42336
10437 42336 48045 43018 48279 64114 63613 49928 40720 43267 50493 58241 55108 43540 33291 29699
10423 29699 28494 26971 10523 1532 4247 4693 9100 7340 3958 20535 28520 25167 31564 23361
10409 23361 14351 7322 1734 15609 16697 12800 10535 27326 34348 27179 20158 3927 -344 16268
10395A6268l423P99j003l137q270N833O600Q293J2581P969K018j0465j8980j2584
10381B499N868J4484m172l356p863J1679J3726n807n925j2486o412j2553L221
10368g097J1318m289J57k963P797Q92J326J0584n892p988J0165R396o386m087
10354A2933RN508R944O233k74r850q33N34n953l911n370J176j1388j2460L171
10339a0531Q153l01q623L431n01K566J5136J7204K803j5460r455Q904J158j3678
10325H06j335K264O996J162l777J348M270L96K013Q08n882N834k884m357j112
10310F550L697N652P149n677q833M139n598j5289j83J5461K447j1182m026p240
10296a2933j4027K648Q379J4262n535j815k617m899L693J0584l506K457P69J136
$$ plain form
10395 16268 12845 13644 12641 9504 1234 7067 13667 21960 34541 42510 44528 34063 15083 2499
10381 2499 8367 22851 18679 15323 7460 19139 32865 27058 21133 8647 2235 -10318 -7097
10368 -7097 4221 -68 89 -2874 4923 5815 7141 17725 11833 3845 14010 23406 17020 12933
10354 12933 12942 18450 28394 34627 34353 24503 23670 24204 18251 14340 8970 10146 -1242 -13702 -10531
10339 -10531 -2378 -2679 -11302 -7871 -8372 -5806 9330 26534 29337 13877 4422 13326 14484 806
10325 806 -529 1735 8731 9893 6116 7464 11734 12130 14143 14951 9069 14903 12019 7662 6550
10310 6550 10247 15899 23048 17371 8538 12677 7079 -8210 -8393 7068 9515 -1667 -5693 -12933
10296 -12933 -26960 -24312 -15933 -1671 -7206 -9021 -11638 -16537 -12844 -2260 -5766 -3309 -2540 -1404
10282a404l370J1037L289N651r022q609K3790P491j3289M747k836K058L975j5031
10268H477p290j837P850q494j0364l586J3700J6091j732j6832j0810j1J120j5331
10254b9049P462J0104Q545Q91N059Q636Q356P887j4549J186P255k760j8996j8708
10240a8681Q216j2458j7011l576K0200m3P656M862N390J1599p398o477j435r844
10226a9000j614l125k846J1504N016Q561k124r695j560l517m21n049j2330Q009
10212b8191R275O173j272j1506R369O462j0433o531J4363R350O684p897j5758
10199a9912j075R210J4j3728K085K0712J0409p540j3374k895o50m165L106j734
10185a9537P062r70J2574L0736J1712J41R615R455K222m921J800m396m941J31
$$ plain form
10282 -1404 -4774 6263 9552 15203 6181 -2428 21362 28853 15564 20311 17475 19533 23508 8477
10268 8477 1187 -650 7200 -1294 -11658 -15244 -1544 14547 12815 -4017 -14827 -14838 -13718 -29049
10254 -29049 -21587 -11483 -2938 -2047 3012 11648 20004 27891 13342 14528 21783 19023 27 -18681
10240 -18681 -10465 -22923 -39934 -43510 -23310 -23353 -15697 -10835 -5445 6154 -1244 -7721 -9156 -19000
10226 -19000 -20614 -23739 -26585 -15081 -10065 -1504 -3628 -13323 -14883 -18400 -18821 -23870 -36200 -28191
10212 -28191 -18916 -12743 -14015 -25521 -16152 -9690 -20123 -26654 -12291 -2941 3743 -4154 -19912
10199 -19912 -20987 -11777 -11763 -25491 -23406 -2694 7715 175 -13199 -16094 -16744 -20909 -17803 -19537
10185 -19537 -12475 -13445 -871 29865 41577 41718 51333 60788 63010 58089 59889 55493 50552 50683
10171E0683J062k78j365J3479J2607L0314K5015q346j6817P449n086j3084L374
10158I9007J4772K1124J3012K0574J6576N966Q23j8080l6440j0747j2045j3051
10146A01491p42K582L423P033J278N351j0744k7200r510m419J263q173j4392j414
10132D5827J2528J4166j8583k2083K863Q949j3918k269J213j0139m473j615o564
10119E902q84M804M089p012P219Q499J002p50j0537o118r341l259j385K810j19
10104e080N183K998L065r271o027J9837P98o831j1964l13O356p860J3650q291
10090c750r780J1793L468p878j5072K106J7488J04j7852j2175J8744j141J1426
10077b519K4184j9868j9708K005K818l100P241R301m822j901q298r748n507M482
$$ plain form
10171 50683 51745 51467 50102 63581 76188 106502 131517 123171 106354 113803 108717 95633 99007
10158 99007 113779 134903 147915 168489 185065 191031 191854 173774 137334 126587 114542 101491
10146 101491 100749 103331 106754 113787 115065 120416 109672 82472 72962 68543 69806 61633 47241 45827
10132 45827 58355 72521 53938 31855 34718 43667 29749 27480 28693 18554 14081 12466 5902
10119 5902 5018 9822 13911 6899 14118 22617 23619 22869 12332 6214 -3127 -6386 -7771 -4961 -5080
10104 -5080 103 3101 6166 -3105 -9132 10705 11503 4672 -7292 -7605 -1249 -9109 4541 -3750
10090 -3750 -13530 -1737 1731 -6147 -21219 -19113 -1625 -1521 -19373 -31548 -12804 -13945 -2519
10077 -2519 21665 1797 -17911 -15906 -13088 -16188 -8947 354 -4468 -6369 -14667 -24415 -29922 -25440
10063b5440M069j210Q837Q875k626p832p070j498K886j729j129n825J4286J6921
10049A515p901k457P070L450K78M812o534o798j7089J1159J5718K548j410p990
10035c629l786N354M531L558m823m211j123o976p517j21p252P036N435O111N408
10020b005l10p458j282O294m898r722o83O842n137O62M603j984r323o095n30M164
10004b6862N763J7460m148K413K785r15O046m1k1117j3152l098O352J0783n036
9990b2767J2397M267k02j987J574m851j0134j234N212Q756L663p035q730O835
9976a4236R717j9425J309P643M491r101O982J121j4889N095l43j1740m304Q131
9962b9549N474K2636J5251q232m261q417q647r91K980J442l760P313J1006j1437
$$ plain form
10063 -25440 -21371 -22581 -13744 -4869 -7495 -15327 -22397 -23895 -21009 -22738 -23867 -29692 -15406 1515
10049 1515 -6386 -8843 -1773 1677 1955 6767 233 -6565 -23654 -12495 3223 5771 4361 -3629
10035 -3629 -7415 -2061 2470 6028 1205 -3006 -4129 -11105 -18622 -18743 -25995 -18959 -13524 -7413 -2005
10020 -2005 -2315 -9773 -11055 -4761 -9659 -19381 -20064 -13222 -18359 -17697 -13094 -15078 -24401 -30496 -31026 -26862
10004 -26862 -21099 -3639 -7787 -5374 -2589 -3504 2542 2501 -18616 -31768 -34866 -28514 -17731 -22767
9990 -22767 -10370 -6103 -6305 -8292 -6718 -11569 -21703 -22937 -17725 -8969 -5306 -12341 -21071 -14236
9976 -14236 -4519 -23944 -22635 -14992 -10501 -19602 -12620 -11499 -26388 -21293 -21636 -33376 -37680 -29549
9962 -29549 -24075 -1439 13812 5580 1319 -7098 -15745 -16736 -13756 -12314 -16074 -8761 2245 -9192
9948i192p692j361k685j2768p074J4641J6262P567Q620L265j0010r578Q941j2262
9934a3326m733P725M800l04P217K8446J1491q923j5937o534j727n777q460j557
9920g599q63M725J4166J78r055M639l111l704q315P406J0023P57p072j1792m494
9905a4111m173n27J3592Q051J005L666r713m54q35l033o811j1154n67k306J214
9890b6156n741L653O057q317Q285M900m51o565J0962k961m887M175J2844K119
9876b083n41m130J062n133l842O382j6301m434j151O992R242j0373k455Q551M345
9861a3869j292N284N665M231Q356k435j5549j1043l039Q378J2540Q343j3582j4785
9847b2797r674K0709N325q406p640n230K371J361J15Q033J1624j1080n729j95
$$ plain form
9948 -9192 -16884 -18245 -20930 -33698 -40772 -26131 -9869 -2302 6318 9583 -427 -10005 -1064 -13326
9934 -13326 -18059 -10334 -5534 -5838 1379 29825 41316 32393 16456 9922 8195 2418 -6042 -7599
9920 -7599 -8462 -3737 10429 10607 1552 6191 3080 -624 -8939 -1533 8490 9247 2175 -9617 -14111
9905 -14111 -18284 -18811 -5219 2832 3837 7503 -2210 -2664 -3499 -6532 -13343 -24497 -25064 -27370 -26156
9890 -26156 -31897 -28244 -22187 -30504 -22219 -17319 -17770 -24335 -13373 -16334 -21221 -17046 -4202 -2083
9876 -2083 -2624 -6754 -5692 -10825 -14667 -8285 -24586 -29020 -30171 -23179 -13937 -24310 -26765 -18214 -13869
9861 -13869 -15161 -9877 -4212 19 8375 5940 -9609 -20652 -23691 -15313 -2773 5570 -8012 -22797
9847 -22797 -32471 -11762 -6437 -14843 -22483 -27713 -25342 -23981 -23866 -15833 -4209 -15289 -21018 -21213
9833b1213Q213l974N648Q660n434j162L40p174J5462O721j2247M910P576m424
9819A902r764m833J023J4632K35j1811k622J5679J4881l761q913l262q80r889
9805g383l595J9466n283l098o784r096J5596Q216K085m628O660q122p454Q208
9791D788P888l81k459l765j274k94n601J2439n802M762J2982K7308L4113N7667
9777A42371R6368J14145Q6412J7969o4090j14995j04080o7903l5098r388o725
9766E4986j1130m77m427N381j3418o593n979n96J0986L859o363m784k1394j0852
9752a0801m592J2497K3955q686j6039m91J1689J911o371l731j0232N824J3006
9739G939N243K328n2O656M010r556k0987n435k25J383k983n74L859J9021J2568
$$ plain form
9833 -21213 -13000 -16974 -11326 -2666 -8100 -9262 -8922 -16096 -634 6087 -6160 -1250 6326 1902
9819 1902 -7862 -12695 -11672 2960 3195 -8616 -11238 4441 19322 15561 6648 3386 2506 -7383
9805 -7383 -10978 8488 3205 107 -6677 -15773 -177 8039 10124 5496 12156 4034 -3420 4788
9791 4788 12676 12295 9836 6071 4797 4503 -1098 11341 5539 10301 23283 50591 84704 142371
9777 142371 238739 352884 439296 457265 393175 278180 174100 106197 71099 61711 54986
9766 54986 43856 43379 38952 44333 30915 24322 18343 17747 28733 32592 26229 21445 51 -10801
9752 -10801 -15393 -2896 21059 12373 -3666 -4157 7532 9443 3072 -659 -10891 -5067 7939
9739 7939 13182 15510 15458 22114 26124 16568 -4419 -9854 -10079 -8696 -11679 -12253 -8394 10627 23195
9724B3195J1547k5346j6254K218r27K560Q345r81j8587o26l119j357K7070P050
9710A4788n541k5567j0011J1875M028r480l580K719K909J4756L769j3062l583
9697a5980M561J1419K153n759n899J2570P800j0248J1606P34n193n659q041j043
9683f979j0638m38J3823N487k002k767m76n781R774k203k265L701J894N779J0224
9668A7133k255P700j8788q792q749Q806J3454l743k104P725l918n2o837p038J1081
9653C623J9940J4551L2851L3168K8489M9310O562l0544m6776m0114k3807j9816
9641B7437o520p650p121l93J2254M766n346k163k710p455J411J1942M390m197
9627A8645N721j41r224j6249N666Q675o620n573j607P366k779l636Q697J5665
$$ plain form
9724 23195 34742 9396 -6858 -4640 -5567 -3007 5338 4357 -14230 -14856 -17975 -19332 7738 14788
9710 14788 9247 -16320 -26331 -14456 -10428 -19908 -23488 -20769 -17860 -3104 665 -12397 -15980
9697 -15980 -11419 0 2153 -3606 -9505 3065 10865 617 12223 12957 7764 2105 -5936 -6979
9683 -6979 -17617 -18055 -4232 1255 -747 -3514 -3990 -9771 3 -2200 -4465 -764 1130 6909 17133
9668 17133 14878 22578 3790 -5002 -13751 -4945 8509 4766 2662 10387 6469 6417 -420 -7458 3623
9653 3623 23563 38114 70965 104133 132622 181932 188494 157950 111174 71060 47253 27437
9641 27437 20917 13267 6146 5753 18007 22773 17427 15264 12554 5099 6510 18452 22842 18645
9627 18645 24366 24225 15001 -1248 4418 13093 6473 900 -707 6659 3880 244 8941 24606
9613B4606k259m926j899L809K245m739o78n558j5873k224P496K445j2111M841
9599d825Q167n438P043K889J124P509m78n651k6376j9070p22K9893L803l029M870
9584b91L338L16j6578j0048M704J2269N451k534N295L599J679O986K523j6118
9570E91M511Q071M423J0086j0371k553M799j0618j5712r647j357P44J665l009
9556a8377K391M081O134l756Q865O678J0665P298Rm715K966J1995P44p040j8965
9541H973j3462j82n09o98n139M825m190j1229P627M701r030j483J4660o71l12
9526f119M082J1320J4440Q109o584j2230q353P85j0911p983R325J7400n443k008
9512E830j0077M096k2O403O18l886J482o123J467M21j0114n521P404K463K562
$$ plain form
9613 24606 22347 17421 15522 19331 21576 16837 16159 10601 -5272 -7496 0 2445 -9666 -4825
9599 -4825 3342 -2096 4947 7836 8960 16469 15991 10340 -16036 -35106 -35828 -5935 -2132 -5161 -291
9584 -291 3047 3363 -13215 -23263 -18559 -6290 -839 -3373 1922 5521 7200 14186 16709 591
9570 591 5102 13173 17596 27682 17311 14758 19557 8939 -6773 -16420 -17777 -17033 -15368 -18377
9556 -18377 -15986 -11905 -5771 -9527 -662 6016 16681 23979 23988 19273 22239 34234 34978 27938 8973
9541 8973 -4489 -4671 -5180 -5878 -11017 -6192 -10382 -21611 -13984 -9283 -18313 -19796 -5136 -5807 -6119
9526 -6119 -2037 9283 23723 31832 25248 13018 4665 5450 -5461 -13444 -4119 13281 7838 5830
9512 5830 -4247 -151 -173 6230 6848 2962 4444 -1679 -212 209 -9905 -15426 -8022 -5559 -2997
9497b997R709J4326J5542m830j2512N150p918q867K869Q603O537r476j784K800
9483A7152n184l980p408j8723O180O276J665r36J1752l769l845J8310j5459r412
9469g381L392O17k651m327n50N596n769m561p128R88M303R530J747J0354P636
9454A1796J594j5977j3364l303N966J48P889J6246k463j4196l213Q93K795L413
9440a776R461J1631M415R980l284k291n118L67r771m742q312N51O188K052O753
9425A6104Q148o855p404J3944J041L81K735n631m094o721J637l214m437J891p387
9410A38j431P540J4429j301p382j319m254R805J100j0730J453J2839r656r878
9396A353O583J0587P920L439j4488k998m761N871m02J5712q377k0691J653Q027
$$ plain form
9497 -2997 6712 21038 36580 31750 19238 24388 16470 7603 10472 19075 25612 16136 14352 17152
9483 17152 11968 7988 580 -18143 -11963 -5687 -4022 -4958 6794 3025 -820 17490 2031 -7381
9469 -7381 -3989 -3372 -6023 -10350 -10900 -5304 -11073 -15634 -22762 -21774 -17471 -7941 -6194 4160 11796
9454 11796 13390 -2587 -15951 -19254 -13288 -13140 -5251 10995 8532 -5664 -8877 -7984 -5189 -1776
9440 -1776 7685 19316 23731 33711 30427 28136 23018 23385 13614 8872 560 1111 7299 9351 16104
9425 16104 24252 17397 9993 23937 24978 25359 28094 22463 18369 11648 13285 10071 5634 7525 138
9410 138 -1293 6247 20676 19375 11993 10674 6420 16225 17325 6595 8048 20887 11231 1353
9396 1353 7936 18523 26443 29882 15394 12396 7635 13506 13104 28816 20439 -252 1401 9428
9382I428R248k287M995N237O7o001j6846M271J1858N007n59k079p023P523J2938
9367C5777L82J4547q588q682N141j504o333p004J868m485L307K2352O672j9666
9353C3784j285q272q86r479P661J7136j723r271j0218P278J4144K073n520r677
9339B5745r183k961J6620Q205J046n33j41k373m093n382n780O119J2603p237r874
9324B2781O097n869m259N941J261K1889K632j0747o547k774P605n32j2900L061
9310B7639J8802l993r634p743k299O61P326r974j4081M825K355m292M110J447
9296A5149r83r044r971R117j29l421Q033J4370L106n328j97R835L035k3594n152
9281D826L912q606N6N560j037o753n173L876j704J1790O852j1215O356J4042J4242
$$ plain form
9382 9428 18676 16389 21384 26621 26688 20687 3841 8112 19970 24977 24418 22339 15316 22839 35777
9367 35777 36159 50706 42118 33436 38577 37073 30740 23736 25604 21119 24426 46778 53450 33784
9353 33784 32499 24227 23341 13862 21523 38659 36936 27665 17447 24725 38869 40942 35422 25745
9339 25745 16562 13601 30221 38426 39472 38939 38798 36425 32332 26950 21170 27289 39892 32655 22781
9324 22781 28878 23009 18750 24691 25952 47841 50473 39726 33179 30405 38010 37478 24578 27639
9310 27639 46441 42448 32814 25071 22772 23433 30759 20785 6704 11529 13884 9592 13702 15149
9296 15149 14166 5122 -4849 4268 4139 718 8751 23121 26227 20899 20702 30537 33572 9978 4826
9281 4826 8738 132 188 5748 4711 -2042 -7215 -3339 -5043 6747 13599 2384 8740 22782 37024
9266C7024O996r491N949k07R184P498Q054m27K759L875n122o313L955j2850m608
9251D6276R595M693O268J9370Q411k2021j2071m093j88N000l241J0957P872J4944
9237I1772J7680j0236j1297N457k6R246J5845N804Q4r277m945O809J1213P363
9223A35492J1249k20k25m517L328J2238J7833K6208N444k016J3131K0754K5171
9210B63870L0675L8996L1796K3141L6611N9004O5344O0029O8195Q3242R9202J06348
9198I66453J33603J54493J66868J66171J60554J61690J45724J22855P4223M8184
9188B300818J3303m5712q8804j02781j15027j16664j30954j31272j26981j11093
9178A344833r7920r5265q0910q2956o7706o1991o2884n4571l6172m4196m2473
$$ plain form
9266 37024 44020 34529 40478 40271 49455 56953 65007 64580 67339 71214 66092 59779 63734 50884 46276
9251 46276 55871 60564 66832 86202 94613 72592 60521 56428 56240 61240 57999 68956 76828 91772
9237 91772 109452 99216 87919 93376 93350 102596 118441 124245 124329 115052 110107 116916 128129 135492
9223 135492 146741 146521 146296 141779 145107 157345 175178 201386 206830 204814 217945 238699 263870
9210 263870 294545 333541 365337 388478 425089 484093 549437 609466 677661 760903 860105 966453
9198 966453 1100056 1254549 1421417 1587588 1748142 1909832 2055556 2178411 2252634 2300818
9188 2300818 2314121 2268409 2179605 2076824 1961797 1845133 1714179 1582907 1455926 1344833
9178 1344833 1246913 1151648 1070738 987782 920076 858085 795201 740630 704458 660262 617789
9167F17789l4956l7119l9998l9632l4115k4436j8159j1116P55k9975k4494k3268
9155C01276j7927j0259j175j0526j0939r53O875j2105j0932J1468Q287j4252l952
9142B34886n34j83Q970M810R131J2817P078m781p113J1899N515j2692L588m628
9128B68763o336n053N11J0278j620k281k83K852P184L106k437k821K4795L491
9114C00149P81n380N108L082P043j3106j7565j2327q291p378k757n302j6553l815
9100B23689r893r679j733K101O044K136J7314J6843J2301P502J6194K3683J3428
9087C19930M68l26m890R795n99q002j189j7090p157r564j7392r678k2344N393
9073B37355J4097J0231L284j266J2325P151J0743k288n134j2752O530J341K2682
$$ plain form
9167 617789 582833 545714 505716 466084 431969 407533 389374 378258 379013 349038 324544 301276
9155 301276 283349 273090 271915 261389 250450 249497 256372 244267 233335 244803 253090 238838 234886
9142 234886 234352 234169 243139 247949 257080 269897 276975 272194 265081 276980 282495 269803 273391 268763
9128 268763 262427 257374 257885 268163 266543 264262 263979 266831 274015 277121 274684 271863 296658 300149
9114 300149 300930 295550 300658 303740 310783 297677 280112 267785 259494 252116 249359 244057 227504 223689
9100 223689 213796 204117 202384 204485 210529 212665 229979 246822 259123 266625 282819 306502 319930
9087 319930 320398 320072 315182 324977 324378 316376 315187 298097 290940 281376 263984 254306 231962 237355
9073 237355 251452 261683 264967 263701 276026 283177 293920 291632 286498 273746 280276 281617 304299
9060C04299J1800j019J9367K0625L435j521L676p202k3051j2959k434m372j0571
9047C00073l290j7731j6716l803l348k644l168j3648M43K665O931p551l886P105
9033B41432N872j159J3362K405n979J0234O599n001j3574R080L3j2183l30R169
9019B59960O39R628J1101j836j6928q808J9398K0195O723N053M985L543q225O642
9005C12070k034P085J5776n177J551r658j7864j418L729o741j0567k87o419K2227
8991C02273J2077N976N435J6082J4097N812l416O448K8989P219k0314j2702k1084
8978C46892j5550J9103J5789j5188j0008j561J620j613J2554J811M041K118J39
8965C60147J9659K1911N194K339o651N310J4863O435M095K2706N931l97J4856
$$ plain form
9060 304299 316099 315080 334447 355072 358507 356986 360662 353460 330409 317450 315016 310644 300073
9047 300073 296783 279052 262336 258533 255185 252541 249373 235725 236168 238833 245764 238213 234327 241432
9033 241432 247304 246145 259507 261912 255933 266167 272766 267765 254191 263271 263304 251121 250791 259960
9019 259960 260599 270227 281328 279492 262564 253756 273154 293349 300072 305125 310110 313653 305428 312070
9005 312070 310036 317121 332897 327720 329271 319613 301749 300331 304060 297319 286752 286465 280046 302273
8991 302273 314350 320326 325761 341843 355940 361752 358336 364784 393773 400992 380678 367976 346892
8978 346892 331342 350445 366234 351046 341038 339477 341097 339484 352038 353849 357890 360008 360147
8965 360147 379806 401717 406911 409250 402599 407909 422772 429207 433302 456008 461939 461542 476398
8952D76398K3385K896J1196M582m22o380Q472N871R235J5562J7881J2280N564
8939E86520k640p092J8552J7330R114m169K8289N6822N6948N1601N4731O4164
8927I30170M6297L3930L7114J8143j1332k8315m5620m1941n0923m4312j7861j7569
8915H07781j4551j2679r236K3443J2815J2506J5797M298J5329K3076K0470K0113
8903I19162J2849N857J9649K6251O897K5125J9701K1100J8441J1558K8706L4799
8891A150095L1247K2740J5481L4136L8836L5226L7954L9170L0635L5650M0600
8880A511770O4732N3989O2030N0056L7182N2458L7449K8508N4950N5642M8177
8869B056943M8519M6585O2569O1406N2088O1687P4973P5087Q9728P0543P2604
$$ plain form
8952 476398 499783 502679 513875 518457 518035 511655 520127 525998 535233 550795 568676 580956 586520
8939 586520 583880 576788 595340 612670 621784 617615 645904 702726 759674 811275 866006 930170
8927 930170 976467 1010397 1047511 1065654 1054322 1026007 980387 938446 887523 843211 825350 807781
8915 807781 793230 780551 771315 794758 807573 820079 835876 840174 855503 878579 899049 919162
8903 919162 932011 937868 957517 983768 990665 1015790 1035491 1056591 1075032 1086590 1115296 1150095
8891 1150095 1181342 1204082 1219563 1253699 1292535 1327761 1365715 1404885 1435520 1471170 1511770
8880 1511770 1576502 1630491 1692521 1742577 1779759 1832217 1869666 1898174 1953124 2008766 2056943
8869 2056943 2105462 2152047 2214616 2276022 2328110 2389797 2464770 2539857 2629585 2700128 2772732
8858B772732P9511Q8831R4736Q7269J03304J16554J17031J25294J38481J58455
8848C882198J68943J59335J70328J74092J95390K04933K18901K31798K47650K54195
8838E907763K67388K87369L13958L26001L49128L84003M16946M55289N01319N44122
8828I753286O00276O54381P21286P95475Q73962R82140J077125J202121J348497
8819A8008549J511700J681716J886921K137577K412001K753217L162979L659891
8811C7214551M248539M946891N772566O725300P854086R191628J0811848J2800908
8803I9566317J5384167J8738601K2998149K8301844L4650162M1725659M8594196
8796C09959095N3620634N4327009M8167748L3991814J3624125q363725k6730366
$$ plain form
8858 2772732 2852243 2941074 3035810 3123079 3226383 3342937 3459968 3585262 3723743 3882198
8848 3882198 4051141 4210476 4380804 4554896 4750286 4955219 5174120 5405918 5653568 5907763
8838 5907763 6175151 6462520 6776478 7102479 7451607 7835610 8252556 8707845 9209164 9753286
8828 9753286 10353562 11007943 11729229 12524704 13398666 14380806 15457931 16660052 18008549
8819 18008549 19520249 21201965 23088886 25226463 27638464 30391681 33554660 37214551
8811 37214551 41463090 46409981 52182547 58907847 66761933 75953561 86765409 99566317
8803 99566317 114950484 133689085 156687234 184989078 219639240 261364899 309959095
8796 309959095 363579729 417906738 466074486 500066300 513690425 505326700 478596334
8789D78596334l8232551m2687985m1979092l8413258l3725575k8986374k4730379
8782B29841120k1089937j8138305j5818143j4064359j2747175j1756270j0947828
8775A25279103j0279030r646250q979027q335367p692732p070392o445648n851167
8767F0979490n314119m793547m295196l862917l468245l123637k805706k512117
8759C0804006k275946k046225j842917j648417j502785j359942j241576j123264
8751A7762934j030520r29166q41596p74476p13189o38530n83026n48409n35696
8742A1168326n06456m88948m85792m38194m11676l84482l48243l31936l18265
8733G454334l00076k70594k57674k56105k39771k28439k29144k23225j93047j77277
$$ plain form
8789 478596334 440363783 397675798 355696706 317283448 283557873 254571499 229841120
8782 229841120 208751183 190612878 174794735 160730376 147983201 136226931 125279103
8775 125279103 115000073 105353823 96374796 88039429 80346697 73276305 66830657 60979490
8767 60979490 55665371 50871824 46576628 42713711 39245466 36121829 33316123 30804006
8759 30804006 28528060 26481835 24638918 22990501 21487716 20127774 18886198 17762934
8751 17762934 16732414 15803248 14961652 14187176 13473987 12835457 12252431 11704022 11168326
8742 11168326 10661870 10172922 9687130 9248936 8837260 8452778 8104535 7772599 7454334
8733 7454334 7154258 6883664 6625990 6369885 6130114 5901675 5672531 5449306 5256259 5078982
8723E078982j66115j42905j37090j35010j26043j21753j09332j12585j09603j04045
8713C814501r9000r3856p9206q6162q2687o9718p6576o7619n6676m7807m5749
8702C009445l9533m2807l8520m1207l4800k3490k5785l0995l3226l5887j8967
8691B644228k7800n626k379k3742k864k672J8090J0410R33J2538Q280J2300J6253
8678B657949Q456L1290L7042N4499N5516N9329O3765P7122R7659J00800J01483
8667C344910J07918J16900J29701J56874J75579K28449K71392L56736N08188O41766
8657F038413Q10525J105078J457306J884802K330530K667130K637216J977636
8649B0908636O94030q16071j999686k486242k347220j884714j399917r79856o44707
$$ plain form
8723 5078982 4912867 4769962 4632872 4497862 4371819 4250066 4140734 4028149 3918546 3814501
8713 3814501 3715501 3621645 3542439 3456277 3373590 3303872 3227296 3159677 3103001 3055194 3009445
8702 3009445 2969912 2927105 2888585 2847378 2812578 2789088 2763303 2732308 2699082 2663195 2644228
8691 2644228 2616428 2610802 2608423 2584681 2581817 2579145 2597235 2607645 2608578 2621116 2629396 2641696 2657949
8678 2657949 2666405 2697695 2734737 2789236 2844752 2904081 2967846 3044968 3142627 3243427 3344910
8667 3344910 3452828 3569728 3699429 3856303 4031882 4260331 4531723 4888459 5396647 6038413
8657 6038413 6848938 7954016 9411322 11296124 13626654 16293784 18931000 20908636
8649 20908636 21602666 20786595 18786909 16300667 13953447 12068733 10668816 9688960 9044253
8640I044253l95257j95144j3019J39996K76874M54571O54571Q53737J066242J379424
8630A3266248J757511K192125K686511L281830L912665M520123M979229N115774
8622D1712016M718705L638290J857258m23430k662842m241705m874889m663350
8614C5060053l935577l030833k159210j369079o13832O4185P52116J497670K334066
8605B8599559L296524M350180N335912N996155N954570M787367K420832p36193
8597F0004906l822377o027334o900363o657463n770464m683008l695340k895525
8589A9553032k236982j713915j311231r66142o78064m18320j46221J54715M89348
8580A2726220R08590J420725J989173K529519K833276K629412J639985M8163j638385
$$ plain form
8640 9044253 8648996 8453852 8440833 8580829 8857703 9312274 9966845 10820582 11886824 13266248
8630 13266248 15023759 17215884 19902395 23184225 27096890 31617013 36596242 41712016
8622 41712016 46430721 50069011 51926269 51502839 48839997 44598292 39723403 35060053
8614 35060053 31124476 28093643 25934433 24565354 23951522 24015707 24767823 26265493 28599559
8605 28599559 31896083 36246263 41582175 47578330 53532900 58320267 60741099 60004906
8597 60004906 56182529 50155195 43254832 36597369 30826905 26143897 22448557 19553032
8589 19553032 17316050 15602135 14290904 13324762 12646698 12228378 12082157 12236872 12726220
8580 12726220 13634810 15055535 17044708 19574227 22407503 25036915 26676900 26725063 25086678
8571B5086678k822565l241915l069150k587057k066187j607065j259420j021994
8563G411325q25802o72117n62671m67177m06320l45084l03567k77086k22151k15958
8553C113392j86480j43081j40179j31448j22925j14430q7192p3072p6374p6553
8543A961658o4156n2532n9692o7960m2562l1060l9017l8208l8805j9278k0819
8532A487569j9877l241N805j1161m5492o8429m8558l2603k7653j8269k3254j6090
8520A178747k9882k9963l8107j9624j7109j846j6841j8877j1273j1557r19j6524
8508I66225j4918j3113k995N833j2014o031j6177k3230n052K776m343K389J508
8495H80858J0195J3629Q009J5540J4046K2747M2318N7896Q4641J27433J20753
$$ plain form
8571 25086678 22264113 19022198 15953048 13365991 11299804 9692739 8433319 7411325
8563 7411325 6585523 5913406 5350735 4883558 4477238 4132154 3828587 3551501 3329350 3113392
8553 3113392 2926912 2783831 2643652 2512204 2389279 2274849 2187657 2114585 2038211 1961658
8543 1961658 1897502 1844970 1785278 1717318 1674756 1643696 1604679 1566471 1527666 1508388 1487569
8532 1487569 1467692 1464451 1470256 1459095 1413603 1345174 1296616 1264013 1236360 1218091 1194837 1178747
8520 1178747 1148865 1118902 1080795 1061171 1044062 1042216 1025375 1006498 995225 983668 982749 966225
8508 966225 951307 938194 935199 941032 929018 922987 906810 883580 878528 881304 876961 879350 880858
8495 880858 891053 904682 912691 928231 942277 965024 1007342 1065238 1149879 1277312 1398065
8484A398065O8904K5228K4580P7588J06489J16381J32917J20366J09325Q2526
8474B262369K3212l2863p6410j37496j56730j55514j62649j31916j17880j03719
8464A210404q9314r9577o3993m4367l9938m6011k5987l0420k2825l0682k7062
8453F90228k991k0869k9287j1487j8990j2335q636l770j3812r628R47L3962L7631
8440F30963o635k2233j6659j9167k9016j6958j4403R56j5396j4393p772j1812
8428D57475r765j0174N481J6269J852j2593n540M317O871n083R50J4549K0826
8415D85435J2918J4129J1763K2883J347O534K1134K7066K7819K5749L2872O6832
8403G56481P5594P1401P9292J00595J01331J25473J39741J37476J58795J69469
$$ plain form
8484 1398065 1466969 1492197 1516777 1594365 1700854 1817235 1950152 2070518 2179843 2262369
8474 2262369 2285581 2252718 2176308 2038812 1882082 1726568 1563919 1432003 1314123 1210404
8464 1210404 1121090 1021513 957520 913153 873215 827204 801217 770797 747972 717290 690228
8453 690228 687237 666368 637081 625594 606604 594269 585633 581863 568051 558423 559370 593332 630963
8440 630963 624328 602095 585436 566269 537253 520295 505892 506848 491452 477059 469287 457475
8428 457475 447710 437536 443017 459286 461138 448545 443005 447322 454193 449110 450060 464609 485435
8415 485435 498353 512482 524245 547128 548475 555009 576143 603209 631028 656777 689649 756481
8403 756481 832075 903476 982768 1083363 1184694 1310167 1449908 1587384 1746179 1915648
8393A915648J68983J41472J16318Q0779M0966m318l0729o9670j11083j11205j24121
8382B013040j40331j43622j24854j06553j02011j06110p9706p6673p1186o8385
8372I93609m6554n1825n9814l2738k6654m0330l9394l2368l7502l3385k8513l0141
8360E34391l1775k3089k0475j4788K519q147j8657j4437K968j2039r523j0737
8348C76211N905k513m278j9984j8061N794j0669r033M344L979j6151r253J0591
8335C16882J165j1703j4715j669L408n578k188j1660O843l197m577Q505M930J1342
8321B97788J924p421m736P377O289O367P15l795K114m893n993m702q224K05o748
8306B76267j3339O56p806J3913K350n827K504K1991Q654J7616J3460L367j5746
$$ plain form
8393 1915648 2084631 2226103 2342421 2423200 2464166 2459848 2429119 2359449 2248366 2137161 2013040
8382 2013040 1872709 1729087 1604233 1497680 1395669 1289559 1209853 1133180 1061994 993609
8372 993609 947055 895230 835416 802678 776024 735694 696300 663932 626430 593045 564532 534391
8360 534391 502616 479527 459052 444264 446783 438636 419979 405542 408510 396471 386948 376211
8348 376211 382116 379603 375325 355341 337280 343074 332405 323372 327716 331695 315544 306291 316882
8335 316882 318047 306344 291629 289960 293368 287790 285602 273942 280785 277588 273011 281516 286446 297788
8321 297788 299712 292291 287555 294932 301221 307588 308303 304508 306622 301729 295736 291034 282810 283015 276267
8306 276267 262928 263584 255778 269691 272041 266214 268718 290709 299363 316979 330439 333806 318060
8293C18060r08r06M536J7681k830n167k161K642j745M269Q765O920J6816J1649
8279C77621j0556P138K95j515J6699Q376K2887K5185J9892J9885K9928M4622M0085
8266F00542N0765N0977N0200M8724N4162O2510Q0605Q6779Q0408Q9506R7082R1847
8254A444107J05206Q9921N6436L6087j0073k5219m0674o5040r7090j06618j18259
8243A268784r8951p3210p7394q0330n1678n3983m8555n0820l1586l5868j9204
8232F47205j9169k6709l9595k7029k5332j0682j668m721p97O951Q108j0875n597
8219D90090J5162J0113k372m610O50k507J32K120J0190Q874K4442K7490K3490
8206F03264N633J3285k28j8043O242M1995K0516K4103K3828K4075J3277K9820
$$ plain form
8293 318060 317152 316246 320782 338463 335633 330466 328305 330947 329202 333471 342236 349156 365972 377621
8279 377621 367065 374203 374498 372983 389682 398058 420945 446130 466022 485907 515835 560457 600542
8266 600542 651307 702284 752484 801208 855370 917880 998485 1085264 1165672 1255178 1352260 1444107
8254 1444107 1549313 1639234 1695670 1731757 1721684 1696465 1655791 1590751 1493661 1387043 1268784
8243 1268784 1169833 1096623 1019229 938899 887221 833238 784683 733863 702277 666409 647205
8232 647205 628036 601327 561732 534703 509371 498689 497021 492300 491503 498454 506562 495687 490090
8219 490090 505252 515365 512993 508383 509033 506526 506658 508778 518968 527842 552284 579774 603264
8206 603264 608897 622182 621954 603911 610153 652148 672664 696767 720595 744670 757947 787767
8194G87767J4740J5290K2952L3909K6478P671J8147L6986O3642N3558N6150M6150
8182A183440L6008O7029Q4784R5416R0147R6049R9686J18674J43516J52729J63329
8171B330807J94059K19547K64108L02820L32821L81259M41625N02946N74960O67955
8161F212907P67952R02940J056227J230658J450219J670088J870799J978519J902479
8152A9042788J562652R36962J16742o71350j237918j475828j457735j236720r45942
8143A4633651o18363k98351K9307L09985N95185Q89812J153876J452182J784117
8134A9931401K154190K556955K984311L403221L742187L897409L771121L218694
8126D5659489K219891Q67244o36314j953959k861533l280459l251692k919097
$$ plain form
8194 787767 802507 817797 840749 874658 901136 908807 926954 963940 1027582 1081140 1137290 1183440
8182 1183440 1219448 1286477 1371261 1466677 1556824 1652873 1752559 1871233 2014749 2167478 2330807
8171 2330807 2524866 2744413 3008521 3311341 3644162 4025421 4467046 4969992 5544952 6212907
8161 6212907 6980859 7883799 8940026 10170684 11620903 13290991 15161790 17140309 19042788
8152 19042788 20605440 21542402 21659144 20987794 19749876 18274048 16816313 15579593 14633651
8143 14633651 14015288 13716937 13746244 14056229 14651414 15541226 16695102 18147284 19931401
8134 19931401 22085591 24642546 27626857 31030078 34772265 38669674 42440795 45659489
8126 45659489 47879380 48746624 48110310 46156351 43294818 40014359 36762667 33843570
8118C3843570k387467j783534j186825n95893m2345M65599R57818J466504J928319
8109C2665746K284845K523420K512554K145333J389404L23539q71931j986549
8101D0986361k852490l387626l573267l495582l227272k866687k477729k083395
8093A7022313j713793j408290j143260r19117p02616n22923l69054k07667o2908
8084I972685Q2931K63596M49499O26411Q15405R53821J037535J025483Q38608
8075A6065974M26052j49496p60755j268928j543299j592441j491158j291901j078059
8066G315989q90418p12533n87421m89034m20311l56014k96493k51317k19563k08839
8056B884046j93385j66164j55439j33602j35542j22434j06215q4402q3015p5296
$$ plain form
8118 33843570 31456103 29672569 28485744 27889851 27847506 28313105 29270923 30737427 32665746
8109 32665746 34950591 37474011 39986565 42131898 43521302 43844841 42972910 40986361
8101 40986361 38133871 34746245 31172978 27677396 24450124 21583437 19105708 17022313
8093 17022313 15308520 13900230 12756970 11837853 11135237 10612314 10243260 10035593 9972685
8084 9972685 10055616 10319212 10768711 11395122 12210527 13164348 14201883 15227366 16065974
8075 16065974 16492026 16342530 15581775 14312847 12769548 11177107 9685949 8394048 7315989
8066 7315989 6425571 5713038 5125617 4636583 4216272 3860258 3563765 3312448 3092885 2884046
8056 2884046 2690661 2524497 2369058 2235456 2099914 1977480 1871265 1786863 1703848 1628552
8046A628552o8274o3399n6416l4999m9362n1704n0497m8112m0659l7413n5214
8035A072503l3473j7252j9564k0668l1265k2258j8891k0865k4184k8099k8508
8024H07476j4722j833j2546j7293j0270r782k0079j5621q634j4050k112Q452l836
8011F85150K592P242k0186k1046j4475P413M491k776P542o540M954l987j3024
7998F37350j8219O319K020K735O907J6038K1117K177J8515J8150J4501L9830L2099
7985G99539K2839J8100J7340K4541J7145p46l0043m3382m2998m1168m3958m4000
7973F53209l8018k6753l4208l6620j9205q857j8805l0663j6730Q3l130j3621j7821
7960C88861k2186j3132j6749j4102j2626J053M723P356k294r180k215n355m903
$$ plain form
8046 1628552 1560278 1496879 1440463 1405464 1356102 1304398 1253901 1205789 1165130 1127717 1072503
8035 1072503 1039030 1021778 1002214 981546 950281 928023 909132 888267 864083 835984 807476
8024 807476 792754 790921 778375 761082 750812 741030 720951 705330 696696 682646 680534 688986 685150
8011 685150 687742 694984 674798 653752 639277 646690 651181 648405 655947 649407 654361 650374 637350
7998 637350 619131 625450 627470 630205 637112 653150 674267 676444 694959 713109 727610 767440 799539
7985 799539 822378 840478 857818 882359 899504 898758 868715 825333 782335 741167 697209 653209
7973 653209 615191 588438 554230 517610 498405 489548 470743 440080 423350 423433 420303 406682 388861
7960 388861 366675 353543 336794 322692 310066 311119 315842 323198 320904 311724 309509 304154 299251
7947B99251j9496P134j3916q624J628k229n58j4195j7324k318J1060Q511Q287
7934B57211o083K688p81n435p400L125l441j3281Q926n215q978k938J1636r303
7920B20731j973n393q351L25k909l505j2975j362K2113J0102o031q096q267J1066
7906B05475J449K403n589M708l334n103n506m134p313L061K783j6568q230j0J636
7891A65728k008O12k128q963J0944J6874O819k335q941q607p443M638O781L469
7877A75440q239l385m834M701O501j3603j0572k351l944j6388J1568Q975J013
7864A44882J466J1812J924j8169N329q36r167o585n131q716J2359J3286P357p002
7850A42809J650j5165j616o493J825P563J485j242j0507r051R276J5007R639M072
$$ plain form
7947 299251 279755 286889 272973 264349 265977 263748 263190 248995 231671 229353 240413 248924 257211
7934 257211 251128 253816 253035 247600 240200 243325 239884 226603 235529 230314 221336 218398 230034 220731
7920 220731 218758 213365 205014 205339 202430 198925 185950 184588 206701 216803 210772 202676 194409 205475
7906 205475 206924 209327 203738 208446 205112 200009 194503 190369 183056 186117 188900 172332 164102 164092 165728
7891 165728 163720 164332 162204 153241 164185 181059 187878 185543 176602 167995 160552 165190 171971 175440
7877 175440 167201 163816 158982 163683 170184 156581 146009 143658 139714 123326 134894 143869 144882
7864 144882 146348 158160 160084 141915 147244 146408 137241 130656 125525 116809 129168 142454 149811 142809
7850 142809 144459 129294 127678 121185 123010 130573 132058 130816 120309 111258 120534 135541 145180 149252
7836A49252j6483n964J001m246j1552M964J0594q086J0836J2583K954n648J16
7823A40321q31j7245j6500Q33J6977O816k812j0294j1681K739j719j1225k748
7810I2631J402l966M695K0073n49j0022m494o10k899j970j379L022p588k02Q14
7795H8958Q166o385l716J1199J18k663r990p038J1431P892n45q576R409j993r528
7780H6739K068M762P441O454M102J833l541j8761m281o572n879o616J0517N881
7766H4147L238J4354J8304j2385m517O616j3177n917p677q19J9187q813k1417
7753G1124j241j0658J4254L292j1605K0800J2415q987m238M181j9535m762M964
7740G0004N506q241J555m36O297J5556J447n415j5529l506J0090Q683Q09p324
$$ plain form
7836 149252 132769 126805 127806 123560 112008 116972 127566 119480 130316 142899 145853 140205 140321
7823 140321 139490 122245 105745 106578 123555 130371 127559 117265 105584 108323 106604 95379 92631
7810 92631 94033 90067 94762 114835 114286 104264 99770 99160 96261 94291 92912 95934 88346 88144 88958
7795 88958 97124 90739 87023 98222 98340 95677 85687 78649 90080 97972 97427 88851 98260 96267 86739
7780 86739 88807 93569 101010 107464 111566 113399 109858 91097 86816 80244 74365 67749 78266 84147
7766 84147 87385 101739 120043 107658 103141 109757 96580 90663 82986 82167 101354 92541 71124
7753 71124 69883 59225 73479 76771 65166 85966 98381 89394 85156 89337 69802 65040 70004
7740 70004 75510 67269 68824 68388 74685 90241 91688 86273 70744 67238 77328 86011 86820 79496
7726G9496r583O800J945p014O016j0044p109Q853O818R327L967K367O986N566
7712A04391o322n087n596M75R507r782r499j081o379J998J970J530M055n196Q573
7697H3557K804J4689J4398r147q728K640Q553L841j4297n231Q742O706l214Q30
7683A06143J2630K374n01j3437m623l670m089J136N645p161m697m640J218P460
7669I3788K299N179m786l29k381j1206q764n93J1795n770j0700J0181l327n161
7655G0225o60Q288J2541j599L566L839m470q256p23j02J939m482j722L156R098
7640I0638J4902Q561L183K638p071l121J5315R768o35J7001R752O121n335j5439
7626A46278j1586J5444O79M978M115j1740l961J3063k724Q860J504j4232j5213
$$ plain form
7726 79496 69913 76713 78658 71644 77660 67616 60507 69360 76178 85505 89472 91839 98825 104391
7712 104391 98069 92982 87386 87861 97368 87586 78087 77006 70627 72625 74595 76125 80180 74984 83557
7697 83557 86361 101050 115448 106301 97573 100213 108766 112607 98310 93079 101821 108527 105313 106143
7683 106143 118773 121147 120646 107209 102586 98916 94827 95963 101608 94447 89750 85110 86328 93788
7669 93788 96087 101266 96480 96151 93770 82564 73800 73207 85002 79232 68532 78713 75386 70225
7655 70225 69565 77853 90394 88795 92361 96200 91730 83474 82751 82649 84588 80106 78384 81540 90638
7640 90638 105540 114101 117284 119922 112851 109730 125045 134813 134178 151179 160931 167052 161717 146278
7626 146278 134692 150136 150815 155793 159908 148168 144207 157270 154546 163406 164910 150678 135465
7613A35465J6539N104J4358J5505N916l423J3723L487l285j77j0372J144N401
7600A99385J322P09r63P075j1663j6921L032J0381o757p636j3184k2485l993M885
7586A43187J8715L722r20K413k265K603K28q107j3577L567o528k3167p885O580
7572A18566J418j0416k529J9138j0p934K169J1929p362l088M635o339J748m597
7558A17328j6019j1154J3546J1492N97K0512M604k171N524n261J5003l888k8973
7545A21140j5473L393L681p396j0117k216N158J608q894r714r15J683O399J1848
7531A00185J9177R081o927n153K000k049O67m550k2850N035p268j8069J3864Q240
7517I1383N373J125J880p231j9555o847k549N69N372o556J315j4210L350Q955
$$ plain form
7613 135465 152004 157108 171466 186971 192887 189464 203187 206674 203389 203212 192840 193984 199385
7600 199385 200707 201416 200453 207528 195865 178944 181976 192357 185600 177964 164780 142295 138302 143187
7586 143187 161902 165624 164704 167117 164852 167455 167683 159576 145999 149566 143038 119871 111986 118566
7572 118566 119984 109568 107039 126177 126167 118233 120402 132331 124969 121881 126516 120177 121925 117328
7558 117328 101309 90155 103701 115193 115790 136302 140906 138735 144259 138998 154001 150113 121140
7545 121140 105667 109060 112741 105345 95228 93012 98170 99778 90884 81170 80255 81938 88337 100185
7531 100185 119362 128443 121516 116363 118363 116314 116981 112431 89581 94616 87348 69279 83143 91383
7517 91383 96756 97881 99761 92530 72975 66128 63579 64148 69520 62964 64279 50069 53419 62374
7503F2374J7012L917n699o776k653j1430j424N818j449j8194j8526K3093J3631
7490E9694J0340O070l103j3310P032J870k23l892N12q247k814n742l214l961q081
7475C2931P778J9502j0294j5678p653o526o915K2335j424O48J1302R550j40q234
7461D7182j4404N94K734J1966R247K642m19q598j204P600r774m385J979p41j7573
7446B6846J084L357k84K816m993m634J4397O889j5139j0921o412P757O667m549
7432B2881k361J4305L745p077j786J2601J4432J9038J712r140j5565n290K435
7419D9930j5586o463k59J1050M318j3776k666K109K473J902J0987J2021j3642
7406D2398p300J8571j852n998m054m762j0791K347O373j44M314J2124J1556j949
$$ plain form
7503 62374 79386 83303 77604 70828 68175 56745 55321 61139 59690 41496 22970 46063 59694
7490 59694 70034 76104 73001 59691 66723 68593 68370 64478 64990 56743 53929 48187 44973 41012 32931
7475 32931 40709 60211 49917 34239 26586 20060 13145 35480 34056 34704 46006 55556 55416 47182
7461 47182 32778 33372 36106 48072 57319 59961 59542 50944 49740 57340 47566 43181 45160 44419 26846
7446 26846 27930 31287 31003 33819 28826 24192 38589 45478 30339 19418 13006 20763 27430 22881
7432 22881 20520 34825 38570 31493 29707 42308 56740 75778 77490 68350 52785 47495 49930
7419 49930 34344 27881 27622 38672 42990 29214 26548 28657 31130 33032 44019 56040 42398
7406 42398 35098 53669 51817 45819 41765 37003 26212 28559 34932 34788 39102 51226 62782 60833
7392F0833k906L234J680M846j871j2659j7183n384j3973N95O500m750J331J2007
7378C2300J3769J0815Q634j0964o144M434j671j6798j245J0366j983K653R315
7365E3481L996q656K787J345j749n338m737R417J358M130r909q73M09L641J2424
7350F1726K03p885j4789j1877M821O143L919R227K549M01j647J450m482j1584
7336C8175m986L027j452K547p977J489o149n483M993P851N636q865n532R445K7872
7321F0591R267j1757l0892p75J035l501j5434m683J9476K4569m722j4557k357
7308B6260k657k757k1744J3966K6590J1048m78j935K775q130j314p29r756n131
7294B6008J6173J8795J6305j0560j7761j1458k757j360j1969o339j388J0967j553
$$ plain form
7392 60833 57927 61161 62841 67687 65816 53157 35974 30590 16617 17212 23712 18962 20293 32300
7378 32300 46069 56884 65518 54554 48410 52844 51173 34375 33130 43496 41513 44166 53481
7365 53481 57477 48821 51608 52953 51204 45866 41129 50546 51904 56034 46125 45252 45661 49302 61726
7350 61726 61929 54044 39255 27378 32199 38342 42261 51488 54037 54438 52791 54241 49759 38175
7336 38175 33189 36216 34764 37311 29334 30823 24674 19191 24184 32035 37671 28806 23274 32719 60591
7321 60591 69858 58101 27209 26434 27469 23968 8534 3851 23327 47896 43174 28617 26260
7308 26260 23603 20846 -898 13068 39658 50706 50228 48293 51068 42938 41624 40895 31139 26008
7294 26008 42181 60976 77281 66721 48960 37502 34745 33385 21416 15077 13689 24656 23103
7281B3103J2545J1282J0575k55r821l121P965N277n413o178j129j3586J5560N373
7267E2177K048j1484j4889K646J0291l98j1165k944j329p90L910N469O897J347
7253D1786K53j001q614k100Q070N861J04J1288L398k2550q367o964Q49J1598J2033
7238D5644M239j824j8914k561J0296n616J509N866k2175o142J1163J6535L153
7225D1173l736o514J4493M085j1232l116p23p9r412P366k085n812J2305k030j8793
7210A5890n548P975J4072R081k651k0594j3445l131K0370P274m966m59J236j3858
7196A1246L345O749J572P712R851k743k720J725p19P574j8591j4537M625J0163
7182B5252J881k077J2624J0820J3583l260j5951q852k65o929L804k391l404j2980
$$ plain form
7281 23103 35648 46930 57505 57250 47429 44308 52273 57550 52137 45959 44830 31244 46804 52177
7267 52177 54225 42741 27852 30498 40789 40391 29226 26282 24953 24163 28073 33542 40439 41786
7253 41786 42039 41038 32424 30324 38394 44255 44359 55647 59045 36495 28128 21164 22013 33611 45644
7238 45644 49883 48059 29145 26584 36880 31264 32773 38639 16464 10322 21485 38020 41173
7225 41173 37437 30923 45416 49501 38269 35153 34430 34351 24939 32305 30220 24408 36713 34683 15890
7210 15890 10342 18317 32389 41470 38819 18225 4780 1649 22019 29293 24327 23868 25104 11246
7196 11246 14591 21340 22912 30624 40475 37732 35012 36737 36018 43592 25001 10464 15089 25252
7182 25252 27133 25056 37680 48500 62083 58823 42872 34020 33755 26826 30630 28239 24835 11855
7168A1855J1160K962N121M560N709k25j2954m038M374P182m90m013q050J3378
7154C6531Q619r737l063r528O117K876n748N019J936K891n754o974K180j753R047
7139C2659J8271L117j1146j9874j8158Q589j626J370O660Q233J892q19p050j42
7125B1976K452o414j785k91m801J0478j272k972P177L317j530j645M839q620j8522
7110B387J0605L449j276K75P552N453N855q295n765L354Q06O712n282q089L316
7095B1057K914P953j089k0437j5155m143R809K0129J2905J0801j0262j8355j983
7082A4144N388k945r029m598n4M158J4381J0614j0129q595p389l513J202K877
7068F512k197N899P971R54J829m8l644n117J3188J0060M082r028j8910J264K1003
$$ plain form
7168 11855 23015 25977 31098 35658 41367 41142 28188 24150 28524 35706 35216 31203 23153 36531
7154 36531 45150 35413 32350 22822 28939 31815 26067 31086 33022 35913 30159 23185 25365 23612 32659
7139 32659 50930 54047 42901 23027 4869 13458 11832 13202 19862 28095 29987 29168 22118 21976
7125 21976 24428 18014 16229 15938 11137 21615 20343 17371 24548 27865 26335 24690 29529 20909 2387
7110 2387 12992 16441 15165 15440 22992 28445 34300 26005 20240 23594 24400 31112 25830 17741 21057
7095 21057 23971 31924 30835 10398 -4757 -8900 909 21038 33943 44744 34482 16127 14144
7082 14144 19532 16587 7558 2960 2906 7064 21445 32059 21930 13335 5946 2433 3635 6512
7068 6512 4315 10214 18185 19139 20968 20920 17276 12159 25347 35407 39489 30461 11551 12815 33818
7053C3818k207j3093j002Q784O915K752k974q260n877J428J5l896M713p66M730
7038B5080r657R0j734j905Q558j1336J095J9140p589k2534p38J4926R218J138
7024B3752N099N719J829p660J991k510n789q138q877K082p890L862J3983q019
7010I434n796J2765N595M252o123m661j1106N67j673Q233P194P624R545n015M741
6995C5576J3152k878j2015r879k584J890o803L736n714j9470L789J5369J0433
6982B4602l69q604L594K777r883o026N753J9162Q637k841m387k538M299K996l829
6967C3343l425j3746k94K555r56J8608M603r910P421O408m128q067k603j3633
6953A6176n711o754M443j557M179l236n973N778J0039P998J1496j869M085J0099
$$ plain form
7053 33818 31611 18518 17516 26300 33215 35967 32993 24733 18856 20284 20299 16403 21116 20350 25080
7038 25080 15423 15513 13779 11874 20432 9096 10191 29331 21742 -792 -1530 13396 22614 23752
7024 23752 28851 34570 36399 28739 30730 28220 22431 14293 5416 7498 -392 3470 17453 9434
7010 9434 3638 16403 21998 26250 20127 15466 4360 4927 3254 11487 18681 26305 35850 30835 35576
6995 35576 48728 45850 33835 23956 21372 23262 16459 20195 14481 -4989 -1200 14169 24602
6982 24602 24233 15629 19223 22000 12117 6091 11844 31006 39643 36802 32415 29877 34176 37172 33343
6967 33343 29918 16172 15878 18433 17477 36085 40688 30778 38199 44607 40479 32412 29809 16176
6953 16176 10465 3711 8154 6597 10776 7540 1567 7345 17384 25382 36878 35009 39094 49193
6939D9193j874k4432l418P127J177n52n030Q41J1605P237p085M346k812o85M122
6924C9760j3350o947j1489n445P51N47J2834R576l467r199k644N27m175j7928
6910a0649j5197K613J3304J7472J4312M518K096l435j4428j0924m494j126J3526
6897G588O36M158j901M629R085m479m621k490n662l11R46r94J7539J2477q457
6882B8143j3848o023L29Q528Q870Q996j7142p642L857P991k458r88j129J770R849
6867B9103k848p811k588O045r572r825k099j663j339k522K563L868R207R38q19
6852A0638Q791q521j3386M564R471M236m112j891j6240k422M760O177Q453j0007
6838E11p887K728j964PL640k034J2132J2737k892Q079n055o472M915o397o713
$$ plain form
6939 49193 47319 22887 19469 26596 27773 27221 22191 23032 34637 41874 34789 39135 36323 35638 39760
6924 39760 26410 19463 7974 2529 3280 3827 16661 26237 22770 13571 10927 11454 7279 -10649
6910 -10649 -25846 -23233 -9929 7543 21855 26373 28469 25034 10606 -318 -4812 -5938 7588
6897 7588 8224 12382 10481 15110 24195 19716 15095 12605 6943 6632 7578 6584 24123 36600 28143
6882 28143 14295 8272 8601 17129 25999 34995 17853 10211 14068 22059 19601 18613 17484 19254 29103
6867 29103 26255 18444 15856 21901 12329 2504 405 -1258 -2597 -5119 -2556 1312 10519 11457 10638
6852 10638 19429 10908 -2478 2086 11557 15793 11681 9790 -6450 -8872 -4112 2065 10518 511
6838 511 -7376 -4648 -6612 -6605 -2965 -4999 7133 19870 16978 25057 20002 13530 18445 12048 5335
6823E335J8939j256j2851q976j1348n83J1210j46l276L833J3013o411j297p599
6809a413M901Q771j1229j2127R917M344J3781J236j843J4071P590k026j3880M67
6795B2560p767R4O743R340K271j2945q700j1224P489K891J6092q584j5853O534
6781H941J7365J019K434j3864j788P96j7818M813J2825k417N403J1221q17l028
6767B5085p130J3281J748N72j2134o087R62J0493M952k1269m867q957K139p29
6753a941m061J973o082j263P809J4581K822J712k350o445L618J0975J2220R630
6739D3198p681k1677j1870j3377j0035P579P329Q466J4072j871M828k916j2059
6726C986K033J8279R166m482K570m029p924k798p319O690j834j179J1591o667
$$ plain form
6823 5335 24274 23018 10167 1191 -10157 -10740 470 324 -2952 881 13894 7483 6186 -1413
6809 -1413 3488 12259 1030 -11097 -1180 3164 16945 18181 16338 30409 37999 35973 22093 22560
6795 22560 14793 14887 21630 30970 33241 20296 11596 372 7861 10752 26844 18260 2407 8941
6781 8941 26306 27325 29759 15895 14107 14903 -2915 1898 14723 12306 17709 28930 28113 25085
6767 25085 17955 31236 32984 33556 21422 15335 16297 26790 31742 10473 5606 -3351 -1212 -1941
6753 -1941 -6002 -4029 -10111 -11374 -3565 11016 13838 15550 13200 6755 10373 21348 33568 43198
6739 43198 35517 13840 1970 -11407 -21442 -13863 -6534 1932 16004 14133 18961 16045 3986
6726 3986 6019 24298 33464 28982 31552 27523 19599 16801 9482 16172 14338 13159 24750 18083
6712A8083q693M324M900j1925M61j121l016j0002k567J5288R844q695m17J8212
6698B4676q150o313P408l121k922l434j0315q12Q742O20j779N111J956K399p64
6683A3302r012j0555n645L862J2684K767l047m518o927O134J5479k099q173N62
6669D814M28K385P323O360K393J831P41j831l427K770k799r662l503m289l472
6654F2p455J0315N290k150K993p300K271m442m237n004J3180K811M024k795o276
6639A287l280j201J7061R533q264l476J79L243j4272J3143O839N835j573j158
6625B3896q13l270N626j0093j4044R447J0820m080j3017K058O30j3173M158J8243
6611A6388M867j1444q412K606L75P686N593j657q790J461Q30K479K765j7047P83
$$ plain form
6712 18083 9390 13714 18614 6689 7150 6029 3013 -6989 -9556 5732 15576 6881 6464 24676
6698 24676 16526 10213 17621 14500 11578 8144 -2171 -2983 5759 6379 4600 9711 11667 14066 13302
6683 13302 4290 -6265 -11910 -8048 4636 7403 4356 -162 -7089 -955 14524 12425 4252 4814
6669 4814 5242 7627 14950 21310 23703 25534 26275 24444 21017 23787 20988 11326 7823 3534 62
6654 62 -7393 2922 8212 6062 9055 1755 4026 -416 -4653 -9657 3523 6334 10358 7563 1287
6639 1287 -1993 -3194 13867 23400 15136 11660 11839 15082 810 13953 20792 26627 25054 23896
6625 23896 23083 19813 25439 15346 1302 10749 21569 17489 4472 6530 7160 -6013 -1855 16388
6611 16388 21255 9811 1399 4005 4380 12066 17659 16002 7212 8673 9503 11982 14747 -2300 -1517
6596a517O981M920j861Q084K264j2226n533j304J886o90R719J6694p077q601l890
6581G849O979J2140O888r637k892K159n015k779L580L704Q04n928n505j987j4004
6566c644L606l735J086J0996K436j1252j1843p226p086l767k253R849J9738M768
6552A673J0978k229R87J1588K042L451l8n8L148j2893Q59L799j1524j7187p00
6537f104j0151O85J0973j0965j2974Q924P871k256J1900j847L18Q039o139O36
6523a090J6828J912j2980K372Q688J508j119P955J921p666j6946n907J3545J3104
6509B2125P56m893L367l953o954p573O034m175p670J0318J3067M393M98r131r550
6494F659n783J1238M597J0312J1090p951o830J644j7946j5260J2617P17o948l123
$$ plain form
6596 -1517 5464 10384 8523 16607 18871 6645 1112 -192 1694 1004 10723 27417 20340 11739 7849
6581 7849 14828 26968 33856 24219 21327 23486 18471 15692 19272 22976 23780 17852 12347 10360 -3644
6566 -3644 -38 -3773 -2687 8309 10745 -507 -12350 -19576 -26662 -30429 -32682 -22833 -3095 1673
6552 1673 12651 10422 11409 22997 25039 28490 28452 28394 31542 18649 19508 23307 11783 -5404 -6104
6537 -6104 -16255 -15570 -4597 -15562 -28536 -19612 -11741 -13997 -2097 -3944 -3626 4413 -1726 -1090
6523 -1090 15738 17650 4670 7042 15730 17238 16119 24074 25995 18329 1383 -4524 9021 22125
6509 22125 22881 17988 21355 17402 10448 2875 8909 4734 -2936 7382 20449 24842 25340 16209 6659
6494 6659 876 12114 16711 27023 38113 30162 23332 24976 7030 -8230 4387 5104 -1844 -4967
6480d967J4096J3846n819r893n461N818J0994q10l99m197Q945M471k3252j6306
6466a2934J2952J4928K791L882n449n444m308L826Q243K402J4876K930j5006j7238
6452F451j1262l324N923p074R068J0175K203P383j5386n722m550o370r205O992
6438a4698M193P796j126L200K704O430K934K119j990j289n743J0537J471r804
6424F734J2076K876j888j0589Q167j433P008m851K95M847R847P208j2037j7442
6410A0818k0121l322M597M058Q111k670m777P517O710j422O34P563r250j4044
6396e598k152J1064N901J1485m431j0933j180p384M815R000J0941j3346m27n803
6382A952l235K602M236R087k038j1989l275J320o800k938k153j696n041J0069
$$ plain form
6480 -4967 9129 22975 17156 7263 1802 7620 18614 17804 17405 13208 22153 26624 3372 -12934
6466 -12934 18 14946 17737 21619 16170 10726 6418 10244 18487 20889 35765 38695 23689 6451
6452 6451 -4811 -8135 -2212 -9286 -218 9957 12160 19543 4157 -1565 -6115 -12485 -21690 -14698
6438 -14698 -10505 -2709 -3835 -635 2069 8499 11433 13552 11562 10273 4530 15067 16538 6734
6424 6734 18810 21686 19798 9209 17376 15943 22951 18100 18395 23242 33089 40297 28260 10818
6410 10818 -9303 -12625 -8028 -3970 4141 1471 -3306 4211 10921 9499 10133 17696 8446 -5598
6396 -5598 -7750 3314 9215 20700 16269 5336 4156 -3228 1587 10587 21528 8182 7755 1952
6382 1952 -1283 1319 5555 14642 12604 615 -2660 -1340 -8140 -11078 -13231 -14927 -19968 -9899
6368i899J0593M963K059o188j0061J641J1975k585R131L207j58K029K1O426Q612
6353C1766k578j345K396n731q718k154j168r280n582J0297J2623l27j3587j474
6339E138K491R25j966J1953J1140n623j1204m628j2285K267M502N714O654m253
6325A0825M172j0952j4953M343K153O114O845P324p049J739K392p806L811k831
6311F127M524m772m09j992j0762j1133Q243J0438Q321Q16r352N584K624m878o398
6296c019j2526J159J409J3616J5701P741k407o997M610J2551k171l629K326p824
6282B0540j2575o10k69P367K152m795o300j801l609l547l999q907O45J1736N215
6267A243K273J4387n169j2538P052n30o834n381O604J588J5272N16P621p365j8679
$$ plain form
6368 -9899 694 5657 7716 1528 -8533 -6892 5083 2498 11629 14836 14678 16707 16728 23154 31766
6353 31766 29188 27843 30239 24508 15790 13636 12468 3188 -2394 7903 20526 20199 6612 5138
6339 5138 7629 8554 6588 18541 29681 24058 12854 8226 -4059 -1792 2710 8424 15078 10825
6325 10825 14997 4045 -10908 -6565 -4412 1702 8547 15871 8822 10561 12953 5147 8958 6127
6311 6127 10651 5879 5470 3478 -7284 -18417 -10174 264 8585 9401 49 5633 8257 3379 -3019
6296 -3019 -15545 -14386 -12977 639 16340 24081 21674 14677 19287 31838 29667 26038 28364 20540
6282 20540 7965 7355 7086 14453 16605 11810 5510 3709 100 -3447 -7446 -16353 -15708 -3972 1243
6267 1243 3516 17903 12734 196 7248 6718 -116 -5497 1107 2695 17967 18483 26104 18739 60
6252F0L170o399r023j2405N213k549M734R374J0559Q276P463m050j404J098M266
6237A8383Q42j4331q886L26L629j869J386j795M442R794L159K725j999j0295n877
6222c66L104p422p763q11J3239R730K93K59k944r263L659M039J582j697j2784
6207g145k930O272Q177J2290L43l41o508M032O52p638n343P449J7929K1424q145
6192D0518k3824j4515q422J1176j0843O963J4616N2N106M168q538j1246j3315
6179h104M816N150p384p769J2804j195n950L579j0227j489J4986m525M074q018
6165i252m201Q444O005j993l80Q49P614p463J0234N465N383o458j6955q038J601
6150i145r512O141R759N072K53M770J829m849j6029M85Q625l591o413m619R770
$$ plain form
6252 60 3230 -3169 -12192 -24597 -19384 -21933 -17199 -7825 2734 11010 18473 14423 13019 14117 18383
6237 18383 19225 4894 -3992 -3666 -37 -1906 -520 -2315 2127 11921 15080 17805 15806 5511 -366
6222 -366 2738 -4684 -12447 -13258 -19 9711 10004 10263 7319 -1944 1715 5754 7336 5639 -7145
6207 -7145 -10075 -3803 4374 16664 17007 16666 10158 14190 14842 7204 1861 9310 27239 48663 40518
6192 40518 16694 2179 -6243 4933 -5910 1053 15669 15721 20827 24995 16457 5211 -8104
6179 -8104 -3288 1862 -5522 -13291 -487 -1682 -7632 -4053 -14280 -15769 -783 -5308 -1234 -9252
6165 -9252 -13453 -5009 996 -997 -1377 -528 7086 -377 9857 15322 20705 14247 -2708 -10746 -9145
6150 -9145 -18657 -12516 -2757 2315 2568 7338 9167 4318 -11711 -11226 -2601 -6192 -12605 -17224 -7454
6135g454J4399Q00m58l189k163J4475k356j0943j3657p414k1316J0510J9112P404
6121b250N202N991k202P646q32j664o190j0428L762M278O316L089Q822j5911j7186
6106a1557j0295K351N825J1371M397K158L5q405m558J0699O115K610Q665M428
6092B3839j3387o224O292O66L935K237O94o26j5412p954P764r075L153m160K692
6077e566O527M699j708k660o407mR040J1112j0492j7754K984k884K1466R836j5840
6062B349j2132q922R241P221R952M347J33j2417r238K784j069j818O298Q482m630
6047E81o557M845J840j0692m009n392P764J0976J0276Q121J4366Q787j0050p362
6033B3494k999N64j2553n131q20N409J0381N017k407k527m000m699m384l324m933
$$ plain form
6135 -7454 6945 7745 7287 4098 1935 16410 14054 3111 -10546 -17960 -39276 -28766 -9654 -2250
6121 -2250 2952 8943 6741 14387 13555 11891 5701 -4727 -965 3313 9629 12718 21540 5629 -11557
6106 -11557 -21852 -19501 -13676 -2305 2092 4250 4285 -4120 -8678 2021 8136 10746 19411 23839
6092 23839 10452 4228 10520 11186 15121 17358 18052 17426 2014 -5940 1824 -7251 -4098 -8258 -5566
6077 -5566 961 5660 3952 1292 -5115 -5119 3921 15033 4541 -13213 -10229 -13113 8353 18189 2349
6062 2349 -9783 -18705 -9464 -2243 7709 12056 12189 -228 -9466 -6682 -7751 -9569 -3271 5211 581
6047 581 -5976 -1131 709 -9983 -13992 -19384 -11620 -644 9632 17753 32119 40906 30856 23494
6033 23494 20495 21059 8506 3375 2555 7964 18345 23362 20955 18428 14428 9729 5345 2021 -2912
6018b912J1014k078R556K252j0845j5031Q338O192q542p8r447j022M706o224O602
6003g519J3534J4087m363J226K689o488k982n544k610n862j792J944q04m563k197
5988a1244K645M909J8581n968r021J187K254l921j2621J2024M938M713j9798l52
5974a1674J1843P93m611q85J1275R132p181j942L029j7023o771O886P640K004
5960B515o475L4K040n69n164P334J4439m249O260J2018l53k739j3918j3082N548
5945C639J4898m387m476l279M857K6312p242j0078k440o50k217j1849m026R729
5931H791J0764q681p104j407j1869l732J0354L91M829o025J263Q183j270n429
5917i42n778j175O115k247o524O320J2797j6706j7637J5752n822j0451M474J8542
$$ plain form
6018 -2912 8102 6024 15580 17832 6987 -8044 294 6486 -2056 -2134 -11581 -12603 -7897 -14121 -7519
6003 -7519 6015 20102 15739 16965 19654 13166 10184 4640 2030 -3832 -5624 -3680 -4484 -9047 -11244
5988 -11244 -8599 -3690 14891 8923 -98 1089 3343 -578 -13199 -1175 3763 8476 -11322 -11674
5974 -11674 169 962 -3649 -4534 6741 15873 8692 6750 9779 -7244 -14015 -7129 511 2515
5960 2515 -3960 -3926 -1886 -2455 -7619 -285 14154 9905 16165 28183 27830 25091 11173 -1909 3639
5945 3639 18537 14150 9674 6395 11252 37564 30322 20244 17804 17154 14937 3088 -938 8791
5931 8791 19555 10874 3770 2363 -9506 -13238 -2884 -2493 2336 -3689 -2426 5757 4487 -942
5917 -942 -6720 -7895 -1780 -4027 -10551 -4231 8566 -8140 -25777 -10025 -15847 -26298 -21824 -3282
5903c282Q213J5673m122j3164p686M703k182p388J351M303j0207j7150Q70Q398
5889b1670L229J378K348L347J6598J2461Q91N846k618j7781p328N306o555j3609
5875a8157M184J1508m39j822J3050M258j1083k1307j507J2631P503l589l175J1855
5861C910L385J0046j83o343k076o966o057J3307J911j3135m690J029N783n44Q161
5846G538N307o536n420j712Q41n487j556k417m617N721J3724o431k213J1200j329
5831F613k912J3845j2666j7814J9784J0550l731q80J563j902L311J749r663m90
5817G357L81n75O753j0258j726M459K1942o378j3737j637o081q67K1214N218r306
5802A6759K283k095K193l939o05j610n851R360L789n336j3621j6675J397K193
$$ plain form
5903 -3282 4931 20604 16482 3318 -4368 335 -1847 -9235 -7884 -3581 -13788 -30938 -30068 -21670
5889 -21670 -18441 -17063 -14715 -11368 5230 17691 18582 24428 21810 4029 -3299 2007 -4548 -18157
5875 -18157 -13973 -2465 -2904 -4726 8324 12582 1499 -19808 -21315 -8684 -1181 -4770 -7945 3910
5861 3910 7295 17341 17158 10815 8739 1773 -4284 9023 10934 -2201 -6891 -5862 -79 -623 7538
5846 7538 12845 6309 889 -823 18 -5469 -7025 -9442 -14059 -8338 5386 -1045 -3258 7942 6613
5831 6613 3701 17546 4880 -12934 6850 17400 13669 12789 14352 12450 15761 17510 7847 7357
5817 7357 7738 7163 13916 3658 1932 6391 28333 21955 8218 6581 500 -367 20847 26065 16759
5802 16759 19042 16947 19140 15201 14596 12986 7135 16495 20284 14948 1327 -15348 -13951 -11758
5788a1758M276j7557N018J4632J0797N623n56J523M145m667k979J491q085L970
5774E873n523Q074L076j4070K132L171J415p06P838j1082o910r841J315O669J2939
5759D370k440L649J4331J0841k323j8365m906q5J833P54N907Q181o583r662J4420
5744A9922p638n686O595q741j2130M803o791K530n610m323j525J387O377R493
5730a337l613r643J237p0J5536N665j6938l459N217Q866q402n168J604K144J2561
5715D200K692M805j0552m480j048l918r193Q591j867J1685J53L48L988J68k194
5700C378K982n368%k590L502J660n860K378J1983k747p838r07O768J145j3555
5685e069R90J0342r785n670m837j0024K421O153N001j1487O464K4954O109J2785
$$ plain form
5788 -11758 -7482 -25039 -20021 -5389 5408 11031 10475 11998 16143 11476 8497 9988 1903 5873
5774 5873 350 8424 11500 -2570 -438 2733 4148 3442 11280 198 -6712 -16553 -15238 -8569 4370
5759 4370 1930 5579 19910 30751 28428 10063 5157 5072 6905 7659 13566 21747 15164 5502 19922
5744 19922 12284 6598 13193 4452 -7678 -2875 -9666 -7136 -12746 -17069 -18594 -17207 -10830 -1337
5730 -1337 -4950 -14593 -13356 -13426 2110 7775 -9163 -12622 -7405 1461 -6941 -12109 -10505 -8361 4200
5715 4200 6892 11697 1145 -3335 -4383 -8301 -17494 -8903 -10770 915 1068 1416 5404 5572 3378
5700 3378 6360 992 992 -1598 1904 3564 -2296 82 12065 9318 1480 573 7341 8486 -5069
5685 -5069 -4079 6263 -3522 -9192 -14029 -24053 -21632 -15479 -10478 -21965 -15501 9453 15562 28347
5671B8347p809j0675J2832j1755J736n909P003R720M500O695o373j1915m860j1791
5657b54p843M544M391k14N164K855k176p71R010p38r375K715J883k39m987n965
5641b000K946L262N787P172J571K830o166K02J751j050J636j783j4887k333J664
5626F02m675L809n078L219j657Q824j6100J336J0147j0569j949M855j014R395
5612A145J0236O585R91L322q189j1288j624n455o798N124P691M645m389l311p051
5597h366J587J941j630R262k06l931lq578p86p30P693m941J2723P528j3461m884
5581f782K642J0693P331J949p568o728k1015O919o67k160L626l326j366J390P641
5566g421q76j303J432P338J137N797P817n462q676Q083P836K155n978q315j4797
$$ plain form
5671 28347 20538 9863 22695 10940 12676 6767 13770 23490 27990 34685 28312 16397 11537 -254
5657 -254 -8097 -3553 838 624 5788 8643 6467 5696 14706 13968 4593 7308 9191 8952 3965 -2000
5641 -2000 946 4208 9995 17167 18738 21568 15402 15604 17355 16305 17941 16158 1271 -1062 602
5626 602 -4073 -264 -5342 -2123 -3780 5044 -11056 -9720 427 -10142 -12091 -7236 -8250 1145
5612 1145 11381 17966 18957 22279 14090 2802 1178 -4277 -11075 -5951 1740 6385 1996 -1315 -8366
5597 -8366 -6779 -4838 -6468 2794 2588 -1343 -1346 -9924 -10710 -11440 -3747 -8688 4035 11563 -1898 -6782
5581 -6782 -4140 6553 13884 15833 8265 1537 -19478 -12559 -13226 -15386 -11760 -15086 -16452 -15062 -7421
5566 -7421 -8297 -9600 -8168 -830 307 6104 13921 8459 -217 7866 15702 17857 11879 3564 -11233
5551a1233N835k593j0102J0939o833o862R713r64n861k635J2301P403M991o838
5537b739r457k260k672R139j351K787J0111L09n743P404J2606M51J175O355j6285
5522I830j2248Q21P500M4Q08q600L15l614O119L886m454O07m843Q900N960j5211
5506d180r153n995J2277N608j41k252q129K02K614l051p91o511K0362J6667J0736
5491B8263k650r713p953m932o821k961q684P16N271J733K818J1320K704O222N20
5476A5853r789q196j7017j573P755O520l285N704K133J798j505n061Q247M605
5462F189l999j2045r958n247J6566k270O200k635L510J105m38J0182K246p532
5448A874M42j294J169K005L027k354o908j7494j1313K947Q522J4895M707j7483
$$ plain form
5551 -11233 -5398 -7991 -18093 -7154 -13987 -20849 -11136 -12100 -17961 -20596 -8295 -892 4099 -2739
5537 -2739 -12196 -14456 -17128 -7989 -9340 -6553 3558 3867 -1876 5528 18134 18585 19760 26115 9830
5522 9830 -2418 -1597 5903 5947 6755 -1845 -1530 -5144 975 4861 407 1014 -3829 5071 11031 -4180
5506 -4180 -13333 -19328 -7051 -1443 -1584 -3836 -11965 -11763 -9149 -12200 -12991 -19502 860 17527 28263
5491 28263 25613 15900 7947 3015 -3806 -6767 -15451 -14735 -9464 -7731 -4913 6407 9111 15333 15853
5476 15853 6064 -2132 -19149 -20722 -12967 -6447 -9732 -4028 -1895 -97 -1602 -6663 1584 6189
5462 6189 2190 -9855 -19813 -25060 -8494 -10764 -4564 -7199 -3689 -2584 -3022 7160 9406 1874
5448 1874 2316 1022 2191 4196 7223 4869 -2039 -19533 -30846 -27899 -19377 -4482 225 -17258
5434a7258o895O659q676Q117O640l651p793m226O216Q777N894n139Q348P261j08
5419D166j552j2085j4338L000J2144Q920K746l340J8159Q806q901m607l640p767
5405A711j4469J083Q670L351q260m163M838k99m992O487Q128J739J0283n294k0229
5390a1416Q857J9802M761M90q079p709j7127K5j295J0023R905R570j942j3922
5376A943j290q850q740j3292N358J1052R87k931J0368Q766J4535j0300p722J782
5362A666r935L143K196l442j640M45O366l389q580r886O363N253O123R248J2330
5347A6261O497N026j0446p89O356q25M832j4504q532o810l719M763K0q823k075
5332a2768k191M55M056l385J410K554N494K23j817L564l569M677L110L502M187
$$ plain form
5434 -17258 -24153 -17494 -26170 -18053 -11413 -15064 -22857 -27083 -20867 -12090 -6196 -11335 -2987 4274 4166
5419 4166 2614 -9471 -23809 -20809 -8665 255 3001 -339 17820 26626 17725 13118 9478 1711
5405 1711 -12758 -11675 -3005 346 -7914 -12077 -7239 -7538 -12530 -6043 2085 3824 14107 8813 -11416
5390 -11416 -2559 17243 22004 22494 14415 6706 -10421 -10396 -11691 -1668 8237 17807 15865 1943
5376 1943 653 -8197 -16937 -30229 -24871 -13819 -12832 -15763 -5395 3371 17906 7606 -116 1666
5362 1666 -8269 -5126 -2930 -6372 -8012 -7567 -1201 -4590 -13170 -23056 -16693 -11440 -5317 3931 16261
5347 16261 22758 27784 17338 16549 22905 22080 26912 12408 3876 -2934 -6653 -1890 -1870 -10693 -12768
5332 -12768 -14959 -14504 -10448 -13833 -12423 -9869 -4375 -4152 -5969 -2405 -5974 -1297 1813 5315 9502
5317I502n202j4093j0380k92R878N741M535p383o115N074N998P886j0993p328
5303a3172q633J921J5493J0424P35j16r342k269J5441M103k3658n029k242j0271
5289b6615N92J9105M453M19j3585j2844j945L343p344r98J9211J5074o185M81
5275f838N472L058j2029p908n643r965R784N857R081J3759Q238M615j5780r440
5261g739N528n76J3728O511k2161r745N83J4243L18j5503q085J3289j89l754l663
5246a7215r311J5028K1806k260n939M832L124K939k275j7201p348K11J6793L790
5232F974o497q05R415j46J9090Q57j0593r113L450k2154j0134O451J2350L628
5218B773r046l704q933L124J2627K489R290M150M091j6697p964r280o507J6445
$$ plain form
5317 9502 4300 -9793 -20173 -20465 -10587 -4846 -311 -7694 -13809 -8735 -2737 5149 -5844 -13172
5303 -13172 -21805 -19884 -4391 6033 6768 6652 -2690 -4959 10482 14585 -9073 -14102 -16344 -26615
5289 -26615 -26023 -6918 -2465 -2046 -15631 -28475 -30420 -27077 -34421 -35419 -16208 -1134 -7319 -6838
5275 -6838 -1366 1692 -10337 -18245 -23888 -33853 -24069 -18212 -9131 4628 12866 17481 1701 -7739
5261 -7739 -2211 -2787 10941 17452 -4709 -14454 -13871 372 690 -14813 -22898 -9609 -9798 -13552 -17215
5246 -17215 -26526 -11498 10308 8048 2109 6941 10065 13004 10729 -6472 -13820 -13609 3184 6974
5232 6974 477 -328 9087 8941 28031 28888 18295 9182 12632 -9522 -19656 -13205 -855 2773
5218 2773 -6273 -9977 -18910 -15786 -3159 -670 8620 12770 16861 164 -7800 -17080 -23587 -7142
5204g142k882r740m931J155J1815L359R091O437Q832l466J656l845k688q428p860
5189h637l560m575j2481p06J1007J2373R030k412L82P077J7894j3238r478K90
5175B966R121J485l016R505n470k4161j0810P115J1282O417o36n970J1964j438
5161H354k3893L372P885O313j5926m607N897k530m430J2338P187L016R22k811
5147A087L356l505J576R543r86j0675k0462M843K010N363L423M299r221k833k296
5132a4478Q988n774o384K059J4762Q821J901l275M367m171O694m224q320O730
5118G696l638j0923l206k864K093N530M099q655K073J0589Q099n76m631p638n7
5103b009M944L887p798j807Q331r32o228j862O323M760N743l157j7811m800j1775
$$ plain form
5204 -7142 -10024 -19764 -24695 -23540 -11725 -8366 725 7162 15994 12528 14184 10339 7651 -777 -8637
5189 -8637 -12197 -16772 -29253 -29959 -18952 -6579 2451 39 421 7498 25392 12154 2676 2966
5175 2966 12087 13572 10556 20061 14591 -9570 -20380 -13265 -1983 4434 3798 -2172 9792 8354
5161 8354 -15539 -12167 -4282 2031 -13895 -18502 -12605 -15135 -19565 -7227 -40 2976 3898 1087
5147 1087 4443 938 2514 12057 11071 396 -20066 -15223 -13213 -7850 -4427 -128 -9349 -12182 -14478
5132 -14478 -5490 -11264 -17648 -15589 -827 7994 9895 6620 10987 6816 13510 9286 966 7696
5118 7696 4058 -6865 -10071 -12935 -10842 -5312 -1213 -9868 -7795 2794 10893 10317 5686 -1952 -2009
5103 -2009 2935 6822 -976 -2783 5548 4616 -1612 -3474 2849 7609 13352 10195 -7616 -12416 -24191
5088b4191l538O601l920O709n53J9030J4492r679n293m645Q1r209m190k259J4487
5073f077N091k512M228n580k475J1645M840O847J2105N520j9066p664P460n891
5059H471q898N231J622l10j0905o224K357J466O294O729j6155K218L925j4893
5045a9072l312K4731J9794L637r202m045o648O087J483O586j0577j1300j613N223
5031A772M96k276j412N196J1780K579k391q617L597J886P318p526j5977K816K599
5016A840k943l102r36r122R920k677R470J062K066j3291p973J3685j0479L264
5002i216L208o269P144M885O88r57m44J914k504L463P92M433j831O15p007j0980
4986a2066o782J1871J5891j0462r290L269m84J411J6485l308j6766j0366R526
$$ plain form
5088 -24191 -27729 -21128 -25048 -18339 -18892 138 14630 4951 -342 -4987 -4906 -14115 -18305 -20564 -6077
5073 -6077 -986 -3498 730 -4850 -7325 4320 9160 16007 28112 33632 14566 6902 14362 8471
5059 8471 -427 4804 6426 6116 -4789 -11013 -8656 -7190 -896 5833 -10322 -8104 -4179 -19072
5045 -19072 -22384 2347 22141 25778 16576 12531 5883 11970 13453 20039 9462 -1838 -3451 1772
5031 1772 2268 -8 -1420 3776 15556 18135 15744 7127 10724 12610 19928 12402 -3575 -759 1840
5016 1840 -1103 -4205 -5141 -14263 -4343 -7020 2450 3512 5578 -7713 -15686 -2001 -12480 -9216
5002 -9216 -6008 -12277 -5133 -248 440 -517 -961 953 -1551 1912 2704 7137 5306 5921 -1086 -12066
4986 -12066 -18848 -6977 8914 -1548 -10838 -7569 -8053 -6642 9843 6535 -10231 -20597 -11071
4973a1071m437L434J0741K243m011j7886q118J0500J8696q78Q497N506l264j5510
4959e558L385J2205j382k815p281J0863m46k633j9485k958J330P939K484P009
4945B657r55P071m172l804p997J21R993l176N052M964M091M141j1550j849j930
4930B657p346j7828P167l28R505Q631o122Q70J2355o481r195M455n435N852l468
4915d711J988o386o993P25k735p839k856l832Q586R905J6568n427j2571j6J4285
4900a309Q431p27Q743K500p708j9003r440Q466k005P339k602j8702p906O358J0123
4885a7442J2786J044r891o667l183J784R536J3825O052r130O265l511k3672n55
4871b2759Q026j182j5395Q860l43r72R124j2538J637J7422J5009J267q122j953
$$ plain form
4973 -11071 -15508 -12074 -1333 910 -3101 -20987 -29105 -18605 91 -787 7710 13216 9952 -5558
4959 -5558 -2173 10032 8650 5835 -1446 9417 8971 6338 -13147 -16105 -14775 -6836 -4352 2657
4945 2657 1702 8773 4601 797 -7200 -7079 2914 -262 4790 9754 13845 17986 6436 4587 2657
4930 2657 -4689 -22517 -15350 -15678 -6173 2458 -3664 -2794 9561 3080 -6115 -1660 -7095 -1243 -4711
4915 -4711 -2723 -9109 -16102 -15377 -18112 -25951 -28807 -32639 -24053 -14148 2420 -3007 -15578 -15594 -1309
4900 -1309 7122 6395 15138 17638 9930 -9073 -18513 -10047 -12052 -4713 -7315 -26017 -33923 -27565 -17442
4885 -17442 -4656 -3612 -13503 -20170 -23353 -21569 -12033 1792 7844 -1286 4979 1468 -22204 -22759
4871 -22759 -14733 -15915 -31310 -22450 -22793 -23765 -14641 -27179 -25542 -8120 6889 8156 34 -1919
4857a919n629j2991O134M912L79m660l944l873j1094o817K3026J4119O013K549
4843F205o860O111L677q167L200j550l769M867j2442m282M043N993Q728O139l745
4828H148k566n517j0342P286k573l211J1029N41R109N098R915n950j0032R8k496
4813H537p700o647j6441k044J4061M144K709L717j0541J649j1850R570J245L808
4799e783J0579J329j1827Q371J0159m940n059m582J774J499j3891l867J3325q702
4785a1615m721J3317q060n816J1107k83R916J4467j1450n331o352j1477J5029
4772a269J1239o459p202q201L204J3577L371J1932J5341o717j2646L043q921j3705
4758c413n236Q25n438L014J830j457J0801m14r759J5577M178q264j054J613J731
$$ plain form
4857 -1919 -7548 -20539 -14405 -9493 -9114 -13774 -17718 -21591 -32685 -39502 -16476 -2357 3656 6205
4843 6205 -655 5456 9133 966 4166 2616 -1153 3714 -8728 -13010 -8967 -2974 5754 11893 8148
4828 8148 5582 65 -10277 -2991 -5564 -8775 2254 2795 11904 17002 26917 20967 10935 11033 8537
4813 8537 837 -5810 -22251 -24295 -10234 -6090 -3381 336 -10205 -8556 -20406 -10836 -9591 -5783
4799 -5783 4796 6125 -5702 2669 12828 7888 2829 -1753 21 1520 -12371 -16238 -2913 -11615
4785 -11615 -16336 -3019 -11079 -16895 -5788 -6071 3845 18312 6862 1531 -4821 -16298 -1269
4772 -1269 9970 3511 -3691 -11892 -8688 4889 8260 20192 35533 28816 16170 19213 10292 -3413
4758 -3413 -8649 -7824 -13262 -10248 -8418 -9875 926 512 -9247 6330 10508 2244 1190 2803 4534
4743D534K26j837m826k1102j122R970J5207m261p55n200K71l264L602m409m570
4728a7536O522J2497Q150J052j1029n588K326p907p735L461O180J746n513j1161
4714b4535r141P156K61M799J0796N929n012r348K682M335O500J2657J748P848
4700A6675P043o179q914q413j105Q203m115l360K966K169j2040k348J0826q73
4686E35j5322o788Q44M83P962O199P783N819Q991Q815p154j4659r82l738m075
4671e287o551J7844p651j5798J2214K934J2040q61l210J613k3603j4435Q789Q226
4657a3736o49l481p484o80N175J1534k707O048N355L69n594j173l169N098P69
4642d325l567o197Q720J2777P568n595j1883M323J9363m103j9013j4054K144p932
$$ plain form
4743 4534 4760 2923 -1903 -23005 -24127 -14157 1050 -3211 -3966 -9166 -8895 -12159 -8557 -12966 -17536
4728 -17536 -11014 1483 9633 10685 -344 -5932 -3606 -11513 -19248 -15787 -9607 -7861 -13374 -24535
4714 -24535 -33676 -26520 -26259 -21460 -10664 -4735 -9747 -19095 -16413 -12078 -5578 7079 8827 16675
4700 16675 23718 17539 8625 212 -893 7310 3195 -165 2801 4970 -7070 -9418 1408 535
4686 535 -14787 -21575 -20731 -20248 -12286 -6087 1696 7515 16506 25321 18167 3508 2526 -1212 -5287
4671 -5287 -11838 6006 -1645 -17443 -5229 -2295 9745 8884 5674 7287 -16316 -30751 -21962 -13736
4657 -13736 -14385 -17866 -25350 -26030 -20855 -9321 -12028 -5980 -625 -256 -5850 -7023 -10192 -5094 -4325
4642 -4325 -7892 -14089 -5369 7408 14976 9381 -2502 1821 21184 17081 -1932 -15986 -13842 -21774
4628b1774N458J627L999L218J5828J1696j4655q090r538L021K8614J277l616j9308
4614b243j0713Q807J139L525r374J212J879m739j787J7794N253q070j2637M551
4600e403P594L535k285k070P72J097j076k4100R77M655K226N092p58M244N003
4585d97J985j9652m905j879J7007J3922r413o396L612N406j0412k658j0965N152
4571a9693R049R900K698L606J663o460o891M668M686M785J093j5647o582j1858
4557b4983j2036N329J6364K478K159M085J0070q147n416J646p933k971O975K031
4543a0349n398o611o601J6837Q906j614p979p897n772j269J8075k812l12L21Q889
4528c586p791j4752O34J5445J5088N160L405n206j1547l756m300p14p577m646
$$ plain form
4628 -21774 -16316 -14689 -10690 -7472 8356 20052 5397 -2693 -12231 -9210 19404 20681 17065 -2243
4614 -2243 -12956 -4149 -3010 515 -8859 -7647 -5768 -10507 -12294 5500 10753 2683 -9954 -5403
4600 -5403 2191 5726 3441 1371 2143 3240 2164 -21936 -20959 -16304 -14078 -8986 -9744 -5500 -497
4585 -497 1488 -18164 -23069 -24948 -7941 5981 -3432 -9828 -6216 -810 -11222 -13880 -24845 -19693
4571 -19693 -10644 -744 1954 5560 7223 763 -6128 -1460 3226 8011 9104 -6543 -13125 -24983
4557 -24983 -37019 -31690 -15326 -12848 -10689 -6604 3466 -4681 -10097 -8451 -16384 -19355 -12380 -10349
4543 -10349 -15747 -22358 -28959 -12122 -3216 -4830 -12809 -20706 -26478 -27747 -9672 -12484 -12796 -12475 -3586
4528 -3586 -11377 -26129 -25495 -10050 5038 10198 13603 8397 -3150 -6906 -11206 -11920 -19497 -24143
4514b4143N290J4678J0615M201q764j4043m208m729n114J7880J01j887n13P195
4500c441R489r921j1410K641m92k279K892j354l434K161j3834K649K954L796o952
4485b6535N313J5338N417Q409n759o826N475Q462p540n464P615M321r966K528
4471G88J6130o387j4159P00m50n154L547Q715J5940k655l611o735m506j976P880
4456H067J117q673Q80r101l707k784J549J281Q451J814o459o611J9151J0443n920
4441I498J27q922K175n544o685j2964R804j977M043K320o739J4654m363J81j984
4426f376J1823M27q86Q891J1625j4444j9663k43J429o32O435j70L089K704K097
4411F106p116k710j1395K892J1398N413N075o814K865K59n209n762r639o57P707
$$ plain form
4514 -24143 -18853 -4175 6440 10641 1877 -12166 -16374 -21103 -26217 -8337 -8236 -10123 -10636 -3441
4500 -3441 6048 -3873 -15283 -12642 -13134 -15413 -12521 -13875 -17309 -15148 -28982 -26333 -23379 -19583 -26535
4485 -26535 -21222 -5884 -467 7942 2183 -4643 832 9294 1754 -3710 3905 8226 -1740 788
4471 788 16918 10531 -3628 -2928 -3378 -8532 -4985 3730 19670 17015 13404 6669 2163 187 8067
4456 8067 9184 511 1391 -7710 -11417 -14201 -12652 -11371 -2920 -1106 -7565 -14176 4975 15418 9498
4441 9498 9625 703 2878 -2666 -9351 -22315 -12511 -14488 -10445 -8125 -14864 -210 -4573 -4392 -6376
4426 -6376 5447 5874 4988 13879 25504 11060 -8603 -8846 -7417 -8049 -1614 -1784 1305 4009 6106
4411 6106 -1010 -3720 -15115 -12223 -825 4588 9663 2849 5714 5973 764 -4998 -14637 -15294 -7587
4396g587Q2K242M523l20j829N612J4759P407j2550k1877k037J5600p114l912Q498
4381A497o497j819Q391K1327r274j8637p504k444K1410M427j7927l694J4675R338
4367A3269j0413o426r84k389N76q06M346l622J0369r62k2176j3185k498N011J6014
4352a3876J9124n174j0484m573o428Q387R396m033M14o678k308J4464M002l992
4338a759K228M879j0843j3389K134O980L296j038o979o663k718o84J8535Q336
4324B315K922O940P870j6734j1764J2939l835p93j3015M373O64J0488J437R71
4310D778m540n245m998j5410n396N215k169n044Q875J1831J5377j911j1124n463
4296a5224k781O381K169j840n128m579o962J6974N295M874n442k0380l23J653
$$ plain form
4396 -7587 -7505 -5263 -740 -1060 -2889 2723 17482 24889 12339 -9538 -11575 4025 -3089 -7001 1497
4381 1497 -5000 -6819 1572 22899 13625 -5012 -12516 -14960 6450 10877 -7050 -10744 3931 13269
4367 13269 2856 -3570 -4554 -6943 -6367 -7173 -2827 -6449 3920 2958 -19218 -32403 -34901 -29890 -13876
4352 -13876 5248 74 -10410 -14983 -21411 -13024 -3628 -7661 -7247 -13925 -16233 -1769 2233 -1759
4338 -1759 469 5348 -5495 -18884 -16750 -9770 -6474 -7512 -14491 -21154 -23872 -24556 -6021 2315
4324 2315 5237 12177 20047 3313 -8451 4488 653 -140 -13155 -8782 -8118 2370 3807 4778
4310 4778 238 -5007 -10005 -25415 -30811 -25596 -27765 -32809 -23934 -12103 3274 1363 -9761 -15224
4296 -15224 -18005 -11624 -9455 -11295 -16423 -21002 -27964 -10990 -5695 -821 -6263 -26643 -26966 -25313
4282b5313R178q403J2739j053l03P436j362J4434J0070j3107j6344r109l752J920
4268b2969R993Q639N199o361L785j029j0720j2884L430J2719Q682N971K185k4788
4254a8148O182M51k063J87j0208k375M164L700J2745j3075q968n847P022J9863
4240f370N788j100k535l255k367J0242j815K429P125m518j3808j1344J2833j477
4226a0172j697O766l685k805J1817k831r944l939m597j0408j3964P751L727Q771
4212b5210O995j2918p5M580K747J455n208Q374J3926J2595K524P279j0804j8592
4198a2332J308j2097m844K5254J6446l248n405n1q764q600K600j5518n747l455
4184c4453M290J2330L346K282J613j2310M352Q713k307q653P129P051j420M994
$$ plain form
4282 -25313 -16135 -24538 -11799 -12852 -13155 -5719 -7081 7353 17423 4316 -12028 -21137 -24889 -22969
4268 -22969 -12976 -4337 862 -5499 -1714 -2743 -13463 -26347 -22917 -10198 -1516 4455 6640 -18148
4254 -18148 -11966 -11515 -13578 -13391 -23599 -25974 -21810 -18110 -5365 -18440 -27408 -33255 -26233 -6370
4240 -6370 -582 -1682 -4217 -7472 -9839 403 -1412 1017 8142 3624 -10184 -21528 -8695 -10172
4226 -10172 -11869 -5103 -8788 -11593 224 -2607 -12551 -16490 -21087 -31495 -45459 -37708 -33981 -25210
4212 -25210 -18215 -31133 -31208 -26628 -23881 -22426 -27634 -19260 -5334 7261 9785 17064 6260 -12332
4198 -12332 -11024 -23121 -27965 -2711 13735 10487 5082 5031 -3733 -12333 -9733 -25251 -30998 -34453
4184 -34453 -30163 -17833 -14487 -12205 -10592 -22902 -18550 -9837 -12144 -20797 -13668 -6617 -8037 -3043
4170c043L497n803p598J5590Q020k413J84j9193p182l019N160K404R487J8232
4156A4323K084j3027j2785p783j0623O299J3692p5j4163P436j047J3760M497j917
4142F71J0360m419j3082n658k344l837J2898q903p045p405J2786J1732l592J4230
4128F392J883j6010j2358o582M233L556N232O321j219l472p365Q605J7352o899
4114c31p354j1946L585J5692R308k921k581o409q610j4379K486Q943N142Q391
4100i84k96l660J499j701r114K938m936N920Q374R125N261L635r088o947p888
4085g862m710J6320r411k765O705j547o31j850p06p406j2470L207L806L446L152
4070a2722J174l10J3976N443j4158l115J3394J2863q249m978m242n955n938j435
$$ plain form
4170 -3043 454 -5349 -12947 2643 10663 8250 8434 -10759 -17941 -20960 -15800 -13396 -3909 14323
4156 14323 16407 3380 -9405 -17188 -27811 -21512 -7820 -7895 -22058 -14622 -15669 -1909 2588 671
4142 671 11031 6612 -6470 -12128 -14472 -18309 -5411 -14314 -21359 -28764 -15978 -4246 -7838 6392
4128 6392 8275 -7735 -20093 -26675 -22442 -18886 -13654 -7333 -8552 -12024 -19389 -10784 6568 -331
4114 -331 -7685 -19631 -16046 -354 8954 6033 3452 -2957 -11567 -25946 -23460 -14517 -9375 -984
4100 -984 -1280 -4940 -3441 -5142 -14256 -11318 -16254 -10334 -1960 7165 12426 16061 6973 26 -7862
4085 -7862 -12572 3748 -5663 -8428 -1723 -3270 -3901 -5751 -6457 -13863 -26333 -23126 -19320 -15874 -12722
4070 -12722 -11548 -11858 2118 7561 -6597 -9712 3682 16545 8296 3318 -924 -6879 -12817 -14252
4056a4252q594Q983Q527J839r365j569r044m096R119J4805J202P712L763n964
4042C066o989k064Q949k423k25K0126j3670k2211p289M511l037N127N190O621
4028d318K943Q087J4785k401j9839j0597P834k978M463j0981p846m050L412j0709
4014c2195K312Q323J8287N662j873J206J225N645J2331P929j8821j2923l158P870
4000A820J2899K881l76o703N407M373O626M044r954j3677p040j730O266L229j523
3985F542p306L051J2430K750j1333n313n38n845m902J4323P367j151j0386k191
3971b502J285J6772O226j8197q037j942l380p1J233k578O508J1548j220q743N568
3956B470J4159m845j5112L717K414l316q45O749M825k352l138M668J1951q812
$$ plain form
4056 -14252 -22846 -13863 -5336 -3497 -12862 -14431 -23475 -27571 -18452 -3647 -2445 5267 9030 3066
4042 3066 -3923 -5987 2962 539 314 20440 6770 -15441 -22730 -18219 -21256 -16129 -10939 -4318
4028 -4318 -1375 6712 21497 19096 -743 -11340 -3506 -6484 -2021 -13002 -20848 -24898 -21486 -32195
4014 -32195 -29883 -21560 -3273 2389 516 1722 2947 8592 20923 28852 10031 -2892 -6050 1820
4000 1820 14719 17600 17224 10521 15928 20301 26927 30971 21017 7340 300 -1430 4836 8065 6542
3985 6542 -764 2287 14717 17467 6134 821 283 -5562 -10464 3859 11226 10075 -311 -2502
3971 -2502 -1217 15555 21781 3584 -4453 -6395 -9775 -9846 -8613 -11191 -4683 6865 5645 -3098 2470
3956 2470 16629 11784 -3328 389 2803 -513 -1358 5391 10216 7864 4726 9394 21345 12533
3942A2533j3329o968J756j677k367J1715k616q689j091L902P223J7789J4104N634
3928C7919k983j3101j6610L526j421j3648n088n886R389N056M24n258r529k792
3914b0002O675J1970N65j0715Q804o53l457j3940m112J2247N68q717j0373J3733
3900a7407J4564j47j0540K616P221J1062J1410j2188l822j178K854k934O744Q466
3886A6721N707J063n785o893K399R495l417j5875K520j634p283O826m708n90M413
3871B959J3917J358l68Q164q600j2187J566J528j151j0498N834P771l356j261
3857E676j270J347k270r314m663N705j016P607J288j2097o536n884o928N933K030
3842b0392k568L716N757J3923K1091M085o278m262q780M276Q51m458k0496P208
$$ plain form
3942 12533 -796 -7764 -6008 -7685 -10052 1663 -953 -9642 -10733 -6831 392 18181 32285 37919
3928 37919 34936 21835 5225 8751 7330 -6318 -11406 -17292 -7903 -2847 -2423 -7681 -17210 -20002
3914 -20002 -13327 -1357 -792 -11507 -2703 -3356 -6813 -20753 -24865 -12618 -12050 -20767 -31140 -17407
3900 -17407 -2843 -2990 -13530 -10914 -3693 7369 18779 6591 2769 1591 4445 1511 8255 16721
3886 16721 22428 23491 17706 10813 13212 22707 19290 3415 5935 4301 -2982 3844 -864 -1454 2959
3871 2959 16876 18234 17866 26030 17430 5243 6809 8337 7186 -3312 2522 10293 6937 5676
3857 5676 4406 5753 3483 -5831 -10494 -4789 -5805 1802 3090 -9007 -15543 -21427 -28355 -22422 -20392
3842 -20392 -22960 -19244 -13487 436 21527 25612 19334 15072 6292 10568 11419 6961 -13535 -6327
3828f327K293Q7N781n85l670r271r035m158J1175O910J742K516J247Q200j96r196
3812b487m695p748j117J2629M135j0446j0679N686m08l498l266l644N037K2479
3798A978J429L453k294j053M434k289j202M667k647l381j3234j062P658O131P738
3783A0326k960j3389j622o721j264n998J0274J6099J403m618p33J376J638j4855
3769a1044j2680K769O240N273L589J6429M820j4958j102N187Q103k05k479r051
3755H91r838l396l414q739m216J758L532J8408O139Q033l225n887m861Q068L663
3740F916o051k026j0086O793J2706K565p241r203J0067m116j9487P139J4051l964
3726a937N59k742J5145j856q521q990m009R98n531j1447k494N671O835K3058J5164
$$ plain form
3828 -6327 -4034 -3947 1834 1249 -2421 -11692 -20727 -24885 -13710 -6800 -5058 -2542 -1295 6905 6709 -2487
3812 -2487 -7182 -14930 -16047 -3418 717 -9729 -20408 -14722 -15130 -18628 -21894 -25538 -20501 1978
3798 1978 3407 6860 4566 3513 7947 5658 4456 9123 6476 3095 -10139 -11201 -3543 2588 10326
3783 10326 7366 -6023 -7645 -14366 -15630 -21628 -11354 4745 6148 1530 797 2173 3811 -11044
3769 -11044 -23724 -20955 -14715 -9442 -5853 10576 15396 438 -664 4523 12626 12421 9942 891
3755 891 -8947 -12343 -15757 -24496 -28712 -26954 -23422 -5014 1125 9158 5933 46 -4815 3253 6916
3740 6916 865 -1161 -11247 -4454 8252 10817 3576 -5627 4440 324 -19163 -12024 2027 -1937
3726 -1937 -1378 -4120 11025 9169 648 -8342 -12351 -11353 -16884 -28331 -30825 -25154 -18319 4739 19903
3711A9903J106j2960j9180j796M411M287l661O021J0436N213o699j2737N675L856
3697C875j0950j997l003J1804L201K932M204L584n992p5J392L324j0380j1056
3683i137K408j0241r307P152K501R800J1198L896m266J433j0502L028K430Q522
3669H915J69j6740j231J4337J4187k558N196o441m793R88j1567q26N377o660o011
3654g658l822o91O303L936j725j1478p539r363J2742l223j8432J3877J3508L364
3640a0201O803J556L516q876k085k776L929r770J081K7991N680l825N954J258
3626B0235j3107q166m023j2966k679P415J5505r102O069M694N312J0758K4445
3613D4390j2598j7483n7L892j6617j0399o738m160J1745K496q123j0673o0o814
$$ plain form
3711 19903 21009 8049 -11131 -12927 -8516 -4229 -7890 -1869 8567 13780 7081 -5656 19 3875
3697 3875 -7075 -9072 -12075 -271 2930 5862 10066 13650 7658 7583 8975 12299 1919 -9137
3683 -9137 -6729 -16970 -26277 -19125 -16624 -6824 4374 8270 4004 5437 -5065 -2037 393 8915
3669 8915 9084 -7656 -8887 5450 19637 17079 22275 15834 11041 12029 462 -364 5013 -1647 -7658
3654 -7658 -11480 -12171 -5868 -1932 -3657 -15135 -22674 -32037 -19295 -22518 -40950 -27073 -13565 -10201
3640 -10201 -3398 -1842 1674 -7202 -9287 -12063 -8134 -17904 -16823 11168 16848 13023 18977 20235
3626 20235 7128 -1038 -5061 -18027 -20706 -13291 2214 -6888 -819 3875 9187 19945 44390
3613 44390 31792 14309 14252 18144 1527 -8872 -15610 -19770 -8025 -5529 -13652 -24325 -24385 -31199
3599c1199l512M713M320O28J3442J4831M089j3574j0185P437L722j961p925J753
3585a3421l833n167J7011n010k284K300O393K5O633J756K057l218J3329k085q390
3570F096L435J415q14j0672k0519p812R587J1366m191q50k896J085m502m283m29
3555b3984r609M672J1083q847R470J820J380K304L372j031P932J1547L241j3243
3541A07p696N434l55r42r653r890N72K771J1748P342j226r982j3979l952R067
3526b0634J4410J2280j1486j5224j0468k890L578P831K934J0479l335J3575j6096
3513a5046m20Q460j7918p202O322N097l279O208K181J2470j097j4583J0123L929
3499d755n85q91R625J7732M878j0702j2242j2707K519J3049j290l458j2298j149
$$ plain form
3599 -31199 -34711 -29998 -25678 -25050 -11608 3223 7312 -6262 -16447 -9010 -5288 -7249 -15174 -13421
3585 -13421 -17254 -22421 -5410 -10420 -12704 -10404 -4011 -3986 2647 4403 6460 3242 16571 14486 6096
3570 6096 9531 10946 10132 -540 -21059 -28871 -19284 -7918 -12109 -12959 -15855 -14770 -19272 -23555 -23984
3555 -23984 -33593 -28921 -17838 -26685 -17215 -15395 -14015 -11711 -8339 -9370 -1438 10109 13350 107
3541 107 -7589 -2155 -2510 -3452 -13105 -22995 -22423 -19652 -7904 -562 -1788 -11770 -25749 -29701 -20634
3526 -20634 -6224 6056 -5430 -20654 -31122 -34012 -30434 -22603 -19669 -9190 -12525 1050 -15046
3513 -15046 -15466 -7006 -24924 -32126 -25804 -20707 -23986 -17778 -15597 -3127 -4224 -18807 -8684 -4755
3499 -4755 -5340 -6231 3394 21126 26004 15302 3060 -9647 -7128 5921 4631 1173 -11125 -12274
3485a2274M292q334k565O334J5372j319j3107k567N42M455N644J6874J221j7840
3471c272p666p89j089M359k603l234l596Q055Q020J637L559L078J379m45P596
3456A4989p756j7046k645Q313J1388k73p458n273J1366K069n276J165M52k006
3442B009p555o430l965J3445J752l669Q976m791K007J1892j3291o776j1073k701
3428b0170l690M798P559m256O871J0124r32K906N620k738k090o32r455n367j6299
3413b7751J1041K92n881k134J381l816N512J0325P201P90L055j4638q187j663
3399b4473M271J3799J3692N226j654j5249j1285J4284p050j7620o991J8177K976
3386a1897O77K2377j0033o301n405R381P178j2208r600J7005k887j1555M241n647
$$ plain form
3485 -12274 -7982 -16316 -18881 -12547 2825 1506 -11601 -14168 -13626 -9171 -3527 13347 14568 -3272
3471 -3272 -10938 -11727 -12816 -8457 -11060 -14294 -17890 -9835 -1815 -178 3381 6459 7838 7393 14989
3456 14989 7233 -9813 -12458 -4145 7243 6970 -488 -5761 5605 7674 2398 3563 4015 2009
3442 2009 -5546 -11976 -15941 -2496 -744 -4413 4563 -228 1779 13671 380 -6396 -17469 -20170
3428 -20170 -23860 -19062 -11503 -15759 -8888 1236 304 3210 8830 6092 4002 3370 -6085 -11452 -27751
3413 -27751 -16710 -16418 -22299 -24433 -23052 -26868 -21356 -11031 -3830 -3040 15 -14623 -22810 -24473
3399 -24473 -20202 -6403 7289 12515 10861 -4388 -15673 -1389 -8439 -26059 -33050 -14873 -11897
3386 -11897 -11220 11157 1124 -5177 -10582 -1201 5977 -6231 -15831 1174 -1713 -13268 -9027 -14674
3372a4674J634Q34j1885J368K405M265R451J1428Q247n9j6178j2410n810P325
3358a4059m703Q063L526k18q38j0462q91O601P335J0509m199p805N402o273k243
3343a0255n724R25N184O041Q086K559M33J678j1072q984m598Q322J1410j2244
3329h239m803j1209l310J5412J270m741P622m080Q094r434j536r98o625o308J0830
3314a8055P726R31L827N261K342p579j4829j0214j846Q122m391Q034M349l165
3300a9487o906O447L652j2422o92Q053M014j611q746M967l809j1555O304J4740
3286a7051J3481R908N220J297j1842k07m682p056m498j74N308R253m786l289O054
3271c064O306R664o399j6191O411P611L440R361J304k018j4994J25N546p379j4282
$$ plain form
3372 -14674 -13040 -12206 -24091 -22723 -20318 -16053 -6602 4826 13073 13014 -3164 -15574 -21384 -14059
3358 -14059 -18762 -10699 -7173 -7391 -8229 -18691 -19582 -12981 -5646 4863 664 -7141 -1739 -8012 -10255
3343 -10255 -15979 -15054 -9870 -3829 4257 6816 7249 8927 -2145 -11129 -15727 -7405 4005 -8239
3329 -8239 -13042 -24251 -27561 -12149 -10879 -15620 -7998 -12078 -3984 -13418 -14954 -15952 -22577 -28885 -18055
3314 -18055 -10329 -9398 -5571 -310 2032 -5547 -20376 -30590 -32436 -24314 -28705 -20671 -16322 -19487
3300 -19487 -26393 -19946 -16294 -28716 -29408 -21355 -17341 -18952 -27698 -22731 -26540 -38095 -31791 -17051
3286 -17051 -3570 6338 11558 12855 1013 806 -3876 -10932 -15430 -15604 -10296 -1043 -5829 -9118 -3064
3271 -3064 3242 12906 6507 -9684 -3273 4338 7778 17139 18443 16425 1431 1556 7102 -277 -14559
3256a4559j5885J6435m74j43N917o032j2356N824K3342M686j2216j0512Q631J4977
3242G635M067K159j0354j5858j1949k859J1341O422j599n183M612o726J1078L358
3228c856l382p416L411J3679K5861n670k4800l714l991n63K441N451M390M359
3214F200O371N582J0461j2638p703P154M170j7566j3060M86J021N280R276m276
3200G58j478j599k948L928O664J5137J294q157j1230q272l068N007O19M233P360
3185H248K19j1068n322j6750O760J1346k067J3341L154j1332N21N679k036j1825
3171a1132j1475K631K436M576j089r954M574J1206n212l22m366j2631j0273J07
3157d0924J539J5209J3366l130k544J8020O581k047r12n012p063Q080q343r161
$$ plain form
3256 -14559 -30444 -14009 -14483 -14626 -8709 -14741 -27097 -21273 2069 6755 -5461 -15973 -7342 7635
3242 7635 11702 13861 3507 -12351 -24300 -27159 -15818 -9396 -10995 -16178 -11566 -18292 -7214 -3856
3228 -3856 -7238 -14654 -11243 2436 28297 22627 -2173 -5887 -9878 -10441 -8000 -2549 1841 6200
3214 6200 12571 18153 28614 15976 8273 15427 19597 2031 -11029 -10543 -9522 -4242 5034 758
3200 758 -720 -2319 -5267 -1339 5325 20462 21756 13599 2369 -5903 -8971 -3964 -3345 888 8248
3185 8248 8467 -2601 -7923 -24673 -17913 -6567 -8634 4707 7861 -3471 -2950 2729 693 -11132
3171 -11132 -22607 -19976 -17540 -12964 -14053 -24007 -19433 -8227 -13439 -13761 -18127 -30758 -41031 -40924
3157 -40924 -39385 -24176 -10810 -13940 -16484 1536 8117 6070 5158 146 -6917 1163 -7180 -16341
3143a6341R31J4120Q228j196P003Q142J1347p866J1039k0030L35M447j7552k1995
3129a9388M054k27O827R530r332j0875j871r69J8889O723r406O218O552K104j079
3114G750m484o668n228L90K825o222J690J0408l10N61m985j45q532q52J1631K2783
3098B0612j1795r033K620r549j1872Q336K702k579r802Q064J674L887J3481m400
3084B346l958p57M809m989j087J177j3146J5865J6060q254j357j4131m052J1517
3070D3O729P0J047j1535o600M04P63n91l786P866J314p186N917J5841L297p957
3054E636j6433k11J7522k592K16P36J0138o120j2425L124M687j9072J549J9306
3040F061j0193R393Q075j1659O2N424O906q843j5565l822J363j148P589K2277
$$ plain form
3143 -16341 -15410 -1290 6938 5742 12745 20887 32234 24368 35407 15377 15712 20159 2607 -19388
3129 -19388 -15334 -15561 -8734 796 -8536 -19411 -21282 -22251 -3362 3361 -6045 173 6725 8829 7750
3114 7750 3266 -3402 -8630 -8240 -5415 -11637 -9947 461 151 712 -4273 -4418 -12950 -13802 -2171 20612
3098 20612 8817 -216 2404 -7145 -19017 -10681 -7979 -10558 -20360 -12296 -10622 -6735 6746 2346
3084 2346 -1612 -2369 2440 -2549 -3636 -2459 -15605 260 16320 8066 6709 -7422 -11474 43
3070 43 6772 6842 7889 -3646 -10246 -9842 -9079 -9670 -13456 -5590 -4276 -11462 -5545 10296 13593 5636
3054 5636 -10797 -11008 6514 3922 4138 4874 15012 8892 -3533 -409 4278 -14794 -13245 6061
3040 6061 -4132 5261 13336 1677 1739 7163 14069 5226 -10339 -14161 -12798 -13946 -6357 15920
3026A5920r681j2552j578L043o247q651J9487k650m815J314J2976Q181j3996k6
3012G25P313m807l655M012m390k0212L300J3748L894O177m966j775n699p71P77
2997f329K271r718j125n42o579M599K7915K455K1N698n307j6651m533Q223q393
2982g995l808M879O540k708N26L403j6533m398J3983N324j012n592O903Q680N309
2967A3501k644J30M518L646P984j8814K073q725m986l562m079m674O512O153l92
2952c359j2825j6426M827M581P295J3445j185k077P736n649q653j372J998M781
2938f883l016m79m391J4618N777j4178Q224R927R065O865q131j8541j2874N057
2924h960K611L760P205j029j0044P214k324J7192L796q660rL79p764j3916k24
$$ plain form
3026 15920 6239 -6313 -7891 -4848 -11095 -19746 -259 -2909 -7724 -6410 6566 14747 751 725
3012 725 8038 3231 -424 3588 -802 -21014 -17714 -3966 -72 6105 1139 -636 -6335 -7106 -6329
2997 -6329 -4058 -13776 -14901 -15443 -22022 -17423 10492 12947 12968 18666 13359 -3292 -7825 398 -7995
2982 -7995 -11803 -6924 -384 -3092 -2566 837 -15696 -20094 -6111 -787 -1799 -7391 -488 8192 13501
2967 13501 10857 10987 15505 19151 27135 8321 10394 1669 -3317 -6879 -10958 -15632 -9120 -2967 -3359
2952 -3359 -16184 -32610 -27783 -23202 -15907 -2462 -3647 -5724 2012 -3637 -12290 -13662 -11664 -6883
2938 -6883 -9899 -10378 -14769 -151 5626 -8552 -328 9599 18664 25529 17398 -1143 -14017 -8960
2924 -8960 -6349 -2589 4616 3587 -6457 757 -1567 15625 19421 10761 10752 11131 3367 -10549 -10773
2909a0773L880k812J0573K237m147j6916O810N118J2544P956n145J1051J1699
2896C2075n738j2334j5343q083m796j4213j0194J0929K1364M116r091k62P888
2883c682J678j1713N154J6037j85j92J4531r617k1709n986l417j426L014n60p249
2868b5322q183l36R572P710k883L293M570N944K596o639o303J3575R244K134j815
2853G157n788J785j0182l804j1422N202J3596L16j3604J2151J1494j1546O85J4134
2839A0174J128Q915J320n093N709j2944j9173j233O573J0601Q512r315k0237r455
2825b4518O595j0964l827O868J1092O762J4550N456j3619j2835J3072J033M719
2812D384O272p671q859l640K025J785J0546L306q196M952j872L07l555j1151Q986
$$ plain form
2909 -10773 -6893 -9705 868 3105 -1042 -17958 -11148 -6030 6514 14470 9325 20376 32075
2896 32075 26337 14003 -1340 -9423 -14219 -28432 -38626 -27697 -6333 -2217 -11308 -11570 -3682
2883 -3682 -2004 -13717 -8563 7474 7289 7097 21628 12011 -9698 -15684 -19101 -20527 -17513 -18073 -25322
2868 -25322 -33505 -33841 -24269 -16559 -19442 -16149 -11579 -5635 -3039 -9678 -15981 -2406 6838 8972 7157
2853 7157 1369 3154 -7028 -10832 -22254 -17052 -3456 -3140 -16744 -4593 6901 -4645 -3960 10174
2839 10174 11302 20217 21537 16444 22153 9209 -9964 -11197 -4624 5977 14489 5174 -15063 -24518
2825 -24518 -17923 -28887 -32714 -25846 -14754 -7992 6558 12014 -1605 -14440 -1368 -335 4384
2812 4384 10656 2985 -5874 -9514 -7489 -5704 4842 8148 -48 4904 3032 3339 -216 -11367 -2381
2797b381p688R60O502l374O103Q294L400j4962P706q352n837R416R104j1714r545
2782a2368L841J2068K936l692n479n261K518J723j713O860M803l795j1285p392
2768a6236K3047J402n747j9296r177k265J123Q830J4285J989J040j0640N50n413
2754a6508q023Q143J1911Q595n661P904J5750L596N615j505k3873j1884l446j590
2740a0976M377K777K01K903o967j031r76k600J3579K776R72j2825p412N509N842
2725c851k930J0038L700k0403M326J9345K614Q56M013j4826k2257j067L956J8037
2711A551O724O701q309q950j1692k785R149M785K187J1704m834m173o576N652
2697A134O431J0117r511q185j195M67N897R006L791q924r253j1708j498J5352
$$ plain form
2797 -2381 -10069 -9109 -2607 -5981 122 8416 11816 -3146 4560 -3792 -9629 -213 8891 -2823 -12368
2782 -12368 -8527 3541 6477 2785 -2694 -7955 -5437 -3714 -5427 1433 6236 2441 -8844 -16236
2768 -16236 6811 8213 2466 -16830 -26007 -28272 -27149 -18319 -4034 -2045 -1005 -11645 -11095 -16508
2754 -16508 -24531 -16388 -4477 4118 -1543 6361 22111 25707 31322 29817 5944 -5940 -9386 -10976
2740 -10976 -6599 -3822 -3621 -718 -7685 -8716 -9692 -12292 1287 4063 5035 -7790 -15202 -9693 -3851
2725 -3851 -6781 3257 6957 -13446 -9120 10225 12839 13695 17708 2882 -19375 -20442 -16486 1551
2711 1551 8275 14976 6667 -2283 -13975 -16760 -7611 -2826 -639 11065 6231 2058 -4518 1134
2697 1134 7565 17682 8171 -14 -1209 -742 5155 14161 17952 9028 -225 -11933 -13431 1921
2683A921N915j1242M26j1077j4174Q017J1076M992K557M852J6776m999j8206r149
2669a2315k036o860N481J0420Q605K430M788m899j1333o030K947J395o699l738
2655a7844k053L140n49n611p851L223K5640J9417M283o646j3022j2640o676N005
2641a2184J8066P009o071M449J501Q42N50j630r456j474N74l93L092M629J525
2626A1029j828O053j742k319m921j0180J885M090j3120j835P218N089L790o423
2612c214K667J500M619k36m213r132o484J739O323P765K5p364k708M213k372P667
2596G95Q974m357m529k89n857L534R143m670o930K891o22o348m874n002J0370
2581g771R075p801M581k342j2271K318J4898p07k781k95j162J726K717l344J145
$$ plain form
2683 1921 7836 -3406 -2980 -14057 -28231 -20214 -9138 -4146 -1589 3263 20039 15040 -3166 -12315
2669 -12315 -14351 -21211 -15730 -5310 3295 5725 10513 5614 -5719 -11749 -8802 -7407 -14106 -17844
2655 -17844 -19897 -16757 -17306 -22917 -30768 -27545 -1905 17512 21795 15149 2127 -10513 -17189 -12184
2641 -12184 5882 12891 6820 11269 12770 13612 14162 12532 3076 1602 2176 1783 4875 9504 11029
2626 11029 9201 15254 13512 11193 6272 -3908 -2023 2067 -11053 -12888 -5670 -581 3209 -3214
2612 -3214 -547 953 5572 5336 1123 -8009 -14493 -12754 -6431 1334 1359 -6005 -8713 -4500 -6872 795
2596 795 9769 5412 883 594 -5263 -1729 7414 2744 -4186 -1295 -1917 -8265 -13139 -18141 -7771
2581 -7771 1304 -6497 -1916 -4258 -16529 -14211 687 -20 -2801 -3096 -4258 -2532 185 -3159 -2014
2566b014j859K893M386O93L073m481J842J2574p081o779p330o075M830K1946M839
2551B1457j3259n537m915M650N516j437j6158J085L297m912k081j1572J666Q935
2537a3265J280J547K980j268M151M881q06n479j712M500k578k88O469m171M506
2522G47J430n819m174n657l802j798J1487R653L478J162n010P927m679n772m373
2507e200r803j1756J7544Q49m292q367N605P540K547J0036Q805j8135p986J963
2493a0650P979k113j3730J84O245o919M286p307l044p41Q435l14n64r01j663K236
2477a8581N283J315J0021J3229O768q646j1432J2030M009j58q610j7197j831J3762
2463c8J0047p956j3863K233R733M751J1606q773N383K036p399j1392p995qm526
$$ plain form
2566 -2014 -3873 -980 3406 4099 7172 2691 4533 17107 10026 3247 -4083 -10158 -5328 16618 21457
2551 21457 8198 2661 -2254 2396 7912 6475 -9683 -8598 -5301 -10213 -12294 -23866 -22200 -13265
2537 -13265 -11985 -10438 -7458 -8726 -4575 306 -500 -5979 -7691 -3191 -5769 -6057 412 -3759 747
2522 747 2177 -3642 -7816 -13473 -17275 -19073 -7586 2067 5545 6707 1697 9624 4945 -827 -5200
2507 -5200 -15003 -26759 -9215 -8366 -12658 -21025 -15420 -7880 -5333 4703 13508 -4627 -12613 -10650
2493 -10650 -2671 -4784 -18514 -18330 -12085 -19004 -14718 -22025 -25069 -25810 -17375 -17689 -18253 -19154 -20817 -18581
2477 -18581 -13298 -11983 -1962 11267 18035 9389 -2043 9987 13996 13838 5228 -11969 -13800 -38
2463 -38 10009 2053 -11810 -9577 156 4907 16513 7740 13123 15159 7760 -3632 -11627 -11635 -16161
2448a6161q02P603L553m362j5163O587K6168N024j048M732o773j164M285j0155
2434B324j3509O105n075l084K605j091P361Q163J423j2768o527J4683Q030M64
$$ plain form
2448 -16161 -16963 -9360 -5807 -10169 -25332 -18745 7423 12447 11399 16131 9358 8194 12479 2324
2434 2324 -11185 -5080 -10155 -13239 -10634 -11725 -4364 3799 5222 -7546 -14073 610 8640 9104
$$ [...]
##END NTUPLES=NMR SPECTRUM
##END=
