##TITLE=Analysis number 327366
Compound Code sew 02691
Project Code adrs 
Chemist Name fudan
##JCAMPDX= 6.0         $$ Bruker NMR JCAMP-DX V2.0
##DATA TYPE= NMR SPECTRUM
##DATA CLASS= NTUPLES
##ORIGIN= Bruker BioSpin GmbH
##OWNER= nmr
$$ XWIN-NMR		Version 3.5
$$ Thu Mar 22 13:33:11 2007 GMT Standard Time (UT+0h)  MAYBRIDGE\nmr@NMR_250MHZ
##.OBSERVE FREQUENCY= 250.131544655141
##.OBSERVE NUCLEUS= ^1H
##.ACQUISITION MODE= SIMULTANEOUS (DQD)
##.ACQUISITION SCHEME= undefined
##.AVERAGES= 16
##.DIGITISER RES= 18
##SPECTROMETER/DATA SYSTEM= dpx250
##.PULSE SEQUENCE= zg30
##.SOLVENT NAME= CDCl3
##.SHIFT REFERENCE= (INTERNAL, CDCl3, 0, 16.522)
##AUDIT TRAIL= $$ (NUMBER, WHEN, WHO, WHERE, WHAT)
$$ ##TITLE= Audit trail, XWIN-NMR		Version 3.5
$$ ##JCAMPDX= 5.01
$$ ##ORIGIN= Bruker BioSpin GmbH
$$ ##OWNER= nmr
$$ C:\u/data/dgb/nmr/ADRS/1740/pdata/1/auditp.txt
$$ ##AUDIT TRAIL=  $$ (NUMBER, WHEN, WHO, WHERE, WHAT)
(   1,<2007-03-22 13:32:50.36 +000>,<MAYBRIDGE\nmr>,<NMR_250MHZ>,
      <created by zg, POWCHK disabled, PULCHK disabled
       configuration hash MD5:
       49 4B E0 1D 92 C2 6B 37 9F E6 65 BC 52 41 86 1D
       data hash MD5: 64K
       E1 B6 D3 2B 32 C8 30 F6 CC 65 B6 E8 05 9A EA 56>)
(   2,<2007-03-22 13:33:02.89 +000>,<MAYBRIDGE\nmr>,<NMR_250MHZ>,
      <Start of raw data processing
       ef LB = 0.3 FT_mod = 6 PKNL = 1 SI = 32K 
       data hash MD5: 32K
       D9 92 5C C7 C3 6A 58 33 D3 08 9C DF 8F C9 CF FC>)
(   3,<2007-03-22 13:33:04.49 +000>,<MAYBRIDGE\nmr>,<NMR_250MHZ>,
      <apk 
       data hash MD5: 32K
       C3 61 D9 D1 8C 57 2D 82 19 10 CD 26 B2 20 2F 53>)
(   4,<2007-03-22 13:33:05.18 +000>,<MAYBRIDGE\nmr>,<NMR_250MHZ>,
      <abs ABSG = 5 
       data hash MD5: 32K
       FE 44 22 22 E9 28 86 3C B9 16 B2 8F C6 BE 3D CD>)
$$ ##END=
$$ 
$$ hash MD5
$$ 6F 6E 5F 6D 0D A4 25 16 27 EC B7 59 00 3D 02 63
##$RELAX= 
##$RELAX= 
##$RELAX= 
##$RELAX= 
##$RELAX= 
##$RELAX= 
##$RELAX= 
$$ Bruker specific parameters
$$ --------------------------
##$DU= <C:\u>
##$EXPNO= 1740
##$NAME= <ADRS>
##$PROCNO= 1
##$TYPE= <nmr>
##$USER= <dgb>
##$AMP= (0..31)
100 100 100 100 100 100 100 100 100 100 100 100 100 100 100 100 100 100 
100 100 100 100 100 100 100 100 100 100 100 100 100 100 
##$AQSEQ= 0
##$AQ_mod= 3
##$AUNM= <au_zg>
##$AUTOPOS= <33 >
##$BF1= 250.13
##$BF2= 250.13
##$BF3= 250.13
##$BF4= 250.13
##$BF5= 500.13
##$BF6= 500.13
##$BF7= 500.13
##$BF8= 500.13
##$BYTORDA= 1
##$CFDGTYP= 0
##$CFRGTYP= 5
##$CHEMSTR= <none>
##$CNST= (0..31)
1 1 145 1 1 1 1 1 1 1 1 1 1 1 1 1 1 1 1 1 1 1 1 1 1 1 1 1 1 1 1 1 
##$CPDPRG= <>
##$CPDPRG1= <>
##$CPDPRG2= <>
##$CPDPRG3= <>
##$CPDPRG4= <mlev>
##$CPDPRG5= <mlev>
##$CPDPRG6= <mlev>
##$CPDPRG7= <mlev>
##$CPDPRG8= <mlev>
##$CPDPRGB= <>
##$CPDPRGT= <>
##$D= (0..31)
0 1 0 0 0 0 0 0 0 0.06 0 0 0 0 0 0 0.0002 0 0 0 0 0 0 0 0 0 0 0 0 0 0 
0 
##$DATE= 1174570369
##$DBL= (0..7)
120 120 120 120 120 120 120 120 
##$DBP= (0..7)
150 150 150 150 150 150 150 150 
##$DBP07= 0
##$DBPNAM0= <>
##$DBPNAM1= <>
##$DBPNAM2= <>
$$ [...]
##$SUBNAM7= <"">
##$SUBNAM8= <"">
##$SUBNAM9= <"">
##$SW= 20.6930455092707
##$SWIBOX= (0..15)
0 0 3 0 0 0 0 0 0 0 0 0 0 0 0 0 
##$SW_h= 5175.983436853
##$TD= 65536
##$TD0= 1
##$TE= 683.16
##$TE2= 300
##$TE3= 300
##$TEG= 300
##$TL= (0..7)
0 120 120 120 120 120 120 120 
##$TP= (0..7)
150 150 150 150 150 150 150 150 
##$TP07= 0
##$TPNAME0= <>
##$TPNAME1= <>
##$TPNAME2= <>
##$TPNAME3= <>
##$TPNAME4= <>
##$TPNAME5= <>
##$TPNAME6= <>
##$TPNAME7= <>
##$TPOAL= (0..7)
0.5 0.5 0.5 0.5 0.5 0.5 0.5 0.5 
##$TPOFFS= (0..7)
0 0 0 0 0 0 0 0 
##$TUNHIN= 0
##$TUNHOUT= 0
##$TUNXOUT= 0
##$USERA1= <user>
##$USERA2= <user>
##$USERA3= <user>
##$USERA4= <user>
##$USERA5= <user>
##$V9= 5
##$VALIST= <valist>
##$VCLIST= <CCCCCCCCCCCCCCC>
##$VD= 0
##$VDLIST= <DDDDDDDDDDDDDDD>
##$VPLIST= <PPPPPPPPPPPPPPP>
##$VTLIST= <TTTTTTTTTTTTTTT>
##$WBST= 1024
##$WBSW= 4
##$XGAIN= (0..3)
0 0 0 0 
##$XL= 0
##$YL= 0
##$YMAX_a= 527928
##$YMIN_a= -545077
##$ZGOPTNS= <>
##$ZL1= 120
##$ZL2= 120
##$ZL3= 120
##$ZL4= 120
##$ABSF1= 16.522
##$ABSF2= -4.171173
##$ABSG= 5
##$ABSL= 3
##$ALPHA= 0
##$AQORDER= 0
##$ASSFAC= 0
##$ASSFACI= 0
##$ASSFACX= 0
##$ASSWID= 0
##$AUNMP= <proc_1d>
##$AZFE= 0.1
##$AZFW= 0.1
##$BCFW= 0
##$BC_mod= 0
##$BYTORDP= 0
##$COROFFS= 0
##$CY= 12.5
##$DATMOD= 1
##$DC= 0
##$DFILT= <>
##$DTYPP= 0
##$F1P= 14.0000005364418
##$F2P= -0.99999901652339
##$FCOR= 0.5
##$FTSIZE= 32768
##$FT_mod= 6
##$GAMMA= 0
##$GB= 0
##$INTBC= 1
##$INTSCL= 1
##$ISEN= 128
##$LB= 0.3
##$LEV0= 0
##$LPBIN= 0
##$MAXI= 10000
##$MC2= 0
##$MEAN= 0
##$ME_mod= 0
##$MI= 0
##$NCOEF= 0
##$NC_proc= -1
##$NLEV= 6
##$NOISF1= 0
##$NOISF2= 0
##$NSP= 0
##$NTH_PI= 0
##$NZP= 0
##$OFFSET= 16.522
##$PC= 1
##$PHC0= 231.9423
##$PHC1= 5.378461
##$PH_mod= 1
##$PKNL= yes
##$PPARMOD= 0
##$PSCAL= 4
##$PSIGN= 0
##$REVERSE= no
##$SF= 250.13
##$SI= 32768
##$SIGF1= 0
##$SIGF2= 0
##$SINO= 400
##$SIOLD= 32768
##$SREGLST= <1H.CDCl3>
##$SSB= 0
##$STSI= 32768
##$STSR= 0
##$SW_p= 5175.98343685301
##$SYMM= 0
##$S_DEV= 0
##$TDeff= 65536
##$TDoff= 0
##$TI= <Analysis number 999999
Compound Code 99
Book Reference 9
Project Code 9>
##$TILT= no
##$TM1= 0
##$TM2= 0
##$TOPLEV= 0
##$USERP1= <user>
##$USERP2= <user>
##$USERP3= <user>
##$USERP4= <user>
##$USERP5= <user>
##$WDW= 1
##$XDIM= 32768
##$YMAX_p= 305748006
##$YMIN_p= -21312
$$ End of Bruker specific parameters
$$ ---------------------------------
##NTUPLES= NMR SPECTRUM
##VAR_NAME=  FREQUENCY,     SPECTRUM/REAL,   SPECTRUM/IMAG
##SYMBOL=    X,             R,               I
##VAR_TYPE=  INDEPENDENT,   DEPENDENT,       DEPENDENT
##VAR_FORM=  AFFN,          ASDF,            ASDF
##VAR_DIM=   32768,         32768,           32768
##UNITS=     HZ,            ARBITRARY UNITS, ARBITRARY UNITS
##FACTOR=    0.157963299565203, 1,           1
##FIRST=     4132.6476996994, 0,             0
##LAST=      -1043.33573715361, 0,           0
##MIN=       -1043.33573715361, -21312,      0
##MAX=       4132.6476996994, 305748006,     0
$$ Real data points
##PAGE= N=1
##DATA TABLE= (X++(R..R)), XYDATA
$$ [...]
$$ plain form
19744 -804 4822 3525 -2348 697 2111 1355 -2149 -5244 -4812 -4160 -2407 -1517 2527 -1718 -9466 -5394
19728 -5394 2693 4462 5483 5727 6737 4457 781 2386 2140 -3303 -5195 -8755 -5126 -2039 -4650
19713 -4650 -3062 -1327 -850 -2850 -1402 -2127 -4492 -4713 -6511 -7392 -6204 -5569 -4404 -1985 982 -823
19697 -823 -531 -2565 -8641 -10375 -9985 -6319 -2453 -2333 -5619 -7787 -9293 -6369 -4849 -4413 -4078 -1283
19681 -1283 -2373 -8712 -10981 -9223 -4788 -2819 -1114 263 3931 7245 2387 -507 -3951 -9757 -8741
19666 -8741 -5753 -7328 -1702 -5366 -7283 -3635 -1429 805 4759 3705 -10 -5192 268 1204 -38
19651 -38 -942 2082 4543 5669 1899 -2253 -799 -2494 -2066 -4655 -2048 -3947 -4609 -3953 -4799 -3427
19635 -3427 -3154 -2696 -585 -93 2753 2256 3116 -2326 -3668 -1629 -5503 -6429 -7954 -3546 289 197 -632
$$ packed form
19744h04N626j297n873L045J414p56l504l095M32O52J753Q90M044m245p748M072
19728e394Q087J769J021K44J010k280l676J605k46n443j892l560L629L087k611
19713d650J588J735M77k000J448p25k365k21j798q81J188O35J165K419K967j805
19697h23K92k034o076j734L90L666L866J20l286k168j506K924J520M36L35K795
19681a283j090o339k269J758M435J969J705J377L668L314m858k894l444n806J016
19666h741K988j575N626l664j917L648K206K234L954j054l715n182N460R36j242
19651c8r04L024K461J126l770m152J454j695M28k589K607j899o62O56q46J372
19635c427K73M58K111M92K846m97Q60n442j342K039l874r26j525M408L835r2q29
$$ plain form
19618 -632 -1520 -6649 -10781 -10543 -6154 -1325 4548 4850 2007 -3133 -6233 -4510 175 1250 -2650 -5122
19602 -5122 -2795 -1949 -6937 -4769 -4239 -1702 -589 4061 1740 -998 -5156 -6361 -695 1559 -2651
19587 -2651 -8410 -6650 -2467 -4662 -286 2923 2162 620 -178 781 -2114 -940 130 -3523 -7728
19572 -7728 -9386 -7804 -5395 -4221 -3335 -1973 -4665 -3116 -4403 -6188 -7801 75 1700 -2753 -4209
19557 -4209 -2426 -1785 -2572 -2970 465 1376 1874 -267 -4106 -7501 -4054 -4572 420 -638 -2087 -1137
19541 -1137 -277 99 4655 4400 -655 -4520 -5456 -4357 -2980 -6145 -9553 -6456 -5449 -7942 -3298 -2313
19525 -2313 -332 4563 5840 7688 8183 8493 11955 7082 3570 3290 5738 4438 3705 132 227 1120
19509 1120 3189 3862 6936 4862 6850 10306 5233 3511 3891 4137 259 -7968 -4751 -434 -4331
$$ packed form
19618f32q88n129m132K38M389M829N873L02k843n140l100J723M685J075l900k472
19602e122K327Q46m988K168N30K537J113M650k321k738m158j205N666K254m210
19587b651n759J760M183k195M376L209p61j542p98R59k895J174J070l653m205
19572g728j658J582K409J174Q86J362k692J549j287j785j613P876J625m453j456
19557d209J783O41p87l98L435R11M98k141l839l395L447n18M992j058j449R50
19541a137Q60L76M556k55n055l865r36J099J377l165l408L097J007k493M644R85
19525b313J981M895J277J848M95L10L462m873l512k80K448j300p33l573R5Q93
19509A120K069O73L074k074J988L456n073j722L80K46l878q227L217M317l897
$$ plain form
19494 -4331 -2187 -1660 -696 417 3383 -1058 -869 5892 5657 3307 4376 10598 13043 5551 -3759 -8941
19478 -8941 -14787 -13894 -8908 -6990 -6794 -6385 -6153 -5761 -4576 -6126 -2629 730 3566 108 -6712 -9921
19462 -9921 -9296 -5453 -3818 -730 -1138 -1876 -2250 -3228 -5342 -1611 -2360 -3384 -2654 -1484 -3860 -5302
19446 -5302 -2252 -2154 -165 -3333 -4027 -5775 -1276 4721 5422 3644 1994 -1150 2724 2512 -3147 -7319
19430 -7319 -7802 -4570 -3626 -3449 404 -1082 -2929 -3710 4884 9820 6001 5536 7564 6905 5893 1856
19414 1856 -2478 1809 6605 12101 9568 6051 1193 -228 -1402 -2733 -3792 -5240 -8858 -11030 -5199
19399 -5199 -3758 -1857 -4624 -7163 -6248 -5395 -2469 -2227 -6441 -5315 -2343 -910 -299 -227 -2611 405
19383 405 -2377 696 1487 83 -1740 -3467 -2712 -844 -509 210 -1443 3370 9849 7119 3314 4668
$$ packed form
19494d331K144N27R64J113K966m441J89O761k35k350J069O222K445p492r310n182
19478h941n846Q93M986J918J96M09K32L92J185j550L497L359K836l458o820l209
19462i921O25L843J635L088m08p38l74r78k114L731p49j024P30J170k376j442
19446e302L050R8J989l168o94j748M499N997P01j778j650l144L874k12n659m172
19430g319m83L232R44J77L853j486j847p81Q594M936l819m65K028o59j012m037
19414A856m334M287M796N496k533l517m858j421j174j331j059j448l618k172N831
19399e199J441J901k767k539R15Q53K926K42m214J126K972J433O11P2k384L016
19383D05k782L073P91j404j823j727P55J868L35P19j653M813O479k730l805J354
$$ plain form
19367 4668 4920 2807 -1038 -278 5148 8990 10910 4962 878 -187 -520 2670 4952 6945 1557
19352 1557 -989 -3636 -4723 -7413 -9617 -10749 -7660 1715 2171 -2297 -2766 -309 -843 -6789 -1316
19337 -1316 -1361 -2649 -5763 -5779 -3972 -4547 -6439 -11760 -10608 -7160 -7654 -7909 -4966 -4949 -7815 -5492 75
19320 75 876 125 3302 3465 4753 1769 2319 3729 3021 764 2232 261 -3140 822 3271 4160 3116
19303 3116 1370 3059 -69 -2344 665 3910 2176 1536 -1486 -6156 -5743 -7466 -7651 -2912 -1729
19288 -1729 2260 -3298 -8683 -8884 -6038 -2811 -308 3039 2735 2759 -3038 -5014 -1790 -3715 -670 1741
19272 1741 -2381 -2437 408 -2038 -7234 -8142 -5606 -5332 -6232 -2097 807 -486 -210 3540 6801 1514
19256 1514 -3786 -1030 4633 2890 -1906 1494 3081 -1663 -2810 2837 -5126 -7713 -3731 -3884 -1592
$$ packed form
19367D668K52k113l845P60N426L842J920n948m084j065l33L190K282J993n388
19352A557k546k647j087k690k204j132L089R375M56m468m69K457n34n946N473
19337a316m5j288l114j6J807n75j892n321J152L448m94k55K943J7k866K323N567
19320G5Q01p51L177J63J288k984N50J410p08k257J468j971l401L962K449Q89j044
19303C116j746J689l128k275L009L245j734o40l022m670M13j723j85M739J183
19288a729L989n558n385k01K846L227K503L347l04K4n797j976L224j925L045K411
19272A741m122n6K845k446n196r08K536K74r00M135K904j293K76L750L261n287
19256A514n300K756N663j743m796L400J587m744j147N647p963k587L982j53K292
$$ plain form
19241 -1592 -761 773 5858 8159 6277 6668 2957 -2589 -1981 402 3055 2990 377 526 -5148 -5724
19225 -5724 -4397 -4224 -3211 -3869 -5920 -7118 -4310 -9051 -8130 -4415 -4660 -2005 298 -282 895 2858
19209 2858 3033 -2277 -2009 -2490 -5863 -8969 -8236 -4047 771 1950 -525 1016 2202 1065 -32 -3151
19193 -3151 -2199 -457 -920 -1347 -4789 -3972 -5090 -5013 -3290 -792 -470 2201 1123 -4052 -5326 -4222
19177 -4222 -4267 -202 2780 1631 -498 -2478 -2255 -1277 -2976 -2073 -872 1619 -1097 -5084 -3221 -5865
19161 -5865 -4605 -1340 -1313 -3418 -2350 -1930 -2502 -3655 -2637 -3063 -5910 -2805 -1093 1484 3459 5592
19145 5592 8166 4341 -1068 1282 1674 -1273 -1838 -7931 -12561 -10542 -4582 -838 839 1291 189
19130 189 504 -3571 -1156 -350 1479 -811 -4184 -3935 -5219 -4929 1679 5596 4798 3153 605 1482
$$ packed form
19241a592Q31J534N085K301j882L91l711n546O08K383K653o5k613J49n674n76
19225e724J327J73J013o58k051j198K808m741R21L715k45K655K303n80J177J963
19209B858J75n310K68m81l373l106P33M189M818J179k475J541J186j137j097l119
19193c151R52J742m63m27l442Q17j118P7J723K498L22K671j078n175j274J104
19177d222m5M065K982j149k129j980K23R78j699R03J201K491k716l987J863k644
19161e865J260L265K7k105J068M20n72j153J018m26k847L105J712K577J975K133
19145E592K574l825n409K350L92k947n65o093m630K019N960L744J677M52j102
19130A89L15m075K415Q06J829k290l373K49j284K90O608L917p98j645k548Q77
$$ plain form
19114 1482 -1913 -5788 -4688 -1609 3373 4998 4676 6586 8286 7267 4384 8127 6816 2772 -1328
19099 -1328 -3657 -6359 -210 4434 3015 -3104 -4705 -1933 -2171 -3555 -3183 -4005 -2619 39 -1586
19084 -1586 -5077 -5968 -3603 -2246 -1732 2070 7328 7365 2284 -621 -3867 -8947 -5493 -4820 -3237 3900
19068 3900 6479 6998 3911 -4039 -4223 -1871 -536 2374 -37 -3360 -4755 -3262 -5218 -3337 1733
19053 1733 3066 1405 7266 12030 14408 14396 9734 14796 18322 16212 13699 14617 16015 19029 21079
19038 21079 25019 36024 45057 53929 55666 73288 94686 116551 154030 201314 245894 255457 193579
19025 193579 120021 80484 59793 43990 30156 22580 24242 23941 23699 20744 18903 19456 19940 20360
19011 20360 21762 21594 24253 26540 28317 33407 35677 40869 45235 48203 53777 68281 92583 125248
$$ packed form
19114A482l395l875J100L079M982J625l22J910J700j019k883L743j311m044m100
19099a328k329k702O149M644j419o119j601K772k38j384L72q22J386K658j625
19084a586l491q91K365J357N14L802N258L7n081k905l246n080L454O73J583P137
19068C900K579N19l087p950j84K352J335K910k411l323j395J493j956J881N070
19053A733J333j661N861M764K378j2m662N062L526k110k513R18J398L014K050
19038B1079L940J1005R033Q872J737J7622K1398K1865L7479M7284M4580R563o1878
19025A93579p3558l9537k0691j5803j3834p576J662l01k42k955j841N53M84M20
19011B0360J402j68K659K287J777N090K270N192M366K968N574J4504K4302L2665
$$ plain form
18997 125248 161557 209673 260353 281239 226442 151438 97306 70141 51735 38116 36658 34927
18985 34927 26733 21771 25513 26570 25941 24652 25222 24662 28523 26974 24434 22355 25547 31538 38396
18970 38396 42385 52057 65722 84766 108010 136458 166450 198263 186488 143750 116542 111854
18958 111854 128717 148356 169666 198058 183346 132553 92089 72449 61640 55351 53187 55843
18946 55843 57947 63032 74676 94827 118250 142505 171138 197396 172487 131315 107609 108163
18934 108163 121871 145401 170424 190081 158364 104205 68770 52284 41851 35292 30592 27934
18922 27934 27566 22672 14676 17497 21385 18366 13587 8252 4918 8237 11082 9530 3849 1283 1511
18907 1511 4355 6683 2582 1878 5284 9899 13839 11779 8831 6189 3110 8725 9955 8741 8282
$$ packed form
18997A25248L6309M8116N0680K0886n4797p5004n4132k7165j8406j3619j458j731
18985C4927q194m962L742J057o29j289N70n60L861j549k540k079L192N991O858
18970C8396L989R672J3665J9044K3244K8448K9992L1813j1775m2738k7208m688
18958A11854J6863J9639K1310K8392j4712n0793m0464j9640j0809o289k164K656
18946E5843K104N085J1644K0151K3423K4255K8633K6258k4909m1172k3706N54
18934A08163J3708K3530K5023J9657l1717n4159l5435j6486j0433o559m700k658
18922B7934l68m894p996K821L888l019m779n335l334L319K845j552n681k566K28
18907A511K844K328m101p04L406M615L940k060k948k642l079N615J230j214m59
$$ plain form
18892 8282 6133 4211 2912 1276 -837 -1598 -256 -3163 -5448 -9113 -6464 -8234 -8185 -5878 -3057
18877 -3057 -2580 -3014 465 4525 7561 4520 4109 5737 7165 6280 4041 -48 -1285 -438 994 2921
18861 2921 2971 2461 233 -1612 -6806 -2730 619 -137 -1885 570 2191 -1559 -4603 815 650 -1229
18845 -1229 266 3197 842 -2019 -55 2156 -1813 43 1704 2966 -1479 -2868 -3516 -3408 -1174
18830 -1174 -2570 -5387 -3063 -5212 -7425 -1966 4507 1602 -1834 615 -602 -937 1538 1412 -908
18815 -908 -2673 -3715 -2372 -390 -876 -4265 -3950 1889 3699 556 -2762 -7305 -6540 791 5249 8404
18799 8404 8319 5942 2559 -807 -2059 -3159 -5582 -4396 157 2391 2186 1739 -1984 -2913 45 4016
18783 4016 2786 2902 5314 6049 6524 9246 9654 9477 7231 10093 11536 14141 16314 13910 20509 28512
$$ packed form
18892H282k149j922j299j636k113p61J342k907k285l665K649j770M9K307K821
18877c057M77m34L479M060L036l041m11J628J428q85k239m089j237Q47J432J927
18861B921N0n10k228j845n194M076L349p56j748K455J621l750l044N418j65j879
18845a229J495K931k355k861J964K211l969J856J661J262m445j389o48J08K234
18830a174j396k817K324k149k213N459O473k905l436K449j217l35K475j26k320
18815i08j765j042J343J982m86l389L15N839J810l143l318m543P65P331M458L155
18799H404q5k377l383l366j252j100k423J186M553K234k05m47l723r29K958L971
18783D016j230J16K412P35M75K722M08j77k246K862J443K605K173k404O599Q003
$$ plain form
18767 28512 34184 42340 50746 47993 39403 29507 19224 7786 7701 12657 14083 14494 12732 14120 18223
18752 18223 17033 10518 4418 5602 5563 2192 -1244 -5565 -3766 -352 1154 3251 1932 1727 3297
18737 3297 544 1044 5473 6703 5767 10468 7215 4452 4742 5432 7113 5027 233 781 3760 540
18721 540 1176 3362 9250 15435 16738 15847 15439 17432 18338 21872 23687 18847 13930 19517 21781 20549
18705 20549 20757 20443 15674 8730 10024 15822 20095 14751 13480 12955 10827 9868 11452 7756 3374
18690 3374 8115 10608 13591 15714 15360 10741 6991 7645 10066 11113 13840 11132 13246 13607 10794
18675 10794 12616 15910 19595 21442 17116 16415 13410 15887 19963 18249 15498 19157 13830 5769 -704
18660 -704 -4213 -1548 4056 5077 10027 10441 8139 7465 8070 8037 11857 6543 1437 5548 7662 9642
$$ packed form
18767B8512N672Q156Q406k753q590r896j0283j1438q5M956J426M11j762J388M103
18752A8223j190o515o100J184l9l371l436m321J799L414J506K097j319k05J570
18737C297k753N00M429J230r36M701l253k763K90O90J681k086m794N48K979l220
18721E40O36K186N888O185J303q91m08J993R06L534J815m840m917N587K264j232
18705B0549K08l14m769o944J294N798M273n344j271n25k128r59J584l696m382
18690C374M741K493K983K123l54m619l750O54K421J047K727k708K114L61k813
18675A0794J822L294L685J847m326p01l005K477M076j714k751L659n327q061o473
18660g04l509K665N604J021M950M14k302o74O05l3L820n314n106M111K114J980
$$ plain form
18644 9642 10493 11668 10627 11135 5706 4943 8800 5362 2901 2915 4957 6449 8619 12345 10642 11347
18628 11347 12432 10873 14521 20699 26918 25554 28137 30209 26480 26002 21282 18941 18300 19707 20998
18613 20998 17475 15733 10803 8188 6898 5939 5473 6357 9647 12523 13603 11455 13831 19765 22036
18598 22036 24154 33474 34797 39986 47555 50889 50855 50929 55156 57877 58005 58313 67660 76050 80937 90717
18582 90717 104628 119281 137536 166833 211716 267603 332300 396790 428156 367246 260609
18571 260609 194491 170265 172248 188639 222267 206338 157503 120943 99935 92254 90599 84349
18559 84349 74604 69539 70272 76114 86528 100111 107890 110824 112616 122857 129058 140708 157651
18546 157651 180081 203182 234720 252153 211354 160506 145151 145953 154411 167925 190476 208398
$$ packed form
18644I642Q51J175j041N08n429p63L857l438k461J4K042J492K170L726j703P05
18628A1347J085j559L648O178O219j364K583K072l729m78m720k341o41J407J291
18613B0998l523j742m930k615j290r59m66Q84L290K876J080k148K376N934K271
18598B2036K118R320J323N189P569L334l4P4M227K721J28L08R347Q390M887R780
18582I0717J3911J4653J8255K9297M4883N5887O4697O4490L1366o0910j06637
18571B60609o6118k4226J983J6391L3628j5929m8835l6560k1008p681j655o250
18559H4349r745n065P33N842J0414J3583P779K934J792J0241O201J1650J6943
18546A57651K2430K3101L1538J7433m0799n0848j5355Q02Q458J3514K2551J7922
$$ plain form
18534 208398 179226 132445 100306 83214 80457 76173 75293 75366 76748 75680 72894 73078 76220 83939
18520 83939 89226 94141 98778 99232 88676 81857 79169 72448 65259 62930 67903 73880 80974 85330
18506 85330 89193 89606 95742 96618 103335 111452 125718 143775 142535 132891 124102 118504 115987 117279
18492 117279 125683 135028 139473 146281 159196 171085 185301 194852 200530 210874 226730 250646 278520
18479 278520 321942 382895 448147 516721 531848 483239 439103 428907 434546 452737 485506 531169
18467 531169 583143 638589 700294 767451 841563 928407 1030094 1149071 1287755 1445492 1621655
18456 1621655 1810669 2020270 2269747 2566595 2896039 3183861 3461395 3834019 4319895
18447 4319895 4916043 5656422 6594346 7831934 9609510 12327660 16462035 22414279 29424587
$$ packed form
18534B08398k9172m6781l2139j7092k757m284q80P3J382j068k786J84L142P719
18520H3939N287M915M637M54j0556o819k688o721p189k329M973N977P094M356
18506H5330L863M13O136Q76O717Q117J4266J8057j240r644q789n598k517J292
18492A17279Q404R345M445O808J2915J1889J4216R551N678J0344J5856K3916K7874
18479B78520M3422O0953O5252O8574J5127m8609m4136j0196N639J8191L2769M5663
18467E31169N1974N5446O1705O7157P4112Q6844J01687J18977J38684J57737J76163
18456A621655J89014K09601K49477K96848L29444K87822K77534L72624M85876
18447D319895N96148P40379R37924J237588J777576K718150M134375N952244P010308
$$ plain form
18438 29424587 37283162 47371751 47990812 34009762 20789291 13229280 9347373 7257042
18430 7257042 5932941 5003585 4370479 3934464 3663887 3548399 3562521 3687178 3887236
18421 3887236 4085798 4260277 4399525 4465224 4552768 4795898 5206735 5753419 6461485 7370908
18411 7370908 8592700 10359691 13131509 17492470 23875441 31598993 40031304 51036693
18403 51036693 54676938 40551317 24875799 15478416 10647334 8088963 6466013 5245660
18395 5245660 4366148 3656016 3018348 2541566 2230890 2034458 1900320 1760722 1544307
18386 1544307 1284603 1079274 931693 824045 744190 684303 646366 607717 558981 508986
18376 508986 470884 440267 415981 400254 391647 392754 400475 414472 438196 471236 514839 573791
$$ packed form
18438B9424587P858575J0088589O19061j3981050j3220471p560011l881907k090331
18430G257042j324101r29356o33106m36015k70577j15488J4122J24657K00058
18421C887236J98562J74479J39248O5699Q7544K43130M10837N46684P08066R09423
18411G370908J221792J766991K771818M360961O382971P723552Q432311J1005389
18403E1036693L640245j4125621j5675518r397383m831082k558371j622950j220353
18395E245660q79512p10132o37668m76782l10676j96432j34138j39598k16415
18386A544307k59704k05329j47581j07648p9855n9887l7937l8649m8736m9995
18376E08986l8102l0617k4286j5727q607J107P721J3997K3724L3040M3603N8952
$$ plain form
18364 573791 577405 506630 442927 403963 345120 286526 247733 221131 198181 184922 176641 167427
18352 167427 154585 148525 146142 141508 134874 127616 122637 119046 113431 106136 100537 99629 102247 101501
18338 101501 100860 100416 92014 87794 88029 88281 88868 86651 81630 88094 88779 81613 78061 73703 74676 76000
18322 76000 72650 72580 78718 80871 74064 70768 70506 67216 64362 62731 59550 60523 60965 61942 66783 72388
18306 72388 78529 78241 79113 77743 73191 63667 56546 58575 58174 47508 40505 37711 38564 34717 30383
18291 30383 25211 25263 31692 39218 37687 39595 40128 40835 41441 38648 32603 31094 30388 31744 34416 42588
18275 42588 46816 55035 51263 53377 64514 64355 54826 47144 48234 50296 49076 39938 33927 32184
18261 32184 29796 25402 21213 22002 27270 27223 26515 25830 24995 23081 19271 22555 28158 26743 20463 16333
$$ packed form
18364E73791L614p0775o3703l8964n8843n8594l8793k6602k2950j3259q281r214
18352A67427j2842o060k383m634o634p258m979l591n615p295n599r08K618p46
18338A01501o41m44q402m220K35K52N87k217n021O464O85p166l552m358R73J324
18322G6000l350p0O138K153o807l296k62l290k854j631l181R73M42R77M841N605
18306G2388O141k88Q72j370m552r524p121K029m01j0666p003k794Q53l847m334
18291C0383n172N2O429P526j531J908N33P07O06k793o045j509p06J356K672Q172
18275D2588M228Q219l772K114J1137j59r529p682J090K062j220r138o011j743
18261C2184k388m394m189P89N268m7p08o85q35j914l810L284N603j415o280m130
$$ plain form
18245 16333 14973 18244 22944 25544 27482 27824 30761 27495 28413 31927 30124 32211 33319 26666 26234
18230 26234 31527 35167 30879 24112 22532 22500 21179 20623 18699 20137 23038 21767 19952 18838 20816
18215 20816 21275 24944 30239 27619 29136 33538 34797 34756 32433 28594 30410 29687 26712 25535 23983
18200 23983 22423 22808 22212 18316 15903 15220 18141 16813 19397 21998 21623 23410 26302 25088 19961
18185 19961 21109 24007 21106 21772 19973 19314 20971 25158 27537 26405 27488 24573 22773 23041 21852
18170 21852 21207 25577 27843 25895 22747 27506 30450 27336 22988 21880 25473 25812 28196 36094 41968
18155 41968 41062 41982 39328 32903 30025 35380 41535 46299 51885 55159 57799 61475 60837 63895 72397
18140 72397 79251 86903 91409 95972 103817 110793 120009 130531 146968 164201 188288 210084 228620
$$ packed form
18245A6333j360L271M700K600J938L42K937l266R18L514j803K087J108o653m32
18230B6234N293L640m288o767j580l2j321n56j924J438K901j271j815j114J978
18215B0816M59L669N295k620J517M402J259m1k323l839J816p23k975j177j552
18200B3983j560L85n96l896k413o83K921j328K584K601l75J787K892j214n127
18185A9961J148K898k901O66j799o59J657M187K379j132J083k915j800K68j189
18170B1852o45M370K266j948l148M759K944l114m348j108L593L39K384P898N874
18155D1968r06R20k654o425k878N355O155M764N586L274K640L676o38L058Q502
18140G2397O854P652M506M563P845O976R216J0522J6437J7233K4087K1796J8536
$$ plain form
18127 228620 250789 277258 305408 339196 378954 420778 471118 523280 588066 671859 770870
18116 770870 881602 1016091 1194365 1457021 1856982 2502168 3484277 4715112 6036880
18107 6036880 7792598 8695692 6565399 3963983 2382970 1567050 1124308 865220 692700
18098 692700 566461 466909 384830 322913 272024 232309 204547 182209 161382 149384 142806
18087 142806 135347 126598 119380 113529 113661 112804 107078 97268 89574 85858 82574 76584 77047 77603 70497
18072 70497 63055 54372 52044 43822 37092 39278 44775 46551 47198 49581 48230 50475 51077 49424 42623
18057 42623 33772 34315 38868 36613 35806 35436 36590 33991 34499 30968 24873 20983 25802 27875 27657 27506
18041 27506 25398 21906 18548 17900 16805 18169 17481 16530 19106 23818 25774 24142 22536 21736 24590
$$ packed form
18127B28620K2169K6469K8150L3788L9758M1824N0340N2162O4786Q3793R9011
18116G70870J10732J34489J78274K62656L99961O45186R82109J230835J321768
18107F036880J755718R03094k130293k601416j581013q15920m42742k59088j72520
18098F92700j26239r9552q2079o1917n0889l9715k7762k2338k0827j1998o578
18087A42806p459q749p218n851J32q57n726r810p694l716l284n990M63N56p106
18072G0497p442q683k328q222o730K186N497J776O47K383j351K245O02j653o801
18057D2623q851N43M553k255q07l70J154k599N08l531o095l890M819K073k18j51
18041B7506k108l492l358o48j095J364o88r51K576M712J956j632j606q00K854
$$ plain form
18026 24590 21630 23550 25595 23477 19070 24036 24277 26882 24814 24690 20278 16420 16542 16204 11894
18011 11894 7204 12310 18358 21733 22188 21232 22703 22329 26706 28526 32532 32930 27105 30083 30661 26146
17995 26146 27660 28030 27034 29941 39167 42437 40540 43360 40511 31598 30204 24535 14760 13576 19773
17980 19773 17503 13788 9738 5815 8732 18889 31419 41170 47330 49685 54572 55565 52902 40217
17966 40217 32548 29966 29340 28425 31728 40899 49502 54760 54516 53461 56459 55274 58739 56026 49024
17951 49024 40626 38535 35387 35573 36444 34093 28922 17017 15545 24549 35786 39656 40692 41534 45552
17936 45552 51984 50739 45499 42413 43046 45431 50025 52234 51203 54597 63688 64539 59904 56716 56807
17921 56807 58055 57950 62522 66192 73327 76076 75909 75478 77098 73611 80033 85796 91419 96857 102868
$$ packed form
18026B4590k960J920K045k118m407M966K41K605k068j24m412l858J22l38m310
18011A1894m690N106O048L375M55r56J471l74M377J820M006L98n825K978N78m515
17995B6146J514L70r96K907R226L270j897K820k849q913j394n669r775j184O197
17980A9773k270l715m050l923K917J0157J2530R751O160K355M887R93k663j2685
17966D0217p669k582o26r15L303R171Q603N258k44j055K998j185L465k713p002
17951D9024q398k091l148J86Q71k351n171j1905j472R004J1237L870J036Q42M018
17936D5552O432j245n240l086O33K385M594K209j031L394R091Q51m635l188R1
17921E6807J248j05M572L670P135K749j67m31J620l487O422N763N623N438O011
$$ plain form
17906 102868 108869 110889 107112 105302 112495 119540 122155 126086 127395 129311 139772 152570 162149 172245
17892 172245 181738 196869 210281 219690 230776 245330 266355 291148 309331 326122 347359 374704
17880 374704 412748 453528 490445 550396 623727 698781 782536 889457 1008390 1139399 1303786
17869 1303786 1488046 1601035 1703913 1857539 2058587 2292195 2514055 2653159 2782822
17860 2782822 2996702 3306627 3701592 4190439 4770984 5438545 6246125 7266665 8653593
17851 8653593 10599796 13533026 18223821 25054958 32964912 41625035 53010210 54274427
17843 54274427 38604189 23685372 15176731 10750215 8278026 6756251 5798055 5176582
17835 5176582 4584270 4058082 3739562 3581267 3492143 3455453 3446435 3455307 3554752 3756066 4048979
$$ packed form
17906A02868O001K020l777j810P193P045K615L931J309J916J0461J2798R579J0096
17892A72245R493J5131J3412R409J1086J4554K1025K4793J8183J6791K1237K7345
17880C74704L8044M0780L6917N9951P3331P5054Q3755J06921J18933J31009J64387
17869A303786J84260J12989J02878J53626K01048K33608K21860J39104J29663
17860B782822K13880L09925L94965M88847N80545O67561Q07580J020540J386928
17851H653593J946203K933230M690795O831137P909954Q660123J1385175J264217
17843E4274427j5670238j4918817q508641m426516k472189j521775r58196o21473
17835E176582n92312n26188l18520j58295q9124l6690r018Q872R9445K01314K92913
$$ plain form
17824 4048979 4441022 4935434 5530755 6273459 7185086 8320060 9925477 12388263 16371590
17815 16371590 22273894 29230231 36599270 46394052 50098543 37161456 22764376 14177141
17807 14177141 9624425 7056486 5494254 4465267 3743645 3108735 2516328 2061715 1733071
17798 1733071 1489452 1296369 1144473 1029993 943317 874668 814433 772729 748147 741988 755376
17787 755376 762846 681620 562820 473687 416082 384215 360796 343337 335094 322935 307353 288577
17775 288577 276196 266944 253489 237981 228668 224237 216130 203833 192655 180395 177432 174262 167634
17762 167634 159048 156428 150932 142935 139361 138673 132228 124834 121597 113423 105768 98882 97330 98929
17748 98929 99882 101277 102957 99829 89402 81129 89700 91004 87502 89954 87681 78741 75813 73238
$$ packed form
17824D048979L92043M94412N95321P42704R11627J134974J605417K462786L983327
17815A6371590N902304O956337P369039R794782L704491j2937087j4397080q587235
17807A4177141m552716k567939j562232j028987p21622o34910n92407m54613l28644
17798A733071k43619j93083j51896j14480q6676o8649o0235m1704k4582o159J3388
17787G55376P470q1226j18800q9133n7605l1867k3419j7459q243j2159j5582j8776
17775B88577j2381r252j3455j5508r313m431q107j2297j1178j2260k963l170o628
17762A67634q586k620n496p997l574o88o445p394l237q174p655o886j552J599
17748I8929R53J395J680l128j0427q273Q571J304l502K452k273q940k928k575
$$ plain form
17734 73238 67845 70334 66128 62855 62515 66553 76056 79723 75008 78050 87349 89672 93477 100029 105082
17719 105082 113636 103704 88100 82286 77435 74736 84189 89157 88806 76749 66928 61337 64222 59792
17705 59792 42719 28693 22905 26414 29465 29808 28987 35381 36196 39568 44501 51313 50041 53008 52510
17690 52510 55173 61948 70285 74342 82266 75780 60361 57772 55695 54591 57268 65229 59430 48559
17676 48559 42223 41411 40133 34852 29828 23535 22132 25088 22607 20835 20292 19462 20460 21837 25016
17661 25016 24517 20733 21136 18407 18097 20822 22129 21406 20385 25303 27432 32085 36213 35335 31744 29996
17645 29996 31040 31414 30206 24869 19033 20317 19002 16285 13774 16699 19118 18632 18486 19025 16363
17630 16363 12237 14724 18049 18743 15761 14404 11392 16914 24477 28453 27628 27434 28861 26522 25239
$$ packed form
17734G3238n393K489m206l273l40M038R503L667m715L042R299K323L805O552N053
17719A05082Q554r932j5604n814m851k699R453M968l51j2057r821n591K885m430
17705E9792j7073j4026n788L509L051L43q21O394Q15L372M933O812j272K967m98
17690E2510K663O775Q337M057P924o486j5419k589k077j104K677P961n799j0871
17676D8559o336q12j278n281n024o293j403K956k481j772n43q30R98J377L179
17661B5016m99l784M03k729l10K725J307p23j021M918K129M653M128q78l591j748
17645B9996J044L74j208n337n836J284j315k717k511K925K419m86j46N39k662
17630A6363m126K487L325O94k982j357l012N522P563L976q25j94J427k339j283
$$ plain form
17615 25239 29557 35293 35053 32721 26422 22958 27235 28998 25599 23729 28304 26336 14010 8067
17601 8067 8935 13276 16921 18562 15750 13217 12590 12783 11342 11596 13403 15477 17667 21412 20161 19840
17585 19840 21421 23349 26652 20448 13818 18074 21815 21596 14242 13162 13382 12595 8696 8086 11259
17570 11259 15481 14442 16654 24156 23954 18814 18028 16547 13908 17554 19781 14987 16611 11250 5618
17555 5618 3041 3511 7981 7668 10884 13366 9970 10988 10559 8499 9927 10263 10069 9506 6200 8619
17539 8619 11531 12807 14315 14593 8907 6189 9252 8801 8363 15062 16434 12345 9083 4040 4219 5827
17523 5827 6217 9645 11440 9241 9197 8239 7196 10486 9095 6821 10278 10009 12671 8406 6900 7177
17507 7177 9757 10183 8573 5252 6169 3354 3139 5130 7882 11268 12671 8404 10206 7104 6517 8132
$$ packed form
17615B5239M318N736k40k332o299l464M277J763l399j870M575j968j2326n943
17601H067Q68M341L645J641k812k533o27J93j441K54J807K074K190L745j251l21
17585A9840J581J928L303o204o630M256L741k19p354j080K20p87l899o10L173
17570A1259M222j039K212P502k02n140p86j481k639L646K227m794J624n361n632
17555E618k577M70M470l13L216K482l396J018m29k060J428L36j94n63l306K419
17539H619K912J276J508K78n686k718L063m51m38O699J372m089l262n043J79J608
17523E827L90L428J795k199m4r58j043L290j391k274L457k69K662m265j506K77
17507G177K580M26j610l321R17k815k15J991K752L386J403m267J802l102n87J615
$$ plain form
17491 8132 6197 7501 9785 11432 11916 8916 5006 2575 2328 3179 813 -559 -3141 -2334 6337 10746
17475 10746 8005 3860 341 -3289 -6465 -6405 1053 2067 3929 338 344 3852 2402 6521 7693 8321
17459 8321 7876 9680 7858 3430 3841 3730 2337 4505 7490 4289 6293 2703 3580 6476 11275 21406
17443 21406 28619 32655 44688 55850 57049 42783 27600 18778 15446 11728 10300 11297 8199 6328
17429 6328 6578 6801 8226 10186 11073 11188 11595 12558 8904 6301 8976 11040 9785 5014 4010 1618
17413 1618 2389 435 2776 6150 6101 4763 3132 634 4107 8233 4945 3461 -60 278 -150 455
17397 455 3227 5110 7953 8926 7547 6298 3094 3016 -835 -4583 211 5238 1723 -1059 -1047 -4314
17381 -4314 -1874 981 -174 1210 126 1977 1274 1031 596 814 2392 3792 600 -1668 -4279 -643
$$ packed form
17491H132j935J304K284J647M84l000l910k431k47Q51k366j372k582Q07Q671M409
17475A0746k741m145l519l630l176O0P458J014J862l591OL508j450M119J172O28
17459H321m45J804j822m428M11j11j393K168K985l201K004l590Q77K896M799J0131
17443B1406P213M036J2033J1162J199j4266j5183q822l332l718j428R97l098j871
17429F328K50K23J425J960Q87J15M07R63l654k603K675K064j255m771j004k392
17413A618P71j954K341L374m9j338j631k498L473M126l288j484l521L38m28O05
17397D55K772J883K843R73j379j249l204p8l851l748M794N027l515k782J2l267
17381d314K440K855j155J384j084J851p03k43m35K18J578J400l192k268k611L636
$$ plain form
17365 -643 3480 4270 1250 7376 8718 5189 6504 7355 5792 9780 11445 11328 7846 7682 7315 3307
17349 3307 2456 2487 2873 -1636 -735 1389 1870 2008 3319 1892 3600 6137 3359 1429 -1604 -815 650
17332 650 1796 -1368 -92 5267 5506 5219 7604 13468 12556 6860 5543 9593 9227 4447 3439 8756
17316 8756 9901 11991 14062 14551 11414 11170 8462 3950 9840 10015 8862 10947 16450 19344 21285
17301 21285 22141 21395 21565 21901 26518 28785 34499 34417 40999 46399 52495 59240 74584 98460 130765
17286 130765 171283 213579 265777 289070 224479 147043 103714 73473 53198 44425 39417 34547
17274 34547 34638 32217 32663 29341 29436 36094 40366 28584 23598 21152 25792 27675 32470 39264 44546
17259 44546 47996 50761 55027 62105 83210 112076 147435 190471 239887 272910 221342 140142
$$ packed form
17365f43M123P90l020O126J342l529J315Q51j563L988J665j17l482j64l67m008
17349C307q51L1L86m509R01K124M81J38J311j427J708K537k778j930l033P89J465
17332F50J146l164J276N359K39k87K385N864r12n696j317M050l66m780j008N317
17316H756J145K090K071M89l137k44k708m512N890J75j153K085N503K894J941
17301B1285Q56p46J70L36M617K267N714q2O582N400O096O745J5344K3876L2305
17286A30765M0518M2296N2198K3293o4591p7436m3329l0241k0275q773n008m870
17274C4547R1k421M46l322R5O658M272j1782m986k446M640J883M795O794N282
17259D4546L450K765M266P078K1105K8866L5359M3036M9416L3023n1568q1200
$$ plain form
17247 140142 89465 60364 43161 36490 35886 24785 17104 15047 10469 5512 6405 6696 10081 11512
17233 11512 16076 16222 7658 1470 2172 5627 8654 6309 11344 13758 12754 12548 12061 4496 699
17218 699 898 1075 1014 108 -2152 -2805 -1422 1315 4470 5401 7661 7871 6416 9591 7078 6372 5174
17201 5174 3058 3242 3859 4727 973 2007 1967 3521 6837 5075 1131 114 -3119 -2428 3460 5457
17185 5457 5550 10800 9966 9452 7963 4700 1094 1106 3492 5553 6802 10698 13293 8343 5889 7155
17169 7155 4592 416 -1513 -1915 693 2239 462 542 3548 4086 1956 -839 -2345 -2899 -2737 3045
17153 3045 6649 5943 3122 616 370 -2521 -2746 -610 1572 4394 5923 3599 -1852 -7653 -6296
17138 -6296 -4436 3228 2960 762 839 76 -263 -273 -1558 -755 -2080 -2178 -4156 -4200 78 1770 2068 1145
$$ packed form
17247A40142n0677k9101j7203o671o04j1101p681k057m578m957Q93K91L385J431
17233A1512M564J46q564o188P02L455L027k345N035K414j004k06m87p565l797
17218F99J99J77o1r06k260o53J383K737L155R31K260K10j455L175k513p06j198
17201E174k116J84O17Q68l754J034m0J554L316j762l944j017l233O91N888J997
17185E457R3N250q34n14j489l263l606J2K386K061J249L896K595m950k454J266
17169G155k563m176j929m02K608J546j777Q0L006N38k130k795j506n54J62N782
17153C045L604p06k821k506k46k891k25K136K182K822J529k324n451n801J357
17138f296J860P664k68k198P7p63l39j0j285Q03j325r8j978m4M278J692K98r23
$$ plain form
17120 1145 -3861 -3795 -683 2675 4319 2437 -862 -2293 -68 4881 7406 7325 5826 1587 -5039 -6842
17104 -6842 -1623 -1211 -2462 -704 -2566 -3743 -5008 -4991 -499 4400 5253 2767 1162 4876 11906 11331
17088 11331 5871 2378 9143 11840 8137 7038 7074 6031 5162 3812 4770 4674 3937 -1069 13 638
17072 638 -364 -1007 -449 -1255 -1456 -777 3369 1239 -820 -2224 -1692 -55 -1882 -1885 1586 4040 3479
17055 3479 3576 -374 234 2510 1347 1011 -1788 -438 4004 4633 2131 -1856 -1977 -2734 -1030 -1423 -2265
17038 -2265 890 8004 7930 794 -803 -1670 1308 2195 1595 990 94 4110 6709 6748 4920 2585 1638
17021 1638 4529 6139 4934 4645 50 1085 266 115 -342 946 -1153 -1517 1984 2059 4523 2506
17005 2506 -449 -734 611 3387 4151 5714 6533 2402 -3207 -4816 -3316 -4413 -6681 -9392 -9955 -11300
$$ packed form
17120A145n006O6L112L358J644j882l299j431K225M949K525q1j499m239o626j803
17104f842N219M12j251J758j862j177j265J7M492M899Q53k486j605L714P030n75
17088A1331n460l493O765K697l703j099L6j043q69j350R58r6p37n006J082O25
17072F38j002o43N58q06k01O79M146k130k059j404N32J637j827lL471K454n61
17055C479R7l950O08K276j163l36k799J350M442O29k502l987j21p57J704l93q42
17038b265L155P114p4p136j597q67K978Q87o00o05q96M016K599L9j828k335r47
17021A638K891J610j205k89m595J035q19j51m57J288k099l64L501P5K464k017
17005B506k955k85J345K776P64J563Q19m131n609j609J500j097k268k711n63j345
$$ plain form
16989 -11300 -12849 -13368 -10529 -8881 -4756 -1546 -656 -228 -1535 -2567 -1377 2302 3479 2023 2653
16974 2653 869 -703 2772 -730 1510 6899 4743 7 -2000 893 2242 156 62 2527 2477 1406
16958 1406 494 -983 -1485 -5075 -2792 -1751 39 500 -1092 -2069 -3317 1337 1242 909 -1883 -4831
16942 -4831 -4820 -278 922 309 -3889 -4183 -2797 -3540 -6341 -3227 1332 142 857 -828 -3384 134
16926 134 1201 1000 -1560 -2105 -703 -3814 -7550 -9373 -5448 -6334 -5245 -3674 1531 4502 751 -5722
16910 -5722 -7853 -7987 -2247 -5457 -8591 -7794 -3385 5959 6557 575 3000 5313 3596 4472 8116 7741
16894 7741 7479 2362 2121 -1180 -3149 -3810 -4080 -168 -663 -838 534 -5172 -5088 733 1445 4025 9993
16877 9993 10731 11333 8475 5469 6911 6215 6125 1088 -5378 -4926 -1136 458 1753 2303 -1455 -6159
$$ packed form
16989a1300j549n19K839J648M125L210Q90M28j307j032J190L679J177j456O30
16974B653j784j572L475l502K240N389k156m736k007K893J349k086r4K465n0j071
16958A406r12j477n02l590K283J041J790M61j592r77j248M654r5l33k792k948
16942d831J1M542J200o13m198k94J386p43k801L114M559j190P15j685k556L518
16926A34J067k01k560n45J402l111l736j823L925q86J089J571N205K971l751o473
16910e722k131j34N740l210l134P97M409R344N98n982K425K313j717Q76L644l75
16894G741k62n117k41l301j969o61k70L912m95j75J372n706Q4N821P12K580N968
16877I993P38O02k858l006J442o96r0n037o466M52L790J594J295N50l758m704
$$ plain form
16861 -6159 -9721 -6892 -7552 -7328 -2073 -1325 -1498 3923 6109 4732 4887 1256 -985 1225 2221 -419
16845 -419 -4392 2034 5227 5367 4326 -2239 -3323 -370 838 1605 1356 -137 -2181 -2098 833 1703
16829 1703 1012 -1004 -1635 14 868 2092 2334 -750 -1757 -2235 -1898 -2306 -3869 -3905 -6261 -8271 -4553
16812 -4553 -1233 908 -4572 -6531 187 5750 1884 3943 4542 5660 9267 6018 -4276 -6700 -5120
16797 -5120 -4911 -4577 -2991 -3354 -2630 -1483 241 -1196 -1831 -546 414 -275 -3581 -4364 -140 589 -1570
16780 -1570 -8080 -5354 2472 4040 4717 5660 7644 5908 26 -3217 72 117 -1425 2900 1353 634
16764 634 2570 3712 4205 907 2063 4544 7337 9402 5860 1452 1777 351 -2431 -8099 -7241 -8240
16748 -8240 -6388 -3164 1267 -707 -3028 -1573 1103 -1884 -1369 -1592 -3520 -4989 -5032 -3096 3385 2701
$$ packed form
16861f159l562K829o60K24N255P48j73N421K186j377J55l631k241K210R96k640
16845d19l973O426L193J40j041o565j084K953J208P67k49j493k044Q3K931Q70
16829A703o91k016o31J649Q54J224K42l084j007m78L37m08j563l6k356k010L718
16812d553L320K141n480j959O718N563l866K059N99J118L607l249j0294k424J580
16797e120K09L34J586l63P24J147J724j437o35J285R60o89l306p83M224P29k159
16780a570o510K726P826J568O77R43J984j736n882l243L289M5j542M325j547p19
16764F34J936J142M93l298J156K481K793K065l542m408L25j426k782n668Q58r99
16748h240J852L224M431j974k321J455K676k987N15k23j928j469m3J936O481o84
$$ plain form
16732 2701 -2142 -5255 -3939 -3006 -2132 -1626 -1023 -1462 -1376 -3281 -7621 -5863 -5066 -2788 -205 465 -7024
16715 -7024 -8973 -5837 -645 -1014 4303 4480 4590 683 -2153 -1269 2110 3010 4967 2408 951 1628
16699 1628 933 1987 -527 -1782 -5934 -807 4652 1680 119 -1329 -6643 -7927 -8447 -10200 -1668
16684 -1668 1847 -2618 -5387 -2859 136 -2731 -2254 1596 7559 10069 8643 -556 -3671 -3197 -4784
16669 -4784 -662 3722 333 -2688 -223 2766 5054 6357 6275 1008 -1040 794 3456 -2487 -2
16654 -2 12486 15095 10659 9352 6122 -22 2291 391 -6214 -9361 -12384 -8516 -5163 -2476 -833
16639 -833 -1584 -1831 -1618 -2067 -3250 -5521 -1253 -956 -3390 -8375 -8311 -6091 -4757 -3000 -3549 -1506 -1755
16622 -1755 -2355 -1038 -840 -3820 -4070 -2222 -2568 3667 8514 7442 6576 2760 -4574 -6546 26 5299
$$ packed form
16732B701m843l113J316R33Q74N06O03m39Q6j905m340J758P97K278K583O70p489
16715g024j949L136N192l69N317J77J10l907k836Q84L379R00J957k559j457O77
16699A628o95J054k514j255m152N127N459k972j561j448n314j284n20j753Q532
16684a668L515m465k769K528K995k867M77L850N963K510j426r199l115M74j587
16669d784M122M384l389l021K465K989K288J303q2n267k048J834K662n943K485
16654bJ2488K609m436j307l230o144K313j900o605l147l023L868L353K687J643
16639h33p51k47K13m49j183k271M268K97k434m985O4K220J334J757n49K043k49
16622a755o00J317J98k980k50J848l46O235M847j072q66l816p334j972O572N273
$$ plain form
16606 5299 3394 876 866 4008 5468 5525 4886 1089 -2910 -7415 -4043 -3677 -1159 2504 1468 -3247
16590 -3247 455 3644 2013 -5534 -10093 -10645 -5012 -3209 -1829 7590 10345 7078 5278 -498 -975
16575 -975 -156 1233 3225 -3187 -7269 -4789 -1648 -2387 -1481 -6003 -5945 -2326 -2716 -4711 -6117 -7275
16559 -7275 -7216 -3086 613 -1563 -5263 -1653 373 2324 1693 -2703 -578 3524 6206 4791 -213
16544 -213 -6249 -1265 2229 -1544 -2212 -2822 -2431 -562 4789 2721 387 1887 3932 747 -1232 1310
16528 1310 5892 9110 2880 3891 6878 7412 12163 11709 3797 -3788 -5851 -4645 338 -3529 -1186
16513 -1186 7209 8919 6032 8614 8673 13226 14289 11027 10210 9339 5475 5316 1561 -308 4448 4540
16497 4540 -1358 -4121 -3339 247 -522 2243 2756 -1426 1045 7544 5018 4362 917 -624 -1521 -6128
$$ packed form
16606E299j905k518j0L142J460N7o39l797l999m505L372L66K518L663j036m715
16590c247L702L189j631p547m559n52N633J803J380R419K755l267j800n776m77
16575i75Q19J389J992o412m082K480L141p39R06m522N8L619l90j995j406j158
16559g275N9M130L699k176l700L610K026J951o31m396K125M102K682j415n004
16544b13o036M984L494l773o68o10L91J869N351k068k334J500K045l185j979K542
16528A310M582L218o230J011K987N34M751m54p912p585k063J206M983l867K343
16513a186Q395J710k887K582N9M553J063l262q17q71l864j59l755j869M756R2
16497D540n898k763P82L586p69K765N13m182K471O499k526o56l445j541q97m607
$$ plain form
16481 -6128 -6689 -9315 -8032 -3057 -2579 -4717 -3950 -3724 -4714 -295 2550 -1900 -7751 -8564 -6290 71
16465 71 1387 -1496 -5204 -7048 -3863 1126 3875 2025 7209 10500 8754 7260 482 -1495 -3168
16450 -3168 -7216 -8166 -3150 -3025 -1411 -1084 -1465 -7649 -4685 -1121 958 4009 5993 5693 6389 1932
16434 1932 1259 2383 -145 -665 -1476 -1695 -785 1066 -1229 339 -82 178 921 1066 -3515 -1994 1766
16417 1766 -1083 -1696 -1920 -752 -392 -3967 -5630 -4417 -5619 -7733 -7734 -5926 -4056 -5018 -4366 206 1110
16400 1110 -5579 -7431 -5370 -8188 -10620 -7861 -6734 -2264 79 -809 359 3487 1371 2696 6162
16385 6162 2764 2823 5286 6174 3568 4707 2071 -6782 -10008 -12803 -12697 -13960 -6136 694 1039 -2171
16369 -2171 -4004 -6269 -9864 -10758 -6741 -5544 -4919 -6198 -4193 -3305 -841 -1815 1143 2152 -1677 -4025
$$ packed form
16481f128n61k626J283M975M78k138P67K26r90M419K845m450n851q13K274O361
16465G1J316k883l708j844L185M989K749j850N184L291j746j494o778j977j673
16450c168m048r50N016J25J614L27l81o184K964L564K079L051J984l00O96m457
16434A932o73J124k528n20q11k19R10J851k295J568m21K60P43J45m581J521L760
16417A766k849o13k24J168L60l575j663J213j202k114jJ808J870r62O52M572R04
16400A110o689j852K061k818k432K759J127M470K343q88J168L128k116J325L466
16385F162l398N9K463Q88k606J139k636q853l226k795J06j263P824O830L45l210
16369b171j833k265l595q94M017J197O25j279K005Q88K464r74K958J009l829k348
$$ plain form
16353 -4025 -5049 -1739 3750 2726 -3400 -5805 -1585 1100 350 -3019 1603 1418 -3246 -3103 -4170
16338 -4170 1455 6084 5088 3523 935 618 3960 5476 2474 201 -3609 -3813 -7685 -10150 -8867
16323 -8867 -7733 -5495 345 3789 2842 -2165 -3645 -1360 3566 9040 13974 6110 1083 -850 603
16308 603 2502 1800 3361 1430 -1619 -4402 -5023 -3679 -382 1600 1842 6889 9797 7152 553 2210
16292 2210 4538 10513 9240 5067 5129 7164 5971 5212 -1346 -5982 -2862 3791 7986 5940 1323
16277 1323 1479 -360 -1191 1173 284 -1885 455 163 -3051 -3520 -2012 2528 -900 -5852 -4561 -849
16261 -849 2908 3713 5854 4684 3319 2209 754 -1183 1318 4898 5501 6566 5319 5240 5237 5229 -248
16244 -248 -2946 3514 5128 1511 4583 6652 5046 4984 1802 2207 -597 -4970 -383 5892 8869 4520
$$ packed form
16353d025j024L310N489j024o126k405M220K685p50l369M622j85m664J43j067
16338d170N625M629r96j565k588l17L342J516l002k273l810k04l872k465J283
16323h867J134K238N840L444r47n007j480K285M926N474M934p864n027j933J453
16308F03J899p02J561j931l049k783o21J344L297J982K42N047K908k645o599J657
16292B210K328N975j273m173O2K035j193p59o558m636L120O653M195k046m617
16277A323J56j839q31K364q89k169K340k92l214m69J508M540l428m952J291L712
16261h49L757Q05K141j170j365j110j455j937K501L580O03J065j247p9lqn477
16244b48k698O460J614l617L072K069j606o2l182M05k804m373M587O275K977m349
$$ plain form
16228 4520 -1169 -94 3613 4595 3489 3104 4271 4196 337 448 2789 3914 7716 7247 5572 3418
16212 3418 -986 -6312 -8004 -7331 -5524 -8240 -7814 -4960 -7195 -7475 -8618 -9303 -7619 -531 -520 -5230
16196 -5230 -2344 -3407 -5812 -4910 -1997 2738 5520 1503 -1366 -321 1821 3250 3906 7231 340
16181 340 -4287 -4443 -6218 -3965 -5686 979 3356 -1349 -455 -5174 -4059 -3521 -1857 -2508 -4953 -5928
16165 -5928 -6385 -6226 -7467 -8987 -11619 -14548 -17433 -14386 -6921 -2021 -1281 -1753 -4621 -6412 -4682 -9135
16149 -9135 -13983 -9911 -6609 -7186 -9281 -10436 -9078 -9741 -8466 -7334 -5821 -8773 -9613 -8524 -3790
16134 -3790 -1857 -2873 -2357 -838 -2017 -1207 2312 6855 8416 7784 7020 8368 4866 4745 8028 5004
16118 5004 4972 7319 3273 5009 5939 5889 3876 1893 3654 2447 -61 -3985 -5507 1223 4367 4210
$$ packed form
16228D520n689J075L707R82j106l85J167p5l859J11K341J125L802m69j675k154
16212C418m404n326j692O73J807k716M26K854k235k80j143o85J684P088J1m710
16196e230K886j063k405R02K913M735K782m017k869J045K142J429O56L325o891
16181C40m627j56j775K253j721O665K377m705Q94m719J115N38J664o51k445r75
16165e928m57J59j241j520k632k929k885L047P465M900P40m72k868j791J730m453
16149i135m848M072L302n77k095j155J358o63J275J132J513k952q40J089M734
16134c790J933j016N16J519j179Q10L519M543J561o32p64J348l502j21L283l024
16118E004l2K347m046J736R30n0k013j983J761j207k508l924j522O730L144j57
$$ plain form
16102 4210 -1312 -2580 -4566 -4887 -2117 -7409 -12324 -7483 -4681 -5213 -2752 -805 1805 1081 1115 2730
16086 2730 4884 6319 2517 -3858 -3542 2077 9672 7712 3724 -1561 -919 -56 -6154 -10199 -11601
16071 -11601 -9482 -6027 -3076 -1763 -2790 -3338 -6203 -1949 2833 3434 3683 -1759 -1379 694 -4686
16056 -4686 -7885 -3992 -6368 -12642 -8901 -5180 -2663 4011 4015 328 1243 2316 5459 10626 11909 12393
16040 12393 8827 7908 8058 3478 3945 2001 -1289 720 4976 2926 -6519 -9576 -8646 -6523 -6289 -4657
16024 -4657 -2939 -2554 2161 -2206 -5221 -7442 -4157 -444 -677 913 -3230 -6367 -6439 -3868 -1694 342
16008 342 -2512 -3134 -143 3571 2520 6097 -63 -3918 -208 2209 -493 4039 4148 2458 -15
15993 -15 -3899 -3361 2661 50 -139 463 2450 5479 5294 1784 -4625 -6728 -2395 -5725 -8125 -4994
$$ packed form
16102D210n522j268j986l21K770n292m915M841K802n32K461J947K610p24L4J615
16086B730K154J435l802o375L16N619P595j960l988n285O42Q63o098m045j402
16071a1601K119L455K951J313j027n48k865M254M782O01K49n442L80K073n380
16056d686l199L893k376o274L741L721K517O674Ml687R15J073L143N167J283M84
16040A2393l566r19J50m580M67j944l290K009M256k050r445l057R30K123K34J632
16024d657J718L85M715m367l015k221L285L713k33J590m143l137p2K571K174K036
16008C42k854o22K991L714j051L577o160l855L710K417k702M532J09j690k473
15993a5l884N38O022k611j89O02J987L029j85l510o409k103M333l330k400L131
$$ plain form
15977 -4994 -1997 -4352 3257 5513 3937 3038 -1287 -5652 -7636 -3812 1941 3091 2312 5472 9858
15962 9858 9385 7001 3828 292 1167 1189 3132 4509 5953 5320 1369 -2568 -8562 -11869 -10370 -8670
15946 -8670 -4986 -4487 -1412 -3588 -8583 -7084 -6230 -10460 -5788 4789 3949 2094 2328 4353 5694
15931 5694 -567 319 2762 194 -6322 -5665 2428 9166 4845 1042 -1202 -794 3332 5305 7065
15916 7065 6691 2610 3576 7111 3847 1488 8592 7015 392 -2139 -384 -2207 -4265 -4320 -1872 949
15900 949 -1324 -49 3785 1394 -966 -833 1472 574 1932 1849 329 2877 3912 2833 288 -4269
15884 -4269 -6001 -8213 -5210 -1108 -2280 -7771 -5627 -765 4522 8735 7648 3486 -1570 -330 -2288
15869 -2288 -5671 -4924 -1172 2277 -2224 -1750 765 2428 1187 -189 3021 5595 276 -4136 629
$$ packed form
15977d994K997k355P609K256j576q99m325m365j984L824N753J150p79L160M386
15962I858m73k384l173l536Q75K2J943J377J444o33l951l937n994l307J499J700
15946h670L684M99L075k176m995J499Q54m230M672J0577q40j855K34K025J341
15931E694o261Q86K443k568o516O57Q093O738m321l803k244M08M126J973J760
15916G065l74m081R66L535l264k359P104j577o623k531J755j823k058n5K448K821
15900I49k273J275L834k391k360J33K305q98J358q3j520K548J035j079k545m557
15884d269j732k212L003M102j172n491K144M862N287M213j087m162n056J240j958
15869b288l383P47L752L449m501M74K515J663j241j376L210K574n319m412M765
$$ plain form
15854 629 1611 -2204 -6434 -4914 69 744 253 3014 5053 2637 -2633 -4514 -4834 -3084 -6254 -5151
15838 -5151 -3417 -7424 -7789 -4653 -3905 -7618 -11456 -11360 -7934 -2752 -2017 -194 -1284 -4278 -3033 -4834
15822 -4834 -9405 -7110 -5532 -6928 -150 1542 -553 7390 9228 1242 -3335 -4571 -4572 -1779 -1020 -7628
15806 -7628 -10643 -8705 -5762 -6450 -6488 -2732 -2603 -6590 -5508 -1927 8 850 476 1070 2980 1350
15790 1350 2535 1425 -2493 -1136 -944 -5287 -10186 -8225 -7565 -3390 1965 -442 3066 6064 1380
15775 1380 -1260 4244 8107 4514 219 -495 -1957 -8102 -7905 -5121 -3804 -3332 -3976 -3072 -2646 -3933
15759 -3933 -4920 -1187 -5609 -7624 -6569 -5066 -1116 2677 -398 549 -2937 -5310 -4394 -4599 1439 1988
15743 1988 -729 41 3390 1483 -1100 755 -1054 -2914 -3289 -5782 -4402 -5766 -5643 -2546 -3068 -4352
$$ packed form
15854F29R82l815m230J520M983O75m91K761K039k416n270j881l20J750l170J103
15838e151J734m007l65L136P48l713l838R6L426N182P35J823j090k994J245j801
15822d834m571K295J578j396O778J692k095P943J838p986m577j236jK793P59o608
15806g628l015J938K943o88l8L756J29l987J082L581J935Q42l74N94J910j630
15790A350J185j110l918J357J92m343m899J961O60M175N355k407L508K998m684
15775A380k640N504L863l593m295p14j462o145J97K784J317M72o44R04M26j287
15759c933r87L733m422k015J055J503L950L793l075R47l486k373R16k05O038N49
15743A988k717P70L349j907k583J855j809j860l75k493J380j364J23L097n22j284
$$ plain form
15727 -4352 541 3568 2880 3981 4395 1167 -1314 -3241 -720 1223 857 -271 -2874 -84 502 -4261
15711 -4261 -4622 4685 6803 6737 8654 8323 3092 -935 -6946 -5950 572 1463 695 4175 -2462 -4051
15695 -4051 162 3768 -388 -7106 -5953 -5164 -7361 -3516 -3471 -693 2063 -779 -3341 -4023 -5655 -2722
15679 -2722 586 -1391 -3012 -7224 -9085 -2892 45 -6975 -9937 -5322 -3367 -846 1845 -2071 -5779
15664 -5779 -4131 -4608 -6445 -5344 -6780 -687 -595 -2214 -623 -3708 -4653 -6001 -2528 56 -300 -382
15648 -382 -183 1424 1619 -2892 -4067 402 -625 -2221 1449 939 928 -3480 -4795 -3228 -459 126
15632 126 -2184 -2782 -1936 373 3264 796 -673 4156 5790 9612 9940 3095 5364 4696 1829 -7565
15616 -7565 -5856 -1635 -6010 -1569 2927 885 -285 -397 -2429 -686 502 -3726 270 3308 4509
$$ packed form
15727d352M893L027o88J101M14l228k481j927K521J943l66j128k603K790N86m763
15711d261l61R307K118o6J917l31n231m027o011R96O522Q91p68L480o637j589
15695d051M213L606m156o718J153P89k197L845M5K778K756k842k562o82j632K933
15679b722L308j977j621m212j861O193K937p020k962M615J955K521K691l916l708
15664e779J648m77j837J101j436O093R2j619J591l085r45j348L473K584l56q2
15648c82J99J607J95m511j175M469j027j596L670n10j1m408j315J567K769N85
15632A26k310n98Q46K309K891k468j469M829J634L822L28o845K269o68k867r394
15616g565J709M221m375M441M496k042j170j12k032J743J188m228L996L038J201
$$ plain form
15601 4509 6465 5633 1166 1856 4801 5054 3337 2786 1518 -1531 -347 2653 7550 6959 4749 5939
15585 5939 5637 -2604 1708 7540 1819 -4642 -2321 28 1372 966 -1979 -145 -1474 -4396 -626
15570 -626 -1076 -2205 3271 -1485 -2583 -1547 267 727 374 6078 6925 4462 1793 -2279 888 -2637
15554 -2637 -7306 -7279 -4358 -5199 -452 1686 1252 -1253 -2900 -3188 -4173 -7424 -9975 -12200 -12360 -8293
15538 -8293 -5346 -5069 -9303 -15740 -15035 -9492 -7544 -4168 -2899 2760 4082 2883 1278 -4310 -5408
15523 -5408 -5197 -5700 -8029 -7088 -4400 -604 1426 1443 753 353 -265 -4782 -938 912 -1082 -2563 751
15506 751 1560 1137 1840 -1134 -337 158 1434 3036 245 -3066 -4558 -1405 2679 8787 8570 9434 9592
15489 9592 10480 9940 7470 2618 1235 1573 -6607 -7607 -5789 -6824 -7404 -4343 -1703 -2888 -4140 -2843
$$ packed form
15601D509J956q32m467O90K945K53j717n51j268l049J184L000M897n91k210J190
15585E939l02q241M312N832n721o461K321K349J344m06k945J834j329k922L770
15570f26m50j129N476m756j098J036J814M60l53N704Q47k463k669m072L167l525
15554b637m669K7K921q41M747K138m34k505j647k88r85l251k551k225j60M067
15538h293K947K77m234o437P05N543J948L376J269N659J322j199j605n588j098
15523e408K11n03k329R41K688L796K030J7o90m00o18m517L844J850j994j481L314
15506G51Q09m23P03k974P97M95J276J602k791l311j492L153M084O108k17Q64J58
15489I592Q88n40k470m852j383L38q180j000J818j035n80L061K640j185j252J297
$$ plain form
15473 -2843 85 -289 264 736 3777 4790 4797 3929 4221 4463 3815 1614 1482 -265 55 -4159 -1957 -1307
15455 -1307 -1924 1551 842 -1108 -5138 -6570 -2645 -1481 904 2918 7951 12001 6599 1383 -3533
15440 -3533 -6373 -5540 2184 4354 3245 2583 3713 2995 4366 2648 -3601 -4639 -2789 2468 1901 -6449
15424 -6449 -5839 -5134 -5048 -2514 -8466 -6934 965 1775 -2057 -2042 -227 -1940 -7887 -5978 -7031 -7249 -2494
15407 -2494 -5978 -6311 -6282 -4963 -891 1575 2285 5199 6085 4185 -909 -6227 -3917 -3489 2108 5405
15391 5405 6995 9579 5208 -558 -5188 -3324 2494 4521 4691 975 -1810 3963 3048 1391 528
15376 528 -1861 -4748 -4786 -7691 -4074 -2147 -157 1685 1598 1584 -194 -1366 -2452 -1736 -6430 -6906 -4154
15359 -4154 -2583 -3279 -7459 -3748 -2335 6845 8875 8256 4396 3113 5163 3319 -1055 2125 2007
$$ packed form
15473b843K928l74N53M72L041J013Pq68K92K42o48k201j32j747L20m214K202O50
15455a307o17L475p09j950m030j432L925J164K385K014N033M050n402n216m916
15440c533k840Q33P724K170j109o62J130p18J371j718o249j038J850N257n67q350
15424f449O10P05Q6K534n952J532P899Q10l832J5J815j713n947J909j053k18M755
15407b494l484l33K9J319M072K466P10K914Q86j900n094n318K310M28N597L297
15391E405J590K584m371n766m630J864N818K027J70l716k785N773r15j657q63
15376E28k389k887l8k905L617J927J990J842q7j4j778j172j086P16m694m76K752
15359d154J571o96m180L711J413R180K030o19l860j283K050j844m374L180j18
$$ plain form
15344 2007 -1521 -2278 -4021 -6345 -5942 -4874 -5244 -5744 -6968 -7670 -4828 -96 697 3652 5683 1967
15328 1967 366 -4379 -6228 -7671 -8441 -3700 -5068 -3459 -549 2606 4476 2174 -578 -627 -1944
15313 -1944 -1556 2252 4536 1817 801 1845 1004 1346 213 -2455 714 -1059 1136 3351 3855 1636
15297 1636 -62 1700 -322 -2712 -239 -2925 -3181 -1983 197 2713 -1917 -4081 -1589 -2671 -5898
15282 -5898 -2971 938 210 2415 4481 3812 2466 4972 5983 -905 -5340 -5182 -3662 87 1044 1419
15266 1419 1220 4115 2771 5202 8302 11097 9193 2916 -4906 -1512 -343 5828 9486 8722 5695
15251 5695 1846 -118 -7764 -8751 -1768 2669 6958 -516 -4176 -1933 -2457 -2267 2328 1666 -3494 -4226
15235 -4226 174 -165 -1424 -2993 -4328 -2682 -194 -2432 -2732 2048 1995 -2257 -8794 -4766 -570 -3954
$$ packed form
15344B007l528p57j743k324M03J068l70n00j224p02K842M732P93K955K031l716
15328A967j601m745j849j443p70M741j368J609K910L155J870k302k752m9j317
15313a944L88L808K284k719j016J044q41L42j133k668L169j773K195K215N04k219
15297A636j698J762k022k390K473k686k56J198K180K516m630k164K492j082l227
15282e898K927L909p28K205K066o69j346K506J011o888m435J58J520L749R57L75
15266A419j99K895j344K431L100K795j904o277p822L394J169O171L658p64l027
15251E695l849j964p646r87O983M437M289p474l660K243n24J90M595o62n160p32
15235d226M400l39j259j569j335J646K488k238l00M780n3m252o537M028M196l384
$$ plain form
15219 -3954 -2404 -1990 -8577 -11542 -10073 -8572 -8796 -2971 -1007 576 1081 1548 836 -3932 -5770 -2680
15203 -2680 1016 4474 2398 -2467 424 3496 4072 3927 5538 1685 1111 -1737 -2008 1572 1816 -5867
15187 -5867 -10448 -7573 -3492 -3748 -4155 -4401 -9481 -7215 -4651 -3591 -1897 2268 1011 -934 714
15172 714 5881 6819 5717 2596 -2982 682 496 -3425 -6702 -7685 -8298 -4752 -2963 -386 -546 -3428
15156 -3428 -3897 -251 1002 1443 -2957 -3045 -1191 -966 2448 4963 8263 8726 5258 3036 3646 1347
15140 1347 -1402 -1535 -1247 -463 -2607 -1343 5248 6109 -46 -5042 -5711 -9390 -11530 -10045 -4255 -402
15124 -402 -612 738 -6429 -7166 -4466 -5847 -7888 -6372 -3664 -406 3080 2685 2178 1196 -385 -2716
15108 -2716 -2451 564 4371 5592 6983 1175 -85 2993 2223 -1364 -2541 -6608 -6012 -3306 -3688 -2572
$$ packed form
15219c954J550M14o587k965J469J501k24N825J964J583N05M67p12m768j838L090
15203b680L696L458k076m865K891L072N76j45J611l853n74k848k71L580K44p683
15187e867m581K875M081k56m07k46n080K266K564J060J694M165j257j945J648
15172G14N167R38j102l121n578L664j86l921l277r83o13L546J789K577j60k882
15156c428m69L646J253M41m400q8J854K25L414K515L300M63l468k222O10k299
15140A347k749j33K88P84k144J264O591Q61o155m996o69l679k140J485N790L853
15124d02k10J350p167p37K700j381k041J516K708L258L486l95n07r82j581k331
15108b716K65L015L807J221J391n808j260L078p70l587j177m067N96K706l82J116
$$ plain form
15092 -2572 1748 5136 5175 4760 3250 1331 2361 6413 7500 7720 8967 6581 -489 279 -657 432
15076 432 -2009 -5784 -8668 -7844 -5712 -4482 -3283 -1814 4091 2682 1816 591 -1388 -610 1133 -2111
15060 -2111 -3684 -1783 -2504 3313 4951 -2602 -8987 -6822 -4603 -3091 -436 -1569 -247 4750 3951
15045 3951 3816 4007 2732 -3030 -2293 1921 3414 1484 -1608 -3407 -1674 479 -879 372 867 -2754
15029 -2754 -3554 -3243 -280 208 -1774 -232 373 2646 216 -2563 -5226 -4327 -237 1431 7455 5188
15013 5188 -4034 -4491 -1878 -180 1071 871 -2828 -4207 -6468 -5938 -5126 -8420 -4958 701 -3814 -4338
14997 -4338 -4630 930 409 -5347 -10049 -7982 -3860 2090 1545 1610 131 1631 2673 7623 11302 6781
14981 6781 3706 5711 5431 5494 3467 3864 4181 691 -1756 -7025 -4859 406 1833 -1335 -4153 -1370
$$ packed form
15092b572M320L388L9m15j510j919J030M052J087K20J247k386p070P68r36J089
15076D32k441l775k884Q24K132J230J199J469N905j409q66j225j979P78J743l244
15060b111j573J901p21N817J638p553o385K165K219J512K655j133J322M997p99
15045C951j35J91j275n762P37M214J493j930l092j799J733K153j358J251M95l621
15029b754q00L11K963M88j982J542O05K273k430k779k663Q99M090J668O024k267
15013E188r222m57K613J698J251k00l699j379k261N30Q12l294L462N659m515n24
14997d338k92N560n21n756m702K067M122N950n45O5j479J500J042M950L679m521
14981F781l075K005k80O3k027L97L17l490k447n269K166N265J427l168k818K783
$$ plain form
14965 -1370 90 1098 3127 851 -136 2213 -1932 -4088 -2350 -179 3538 2750 7247 7028 2934
14950 2934 2647 4346 6305 8166 3173 2157 -4822 -6081 -5970 -5041 -6922 -3626 -3451 -2182 -2911 -3833
14934 -3833 -2001 -2838 -3939 -5022 -8323 -5906 -7922 -4381 -2240 -7993 -8968 -7235 -4686 -3642 -3354
14919 -3354 -4025 -4578 -6630 -7977 -5966 -5002 -596 994 -3109 -7053 -5029 712 5052 4046 -978
14904 -978 -2452 -2582 -2898 -2933 -3173 -2855 -1129 1438 -1219 -2724 1260 1540 -2327 -1728 -48 226 -1540
14887 -1540 366 75 -668 -22 858 -230 -576 -2362 1630 600 -1144 -2578 -2932 276 -141 -4713
14871 -4713 -2073 5804 6536 6275 1616 -3931 -3606 1122 751 -4349 -4546 -3777 -1218 -4440 -10134 -6931
14855 -6931 -1608 1544 1290 -2028 -4823 -5806 -5803 -5500 -4899 1199 2251 1511 2346 7349 3578 1901 3001
$$ packed form
14965a370J460J008K029k276r87K349m145k156J738K171L717p88M497k19m094
14950B934k87J699J959J861m993j016o979j259J11R29j881L296J75J269p29r22
14934c833J832q37j101j083l301K417k016L541K141n753r75J733K549J044K88
14919c354o71n53k052j347K011R64M406J590m103l944K024N741M340j006n024
14904i78j474j30l16l5k40L18J726K567k657j505L984K80l867N99J680K74j766
14887a540J906k91p43O46Q80j088l46j786L992j030j744j434l54L208m17m572
14871d713K640P877P32k61m659n547L25M728l71n100j97P69K559l222n694L203
14855f931N323L152k54l318k795r83LL03O01O098J052p40Q35N003l771j677J100
$$ plain form
14838 3001 4255 815 -3087 -2308 2087 868 -2071 -5853 -7498 289 4941 2605 604 731 -2992
14823 -2992 -1894 1 1931 3698 5557 4464 2618 3408 1772 921 1772 4224 6427 2952 -4773
14808 -4773 -9093 -6112 597 1717 -3693 -7030 -4792 -3569 -9144 -4260 -383 601 -775 -3070 -2550
14793 -2550 165 4701 215 1007 4569 6408 551 -4859 -2323 77 -1991 -1874 -2704 -4524 -3785 -1911
14777 -1911 3138 4110 -990 3594 5081 3818 -1663 -1182 -1422 -2581 -2432 1994 3868 1346 940 2688
14761 2688 2635 7132 7410 5026 614 -4703 -3569 -5026 -5935 -2860 -1838 -4238 -6849 -8842 -6495 -2932
14745 -2932 -628 -5850 -7429 -6695 -5728 -2123 1942 4524 2054 -522 -815 1297 4165 7733 7246 3
14729 3 -2127 -1015 1650 -1040 -3678 -5570 -5392 -2138 -1252 -6134 -7402 -5706 -2442 -1593 3677 3926
$$ packed form
14838C001J254l440l902P79M395j219k939l782j645P787M652k336k001J27l723
14823b992J098J895J930J767J859j093j846P90j636q51Q51K452K203l475p725
14808d773m320K981O709J120n410l337K238J223n575M884L877R84j376k295N20
14793b550K715M536m486P92L562J839n857n410K536K400k068J17q30j820P39J874
14777a911N049R72n100M584J487j263n481M81k40j159J49M426J874k522m06J748
14761B688n3M497K78k384m412n317J134j457r09L075J022k400k611j993K347L563
14745b932K304n222j579P34R67L605M065K582k470k576k93K112K868L568m87p243
14729Ck130J112K665k690k638j892J78L254Q86m882j268J696L264Q49N270K49
$$ plain form
14713 3926 3180 3300 -1885 -4385 -2990 -842 1903 2108 1211 -2547 -4089 -1640 -903 2211 345 -128
14697 -128 -727 -2464 -1704 -3018 -2318 -3843 -6542 -3940 -545 -772 2310 6938 9243 10057 6072 1672
14681 1672 4057 3666 -220 -474 1564 -2278 -52 -609 -1614 -3293 -6733 -3157 -2701 -5187 -8576 -5826
14665 -5826 304 4675 5607 3566 1081 3726 7470 4073 2318 1684 4073 5368 5336 4509 -1795 2928
14649 2928 5626 8440 6689 2840 2362 1193 -906 -3967 -4411 -7814 -5809 -4645 -3729 -3525 -1195 145
14633 145 -536 -300 778 1361 -2686 -3004 1616 3621 -1777 -4240 -3514 -805 24 2102 482 -2551
14617 -2551 192 2582 4497 2356 993 -2053 -5476 -3305 -3313 -4466 -3742 -1392 2295 4472 1865 -4158
14601 -4158 -3259 -2202 -2243 2156 2250 2163 3926 6062 5642 3097 1278 3709 7027 2978 -3368 -2317 -179
$$ packed form
14713C926p46J20n185k500J395K148K745K05q97l758j542K449P37L114j866m73
14697a28n99j737P60j314P00j525k699K602L395k27L082M628K305Q14l985m400
14681A672K385l91l886k54K038l842K226n57j005j679l440L576M56k486l389K750
14665e826O130M371R32k041k485K645L744l397j755o34K389J295l2q27o304M723
14649B928K698K814j751l849m78j169k099l061m44l403K005J164R16K04K330J340
14633A45o81K36J078N83m047l18M620K005n398k463P26K709Q29K078j620l033
14617b551K743K390J915k141j363l046l423K171qj153P24K350L687K177k607o023
14601d158Q99J057m1M399R4q7J763K136m20k545j819K431L318m049o346J051K138
$$ plain form
14584 -179 -2135 -2724 -990 -255 -2339 -1064 -23 1853 6035 7673 5853 9019 6682 5520 6443 5186
14568 5186 1179 -5756 -6422 -1310 -1563 -2180 1426 1321 -23 464 4579 9538 9525 9843 7246 10621 7368
14551 7368 5872 5807 6063 5823 7159 3133 3211 1582 4070 3135 2719 1118 957 1186 -144 -2965 -5716
14534 -5716 -2657 922 2708 2772 -735 892 7326 5605 -1729 -2371 -5405 -6796 -6956 -3697 -3666 -3548
14518 -3548 -925 102 446 6212 5349 8341 10741 3108 -5400 -8042 -7277 -4610 -2093 -4288 -8133
14503 -8133 -4911 -453 -520 13 4955 6888 7229 6202 5759 1886 -2701 -513 -235 3649 6473 2514
14487 2514 3623 5811 11724 6949 405 748 -917 -1784 -3625 -5704 -7070 -6154 -7322 -10046 -9849 -5338
14471 -5338 -6200 -1558 1134 1357 847 -866 -1079 4126 7609 10537 15373 15959 8324 4719 3918 -1527
$$ packed form
14584a79j956n89J734P35k084J275J041J876M182J638j820L166k337j162R23j257
14568E186m007o935o66N112k53o17L606j05j344M87M115M959j3L18k597L375l253
14551G368j496o5K56k40J336m026P8j629K488r35m16j601j61K29j330k821k751
14534e716L059L579J786O4l507J627O434j721p334o42l034j391j60L259L1J18
14518c548K623J027L44N766q63K992K400p633q508k642P65K667K517k195l845
14503h133L222M458o7N33M942J933L41j027m43l873m587K188K78L884K824l959
14487B514J109K188N913m775o544L43j665q67j841k079j366R16j168k724J97M511
14471e338q62M642K692K23n10j713k13N205L483K928M836N86p635l605q01n445
$$ plain form
14455 -1527 -5335 -1359 831 1691 3231 4292 6610 3536 2729 251 -3333 -4404 -8594 -9053 -7798
14440 -7798 -4171 -8313 -10956 -10016 -8989 -9883 -5145 -3607 -1369 -3750 -4857 -3117 -4364 -165 1891
14425 1891 130 -295 -4221 -8456 -7322 -3024 4022 2989 708 -2010 -4944 -1778 2033 2303 183
14410 183 -2474 -552 3513 2821 1934 -905 284 3029 4683 4000 4328 3418 2252 2605 1954 -530 -1322
14393 -1322 2957 5164 1488 -916 -3259 -4317 -1086 903 1003 -786 503 -64 111 5878 5646 2499
14377 2499 4599 2304 286 -2761 -849 -147 -2292 2322 -1545 -1442 4989 5046 588 -7731 -9725 -6372
14361 -6372 -3076 3942 9621 10165 6807 1293 -194 -181 2844 5024 4342 4632 3949 3214 3197 1669 -643
14344 -643 319 106 642 2759 -2076 108 0 -4584 -1911 2482 6341 7485 6920 5089 2035 1836
$$ packed form
14455a527l808L976K190Q60J540J061K318l074q07k478l584j071m190m59J255
14440g798L627m142k643R40J027q94M738J538K238k381j107J740j247M199K056
14425A891j761m25l926m235J134M298P046j033k281k718k934L166L811K70k120
14410A83k657J922M065o92q87k839J189K745J654o83L28r10j166L53o51k484p92
14393a322M279K207l676k404k343j058L231J989J00j789J289n67J75N767k32l147
14377B499K100k295k018l047J912P02k145M614l867J03O431N7m458q319j994L353
14361f372L296P018N679N44l358n514j487J3L025K180o82K90o83p35j7j528k312
14344f43R62k13N36K117m835K184j08m584K673M393L859J144n65j831l054j99
$$ plain form
14328 1836 1787 -705 -1293 1257 1706 1854 3226 5377 2622 864 -3902 -9685 -6619 1321 2149 2238 2237
14311 2237 -2075 -3624 -6700 -7529 -9055 -9791 -6530 -4164 807 2327 -1223 -332 -224 -4703 -5164 957
14295 957 777 4565 5154 7959 6675 3222 2279 5501 4532 -3251 -4262 -6424 -5060 -5200 -9075 -11593
14279 -11593 -9890 -8980 -4504 -1355 111 -930 -2320 182 2377 -1649 -6127 -7928 -6362 -5206 -5479
14264 -5479 -1247 -4421 -9119 -5700 -916 2318 -872 -3916 -6673 -2239 2973 -1812 -899 1122 2205
14249 2205 4052 2239 1949 2764 1711 1649 2336 2206 2314 7356 6583 6519 4482 796 48 -987 -2942
14232 -2942 4942 2751 2099 -142 -6535 -6757 -4470 -468 3970 9207 6954 6242 4317 -142 -1855
14217 -1855 -380 316 -1034 1227 2157 1185 -584 1581 3969 7831 8245 4429 1565 2134 -240 -1304
$$ packed form
14328A836m9k492n88K550M49J48J372K151k755j758m766n783L066P940Q28Q9j
14311B237m312j549l076q29j526p36L261K366M971J520l550Q91J08m479m61O121
14295I57j80L788N89K805j284l453r43L222r69p783j011k162J364j40l875k518
14279a1593J703R10M476L149J466j041j390K502K195m026m478j801J566J156k73
14264e479M232l174m698L419M784L234l190l044k757M434N212m785R13K021J083
14249B205J847j813k90Q15j053o2O87j30J08N042p73o4k037l686p48j035j955
14232b942P884k191o52k241o393k22K287M002M438N237k253p12j925m459j713
14217a855J475O96j350K261R30r72j769K165K388L862M14l816k864N69k374j064
$$ plain form
14201 -1304 -5564 -7908 -4339 930 1766 1321 -2207 -4273 1503 3680 1399 1854 109 -359 5519 6380
14185 6380 1123 4045 8769 8216 4524 278 -2511 -871 1180 2704 -3490 -8134 -3311 -780 38
14170 38 1271 429 -296 -2328 -1986 -212 1925 7265 6887 5731 4027 1223 -1720 -5555 -7594 -5741
14154 -5741 -7190 -4508 -6273 -9712 -8199 -7015 -5801 -1338 -230 626 51 -1419 -1969 -4067 -4023 -1488
14138 -1488 -1727 -3591 -6702 -4049 1033 4907 7729 11911 10016 7018 2373 -7242 -10384 -8637 -1267
14123 -1267 -1336 -2585 -5794 -5396 -5716 -2383 -220 204 -145 -371 -4742 -3761 -3611 -3457 -2607 -2007 1222 4544
14105 4544 8307 7335 3514 1955 680 398 -232 1626 780 -2148 -2257 -3568 -2525 -35 729 -247
14089 -247 -1283 -591 449 4353 3061 2840 1914 4117 3677 4959 5560 6950 2143 634 1604 768 2276
$$ packed form
14201a304m260k344L569N269Q36m45l528k066N776K177k281M55j745m68N878Q61
14185F380n257K922M724n53l692m246k789J640K051J524o194m644M823K531Q18
14170C8J233q42p25k032L42J774K137N340l78j156j704k804k943l835k039J853
14154e741j449K682j765l439J513J184J214M463J108Q56n75j470n50k098M4K535
14138a488k39j864l111K653N082L874K822M182j895k998m645r615l142J747P370
14123a267o9j249l209L98l20L333K163M24l49k26m371R81J50J54Q50O00L229L322
14105D544L763r72l821j559j275k82o30J858q46k928j09j311J043K490P64r76
14089b47j036O92J040L904j292k21r26K203m40J282O01J390m807j509R70q36J508
$$ plain form
14072 2276 756 -2727 -97 1528 2477 2618 3430 -1020 -9042 -6725 -4050 -7182 -4421 7071 13291
14057 13291 10603 12741 12343 4006 -2301 -1041 1097 -1514 -5844 -4656 -448 -3614 1285 7663 11618
14042 11618 8362 4435 932 -1289 -1352 2705 5615 9372 10491 5998 1616 -2378 -3297 1596 3148
14027 3148 1896 -2467 -5979 -2433 -3837 -4692 -4492 -3290 -1664 -1560 2276 3476 5250 6975 6268 6376
14011 6376 3927 2393 240 -2010 -3919 -687 -4126 -4676 1983 1134 -1497 -179 4530 3674 -968
13996 -968 -1315 -1554 -3632 -399 1434 2879 5019 6005 1895 -6420 -9128 -6212 -7085 -5166 -8807 -15449
13980 -15449 -17530 -12003 -6612 -4739 -404 405 580 3090 3141 4650 6938 6504 2475 1378 6071 7823
13964 7823 3892 3949 166 -4373 -5535 -1255 104 1017 850 -1724 836 3502 752 -3454 -3602 636
$$ packed form
14072B276j520l483K630J625R49J41Q12m450q022K317K675l132K761J1492O220
14057A3291k688K138l98q337o307J260K138k611m330J188M208l166M899O378L955
14042A1618l256l927l503k221o3M057K910L757J119m493m382l994r19M893J552
14027C148j252m363l512L546j404q55K00J202J626J04L836J200J774J725p07J08
14011F376k449j534k153k250j909L232l439n50O659q49k631J318M709q56m642
13996i68l47k39k078L233J833J445K140R86m110q315k708K916q73J919l641o642
13980a5449k081N527N391J873M335Q09J75K510N1J509K288m34m029j097M693J752
13964G823l931N7l783m539j162M280J359R13j67k574K560K666k750m206j48M238
$$ plain form
13948 636 3993 6024 8118 9437 3276 780 -277 4051 4530 2685 910 571 -2273 -4961 1113
13933 1113 3551 2921 1954 2153 1708 739 400 344 726 2005 1422 -2713 1084 5628 7168 5851 2786
13916 2786 4200 6527 4492 7026 7668 7308 6155 6524 10692 7385 2546 711 2902 3984 3217 7240
13900 7240 8859 8017 7250 6780 5601 13069 16912 13664 4719 1600 3829 2391 4230 3752 1185 4709
13884 4709 2980 552 -636 -784 1453 6166 4774 6179 8301 2501 5108 9834 8469 7465 10082
13869 10082 4989 1237 -1521 3042 5608 2947 2959 4101 4168 1840 1922 6628 4313 3536 708 5157
13853 5157 4941 1315 -3119 -2913 -1063 773 -2633 3829 3600 558 1000 -380 -1940 -2813 -2086 2351
13837 2351 2473 2425 6315 6547 1524 37 3401 3931 -210 -626 -4007 -6980 -8187 -927 3864 2394
$$ packed form
13948F36L357K031K094J319o161k496j057M328M79j845j775l39k844k688O074
13933A113K438o30r67J99m45r69l39n6L82J279n83m135L797M544J540j317l065
13916B786J414K327k035K534O42l60j153L69M168l307m839j835K191J082p67M023
13900G240J619q42p67m70j179P468L843l248q945l119K229j438J839m78k567L524
13884D709j729k428j188j48K237M713j392J405K122n800K607M726j365j004K617
13869A0082n093l752k758M563K566k661J2J142O7k328Q2M706k315p77k828M449
13853E157k16l626m434K06J850J836l406O462k29l042M42j380j560q73P27M437
13837B351J22m8L890K32n023j487L364N30m141m16l381k973j207P260M791j470
$$ plain form
13821 2394 5763 4058 2122 -219 -4503 -1350 3251 3831 2756 -92 -4523 -2436 -1725 2039 4830
13806 4830 6572 4323 751 -447 -719 1186 5780 5259 1841 4280 6119 8684 8336 3089 -617
13791 -617 -1921 -2291 -5254 -7947 -5325 -3933 -3589 -344 2409 400 3163 3871 113 2471 1377 644
13775 644 4819 5417 5325 2878 166 -4767 -3526 -5367 -4473 -3021 3837 2991 -174 1319 4971 2135
13759 2135 1914 5519 5372 -673 -4812 -1861 3677 5177 4668 1315 1978 4810 -813 953 -462 581
13743 581 -200 2045 1114 551 925 1607 3687 7693 4143 1686 5024 3317 7222 13474 9888 4897
13727 4897 4265 3614 3885 3709 4904 -117 -373 5618 10020 4695 402 -216 3933 7379 9567 4535
13711 4535 2347 -3197 -2894 1019 2685 529 1300 2691 3216 -40 -523 -1817 -5545 -4892 -1255 1226
$$ packed form
13821B394L369j705j936k341m284L153M601N80j075k848m431K087P11L764K791
13806D830J742k249l572j198k72J905M594n21l418K439J839K565l48n247l706
13791f17j304l70k963k693K622J392L44L245K753k009K763P08l758K358j094p33
13775F44M175N98r2k447k712m933J241j841Q94J452O858q46l165J493L652k836
13759B135k21L605j47o045m139K951N538J500n09l353O63K832n623J766j415J043
13743E81p81K245r31n63L74O82K080M006l550k457L338j707L905O252l586m991
13727D897o32o51K71j76J195n021k56N991M402n325m293o18M149L446K188n032
13711D535k188n544L03L913J666k156P71J391N25l256m83j294l728O53L637K481
$$ plain form
13695 1226 2183 -1794 -1618 517 -465 1266 -1702 -815 -1118 -4368 112 1976 2751 355 -1125 -2613
13679 -2613 -7796 -5424 -6064 -4698 -1183 -3880 -3658 795 3722 5438 4655 1848 702 1451 1333 4678
13663 4678 6304 6609 6699 7747 7080 5040 7432 9486 12560 10021 8675 10736 10785 3148 -544 1263
13647 1263 -1139 -3961 -5610 358 7668 7778 3985 3203 4952 4313 6174 6270 6535 9675 13084 8606
13631 8606 7116 7519 6445 6283 4852 5803 5884 6644 5971 4032 5986 3565 -2646 -3520 -4758 -2010 -2495
13614 -2495 589 31 -1843 -3558 1850 2957 61 -1572 -347 319 3861 10932 10496 7311 -1817
13599 -1817 -4203 -3511 -4893 -6224 -7369 -3257 308 2652 4271 5510 6672 4404 900 -1524 -3077
13584 -3077 -5927 -4604 562 7288 8649 5997 3538 5604 6070 6753 1759 -1695 -4297 -3240 -3007
$$ packed form
13695A226R57l977J76K135r82J731k968Q87l03l250M480J864P75k396j480j488
13679b613n183K372o40J366L515k697K22M453K927J716p83k807j146P49j18L345
13663D678J626L05R0J048o67k040K392K054L074k539j346K061M9p637l692J807
13647A263k402k822j649N968P310J10l793p82J749o39J861R6K65L140L409m478
13631H606j490M03j074j62j431R51Q1P60o73j939J954k421o211q74j238K748m85
13614b495L084n58j874j715N408J107k896j633J225O66L542P071m36l185r128
13599a817k386O92j382j331j145M112L565K344J619J239J162k268l504k424j553
13584c077k850J323N166O726J361k652k459K066M66O83m994l454k602J057K33
$$ plain form
13569 -3007 -1898 -455 102 1004 -703 1557 5475 5568 5873 3968 2935 3639 5547 8843 7889 6000
13553 6000 6148 6552 9725 10825 7931 2163 382 -1546 1144 5333 5246 1149 4 1274 818 -3677
13537 -3677 1380 3125 1968 -1892 2024 6569 3725 796 1180 3042 6357 7818 4826 2128 -1448
13522 -1448 -3687 -6407 -4388 -1486 2392 7782 11287 9967 8405 9923 8650 8523 5253 3479 4448
13507 4448 8287 8382 7435 8359 12973 12651 11805 7480 7381 7944 7057 9541 8570 3994 437 -1787 -2162 -1293
13489 -1293 -1223 -747 751 2919 7289 3520 1530 2923 4914 -990 -6047 -5862 -4323 -3332 -4878 -4254
13473 -4254 -2712 -1148 -4878 -811 1642 1577 3378 3839 34 1689 8469 8916 8306 5271 4081 -1664
13457 -1664 -1991 -1920 -3393 -4519 -43 1439 3054 4460 8056 8945 8272 10474 10364 6743 5852 4513
$$ packed form
13569c007J109J443N57R02j707K260L918R3L05j905j033P04J908L296r54j889
13553F000J48M04L173J100k894n768j781j928K690M189q7m097j145J270m56m495
13537c677N057J745j157l860L916M545k844k929L84J862L315J461k992k698l576
13522a448k239k720K019K902L878N390L505j320j562J518j273j27l270j774R69
13507D448L839R5r47R24M614l22q46m325r9N63q87K484r71m576l557k224l75Q69
13489a293P0M76J498K168M370l769j990J393J991n904n057J85J539R91j546O24
13473d254J542J564l730M067K453o5J801M61l805J655O780M47o10l035j190n745
13457a664l27P1j473j126M476J482J615J406L596Q89o73K202j10l621q91j339
$$ plain form
13441 4513 4516 3219 1682 3021 2772 5371 11641 9680 2803 -3219 938 -542 -2338 -1654 -1057 -1022 -4783
13424 -4783 -6671 -10196 -9940 -5902 -3875 -1327 -893 -2392 -3012 -6475 -4421 -2146 -499 5198 10827
13409 10827 10593 2797 3237 8275 4253 3177 6442 7929 7106 10015 8616 1700 -448 -2337 -1032
13394 -1032 218 1000 3366 2292 282 3746 2675 2384 5120 4210 2822 3834 3275 4989 5416 227
13378 227 -848 3662 11256 14095 9548 13576 13497 15570 16731 12499 10706 8933 5904 6645 5306 5150
13362 5150 9735 10821 7774 8274 12180 8105 1597 4141 2711 4462 5579 6504 5041 4346 5925
13347 5925 8279 7224 6030 9522 7719 7087 5775 8755 8533 8910 9716 14901 19310 13798 11138 8475
13331 8475 11136 13947 13008 8558 9707 7145 8731 9046 9123 7945 13342 12447 8312 7683 7825 5975
$$ packed form
13441D513Lj297j537J339k49K599O270j961o877o022M157j480j796O84N97L5l761
13424d783j888l525K56M038K027K548M34j499o20l463K054K275J647N697N629
13409A0827k34p796M40N038m022j076L265J487q23K909j399o916k148j889J305
13394a032J250P82K366j074k010L464j071k91K736r10j388J012n59J714M27n189
13378B27j075M510P594K839m547M028p9K073J161m232j793j773l029P41j339j56
13362E150M585J086l047N00L906m075o508K544j430J751J117R25j463o95J579
13347E925K354j055j194L492j803o32j312K980k22L77Q06N185M409n512k660k663
13331H475K661K811r39m450J149k562J586L15P7j178N397q95m135o29J42j850
$$ plain form
13315 5975 -251 -83 3238 11514 17405 14746 15822 13755 14821 15905 13436 11955 11428 9819 8687
13300 8687 8619 8047 7606 7208 4463 2107 4943 13390 18250 19348 20836 22028 18529 16446 19693 20672
13284 20672 21127 20100 15775 14773 16091 13758 12552 11849 2883 2928 9633 9966 7876 9634 13957 21901
13268 21901 24292 26834 24626 27121 27051 23452 17907 21666 27826 25425 31245 39470 39221 45315 50134
13253 50134 56756 63473 67063 72051 80225 90185 98102 106778 119712 130044 148458 163443 177944
13240 177944 195112 218579 245974 288992 358435 469245 635834 853577 1098387 1375468
13230 1375468 1667386 1583091 1116975 701103 453594 311914 230231 184524 152875 129808
13220 129808 109843 97838 81168 71014 64991 58856 56653 51187 42072 39011 33599 25964 24781
$$ packed form
13315E975o226J68L321Q276N891k659J076k067J066J084k469j481n27j609j132
13300H687o8n72m41l98k745k356K836Q447M860J098J488J192l499k083L247R79
13284B0672M55j027m325j002J318k333j206p03q966M5O705L33k090J758M323P944
13268B1901K391K542k208K495p0l599n545L759O160k401N820Q225k49O094M819
13253E0134O622O717L590M988Q174R960P917Q676J2934J0332J8414J4985J4501
13240A77944J7168K3467K7395M3018O9443J10810J66589K17743K44810K77081
13230A375468K91918q4295m66116m15872k47509j41680q1683m5707l1649k3067
13220A29808j9965j2005j6670j0154o023o135k203n466r115l061n412p635j183
$$ plain form
13207 24781 27675 29544 29155 31324 28422 27134 23608 21840 18816 17614 22755 26966 26072 30324 29790
13192 29790 22972 17657 15997 17049 19479 12790 9492 15230 15219 16277 12933 11523 13529 11692 8926
13177 8926 8358 10335 10564 9198 9137 10764 8559 4939 6771 4846 5211 12015 17085 17907 20570 22293
13161 22293 20032 17176 18853 22065 23007 21574 19341 15601 15081 14593 10258 12465 10544 7964 8910
13146 8910 8876 8934 5630 6798 10053 14863 15487 15556 16140 21104 23414 17964 16014 19770 19482 17707 21968
13129 21968 24545 24131 20337 17029 12565 9474 5475 3509 3458 -3075 -8006 -9115 -6284 -4610 -2345
13114 -2345 4059 6305 6183 12045 13194 11518 11465 13901 16262 17066 19490 19109 15153 10426 9845 13795
13098 13795 15384 16832 14963 18686 20513 18713 18833 16955 15258 19246 17515 16092 21159 24038 18662
$$ packed form
13207B4781K894J869l89K169k902j288l526j768l024j202N141M211q94M252n34
13192B9790o818n315j660J052K430o689l298N738j1J058l344j410K006j837k766
13177H926n68J977K29j366o1J627k205l620J832j925L65O804N070Q22K663J723
13161B2293k261k856J677L212R42j433k233l740n20m88m335K207j921k580R46
13146H910l4N8l304J168L255M810O24O9N84M964K310n450j950L756k88j775M261
13129B1968K577m14l794l308m464l091l999j966n1o533m931j109K831J674K265
13114b345O404K246j22N862J149j676n3K436K361Q04K424l81l956m727n81L950
13098A3795J589J448j869L723J827j800J20j878j697L988j731j423N067K879n376
$$ plain form
13083 18662 11286 7804 5805 7146 9156 11756 15351 17106 13577 12579 20187 27500 30405 32352 32691
13068 32691 32894 30650 26719 28028 28822 25484 20899 24740 30180 31091 34358 34266 35725 39253 43074 44647
13052 44647 53058 60020 62728 64277 66219 64598 58258 55514 62855 70354 73020 75073 80808 92672
13038 92672 110658 116620 110382 105251 102877 91748 82103 87367 107264 127088 118623 103842 98987
13025 98987 83937 52143 34784 29960 37165 44703 45527 45589 41052 37032 33224 31389 28425 30324
13011 30324 33100 36852 43890 50062 58269 56064 49406 44351 41797 36235 34914 37346 40058 32991
12997 32991 30839 33510 32330 33111 28861 33465 36337 37843 38279 43039 43267 39048 39384 44068 47226
12982 47226 45636 43859 47146 48060 44087 40607 38662 39468 36474 30967 24125 11683 -37 -7075
$$ packed form
13083A8662p376l482j999J341K010K600L595J755l529r98P608P313K905J947L39
13068C2691K03k244l931J309P94l338m585L841N440R11L267r2J459L528L821J573
13052D4647Q411O962K708J549J942j621o340k744P341P499K666K053N735J1864
13038I2672J7986N962o238n131k374j1129r645N264J9897J9824q465j4781m855
13025I8987j5050l1794j7359m824P205P538Q24O2m537m020l808j835k964J899
13011C0324K776L752P038O172Q207k205o658n055k554n562j321K432K712p067
12997C2991k152K671j180P81m250M604K872J506M36M760K28m219L36M684L158
12982D7226j590j777L287R14l973l480j945Q06k994n507o842j2442j1720p038
$$ plain form
12968 -7075 -8433 -7173 -1417 3381 2489 -329 8987 24734 32429 27640 26263 32914 43165 59450
12954 59450 71856 83725 79115 63674 57146 56085 59420 61804 66063 69487 68517 68252 69020 69178 67385
12939 67385 67355 65474 64758 65019 70819 75257 75039 73929 72835 81553 86416 84551 86578 90548 95405 109255
12923 109255 120163 114162 111273 108829 110929 118332 127686 137207 144740 148109 153279 165642 175295 178632
12909 178632 177859 163432 137366 115082 87983 61533 66496 73531 52717 7540 -21312 -17781
12897 -17781 30260 78302 101325 132925 154909 158788 158868 154831 146559 138160 132533 130118 136572 142009
12883 142009 155249 169549 174434 185465 192665 189832 188639 188861 184038 177693 173245 168898 166002 168519
12869 168519 166930 162292 161025 155465 152514 150890 156705 155443 148354 141808 148206 160934 177505 191440
$$ packed form
12968g075j358J260N756M798q92k818R316J5747P695m789j377O651J0251J6285
12954E9450J2406J1869m610j5441o528j061L335K384M259L424r70k65P68J58j793
12939F7385l0j881p16K61N800M438k18j110j094Q718M863j865K027L970M857J3850
12923A09255J0908o001k889k444K100P403R354R521P533L369N170J2363R653L337
12909A78632p73j4427k6066k2284k7099k6450M963P035k0814m5177k8852L531
12897a7781M8041M8042K3023L1600K1984L879Q0m037q272q399n627k415O454N437
12883A42009J3240J4300M885J1031P200k833j193K22m823o345m448m347k896K517
12869A68519j589m638j267n560k951j624N815j262p089o546O398J2728J6571J3935
$$ plain form
12855 191440 194842 194329 195428 197612 209621 219467 235775 249349 249181 242554 243087 241350 241248 246434
12841 246434 256718 280623 308248 329216 342637 361568 380261 393572 405514 425805 463673
12830 463673 509117 549223 572005 583020 591508 597874 603441 615802 637236 669526 707673 740189
12818 740189 769581 804084 846094 895419 947440 1007116 1073150 1138898 1213541 1298538 1401781
12807 1401781 1516130 1624321 1734005 1868725 2045229 2278892 2550898 2869161 3235484
12798 3235484 3661308 4103078 4358966 4532307 4819139 5214700 5718263 6322212 7021187
12789 7021187 7828797 8737433 9717079 10769765 11918387 13234373 14844289 16818725 19159824
12780 19159824 21886492 25075160 28359544 31659353 35692095 40999815 48221995 58541839
$$ packed form
12855A91440L402n13J099K184J2009R846J6308J3574j68o627N33j737j02N186
12841B46434J0284K3905K7625K0968J3421J8931J8693J3311J1942K0291L7868
12830D63673M5444M0106K2782J1015Q488O366N567J2361K1434L2290L8147L2516
12818G40189K9392L4503M2010M9325N2021N9676O6034O5748P4643Q4997J03243
12807A401781J14349J08191J09684J34720J76504K33663K72006L18263L66323
12798C235484M25824M41770K55888J73341K86832L95561N03563O03949O98975
12789G021187Q07610R08636R79646J052686J148622J315986J609916J974436K341099
12780A9159824K726668L188668L284384L299809M032742N307720P222180J0319844
$$ plain form
12772 58541839 74206583 98605071 133979332 176722015 221522125 275593000 305748006
12765 305748006 247996925 162616523 102605202 68644227 49522584 37921484 30206981
12758 30206981 24741655 20663728 17590110 15403535 13931016 12918020 11772215 10214778
12750 10214778 8401425 6949076 5930171 5182899 4605739 4144164 3780164 3517231 3278883
12741 3278883 3038815 2833562 2669950 2539866 2435965 2287024 2094149 1927745 1798661
12732 1798661 1682954 1581598 1505006 1429869 1335573 1237696 1162028 1109734 1077240 1057224 1025715
12721 1025715 976452 916648 857666 806338 765798 737806 713632 686448 647924 618542 608995
12710 608995 602972 590434 568120 523921 473162 438412 421558 416199 421212 434668 433500 421745
$$ packed form
12772E8541839J5664744K4398488L5374261M2742683M4800110N4070875L0155006
12765C05748006n7751081q5380402o0011321l3960975j9121643j1601100p714503
12758C0206981n465326m077927l073618k186575j472519j012996j145805j557437
12750A0214778j813353j452349j018905p47272n77160m61575l64000k62933k38348
12741C278883k40068k05253j63612j30084j03901j48941j92875j66404j29084
12732A798661j15707j01356p6592p5137r4296r7877p5668n2294l2494k0016l1509
12721A025715m9263n9804n8982n1328m0540k7992k4174k7184l8524k9382r547
12710F08995o023j2538k2314m4199n0759l4750j6854n359N013J3456j168j1755
$$ plain form
12698 421745 405214 398419 403392 400712 392683 393890 399201 395743 392643 378751 355677 330056 312946
12685 312946 299802 294855 295428 300223 301334 296866 290706 275410 259174 251241 248677 253596 257187 257145
12671 257145 252305 246202 240916 236603 227944 212990 202109 194950 189829 184150 174184 167823 163155 156332
12657 156332 152388 146046 139721 137841 138108 136453 138373 150328 165078 171954 174880 174930 167345 154841
12643 154841 146738 136596 125667 127586 146838 181783 209486 207410 229002 278927 298357 270134
12631 270134 219122 191441 205830 185357 144424 105555 82510 84770 86780 75019 63961 64526
12619 64526 75121 89455 100449 105837 105024 101358 97326 95398 88594 75691 72549 73678 76625 78549
12605 78549 82328 80330 78768 82662 82976 81575 77922 81760 85720 81780 76750 76336 77441 72731 66841
$$ packed form
12698D21745j6531o795M973k680q029J207N311l458l100j3892k3074k5621j7110
12685C12946j3144m947N73M795J111m468o160j5296j6236p933k564M919L591m2
12671B57145m840o103n286m313q659j4954j0881p159n121n679r966o361m668o823
12657A56332l944o342o325j880K67j655J920J1955J4750O876K926N0p585j2504
12643A54841q103j0142j0929J919J9252L4945K7703k076K1592M9925J9430k8223
12631B70134n1012k7681J4389k0473m0933l8869k3045K260K010j1761j1058N65
12619F4526J0595J4334J0994N388q13l666m032j928o804j2903l142J129K947J924
12605G8549L779j998j562L894L14j401l653L838L960l940n030m14J105m710n890
$$ plain form
12590 66841 61033 57713 59958 66763 72925 78495 81026 75454 62418 52261 47319 42809 48532 63249
12576 63249 80985 94058 97049 97195 100068 96771 97270 107574 108962 105474 102624 102292 97843 94868
12562 94868 87250 77970 68708 59089 57250 62776 60493 57805 53657 50201 39879 34119 35713 41912
12548 41912 48539 50183 52933 56105 54667 53763 53551 52616 53256 50870 50118 52235 50254 50962 54567 51985
12532 51985 47041 41325 34324 33174 31352 31689 29772 34034 44173 48673 53352 57093 59007 55751
12518 55751 54167 58887 64667 71357 88283 100481 102482 88837 74478 63404 58829 51039 46583
12505 46583 45756 48800 46595 39865 33687 39846 40068 36994 35453 38730 39397 45364 50748 49601 49910
12490 49910 54347 58775 62144 60289 57635 54433 51677 45950 39350 35860 36466 34372 40080 39805 32300
$$ packed form
12590F6841n808l320K245O805O162N570K531n572j3036j0157m942m510N723J4717
12576F3249J7736J3073K991J46K873l297M99J0304J388l488k850l32m449k975
12562I4868p618r280r262r619j839N526k283k688m148l456j0322n760J594O199
12548D1912O627J644K750L172j438r04k12r35O40k386p52K117j981P08L605k582
12532E1985m944n716p001j150j822L37j917M262J0139M500M679L741J914l256
12518E5751j584M720N780O690J6926J2198K001j3645j4359j1074m575p790m456
12505D6583q27L044k205o730o178O159K22l074j541L277O67N967N384j147L09
12490D9910M437M428L369j855k654l202k756n727o600l490O06k094N708k75p505
$$ plain form
12475 32300 30760 30123 31825 30284 29341 27995 26843 24092 23295 21335 21225 21719 19284 22802 29234 36476
12459 36476 42008 42734 42540 39388 39006 36946 33650 29008 26640 27162 25741 19015 15040 15087 18543 22444
12443 22444 20100 17032 18396 19672 19881 22741 24720 23991 28908 36501 32478 24670 18310 14031 12712
12428 12712 16207 20146 24141 28588 27816 25784 26633 30241 29364 26162 26070 29585 32203 30748 30785 30973
12412 30973 30482 29832 32879 29127 21497 20975 24681 22350 18933 14820 16926 19569 21869 18293 15402
12397 15402 17258 20049 20672 22162 19463 16893 17034 13382 14484 15598 12708 16255 22231 27210 34730
12382 34730 33368 27676 23495 22523 21541 17319 14884 18644 18318 8734 6134 8151 10519 12768 13860
12367 13860 13199 13070 11112 12603 17369 21250 18149 16356 12116 9029 8313 10968 14431 15796 16479
$$ packed form
12475C2300j540o37J702j541r43j346j152k751p97j960j10M94k435L518O432P242
12459C6476N532P26j94l152l82k060l296m642k368N22j421o726l975M7L456L901
12443B2444k344l068J364J276K09K860J979p29M917P593m023p808o360m279j319
12428A2712L495L939L995M447p72k032Q49L608q77l202r2L515K618j455L7J88
12412C0973m91o50L047l752p630n22L706k331l417m113K106K643K300l576k891
12397A5402J856K791O23J490k699k570J41l652J102J114k890L547N976M979P520
12382C4730j362n692m181r72r82m222k435L760l26r584k600K017K368K249J092
12367A3860o61j29j958J491M766L881l101j793m240l087p16K655L463J365O83
$$ plain form
12352 16479 8572 2333 1679 7638 14309 20092 18737 18589 16805 17038 14773 13391 14289 12488 14690
12337 14690 16307 15554 16783 16314 14824 20832 27144 23072 21558 25007 32378 38961 40526 40076 42251
12322 42251 43451 48870 47562 52266 58134 62765 65066 73039 80035 92086 98443 99954 110471 125229
12308 125229 137318 153645 170749 193024 218230 246882 288504 357309 459151 617658 839228
12297 839228 1091604 1370514 1664695 1582728 1115588 697162 445112 308631 233080 187126
12287 187126 151717 123481 103586 90482 82891 73740 68350 57108 49852 45585 45000 42401 36437
12274 36437 36123 36450 32971 29740 28023 21928 19592 23466 21084 17663 14876 18391 23596 26606 25185
12259 25185 20467 17478 17362 16314 13357 14036 13984 11404 5973 6713 8227 9911 10583 2925 1053 6299
$$ packed form
12352A6479p907o239o54N959O671N783j355j48j784K33k265j382Q98j801K202
12337A4690J617p53J229m69j490O008O312m072j514L449P371O583J565m50K175
12322D2251J200N419j308M704N868M631K301P973O996J2051O357J511J0517J4758
12308A25229J2089J6327J7104K2275K5206K8652M1622O8805J01842J58507K21570
12297H39228K52376K78910K94181q1967m67140m18426k52050j36481p5551m5954
12287A87126l5409k8236j9895j3104p591r151n390j1242p256m267n85k599n964
12274C6437l14L27l479l231j717o095k336L874k382l421k787L515N205L010j421
12259B5185m718k989j16j048k957O79n2k580n431P40J514J684O72p658j872N246
$$ plain form
12243 6299 10463 10616 9293 9962 10894 11510 6183 2954 5631 7579 5770 5857 15016 14159 15461 17415
12227 17415 15623 11597 11457 10412 10187 12476 11258 6304 6256 11926 13851 15318 13370 11148 12722
12212 12722 12025 13120 13536 5266 -715 1953 1992 3841 3399 5606 4827 4188 5477 4142 5315 7881
12196 7881 5906 5525 6623 9296 8950 7657 6902 8960 9929 10329 11236 11347 10652 7586 7767 4885 1208
12179 1208 -270 3200 687 -3119 923 7146 4819 8181 13806 19342 18336 14362 8139 7836 9130
12164 9130 9565 9389 11500 11219 9222 9865 12329 17865 20257 20834 21812 16868 11745 16552 18432 15316
12148 15316 14763 25125 28534 27507 24713 24900 29290 32654 31238 27830 26937 33436 33878 35007 39173
12133 39173 42011 44193 49166 59074 65387 74662 86962 98685 111334 124550 145770 179511 228081
$$ packed form
12243F299M164J53j323O69R32O16n327l229K677J948j809Q7R159q57J302J954
12227A7415j792m026j40j045k25K289j218m954m8N670J925J467j948k222J574
12212A2722o97J095M16q270n981K668L9J849m42K207p79o39J289j335J173K566
12196G881j975l81J098K673l46j293p55K058R69M00R07J11o95l066J81k882l677
12179A208j478L470k513l806M042O223k327L362N625N536j006l974o223l03J294
12164I130M35j76K111k81j997O43K464N536K392N77R78m944n123M807J880l116
12148A5316n53J0362L409j027k794J87M390L364j416l408q93O499M42J129M166
12133C9173K838K182M973R908O313R275J2300J1723J2649J3216K1220L3741M8570
$$ plain form
12120 228081 300578 402135 525618 656203 805297 869523 697510 461880 295826 200108
12110 200108 141646 106161 86042 72613 61879 50262 43089 39716 33086 27709 20811 19999 21795
12097 21795 22105 15906 12923 15483 15651 10220 7582 9117 11012 10002 11030 13617 13698 10946 13621
12082 13621 13171 15077 20226 22491 17819 9800 8413 6838 7266 11774 13500 11487 13018 16696 21155
12067 21155 18908 17396 18347 13057 6399 5693 9964 14274 13020 10373 10553 14345 13248 13017 15825
12052 15825 15623 13521 13716 13535 12543 11920 7779 9322 8880 6994 5270 6603 5925 10295 10490 8195
12036 8195 7658 5870 1750 47 -1468 -3850 -6884 -3927 -368 2287 3389 4297 7406 4478 3528
12021 3528 2979 2730 4663 4323 6691 9930 16226 14857 10198 8726 3488 2763 6976 157 -994 4015
$$ packed form
12120B28081P2497J01557J23483J30585J49094O4226j72013k35630j66054r5718
12110B00108n8462l5485k0119j3429j0734j1617p173l373o630n377o898q12J796
12097B1795L10o199k983K560J68n431k638J535J895j010J028K587Q1k752K675
12082A3621m50J906N149K265m672q019j387j575M28M508J726k013J531L678M459
12067B1155k247j512R51n290o658p06M271M310j254k647J80L792j097k31K808
12052A5825k02k102J95j81r92o23m141J543m42j886j724J333o78M370J95k295
12036H195n37j788m120j703j515k382l034K957L559K655J102R08L109k928r50
12021C528n49k49J933l40K368L239O296j369m659j472n238p25M213o819j151N009
$$ plain form
12005 4015 8128 9927 8178 9286 9149 4171 2422 4419 8151 10045 7700 3834 -1142 -5008 -3951
11990 -3951 -335 469 4764 6852 9150 11396 9328 5462 5605 -1159 -3699 -2436 -1814 982 6495
11975 6495 9610 7358 7705 8322 6994 6528 6469 10918 14134 13261 7498 5746 7661 5527 8387 10582
11959 10582 9558 4836 2986 6350 6258 1027 1995 4144 -3358 -5308 -3227 -3147 1954 10947 12988 10559
11943 10559 7464 2536 1341 -2344 -4504 -4688 -2838 1961 4277 4185 4434 2022 -1 987 4941 7316
11927 7316 13043 9759 6702 -203 759 7105 8123 7165 6460 12870 11400 7610 7569 9933 10838 9754
11911 9754 10332 6550 5553 2767 -42 2067 3258 4608 6959 5842 5908 6485 6599 5863 3847 1522
11895 1522 830 1387 5291 6936 7646 6706 4965 6305 4842 4603 4888 6324 8665 5423 2369 4416
$$ packed form
12005D015M113J799j749J108j37m978j749J997L732J894k345l866m976l866J057
11990c951L616Q04M295K088K298K246k068l866J43o764k540J263O22K796N513
11975F495L115k252L47O17j328m66n9M449L216q73n763j752J915k134K860K195
11959A0582j024m722j850L364r2n231R68K149p502j950K081Q0N101Q993K041k429
11943A0559l095m928j195l685k160j84J850M799K316r2K49k412k023R88L954K375
11927G316N727l284l057o905R62O346J018r58p05O410j470l790m1K364R05j084
11911I754N78l782r97k786k809K109J191J350K351j117O6N77J14p36k016k325
11895A522o92N57L904J645P10r40j741J340j463k39K85J436K341l242l054K047
$$ plain form
11879 4416 3724 4293 5322 3004 4837 5561 6226 9078 8169 3462 5047 -1342 -2013 -2829 -2839 -3949 -2836
11862 -2836 -3680 -7658 -11147 -9893 -1500 254 603 -334 1383 -1942 -4415 -1512 2566 3764 5158
11847 5158 2824 5573 4060 162 -117 -1159 3228 3920 2907 3681 6226 7706 4487 2461 2085 4623
11831 4623 7057 7893 9272 4087 1311 4437 7059 9457 2920 -682 -1146 7007 9733 12251 17358
11816 17358 14723 13587 8663 4321 7429 3550 -2407 -1145 -1673 -176 1308 -261 4673 8834 4199
11801 4199 1616 -268 -7314 -5540 -5469 -7884 -7237 -6219 -7510 -8387 -3124 -241 3581 -703 -5275 -3078
11785 -3078 247 4611 5382 4910 9260 10077 7437 6177 7462 8590 11149 10019 2297 4045 10927
11770 10927 8026 3312 3520 2863 1367 2276 823 -2033 1369 139 693 -4432 -7226 -4702 -7333
$$ packed form
11879D416o92N69J029k318J833P24O65K852r09m707J585o389o71q16j0j110J113
11862b836q44l978l489J254Q393J754L49r37J717l325k473K903M078J198J394
11847E158k334K749j513l898k79j042M387O92j013P74K545J480l219k026l76K538
11831D623K434Q36J379n185k776L126K622K398o537l602m64Q153K726K518N107
11816A7358k635j136m924m342L108l879n957J262n28J497J484j569M934M161m635
11801D199k583j884p046J774P1k415O47J018j291q77N263K883L822m284m572K197
11785c078L325M364P71m72M350Q17k640j260J285J128K559j130p722J748O882
11770A0927k901m714K08o57j496R09j453k856L402j230N54n125k794K524k631
$$ plain form
11755 -7333 -9242 -1213 -810 -149 -214 -1494 -126 3906 4613 1631 1136 2241 6547 7070 6129 9065 6922
11738 6922 6271 5392 3184 2624 -1693 -726 -2427 -2071 4134 2941 2715 1879 88 1227 367 426 3024
11721 3024 3829 1564 3106 4830 6952 7690 1670 1790 1271 145 1891 2541 2832 664 -1374 692
11705 692 2071 5091 220 -2013 -4174 -3815 -762 1166 3119 1789 210 -3524 -6577 -5388 -1481
11690 -1481 1122 4941 3849 -1369 -3113 -1800 4438 3360 3806 4906 2892 3198 6775 5337 2737
11675 2737 -599 -2892 -1123 728 1180 4355 4727 1999 4387 3518 6011 5676 11830 16435 15314 10010
11659 10010 4771 -1075 -4707 -4667 -7808 -3717 -3052 -1149 -2791 -3363 -4081 -807 -2948 -6570 -6920 -7649
11643 -7649 -7152 -5979 -5112 -3420 -1032 1085 2229 -3593 -4886 -5895 -7197 -3480 -1433 -3814 -4966
$$ packed form
11755g333j909Q029M03O61o5j280J368M032P07k982m95J105M306N23r41K936k143
11738F922o51q79k208n60m317R67j701L56O205j193k26q36j791J139q60N9K598
11721C024Q05k265J542J724K122P38o020J20n19j126J746O50K91k168k038K066
11705F92J379L020m871k233k161L59L053J928J953j330j579l734l053J189L907
11690a481K603L819j092n218j744J313O238j078M46J100k014L06L577j438k600
11675B737l336k293J769J851M52L175L72k728K388q69K493l35O154M605j121n304
11659A0010n239n846l632M0l141M091O65J903j642n72p18L274k141l622l50p29
11643g649M97J173Q67J692K388K117J144n822j293j009j302L717K047k381j152
$$ plain form
11628 -4966 -4759 -1568 3847 6537 5944 627 1007 3706 1418 1481 2462 2037 4748 7161 4621 4603 6879
11611 6879 4809 1101 2375 7300 11040 10665 9050 9682 7456 6117 3560 1965 -3532 -3704 -896
11596 -896 -2042 224 228 -3226 -6960 -4360 -2112 -2548 -2503 -3494 -2571 -123 -2485 -2451 5735 4569 1348
11579 1348 33 1919 3902 6290 6324 5240 5802 7054 3842 1415 1338 636 2085 2826 5191 7043
11563 7043 6358 7710 8733 7849 3213 -3496 -3161 2092 7673 9643 2877 -1292 4183 5654 7284
11548 7284 6838 8452 10555 8025 7029 4831 2199 2337 -196 3593 6980 6044 5525 6738 4 -1122
11532 -1122 554 1071 -216 1092 3729 2334 -4594 -5238 -3424 -3861 -3062 -3020 -3179 -4251 -6094 -4545
11516 -4545 -7259 -10698 -10898 -3984 -2050 -1972 -3198 -1075 5613 4218 -740 -445 2298 4522 1411 1072
$$ packed form
11628d966K07L191N415K690n93n317L80K699k288O3R81m25K711K413k540j8K276
11611F879k070l708J274M925L740l75j615O32k226j339k557j595n497j72K808
11596h96j146K266Ml454l734K600K248m36M5r91R23K448k362L4Q186j166l221
11579A348j315J886J983K388L4j084N62J252l212k427p7p02J449P41K365J852
11563G043o85J352J023q84m636o709L35N253N581J970o766m169N475J471J630
11548G284m46J614K103k530r96k198k632J38k533L789L387r36n19J213o734j126
11532a122J676N17j287J308K637j395o928o44J814m37P99M2j59j072j843J549
11516d545k714l439k00O914J934P8j226K123O688j395m958K95K743K224l111l39
$$ plain form
11500 1072 2786 1750 -2495 -3858 -6191 -7209 -7403 -3088 -2480 -754 -5828 -6613 -4970 -4607 -1155 -45
11484 -45 -1803 198 1459 -1157 -3064 1356 3647 -975 -3095 -3744 -4966 -1004 6189 8240 3134
11469 3134 -1215 -2608 -2961 1550 4694 9584 11214 7610 7686 3455 -772 1741 3153 5502 -23
11454 -23 -2113 1235 -262 -2232 -3949 -4667 1922 5427 1038 -5056 -1631 -618 -1059 -2184 978 5898
11438 5898 10177 10034 7486 1753 605 -5877 -5969 -1506 -242 658 -835 2609 2852 -419 -2849 -4475
11422 -4475 -3046 561 640 1849 383 -607 -5055 -9721 -10898 -7441 -3620 -3923 -5617 -6709 -8589 -5537
11406 -5537 -1094 -179 75 -6484 -5739 -1660 1084 3516 5135 -462 -4039 -2333 -2953 269 3481 4718
11390 4718 4672 4433 2445 -1174 -7590 -3752 -1321 -3043 -3509 338 3367 2785 1525 -1347 -4037 -3774
$$ packed form
11500A072J714j036m245j363k333j018j94M315O08J726n074p85J643L63L452J110
11484d5j758K001J261k616j907M420K291m622k120o49j222L962P193K051n106
11469C134m349j393l53M511L144M890J630l604P6m231m227K513J412K349n525
11454b3k090L348j497j970j717p18O589L505m389o094L425J013m41j125L162M920
11438E898M279j43k548n733j148o482r2M463J264R00j493L444K43l271k430j626
11422d475J429L607P9J209j466r90m448m666j177L457L821l03j694j092j880L052
11406e537M443R15K54o559P45M079K744K432J619n597l577J706o20L222L212J237
11390D718m6k39j988l619o416L838K431j722m66L847L029n82j260k872k690K63
$$ plain form
11374 -3774 63 4327 5400 237 -5448 -6881 -4294 -2509 -1556 -2439 -467 667 -200 -363 668 2482
11358 2482 714 -2 637 5648 7546 4140 -1363 928 5072 6471 10150 9399 9753 9967 12967 8654
11342 8654 5704 -389 -845 4732 8145 9130 11801 14313 8347 462 -1923 -744 -1254 668 5287
11327 5287 -828 -4340 -2683 2732 3473 1888 -24 920 1718 9925 10911 -829 -5948 -9179 -8926 -10460
11311 -10460 -7917 -4222 -3359 -1896 -1288 -18 1875 3141 1827 3672 5839 2141 -1762 -1895 4261
11296 4261 7100 7464 5920 7167 9137 4066 -595 -3502 -1882 -4097 -10252 -7860 -5838 -5634 -6728
11281 -6728 -9020 -8343 -5009 1170 6301 6504 9280 5508 4325 2859 -1288 -3224 -1886 2964 2100
11266 2100 -3068 -3644 -304 -1796 -3105 -4314 -2282 -3832 -3168 -612 4314 4038 6837 10046 629
$$ packed form
11374c774L837M264J073n163n685j433K587J785R53q83J972J134q67j63J031J814
11358B482j768p16O39N011J898l406n503K291M144J399L679p51L54K14L000m313
11342H654k950o093m56N577L413R85K671K512n966p885k385J179n10J922M619
11327E287o115l512J657N415P41j585j912R44P98Q207R86j1740n119l231K53j534
11311a0460K543L695Q63J463O08J270J893J266j314J845K167l698l903j33O156
11296D261K839L64j544J247J970n071m661k907J620k215o155K392K022K04j094
11281f728k292O77L334O179N131K03K776l772j183j466m147j936J338M850q64
11266B100n168n76L340j492j309j209K032j550O64K556M926k76K799L209r417
$$ plain form
11251 629 -1412 1268 787 -2457 1024 5645 3499 4484 3803 2350 4660 3992 -1957 -1513 1420 -410
11235 -410 -1498 3226 6073 4807 2738 -426 -4404 -2758 2617 4621 -27 -5813 -4122 -2361 -3276
11220 -3276 -6106 -6515 -3302 -2849 -1793 13 -1886 -2996 -2585 -4768 -3854 -1483 5014 6139 3695 5451
11204 5451 4714 2775 4362 4747 -1669 -3091 2110 4273 7422 5969 7455 5238 1545 -4085 -9295
11189 -9295 -5826 -4959 -2355 -7256 -6062 -5229 -2850 3410 4955 9394 10955 12517 10782 9954 6897
11174 6897 3655 5461 3208 2869 3734 -1001 -3232 -2082 3200 3856 6657 7680 6284 2514 1624 1992
11158 1992 2417 4031 2902 -1890 -2373 -2476 -1128 -2065 -4291 692 2815 565 -313 -355 -1206 1000 4043
11141 4043 2804 -559 -438 -1574 118 4240 4429 1769 97 2172 2585 1032 3582 2560 -1964
$$ packed form
11251F29k041K680m81l244L481M621k146R85o81j453K310o68n949M44K933j830
11235d10j088M724K847j266k069l164l978J646N375K004m648n786J691J761r15
11220c276k830m09L213M53J056J806j899j110M11k183R14K371O497J125k444J756
11204E451p37j939J587L85o416j422N201K163L149j453J486k217l693n630n210
11189i295L469Q67K604m901J194Q33K379O260J545M439J561J562j735q28l057
11174F897l242J806k253l39Q65m735k231J150N282O56K801J023j396l770q90L68
11158A992M25J614j129m792m83j03J348r37k226M983K123k250q78m2q51K206L043
11141D043j239l363J21j136J692M122J89k660j672K075M13j553K550j022m524
$$ plain form
11126 -1964 -1665 -2696 -2902 -2069 -4766 2037 112 -4218 -3252 -689 -2174 -3134 -1428 -1078 -2544 -1977
11110 -1977 -1073 794 760 3794 4341 1291 -1205 -2129 -4852 -3001 -2629 -4926 -3850 -299 7168 10121
11094 10121 7176 3385 5842 6736 4531 -3099 -5482 -1263 1901 3654 996 -864 851 2051 2073
11079 2073 -79 -3004 -2288 1483 1081 2577 4795 4374 2533 2809 2518 484 2282 1816 5117 8992
11063 8992 11646 9214 5899 3947 2532 1401 5993 6532 3719 180 1332 2913 842 1349 1156
11048 1156 2244 2660 734 -2281 -3442 -6765 -7031 -263 3707 530 -2519 -6642 -2999 724 3987
11033 3987 2744 2246 2284 1237 -2139 -1358 -5028 -6352 -4316 -1377 5318 5846 2170 1796 -492 737
11017 737 115 -7239 -8369 -6980 -5937 890 5116 5138 5920 1758 -2635 -4615 -6663 -4351 868 2119
$$ packed form
11126a964K99j031k06Q33k697O803j925m330R66K563j485r60J706L50j466N67
11110a977R04J867l4L034N47l050k496r24k723J851L72k297J076L551P467K953
11094A0121k945l791K457Q94k205p630k383M219L164J753k658j860J715J200K2
11079B073k152k925P16L771m02J496K218m21j841K76k91k034J798m66L301L875
11063H992K654k432l315j952j415j131M592N39k813l539J152J581k071N07j93
11048A156J088M16j926l015j161l323k66O768L970l177l049m123L643L723L263
11033C987j243m98L8j047l376P81l670j324K036K939O695N28l676l74k288J229
11017G37o22p354j130J389J043O827M226K2P82m162m393j980k048K312N219J251
$$ plain form
11001 2119 1185 -44 -6571 -9132 -651 5605 1211 -2760 -2310 164 3763 5909 6212 9251 9681 7999
10985 7999 5220 5164 8437 9638 10994 6957 3275 -61 1189 1047 -1747 -2808 -5129 -7851 -10449
10970 -10449 -8775 -6957 -3629 -227 6590 8633 5935 2153 -2597 -3364 -3859 -912 -3371 -10474 -7611
10955 -7611 -3330 -413 -221 4897 3324 -4920 -6189 -4256 760 -1004 -5740 -7030 -1536 -4730 -5937
10940 -5937 -3196 -1489 -1282 -5271 -5779 -6128 -7536 -9673 -10236 -12029 -12064 -7533 -5119 -1112 -1958 -1858 -124
10923 -124 -1465 -9167 -10053 -8687 -7569 -7579 -3168 2492 -1742 -4661 -1873 3432 1144 -1596 -1596 1583
10907 1583 3796 1166 -3398 -3901 -5433 -4881 -763 957 -3423 -584 2779 3573 -1679 -5655 -1100
10892 -1100 957 4584 3185 -1896 -8206 -9517 -2395 4603 82 -3649 -4047 -4010 863 4748 2690
$$ packed form
11001B119r34j229o527k561Q481O256m394l971M50K474L599K146L03L039M30j682
10985G999k779n6L273J201J356m037l682l336J250j42k794j061k321k722k598
10970a0449J674J818L328L402O817K043k698l782m750p67m95K947k459p103K863
10955g611M281K917J92N118j573q244j269J933N016j764m736j290N494l194j207
10940e937K741J707K07l989n08l49j408k137n63j793l5M531K414M007q46J00J734
10923a24j341p702q86J366J118j0M411N660m234k919K788N305k288k740%L179
10907A583K213k630m564n03j532N52M118J720m380K839L363P94n252l976M555
10892a100K057L627j399n081o310j311P122O998m521l731l98L7M873L885k058
$$ plain form
10877 2690 2996 2429 -1725 -526 -1871 -911 1530 5649 4150 579 -34 -3264 -3206 -2602 1091 677 -3502
10860 -3502 -1253 -75 -950 2965 7786 8534 9735 104 -10491 -14633 -13632 -12468 -13332 -13400 -5664 -3076
10844 -3076 -5754 292 6153 6636 6716 6237 8222 6561 7801 4257 3791 962 -82 -5678 -10582 -10674
10828 -10674 -3544 1029 -2889 -4301 -3558 -3683 -6640 -10853 -10630 -1478 -1465 -4706 -10746 -9675 -4775 -4973
10812 -4973 -6436 -5843 2201 6907 4128 4570 -1052 -5847 -1671 -5091 -9533 -9935 -4432 -2356 553
10797 553 4363 2009 -993 1559 1493 -1608 -314 1480 2003 -5389 -8539 -8450 -1549 -4670 -7668 -5999
10781 -5999 -5991 -3487 -726 7042 5470 48 -615 -3057 -1762 -6418 -6286 654 3392 2317 -2483 -4685
10765 -4685 -2701 76 -1631 -5301 -5766 -862 939 -1925 -4936 -4559 783 -3092 -8185 -3389 -1312
$$ packed form
10877B690L06n67m154J199j345R60K441M119j499l571o13l230N8O04L693m14m179
10860c502K249J178q75L915M821P48J201r631j0595m142J001J164q64o8P736K588
10844c076k678O046N861M83Q0m79J985j661J240l544m66k829j044n596m904r2
10828a0674P130M573l918j412P43j25k957m213K23R152J3l241o040J071M900j98
10812d973j463N93Q044M706k779M42n622m795M176l420m442m02N503K076K909
10797E53L810k354l002K552o6l101J294J794N23p392l150Q9O901l121k998J669
10781e999QK504K761P768j572n422o63k442J295m656J32O940K738j075m800k202
10765d685J984K777j707l670m65M904J801k864l011L77N342l875n093M796K077
$$ plain form
10750 -1312 2252 6580 6490 3647 2402 1727 3958 1476 -1281 -2171 -2837 -4910 -3689 -5080 -9702 -6634
10734 -6634 -1301 -2382 -2990 -4992 -3052 -2035 -4492 -1765 -5862 -5086 -1911 -2551 -9475 -9772 -6175 282
10718 282 1873 3221 5184 6450 9752 6375 5990 7082 7954 6762 2740 7331 7490 2286 -4872 357
10702 357 3913 2978 -622 -6217 -7834 -6840 -5830 -3240 1415 348 2988 2446 1611 260 2327 3059
10686 3059 4044 2409 -1722 -5541 -645 2159 -1066 2659 8551 9113 7478 2460 1406 -612 421
10671 421 -4145 -2417 -2091 -1116 -564 -1676 1943 366 104 -81 3250 2409 851 339 -787 -2930 -6575
10654 -6575 -10383 -7660 -3502 -1627 -3230 -1155 188 1503 -3324 -6552 -11522 -7764 -2153 488 3156
10639 3156 -1509 -1109 2254 5122 4457 4425 2955 2810 5229 3965 4432 5218 212 -5320 -2990 1436
$$ packed form
10750a312L564M328r0k843j245o75K231k482k757q90o66k073J221j391m622L068
10734f634N333j081o08k002J940J017k457K727m097P76L175o40o924k97L597O457
10718B82J591J348J963J266L302l377l85J092Q72j192m022M591J59n204p158N229
10702C57L556r35l600n595j617R94J010K590M655j067K640n42q35j351K067P32
10686C059R85j635m131l819M896K804l225L725N892N62j635n018j054k018J033
10671D21m566J728L26R75N52j112L619j577k62j85L331q41j558n12j126k143l645
10654f575l808K723M158J875j603K075J343J315m827l228m970L758N611K641K668
10639C156m665M00L363K868o65l2j470j45K419j264M67P86n006n532K330M426
$$ plain form
10623 1436 744 2 6877 9634 9404 7560 3380 -1415 -5937 -9134 -8853 -7835 -7189 -1987 -139 -2066
10607 -2066 -4545 -4278 -3415 -2865 1350 195 2075 4153 6962 11488 7129 993 44 -3266 -4078 -959
10591 -959 -1915 -348 -632 -2376 -1356 -4303 -7545 -7746 -3245 4462 10064 8072 4813 -918 -2521 1147
10575 1147 492 375 2548 3108 187 -408 -3036 -4891 -2949 -5002 -9893 -7584 -6327 -4602 -4128 -7058
10559 -7058 -9568 -7924 -4839 -6372 -11728 -12259 -13401 -9613 -4295 -3936 -4609 3749 2106 1825 -526 -5657
10543 -5657 -4542 -6361 -520 4493 1162 720 -3039 -3970 -5918 -4290 -1291 -2224 -5845 -4806 -774
10528 -774 -2227 -4689 -3253 158 4745 8032 9114 11474 9448 7100 4797 1947 2569 4841 3838
10513 3838 5500 9383 8368 6214 4932 -183 -2873 -623 -3255 514 3635 78 1674 2096 4762
$$ packed form
10623A436o92p42O875K757k30j844m180m795m522l197K81J018O46N202J848j927
10607b066k479K67Q63N50M215j155J880K078K809M526m359o136r49l310q12L119
10591i59r56J567k84j744J020k947l242k01M501P707N602j992l259n731j603L668
10575A147o55j17K173N60k921n95k628j855J942k053m891K309J257J725M74k930
10559g058k510J644L085j533n356n31j142L788N318L59o73Q358j643k81k351n131
10543e657J115j819N841N013l331m42l759r31j948J628K999r33l621J039M032
10528g74j453k462J436L411M587L287J082K360k026k348k303k850O22K272j003
10513C838J662L883j015k154j282n115k690K250k632L769L121l557J596M22K666
$$ plain form
10498 4762 4632 2928 4658 3707 67 -315 -763 506 819 4699 6214 2331 -1681 -1820 -4147 575
10482 575 5912 3950 3380 3399 2961 2166 3083 1500 -711 -2569 2878 4470 5988 6760 1387 -3083 -6443
10465 -6443 -5667 3452 9969 10076 6758 6109 8008 249 -8133 -3676 2789 8880 10430 1340 -8754
10450 -8754 -7141 -1383 -4439 -3401 3046 7985 11103 11017 8892 13292 19300 19692 19891 20690 19802 23126
10434 23126 22822 17753 13272 8821 9733 12804 10137 6416 4611 8083 5863 2314 -323 -2086 -5218
10419 -5218 -4902 -4867 -1995 -3363 -1231 -598 -5874 -9666 -4598 -832 -951 2092 -981 -2666 -2797 181
10403 181 3144 1760 2151 1657 897 -896 -7468 -6755 -6098 -2392 1535 3287 1555 830 3490 3987 3537
10386 3537 -2079 -6091 -727 1621 3049 6385 2621 344 -470 -241 4392 4879 2214 2401 5301 3748
$$ packed form
10498D762j30j704J730r51l640l82m48J269L13L880J515l883m012j39k327M722
10482E75N337j962n70J9m38p95R17j583k211j858N447J592J518P72n373m470l360
10465f443P76R119O517J07l318o49J899p759q382M457O465O091J550r090j0094
10450h754J613N758l056J038O447M939L118q6k125M400O008L92J99P99q88L324
10434B3126l04n069m481m451R12L071k667l721j805L472k220l549k637j763l132
10419e218L16L5K872j368K132O33n276l792N068L766j19L043l073j685j31K978
10403A81K963j384L91m94p60j793o572P13O57L706L927J752j732p25K660M97m50
10386C537n616m012N364K348J428L336l764k277q14K29M633M87k665J87K900j553
$$ plain form
10370 3748 1122 6304 5538 1301 -3418 1418 362 -4545 -2793 -5683 -7425 -3346 4605 9013 8333
10355 8333 3302 587 942 6138 7923 5738 308 -1404 5540 7295 4676 3500 5347 3104 -1403
10340 -1403 -1658 75 3079 1404 3790 4181 1360 559 -2195 -2208 -1700 594 2899 4632 3129 2221
10324 2221 1911 3148 5579 5843 262 -1583 -4896 -2684 2377 3228 1123 413 -420 -1795 -3301 -1411
10308 -1411 6195 7532 5526 -193 363 4146 698 -1646 -1672 -320 -531 -4701 -4133 -4219 -5510 -8389
10292 -8389 -6396 -577 -788 -2333 536 -417 -710 2923 6249 4089 9 -2123 -1104 -1532 -3477 -5768
10276 -5768 -2544 -1286 -5068 -3499 -2458 3518 3645 679 70 3050 3815 3251 2393 -2232 -2742 -2651 -488
10259 -488 -65 1795 5165 6267 6467 5358 6638 5874 2981 1268 1416 2816 5054 5900 7307 8649
$$ packed form
10370C748k626N182p66m237m719M836j056m907J752k890j742M079P951M408o80
10355H333n031k715L55N196J785k185n430j712O944J755k619j176J847k243m507
10340a403k55J733L004j675K386L91k821q01k754j3N08K294K305J733j503r08
10324B221l10J237K431K64n581j845l313K212N061Q51k105p10q33j375j506J890
10308a411P606J337k006n719N56L783l448k344k6J352k11m170N68q6j291k879
10292h389J993N819k11j545K869r53k93L633L326k160m080k132J019m28j945k291
10276e768L224J258l782J569J041N976J27k966o09K980P65n64q58m625n10R1K163
10259d88M23J860L370J102K00j109J280p64k893j713J48J400K238Q46J407J342
$$ plain form
10243 8649 5523 7450 15509 16039 10477 4922 4664 7330 2880 1144 2743 482 4149 5511 5308
10228 5308 5633 10587 11371 6765 -2405 -5375 -1467 5097 10340 9498 4978 865 876 445 1854 6414
10212 6414 5509 1136 -3276 -4989 -5321 -476 -6371 -8822 -5180 -417 4158 2172 -2456 -7432 -12305
10197 -12305 -15229 -12852 -3918 -3028 -6561 -7982 -9251 -8149 -2593 1634 5107 3316 3102 879 2515
10182 2515 302 4403 3803 692 -1179 -5383 -5932 -4515 -1941 -955 -1949 -1442 -5746 -9475 -4076 -2278
10166 -2278 -5278 -6644 -8937 -7152 -4549 -6335 -4924 -6423 -4604 -2995 4874 9037 4190 5505 6725
10151 6725 -317 -3423 2263 4908 6410 10259 8969 2185 -3574 -4350 -2369 -2943 -3317 -2281 -2961 -823
10135 -823 1708 -29 130 868 -623 -2000 -865 3509 8210 6202 6144 4271 2053 205 126 3392
$$ packed form
10243H649l126J927Q059N30n562n555k58K666m450j736J599k261L667J362k03
10228E308L25M954P84m606r170k970L908O564N243q42m520m113J1m31J409M560
10212F414r05m373m412j713l32M845n895k451L642M763M575j986m628m976m873
10197a2305k924K377Q934Q90l533j421j269J102N556M227L473j791k14k223J636
10182B515k213M101o00l111j871m204n49J417K574R86r94N07m304l729N399J798
10166b278l000j366k293J785K603j786J411j499J819J609P869M163m847J315J220
10151F725p042l106N686K645J502L849j290o784n759p76J981n74l74J036o80K138
10135h23K531j737J59P38j491j377J135M374M701k008n8j873k218j848p9L266
$$ plain form
10119 3392 2664 -778 225 4385 5868 7484 9295 5915 3259 3404 2414 234 398 2510 1264 346
10103 346 -2819 -3624 -1756 -547 -1721 1590 -1373 -6180 -2413 903 -1642 -3447 -5840 -4167 2360
10088 2360 4627 2616 -1086 -3691 671 7577 8067 3337 2157 -219 590 2057 2324 -264 2712
10073 2712 2679 -2302 -1537 1595 3653 949 340 1952 3534 7197 1813 -1212 1231 4653 6856 7926
10057 7926 8355 8422 6950 9942 15159 14506 18166 26676 33460 36253 36302 41006 47444 48803 51964 61563
10041 61563 75065 83900 89741 99432 117199 143642 169655 206473 267286 367681 512499 679150
10029 679150 868575 1119182 1057483 688668 399336 242186 167531 131649 105231 84862
10019 84862 70277 59987 49010 38772 33443 28815 23260 20841 20776 17431 16226 15946 17902 16254
$$ packed form
10119C392p28l442J003M160J483J616J811l380k656J45r90k180J64K112j246r18
10103C46l165q05J868J209j174L311k963m807L767L316k545j805k393J673O527
10088B360K267k011l702k605M362O906M90m730j180k376Q09J467K67k588K976
10073B712l3m981P65L132K058k704o09J612J582L663n384l025K443L422K203J070
10057G926M29O7j472K992N217o53L660Q510O784K793M9M704O438J359L161R599
10041F1563J3502Q835N841R691J7767K6443K6013L6818O0813J00395J44818J66651
10029F79150J89425K50607o1699l68815k89332j57150p4655l5882k6418k0369
10019H4862j4585j0290j0977j0238n329m628n555k419o5l345j205k80J956j648
$$ plain form
10005 16254 16376 14097 6010 185 3194 5740 5405 9409 8641 5801 7411 4650 3107 5776 5280
9990 5280 -198 260 4797 8063 8464 7804 7443 6700 6849 1239 -2566 -3896 -83 3187 750 -1867
9974 -1867 -32 -685 923 3131 5709 7199 10165 7049 -1733 -1583 2161 1867 144 1043 740 2700
9958 2700 1963 920 2457 1228 2347 426 -1450 -965 -2915 -4444 -241 -851 -1088 -1116 -6215 -1727
9942 -1727 3641 5541 2338 3383 4658 7117 4420 4804 5519 5192 3145 187 -2935 -7597 -7035 -1273
9926 -1273 -83 4530 -3441 -7898 -4247 -3487 -2654 -4336 -4373 -1414 3011 3515 4525 7135 11199 11203 8155
9909 8155 2492 -442 673 3774 1842 -2520 -1574 1141 -906 -821 2538 1864 2443 6024 -31 -4562
9893 -4562 -5843 -547 2013 4901 3327 -1569 1640 6363 -1663 -4397 -1696 1199 1364 3495 8217
$$ packed form
10005A6254J22k279q087n825L009K546l35M004p68k840J610k761j543K669m96
9990E280n478M58M537L266M01o60l61p43J49n610l805j330L813L270k437k617
9974a867J835o53J608K208K578J490K966l116q782J50L744k94j723Q99l03J960
9958B700p37j043J537j229J119j921j876M85j950j529M203o10k37k8n099M488
9942a727N368J900l203J045J275K459k697L84P15l27k047k958l122m662N62N762
9926a273J190M613p971m457L651P60Q33j682l7K959M425N04J010K610M064Ml048
9909H155n663k934J115L101j932m362R46K715k047Q5L359o74N79L581o055m531
9893d562j281N296K560K888j574m896L209M723q026k734K701K895J65K131M722
$$ plain form
9878 8217 10120 6588 5556 828 2954 6216 7292 11929 10501 5547 5172 7088 8042 12677 12659 7200
9862 7200 5326 8797 3382 -5792 -6064 -2348 -3696 -7182 -3096 1416 5065 5548 8080 5241 2526
9847 2526 -483 -8183 -8759 -3985 -2168 1666 440 -2370 -5653 -4504 4300 8521 6000 1259 -1569
9832 -1569 1006 239 4918 3424 663 -1243 -3515 -2539 -1100 -3380 -3492 -3534 78 -382 297 -1515 -2454
9815 -2454 -5736 -9273 -9250 -3277 -2180 -8975 -10225 -5299 -5120 -7429 -7444 -4157 -1512 -1334 -1152 913 -2144
9798 -2144 -6276 -6883 -4217 -5036 -3976 974 543 853 -90 344 -2287 -4744 -3264 -1592 -2562 -2423 -1282
9781 -1282 -3238 -2916 -1389 -2343 -1893 2055 -441 -1082 -4019 -4183 -3852 1467 -1184 -5274 -6244 -9700 -7397
9764 -7397 -224 2932 6019 3098 2389 2814 2179 427 829 4575 597 -3286 -1093 734 1107 -433
$$ packed form
9878H217J903l532j032m728K126L262J076M637j428m954l75J916R54M635j8n459
9862G200j874L471n415r174k72L716j348l486M086M512L649M83K532k839k715
9847B526l009p700n76M774J817L834j226k810l283J149Q804M221k521m741k828
9832a569K575p67M679j494k761j906k272R76J439k280j12m2L612m60O79j812r39
9815b454l282l537K3N973J097o795j250M926J79k309j5L287K645J78J82K065l057
9798b144m132o07K666q19J060M950m31L10r43M34k631k457J480J672r70J39J141
9781a282j956L22J527r54M50L948k496o41k937j64L31N319k651m090r70l456K303
9764g397P173L156L087k921p09M25o35j752M02L746l978l883K193J827L73j540
$$ plain form
9748 -433 4730 9877 11249 10345 4875 1199 247 -1305 -3287 -2400 301 -797 -3967 -4945 -4424 -1155
9732 -1155 -1917 1254 7532 8768 4895 -1688 2702 2911 3237 2977 976 23 1023 4262 1153 254
9716 254 6084 7516 6813 4248 -2155 -2124 1842 4313 3552 -4637 -2166 3924 8973 4670 2391 4119
9700 4119 5087 3018 1627 -337 -4125 -7669 -4644 -2538 -905 -3792 -6694 -4329 -1263 -2286 -150
9685 -150 1855 6454 10521 11092 7392 -1300 -4280 -7092 -4680 -7114 -4291 -2447 1583 351 -5980
9670 -5980 -6799 -2838 -2371 757 -58 -5530 -6272 -4995 -4860 -4826 2262 6238 2884 44 960 1247 3954
9653 3954 35 -1989 -3943 -4306 -1065 4693 743 137 4090 3850 4437 4357 4534 3623 813 -25 1576
9636 1576 1744 -1453 -2049 4304 11444 14757 12278 11636 10802 8099 5458 2034 828 3270 6284 29
$$ packed form
9748d33N163N147J372r04n470l676r52j552j982Q87K701j098l170r78N21L269
9732a155p62L171O278J236l873o583M390K09L26k60k001r53J000L239l109q99
9716B54N830J432p03k565o403L1L966K471p61q189K471O090N049m303k279J728
9700D119R68k069j391j964l788l544L025K106J633k887k902K365L066j023K136
9685a50K005M599M067N71l700q692k980k812K412k434K823J844M030j232o331
9670e980q19L961M67L128q15n472p42J277J35L4P088L976l354k840R16K87K707
9653C954l919k024j954l63L241N758l950o06L953k40N87q0J77r11k810q38J601
9636A576J68l197n96O353P140L313k479o42q34k703k641l424j206K442L014o255
$$ plain form
9620 29 139 -976 1877 6685 9687 5523 -225 -1677 2943 7587 12993 14748 11120 5009 3468 2111
9604 2111 3449 4728 5270 3325 2965 5602 10613 12924 6253 74 768 -915 -2707 -148 2896 2587
9588 2587 4078 733 1662 4112 3606 6033 7808 9002 7328 5631 -1145 -1715 1484 -247 -1145 -526
9572 -526 -427 -54 3945 6132 3176 3012 1560 -3 1728 861 -2225 -4849 -6913 -8209 -9238 -2161
9556 -2161 3898 2813 4813 3571 4158 6411 8449 6891 4034 4883 5560 7759 7205 9710 11795 10672
9540 10672 5065 3297 7429 4760 5952 3470 4916 9018 6946 4464 -342 -1501 3905 5994 8178
9525 8178 6823 3934 3035 7879 7338 5437 3725 4915 2782 3548 489 -1473 1685 2434 3188 1026
9509 1026 1415 1743 817 3755 -1383 -3788 -4174 2485 10171 10345 13882 14879 10061 4913 3586 2154
$$ packed form
9620B9J10j115K853M808L002m164n748j452M620M644N406J755l628o111j541j357
9604B111J338J279N42j945l60K637N011K311o671o179O94j683j792K559L044l09
9588B587J491l345R29K450n06K427J775J194j674j697o776n70L199j731q98O19
9572e26R9L73L999K187k956j64j452j563J731q67l086k624k064j296j029P077
9556b161O059j085K000j242N87K253K038j558k857Q49O77K199n54K505K085j123
9540A0672n607j768M132k669J192k482J446M102k072k482m806j159N406K089K184
9525H178j355k889q99M844n41j901j712J190k133P66l059j962L158P49P54k162
9509A026L89L28r26K938n138k405l86O659P686J74L537R97m818n148j327j432
$$ plain form
9493 2154 4762 6322 3924 5675 11625 13667 12906 7887 5212 3983 139 -1827 -2462 5606 7740
9478 7740 2438 -3381 -1508 4370 108 -2146 -1905 349 4442 6406 9085 8773 9998 11421 6045
9463 6045 6029 6010 5179 8656 12939 11191 8978 7350 8428 9707 12550 14389 14905 11633 9863 6943
9447 6943 3522 4311 8289 12814 13044 7287 5130 397 1056 8212 11117 9657 11830 8868 2613 1070
9431 1070 560 418 4554 9127 8695 11886 13736 13741 17102 19717 17532 18357 21701 19072 14334 11380 12480
9414 12480 12111 15369 20296 20517 20337 18647 13853 12471 15382 16859 16865 14405 13974 11103 12413 15847
9398 15847 10353 7153 12846 15659 15488 15879 22793 18258 10380 12364 13329 9774 11945 14187 15501
9383 15501 14411 14423 13758 12598 15089 17011 12742 12758 12513 11440 11611 13813 10260 8225 11488 13758
$$ packed form
9493B154K608J560k398J751N950K042p61n019k675j229l844j966o35Q068K134
9478G740n302n819J873N878m262k254K41K254M093J964K679l12J225J423n376
9463F045j6j9q31L477M283j748k213j628J078J279K843J839N16l272j770k920
9447F943l421P89L978M525K30n757k157m733O59P156K905j460K173k962o255j543
9431A070n10j42M136M573m32L191J850NL361K615k185Q25L344k629m738k954J100
9414A2480l69L258M927K21j80j690m794j382K911J477Ok460m31k871J310L434
9398A5847n494l200N693K813j71L91O914m535p878J984R65l555K171K242J314
9383A5501j090J2o65j160K491J922m269J6k45j073J71K202l553k035L263K270
$$ plain form
9367 13758 18638 19531 19490 17951 17257 20187 19745 19417 19535 20643 19660 21503 21978 22365 21174 16311 14258
9350 14258 16586 20693 19882 23226 26078 25277 25828 22177 17336 16137 18879 25488 30606 32016 25383
9335 25383 23566 26690 25751 23723 28009 28140 26274 26556 29274 30057 28260 28083 23960 22523 23988 21727
9319 21727 24075 29972 30498 28636 30153 33794 36671 43612 39595 33980 31314 32621 34058 33347 33603
9304 33603 39552 40811 41746 35848 39356 35496 35333 37466 39072 41617 41670 47211 50820 46277 43964 44862
9288 44862 45536 43924 46899 50096 50354 47198 48905 53495 50163 47303 49428 56161 57928 58843 59468 60152
9272 60152 60292 56273 58558 62636 59521 55156 54726 58334 63118 63918 67033 62986 59493 60953 66136
9257 66136 64601 63724 65738 69584 77984 83844 84206 84318 84159 80844 80981 79112 79468 80014 82096 82975 81791
$$ packed form
9367A3758M880Q93m1j539o94K930m42l28J18J108r83J843M75L87j191m863k053
9350A4258K328M107q11L344K852q01N51l651m841j199K742O609N118J410o633
9335B5383j817L124r39k028M286J31j866K82K718P83j797j77m123j437J465k261
9319B1727K348N897N26j862J517L641K877O941m017n615k666J307J437p11K56
9304C3603N949J259R35n898L508l860j63K133J606K545N3N541L609m543k313Q98
9288D4862O74j612K975L197K58l156J707M590l332k860K125O733J767R15O25O84
9272F0152J40m019K285M078l115m365m30L608M784Q00L115m047l493J460N183
9257F6136j535q77K014L846Q400N860L62J12j59l315J37j869L56N46K082Q79j184
$$ plain form
9240 81791 83688 82984 81232 74640 75809 77247 80283 85480 83938 91341 100038 97087 95336 94775 94276
9225 94276 98399 98659 92532 91122 89845 88963 89242 90095 95543 102419 102571 102110 101559 94948 90637 96826
9209 96826 100534 103244 105681 108254 107959 109669 108959 106382 106167 104139 106781 106934 105022 102360 101916 106170
9193 106170 107025 105062 105816 103172 100804 101506 104060 106638 109656 105388 101278 100590 98106 95184 91970
9178 91970 94247 101088 102524 98472 94087 90135 93261 89950 89255 88431 93763 91248 87111 86687 86910 85174
9162 85174 83198 82801 81210 82803 83073 79059 81794 85699 86063 82797 79985 78955 74275 69321 68689 64602
9146 64602 63254 64537 60866 63288 64184 58931 54424 51898 53677 58482 65508 66203 62790 62401 59258
9131 59258 57361 56265 56238 58369 56861 56206 53780 50850 51550 55516 53803 48763 49137 49686 51937 53912
$$ packed form
9240H1791J897p04j752o592J169J438L036N197j542P403Q697k951j751n61m99
9225I4276M123K60o127j410j277q82K79Q53N448O876J52m61n51o611m311O189
9209I6826L708K710K437K573k95J710p10k577k15k028K642J53j912k662m44M254
9193A06170Q55j963P54k644k368P02K554K578L018m268m110o88k484k922l214
9178I1970K277O841J436m052m385l952L126l311o95q24N332k515m137m24K23j736
9162H5174j976l97j591J593K70m014K735L905L64l266k812j030m680m954o32m087
9146F4602j348J283l671K422Q96n253m507k526J779M805P026O95l413l89l143
9131E9258j897j096k7K131j508o55k426k930P00L966j713n040L74N49K251J975
$$ plain form
9115 53912 53906 51618 51614 53371 51217 51371 47321 46575 44239 40311 45317 46592 46439 43731 42432 42822 38972
9098 38972 41649 44674 40819 37664 37743 33438 34885 34393 33184 37292 36602 36823 34578 34139 33819 36660
9082 36660 36845 32099 28503 24347 24160 26769 25822 26520 27707 29778 28898 27410 27752 27526 29134 26516
9066 26516 21181 23074 23347 26462 25491 25252 23167 24365 24043 27820 31146 25814 20776 19360 20414 27536
9050 27536 28271 29944 26290 22311 18670 16158 17893 19030 22370 23583 19335 20356 20570 21929 20284
9035 20284 18397 15725 14900 15961 18802 12574 10529 14004 16935 19434 18795 17172 16893 19262 19863 15761
9019 15761 13423 15649 16702 15685 11532 13250 16576 16502 13695 12736 17219 18048 14263 12936 16644 19467
9003 19467 18524 15039 8713 6917 12997 16343 18282 15341 14818 13437 18103 17439 17530 17968 18704 15894
$$ packed form
9115E3912ok288mJ757k154J54m050p46k336l928N006J275j53k708j299L90l850
9098C8972K677L025l855l155P9m305J447m92j209M108o90K21k245m39l20K841
9082C6660J85m746l596m156j87K609r47O98J187K071q80j488L42k26J608k618
9066B6516n335J893K73L115r71k39k085J198l22L777L326n332n038j416J054P122
9050B7536P35J673l654l979l641k512J735J137L340J213m248J021K14J359j645
9035B0284j887k672q25J061K841o228k045L475K931K499o39j623k79K369O01m102
9019A5761k338K226J053j017m153J718L326p4k807r59M483Q29l785j327L708K823
9003A9467r43l485o326j796O080L346J939k941n23j381M666o64R1M38P36k810
$$ plain form
8987 15894 14709 13216 11266 14164 14941 12979 14203 14984 16818 15906 14447 13133 13378 14858 11008 11780
8971 11780 9226 10968 10743 13748 10448 8777 10710 10484 7573 7083 6902 6708 4780 3643 4123 2953
8955 2953 1447 281 414 669 7141 10227 8278 8962 8672 7827 9944 12871 14030 22325 18986 14301
8939 14301 12381 11756 12445 11162 9777 13732 11130 11908 11302 9138 7282 11751 12692 7185 4819 9504
8923 9504 9489 6495 7081 7732 7956 8972 5510 8355 14341 13427 15978 16269 11551 12693 13073 9877 7791
8906 7791 7586 6771 11750 12636 8770 8886 11629 10062 10483 9734 8189 6796 8700 7964 4666 31 -1256
8889 -1256 1148 952 4775 6612 6166 4766 2343 2158 3276 5291 3849 3054 8528 11677 10241 5600
8873 5600 3947 1243 161 2122 8227 14824 12312 6192 -246 -7549 -10330 -5613 -318 200 174 1648
$$ packed form
8987A5894j185j493j950K898P77j962J224P81J834r12j459j314K45J480l850P72
8971A1780k554J742k25L005l300j671J933k26k911m90j81j94j928j137M80j170
8955B953j506j166J33K55O472L086j949O84k90q45K117K927J159Q295l339m685
8939A4301j920o25O89j283j385L955k602P78o06k164j856M469R41n507k366M685
8923I504j5k994N86O51K24J016l462K845N986r14K551K91m718J142L80l196k086
8906G791k05q15M979Q86l866J16K743j567M21p49j545j393J904p36l298m635j287
8889a256K404j96L823J837m46j400k423j85J118K015j442p95N474L149j436m641
8873E600j653k704j082J961O105O597k512o120o438p303k781M717N295N18k6J474
$$ plain form
8857 1648 4809 1416 124 -1547 -2281 4982 4189 5907 6066 4983 4452 3142 2068 -984 -1142 2404
8841 2404 2018 -1285 1587 5542 1544 -883 1779 4450 5121 1913 2150 2031 3177 2806 3212 5895
8825 5895 8190 3828 1169 -1071 -817 -2825 -2359 -1293 3437 6060 4597 2278 -1101 1754 1993 5147
8809 5147 8234 5992 1907 1269 347 -2406 -4713 -30 3374 9654 10893 8545 11046 12598 10036
8794 10036 12580 13507 11517 10309 5903 3966 2932 6861 7709 8181 8472 7471 7211 4134 4015 6861
8778 6861 5902 3971 -1097 2626 3590 4605 6942 4587 2842 -1571 -346 3742 7870 3789 1426
8763 1426 -862 2638 8279 13254 10880 8291 9109 6326 5405 2635 3698 4733 7010 4391 -2914
8748 -2914 -3850 -2730 -4989 -282 3154 3721 3014 4057 -2216 -3634 530 -170 -3161 -239 -3354 -670
$$ packed form
8857A648L161l393j292j671p34P263p93J718J59j083n31j310j074l052j58L546
8841B404l86l303K872L955l998k427K662K671O71l208K37j19J146l71M06K683
8825E895K295m362k659k240K54k008M66J066M730K623j463k319l379K855K39L154
8809E147L087k242m085o38r22k753k307M683L404O280J239k348K501J552k562
8794A0036K544R27j990j208m406j937j034L929Q48M72K91j001k60l077j19K846
8778F861r59j931n068L723R64J015K337k355j745m413J225M088M128m081k363
8763A426k288L500N641M975k374k589Q18k783r21k770J063J035K277k619p305
8748b914r36J120k259M707L436N67p07J043o273j418M164p00k991K922l115K684
$$ plain form
8732 -670 -898 -3638 -923 3288 6719 6554 6025 7955 9841 5625 4121 5038 5560 4985 5380 5336 3684
8715 3684 1029 3112 3433 1826 -230 -118 -1152 -1671 -1155 3290 5230 5784 5370 4301 4174 7430 8753
8698 8753 5810 4546 6282 7487 9540 4594 -2512 -5928 -5403 -910 275 -375 -1505 1852 4067
8683 4067 2695 2907 1663 2461 4437 8360 11271 10642 8106 5920 4528 5248 4945 6209 6508 4882
8667 4882 9059 10695 7124 5393 1359 4064 8815 13802 12585 6091 5119 7966 6362 6346 8632 9712
8651 9712 6020 7023 7026 6638 1932 -1691 -5551 -4670 1504 7049 7190 8028 3499 -1172 130 1081 6210
8634 6210 12478 11619 8564 6283 6493 -1353 -156 -1213 550 5394 9973 6050 6554 10182 9641 10631
8618 10631 11015 10565 13323 16734 11829 14880 19725 19049 17668 15247 12391 10801 11964 12058 15229 13741
$$ packed form
8732f70k28k740K715M211L431j65n29J930J886m216j504R17N22n75L95m4j652
8715C684k655K083L21j607k056J12j034n19N16M445J940N54m14j069j27L256J323
8698H753k943j264J736J205K053m946p106l416N25M493J185o50j130L357K215
8683D067j372K12j244P98J976L923K911o29k536k186j392P20l03J264K99j626
8667D882M177J636l571j731m034K705M751M987j217o494r72K847j604j6K286J080
8651I712l692J003Ll88m706l623l860Q81O174N545J41Q38m529m671J302R51N129
8634F210O268q59l055k281K10p846J197j057J763M844M579l923N04L628n41R90
8618A0631L84m50K758L411m905L051M845o76j381k421k856j590J163R4L171j488
$$ plain form
8602 13741 6282 3676 6970 8549 13704 16896 18736 21669 25443 25578 26877 23739 23968 25036 29501
8587 29501 31141 30887 27009 29420 36423 38222 41563 42458 43022 50189 54810 64262 68607 71983 71411 72800
8571 72800 74447 71916 61983 52810 44679 35316 29750 29079 22735 21827 21441 23747 19770 12606 9058
8556 9058 10706 9844 5352 3188 4506 4604 2857 4669 6420 7647 6476 5532 6627 7504 3617 -39
8540 -39 -2158 1280 7097 9714 14053 11026 7114 7884 12334 13054 10088 974 -3402 -5016 -5175 278
8524 278 6232 3823 60 652 -1087 834 8176 8156 5157 6552 10421 11926 7681 5032 7658 6854
8508 6854 1543 -1163 -951 1127 792 4015 4638 3593 -507 -2486 1821 2286 4092 5141 5463 5536 4086
8491 4086 -839 1697 4957 6535 5630 6333 5398 3494 3715 7175 5041 -170 -64 -1396 1359 6185
$$ packed form
8602A3741p459k606L294J579N155L192J840K933L774J35J299l138K29J068M465
8587B9501J640k54l878K411P003J799L341Q95N64P167M621R452M345L376n72J389
8571G2800J647k531r933r173q131r363n566o71o344r08l86K306l977p164l548
8556I058J648q62m492k164J318R8j747J812J751J227j171r44J095Q77l887l656
8540c9k119L438N817K617M339l027l912P70M450P20k966r114m376j614j59N453
8524B78N954k409l763N92j739J921P342k0k999J395L869J505m245k649K626q04
8508F854n311k706K12K078l35L223O23j045m100j979M307M65J806J049L22P3j450
8491D086m925K536L260J578r05P03r35j904K21L460k134n211J06j332K755M826
$$ plain form
8475 6185 3849 -2924 -1556 520 457 253 2451 4945 1549 1066 -2111 -4607 -2796 4470 5075 1316
8459 1316 -1006 1158 -564 -4409 -1619 -586 -790 3193 6667 7291 5670 -2324 -1753 1961 5349 4779
8443 4779 3122 3109 3242 1115 1996 2120 2134 -780 1424 1715 -2029 -3810 -624 -1957 -1404 389 2696
8426 2696 -75 546 1365 1938 -220 -643 -2658 -4607 -3024 -3904 -2229 -849 4308 5057 4630 3079 900
8409 900 -1733 683 2671 6054 7245 1863 1149 -1615 -179 1049 705 2769 5153 7131 3568 5523
8393 5523 5085 1625 203 2700 5318 196 2061 4939 9276 6196 4419 6381 4038 -1170 -4465
8378 -4465 -6569 -4532 69 6389 7873 4808 1920 1406 2031 -2190 -2475 -4021 -1497 -8 1358 4412
8362 4412 -2570 -7537 -5235 -4789 -8205 -6450 -3605 -993 1646 3024 3707 4407 3411 2977 1479 -1893
$$ packed form
8475F185k336o773J368K076o3k04K198K494l396m83l177k496J811P266O05l759
8459A316k322K164j722l845K790J033k04L983L474O24j621p994N71L714L388n70
8443D779j657j3J33k127Q81J24J4k914K204K91l744j781L186j333N53J793K307
8426B696k771O21Q19N73k158m23k015j949J583q80J675J380N157P49m27j551k179
8409I00k633K416J988L383J191n382p14k764J436J228l44K064K384J978l563J955
8393E523m38l460j422K497K618n122J865K878M337l080j777J962k343n208l295
8378d465k104K037M601O320J484l065k888n14O25m221k85j546K524J489J366L054
8362D412o982m967K302M46l416J755K845K612K639J378O83P00r96m34j498l372
$$ plain form
8346 -1893 -1869 -799 -1143 -3710 -6332 -4489 -4589 -10817 -10253 -5102 -1914 229 2528 -1763 226 3971
8330 3971 4165 327 -2406 -1342 3494 4766 5210 2811 4292 3374 -2904 -8114 -4634 -502 1232 179
8314 179 -639 2119 7907 5192 3070 4137 1601 459 -1745 -4037 -1022 -1276 -245 -767 -3786 -2945
8298 -2945 -4247 957 6750 3947 -183 -5755 -6336 -313 701 616 -3935 -8370 -7659 -6297 -4637 -4870
8282 -4870 -2478 5048 9262 4018 -1299 -6123 -6966 -4137 -865 -738 2947 -160 -3837 -86 604 3508
8266 3508 5520 3077 1707 -398 1630 5527 4283 1010 3703 5676 8032 9960 9122 4306 4502
8251 4502 842 1434 2552 4302 2400 -1551 1732 2221 -872 -5519 -4793 -1515 -1208 1904 1490 -2414
8235 -2414 -3420 -5693 -9342 -6485 2398 4212 622 -6881 -6662 -1978 -184 -3120 -5063 -5808 -4177
$$ packed form
8346a893K4J070l44k567k622J843j00o228N64N151L188K143K299m291J989L745
8330C971J94l838k733J064M836J272M44k399J481r18o278n210L480M132J734j053
8314A79q18K758N788k715k122J067k536j142k204k292L015k54J031n22l019Q41
8298b945j302N204N793k803m130n572n81O023J014q5m551m435P11J362J660k33
8282d870K392P526M214n244n317m824q43K829L272J27L685l107l677L751O90K904
8266C508K012k443j370k105K028L897j244l273K693J973K356J928q38m816J96
8251D502l660N92J118J750j902l951L283M89l093m647P26L278L07L112m14l904
8235b414j006k273l649K857Q883J814l590p503K19M684J794k936j943p45J631
$$ plain form
8220 -4177 -3667 -7167 -7276 -4453 -3064 -2949 -2164 3306 2148 2096 3381 2329 2756 4935 5072 -131 -5623
8203 -5623 -588 2225 3235 1680 2624 2073 0 58 1861 1026 206 406 -77 -6246 -7186 -901 1944
8186 1944 -1717 -5684 -3301 -223 2182 784 4667 3846 5080 7246 5427 7643 6520 2088 1206
8171 1206 -172 2125 2750 1914 -1279 1379 -875 478 4713 6478 7099 7128 10010 10129 7746 -1526
8155 -1526 -5937 -6191 -6030 -6300 -5130 -4426 -3227 1272 -406 -1655 1983 1169 3430 5314 6603 6987
8139 6987 3604 4890 5671 4007 3661 2350 96 2205 3159 -534 -3094 -1657 -774 -1955 -4491 -2392
8123 -2392 -988 2845 5332 4014 10977 13968 5623 -1321 -4872 -5742 -4656 -178 466 -3112 -4453
8108 -4453 5629 6667 412 -6288 -4459 -2873 -6973 -2184 2259 -842 -4073 -6548 -32 3283 2927
$$ packed form
8220d177N10l500j09K823J389J15P85N470j158n2J285j052M27K179J37n203n492
8203e623N035K813J010j555R44n51k073N8J803q35q20K00m83o169r40O285K845
8186A944l661l967K383L078K405j398L883q21J234K166j819K216j123m432q82
8171A206j378K297O25q36l193K658k254J353M235J765O21K9K882J19k383r272
8155a526m411k54J61k70J170P04J199M499j678j249L638q14K261J884J289L84
8139F987l383J286P81j664l46j311k254K109R54l693k560J437Q83j181k536K099
8123b392J404L833K487j318O963K991q345o944l551q70J086M478O44l578j341
8108d453J0082J038o255o700J829J586m100M789M443l101l231k475O516L315l56
$$ plain form
8093 2927 6001 3540 -1410 -4780 -5019 -2699 -4457 -2242 3127 4275 1764 -1843 2092 192 -1108
8078 -1108 -470 5746 6268 2525 -997 -1669 2117 -968 -8289 -6343 -406 1018 2967 3472 1610 338
8062 338 454 3532 339 -2487 -3869 -1854 -283 -1015 -6680 -11989 -10945 -6408 -5878 -349 -1814 -1525
8046 -1525 -2578 -2842 1686 2775 -949 -1244 1561 5105 9212 10265 5395 2446 133 -1016 -287 3829
8030 3829 7195 1126 -1609 -5851 -5262 -5948 -8117 -6142 -2024 -74 6010 2204 385 -4761 -5143 -5058
8014 -5058 -2692 1869 -86 4651 8215 6502 7128 3224 2505 3446 3435 1648 -1728 2706 3893 3229
7998 3229 -1935 -5044 -736 4475 6777 7854 9533 11081 12767 6878 4907 2208 -942 2486 7930
7983 7930 8694 5088 3305 2753 4484 5616 1949 1943 4363 9126 9170 8940 10589 8276 6926 3501 2844
$$ packed form
8093B927L074k461m950l370k39K320j758K215N369J148k511l607L935j900j300
8078a108O38O216N22l743l522o72L786l085p321J946N937J424J949N05j862j272
8062C38J16L078l193k826j382K015J571p32n665n309J044M537N30N529j465K89
8046a525j053k64M528J089l724k95K805L544M107J053m870k949k313j149P29M116
8030C829L366o069k735m242N89o86k169J975M118J950O084l806j819n146l82Q5
8014e058K366M561j955M737L564j713O26l904p19R41j1j787l376M434J187o64
7998C229n164l109M308N211K302J077J679J548J686n889j971k699l150L428N444
7983G930P64l606j783n52J731J132l667oK420M763M4k30J649k313j350l425o57
$$ plain form
7966 2844 3857 5742 9822 8878 7019 5938 9081 5561 1380 4203 10142 17879 17648 13419 10130
7951 10130 7259 9842 9268 7221 7708 8092 11161 16290 17526 14208 8034 10729 13122 13727 10902 9821
7935 9821 9270 10682 5372 4346 7337 4919 6006 7413 7183 4375 490 -827 -2504 -2936 -3 3481
7919 3481 3319 3143 -423 85 3389 4562 622 97 3729 5799 9221 8730 7903 8938 8118 5793 7598
7902 7598 6166 5319 1494 1141 3227 9265 9249 1017 -3302 -3178 -2139 -2827 -856 972 2139 3629
7886 3629 4899 5358 4030 -995 -1727 1035 4450 4265 3930 4397 8317 10043 11880 8778 6449 3818
7870 3818 2989 1689 -4 1641 1872 5695 9523 8069 4709 -2464 -6334 -1673 1012 2640 2116 762
7854 762 -1593 2354 2429 1145 3210 3543 4291 2444 999 -1698 -3543 -3660 -2746 -4197 -623 616 -1762
$$ packed form
7966B844J013J885M080r44j859j081L143l520m181K823N939P737k31m229l289
7951A0130k871K583n74k047M87L84L069N129J236l318o174K695K393O05k825j081
7935I821n51J412n310j026K991k418J087J407k30k808l885j317j677m32K933L484
7919C481j62j76l566N08L304J173l940n25L632K070L422m91q27J035q20k325J805
7902G598j432q47l825l53K086O038j6q232m319J24J039o88J971J828J167J490
7886C629J270M59j328n025p32K762L415j85l35M67L920J726J837l102k329k631
7870C818q29j300j693J645K31L823L828j454l360p173l870M661K685J628n24j354
7854G62k355L947P5j284K065L33P48j847j445k697j845j17R14j451L574J239k378
$$ plain form
7837 -1762 -6498 -5967 -5620 -4901 -2785 -3215 -1887 -5547 -12124 -11893 -6254 -5587 -6395 -4955 1931 5042 4578
7820 4578 4023 5555 5621 4697 8050 5702 4794 6870 2849 -340 -1987 -4221 -1889 -875 -3628 -6710
7804 -6710 -6994 -3468 -7071 -7128 -5405 -4523 -3417 227 -916 -1186 -1594 -165 4 -442 -883 295 2433
7787 2433 2714 3534 3542 4507 3982 1702 -939 -320 -2185 -6487 -3288 -852 -1973 -1756 -2638 -1717 -2241 -4226
7769 -4226 -7836 -2370 1995 -1130 2660 3127 2273 1865 235 2620 811 -2273 -5145 -5755 -3076 -304
7753 -304 1297 376 1531 981 -7305 -12829 -9328 -7227 -10022 -13546 -9530 -6516 -6387 -6709 -6630 -11090 -13649
7736 -13649 -10583 -5122 -548 340 2596 -938 772 421 -3195 -3791 1170 6171 9329 8117 13060
7721 13060 14309 4823 -2932 -2395 829 3214 2141 -2106 -913 3954 5124 2719 332 3592 3561
$$ packed form
7837a762m736N31L47P19K116m30J328l660o577K31N639O67q08J440O886L111m64
7820D578n55J532O6r24L353k348r08K076m021l189j647k234K332J014k753l082
7804f710k84L526l603n7J723Q82J106L644j143k70m08J429J69m46m41J178K138
7787B433K81Q20QR65n25k280k641O19j865m302L199K436j121K17q82R21n24j985
7769d226l610N466M365l125L790M67q54m08j630K385j809l084k872o10K679K772
7753c04J601r21J155n50q286n524L501K101k795l524M016L014J29l22P9m460k559
7736a3649L066N461M574Q88K256l534J710l51l616n96M961N001L158j212M943
7721A3060J249r486p755N37L224K385j073m247J193M867J170k405k387L260l1
$$ plain form
7706 3561 340 1264 5783 4058 422 -2685 -492 2326 3146 984 -3678 -8401 -8751 -9540 -3647 3742
7690 3742 555 1985 11614 6038 -2867 -2031 1839 1039 -2727 -1052 -635 947 1293 -1867 -3865 -3173
7674 -3173 2178 8944 8669 8371 2415 3030 4930 2307 -134 -1220 -1464 830 -1393 -4369 -5892 -4979
7658 -4979 -2585 -381 3744 1772 1489 3204 -251 -2904 -4529 -8207 -10479 -7033 -4016 -2517 -1527
7643 -1527 2097 2391 1931 595 -2542 -6549 -8657 -6210 -3781 -638 -2122 -7863 -5868 -5936 -7615 -2851
7627 -2851 -443 3099 2980 2281 189 111 -1787 -7137 -8723 -4624 -2046 -2647 1304 2170 -2402 -1836 -67
7610 -67 -725 -8200 -8792 -5619 -7904 -10017 -9247 -9284 -12307 -12004 -5526 -512 4531 5668 1886 1736 2870
7593 2870 -2439 -4134 -5207 -4935 -2865 1032 815 -2829 -4573 -3878 3839 1229 -522 -127 1550 3240
$$ packed form
7706C561l221R24M519j725l636l107K193K818Q20k162m662m723l50p89N893P389
7690C742l187J430R629n576q905Q36L870q00l766J675M17J582L46l160j998O92
7674c173N351O766k75k98n956O15J900k623k441j086k44K294k223k976j523R13
7658d979K394K204M125j972k83J715l455k653j625l678k272L446L017J499R90
7643a527L624K94m60j336l137m007k108K447K429L143j484n741J995o8j679M764
7627b851K408L542j19o99k092p8j898n350j586M099K578o01L951Q66m572N66J769
7610f7o58p475n92L173k285k113P70l7l023L03O478N014N043J137l782j50J134
7593B870n309j695j073K72K070L897k17l644j744O95P717k610j751L95J677J690
$$ plain form
7577 3240 364 -2327 -3524 -2298 -4659 -6259 -5226 -7869 -7530 -4737 -3694 -2737 -3580 -4030 -3094 -5395
7561 -5395 -10151 -9839 -5254 -1376 -5549 -8654 -5832 -6561 346 3598 7578 6048 2041 1356 265 1742
7545 1742 -89 -348 1403 4225 2855 2251 4516 2064 3968 3376 3751 2018 3799 1596 3052 38
7529 38 98 -860 2227 5061 644 -5646 -7428 -7500 -4150 -3869 -8614 -7819 -3499 3200 6197 6162 12561 11719
7511 11719 9416 8463 3811 1657 -1255 -6307 -11050 -11791 -9252 -4998 -1938 -2843 -10005 -15485 -15485 -15530 -12980
7494 -12980 -15293 -16889 -11050 -5675 -6603 -7402 -4740 69 199 -2528 -6394 -10563 -10064 -4953 -3787 -5795
7478 -5795 -5688 -966 -1682 246 -195 -845 -4477 -2957 1912 3601 2479 -229 -1641 -200 1792 -918
7462 -918 -2421 -6236 -5565 -4738 -11216 -13391 -12549 -9850 -6624 -3890 -2250 -3887 -5106 -6316 -4959 -5332
$$ packed form
7577C240k876k691j197J226k361j600J033k643L39K793J043R57q43m50R36k301
7561e395m756L12M585L878m173l105K822p29O907L252L980j530m007o85j091J477
7545A742j831k59J751K822j370o04K265k452J904n92L75j733J781k203J456l014
7529C8O0r58L087K834m417o290j782p2L350K81m745P95M320O699K997l5O399q42
7511A1719k303r53m652k154k912n052m743p41K539M254L060r05p162n480%m5K550
7494a2980k313j596N839N375r28p99K662M809J30k727l866m169M99N111J166k008
7478e795J07M722p16J928m41o50l632J520M869J689j122k708j412J441J992k710
7462i18j503l815O71Q27o478k175Q42K699L226K734J640j637j219j210J357l73
$$ plain form
7446 -5332 -7820 -3778 -5335 -7442 -3223 269 -5895 -10468 -10036 -8712 -4357 -4022 -4063 -4797 -2581 -2701
7430 -2701 -1711 1943 4933 8205 5639 996 276 -977 432 251 -111 -1608 608 -2537 -1472 3231
7414 3231 691 -1798 -3509 122 1874 854 -362 -1295 -2570 -5627 -3957 446 2354 3157 5720
7399 5720 9098 10357 7013 3742 1488 2774 4582 871 -4415 -1960 2161 -457 -100 2781 3469
7384 3469 2374 1650 -697 -3188 3696 10536 10793 6488 -514 -2425 -1738 3229 2865 2726 -3319 426
7368 426 2195 -2321 -4304 -3015 -1369 -1738 -699 -1222 -1852 -788 -2343 -8550 -9410 -5514 -1202 -3199
7352 -3199 -5370 -5177 -3229 -853 -1880 290 2217 1409 -1604 -8172 -11550 -10778 -13324 -9323 -3930 -387
7336 -387 2529 5132 2456 -993 -5487 -3238 -239 1934 1008 -828 -3121 -466 809 454 -941 -190
$$ packed form
7446e332k488M042j557k107M219L492o164m573M32J324M355L35m1p34K216j20
7430b701R90L654K990L272k566m643p20j253J409j81l62j497K216l145J065M703
7414C231k540k489j711L631J752j020j216r33j275l057J670M403J908Q03K563
7399E720L378J259l344l271k254J286J808l711n286K455M121k618L57K881O88
7384C469j095p24k347k491O884O840K57m305p002j911O87M967l64j39o045L745
7368D26J769m516j983J289J646l69J039n23o30J064j555o207q60L896M312j997
7352c199k171J93J948K376j027K170J927q08l013o568l378P72k546M001N393L543
7336c87K916K603k676l449m494K249K999K173r26j836k293K655J275l55j395P51
$$ plain form
7320 -190 -719 949 4924 1474 -1703 1564 197 -2889 -1327 1578 1623 -803 1288 1593 -1613 -5075
7304 -5075 -7417 -5847 -8042 -5509 -719 508 1318 -391 238 6344 6766 4154 3670 221 -1362 -3385
7288 -3385 -3242 -2224 -534 499 -1076 -925 -1953 -3998 -9076 -7374 -1325 -6046 -3839 -3360 -279 3579
7272 3579 5452 5706 6622 3454 1290 712 -136 -1359 -312 1788 4695 362 -2779 -543 -2976 -2042
7256 -2042 -35 -5543 -6392 -1236 2475 2150 288 1631 5455 4138 4897 7832 10709 9726 6895 3111
7240 3111 -181 171 971 -353 -180 1303 2068 4709 -401 -5709 -7525 -3980 3314 1192 -4354 -1795
7224 -1795 1814 5395 8065 3940 -4285 -5140 -4274 -5296 -4892 -3115 -2264 -1468 -581 -2612 -4453 -2484
7208 -2484 -2663 -1715 -865 1883 156 -2190 -3310 -3908 -3884 3908 4518 2272 -1442 -5363 -8854 -8152 -5244
$$ packed form
7320a90n29J668L975l450l177L267j367l086J562K905M5k426K091L05l206l462
7304e075k342J570k195K533M790J227Q10j709O29O106M22k612m84l449j583k023
7288c385J43J018J690J033j575J51j028k045n078J702O049m721K207M79L081L858
7272C579J873K54R16l168k164n78q48j223J047K100K907m333l141K236k433R34
7256b042K007n508q49N156L711l25j862J343L824j317P59K935K877r83k831l784
7240C111l292L52Q00j324J73J483P65K641n110n308j816L545P294k122n546K559
7224a795L609L581K670m125q225q55Q66j022M04J777Q51P96Q87k031j841J969
7208b484j79R48Q50K748j727k346j120n98K4P792O10k246l714l921l491P02K908
$$ plain form
7191 -5244 -844 -3779 -3508 -1772 2270 2849 1831 1747 2129 -172 -992 769 2555 4508 -1661 -4138
7175 -4138 -4711 -6111 -6854 -9707 -9914 -10225 -9768 -10639 -5578 -1218 -4430 -3535 2185 2890 838 -1033 3972
7158 3972 5573 1018 -1356 -2000 -9643 -13447 -14367 -12611 -11479 -14236 -10720 -3940 -3279 -3788 -1053 -1777
7142 -1777 -5322 -6117 -5235 -7016 -8749 -10181 -12439 -7649 -4066 -2998 1674 4862 10097 12189 7304
7127 7304 3373 1956 -1492 -4280 -5432 -5086 -2756 -6536 -9610 -7494 -6003 -4290 -649 3330 6597
7112 6597 7507 4015 1240 2900 7521 3455 1260 465 -980 -2282 -8 -27 998 -2202 -820 7243
7096 7243 13623 9100 1025 201 -1012 988 1367 3716 4757 7244 6976 6242 3705 3229 801 -4104
7080 -4104 -6133 -3371 -2061 -1591 -2371 -7788 -8797 -10369 -6493 -3452 -1768 -541 462 -1888 -2170 886
$$ packed form
7191e244M400k935K71J736M042N79j018q4L82k301q20J761J786J953o169k477
7175d138n73j400p43k853k07l11M57q71N061M360l212Q95N720P05k052j871N005
7158C972J601m555k374o44p643l804r20J756J132k757L516O780O61n09K735p24
7142a777l545p95Q82j781j733j432k258M790L583J068M672L188N235K092m885
7127G304l931j417l448k788j152L46K330l780l074K116J491J713L641L979L267
7112F597R10l492k775J660M621m066k195p95j445j302K274j9J025l200J382Q063
7096G243O380m523q075q24j213K000L79K349J041K487k68p34k537m76k428m905
7080d104k029K762J310M70p80n417j009j572L876L041J684J227J003k350k82L056
$$ plain form
7064 886 -987 -1321 480 55 -131 -3001 -5604 -7079 -5044 -4259 -2249 -6917 -10238 -8850 -6963 -8287
7048 -8287 -2041 1506 -2438 1843 6623 6180 2119 -821 -3218 -9208 -12183 -10858 -6204 455 3128
7033 3128 -3677 -6045 -5223 -6416 -10606 -2536 2245 595 -173 -3372 -6480 -6092 2226 2515 5334 4930
7017 4930 7127 3307 -2822 -4340 -213 370 -2929 -4251 -4002 -1560 -62 4103 3276 -3823 -1488 866
7001 866 -2480 3605 7791 4841 898 308 2717 2718 19 1459 3171 90 -2157 -1776 197 4522
6985 4522 2009 -5908 -6706 -4713 -3221 1488 -2325 -2271 1669 2023 -1904 -5328 -2733 -2377 -1896 -163
6969 -163 -789 -3139 -3021 -2886 -4712 -9759 -7883 -9563 -3682 4870 4450 4357 7878 5829 1267 -3735 -664
6952 -664 1715 88 -1182 1279 1997 919 2561 1768 262 -2960 -3971 -1861 3606 2331 5383 6756
$$ packed form
7064H86j873l34J801m25j86k870k603j475K035P85K010m668l321J388J887j324
7048h287O246L547l944M281M780m43m061k940k397n990k975J325M654O659K673
7033C128o805k368Q22j193m190Q070M781j650p68l199l108L88Q318K89K819m04
7017D930K197l820o129j518M127N83l299j322K49K442J498M165q27p099K335K354
7001H66l346O085M186k950l943n90K409Jk699J440J712l081k247L81J973M325
6985D522k513p917p98J993J492M709l813N4L940L54l927l424K595L56M81J733
6969a63o26k350J18J35j826n047J876j680N881Q552m20r3L521k049m562n002L071
6952f64K379j627j270K461P18j078J642p93j506l222j011K110N467j275L052J373
$$ plain form
6936 6756 3146 1445 -45 -3077 -4000 -7829 -10182 -8300 -7432 -9750 -7038 -2776 -2198 -2230 -1658 -4610
6920 -4610 -7341 -4381 -2370 -1774 -1094 3427 3458 -977 -5619 -6426 -3441 606 3467 378 -6538 -10056
6904 -10056 -14242 -8958 -6620 -7075 -3760 -956 -1656 -2174 -2051 -6549 -8740 -2119 -1208 -148 3274 4112
6888 4112 4673 -630 -6839 -5393 -3496 -5066 -3037 3970 4814 -224 -2493 848 2249 1037 -123
6873 -123 -836 1969 1957 1443 -1535 1389 6139 11088 9752 9649 8049 11058 8510 8198 2553 -2909 -4079
6856 -4079 1134 4004 4126 -3425 -7359 -5214 -6719 -7592 -3335 74 1639 1184 830 5396 5986 6612
6840 6612 4846 2003 -1326 -2014 -966 -646 -148 169 950 -307 -2349 -1380 3176 4635 2660 -1890
6824 -1890 -506 -999 -2527 -4368 -2400 -667 -4820 -7534 -7893 -4152 -2035 -593 1144 1137 -480 -295
$$ packed form
6936F756l610j701j490l032r23l829k353J882Q68k318K712M262N78l2N72k952
6920d610k731K960K011N96O80M521L1m435m642q07K985M047K861l089o916l518
6904a0056m186N284K338m55L315K804p00n18J23m498k191O621R11J060L422Q38
6888D112N61n303o209J446J897j570K029P007Q44n038k269L341J401j212j160
6873a23p13K805j2n14k978K924M750M949j336j03j600L009k548l12n645n462j170
6856d079N213K870J22p551l934K145j505q73M257L409J565m55l54M566N90O26
6840F612j766k843l329o88J048L20M98L17P81j257k042R69M556J459j975m550
6824a890J384m93j528j841J968J733m153k714l59L741K117J442J737pj617J85
$$ plain form
6808 -295 3521 7083 8177 7478 2400 5812 5602 2656 -1073 1583 683 1606 4849 -1325 -5534 -1459
6792 -1459 -229 -1419 -2622 -4235 -2247 -1389 -3286 -1681 -2032 -2334 -2583 -584 2232 1443 -3665 107
6776 107 2564 -2729 -4636 -5853 -7222 -3781 -3171 -3352 920 -1456 -1666 580 1130 3565 -3776 -7982
6760 -7982 -10794 -14295 -9568 -1759 1236 -129 -2201 -1478 -1392 -2328 -3967 -1400 -1588 2329 5034 4342
6744 4342 4462 3270 -437 -2278 -4452 -1620 -3296 -3040 4555 5113 3977 2432 -949 -597 830 -3537
6728 -3537 -3349 -960 2502 4379 8446 11088 13372 7012 -1587 -6034 -4592 -1087 -1100 -1301 257 3027
6712 3027 4512 6152 2723 -3089 -6348 -7228 -5655 -3338 389 3101 2597 5505 4665 -1506 -532 2347
6696 2347 3201 5809 4681 4561 3589 -801 -157 5567 4196 -2464 -1366 2557 2403 2429 3197 4186 5018
$$ packed form
6808b95L816L562J094o99n078L412k10k946l729K656r00R23L243o174m209M075
6792a459J230j190j203j613J988Q58j897J605l51l02k49J999K816p89n108L772
6776A07K457n293j907j217j369L441O10j81M272k376k10K246N50K435p341m206
6760g982k812l501M727P809K995j365k072P23Q6r36j639K567j88L917K705o92
6744D342J20j192l707j841k174K832j676K56P595N58j136j545l381L52J427m367
6728c537J88K389L462J877M067K642K284o360q599m447J442L505j3k01J558K770
6712C027J485J640l429n812l259q80J573K317L727K712n04K908q40o171R74K879
6696B347Q54K608j128j20r72m390O44N724j371o660J098L923j54K6P68R89Q32
$$ plain form
6679 5018 2603 1004 2189 2088 -882 -810 -2992 1049 4519 1147 -300 3840 5740 3489 -408 -2245
6663 -2245 -3754 512 2945 2614 591 4999 5187 657 2796 6862 6385 164 -2959 -4222 -1194 1405
6647 1405 2440 2973 2047 -277 1363 1548 999 1208 -1329 -6824 -4386 -1418 -2004 -1884 -1444 -3042 -7245
6630 -7245 -10322 -7545 -3918 -1874 -444 -3966 -6702 -3504 -3 1658 3012 1476 -2170 -773 3157
6615 3157 946 -4070 -9075 -12512 -9547 -3789 -3169 -9708 -9633 -7287 -2825 -5240 -4417 3890 9019 4675
6599 4675 1240 2200 2356 2257 56 -144 1022 -644 -2897 -704 2036 3363 2836 796 -1081 156
6583 156 -683 -3103 -5178 -3501 -5152 -2424 547 4773 4493 2100 -5202 -3842 -4159 -3560 -148 3168
6567 3168 -1275 -4437 -1641 -2256 1219 3722 1443 -2255 -6975 -4439 -3575 3172 1890 1046 1046 1220 1265
$$ packed form
6679E018k415j599J185j01k970P2k182M041L470l372j447M140J900k251l897j837
6663b245j509M266K433l31k023M408J88m530K139M066m77o221l123j263L028K599
6647A405J035N33r26k324J640J85n49K09k537n495K438K968n86J20M40j598m203
6630g245l077K777L627K044J430l522k736L198L501J661J354j536l646J397L930
6615C157k211n016n005l437K965N758O20o539P5K346M462k415Q23Q307N129m344
6599D675l435R60J56r9k201k00J166j666k253K193K740J327n27k040j877J237
6583A56q39k420k075J677j651K728K971M226k80k393p302J360l17N99L412L316
6567C168m443l162K796o15L475K503k279l698m720K536Q64O747j282q44%J74M5
$$ plain form
6550 1265 -1547 2552 5129 8689 8936 1050 -1808 -2414 -4788 -5940 -10789 -12553 -12185 -10506 -4390 -2756
6534 -2756 -2335 -1711 -4016 -5424 -2591 -1284 -3281 -1446 -308 -6113 -4726 -4069 -1821 301 -2643 4079
6518 4079 3524 -4391 -8686 -3870 -1841 -2280 -4274 -3330 -1653 -411 1653 -948 2321 2901 -253 -2445
6502 -2445 -3481 -3465 -1961 -802 -2065 -5333 -4667 -3089 -3604 -1841 -2288 -3184 -3592 -3430 -1861 1772 1207
6485 1207 -2697 -6709 -9884 -9607 -8307 -1802 3292 292 -529 -2983 -6299 -3312 1570 5108 2285
6470 2285 2096 -538 1464 3560 3103 93 -352 -116 -2530 -3519 -3846 -3390 -5246 -2350 -1179 2499 1796
6453 1796 -2673 -2123 2883 4651 1051 209 -1302 -684 2549 3927 3796 5315 5279 4167 1555 -651
6437 -651 -1541 2162 2538 -4044 -4404 677 -1726 -2898 -1279 56 26 -4121 -187 1202 3510 2765 1172
$$ packed form
6550A265k812M099K577L560K47p886k858o06k374j152m849j764L68J679O116J634
6534b756M21O24k305j408K833J307j997J835J138n805J387O57K248K122k944O722
6518D079n55p915m295M816K029m39j994R44J677J242K064k601L269N80l154k192
6502b445j036J6J504J159j263l268O66J578n15J763m47q96m08J62J569L633n65
6485A207l904m012l175K77J300O505N094l000q21k454l316K987M882L538k823
6470B285j89k634K002K096m57l010m45K36k414r89l27M56j856K896J171L678p03
6453A796m469N50N006J768l600q42j511O18L233J378j31J519l6j112k612k206
6437f51q90L703L76o582l60N081k403j172J619J335l0m147L934J389K308p45j593
$$ plain form
6420 1172 -1802 2817 7892 7726 3255 2425 2975 2083 -112 597 2825 2154 -7017 -10295 -8767 -6351
6404 -6351 -5170 -2488 62 3076 3356 3344 -1508 -7089 -4911 -1798 -3057 -3050 -813 -2421 -2918 -2858 -2117
6387 -2117 -4590 -3925 -3862 -2947 -4366 -2459 -18 2006 1780 -3262 -590 544 -2266 -2560 208 439 -2701
6370 -2701 -2852 6528 4281 -325 -3426 -6824 -5680 -3615 -6388 -8650 -6023 -4877 -6190 -6103 -5349 -2715
6354 -2715 -6401 -8689 -8971 -9895 -6637 -5870 -2310 -435 3259 3778 4654 3231 3658 402 1314 -979 -1542
6337 -1542 -2050 -4965 -4785 1226 2316 838 1937 -158 -301 1740 -626 -2153 -472 -3052 -4552 -3180
6321 -3180 -616 4308 218 -3564 -3196 2250 5930 940 2068 5980 6066 4712 801 344 -4217 -5668
6305 -5668 -8130 -7842 -6715 -6947 -3230 -1132 -1759 277 2289 1399 -1105 -2893 204 -3617 -4805 86
$$ packed form
6420A172k974M619N075j66m471q30N50q92k195P09K228o71r171l278J528K416
6404f351J181K682K550L014K80j2m852n581K178L113j259PK237j608m97O0P41
6387b117k473O65O3R15j419J907K441K024k26n042K672J134k810k94K768K31l140
6370b701j51R380k247m606l101l398J144K065k773k262K627J146j313Q7P54K634
6354b715l686k288k82r24L258P67L560J875L694N19Q76j423M27l256R12k293n63
6337a542n08k915J80O011J090j478J099k095j43K041k366j527J681k580j500J372
6321c180K564M924m090l782L68N446L680m990J128L912Q6j354l911m57m561j451
6305e668k462K88J127k32L717K098o27K036K012q90k504j788L097l821j188M891
$$ plain form
6289 86 -3364 -8689 -8101 -7845 -10512 -9561 -10195 -10435 -12294 -9176 -5677 -1980 -4304 -4888 1430 1940 1121
6272 1121 2527 -122 -804 884 220 -4126 -6217 -8680 -6926 -7846 -7090 -1253 -1548 -2968 3733 6092
6256 6092 2784 2257 1942 3171 2814 -306 -1188 1919 4819 2262 -912 -630 -2558 -1893 2054 -1015
6240 -1015 -3385 -1073 196 661 3587 3290 5031 2400 -3780 -2847 564 1789 -719 -5539 -10196 -13658
6224 -13658 -14695 -9479 -1980 -1506 -7406 -9765 -10673 -4779 -1956 -7081 -5673 -3495 -991 -2664 -5037
6209 -5037 -9425 -9432 -5760 -6205 -4343 135 624 -1673 -3637 -4851 -734 10453 11828 5998 5676 3147
6193 3147 -3738 -9100 -4758 -2327 2 2030 1065 -933 -3345 -1746 712 -1758 -1226 -1669 -3911 -4879
6177 -4879 -10333 -9369 -1797 -584 1223 2309 1296 -2747 -10093 -13933 -13395 -11323 -7776 -8341 -9182 -10032
$$ packed form
6289H6l450n325N88K56k667R51o34k40j859L118L499L697k324n84O318N10q19
6272A121J406k649o82J688o64m346k091k463J754r20P56N837k95j420O701K359
6256F092l308n27l15J229l57l120q82L107K900k557l174K82j928O65L947l069
6240a015k370K312J269M65K926k97J741k631o180R33L411J225k508m820m657l462
6224a3658j037N216P499M74n900k359r08N894K823n125J408K178K504j673k373
6209e037m388pL672m45J862M478M89k297j964j214M117J1187J375n830l22k529
6193C147o885n362M342K431K329K028r65j998k412J599K458k470N32m43k242r68
6177d879n454R64P572J213J807J086j013m043p346l840N38K072L547n65q41q50
$$ plain form
6161 -10032 -9955 -7596 -2469 985 -1106 -4652 -684 1188 -2290 -4247 -4823 -3410 -3012 -190 -930 -1081
6145 -1081 -1899 2881 4856 1582 -2885 -3978 -5951 -3076 -2801 -214 -1273 -2474 -4322 -176 2041
6130 2041 -1176 -2869 -5543 -5979 -5751 1344 -226 -2843 -2217 -3883 -2080 -2630 -1689 -2119 2983 3990
6114 3990 1292 -6503 -6049 -420 -753 -4647 -6250 -3453 -32 4585 5085 8343 7487 4014 6597 6015
6098 6015 5279 -1739 -7716 -6220 2728 7478 7815 7205 2717 -536 1043 -953 -2108 -4852 -6515 -5642
6082 -5642 -1295 -2509 352 7627 6659 2384 471 -2 -3760 -6901 -6677 -6447 -6745 -1912 -478 -1882
6066 -1882 803 -1575 225 1267 3542 5729 3506 -4109 -5785 -3481 -3890 -8106 -11169 -7704 -3206
6051 -3206 -4561 -5570 -4120 -4407 -5873 -4248 -4538 -2199 -4319 -8212 -10157 -5997 -2886 -1296 -777 2120
$$ packed form
6161a0032P7K359N127L454k091l546L968J872l478j957n76J413L98K822p40j51
6145a081q18M780J975l274m467j093j973K875K75K587j059j201j848M146K217
6130B041l217j693k674m36K28P095j570k617O26j666J803n50R41m30N102J007
6114C990k698p795M54N629l33l894j603K797L421M617N00L258q56l473K583n82
6098F015p36p018n977J496Q948M750L37o10m488l253J579j996j155k744j663Q73
6082e642M347j214K861P275r68m275j913m73l758l141K24K30k98M833J434j404
6066a882K685k378J800J042K275K187k223p615j676K304m09m216l063L465M498
6051c206j355j009J450k87j466J625k90K339k120l893j945M160L111J590N19K897
$$ plain form
6035 2120 2293 -4533 -5739 -2450 -1856 -474 5365 6919 4354 1449 -731 -5367 -438 -437 284 653 4152
6018 4152 3338 -2451 -4901 792 6078 7656 8859 7551 5206 1924 1293 -572 -2277 -3064 -1746 -2845
6002 -2845 -2081 -1687 -2199 -3337 -8674 -9075 -6277 -5590 -2245 -6375 -6955 -8246 -9946 -6018 -4469 -4719 -6461
5985 -6461 -3411 1066 -61 -4301 -7999 -4314 -1196 -1318 1985 56 1512 5731 2807 -3810 -9697
5970 -9697 -6739 -3743 -3643 996 285 -560 -3370 -2360 -357 1608 3181 1475 -3126 -2159 5701 6207
5954 6207 143 -2005 -3494 -2637 -6248 -12348 -12849 -9477 -3784 -635 3180 1694 -2524 -2890 1957 -1997
5938 -1997 -624 2065 9515 12421 10063 6312 2143 -251 -1224 1846 1820 -1151 -7766 -6111 -625 -1718
5922 -1718 2614 1951 799 4632 5238 -614 -1437 4431 2637 3297 5741 1309 987 3126 5761 4323
$$ packed form
6035B120J73o826j206L289N94J382N839J554k565k905k180m636M929JP21L69L499
6018D152q14n789k450N693N286J578J203j308k345l282o31j865j705p87J318j099
6002b845P64L94n12j138n337m01K798O87L345m130n80j291j700L928J549k50j742
5985f461L050M477j127m240l698L685L118j22L303j929J456M219k924o617n887
5970i697K958K996J00M639p11q45k810J010K003J965J573j706m601R67P860N06
5954F207o064k148j489Q57l611o100n01L372N693L149L815j486m218l66M847l954
5938a997J373K689P450K906k358l751m169k394r73L070k6k971o615J655N486j093
5922a718M332o63j152L833O06n852q23N868j794O60K444m432l22K139K635j438
$$ plain form
5906 4323 2842 -1933 -3890 2382 6404 6763 3400 4810 4042 104 2239 2130 -979 1627 1664 1390
5890 1390 1725 -2789 -6547 -3140 1862 1506 -1993 -747 -3324 -4005 176 2421 -374 -1926 771 3352
5874 3352 1354 2301 2612 -436 -2069 -109 -4187 -2323 2112 106 -1762 -3205 -3592 -1935 -3091 112
5858 112 2021 -1535 -3933 -746 -1791 -3619 -2014 -633 -28 950 1065 1084 1147 -237 -5167 -6223 -4268
5841 -4268 -1502 -3155 -2576 -1618 -931 -3992 -4997 768 -974 -4252 -5620 -7119 -7443 -7170 -2855 -1918
5825 -1918 -2913 -3887 -363 2872 4505 -519 -2992 -2835 -1394 -3326 -9217 -5170 1265 2109 -2450 -4221
5809 -4221 -1538 996 176 -5299 -10854 -12925 -11364 -11308 -9764 -6680 -6719 -9028 -4487 641 2293 -620
5793 -620 -4066 -6088 -4372 238 2107 2151 1264 -4096 -6576 -4396 -4365 -7172 -4121 416 -435 -3879 -932
$$ packed form
5906D323j481m775j957O272M022L59l363J410p68l938K135j09l109K606L7k74
5890A390L35m514l758L407N002l56l499J246k577o81M181K245k795j552K697K581
5874C352j998R47L11l048j633J960m078J864M435k006j868j443l87J657j156L203
5858A12J909l556k398L187j045j828J605J381O05R78J15J9O3j384m930j056J955
5841d268K766j653N79R58O87l061j005N765j742l278j368j499l24K73M315R37
5825a918r95r74L524L235J633n024k473J57J441j932n891M047O435Q44m559j771
5809d221K683K534q20n475n555k071J561N6J544L084l9k309M541N128J652k913
5793f20l446k022J716M610J869M4q87n360k480K180L1k807L051M537q51l444K947
$$ plain form
5776 -932 1532 1597 -3234 -4380 -3313 1049 119 -64 217 -799 -1437 -4973 -4499 -253 -1481 1817 2714
5759 2714 -2812 -8887 -7356 -7223 -6584 -8341 -9639 -11707 -17488 -15367 -11406 -6985 -3571 -3915 941 7103
5743 7103 6196 6466 8794 7019 2305 1064 -253 2040 2560 -410 -3291 -2891 259 2589 3247 -2060
5727 -2060 -3045 -4271 -6967 -7612 -8442 -9189 -6123 -6086 -7280 -4458 11 -981 -135 -2122 -8056 -3943 -2134
5710 -2134 -1334 -1895 689 -272 1036 1664 -3691 -3345 -1564 -2740 -2605 -1267 -2042 -893 2236 980 -3774
5693 -3774 -3948 -6756 -7230 -8397 -7372 -4785 2105 -1128 -2922 -2956 -5867 -8077 -10146 -7299 -2789 -4831
5677 -4831 -3863 -1558 -2223 -58 -4586 -8211 -7994 -6336 -4734 -8925 -12973 -9746 -10660 -9907 -6567 -3446
5661 -3446 -4007 -6117 -4033 2044 4024 3831 6017 5523 4979 6045 4848 842 -4972 -9512 -12300 -10472
$$ packed form
5776i32K464O5m831j146J067M362r30j83K81j016o38l536M74M246j228L298Q97
5759B714n526o075J531J33O39j757j298k068n781K121L961M421L414l44M856O162
5743G103r07K70K328j775m714j241j317K293N20k970k881M00L150K330O58n307
5727b060r85j226k696o45q30p47L066L7j194K822M469r92Q46j987n934M113J809
5710b134Q00n61K584r61J308O28n355L46J781j176J35J338p75J149L129j256m754
5693c774j74k808m74j167J025K587O890l233j794l4k911k210k069K847M510k042
5677d831R68K305o65K165m528l625K17J658J602m191m048L227r14P53L340L121
5661c446n61k110K084O077J980j93K186m94n44J066j197m006n814m540k788J828
$$ plain form
5645 -10472 -5741 1455 1434 1726 4415 6987 5149 3956 3098 243 -2254 781 5453 9397 10947 6241
5629 6241 4941 9179 7608 3770 211 -1682 1847 1908 -1388 -5157 -8468 -3376 1187 2006 4930 7900
5613 7900 5984 5118 5914 5165 3579 3212 3226 5186 2944 -1509 -4926 -5603 -2804 122 2618 1409 -583
5596 -583 -1468 -5267 -3077 -3590 138 4106 2253 329 169 3139 2198 2306 946 201 -4073 -6417 -1977
5579 -1977 -2710 -3654 -2248 -1340 -2484 967 2409 3208 8156 10299 8386 4903 517 -5442 -6372 -385
5563 -385 -1366 -4367 -6300 -3175 -298 479 -617 4638 3704 -3455 -1569 1037 -1918 -4729 -7044 -6319
5547 -6319 -8580 -11073 -11594 -9655 -5316 -5306 -6576 -4893 -6846 -7236 -7465 -4857 -10081 -13006 -10957 -7883
5531 -7883 -9420 -9021 894 7225 7447 6712 6248 5450 3251 540 -4372 -5259 -8440 -4211 2839 -319
$$ packed form
5645a0472M731P196k1K92K689K572j838j193q58k855k497L035M672L944J550m706
5629F241j300M238j571l838l559j893L529O1l296l769l311N092M563Q19K924K970
5613G900j916q66P96p49j586l67J4J960k242m453l417o77K799K926K496j209j992
5596e83q85l799K190n13L728L968j853j924j60K970r41J08j360p45m274k344M440
5579a977p33r44J406R08j144L451J442P99M948K143j913l483m386n959r30N987
5563c85r81l001j933L125K877P77j096N255r34p159J886K606k955k811k315P25
5547f319k261k493n21J939M339J0j270J683j953l90k29K608n224k925K049L074
5531g883j537L99R915O331K22p35m64p98k199k711m912q87l181M229P050l158
$$ plain form
5515 -319 3539 2914 322 2436 742 -848 -2382 -3213 -878 -2409 -2702 -7825 -7087 -3552 2823 2419
5499 2419 -6161 -5092 -3744 -3789 -7466 -11001 -11369 -7079 -8980 -16383 -16616 -10365 -2010 -4048 -10289 -14627
5483 -14627 -9149 -6367 -6690 -12032 -16254 -10916 -7273 -9543 -6974 724 -486 1307 -1540 -2273 -607
5468 -607 -1047 -1949 -3773 -5116 -3358 -1431 1233 2801 4590 3439 -221 -848 -564 134 -2172 -4695
$$ packed form
5515c19L858o25k592K114j694j590j534q31K335j531k93n123P38L535O375m04
5499B419q580J069J348m5l677l535l68M290j901p403k33O251Q355k038o241m338
5483a4627N478K782l23n342m222N338L643k270K569P698j210J793k847p33J666
5468f07m40r02j824j343J758J927K664J568J789j151l660o27K84O98k306k523
$$ [...]
##END NTUPLES=NMR SPECTRUM
##END=
