##TITLE=Analysis number 327778
Compound Code sp 00291
Book Reference 197114
Project Code adrs flro3
Chemist Name jom
##JCAMPDX= 6.0         $$ Bruker NMR JCAMP-DX V2.0
##DATA TYPE= NMR SPECTRUM
##DATA CLASS= NTUPLES
##ORIGIN= Bruker BioSpin GmbH
##OWNER= nmr
$$ XWIN-NMR		Version 3.5
$$ Thu Apr  5 09:39:38 2007 GMT Daylight Time (UT+1h)  MAYBRIDGE\nmr@NMR_250MHZ
##.OBSERVE FREQUENCY= 250.131544655141
##.OBSERVE NUCLEUS= ^1H
##.ACQUISITION MODE= SIMULTANEOUS (DQD)
##.ACQUISITION SCHEME= undefined
##.AVERAGES= 16
##.DIGITISER RES= 18
##SPECTROMETER/DATA SYSTEM= dpx250
##.PULSE SEQUENCE= zg30
##.SOLVENT NAME= DMSO
##.SHIFT REFERENCE= (INTERNAL, DMSO, 0, 16.522)
##AUDIT TRAIL= $$ (NUMBER, WHEN, WHO, WHERE, WHAT)
$$ ##TITLE= Audit trail, XWIN-NMR		Version 3.5
$$ ##JCAMPDX= 5.01
$$ ##ORIGIN= Bruker BioSpin GmbH
$$ ##OWNER= nmr
$$ C:\u/data/dgb/nmr/ADRS/620/pdata/1/auditp.txt
$$ ##AUDIT TRAIL=  $$ (NUMBER, WHEN, WHO, WHERE, WHAT)
(   1,<2007-04-05 09:39:03.05 +100>,<MAYBRIDGE\nmr>,<NMR_250MHZ>,
      <created by zg, POWCHK disabled, PULCHK disabled
       configuration hash MD5:
       49 4B E0 1D 92 C2 6B 37 9F E6 65 BC 52 41 86 1D
       data hash MD5: 64K
       9D A4 8E 88 BD 76 1F 3F FB D5 E0 B2 4E 6B 38 17>)
(   2,<2007-04-05 09:39:21.75 +100>,<MAYBRIDGE\nmr>,<NMR_250MHZ>,
      <Start of raw data processing
       ef LB = 0.3 FT_mod = 6 PKNL = 1 SI = 32K 
       data hash MD5: 32K
       37 DC 1C 6A 7E 4F 48 4B 1A 40 6A CE 68 97 62 B0>)
(   3,<2007-04-05 09:39:26.41 +100>,<MAYBRIDGE\nmr>,<NMR_250MHZ>,
      <apk 
       data hash MD5: 32K
       92 51 7D 39 B6 2C 78 A0 DA B2 4D 47 3A CC 98 E9>)
(   4,<2007-04-05 09:39:28.08 +100>,<MAYBRIDGE\nmr>,<NMR_250MHZ>,
      <abs ABSG = 5 
       data hash MD5: 32K
       EF B6 66 B0 27 4D 5C 07 11 59 B8 56 FC 59 09 05>)
$$ ##END=
$$ 
$$ hash MD5
$$ A4 D6 D3 13 2E 80 51 67 95 D2 59 E3 2E C0 6A 69
##$RELAX= 
##$RELAX= 
##$RELAX= 
##$RELAX= 
##$RELAX= 
##$RELAX= 
##$RELAX= 
$$ Bruker specific parameters
$$ --------------------------
##$DU= <C:\u>
##$EXPNO= 620
##$NAME= <ADRS>
##$PROCNO= 1
##$TYPE= <nmr>
##$USER= <dgb>
##$AMP= (0..31)
100 100 100 100 100 100 100 100 100 100 100 100 100 100 100 100 100 100 
100 100 100 100 100 100 100 100 100 100 100 100 100 100 
##$AQSEQ= 0
##$AQ_mod= 3
##$AUNM= <au_zg>
##$AUTOPOS= <6 >
##$BF1= 250.13
##$BF2= 250.13
##$BF3= 250.13
##$BF4= 250.13
##$BF5= 500.13
##$BF6= 500.13
##$BF7= 500.13
##$BF8= 500.13
##$BYTORDA= 1
##$CFDGTYP= 0
##$CFRGTYP= 5
##$CHEMSTR= <none>
##$CNST= (0..31)
1 1 145 1 1 1 1 1 1 1 1 1 1 1 1 1 1 1 1 1 1 1 1 1 1 1 1 1 1 1 1 1 
##$CPDPRG= <>
##$CPDPRG1= <>
##$CPDPRG2= <>
##$CPDPRG3= <>
##$CPDPRG4= <mlev>
##$CPDPRG5= <mlev>
##$CPDPRG6= <mlev>
##$CPDPRG7= <mlev>
##$CPDPRG8= <mlev>
##$CPDPRGB= <>
##$CPDPRGT= <>
##$D= (0..31)
0 1 0 0 0 0 0 0 0 0.06 0 0 0 0 0 0 0.0002 0 0 0 0 0 0 0 0 0 0 0 0 0 0 
0 
##$DATE= 1175762337
##$DBL= (0..7)
120 120 120 120 120 120 120 120 
##$DBP= (0..7)
150 150 150 150 150 150 150 150 
##$DBP07= 0
##$DBPNAM0= <>
##$DBPNAM1= <>
$$ [...]
##$SUBNAM7= <"">
##$SUBNAM8= <"">
##$SUBNAM9= <"">
##$SW= 20.6930455092707
##$SWIBOX= (0..15)
0 0 3 0 0 0 0 0 0 0 0 0 0 0 0 0 
##$SW_h= 5175.983436853
##$TD= 65536
##$TD0= 1
##$TE= 683.16
##$TE2= 300
##$TE3= 300
##$TEG= 300
##$TL= (0..7)
0 120 120 120 120 120 120 120 
##$TP= (0..7)
150 150 150 150 150 150 150 150 
##$TP07= 0
##$TPNAME0= <>
##$TPNAME1= <>
##$TPNAME2= <>
##$TPNAME3= <>
##$TPNAME4= <>
##$TPNAME5= <>
##$TPNAME6= <>
##$TPNAME7= <>
##$TPOAL= (0..7)
0.5 0.5 0.5 0.5 0.5 0.5 0.5 0.5 
##$TPOFFS= (0..7)
0 0 0 0 0 0 0 0 
##$TUNHIN= 0
##$TUNHOUT= 0
##$TUNXOUT= 0
##$USERA1= <user>
##$USERA2= <user>
##$USERA3= <user>
##$USERA4= <user>
##$USERA5= <user>
##$V9= 5
##$VALIST= <valist>
##$VCLIST= <CCCCCCCCCCCCCCC>
##$VD= 0
##$VDLIST= <DDDDDDDDDDDDDDD>
##$VPLIST= <PPPPPPPPPPPPPPP>
##$VTLIST= <TTTTTTTTTTTTTTT>
##$WBST= 1024
##$WBSW= 4
##$XGAIN= (0..3)
0 0 0 0 
##$XL= 0
##$YL= 0
##$YMAX_a= 195759
##$YMIN_a= -267398
##$ZGOPTNS= <>
##$ZL1= 120
##$ZL2= 120
##$ZL3= 120
##$ZL4= 120
##$ABSF1= 16.522
##$ABSF2= -4.171173
##$ABSG= 5
##$ABSL= 3
##$ALPHA= 0
##$AQORDER= 0
##$ASSFAC= 0
##$ASSFACI= 0
##$ASSFACX= 0
##$ASSWID= 0
##$AUNMP= <proc_1d>
##$AZFE= 0.1
##$AZFW= 0.1
##$BCFW= 0
##$BC_mod= 0
##$BYTORDP= 0
##$COROFFS= 0
##$CY= 12.5
##$DATMOD= 1
##$DC= 0
##$DFILT= <>
##$DTYPP= 0
##$F1P= 14.0000005364418
##$F2P= -0.99999901652339
##$FCOR= 0.5
##$FTSIZE= 32768
##$FT_mod= 6
##$GAMMA= 0
##$GB= 0
##$INTBC= 1
##$INTSCL= 1
##$ISEN= 128
##$LB= 0.3
##$LEV0= 0
##$LPBIN= 0
##$MAXI= 10000
##$MC2= 0
##$MEAN= 0
##$ME_mod= 0
##$MI= 0
##$NCOEF= 0
##$NC_proc= -5
##$NLEV= 6
##$NOISF1= 0
##$NOISF2= 0
##$NSP= 0
##$NTH_PI= 0
##$NZP= 0
##$OFFSET= 16.522
##$PC= 1
##$PHC0= 219.6532
##$PHC1= 10.05478
##$PH_mod= 1
##$PKNL= yes
##$PPARMOD= 0
##$PSCAL= 4
##$PSIGN= 0
##$REVERSE= no
##$SF= 250.13
##$SI= 32768
##$SIGF1= 0
##$SIGF2= 0
##$SINO= 400
##$SIOLD= 32768
##$SREGLST= <1H.DMSO>
##$SSB= 0
##$STSI= 32768
##$STSR= 0
##$SW_p= 5175.98343685301
##$SYMM= 0
##$S_DEV= 0
##$TDeff= 65536
##$TDoff= 0
##$TI= <Analysis number 999999
Compound Code 99
Book Reference 9
Project Code 9>
##$TILT= no
##$TM1= 0
##$TM2= 0
##$TOPLEV= 0
##$USERP1= <user>
##$USERP2= <user>
##$USERP3= <user>
##$USERP4= <user>
##$USERP5= <user>
##$WDW= 1
##$XDIM= 32768
##$YMAX_p= 543574863
##$YMIN_p= -517425
$$ End of Bruker specific parameters
$$ ---------------------------------
##NTUPLES= NMR SPECTRUM
##VAR_NAME=  FREQUENCY,     SPECTRUM/REAL,   SPECTRUM/IMAG
##SYMBOL=    X,             R,               I
##VAR_TYPE=  INDEPENDENT,   DEPENDENT,       DEPENDENT
##VAR_FORM=  AFFN,          ASDF,            ASDF
##VAR_DIM=   32768,         32768,           32768
##UNITS=     HZ,            ARBITRARY UNITS, ARBITRARY UNITS
##FACTOR=    0.157963299565203, 1,           1
##FIRST=     4132.6476996994, 0,             0
##LAST=      -1043.33573715361, 0,           0
##MIN=       -1043.33573715361, -517425,     0
##MAX=       4132.6476996994, 543574863,     0
$$ Real data points
##PAGE= N=1
##DATA TABLE= (X++(R..R)), XYDATA
$$ [...]
$$ plain form
15806 11088 -21306 -115648 -109849 -130131 -122803 -89551 -27699 -18500 45115 138238 102383 11431
15794 11431 -110092 -176752 -75659 -25130 47982 10935 49890 14593 -63615 22572 15767
15783 15767 -63986 -128615 -199278 -215703 -250059 -172072 -100980 40024 95416 112308 132021
15772 132021 149552 81709 98293 125949 146990 132898 89421 47021 129743 226489 393762
15761 393762 457936 469980 528157 482775 438093 481904 361096 270372 203190 367840 448205
15750 448205 518436 570380 372253 180269 78530 70742 28341 56951 125617 6583 -17968
15739 -17968 41994 133609 110254 163134 150791 109252 54912 90653 101474 164010 1273
15728 1273 7042 57577 69773 45007 -59581 -188817 -37419 73384 -63535 -182678 -44042
$$ packed form
15806A1088l2394r4342N799k0282P328L3252O1852R199O3615R3123l5855r0952
15794A1431j21523o6660J01093N0529P3112l7047L8955l5297p8208Q6187o805
15783A5767p9753o4629p0663j6425l4356P7987P1092J41004N5392J6892J9713
15772A32021J7531o7843J6584K7656K1041j4092m3477m2400Q2722R6746J67273
15761C93762O4174J2044N8177m5382m4682M3811j20808r0724o7182J64650Q0365
15750D48205P0231N1944j98127j91984j01739p788m2401K8610O8666j19034k4551
15739a7968N9962R1615k3355N2880j2343m1539n4340L5741J0821O2536j62737
15728A273N769N0535J2196k4766j04588j29236J51398J10803j36919j19143J38636
$$ plain form
15717 -44042 -31441 -119451 -146394 -133073 -120653 -179577 -282099 -256559 -163481 -76423 -52159
15706 -52159 -122578 -240749 -257268 -133113 -97515 -78599 -91201 -93047 -18649 19305 80648
15695 80648 135098 91904 88857 162796 206503 123958 85296 105209 -70246 -179244 -164778
15684 -164778 -242357 -216276 -142638 -162012 -161550 -122831 -204288 -231042 -216296 -203607 -231240 -237837
15672 -237837 -166829 -123504 -98925 -64359 87792 28148 -153182 -265356 -249822 -155903 -74354
15661 -74354 -56261 -36052 -86851 -199467 -190236 -249667 -108844 -2745 -7018 38401 84057
15650 84057 102079 197982 346052 340595 350716 340553 231116 126243 98411 82479 104322
15639 104322 30525 -15638 -52081 -83314 -67727 -29050 -13506 -4905 -74940 -142391 -212419 -130066
$$ packed form
15717d4042J2601q8010k6943J3321J2420n8924j02522K5540R3078Q7058K4264
15706e2159p0419j18171j6519J24155L5598J8916j2602j846P4398L7954O1343
15695H0648N4450m3194l047P3939M3707q2545l8662J9913j75455j08998J4466
15684a64778p7579K6081P3638j9374M62L8719q1457k6754J4746J2689k7633o597
15672b37837P1008M3325K4579L4566J52151n9644j81330j12174J5534R3919Q1549
15661g4354J8093K0209n0799j12616R231n9431J40823J06099m273M5419M5656
15650H4057J8022R5903J48070n457J0121j0163j09437j04873k7832j5932K1843
15639A04322p3797m6163l6443l1233J5587L8677J5544Q601p0035o7451p0028Q2353
$$ plain form
15627 -130066 -4966 72290 67597 29356 -129186 -135305 -94649 -109291 -182648 -206189 -47182
15616 -47182 -5757 44123 23602 -60236 -88620 18927 116642 111825 112418 38441 -157178 -132253
15604 -132253 -66511 -104703 -130838 -119020 -1329 48734 14643 131511 180330 50672 -57911
15593 -57911 -78914 -2733 -25802 31645 129439 14425 -53195 4862 186362 187619 176105
15582 176105 51739 -28948 -176868 -142260 -41688 50497 99453 86014 -10292 33443 132314
15571 132314 137675 -35768 5587 50764 -16403 -33165 -35198 121081 76734 -31253 -117946
15560 -117946 -77012 -54340 -89838 -92359 -15789 -78483 -145173 -103103 -71759 -99356 -75839 -61271
15548 -61271 10863 -4412 -120374 -55917 26126 -5305 23215 174142 23711 -131234 -115193
$$ packed form
15627a30066J25100P7256m693l8241j58542o119M0656j4642p3357k3541J59007
15616d7182M1425M9880k0521q3838k8384J07547R7715m817N93p3977j95619K4925
15604a32253O5742l8192k6135J1818J17691N0063l4091J16868M8819j29658j08583
15593e7911k1003P6181k3069N7447R7794j15014o7620N8057J81500J257j1514
15582A76105j24366q0687j47920L4608J00572R2185M8956j3439r6306M3735R8871
15571A32314N361j73443M1355M5177o7167j6762k033J56279m4347j07987q6693
15560a17946M0934K2672l5498k521P6570o2694o6690M2070L1344k7597K3517J4568
15548f1271P2134j5275j15962O4457Q2043l1431K8520J50927j50431j54945J6041
$$ plain form
15537 -115193 -62187 -15583 86542 -24241 -166333 -174202 -162756 -36832 -33293 -66045 -60455
15526 -60455 -113007 -110976 -100537 -105350 -110097 -18960 -4513 41425 695 -5349 12384 76424
15514 76424 106621 140657 50204 64235 25517 -56229 -137657 -133503 -126712 -136031 -14454 -106191
15502 -106191 -240827 -149014 -88527 -171945 -181461 -140003 -102461 -96843 12065 21567 112565 24268
15490 24268 -5054 -128314 -157359 -203353 -160402 -59462 -42947 -96913 -55451 5281 67051
15479 67051 29234 16281 83579 49977 1006 -44575 14384 -44190 -13417 10079 -106028
15468 -106028 25901 159495 94158 -556 83809 171526 81792 50329 -46581 -24149 5674
15457 5674 51244 8090 -18783 -35777 -14985 -6613 -58255 63919 154698 133931 139644 148951
$$ packed form
15537a15193N3006M6604J02125j10783j42092p869J1446J25924L539l2752N590
15526f0455n2552K031J0439m813m747R1137J4447M5938m0730o044J7733O4040
15514G6424L0197L4036r0453J4031l8718q1746q1428M154O791r319J21577r1737
15502a06191j34636R1813O0487q3418r516M1458L7542N618J08908R502R0998q8297
15490B4268k9322j23260k9045m5994M2951J00940J6515n3966M1462O0732O1770
15479F7051l7817j2953O7298l3602m8971m5581N8959n8574L0773K3496j16107
15468a06028J31929J33594o5337r4714Q4365Q7717q9734l1463r6910K2432K9823
15457E674M5570m3154k6873j6994K0792Q372n1642J22174R0779k0767N713R307
$$ plain form
15445 148951 118915 102309 -64564 2059 32850 161443 250743 16168 -56025 -15948 46135
15434 46135 174427 86016 82600 122188 128897 78667 -81598 -122103 -120305 -60758 65505 -36796
15422 -36796 -54071 161252 143799 -33492 -182580 -167028 -81890 35274 147347 191365 222364
15411 222364 245438 246113 278719 202231 209051 267689 235794 298999 322143 454668 540547 650896
15399 650896 708957 734277 847117 970491 1049175 1041956 966255 925695 891251 914149 841281
15388 841281 717840 595585 661596 730898 741264 674153 590498 512783 506424 483569 357321
15377 357321 263743 222142 316123 444852 429135 374928 250520 225439 165487 232119 353130
15366 353130 401096 358056 316653 155898 105315 137233 204587 242088 157510 141221 194293
$$ packed form
15445A48951l0036j6606j66873O6623L0791J28593Q9300k34575p2193M0077O2083
15434D6135J28292q8411l416L9588O709n0230j60265m0505J798N9547J26263j02301
15422c6796j7275K15323j7453j77291j49088J5552Q5138J17164J12073M4018L0999
15411B22364K3074O75L2606p6488O820N8638l1895O3205K3144J32525Q5879J10349
15399F50896N8061K5320J12840J23374P8684p219p5701m0560l4444K2898p2868
15388H41281j23441j22255O6011O9302J0366o7111q3655p7715o359k2855j26248
15377C57321r3578m1601R3981J28729j5717n4207j24408k5081n9952O6632J21011
15366C53130M7966m3040m1403j60755n0583L1918O7354L7501q4578j6289N3072
$$ plain form
15355 194293 256744 199031 131964 43379 86643 64973 -22103 8319 70861 -84929 -142916
15344 -142916 -92621 -43965 8364 -41402 -49102 -114110 -11582 145787 134040 100719 156405
15333 156405 142178 135663 116336 156364 182956 130265 137897 128139 -16232 -12536 7426 -140255
15321 -140255 -91931 -95911 -21298 -58958 -33625 -18420 46428 23155 -82362 6116 87547
15310 87547 161783 149134 70441 136998 100577 80697 45715 -33156 -70088 63997 174483
15299 174483 183856 24203 -22648 -3963 -764 -95458 -76402 -34436 6290 -5686 -89863 -134161
15287 -134161 -147843 -73703 72243 176359 169083 167368 134591 153408 245849 188300 97663
15276 97663 115996 153903 173979 124971 42140 26693 -40696 -12814 95958 132512 67245
$$ packed form
15355A94293O2451n7713o7067q8585M3264k1670q7076L0422O2542j55790n7987
15344a42916N0295M8656N2329m9766p700o5008J02528J57369j1747l3321N5686
15333A56405j4227o515j9327M0028K6592n2691P632r758j44371L696J9962j47681
15321a40255M8324l980P4613l7660K5333J5205O4848k3273j05517Q8478Q1431
15310H7547P4236j2649p8693O6557l6421j9880l4982p8871l6932J34085J10486
15299A74483R373j59653m6851J8685L199r4694J9056M1966M0726j1976q4177m4298
15287a34161j3682P4140J45946J04116p276j715l2777J8817R2441n7549r0637
15276I7663J8333L7907K0076m9008q2831j5447o7389K7882J08772L6554o5267
$$ plain form
15265 67245 50466 23869 -19175 -30272 51259 158022 135525 112894 163260 213968 215762 125930
15253 125930 88883 142663 199370 181783 101974 148562 213262 140896 142749 140808 82668 14698
15241 14698 -39104 -42264 57734 90831 61769 -40447 69815 269372 269281 288139 159717 163901
15229 163901 175077 93735 -10990 105179 263770 318658 285734 255553 156393 42497 100457
15218 100457 20479 -59631 -97049 26026 83026 61750 107297 146983 71876 227 21166
15207 21166 34983 67125 175094 291675 328382 311183 275198 271971 130074 99562 182084
15196 182084 162162 161291 190323 167916 55484 148658 128733 35402 51130 149695 252954
15185 252954 170642 198733 249539 192454 138989 211333 228670 200510 178098 132628 234698
$$ packed form
15265F7245j6779k6597m3044j1097Q1531J06763k2497k2631N0366N0708J794q9832
15253A25930l7047N3780N6707j7587p9809M6588O4700p2366J853j941n8140o7970
15241A4698n3802l160R9998L3097k9062j02216J10262J99557r1J8858j28422M184
15229A63901J1176q1342j04725J16169J58591N4888l2924l0181r9160j13896N7960
15218A00457p9978q0110l7418J23075N7000k1276M5547L9686p5107p1649K0939
15207B1166J3817L2142J07969J16581L6707j7199l5985l227j41897l0512Q2522
15196A82084j9922q71K9032k2407j12432R3174j9925r3331J5728R8565J03259
15185B52954q2312K8091N0806n7085n3465P2344J7337k8160k2412m5470J02070
$$ plain form
15174 234698 367797 404864 347705 282010 515122 542466 395651 258189 380155 339086
15164 339086 322078 347587 268994 191887 122914 110636 191016 254333 244031 226924 217997 207956
15152 207956 282733 330655 321323 218156 129558 90055 85410 151187 183255 138869 74154 122
15140 122 -15638 95893 266908 228697 211154 282187 228303 183398 222189 240105 136967
15129 136967 40756 -16764 141994 162842 59194 31161 76961 83518 162840 238412 273748
15118 273748 283235 228596 258225 288596 280125 196504 109153 132119 214906 210041 126395 117708
15106 117708 134727 12299 3915 81305 76570 79185 149097 190606 196679 287096 311967 226583
15094 226583 199149 157400 256689 418079 522548 440024 401509 325975 265638 393510 464289
$$ packed form
15174B34698J33099L7067n7159o5695K33112K7344j46815j37462J21966m1069
15164C39086j7008K5509p8593p7107o8973j2278Q0380O3317j0302j7107q927j0041
15152B07956P4777M7922r332j03167q8598l9503m645O5777L2068m4386o4715p4032
15140A22j5760J11531J71015l8211j7543P1033n3884m4905L8791J7916j03138
15129A36967r6211n7520J58758K0848j03648k8033M5800O557P9322P5572L5336
15118B73748R487n4639K9629L0371q471q3621q7351K2966Q2787m865q3646q687
15106A17708J7019j22428q384P7390m735K615O9912M1509O073R0417K4871q5384
15094B26583k7434m1749R9289J61390J04469q2524l8515p5534o0337J27872P0779
$$ plain form
15083 464289 439392 542887 636600 718507 673910 589818 603210 640911 678968 650740 572311
15072 572311 614875 651857 702746 678604 709399 733964 802255 741430 648239 546968 564379
15061 564379 630126 713981 823060 856882 990863 1098683 1065294 984587 902914 855664 844971
15050 844971 947513 937804 964733 1027057 1041613 906730 791601 948202 1082417 1197707
15040 1197707 1167729 1135068 1120009 1128487 1091051 1253997 1245829 1260091 1311150 1289762 1317471
15029 1317471 1221896 1188851 1243321 1392007 1478385 1402966 1330747 1390565 1408670 1387821 1282367
15018 1282367 1353429 1473171 1497770 1504626 1618118 1761753 1864294 1898707 1889970 1885125 1940327
15007 1940327 2016096 2090552 2137685 2186610 2209557 2233837 2147026 2224749 2423643 2464970 2470134
$$ packed form
15083D64289k4897J03495R3713Q1907m4597q4092J3392L7701L8057k8228p8429
15072E72311M2564L6982N0889k4142L0795K4565O8291o0825r3191j01271J7411
15061E64379O5747Q3855J09079L3822J33981J07820l3389q0707q1673m7250j0693
15050H44971J02542r709K6929O2324J4556j34883j15129J56601J34215J15290
15040A197707k9978l2661j5059Q478l7436J62946q168J4262N1059k1388K7709
15029A317471r5575l3045N4470J48686Q6378p5419p2219N9818J8105k0849j05454
15018A282367P1062J19742K4599O856J13492J43635J02541L4413q737m845N5202
15007A940327P5769P4456M7133M8925K2947K4280q6811P7723J98894M1327N164
$$ plain form
14996 2470134 2622034 2796410 3033661 3147038 3360511 3697766 3885884 3887133 3958798 4136488
14986 4136488 4280681 4539827 4871137 5179871 5429485 5814735 6438674 6954174 7387303
14977 7387303 7839558 8421841 9138756 9969173 10769420 11796804 12875603 14057802 15436456
14968 15436456 16934823 18694940 20724647 23242936 26085647 29372144 33070328 37668361
14960 37668361 43241867 50156053 58788706 69676593 83245139 99868619 119658462
14953 119658462 141774786 164640677 185888954 202962152 215005453 222483950 226739193
14946 226739193 228886029 229020981 225995539 218060576 204741340 187036723 167074060 147159763
14938 147159763 129118914 113634702 100723323 90115415 81356638 73971613 67681447
$$ packed form
14996B470134J51900J74376K37251J13377K13473L37255J88118J249P1665J77690
14986D136488J44193K59146L31310L08734K49614L85250O23939N15500M33129
14977G387303M52255N82283P16915Q30417Q00247J027384J078799J182199J378654
14968A5436456J498367J760117K029707K518289K842711L286497L698184M598033
14960C7668361N573506O914186Q632653J0887887J3568546J6623480J9789843
14953A19658462K2116324K2865891K1248277J7073198J2043301P478497M255243
14946B26739193K146836J34952l025442p934963j3319236j7704617j9962663j9914297
14938A47159763j8040849j5484212j2911379j0607908q758777p385025o290166
$$ plain form
14931 67681447 62176628 57047600 52371759 48068548 44121147 40461110 36979788 33719211
14923 33719211 30829785 28257794 26056394 23876421 21905536 20121495 18581721 17222649
14915 17222649 15872403 14699539 13644831 12702164 11956505 11226205 10575860 10021134 9509621
14906 9509621 8776880 8044754 7460451 7131434 6896790 6531091 6163219 5751617 5327495
14897 5327495 5002136 4679428 4471554 4349969 4040433 3800782 3580932 3427171 3202461
14888 3202461 3166961 3156862 3114729 2894610 2579652 2428796 2438661 2345241 2214973 2033808
14878 2033808 2005725 1956445 1936030 1861185 1663178 1628836 1659635 1547038 1365166 1293301 1265399
14867 1265399 1272133 1244313 1231861 1221570 1220251 1159250 1145343 1097559 1043098 982312 897037 862418
$$ packed form
14931F7681447n504819n129028m675841m303211l947401l660037l481322l260577
14923C3719211k889426k571991k201400k179973j970885j784041j539774j359072
14915A7222649j350246j172864j054708r42667p45659p30300o50345n54726n11513
14906I509621p32741p32126n84303l29017k34644l65699l67872m11602m24122
14897E327495l25359l22708k07874j21585l09536k39651k19850j53761k24710
14888C202461l5500j0099m2133k20119l14958j50856R865r3420j30268j81165
14878B033808k8083m9280k0415p4845j98007l4342L0799j12597j81872p1865k7902
14867A265399O734k7820j2452j0291j319o1001j3907m7784n4461o0786q5275l4619
$$ plain form
14855 862418 825344 794449 781059 750993 753400 806804 777792 670446 602149 601116 548723 589837
14843 589837 623207 590910 546450 605482 699683 794710 809114 760332 871384 877476 895907
14832 895907 876459 715511 653007 686595 704329 682825 513240 535478 547137 559697 672271
14821 672271 639610 599540 691921 669712 592090 636227 723626 712079 629638 592555 594268 595386
14809 595386 576763 510395 508162 595877 577012 522667 510238 483311 458757 449751 552729 681660
14797 681660 658087 639433 608268 512228 609573 627627 636473 646096 578190 548848 549313 381702
14785 381702 389870 466465 507351 479377 418169 264192 150269 165281 247040 362980 272284
14774 272284 154345 165635 155737 172149 200407 211314 302849 438860 450765 445775 294511
$$ packed form
14855H62418l7074l0895j3390l0066K407N3404k9012j07346o8297j033n2393M1114
14843E89837L3370l2297m4460N9032R4201R5027J4404m8782J11052O092J8431
14832H95907j9448j60948o2504L3588J7734k1504j69585K2238J1659J2560J12574
14821F72271l2661m0070R2381k2209p7622M4137Q7399j1547q2441l7083J713J118
14809E95386j8623o6368k233Q7715j8865n4345j2429k6927k4554r006J02978J28931
14797F81660k3573j8654l1165r6040R7345J8054Q846R623o7906k9342M65j67611
14785C81702Q168P6595M0886k7974o1208j53977j13923J5012Q1759J15940r0696
14774B72284j17939J1290r898J6412K8258J0907R1535J36011J1905m990j51264
$$ plain form
14763 294511 242516 315292 406553 374859 480008 486967 437061 345089 328849 381373 322814
14752 322814 217933 192248 284542 272036 162650 -60532 -100351 45470 122941 33015 102059
14741 102059 173591 178247 207228 91585 70761 166804 94638 60454 73476 60287 113908
14730 113908 118176 152293 110473 78193 56047 52525 -24028 -62848 -35441 -43744 56388 16694
14718 16694 81929 46700 83830 78536 796 21052 29428 133705 136068 205606 169392 113451
14706 113451 -54190 -47043 43525 83056 1499 -81257 3484 63331 90827 8722 46565
14695 46565 99606 60081 78056 107990 25595 76371 134536 163038 231463 174987 276786
14684 276786 181894 204205 46080 -32157 53013 31816 64469 1762 -107298 -95949 -14089
$$ packed form
14763B94511n1995P2776R1261l1694J05149O959m9906r1972j6240N2524n8559
14752C22814j04881k5685R2294j2506j09386k23182l9819J45821P7471q9926O9044
14741A02059P1532M656K8981j15643k0824R6043p2166l4184J3022j3189N3621
14730A13908M268L4117m1820l2280k2146l522p6553l8820K7407q303J00132l9694
14718A6694O5235l5229L7130n294p7740K0256Q376J04277K363O9538l6214n5941
14706A13451j67641P147R0568L9531q1557q2756Q4741N9847K7496q2105L7843
14695D6565N3041l9525J7975K9934q2395N0776N8165K8502O8425n6476J01799
14684B76786r4892K2311j58125p8237Q5170k1197L2653o2707j09060J1349Q1860
$$ plain form
14673 -14089 -71625 -47428 2415 148967 235259 208972 165484 285019 308896 232254 145486
14662 145486 94869 143955 82720 24491 62076 -68289 -125605 -84448 -89650 99944 186146
14651 186146 138529 126424 126811 79277 61320 46750 159396 95679 29223 -37092 29676 83318
14639 83318 144544 179658 166558 131581 124488 287984 287799 253042 308890 240857 158523 90904
14627 90904 158591 343608 210993 120396 15460 -64602 -33903 -41802 22549 173624 182380
14616 182380 31114 17367 97033 215367 260223 254979 289314 249084 200946 54069 32634
14605 32634 93180 11366 7504 125010 187465 140737 -678 64676 13148 -88347 -93935
14594 -93935 -186824 -256813 -247975 -99704 -20509 110316 186286 63816 -110088 -117440 -11198
$$ packed form
14673a4089n7536K4197M9843J46552Q6292k6287m3488J19535K3877p6642q6768
14662A45486n0617M9086o1235n8229L7585j30365n7316M1157n202J89594Q6202
14651A86146m7617j2105L87m7534j7957j4570J12646o3717o6456o6315O6768N3642
14639H3318O1226L5114j3100l4977p093J63496j85l4757N5848o8033q2334o7619
14627I0904O7687J85017j32615r0597j04936q0062L0699p899O4351J51075Q756
14616A82380j51266j3747P9666J18334M4856n244L4335m0230m8138j46877k1435
14605C2634O0546q1814l862J17506O2455m6728j41415O5354n1528j01495n588
14594i3935r2889o9989Q838J48271P9195J30825P5970j22470j73904p352J06242
$$ plain form
14583 -11198 78759 47706 146982 109702 16640 -97973 -216199 -265669 -200735 -268419 -279326
14572 -279326 -298984 -325474 -328034 -388502 -215592 -55818 -45839 -30559 17685 130528 91648
14561 91648 72534 80123 -24095 -65828 -18703 -35431 -5127 -56273 -138886 -6205 69280
14550 69280 63152 77536 50352 -85030 -145284 -193762 9745 60353 179458 242882 162555
14539 162555 134522 145019 8902 -103753 -132181 -100047 66783 110340 106169 204082 197798
14528 197798 167039 145621 242822 208236 151403 154476 198211 26700 -22314 -23325 41891 59930
14516 59930 143745 286369 197996 196147 176601 196952 214365 294110 440991 571530 664298
14505 664298 610763 577530 605097 747488 763858 748763 922313 964080 919776 1037771 984444
$$ packed form
14583a1198Q9957l1053R9276l7280r3062j14613j18226m9470O4934o7684j0907
14572b79326j9658k6490k560o0468J72910J59774R979J5280M8244J12843l8880
14561I1648j9114P589j04218m1733M7125j6728L0304n1146q2613J32681P5485
14550F9280o128J4384k7184j35382o0254m8478K03507N0608J19105O3424q0327
14539A62555k8033J0497j36117j12655k8428L2134J66830M3557m171R7913o284
14528A97798l0759k1418R7201l4586n6833L073M3735j71511m9014j011O5216J8039
14516E9930Q3815J42624q8373j849j9546K0351J7413P9745J46881J30539R2768
14505F64298n3535l3233K7567J42391J6370j5095J73550M1767m4304J17995n3327
$$ plain form
14494 984444 1004337 989827 902855 844153 708348 646100 592374 474472 560067 569284 548678
14483 548678 609899 539142 433779 359116 418307 313774 320730 275829 144763 147609 168659
14472 168659 188917 264905 187838 -6177 -91576 -162268 5194 57851 34558 81466 35997
14461 35997 -13701 -29631 -20096 -11051 51412 19412 -18655 -13149 -70423 -27718 -70166 -68129
14449 -68129 84375 103503 1046 -114082 -70739 -59461 -57191 -80159 -55810 -13666 42616
14438 42616 100067 135317 36575 -47177 -17973 -31166 -86310 -61284 55538 56037 84499 58355
14426 58355 9857 52387 116121 33265 -109101 -105998 52228 203542 223458 145376 10260
14415 10260 -106086 -35659 -60654 -91347 -16380 -35113 -47895 36590 32226 36469 73539 17508
$$ packed form
14494I84444J9893j4510q6972n8702j35805o2248n3726j17902Q5595R217k0606
14483E48678O1221p0757j05363p4663N9191j04533O956m4901j31066K846K1050
14472A68659K0258P5988p7067j94015q5399p0692J67462N2657k3293M6908m5469
14461C5997m9698j5930R535R045O2463l2000l8067N506n7274M2705m2448K037
14449f8129J52504J9128j02457j15128M3343J1278K270k2968K4349M2144N6282
14438D2616N7451L5250r8742q3752K9204j3193n5144K5026J16822M99K8462k6144
14426E8355m8498M2530O3734q2856j42366L103J58226J51314J9916p8082j35116
14415A0260j16346P0427k4995l0693P4967j8733j2782Q4485m364M243L7070n6031
$$ plain form
14403 17508 63145 83467 59836 30059 -5305 31412 44939 -48805 -79629 -20655 93617
14392 93617 183291 116768 40761 -82586 -99204 67984 133160 24325 -6338 -4177 71218
14381 71218 84320 61897 192200 201024 170390 90045 12083 113439 201331 125033 29943
14370 29943 30450 62254 19591 -148013 -290753 -254935 -178614 -35859 -8140 -73207 28551
14359 28551 72720 80872 -3230 87153 231141 180655 206561 234187 250641 87422 -28837
14348 -28837 -631 69578 7725 19346 17930 -25346 -23793 81822 37507 -10215 -76471 -200682
14336 -200682 -162693 -196708 -163137 -64333 66335 -28825 -85969 34682 106772 211377 163072
14325 163072 118171 -5352 21861 -15120 -48912 -48177 -55809 188556 237802 139297 184172 226779
$$ packed form
14403A7508M5637K0322k3631k9777l5364L6717J3527r3744l0824N8974J14272
14392I3617Q9674o6523p6007j23347j6618J67188O5176j08835l0663K161P5395
14381G1218J3102k2423J30303Q824l0634q0345p7962J01356Q7892p6298r5090
14370B9943N07L1804m2663j67604j42740L5818P6321J42755K7719o5067J01758
14359B8551M4169Q152q4102R0383J43988n0486K5906K7626J6454j63219j16259
14348b8837K8206P0209o1853J1621j416m3276J553J05615m4315m7722o6256j24211
14336b00682L7989l4015L3571R8804J30668r5160n7144J20651P2090J04605m8305
14325A63072m4901j23523K7213l6981l3792P35p632K44365M9246r8505M4875M2607
$$ plain form
14313 226779 49779 -39881 -11404 11446 52320 7863 -91528 -167751 -124042 -109871 -52683
14302 -52683 -31305 10624 -48378 -106702 -34051 -59719 -169299 -199893 -245810 -166289 -152731
14291 -152731 -150488 8666 -31478 -130439 -96295 49435 4188 -53568 -28245 7551 146365
14280 146365 60170 -56916 -135245 -244385 -250160 -159077 -177602 -176806 -30182 -23545 -205826
14269 -205826 -209797 -153018 -109020 -149703 -17905 80772 66343 6084 -6980 -7837 8711 44264
14257 44264 -2864 -62373 -39514 -9744 92805 73213 115893 145488 124702 123467 28190 16491
14245 16491 37396 59380 12674 28311 1919 -19920 -3951 -79617 -107900 -147500 -181830 -112212
14233 -112212 -50142 -77587 -77088 19408 19231 -37061 -18847 -53205 -120882 -118737 -1875 57465
$$ packed form
14313B26779j77000q9660K8477K2850M0874m4457r9391p6223M3709J4171N7188
14302e2683K1378M1929n9002n8324P2651k5668j09580l0594m5917P9521J3558
14291a52731K243J59154m0144r8961L4144J45730m5247n7756K5323L5796J38814
14280A46365q6195j17086p8329j09140n775R1083j8525P96J46624O637j82281
14269b05826l971N6779M3998m0683J31798R8677j4429o0259j3064q57J6548L5553
14257D4264m7128n9509K2859K9770J02549j9592M2680K9595k0786j235r5277j1699
14245A6491K0905K1984m6706J5637k6392k1839J5969p5666k8283l9600l4330O9618
14233a12212O2070k7445M99R6496j77n6292J8214l4358o7677K145J16862N9340
$$ plain form
14221 57465 31045 23183 6086 -127346 -145821 -138231 -221557 -258248 -111898 92346 147880
14210 147880 113063 70443 26627 -43022 -69153 -75162 -193385 -204378 -106049 -60344 -72850
14199 -72850 -132441 -192151 -54512 45025 235899 229733 54682 15261 16293 -40817 -29818
14188 -29818 -109961 -76268 -113399 -54289 -147940 -152756 -44277 78769 -29036 -96659 -21142
14177 -21142 -8490 9613 16664 311 -76323 -135045 -61440 7619 81348 13731 -23192 116202
14165 116202 41364 -9291 1024 -43330 -136660 -81692 -114295 -136976 -778 102608 170666
14154 170666 141656 172100 163046 107870 82473 -50116 -84771 -18128 69567 95473 50114
14143 50114 -76319 -126429 -51338 15360 98669 76196 16368 5000 58572 52574 52715 117975
$$ packed form
14221E7465k6420p862j7097j33432j8475P590q3326l6691J46350K04244N5534
14210A47880l4817m2620m3816o9649k6131o009j18223j0993R8329M5705j2506
14199g2850n9591n9710J37639R9537J90874o166j75051l9421J032n7110J0999
14188b9818q0143L3693l7131N9110r3651m816J08479J23046j07805o7623P5517
14177b1142J2652J8103P051j6353p6634n8722P3605O9059P3729o7617l6923J39394
14165A16202p4838n0655J0315m4354r3330N4968l2603k2681J36198J03386O8058
14154A70666k9010L0444r054n5176k5397j32589l4655O6643Q7695K5906m5359
14143E0114j26433n0110P5091O6698Q3309k2473n9828j1368N3572n998J41O5260
$$ plain form
14131 117975 169164 117695 106038 138918 127153 91422 39337 19710 -95238 -268183 -189623
14120 -189623 -138489 -63295 64279 28925 -37302 -28106 -35890 -106372 -158213 -57319 30598
14109 30598 -78797 -61119 -94997 43851 63928 -14586 -37417 73828 83274 92731 30364
14098 30364 51694 78464 -16722 -57794 -111629 -70967 -108414 -87209 -33881 -25447 -48853 -184382
14086 -184382 -288326 -167237 -40681 45875 6512 -50596 12738 151562 310006 255870
14076 255870 122807 153117 127012 128242 194587 183262 83612 10037 -96993 -95795 -10736
14065 -10736 92331 -95057 -211260 -150256 53559 114865 71321 137145 101204 96265 90911
14054 90911 8690 -75635 -105645 -47150 -45546 -172327 -54158 -31906 -10695 41879 50317 72935
$$ packed form
14131A17975N1189n1469j1657L2880j1765l5731n2085j9627j14948j72945P8560
14120a89623N1134P5194J27574l5354o6227R196p784p0482n1841J00894Q7917
14109C0598j09395J7678l3878J38848K0077p8514k2831J11245R446R457o2367
14098C0364K1330K6770r5186m1072n3835M0662l7447K1205N3328Q434k3406j35529
14086a84382j03944J21089J26556Q6556l9363n7108O3334J38824J58444n4136
14076B55870j33063L0310k6105J230O6345j1325r9650p3575j07030J198Q5059
14065a0736J03067j87388j16203O1004K03815O1306m3544O5824l5941m939n354
14054I0911q2221q4325l0010N8495J604j26781J18169K2252K1211N2574Q438K2618
$$ plain form
14042 72935 95482 32147 -152239 -254474 -209716 -58148 32436 -25372 -108073 -73641 -100317
14031 -100317 -143976 -300210 -242393 -67798 -26043 36513 41461 -14804 2933 39921 -51418
14020 -51418 -19040 -14625 143768 173431 27470 69608 184837 304502 276145 240151 189138
14009 189138 71371 -3805 17205 114407 64140 135755 178771 217817 204202 238557 304817
13998 304817 342231 300943 182605 171837 147578 44014 -24165 44538 170960 131246 104697
13987 104697 49762 -15311 -4342 14287 73121 220439 201282 168507 70658 6963 35781
13976 35781 19814 -73293 -167692 -51801 -114905 -164319 -72964 -3466 -93752 -94885 94496
13965 94496 163560 99425 122573 123558 116546 -25966 -170266 -211249 -150176 -206435 -245121 -19137
$$ packed form
14042G2935K2547o3335j84386j02235M4758J51568R0584n7808q2701L4432k6676
14031a00317m3659j56234N7817J74595M1755O2556M948n6265J7737L6988r1339
14020e1418L2378M415J58393K9663j45961M2138J15229J19665k8357l5994n1013
14009A89138j17767p5176K1010R7202n0267P1615M3016L9046j3615L4355O6260
13998C04817L7414m1288j18338j0768k4259j03564o8179O8703J26422l9714k6549
13987A04697n4935o5073J0969J8629N8834J47318j9157l2775r7849o3695K8818
13976C5781j5967r3107r4399J15891o3104m9414R1355O9498r0286j133J89381
13965I4496O9064o4135K3148R85p012j42512j44300m0983O1073n6259l8686K25984
$$ plain form
13953 -19137 -2183 43439 124568 192352 181428 91985 33315 50216 102402 63179 65472 142875
13941 142875 -6567 -14547 91797 206628 261591 94094 -136566 -49063 -19516 28040 99260
13930 99260 89864 -29672 18870 122307 62924 -88543 -107247 -137517 -189023 -204642 -226084
13919 -226084 -100270 -22683 -162081 -324730 -342240 -296547 -209735 -165991 -197059 -188259 -152096
13908 -152096 -69654 48439 170951 154814 -23456 -93723 -118446 -79062 -166980 -111309 -41534
13897 -41534 -63981 -152286 -186913 -155186 -138129 -139111 -185488 -101987 -114816 -202475 -91866 -71120
13885 -71120 -649 -6530 -113997 -140350 -12634 119787 121710 90683 46105 -75254 -154176
13874 -154176 -136265 -51012 1846 -60230 -161067 -76944 180263 186724 108676 -21713 -10426
$$ packed form
13953a9137J6954M5622Q1129O7784j0924q9443n8670J6901N2186l9223K293P7403
13941A42875j49442p980J06344J14831N4963j67497k30660Q7503K9547M7556P1220
13930I9260r396j19536M8542J03437n9383j51467j8704l0270n1506j5619k1442
13919b26084J25814P7587j39398j62649j7510M5693Q6812M3744l1068Q800L6163
13908a52096Q2442J18093J22512j6137j78270p0267k4723L9384q7918N5671O9775
13897d1534k2447q8305l4627L1727J7057r82m6377Q3501j2829q7659J10609K0746
13885g1120P0471n881j07467k6353J27716J32421J923l1027m4578j21359p8922
13874a54176J7911Q5253N2858o2076j00837Q4123K57207O461p8048j30389J1287
$$ plain form
13863 -10426 -46593 -116082 -60335 -82008 -130744 -158935 -77351 -52025 -7877 96741 112404
13852 112404 39612 -51796 -167186 -145241 -163091 -109702 -84354 -55344 26230 103660 97208
13841 97208 56781 29450 -98349 -136638 -41281 61290 55696 -84377 -132320 -138461 -266475
13830 -266475 -279640 -273159 -213866 -228008 -181793 -107592 -21460 19424 82429 39485 -31433 -32203
13818 -32203 -2215 69408 78054 92644 91217 15662 -26456 -35233 -31238 11701 73961 65755 123681
13805 123681 216156 127225 59211 -11489 94563 61068 65428 11130 -107884 -95957 -29042
13794 -29042 -29280 -61199 -43759 13199 -37950 -47955 -181544 -211948 -80185 -33169 23101 20881
13782 20881 31989 63048 76667 -40973 -196592 -123291 23598 42936 18306 -61863 -80685
$$ packed form
13863a0426l6167o9489N5747k1673m8736k8191Q1584K5326M4148J04618J5663
13852A12404p2792r1408j15390K1945j7850N3389K5348K9010Q1574P7430o452
13841I7208m0427k7331j27799l8289R5357J02571n594j40073m7943o141j28014
13830b66475j3165O481N9293j4142M6215P4201Q6132M0884O3005m2944p0918p70
13818c2203K9988P1623Q646J4590j427p5555m2118q777L995M2939O2260q206N7926
13805A23681R2475q8931o8014p0700J06052l3495M360n4298j19014J1927O6915
13794b9042k38l1919J7440N6958n1149j0005j33589l0404J31763M7016N6270k220
13782B0881J1108L1059J3619j17640j55619P3301J46889J9338k4630q0169j8822
$$ plain form
13771 -80685 -110149 -125950 -37543 13767 6551 17181 47398 88314 51316 40897 46938 80275
13759 80275 53129 143672 217801 137673 33080 -11632 18490 -120218 -165619 -46683 40825
13748 40825 -9891 15199 -3061 -20100 -7603 -22323 -69903 -154116 -193076 -135838 -69691 -108759
13736 -108759 -199971 -237051 -139798 -22867 22220 -81851 -33920 10460 -76803 -17855 108100
13725 108100 164664 122381 92177 -119501 -179406 -99712 -126824 -66298 -43833 -113728 -104677
13714 -104677 -140146 -191034 -269030 -303082 -131503 11970 71054 110748 138963 125819 -5654
13703 -5654 -113235 -135629 -236753 -114957 -99718 -190068 -101510 -104036 -159853 -86888 -55382
13692 -55382 -141078 -206624 -228856 -195804 -70094 -140522 -197681 -88506 -44274 -4777 37766
$$ packed form
13771h0685k9464j5801Q8407N1310p216J0630L0217M0916l6998j0419O041L3337
13759H0275k7146R0543P4129q0128j04593m4712L0122j38708m5401J18936Q7508
13748D0825n0716K5090j8260j7039J2497j4720m7580q4213l8960N7238O6147l9068
13736a08759r1212l7080R7253J16931M5087j04071M7931M4380q7263N8948J25955
13725A08100N6564m2283l0204k11678n9905P9694k7112O0526K2465o9895R051
13714a04677l5469n0888p7996l4052J71579J43473N9084L9694K8215j3144j31473
13703e654j07581k2394j01124J21796J5239r0350Q8558k526n5817P2965L1506
13692e5382q5696o5546k2232L3052J25710p0428n7159J09175M4232L9497M2543
$$ plain form
13681 37766 -61715 -182032 -171217 -87209 -68899 -101223 -104482 -173597 -23525 92657 25689
13670 25689 -48423 29384 31022 -122360 -33671 -65700 -134733 -59639 -4498 -10454 40048 8711
13658 8711 -96166 -21557 31846 58100 -124252 -224380 -221763 -158089 -9353 -79132 -181104
13647 -181104 -222763 -234434 -176028 30947 11405 -127689 -229018 -126175 -107062 -85951 -51006
13636 -51006 -104829 -65530 -32519 -110705 -215750 -184204 -168641 -156843 -236237 -334579 -337362 -356576
13624 -356576 -394017 -296939 -190307 -95998 -34564 -98652 -133397 -69333 -74356 -55307 -51592 -110489
13612 -110489 -38130 42454 -16899 -103802 -19768 28556 -11461 -70920 -230477 -230321 -143240 -98259
13600 -98259 -162781 -268334 -338946 -272115 -166183 -94122 -39116 33681 -51899 -12344 35553
$$ packed form
13681C7766r9481j20317J0815Q4008J8310l2324l259o9115J50072J16182o6968
13670B5689p4112P7807J638j53382Q8689l2029o9033P5094N5141n956N0502l1337
13658H711j04877P4609N3403K6254j82352j00128K617O3674J48736o9779j01972
13647a81104m1659j1671N8406K06975j9542j39094j01329J02843J9113K1111L4945
13636e1006n3823L9299L3011p8186j05045L1546J5563J1798p9394r8342k783j9214
13624c56576l7441R7078J06632R4309O1434o4088l4745O4064n023J9049L715n8897
13612a10489P2359Q0584n9353q6903Q4034M8324m0017n9459j59557J56Q7081M4981
13600i8259o4522j05553p0612O6831J05932P2061N5006P2797q5580L9555M7897
$$ plain form
13589 35553 111232 169115 74438 32264 -51368 -57550 -72797 -76054 69334 107583 35647 59703
13577 59703 -68558 -153045 -89571 -100048 -144544 -105463 19558 -15883 -2016 -24983 -88423
13566 -88423 5240 107060 93372 74532 33878 -24971 -13149 25048 135529 142129 160617
13555 160617 5560 -10467 34633 105251 236778 59630 -27257 -78270 -79465 -27272 37237
13544 37237 117578 206709 145319 8456 13290 -34669 50362 118407 69192 18450 99103 142753
13532 142753 71405 3457 127256 228644 168853 85560 99780 187333 83620 21411 76280
13521 76280 115864 206752 186134 181702 75603 -43303 -81573 -113699 -207033 -255091 -206786
13510 -206786 -99428 23846 52650 18388 5947 -35361 -87778 -182315 -335184 -220150 -142655
$$ packed form
13589C5553P5679N7883r4677m2174q3632o182j5247l257J45388L8249p1936K4056
13577E9703j28261q4487O3474j0477m4496L9081J25021l5441J3867k2967o3440
13566h8423R3663J01820j3688j8840m0654n8849J1822L8197J10481O600J8488
13555A60617j55057j6027M5100P0618J31527j77148q6887n1013j195N2193O4509
13544C7237Q0341Q9131o1390j36863M834m7959Q5031O8045m9215n0742Q0653M3650
13532A42753p1348o7948J23799J01388n9791q3293J4220Q7553j03713o2209N4869
13521G6280L9584R0888k0618m432j06099j18906l8270l2126r3334m8058M8305
13510b06786J07358J23274K8804l4262j2441m1308n2417r4537j52869J15034P7495
$$ plain form
13499 -142655 -60000 17874 -18885 -83592 -115879 -177223 -267192 -244492 -205284 -142985 -40364
13488 -40364 -51827 -78523 -124362 -92423 32570 -17772 -29261 -2345 -48041 -7009 179857
13477 179857 236286 151930 75174 95851 163660 168538 223510 111746 -6802 77710 72057
13466 72057 49345 2332 30537 147804 160912 78613 116454 254511 156092 67426 11360
13455 11360 3546 144717 156594 -69018 -112996 -19353 -66656 -112450 -186008 -220159 -163148
13444 -163148 -228411 -168935 -101698 -66285 -27580 -113644 -152621 -55820 13828 33002 9186
13433 9186 -61748 -72140 -142608 -186315 -278227 -220576 -189366 -107346 -108648 -117973 -196110 -294690
13421 -294690 -254196 -179128 -184631 -82420 4867 -101928 -260714 -190908 -146837 -164575 -276959
$$ packed form
13499a42655Q2655P7874l6759o4707l2287o1344q9969K2700L9208O2299J02621
13488d0364j1463k6696m5839L1939J24993n0342j1489K6916m5696M1032J86866
13477A79857N6429q4356p6756K0677O7809M878N4972j11764j18548Q4512n653
13466G2057k2712m7013K8205J17267J3108q2299L7841J38057r8419q8666n6066
13455A1360p814J41171J1877k25612m3978R3643m7303m5794p3558l4151N7011
13444a63148o5263N9476O7237L5413L8705q6064l8977R6801O9648J9174k3816
13433I186p0934j0392p0468m3707r1912N7651L1210Q2020j302r325p8137r8580
13421b94690M0494P5068n503J02211Q7287j06795j58786O9806M4071j7738j12384
$$ plain form
13410 -276959 -372060 -311163 -120656 17059 104107 107643 175988 211488 154079 101954 108454
13399 108454 86494 44660 57797 143822 124797 90904 20220 -22170 -165409 -176537 -263386
13388 -263386 -200232 -134625 31470 92668 110131 80679 -17511 -53961 46360 109524 137127
13377 137127 108203 -4002 -62733 -87468 -46074 -8882 79815 113792 3898 1082 -51217
13366 -51217 -99790 -80783 -121232 -137409 -11644 135212 85391 76551 50893 69709 94020
13355 94020 21329 70167 84826 48138 73419 85258 56185 84678 -1625 -75158 -82459 -134685
13343 -134685 -209060 -178441 -55515 -198 -15569 -125047 -179519 -62729 -69934 -167315 -235476
13332 -235476 -268888 -192109 -180850 -105619 -170924 -236935 -274426 -301222 -195210 -70410 69317
$$ packed form
13410b76959r5101O0897J90507J37715Q7048L536O8345L5500n7409n2125O500
13399A08454k1960m1834J3137Q6025j9025l3893p0684m2390j43239j1128q6849
13388b63386O3154O5607J66095O1198J7463k9452r8190l6450J00321O3164K7603
13377A37127k8924j12205n8731k4735M1394L7192Q8697L3977j09894k816n2299
13366e1217m8573J9007m0449j6177J25765J46856m9821q840k5658J8816K4311
13355I4020p2691M8838J4659l6688K5281J1839k9073K8493q6303p3533p301n2226
13343a34685p4375L0619J22926N5317j5371j09478n4472J16790p205r7381o8161
13332b35476l3412P6779J1259P5231o5305o6011l7491k6796J06012J24800J39727
$$ plain form
13321 69317 128643 93639 9937 -55252 -27304 -6633 45399 132239 108409 2602 -55279
13310 -55279 1897 -52988 -77647 -3855 -5243 -147474 -134330 -82068 -20246 84593 71743
13299 71743 18874 -44827 24934 107264 64593 -65666 -21071 -41344 -59002 50517 59355
13288 59355 -624 -34482 -26332 -58484 -14314 22453 25763 -56653 -100592 -43660 140171 106989
13276 106989 -58923 -65993 16630 40646 98250 56737 -9601 27542 -45880 -58150 -79554
13265 -79554 -8621 41004 27483 24076 19588 113821 3464 79323 181756 145325 78038 13824
13253 13824 -22969 -65260 -54986 57542 168181 75109 426 -40038 -142027 -108949 33259
13242 33259 -15033 7419 -144152 -168328 -110575 -61468 34585 121202 -319 -38321 125051
$$ packed form
13321F9317N9326l5004q3702o5189K7948K0671N2032Q6840k3830j05807n7881
13310e5279N7176n4885k4659P3792j388j42231J3144N2262O1822J04839j2850
13299G1743n2869o3701O9761Q2330m2671j30259M4595k0273j7658J09519Q838
13288E9355n9979l3858Q150l2152M4170L6767L310q2416m3939N6932J83831l3182
13276A06989j65912p070Q2623K4016N7604m1513o6338L7143p3422j2270k1404
13265g9554P0933M9625j3521l407m488R4233j10357P5859J02433l6431o7287o4214
13253A3824l6793m2291J0274J12528J10639r3072p4683m0464j01989L3078J42208
13242C3259m8292K2452j51571k4176N7753M9107R6053Q6617j21521l8002J63372
$$ plain form
13231 125051 76100 55848 61873 641 -20523 58354 5685 -79642 -35026 -68621 -94300 -8245
13219 -8245 26811 -11576 -87998 -38220 -70097 -113631 -79386 -85838 -58372 -47909 67758 186070
13207 186070 55628 -20205 -40613 -65408 -135130 -76137 42858 -20069 -60006 -7752 -53890
13196 -53890 131599 205196 143911 137402 131424 91985 71456 113459 202423 200506 208147 274114
13184 274114 393106 379455 386685 450267 260583 112203 46438 36227 101437 138942 51486
13173 51486 -3365 70893 112315 101144 58747 77397 168380 265661 295031 293873 263685 168316
13161 168316 74889 155620 92336 94203 92568 159361 88494 150784 62839 -65357 -75491 -79498
13149 -79498 -21214 43429 67269 166605 266502 290898 256767 335346 418205 359949 400471 513598
$$ packed form
13231A25051m8951k0252O025o1232k1164P8877n2669q5327M4616l3595k5679Q6055
13219h245L5056l8387p6422M9778l1877m3534L4245o452K7466J0463J15667J18312
13207A86070j30442p5833k0408k4795o9722N8993J18995o2927l9937N2254m6138
13196e3890J85489P3597o1285o509n978l9439k0529M2003Q8964j917P641O5967
13184B74114J18992j3651P230O3582j89684j48380o5765j0211O5210L7505q7456
13173E1486n4851P4258M1422j1171m2397J8650R0983R7281K9370j158l0188r5369
13161A68316r3427Q0731o3284J867j635O6793p0867O2290q7945j28196j0134m007
13149g9498N8284O4643K3840R9336R9897K4396l4131P8579Q2859n8256M0522J13127
$$ plain form
13137 513598 499660 341461 189114 92381 139951 103653 29846 -16911 19296 -62105 -208149
13126 -208149 -163304 -15213 -33551 29202 7782 92917 56022 -30892 -9001 77402 106111
13115 106111 34018 77246 28530 -3145 -36977 -38763 -70817 -105012 -193470 -175334 -49267
13104 -49267 19826 88783 107379 172705 170931 159060 161966 103190 86168 45407 117130 -11791
13092 -11791 -116901 -199122 -150736 -44905 -1990 -889 27094 8537 -112957 -124258 -91073
13081 -91073 -137518 -155522 -81231 8786 53807 78749 133890 52022 -29974 -81809 -36359 -25270
13069 -25270 -154226 -80949 -81924 -134590 -148600 -80081 -68935 -124260 -82242 -14621 -5674 -98119
13057 -98119 -223926 -226481 -155955 -40010 33391 109079 113298 33780 -22125 -91886 -145377 -173976
$$ packed form
13137E13598j3938j58199j52347r6733M7570l6298p3807m6757L6207q1401j46044
13126b08149M4845J48091j8338O2753k1420Q5135l6895q6914K1891Q6403K8709
13115A06111p2093M3228m8716l1675l3832j786l2054l4195q8458J8136J26067
13104d9267O9093O8957J8596O5326j774j1871K906n8776j7022m0761P1723j28921
13092a1791j05110q2221M8386J05831M2915J101K7983j8557j21494j1301L3185
13081i1073m6445j8004P4291R0017M5021K4942N5141q1868q1996n1835M5450J1089
13069b5270j28956P3277r75n2666j4010O8519J1146n5325M2018O7621Q947r2445
13057i8119j25807k555P0526J15945P3401P5688M219p9518n5905o9761n3491k8599
$$ plain form
13045 -173976 -145467 -71479 46701 74484 225758 232024 137067 64587 -100324 -105411 75364
13034 75364 124212 144871 185182 162199 26488 -5652 24124 -31761 -58272 9504 -26577
13023 -26577 -44502 -42732 -100201 -60177 -3348 81762 33682 -81523 -178508 -149300 6625
13012 6625 31186 -31175 13434 -3870 -56783 -167288 -230671 -176201 -99444 -22020 -35374 66267
13000 66267 121995 99034 38903 53942 91132 102919 228508 269490 292259 350932 240409
12989 240409 100892 10211 -42191 -44271 105014 191458 101124 -107515 -212152 -281873 -144565
12978 -144565 92577 86601 85148 -3354 -86992 -16692 -33264 -36634 53501 -22912 -52892 -97848
12966 -97848 -85467 15161 40378 28429 8637 30263 6010 -96287 -23868 32104 2464
$$ packed form
13045a73976K8509P3988J18180K7783J51274O266r4957p2480j64911n087J80775
13034G5364M8848K0659M0311k2983j35711l2140K9776n5885k6511O7776l6081
13023b6577j7925J770n7469M0024N6829Q5110m8080j15205r6985K9208J55925
13012F625K4561o2361M4609j7304n2913j10505o3383N4470P6757P7424j3354J01641
13000F6267N5728k2961o0131J5039L7190J1787J25589M0982K2769N8673j10523
12989B40409j39517r0681n2402k080J49285Q6444r0334k08639j04637o9721J37308
12978a44565K37142n976j453q8502q3638P0300j6572l370R0135p6413k9980m4956
12966i7848J2381J00628K5217j1949j9792K1626k4253j02297P2419N5972k9640
$$ plain form
12955 2464 52734 100078 23557 -2049 -16600 19852 59302 31907 -37182 -28793 -28572 -151759
12943 -151759 -198660 -80806 -92349 -27775 132194 125674 -1586 -46704 -51178 -6501 17037
12932 17037 -70484 -213071 -264787 -268721 -215526 -96373 -30697 -19992 86700 -2102 44625
12921 44625 5238 10877 50074 127861 122997 159335 192486 138925 72034 5886 -115782 -36354
12909 -36354 -42115 -59820 -94921 -68094 50265 135951 33246 37080 -42342 -157484 -175376
12898 -175376 -144852 -18919 -47906 -97832 -140782 -108956 42486 166830 136118 -149738 -250533
12887 -250533 -252958 -135321 -30934 32833 -29708 -46622 49942 23461 21535 -13272 -24519
12876 -24519 -167266 -28000 -66519 23256 172470 176398 143318 -73400 -102250 -44402 113483
$$ packed form
12955B464N0270M7344p6521k5606j4551L6452L9450k7395o9089Q389K21j23187
12943a51759m6901J17854j1543O4574J59969o520j27260m5118m474M4677K3538
12932A7037q7521j42587n1716l934N3195J19153O5676J0705J06692q8802M6727
12921D4625l9387N639L9197P7787m864L6338L3151n3561o6891o6148j21668P9428
12909c6354n761j7705l5101K6827J18359Q5686j02705L834p9422j15142j7892
12898a75376L0524J25933k8987m9926m2950L1826J51442J24344l0712k85856j00795
12887b50533k425J17637J04387O3767o2541j6914R6564k6481j926l4807j1247
12876b4519j42747J39266l8519Q9775J49214L928l3080k16718k8850N7848J57885
$$ plain form
12865 113483 69143 -44715 -168511 -184398 -114175 -92072 -149629 -27961 -2624 -81518 -115914
12854 -115914 -3153 -60290 -82073 -91917 -157091 -130596 -149131 -183407 -231171 -151036 -138641
12843 -138641 -99170 -44438 955 6134 -124109 -68941 -83498 -69877 -153803 -191994 -79078
12832 -79078 -28730 -97762 -131479 -118345 42316 110112 191320 295182 231705 131241 45963
12821 45963 50430 -80678 -86696 -6446 -90860 -153387 -210252 -214211 -115356 -28338 104659 67058
12809 67058 7462 -16451 50823 98463 125170 173803 36515 -42289 -39118 -29983 137001 89897
12797 89897 25373 -22540 -171120 -151318 -131567 -214629 -253184 -133835 -69760 -98353 -157823
12786 -157823 -154957 -174694 -158040 -86026 61546 83320 18931 65730 132770 150753 167889
$$ packed form
12865A13483m4340j13858j23796j5887P0223K2103n7557J21668K5337p8894l4396
12854a15914J12761n7137k1783r844o5174K6495j8535l4276m7764Q0135J2395
12843a38641L9471N4732M5393N179j30243N5168j4557J3621q3926l8191J12916
12832g9078N0348o9032l3717J3134J60661O7796Q1208J03862o3477j00464q5278
12821D5963M467j31108o018Q0250q4414o2527n6865l959R8855Q7018J32997l7601
12809F7058n9596k3913O7274M7640K6707M8633j37288p8804L171R135J66984m7104
12797H9897o4524m7913j48580J9802J9751q3062l8555J19349O4075k8593n9470
12786a57823K866j9737J6654P2014J47572K1774o4389M6799O7040J7983J7136
$$ plain form
12775 167889 195185 128249 27823 -80384 -90465 84074 71322 52685 53147 131972 147566
12764 147566 72732 -134286 -220290 -90481 -51931 8729 88969 104780 84669 -2081 7999
12753 7999 96597 130537 94350 -12948 -41368 47197 -28868 -139798 -107902 -59291 -99352
12742 -99352 -122966 -104890 -115732 -168761 -127767 100335 164828 42636 47950 130073 61765
12731 61765 -84799 -115140 -146093 -146907 -220795 -206955 -102805 -25755 -16605 91989 133810 104606
12719 104606 69646 17794 77285 138630 237416 364482 323390 221029 165872 86582 -54926
12708 -54926 -148629 -47172 -5693 -32600 7047 34356 -24548 -150710 -242477 -189073 -76581
12697 -76581 -1734 -988 121291 117046 98658 26667 24097 36016 116725 119187 34187 -12499
$$ packed form
12775A67889K7296o6936j00426j08207j0081J74539j2752j8637M62P8825J5594
12764A47566p4834k07018q6004J29809L8550O0660Q0240J5811k0111q6750J0080
12753G999Q8598L3940l6187j07298k8420Q8565p6065j10930L1896M8611m0061
12742i9352k3614J8076j0842n3029M0994K28102O4493j22192N314Q2123o8308
12731F1765j46564l0341l0953q14p3888J3840J04150P7050R150J08594M1821k9204
12719A04606l4960n1852N9491O1345R8786J27066m1092j02361n5157p9290j41508
12708e4926r3703J01457M1479k6907L9647K7309n8904j26162r1767N3404J12492
12697g6581P4847P46J22279m245j8388p1991k570J1919Q0709K462q5000m6686
$$ plain form
12685 -12499 -36611 18462 165495 279519 179029 121646 140939 44156 -185643 -257476 -272432
12674 -272432 -283977 -128844 -52052 40378 239084 212108 163920 77608 95816 88947 -21164
12663 -21164 -31696 33917 73732 139065 146821 123692 82622 905 -48023 84534 106666 18396
12651 18396 -18777 11918 75071 144999 46824 -61669 -107088 -254 3031 87249 56755
12640 56755 1125 121187 142277 -60090 -184318 -29939 62281 75644 98785 69435 -810
12629 -810 -7962 53862 95418 -39317 -118247 -139634 -46868 -130986 -170556 4547 106462 67213
12617 67213 70860 52640 6928 -114807 -104248 -13222 65285 64678 112256 43072 53763 20724
12605 20724 -51707 -32558 6907 -79612 -199658 -249938 -259610 -132998 17426 -97207 -68693
$$ packed form
12685a2499k4112N5073J47033J14024j00490n7383J9293r6783k29799p1833j4956
12674b72432j1545J55133P6792R2430J98706k6976m8188q6312J8208o869j10111
12663b1164j0532O5613L9815O5333P756k3129m1070q1717m8928J32557K2132q8270
12651A8396l7173L0695O3153O9928r8175j08493m5419J06834L285Q4218l0494
12640E6755n5630J20062K1090k02367j24228J54379R2220J3363K3141k9350p0245
12629h10p152O1824M1556j34735p8930k1387R2766q4118l9570J75103J01915l9249
12617F7213L647j8220m5712j21735J0559R1026P8507o07M7578o9184J0691l3039
12605B0724p2431J9149L9465q6519j20046n0280r672J26612J50424j14633K8514
$$ plain form
12594 -68693 -145240 -194943 -141229 -106975 -110746 -146624 -204052 -230398 -55363 40990 -2814 -98156
12582 -98156 -25605 -22969 36300 12796 -25080 -47985 -31100 -36963 -70953 58907 163620 -59040
12570 -59040 -205896 -188052 -192783 -232130 -210497 -63978 17713 -110283 -240022 -188249 -169372
12559 -169372 -138200 -135857 -124336 -118923 -88833 -85047 -7002 -57100 -176570 -196450 -120564 -25604
12547 -25604 -809 -13647 -22208 -67929 -68229 -97664 -95193 39124 181913 62141 17843 1074
12535 1074 -137253 -140739 -8423 21041 -39373 -71440 -70499 65807 -53801 -203685 -261519
12524 -261519 -179765 -111754 -93578 -73693 -51941 -22740 6199 -21234 -29738 5084 -56998 -42085
12512 -42085 -16727 -109643 -55423 3005 10242 -84758 -102035 39666 116256 49703 -78139
$$ packed form
12594f8693p6547m9703N3714L4254l771l5878n7428k6346J75035R6353m3804r5342
12582i8156P2551K636N9269k3504l7876k2905J6885n863l3990J29860J04713k22660
12570e9040j46856J7844m731l9347K1633J46519Q1691j27996j29739N1773J8877
12559a69372L1172K343J1521N413L0090L786P8045n0098j19470j9880P5886R4960
12547b5604K4795j2838q561m5721l00k9435K471J34317J42789j19772m4298j6769
12535A074j38327l486J32316K9464o0414l2067R41J36306j19608j49884n7834
12524b61519Q1754O8011J8176J9885K1752K9201K8939k7433q504L4822o2082J4913
12512d2085K5358r2916N4220N8428P237r5000j7277J41701P6590o6553j27842
$$ plain form
12501 -78139 1239 -83105 -109815 -75945 7216 135637 119597 174092 107125 -13269 12581
12490 12581 48959 35967 4993 -72403 -67130 2046 158924 274309 241420 144783 93989
12479 93989 -44400 -79352 -92058 -103395 -58411 2785 -29740 -81881 -49380 27041 118883
12468 118883 169155 144292 156469 180807 48921 -22187 -23956 37403 162943 190906 128650
12457 128650 65512 47051 48001 8520 64835 14393 -19656 -19988 -21831 -31142 -52593 -65349 8144
12444 8144 60381 102336 73451 63895 14788 -61055 -35333 -78881 -136176 -186946 -119619 11569
12432 11569 195489 169395 89032 25214 -12566 -106104 -153709 -33437 16674 -34517 -147163
12421 -147163 -129158 -5169 23678 126069 64472 23222 44135 -38219 -2384 59341 142884
$$ packed form
12501g8139P9378q4344k6710L3870Q3161J28421j6040N4495o6967j20394K5850
12490A2581L6378j2992l0974p7396N273O9176J56878J15385l2889r6637n0794
12479I3989j38389l4952j2706j1337M4984O1196l2525n2141L2501P6421R1842
12468A18883N0272k4863J2177K4338j31886p1108j769O1359J25540K7963o2256
12457A28650o3138j8461R50l9481N6315n0442l4049l32j843r311k1451j2756P3493
12444H144N2237M1955k8885r556m9107p5843K5722m3548n7295n0770O7327J31188
12432A1569J83920k6094q0363o3818l7780r3538m7605J20272N0111n1191j12646
12421a47163J8005J23989K8847J02391o1597m1250K0913q2354L5835O1725Q3543
$$ plain form
12410 142884 127604 43350 30006 -61565 -75393 -21360 3770 9635 93840 174540 154032 68314
12398 68314 18993 -64741 34117 24850 -69030 -190402 -95160 -1559 62550 70277 120243 -23019
12386 -23019 -111472 -51668 -37835 20639 46155 112661 223411 190366 211272 147413 76276
12375 76276 103093 64058 40545 66173 -35643 74146 152631 145241 81560 -49917 -94274
12364 -94274 -75381 -61052 -46267 -20958 31132 63744 151877 43586 111426 124971 235338
12353 235338 175092 45537 -18380 144843 208950 75564 61976 -11069 79355 67211 98573
12342 98573 125840 125444 56819 -15796 -95556 -79628 -131323 -8540 -16308 -82340 53236 102500
12330 102500 138247 158527 114200 -53074 -83741 -14090 -32050 -23793 -91242 -95746 -38880 -35617
$$ packed form
12410A42884j5280q4254j3344r1571j3828N4033K5130N865Q4205Q0700k0508q5718
12398F8314m9321q3734R8858r267r3880j21372R5242R3601O4109P727M9966j43262
12386b3019q8453N9804J3833N8474K5516O6506J10750l3045K0906o3859p1137
12375G6276K6817l9035k3513K5628j01816J09789P8485p390o3681j31477m4357
12364i4274J8893J4329J4785K5309N2090L2612Q8133j08291O7840J3545J10367
12353B35338o0246j29555o3917J63223O4107j33386j3588p3045R0424j2144L1362
12342I8573K7267l96o8625p2615p9760J5928n1695J22783p768o6032J35576M9264
12330A02500L5747K0280m4327j67274l0667O9651j7960Q257o7449m504N6866L263
$$ plain form
12318 -35617 -77652 54685 171737 133796 113316 -35480 -26082 40119 99631 96027 122035
12307 122035 139914 139207 76357 10258 -38570 -156830 -168182 -130328 -138788 -211236 -168599 -155792
12295 -155792 -125592 25698 23062 -77173 -78311 -236378 -304675 -110396 -121266 -203753 -172729
12284 -172729 -72028 1028 38418 118184 172155 91271 119427 202853 215839 228552 198441
12273 198441 144238 90768 78683 58058 102582 192990 160146 138502 171196 121442 28671
12262 28671 17421 136832 171054 107764 134314 157093 181225 161280 145199 111347 135931
12251 135931 114390 51119 -31992 -30556 99119 130168 163144 191819 155979 134483 24068
12240 24068 83124 36675 -16938 40334 50610 155929 113081 117375 191399 210794 170184 55949
$$ packed form
12318c5617m2035J32337J17052l7941k0480j48796R398O6201N9512l604K6008
12307A22035J7879p07o2850o6099m8828j18260j1352L7854q460p2448M2637J2807
12295a55792L0200J51290k636j00235j138j58067o8297J94279j0870q2487L1024
12284a72729J00701P3056L7390P9766N3971q0884K8156Q3426J2986J2713l0111
12273A98441n4203n3470j2085k0625M4524R0408l2844k1644L2694m9754r2771
12262B8671j1250J19411L4222o3290K6550K2779K4132j9945j6081l3852K4584
12251A35931k1541o3271q3111J436J29675L1049L2976K8675l5840k1496j10415
12240B4068N9056m6449n3613N7272J0276J05319m2848M294P4024J9395m0610j14235
$$ plain form
12228 55949 95875 345412 376925 275427 278417 264062 155767 266223 222009 141333 220534
12217 220534 272024 303066 320282 380490 352127 249722 92452 78937 226361 314699 223618
12206 223618 116395 50939 2167 5432 97766 135770 125497 224297 248637 197122 218798
12195 218798 215124 103206 36280 128110 225289 277354 386813 387424 338950 311397 304033 333362
12183 333362 233197 125180 135308 124370 248053 395711 393975 302893 282833 275216 320382
12172 320382 301368 281928 263443 267261 298677 373773 387804 426950 341027 332267 337611 355738
12160 355738 378089 390839 536802 410417 317513 306171 299989 306816 276377 254365 260210 213391
12148 213391 220239 157720 222512 273145 419711 570384 578463 519414 500684 439727 380039
$$ packed form
12228E5949L9926K49537L1513j01498K990j4355j08295J10456m4214q0676P9201
12217B20534N1490L1042J7216O0208k8363j02405j57270j3515J47424Q8338r1081
12206B23618j07223o5456m8772L265R2334L8004j0273R8800K4340n1515K1676
12195B18798l674j11918o6926R1830R7179N2065J09459O11m8474k7553p364K9329
12183C33362j00165j08017J0128j0938J23683J47658j736r1082k0060p617M5166
12172C20382j9014j9440j8485L818L1416P5096J4031L9146q5923q760N344J8127
12160C55738K2351J2750J45963j26385r2904j1342o182O827l0439k2012N845m6819
12148B13391O848o2519O4792N0633J46566J50673Q079n9049j8730o0957n9688
$$ plain form
12137 380039 342917 408891 502857 392125 424222 420893 393703 457821 438086 393265 488537
12126 488537 553868 495225 428657 436442 483915 438373 444394 347283 390024 546136 581342 572503
12114 572503 585381 626102 506058 342571 440275 546834 474079 316740 305439 376737 348423
12103 348423 366176 309615 388031 527957 592306 522840 519180 529516 529543 547359 557637 465994
12091 465994 477623 531896 666014 703970 718689 784844 767034 658131 597751 635605 496752
12080 496752 430144 514203 529913 562417 644696 710879 784170 839834 885796 773192 530204
12069 530204 483029 543417 604107 580819 694380 900887 900765 905174 820627 834048 895838 947397
12057 947397 1134398 1228685 1225412 1135247 1065425 1065683 1069327 1154235 1192963 1154430 1054062 1158249
$$ packed form
12137C80039l7122O5974R3966j10732L2097l329k7190O4118j9735m4821R5272
12126D88537O5331n8643o6568P785M7473m5542O021r7111M2741J56112L5206q839
12114E72503J2878M0721j20044j63487R7704J06559p2755j57339j1301P1298k8314
12103C48423J7753n6561P8416J39926O4349o9466l660J0336K7J7816J0278r1643
12091D65994J1629N4273J34118L7956J4719O6155j7810j08903o0380L7854j38853
12080D96752o6608Q4059J5710L2504Q2279O6183P3291N5664M5962j12604k42988
12069E30204m7175O0388O0690k3288J13561K06507j22M409q4547J3421O1790N1559
12057I47397J87001R4287l273r0165o9822K58L644Q4908L8728l8533j00368J04187
$$ plain form
12045 1158249 1410077 1437023 1352412 1327952 1355931 1328231 1377741 1308365 1281835 1312296 1402607
12034 1402607 1401924 1444844 1459535 1319872 1285591 1272075 1294384 1484153 1595076 1591917 1572312
12023 1572312 1624326 1648954 1763621 1777989 1836802 1745282 1766934 1808875 1841888 1938226 2053863
12012 2053863 2065513 2033073 2094570 2190256 2219162 2228040 2338889 2363460 2300572 2320447 2434953
12001 2434953 2602681 2616607 2724193 2735202 2665316 2563257 2647450 2852498 2869125 2926380
11991 2926380 2971656 3044457 3139555 3236148 3324290 3362718 3522139 3663410 3683649 3676996 3959914
11980 3959914 4226325 4252106 4286705 4409131 4468225 4586746 4816694 4965923 5140697 5353121
11970 5353121 5498745 5778225 6056312 6371062 6615889 6799481 7071255 7329829 7576936
$$ packed form
12045A158249K51828K6946q4611k4460K7979k7700M9510o9376k6530L0461R0311
12034A402607o83M2920J4691j39663l4281j3516K2309J89769J10923l159j9605
12023A572312N2014K4628J14667J4368N8813r1520K1652M1941L3013R6338J15637
12012B053863J1650l2440O1497R5686K8906Q878J10849K4571o2888J9875J14506
12001B434953J67728J3926J07586J1009o9886j02059Q4193K05048J6627N7255
11991B926380M5276P2801R5098R6593Q8142L8428J59421J41271K0239o653K82918
11980C959914K66411K5781L4599J22426N9094J18521K29948J49229J74774K12424
11970E353121J45624K79480K78087L14750K44827J83592K71774K58574K47107
$$ plain form
11961 7576936 7861533 8314648 8775490 9118546 9537333 10111386 10722760 11363678 12097141
11952 12097141 12904459 13631208 14434092 15357814 16362346 17543409 18690118 19995349 21460835
11943 21460835 23048833 24942171 26906971 29010943 31549535 34307785 37318116 40807267
11935 40807267 44824538 49432888 54594900 60499717 67238579 74706944 83239695 92624653
11927 92624653 103051273 114149910 125905140 137818425 149106752 159186487 167406814
11920 167406814 172972563 175234169 174128608 170002760 163484083 155246218 145922738 136082058
11912 136082058 126369728 117112452 108454434 100433216 93051781 86197424 80113711 74432825
11904 74432825 69221278 64466397 59996413 56018853 52326705 48799641 45538119 42662519
$$ packed form
11961G576936K84597M53115M60842L43056M18787N74053O11374O40918P33463
11952A2097141Q07318P26749Q02884R23722J004532J181063J146709J305231J465486
11943B1460835J587998J893338J964800K103972K538592K758250L010331L489151
11935D0807267M017271M608350N162012N904817O738862P468365Q532751R384958
11927I2624653J0426620J1098637J1755230J1913285J1288327J0079735Q220327
11920A67406814N565749K261606j105561m125848o518677q237865r323480r840680
11912A36082058r712330r257276q658018q021218p381435o854357o083713n680886
11904G4432825n211547m754881m469984l977560l692148l527064l261522k875600
$$ plain form
11896 42662519 39816587 37177902 34762541 32561484 30656874 28776138 27095542 25563400
11888 25563400 24056701 22619692 21382301 20208223 19020103 18052473 17064162 16084052
11880 16084052 15340697 14523233 13827080 13159981 12458166 11894208 11211938 10654203 10348885
11871 10348885 10030029 9537519 9128205 8703331 8272593 7941851 7569758 7143928 6843999
11862 6843999 6583610 6360697 6187525 6073436 5867456 5630782 5482448 5213373 4915586
11853 4915586 4683233 4486721 4348800 4341611 4189555 3972449 3735727 3530872 3328853 3188769
11843 3188769 2989830 2864442 2817021 2905753 2992468 3064275 3041387 2962349 2867897 2732645 2664110
11832 2664110 2646447 2640563 2579816 2395742 2227574 2219498 2334087 2250127 2065344 1968148 1973357
$$ packed form
11896D2662519k845932k638685k415361k201057j904610j880736j680596j532142
11888B5563400j506699j437009j237391j174078j188120r67630r88311r80110
11880A6084052p43355q17464o96153o67099p01815n63958o82270n57735l05318
11871A0348885l18856m92510m09314m24874m30738l30742l72093m25830k99929
11862F843999k60389k22913j73172j14089k05980k36674j48334k69075k97787
11853D915586k32353j96512j37921p189j52056k17106k36722k04855k02019j40084
11843C188769j98939j25388m7421Q8732Q6715P1807k2888p9038r4452j35252o8535
11832B664110j7663n884o0747j84074j68168q076J14589q3960j84783r7196N209
$$ plain form
11821 1973357 1938255 1884846 1785805 1751342 1692669 1711730 1767126 1735101 1739514 1746345 1681091 1720895
11809 1720895 1797161 1729342 1695941 1616425 1669736 1605854 1609260 1633212 1592027 1396830 1261328
11798 1261328 1321225 1334348 1379383 1427253 1288539 1236019 1246737 1184547 1226038 1310116 1346705
11787 1346705 1308661 1242308 1244141 1223706 1324009 1190598 1053922 1047110 965102 941265 1048452
11776 1048452 1029365 923969 925947 1046787 1163567 1166871 1099464 1039878 1050885 960478 893635
11765 893635 906347 893280 836301 772335 920810 900333 928369 993164 945027 830451 792618
11754 792618 746202 741344 735378 651993 606441 675822 703553 660012 758217 821046 808717 733221
11742 733221 793526 773303 742078 697519 684313 579626 442806 403041 347206 340845 516350
$$ packed form
11821A973357l5102n3409r9041l4463n8673J9061N5396l2025M413O831o5254L9804
11809A720895P6266o7819l3401p9516N3311o3882L406K3952m1185j95197j35502
11798A261328N9897J3123M5035M7870j38714n2520J0718o2190M1491Q4078L6589
11787A346705l8044o6353J833k0435J00303j33411j36676o812q2008k3837J07187
11776A048452j9087j05396J978J20840J16780L304o7407n9586J1007r0407o6843
11765H93635J2712j3067n6979o3966J48475k0477K8036O4795m8137j14576l7833
11754G92618m6416m858n966q3385m5552O9381K7731m3541R8205O2829j2329p5496
11742G33221O0305k0223l1225m4559j3206j04687j36820l9765n5835o361J75505
$$ plain form
11731 516350 635826 663248 625342 443354 338459 349898 357010 403072 394764 408943 415862
11720 415862 461919 412480 320666 347474 423252 463884 488989 459767 359442 419734 378944
11709 378944 495265 531489 344424 260778 395775 418557 300445 287541 366737 295191 216198
11698 216198 206312 162250 65966 156532 304268 439374 475673 475149 319644 325962 228489 108367
11686 108367 106231 96815 156561 165135 142736 289881 277853 225080 227403 319645 337182 287428
11674 287428 299969 318548 332845 237702 171473 229695 204722 179425 233938 325717 339037
11663 339037 390964 369791 257119 151776 111313 184585 137971 134134 240896 324032 387881
11652 387881 226766 142409 176318 185846 214322 134240 208915 268995 293434 222140 185915
$$ packed form
11731E16350J19476K7422l7906j81988j04895J1439P112M6062q308J4179O919
11720D15862M6057m9439r1814K6808P5778M0632K5105k9222j00325O0292m0790
11709C78944J16321L6224j87065q3646J34997K2782j18112j2904P9196p1546p8993
11698B16198r886m4062r6284R0566J47736J35106L6299n24j55505O318r7473j20122
11686A08367k136r416N9746Q574k2399J47145j2028n2773K323R2242J7537m9754
11674B87428J2541J8579J4297r5143o6229N8222k4973k5297N4513R1779J3320
11663C39037N1927k1173j12672j05343m0463P3272m6614l837J06762Q3136O3849
11652C87881j61115q4357L3909R528K8476q0082P4675O0080K4439p1294l6225
$$ plain form
11641 185915 168409 180446 74865 68635 12758 -42431 -33459 113330 173213 166528 157268 234120
11629 234120 247320 215016 279114 309321 262193 205527 316588 273549 119860 176366 215812
11618 215812 210069 167849 114972 102846 83628 107478 76131 92520 185645 226692 200293 235104
11606 235104 185232 115265 56201 44404 43676 153484 56671 45094 129205 201573 226414 126107
11594 126107 120509 110109 56928 53727 118405 194499 108146 66642 45140 10358 113091 136715
11582 136715 43609 11165 82416 104891 77800 43438 107795 161800 187204 215475 184825
11571 184825 235703 181931 167903 134317 197306 231315 259265 238903 115803 136242 241762
11560 241762 174752 90181 1552 91264 -38497 -77684 59879 -4519 82612 145646 196661
$$ packed form
11641A85915j7506J2037j05581o230n5877n5189Q972J46789N9883o685r260P6852
11629B34120J3200l2304O4098L0207m7128n6666J11061m3039j53689N6506L9446
11618B15812n743m2220n2877j2126j9218K3850l1347J6389R3125M1047k6399L4811
11606B35104m9872o9967n9064j1797p28J09808r6813j1577Q4111P2368K4841j00307
11594A26107n598j0400n3181l201O4678P6094q6353m1504k1502l4782J02733K3624
11582A36715r3106l2444P1251K2475k7091l4362O4357N4005K5404K8271l0650
11571A84825N0878n3772j4028l3586O2989L4009K7950k0362j23100K0439J05520
11560B41762o7010q4571q8629Q9712j29761l9187J37563o4398Q7131O3034N1015
$$ plain form
11549 196661 209901 165169 99242 89481 2695 63750 119825 148272 15692 4373 128220
11538 128220 223030 256616 170092 73612 61697 207232 231823 177652 204939 112008 99935
11527 99935 134953 173729 155969 99248 140833 126872 125677 131381 126135 113913 131595 102395
11515 102395 20194 20613 47797 111065 131439 150752 111155 125913 92242 59452 23519 30004
11503 30004 11018 -3277 -2358 92351 52791 -3372 8212 58855 42751 -128282 -109707 -143670
11491 -143670 -151714 -154257 -193972 -82828 15347 145847 208876 74190 -103697 -11861 191579
11480 191579 241911 158972 143844 126763 98059 107788 -37614 67414 98355 162598 146260
11469 146260 203832 146418 166531 189471 172828 179944 230438 253507 157326 57311 69818
$$ packed form
11549A96661J3240m4732o5927r761q6786O1055N6075K8447j32580j1319J23847
11538A28220R4810L3586q6524r6480j1915J45535K4591n4171K7287r2931j2073
11527I9935L5018L8776j7760n6721M1585j3961j195N704n246j2222J7682k9200
11515A02395q2201M19K7184O3268K0374J9313l9597J4758l3671l2790l5933O485
11503C0004j8986j4295R19R4709l9560n6163J1584N0643j6104j71033J8575l3963
11491a43670q044k543l9715J11144R8175J30500O3029j34686j77887R1836K03440
11480A91579N0332q2939j5128j7081k8704R729j45402J05028L0941O4243j6338
11469A46260N7572n7414K0113K2940j6643P116N0494K3069r6181j00015J2507
$$ plain form
11458 69818 153405 185691 174029 190282 208889 70837 33320 18146 24673 23844 43843 -15546
11446 -15546 -91639 48948 192084 134696 83208 68237 79307 65455 27796 25206 23705 37
11434 37 49847 -38502 -27071 134657 154176 110055 26416 34337 -66226 -171999 -101722 -5349
11422 -5349 -87771 -59768 78243 53748 73997 53079 105391 99185 -48796 -64111 -93510 -54893
11410 -54893 1537 -44462 -93322 45578 96750 53807 20680 87010 100909 154620 179661
11399 179661 66554 -16064 55373 48790 -19003 -73869 -96114 -152148 -37926 111660 99368
11388 99368 147026 57526 -14505 52241 -12090 9898 57552 1131 -8952 69498 4874 67097
11376 67097 171555 139585 75353 181707 79532 -9797 -21752 -50466 -63319 -62486 -18275
$$ packed form
11458F9818Q3587L2286j1662J6253J8607j38052l7517j5174O527q29J9999n9389
11446a5546p6093J40587J43136n7388n1488j4971J1070j3852l7659k590j501k3668
11434C7M9810q8349J1431J61728J9519m4121q3639P921j00563j05773P0277R6373
11422e349q2422K8003J38011k4495K0249k0918N2312o206j47981j5315k9399L8617
11410e4893N6430m5999m8860J38900N1172m2943l3127O6330J3899N3711K5041
11399A79661j13107q2618P1437o583o7793n4866k2245n6034J14222J49586j2292
11388I9368M7658q9500p2031O6746o4331K1988M7654n6421j0083P8450o4624O2223
11376F7097J04458l1970o4232J06354j02175q9329j1955k8714j2853Q33M4211
$$ plain form
11365 -18275 137287 165653 251442 244775 163512 143737 148742 120080 111722 23295 25024 39610
11353 39610 95345 90797 -17181 -12640 -65400 -18636 -18066 -109336 -73679 13944 -72339 -119465
11341 -119465 -159231 -92327 39223 122362 207472 198321 170992 223787 172202 -38223 -89943
11330 -89943 -84222 -115961 -24541 -73336 -7231 148961 134239 158420 185436 153231 80249 40536
11318 40536 30612 -18867 -37501 -41966 -71836 -45184 -64483 23811 -14375 -141650 -181180 -64278
11306 -64278 43823 -33507 -73576 -77903 -158787 -132398 -18788 111318 81140 31893 -135614
11295 -135614 -178124 -125609 -95623 7003 51045 28606 -37726 18458 14806 140275 120480
11284 120480 120159 221092 250887 250737 166809 65168 12889 51340 50316 84550 122547 104304
$$ packed form
11365a8275J55562K8366Q5789o667q1263j9775N005k8662q358q8427J729J4586
11353C9610N5735m548j07978M541n2760M6764N70r1270L5657Q7623q6283m7126
11341a19465l9766O6904J31550Q3139Q5110r151k7329N2795n1585k10425n1720
11330h9943N721l1739R1420m8795O6105J56192j4722K4181K7016l2205p2982l9713
11318D0536r924m9479j8634m465k9870K6652j9299Q8294l8186j27275l9530J16902
11306f4278J08101p7330m0069m327q0884K6389J13610J30106l0178m9247j67507
11295a35614m2510N2515K9986J02626M4042k2439o6332N6184l652J25469j9795
11284A20480l21J00933K9795j50q3928j01641n2279L8451j024L4234L7997j8243
$$ plain form
11272 104304 173142 167801 4034 39275 88628 221502 181481 133313 102071 118179 80536
11261 80536 43467 19935 -27971 -75425 -149159 -181393 -213838 -229644 -133666 2221 -58878
11250 -58878 -23570 167575 265923 190883 131173 111345 136661 120513 143822 76036 66011
11239 66011 86297 143801 72071 107051 88207 112746 104705 19299 -96954 -284044 -257336
11228 -257336 -94229 604 27592 -27109 -53941 -24386 -2331 9176 -5803 -62941 -95292
11217 -95292 -88526 -40223 -111761 -152495 -172742 -170757 -92599 -23560 16947 60966 118580 45941
11205 45941 10700 46751 69844 94183 9648 -11662 33097 -7255 -28132 -41917 7086 68255
11193 68255 114344 201374 145826 36339 -6216 -54250 -131525 -83750 -64047 -197113 -194192
$$ packed form
11272A04304O8838n341j63767L5241M9353J32874m0021m8168l1242J6108l7643
11261H0536l7069k3532m7906m7454p3734l2234l2445j5806R5978J35887o1099
11250e8878L5308J91145R8348p5040n9710j9828K5316j6148K3309o7786j0025
11239F6011K0286N7504p1730L4980j8844K4539q041q5406j16253j87090K6708
11228b57336J63107R4833K6988n4701k6832K9555K2055J1507j4979n7138l2351
11217i5292O766M8303p1538m0734k0247J985P8158O9039M0507M4019N7614p2639
11205D5941l5241L6051K3093K4339q4535k1310M4759m0352k0877j3785M9003O1169
11193F8255M6089Q7030n5548j09487m2555m8034p7275M7775J9703j33066K921
$$ plain form
11182 -194192 -170999 -178538 -149412 -63852 -70101 27997 87654 54937 10729 -10172 -95622 -110514
11170 -110514 -52803 -18981 -1600 21533 88754 64803 47018 -59823 -30998 20248 23987
11159 23987 27941 23880 35831 72214 118271 158399 49254 75474 119486 44977 -38712 -128772
11147 -128772 -147888 -127510 -93621 113622 90045 -37884 -60746 -76694 -45014 -41667 -97297
11136 -97297 -928 97097 77439 71055 -12245 9299 -15540 -132140 -108303 -120856 -195712 -170727
11124 -170727 -85500 -45654 -113693 -156229 -196428 -217795 -106553 58415 63243 -46956 -29862
11113 -29862 119828 165574 96064 79849 12953 -7049 8292 -62603 992 150040 286629
11102 286629 240419 72383 -6799 131460 111477 49733 13881 29644 82660 99942 172872
$$ packed form
11182a94192K3193p539K9126Q5560o249R8098N9657l2717m4208k0901q5450j4892
11170a10514N7711L3822J7381K3133O7221k3951j7785j06841K8825N1246L739
11159B3987L954m061J1951L6383M6057M0128j09145K6220M4012p4509q3689r0060
11147a28772j9116K0378L3889K07243k3577j27929k2862j5948L1680L347n5630
11136i7297R6369R8025j9658o384q3300K1544k4839j16600K3837j2553p4856K4985
11124a70727Q5227L9846o8039m2536m0199k1367J11242J64968M828j10199J7094
11113b9862J49690M5746o9510j6215o6896k0002J5341p0895O3595J49048J36589
11102B86629m6210j68036p9182J38259j9983o1744l5852J5763N3016J7282P2930
$$ plain form
11091 172872 152954 103061 82265 10652 -41198 -73235 -24951 7999 124465 172728 152605
11080 152605 -1573 -59224 -113264 -124567 -24900 47667 85788 174663 300509 140595 -50376
11069 -50376 17381 10679 8214 -36664 -16115 -172561 -183542 -81461 54193 123208 101307
11058 101307 92652 133296 38983 -99531 -160657 -95403 26460 47550 86236 145178 98660
11047 98660 136249 159369 232658 358234 505486 523694 438709 456076 473509 368421 365650
11036 365650 477153 518863 526806 710546 882249 881160 711205 667443 611207 676853 667919
11025 667919 751587 833043 1018554 1136405 1233256 1255876 1102027 882551 751502 725545
11015 725545 686330 603693 613866 729581 926927 1041114 1096174 1072487 928236 775494
$$ packed form
11091A72872j9918m9893k0796p1613n1850l2037M8284L2950J16466M8263k0123
11080A52605j54178n7651n4040j1303R9667P2567L8121Q8875J25846j59914j90971
11069e0376O7757o702k465m4878K0549j56446j0981J02081J35654O9015k1901
11058A01307q655M0644r4313j38514o1126O5254J21863K1090L8686N8942m6518
11047I8660L7589K3120P3289J25576J47252J8208q4985J7367J7433j05088k771
11036C65650J11503M1710P943J83740J71703j089j69955m3762n6236O5646q934
11025F67919Q3668Q1456J85511J17851R6851K2620j53849k19476j31049k5957
11015G25545l9215q2637J0173J15715J97346J14187N5060k3687j44251j52742
$$ plain form
11005 775494 590835 454800 333029 293494 305808 463344 574829 555311 354135 197829
10995 197829 229130 215644 96879 30153 172912 192925 64867 46309 60381 36943 26242
10984 26242 -34743 70336 139963 66471 8629 65165 129521 183269 196300 168015 213915
10973 213915 208532 250456 168981 87516 2730 -101630 -176833 -228923 -281166 -373120 -351972
10962 -351972 -222047 -75819 17411 143568 206852 95661 144873 94710 22165 78111 62116
10951 62116 96809 56336 5545 -8138 33798 200732 177705 54941 52644 79417 112031
10940 112031 251718 283135 256412 400523 511922 530992 490796 591315 856035 991602
10930 991602 1220128 1637606 2000559 2253946 2591928 2856833 2867350 2629838 2424968 2171610
$$ packed form
11005G75494j84659j36035j21771l9535J2314J57536J11485j9518k01176j56306
10995A97829L1301j3486j18765o6726J42759K0013j28058j8558J4072k3438j0701
10984B6242o0985J05079O9627p3492n7842N6536O4356N3748J3031k8285M5900
10973B13915n383M1924q1475q1465q4786j04360p5203n2090n2243r1954K1148
10962c51972J29925J46228R3230J26157O3284j11191M9212n0163p2545N5946j5995
10951F2116L4693m0473n0791j3683M1936J66934k3027j22764k297K6773L2614
10940A12031J39687L1417k6723J44111J11399J9070m0196J00519K64720J35567
10930I91602K28526M17478L62953K53387L37982K64905J0517k37512k04870k53358
$$ plain form
10920 2171610 1973935 1627164 1337073 1051411 826546 722607 714463 719640 735297 683630
10910 683630 560172 586258 613218 547256 391759 243863 180140 277908 309025 271845 297858
10899 297858 281533 167573 162205 135513 87383 226574 245975 28965 -26068 127153 189031
10888 189031 204552 204362 309183 164352 28423 60867 34304 21217 37761 55759 44793
10877 44793 -60933 32463 94642 92103 54758 63167 -14357 147114 194169 131432 113188 108210
10865 108210 124649 105993 -7683 -65785 -81219 1019 52269 71114 222859 224520 122825
10854 122825 133268 192600 219735 202235 230341 283602 218079 134836 82399 189006 292255
10843 292255 364431 345513 168583 141864 138696 22983 -58592 -90095 -70039 -15406 2429
$$ packed form
10920B171610j97675l46771k90091k85662k24865j03939q144N177J5657n1667
10910F83630j23458K6086K6960o5962j55497j47896o3723R7768L1117l7180K6013
10899B97858j6325j13960n368k6692m8130J39191J9401k17010n5033J53221O1878
10888A89031J5521j90J04821j44831j35929L2444k6563j3087J6544J7998j0966
10877D4793j05726R3396O2179k539l7345Q409p7524J61471M7055o2737j8244m978
10865A08210J6439j8656j13676n8102j5434Q2238N1250J8845J51745J661j01695
10854A22825J0443N9332K7135j7500K8106N3261o5523q3243n2437J06607J03249
10843B92255P2176j8918j76930k6719l168j15713q1575l1503K0056N4633J7835
$$ plain form
10832 2429 51282 173267 296208 233971 230125 288837 236802 144816 107510 123915 140413 285137
10820 285137 170314 163775 207737 270145 283232 240756 122063 98963 166201 138229 134849
10809 134849 58139 999 -17335 19898 80746 89437 140454 212842 200762 207877 176244 163205
10797 163205 103249 29358 -14457 93901 54196 -35922 62404 69346 -8118 57934 85783
10786 85783 -42051 -16139 281899 386215 320150 388562 285834 299013 342126 354653 424011
10775 424011 412837 362389 276743 368462 366551 413147 362263 184071 57833 6427 31933
10764 31933 140538 170721 61166 62075 97515 52046 38090 20077 120551 120803 26918 -44605
10752 -44605 -131269 -110621 -48226 33770 109178 262484 289514 366152 353255 320095 306794
$$ packed form
10832B429M8853J21985J22941o2237l846N8712n2035r1986l7306J6405J6498J44724
10820B85137j14823o539M3962O2408J3087m2476j18693k3100O7238k7972l380
10809A34849p6710n7140j8334L7233O0848Q691N1017P2388j2080P115l1633j3039
10797A63205n9956p3891m3815J08358l9705r0118R8326O942p7464O6052K7849
10786H5783j27834K5912K98038J04316o6065O8412j02728J3179M3113J2527O9358
10775D24011j1174n0448q5646R1719j911M6596n0884j78192j26238n1406K5506
10764C1933J08605L0183j09555R09L5440m5469j3956j8013J00474K52r3885p1523
10752d4605q6664K0648O2395Q1996P5408J53306K7030P6638j2897l3160j3301
$$ plain form
10741 306794 229262 190171 173951 146464 230315 341158 511938 510367 453807 376070 247088
10730 247088 263317 378193 474206 434817 469934 533654 548287 473992 540896 521918 430824
10719 430824 424355 498282 436690 393434 309953 231864 140531 97096 110623 202616 337009
10708 337009 488199 611335 488313 421030 446262 477140 601391 579638 570670 515320 597445
10697 597445 730593 686068 522727 424160 441676 470004 507454 468864 445568 414202 342753
10686 342753 474639 538631 549712 550356 523428 538460 585015 640728 758474 897823 916589
10675 916589 788381 782032 781184 775211 841365 841600 697631 650287 738564 757357 740924 753201
10663 753201 806276 897727 905420 885328 859418 916816 878324 958308 1122531 1319585 1520752
$$ packed form
10741C06794p7532l9091j6220k7487Q3851J10843J70780j571n6560p7737j28982
10730B47088J6229J14876R6013l9389L5117O3720J4633p4295O6904j8978r1094
10719D30824o469P3927o1592m3256q3481p8089r1333m3435J3527R1993J34393
10708C37009J51190J23136j23022o7283K5232L0878J24251k1753q968n5350Q2125
10697E97445J33148m4525j63341r8567J7516K8328L7450l8590k3296l1366p1449
10686C42753J31886O3992J1081O44k6928J5032M6555N5713J17746J39349J8766
10675I16589j28208o349q48n973O6154K35j43969m7344Q8277J8793j6433J2277
10663G53201N3075R1451P693k0092k5910N7398l8492P9984J64223J97054K01167
$$ plain form
10652 1520752 1686913 1941896 2006707 2037834 2033633 1939978 1956555 2059890 2002920 1879989 1795195
10641 1795195 1868482 1977516 2029435 2210761 2429117 2810930 3217890 3562115 3882291 4357004
10631 4357004 4797916 5063866 5348595 5622835 6168349 6915478 7910560 9464420 11474146
10622 11474146 14100002 17690158 22360652 28234870 35664992 44046963 52301645 58573860
10614 58573860 61571800 61648396 60059785 58718610 59264379 62600905 69114200 79412186
10606 79412186 93694456 110616510 126451274 136465985 138265789 132766648 123859734
10599 123859734 115927383 111866032 112960847 119870146 132577685 150756596 171863231
10592 171863231 189959912 198314176 193971337 179492969 160670866 143596870 131282047
$$ packed form
10652A520752J66161K54983O4811L1127m201r3655J6577J03335n6970j22931q4794
10641A795195P3287J09034N1919J81326K18356L81813M06960L44225L20176M74713
10631D357004M40912K65950K84729K74240N45514P47129R95082J553860K009726
10622A1474146K625856L590156M670494N874218P430122Q381971Q254682O272215
10614E8573860K997940P6596j588611j341175N45769L336526O513295J0297986
10606G9412186J4282270J6922054J5834764J0014711J799804n499141q906914
10599A23859734p932351m061351J094815O909299J2707539J8178911K1106635
10592A71863231J8096681Q354264m342839j4478368j8822103j7073996j2314823
$$ plain form
10585 131282047 124674018 123769518 128138680 136812719 147153269 154887017 155552177 147745030
10577 147745030 133827581 117766853 103389095 92687807 85772290 82172581 81376109
10570 81376109 82529232 84064220 84356716 81619071 75693242 67599118 58796800 50644945
10562 50644945 43813384 38469647 34245675 31001451 28502833 26469140 24768479 23335206
10554 23335206 22256415 21447334 20750708 20030991 19477599 19269409 19304816 19470913 19968951
10545 19968951 20722268 21766761 22937375 24253130 25369643 26368606 27628596 29335640
10537 29335640 31632201 34701939 38806050 44209944 51288962 60699363 73042066 89490061
10529 89490061 111639392 141998203 182993377 236798668 303956798 380203188 454922590
$$ packed form
10585A31282047o608029r04500M369162Q674039J0340550P733748O65160p807147
10577A47745030j3917449j6060728j4377758j0701288o915517l599709p96472
10570H1376109J153123J534988K92496k737645n925829q094124q802318q151855
10562E0644945o831561n343737m223972l244224k498618k033693j700661j433273
10554B3335206j078791q09081o96626p19717n53392k08190L5407J66097M98038
10545A9968951P53317J044493J170614J315755J116513R98963J259990J707044
10537B9335640K296561L069738M104111N403894P079018R410401J2342703J6447995
10529H9490061K2149331L0358811M0995174N3805291O7158130P6246390P4719402
$$ plain form
10522 454922590 513388126 543574863 538275732 499731887 439585750 371196942 306698485
10515 306698485 252975169 211332658 179839109 156166022 138350515 124586571 113550334
10508 113550334 104214562 95938769 88404088 81199136 74418746 68211930 62536808 57400037
10500 57400037 52718984 48593405 44830798 41203809 37795972 34546797 31669767 28940924
10492 28940924 26612217 24577708 22666241 20940469 19352700 18033112 16985433 15890322
10484 15890322 14818177 13957333 13078108 12393885 11790137 11231091 10797070 10252773 9794475
10475 9794475 9472769 9188874 9028802 8927484 8766965 8508312 8143190 7818763 7590732
10466 7590732 7274668 6971085 6709437 6468081 6077087 5670906 5356365 4976273 4626409
$$ packed form
10522D54922590N8465536L0186737n299131l8543845o0146137o8388808o4498457
10515C06698485n3723316m1642511l1493549k3673087j7815507j3763944j1036237
10508A13550334r335772q275793p534681p204952o780390o206816n675122n136771
10500E7400037m681053m125579l762607l626989l407837l249175k877030k728843
10492B8940924k328707k034509j911467j725772j587769j319588j047679j095111
10484A5890322j072145q60844q79225o84223o03748n59046m34021n44297m58298
10475I794475l21706k83895j60072j01318j60519k58653l65122l24427k28031
10466G590732l16064l03583k61648k41356l90994m06181l14541l80092l49864
$$ plain form
10457 4626409 4405214 4244958 4000659 3898131 3746874 3604924 3523675 3489575 3381535 3346498
10447 3346498 3123387 2915451 2865454 2856805 2908841 3020058 2978318 2976537 2898407 2749037 2663711
10436 2663711 2548680 2259003 2161310 2140171 2120159 2059653 2078800 2110201 1936359 1819580
10426 1819580 1794531 1620449 1566845 1572340 1570326 1497648 1517497 1573751 1617255 1648718 1565811
10415 1565811 1479588 1512539 1509346 1357032 1257874 1195885 1199423 1265999 1326951 1193879 1084398
10404 1084398 1207791 1328825 1245733 1228046 1260516 1296166 1361917 1361586 1366212 1467722 1529151
10393 1529151 1489607 1320629 1112026 1119608 1212409 1243195 1226808 1278452 1169452 1112458 1191499
10382 1191499 1143289 1202911 1203166 1236052 1206648 1111230 1073936 1109452 940905 867245 898999
$$ packed form
10457D626409k21195j60256k44299j02528j51257j41950q1249l4100j08040l5037
10447C346498k23111k07936m9997q649N2036J11217m1740j781p8130j49370q5326
10436B663711j15031k89677r7693k1139k0012o0506J9147L1401j73842j16779
10426A819580k5049j74082n3604N495k014p2678J9849N6254M3504L1463q2907
10415A565811q6223L2951l193j52314r9158o1989L538O6576O0952j33072j09481
10404A084398J23393J21034q3092j7687L2470L5650O5751l31M626J01510O1429
10393A529151l9544j68978k08603P582R2801L0786j6387N1644j09000n6994P9041
10382A191499m8210N9622K55L2886k9404r5418l7294L5516j68547p3660L1754
$$ plain form
10371 898999 943322 986894 1073897 1179207 1132774 1148543 1299908 1345007 1262003 1115151 1070814
10360 1070814 1137392 1189918 1078306 896565 812731 810945 805990 840652 837790 931812 999404
10349 999404 971008 992283 912588 887105 895358 865676 887925 836524 877555 956506 956187 869549
10337 869549 767123 677158 771830 835273 823078 810141 860494 878663 853423 886843 882452
10326 882452 880586 885547 841082 959063 905349 893666 898804 890805 901671 982149 856364 629122
10314 629122 553674 646660 618414 557827 819182 834144 724496 584402 570914 509216 503638
10303 503638 537521 545068 449071 414523 487241 518814 566267 655567 655390 671235 576695 595415
10291 595415 650721 558556 530427 579898 467853 398996 383320 447180 458392 428951 538005
$$ packed form
10371H98999M4323M3572Q7003J05310m6433J5769J51365M5099q3004j46852m4337
10360A070814O6578N2526j11612j81741q3834j786m955L4662k862R4022O7592
10349I99404k8396K1275p9695k5483Q253k9682K2249n1401M1031P8951l19q6638
10337H69549j02426q9965R4672O3443j2195j2937N0353J8169k5240L3420m391
10326H82452j866M961m4465J17981n3714j1683N138p999J0866Q0478j25785k27242
10314F29122p5448R2986k8246o0587K61355J4962j09648j40094j3488o1698n578
10303E03638L3883P547r5997l4548P2718L1573M7453Q9300j77J5845r4540J8720
10291E95415N5306r2165k8129M9471j12045o8857j5676O3860J1212k9441J09054
$$ plain form
10280 538005 580756 634413 717830 793791 927051 1129730 1353976 1629232 1692631 1707359 1635802
10269 1635802 1748559 1828815 1786549 1690323 1558161 1355166 1337467 1235272 1034802 865725
10259 865725 687508 526751 639575 687054 717846 695981 631695 631054 567696 527901 615170
10248 615170 818123 807454 661697 608409 562049 466404 338879 290999 224830 272883 326499
10237 326499 441747 314609 159323 177204 213324 268272 275033 275206 422491 471950 510045
10226 510045 487129 394870 350277 310108 456947 675019 684830 649399 566503 491263 304445
10215 304445 223983 525483 695274 542100 481801 605339 616166 568257 522328 521424 598400
10204 598400 648834 614782 577540 597154 684007 806545 935958 854903 884938 863489 858714
$$ packed form
10280E38005M2751N3657Q3417P5961J33260K02679K24246K75256O3399J4728p1557
10269A635802J12757Q0256m2266r6226j32162k02995j7699j02195k00470j69077
10259H65725j78217j60757J12824M7479L0792k1865o4286o41o3358l9795Q7269
10248F15170K02953j0669j45757n3288m6360r5645j27525m7880o6169M8053N3616
10237C26499J15248j27138j55286J7881L6120N4948O761J73J47285M9459L8095
10226E10045k2916r2259m4593m0169J46839K18072R811l5431q2896p5240j86818
10215C04445q0462L01500J69791j53174o0299J23538J0827m7909m5929r04P6976
10204E98400N0434l4052l7242J9614Q6853J22538J29413q1055L0035k1449m775
$$ plain form
10193 858714 951110 1032997 1084856 943397 827846 850777 957732 969989 1059901 1106183 1173852
10182 1173852 1186200 1206399 1320952 1366560 1417335 1332413 1294490 1362326 1387757 1514731 1571078
10171 1571078 1590215 1692048 1833582 1857520 1880052 2009697 1913119 1841319 1908975 1947960 1946150
10160 1946150 1964438 1836538 1907704 2118528 2283272 2344164 2466190 2461407 2417655 2272006
10150 2272006 2155196 2071917 2082858 2174850 2283545 2323246 2419208 2502890 2456758 2348637 2211748
10139 2211748 2116960 2125686 2087114 2013148 2040999 2130464 2186782 2246966 2314617 2314138 2289217 2313016
10127 2313016 2275012 2247005 2413302 2587296 2784345 2943166 3009474 3163538 3324782 3488740
10117 3488740 3751875 4217435 4747231 5257258 5592365 5866898 6131475 6223198 6239042 6088513
$$ packed form
10193H58714R2396Q1887N1859j41459j15551K2931J06955J2257Q9912M6282O7669
10182A173852J2348K0199J14553M5608N0775q4922l7923O7836K5431J26974N6347
10171A571078J9137J01833J41534K3938K2532J29645r6578p1800O7656L8985j810
10160A946150J8288j27900P1166K10824J64744O0892J22026m783m3752j45649
10150B272006j16810q3279J0941R1992J08695L9701R5962Q3682m6132j08121j36889
10139B211748r4788Q726l8572p3966K7851Q9465N6318O0184O7651m79k4921K3799
10127B313016l8004k8007J66297J73994J97049J58821O6308J54064J61244J63958
10117C488740K63135M65560N29796N10027L35107K74533K64577R1723J5844j50529
$$ plain form
10107 6088513 5845061 5673705 5723992 5773771 6007435 6271173 6629087 7028469 7413173 7923387
10097 7923387 8586855 9301806 9957901 10722275 11571405 12712026 14079520 15596805 17221405
10088 17221405 18967917 20891518 23231931 26101143 29319491 33277632 38237757 44358442
10080 44358442 52221817 62605436 76225212 94044791 117426200 147216802 183488898
10073 183488898 225187370 268415911 308005368 340259564 363174873 377365879 385769300
10066 385769300 389639730 388360108 380021880 362678094 335133762 300334760 262259829
10059 262259829 225241553 192879070 166273381 145079469 128351277 114875003 103831626
10052 103831626 94789892 86946668 80087712 73790516 68026947 62604278 57507786 52596884
$$ packed form
10107F088513k43452j71356N0287M9779K33664K63738L57914L99382L84704N10214
10097G923387O63468P14951O56095P64374Q49130J140621J367494J517285J624600
10088A7221405J746512J923601K340413K869212L218348L958141M960125O120685
10080D4358442P863375J0383619J3619776J7819579K3381409K9790602L6272096
10073A83488898M1698472M3228541L9589457L2254196K2915309J4191006Q403421
10066C85769300L870430j279622q338228j7343786k7544332l4799002l8074931
10059B62259829l7018276l2362483k6605689k1193912j6728192j3476274j1043377
10052A03831626r041734p843224o858956o297196n763569n422669n096492m910902
$$ plain form
10044 52596884 48221146 44283387 40712033 37391292 34419374 31612445 28924045 26600657
10036 26600657 24558051 22610440 20901916 19321647 18030868 17004756 15860816 14760623
10028 14760623 13721834 12913490 12097350 11336645 10635262 10058063 9598756 9014911 8483148
10019 8483148 7995427 7593083 7138931 6735603 6328570 6023586 5772492 5486354 5160599
10010 5160599 4850156 4611206 4395522 4196907 3957492 3822479 3708241 3472053 3321720
10001 3321720 3204430 3123875 3095383 2936884 2738162 2659366 2631903 2566328 2589696 2617123 2586556
9990 2586556 2555524 2504702 2458020 2312597 2296349 2174226 2093885 2083716 2114347 1971414 1868181
9979 1868181 1838155 1823529 1858802 1803301 1674913 1654006 1643193 1601338 1516168 1493854 1518397
$$ packed form
10044E2596884m375738l937759l571354l320741k971918k806929k688400k323388
10036B6600657k042606j947611j708524j580269j290779j026112j143940j100193
10028A4760623j038789q08344q16140p60705p01383n77199m59307n83845n31763
10019H483148m87721m02344m54152m03328m07033l04984k51094k86138l25755
10010E160599l10443k38950k15684j98615k39415j35013j14238k36188j50333
10001C321720j17290q0555k8492j58499j98722p8796k7463o5575K3368K7427l0567
9990B586556l1032n0822m6682j45423j6248j22123q0341j0169L0631j42933j03233
9979A868181l0026j4626L5273n5501j28388k0907j0813m1855q5170k2314K4543
$$ plain form
9968 1518397 1520231 1415946 1359290 1361662 1404133 1412660 1382691 1280837 1284255 1261269 1274186 1232457
9956 1232457 1118698 954243 959954 889353 882298 989618 994447 1024476 1061240 1138014 1200377
9945 1200377 1282155 1310301 1142662 1162117 1261740 1328339 1293647 1347120 1365759 1369745 1334640
9934 1334640 1239990 1204953 1277051 1290626 1156800 1033268 1019673 1033119 867509 964977 1077149
9923 1077149 1024238 1075877 1019827 958078 1000843 977407 922896 911132 777654 800066 783795
9912 783795 801792 891805 981204 1070595 1046560 968725 907470 866572 966412 975772 993729 907483
9900 907483 831892 748765 726515 794221 864138 885860 843457 808031 748661 740641 650863 683219
9888 683219 711288 795689 755514 631712 552822 541499 462612 451497 553008 576991 550673
$$ packed form
9968A518397J834j04285n6656K372M2471Q527k9969j01854L418k2986J2917m1729
9956A232457j13759j64455N711p0601p055J07320M829L0029L6764P6774O2363
9945A200377Q1778K8146j67639J9455R9623O6599l4692N3473J8639L986l5105
9934A334640r4650l5037P2098J3575j33826j23532j3595J3446j65610R7468J12172
9923A077149n2911N1639n6050o1749M2765k3436n4511j1764j33478K2412j6271
9912G83795J7997R0013Q9399Q9391k4035p7835o1255m0898R9840R360J7957q6246
9900I07483p5591q3127k2250O7706O9917K1722m2403l5426n9370q020q9778L2356
9888F83219K8069Q4401m0175j23802p8890j1323p8887j1115J01511K3983k6318
$$ plain form
9877 550673 533541 489112 453212 507853 577497 562753 603217 581642 532908 482028 310146
9866 310146 365728 359579 393277 276414 207589 249165 308758 231672 230742 248786 267290 217626
9854 217626 179676 167341 160381 138617 233433 351378 394938 345025 255600 425280 423096 391552
9842 391552 403778 324073 175489 131374 234802 278176 375344 393286 405184 459164 402137
9831 402137 308672 396913 413688 355255 273266 265450 360780 362214 263373 188269 203349 212537
9819 212537 302470 409111 396429 368808 482089 457152 477224 498789 461826 445731 475096
9808 475096 416946 380308 380666 269052 271950 269700 168905 144565 225268 217068 265083 249963
9796 249963 253018 281153 207934 160710 222093 338059 444178 492308 377073 475812 442379
$$ packed form
9877E50673j7132m4429l5900N4641O9644j4744M0464k1575m8734n0880j71882
9866C10146N5582o149L3698j16863o8825M1576N9593p7086r30J8044J8504m9664
9854B17626l7950j2335o960k1764R4816J17945M3560m9913q9425J69680k184l1544
9842C91552J2226p9705j48584m4115J03428M3374R7168J7942J1898N3980n7027
9831D02137r3465Q8241J6775n8433q1989p816R5330J434r8841p5104J5080R188
9819B12537Q9933J06641j2682k7621J13281k4937K0072K1565l6963j6095K9365
9808D75096n8150l6638L58j11614K898k250j00795k4340Q0703q200M8015j5120
9796B49963L055K8135p3219m7224O1383J15966J06119M8130j15235R8739l3433
$$ plain form
9785 442379 249205 105868 109214 157359 183065 166014 197119 240283 218446 208589 224390 211075
9773 211075 142880 155707 176523 160994 229965 238449 317687 426526 382838 271802 178387
9762 178387 203229 262847 271161 302050 289205 207889 95494 141087 245079 266730 237293
9751 237293 112108 99694 293336 280793 323044 308838 229777 259195 247462 249158 228705
9740 228705 320785 348307 335159 349721 354159 211323 98647 139771 172452 195127 227402
9729 227402 145369 198865 259434 264814 155316 32310 118959 79437 -30187 16261 -104453
9718 -104453 -69453 19197 38139 -55521 -81168 -58559 25675 127243 205701 234509 198114
9707 198114 235755 262663 234199 287427 220768 201420 295321 353426 319950 178098 158556
$$ packed form
9785D42379j93174j43337L346M8145K5706j7051L1105M3164k1837r857J5801j3315
9773B11075o8195J2827K0816j5529O8971Q484P9238J08839m3688j11036r3415
9762A78387K4842N9618Q314L0889j2845q1316j12395M5593J03992K1651k9437
9751B37293j25185j2414J93642j2543M2251j4206p9061K9418j1733J696k0453
9740B28705R2080K7522j3148J4562M438j42836j12676M1124L2681K2675L2275
9729B27402q2033N3496O0569N380j09498j23006Q6649l9522j09624M6448j20714
9718a04453L5000Q8650J8942r3660k5647K2609Q4234J01568P8458K8808l6395
9707A98114L7641K6908k8464N3228o6659j9348R3901N8105l3476j41852j9542
$$ plain form
9696 158556 227828 289865 326166 359717 383321 362883 314888 385375 335564 375347 465525 317630
9684 317630 293740 297099 253427 205806 205349 267042 307052 379505 427183 621309 631356 537650
9672 537650 541364 558949 610762 842213 1057329 1222740 1427903 1604336 1891723 2108451
9662 2108451 2222244 2270305 2229826 2265635 2085553 2006618 1923347 1896229 1913235 1852012 1881278
9651 1881278 1864146 1781170 1622595 1440210 1310313 1163696 904141 837976 804739 687731
9641 687731 638933 654805 629329 425101 369827 350106 404019 415481 384065 393124 384724 401339
9629 401339 429203 365768 327362 213642 211390 271558 282033 249594 271982 255875 131107
9618 131107 168534 135243 131416 140906 108597 191027 258767 153960 80232 79622 126679 150193
$$ packed form
9696A58556O9272O2037L6301L3551K3604k0438m7995P0487m9811L9783R0178j47895
9684C17630k3890L359m3672m7621m57O1693M0010P2453M7678J94126J0047r3706
9672E37650L714J7585N1813K31451K15116J65411K05163J76433K87387K16728
9662B108451J13793M8061m0479L5809j80082p8935q3271k7118J7006o1223K9266
9651A881278j7132q2976j58575j82385j29897j46617k59555o6165l3237j17008
9641F87731m8798J5872k5476k04228n5274j9721N3913J1462l1416R059q400J6615
9629D01339K7864o3435l8406j13720k252O0168J0475l2439K2388j6107j24768
9618A31107L7427l3291l827R490l2309Q2430O7740j04807p3728o10M7057K3514
$$ plain form
9606 150193 101449 59448 133410 232411 198575 132588 80806 173999 188321 213461 141264 -13653
9594 -13653 -28787 72972 79751 11280 20958 -41402 -23727 -14303 -17796 -5776 -85307 -70865
9582 -70865 -34141 -57650 14452 -6787 31227 70969 53610 110423 21947 -14508 88261 126032
9570 126032 169215 219212 162899 57951 13505 87752 66444 79356 -29379 -48646 144415
9559 144415 266915 199623 123494 124036 152559 151105 94544 101688 1232 -48735 -43691 86340
9547 86340 87965 -11847 992 43696 48298 80327 109290 87685 28139 46214 86705 107732
9535 107732 44128 -45577 -37771 -53672 -71779 -88528 -180579 -204767 -64807 3789 11377 -5765
9523 -5765 31181 122425 32270 -8583 16757 61923 15714 48140 116199 37741 89025 124229
$$ packed form
9606A50193m8744m2001P3962R9001l3836o5987n1782R3193J4322K5140p2197j54917
9594a3653j5134J01759O779o8471R678o2360J7675R424l493J2020p9531J4442
9582g0865L6724k3509P2102k1239L8014L9742j7359N6813q8476l6455J02769L7771
9570A26032M3183M9997n6313j04948m4446P4247k1308J2912j08735j9267J93061
9559A44415J22500o7292p6129N42K8523j454n6561P144j00456m9967N044J30031
9547H6340J625r9812J2839M2704M602L2029K8963k1605n9546J8075M0491K1027
9535A07732o3604q9705P806j5901j8107j6749r2051k4188J39960O8596P588j7142
9523e765L6946R1244r0155m0853K5340M5166m6209L2426O8059p8458N1284L5204
$$ plain form
9511 124229 88639 25700 17650 -29642 -96548 -48128 -32782 -63325 -63763 32460 132466 186758
9499 186758 143879 49711 23019 13925 32943 121812 109377 184564 186159 116944 126185 133619
9487 133619 153195 5960 -5837 35591 -38345 -174423 -226701 -162814 -117108 -71541 -66526
9476 -66526 -46809 55632 -29377 -31705 -148866 -208315 -129389 -98937 -75848 -16457 33810 -12455
9464 -12455 96600 235887 319850 355873 314459 255159 293553 150270 -45681 55890 111290
9453 111290 149131 102317 91494 132856 183421 39150 -155083 -167392 -114815 14708 -3332
9442 -3332 -6443 42787 -93832 -120820 -74993 -94329 -46584 -42950 -125894 -101901 -127923 -109581
9430 -109581 -89738 -40431 -124385 -141395 -58813 -5599 -24235 -32740 -28018 -72121 -75341 -47572
$$ packed form
9511A24229l5590o2939q050m7292o6906M8420J5346l0543m38R6223J00006N4292
9499A86758m2879r4168k6692r094J9018Q8869j2435P5187J595o9215R241P434
9487A33619J9576j47235j1797M1428p3936j36078n2278O3887M5706M5567N015
9476f6526J9717J02441q5009k328j17161n9449P8926L0452K3089N9391N0267m6265
9464a2455J09055J39287Q3963L6023m1414n9300L8394j43283j95951J01571N5400
9453A11290L7841m6814j0823M1362N0565j44271j94233j2309N2577J29523j8040
9442c332l111M9230j36619k6988M5827j9336M7745L634q2944K3993k6022J8342
9430a09581J9843M9307q3954j7010Q2582N3214j8636q505M722m4103l220K7769
$$ plain form
9418 -47572 -55002 -47461 70643 180923 125670 182244 241927 269474 113071 87731 -7358 -65934
9406 -65934 -112109 -14349 10881 -18459 -14373 28217 26390 -82904 -69995 -5782 2485 27661
9394 27661 11915 48289 48786 167000 168612 87089 -65373 -129767 31655 71077 -74719 -97915
9382 -97915 -72535 -60134 125107 201517 95466 6243 40996 86493 108858 147570 126747
9371 126747 6769 7146 49755 159679 178206 -2554 -86804 -46915 -19436 -1606 79533
9360 79533 114668 -40158 -107354 -92087 -16968 5467 -99579 -79420 -64945 -96650 -55427
9349 -55427 -117567 -154209 -249116 -265700 -292028 -279281 -179834 -99042 -112565 -95753 -54346 -47849
9337 -47849 -74337 -143410 -56023 -32733 -118697 -90788 -61047 -3896 -13131 35983 87749 53466
$$ packed form
9418d7572p430P541J18104J10280n5253N6574N9683K7547j56403k5340r5089n8576
9406f5934m6175R7760K5230k9340M086M2590j827j09294J2909O4213Q267K5176
9394B7661j5746L6374M97J18214J612q1523j52462o4394J61422L9422j45796k3196
9382i7915K5380J2401J85241P6410j06051q9223L4753M5497K2365L8712k0823
9371A26747j19978L77M2609J09924J8527j80760q4250L9889K7479J7830Q1139
9360G9533L5135j54826o7196J5267P5119K2435j05046K0159J4475l1705M1223
9349e5427o2140l6642r4907j6584k6328J2747R9447Q0792j3523J6812M1407O497
9337d7849k6488o9073Q7387K3290q5964K7909K9741N7151r235M9114N1766l4283
$$ plain form
9325 53466 53736 104252 172154 151660 120304 27923 22216 -28328 97392 167962 58850 62353
9313 62353 84269 4599 30034 34019 40734 94672 153836 15874 -130593 -83431 -41490 -58809
9301 -58809 -118652 -78713 19617 54586 66157 96971 -18320 20153 55729 49686 33796 -20417
9289 -20417 -31059 -1148 -19618 -41988 -84187 -91977 -144321 -222823 -232070 -87428 32544 36908
9277 36908 68004 22188 -78045 84248 149732 152481 100255 96223 119185 163583 167359 53525
9265 53525 44647 56037 14828 9790 -21449 114641 167455 80924 39446 39325 -60210 -135816
9253 -135816 14374 137513 143936 -14786 81752 162005 209094 88695 -75094 -146504 -65040
9242 -65040 -99501 -42979 -47102 -63703 11973 30440 98443 14840 -16392 -10277 -15879 1290
$$ packed form
9325E3466K70N0516O7902k0494l1356r2381n707n0544J25720P0570j09112L503
9313F2353K1916p9670K5435L985O715N3938N9164j37962j46467M7162M1941j7319
9301e8809n9843L9939R8330L4969J1571L0814j15291L8473L5576o043j5890n4213
9289b0417j0642K9911j8470k2370m2199p790n2344p8502r247J44642J19972M364
9277C6908L1096m5816j00233J62293O5484K749n2226m032K2962M4398L776j13834
9265E3525q878J1390m1209n038l1239J36090N2814q6531m1478j21r9535p5606
9253a35816J50190J23139O423j58722R6538Q0253M7089j20399j63789p1410Q1464
9242f5040l4461N6522m123j6601P5676J8467O8003q3603l1232O115n602J7169
$$ plain form
9230 1290 8155 -14205 25057 86361 159659 114157 62547 97052 86621 -66566 -167306 -288780
9218 -288780 -234498 -94140 24629 28123 -24891 -52296 -87850 -68126 -55224 40907 -598
9207 -598 -976 -94768 -117190 1750 37807 148116 195546 30536 -78704 -68417 12122 141837
9195 141837 159161 164679 142867 169963 176740 152910 171756 166252 -9334 -127855 -110044 -17721
9183 -17721 -99397 -91507 -2243 35445 26540 28950 125275 44662 5380 -46629 -47946 -24536 -28570
9170 -28570 -169209 -201263 -133487 46122 -30710 -65428 -20452 -17641 -69914 -71339 -198253 -218255
9158 -218255 -133743 -164998 -12449 58316 13599 95858 81982 8435 -17050 -170449 -42815
9147 -42815 5065 -31516 -28405 -18334 5217 -6640 42937 -24756 -74288 -9142 -15498 -20891
$$ packed form
9230A290O865k2360L9262O1304P3298m5502n1610L4505j0431j53187j00740j21474
9218b88780N4282J40358J18769L494n3014k7405l5554J9724J2902R6131m1505
9207e98l78r3792k2422J18940L6057J10309M7430j65010j09240J0287Q0539J29715
9195A41837J7324N518k1812K7096O777k3830J8846n504j75586j18521J7811R2323
9183a7721q1676P890Q9264L7688q905K410R6325q0613l9282n2009j317K3410m034
9170b8570j40639l2054O7776J79609p6832l4718M4976K811n2273j425j26914k0002
9158b18255Q4512l1255J52549P0765m4717Q2259j3876p3547k5485j53399J27634
9147d2815M7880l6581L111J0071K3551j1857M9577o7693m9532O5146o356n393
$$ plain form
9135 -20891 -89089 -33231 13452 44336 10810 117211 190494 189581 106299 33125 -8337 64498
9123 64498 197050 110525 -75835 -160520 -88057 1758 81627 49417 8325 -36595 44159
9112 44159 78253 176368 110947 5141 60088 137990 38848 13444 103720 173186 181971 176017
9100 176017 157214 16377 -11369 81255 131417 236716 139664 73966 106362 -59205 -203043
9089 -203043 -165385 -186454 -182905 -86852 -1844 8400 87377 128347 161822 120749 129735 39883
9077 39883 -21196 48729 64921 61774 34586 -8226 5498 -49337 19121 -1818 -135366 -137052
9065 -137052 -54165 -106484 -98744 -102075 -19619 53785 -26664 -8996 77281 81744 1553 -6666
9053 -6666 82611 86669 52183 92610 102000 49256 57668 37732 78035 83632 118646 18988 -136166
$$ packed form
9135b0891o8198N5858M6683L0884l3526J06401P3283r13q3282p3174m1462P2835
9123F4498J32552q6525j86360q4685P2463Q9815P9869l2210m1092m4920Q0754
9112D4159L4094R8115o5421j05806N4947P7902r9142k5404R0276O9466Q785n954
9100A76017j8803j40837k7746R2624N0162J05299r7052o5698L2396j65567j43838
9089b03043L7658k1069L549R6053Q5008J0244P8977M0970L3475m1073Q986q9852
9077C9883o1079O9925J6192l147k7188m2812J3724n4835O8458k0939j33548j686
9065a37052Q2887n2319P740l331Q2456P3404q0449J7668Q6277M463q0191q219
9053f666Q9277M058l4486M0427R390n2744Q412j9936M0303N597L5014r9658j55154
$$ plain form
9040 -136166 -118598 -65587 -37335 21310 -15129 5700 -52260 22793 -28916 -148262 -188165
9029 -188165 -52461 47041 56514 8726 124201 44357 -6085 -52419 -81906 -37262 787
9018 787 50055 114260 115594 -17597 -70095 -74844 -90717 -9221 95656 150485 59070 8449
9006 8449 66597 105599 25877 -49834 14848 33863 -132452 -69689 116741 75171 -10029 -33426
8994 -33426 -28492 53659 56473 86996 45035 46235 -25452 31964 37774 -49369 -33597 -47567 31173
8981 31173 128004 187365 20598 -82552 -139646 -225426 -192743 -94170 -29660 34653 43704 -84840
8969 -84840 -147488 -89094 -115177 -23659 77035 112951 -20626 -1618 60461 -55837 -2019
8958 -2019 129393 202625 194823 80887 -25940 29578 46071 5472 -7796 -44067 -174026
$$ packed form
9040a36166J7568N3011K8252N8645l6439K0829n7960P5053n1709j19346l9903
9029a88165J35704R9502R473m7788J15475p9844n0442m6334k9487M4644L8049
9018G87M9268O4205J334j33191n2498m749j5873Q1496J04877N4829r1415n0621
9006H449N8148L9002p9722p5711O4682J9015j66315O2763J86430m1570q5200k3397
8994c3426M934Q2151K814L0523m1961J200p1687N7416N810q7143J5772j3970P8740
8981C1173R6831N9361j66767j03150n7094q5780L2683R8573O4510O4313R051j28544
8969h4840o2648N8394k6083R1518J00694L5916j33577J9008O2079j16298N3818
8958b019J31412P3232p802j13936j06827N5518J6493m0599j3268l6271j29959
$$ plain form
8947 -174026 -185294 -173073 -148073 -11278 -2862 -65690 15475 27372 -29826 133055 163803
8936 163803 74167 112522 103113 138019 154283 129222 101589 129779 151794 133945 55345 -6874
8924 -6874 29351 -19900 -20162 -22945 29801 170515 257688 194790 147380 88082 1134 -89569
8912 -89569 -40815 -46836 98602 180851 45079 28025 104289 102490 114480 128854 153203 133047
8900 133047 142917 109947 68504 140747 50800 -112284 -184074 -114181 -23857 -27077 -12013 -85174
8888 -85174 -83056 20864 61102 21197 -45823 -25921 -20185 28973 70067 -6379 79103 66556
8876 66556 70449 35287 -86471 -86460 -87469 -113137 -178175 -119464 -150241 -195066 -233332 -146800 -150615
8863 -150615 -100928 -75149 -106219 -131611 -34825 -99310 -221034 -268625 -251966 -253512 -183317 -175507
$$ packed form
8947a74026j1268J2221K5000J36795Q416o2828Q1165J1897n7198J62881L0748
8936A63803q9636L8355r409L4906J6264k5061k7633K8190K2015j7849p8600o2219
8924f874L6225m9251k62k783N2746J40714Q7173o2898m7410n9298q6948r0703
8912h9569M8754o021J45438Q2249j35772j7054P6264j799J1990J4374K4349k0156
8900A33047R870l2970m1443P2243q9947j63084p1790O9893R0324l220J5064p3161
8888h5174K118J03920M0238l9905o7020J9902N736M9158M1094p6446Q5482j2547
8876F6556L893l5162j21758J1j009k5668o5038N8711l0777m4825l8266Q6532l815
8863a50615M9687K5779l1070k5392R6786o4485j21724m7591J6659j546P0195P810
$$ plain form
8851 -175507 -15538 53771 95834 -63316 -166874 -223514 -118920 -32601 98557 33526 -52991
8840 -52991 -39251 -45650 -53568 -59373 -46614 -33096 -33747 33079 59516 96854 27075 -128708 -239337
8827 -239337 -209301 -187623 -78590 -62384 -90257 -58929 -28346 18086 99326 4721 -37412
8816 -37412 -164695 -163638 -193327 -211830 -131717 -48340 -49287 -6700 114592 182797 121543 133119
8804 133119 124999 101016 120045 136881 125114 31363 -135384 -282266 -251054 -204319 -149751
8793 -149751 -143509 -101941 17443 84223 135735 85674 1520 -19147 -140131 -269050 -256886
8782 -256886 -261367 -202887 -253592 -226715 -182287 -242080 -313563 -296220 -240914 -180346 -71978 -34029
8770 -34029 -38744 -39465 -35573 -52155 13880 19812 122028 145668 69254 63630 6783 89823 158934
$$ packed form
8851a75507J59969O9309M2063j59150j03558n6640J04594Q6319J31158o5031q6517
8840e2991J3740o399p918n805J2759J3518o51O6826K6437L7338o9779j55783j10629
8827b39337L0036K1678J09033J6206k7873L1328L0583M6432Q1240r4605m2133
8816c7412j27283J057k9689j8503Q0113Q3377r47M2587J21292O8205o1254J1576
8804A33119q120k3983J9029J6836j1767r3751j66747j46882L1212M6735N4568
8793a49751O242M1568J19384O6780N1512n0061q4154k0667j20984j28919J2164
8782b56886m481N8480n0705K6877M4428n9793p1483J7343N5306O0568J08368L7949
8770c4029m715p21L892j6582O6035N932J02216K3640p6414n624n6847Q3040O9111
$$ plain form
8757 158934 147732 134892 33880 40037 35139 -28097 -43681 -55719 12371 -38427 -63199 -34268
8745 -34268 -66153 -114335 -61552 -59151 2568 9908 -21613 62097 11622 -130070 -243793 -409804
8733 -409804 -373264 -352756 -337523 -339975 -203154 -136649 -166238 -206749 -186438 -34143 137202
8722 137202 196914 221229 173982 123744 83186 -21990 -118803 -67923 11808 115853 250784
8711 250784 269523 183505 132237 143431 162308 110619 33378 -29843 -35376 -84929 12730 -36386
8699 -36386 -77120 -21077 33059 -1399 -51541 -24088 -47952 -98004 -40587 89348 158570 48120
8687 48120 -3870 140480 165570 242161 188981 143929 27072 -49423 -110044 -260548 -224709
8676 -224709 -111115 -131408 -95284 -40216 -45545 -62374 -17539 59955 128577 202657 174432 34986
$$ packed form
8757A58934j1202j2840j01012O157m898o3236j5584j2038O8090n0798k4772K8931
8745c4268l1885m8182N2783K401O1719P340l1521Q3710n0475j41692j13723j66011
8733d09804L6540K0508J5233k452J36821O6505k9589m0511K0311J52295J71345
8722A37202N9712K4315m7247n0238m0558j05176r6813N0880P9731J04045J34931
8711B50784J8739q6018n1268J1194J8877n1689p7241o3221n533m9553R7659m9116
8699c6386m0734N6043N4136l4458n0142K7453k3864n0052N7417J29935O9222j10450
8687D8120n1990J44350K5090P6591n3180m5052j16857p6495o0621j50504L5839
8676b24709J13594k0293L6124N5068n329j6829M4835P7494O8622P4080k8225j39446
$$ plain form
8664 34986 -484 16492 16645 -25952 -110174 -166034 -40216 61335 158782 144475 -23413 -24837
8652 -24837 -28815 -12661 -345 19100 57238 61953 -36704 -84094 47881 175027 250767 282478
8640 282478 241388 201610 65845 -30828 -49542 -65301 -53055 -73561 -136778 -17352 7562
8629 7562 -88881 -537 169310 49400 177639 414886 486441 411483 386973 369424 408361
8618 408361 256434 214605 100872 -77031 -48667 -30758 -129348 -30256 132472 209037 133560
8607 133560 109780 66090 121124 229256 294725 304046 331305 345691 350092 287216 359820 295915
8595 295915 165946 26674 108883 172007 139458 130374 225303 366212 412674 355751 244660
8584 244660 172636 154009 268011 396049 576722 923536 1039857 1080373 979161 855567
$$ packed form
8664C4986l5470J6976J53m2597q4222n5860J25818J01551R7447j4307j67888j424
8652b4837l978J6154J2316J9445L8138M715r8657m7390J31975J27146P5740L1711
8640B82478m1090l9778j35765r6673j8714j5759J2246k0506o3217J19426K4914
8629G562r6443Q8344J69847j19910J28239K37247P1555p4958k4510j7549L8937
8618D08361j51927m1829j13733j77903K8364J7909r8590R9092J62728P6565p5477
8607A33560k3780m3690N5034J08132O5469R321K7259J4386M401o2876P2604o3905
8595B95915j29969j39272Q2209O3124l2549r084R4929J40909M6462n6923j11091
8584B44660p2024j8627J14002J28038J80673L46814J16321M0516j01212j23594
$$ plain form
8574 855567 777859 454148 335654 321539 339527 365577 320030 156206 113583 143265 241387
8563 241387 279444 307199 365663 397251 234558 236960 131725 231644 322541 116791 -4149
8552 -4149 141226 178238 114829 96267 143011 163847 128713 149687 96581 72485 101203 152596
8540 152596 178480 212000 177357 195570 298645 449197 578024 657903 659138 613260 556899
8529 556899 537970 473522 440039 382926 371136 297158 337438 271772 200546 164726 118574 177630
8517 177630 197375 93590 15279 -7569 -130024 -5259 91683 74686 37902 69118 29417
8506 29417 4534 30412 -123956 -206768 -142451 -26811 20676 79542 137459 105797 53122
8495 53122 -35646 -126768 -169510 -76145 -12089 -23015 -163277 -39469 141878 232672 173430
$$ packed form
8574H55567p7708l23711j18494j4115J7988K6050m5547j63824m2623K9682R8122
8563B41387L8057K7755N8464L1588j62693K402j05235R9919R0897k05750j20940
8552d149J45375L7012o3409j8562M6744K0836l5134K0974n3106k4096K8718N1393
8540A52596K5884L3520l4643J8213J03075J50552J28827P9879J235m5878n6361
8529E56899j8929o4448l3483n7113j1790p3978M0280o5666p1226l5820m6152N9056
8517A77630J9745j03785p8311k2848j22455J24765R6942j6997l6784L1216l9701
8506B9417k4883K5878j54368q2812O4317J15640M7487N8866N7917l1662n2675
8495E3122q8768r1122m2742R3365O4056j0926j40262J23808J81347R0794n9242
$$ plain form
8484 173430 -80530 -197440 -266729 -199502 -174205 -146069 -86592 -10267 52585 85214 183872
8473 183872 146975 111809 48078 32292 167791 118870 100782 65552 38331 726 -105420
8462 -105420 839 97136 75365 83781 -12452 -78784 -33928 -65430 -37690 -118381 -49391 76094
8450 76094 115342 102394 31108 -23606 -86409 -19807 -32085 7829 -33847 -90838 -9342 -75386
8438 -75386 -120090 -133864 -33667 -35048 50656 139496 167757 73850 57250 18297 -84586 -10222
8426 -10222 -36735 -123249 5730 148256 6802 -154447 -147166 -89772 24269 88260 11073
8415 11073 -8092 -70700 -40754 -56623 -105884 -45855 27233 -935 -37794 -62948 -44993 -87818
8403 -87818 22693 24463 -18543 -52815 -42394 -115146 -172679 -131295 -11591 -4783 41512 116511
$$ packed form
8484A73430k53960j16910o9289O7227K5297K8136N9477P6325O2852L2629R8658
8473A83872l6897l5166o3731j5786J35499m8921j8088l5230k7221l7605j06146
8462a05420J06259R6297k1771Q416r6233o6332M4856l1502K7740q0691O8990J25485
8450G6094L9248j2948p1286n4714o2803O6602j2278L9914m1676n6991Q1496o6044
8438g5386m4704j3774J00197j381Q5704Q8840K8261r3907j6600l8953j02883P4364
8426a0222k6513q6514J28979J42526j41454j61249P281N7394J14041O3991p7187
8415A1073j9165o2608K9946j5869m9261O0029P3088k8168l6859k5154J7955m2825
8403h7818J10511J770m3006l4272J0421p2752n7533M1384J19704O808M6295P4999
$$ plain form
8391 116511 157701 5620 -170067 -134256 -61551 12543 54966 23209 77386 208879 275605
8380 275605 151839 -29152 -46860 151069 158532 -56222 -62389 -83872 33080 131156 177619
8369 177619 190361 167049 94879 -80630 -104009 -117919 -61576 -19895 75236 7919 -109754
8358 -109754 -98319 -54772 -115079 -69342 -45016 -74919 -119469 -213954 -153761 -142591 -104137 30028
8346 30028 263446 485262 457808 259542 124906 38541 44381 231295 420333 358157 350293
8335 350293 224308 199334 259944 212066 194111 15281 -69760 -55888 -15628 -36084 29014
8324 29014 133401 107946 4729 -45935 -94697 8458 59777 175882 165369 96854 44144
8313 44144 49362 -35787 -31678 -31500 52111 89730 32955 4615 137835 194204 342579 525786
$$ packed form
8391A16511M1190j52081j75687L5811P2705P4094M2423l1757N4177J31493O6726
8380B75605j23766j80991j7708J97929P463k14754o167k1483J16952R8076M6463
8369A77619J2742k3312p2170j75509k3379j3910N6343M1681R5131o7317j17673
8358a09754J1435M3547o0307M5737K4326k9903m4550r4485O0193J1170L8454J34165
8346C0028K33418K21816k7454j98266j34636q6365N840J86914J89038o2176p864
8335C50293j25985k4974O0610m7878j7955j78830q5041J3872M0260k0456O5098
8324B9014J04387k5455j03217n0664m8762J03155N1319J16105j0513o8515n2710
8313D4144N218q5149M109J78Q3611L7619n6775k8340J33220N6369J48375J83207
$$ plain form
8301 525786 672068 796675 803718 550856 341902 214682 254668 178613 193946 232362 190298
8290 190298 118479 117416 71675 5333 -50728 -78949 -100021 468 50296 -50585 4795
8279 4795 -32239 -73928 5842 -25707 -44071 -137814 -112222 23968 -31097 -111970 -59608 -3087
8267 -3087 154097 187806 137592 71043 63901 38499 121040 321509 306803 307351 310853 316052 332863
8254 332863 368328 401671 328358 272014 281161 178366 209318 132104 100241 126817 66405 73288
8242 73288 86437 132749 202315 293936 240131 195474 169802 130656 96964 12157 105400 100260
8230 100260 75602 138947 117181 80661 2429 30506 88287 85703 61047 114167 2804 68628
8218 68628 -3236 -114635 -100883 -44296 -24078 18865 81621 -17828 -82959 -55409 34945 161229
$$ packed form
8301E25786J46282J24607P043k52862k08954j27220L9986p6055J5333L8416m2064
8290A90298p1819j063m5741o6342n6061k8221k1072J00489M9828j00881N5380
8279D795l7034m1689P9770l1549j8364r3743K5592J36190n5065q0873N2362N6521
8267c087J57184L3709n0214o6549p142k5402Q2541K00469j4706N48L502N199J6811
8254C32863L5465L3343p3313n6344R147j02795L0952p7214l1863K6576o0412O883
8242G3288J3149M6312O9566R1621n3805m4657k5672l9146l3692q4807R3243n140
8230A00260k4658O3345k1766l6520p8232K8077N7781k584k4656N3120j11363O5824
8218F8628p1864j11399J3752N6587K0218M2943O2756r9449o5131K7550R0354J26284
$$ plain form
8206 161229 181185 109372 131045 45149 -72572 -149268 -43583 -11901 -72795 -109066 -110951
8195 -110951 -120075 -88690 59332 125863 95358 159510 224784 146032 65827 -41888 -32727 35335
8183 35335 -112310 -161788 -53663 -51876 -6241 -25040 -190625 -204055 -74829 -124250 -201249
8172 -201249 -148270 -145789 -245621 -246664 -86379 -36022 -10721 78515 120917 172021 186505 94970
8160 94970 -376 19294 6808 -16130 56290 49516 -136700 -79169 84002 70294 53333 62468
8148 62468 -8692 -104241 -45561 52210 123483 136166 114916 49887 70496 30817 92471 75718
8136 75718 -69043 -101528 -18558 -28321 -24020 -49369 -92856 -161240 -118168 -87714 51590 69873
8124 69873 107539 170439 168174 65942 10529 12163 109116 66188 74764 -5481 -31021 -26161
$$ packed form
8206A61229J9956p1813K1673q5896j17721p6696J05685L1682o0894l6271j885
8195a10951r124L1385J48022O6531l0505O4152O5274p8752q0205j07715R161O8062
8183C5335j47645m9478J08125J787M5635j8799j65585j3430J29226m9421p6999
8172b01249N2979K481r9832j043J60285N0357K5301Q9236M2402N1104J4484r1535
8160I4970r5346J9670j2486k2938P2420o774j86216N7531J63171j3708j6961R135
8148F2468p1160r5549N8680R7771P1273J2683k1250o5029K0609l9679O1654j6753
8136G5718j44761l2485Q2970r763M301k5349m3487o8384M3072L0454J39304J8283
8124F9873L7666O2900k265j02232n5413J634R6953m2928Q576q0245k5540M860
$$ plain form
8112 -26161 2906 60214 48831 53308 65675 24504 74743 16655 10135 78820 35057 -7312
8100 -7312 -11012 -45865 -96067 -21407 -15348 59166 23856 32323 97034 44689 -79335 -144022
8088 -144022 -139810 -143287 -52689 58670 114669 140257 148896 221846 191379 58491 -64791 -152721
8076 -152721 -120950 -149138 -181763 -143931 -120761 -156932 -119118 -66015 -64098 -455 79430 78147
8064 78147 10171 -54193 -2358 -891 -33119 -319 -16938 -64284 -111834 -149013 -50616 -1000
8052 -1000 -50407 37362 75224 42031 -11292 -1985 -4963 -25527 -41401 98978 236151 166737
8040 166737 148094 185358 160055 84271 164138 159072 188384 86362 -8293 -118613 -28995
8029 -28995 42832 -50894 -105200 37732 48750 74330 55885 7076 -2307 65536 48896 -1717
$$ packed form
8112b6161K9067N7308j1383M477J2367m1171N0239n8088o520O8685m3763m2369
8100g312l700l4853n0202P4660O059P4514l5310Q467O4711n2345j24024o4687
8088a44022M212l477R0598J11359N5999K5588Q639P2950l0467j32888j23282q7930
8076a52721L1771k8188l2625L7832K3170l6171L7814N3103J917O3643P9885j283
8064G8147o7976o4364N1835J467l2228L2800j6619m7346m7550l7179R8397M9616
8052a000m9407Q7769L7862l3193n3323R307k978k0564j5874J40379J37173o9414
8040A66737j8643L7264k5303p5784P9867n066K9312j02022r4655j10320Q9618
8029b8995P1827r3726n4306J42932J1018K5580j8445m8809r383O7843j6640n0613
$$ plain form
8017 -1717 -28786 -11487 62741 66109 143388 126768 42494 -65378 -60428 -113662 -221648 -134109
8005 -134109 76364 33241 -53950 -53930 57702 102439 79011 35295 5637 -89798 -76056 -193341
7993 -193341 -254166 -88923 -21558 -116981 -174348 -109825 -4870 22468 -46063 -95751 -11417
7982 -11417 -17611 -2383 52331 54011 189877 177277 135672 71888 75470 114968 128787 215259
7970 215259 174675 43115 18213 109689 127824 123047 116916 32276 49288 41024 96349 48550
7958 48550 -47203 -134592 -159924 -30285 -10525 -30815 745 120963 63899 122067 165912
7947 165912 138582 59054 -93775 -96740 -30580 97327 79800 60271 68301 184891 202735
7936 202735 111874 765 -18810 44582 134233 154860 165431 271493 261939 153424 -14503
$$ packed form
8017a717k7069J7299P4228L368P7279j6620q4274j07872M950n3234j07986Q7539
8005a34109K10473m3123q7191K0J11632M4737k3428m3716k9658r5435J3742j17285
7993a93341o0825J65243O7365r5423n7367O4523J04955K7338o8531m9688Q4334
7982a1417o194J5228N4714J680J35866j2600m1605o3784L582L9498J3819Q6472
7970B15259m0584j31560k4902R1476J8135m777o131q4640J7012q264N5325m7799
7958D8550r5753q7389k5332J29639J9760k0290L1560J20218n7064N8168M3845
7947A65912k7330p9528j52829k965O6160J27907j7527j9529Q030J16590J7844
7936B02735r0861j11109j9575O3392Q9651K0627J0571J06062r554j08515j67927
$$ plain form
7925 -14503 -16076 136172 244098 172554 61369 55308 69504 96109 860 -29986 35718 -46326
7913 -46326 -122545 -93509 25194 50557 59408 57530 160477 135277 88099 29994 5773 78480
7901 78480 98642 66229 -75846 -57055 -106807 -69111 -12260 -55383 -73503 -15541 -75867 14173
7889 14173 40388 -3495 -100605 -162522 -91269 -48117 3712 -20025 -117003 -93011 -15086 -50425
7877 -50425 -131134 -142713 -74680 -84060 -193030 -232329 -242369 -159823 -109494 -75904 -149462 -60469
7865 -60469 86371 208567 286046 141384 121943 40737 -1247 68769 44192 -43158 70741
7854 70741 48962 -46483 -25996 -105496 -151693 -120155 2293 50296 79844 173235 144031 -78315
7842 -78315 -167950 -90900 -32901 -11181 -22359 -35143 -52481 5942 -102847 -94568 -46192 56536
$$ packed form
7925a4503j573J52248J07926p1544j11185o061J4196K6605r5249l0846O5704q2044
7913d6326p6219K9036J18703K5363Q851j878J02947k5200m7178n8105k4221P2707
7901G8480K0162l2413j42075J8791m9752L7696N6851m3123j8120N7962o0326R0040
7889A4173K6215m3883r7110o1917P1253M3152N1829k3737r6978K3992P7925l5339
7877e0425q0709j1579O8033r380j08970l9299j0040Q2546N0329L3590p3558Q8993
7865f0469J46840J22196P7479j44662j9441q1206m1984P0016k4577q7350J13899
7854G0741k1779r5445K0487p9500m6197L1538J22448M8003K9548R3391k9204k22346
7842g8315q9635P7050N7999K1720j1178j2784j7338N8423j08789Q279M8376J02728
$$ plain form
7830 56536 173643 141890 89162 113759 32778 -824 -56859 -101794 -133839 -113928 -124157 -175944
7818 -175944 -128233 13178 -18650 49052 61116 2638 -3911 -114539 -227954 -280627 -109070
7807 -109070 -41283 -92745 -145621 -257733 -240234 -115655 -130050 -134169 -256588 -152507 -28005
7796 -28005 -45317 -132832 -224736 -197974 -161712 -172738 -80374 -146508 -221431 -224769 -198276 -167391
7784 -167391 -158376 -98841 -185224 -383558 -240347 -112780 -177378 -213718 -80174 36065 33560
7773 33560 -107712 -50190 -1353 64108 40923 -54822 -155026 -195969 -133391 -145007 -176306
7762 -176306 -165951 -224150 -203236 -76486 -9975 44460 72139 -90468 -38438 107253 190681
7751 190681 49720 -65229 69863 148773 132806 127970 123749 80425 -46720 -50648 16660
$$ packed form
7830E6536J17107l1753n2728K4597q0981l3602n6035m4935l2045J9911j0229n1787
7818a75944M7711J41411l1828O7702J2064n8478o549j10628j13415n2673J71557
7807a09070O7787n1462n2876j12112J7499J24579j4395m119j22419J04081J24502
7796b8005j7312q7515r1904K6762L6262j1026R2364o6134p4923l338K6493L0885
7784a67391R015N9535q6383j98334J43211J27567o4598l6340J33544J16239k505
7773C3560j41272N7522M8837O5461k3185r5745j00204m0943O2578j1616l1299
7762a76306J0355n8199K0914J26750O6511N4435K7679j62607N2030J45691Q3428
7751A90681j40961j14949J35092P8910j5967m836m221m3324j27145l928O7308
$$ plain form
7740 16660 108539 36686 -25734 -29519 -12120 1118 78067 104010 24553 -75084 -125151 -54600
7728 -54600 27979 -10321 18005 59790 76279 52123 -88704 -22393 -45104 -117508 -98730 -70804
7716 -70804 13438 1801 -68683 -111061 -94854 -185491 -168503 -115442 -56552 -99466 -56545 -43685
7704 -43685 34866 26959 -89312 -4948 58369 53921 -6497 -115257 90488 73290 -38931
7693 -38931 -32184 42021 -16790 60720 75431 7811 75562 174091 159963 78039 -94711 -106855
7681 -106855 24647 181964 113396 -8703 -139818 -48760 -68494 -123401 -86225 -29992 45779
7670 45779 70879 92022 40422 -96500 -243461 -157966 87810 25069 -68797 -28403 92133
7659 92133 64753 -1797 -40053 -17606 -17038 -98051 -146034 -63868 -29133 22010 86982 82490
$$ packed form
7740A6660R1879p1853o2420l785J7399J3238P6949K5943p9457r9637n0067P0551
7728e4600Q2579l8300K8326M1785J6489k4156j40827O6311k2711p2404J8778K7926
7716g0804Q4242j1637p0484m2378J6207r0637J6988N3061N8890m2914M2921J2860
7704d3685P8551p907j16271Q4364O3317m448o0418j08760K05745j7198j12221
7693c8931O747P4205n8811P7510J4711o7620O7751R8529j4128q1924j72750j2144
7681a06855J31502J57317o8568j22099j31115R1058j9734n4907L7176N6233P5771
7670D5779K5100K1143n1600j36922j46961Q5495K45776o2741r3866M0394J20536
7659I2133k7380o6550l8256K2447N68q1013m7983Q2166L4735N1143O4972m492
$$ plain form
7647 82490 129650 182762 188508 156764 161804 101567 -18929 -14942 15037 38951 -28260 -37630
7635 -37630 -48383 -15 19284 86383 97799 43872 -19233 -29678 -91738 -27929 -18091 33409
7623 33409 109893 76532 -7193 20964 72072 83273 126313 178537 111738 70211 -124582 -233494
7611 -233494 -295171 -249509 -163642 -76169 -15753 -102671 -101031 -121679 -50746 -2641 8596 -8784
7599 -8784 -85707 -119419 -32666 -29282 145764 207336 166459 93212 -13130 -84537 -61412 -92894
7587 -92894 -152078 -155406 -105037 -69308 -35452 -16497 -81245 -128191 -19624 95834 55359 -5945
7575 -5945 -30323 -53866 -62803 -55141 -49494 -123994 -159198 -49239 40532 -11129 -81484 -199018
7563 -199018 -127913 -25635 -2844 -66126 35719 62327 -61615 -155944 -237852 -170578 -189126
$$ packed form
7647H2490M7160N3112N746l1744N040o0237j20496L987K9979K3914o7211r370
7635c7630j0753M8368J9299O7099J1416n3927o3105j0445o2060O3809R838N1500
7623C3409P6484l3361q3725K8157N1108J1201M3040N2224o6799m1527j94793j08912
7611b33494o1677M5662Q5867Q7473O0416q6918J640k0648P0933M8105J1237j7380
7599h784p6923l3712Q6753L384J75046O1572m0877p3247j06342p1407K3125l1482
7587i2894n9184l328N0369L5729L3856J8955o4748m6946J08567J15458m0475o1304
7575e945k4378k3543q937P662N647p4500l5204J09959Q9771n1661p0355j17534
7563a99018P1105J02278K2791o3282J01845K6608j23942r4329q1908O7274j8548
$$ plain form
7552 -189126 -188083 -100550 -38802 -7925 -24472 -2743 -37649 1151 113866 278289 195839
7541 195839 88650 21999 37556 95664 114412 117183 -88025 -310233 -339170 -189136 -77684
7530 -77684 41429 -38193 -126170 -143045 -152311 -98748 -60594 -175201 -276177 -299348 -233036
7519 -233036 -260665 -116589 -16764 16104 -57173 -10335 -43759 5444 32322 41809 10409 -144352
7507 -144352 -174748 -118608 -37441 -76868 -41819 -7478 26815 101058 54249 10931 -48512 -80660
7495 -80660 -121257 -201298 -181659 -86483 -18375 28062 46256 32189 -17050 60750 149792 102478
7483 102478 23022 -46165 -53623 18101 -87975 -137036 -258269 -290433 -276576 -246563 -165205
7472 -165205 -11955 -36498 -45128 -46015 97239 29952 -68023 -35719 -913 -47082 66 150198
$$ packed form
7552a89126J043Q7533O1748L0877j6547K1729l4906L8800J12715J64423q2450
7541A95839j07189o6651J5557N8108J8748K771k05208k22208k8937J50034J11452
7530g7684J19113p9622q7977j6875r266N3563L8154j14607j00976k3171O6312
7519b33036k7629J44076R9825L2868p3277M6838l3424M9203K6878R487l1400j54761
7507a44352l0396N6140Q1167l9427L5049L4341L4293P4243m6809m3318n9443l2148
7495h0660m0597q0041J9639R5176O8108M6437J8194j4067m9239P7800Q9042m7314
7483A02478p9456o9187p458P1724j06076m9061j21233l2164J3857L0013Q1358
7472a65205J53250k4543q630q87J43254o7287r7975L2304L4806m6169M7148J50132
$$ plain form
7460 150198 155838 2341 -14581 -45238 -109971 -106118 -57610 -95736 -143074 -144577 -61234 -17601
7448 -17601 -24189 -17124 -108729 -242699 -307028 -289256 -153467 -163752 -185355 -256606 -305626 -373012
7436 -373012 -388397 -279117 -229112 -246440 -260618 -99992 -25482 -100273 -266903 -222931 -112792
7425 -112792 6697 11174 -29117 -91101 -147507 -79558 51243 99520 75995 30902 22189 26402
7413 26402 89245 88619 83334 3392 -210206 -139736 -132091 -199143 -188586 -127103 -5789 12106
7401 12106 -11335 -125412 -74317 40932 14848 -124986 -143961 -177543 -184188 -211040 -211134 -183840
7389 -183840 -133490 -117374 -142536 -37190 124798 190534 170678 95535 102193 96602 141015 150519
7377 150519 81851 -4765 65521 68273 99961 119906 -5120 -35118 47811 148172 214940
$$ packed form
7460A50198N640j53497j6922l0657o4733L853M8508l8126m7338j503Q3343M3633
7448a7601o588P065r1605j33970o4329J7772J35789j0285k1603p1251m9020o7386
7436c73012j5385J09280N0005j7328j4178J60626P4510p4791j66630M3972J10139
7425a12792J19489M477m0291o1984n6406O7949J30801M8277k3525m5093q713M213
7413B6402O2843o26n285p9942k13598P0470P645o7052J0557O1483J21314J7895
7401A2106k3441j14077N1095J15249k6084j39834j8975l3582o645k6852r4K7294
7389a83840N0350J6116k5162J05346J61988O5736j9856p5143O658n591M4413R504
7377A50519o8668q6616P0286K752L1688J9945j25026k9998Q2929J00361O6768
$$ plain form
7366 214940 109843 101887 78465 33769 29678 166955 101755 26512 -76600 -124196 22538
7355 22538 145728 152522 147419 142121 114493 84575 -83789 -101783 -37498 3383 65056 34103
7343 34103 -21204 -15731 50640 118378 10596 -41178 -61838 -110417 -111438 -98225 -9825 25784
7331 25784 67389 121705 95580 67621 14288 -24815 -89181 -120580 -172003 -163581 -69208 -36961
7319 -36961 45779 49989 31033 -62793 -106565 -23406 -18393 -116875 -89267 -91956 -179175 -148314
7307 -148314 -56007 1984 1878 41848 92157 -29922 -126005 -48088 67498 -34308 -178854
7296 -178854 -165117 -94873 77004 78165 100962 34009 -26992 -27090 -39 -10996 -129959 -172318
7284 -172318 -94526 -139159 -127247 -97774 -56599 -62274 -83624 -73794 -43386 -64081 29804 73
$$ packed form
7366B14940j05097p956k3422m4696m091J37277o5200p5243j03112m7596J46734
7355B2538J23190O794n103n298k7628k9918j68364j7994O4285M0881O1673l0953
7343C4103n5307N473O6371O7738j07782n1774k0660m8579j021J3213Q8400L5609
7331B5784M1605N4316k6125k7959n3333l9103o4366l1399n1423Q422R4373L2247
7319c6961Q2740M210j8956r3826m3772Q3159N013r8482K7608k689q7219L0861
7307a48314R2307N7991j06L9970N0309j22079r6083P7917J15586j01806j44546
7296a78854J3737P0244J71877J161K2797o6953o1001r8K7051j0957j18963m2359
7284a72318P7792m4633J1912K9473M1175n675k1350R830L0408k0695R3885k9731
$$ plain form
7272 73 -78539 18255 95294 109769 147602 100191 31863 -33804 -90573 -39210 122758 112987
7260 112987 -20199 -100081 -166582 -184920 -143289 -149049 -139517 -39022 30679 -70308 -149262
7249 -149262 -94942 -22927 21693 64412 17474 -16201 -80730 -139384 -143761 -145968 -92496 66189
7237 66189 78891 68378 -13022 -10259 -107151 -79244 -37389 44124 93270 18969 8858 110634
7225 110634 141217 54848 -68719 -128935 -69897 -145209 -134506 -104057 -165410 -217706 -220255 -208349
7213 -208349 -150390 -113266 -87785 -11154 26246 96686 69306 13445 -132846 -116614 28555
7202 28555 53867 63726 12099 3361 -46438 40778 70455 99521 131961 40224 -95296 -108006
7190 -108006 -74733 37302 95345 43679 47545 56310 25620 -36846 -211977 -254433 -68976
$$ packed form
7272G3p8612R6794P7039J4475L7833m7411o8328o5667n6769N1363J61968r771
7260A12987j33186p9882o6501j8338M1631n760R532J00495O9701j00987p8954
7249a49262N4320P2015M4620M2719m6938l3675o4529n8654m377k207N3472J58685
7237F6189J2702j0513q1400K763r6892K7907M1855Q1513M9146p4301j0111J01776
7225A10634L0583q6369j23567o0216N9038p5312J0703L0449o1353n2296k549J1906
7213b08349N7959L7124K5481P6631L7400P0440k7380n5861j46291J6232J45169
7202B8555K5312R859n1627q738m9799Q7216K9677K9066L2440r1737j35520j2710
7190a08006L3273J12035N8043n1666L866Q765l0690o2466j75131m2456J85457
$$ plain form
7179 -68976 -160703 -208688 -193869 -251973 -148511 -86293 -134091 -143240 -155866 -136285 7982 10759
7167 10759 -47569 -54357 4623 39455 98738 141114 124230 138106 122597 96103 106977 124726
7155 124726 64355 -181 -181961 -217274 -140054 -100035 -129348 -88246 -72431 -106356 -49288
7144 -49288 5011 -105726 -86238 -21945 100259 160777 92818 12291 -86205 -91142 -34414 -131296
7132 -131296 -93596 -47345 -11530 -13061 50907 47340 80922 200328 276489 213242 177067 136667
7120 136667 84053 117566 173502 87398 68602 49421 1286 -174263 -227595 -203917 -145772
7109 -145772 -91864 -36890 51654 158347 204431 220824 -13441 -153315 -74463 -46469 -148129
7098 -148129 -124897 -22786 -27277 37537 161948 74203 68148 45930 24997 48898 -39814 -23513
$$ packed form
7179f8976r1727m7985J4819n8104J03462O2218m7798r149j2626J9581J44267K777
7167A0759n8328o788N8980L4832N9283M2376j6884J3876j5509k6494J0874J7749
7155A24726o0371o4536j81780l5313P7220M0019k9313M1102J5815l3925N7068
7144d9288N4299j10737J9488O4293J22204O0518o7959q0527r8496m937N6728r6882
7132a31296L7700M6251L5815j531O3968l567L3582J19406P6161o3247l6175m0400
7120A36667n2614L3513N5936q6104j8796j9181m8135j75549n3332K3678N8145
7109a45772N3908N4974Q8544J06693M6084J6393k34265j39874P8852K7994j01660
7098a48129K3232J02111m491O4814J24411q7745o055k2218k0933K3901q8712J6301
$$ plain form
7086 -23513 25393 28269 164439 119046 19616 -13692 39544 -8309 -78372 -65488 -184819 -337683
7074 -337683 -331174 -208191 -199411 -116741 -151673 -64695 -35803 -70500 -69439 -134022 -178562 -148989
7062 -148989 -109011 -88373 -142855 -108504 -3033 -23852 26873 61325 5 18674 -4173
7051 -4173 130656 42490 -79047 24177 63734 65689 55788 -6530 -39191 11755 -89722 -216217
7039 -216217 -154379 -116290 -110268 -3148 23480 92952 100408 39850 43877 37126 43795 17614
7027 17614 -35619 -3245 -15919 -72922 -52997 -4396 53781 173840 30836 -32993 -4395
7016 -4395 -9791 -118706 -183769 -127223 -98428 -112624 -126217 -81592 -85710 -122139 677 -40245
7004 -40245 -151213 -185013 -169256 -239263 -298758 -227613 -174802 -324987 -322272 -227302 -160537 -146942
$$ packed form
7086b3513M8906K876J36170m5393r9430l3308N3236m7853p0063J2884j19331j52864
7074c37683O509J22983Q780Q2670l4932Q6978K8892l4697J061o4583m4540K9573
7062a48989L9978K0638n4482L4351J05471k0819N0725L4452o1320J8669k2847
7051d173J34829q8166j21537J03224L9557J955r901o2318l2661N0946j01477j26495
7039b16217O1838L8089O022J07120K6628O9472P456o0558M027o751O669k6181
7027A7614n3233L2374j2674n7003J9925M8601N8177J20059j43004o3829K8598
7016d395n396j08915o5063N6546K8795j4196j3593M4625m118l6429J22816m0922
7004d0245j10968l3800J5757p0007n9495P1145N2811j50185K715R4970O6765J3595
$$ plain form
6992 -146942 -141222 -74194 -99634 -71385 -45405 -3252 92189 70459 34766 33811 -92718 -212557
6980 -212557 -188602 -27177 26542 14022 -25568 23289 33155 23467 51280 101354 45160 63323
6968 63323 115860 140548 262795 298930 95436 73675 8250 -22570 30201 -3608 -175412
6957 -175412 -182015 -54599 -43044 -39730 -79699 -137172 22747 35380 -59582 -106508 -2928
6946 -2928 -22812 -16142 -29564 -133791 -225304 -229690 -182366 -81362 2845 -70766 -93088 -180848
6934 -180848 -183680 -31632 -60474 -125178 -215574 -252482 -100670 84864 70104 -2361 -40115
6923 -40115 -158320 -210967 -235817 -146170 -167590 -193869 -176838 -14570 71111 5467 -90214
6912 -90214 -88023 -139907 -56748 54781 82927 87184 5208 -53318 -48055 -63875 -30945 -27976
$$ packed form
6992a46942N720O7028k5440K8249K5980M2153R5441k1730l5693r55j26529j19839
6980b12557K3955J61425N3719j2520l9590M8857R866r688K7813N0074n6194J8163
6968F3323N2537K4688J22247L6135k03494k1761o5425l0820N2771l3809j71804
6957a75412o603J27416J1555L314l9969n7473J59919J2633r4962m6926J03580
6946b928j9884O670j3422j04227r1513m386M7324J01004Q4207p3611k2322q7760
6934a80848k832J52048k8842o4704r0396l6908J51812J85534j4760p2465l7754
6923d0115j18205n2647k4850Q9647k1420k6279J7031J62268Q5681o5644r5681
6912i0214K191n1884Q3159J11529K8146M257q1976n8526N263j5820L2930K969
$$ plain form
6900 -27976 -120730 -136716 26722 148065 93948 -4481 -2927 5940 -83064 -61291 5308 22887
6888 22887 55352 63604 137900 249323 156132 20749 -61883 15225 125941 76678 79493 91315
6876 91315 57988 9064 -107145 -124237 -110553 -161000 -155374 -209832 -121697 16667 2294 19090
6864 19090 25517 15775 -11863 -123163 -179908 -274107 -203762 -86524 -41274 -93437 -84356 43465
6852 43465 99610 82291 140772 62704 -103371 -186770 -160151 -75004 63456 95075 123067
6841 123067 114795 -48588 -65504 -216 -36805 -165974 -74279 123899 125524 120926 71379 126540
6829 126540 205093 138885 141337 88107 19554 20990 54553 86781 40719 -56056 -82752 -20216
6817 -20216 76040 119809 108638 68383 3833 13719 20737 -96406 -180363 -175603 -241681 -273399
$$ packed form
6900b7976r2754j5986J63438J21343n4117r8429J554Q867q9004K1773O6599J7579
6888B2887L2465Q252P4296J11423r3191j35383q2632P7108J10716m9263K815J1822
6876I1315l3327m8924j16209j7092J3684n0447N626n4458Q8135J38364j4373J6796
6864A9090O427r742k7638j11300n6745r4199P0345J17238M5250n2163R081J27821
6852D3465N6145j7319N8481p8068j66075q3399K6619Q5147J38460L1619K7992
6841A23067q272j63383j6916O5288l6589j29169R1695J98178J625m598m9547N5161
6829A26540P8553o6208K452n3230o8553J436L3563L2228m6062r6775k6696O2536
6817b0216R6256M3769j1171m0255o4550R886P018j17143q3957M760o6078l1718
$$ plain form
6805 -273399 -218352 -132715 -62151 -112997 -90058 -152334 -121888 -40343 -191396 -189949 -131943 1549
6793 1549 33072 15642 -54220 -51487 -67678 20508 19954 -23225 -18180 7239 42360 95406 85835
6780 85835 13992 -45089 -24386 -55043 -155111 -291802 -334343 -297663 -320732 -205190 -136534
6769 -136534 -171177 -167295 -38487 44055 51983 55533 -3297 -7300 -28591 -77089 -121206 -204294
6757 -204294 -199351 -126508 8147 -2888 -88912 -48654 -18991 96491 120385 75295 64793
6746 64793 -45713 -230159 -394446 -371936 -271375 -299073 -293557 -300481 -271123 -169574 -131056
6735 -131056 -63813 77461 179226 99089 96294 188095 156662 19122 -15857 -24401 4151
6724 4151 37573 81768 123505 11996 38184 61509 31959 22021 51369 50568 35218 -22434
$$ packed form
6805b73399N5047Q5637P0564n0846K2939o2276L0446Q1545j51053J447N8006J33492
6793A549L1523j7430o9862K733j6191Q8186n54m3179N045K5419L5121N3046r571
6780H5835p1843n9081K0703l0657j00068j36691m2541L6680k3069J15542O8656
6769a36534l4643L882J28808Q2542P928L550n8830m003k1291m8498m4117q3088
6757b04294M943P2843J34655j1035q6024M0258K9663J15482K3894m5090j0502
6746F4793j10506j84446j64287K2510J00561k7698N516o924K9358J01549L8518
6735a31056O7243J41274J01765q0137k795R1801l1433j37540l4979q544K8552
6724D151L3422M4195M1737j11509K6188K3325k9550r938K9348q01j5350n7652
$$ plain form
6712 -22434 85744 80051 -40591 -95988 -180300 -222287 -198878 -161086 -34193 196254 174419
6701 174419 36768 4777 -53212 -63833 -36294 -83357 -98247 -224602 -338216 -253963 -123362
6690 -123362 -136841 -70259 -69165 -21178 22126 -99450 -83091 -143899 -139129 -198101 -253563 -162352
6678 -162352 -84469 -70881 -119090 -38110 -1357 -30695 -155551 -60173 30687 -59850 -14720
6667 -14720 23795 -42267 -161130 -143785 -130273 -139530 -44267 6730 -3822 -10126 -52983 -90312
6655 -90312 11634 -83303 -54207 -12438 -105544 -145480 -73685 -142971 -170704 -173393 -52412 -21449
6643 -21449 7825 69542 126229 -32796 -93233 -81125 -115941 -68880 -32970 -17808 4471 114807
6631 114807 57047 40038 46261 204255 212335 85621 54063 57453 10540 54421 75247 -38346
$$ packed form
6712b2434J08178n693j20642n5397q4312m1987K3409L7792J26893K30447k1835
6701A74419j37651l1991n7989j0621K7539m7063j4890j26355j13614Q4253J30601
6690a23362j3479O6582J094M7987M3304j21576J6359o0808M770n8972n5462R1211
6678a62352P7883J3588m8209Q0980L6753k9338j24856R5378R0860r0537M5130
6667a4720L8515o6062j18863J7345J3512r257R5263N0997j0552o304m2857l7329
6655i0312J01946r4937K9096M1769r3106l9936P1795o9286k7733k689J20981L0963
6643b1449K9274O1717N6687j59025o0437J2108l4816M7061L5910J5162K2279J10336
6631A14807n7760j7009O223J57994Q080j26714l1558L390m6913M3881K0826j13593
$$ plain form
6619 -38346 -161658 -152870 -146531 -165772 -107517 -22362 -65167 -972 182332 113347 28589 -25932
6607 -25932 -623 95957 269985 349055 210929 58718 29991 -16556 -89071 -124139 -61371
6596 -61371 167777 291828 196914 61277 -3516 -68787 -119854 -86234 -110655 -139865 -164104
6585 -164104 -82428 -23085 -42404 -105899 -76273 431 64590 216278 272153 79281 -93587
6574 -93587 -90622 -93991 -93218 -36139 38462 42717 -13678 -56886 73618 119083 137694 75914 17053
6561 17053 26781 47274 -61720 -81657 -76243 100638 -17629 -101134 -26664 26750 40878 59717
6549 59717 -23046 -32697 -109322 -127879 -24990 44651 -25721 978 34983 4266 54812 21480
6537 21480 -40634 -59637 100809 153499 176345 202816 238221 238863 295714 310286 194506 97406
$$ packed form
6619c8346j23312Q788O339j9241N8255Q5155m2805O4195J83304o8985q4758n4521
6607b5932K5309R6580J74028P9070j38126j52211k8727m6547p2515l5068O2768
6596f1371K29148J24051r4914j35637o4793o5271n1067L3620k4421k9210k4239
6585a64104Q1676N9343j9319o3495K9626P6704O4159J51688N5875j92872j72868
6574i3587K965l369P73N7079P4601M255n6395m3208J30504M5465J8611o1780n8861
6561A7053R728K0493j08994j9937N414J76881j18267q3505P4470N3414J4128J8839
6549E9717q2763r651p6625j8557J02889O9641p0372K6699L4005l0717N0546l3332
6537B1480o2114j9003J60446N2690K2846K6471L5405O42N6851J4572j15780r7100
$$ plain form
6525 97406 30908 11508 -31275 35922 35780 -42517 17057 -4813 -32579 -196214 -88651 53766
6513 53766 18685 -72888 -15293 -13356 -66799 -50549 -146502 -152396 -48186 85209 142401 176531
6501 176531 114051 116917 175368 118195 18320 -5619 -68785 -117073 -147758 -63496 3569 89068
6489 89068 13505 8809 88449 156904 60058 -115171 -73307 -18648 29957 -16851 -105186 -167378
6477 -167378 -163573 4012 71065 28446 6555 27870 143512 140083 86549 -19835 -55970
6466 -55970 -46609 22121 9988 -75690 -70445 -195914 -88040 -88775 -98489 -64855 -50427 -61510
6454 -61510 -24452 -20308 -59701 -71177 -56139 -19093 101121 101137 53691 25077 32190 -47311 -159263
6441 -159263 -65015 102542 -22538 -70605 -85150 -112593 7915 135742 180865 151893 43884
$$ packed form
6525I7406o6498j9400m2783O7197j42p8297N9574k1870k7766j63635J07563J42417
6513E3766l5081r1573N7595J937n3443J6250r5953n894J04210J33395N7192L4130
6501A76531o2480K866N8451n7173r9875k3939o3166m8288l0685Q4262O7065Q5499
6489H9068p5563m696P9640O8455r6846j75229M1864N4659M8605m6808q8335o2192
6477a67378L805J67585O7053m2619k1891K1315J15642l429n3534j06384l6135
6466e5970R361O8730j2133q5678N245j25469J07874p35r714L3634J4428j1083
6454f1510L7058M144l9393j1476J5038L7046J20214J6m7446k8614P113p9501j11952
6441a59263R4248J67557j25080m8067j4545k7443J20508J27827M5123k8972j08009
$$ plain form
6430 43884 -66401 23491 227254 192674 136423 122637 1991 -75230 -48175 -39895 -14268
6419 -14268 -87744 -65260 -76981 -74949 -46319 -84121 -86242 -29640 -44149 -42554 -39945 -179374
6407 -179374 -285645 -200880 -52871 -64376 -115905 -140524 -237522 -270737 -217491 -25937 63381
6396 63381 78182 90488 141260 67791 -36547 -88124 -157591 -192232 -102072 -51097 -52708 -3111
6384 -3111 21689 24989 8648 10160 -59356 -168681 -142148 8711 53669 108150 78049 51636
6372 51636 30911 9304 -36811 -34580 -16208 -60747 -37071 58274 -29356 -146828 -33929 -36814
6360 -36814 -24236 -46109 -34437 -8361 -66817 -53526 -28911 -49507 -65047 -142249 -190688 -145662
6348 -145662 -163441 -110455 -38701 29657 -35832 -132684 -195944 -112492 -19610 35892 -113356
$$ packed form
6430D3884j10285Q9892K03763l4580n6251j3786j20646p7221K7055Q280K5627
6419a4268p3476K2484j1721K032K8630l7802k121N6602j4509J595K609j39429
6407a79374j06271Q4765J48009j1505n1529k4619r6998l3215N3246J91554Q9318
6396F3381J4801J2306N0772p3469j04338n1577o9467l4641R0160N0975j611M9597
6384c111K4800L300j6341J512o9516j09325K6533J50859M4958N4481l0101k6413
6372E1636k0725k1607m6115K231J8372m4539K3676R5345q7630j17472J12899k885
6360c6814J2578k1873J1672K6076n8456J3291K4615k0596j5540p7202m8439M5026
6348a45662j7779N2986P1754O8358o5489r6852o3260Q3452R2882N5502j49248
$$ plain form
6337 -113356 -109436 -97001 -42252 87911 119430 90340 -17573 39182 117009 31865 15912
6326 15912 66078 144775 100249 28215 68711 151196 77330 -11551 -26863 148221 227590 212464
6314 212464 160363 126845 28632 41429 81317 42867 48806 59924 -51524 -193486 -262040
6303 -262040 -200017 -138228 -129868 -65744 -71272 -163149 -249200 -232675 -227597 -59111 -42858 -75906
6291 -75906 25089 131666 199391 108252 83356 -31375 -146022 -17058 5868 -30188 -22661
6280 -22661 -16334 12584 -116102 -89599 100741 115914 28999 9931 -34480 -54215 31880 88510
6268 88510 121015 49942 -90393 9012 132918 96266 29312 1046 -46043 -5431 59840
6257 59840 -2441 -86199 -16171 48164 -48516 -137417 -126070 -90441 -84921 74686 171377 91984
$$ packed form
6337a13356L920J2435N4749J30163L1519k9090j07913N6755P7827q5144j5953
6326A5912N0166P8697m4526p2034M0496Q2485p3866q8881j5312J75084P9369j5126
6314B12464n2101l3518r8213J2797L9888l8450N939J1118j11448j41962o8554
6303b62040O2023O1789Q360O4124n528r1877q6051J6525N078J68486J6253l3048
6291g5906J00995J06577O7725r1139k4896j14731j14647J28964K2926l6056P527
6280b2661O327K8918j28686K6503J90340J5173q6915j9068m4411j9735Q6095N6630
6268H8510L2505p1073j40335R9405J23906l6652o6954k8266m7089M0612O5271
6257E9840o2281q3758P0028O4335r6680q8901J1347L5629N520J59607R6691p9393
$$ plain form
6245 91984 61385 98347 196866 156212 19862 60951 150111 142362 58765 31015 49527 -5042
6233 -5042 -33340 -28201 -816 38268 74164 -8036 -7128 48538 -21838 -48130 27507 -68197 -209976
6220 -209976 -181236 -228975 -228597 -214347 -346531 -313840 -251762 -199900 -116966 -59057 -1619 59752
6208 59752 145339 73793 -5671 79794 36566 -51242 -6648 -42064 33711 88424 62308 -29468
6196 -29468 -130895 -206549 -252009 -261179 -215370 -67081 -57373 -67195 -108829 -78280 -122157 -227583
6184 -227583 -280654 -122090 -65575 12546 46635 64457 89854 133868 123745 20328 13723
6173 13723 6631 -48664 20776 162661 261453 104310 -52706 -79327 -122634 50253 -1432
6162 -1432 -121254 -164717 -161140 4730 128607 88339 123911 215841 157078 113316 101306 132620
$$ packed form
6245I1984l0599L6962R8519m0654j36350M1089Q9160p749q3597k7750J8512n4569
6233e042k8298N139K7385L9084L5896q2200R08N5666p0376k6292P5637r5704j41779
6220b09976K8740m7739L78J4250j32184L2691O2078N1862Q2934N7909N7438O1371
6208E9752Q5587p1546p9464Q5465m3228q7808M4594l5416P5775N4713k6116r1776
6196b9468j01427p5654m5460r170M5809J48289R708r822m1634L0549m3877j05426
6184b27583n3071J58564N6515P8121L4089J7822K5397M4014j0123j03417o605
6173A3723p092n5295O9440J41885R8792j57143j57016k6621m3307J72887n1685
6162a432j19822m3463L577J65870J23877m0268L5572R1930n8763m3762j2010L1314
$$ plain form
6150 132620 126201 120151 11221 9289 77199 10308 52893 153406 -43828 -87516 -49368 5852
6138 5852 9568 6884 59097 30183 142033 36001 -23894 -57296 -39816 33175 -31168 -123480
6126 -123480 -59791 4656 57765 -20959 -130181 -48885 19837 -23660 -70765 -599 101787
6115 101787 253722 237269 150328 89301 -35971 -109076 -135793 -178241 -193853 -138617 -141071
6104 -141071 -35222 -26286 -61959 -15241 -41479 -49297 -6095 -35496 -110161 -141595 -36283 -9483
6092 -9483 -28050 28220 -21069 -78167 -112617 -1106 60443 4594 131272 135173 9998 -119956
6080 -119956 -168570 -79124 -78081 -120788 -105466 -7333 64161 114178 55353 57863 66543 -20359
6068 -20359 -24257 -125764 -203154 -204716 -133462 -155794 -120683 -47254 -55332 19865 53247 11965
$$ packed form
6150A32620o419o050j08930j932O7910o6891M2585J00513j97234m3688L8148N5220
6138E852L716k684N2213k8914J11850j06032n9895l3402J7480P2991o4343r2312
6126a23480O3689O4447N3109p8724j09222Q1296O8722m3497m7105P0166J02386
6115A01787J51935j6453q6941o1027j25272p3105k6717m2448j5612N5236k454
6104a41071J05849Q936l5673M6718k6238p818M3202k9401p4665l1434J05312K6800
6092i483j8567N6270m9289n7098l4450J11511O1549n5849J26678L901j25175j29954
6080a19956m8614Q9446J043m2707J5322R8133P1494N0017n8825K510Q680q6902
6068b0359l898j01507p7390j562P1254k2332L5111P3429q078P5197L3382m1282
$$ plain form
6056 11965 290 -9922 -100062 -198987 -153364 -164509 -176114 -138110 -158046 32824 86735 -35836
6044 -35836 -15184 -714 -29793 -18813 -7130 85223 -5940 -41855 59940 51014 -66468 -69496
6032 -69496 -86406 -116433 -91579 -15514 87868 83903 63054 6216 18518 -31278 -109153 -126228
6020 -126228 -41225 -13419 -40562 -42402 -40813 -106025 -94947 -24937 37714 94315 132660 118355
6008 118355 -44074 -49886 -206 44371 -32856 -101058 -27520 -56544 46543 -11138 -22916
5997 -22916 -72480 -73493 -41098 -40032 -26379 -15758 -61118 -22007 13240 -69132 -94595 -142526
5985 -142526 -127864 -174930 -251467 -199643 -211824 -191543 -44432 13814 10007 13060 45423 -9712
5973 -9712 3714 -42203 -86724 -117405 -111329 -82150 -101295 -42575 -38909 62605 37034 -98144
$$ packed form
6056A1965j1675j0212r0140r8925M5623j1145j1605L8004j9936J90870N3911j22571
6044c5836K0652J4470k9079J0980J1683R2353r1163l5915J01795q926j17482l028
6032f9496j6910l0027K4854P6065J03382l965k0849n6838J2302m9796p7875j7075
6020a26228Q5003K7806k7143j840J589o5212J1078P0010O2651N6601L8345j4305
6008A18355j62429n812M9680M4577p7227o8202P3538k9024J03087n7681j1778
5997b2916m9564j013L2395J066J3653J0621m5360L9111L5247q2372k5463m7931
5985a42526J4662m7066p6537N1824j2181K0281J47111N8246l807L053L2363n5135
5973i712J3426m5917m4521l0681O076K9179j9145N8720L666J01514k5571j35178
$$ plain form
5961 -98144 -134036 -45187 14741 -47497 -18393 94127 41629 40656 45361 14920 -124151 -115634
5949 -115634 -146655 -235081 -304661 -134545 -119747 -133251 -170869 -126698 -152769 -111090 -109179 -134153
5937 -134153 32444 113900 177340 255284 253539 138506 92165 211454 312439 356827 318908
5926 318908 238407 114677 54043 139767 164301 204370 162071 155941 -77539 -155381 -65595
5915 -65595 -33830 42877 58153 74368 60265 80447 128566 72301 -15354 -144951 -85130 -28833
5903 -28833 -57529 44937 85126 -59861 -111171 -204288 -248872 -250178 -178745 -118116 -14346
5892 -14346 11348 -32284 -35575 -50728 -85211 -125075 -93867 -40964 29489 105995 139749 75590
5880 75590 31750 -39441 -122649 -163328 -73560 -60092 -46601 111222 203063 151093 95884 37232
$$ packed form
5961i8144l5892Q8849N9928o2238K9104J12520n2498r73M705l0441j39071Q517
5949a15634l1021q8426o9580J70116J4798j3504l7618M4171k6071M1679J911k4974
5937a34153J66597Q1456O3440P7944j745j15033m6341J19289J00985M4388l7919
5926C18908q0501j23730o0634Q5724K4534M0069m2299o130k33480p7842Q9786
5915f5595L1765P6707J5276J6215j4103K0182M8119n6265q7655j29597N9821N6297
5903b8833k8696J02466M0189j44987n1310r3117m4584j306P1433O0629J03770
5892a4346K5694m3632l291j5153l4483l9864L1208N2903P0453P6506L3754o4159
5880G5590m3840p1191q3208m0679Q9768J3468J3491J57823R1841n1970n5209n8652
$$ plain form
5868 37232 29135 -79552 -80354 134493 217021 174041 -3612 4645 80634 2614 -198919 -241382
5856 -241382 -213578 -89838 -63587 -43913 -18228 15368 2125 -33501 -19629 -37424 -107684
5845 -107684 -104390 -97813 -163541 -229060 -58989 11576 -53946 -109958 -66517 -140411 -182176 -145755
5833 -145755 -103307 -19534 93613 87092 45228 -65186 -68163 -124484 -211808 -268415 -260859 -112891
5821 -112891 -94598 -90596 -50048 -29725 -65065 -146782 -147131 -71950 -177145 -159032 -133639 -119534
5809 -119534 -119370 -171965 -111321 -157 43517 39335 14691 -46805 51448 49978 -13071 75146
5797 75146 180185 299147 162335 -21925 -70453 -43963 -19086 -6111 -45686 -118434 -89929
5786 -89929 -38875 -58933 -116851 24551 41896 -9223 52811 -8019 -11153 20194 35149 724
$$ packed form
5868C7232q097j08687q02K14847Q2528m2980j77653Q257P5989p8020k01533m2463
5856b41382K7804J23740K6251J9674K5685L3596j3243l5626J3872j7795p0260
5845a07684L294O577o5728o5519J70071P0565o5522n6012M3441p3894m1765L6421
5833a45755M2448Q3773J13147o521m1864j10414k977n6321q7324n6607P556J47968
5821a12891J8293M002M0548K0323l5340q1717l49P5181j05195J8113K5393J4105
5809a19534J64n2595O0644J11164M3674m182k4644o1496R8253j470o3049Q8217
5797G5146J05039J18962j36812j84260m8528K6490K4877J2975l9575p2748K8505
5786h9929N1054k0058n7918J41402J7345n1119O2034o0830l134L1347J4955l4425
$$ plain form
5774 724 -102602 -96053 -11486 -33005 -18031 -27634 -37163 -25198 -32733 -53951 -106325 -69310 39437
5761 39437 50836 -49047 -114348 -182226 -181013 -71809 -15223 -3919 8961 66828 100227 108638
5749 108638 117646 124775 90835 -13945 -76468 -56428 27542 60103 -49012 -82813 -94239 -84251
5737 -84251 -65785 -8518 -28131 -84744 -94361 -185772 -224472 -98187 -89062 -131698 -147749 -235557
5725 -235557 -170757 -46771 54258 129569 7112 72502 49369 -119690 -83900 -60927 -147959
5714 -147959 -245265 -196780 -107018 -86179 -144580 -171817 -238525 -101415 -14057 -53547 3565
5703 3565 -123654 -135391 -6168 -20082 -31777 -66599 -11367 83273 221557 158070 83884
5692 83884 78782 170823 177507 90453 -68281 -84256 -25969 24159 20169 -79989 -103005 34848
$$ packed form
5774G24j03326O549Q4567k1519J4974r603r529J1965p535k1218n2374L7015J08747
5761C9437J1399r9883o5301o7878J213J09204N6586J1304J2880N7867L3399Q411
5749A08638R008P129l3940j04780o2523K0040Q3970L2561j09115l3801j1426R988
5737h4251J8466N7267j9613n6613r617r1411l8700J26285R125m2636j6051q7808
5725b35557O4800J23986J01029P5311j22457O5390k3133j69059L5790K2973q7032
5714a47959r7306M8485Q9762K0839n8401k7237o6708J37110Q7358l9490N7112
5703C565j27219j1737J29223j3914j1695l4822N5232R4640J38284o3487p4186
5692H3884n102R2041O684q7054j58734j5975N8287N0128l990j00158k3016J37853
$$ plain form
5680 34848 105648 110471 804 -228559 -245448 -251339 -161176 -99919 -162793 -129285 -20009 -2857
5668 -2857 -21316 -101243 -87888 34466 -16644 -66448 -97585 -47620 18316 -48643 -82772 -58307
5656 -58307 54943 61544 36050 45292 109783 81023 114903 214485 177844 93786 111042 277714
5644 277714 377600 281994 93892 135075 65018 52310 15571 48216 152184 146851 195087
5633 195087 267214 183912 57287 -63562 -120667 -93460 -86428 -40907 -15899 -58871 -151605
5622 -151605 -210785 -157703 -191605 -187697 -85467 -78310 -54521 -164195 -232047 -112226 -78155
5611 -78155 18920 126712 118614 -35821 -76914 -111852 -132330 -174658 -171907 -122804 -96083 -75121
5599 -75121 -59491 -81055 -71121 -94592 -95268 -61189 89633 53901 -52594 -48632 -160782 -243612
$$ packed form
5680C4848P0800M823j09667k29363j6889n891R0163O1257o2874L3508J09276J7152
5668b857j8459p9927J3355J22354n1110m9804l1137M9965O5936o6959l4129K4465
5656e8307J13250O601k5494R242O4491k8760L3880R9582l6641q4058J7256J66672
5644B77714R9886r5606j88102M1183p0057j2708l6739L2645J03968n333M8236
5633A95087P2127q3302j26625j20849n7105K7207P032M5521K5008m2972r2734
5622a51605n9180N3082l3902L908J02230P157K3789j09674o7852J19821L4071
5611g8155R7075J07792q098j54435m1093l4938k0478m2328K751M9103K6721K0962
5599g5121J5630k1564R934k3471o76L4079J50822l5732j06495L962j12150q2830
$$ plain form
5587 -243612 -221305 -7287 42612 18090 11871 62743 167613 149019 49323 -15838 -3080
5576 -3080 107521 214935 271375 142186 158494 198243 32154 -24922 8228 -38878 -160548
5565 -160548 -66140 84546 61741 58370 83188 -18823 -124395 -116875 -76265 -73696 -101815 -42673
5553 -42673 -65978 -29032 -15926 -14644 16795 -18254 -88547 -218310 -243330 -146827 -20986 -44455
5541 -44455 -78105 -129568 -275513 -269832 -162536 -132775 -32700 -91839 -171546 -175368 -119517 -82173
5529 -82173 -122563 -209849 -103232 -82225 -138457 -103832 -95877 -59435 -62756 -214329 -263634 -252914
5517 -252914 -251903 -190165 -116720 -37190 -48947 -10226 -10587 -62268 -28629 112957 141671 28599
5505 28599 42101 17835 157685 99174 -15528 -94219 -128217 -163496 -69853 93221 51509
$$ packed form
5587b43612K2307K14018M9899k4522o219N0872J04870j8594r9696o5161J2758
5576c080J10601J07414N6440j29189J6308L9749j66089n7076L3150m7106j21670
5565a60548R4408J50686k2805l371K4818j02011j05572P520M0610K569k8119N9142
5553d2673k3305L6946J3106J282L1439l5049p0293j29763k5020R6503J25841k3469
5541d4455l3650n1463j45945N681J07296K9761J00075n9139p9707l822N5851L7344
5529h2173m0390q7286J06617K1007n6232L4625P955L6442l321j51573m9305J0720
5517b52914J011O1738P3445P9530j1757L8721l61n1681L3639J41586K8714j13072
5505B8599J3502k4266J39850n8511j14702p8691l3998l5279R3643J63074m1712
$$ plain form
5494 51509 -64350 -5179 -18037 -99741 107560 146443 110057 243926 315196 195872 83573
5483 83573 -63708 -143574 -174522 -115179 135 62900 177751 99029 125055 58877 -70640
5472 -70640 -240581 -372617 -328140 -291008 -232574 -229434 -149458 12364 184792 156963 -56985
5461 -56985 -227723 -186354 -177169 -116557 -138055 -72003 -90994 -91690 41410 112504 192902 66773
5449 66773 -110340 -29388 -46896 -128162 -185259 -93778 20854 81635 -18507 -48078 20176
5438 20176 91813 125478 158272 30086 -148741 -165420 -177159 -118903 -82041 -95346 16990
5427 16990 25788 93393 144333 51780 74111 56281 14890 5854 -141282 -215823 -203501 -114048
5415 -114048 -102721 39919 111363 -1369 -45526 -871 59511 -12326 -37128 -123853 -195597
$$ packed form
5494E1509j15859N9171j2858q1704K07301L8883l6386J33869P1270j19324j12299
5483H3573j47281p9866l0948N9343J15314O2765J14851p8722K6026o6178j29517
5472g0640j69941j32036M4477L7132N8434L140P9976J61822J72428k7829k13948
5461e6985j70738M1369R185O0612k1498O6052j8991o96J33100P1094Q0398j26129
5449F6773j77113Q0952j7508q1266n7097R1481J14632O0781j00142k9571O8254
5438B0176P1637L3665L2794j28186j78827j6679j1739N8256L6862j3305J12336
5427A6990Q798O7605N0940r2553K2331j7830m1391r036j47136p4541J2322Q9453
5415a14048J1327J42640P1444j12732m4157M4655O0382p1837k4802q6725p1744
$$ plain form
5404 -195597 -147503 -118396 -24695 51929 105994 45608 -111240 -210985 -210894 -167105 -188289 -248402
5392 -248402 -223690 -127973 -102169 -102094 -142258 -156379 -130263 -180258 -182664 -111237 -99319 -42263
5380 -42263 -3247 -5856 66038 17891 -62676 -148093 -140148 -35889 -38961 -132650 -123924 -188550
5368 -188550 -168888 -261809 -122469 27286 96284 -6555 -63302 -46506 97015 54703 1484
5357 1484 -38674 -22968 -2791 12009 -17349 121041 115363 -46121 -72140 -146498 -193059 -133778
5345 -133778 -85780 -117973 -73064 -88297 -43484 -74564 -105234 -121132 -127611 -85431 24078 77792
5333 77792 19890 -47 -46629 -119191 -86945 -50435 -5538 27022 47040 72146 155492 135137
5321 135137 178920 166074 74046 -7963 -34801 86730 109496 98460 79166 100229 119933
$$ packed form
5404a95597M8094K9107R3701P6624N4065o0386j56848r9745R1M3789k1184o0113
5392b48402K4712R5717K5804P5m0164j4121K6116m9995k406P1427J1918N7056
5380d2263L9016k609P1894m8147q0567q5417P945J04259l072r3689Q726o4626
5368a88550J9662r2921J39340J49755O8998j02839n6747J6796J43521m2312n3219
5357A484m0158J5706K0177J4800k9358J38390n678j61484k6019p4358m6561N9281
5345a33778M7998l2193M4909j5233M4813l1080l0670j5898o479M2180J09509N3714
5333G7792n7902j9937m6582p2562L2246L6510M4897L2560K0018K5106Q3346k0355
5321A35137M3783j2846r2028q2009k6838J21531K2766j1036j9294K1063J9704
$$ plain form
5310 119933 37543 106870 146975 120493 130758 49794 99856 40259 16270 3336 38761 46581
5298 46581 -8658 -95103 10239 101373 162282 165370 122213 142776 180527 110586 163553 122466
5286 122466 204801 163568 257537 207227 34358 -82940 -81365 -48386 4839 50534 36300
5275 36300 -44051 -90150 -171201 -165527 -123307 -94538 -17637 -37521 -64896 -112995 -87750 -93004
5263 -93004 -162985 -117056 -8263 -25401 -137161 -174823 -134002 -117754 -95871 -66732 -22146
5252 -22146 -8647 -72623 -66266 -45008 -25671 -67445 -123669 -169012 -47847 86372 -15581
5241 -15581 -114847 -54255 92549 113002 201230 294508 227126 98705 44124 1217 5296 46924
5229 46924 122493 85859 63135 92868 117939 72022 97867 87765 94733 91955 139940 80770
$$ packed form
5310A19933q2390O9327M0105k6482J0265q0964N0062n9597k3989j2934L5425P820
5298D6581n5239q6445J05342R1134O0909L088m3157K0563L7751o9941N2967m1087
5286A22466Q2335m1233R3969n0310j72869j17298J575L2979N3225M5695j4234
5275C6300q0351m6099q1051N674M2220K8769P6901j9884k7375m8099K5245n254
5263i3004o9981M5929J08793j7138j11760l7662M0821J6248K1883K9139M4586
5252b2146J3499o3976O357K1258J9337m1774n6224m5343J21165J34219j01953
5241a5581r9266O0592J46804K0453Q8228R3278o7382j28421n4581m2907M079M1628
5229D6924P5569l6634k2724K9733K5071m5917K5845j0102O968k778M7985n9170
$$ plain form
5217 80770 -91779 -41117 -13487 -80936 -218161 -275698 -111807 -18120 54803 7833 -55460
5206 -55460 -156247 -220213 -105915 19033 -49999 54972 78432 63517 55878 24600 120749
5195 120749 270304 248394 79948 17095 90043 79686 30992 37776 882 -16319 39712
5184 39712 79836 8336 32442 115096 193506 178754 233127 206324 21497 -86695 -122233
5173 -122233 -50208 37941 45774 -12176 -182823 -252386 -138487 -89383 9645 90130 121887
5162 121887 -103982 -165495 -182125 -123304 -83515 57769 85161 37376 -69591 -14544 -12261
5151 -12261 -72687 -77814 -44936 -41583 -43230 -914 148131 256246 220359 154304 157951 37771
5139 37771 -29126 38187 108939 94819 12372 63842 -15757 -86422 -157249 -159798 -140493 -127249
$$ packed form
5217H0770j72549N0662K7630o7449j37225n7537J63891R3687P2923m6970o3293
5206e5460j00787o3966J14298J24948o9032J04971K3460j4915p639l1278R6149
5195A20749J49555k1910j68446o2853P2948j0357m8694O784l6894j7201N6031
5184C9712M0124p1500K4106Q2654P8410j4752N4373k6803j84827j08192l5538
5173a22233P2025Q8149P833n7950j70647o9563J13899M9104R9028Q0485L1757
5162A21887k25869o1513j6630N8821L9789J41284K7392m7785j06967N5047K283
5151a2261o0426n127L2878L353j647M2316J49045J08115l5887o6055L647j20180
5139C7771o6897O7313P0752j4120q2447N1470p9599p0665p0827k549J9305J3244
$$ plain form
5127 -127249 -68008 -92033 -61253 -39470 -148862 -177149 -209006 -216306 -247633 -168131 -115214 76444
5115 76444 94145 59334 13317 71670 139668 213030 209955 22265 -28369 107349 134883 132203
5103 132203 125087 22877 9423 -47625 72804 216764 85636 17878 17816 -21076 9355 -48425
5091 -48425 -39889 -5425 50390 44446 94741 112107 223231 213176 204285 194969 55233 268
5079 268 -111810 -209900 -204933 -117142 -58247 -15450 -27228 -150196 -133581 -102021 -106295 -147990
5067 -147990 -75262 -18686 -62861 -144294 -140188 -267229 -174505 28083 49425 -119399 -200875
5056 -200875 -89579 -147896 -149660 28113 98288 64156 9651 -20536 -31098 105400 100725
5045 100725 -93433 -135445 -120344 -194589 -241262 -202950 -126683 1824 22410 23694 8145
$$ packed form
5127a27249N9241k4025L0780K1783j09392k8287l1857p300l1327P9502N2917J91658
5115G6444J7701l4811m6017N8353O7998P3362l075j87690n0634J35718K7534k680
5103A32203p116j02210j3454n7048J20429J43960j31128o7758o2l8892L0431n7780
5091d8425Q536L4464N5815n944N0295J7366J11124j0055q891r316j39736n4965
5079B68j12078r8090M967Q7791N8895M2797j1778j22968J6615L1560m274m1695
5067a47990P2728N6576m4175q1433M106j27041R2724K02588K1342j68824q1476
5056b00875J11296n8317j764J77773P0175l4132n4505l0187j0562J36498m675
5045A00725j94158m2012J5101p4245m6673L8312P6267J28507K0586J284j5549
$$ plain form
5034 8145 -47760 -15046 71491 100751 36880 -38671 -1826 158116 186698 165361 161367 184291
$$ packed form
5034H145n5905L2714Q6537K9260o3871p5551L6845J59942K8582k1337l994K2924
$$ [...]
##END NTUPLES=NMR SPECTRUM
##END=
