##TITLE=Analysis number 327794
Compound Code spb 01327
Book Reference 190282
Project Code adrs  flro3
Chemist Name jom
##JCAMPDX= 6.0         $$ Bruker NMR JCAMP-DX V2.0
##DATA TYPE= NMR SPECTRUM
##DATA CLASS= NTUPLES
##ORIGIN= Bruker BioSpin GmbH
##OWNER= nmr
$$ XWIN-NMR		Version 3.5
$$ Tue Apr 10 11:59:27 2007 GMT Daylight Time (UT+1h)  MAYBRIDGE\nmr@NMR_250MHZ
##.OBSERVE FREQUENCY= 250.131544655141
##.OBSERVE NUCLEUS= ^1H
##.ACQUISITION MODE= SIMULTANEOUS (DQD)
##.ACQUISITION SCHEME= undefined
##.AVERAGES= 16
##.DIGITISER RES= 18
##SPECTROMETER/DATA SYSTEM= dpx250
##.PULSE SEQUENCE= zg30
##.SOLVENT NAME= DMSO
##.SHIFT REFERENCE= (INTERNAL, DMSO, 0, 16.522)
##AUDIT TRAIL= $$ (NUMBER, WHEN, WHO, WHERE, WHAT)
$$ ##TITLE= Audit trail, XWIN-NMR		Version 3.5
$$ ##JCAMPDX= 5.01
$$ ##ORIGIN= Bruker BioSpin GmbH
$$ ##OWNER= nmr
$$ C:\u/data/dgb/nmr/ADRS/770/pdata/1/auditp.txt
$$ ##AUDIT TRAIL=  $$ (NUMBER, WHEN, WHO, WHERE, WHAT)
(   1,<2007-04-10 11:59:02.62 +100>,<MAYBRIDGE\nmr>,<NMR_250MHZ>,
      <created by zg, POWCHK disabled, PULCHK disabled
       configuration hash MD5:
       49 4B E0 1D 92 C2 6B 37 9F E6 65 BC 52 41 86 1D
       data hash MD5: 64K
       B7 48 C9 40 88 3B A9 B9 A9 2E A5 6C F3 08 EB B2>)
(   2,<2007-04-10 11:59:17.15 +100>,<MAYBRIDGE\nmr>,<NMR_250MHZ>,
      <Start of raw data processing
       ef LB = 0.3 FT_mod = 6 PKNL = 1 SI = 32K 
       data hash MD5: 32K
       7E 33 AD E1 FA 93 EB 59 1C 64 C0 D7 FA B5 4E E2>)
(   3,<2007-04-10 11:59:18.79 +100>,<MAYBRIDGE\nmr>,<NMR_250MHZ>,
      <apk 
       data hash MD5: 32K
       E1 78 F8 FB EC 27 4D 83 F6 CE 8A 65 EC 34 23 8A>)
(   4,<2007-04-10 11:59:19.51 +100>,<MAYBRIDGE\nmr>,<NMR_250MHZ>,
      <abs ABSG = 5 
       data hash MD5: 32K
       5A 91 29 CF D3 D2 BA E9 DE BA EA 8D 7A 06 42 62>)
$$ ##END=
$$ 
$$ hash MD5
$$ 5C 7F 80 37 89 73 95 9C B7 42 D2 90 15 1C 3A 81
##$RELAX= 
##$RELAX= 
##$RELAX= 
##$RELAX= 
##$RELAX= 
##$RELAX= 
##$RELAX= 
$$ Bruker specific parameters
$$ --------------------------
##$DU= <C:\u>
##$EXPNO= 770
##$NAME= <ADRS>
##$PROCNO= 1
##$TYPE= <nmr>
##$USER= <dgb>
##$AMP= (0..31)
100 100 100 100 100 100 100 100 100 100 100 100 100 100 100 100 100 100 
100 100 100 100 100 100 100 100 100 100 100 100 100 100 
##$AQSEQ= 0
##$AQ_mod= 3
##$AUNM= <au_zg>
##$AUTOPOS= <22 >
##$BF1= 250.13
##$BF2= 250.13
##$BF3= 250.13
##$BF4= 250.13
##$BF5= 500.13
##$BF6= 500.13
##$BF7= 500.13
##$BF8= 500.13
##$BYTORDA= 1
##$CFDGTYP= 0
##$CFRGTYP= 5
##$CHEMSTR= <none>
##$CNST= (0..31)
1 1 145 1 1 1 1 1 1 1 1 1 1 1 1 1 1 1 1 1 1 1 1 1 1 1 1 1 1 1 1 1 
##$CPDPRG= <>
##$CPDPRG1= <>
##$CPDPRG2= <>
##$CPDPRG3= <>
##$CPDPRG4= <mlev>
##$CPDPRG5= <mlev>
##$CPDPRG6= <mlev>
##$CPDPRG7= <mlev>
##$CPDPRG8= <mlev>
##$CPDPRGB= <>
##$CPDPRGT= <>
##$D= (0..31)
0 1 0 0 0 0 0 0 0 0.06 0 0 0 0 0 0 0.0002 0 0 0 0 0 0 0 0 0 0 0 0 0 0 
0 
##$DATE= 1176202741
##$DBL= (0..7)
120 120 120 120 120 120 120 120 
##$DBP= (0..7)
150 150 150 150 150 150 150 150 
##$DBP07= 0
##$DBPNAM0= <>
##$DBPNAM1= <>
$$ [...]
##$SUBNAM6= <"">
##$SUBNAM7= <"">
##$SUBNAM8= <"">
##$SUBNAM9= <"">
##$SW= 20.6930455092707
##$SWIBOX= (0..15)
0 0 3 0 0 0 0 0 0 0 0 0 0 0 0 0 
##$SW_h= 5175.983436853
##$TD= 65536
##$TD0= 1
##$TE= 683.16
##$TE2= 300
##$TE3= 300
##$TEG= 300
##$TL= (0..7)
0 120 120 120 120 120 120 120 
##$TP= (0..7)
150 150 150 150 150 150 150 150 
##$TP07= 0
##$TPNAME0= <>
##$TPNAME1= <>
##$TPNAME2= <>
##$TPNAME3= <>
##$TPNAME4= <>
##$TPNAME5= <>
##$TPNAME6= <>
##$TPNAME7= <>
##$TPOAL= (0..7)
0.5 0.5 0.5 0.5 0.5 0.5 0.5 0.5 
##$TPOFFS= (0..7)
0 0 0 0 0 0 0 0 
##$TUNHIN= 0
##$TUNHOUT= 0
##$TUNXOUT= 0
##$USERA1= <user>
##$USERA2= <user>
##$USERA3= <user>
##$USERA4= <user>
##$USERA5= <user>
##$V9= 5
##$VALIST= <valist>
##$VCLIST= <CCCCCCCCCCCCCCC>
##$VD= 0
##$VDLIST= <DDDDDDDDDDDDDDD>
##$VPLIST= <PPPPPPPPPPPPPPP>
##$VTLIST= <TTTTTTTTTTTTTTT>
##$WBST= 1024
##$WBSW= 4
##$XGAIN= (0..3)
0 0 0 0 
##$XL= 0
##$YL= 0
##$YMAX_a= 258489
##$YMIN_a= -404933
##$ZGOPTNS= <>
##$ZL1= 120
##$ZL2= 120
##$ZL3= 120
##$ZL4= 120
##$ABSF1= 16.522
##$ABSF2= -4.171173
##$ABSG= 5
##$ABSL= 3
##$ALPHA= 0
##$AQORDER= 0
##$ASSFAC= 0
##$ASSFACI= 0
##$ASSFACX= 0
##$ASSWID= 0
##$AUNMP= <proc_1d>
##$AZFE= 0.1
##$AZFW= 0.1
##$BCFW= 0
##$BC_mod= 0
##$BYTORDP= 0
##$COROFFS= 0
##$CY= 12.5
##$DATMOD= 1
##$DC= 0
##$DFILT= <>
##$DTYPP= 0
##$F1P= 14.0000005364418
##$F2P= -0.99999901652339
##$FCOR= 0.5
##$FTSIZE= 32768
##$FT_mod= 6
##$GAMMA= 0
##$GB= 0
##$INTBC= 1
##$INTSCL= 1
##$ISEN= 128
##$LB= 0.3
##$LEV0= 0
##$LPBIN= 0
##$MAXI= 10000
##$MC2= 0
##$MEAN= 0
##$ME_mod= 0
##$MI= 0
##$NCOEF= 0
##$NC_proc= -4
##$NLEV= 6
##$NOISF1= 0
##$NOISF2= 0
##$NSP= 0
##$NTH_PI= 0
##$NZP= 0
##$OFFSET= 16.522
##$PC= 1
##$PHC0= 218.596
##$PHC1= 7.111371
##$PH_mod= 1
##$PKNL= yes
##$PPARMOD= 0
##$PSCAL= 4
##$PSIGN= 0
##$REVERSE= no
##$SF= 250.13
##$SI= 32768
##$SIGF1= 0
##$SIGF2= 0
##$SINO= 400
##$SIOLD= 32768
##$SREGLST= <1H.DMSO>
##$SSB= 0
##$STSI= 32768
##$STSR= 0
##$SW_p= 5175.98343685301
##$SYMM= 0
##$S_DEV= 0
##$TDeff= 65536
##$TDoff= 0
##$TI= <Analysis number 999999
Compound Code 99
Book Reference 9
Project Code 9>
##$TILT= no
##$TM1= 0
##$TM2= 0
##$TOPLEV= 0
##$USERP1= <user>
##$USERP2= <user>
##$USERP3= <user>
##$USERP4= <user>
##$USERP5= <user>
##$WDW= 1
##$XDIM= 32768
##$YMAX_p= 497601693
##$YMIN_p= -326437
$$ End of Bruker specific parameters
$$ ---------------------------------
##NTUPLES= NMR SPECTRUM
##VAR_NAME=  FREQUENCY,     SPECTRUM/REAL,   SPECTRUM/IMAG
##SYMBOL=    X,             R,               I
##VAR_TYPE=  INDEPENDENT,   DEPENDENT,       DEPENDENT
##VAR_FORM=  AFFN,          ASDF,            ASDF
##VAR_DIM=   32768,         32768,           32768
##UNITS=     HZ,            ARBITRARY UNITS, ARBITRARY UNITS
##FACTOR=    0.157963299565203, 1,           1
##FIRST=     4132.6476996994, 0,             0
##LAST=      -1043.33573715361, 0,           0
##MIN=       -1043.33573715361, -326437,     0
##MAX=       4132.6476996994, 497601693,     0
$$ Real data points
##PAGE= N=1
##DATA TABLE= (X++(R..R)), XYDATA
$$ [...]
24032 153813 38307 55604 83776 91916 111118 45739 -6233 -13914 -11211 -3541 7469 38762
24020 38762 55440 54605 38456 84308 91710 11433 -63772 -80677 -81644 -57660 -39398 942 31645
24007 31645 2504 38474 64844 89723 73617 49493 36177 55910 52693 79448 78215 147792
23995 147792 136838 109061 91611 41320 48565 15317 38567 45818 83299 76809 -1479 -48252
23983 -48252 17815 77968 105166 35848 14550 19877 35463 25342 43862 9933 -46990 -77165
23971 -77165 -88089 -76010 2585 18431 -2368 -30648 -33592 -37729 -70398 -33390 -83632 -122920
23959 -122920 -81802 -79561 -20133 33201 30757 -6978 -42799 -76120 -5776 56233 52137 60568
23947 60568 61720 75629 6556 -39784 -42840 -3803 37458 53163 60021 22218 -29424 -3203
23935 -3203 83409 44733 -39421 -16782 -29580 -34386 15766 82784 94967 74121 29164 15692
23923 15692 25785 -15552 -59903 -53176 -103734 -131889 -148320 -134686 -155391 -106009 -3357 24112
23911 24112 -250 -4437 14694 13703 879 51722 32731 17965 -9023 -50583 -19267 1604
23899 1604 29420 57831 36858 -60361 -31609 -5920 22885 43290 65999 59717 41096 -393
23887 -393 595 11726 19087 38854 51941 396 -47874 -70466 -72882 -68198 -32582 -48816 -84159
23874 -84159 -38883 -43743 -92763 -70642 -7319 50386 59613 21471 -10921 31752 15618 26633
23862 26633 61313 65960 132211 104691 66116 10088 32502 34544 27380 -38446 -71770 -16959
23850 -16959 -13313 -27643 -42306 -45388 -18178 29876 54358 75691 36941 20637 41549 100885
23838 100885 148858 129939 106213 57466 -15249 -59250 -53973 -53649 -37443 44800 24319 -3073
23826 -3073 -4922 66619 56701 26076 -26983 1307 81389 103787 62927 73968 49981 39339
23814 39339 18377 -5225 -25096 37728 30538 49430 61124 60877 23524 23967 19568 -20424 -48470
23801 -48470 -73017 -59415 -6204 -4743 -11345 13814 41214 10333 25614 28973 67453 65392
23789 65392 -1463 -19256 -32882 -26646 25043 14003 16144 8648 -17600 -23869 -37043 -31597 -4187
23776 -4187 35259 66501 57848 26138 25460 -18425 -38675 17386 105220 77449 -25642 -64488
23764 -64488 -29598 -9608 -25611 -47552 -1770 28769 55469 91432 103461 76582 69921 85763
23752 85763 17720 -41509 -33381 -21677 -5438 13052 26443 -12031 30675 21781 7610 -25035
23740 -25035 -39860 -113424 -73853 4152 20753 27302 23603 -34769 -61242 -50985 -71979 -50412
23728 -50412 -8927 -53180 -68406 -23672 18965 15858 -167 32727 5804 50093 80249 9850
23716 9850 26369 14823 8049 -14625 24862 -5723 39617 85974 96295 53521 29046 22971
23704 22971 -21710 -46425 -78999 -90604 -80150 -54831 -31474 -52292 -59813 -24886 -24000 -56398
23692 -56398 -26152 21510 48601 46541 46714 27090 -2995 21625 133524 206240 149244 152875
23680 152875 146043 120785 85215 22812 41354 52965 51532 -3241 19930 -1798 -31267 -1919
23668 -1919 54830 43519 9422 -64991 -93870 -59663 -61365 -26995 -28141 -26152 -27269 -19170 -754
23655 -754 -46793 -6603 -45600 -18179 16008 59436 63650 21806 8563 44005 69794 97670
23643 97670 85376 7678 -40990 -22174 -2939 81565 112957 67031 41996 25688 31250 80432
23631 80432 65647 3473 6609 67976 97072 -5422 6986 -3254 -3733 -54379 18325 43657
23619 43657 79066 53721 35155 32054 62019 8877 -2965 16780 -23551 -11721 18572 -28034
23607 -28034 -30273 23799 28030 -18612 -33293 -41975 -23337 40047 29536 -9646 -48580 -17628
23595 -17628 3308 70371 92249 71641 39033 38858 24730 64968 75074 10221 -15696 876
23583 876 -21419 -15754 -6492 51543 63471 16525 21160 78499 87105 86861 64812 63209 37401
23570 37401 27153 49665 29667 39483 91246 152966 111293 107691 81206 83760 106007 105412 85808
23557 85808 92538 131759 148960 114165 72108 71161 96450 50761 -16178 -18749 41195 49090 35333
23544 35333 30450 44594 127051 121940 73166 -22656 -74181 -29990 30690 69618 112353 90208
23532 90208 69009 55781 16295 -14305 29066 64781 32248 4873 6459 10071 -49034 -40649
23520 -40649 -7177 -13861 -24115 528 43160 66398 54115 81435 87421 79396 79102 54447 16301
23507 16301 65867 83459 -8614 -97804 -38146 -6686 35400 59592 80388 32305 -50591 -44886
23495 -44886 -24359 -55902 -73264 -107608 -84888 9433 43668 34560 19638 55393 92003 69539
23483 69539 50601 44825 36137 -4859 10832 28965 54053 74371 66968 54646 62640 53161 16247
23470 16247 24287 35555 27966 35477 66564 50344 6242 -28717 -9458 -40006 2858 5446
23458 5446 -46732 -27032 23424 108249 112033 82899 448 1436 -4437 6202 18613 71022 14203
23445 14203 -5644 -38237 -37432 -7982 20243 4506 25502 17694 -1513 -12758 17622 39239
23433 39239 70894 53376 16452 32921 75776 72486 6369 18401 -17407 9175 46772 40811
23421 40811 36207 22263 -43509 -61809 -67730 -48121 -13323 11556 32183 20886 38641 71129
23409 71129 60836 14615 32003 54775 33247 103662 98559 46920 110594 95109 65659 37855
23397 37855 30636 75228 91577 33485 -16973 -31359 6243 37357 29098 67970 92676 72294
23385 72294 23876 -18031 -2540 7387 -18630 -25337 3151 -6809 12562 21676 70046 54213
23373 54213 11276 15732 -50870 -34224 32317 90863 122510 63647 27148 -15786 -15710 54968
23361 54968 70035 43785 25716 35641 37434 48690 83711 138362 121727 74794 125760 139332
23349 139332 100076 51815 18409 16750 43504 71728 89316 151005 180012 112639 120639 113255
23337 113255 79973 83476 124116 150094 123916 175661 144725 53182 51199 92166 101368 79103
23325 79103 94426 46116 56427 115096 138196 131463 162789 121393 94220 84603 104394 156986
23313 156986 160865 127350 35729 -5564 -802 22692 73988 131407 194573 202143 165606 167390
23301 167390 144134 33297 29550 100090 108540 111199 158414 128408 23980 1364 46348 40042
23289 40042 64199 137219 178907 153690 161990 112182 82743 31393 95920 158497 155080 137969
23277 137969 70794 76365 178270 166941 113606 116673 98033 89440 89005 57070 46427 69146
23265 69146 94618 97039 94281 113211 64891 35660 60226 106619 98127 84925 68074 111136
23253 111136 73357 75140 58579 69495 106171 128144 123751 172820 183767 179666 188069 176480
23241 176480 182933 162235 115558 41637 5050 8646 36152 100867 125949 119134 162953 155713
23229 155713 173561 194361 203604 167292 99153 69543 87992 59265 85306 107475 115583 127360
23217 127360 142753 217973 260218 228297 136566 69744 45903 79579 104156 126750 127431 89743
23205 89743 80478 73455 10037 -32649 19072 54645 57875 131853 187720 187609 115053 151411 143552
23192 143552 125361 101302 50365 46579 91509 105532 143210 121461 90888 127958 160456 152612
23180 152612 145305 92209 79092 100226 92296 106691 132835 145340 130712 91967 54979 47312
23168 47312 61965 35259 57254 126241 69431 44734 35726 78257 121906 136047 143245 115423
23156 115423 97744 102032 66548 61389 98293 100305 90223 76543 95531 149659 200035 195518
23144 195518 153266 52409 16016 31560 80175 133520 134629 126757 112870 112323 143320 152621
23132 152621 131535 111713 157959 197707 171467 164523 138010 156132 210296 194380 146964 100240
23120 100240 64847 66068 127004 127519 145695 167803 121808 82475 51508 44318 107572 87100
23108 87100 40551 25656 56356 80820 107967 147604 170265 149992 141655 150031 156677 188849
23096 188849 199371 217711 210484 179900 109798 56622 21755 58028 82702 116710 87345 43117
23084 43117 88649 88895 99587 88175 99744 187174 248680 224732 171521 85401 119024 110708
23072 110708 112699 148047 118778 113737 96571 74143 93109 153829 243926 317691 370944 326679
23060 326679 199671 172848 147862 129963 171919 101238 72216 104060 105178 111157 131481 124011
23048 124011 145466 146152 175186 143815 85339 95867 86125 148042 156282 131275 116612 88251
23036 88251 86007 126241 189266 220312 248338 238183 175157 211825 217484 190639 166030 153088
23024 153088 159977 159965 151367 142046 215881 280281 232087 195163 161242 151499 175017 159191 130703
23011 130703 130438 134166 137676 195281 215902 224401 218108 188734 183687 161897 151354 193674 238602
22998 238602 274491 289658 239234 236026 241002 267214 218600 226413 264436 225117 170468 160853
22986 160853 148729 159851 178657 210720 229463 208625 163798 169399 181976 194587 212918 173182
22974 173182 180693 157816 212414 222150 186250 271833 303079 243060 185116 171134 221076 200178
22962 200178 209060 222520 210607 209714 185680 155845 171720 197783 278966 279932 233184 279652
22950 279652 303724 338408 362009 320646 246294 259874 275350 236145 160986 167850 193044 252240
22938 252240 251327 209103 157265 137253 154209 180929 165621 191685 258676 275697 237039 176680
22926 176680 221275 234431 233731 201589 220264 221179 188784 190625 255616 333958 316264 295916
22914 295916 295847 264587 287287 354312 344124 258415 255212 272480 281037 281483 295263 328180 346837
22901 346837 327141 307172 315271 328467 308556 261598 237595 278813 307642 347431 372998 393200
22889 393200 362394 376581 439002 498332 412769 355087 332242 338825 382777 377616 368267 335888
22877 335888 307072 324693 304052 308405 325271 356130 428380 452953 418050 379253 385912 399473
22865 399473 412115 395781 375443 348886 322516 326058 257624 290445 346179 385152 419387 426264
22853 426264 438436 413385 401210 405148 416576 404506 361091 395267 452223 487317 492809 483418
22841 483418 519912 475526 405314 388408 380529 429881 491351 491454 512849 533982 472627 449891
22829 449891 477856 464367 460312 518873 497894 480753 448007 484644 525824 613570 688198 721969
22817 721969 710348 718134 763044 754654 760547 780787 822879 780936 671161 647465 685323 706595
22805 706595 713147 704217 718784 787547 837379 810688 801389 751183 694187 656483 630215 592176
22793 592176 614491 693898 700577 667021 658408 630837 592660 588765 584039 596298 617562 610290
22781 610290 605265 589431 558970 581674 562356 617480 616024 589323 567403 612997 691870 720225
22769 720225 711963 734004 724426 685524 712715 781188 791857 722174 650309 672494 734661 743669
22757 743669 656204 675988 744047 793215 868061 880976 827948 784893 752130 719859 681142
22746 681142 746449 821958 771134 779363 805757 840226 857501 787612 802308 837437 865181 930892
22734 930892 918361 908946 904089 874397 872503 880781 954514 929922 886613 903699 966557 1000922
22722 1000922 993717 964449 940223 955071 977137 1035968 1072087 1088236 1081821 1105905 1077399 1037808
22710 1037808 1029845 1104696 1141780 1170072 1181897 1189581 1210811 1202656 1278204 1312261 1393117 1398873
22698 1398873 1321617 1323451 1337159 1303518 1327007 1355312 1317307 1292244 1334365 1361106 1407055
22687 1407055 1431683 1466921 1483131 1522512 1458899 1480855 1583522 1590968 1602834 1560646 1607487
22676 1607487 1657750 1691612 1742889 1690424 1697617 1769652 1757987 1710400 1697433 1744354 1809947
22665 1809947 1796288 1815635 1856048 1851894 1927018 1965142 1964321 2005480 2030510 2008679 2021621 2126693
22653 2126693 2131822 2128607 2192086 2289364 2304943 2273286 2264011 2228811 2291368 2394502 2471743 2522163
22641 2522163 2597150 2584355 2590752 2667875 2687583 2714644 2733485 2793215 2876444 2895747 2899811 2954455
22629 2954455 3029830 3122227 3210665 3228174 3267115 3342542 3372505 3428894 3424443 3404442 3404415 3520937
22617 3520937 3659317 3755625 3804060 3857228 3894188 3896509 3989447 4149814 4199529 4239618 4341601
22606 4341601 4425908 4510692 4567853 4608206 4687790 4766028 4868097 4953295 5091498 5209327 5291258
22595 5291258 5413384 5531380 5631241 5717043 5814558 5940394 6044104 6166496 6343510 6510060
22585 6510060 6660088 6744152 6878951 7071487 7253226 7408689 7555396 7699290 7861842 8047006
22575 8047006 8213896 8486399 8736222 8883472 9043379 9241449 9449237 9662337 9871254
22566 9871254 10051819 10288594 10555527 10841739 11072216 11335470 11610812 11932867 12206895
22557 12206895 12419326 12703487 13020353 13335274 13614334 13948945 14269731 14502506 14769640
22548 14769640 15113648 15420073 15718957 16018594 16303942 16644498 16979178 17302181 17590490
22539 17590490 17923659 18198448 18444943 18732652 19049792 19293656 19560690 19829509 20068461
22530 20068461 20359080 20515518 20658637 20788145 20903808 21052033 21187430 21251691 21360748
22521 21360748 21472624 21499016 21490717 21510312 21499096 21432867 21340944 21227386 21167753 21000641 20864242
22510 20864242 20745651 20620636 20437391 20138773 19825309 19570866 19390849 19202537 18923758
22501 18923758 18616937 18326696 18049732 17716270 17370756 17061778 16776281 16475558 16178043
22492 16178043 15843928 15543549 15263751 14909340 14580093 14296892 13993224 13697628 13390155
22483 13390155 13069798 12794007 12529068 12255339 11974012 11631156 11380585 11153180 10960493
22474 10960493 10702152 10480419 10207172 9879579 9565747 9325177 9139023 8978580 8790405
22465 8790405 8556580 8287846 8125655 7995221 7813906 7605376 7425515 7297438 7196287
22456 7196287 7044153 6839762 6698214 6583883 6448059 6294787 6118600 5990787 5903832 5771673
22446 5771673 5650786 5535712 5459505 5327500 5207929 5082712 5042357 4957630 4846149 4705318
22436 4705318 4580333 4489012 4416362 4389409 4307200 4229312 4138771 4040701 3925443 3800398 3715963
22425 3715963 3664009 3623426 3591548 3573570 3511699 3402176 3360595 3335435 3286412 3206299 3179389
22414 3179389 3121117 3008040 2950648 2938569 2887084 2835532 2867998 2862172 2755195 2680590 2617035
22403 2617035 2604897 2584701 2593712 2547663 2441845 2361551 2326907 2317105 2300984 2333832 2346562
22392 2346562 2334032 2255808 2167213 2130054 2084828 2029469 1993232 1939941 1919688 1972407 1957823
22381 1957823 1980740 1999987 2004284 1903930 1814551 1748812 1786021 1764719 1714483 1669082 1676640
22370 1676640 1696140 1692910 1663941 1670340 1678086 1613828 1526027 1456312 1461946 1499491 1497482 1432347
22358 1432347 1383024 1323886 1306942 1283844 1200418 1260529 1287062 1238504 1225531 1265100 1291677
22347 1291677 1286056 1219297 1227031 1236587 1195897 1207010 1225189 1233464 1215738 1187133 1127214 1087271
22335 1087271 1060875 1082796 1092955 1160665 1195925 1163853 1124674 1139588 1107520 1073839 1090303
22324 1090303 1078338 1068623 1034382 992121 990445 955312 915734 840437 853306 852884 844703 883208
22312 883208 884119 843285 888585 856688 829936 831956 827434 849991 891073 902794 893207 881385
22300 881385 882933 835359 749755 692537 705555 683911 685448 700531 682131 675722 680377 735714
22288 735714 798685 730461 643646 600277 583287 555965 613599 723267 820065 825466 785380
22277 785380 730465 616713 574201 546553 556440 599350 571715 563100 557184 584801 658472 648623
22265 648623 581760 613024 567721 509450 507695 525935 447751 448500 525573 539713 525429 554400
22253 554400 590434 565131 530477 527056 496275 504519 485047 464193 513629 499877 526586 588302
22241 588302 583413 582238 585070 635225 743657 748823 698006 675338 652386 608495 575874 566857
22229 566857 551519 604784 647367 672792 715906 724663 710063 673276 650881 638386 630218 583738
22217 583738 573482 557339 520619 508618 474692 503173 524457 568289 559060 575982 571927 537545
22205 537545 518921 501675 494705 453169 423941 432204 427166 380830 336089 346900 365099 378732
22193 378732 364774 386401 340796 314412 347034 335583 361917 384508 320498 340545 401906
22182 401906 495722 484279 466508 464260 403928 383631 406957 390646 397481 443154 423729 400080
22170 400080 432664 413514 384932 337115 298388 329906 462812 499461 453633 441653 464453
22159 464453 499436 480163 432994 395605 381293 319290 389584 395746 421642 393623 353816 374254
22147 374254 411536 352088 318851 297979 279112 331198 340981 366846 364010 341994 330514 352261
22135 352261 387119 407851 352560 290544 313901 306073 307737 398016 411242 394948 425537 423519
22123 423519 382114 381702 324970 285552 313040 270104 231672 250882 245893 252553 294879 334108
22111 334108 264996 186258 243944 277136 253139 260872 266614 291439 276521 268968 268366 304745
22099 304745 261530 193770 174963 114493 119065 223062 303593 319569 308047 266461 244875
22088 244875 247014 215720 224092 295947 322850 371095 356362 294836 257738 269202 294935 317974
22076 317974 301097 304705 243781 235272 202026 173346 187881 207767 173412 162444 161090 230535
22064 230535 256765 240589 257726 265424 258469 255289 257703 250298 249496 304813 258981 204893 253319
22051 253319 261336 233558 237459 227472 280837 239501 197638 233490 282995 302387 294929 274015
22039 274015 276477 220805 143832 106086 148002 157001 196518 253073 239900 251768 222466 237760
22027 237760 233684 260614 259944 227211 297580 342879 313627 242118 193513 207170 248118 233147
22015 233147 230961 270750 260776 231279 232348 211638 164326 160360 175700 248636 286517 245144
22003 245144 273922 306896 356639 346322 317501 255229 273151 248614 241258 260479 255551 272892
21991 272892 274161 261662 288794 309242 338625 277645 208573 227413 242280 249005 261942 318504
21979 318504 361756 373982 378785 360335 339000 337359 320799 276504 277724 324427 337855 362824
21967 362824 338345 295416 247970 283817 278412 197688 207616 237617 289305 269525 224282 216130
21955 216130 247140 278356 244511 245155 244820 275481 255830 262582 270221 307871 300707 283609 308330
21942 308330 300689 278854 314107 297426 255075 264349 269000 287043 288348 300372 285842 307846
21930 307846 360272 324799 319928 269942 294048 303068 297189 354809 395672 424101 401910 431017
21918 431017 380302 369805 335574 263818 266792 347740 349585 310496 277195 275849 290898 317265
21906 317265 347106 338934 310846 261605 272406 292249 306905 347168 316318 331283 364021 413590
21894 413590 378081 311135 309448 405513 323458 236121 297922 294023 283798 325814 376777 380431
21882 380431 364822 378104 411488 397085 400584 333636 317469 332303 387526 374698 395024 405316
21870 405316 387663 449708 429017 416748 456742 476803 498214 463332 400820 340271 330074
21859 330074 333066 365675 437420 433581 394624 386288 456944 511498 470553 426797 467449 547325
21847 547325 547998 490752 474441 474429 490752 431853 413587 441877 406372 442553 472416 444604
21835 444604 433404 458341 488405 486261 442414 470795 509643 511491 514180 535676 561194 555117
21823 555117 611760 521284 453155 486381 500355 490228 477989 487843 509311 517652 457805 468546
21811 468546 529432 508876 460983 447028 485117 536802 551721 630623 685128 679277 668859 669821
21799 669821 707481 794601 781488 762176 731990 721897 717258 739189 759809 787533 769264 773229
21787 773229 750812 712114 751544 750545 744311 766382 772961 748580 765407 746640 738009 736848 685752
21774 685752 689478 703038 671082 648848 625957 670396 668856 680846 677911 644154 657156 646851
21762 646851 667571 694785 720158 720507 750490 729943 670742 641618 687350 742678 752258 707985
21750 707985 758320 858348 842364 756553 699493 692399 720723 790265 815491 840014 885774
21739 885774 813380 742966 765464 865360 956301 976791 967020 902094 876453 880570 919561 954003
21727 954003 922674 921202 926812 867856 894550 870857 886742 883910 895559 962001 953006 885999
21715 885999 868264 921286 921736 890830 928213 925206 943024 968786 993338 1035900 1039346 1018612
21703 1018612 1017439 1002595 1028889 1095885 1130658 1125074 1161620 1206918 1195288 1190509 1171745 1221530
21691 1221530 1244610 1240695 1231321 1233592 1177019 1199644 1256043 1319221 1334061 1282979 1295940 1299373
21679 1299373 1313682 1319181 1307229 1282888 1293779 1327479 1400718 1453931 1463072 1424304 1412494 1400422
21667 1400422 1407437 1491070 1576713 1587939 1626983 1638204 1656853 1695225 1741936 1738112 1720249 1679707
21655 1679707 1661933 1647967 1678568 1751921 1823552 1796238 1792518 1837648 1868764 1834990 1855980
21644 1855980 1940636 1980567 2043498 2098194 2071259 2103240 2150318 2200913 2223541 2253812 2273835
21633 2273835 2276171 2329090 2320109 2320802 2357544 2364472 2463522 2504931 2491663 2577558 2638406 2646348
21621 2646348 2714276 2759892 2774208 2778976 2810767 2875318 2958553 3008900 3032053 3131710 3197581
21610 3197581 3240986 3331097 3361372 3356371 3400724 3486407 3563947 3624710 3676922 3679451 3760034 3896649
21598 3896649 3977104 3973502 3976229 4006869 4131951 4275032 4407489 4518786 4615146 4715645 4803345
21587 4803345 4851633 4934834 5020012 5103630 5218142 5342913 5486372 5593684 5653883 5776359
21577 5776359 5921292 6055719 6177286 6274746 6410984 6594363 6745712 6904128 7016417 7105660
21567 7105660 7199400 7435450 7675736 7818379 7966100 8136956 8327369 8553137 8749866 8939517
21557 8939517 9178053 9470997 9711551 9927795 10084324 10329651 10538092 10769632 11060301
21548 11060301 11338855 11615720 11905644 12146256 12462118 12796227 13075847 13385701 13674516
21539 13674516 13975835 14323703 14619309 14895155 15298572 15668321 16024809 16421088 16782062
21530 16782062 17032379 17300435 17653791 17997856 18321219 18732220 19059454 19291043 19575365
21521 19575365 19817760 20063968 20313435 20593152 20887607 21122445 21394372 21589116 21716143
21512 21716143 21840045 21973643 22100642 22123944 22119139 22165909 22194317 22221687 22230260 22213828 22116778
21501 22116778 21974796 21829426 21636149 21453040 21294726 21129743 20962819 20685499 20419584
21492 20419584 20219360 19945677 19693903 19420827 19130333 18818368 18437379 18115766 17846932
21483 17846932 17444579 17060846 16716090 16367065 16008755 15679464 15389797 15079757 14774113
21474 14774113 14458575 14144717 13868453 13550731 13198528 12891524 12576444 12246640 11910904
21465 11910904 11656528 11366604 11087446 10842492 10596053 10285742 9990197 9827441 9686501
21456 9686501 9494924 9291472 9031354 8802866 8572253 8248412 7964489 7810204 7608820
21447 7608820 7410867 7246025 7095616 7031742 6939582 6775572 6590534 6388777 6240989 6086515
21437 6086515 5997627 5901166 5776950 5591542 5461499 5407225 5301259 5203867 5033079 4865464
21427 4865464 4810496 4766508 4735794 4584388 4478924 4328608 4211436 4159081 4067468 3992897
21417 3992897 3951563 3897193 3799133 3762127 3724997 3692016 3642199 3543421 3459749 3416782 3310770
21406 3310770 3262582 3256712 3221281 3103891 3016996 2953364 2880056 2801520 2764648 2701739 2618519
21395 2618519 2609411 2646782 2643202 2575113 2535777 2523883 2427722 2400461 2379649 2361015 2335894 2313599
21383 2313599 2273435 2247090 2224074 2176508 2155512 2122438 2067154 2029547 2007342 1997308 1973972
21372 1973972 1948173 1941893 1905693 1865773 1837421 1853821 1841809 1813652 1718247 1641498 1661773
21361 1661773 1665562 1672902 1639430 1619411 1558804 1510324 1539536 1547757 1515054 1500342 1445465 1408188
21349 1408188 1369544 1321854 1318739 1310950 1258642 1239891 1264356 1302919 1320795 1341324 1329295 1327368
21337 1327368 1261137 1226509 1229119 1193995 1086510 1007704 1016661 1048763 1054459 1044271 971529 910001
21325 910001 904244 888599 868453 902410 979496 1007334 940630 868772 916508 934263 919942 938139
21313 938139 895717 879764 892164 855425 828306 851439 881178 831834 814049 797482 728224
21302 728224 707231 782744 765857 729258 795192 819838 813260 799909 785946 825148 841490 823132
21290 823132 759309 771554 777606 728050 706109 689224 659133 665272 676599 660189 634450 649501
21278 649501 683076 659407 632683 612152 649225 636450 606206 604315 602922 612096 588122 543821
21266 543821 570202 595912 608444 597100 559966 497575 495348 533164 520333 608248 623242 640816
21254 640816 638114 536400 498954 498848 489111 462151 519208 575395 524495 494290 454250 446993
21242 446993 471232 462594 465327 452581 484844 496085 503593 508950 447673 489703 567036 646702
21230 646702 714028 727898 756484 762989 724987 704345 654370 600397 601976 622164 572922 564390
21218 564390 590846 585336 542821 548325 566093 602843 656326 624685 554369 477030 461387 449539
21206 449539 412425 426758 421760 446671 440905 426398 466317 506339 447550 413830 362262 380691
21194 380691 439038 369055 348688 362353 388106 353489 341422 305048 338921 321887 302128
21183 302128 327973 332403 289783 271611 343464 375537 387111 334859 315334 309871 295301 297466
21171 297466 266031 294903 262991 258722 296218 341881 369349 403374 376950 383218 358594 292670
21159 292670 247144 250865 252350 260982 254356 286678 273404 226372 245566 279928 297415 301626
21147 301626 318111 291774 237331 204311 218188 193021 151641 180131 218379 296861 331194
21136 331194 281238 301279 192377 163898 224342 236163 204598 187137 170276 176780 206789
21125 206789 234746 227479 207344 196062 145738 132158 138043 151658 184391 189463 173273 212821
21113 212821 237461 144505 89638 98711 137258 154854 210325 224627 201744 191404 192641 224862
21101 224862 210732 215983 198303 172232 166585 162175 192805 235193 277852 276959 275403 217351 176008
21088 176008 241120 188793 146557 166065 228349 270476 292650 240085 187800 113263 161987
21077 161987 241005 203825 200872 143758 74672 34678 69863 99374 86376 50148 50931 101078
21065 101078 89310 63214 99131 171348 187607 202466 169589 141383 112202 144073 193782
21054 193782 194735 150660 99211 21328 67840 142031 145746 135402 131609 99000 88553 92859
21042 92859 67858 46677 88816 130104 132340 148079 147034 131177 130558 116402 143612 120202
21030 120202 150788 183743 140415 145302 170226 185617 173192 137026 149974 149212 150678 193211
21018 193211 200589 166403 92798 73294 88536 94784 130486 127727 82673 87557 155267 151735
21006 151735 102839 119408 169060 185280 151773 127849 115804 89488 78604 73931 114100 157004
20994 157004 115134 81752 86930 140161 198935 187381 157291 108598 92170 92215 46960 60478
20982 60478 83984 111331 95226 70327 91283 92506 151761 215871 129888 86650 52424 39489
20970 39489 131947 132657 92310 50591 93214 150656 183198 181959 134434 162194 129559 58161
20958 58161 52590 105981 99905 108354 91567 77735 102391 42837 1764 35707 88686 96598
20946 96598 66438 101685 116491 99919 59682 76198 84024 124619 155550 132997 96069 53563
20934 53563 1342 28453 113517 85487 40540 17024 48111 129511 145357 79625 14431 26099
20922 26099 48322 89937 98091 95269 131800 140793 175577 122305 98775 60741 78530 22154
20910 22154 37212 36744 72210 157967 135132 93298 51176 56478 34656 12981 44425 45751
20898 45751 -6672 -11010 -17070 1805 4094 -16032 -2180 52410 22473 28093 22148 89807 168282
20885 168282 94287 6048 -7206 37035 82705 135119 124836 140021 135171 98054 120342 106579
20873 106579 101965 115735 119085 76474 63047 45386 104216 124228 52419 -4995 -28004 22262
20861 22262 52134 -7567 103791 156034 127298 95805 97604 86785 76119 93294 86456 55860
20849 55860 120064 176390 152036 85054 52548 70882 86648 1246 -58351 -68629 6349 21560
20837 21560 -7133 -5562 9112 57026 65772 82321 133255 90231 88247 134339 176047 136069
20825 136069 105847 62813 -5101 -2249 48890 33340 -39114 -29088 20205 38806 42380 18345
20813 18345 43042 97719 175442 181253 122857 64813 49196 59887 62576 52247 31702 61512
20801 61512 8837 -3161 -36859 -41545 -12979 32340 124596 110987 98918 86923 5250 -21817
20789 -21817 -20322 -69898 -49536 -7702 65962 79754 52010 40477 73960 31365 38697 67046
20777 67046 32699 -18404 3676 7804 21966 92863 113626 78371 57624 34942 21813 50905
20765 50905 56766 57116 77621 37728 47854 30780 22991 12465 11465 -2599 -35968 -88545 -106533
20752 -106533 -110038 -92280 -48902 -47836 -15607 60092 62455 70350 72667 7061 -3397 11050
20740 11050 12099 35633 18979 56025 90340 50350 -3538 -21068 -26790 -23447 -2180 -9117
20728 -9117 -15417 -14337 -31351 -40545 4240 16983 29139 64761 91682 76276 71012 97995 50968
20715 50968 4060 23212 54308 79836 106223 65632 6962 -11766 17633 -24052 -11835 -58148
20703 -58148 -75176 -92569 -71387 -29063 -32027 -35561 -35531 8082 19113 -60141 -109016 -93589 -56638
20690 -56638 12306 -18206 -30001 26756 12243 9378 -25951 -88735 -106381 514 31593 -33406
20678 -33406 -91205 -132103 -143243 -76591 4761 -9392 -50457 -58122 -68870 -47360 -20701 -30856
20666 -30856 26033 69464 59310 -12150 -61458 -22288 30908 -16898 -85520 -57922 -12717 -5038
20654 -5038 22784 64393 50419 -30751 -90320 -85469 -50596 -21089 34416 1102 5672 5672 14355
20641 14355 59926 102170 17790 -3261 18132 16922 51344 28343 1320 24806 102991 126957
20629 126957 87360 19912 24414 41893 58590 21430 -28894 -29679 -19351 1318 37027 -23840
20617 -23840 -60633 -48776 -115071 -104991 -10725 -4376 -9764 -17935 -6465 405 16111 22443 2771
20604 2771 -38773 -17526 55097 105811 104182 92063 93064 8471 -21182 -369 49360 77974
20592 77974 41159 19981 25434 26120 17983 -9650 -82389 -100496 -44103 -4586 28581 57676
20580 57676 67506 41892 10882 12713 -21595 -114426 -116835 -48158 -10098 -43797 -48336 -21234
20568 -21234 -26542 34748 3662 -70734 -148881 -117281 -49341 16066 -18126 -22136 -25175 -7632
20556 -7632 33330 59650 74985 52331 26183 -9527 26650 68784 95145 126994 124758 31805
20544 31805 9889 27717 44738 116051 99458 73603 26945 74606 86627 63637 51765 83979
20532 83979 146839 99675 33269 -16356 -34622 -51676 -73725 -101543 -74901 -38146 -27496 -70866
20520 -70866 -86584 -44601 15000 48884 56418 96790 52442 47641 45276 5631 44610 23697
20508 23697 -24829 -16898 62859 88210 70190 21796 1220 46243 40989 35915 63428 109199
20496 109199 139879 113303 59512 37163 11605 -27856 -104003 -131573 -105037 -77088 -76037 -65519
20484 -65519 -55905 -56488 -48560 -24271 -49388 -10378 42073 67407 68791 15748 -14914 -26089 6431
20471 6431 1474 -20603 -39958 9525 42841 16271 37331 1740 -13807 -12891 -72707 -109213
20459 -109213 -103324 -94306 -25256 -1399 -25623 -20492 -49865 -29350 20827 3133 15651 34990
20447 34990 21691 -9980 -40506 -23096 11381 7647 3512 44548 13976 -65011 -68781 -20512
20435 -20512 52283 70680 29172 44575 50936 87517 98542 63218 257 -17947 -34225 -31595
20423 -31595 -9953 -42609 -88398 -106783 -173883 -160702 -73225 2101 38176 57783 65159 42476
20411 42476 -629 14263 69752 43747 35980 53574 42969 50019 64924 72192 -20221 -55540
20399 -55540 -41624 -26319 -50161 -25540 24515 -16513 -33571 -43642 -84857 -124798 -42763 -38320
20387 -38320 -19339 -30698 -30553 -32651 -34954 -46657 -89746 -161443 -179768 -141527 -29555 17300
20375 17300 14288 -5588 -28061 -3833 -54077 -76121 -61281 -47946 -8866 -17960 -5321 15770
20363 15770 10474 6812 -56062 -42594 -6233 -11347 -12037 5692 16448 28753 57076 31362 -7436
20350 -7436 19302 38511 954 -49742 13225 33991 -6741 7551 42491 46041 36100 35428 54637
20337 54637 -3136 19426 -26114 14896 49704 1471 -40963 15476 43344 81949 -26243
20326 -26243 -66805 -50441 -30159 7851 28172 -18745 -60197 -58667 6007 1271 10365 12902
20314 12902 -3100 -27672 -24827 -10918 31242 10045 -53436 -51859 7685 891 33407 61253
20302 61253 53284 19398 -38067 -9124 -3772 -12311 15760 -12138 -35930 -85106 -40217 50284
20290 50284 5647 24946 -30509 -44288 -8286 47714 72268 70999 61338 61474 119932 171642
20278 171642 146707 112250 93835 99363 56776 10168 4179 -56173 -62805 -53361 -44920 -3531
20266 -3531 -11376 -20517 4531 21080 12125 58715 115670 121425 58324 15335 43768 -7284 -20307
20253 -20307 32375 9889 -54188 -50419 -31361 -7227 10528 -3525 -6572 -21461 -25058 -51567
20241 -51567 -9023 -27640 -49309 -7096 37386 54820 -9687 5886 -22497 9724 43501 78510
20229 78510 28273 41562 42179 23525 -1573 47438 61053 78954 45649 38333 5680 55458
20217 55458 115847 141630 18055 -23204 -45389 27251 48171 19156 -10798 23247 41652
20206 41652 38326 -28120 -19668 6507 -10713 -11322 17295 -52142 -70440 -28765 -3013 -34376
20194 -34376 -34376 -46720 36448 74536 36754 56 -21302 -57150 -58316 -49269 -5761 18338 51435
20181 51435 76751 22569 -21544 -8155 -37688 -60606 -75186 -129722 -91227 -48009 -25102 -60570
20169 -60570 -89869 -62918 169 51169 24436 -28784 -16245 29138 77063 90667 92610 90481
20157 90481 61323 77389 65673 25977 21985 56735 61155 41948 11155 -30999 9788 24667
20145 24667 1970 -9601 60249 52635 33938 2380 24288 72565 81281 66387 21689 -25926
20133 -25926 -125391 -117677 -46667 -15753 -18730 -3320 -26199 -53484 -69966 -49316 -61996 -45238
20121 -45238 -36190 1504 27488 21013 70404 100495 77930 3128 26510 58910 34596 26825
20109 26825 61568 87330 59606 16277 19118 -16182 -52623 -66982 -98145 -68785 -38494 -74996
20097 -74996 -58254 -11249 -3085 39144 6475 -37213 -18509 -13306 -35346 -12063 103 8095
20085 8095 -10597 -52161 -48687 6863 376 6055 -13788 -1720 56325 -963 -38021 -65985
20073 -65985 -30746 28826 22995 1982 -591 -10032 24284 48954 3024 -29296 -23087 -2267
20061 -2267 16783 13985 1023 2136 -35894 -82268 -135783 -135201 -106965 4449 6476 -42333 -24831
20048 -24831 5249 -40836 -19963 28912 46948 57866 41257 22473 -72076 -124100 -64902 12811
20036 12811 -44383 -68293 -36489 -8223 59606 89150 56979 8858 29119 84268 57301 32481
20024 32481 84271 92940 116176 82899 20699 -5539 14128 3188 -24796 -25468 -21437 -33344
20012 -33344 -52035 -29993 -34165 -62702 -96343 -49356 -36948 -63944 -94114 -70124 -110626 -128253
20000 -128253 -115209 -42312 8351 80881 102952 66479 55846 7458 -18941 -66609 -59905 -6498
19988 -6498 -7784 -33342 -72449 -80392 -1104 32874 71431 83360 83747 80078 13899 -45941 -41058
19975 -41058 -13299 -40117 -47550 27319 39649 56772 53683 66758 51744 37586 30598 42488
19963 42488 -18309 -42663 -53396 -8206 25187 15900 18549 -42481 -82097 -77168 -69623 -83804
19951 -83804 -88015 -28147 -8945 -65331 -126788 -131787 -89074 -92020 -140196 -79933 -25599 -59393
19939 -59393 -113579 -109211 -33276 -49557 -74502 -31520 -43853 -37129 -15149 -17441 -78913 -50149
19927 -50149 -29343 -30632 -24372 -60100 -68906 -61600 -42867 3178 66778 40653 34844 17043 -37745
19914 -37745 -81449 -123053 -142310 -136022 -53903 -26864 -3782 6980 2603 -18956 -30415 -15589
19902 -15589 -97947 -148437 -173042 -139814 -93900 -35594 43237 67236 37957 29332 40312 -6389
19890 -6389 -93008 -96517 -67794 -37663 -13226 -25096 -9726 12967 25232 -38889 -64898 -75657
19878 -75657 -70618 -78551 -106987 -62503 -62810 -66298 -36693 -41079 -23207 -87234 -80503 -43039 -48297
19865 -48297 -64333 -93210 -97194 -84772 -33382 -15605 -6657 22754 51331 47884 19157 -16157
19853 -16157 1472 -16606 4090 26736 29608 5050 19305 2787 -61409 -32456 -46390 -57025
19841 -57025 -48519 -28700 25026 25338 -2538 -16309 5464 -4497 -22468 -71622 -37110 18646
19829 18646 7020 59991 93389 61377 9317 -54594 -64855 -27419 7840 73164 102408 100258
19817 100258 48894 -5935 26207 42270 -31644 28161 55011 5228 -20200 -45249 -1704
19806 -1704 2501 -45449 -63097 -106044 -136725 -150101 -149266 -112854 -77249 -109270 -108850 -59561 -104484
19793 -104484 -75748 -80542 -59179 -65570 -48971 -8011 -30764 -36699 4961 31854 -22361 4833
19781 4833 6822 -41185 -29110 -44317 -41785 23811 6433 21846 69162 92656 37054 -9555
19769 -9555 -28255 -20829 -29055 -32653 5893 7953 -20878 -41041 -49603 -642 30123 -34832 -60451
19756 -60451 23111 55749 6964 11746 40539 59518 23421 -39525 -1743 15803 -9637 -5031
19744 -5031 -7573 -52101 -109306 -99122 -118736 -128418 -96738 -37192 -53013 -17232 -35425 -108361
19732 -108361 -163155 -124278 -72648 -95458 -106995 -81713 -24591 30186 24653 -35982 -14166 16899
19720 16899 35332 -27529 -35594 -35830 -67736 -70703 -65824 -76491 -46414 5103 45315 23752 8195
19707 8195 5734 -16934 -12071 -33414 -96111 -67770 -39591 -67950 -87530 -109218 -122945 -93800
19695 -93800 -50714 -67288 -25097 -16953 -76723 -79689 -50565 -21602 17737 -26246 -95920 -109544
19683 -109544 -79870 -53635 -25405 31994 78307 78164 31752 -7995 15364 18798 -27214 -8279
19671 -8279 -54160 -14226 58111 17070 -45497 -40967 -14815 -6766 -818 -34827 -97257 -118010
19659 -118010 -79737 -58332 -65945 -54437 23018 54245 80602 46215 38907 25069 15158 -29791
19647 -29791 -35346 -54405 -55593 -31874 -27044 -16951 -9082 -8359 3219 -28162 -41965 -49020 -60788
19634 -60788 -25455 -3037 80608 73232 9287 -5144 34255 -5809 17506 32820 33754 -27258
19622 -27258 -22303 72931 55475 27625 -61893 -99502 -56544 10394 39821 34629 21586 28417
19610 28417 43223 4412 -30278 -43956 -60531 -19896 -31384 -54189 45265 76244 70766 19899
19598 19899 -17752 -37560 -28085 -12201 -47184 -92237 -65351 -53946 -32555 -6464 17225 -6148
19586 -6148 -16109 -64885 -102789 -58776 -104414 -143396 -111382 -109883 -165669 -150447 -157702 -170751
19574 -170751 -63304 -873 -11223 -27319 -42420 -79169 -120618 -147457 -120256 -136188 -155243
19563 -155243 -133669 -72532 -21403 -46292 -20036 27060 25616 46198 5330 -5541 -10846 -17448
19551 -17448 -27249 -571 42237 19354 15851 38552 68280 108809 142260 141268 158281 162640 95321
19538 95321 41106 2165 19086 6263 66154 78110 52708 -4825 -10778 -26788 -11306 -8024
19526 -8024 -45150 -85633 -68409 -35964 -43062 -103273 -108519 -74910 -75719 -53776 -21092 -3946 -25829
19513 -25829 -447 13004 -58044 -131455 -124153 -108336 -57138 11261 -918 44818 71323 22422
19501 22422 -7533 -18200 35897 12439 -32105 -30404 32983 26953 41 27412 7276 -62392
19489 -62392 -20716 3040 -52784 -26054 -26385 -28935 44987 60077 56370 56712 29760 -4745 -20095
19476 -20095 28761 58626 83883 -570 -121332 -97572 -54671 -65450 -70607 -40562 39986 16162
19464 16162 22319 -7186 -38290 -27919 -18518 -45514 -69460 -32464 70341 146424 141438 61538
19452 61538 71226 45927 5996 8559 9101 7729 -19522 -19468 -764 5741 -49158 -54860 -93092 -81954
19438 -81954 -92203 -150434 -155364 -131015 -47691 -40667 478 -20073 -58689 -46567 -29935 15995
19426 15995 54641 -18610 -80019 -70441 -53526 -34520 -1312 -26074 -79464 -75332 -23573 -2799
19414 -2799 -60183 -84315 -42189 10711 11612 -84314 -123536 -105496 -37309 21714 30906 16672
19402 16672 10178 11379 -21067 -22972 -2690 -5683 5508 -24576 -45765 -44155 -84349 -97655 -80482
19389 -80482 -101210 -77850 -41074 -118007 -103331 -34226 6868 -7170 -58300 -72279 -41241 540
19377 540 12793 -4149 10715 -39249 -39491 21697 44807 68527 72418 67666 82416 40826 16341
19364 16341 -11061 6691 40800 51437 44963 3323 2395 6733 -37058 -1474 67347 22888
19352 22888 -24707 -24797 -12982 -40309 -14689 209 7779 24841 -6154 -10911 -69689 -94087 -47288
19339 -47288 3048 -41187 -87606 -43409 -13501 -20638 -22740 -52125 -101837 -77324 -71360 -70240
19327 -70240 -29296 -6399 -44188 -42669 1829 38430 41947 49967 47542 63489 38165 -43365
19315 -43365 -109667 -70300 2331 7569 -18520 -25279 -70605 -14095 50859 66953 65048 93232
19303 93232 97489 95208 54337 -795 -49687 -113990 -88983 -1293 61829 62066 15674 -41960
19291 -41960 -50223 -22374 17728 -1035 -14996 -18087 -68888 -65301 -47407 -54012 -50175 9442 49445
19278 49445 60598 33445 27082 45431 5398 -38190 -21906 -24536 10079 50885 78969 122866
19266 122866 145335 158911 116652 67699 14428 -50938 -56965 -10817 -11474 3544 95626 117463
19254 117463 28960 17316 -7768 -13067 1107 -24326 -16224 107 -19982 -35555 -59420 -28706
19242 -28706 -34767 -76440 -36830 -66018 -64595 14234 14926 -7202 -4767 -17656 22400 53026 139556
19229 139556 145226 87298 51582 20087 37066 61281 42187 28117 260 -27012 -75538 -94948
19217 -94948 -77918 -57988 -48766 -23661 48858 79695 91863 -26016 -54670 -53535 -24566 8415
19205 8415 23660 35316 40978 10865 -48981 -47276 -48645 -53424 -23703 37771 72240 142918 147151
19192 147151 64953 7359 -9140 -18865 -54649 -6651 -3017 -50204 -23387 -12556 -19242 -23221
19180 -23221 -34825 -36060 -33692 -2638 -6243 -838 19629 -4443 -43219 -74787 -69493 -20518 -32482
19167 -32482 -68308 -76498 -50207 -20777 -10538 -7516 -5285 9209 -40938 -42011 -35934 -31643 -21800
19154 -21800 667 8937 151 17673 47061 33395 86013 125448 94473 23094 533 30233
19142 30233 26995 31339 42785 -36836 -61682 -16997 17803 73994 69602 60115 74428 92267
19130 92267 79973 59117 51326 50369 42378 59465 49092 68627 37050 51049 18734 -2344
19118 -2344 16898 8703 -3152 1314 -8739 -34220 -29846 21468 12879 -64408 -99371 -15752 -21284
19105 -21284 -27878 -27676 -17204 -46752 -86905 -106240 -98800 -101821 -73445 -12579 48866 43787 64873
19092 64873 61093 58458 92154 97632 40315 16891 21674 38184 24226 1268 -35122 19395
19080 19395 116827 117155 54047 41937 46325 12205 -12668 -14684 -25090 -11053 9454 23977
19068 23977 5399 -3908 64409 87531 43722 58799 31700 -50416 -87227 19040 87622 45895
19056 45895 -11144 -16426 -16474 -33880 -756 13797 11153 -10909 -24899 -13567 365 -32982 -61724
19043 -61724 -71870 -26621 -23774 5347 8640 20599 39869 -8597 -55647 -50631 -38544 -33542
19031 -33542 -16170 -28908 -70207 -19844 27357 -9371 32344 17569 -13052 -5673 -9741 11008
19019 11008 299 -65579 -142185 -76622 -12921 19360 92600 125217 87753 113397 106828 52025
19007 52025 -1617 4681 69552 83815 103848 55381 16733 26230 76930 32767 5634 -39789
18995 -39789 -13665 20127 62956 38681 -35128 -68789 -69436 -46277 -24708 1421 21407 10961
18983 10961 20246 60944 17783 7428 -72982 -98991 -115468 -17042 48513 63039 66912 51131
18971 51131 -18401 -27319 -32907 -17084 -10130 17943 71745 79229 69728 69768 78448 94134 86755 92451
18957 92451 83763 70178 84286 86913 42495 43686 27098 24444 49051 49721 5869 -16084 -17644
18944 -17644 199 -13854 51956 72824 49302 35295 19493 -5943 5174 -1898 29442 23543
18932 23543 -15604 12456 10831 -17017 -25729 38065 21873 -3212 41547 12521 -9419 -56780
18920 -56780 -13039 -6303 -41626 -22122 -21095 -14688 -26697 45501 69858 18804 -26043 -15123
18908 -15123 -31420 -81565 -26567 12205 37616 34697 -70570 -132130 -85734 -83309 -95298 -85337
18896 -85337 -40693 -57697 -1563 6677 8116 44114 24543 -9151 -44978 -44337 -11041 13350
18884 13350 32922 14843 -6886 -11143 -24439 16933 -6452 -18355 -15325 -4300 8545 -298
18872 -298 -24270 -5225 56210 79658 114210 56526 4510 -49123 18801 92589 70432 16130
18860 16130 -15378 -22844 25757 25320 24813 -2918 -17594 31276 49539 79121 78854 -2121 -5879
18847 -5879 29538 24731 4967 44857 -14294 -23098 11187 58600 94530 93009 89668 44993 13470
18834 13470 -7572 -27921 -71683 -37455 60577 79363 51556 53858 51217 60101 86761 94106
18822 94106 95128 97131 90516 95678 105974 78234 75776 50194 44996 113742 157496 166353 84098
18809 84098 107535 115383 141345 236373 275248 291552 321569 298112 270316 297385 238102 132655
18797 132655 101288 84446 76886 78933 43848 42947 28877 -6434 -56390 -118949 -49511 15154
18785 15154 -2400 1108 46583 73973 82531 62780 23899 11789 1085 9090 10615 -25680
18773 -25680 -8578 2954 29348 50098 51670 32096 -16499 -8372 13576 24773 69404 67261
18761 67261 69674 147589 220212 248440 317305 353264 395005 478601 508543 508093 509405 441008
18749 441008 347893 311285 263365 190571 180208 216496 213089 123133 121955 127802 95331 66131
18737 66131 54569 47477 95288 162794 124766 117199 141605 78022 35164 3506 37982 103190
18725 103190 91468 72184 84115 71147 -1315 18108 24492 -19046 -27794 -40129 -31775 7493
18713 7493 105501 201988 266335 308627 257085 258058 223054 175198 168686 180456 188578 232108 248770
18700 248770 226384 226468 204742 154014 92572 88714 124798 172166 159903 142865 186519 178689
18688 178689 119925 78513 62504 56296 93406 72977 54326 67779 53165 24741 20225 27054
18676 27054 20801 -3273 16689 24930 38288 74516 64640 50315 54463 104914 226221 181072
18664 181072 80467 27623 71403 98748 111797 59852 44803 8818 -22698 24712 43269
18653 43269 26521 10363 82040 78709 41040 64272 86787 37208 -38445 -43569 -19102 27549
18641 27549 17036 52933 49555 25566 58371 42596 -26985 -99197 -127105 -69254 -14600 2295
18629 2295 30299 -3043 11998 23567 11014 25735 22541 49358 92493 139902 103363 7332
18617 7332 8378 23296 59776 89346 80771 25846 35787 90329 35930 13575 47700 49786 101944
18604 101944 111018 92314 41025 22896 -25824 -62540 -38450 7861 63496 57252 68318 19514
18592 19514 66972 145095 136611 142595 135112 110352 73366 26750 -20170 63936 97243 126270
18580 126270 103153 56796 41946 94545 144264 81562 45955 10132 -18866 66051 79762
18569 79762 19953 6641 10641 34972 47530 101258 88736 84866 99531 82001 113929 128181
18557 128181 39270 11253 -24529 -29491 -16481 39490 114917 174290 201209 203656 203126 203919 167408
18544 167408 134856 137967 113763 119647 104912 150926 114606 101586 137811 168060 142832 120416
18532 120416 84883 48315 -27792 6696 84937 99434 89435 69218 78003 109878 144601 114475
18520 114475 65602 84690 66677 86119 93496 78656 69319 101569 160100 229707 231188 193992
18508 193992 223008 204024 228683 205762 175209 190001 188499 116482 100327 143067 148149 128098
18496 128098 114941 137819 145003 130389 132425 134038 148631 182381 206464 199937 168520 124664
18484 124664 97505 65935 1673 35751 83913 76801 70322 14725 22199 77759 131405 124102
18472 124102 137282 168041 143148 149656 159055 155999 107806 53256 -20858 -18400 111916 162564
18460 162564 166848 218546 217845 223015 237240 237929 171767 101498 135020 141880 91495 50378 96882
18447 96882 148183 129637 158377 163804 173898 191505 219909 216082 145367 139574 181613 184151
18435 184151 169676 171228 166869 148949 129503 125268 121905 115786 134065 117764 125046 150763 169083
18422 169083 149327 184562 145301 153047 114023 94491 127548 160651 174892 127314 127451 142157
18410 142157 131535 79201 90386 116965 133118 166118 129048 95372 148680 246957 245713 227349
18398 227349 242449 201926 197526 283594 312878 324844 383408 337315 233401 205931 256761
18387 256761 257487 235091 206306 159326 125144 169494 170065 191182 192964 189739 172297 149761 221955
18374 221955 253638 301334 306630 311946 352765 403862 393140 400134 409632 467132 441372 413556
18362 413556 422394 434578 443277 446283 423909 446715 443151 441266 445614 471768 542102 578432 559799
18349 559799 557233 607505 659577 721450 835528 923747 956050 965255 983937 944884 814501
18338 814501 730144 790699 901287 1022932 1122048 1225179 1314493 1414111 1529100 1653097
18328 1653097 1718125 1717756 1547811 1377035 1280259 1186273 1140402 1174455 1203401 1158908 1158476 1212507
18316 1212507 1309482 1398247 1531550 1610939 1602129 1661716 1785299 2093226 2604034 3434410
18306 3434410 4718168 6244716 6967333 6438076 5779524 5572986 5855626 6810631 8600228
18297 8600228 11650394 16991574 26217217 39694113 50977063 50326879 45135961 45469405
18289 45469405 49764669 46237434 34196912 23001561 15973290 11943619 9500488 7880720
18281 7880720 6706628 5699346 4930510 4388310 3952659 3675202 3494946 3252436 2954123
18272 2954123 2725730 2503846 2388863 2346468 2313751 2278042 2289655 2360165 2478282 2501434
18262 2501434 2588200 2863335 3124099 3418936 3721867 4057161 4591307 5289360 6024843 7056322
18252 7056322 8556789 10622763 13723320 18781210 27253225 41049844 60502728 78193076
18244 78193076 83451577 82989945 91825278 110992308 117137365 94846279 65988309 46665015
18236 46665015 37267558 34816287 37785238 43889180 45200385 37465412 28322894 22018498
18228 22018498 17306998 13278043 10242570 8153214 6769061 5816961 5195750 4663681
18220 4663681 4188239 3770040 3398251 3143675 2948904 2828094 2704726 2578778 2687737
18211 2687737 2831670 2994283 3182161 3399406 3654804 3903331 4136280 4422869 5051309
18202 5051309 6006565 7467542 9651337 13045313 18585898 27195384 37032751 41155099
18194 41155099 36531376 29760368 26299481 27848270 35329455 49747920 66807112 70166725
18186 70166725 56727735 42919966 36609347 35755420 33878239 27115822 19156905 13312045
18178 13312045 9619622 7300427 5824311 4711653 3884692 3316322 2860450 2597698 2455755
18169 2455755 2349172 2190850 2083554 1965617 1710702 1518839 1387952 1299960 1255631 1288052
18159 1288052 1343330 1323089 1317239 1351859 1377446 1448215 1408214 1244920 1027858 814464 740703
18148 740703 791042 889337 865929 719808 590377 493391 391002 325821 281032 291696 252639
18137 252639 193511 187515 228009 257738 235104 158861 179756 237221 288633 296182 303473 287928
18125 287928 322661 342720 356430 315928 305294 262153 326123 404959 432482 427749 472892 503178
18113 503178 440100 467924 470026 451155 419287 412900 382268 394265 390521 387824 373844 391287
18101 391287 365771 324789 261576 187944 173503 232807 233057 274841 247316 203135 200345 190285
18089 190285 191890 143069 93713 135922 199052 167725 163808 206514 228996 210476 246424 261359
18077 261359 252574 276121 242071 232128 208442 195619 183328 185520 255692 279190 299823 380820
18065 380820 388401 318854 250514 301957 325181 354904 404530 422239 381412 424984 407879 418757
18053 418757 399233 334133 341689 294708 267311 200138 167648 182420 187044 237836 200554 196982
18041 196982 191782 147353 141279 172651 119373 57228 75933 67420 72060 95823 107690 95062
18029 95062 101994 138808 155880 164255 191784 220815 190162 253630 239847 185835 144793 127227
18017 127227 115635 185928 246341 253199 266600 249766 252137 291338 282874 234825 214307 159161
18005 159161 162604 266200 265019 250232 274124 235502 202732 274672 284657 297620 277177 252652
17993 252652 265887 254099 195304 172404 189214 245374 300005 269545 222446 211048 173727
17982 173727 150581 166263 203634 225479 241377 262387 262318 293918 292579 268710 216442 262379
17970 262379 274778 248824 274861 275264 261582 293638 353668 437208 452084 443952 424418 374461
17958 374461 361394 337659 339237 355971 371409 383258 367314 368284 353680 309800 303019 316648
17946 316648 346611 326736 338011 326070 331074 307574 275808 238043 246009 300237 344388 376259
17934 376259 403591 420565 447987 437146 472982 421293 397846 435565 413086 421192 509633 572479
17922 572479 547049 458941 441252 530094 550041 523231 571448 583844 570428 552711 536023
17911 536023 558032 585550 573804 548002 543991 531463 480645 516222 534182 558416 546795 542011
17899 542011 538989 494261 479119 542117 535616 520232 463853 433815 511795 541228 531930 561714
17887 561714 552442 545249 618792 672075 642433 649106 589812 618121 635388 620522 560405 584067
17875 584067 648297 715647 799251 813503 859320 888234 862462 863301 892834 792160 776706 852765
17863 852765 931795 1003346 1012627 965311 937981 1014954 1127310 1215422 1275679 1370620 1408813
17852 1408813 1418296 1412674 1444188 1497490 1579262 1661109 1711494 1817993 1940520 2029389 2138438
17841 2138438 2342592 2597280 2816199 3131473 3428583 3795940 4213125 4677634 5155270
17832 5155270 5749151 6608679 7607704 8837475 10561011 13251946 17119146 21539420 25531716
17823 25531716 30721016 39463711 49909627 53452511 47813180 41479290 39689185 44026532
17815 44026532 56126114 78314842 109626636 137962596 155284512 174167907 191975764
17808 191975764 187647695 164552115 143746855 133851984 130238411 138717098 171775655
17801 171775655 229837573 272147379 243222246 177929239 127869335 100170343 87046658
17794 87046658 85591126 90234291 87588092 71437069 52148766 37761657 28594778 22771928
17786 22771928 18798665 15817631 13519856 11933366 10803542 10059747 9619609 9228466
17778 9228466 8836123 8418087 7971666 7493881 7076612 6860251 6756015 6803296 7017550 7505111
17768 7505111 8299989 9602968 11689541 15063911 20750710 30757133 46824624 63920397
17760 63920397 65773505 55017995 47627236 50007384 60726537 70418947 64527409 48998384
17752 48998384 37216664 33211852 36321553 44839239 50739675 44932250 35687483 31542074
17744 31542074 33727327 39565978 40900336 32483920 22049152 14951735 10876174 8433419
17736 8433419 6775074 5608906 4749364 4124394 3710721 3361680 3031618 2756590 2547888
17727 2547888 2385662 2264957 2183073 2109758 2128328 2055006 1995466 2003253 2009936 2034790 1933733
17716 1933733 1783384 1587706 1454077 1338178 1289306 1284411 1297615 1300168 1233607 1152312 1096508
17705 1096508 1067388 1072329 1098347 1064927 1045287 1093503 1145191 1190802 1233152 1261978 1372265
17694 1372265 1534564 1565720 1535078 1598395 1707325 1841020 2038922 2334595 2633327 2962930
17684 2962930 3232967 3436012 3844759 4361688 5026369 5885297 7052458 8733810 11366728
17675 11366728 15325759 20850677 27911247 37688394 51717242 64837932 65112248 53310598
17667 53310598 40612919 32715598 29839569 31261493 37227000 48295867 62530507 73551934
17659 73551934 77813584 76877135 67533358 52047667 38574242 30265551 26554388 26647635
17651 26647635 30770154 39233579 49548529 52989343 45057595 33843158 25589579 19956819
17643 19956819 15423697 11936176 9538915 8008355 6994382 6204500 5608207 5206092
17635 5206092 4903807 4776851 4754632 4704639 4581726 4548078 4668369 4896869 5178283 5497692
17625 5497692 6079913 7011669 8370331 10575456 14181464 20274208 30335575 44472409
17617 44472409 56690788 56547011 48005286 42214960 43752032 50887436 55913289 50627958
17609 50627958 39163458 29270423 23556263 21455084 22580160 27382439 36537791 48016511
17601 48016511 53043371 47012157 38841532 36187696 39981949 46143173 45865290 36494585
17593 36494585 25429004 17394880 12421125 9319064 7337342 6002687 5124629 4407357
17585 4407357 3746073 3188886 2741976 2410314 2207478 1993385 1784573 1637145 1587947 1485248
17575 1485248 1368882 1223545 1117365 1059918 967461 902927 799057 706458 662833 608351
17565 608351 572576 528355 447555 431469 441304 375233 375729 348788 310456 256056 290828 293774
17553 293774 238255 231500 243979 224909 295565 308658 278509 255960 246809 262008 229249 182211
17541 182211 139174 85225 99446 87527 106787 113788 76503 53418 47612 42263 42011 41904 79240
17528 79240 60441 50403 30898 36263 49410 64428 9751 -66657 -86993 -75534 -38515 -37263
17516 -37263 -31060 -45061 -62102 -55775 -52974 -89290 -126653 -83275 -82645 -156027 -124169 -133532 -140252
17503 -140252 -122346 -135747 -160563 -150026 -121675 -68989 -71109 -68709 -88371 -129547 -91821 -34475
17491 -34475 7811 31755 -2576 -3144 -2352 -22223 39354 44646 5992 10108 68326 101805 69141
17478 69141 61360 127908 159170 121583 112201 68087 32842 -10329 2809 3473 90925 130001
17466 130001 70644 -6140 -50700 -76683 -61747 2743 74398 57481 34350 5606 -33682
17455 -33682 -74192 -91984 -31210 11506 8545 -74775 -37873 -48269 -73055 -74627 -46531 -34683
17443 -34683 -67001 -13065 6096 -9758 -12177 4969 -17967 -21849 -25903 -5986 34840 28064
17431 28064 4421 21974 -52232 -164865 -190072 -112971 -106526 -105977 -96318 -78383 -12618 -13162 -1884
17418 -1884 -49688 -82192 -80866 -52045 -35706 25227 63076 29523 47745 51433 6208 3250
17406 3250 5649 -28646 -65838 -26874 41658 13368 14213 62517 106305 69537 54700 4435
17394 4435 -34633 -11269 11693 -31081 -80923 -83931 -89172 -66783 -41741 -39481 -59411 22448
17382 22448 -530 -45839 -89157 -75399 -46420 -44579 -85696 -153420 -121720 -98663 -94639 -79356
17370 -79356 -71854 -74820 -79239 -51682 -99996 -116161 -57058 -20391 1755 -19074 -37787 -58624
17358 -58624 -93338 -113006 -88715 -75118 -118500 -127612 -74176 -387 1618 54026 88556 103695
17346 103695 60635 12996 -53458 -19753 -1955 -8360 -50758 -83145 -51395 -60105 -62045 -10624
17334 -10624 -19768 -1107 -62512 -65079 -52525 -83350 -55721 -20087 -72380 -114004 -61524 -20361
17322 -20361 -44216 -115175 -129078 -71883 -26636 18298 -24918 -103001 -150036 -69994 -83230 -87037
17310 -87037 -54602 -11283 -11367 -65602 -71042 -46759 36294 90720 129392 98601 84458 59648
17298 59648 102008 69726 130843 245675 325866 370341 428660 370880 327790 257960 226989
17287 226989 313402 405625 452523 579477 634367 722144 812706 889310 940401 935999 850492
17276 850492 773456 682904 637677 566119 485619 454111 405729 422891 468836 537329 689533
17265 689533 707443 668113 576409 458987 381285 267873 268707 231124 193415 155865 93038
17254 93038 47034 41237 33726 59988 98828 60313 62510 50383 39869 37701 11622 -31537
17242 -31537 -19776 21826 17775 -36056 1477 -1991 -6990 26852 18523 42221 83096 99024
17230 99024 116192 220968 240090 227441 315600 306084 241957 199094 181890 216291 200161 144927
17218 144927 137007 177500 221536 257079 226595 229351 231634 219535 212540 225832 221093 161930
17206 161930 146493 143287 150681 124301 82044 13268 -37573 -75543 -65182 -71567 -112292 -81261
17194 -81261 -119751 -58570 21837 29968 73601 45993 -1062 -2249 -54388 -85652 -122836 -140603
17182 -140603 -116492 -37412 1893 -2978 -37933 -30135 -37389 -111791 -112058 -120083 -126202 -119122 -85292
17169 -85292 -12171 3984 -35071 -110687 -83637 -51712 15005 35330 24394 13957 5787 25902
17157 25902 37830 22291 20949 45194 136179 195434 207619 241026 199617 158522 170791 196144
17145 196144 195654 210899 207073 154740 155323 157259 189556 164951 92991 -2945 -16938 20824 96413
17132 96413 153707 169178 161581 145579 139979 85884 29204 20859 11651 42809 65859 58035 1171
17119 1171 -11987 14101 16180 -26998 -20421 -30493 -21470 -8826 -50834 -110217 -82113 -13783
17107 -13783 3639 -58097 -66179 -24640 55529 137064 142846 159355 225456 259261 248472 173847
17095 173847 159173 187212 168544 190725 199900 159674 126748 136123 176418 121494 90788 163837
17083 163837 180958 142210 154482 163528 219358 229985 179577 133177 83482 75595 66699 33055
17071 33055 -28132 -41834 10997 -8153 -96186 -137173 -28997 51908 11056 -48232 -73628
17060 -73628 -59305 -70099 -183774 -155549 -81412 -54757 -39471 -19113 -18906 -5729 7498 51059
17048 51059 -8152 -110281 -142709 -148727 -164257 -152295 -93735 -115957 -125651 -62458 -49554 -43966
17036 -43966 -95454 -85349 -681 29946 23208 51326 73646 77325 86227 31637 -22350 -12016
17024 -12016 26824 7319 -10267 -52618 -63102 -53204 -74434 -81092 -52883 -22676 -22898 -15001 -56329
17011 -56329 -79037 -67816 -47688 -30094 -19234 -9406 -22307 -12986 12503 -30011 -58953 -97047
16999 -97047 -87725 -71341 -84463 -80570 -48303 -41739 -60693 -54134 -50481 -75591 -5877 72515 27926
16986 27926 -28076 -19661 -18141 -42532 -28415 -12759 -27338 -59045 -77564 -92626 -36729 23557
16974 23557 74772 38560 -42728 -37109 -51811 -59933 -41037 -40480 -12089 7770 -56518 -100124
16962 -100124 -21655 -23188 -11638 33173 16783 -47677 -92029 -77831 -31754 -32945 -55836 -63217
16950 -63217 -40218 -35677 -64408 -59013 -20552 -38979 -39505 -73457 -95698 -68902 -49502 -56266 -34697
16937 -34697 37492 -12897 -79227 -83307 -54070 -17059 -16453 44087 21720 -115220 -76040 -30220
16925 -30220 -22696 -45204 -51403 -47882 -65990 -46505 -81304 -127500 -103799 -92999 -17222 38105
16913 38105 80035 61258 30243 9274 21855 70227 42067 -27913 -73630 -102940 -57207 9649
16901 9649 68481 -7632 -88014 -65967 -19783 -28815 -12472 -61048 -122602 -79333 -1326 -27593
16889 -27593 -40791 -86953 -71320 -96438 -128512 -54689 -24813 -43650 -10133 -27349 -80208 -95340
16877 -95340 -49720 -81185 -63232 2353 37955 17515 -30606 -21210 5610 -17120 -94440 -134572
16865 -134572 -81175 -82280 -140187 -93318 -2353 -19391 -39660 -50352 -15125 39035 43222 -10448
16853 -10448 -33093 -83538 -94099 -61379 -59330 -16628 -28727 -12796 85599 72378 -21148 -88147
16841 -88147 -68031 -25646 -59882 -17158 -18223 -85815 -9701 70711 40553 -35094 -75194 -38409
16829 -38409 -32735 -4463 48288 28104 -87169 -111690 -58935 -1545 44436 75687 80867 96312
16817 96312 77867 15093 -20098 -64171 -90407 -64720 -45294 -37654 -9085 -24001 -61096 -45076
16805 -45076 -72004 -14268 26632 36163 -7204 -28712 -12406 -13327 -22216 24052 78871 54627
16793 54627 -43177 -101629 -91165 -65905 21239 29566 39465 61560 27134 -15311 18295 -41803
16781 -41803 -76022 -113265 -104163 -108435 -76935 -57210 13944 -47371 -36100 -48734 -55717 -46318
16769 -46318 -16617 -2338 30802 12006 -16926 -5480 3383 -57454 -99147 -86638 -71787 -64620
16757 -64620 -24753 -46240 -52641 -76341 -77335 -32022 -1604 9930 57622 70232 9687 -78871
16745 -78871 -104868 -156473 -128241 -102363 -126037 -91499 -68791 -85826 -72417 8450 6348 -48037
16733 -48037 -34324 37828 49397 40115 20560 50553 85118 39089 -10237 -98139 -147142 -112036
16721 -112036 -89176 -64426 -75945 -99402 -59283 -69119 -50391 -60742 -33396 -27681 -71613 -96629
16709 -96629 -114312 -94102 -48068 -73950 -77408 -30302 -48073 -107701 -126532 -59773 -3772 50237
16697 50237 -18355 -118344 -134422 -125748 -106349 -75379 -50764 -28257 -43492 -50935 -50317 -51457 -116157
16684 -116157 -119426 -118401 -72111 -38717 544 2501 -62511 -51166 -16642 -28913 -28391 -107986
16672 -107986 -67656 -60635 -47241 11304 21046 70435 36775 686 -50453 -56379 -80320 -92036
16660 -92036 -4770 20788 -44409 -47609 -44075 -11042 -10565 -3951 -26975 -41519 -85270 -86237 11376
16647 11376 10553 20606 16316 17827 59590 51229 24494 10576 -13633 -23822 -20470 5481 3669
16634 3669 -28781 -14501 -65328 -128902 -131983 -52947 -78957 -125603 -90153 -41485 -82166 -66365
16622 -66365 -59188 -56132 -66780 -33110 -37601 -34493 -15675 -1012 -3944 -34742 -40341 -39113 -91754
16609 -91754 -119087 -61619 -55520 -135918 -158447 -159342 -143134 -152192 -103023 -80455 -75377 -36258 -23398
16596 -23398 -37885 -15604 44192 50953 66390 24959 -34448 -28735 10163 -9774 1953 19940
16584 19940 20178 -80998 -139585 -121253 -32945 17191 34786 27196 -45351 -54659 -69453 -62435
16572 -62435 -21241 -30264 -17130 -11158 -22728 15103 -4430 -15712 -66045 -93543 -52059 -42239
16560 -42239 -36273 14234 -7072 -24753 -32466 -50413 -100173 -111107 -85319 -25592 37855 39874
16548 39874 17806 -32349 -61416 -55045 -12384 23646 15390 20118 63428 41362 19260 -58583
16536 -58583 -57656 -62111 -98102 -109788 -82977 9899 114632 90547 99704 45755 -54739 -39583
16524 -39583 -41515 -26809 -11340 -741 -45885 -106109 -143733 -66663 -60390 -105501 -98850 -14507
16512 -14507 -31337 14928 -16574 -42499 -67746 -112970 -110212 -124539 -111434 -28526 -5645 -24805
16500 -24805 -45609 -57155 -96543 -151006 -120281 -88879 -64912 -25446 -3619 -1812 9734 -10837
16488 -10837 -7085 -1244 18891 17431 -73229 -75267 -16159 -64377 -82804 -57295 -22226 -52634
16476 -52634 -76556 -68404 -29362 -17726 -10052 -11471 -23390 -21949 -28470 -4591 20961 -42450 -72189
16463 -72189 -36229 -24537 -48715 -25628 -11885 -4939 -10563 -18327 12568 -42229 -70725 -85846
16451 -85846 -65283 310 33060 41054 42459 -42204 -65978 -59199 -51691 -11296 -26753 -26210 -26904
16438 -26904 -41006 -23062 -29123 -5030 22376 405 2502 27985 -29710 -61854 -68059 -81348
16426 -81348 -80330 -103431 -90207 -62934 -26283 -3108 -7679 -8521 -5163 8299 23676 6857 13781
16413 13781 16974 65185 73800 -6058 15296 57767 -40814 -59123 -5921 -38 26526 43038
16401 43038 6271 -42361 -90263 -51855 28376 18914 37132 53296 57671 55009 25125 18034
16389 18034 -2962 -16767 -735 1059 10424 31920 34910 -26378 -131622 -109265 -99872 -114749
16377 -114749 -32912 44802 -599 -19808 -29839 -33439 -28123 -41222 353 2173 -15249 -34573
16365 -34573 -55085 -88407 -34923 -23838 -41368 -51045 -46808 -16685 -39355 -25381 3142 74943
16353 74943 98884 80703 5319 -48817 -53512 -65142 -23014 -2571 -65213 -94939 -75566 -24632
16341 -24632 4374 568 4967 -7901 -106831 -140265 -120904 -49965 33500 13367 -38281 -29165
16329 -29165 -27383 -57443 -98079 -75171 -10911 -420 -31544 -21037 -4184 2791 -38848 -58480
16317 -58480 -39825 -37139 -24902 -29796 -48441 -37828 -42731 -74564 -73394 -39083 13164 42656
16305 42656 46612 39633 18350 14459 15526 14207 30519 19523 -33465 -36782 -16042 -41896 -112596
16292 -112596 -122727 -134005 -143813 -83002 -133673 -141117 -177853 -174720 -126851 -48208 2585 15979
16280 15979 -7637 -48578 -51936 -34256 -51442 -62612 -60324 -83521 -141601 -180630 -189422 -130714
16268 -130714 -115746 -97720 -49211 -55067 -16360 11758 -44241 -75683 -119136 -118056 -31975 9131
16256 9131 -7906 -39467 -67507 -43827 -51516 -55398 -60778 -41230 17364 -17698 -12988 -16333 -77905
16243 -77905 -56208 -26846 -31438 -87782 -55729 -61859 -101356 -56217 -25051 -2190 -13847 22054
16231 22054 19015 10607 -33570 -54048 354 -33003 -33903 -6627 -9441 -36301 -29786 -90394 -68971
16218 -68971 -16107 -39795 -54120 -26940 -57765 -91407 -71115 -54280 -59740 -88812 -61667 -81660
16206 -81660 -28317 7092 35583 24661 -30665 -46161 -98106 -87067 -61658 -60576 -48909 -48740
16194 -48740 -77715 -82354 -14611 20271 -28464 -46506 -27719 -13000 -8466 -43158 -77565 -76656
16182 -76656 -65965 -97455 -107045 -132698 -100960 -69983 -56658 -80704 -121761 -105762 -79260 -134508
16170 -134508 -155962 -104212 -109326 -78584 -49307 -91400 -93419 -53247 -62189 -43319 -54891 -75507
16158 -75507 -51420 -68903 -66213 -69711 -57919 -45026 -57541 -48086 -58251 -35440 3818 44433
16146 44433 18945 -5211 -6592 -61361 -121696 -95260 -82157 -61812 -82509 -58371 18811 23260
16134 23260 23444 -57920 -51327 -46538 -67059 -41835 -95319 -113564 -66580 -43952 -51093 -82870 -51782
16121 -51782 -5664 4706 -20585 -57117 -70372 -38935 36517 56784 28784 -13691 -14028 -12228
16109 -12228 -6686 -23625 -57169 -21411 -33964 9732 25167 -49784 -91336 -132312 -126009 -60955
16097 -60955 -1878 12829 56155 56676 13316 -23449 -45990 -101563 -121356 -139544 -147932 -111689
16085 -111689 -41056 -473 -26588 -54273 -104186 -139693 -103116 -60759 -40344 -24568 -23434 -59639
16073 -59639 -73341 -28412 -1992 17980 17433 41150 37532 77002 101813 92432 120551 133626
16061 133626 49543 34224 56636 19867 -7020 6081 -7761 4969 28552 65562 67483 50922
16049 50922 63864 38537 -23658 -40337 29043 56099 37778 15376 34456 44088 53858 63185
16037 63185 38141 -8248 7501 18751 -19144 -13795 -112 -2685 -63454 -43470 5755 30398
16025 30398 60095 38395 24133 16656 -23660 -30718 4897 -18262 -52800 -48315 -79948 -89503
16013 -89503 -98939 -105613 -56707 16265 12786 -64027 -98970 -53149 -3282 45764 18027 38990
16001 38990 35964 -22373 -92371 -146687 -126673 -84782 -63763 -39495 21779 26427 -1452 -21504
15989 -21504 -36129 -33521 -3261 41620 46833 96511 49942 -2215 7631 62298 58458 -1421
15977 -1421 -39018 -10314 -41690 -61357 -102438 -143625 -122826 -57272 -65329 -53596 -60150 -79099
15965 -79099 -91512 -72000 -63624 -15560 22091 6396 -57935 -68675 -16599 -1215 -39651 -30876
15953 -30876 -83821 -64126 -33924 -48810 -41761 -49396 -72053 -58423 -19586 58358 59316 36225
15941 36225 72934 126470 86341 -24332 -52079 -53183 -14973 21351 -759 13507 35562 30026
15929 30026 12495 -40439 -100180 -139609 -107222 -38119 15072 57564 -9999 -52614 32914 110000
15917 110000 48819 8080 51430 71772 15618 -30788 -37836 -66516 -34239 8549 -56550 -52795
15905 -52795 -66099 -81512 -66890 -45149 -33808 -24516 -16900 -395 30184 6283 13272 -21242
15893 -21242 -23382 -17870 -437 4821 -20502 -17391 30317 60986 35557 -32034 -24824 21552 36810
15880 36810 84143 97976 93779 49520 39352 34593 -25010 -28077 -17727 6609 14201 47280
15868 47280 74162 57652 45622 55547 51506 62637 96853 66146 75284 96473 63662 -18539
15856 -18539 -42065 -101404 -95444 -23466 303 29173 29877 58685 126606 99734 51378 2578
15844 2578 4309 -3962 -32290 -104564 -98227 -41552 -4061 9767 -41273 -95756 -139511 -128544
15832 -128544 -75346 -63865 8043 66072 23379 -7956 -19704 -55969 -71692 -94224 -70947
15821 -70947 29204 -19999 -51972 -9699 -13034 -58450 -44749 -29513 -35899 -62881 -86365 -124423
15809 -124423 -74903 -3366 -37939 -89443 -99620 -93400 -78620 -84333 -135261 -163829 -132325 -100111
15797 -100111 -76864 -79958 -65374 -79575 -54873 -28042 70 -41255 -28706 -27175 -21415 -65497
15785 -65497 -82266 -43495 -12237 -16065 -62842 -75751 -43447 -36796 -109861 -134960 -104381 -64725
15773 -64725 -43170 -92949 -87009 -71742 -30556 15753 -36677 -6724 17600 11323 26380 81882
15761 81882 36771 -12727 -32244 -62838 -72058 -80237 3350 56507 28463 -22434 -20879 -41037
15749 -41037 -100364 -54340 16312 20594 21565 30176 54681 20935 -23299 -59862 -71804 -63462 -37538
15736 -37538 -55576 -52660 -36286 32823 100066 98960 6998 -50982 -74904 -89738 -66665 -51779
15724 -51779 -62639 -16129 -22849 -28697 -61650 -75808 -133013 -145202 -55907 -541 -65340 -71718
15712 -71718 -83333 -94362 -62565 -23241 16181 39854 49136 -20307 -45794 -53101 -33199 -45805
15700 -45805 -71028 -76526 -89445 -97867 -87540 -40968 -48432 -74659 -38810 -38649 -46327 -7692 38220
15687 38220 469 3591 -3096 -53137 -87499 -109473 -129091 -107837 -29727 24211 7997 -3532
15675 -3532 -33819 -16220 -33511 -43429 5978 -2682 -15554 -65121 -108392 -114233 -60403 -42084
15663 -42084 -277 75058 42495 20221 13645 12480 -33318 -60818 -4594 36496 39150 94222
15651 94222 143167 102707 53053 10524 16512 -22493 -840 71308 96091 32686 36786 66790
15639 66790 64649 22170 7911 41494 52447 121742 74026 -11714 -37049 -53450 -35091 -34048
15627 -34048 21100 3080 -4704 42428 16335 22346 56495 54705 54060 7792 -30452 -73989 -72378
15614 -72378 -25021 57443 64437 10219 -32896 -71100 -53126 -52236 -49756 -22237 21298 -52328
15602 -52328 -12776 -38123 -15278 -21851 -18235 28753 -45124 -65329 -37022 -33966 -29624 -18199
15590 -18199 10085 -24524 -96848 -56080 -90172 -122891 -59484 8779 21109 27721 18505 6268
15578 6268 15752 -25896 -19175 -997 -8511 21825 -8834 -30976 -4249 35335 -5212 -14129 20209
15565 20209 56253 33675 -53557 -81727 -100516 -96144 -67746 -29119 -88434 -99569 -90702 -57707
15553 -57707 -38059 18014 64802 71558 12198 -28744 -128683 -148462 -115916 -99515 -33116 -44597
15541 -44597 -52744 -33644 -113 36642 72411 49699 -40263 -133330 -91382 -128631 -135338 -63374
15529 -63374 4451 66458 76057 49190 279 -57717 -115376 -84099 -53548 -72168 -112013 -101125
15517 -101125 -126873 -116205 -73355 -53061 24694 37173 46564 30470 14538 -23824 -40439 13985
15505 13985 70893 53228 32790 52149 84184 79035 54464 -3324 10303 67800 91221 98540
15493 98540 172334 156879 181832 119432 51678 74966 67448 -3130 12368 14735 -26000 -28854
15481 -28854 -8656 7521 -71698 -85679 -77284 -27583 26260 -11204 -60902 -79667 -54841 -7463
15469 -7463 24013 9613 -15962 -37851 -66678 -56544 -57088 -70608 -66107 -59436 -92110 -127704 -78457
15456 -78457 -46309 -37984 -70539 -75843 -29729 1917 -21306 -20498 -47852 -22111 -19809 -48691 -80123
15443 -80123 -104059 -67487 -63201 -35414 -28507 -93378 -84899 -44045 -26601 -3481 -25216 -1306
15431 -1306 -9933 6058 -24524 -63610 -86366 -52188 45692 60020 34696 -12946 -43939 -50186
15419 -50186 -6025 7326 -38111 -68770 -75616 -60137 -14591 -63123 -25390 19082 -25776 -99481
15407 -99481 -106054 -47164 -52830 -86881 -116124 -126031 -97093 -83367 -91605 -95916 -88313 -75031 -20277
15394 -20277 3670 4537 20582 -36180 -63007 -70610 -93351 -104936 -80923 -89840 -113471 -62595
15382 -62595 -68494 -36934 8728 67809 60607 26047 41524 63950 87486 100484 100021 74106
15370 74106 51843 -4472 -37469 -88584 -30496 -40518 -31461 10606 9502 -17344 -5907 1234
15358 1234 -23545 -31818 -40961 -61133 -60558 2593 47168 106517 84818 -928 -45621 -36931 26278
15345 26278 47381 21937 -31333 -99920 -93541 -43350 -22761 74240 85605 33672 50767 -10616
15333 -10616 -4262 8447 -30041 -132981 -100934 -73494 -33929 -10411 10443 1527 15529 21730
15321 21730 42541 5192 48773 36274 35441 -7987 -43073 -32857 14947 -15630 15944 48101
15309 48101 14713 9106 24117 16702 -50026 -45795 -39939 -62092 -124253 -145634 -88806 -13632
15297 -13632 13238 64009 101807 81740 58753 50522 47172 53307 53262 27814 -2865 -22115 -81976
15284 -81976 -108435 -84656 -92745 -87930 -126267 -118957 -92305 -58041 -80998 -74431 -18708 54755
15272 54755 45632 37204 29667 6931 -14915 19527 48617 59823 22279 -1008 -25126 -18864
15260 -18864 27131 29883 1498 28515 26878 16721 57527 -3835 -17075 -1062 40255 82932
15248 82932 52001 -50251 -112696 -36413 33835 -45625 3125 17710 -24967 -50618 -882
15237 -882 -6156 5721 40065 52256 86787 88145 16821 -40452 -32282 41322 33659 58626 107514
15224 107514 115204 118349 15024 1674 72938 118384 104701 23288 -24641 -23005 -33836 -49095
15212 -49095 -12376 8067 7396 12655 30689 36339 77300 102784 9053 -46292 25852 95656
15200 95656 92988 79246 65876 4379 -57046 -76438 -22798 35922 20296 13381 18387 28543
15188 28543 22671 2484 -38553 -81617 -85934 -89266 -14718 38856 47939 46910 72400 -22680 -71147
15175 -71147 -90746 -88622 -56868 -66451 -96624 -55748 -28362 -45100 -22366 6808 -12920 -75203
15163 -75203 -108172 -94487 -71498 -76145 -78033 -35977 -32087 31752 59584 9424 -22039 -55836
15151 -55836 -35942 38724 92437 46709 -26176 -68590 -61078 -31074 32181 63701 43889 16736
15139 16736 8690 -43786 -7357 -1142 4550 -3738 -31414 41579 66570 26994 -33217 -28956 -7327
15126 -7327 25256 41848 33623 65092 49349 60475 17962 40948 44861 18231 -32008 -22950
15114 -22950 6880 21411 13325 -10107 -25848 -16588 -50777 -10508 1233 33440 41407 60397
15102 60397 41174 33686 16966 -9607 -12768 -22512 11634 46957 74292 52233 -16253 5689
15090 5689 8364 26904 49580 7283 -27855 10394 61960 61244 60055 97250 27853 35157 14296
15077 14296 -14771 -28386 2056 11347 -42828 -92715 -113619 -76939 -71573 -54494 21301 24772
15065 24772 -45304 -47308 -17280 -58389 -82103 -81304 -59629 -55316 7906 12497 -16832 -68838 -65513
15052 -65513 -42262 -50877 -28497 -7293 14208 57794 103464 85271 67586 21788 42562 13112
15040 13112 33743 92308 113174 120444 123171 122903 165110 156860 123109 82991 79419 107472 41520
15027 41520 -11673 6122 -4882 21076 6429 -7891 2261 77075 81266 52246 148728 99536
15015 99536 74832 72358 67764 35925 -2055 -16198 -25101 -30109 -30915 -12825 -47951 -21685 29739
15002 29739 14017 7756 5084 30640 93188 87190 56152 23201 40437 109956 99072 -1184
14990 -1184 -70 51828 117275 77533 57636 9760 -39284 -14411 53670 90679 43473 33108
14978 33108 10131 -29482 -19731 -8271 -28095 -32383 -80585 -128519 -98257 -64779 -64313 -27975
14966 -27975 -16307 -32460 -34940 -64018 -25549 8949 64299 46338 30679 30585 34529 9196 -50906
14953 -50906 -26672 15757 -31368 -16231 -24244 -107256 -33097 45071 49445 -5965 16560 27081
14941 27081 20549 101286 129033 59205 -5394 -16290 12918 4473 -22306 -531 30013 44441
14929 44441 -12865 -41127 -28236 27043 21029 16193 21690 -16831 12412 30698 42598 96460
14917 96460 56960 -16506 -1906 -2989 -26098 18968 -1591 -27137 -51433 -86479 -70830 -16343
14905 -16343 42416 132551 157892 133899 209575 241693 175574 61902 62262 54836 56209 91935
14893 91935 76491 63734 75474 165366 138171 136641 112051 79844 47679 14548 11924 12412
14881 12412 41864 360 12047 14416 -23426 -48645 -31082 -49541 -89686 -93247 -67298 51
14869 51 18616 22764 3038 -42305 -15830 -24385 -29404 42636 20345 -50391 -5598 16393 28008
14856 28008 17435 51174 72291 60752 12178 48312 78586 77142 80907 106644 128458 173223
14844 173223 132543 77186 -3834 11626 66203 44411 57601 -27750 -57412 67183 107749
14833 107749 76301 65643 72201 63735 135499 156927 71133 82479 119409 70612 -40253 -77025
14821 -77025 -65103 -36283 10038 4860 -57351 -38473 -22153 28309 66759 38464 103577 115719
14809 115719 104921 52332 27059 8441 28141 72598 40125 26961 31279 40876 67603 67495
14797 67495 30636 -5520 22207 25008 10456 3974 62394 133673 150532 65778 20587 15601
14785 15601 36772 46522 55839 91275 53626 57078 56638 75684 68859 8843 -32885 -2126 30692
14772 30692 80829 97039 63367 90855 80224 24930 -2121 8922 -27432 -39282 -45171 15283
14760 15283 60416 20443 -11740 -25148 -6690 -7682 4337 -6501 -29213 -81853 -56501 -11656
14748 -11656 4617 32378 70906 68063 2029 -66157 -55749 47414 74708 33983 8248 73832
14736 73832 78369 16614 32761 48338 -24264 4927 54076 99762 61762 42538 39628 6925
14724 6925 13181 29817 37283 31460 57623 58245 46624 2225 -12202 30909 103633 156670 152980
14711 152980 117360 78034 94337 116019 172098 250949 311802 306883 322313 399404 502588
14700 502588 617444 797957 971287 1151199 1419004 1721038 1951855 2097836 2053925 1937855
14690 1937855 1772584 1549258 1204671 946223 785373 624546 520299 429664 338375 285480
14680 285480 309523 335898 258283 209215 186643 85648 86447 70488 73750 140964 154509 103589
14668 103589 98763 53877 22423 52224 83334 97817 96790 97689 140295 162565 134710 146933
14656 146933 167639 128293 153402 215568 160733 70816 28502 104308 160750 145892 126178
14645 126178 129878 148446 151571 148425 66867 5769 -6711 50020 22760 24698 50724 103892
14633 103892 108787 107354 119588 144202 160917 137837 93501 106613 107010 93151 99620 84261
14621 84261 82388 53564 45738 108814 114112 98008 69525 56038 51184 8669 -69326 -49053
14609 -49053 11256 38358 32484 6464 -11735 -62734 -56941 -55091 -7834 43570 61690 81084
14597 81084 120981 116203 72905 7581 44111 40991 45038 41262 17706 31878 42789 44662 28733
14584 28733 76334 88022 73398 -11310 -33055 19135 47485 60461 39127 -1814 -28425 -1270
14572 -1270 -33453 -86810 -91724 -51488 -29975 -16400 35246 72671 107110 157435 202730 159723
14560 159723 71316 44150 24207 51677 84223 118147 103042 47945 62040 14451 13165 15421
14548 15421 4641 -50871 -59294 -36510 -59874 -52573 -40724 -36560 -71216 -88385 -54466 -45467
14536 -45467 -53538 -53558 -66425 -31499 24674 35588 47446 91343 153891 244118 346509 383454
14524 383454 378558 397332 361524 347517 336000 289706 235989 247619 255706 230622 205132 185002
14512 185002 187006 199706 250611 220269 247122 219589 167526 202744 171263 127727 133041 114075
14500 114075 145160 174909 156028 130012 158033 190240 182543 184394 142534 131879 133280 183797
14488 183797 258903 229705 175812 92686 72428 148163 188190 207856 211414 284058 335197 400126
14476 400126 464846 487663 453151 450422 409155 339390 302816 303258 291712 279134 233836 209565
14464 209565 193569 186812 164131 124757 124717 199315 220682 212902 211574 196670 152875 146969 180109
14451 180109 134922 117754 205072 258240 229180 194489 184938 161325 156036 171158 201234 217431
14439 217431 178470 139772 214014 279898 228308 186335 189839 183908 151880 133558 110450 122780
14427 122780 104426 123179 114876 116087 109697 149717 180973 254148 270571 260829 252730 255635 236866
14414 236866 277105 283306 258167 252713 218935 210051 224850 239757 257651 262688 280283 225889
14402 225889 178697 188034 243390 232313 209474 179312 165748 200322 255408 281156 324033 385918
14390 385918 398687 359861 299340 270585 238687 229851 224771 204929 141630 163638 168255 191764
14378 191764 258160 302089 318566 391244 499842 594753 641316 681168 671015 621089 555693
14367 555693 459030 454233 384306 336281 323461 306819 353692 364859 396435 369865 366931 385155
14355 385155 324434 320805 391979 469939 480301 518889 557626 586861 662408 727783 744734 741163
14343 741163 739535 690375 638894 580773 599619 591005 555647 556800 591442 586244 551711 474362
14331 474362 445012 480438 503322 536999 546893 551969 546448 542714 613271 669404 614776 643184
14319 643184 634688 611436 604908 662846 641043 641178 748231 760995 722472 695857 728103 792196
14307 792196 849520 822514 748864 768942 807669 800190 831530 868350 855398 782712 792410 822073
14295 822073 882192 881939 834678 845049 894375 983429 1089801 1166419 1216015 1176314 1146510 1260916
14283 1260916 1338430 1395923 1483246 1534910 1525729 1603679 1686906 1727796 1723542 1742219 1877406
14272 1877406 1948490 2020972 2102177 2232778 2263611 2334116 2386783 2462718 2563442 2648732 2754401
14261 2754401 2819208 2836758 3004452 3172668 3383723 3597074 3819602 4026769 4259292 4581572
14251 4581572 4893723 5291802 5668599 6018888 6437930 6874749 7384620 8016014 8689811
14242 8689811 9414966 10252273 11294948 12544679 14081441 15943267 18170896 20954026
14234 20954026 24391147 28556503 33633039 39605413 46610130 55210708 66562403 82289278
14226 82289278 104776444 137106834 182651348 244082426 320277775 401976805 469142000
14219 469142000 497601693 475589349 413435804 334598051 259559247 198165531 151754441
14212 151754441 117950214 93613101 76088945 63190676 53348799 45528758 38909972
14205 38909972 33301771 28607431 24740784 21547835 18913344 16698922 14867599 13327479
14197 13327479 11971626 10773749 9781391 8921463 8171371 7474977 6857520 6290105 5787346
14188 5787346 5373685 5071569 4806885 4559105 4370321 4158045 3913196 3641255 3432025
14179 3432025 3215688 2982836 2830434 2703971 2610831 2461368 2352909 2190800 2079891 1952538
14169 1952538 1907484 1876322 1731772 1709747 1654490 1617367 1518751 1425304 1396474 1419662 1384578
14158 1384578 1353643 1305259 1258787 1233244 1153772 1096283 1076631 1076957 1069540 1089395 1122784 1068344
14146 1068344 1042705 1023955 968904 870737 879160 855077 834046 775135 723367 710447 675553
14135 675553 703950 590090 510368 514314 514008 529318 473472 518768 546998 540894 507527 538522
14123 538522 536859 507357 439795 437524 450427 462375 477411 475030 418363 401533 356339 295826
14111 295826 292574 346589 401569 406913 353028 342378 363926 367040 344334 364642 383139 377571
14099 377571 367065 367842 369347 337944 379880 437896 429580 447038 514941 574676 618054 595739
14087 595739 530838 452238 400503 355074 373539 330171 279872 229364 262297 309020 284136
14076 284136 205942 185021 171397 151019 74489 16859 -45648 -128565 -161828 -122088 -90098
14065 -90098 -87661 -81718 -43814 -17744 37200 134018 169447 153835 144117 137821 60907 85962
14053 85962 90493 53369 59436 80533 140562 230861 217308 225227 123072 109711 204420 227235
14041 227235 219564 235188 161383 110202 90169 104770 107343 60859 39636 78873 67028 40707
14029 40707 45810 29083 31855 -26817 -53549 9842 54005 81159 81624 95777 146097 142638 116202
14016 116202 102575 47697 99632 134559 123248 119656 128803 123189 140617 104295 77926 100936
14004 100936 148927 200797 221140 183201 111666 68889 83199 124930 140816 77460 40803
13993 40803 71100 88836 67542 13052 -54913 -70669 -49108 2416 78045 75685 54103 105512
13981 105512 193448 188843 173751 145459 83608 73482 83760 79391 18221 49310 116600 186596
13969 186596 171917 73832 71003 57349 -17110 -13930 14104 2264 19363 62403 86143 50550
13957 50550 7817 9400 46538 38283 -4441 11449 -629 -96023 -125074 -88034 -137800 -218206
13945 -218206 -189503 -130791 -79308 -14303 20978 -55512 -87827 -62181 -30548 2668 61183
13934 61183 33393 15590 -26453 -81143 -76784 -66869 -83241 -121363 -95521 -50284 -23460 -75457
13922 -75457 -111250 -161393 -211118 -234064 -281705 -316335 -326437 -303083 -260153 -211672 -194202 -146178
13910 -146178 -80032 1738 50887 92006 96545 68488 38061 30029 84937 144214 141718 100957
13898 100957 123751 173961 186010 159271 133991 150988 191773 175684 138921 139773 118587 114633
13886 114633 131145 142177 102859 48530 67505 74658 53931 52924 70063 25846 42785 60638
13874 60638 85719 83140 85657 70281 60387 62409 50840 78515 143665 138624 115497 142950 142559
13861 142559 116846 46167 6204 31508 50843 70184 64858 101299 86039 59218 69524 44982
13849 44982 4362 -330 44461 42234 11372 -18408 -79473 -173356 -123227 -64740 -27309 1675
13837 1675 11657 -59720 -108892 -55200 -5659 4178 57285 34727 39847 25742 41645 63693
13825 63693 36675 57695 65477 11021 -28745 -49870 -62640 -48821 15014 17896 -4356 11413
13813 11413 17757 11496 8438 -35758 -44505 -43754 -46196 15376 73968 54535 57586 17790 -15663
13800 -15663 -106125 -71279 -36803 -14634 2456 -15260 29224 46506 87270 70680 28800 17632
13788 17632 52677 109258 208979 175023 61196 21966 56150 52069 32997 33714 78035 89528
13776 89528 59879 91823 143560 124347 73832 8119 56914 119851 116083 124719 64562 5414
13764 5414 27314 61072 111334 145160 227518 290513 298364 258587 243834 233253 266936 243597
13752 243597 280526 279663 327107 405654 459381 512874 623445 806225 994439 1209288 1486958
13741 1486958 1790657 1997641 2134248 2154407 1988368 1691763 1386362 1144805 975062 793153
13731 793153 623153 473088 457199 480427 450337 340982 308813 287822 252528 199177 234827
13720 234827 258336 196208 130223 147521 176414 120124 76855 53152 70057 115193 125433
13709 125433 113338 84962 74547 66580 52985 57738 83405 148458 214079 277499 371061 477930
13697 477930 537996 520963 469476 405598 347970 322552 259058 176613 95483 55281 42698
13686 42698 16501 46200 61911 136785 144669 81543 72017 50644 18354 -18573 -1108 12477
13674 12477 18373 7958 -23545 -36240 -65675 -24133 19896 9982 -27026 -44648 -44437 -22322
13662 -22322 31502 23244 12570 16184 -14142 4788 45917 49846 71271 72319 28423 22547 -6069
13649 -6069 -27328 -58058 -39657 14442 93 -19874 -48051 -42597 -42691 -40208 21218 70418 98890
13636 98890 63497 39249 7914 -1457 18532 29770 -3227 -9659 -29593 -23313 13122 76603
13624 76603 63608 41906 34179 48305 62280 6212 -12381 58412 99225 54971 -22253 -21553
13612 -21553 57418 74961 18167 -38558 -51181 -47243 -14203 4150 -46318 -52202 396 48801
13600 48801 27697 8152 74658 88754 68360 55272 2340 -2860 -5065 -43619 -25898 -40240
13588 -40240 -41499 10971 -46942 -89561 -56487 -70713 -33861 -32336 23287 41849 82083 60568
13576 60568 -22407 -66170 -46918 -27131 13912 -882 26856 26875 -15633 -61408 -48002 -44946
13564 -44946 -37264 14716 48268 24619 -52722 -76371 -81454 -95609 -93028 -57264 -14845 -11150
13552 -11150 13741 -29742 -35216 -59221 -74269 -58441 -26715 -40258 3018 20171 6991 -53258
13540 -53258 10593 90743 73982 118010 111195 120818 85511 18151 34268 -3467 -93853 -132812
13528 -132812 -121524 -72451 -9662 33133 56613 610 -31739 -27613 9913 18625 -2119 -29307
13516 -29307 -46288 -71992 -87859 -82425 -23689 -32048 -74813 -87275 -18030 -21129 -74266 3684
13504 3684 45347 19846 24295 -2206 -18525 -6785 -7667 -32093 -26867 -8207 4111 43397 71161
13491 71161 63250 16433 -37 10773 8627 -18384 -27386 -15894 -18389 29492 65822 53648
13479 53648 24387 5969 23028 63503 63125 7310 -68099 -86782 -14837 -22641 -9999 47413
13467 47413 31229 11973 -29616 -22753 25682 23407 -21908 -581 -5523 -38462 -15115 11898
13455 11898 26100 23178 68725 86706 42833 -23975 -62385 -27599 -5026 13723 43854 39935
13443 39935 13967 -18166 -3099 18695 44126 705 -91704 -62913 -41872 -5047 -48172 -38872
13431 -38872 8311 22532 45323 53782 43867 -5235 -28957 9399 -5812 -4957 -5820 -36984 -20461
13418 -20461 13901 4076 -56184 -60878 -26790 -25326 -3239 -21334 -47409 39899 4598 -58908
13406 -58908 -51718 -9295 32224 -48367 -72698 -67712 -30968 -13441 25795 67645 74468 27756
13394 27756 -10928 5606 20751 -4275 32661 53219 81490 62290 31385 -11327 -31122 -49599
13382 -49599 -44756 -57093 -67694 -73791 -17614 12794 39710 72708 100104 56589 32209 9979
13370 9979 -10215 4307 -18996 -40689 -59285 -84393 -129842 -122113 -57055 -25710 -39244 -41932
13358 -41932 -52343 -22990 16130 -17820 34392 89668 56213 43634 40617 9363 -1422 25375
13346 25375 30890 73678 70858 29367 -35403 -21190 36551 -33821 -64577 -112536 -65181 -46942
13334 -46942 -31116 -83246 -98837 -98520 -48785 -25459 -41461 -55707 -57844 1583 54365 60175
13322 60175 -3987 -22703 -19162 -53344 -36101 -68377 -38190 -61871 11450 -6617 -13997 28546
13310 28546 43897 463 7935 48199 56808 33142 -27697 -81020 -67964 -23301 5179 6970
13298 6970 -49328 -76541 -60467 -64654 -60047 -11048 15308 7169 41945 16185 23824 55192 70014
13285 70014 14182 -1276 52698 120772 120805 103236 53818 -12539 27435 55237 15770 -28851
13273 -28851 -61218 -14979 -18570 -19033 -8310 -64476 -70474 -48621 -61994 -77950 -39797 -37200 12703
13260 12703 12944 -38090 -28618 603 -11709 -27504 -49459 -85017 -119561 -119766 -40571 31321 23498
13247 23498 -9000 -2766 -715 3757 1676 -7420 -38078 -19861 -1118 5746 -7246 17540 18615
13234 18615 19121 17387 29926 38273 71171 69715 15832 -29290 -37425 -69212 -46277 -21309 26969
13221 26969 67784 -21346 -97933 -57492 1339 -17847 -61053 -55305 -11817 39465 60183 10793
13209 10793 9529 15287 -20854 -20057 -19245 9183 49917 88763 120311 124962 100144 39956 16597
13196 16597 -18428 -55281 -16646 17746 25329 25109 28571 56261 57156 -2731 -17287 -15296 13122
13183 13122 3880 -30771 -2923 40661 26113 46294 30926 2462 -66168 -44808 -34151 -50749
13171 -50749 -20160 27200 -1560 -9999 -17889 -9930 26231 -6483 -18663 46994 57973 -25705
13159 -25705 -69647 -66820 -50723 19079 34211 53391 68859 37564 65883 49231 54974 50124
13147 50124 26464 27942 14401 9746 18128 35181 20921 31669 87004 92098 100705 150017 117091
13134 117091 52422 -27478 -85240 -78264 -92630 -74901 -35783 -25108 -15955 25233 51652 44422
13122 44422 -2874 -14233 2001 8152 16063 -25531 -98700 -46885 -41961 -54989 -294 31243
13110 31243 42911 62304 93709 87015 43237 -60847 -58616 -57720 -59978 -26053 -37246 50158
13098 50158 95110 11387 16203 60751 70228 68148 53537 56228 73800 111490 120101 74598 -21432
13085 -21432 -137251 -104930 -7749 53140 13406 6921 33362 35856 -5965 -46317 -20317 34609
13073 34609 43071 84144 92624 44701 11829 8592 -4081 -42851 -81624 -39374 27419 35200
13061 35200 -303 -9108 37879 38892 79709 124050 119969 70967 52202 8899 -6777 10362
13049 10362 32951 27873 35288 20195 -59355 -52562 -32247 -6415 -41831 -109168 -79220 -11218
13037 -11218 19900 53838 39066 71236 74881 64887 65820 24786 -7903 -16786 -19647 -32081 -67326
13024 -67326 -116184 -118877 -56156 3022 7282 -5503 67861 28233 50592 62683 81384 126681
13012 126681 89104 72982 47162 14338 -776 19744 43141 16703 -14649 -28837 14475
13001 14475 11887 -18209 -32931 -21457 19569 47548 -62 -62181 -74092 -17358 10956 83704
12989 83704 93781 76989 68477 68832 17907 58352 123367 88675 62390 31634 -20302 -24145
12977 -24145 -16082 -15074 -12178 19526 68330 50502 43384 9088 -54848 -52960 -64752 5877 -4790
12964 -4790 -34548 4951 43985 50699 4010 -21668 -24454 -35022 -6688 55477 33082 16712
12952 16712 20961 24486 -19093 -25060 -29033 -41389 -74367 -37771 -76262 -97805 -57959 -10196
12940 -10196 50961 72915 46078 -6101 -24562 -30724 23839 96034 103053 82889 107063 153874
12928 153874 141052 94177 34274 13851 14405 -17617 -11370 -18250 -7545 3976 16675 33133
12916 33133 35508 32494 -11497 -32976 -59136 -43260 22379 56209 8362 -2448 21637 6016
12904 6016 -4832 -47582 -48102 -7749 -21030 -41184 -10480 23464 4690 7443 60116 68438 59723
12891 59723 40926 35737 -6810 -33168 -47832 -13180 28037 10938 30143 14186 -2254 17492
12879 17492 -8261 -10149 -116110 -95771 16720 72411 68671 58231 40861 22944 38629 20480
12867 20480 40096 36429 106678 139740 166395 165921 134247 92809 52242 69270 90713 108632
12855 108632 107867 68053 89398 56448 56065 95332 67125 74522 32256 19299 22080 3878 -2604
12842 -2604 -10661 -2698 -10183 -19210 -78294 -40289 -2540 38338 81869 84978 87815 37273 -39825
12829 -39825 -79338 -38182 -19623 29248 50268 95996 93625 100563 75537 50149 18942 -15045
12817 -15045 31492 15976 -41161 -57998 -99177 -60695 25124 104886 55863 -3345 50265 77600
12805 77600 17964 -33921 -30444 1289 -2162 -32581 -89396 -55081 -31846 2742 -34057 -19984
12793 -19984 -30595 -69698 -112685 -107760 -74856 -25315 28473 34980 6390 -65410 -97191 -80316
12781 -80316 -73303 -48038 -18053 -8509 -47038 -82576 -21177 -11294 -46669 -27269 -33529 -33805 38925
12768 38925 43355 58721 57512 75721 77846 69150 68763 -880 -11525 46462 72434 64500 12042
12755 12042 -2041 60222 110213 137137 94034 49451 16512 32442 18822 -37875 -90469 -43879
12743 -43879 -25592 -39926 -47797 17135 53815 74579 56971 94970 74249 34706 40924 20454
12731 20454 4107 -15915 -235 -538 -94800 -117708 -115373 -50603 372 -90361 -153424 -136624
12719 -136624 -54219 12584 21126 -137 77550 122530 74319 1808 11844 10393 3316 8710
12707 8710 -31934 -82025 -89429 -82634 -50708 -65648 -51349 -24494 55866 79381 76478 80294 86965
12694 86965 65801 60867 8281 -15502 22059 32819 24128 -7598 -26333 -16797 -21992 2251
12682 2251 49125 40648 1657 -25095 -15674 1515 -5204 -8440 -28596 -1383 35303 37465 42035
12669 42035 36545 17251 -6996 -3228 -29739 -24912 7657 -13185 -25483 -58079 -31981 -1972
12657 -1972 -4030 -30756 -33942 -26668 115 11385 22628 13182 62997 79007 27842 -14596 -57572
12644 -57572 19300 68447 16071 1272 -5083 -60399 12246 84563 26606 -25997 -5895 20084
12632 20084 31082 51721 55685 35698 8422 32587 90116 58170 34416 40511 107274 82575
12620 82575 82662 107038 84199 -44213 -100013 -96594 -37090 -38393 -46636 -24404 -18830 -55501 -68001
12607 -68001 -54477 -11813 -5470 -35153 -25830 -16645 -2336 29924 -4427 -32075 -68163 -101393
12595 -101393 -87263 -42712 19485 82374 41987 -69376 -55206 -18570 19155 54625 80872
12584 80872 77674 1832 30345 36081 14927 42708 29725 -23577 -65734 -67099 -30803 4323
12572 4323 37488 33638 26189 -8888 7433 9389 3415 -17213 9109 21259 8802 -29462 12871
12559 12871 19124 35612 93767 79792 37767 -560 1241 -8448 -529 19494 34459 14432
12547 14432 31072 72271 64182 -12628 -33813 -49243 -52113 -18213 27018 59455 13810 7637
12535 7637 -45460 -5423 35119 11279 -25885 14146 -12701 -76261 -107303 -55025 -22279 27860
12523 27860 44574 85475 86248 -21256 -65998 -14030 -13427 30771 53780 84152 95763 78683
12511 78683 72526 59989 77212 111285 59960 11960 19572 50097 40595 54884 91955 132551
12499 132551 113344 81828 86460 44201 -12469 -295 -19371 -61925 -34076 1815 27320 49115
12487 49115 74610 61691 15198 -26017 19208 -18967 1197 7461 50186 120937 75145 70931
12475 70931 93309 66960 20462 9635 10427 -28140 -21395 -4199 16216 -22420 -43358 -13953
12463 -13953 39592 6681 42251 70845 76572 65205 47155 -9530 -27304 13134 33900 46250
12451 46250 25602 -3572 -23252 48492 76842 29122 44795 68031 27466 46139 88687 76071
12439 76071 86821 105615 116128 89887 28538 12054 7384 -23209 -12855 -2842 55710 100622
12427 100622 89032 69237 87840 57643 14504 -18548 -32116 -19919 -40850 -20342 -7375
12416 -7375 -13157 -56523 -107994 -124571 -112803 -74236 -113483 -141677 -66424 28741 9628 -337
12404 -337 26416 2850 -23716 -28329 -18814 3414 47635 57714 73255 78618 62560 52227 69876
12391 69876 78195 97309 112419 81090 74461 63969 17212 -59818 -23103 53382 65484 28422
12379 28422 65031 68814 68085 89679 15133 -34015 -75239 -57855 -23083 -4242 -32677 -12358
12367 -12358 -18437 -22821 -47817 -12942 -37114 -101698 -117250 -94023 -92020 -84825 -52055 -16663
12355 -16663 -20401 -20249 -24220 -8175 62870 130350 96951 78012 73787 48607 52598 37950 42949
12342 42949 48002 34928 -6193 -4649 32968 47529 37417 -1296 -39311 -81844 -85490 -52259
12330 -52259 -23205 -23820 -11068 23126 75355 94111 66339 14571 -15201 12283 -5227 30305
12318 30305 94424 74022 33982 -5667 -41353 -31248 -50333 -89327 -175204 -125239 8446
12307 8446 17824 -24749 -20510 -28755 -63907 -74073 -85693 -79682 -35410 -36127 -14128 -32204 -43113
12294 -43113 -9408 15606 43358 50586 42306 27961 72651 125458 121354 108373 97624 63077
12282 63077 59710 7814 -26021 -14820 16087 30528 27479 56909 38073 24872 -13493 -11681
12270 -11681 -21780 35533 82149 63444 47321 -16195 -43940 -89065 -49946 -62543 -85336 -13324
12258 -13324 -315 70716 56252 9690 -30862 -21428 9003 10584 32845 10410 25520 19091
12246 19091 25835 56909 53487 -2413 -15753 16197 45088 55425 32522 -8546 -31703 -31201
12234 -31201 -28575 -11827 -29658 -35204 12362 52358 16555 38990 -8125 -38849 -114964 -119276
12222 -119276 -61760 -2137 57192 107464 152030 145060 177922 173290 150133 183548 175470 119744
12210 119744 80258 93129 92913 80809 69126 35074 22700 27362 1938 23435 11322 15795
12198 15795 41787 57094 74916 28761 -41179 -35022 -8814 18290 28515 108534 136892 182093
12186 182093 177962 155844 146830 117089 97264 105847 99852 93352 73880 44619 87287 102795
12174 102795 82458 42183 100860 151779 108594 104323 146465 167573 197205 180408 164045 163496
12162 163496 148632 131152 71632 76240 77567 71770 13542 -32092 20754 48473 59201 52142
12150 52142 5212 67676 148185 166066 133919 93665 48450 8186 19190 26040 92115 91297
12138 91297 9931 -5511 -345 3551 -15747 -41406 -25215 42869 76896 26395 14838 -4373
12126 -4373 7838 48508 95735 105909 100994 63521 56652 52830 33279 56784 109455 79823
12114 79823 89126 92329 107371 66630 -6366 -37580 -7543 -2631 24651 117212 180235 137346
12102 137346 108378 36355 -54315 -49507 -21138 12643 92200 94064 126585 119727 42811 8672
12090 8672 17308 53231 98769 130690 109750 57498 106744 162818 147684 105352 121212 92787
12078 92787 15347 41277 94591 158530 140611 151182 116322 116124 97172 92766 141202 150631
12066 150631 212830 264476 290189 335299 319732 224185 168890 141236 129018 125095 113409 109557
12054 109557 107194 35753 50373 82767 97492 122294 93794 53429 60485 84218 154065 198369
12042 198369 227283 255163 254945 286064 305823 251378 222475 263651 272178 189464 120216 111708
12030 111708 125975 198515 208629 149485 113922 92041 117987 165436 224807 269058 259297 270148
12018 270148 289639 262667 207084 204845 202558 169968 140737 160146 243494 277063 277451 340889
12006 340889 339043 294348 263658 217536 174403 166121 195233 192482 198430 186549 214773 204391
11994 204391 167763 141954 182427 180807 146649 151466 160130 205001 230132 298846 329039 350516
11982 350516 326483 285101 310420 343906 371193 387724 421172 427140 412782 372931 421497 473410
11970 473410 486101 504704 504587 490191 506560 501513 511307 485260 490917 635998 709952 746347
11958 746347 821652 830070 878809 900887 885004 882044 882276 933241 983498 955387 979235 1061823
11946 1061823 1129039 1248492 1413187 1603339 1716358 1740945 1828583 1946939 2069359 2244570
11936 2244570 2424882 2609050 2828351 3052230 3281819 3588124 4011407 4472847 5060168
11927 5060168 5754712 6645597 7701893 8929620 10454939 12360408 14763606 17979372
11919 17979372 22460539 29062943 39160939 55283561 82195460 127834094 201328415
11912 201328415 296983903 354638424 309530926 215588795 139484550 92847801 65349747
11905 65349747 48303390 36901066 28808571 22917348 18566490 15304563 12815591 10983284
11897 10983284 9514902 8357437 7407817 6554002 5812812 5231264 4762235 4293664 3835779
11888 3835779 3421869 3083836 2837375 2669122 2455346 2227410 2051050 1911692 1839169 1744364
11878 1744364 1718702 1727516 1684013 1545042 1426385 1312080 1291915 1218605 1093394 999132 947227
11867 947227 880267 807588 796244 701149 642763 616005 562779 544580 514477 540887 557289
11856 557289 510428 439909 411054 385925 393529 486797 487273 432647 422616 452154 372351 286759
11844 286759 329992 383337 413434 340889 321385 321528 351721 392927 361659 292565 227298 239086
11832 239086 263012 248406 188147 174742 135538 184618 210383 218484 257703 213686 163849 158460
11820 158460 144277 129427 96032 95680 168347 193440 171795 183063 162053 102399 104394 165473
11808 165473 170579 156197 129739 112796 139816 143675 94124 47495 30075 60679 94583 101867
11796 101867 67701 73704 118810 146580 191227 205627 165962 119405 62153 32005 47979 211060
11784 211060 400816 457484 470253 451945 389973 232733 158027 177155 144950 80583 105232
11773 105232 114757 131062 223647 222838 135992 141124 119601 125476 114029 136103 54957 -52520
11761 -52520 -148473 -187500 -182694 -197977 -171361 -102532 -32945 15899 38242 55190 30372 35680
11749 35680 44935 53587 75790 75781 29240 52243 78025 98391 82527 49964 9999 3437 41926
11736 41926 77370 20840 -67930 -12582 49040 53933 4404 17306 49613 39414 -48842 -62551
11724 -62551 5758 109736 92911 63623 63917 -16734 -66862 -104508 -113255 -80947 10904 32606
11712 32606 -81915 -99923 -56357 -9815 109622 154388 184483 115816 38694 -38291 -54058
11701 -54058 -37427 -75420 -79361 -29613 25204 19256 28267 49182 20896 -23232 -13772 37553
11689 37553 76206 90335 13343 -14347 -6883 26989 83244 77522 75115 48746 17115 148
11677 148 24971 8295 7167 25012 12347 -14128 6480 43055 103132 96046 19358 -903
11665 -903 -4430 3016 900 -55623 -48323 -34714 -25459 21770 79803 39438 55945 80683 79599
11652 79599 55500 -5813 -5714 -20705 -90016 -85126 -63047 -5392 39216 39462 75905 43678 -20407
11639 -20407 -42030 -49205 -18614 51058 30991 14862 15771 -10860 -34057 -58455 -6570 30829
11627 30829 47894 45531 -27821 -121905 -89886 -87372 -113520 -95348 -49437 -53382 -35862 -4839
11615 -4839 8434 44970 29663 55682 1921 -72796 -145004 -174458 -157598 -144234 -113324 -140970
11603 -140970 -122963 -34375 26803 17361 48331 49330 42967 -1005 -20371 -19339 -66620 -101567
11591 -101567 -58961 21850 64839 18599 -28260 -11622 41016 68434 34754 -22412 -14732 44156
11579 44156 10773 2747 -29337 -21985 -21978 -34487 8188 22558 33422 73290 79902 116163 149142
11566 149142 164491 154795 172848 193133 156098 161459 87794 52298 60497 -11435 -42015 -38156
11554 -38156 -92383 -128232 -100509 -53501 -20927 -4729 -59901 -16767 -24037 -42009 -65810 -50744
11542 -50744 -13352 -42045 29773 59541 63422 98516 75696 75146 53368 -5435 -16553 25078
11530 25078 -2297 -44910 -5576 32784 35788 56927 76380 36684 -24501 -23144 -24492 -29169
11518 -29169 3948 32929 75107 67334 14177 10664 24932 28243 43408 25603 41051 52887
11506 52887 29660 2681 46574 6796 14266 23936 -8456 -38029 -48095 -55587 -16590 4800
11494 4800 5776 -41209 -41055 90572 87403 24755 28665 218 -2391 18108 21700 4682 -28413
11481 -28413 -35556 11992 24830 57832 73067 12787 -19988 31118 72929 110085 84403 46049
11469 46049 -62742 -37851 -50110 -96262 -37729 16384 -881 3077 -10020 -17546 2492 1228
11457 1228 19297 -35606 -29411 19946 -4606 -42678 -81026 -6357 26221 -19824 -80961 -115756
11445 -115756 -115913 -125481 -108990 -44098 -14485 -34053 -76319 -75937 -37200 3743 -4431 -49 4592
11432 4592 7482 24933 26249 91251 131248 92675 -32616 -88722 -52156 -25919 -25183 34757
11420 34757 115368 163253 136489 107181 156404 164459 129986 115541 115683 64121 87656 76858
11408 76858 2498 12998 11489 41668 89640 66896 48079 52273 87754 77009 42230 63583
11396 63583 27197 -8815 -39720 -9339 312 50899 104836 118404 142037 103867 55933 1995
11384 1995 33331 4838 -17236 5141 67776 88510 46728 32262 12616 -45395 -7988 -10990
11372 -10990 16450 14322 -32236 -33005 -8625 67294 81308 57063 -10755 -62413 -55230 -21498
11360 -21498 -35683 -49401 11850 151 27462 24954 115 28589 40108 21543 -11455 -15565
11348 -15565 -39453 -26224 -21759 1579 29350 -2342 6912 -68077 -146844 -178297 -186472 -169301
11336 -169301 -206757 -157577 -124506 -88082 -46054 -80984 -39395 -9833 20767 81049 66809
11325 66809 22282 25447 6431 -1959 60848 50629 28890 -72932 -56831 9948 55178 48021
11313 48021 22310 2877 18050 48232 71590 35658 11030 21260 -35605 -82464 -77149 -55753
11301 -55753 -21499 -15231 19709 -74270 -132890 -102980 -49623 -28375 -33905 -14331 -2909 -46559
11289 -46559 -120512 -124338 -118842 -119553 -123824 -65995 -84143 -126617 -105229 -35992 -22035 18913 62585
11276 62585 4363 -79499 -67469 -3346 -33901 -41820 -43948 -77324 -27966 11785 36101 48619
11264 48619 25048 -54096 -57578 -60904 -72905 -47644 11465 18362 54753 63072 79830 42649
11252 42649 67103 84199 36599 3684 54682 89797 53857 50932 11623 -766 -1331 -3570
11240 -3570 -466 760 -9650 -6543 -9114 -24999 -23389 -24743 -8213 -57903 -99241 -72040 -1981
11227 -1981 47097 16712 -6312 -31663 -86376 -74488 10024 26489 7992 -52361 -73669 -40313
11215 -40313 -23916 52097 54645 36624 32114 63587 7251 -47222 -55105 -49535 -37195 -117
11203 -117 -5751 -24882 41260 66004 -9272 -52046 -17429 49667 61209 43789 8450 -43652
11191 -43652 -58649 -13514 39000 41069 40610 83164 83181 13597 21957 103253 70594 46713 59158
11178 59158 64255 84357 60732 58595 65259 57383 41725 90998 103358 65000 35576 96870
11166 96870 54216 21003 -17948 -21379 19193 11186 -15814 -3349 21647 22285 58427 116367
11154 116367 88559 41332 -13275 -73107 -56345 -29367 -26438 -45109 -39206 -14302 13156 16255
11142 16255 18975 30469 39961 61147 72075 106161 74913 10640 -4213 25724 25602 17871 13503
11129 13503 -22569 24948 71826 85620 81888 70549 88935 55786 27456 53089 45413 58191
11117 58191 49559 38426 38690 41990 99887 90702 75091 26496 42513 110945 122563 59054 60293
11104 60293 56301 39827 37028 57698 87204 174177 161580 83862 54506 13092 56809 88417
11092 88417 24537 -28345 -12950 35732 650 -16002 -41551 -58499 -47612 -10540 -12333 -9726
11080 -9726 -46759 -60783 -46719 -28621 -22611 -10423 11443 12620 9226 58036 30389 -11315
11068 -11315 -13817 4317 -17031 -90574 -91020 -50688 -15854 15233 34214 -44069 -51449 -38647
11056 -38647 3090 77534 166169 148203 60539 91677 138265 120248 57631 65134 97273 123059
11044 123059 126724 96535 76903 51146 109424 162528 229920 275682 264033 275806 375002 477193
11032 477193 483169 407923 372755 316364 276772 265119 261480 324089 403661 516875 570175 583873
11020 583873 619088 574718 525896 445815 379625 368057 330104 239144 181372 236123 380760
11009 380760 420548 448720 450016 330125 241355 207893 154462 136193 162386 168668 189119 212637
10997 212637 222092 232165 161125 92157 58384 34251 40538 -34581 -29388 1273 11231 -42501
10985 -42501 -43402 -29218 -38395 -3274 6658 5650 26978 71806 73701 31460 53894 62494 4985
10972 4985 -22585 -17869 -27461 -16561 30330 23689 -1127 -59069 -68521 -34701 -8241 45636 45458
10959 45458 43788 11402 -8170 -7551 6671 34018 42005 1160 33323 77868 5894 -66533
10947 -66533 -46075 4019 -765 -21278 -13925 30749 92542 32086 22779 23638 32559 16714 -1470
10934 -1470 -52562 -43533 26650 -19497 16254 13372 16870 34175 59055 56029 26210 28442 30219
10921 30219 53378 36074 71377 55335 77010 104898 32400 -4053 -34715 -25628 6538 31785
10909 31785 68585 110807 89359 136099 151887 86775 40964 58423 5976 10048 46524 81427
10897 81427 51162 18629 24807 71382 90183 41256 3061 28232 67623 133551 196487 154646
10885 154646 106601 41822 70012 115634 65053 87005 28071 32513 86209 79697 75084 88979
10873 88979 60588 58050 55904 100675 140088 126253 66396 23765 66632 92132 65671 81932
10861 81932 119262 116054 94967 134805 146744 117350 3157 19992 104608 169426 220000 208656
10849 208656 179842 170875 130344 134169 142324 118526 124134 100293 71805 117723 102105 138933
10837 138933 172221 191790 128047 119360 107688 77142 35735 63496 72748 59757 89283 194821
10825 194821 217671 128869 74241 77606 18769 -25532 -18880 11380 25603 18291 31815 22417
10813 22417 -4989 49731 59919 3225 13450 8726 47437 92725 144741 137608 78681 106691
10801 106691 97914 87486 64834 26687 25548 41000 24211 46275 92257 56449 19553 86088
10789 86088 89495 76598 45991 27638 62923 8024 6489 79029 85869 101320 84220 119860
10777 119860 97300 118955 112996 133851 153867 105862 82552 58409 -12247 -44587 55301 132141
10765 132141 202706 205863 175835 113437 82763 56170 108937 81458 51611 45460 84886 158308
10753 158308 134050 53336 8312 1283 52143 84810 66528 51831 67299 143221 203850 190789
10741 190789 171287 179585 164250 126865 167910 137176 107522 96577 85200 140274 210904 206493
10729 206493 216541 178120 170755 208909 227614 227189 230409 245305 223149 239662 218959 165097
10717 165097 154646 120229 133343 179733 239294 298065 283434 213494 135045 129601 172728 213393
10705 213393 240914 193442 161926 212414 243660 255273 247724 274256 258172 205838 161093 160047
10693 160047 143924 116545 165428 157161 165030 169628 190508 202419 182489 173624 151055 168895
10681 168895 150600 141592 101236 61141 106260 158686 169450 150479 141423 151623 187949 194720
10669 194720 248352 266816 249902 235905 261499 312084 303637 298100 312975 316990 359924 401379
10657 401379 368244 360111 374631 394916 434531 522107 607619 681598 724385 859835 858652 790172
10645 790172 758551 745254 745649 722007 715246 815208 945503 1024958 1046918 1106368 1192991 1316896
10633 1316896 1572042 1845401 2203430 2426491 2497138 2644890 2792813 2997336 3334771 3868225
10623 3868225 4559018 5531528 6896337 8849344 11526253 15070041 19766811 25599281
10615 25599281 31405534 35278135 35857461 33904761 31193841 29255507 28753942 30135323
10607 30135323 33809648 40172764 49806828 62113942 74031692 80278333 77847487 69613278
10599 69613278 60743620 54326063 51301845 51820791 56090752 64554336 77578106 93822513
10591 93822513 108198701 112880325 104794739 89426092 74100758 62600639 55418169
10584 55418169 52148524 52572051 56576981 63781179 72800337 79869437 79925154 71634889
10576 71634889 59219928 47630995 39050067 33573997 30576894 29652649 30482252 32592794
10568 32592794 35167627 36545608 35051969 30530147 24593737 18989241 14537531 11270420
10560 11270420 8834891 7034265 5740531 4833218 4163991 3608062 3180364 2758002 2471283
10551 2471283 2186967 1906418 1686519 1582234 1435052 1287391 1181644 1068011 996908 929610
10541 929610 837634 809178 794308 724629 663797 523206 514853 539203 493332 462038 466816 435670
10529 435670 419205 410178 395411 388287 341200 294092 271445 282035 289480 300593 267325 214868
10517 214868 173627 218963 258225 277354 331742 375272 320283 265528 257434 269553 242693 233500
10505 233500 237845 201997 214482 145098 107732 60224 28656 74105 117631 87557 95562 55572
10493 55572 44820 77553 109359 91630 107701 150617 154354 112877 25888 49848 87817 107224
10481 107224 111144 108510 110786 103824 122524 141429 210989 192586 184436 174585 123466 171126 160160
10468 160160 69459 45988 31980 54024 112624 181614 229738 151819 94971 74464 52451
10457 52451 63036 58459 87987 115536 115978 123526 74942 117595 142375 140852 136653 100878 40578
10444 40578 24680 -19041 -14957 -33574 -53261 -61405 -79503 -79212 -58030 -47278 -20862 -16722 -54851
10431 -54851 -10290 47391 58352 50911 77188 65170 49155 110786 94363 25692 -17615 -63996
10419 -63996 -46180 -18513 -198 32913 13732 24814 20803 -9574 -40990 -77080 -61313 -71010
10407 -71010 -36757 -7929 -28976 -86012 -133400 -141785 -137362 -92907 -75870 -48930 -61049 -103757
10395 -103757 -94344 4558 -12218 -11058 41604 59667 98138 62265 33501 -6386 -15211 -26620
10383 -26620 8329 -4715 -11885 21011 54547 1143 32645 114623 95061 114039 125440 100474
10371 100474 52387 36577 95403 80050 114458 97616 93905 120480 82536 7568 -25633 -49842
10359 -49842 30056 73502 51487 14789 61222 87510 56388 67109 88078 104048 33272 11994
10347 11994 38301 24922 -9120 -46627 -26537 -7490 -12373 50869 56479 6024 -51447 -94876
10335 -94876 -149656 -86203 -9114 64641 87930 58050 32985 -41409 -92854 -88252 -35916 -22369
10323 -22369 -23899 -38530 -72470 -106831 -62793 -624 40667 38529 -11767 -52967 18173 50077
10311 50077 45265 15457 16924 12721 -2422 -59797 -85140 -59789 -51105 -20390 -61264 -80931
10299 -80931 -49350 -88420 -97810 -93669 -106437 -90188 -76735 -49427 -60743 -101319 -60750 -33238
10287 -33238 -68402 -95365 -89251 -46145 6681 51665 52005 104887 108212 98061 156848 169534
10275 169534 169036 174972 157730 212832 232117 277333 312573 283702 269838 296659 284651 276580
10263 276580 250747 169512 141193 156295 156433 131090 106450 96182 127422 133231 85874 72234
10251 72234 36871 5799 39644 13363 23783 19208 -14772 -33052 -47253 -42996 -43072 11327 39802
10238 39802 -2372 565 21981 40896 51940 113649 135857 145617 82197 27582 -32680 -65319
10226 -65319 -62065 -84534 -82855 -67334 -15181 2515 -41332 -3391 23349 -23676 -4726 -13221
10214 -13221 -10320 54312 37596 -10898 -42374 -58978 -3918 17455 19558 -365 -37052 -32424
10202 -32424 -5527 -7023 4713 21968 -12067 -39352 -15170 8904 11013 64056 36862 -2154
10190 -2154 -14572 36465 42199 11405 -43066 -34963 17695 78886 99090 90967 122378 160814
10178 160814 199661 234043 247822 279498 228335 205348 215650 272658 263556 264797 302755 366196
10166 366196 355950 388629 385652 374023 343828 310721 271447 291701 353938 387788 456248 519140
10154 519140 596920 579103 506753 446707 397750 386360 377282 332758 334854 341155 381017 466520
10142 466520 458453 386013 289985 249602 219760 219844 198965 239489 241128 245399 247668 258735 292489
10129 292489 271272 239070 206727 152622 61263 14829 -5420 7194 19691 47780 11493
10118 11493 24491 76634 67983 54003 59815 -1922 2820 38432 48879 40743 -32353 -28617 -3110
10105 -3110 6218 -9134 -24506 6077 50146 38978 -16835 -43331 -27005 17849 43554 93258
10093 93258 98424 79968 -11702 -94435 -132555 -77969 -20078 -11651 6813 -2217 -20904 62233
10081 62233 111610 115533 149412 116855 91990 67078 42928 3943 -24479 -38555 -57875 -52059
10069 -52059 -96580 -41993 12451 5389 -8972 -40534 -57033 -29404 3180 -46029 -62251 1111
10057 1111 2591 -23796 -62384 -14910 19650 48785 37099 7941 22261 2013 -41339 -74603
10045 -74603 -87488 -103144 -83560 -61682 -19623 -7177 11606 -8711 -3107 -46633 -38598 26409
10033 26409 108467 103393 86198 121970 90246 25901 47205 58564 59824 97091 119967 107165
10021 107165 71719 37210 4515 -1258 13497 -16350 4077 17496 53405 46654 30943 -2384
10009 -2384 4799 76602 115839 85563 -21469 -89922 -100128 -75551 -40696 -76 8835 18379
9997 18379 56637 35099 16491 16963 -9242 -12193 -54295 -42956 -90436 -68454 -47357 -45224 -91869
9984 -91869 -72037 -25220 23306 30812 -601 -5959 13298 19442 1600 -1172 -12789 1606 -9717
9971 -9717 -5353 7015 20455 30307 45454 -20210 -50676 -45670 -20114 -38360 -44550 -33975 -27760
9958 -27760 24956 43560 61984 91157 82267 1874 -8335 29058 20701 28607 25307 -17836 32560
9945 32560 66316 81289 74040 93278 92129 113503 84928 39625 67416 101551 108202 104227 184912
9932 184912 313640 605677 819945 660692 393637 251329 239875 232540 159375 100985 67089
9921 67089 86863 96617 109891 98599 46415 10187 -8820 340 -52630 -79989 -68268 -15139
9909 -15139 9645 22514 68353 23403 22780 40170 23799 -5720 -8619 -24439 -12364 2520
9897 2520 11945 4166 29857 25724 5155 -4077 33372 51447 12159 -2185 27700 72120 60871
9884 60871 53885 32366 2732 11537 35188 -10377 -47762 20738 56235 25530 8115 7350 30882
9871 30882 33821 -78844 -116282 -108255 -143451 -67941 -36561 -24805 9999 25626 2480 -36745
9859 -36745 -46471 -33549 -14785 -67591 -122696 -149541 -130049 -86374 -100814 -117236 -54371 -28214
9847 -28214 22949 56900 33010 5234 1982 -62383 -75378 -59855 26014 51273 11966 26574
9835 26574 88141 94356 57202 22234 58212 23088 55442 38550 52022 41070 -42840 -104621
9823 -104621 -97176 -33088 -74287 -91434 -79512 -26560 -6191 24251 6380 4711 -49698 -36613
9811 -36613 8290 -350 -80059 -136247 -130407 -34859 44632 -28807 -70905 -37265 -75059 -159237
9799 -159237 -128428 -71388 -71302 -82861 -57047 -37503 -24959 -4688 -26773 -13810 -1271 6863
9787 6863 -36516 -18866 23828 13402 16903 8549 25373 13499 22564 3610 -86159 -101667 -93132
9774 -93132 -53956 -39713 -18206 -24609 -96681 -46976 -25734 -55257 -45050 -64561 -65045 -54369
9762 -54369 -88295 -62395 -16668 8008 -18841 -20094 -26855 -39570 -57318 -49965 -32647 -64489
9750 -64489 26465 50729 45625 76551 17640 -34863 -70621 -45650 8422 -8673 -12082 -31051
9738 -31051 -41643 -61835 -37759 -50192 -40733 -19655 2946 -31777 -19563 32369 -7962 -67453
9726 -67453 -19506 45052 54940 1799 -146529 -155362 -45375 4416 46790 81099 33888 48672
9714 48672 45843 14971 -8373 -37167 -58124 -22313 -3454 -5671 39567 48062 17647 55560
9702 55560 90371 53639 66306 88098 30992 -13465 -19462 -78862 -91220 -45985 -13987 -23779
9690 -23779 -28925 -79808 -143258 -116920 -84594 -56898 -35358 -6632 -41848 -95284 -69564 -12315
9678 -12315 20823 -28649 -47099 -50715 -18525 -47761 -17257 26074 71712 98727 660 -52337
9666 -52337 -69009 -92710 -41945 4991 -37639 -70320 8339 84550 119366 148574 195996 286963
9654 286963 361582 504527 682694 694856 521259 356312 223972 127242 82287 35088 -2999
9643 -2999 -28440 9054 -7004 -44136 21034 39580 -20726 -62272 -97292 -105089 -51370 41575
9631 41575 62246 -3009 -3996 -24315 -99760 -119011 -70175 -22026 -18744 -4871 -20976 -32024
9619 -32024 -40762 -61544 -69736 -55581 5654 21752 -35291 -51958 -7412 -42822 -85954 -43018
9607 -43018 42504 27340 39538 48938 48195 45199 52223 34938 10349 -42318 15702 15861 20748
9594 20748 14018 21737 56497 70827 69209 25068 15750 -1690 -5883 53483 120918 106245 39837
9581 39837 -8597 -40653 -18011 5458 -12771 -40511 -5814 26958 51081 39343 -8732 12106
9569 12106 76744 61541 67293 95035 42687 -37230 -34868 5318 -10558 18886 10572 -13631
9557 -13631 1342 -1405 -28387 -6908 -13784 -45476 -8472 10705 46773 18998 -13355 -2468
9545 -2468 -42832 -87081 -60000 -15937 622 -6083 3938 -22373 -34373 23573 91290 145216
9533 145216 128763 63504 59236 67907 47437 14327 43928 40328 7448 17799 31549 -12134
9521 -12134 -72076 -101912 -63208 -4603 5284 41051 28958 -7871 35059 30741 -7389 -48429
9509 -48429 -57504 -44299 -44514 3705 61781 97741 109997 68936 13278 -80695 -99024 -114658
9497 -114658 -110059 -66928 -26499 -55160 -64389 -20161 -30133 -7811 10439 -27265 -22632 -44256
9485 -44256 -44423 -40202 -36626 51270 43700 20589 -197 -19915 -21770 1259 -7632 -13371 -8383 -6724
9471 -6724 13226 -22139 -125840 -87990 -66128 -76313 -58443 -87846 -73469 -47686 -40946 -76918
9459 -76918 -77059 -42761 1023 -40176 -69150 -24059 37766 -5402 -148978 -207915 -127558 -46180
9447 -46180 -40440 -70373 -92548 -127600 -114865 -76641 -8437 -15325 -44526 -13322 -30368 -45517
9435 -45517 -8710 -5577 -5596 -32351 -13057 20424 -23221 -34768 -37501 -73251 -24752 26651 -5868
9422 -5868 -56461 -72758 -86131 -35194 46570 95356 63045 -1514 16261 36545 59496 73367
9410 73367 87357 87068 46703 3946 -32172 -19496 -20742 -14988 56657 96759 113765 53518 21513
9397 21513 -19592 8496 8934 -32901 -106259 -79250 12167 66745 48168 51914 55686 51975 22347
9384 22347 -9055 14857 411 -27539 -31513 -27437 -87941 -72002 -44087 -10943 13825 -34440
9372 -34440 -22396 -2577 458 -4043 -24985 -21906 -38524 -43082 19555 -9796 -30123 -63478 -90712
9359 -90712 -71651 -55266 -74014 -92903 -106461 -125543 -109087 -128330 -105753 -88770 -71913 -65287
9347 -65287 -82006 -76148 -45984 -62155 -68688 12540 86934 49960 -15041 -43186 -52283 -52925 -33495
9334 -33495 -57927 -88340 -93182 -58707 146 65567 93422 77713 17654 -30458 -30828 -21497 -75659
9321 -75659 -77301 -20696 -13830 -16308 -73732 -65850 -9019 -12216 -10482 10617 1599 -5463 18156
9308 18156 35186 -35226 -95284 -97726 -71844 -26747 13463 33371 42136 64306 69353 82173
9296 82173 28732 25429 10855 84993 142690 152780 121698 39266 -8427 -39178 -102991 -75370
9284 -75370 -58772 -80913 -63301 -88910 -100807 -68474 -19966 3897 -20633 -5985 49349 47214
9272 47214 -18189 -23283 -68968 -70394 -35439 -14954 24280 54817 66897 78868 117473 130307
9260 130307 187689 168421 30709 -10476 3866 39836 63978 60698 66113 51010 -5802 -93787
9248 -93787 -88248 -34380 6325 24517 -34317 -66181 -35387 -41593 -47850 -56696 -43473 -46235 -42735
9235 -42735 -19710 -29254 -39453 -51945 -94719 -58972 -54899 -111971 -109075 -12236 15527 -14292
9223 -14292 -64100 -28954 -22653 -97134 -125048 -101280 -51471 -87987 -96701 -61386 29352 108247
9211 108247 85467 20690 -51919 -58133 -19392 -49301 -66728 -55903 -4829 38062 21075 -38552
9199 -38552 -86403 -45899 -63029 -21700 -14959 -24056 3700 -18774 40471 53275 73549 39091
9187 39091 6684 -42583 -29292 61320 32497 -10785 22119 9951 -19487 -45551 -64170 -53094
9175 -53094 -112199 -110506 -7823 63173 52258 33284 27920 -24992 -44332 -22196 -28581 -28930 -40273
9162 -40273 -75542 -79760 -40264 -11213 -1556 -23241 -23720 6334 -35764 -47094 -31257 -43009 -41160
9149 -41160 33561 654 -21408 -54903 -43538 -15159 -28292 -50298 -36491 7586 25760 28936
9137 28936 -2908 -8941 17707 71923 83422 50346 36294 -19583 -36676 -55191 -50798 -28831
9125 -28831 -21100 -36802 -90039 -101088 -69049 82077 141497 130594 91803 32167 -1409 20192
9113 20192 10126 54691 68733 4385 -28318 -83279 -108618 -77723 672 33044 40937 25711
9101 25711 -35570 -31652 79524 74204 20395 3181 16237 -6656 -45826 -30675 -37404 -35848
9089 -35848 -26353 -11329 -32999 -269 27646 51857 45004 -1737 -53165 -97403 -106423 -118295
9077 -118295 -85318 -70348 -79683 -52002 -4293 7678 -16228 -33075 -68013 -93138 -43413 -38546
9065 -38546 -49258 -62794 11561 55843 22144 -51734 -80318 -54301 -50561 -44444 -38827 -19638
9053 -19638 116 -6373 991 -20254 -33967 -56588 -83334 -91088 -13171 -963 -62940 -97068
9041 -97068 -43555 -5648 -7525 -21943 29483 70386 73878 92580 79492 40169 14302 17256
9029 17256 -1926 17830 17349 -33225 -52466 -18223 19543 1687 4906 4139 -16501 -14279 38915
9016 38915 10016 -47772 -76922 -64226 32952 39191 25641 -426 -31519 -32907 -26543 -4812
9004 -4812 -51201 -60223 -45783 -56906 -75144 -63626 -2116 35942 27409 -19768 -36290 -98085
8992 -98085 -86881 -13937 -14429 5676 25575 -13823 -24773 -7208 -33569 -58647 -110726 -76120
8980 -76120 -47579 -38157 23407 9914 -89085 -106000 -85843 -88052 -83276 -51266 -20849 -61217
8968 -61217 -75154 -27001 -14629 34358 65743 20299 53161 58879 57914 34159 -35819 -29286 18538
8955 18538 41879 21009 -3766 -1258 24811 50656 79701 -8455 -53069 -98254 -160136 -140070
8943 -140070 -53821 -37617 -9164 20142 24924 63485 101205 44376 40377 78349 58251 28030
8931 28030 47937 29751 4066 -20649 -67771 -64783 -128390 -117410 -46027 21681 24241 -36605
8919 -36605 -8867 40729 59581 52827 -13314 -3653 54883 77900 21828 -71104 -58158 -68213
8907 -68213 -36426 19108 5686 62885 97229 87259 45302 42260 82626 86148 23982 -7818
8895 -7818 -1343 20619 16531 -24720 -17945 8069 -30060 -21870 12036 13880 -20927 -50218 -13292
8882 -13292 -38396 -76463 -59001 -79300 -46755 -27967 -84821 -96905 -108332 -57076 -16321 -6821
8870 -6821 -11041 -14967 -38618 -17605 -41464 -66330 -33938 3316 8452 -24659 -47484 -53374 -85918
8857 -85918 -94546 -18212 49777 42513 2531 -50132 5517 -9317 -58110 -44247 -75437 -50186
8845 -50186 17488 53608 29500 36859 67152 80291 44043 30234 29306 -19995 -62634 -55654 -64870
8832 -64870 -55685 2413 37301 50070 35356 28789 54600 31346 39087 24683 -33176 -11961
8820 -11961 22610 -13570 19065 -2860 -697 10694 28993 64550 49816 3325 18502 41955
8808 41955 61255 52064 25277 -32614 18452 38635 -1362 -65584 -10766 10955 -34673 -56952
8796 -56952 -49308 -59015 -52113 46589 49348 10009 21651 7828 -24045 -38218 -22939 -11046 -28112
8783 -28112 -50512 -13176 -58084 -4669 9547 22388 4975 124 -39745 -17334 2719 -26937
8771 -26937 -25996 -5553 -4767 310 9743 70824 85992 11278 -78610 -46880 -24835 -63042 -93972
8758 -93972 -91726 -44485 -42703 -34985 35073 78821 42360 24587 27340 15426 31181 53177 35553
8745 35553 -17539 -14098 37907 87062 62876 40813 16229 19765 10238 45729 27029 12207
8733 12207 -63364 -63911 -59378 -75187 -117102 -96264 -11156 -3542 -21165 -37359 -21631 -16094 33360
8720 33360 88514 8920 -74676 -78712 -97947 -113166 -169255 -156651 -102406 -131373 -142673 -107133
8708 -107133 -112484 -78099 -2452 -48836 -75080 -62240 -52267 -65770 -37802 -60238 -13086 44516
8696 44516 44546 -22727 -76143 -41452 -18087 -1059 45260 23397 6931 8166 17835 -12961 -51033
8683 -51033 -11118 37656 -33784 -34777 -16069 -46708 -43653 -59393 -61456 -46084 44523 80388 66849
8670 66849 29001 4897 34514 46992 24881 -15259 -61060 -12405 14302 16406 -20844 -6854
8658 -6854 -646 -42594 -63265 -35983 -9811 -446 -32894 -89854 -104726 -79641 -37713 -5886
8646 -5886 -20805 -48146 -85001 -49064 29157 1920 45372 48213 19601 -65083 -108692 -82150
8634 -82150 -28665 14688 26037 36567 17725 -20352 -8503 -19312 -23712 -49802 -70271 -60516
8622 -60516 -11619 -7176 -18454 -12297 -6876 -1967 45962 69764 62345 35745 21109 65895 64550
8609 64550 29568 -5853 44747 13727 93 9041 -9055 -47486 -115452 -97556 -97018 -110949
8597 -110949 -96198 -51412 -42321 -53238 -14297 -5757 -47160 -92724 -47452 4662 -33458 -53493
8585 -53493 -30142 -50183 -14169 -2933 30089 23342 12459 917 39341 32134 16453 3100
8573 3100 -75802 -117006 -127298 -113898 -56577 -22717 -5408 -3297 -18294 -38871 -28546 10516
8561 10516 7070 14891 47982 21919 6893 21731 48177 32068 71535 75997 38827 75226
8549 75226 77783 46922 37451 57601 103314 40426 9465 2199 11980 33698 14505 -8136 -16462
8536 -16462 -8064 -34364 -41207 -21636 -63612 -11994 -34371 -39938 -18055 -78587 -147281 -103353
8524 -103353 -51445 -60185 -41690 -44928 -46950 -50768 -16396 24572 23995 -17382 -32952 15515 6883
8511 6883 13489 5170 4650 -17505 15280 10038 47825 39097 27558 22018 -22813 -77717 -18460
8498 -18460 7733 15521 4021 23548 2821 -25976 -34527 -25020 -11307 14527 45364 95362
8486 95362 68558 67402 31552 14789 55346 83000 76740 16353 -51043 -69484 -86168 -96353
8474 -96353 -91598 -30508 54062 85405 96643 19793 -9599 27660 42831 62974 43291 25290
8462 25290 41601 67604 36757 28690 14033 -11609 26161 21859 25885 56680 60357 27074 25060
8449 25060 19834 -333 42686 88274 129535 131620 150614 206723 180690 59591 51499 55107
8437 55107 70444 53293 44699 37379 65429 163776 140359 134264 80995 87553 110682 28442 -39584
8424 -39584 -33093 -47810 12989 9194 24335 -17347 -47587 -33983 -10492 -25170 27535 35603
8412 35603 7464 -8066 -12318 11407 -14219 30748 75766 72307 11807 27963 76488 106916
8400 106916 81082 1020 -10072 -37842 -83967 -55516 -20804 5113 25820 23935 -1922 -23629
8388 -23629 -36211 4072 -24116 -20357 -68282 -118973 -97904 -67046 -32309 41163 1738 24932
8376 24932 84465 56047 34605 92806 96826 61883 43116 90830 46552 33131 63711 51076
8364 51076 30479 19607 75649 93864 53656 24855 20314 -26966 -2688 83953 138313 88356
8352 88356 68504 57313 -19509 879 -31118 -20852 -27935 12277 11244 27690 40575 55480
8340 55480 42156 -21881 -18120 -50965 -37176 -24831 -39001 -8046 68257 79441 55631 53058
8328 53058 44436 21425 3201 33569 17474 19560 -709 -8693 34016 63028 44514 46686 28126
8315 28126 3432 -32876 -44072 -91229 -163860 -113176 -54526 -62980 -38496 3614 44533 -5793
8303 -5793 -84091 -65142 5675 17210 12844 26857 50345 39823 -15719 15870 14849 -5966
8291 -5966 -14410 -27605 -43527 -43213 -32865 -55593 -67046 -28345 -1373 20076 20797 43401 52813
8278 52813 -22013 -10624 20351 87838 69603 9606 -80702 -90262 -109620 -71378 -31171 -27247
8266 -27247 -61073 -51934 -46104 36709 50819 -17718 -41965 -41276 5984 37886 8333 -35162 -70581
8253 -70581 -64882 -13652 4440 -35756 -114506 -135406 -77116 -82908 -73668 -6044 -21995 -27755 -28419
8240 -28419 -55682 -86170 -66263 -76204 -76054 -64023 -129464 -135502 -124395 -115884 -49789 -46619 -34359
8227 -34359 -17737 -21855 7204 76867 100426 56004 29577 37523 104857 101423 65868 44733
8215 44733 47029 28212 55176 38425 16032 -30229 -65037 -37074 -4233 74759 12357 -59872
8203 -59872 -73940 -135927 -125952 -143229 -137230 -90286 40060 15335 -21928 -53750 -39958 17391
8191 17391 54682 43349 38095 69557 104747 92400 79731 81885 27058 -77916 -79726 -70845
8179 -70845 -48268 47971 24838 36740 67339 60333 58946 7900 -55775 -101050 -70159 -15546
8167 -15546 46210 76695 54305 36069 67003 61709 6040 -30009 -25073 -4274 -7695 -24849
8155 -24849 22492 41250 46549 56269 92660 113955 79309 44026 -8664 -15449 -4174 38105
8143 38105 30936 -50986 -59344 -43670 -2319 28945 21440 10792 30473 51416 64966 4802
8131 4802 -80910 -103747 -111160 -61817 35516 9749 -34297 -15923 22406 31141 17925 41168
8119 41168 60312 40835 1268 -44685 -64366 -86246 -119767 -133720 -116050 7963 13044 81935
8107 81935 85387 43527 65020 52767 16310 24536 26188 -6270 -29122 -13063 27765 57045
8095 57045 53122 36378 99896 147510 103890 83216 102123 66534 42051 6940 -24374 -18641
8083 -18641 -41706 -45789 -44403 11613 48186 21479 5101 11063 -1783 20876 42657 -12200
8071 -12200 -63902 -84151 -57561 -40307 -42065 -47721 -47073 -58872 2043 87643 34354 23578 39072
8058 39072 -2651 -26811 4496 -47027 -66437 23321 31319 23920 -37878 -56072 -44391 -53007
8046 -53007 -37333 -14574 33663 32487 3985 -12920 9610 -15689 -58968 -68027 -42041 -43123
8034 -43123 -58547 -1241 44866 -40427 -90732 -45078 -3548 -27936 -15894 -57614 -20385 22152
8022 22152 18311 64116 144231 162444 75107 -62132 -130531 -119159 -42934 -2334 13646 23582
8010 23582 -10237 -43540 6338 -12944 -42600 -49872 -10090 20626 32991 30710 59424 69995
7998 69995 41153 44727 12543 -84156 -101055 -97362 -61940 -41016 -59341 -54780 -79632 -4471
7986 -4471 43034 25721 39534 25946 17941 -54959 -30791 -16056 4506 28653 19308 48375
7974 48375 32771 22006 -13363 -71838 -86189 -37360 -1383 20684 -20041 -72448 -64086 1920
7962 1920 59679 2382 6728 15435 34570 70617 65267 31902 24103 -4979 6423 -26918 -10216
7949 -10216 67300 99091 87456 87493 109805 98283 62684 72587 45564 25668 16812 0 -47575
7936 -47575 -30550 -18456 -17243 22079 -16486 -6967 54134 -7502 -63083 -79515 -57024 -55802
7924 -55802 -23114 -6351 -19367 -25033 48676 63695 84277 63309 -1320 -39652 -88048 -104355
7912 -104355 -52125 -56994 -1561 13756 -45223 -45013 -40954 -18070 23212 35662 30388 48669 69062
7899 69062 29343 5218 -17381 26446 15825 -7105 13046 6687 41208 45487 46523 7180
7887 7180 11244 30935 -7635 -32718 -21951 7073 15329 43847 70459 91523 45676 17556
7875 17556 4996 42558 94430 127694 136222 105562 69548 2618 -22492 28268 72674 31431
7863 31431 27372 33172 -34285 -62413 -36814 23140 43814 68751 61720 37347 7084 6200 -2487
7850 -2487 -8898 10964 1959 49121 104025 141802 68431 14390 -24449 -68495 -103419 -102042 -110745
7837 -110745 -62780 8524 7884 -32275 5411 -8813 -55352 -40559 -78949 -95841 -39302 -13120
7825 -13120 -33587 -42832 -40182 -48515 -45645 6214 30038 38558 71205 66950 -4602 -34009 10790
7812 10790 106597 101809 68808 18603 -46229 -29054 -22271 -7054 -40204 -7570 80177 84879
7800 84879 46741 -14942 -46975 -51793 -71114 -22426 35229 -9292 -26345 -21105 -48102 -70728
7788 -70728 -53679 -54314 -17513 -36060 -49459 -104170 -159158 -138693 -107146 -118938 -110651 -128349
7776 -128349 -186493 -208397 -178148 -178232 -114704 -26168 -27712 -86719 -53668 -45672 -2883 8960 -16219
7763 -16219 -12897 -16940 -61218 -43250 -8497 -4382 -11850 -36527 -48904 29010 24958 -29278 -59901
7750 -59901 -37999 31255 63128 60248 45434 75281 79622 116150 87034 4870 35666 28475
7738 28475 -9204 38333 32167 -9354 -70679 -36480 -325 -3933 -14491 -33798 -125730 -178267
7726 -178267 -133928 -96127 -92655 -51330 -7533 5711 -19741 -56460 -126130 -82079 -24977 -43190
7714 -43190 -52538 -17616 -45328 -59820 -101405 -122237 -56552 -8332 26625 -14425 -33701 1106
7702 1106 -6989 20874 54597 43690 -61414 -86203 -68083 -70316 -131305 -185383 -138545 -95021
7690 -95021 -50101 -35822 -69009 -51861 -25249 -30792 -26077 16511 1941 -60578 -151890 -106522
7678 -106522 2330 32329 29262 26997 6429 -53660 -37440 -9039 23328 -2765 -7840 -43334
7666 -43334 -46917 -47568 -15700 85565 83690 55694 44393 46855 75526 51149 26339 7679 29962
7653 29962 12624 -57587 -49707 -40207 -60158 -4974 -48456 -3231 43426 -11783 -6515 -3101 -3039
7640 -3039 16617 53137 36676 44550 5257 -38273 -51410 -122266 -63136 -46119 -9163 1564
7628 1564 44037 23798 -42129 -38260 14721 49755 18848 -938 10824 -4903 -32494 24888
7616 24888 58869 62941 24056 41610 36412 52073 22845 28959 75255 72643 76367 20503 -16118
7603 -16118 -71275 -55295 12321 37730 -28980 -35385 337 10357 -38478 -60164 -82789 -28442
7591 -28442 -12797 28979 67384 60168 34237 -15627 -55483 -64767 -42568 16330 37367 27343
7579 27343 42125 13277 60902 113867 39907 -8063 -44595 2762 72343 88052 38850 20840
7567 20840 -13206 -39449 -25505 -12958 -11821 -7876 -22918 -2006 -10227 -6891 -40590 -41160 8283
7554 8283 4865 -12247 -52347 -95433 -58031 -4114 15688 21254 -37259 -61155 -73568 -34651
7542 -34651 28459 24906 -4541 -24399 -85670 -122668 -88426 -34298 -7753 -33887 -27312 461
7530 461 -5613 -23085 -47509 -46031 10744 34239 22895 22230 34197 51274 25402 60348 -929
7517 -929 -80798 -89266 -88303 -35900 1271 -17373 -66577 -138931 -165789 -175828 -108498 -54800 -69567
7504 -69567 -127252 -153538 -96088 -50479 -40539 -26663 -11587 23212 -12512 -39614 -21466 22378
7492 22378 -382 -28786 -27587 -6905 9148 -8535 -62591 -111590 -76061 -53176 -115244 -163364
7480 -163364 -87566 853 25086 35218 -13523 -68200 304 14787 -720 -13300 5864 -30697
7468 -30697 -33942 -45704 -36371 -42376 -635 -28994 -58205 -102313 -94902 -113530 -131253 -86176 -65636
7455 -65636 -80490 -98344 -53335 -8128 -19563 -10591 21385 58765 6483 -32102 -6527 31959
7443 31959 17043 27485 28858 3527 45696 89508 29996 17272 -17177 -12588 49466 61732
7431 61732 22762 -4335 38541 8192 -2997 -17252 -39226 -32033 18140 3810 -52777 -4973
7419 -4973 12589 -41904 -26484 -8412 -2826 5421 -5953 -46977 -3771 -1495 14850 20806 7220
7406 7220 -20204 -1919 -51322 -73404 -34079 15120 -1273 8799 -17581 -14857 -26200 -32462
7394 -32462 36757 29357 -36632 -23444 -8307 -15382 26325 53259 -39530 -78059 -70610 -60796 -48710
7381 -48710 2224 91805 89324 37915 36416 19494 -3206 49261 36147 42555 5952 8814 28425
7368 28425 -35007 -54068 -38885 4585 46426 47325 -5147 -15495 -12880 -22985 -57363 -93614
7356 -93614 -32656 -16733 -5249 -46320 -93502 -37055 3934 -6484 -28192 -10288 -35384 -71696
7344 -71696 -92453 -143745 -147594 -64287 -47746 -52563 -17793 19710 14918 21970 -8816 -47599 -75891
7331 -75891 -30608 15457 -5971 17785 97888 85565 70856 68747 68859 49385 63413 46816
7319 46816 15758 79702 68300 -3466 43614 108374 120592 85256 38806 -22719 -48490 -58104
7307 -58104 -54928 -67989 -43549 13105 -47483 -35911 21971 -20419 -99055 -130338 -82417 -51589
7295 -51589 -98589 -164711 -92436 -82004 -127410 -134625 -95368 -56034 -40663 -1501 -8307 -41418
7283 -41418 -27394 5767 31430 -19072 -30223 -50325 -46443 -4791 10838 17563 -20051 -36534
7271 -36534 -5558 -18878 -17177 -47233 -102116 -118343 -71418 -46401 -36566 -52829 -64640 9735
7259 9735 55239 116356 103346 75732 59821 24746 20801 -7475 4613 72726 64327 -3804
7247 -3804 -63214 -98264 -89566 -86925 -62319 -25849 5350 21298 19747 -11256 -76194 -58712 -14314
7234 -14314 21837 9218 83081 108075 68023 47016 64113 78570 63158 32066 42591 23735
7222 23735 52681 70913 11850 48160 65447 73266 64892 2201 8577 -24710 -11475 -24252
7210 -24252 -48060 -70372 -77620 -40410 -37059 21559 -10935 -51104 -48137 -19226 -14535 2352 -18574
7197 -18574 -21066 11394 34973 39865 294 -21907 30849 25873 -11633 15572 38193 25197
7185 25197 -25394 -27142 -18448 5645 78424 98823 37814 10327 -56255 -84765 -79740 -80423 -38341
7172 -38341 -52216 -57257 -107006 -124342 -17345 25129 18540 43020 43934 22162 -4927 28599
7160 28599 1751 -78938 -92630 -5220 -16905 3015 -27064 -72238 -82300 -8803 32745 17495
7148 17495 28109 21681 -42731 -27989 2357 -31079 10616 -4020 -57298 -56095 -29057 -53725
7136 -53725 -51532 -21012 4451 3038 -36515 -30534 10781 32941 44385 -23449 -50412 -34777
7124 -34777 -73066 -106536 -104813 -103936 -126347 -55977 -24562 -10698 60992 125153 80023 47805
7112 47805 24890 10056 -3523 -582 11095 -73223 -45020 9096 -80246 -97312 -63106 -61012
7100 -61012 -85471 -105619 -62744 3249 34941 -5182 -15176 -26778 -27658 -10459 -3612 -416 -31839
7087 -31839 -28766 58940 51105 26127 -14987 -12662 -13648 -35180 -3240 4989 -28065 -42333 -24657
7074 -24657 3344 20797 31776 67625 79426 53566 5007 -11557 -38809 -39438 -66473 -31521
7062 -31521 55842 55742 10287 1120 -3376 -36346 -42671 -62620 -35105 -583 51636 45419 23932
7049 23932 39475 18675 -22411 -11015 -7516 -23184 -32197 3151 -3 17614 33033 28388 34807
7036 34807 35858 2368 19336 42323 -5299 33133 45544 10855 -38920 -78267 -102094 -97139
7024 -97139 -51646 -50743 -28657 25845 -7444 -73958 -71143 -37873 -4667 50322 55588 23985 19548
7011 19548 37769 50252 19703 -19516 -67298 -78758 -81021 -60753 -31860 -13832 19032 -17787
6999 -17787 -41430 -6497 46929 49302 62985 63642 -1583 -74798 -72966 -66599 -28253 40322 58549
6986 58549 13973 53459 111078 104095 55258 -32721 -74393 -28469 20886 20709 44844 40609 25112
6973 25112 30916 28774 -13639 13130 44016 10752 -16140 -6101 27913 59400 85063 72485
6961 72485 30238 41008 41559 24247 -3792 -62173 -127233 -92266 -50893 -7397 -3559 30202
6949 30202 17141 536 20450 66265 65503 13111 -9960 -64692 -41920 33556 72433 76780
6937 76780 113297 122817 93980 3650 -97337 -65595 -23239 -1986 -6260 34221 55832 27449
6925 27449 -65286 -71994 -16798 7065 -41643 -53926 -69550 -24892 12514 49616 97980 77910
6913 77910 34360 -1142 13816 9714 -12929 -14869 -10517 29263 27930 20869 11599 -47970 -62895
6900 -62895 26201 54901 36903 35485 -23526 -96504 -77043 2109 12783 61745 99484 68889
6888 68889 27573 15561 16383 43035 20997 -60012 -57614 -69087 -52363 -69468 -76237 -80955 -79929
6875 -79929 -30322 606 33307 1364 -12522 49256 24624 -13379 -29831 -7310 -6520 -3312
6863 -3312 50181 51931 73619 25327 19889 -14041 -26609 -71656 -18278 40221 33594 -4853 7288
6850 7288 12037 1292 41872 14579 -53116 -76746 -35776 -5983 31082 -24329 -47218 -100371
6838 -100371 -133416 -87721 -56118 -3001 4021 -25208 -46975 -79907 -70182 -42941 -12452 64224
6826 64224 101010 60063 30924 33726 24432 21734 -36434 -24553 16694 41707 70069 17282
6814 17282 36791 57984 41598 10921 17751 26335 34837 100736 115886 30910 25493 6132 -17825
6801 -17825 16297 30518 22822 36757 11611 14268 -18594 -16696 -13986 -35998 8181 -34334 -38477
6788 -38477 -357 7151 530 2118 44587 39994 6570 -20321 15805 -16785 -65238 -95842 -119657
6775 -119657 -73852 -46547 -55300 -36120 -32545 -33057 -51416 -65924 -32768 -25071 -45518 889 10939
6762 10939 43936 54263 33050 5450 34924 66763 53311 75635 65092 6871 21312 -17957
6750 -17957 -15499 -21783 11842 10575 -13899 -13715 43643 -26243 -101177 -63286 -47514 -113460 -207565
6737 -207565 -230321 -131661 -65584 27554 26335 11502 42614 92136 83295 20137 -48758 5848
6725 5848 -11610 -88684 -106216 -61105 -12098 5690 -45586 -106061 -78710 -75862 -61106 16232
6713 16232 4616 -12998 -62187 -57826 2035 33494 30563 70806 74127 21545 35519 9053
6701 9053 40253 82053 90334 28257 11363 44032 2428 -39897 -72646 -64070 -25580 -32549 44971
6688 44971 51425 43507 2799 -52367 -68830 -56151 -57747 -37126 -17795 -6705 20868 15865 3437
6675 3437 333 -17980 -71271 -99528 -95913 -83416 -67053 20262 -4240 -62627 -51768 -29121
6663 -29121 19313 53441 102594 47666 22539 76279 51631 -26513 4537 23479 23205 84809
6651 84809 97316 79733 68685 68832 67783 32094 6380 -6810 -41713 15028 48594 49776 52858
6638 52858 15004 -8163 -45739 -16468 -580 12860 33664 -19076 -77909 -64687 -49322 -49284
6626 -49284 -82862 -64706 -28665 -12605 -51892 -104496 -70323 -51928 -19756 26743 -22149 -51945
6614 -51945 29118 24057 69680 111918 53421 20007 4437 -54222 -101377 -51030 -53273 -20420
6602 -20420 7083 24111 6030 5572 8476 -13876 -40603 -67090 -50513 -86304 -110970 -79117
6590 -79117 -68197 -42861 -42494 12462 69922 61760 85766 93820 17390 4668 35143 18596 -6622
6577 -6622 -43015 -54936 -51503 -36821 -10307 15045 51425 59354 46903 17894 14986 38045 30789
6564 30789 29461 14307 41818 32721 22419 75919 87349 83498 58461 68558 21748 -73337
6552 -73337 -90490 -43825 10292 -1132 15431 39170 50775 7947 -15696 7897 9369 41681
6540 41681 32057 9665 -12310 -3511 22649 28836 19859 -44608 -141758 -133221 -16446 -11542 -79578
6527 -79578 -122781 -108163 -66945 -83916 -135968 -136807 -88619 -19236 -20656 -30836 -22601 -51128 -52340
6514 -52340 -20541 2611 38529 11815 5866 -75618 -81440 -56161 -56955 -110825 -50319 -11581 -75497
6501 -75497 -71855 -76454 -108338 -100042 -51417 -5816 383 -20852 -13932 31091 75495 70446 40704
6488 40704 -37562 -112357 -137352 -146892 -140243 -92774 4023 47858 58123 18214 29791 25
6476 25 -15019 24667 31587 39220 -1992 -39651 -21806 41463 73594 61331 11223 34165 16425
6463 16425 7369 -54907 -76316 -28978 748 1202 -19635 -28721 -35700 -24474 -20014 -32197 -64503
6450 -64503 -87081 -131211 -92316 -57116 -1453 49045 34113 -1232 -13141 34809 39911 27376
6438 27376 13393 10171 41272 47584 56851 23480 -9813 -35876 27217 13212 -8834 -10215 -23203
6425 -23203 -10880 7601 -1762 47093 30686 17905 16758 37375 49046 -3634 -67102 -40662
6413 -40662 -63021 -97728 -63702 -15523 24896 9732 -21619 -88452 -112214 -47132 16608 -14929
6401 -14929 12847 27452 -26689 -29649 -55135 -126699 -139646 -93749 -104452 -113215 -141343 -118184
6389 -118184 -89443 -82076 -56564 -30685 -22030 -35028 -20969 -18949 -26434 3698 20536 42898
6377 42898 82401 97143 60996 -8821 -38141 52494 63865 25686 70813 92616 83826 35303
6365 35303 -7193 3081 6328 -14297 -58306 -59858 -28623 38958 40347 -1950 6071 30030 58006
6352 58006 40020 28130 59168 -8479 -61080 -57428 -64613 -32707 -11773 -58701 -33046 2185
6340 2185 14669 19119 -26311 -76163 -59029 -54022 -86301 -112486 -75108 -37871 8365 39858
6328 39858 25677 21027 -19282 -4248 -23763 -17511 -17438 -5969 4574 29376 77581 48504 -346
6315 -346 10323 -1509 -54796 -43912 2310 -9092 -35953 5855 69625 16055 21414 23361 44877
6302 44877 -4502 -35922 -66874 -50679 -70676 -61836 -37921 -6896 17534 -56572 -90005 -38201
6290 -38201 11876 36193 47804 8914 -24668 -47108 -60822 -34187 6992 7161 51095 103511
6278 103511 69181 97829 72350 7648 -34901 -57235 -77338 -42259 19555 -10213 11032 21267
6266 21267 40924 84563 98254 40639 4069 -2305 -10338 12705 9856 10045 4856 26135 -7330
6253 -7330 -24365 11332 69105 34225 2122 -79873 -104314 -95959 -52208 22948 66652 59557
6241 59557 91185 27147 9572 34824 36855 -51761 -58995 -22719 -35577 59042 97948 70225
6229 70225 53732 35136 45187 40864 -32210 -43897 -60877 -83291 -53737 -30670 -33554 -13745
6217 -13745 8825 16390 -11832 49175 107465 154450 118399 57743 15363 22073 26845 43590
6205 43590 100032 69448 24667 52354 -8847 -17843 29349 13661 14418 30290 4267 -6008
6193 -6008 -13218 -35665 -9906 1836 -49166 -13027 -20647 -53183 -50129 -94293 -104862 -127505 -87726
6180 -87726 -48656 -15509 -27548 -41789 -18444 4295 36291 41591 5625 10733 -15261 -110654
6168 -110654 -134352 -45083 9394 5206 -10298 -32589 -25591 6116 2583 -5495 -27829 38622
6156 38622 67371 57253 66483 27201 -44167 -10437 -11718 5195 44658 29518 -41507 -61399
6144 -61399 -24800 63210 58142 78024 109850 53385 50988 57227 51848 24474 -12724 -9729 48201
6131 48201 84670 99497 43929 7581 -4094 -45124 4571 6065 -14765 -14627 -522 -52132
6119 -52132 -33773 25454 52522 46613 75875 33686 24067 37572 64029 57437 -72 -9777 30001
6106 30001 33090 59515 41838 4402 3530 31696 13304 -490 41677 11760 11800 9971 -85850
6093 -85850 -122793 -83895 -51992 -12802 17619 -2083 -11249 3041 -26533 -75037 -63875 -36103
6081 -36103 -62013 -62337 -33535 13410 23779 31664 18257 8036 25650 30787 -17037 -8486 -55471
6068 -55471 -10982 31145 84244 109415 88915 65397 30645 -39331 -63129 -30389 -47032 -47064
6056 -47064 -23251 -45258 -12918 69089 57857 42142 96088 101634 84104 25040 61108 101521
6044 101521 102751 88100 3649 -33891 -31851 -1873 49386 44575 12769 12721 -19887 -24346 -6793
6031 -6793 -29433 -8609 13240 -956 -10967 -25469 -60110 -118042 -48085 12272 34562 20819
6019 20819 -24680 -175 24447 -18159 -18331 45477 91676 64427 70734 116751 96737 35966
6007 35966 2674 -58267 -39937 16420 15462 7093 -23522 -9275 -14996 -32879 3966 -65326 -109491
5994 -109491 -84376 -53613 -36501 -44459 -72732 -65159 -31030 38542 80742 60718 20678 54622
5982 54622 48739 -2528 -5493 34137 21127 2244 -1350 26825 55165 113144 159661 119030
5970 119030 42591 -5991 -40491 -40488 -46797 -72868 -32020 16126 27524 -3100 2709 44389 15894
5957 15894 -52279 -84925 -30157 -3147 -65979 -29683 -19631 -4961 -48062 -52536 9669 56458
5945 56458 21874 28111 22971 59965 9007 -43690 -64318 -23830 26140 9346 15239 47506
5933 47506 28098 46423 19125 35479 33628 47531 -1144 -26890 -30239 -21618 -24353 -16085 -18297
5920 -18297 22939 58101 83778 65889 20693 -73368 -71659 -6372 -17063 11328 34153 32440
5908 32440 -7697 -45412 -63214 -54793 -69375 -48619 -12950 -57869 -93454 -45272 13088 67052
5896 67052 23849 -3270 -14666 4287 -19781 -59252 -68312 2096 62827 55990 -10604 -71577
5884 -71577 -72725 -86589 -58398 -6698 5038 20884 15898 15639 55266 34850 17047 7243 26643
5871 26643 24087 19005 -8497 -15383 -52785 -53568 23289 25402 -5085 -27282 -37602 -79816 -61260
5858 -61260 -1591 25852 15261 23296 47002 58063 10122 -3161 15276 3064 -24862 10244
5846 10244 31776 53914 94723 44649 5644 27196 14773 19253 -24667 -3160 -15316 -1642
5834 -1642 30601 22556 34344 88145 116090 75105 15570 -13002 -73424 -107540 -82240 -29923
5822 -29923 42366 21602 -16467 -9103 -19776 -50307 -2045 -40229 -62914 -69670 -124464 -71875
5810 -71875 -64484 -95944 -44206 19710 20109 42619 95486 91438 81622 83643 50558 3962 77969
5797 77969 52697 30926 4714 -17674 -23034 -9232 -37981 -30065 34110 46412 42129 3717
5785 3717 60590 49164 117884 67873 21628 36559 64974 47232 43182 47318 82913 48590
5773 48590 57744 46596 63642 20796 -38789 -38679 -29850 -2695 22571 37064 8590 39195 12071
5760 12071 -53928 -89250 -129096 -76783 -33789 38521 64606 29991 -7867 -50291 -59073 -61565
5748 -61565 -54705 45832 105600 63268 7108 19093 15909 27028 -20601 -63110 -100091 -42029
5736 -42029 10475 61079 66921 20486 -39594 -132917 -114533 -80284 -8546 72210 87103 62640
5724 62640 53622 36171 -21332 -57797 -40126 -33610 9918 9159 -26377 -53785 -34888 -45108 -66245
5711 -66245 -79069 -65404 -58341 -108196 -127983 -139307 -48452 -23955 18373 75217 121673 86131
5699 86131 51676 28951 45565 42742 43958 53041 32438 -11342 16481 65191 28147 53150
5687 53150 47750 3344 -9098 34013 43452 -12406 -32921 9827 24099 7364 31642 41205
5675 41205 -53113 -61566 -33265 -33684 -24629 -5203 28340 24204 -19217 -40881 -38497 -26709 -30797
5662 -30797 5168 17339 16965 -46898 -33441 33672 35091 63821 40936 28991 73861 70705 36124
5649 36124 -11647 -59485 -34284 -8952 20592 3921 -46217 -58212 -50180 -46122 -25285 52663
5637 52663 100795 53642 113517 124725 76310 26302 5835 16592 44799 62979 100463 94214
5625 94214 61156 52861 64735 79498 100859 85445 34509 75538 79042 31370 -25910 -66898
5613 -66898 -86935 -66588 -56601 -117854 -133085 -70878 -26525 -590 35588 18444 -18958 -104555
5601 -104555 -150559 -80938 3703 60960 25218 30041 24216 -2046 -11958 46380 47372 -4102 861
5588 861 1625 -35264 -67739 -58189 -44019 53521 77434 71385 87580 100489 82021 66937 74591
5575 74591 64890 -18197 -14395 -22070 -88975 -152502 -146194 -74138 -50034 -29827 -28261 -38087 3110
5562 3110 9558 55383 68373 12469 -66705 -77553 -119897 -80805 -65211 -66966 -84833 -49309
5550 -49309 -25563 -42923 -19820 -7918 26657 5100 644 9620 36513 76230 97976 52726
5538 52726 69198 80282 37358 25295 39693 13935 20241 11159 9754 -3929 -53980 238
5526 238 50831 42734 33031 65282 4221 -54707 -68640 -77094 -116779 -106535 -110751 -96402 -72915
5513 -72915 -94704 -37395 9426 -3934 -53027 -70364 -122434 -71694 -1485 77662 -6734 -12305
5501 -12305 4423 -66592 -94669 -86929 -61812 -73854 -29863 -4035 4170 29287 4977 -42215
5489 -42215 -1577 32168 -245 -46663 -17216 -1728 -5566 -12446 -34616 -29730 31684 39142 17849
5476 17849 896 -22172 -30189 -26526 -18630 -27399 -29651 -37997 -24625 17126 35314 -30555 -23992
5463 -23992 20987 25540 24221 58178 83148 90457 110938 95768 116393 69567 59985 26617 -11616
5450 -11616 -966 31292 52013 11074 -30116 9278 -25881 -75945 -63639 -74278 -57158 -46549
5438 -46549 -33551 18286 85434 46461 -6242 -71360 -116881 -69089 -50657 -86174 -117443 -128003
5426 -128003 -59978 -2702 96825 74557 7056 5572 3622 -52266 -34327 -26364 15131 131678
5414 131678 136978 19735 -29054 -44298 -90859 -78865 -50853 -27564 8912 -53028 2573 41631
5402 41631 45784 65687 47639 -37851 -18854 -4995 31134 49670 77972 121673 60796 36195
5390 36195 30321 50544 39048 30097 2466 -65405 -26201 33301 54049 38007 -20850 7005
5378 7005 55481 55344 59986 37816 -2659 -61523 -49003 -1970 30116 61570 35206 89369 120949
5365 120949 64959 4802 -40326 -39429 -60625 -73531 -56632 -42110 -33993 -16755 7266 47673
5353 47673 112394 81017 -10486 -66536 -95877 -62698 -48421 -77519 -72684 -15204 -24733 -34956
5341 -34956 -30819 -48603 -14559 41603 45665 25753 -23514 14443 -2539 32488 52178 85127
5329 85127 64926 66187 91599 55851 43452 38356 -10503 -9346 -68482 -85930 -73906 -55511
5317 -55511 -60606 -69363 -72239 -19804 8953 -4111 57437 74725 50643 48432 64120 146107 91850
5304 91850 59196 31326 -36662 -12350 59575 27724 -20595 -26854 -17559 -32127 -11152 -17964
5292 -17964 -7107 -55763 -45791 -22470 -40624 -6518 50227 70777 42977 13351 -13991 16048
5280 16048 27987 -22957 -47302 -40816 -26053 -42307 -41017 -15394 37721 34866 62381 79347
5268 79347 39109 14272 71763 17021 -27753 -64779 -59246 -12103 -8815 -10870 18231 46083
5256 46083 82610 95703 95026 113362 115577 112584 110592 82017 28895 -23780 -51033 -55650 -49651
5243 -49651 -47733 -76810 -24600 -34601 -46779 -65392 -22001 44839 40659 25045 54109 54826 86025
5230 86025 49785 16902 7256 -65042 -36264 -31496 -68466 -77889 -47605 -75873 -42418 -20492
5218 -20492 9424 20928 37957 73356 25834 -13289 13265 17655 -14498 -35551 -12775 31351
5206 31351 32904 68822 84680 89942 94234 12984 22417 28965 -64630 -73559 -60747 4664 12930
5193 12930 5922 22401 27971 -717 -1868 -15265 -19011 -5272 -17783 -23453 -50578 -60821 238
5180 238 58232 15680 6540 66737 121223 31739 -7985 -13398 -4280 527 -11623 6667 -11797
5167 -11797 -79772 -136570 -91622 27611 134747 154920 96353 28654 7767 10594 34480 64928
5155 64928 38471 19077 6593 25480 111250 154752 105793 91649 103683 111705 83251 7550
5143 7550 13500 73695 69782 41067 46397 73147 -2083 -14036 -22304 -41964 -7722 92876 94818
5130 94818 67355 40499 -13344 -47338 11843 27055 18990 -31032 -124228 -119084 -95984 -59260
5118 -59260 7511 37653 39505 -16416 -53197 -93110 -113260 -67349 -19611 -6586 -14402 -17103
5106 -17103 2436 -8861 -18204 -58536 -32503 -317 120 -64008 -39196 -41692 -25483 66099 125688
5093 125688 92889 96918 64882 29230 -23803 -62543 -87686 -111608 -124680 -131828 -75430 -46924
5081 -46924 -58368 -93345 -119030 -168284 -97138 -39481 -25319 -28263 -36067 -52720 -146061 -97980
5069 -97980 -62798 -42590 25260 64066 75295 65619 40067 -8601 11235 11582 -16057 -6264 -25150
5056 -25150 15864 -27619 -24070 18260 -21448 -66720 -85670 -56563 -29911 -7342 -6041 -36282
5044 -36282 14292 75463 61997 64271 115673 147822 124709 109790 86780 74106 53740 48253
5032 48253 33803 27925 48488 64703 68288 65257 8465 -398 -21963 -20047 59992 39216 44817
5019 44817 15935 23058 20076 14290 37271 19898 27708 4150 75434 131498 103385 66747 40262
5006 40262 -28569 -68983 -81785 -37167 -54800 36270 131048 136897 23629 -43064 -18093 -14919
4994 -14919 -23573 25956 32679 47259 25724 48572 66119 13686 -43771 -27371 -1222 15171
4982 15171 56714 87885 44300 11358 8314 -32948 12647 33296 139295 128848 98890 106849
4970 106849 113976 130408 30096 -33458 -40530 -23194 33899 64738 20185 -3176 7234 -24151
4958 -24151 -3863 -39065 -36344 -26867 -59900 -100383 -75960 -86567 -44154 -38067 -9424 -14677 -57733
4945 -57733 -61041 -37746 -35033 -64320 -62690 -49142 -794 6284 -24273 -13401 6949 23139 59041
4932 59041 95377 76426 60025 27483 40062 32529 29559 -51 21499 28580 25327 20609 13122
4919 13122 44271 56284 62435 34100 10169 -32806 -79213 -125537 -100438 -47752 -55244 -38090
4907 -38090 -40686 -91791 -36800 -31352 -54395 -40701 25770 70654 85875 3150 -61600 -15482
4895 -15482 -29624 -16392 3298 11644 13894 35066 7857 302 11686 18831 33213 66305 73947
4882 73947 31649 -71395 -83360 -60857 -71645 -104488 -90110 -29676 -12241 -18476 6713 -29299
4870 -29299 22837 52741 -18184 -35063 -9545 -4827 -33069 -29016 -2607 41572 81535 56453
4858 56453 8854 5764 -27615 -35782 8803 -32150 -75660 -47369 -87548 -67207 -30024 11379
4846 11379 20847 -2304 -41663 -58465 -56187 -32141 -59567 -84994 -105396 -123938 -116815 -57426
4834 -57426 -12599 -30389 -54596 -66950 -43538 -73156 -49145 5747 12529 33547 64925 87382
4822 87382 43662 47065 65388 76579 42679 47179 17693 -42539 -13966 23956 16155 58587
4810 58587 10327 -27898 -1103 108263 153157 132743 53305 32853 -90 -78967 -38502 50636
4798 50636 62163 -20533 -33410 -20670 -32618 -23054 -66156 -156366 -134799 -61826 -79348 -113099
4786 -113099 -82733 -11475 24593 2722 -54510 -45844 -50135 -80001 -97520 -77105 -42146 -30083
4774 -30083 -46439 -99369 -51513 3021 -29867 -44046 -35368 -1077 -29373 -30512 49130 40510
4762 40510 26927 -14498 -53579 -6351 28537 45686 50104 81136 50747 21783 25867 34164
4750 34164 -7635 -83732 -161221 -104608 -9400 22656 -35090 -93362 -92027 -56751 -28635 -2724
4738 -2724 23133 59159 32025 13769 8207 2100 105 -19463 -42974 -47220 -17325 32242 62821
4725 62821 79072 54093 -10566 -81270 -77670 -37794 -25747 30000 31201 21198 4282 75233
4713 75233 19401 17163 56804 77790 11523 30167 84392 117756 115130 104255 100821 9325
4701 9325 -36941 -28904 -22835 -17625 -12165 -23392 -32910 -40111 -54022 -65324 -27381 39525 43643
4688 43643 3456 33154 50603 28920 53910 -6420 -13186 39999 88174 86950 59905 30002
4676 30002 22124 31410 28747 -2297 -25618 -5084 32260 77316 70890 136036 107894 42631 -3475
4663 -3475 -23792 49748 37297 28991 -13191 -23262 -6888 -12361 -23875 9784 35849 -3833
4651 -3833 242 55073 50268 27766 2464 17468 55497 53172 84364 22507 -14195 -57182 -59676
4638 -59676 -24405 43138 61559 60145 81039 36287 39613 41710 50275 105185 120013 100411 59316
4625 59316 25315 3826 8570 -5622 -10151 -20913 383 90529 102114 89873 36837 33152
4613 33152 69174 14330 2770 -37385 -22019 -25156 -17015 -54286 -80132 -27688 -63882 -86359
4601 -86359 -43049 -52641 -38303 -35287 -90564 -104256 -105727 -94599 -76813 -33815 -30171 -47915 -41924
4588 -41924 -103423 -97536 -92181 -124866 -76355 -8251 -27989 -23391 3844 36286 36789 34737 -22164
4575 -22164 -9198 -25782 -71322 -37257 31836 19503 -3112 -31041 -56568 -43334 -1387 7422
4563 7422 16170 -2417 -2967 26961 -41553 -67267 -1170 2432 -6270 -12381 2850 -15086 -23361
4550 -23361 2993 -55727 -39870 16001 48650 18414 31890 51407 33605 -19555 -305 -20262
4538 -20262 -52585 -18701 16460 18271 2361 -54221 -100541 -98298 -86258 -74489 -49219 -14798
4526 -14798 -10505 -11792 -48268 -52132 -44369 27981 81788 90276 42541 -8708 -56151 -7972 -17306
4513 -17306 3985 33990 16002 -7446 -47656 -18923 53722 54935 39716 2253 -742 11356
4501 11356 73793 66349 -33322 -46263 -15573 -21077 -2852 17502 18283 118 -13907 -4032 -37565
4488 -37565 -27407 19574 89227 74965 14385 24398 53088 84156 98615 48753 22138 7862
4476 7862 -15501 33471 76200 37529 6642 -10105 -70254 -56905 9191 4408 -45164 6789
4464 6789 40427 8581 25974 -7495 -9394 -20611 -77940 -55650 -89766 -130674 -70191 -45963
4452 -45963 -76020 -120285 -92654 -35062 822 14255 47865 17223 -9326 7579 32463 15993
4440 15993 -58892 -81153 -106109 -94094 12943 42212 -30522 2744 20141 47272 78303 77138
4428 77138 85641 84625 -3689 5111 46305 -5034 -9409 33937 47823 56079 9701 -18253 -48
4415 -48 39715 43301 -15335 -66391 -34400 12207 -25435 -38758 12354 -289 27548 107393 112417
4402 112417 74242 -5400 -37785 -27589 -30669 -82244 -33949 30840 72652 87764 80069 22940
4390 22940 -28050 -1496 67130 76828 20534 -69525 -67887 -3342 17015 -226 9105 41538
4378 41538 75198 58659 -34207 -43822 -40669 -63067 -39220 29887 44809 59597 47417 21768
4366 21768 -14419 1651 -16059 -29099 -3344 21164 9659 -23266 -56174 -107688 -122305 -100137
4354 -100137 -76593 -62692 -12849 33288 64234 90097 12409 -41558 -115126 -130692 -58266 39062
4342 39062 32242 -8661 50509 73698 46351 -8660 -28668 -28224 1667 -28175 -36834 -65082 -54658
4329 -54658 -82096 -37618 29187 -44646 -45751 -31466 -75931 -133981 -115469 -17402 -10811 -19297
4317 -19297 -5403 -6125 -59839 -39762 -14114 -32736 -1278 30719 36303 68388 140243 56953
4305 56953 51244 22659 1998 -39266 -28236 -36519 -30146 -13496 -27704 -38415 -20168 -498
4293 -498 25932 -8366 -24477 -53729 -60984 -51317 -19248 37397 58442 37924 22302 25982 31351
4280 31351 19830 29163 75838 76486 50866 34935 1026 29992 51625 14032 41917 63752
4268 63752 24613 -18253 -4980 38438 41292 17358 1326 -30289 -83431 -93694 -33654 27526
4256 27526 47825 31498 19704 94204 142059 107974 86811 12490 -67194 -102092 -82571 -101739
4244 -101739 -73719 -44815 -39466 -12887 -13 -11868 -22677 -14117 23708 3277 -69292 -83359
4232 -83359 -77503 -101783 -151991 -80655 2386 -21338 -39928 -40186 -37284 35558 95166 45585 -21664
4219 -21664 -1533 37793 51388 29675 -745 -51279 -73466 -88340 -40619 -11342 16822 73663
4207 73663 20413 -10924 -12024 37604 77106 45053 41221 38067 66854 13813 14796 13203 -42759
4194 -42759 -26278 -16581 -44396 -72877 -22068 -13462 -24431 -64635 -46932 -51013 -110917 -140055
4182 -140055 -173856 -157465 -119215 -80880 -8174 14081 15993 -30970 -55986 -40756 -25309 -45779
4170 -45779 -24082 -4721 -18752 -67981 -65701 -63566 -17045 -2951 -36220 24009 73103 84335
4158 84335 48989 32625 42989 41898 23623 64290 13298 -45139 -62648 -13527 6672 26782
4146 26782 10139 9650 17808 19704 -24200 -65212 -13697 27754 -24475 -39350 -65114 -71316 -71823
4133 -71823 -70104 -93055 -70728 -29615 -65796 -108316 -87773 -28409 -22955 -42243 -61147 -40829
4121 -40829 -63571 -59608 -14360 26687 8918 -29802 -22466 -38265 -47831 -34390 -25760 -32293 -11281
4108 -11281 11173 23171 -23020 -33584 5422 26680 -35568 -56476 -25854 -19784 -109396 -61397
4096 -61397 20487 50320 44766 60170 47256 -16178 -17101 -3293 -5349 -15916 14248 43137 -7938
4083 -7938 -57429 -35297 -68105 -45111 -61411 -80214 -35321 -28396 46778 45817 30326 56479 61454
$$ [...]
##END NTUPLES=NMR SPECTRUM
##END=
