##TITLE=Analysis number 326933
Compound Code spb 04027
Project Code adrs
Chemist Name endeavour
##JCAMPDX= 6.0         $$ Bruker NMR JCAMP-DX V2.0
##DATA TYPE= NMR SPECTRUM
##DATA CLASS= NTUPLES
##ORIGIN= Bruker BioSpin GmbH
##OWNER= nmr
$$ XWIN-NMR		Version 3.5
$$ Fri Mar  2 10:45:19 2007 GMT Standard Time (UT+0h)  MAYBRIDGE\nmr@NMR_250MHZ
##.OBSERVE FREQUENCY= 250.131544655141
##.OBSERVE NUCLEUS= ^1H
##.ACQUISITION MODE= SIMULTANEOUS (DQD)
##.ACQUISITION SCHEME= undefined
##.AVERAGES= 16
##.DIGITISER RES= 18
##SPECTROMETER/DATA SYSTEM= dpx250
##.PULSE SEQUENCE= zg30
##.SOLVENT NAME= CDCl3
##.SHIFT REFERENCE= (INTERNAL, CDCl3, 0, 16.522)
##AUDIT TRAIL= $$ (NUMBER, WHEN, WHO, WHERE, WHAT)
$$ ##TITLE= Audit trail, XWIN-NMR		Version 3.5
$$ ##JCAMPDX= 5.01
$$ ##ORIGIN= Bruker BioSpin GmbH
$$ ##OWNER= nmr
$$ C:\u/data/dgb/nmr/ADRS/130/pdata/1/auditp.txt
$$ ##AUDIT TRAIL=  $$ (NUMBER, WHEN, WHO, WHERE, WHAT)
(   1,<2007-03-02 10:44:37.08 +000>,<MAYBRIDGE\nmr>,<NMR_250MHZ>,
      <created by zg, POWCHK disabled, PULCHK disabled
       configuration hash MD5:
       49 4B E0 1D 92 C2 6B 37 9F E6 65 BC 52 41 86 1D
       data hash MD5: 64K
       E0 07 6E 8E E0 C0 6E CA 0A E5 55 C5 37 4A 2A 6F>)
(   2,<2007-03-02 10:44:55.66 +000>,<MAYBRIDGE\nmr>,<NMR_250MHZ>,
      <Start of raw data processing
       ef LB = 0.3 FT_mod = 6 PKNL = 1 SI = 32K 
       data hash MD5: 32K
       77 11 9B 62 A3 0E 7A 3B FA 14 6B 07 7E 33 D0 0D>)
(   3,<2007-03-02 10:45:00.35 +000>,<MAYBRIDGE\nmr>,<NMR_250MHZ>,
      <apk 
       data hash MD5: 32K
       2F CD 5C 9B 59 1A 2F 9B 21 52 C9 E7 BE 60 D8 3A>)
(   4,<2007-03-02 10:45:01.94 +000>,<MAYBRIDGE\nmr>,<NMR_250MHZ>,
      <abs ABSG = 5 
       data hash MD5: 32K
       94 32 E4 CC 7B 82 17 1D 4F 4C 59 FD 68 8E 95 EA>)
$$ ##END=
$$ 
$$ hash MD5
$$ 5E 22 F2 2D 2A 91 14 CB 2B 16 A6 17 EB 41 EB C8
##$RELAX= 
##$RELAX= 
##$RELAX= 
##$RELAX= 
##$RELAX= 
##$RELAX= 
##$RELAX= 
$$ Bruker specific parameters
$$ --------------------------
##$DU= <C:\u>
##$EXPNO= 130
##$NAME= <ADRS>
##$PROCNO= 1
##$TYPE= <nmr>
##$USER= <dgb>
##$AMP= (0..31)
100 100 100 100 100 100 100 100 100 100 100 100 100 100 100 100 100 100 
100 100 100 100 100 100 100 100 100 100 100 100 100 100 
##$AQSEQ= 0
##$AQ_mod= 3
##$AUNM= <au_zg>
##$AUTOPOS= <34 >
##$BF1= 250.13
##$BF2= 250.13
##$BF3= 250.13
##$BF4= 250.13
##$BF5= 500.13
##$BF6= 500.13
##$BF7= 500.13
##$BF8= 500.13
##$BYTORDA= 1
##$CFDGTYP= 0
##$CFRGTYP= 5
##$CHEMSTR= <none>
##$CNST= (0..31)
1 1 145 1 1 1 1 1 1 1 1 1 1 1 1 1 1 1 1 1 1 1 1 1 1 1 1 1 1 1 1 1 
##$CPDPRG= <>
##$CPDPRG1= <>
##$CPDPRG2= <>
##$CPDPRG3= <>
##$CPDPRG4= <mlev>
##$CPDPRG5= <mlev>
##$CPDPRG6= <mlev>
##$CPDPRG7= <mlev>
##$CPDPRG8= <mlev>
##$CPDPRGB= <>
##$CPDPRGT= <>
##$D= (0..31)
0 1 0 0 0 0 0 0 0 0.06 0 0 0 0 0 0 0.0002 0 0 0 0 0 0 0 0 0 0 0 0 0 0 
0 
##$DATE= 1172832275
##$DBL= (0..7)
120 120 120 120 120 120 120 120 
##$DBP= (0..7)
150 150 150 150 150 150 150 150 
##$DBP07= 0
##$DBPNAM0= <>
##$DBPNAM1= <>
##$DBPNAM2= <>
$$ [...]
##$SUBNAM7= <"">
##$SUBNAM8= <"">
##$SUBNAM9= <"">
##$SW= 20.6930455092707
##$SWIBOX= (0..15)
0 0 3 0 0 0 0 0 0 0 0 0 0 0 0 0 
##$SW_h= 5175.983436853
##$TD= 65536
##$TD0= 1
##$TE= 295.16
##$TE2= 300
##$TE3= 300
##$TEG= 300
##$TL= (0..7)
0 120 120 120 120 120 120 120 
##$TP= (0..7)
150 150 150 150 150 150 150 150 
##$TP07= 0
##$TPNAME0= <>
##$TPNAME1= <>
##$TPNAME2= <>
##$TPNAME3= <>
##$TPNAME4= <>
##$TPNAME5= <>
##$TPNAME6= <>
##$TPNAME7= <>
##$TPOAL= (0..7)
0.5 0.5 0.5 0.5 0.5 0.5 0.5 0.5 
##$TPOFFS= (0..7)
0 0 0 0 0 0 0 0 
##$TUNHIN= 0
##$TUNHOUT= 0
##$TUNXOUT= 0
##$USERA1= <user>
##$USERA2= <user>
##$USERA3= <user>
##$USERA4= <user>
##$USERA5= <user>
##$V9= 5
##$VALIST= <valist>
##$VCLIST= <CCCCCCCCCCCCCCC>
##$VD= 0
##$VDLIST= <DDDDDDDDDDDDDDD>
##$VPLIST= <PPPPPPPPPPPPPPP>
##$VTLIST= <TTTTTTTTTTTTTTT>
##$WBST= 1024
##$WBSW= 4
##$XGAIN= (0..3)
0 0 0 0 
##$XL= 0
##$YL= 0
##$YMAX_a= 225311
##$YMIN_a= -274511
##$ZGOPTNS= <>
##$ZL1= 120
##$ZL2= 120
##$ZL3= 120
##$ZL4= 120
##$ABSF1= 16.522
##$ABSF2= -4.171173
##$ABSG= 5
##$ABSL= 3
##$ALPHA= 0
##$AQORDER= 0
##$ASSFAC= 0
##$ASSFACI= 0
##$ASSFACX= 0
##$ASSWID= 0
##$AUNMP= <proc_1d>
##$AZFE= 0.1
##$AZFW= 0.1
##$BCFW= 0
##$BC_mod= 0
##$BYTORDP= 0
##$COROFFS= 0
##$CY= 12.5
##$DATMOD= 1
##$DC= 0
##$DFILT= <>
##$DTYPP= 0
##$F1P= 14.0000005364418
##$F2P= -0.99999901652339
##$FCOR= 0.5
##$FTSIZE= 32768
##$FT_mod= 6
##$GAMMA= 0
##$GB= 0
##$INTBC= 1
##$INTSCL= 1
##$ISEN= 128
##$LB= 0.3
##$LEV0= 0
##$LPBIN= 0
##$MAXI= 10000
##$MC2= 0
##$MEAN= 0
##$ME_mod= 0
##$MI= 0
##$NCOEF= 0
##$NC_proc= -4
##$NLEV= 6
##$NOISF1= 0
##$NOISF2= 0
##$NSP= 0
##$NTH_PI= 0
##$NZP= 0
##$OFFSET= 16.522
##$PC= 1
##$PHC0= 227.2871
##$PHC1= 8.768165
##$PH_mod= 1
##$PKNL= yes
##$PPARMOD= 0
##$PSCAL= 4
##$PSIGN= 0
##$REVERSE= no
##$SF= 250.13
##$SI= 32768
##$SIGF1= 0
##$SIGF2= 0
##$SINO= 400
##$SIOLD= 32768
##$SREGLST= <1H.CDCl3>
##$SSB= 0
##$STSI= 32768
##$STSR= 0
##$SW_p= 5175.98343685301
##$SYMM= 0
##$S_DEV= 0
##$TDeff= 65536
##$TDoff= 0
##$TI= <Analysis number 999999
Compound Code 99
Book Reference 9
Project Code 9>
##$TILT= no
##$TM1= 0
##$TM2= 0
##$TOPLEV= 0
##$USERP1= <user>
##$USERP2= <user>
##$USERP3= <user>
##$USERP4= <user>
##$USERP5= <user>
##$WDW= 1
##$XDIM= 32768
##$YMAX_p= 479730455
##$YMIN_p= -277859
$$ End of Bruker specific parameters
$$ ---------------------------------
##NTUPLES= NMR SPECTRUM
##VAR_NAME=  FREQUENCY,     SPECTRUM/REAL,   SPECTRUM/IMAG
##SYMBOL=    X,             R,               I
##VAR_TYPE=  INDEPENDENT,   DEPENDENT,       DEPENDENT
##VAR_FORM=  AFFN,          ASDF,            ASDF
##VAR_DIM=   32768,         32768,           32768
##UNITS=     HZ,            ARBITRARY UNITS, ARBITRARY UNITS
##FACTOR=    0.157963299565203, 1,           1
##FIRST=     4132.6476996994, 0,             0
##LAST=      -1043.33573715361, 0,           0
##MIN=       -1043.33573715361, -277859,     0
##MAX=       4132.6476996994, 479730455,     0
$$ Real data points
##PAGE= N=1
##DATA TABLE= (X++(R..R)), XYDATA
$$ [...]
##PAGE= N=2
##DATA TABLE= (X++(I..I)), XYDATA
16817 -1859642 -1859599 -1851298 -1807053 -1816517 -1820746 -1755873 -1799555 -1832547 -1842285 -1786408 -1755078 -1798874 -1872558
16804 -1872558 -1819999 -1854780 -1833798 -1803394 -1820357 -1828940 -1820447 -1793968 -1763443 -1747624 -1796658 -1823119
16792 -1823119 -1802168 -1783949 -1783906 -1765319 -1711461 -1664925 -1688026 -1762678 -1751830 -1732617 -1707522 -1615494
16780 -1615494 -1592704 -1655156 -1720911 -1707310 -1722213 -1666252 -1584078 -1617140 -1708495 -1734440 -1669850
16769 -1669850 -1683661 -1684240 -1652309 -1650991 -1583963 -1537703 -1516745 -1584331 -1626622 -1652372 -1616049 -1696846
16757 -1696846 -1707029 -1676008 -1645239 -1599057 -1572946 -1610061 -1651204 -1593947 -1597394 -1607893 -1551585
16746 -1551585 -1522735 -1580467 -1626307 -1585042 -1558572 -1520167 -1551142 -1565029 -1596962 -1656420 -1588592
16735 -1588592 -1568951 -1619187 -1648205 -1606005 -1557557 -1546966 -1598832 -1614764 -1607115 -1556457 -1572989
16724 -1572989 -1687052 -1694173 -1631420 -1615390 -1618253 -1675890 -1669231 -1637998 -1549195 -1481902 -1482594 -1520501
16712 -1520501 -1549413 -1536205 -1519379 -1550572 -1534590 -1528877 -1554717 -1460205 -1420392 -1466521 -1511772
16701 -1511772 -1575304 -1558333 -1504156 -1498190 -1477506 -1458206 -1425451 -1419689 -1476375 -1479064 -1464756 -1455296
16689 -1455296 -1542865 -1581068 -1575078 -1515007 -1471812 -1421786 -1498498 -1513979 -1540572 -1569148 -1595042
16678 -1595042 -1583222 -1574242 -1461321 -1447810 -1429313 -1447791 -1445548 -1450085 -1441276 -1414311 -1386156 -1414330
16666 -1414330 -1417529 -1437920 -1418114 -1455843 -1465916 -1448342 -1430861 -1384618 -1422757 -1479961 -1460843
16655 -1460843 -1395777 -1426314 -1480099 -1505175 -1526275 -1511582 -1502934 -1524512 -1482051 -1422089 -1331325
16644 -1331325 -1309180 -1328404 -1364633 -1430909 -1413279 -1383030 -1397423 -1428646 -1410869 -1417259 -1390829
16633 -1390829 -1353809 -1431603 -1472326 -1407327 -1397320 -1404405 -1503694 -1524884 -1417636 -1305304 -1322893
16622 -1322893 -1314278 -1232077 -1219749 -1217260 -1249574 -1311694 -1329392 -1380402 -1396068 -1365068 -1416500 -1371011
16610 -1371011 -1303497 -1268028 -1317601 -1384904 -1413088 -1341627 -1318710 -1341829 -1320431 -1271876 -1263854
16599 -1263854 -1272480 -1296616 -1331521 -1341870 -1282265 -1281265 -1302990 -1335925 -1343632 -1319470 -1296353 -1269845
16587 -1269845 -1295603 -1288562 -1360773 -1409942 -1364955 -1275875 -1261952 -1232275 -1265523 -1293320 -1276740
16576 -1276740 -1301507 -1385637 -1391209 -1327601 -1262718 -1223813 -1208491 -1208650 -1228488 -1241342 -1218478 -1192030
16564 -1192030 -1164999 -1229392 -1281339 -1243995 -1226181 -1219277 -1277303 -1291114 -1274727 -1306069 -1332341
16553 -1332341 -1332764 -1278345 -1339220 -1386106 -1334702 -1270856 -1233227 -1239727 -1211475 -1173212 -1212106 -1283266
16541 -1283266 -1249233 -1203292 -1122266 -1102500 -1079370 -1092330 -1067416 -1150081 -1210637 -1250424 -1264447
16530 -1264447 -1257675 -1207401 -1172478 -1218945 -1229189 -1174265 -1148664 -1120795 -1108414 -1175108 -1245368
16519 -1245368 -1185880 -1189225 -1184406 -1165401 -1156730 -1200486 -1188711 -1142025 -1132882 -1131901 -1172860 -1214692
16507 -1214692 -1177276 -1131744 -1141675 -1135833 -1128010 -1154312 -1147739 -1137204 -1182359 -1232533 -1241498 -1240343
16495 -1240343 -1241895 -1257071 -1175297 -1220803 -1167103 -1093401 -1131531 -1176186 -1155751 -1153334 -1179490 -1167055
16483 -1167055 -1168391 -1128214 -1054211 -1064986 -1053253 -1030103 -1045766 -964605 -920291 -1056926 -1200037
16472 -1200037 -1212189 -1147431 -1124488 -1121163 -1138424 -1156516 -1210626 -1218737 -1174742 -1165684 -1150689 -1095022
16460 -1095022 -1077472 -1118534 -1103614 -1047315 -1073408 -1145584 -1186110 -1156424 -1168040 -1200984 -1146707
16449 -1146707 -1082260 -1059071 -1095835 -1084886 -1068431 -1061501 -1082152 -1071583 -1097296 -1155985 -1153028 -1079921
16437 -1079921 -1049947 -1068510 -1135755 -1101150 -1053727 -1059760 -1096577 -1113508 -1064297 -1041416 -954439
16426 -954439 -900330 -933113 -1014426 -1071001 -951861 -869919 -962660 -993077 -991149 -1010008 -1013868 -1033277
16414 -1033277 -1068163 -1099831 -1049039 -1037531 -1029407 -1015199 -1011708 -1006919 -949932 -930629 -961588 -997702
16402 -997702 -998392 -1035464 -999964 -982064 -904964 -876961 -931607 -1002625 -974476 -911513 -917291 -898025
16390 -898025 -974853 -1025521 -963268 -1001584 -1020506 -974087 -939616 -955199 -962191 -976911 -997866 -1027419
16378 -1027419 -963183 -934709 -923504 -890434 -895028 -918493 -926198 -979543 -1044689 -1001138 -1020716 -1009315
16366 -1009315 -962772 -950674 -984766 -1000339 -985636 -946339 -886455 -933669 -896954 -874841 -923956
16355 -923956 -940431 -1052492 -1054158 -1004321 -1000578 -958326 -927188 -896487 -858941 -919726 -966967 -996618
16343 -996618 -976131 -933074 -937020 -947659 -928772 -896191 -919400 -962218 -989102 -937155 -891363 -948511
16331 -948511 -1002544 -996064 -1006636 -973078 -1012222 -1007570 -943249 -891647 -930126 -955611 -970051 -939045
16319 -939045 -912329 -923415 -927706 -943664 -919000 -923638 -893479 -860612 -823050 -824289 -826844 -835754
16307 -835754 -866304 -844338 -827396 -885111 -916026 -912326 -894876 -915825 -883218 -822319 -812992 -874143
16295 -874143 -874711 -808668 -834278 -783789 -779615 -820305 -763930 -794040 -785456 -759543 -840199 -927669
16283 -927669 -951510 -956042 -948126 -902408 -882134 -867439 -909050 -943932 -933289 -908956 -881384 -875132
16271 -875132 -798931 -751275 -794543 -817192 -792212 -825168 -872156 -894234 -846625 -778575 -813908
16260 -813908 -749863 -760051 -850966 -921542 -904131 -833962 -799743 -767399 -788572 -845597 -872460
16249 -872460 -875458 -837736 -827459 -757090 -694530 -666219 -660343 -731359 -732958 -710935 -728747 -819556
16237 -819556 -817791 -781649 -696283 -689009 -707462 -740097 -779265 -756788 -704746 -640712 -654887 -781983
16225 -781983 -821579 -785308 -734552 -679267 -704228 -748080 -798441 -798855 -768646 -700886 -626970 -557248
16213 -557248 -601158 -682514 -737946 -688708 -740950 -761966 -742812 -790099 -790314 -791801 -797789 -808681
16201 -808681 -758729 -732740 -700069 -732393 -804487 -789943 -816205 -774223 -748306 -749213 -769982 -753996
16189 -753996 -798352 -772075 -743396 -755795 -755773 -767591 -783303 -811262 -767730 -749640 -759586 -727090
16177 -727090 -732956 -741094 -665906 -611542 -660365 -638329 -635899 -603057 -536560 -539636 -624044 -717802
16165 -717802 -725180 -760727 -773600 -761214 -783137 -695623 -644370 -697307 -699442 -683393 -740922 -724352
16153 -724352 -695810 -677134 -721062 -751417 -779836 -811038 -744618 -708353 -707333 -685750 -718473 -710383
16141 -710383 -661872 -721462 -762277 -817634 -797500 -841678 -791586 -748139 -668140 -626288 -648456
16130 -648456 -707787 -738384 -713576 -643305 -642177 -631475 -587850 -654839 -710107 -602762 -553601
16119 -553601 -573452 -674986 -636210 -545328 -525625 -571908 -682918 -732432 -646846 -585215 -590399
16108 -590399 -632095 -637868 -592962 -577982 -605467 -630272 -645229 -642691 -614882 -590662 -623352 -642800
16096 -642800 -659893 -664349 -623127 -598827 -656673 -660054 -670633 -661581 -641107 -611280 -644832 -662872
16084 -662872 -721447 -729486 -721683 -714663 -703727 -723869 -664424 -652490 -652941 -629053 -593534 -615519
16072 -615519 -557600 -494028 -463987 -491957 -449627 -443224 -521285 -545202 -629483 -576456 -538734 -588545
16060 -588545 -630915 -606544 -625553 -642341 -687216 -695547 -692455 -686737 -630330 -551156 -584339 -680985
16048 -680985 -680262 -667077 -624524 -673470 -661186 -595162 -641079 -680521 -660411 -673482 -603560 -556347
16036 -556347 -495765 -488245 -447724 -454877 -489783 -510720 -537737 -514365 -541735 -584798 -544796 -544309
16024 -544309 -589349 -553399 -474494 -483123 -525452 -620291 -637471 -576648 -546063 -549698 -576930 -636581
16012 -636581 -647146 -627150 -590733 -634389 -616140 -650671 -670389 -614552 -598927 -597935 -610227 -636423
16000 -636423 -627459 -582082 -586766 -629736 -624345 -584829 -642190 -627186 -564897 -525938 -565294 -592176
15988 -592176 -631371 -539296 -526296 -538895 -498669 -510409 -493033 -556711 -572274 -556338 -448976
15977 -448976 -347208 -335329 -372272 -442366 -420836 -458664 -515682 -527716 -517161 -540609 -571153
15966 -571153 -593564 -568546 -504853 -515935 -574414 -560276 -501203 -450159 -462234 -487478 -474632
15955 -474632 -451019 -421679 -413122 -402665 -422419 -464515 -453127 -446034 -516691 -496615 -441362 -431735
15943 -431735 -402949 -372017 -467155 -483873 -452705 -435201 -486781 -449283 -356192 -321321 -316715 -401163
15931 -401163 -454435 -494711 -511780 -514213 -511034 -492220 -489047 -403453 -402483 -404508 -432539 -486025 -481717
15918 -481717 -472876 -438911 -438999 -468559 -467210 -475648 -430879 -407908 -437553 -432823 -441464 -431347 -439702
15905 -439702 -411957 -374705 -378963 -432263 -468415 -511104 -503330 -413021 -328665 -365136 -418897 -447038
15893 -447038 -449435 -409910 -364297 -380752 -366352 -314467 -371747 -391658 -384271 -365935 -408094 -424055
15881 -424055 -437181 -479402 -484005 -540778 -475816 -424222 -387888 -366024 -402173 -411011 -433055 -425522
15869 -425522 -378088 -364278 -370247 -420925 -397038 -375409 -389490 -380317 -353746 -362225 -416220 -487509
15857 -487509 -432137 -341173 -333214 -402412 -458120 -423343 -451286 -450534 -425309 -439157 -440737 -495982
15845 -495982 -479480 -448832 -521049 -586306 -520501 -412559 -379459 -356946 -355912 -345202 -327440
15834 -327440 -353569 -363302 -320088 -370558 -424914 -475382 -459442 -459039 -407063 -356912 -310272 -270030
15822 -270030 -274754 -260304 -311491 -367587 -385150 -390179 -355680 -340854 -375924 -420705 -406891 -387043
15810 -387043 -412990 -389481 -406629 -475007 -482868 -458838 -423509 -412330 -398879 -404611 -426925 -408232
15798 -408232 -392113 -331347 -296805 -356303 -455242 -505587 -450645 -329190 -246674 -249800 -312596
15787 -312596 -334476 -317298 -379526 -424882 -357153 -297922 -331520 -325107 -272314 -279427 -313907 -269040
15775 -269040 -228369 -229833 -216900 -231545 -307108 -331190 -361037 -356007 -349656 -397568 -412733 -406150
15763 -406150 -419742 -369578 -376300 -422165 -340586 -317067 -315883 -274074 -211349 -235474 -237057 -171230
15751 -171230 -191365 -250083 -314626 -360591 -319543 -228933 -231130 -252103 -252978 -265120 -272927 -279229
15739 -279229 -340304 -339849 -312453 -305041 -271186 -301202 -300892 -290756 -307036 -276586 -220013 -202052
15727 -202052 -235735 -296925 -378685 -355394 -332445 -342662 -331058 -313503 -303008 -294178 -241755 -226312
15715 -226312 -291430 -326756 -279088 -255468 -296889 -262160 -220556 -236070 -287687 -285083 -225667 -254537
15703 -254537 -299617 -262850 -258962 -287686 -275387 -272588 -231473 -271159 -308548 -328668 -376759 -375159
15691 -375159 -314494 -305380 -346718 -372308 -380259 -322389 -250754 -181815 -177129 -220648 -234133 -292977
15679 -292977 -254683 -162006 -249950 -295207 -334390 -375802 -340146 -202169 -104246 -186238 -212061
15668 -212061 -189566 -234284 -298975 -288844 -248216 -246480 -255950 -186288 -202934 -220645 -277837 -217145
15656 -217145 -145479 -176107 -216462 -196907 -187089 -217186 -231470 -264362 -226042 -165806 -124843 -107013
15644 -107013 -106521 -89988 -162610 -177956 -165733 -250551 -254480 -160387 -105742 -144281 -191151 -160183
15632 -160183 -144697 -177111 -156976 -153565 -99030 -43319 -95657 -148478 -143413 -135426 -133557 -226704
15620 -226704 -224081 -196385 -212842 -201555 -160090 -88726 -69943 -58442 -25472 -105504 -168736 -167595
15608 -167595 -93994 -99921 -137149 -189219 -216002 -228515 -212401 -83769 -34018 -47788 -58969
15597 -58969 -87865 -118209 -135079 -149836 -115635 -86008 -117794 -168554 -173093 -215244 -252660 -256711
15585 -256711 -283414 -218211 -140129 -151058 -148141 -65791 -95361 -134103 -91792 -35198 -62399 -118264
15573 -118264 -98699 -112777 -160058 -136420 -115417 -175750 -174636 -154531 -138839 -155757 -153183 -189925
15561 -189925 -247848 -257078 -174020 -134356 -70521 -21965 -29809 -25887 -35824 -137325 -185330 -151399
15549 -151399 -152897 -172127 -169638 -101706 -107885 -114320 -63441 -143661 -158378 -138063 -141830 -147437 -116592
15536 -116592 -111456 -137304 -131901 -108672 -174686 -127192 -120704 -109316 -90631 -93287 -105994 -125047
15524 -125047 -202616 -253438 -240672 -137903 -35890 -44095 -99919 -99323 -108092 -113805 -91476 -36194
15512 -36194 -9822 -43848 -94438 -112215 -84676 -56601 -117284 -186197 -190196 -121116 -118180 -119853
15500 -119853 -142855 -187410 -180665 -125565 -17435 41721 -8063 -79443 -101302 -159578 -151955 -137597
15488 -137597 -95654 -65738 -71368 -47330 -99389 -161683 -79523 30218 8346 -93167 -139391
15477 -139391 -79119 -33910 -51878 -118222 -169149 -132008 -74483 -83182 -110309 -107554 -109538 -163705
15465 -163705 -172270 -101027 -56237 -82802 -132185 -94755 -59721 -48278 29034 59083 44875 6052
15453 6052 -16506 -21806 -94892 -145015 -106741 -109905 -158993 -79594 20104 13513 -51151 -58658 -28737
15440 -28737 -19274 17467 -24338 -20518 47631 21162 -60227 -29022 -12498 -89180 -124927 -120986
15428 -120986 -46420 -1220 -3364 32983 -26436 -86490 -102290 -71114 -15221 -1134 38946 13327
15416 13327 -11174 -7396 -3094 21669 -3260 -40396 -110217 -128467 -157321 -83095 11731 63392
15404 63392 92733 72361 26278 21674 28081 19919 30624 -2858 -40189 4933 27588 21268
15392 21268 29102 50178 70010 25393 35242 143821 188084 137638 64606 95032 79485 14796
15380 14796 49478 24988 -23388 -75527 -82529 -30538 -437 4319 7374 -10226 -33654 -57435
15368 -57435 -52832 -54117 -25603 10515 36199 -6091 -11660 7335 77050 81117 31239 16585
15356 16585 39959 86407 33122 -26136 12580 19404 63307 39710 -44108 -96908 -119058 -195172
15344 -195172 -113292 -31073 -24570 -72546 -41630 21381 62567 85134 97194 53394 94588 128176
15332 128176 145794 48429 -54966 -56575 -40155 -74058 -22774 33140 54627 61482 83412 72306
15320 72306 81767 95975 92588 133701 181392 167865 130699 81123 15449 5172 1013 15481
15308 15481 65501 42540 21806 49372 71871 181286 212869 188698 123990 103448 96525 67390
15296 67390 69470 113830 107566 144428 189220 188179 175685 120185 103581 87856 68626 98413
15284 98413 103793 93799 43760 9191 -40374 -80315 -95559 -25922 74069 131490 151495 171529
15272 171529 153402 141172 109749 126200 143112 130041 106491 103328 200248 225140 218832 223172
15260 223172 251283 313688 262441 211910 217557 178500 171602 208163 165772 109245 83346 94531
15248 94531 109856 127610 144521 111523 64896 60349 55048 62528 88886 149289 187808 200386
15236 200386 218829 224034 199388 144851 176465 179680 180174 221479 199736 152659 199877 200934
15224 200934 212486 375405 364982 254716 207903 136745 82704 151657 170120 151339 135008
15213 135008 180207 201721 264500 202202 118151 112202 164263 239025 275201 273819 187883 138307
15201 138307 119070 70468 76457 107432 200373 211068 194327 211660 231421 237008 257332 254375
15189 254375 221890 213974 250615 278307 288760 274416 245364 230378 252037 295765 208116 200933
15177 200933 236390 242245 305398 354325 260355 134228 184503 284707 286223 219113 201422
15166 201422 208318 176075 164504 202160 199566 162756 221542 284076 274920 242854 242943 265060 271188
15153 271188 262433 265165 300034 242365 267560 307960 280225 289925 319287 267938 229145 270997
15141 270997 366480 362714 290540 279976 292773 338118 335169 257941 281881 339526 374982 394916
15129 394916 393244 308497 335195 282778 254432 153727 146636 188091 210978 287500 347351 338474
15117 338474 350999 366211 373307 368891 365182 382417 319182 364373 434391 483739 432247 320015
15105 320015 214762 238346 205553 164718 254673 344565 399346 393739 407145 361666 342919
15094 342919 326869 334030 322012 320313 306529 278372 251077 250124 320701 328892 325205 318997 295910
15081 295910 328538 393438 402622 341091 384286 360796 305850 312148 340551 329043 345747 371267
15069 371267 320549 312788 382824 378691 308010 320464 318976 295898 297604 344590 314580 358673
15057 358673 373977 401282 349685 272217 297732 379191 396307 387783 350439 364062 383798 377549
15045 377549 297282 280366 291880 337013 357625 376910 328490 328863 385280 384952 386081 445961
15033 445961 444328 461082 441874 436406 484888 488341 498112 524806 485980 464415 466225 420169
15021 420169 390076 429362 459044 438105 441318 451668 430346 458084 432413 423020 406919 403372
15009 403372 460239 466385 475068 494444 479208 446219 343156 318606 337253 394570 436264 480493
14997 480493 493325 555321 528562 476466 440299 415282 367176 327415 393411 494737 473266
14986 473266 426757 401266 362390 391463 421004 412867 373472 392803 424778 435779 421853 417497
14974 417497 482269 446210 449805 471924 473190 487799 590162 629617 549920 507871 458858 474066
14962 474066 470877 423904 420024 403299 471252 530601 494871 485089 520976 553230 535949 489150
14950 489150 451948 433224 456981 595553 609161 508116 561101 544123 447095 440403 477912
14939 477912 475634 474180 462775 479766 505137 526901 487777 582244 639326 654935 680097 619063
14927 619063 550557 567698 568647 569313 553022 528295 490550 485665 530305 560594 591288 591005 509435
14914 509435 432430 401467 461467 498617 503328 512593 583613 663057 652349 572726 545847 510039
14902 510039 470430 461709 536841 534177 519216 482081 431242 435919 491320 505506 525618 535860
14890 535860 527057 520707 489239 486574 454937 438898 519670 549965 551936 527180 465080 523367
14878 523367 606591 616238 608001 594788 623061 647928 628949 549107 533630 541571 565087 504324
14866 504324 460536 488910 494924 511982 549154 603072 669491 616561 621577 593344 609565 580312
14854 580312 520693 500347 495534 454688 470853 507088 557120 558642 572264 582897 564289 550047
14842 550047 586983 647298 696234 754080 718452 655461 636124 668346 640609 649681 678990 622267
14830 622267 654322 674961 659116 603525 663840 635641 602176 610237 579804 551117 462243 389481
14818 389481 456050 564743 657737 681425 649355 660744 669756 606361 604520 639957 669786 709085
14806 709085 697030 615441 613334 677771 698737 741548 735935 695420 672328 717203 695578 648809
14794 648809 703949 772450 790310 770896 775227 781602 747086 652130 695537 717356 684342 675470
14782 675470 695544 679544 753597 820171 734907 633103 586966 610926 679191 667999 634431
14771 634431 639534 615097 609156 700238 730521 733926 784264 725306 644330 612433 622103 666485
14759 666485 641121 653676 717735 679837 649901 676807 707841 659411 622065 629568 655518 690969
14747 690969 702907 662842 678216 714567 784965 778642 807033 845059 839480 822969 824129 844132
14735 844132 838124 816181 814027 789835 757883 758965 759464 811803 848762 765168 694104 745520
14723 745520 730771 713329 727716 769318 695248 781780 900650 903832 924757 883316 851699
14712 851699 793450 803259 806767 830513 816324 723108 728446 724635 744885 751425 736022 727998 679644
14699 679644 698605 728913 721478 699004 717849 681047 673628 664244 692442 717620 750636 818449
14687 818449 802253 826613 836757 840272 805076 790389 775388 800905 794101 838542 859882 858109
14675 858109 893879 922550 887948 809143 747264 756846 820608 884144 883028 901539 913606 919860
14663 919860 875099 808099 790594 777323 758383 826903 939159 944018 899233 830044 803677
14652 803677 853453 865786 839886 815588 899146 913780 901657 902790 909263 923179 945165 905770
14640 905770 902556 892665 891325 868231 825289 899219 942895 938351 964774 963250 989317 1010776
14628 1010776 1020641 1011622 1009712 950427 843936 903509 824109 814003 890782 941511 920438 918527
14616 918527 931221 946882 1037715 1083631 1056423 940938 889413 947373 1037104 1010441 1070950
14605 1070950 1124292 1094646 1056497 998406 979361 967838 965728 972261 1023501 1038988 1005123 1013769
14593 1013769 993511 943176 853560 834325 948917 1040723 1069362 1047456 1029160 1014157 972298
14582 972298 986274 1004732 1045542 1087066 983517 969337 1070659 1084917 995694 988094 1009181
14571 1009181 973227 1033066 1052313 1019474 977894 1019302 1035572 939351 938762 936018 932381 915362
14559 915362 942893 929987 955293 1022780 1018854 1006440 1059879 1111983 1134195 1101818 1020183 965819
14547 965819 1001156 1025448 1024254 1059953 1077450 1029094 1022055 1019232 1022656 1000061 1023035 1020615
14535 1020615 1069093 1099279 1095690 1051479 1045762 1069931 1055685 1026391 1032577 1008139 1021147 980744
14523 980744 976808 958608 998009 994503 991714 1002603 975526 1038977 1051799 1057775 1109225 1156832
14511 1156832 1173958 1140787 1146281 1150148 1164806 1123537 1106619 1110575 1197566 1182921 1177815 1140164
14499 1140164 1141711 1107110 1090238 1128315 1140595 1118824 1109316 1106731 1106070 1086151 1116021 1182461
14487 1182461 1223068 1160516 1169912 1118828 1106757 1204445 1193212 1176991 1210025 1209288 1209344 1225226
14475 1225226 1183903 1227870 1240751 1169322 1118280 1181625 1174052 1138058 1142864 1100049 1149605 1214503
14463 1214503 1257119 1251380 1258544 1285716 1250110 1237694 1254010 1241397 1245079 1259509 1233432 1191688
14451 1191688 1192371 1172751 1240966 1311672 1293463 1277550 1284928 1308065 1323001 1312262 1278060 1196757
14439 1196757 1241617 1243211 1203946 1224191 1266863 1261467 1309004 1340264 1371064 1381458 1386944 1369081
14427 1369081 1306168 1264305 1298461 1341409 1326632 1399630 1403410 1458331 1488147 1479360 1396861 1348002
14415 1348002 1316799 1304071 1348319 1374352 1401402 1423383 1342714 1342026 1419488 1448967 1444330 1403880
14403 1403880 1420544 1465196 1445580 1359486 1330712 1359821 1395416 1375714 1459227 1533180 1484676
14392 1484676 1473193 1410678 1369774 1364651 1338794 1316284 1334170 1462047 1588645 1576884 1532210
14381 1532210 1533201 1520409 1497809 1467450 1478138 1507974 1463428 1418810 1390258 1410200 1437991 1350257
14369 1350257 1314715 1322624 1391366 1405737 1517270 1534958 1493125 1434753 1342897 1333261 1401391
14358 1401391 1438346 1433543 1436402 1461343 1431123 1409126 1449017 1464603 1537532 1593146 1540373 1457727
14346 1457727 1481742 1424742 1384795 1399410 1448544 1489627 1476292 1459284 1518729 1553508 1550837
14335 1550837 1476631 1461847 1445728 1501150 1540008 1629991 1663470 1686770 1623168 1608960 1661457
14324 1661457 1611899 1572940 1491125 1437370 1430169 1460348 1512846 1535842 1572798 1599063 1592370 1674319
14312 1674319 1654366 1674169 1629089 1594078 1652687 1675724 1684942 1671351 1584777 1575203 1593599 1561160
14300 1561160 1623921 1727475 1736914 1642209 1549568 1574312 1608990 1570862 1545491 1633850 1683752
14289 1683752 1700588 1732240 1696568 1593559 1540864 1553722 1541084 1596724 1644385 1696138 1711502
14278 1711502 1669564 1659752 1671071 1698415 1653970 1674892 1734727 1755707 1717009 1833909 1837875
14267 1837875 1796914 1846738 1824452 1745982 1773499 1801310 1736386 1707988 1701269 1678457 1671413 1746855
14255 1746855 1754446 1799000 1809748 1780908 1769254 1785376 1751396 1751442 1767927 1781177 1747974 1760040
14243 1760040 1892671 1951324 1964595 1867711 1858300 1830808 1870228 1863001 1872719 1863848 1852944 1892743
14231 1892743 1914830 1890493 1857968 1885659 1842053 1795845 1856516 1875295 1865011 1882710 1909777
14220 1909777 1847222 1856001 1861297 1941878 1997836 2062374 2085109 2029251 2020083 2052215 2029559 2001646
14208 2001646 2028470 2000668 1999437 2027109 2015199 2011590 1992395 1997417 2012386 2070254 2086246 2040464
14196 2040464 1971932 2003818 2010434 1992010 2032205 1975599 1963292 2022446 2067812 2069319 2072987 2129109
14184 2129109 2112657 2110057 2132432 2051597 2010769 1982203 1965805 2023493 2082644 2100082 2122364
14173 2122364 2120946 2077481 2050714 2072100 2141595 2172540 2173467 2175936 2159622 2196701 2215594 2219072
14161 2219072 2173976 2165718 2250511 2278665 2229875 2215754 2248228 2275470 2316899 2279004 2253876
14150 2253876 2198432 2210625 2231302 2205540 2228200 2284060 2275272 2315529 2365713 2329307 2365596
14139 2365596 2402918 2393362 2285839 2288623 2340590 2367556 2310650 2249541 2265962 2340253 2423972
14128 2423972 2463886 2460251 2470986 2458669 2426915 2421937 2417442 2475186 2488714 2458738 2515584 2543970
14116 2543970 2611952 2688948 2705536 2703569 2696069 2622813 2489582 2405792 2391856 2402213 2409118 2342622
14104 2342622 2312201 2399458 2397993 2429734 2436146 2381901 2341132 2407876 2500907 2480018 2435652 2492118
14092 2492118 2526858 2526773 2524329 2439060 2442522 2487847 2523860 2630063 2687008 2666906 2699063 2684562
14080 2684562 2673798 2696866 2706133 2753703 2802188 2813546 2827285 2842029 2915179 2989805 3092542
14069 3092542 3200482 3283710 3168528 2900507 2549478 2291814 2213577 2265999 2375692 2394125
14059 2394125 2440586 2483731 2553788 2607264 2479676 2503281 2535839 2588061 2616458 2646994 2665149
14048 2665149 2671627 2746991 2747924 2650038 2725939 2846070 2865950 2894377 2934408 2897584 2866463 2868447
14036 2868447 2874663 2868444 2924647 2993406 3027571 3088057 3123974 3055723 3046981 3074417 3160773 3174162
14024 3174162 3273813 3391487 3459930 3283278 2837046 2451749 2296369 2380487 2532625 2609888
14014 2609888 2632423 2644146 2664679 2681842 2741223 2744431 2702763 2703626 2742289 2785279 2865923 2886167
14002 2886167 2888896 2930583 2947951 2995532 3066195 3087338 3043915 3047981 3065902 3110456 3184830 3186467
13990 3186467 3112254 3038370 3112374 3216753 3132618 3125522 3189418 3178946 3163490 3177291 3211847
13979 3211847 3334975 3416400 3429899 3361723 3210883 3088964 3026145 3042710 3122933 3114648 3129266
13968 3129266 3190681 3192653 3181620 3180270 3234566 3240921 3297523 3409967 3462795 3449124 3385176 3340051
13956 3340051 3327535 3371985 3410702 3427141 3489991 3485977 3463485 3511679 3512921 3532284 3583253 3626897
13944 3626897 3641547 3570194 3491378 3473579 3470468 3514155 3524468 3566264 3620767 3720800 3698199
13933 3698199 3662873 3698084 3677097 3631632 3654412 3704732 3740032 3733349 3733561 3750531 3800408 3868670
13921 3868670 3865825 3864459 3888109 3876179 3779317 3754171 3806041 3902107 3990332 4052670 4019170 3990737
13909 3990737 4029115 4068830 4043855 4056040 4042654 4100204 4129074 4187940 4211519 4181306 4187684
13898 4187684 4171385 4096209 4078851 4045066 4082417 4122177 4152958 4157816 4160528 4214695 4230489 4310930
13886 4310930 4301599 4254575 4236014 4267659 4256827 4225732 4349269 4457822 4450030 4440978 4472391
13875 4472391 4469760 4467555 4420277 4451493 4501440 4526695 4612848 4668031 4650955 4682998 4662022 4642765
13863 4642765 4680245 4694037 4722513 4769117 4881243 4937122 4953726 4943507 4924943 4918100 4918705 4912113
13851 4912113 4850649 4819592 4851406 4855614 4938280 4970800 4955979 4958729 5042886 5131720 5196317 5183976
13839 5183976 5195669 5227082 5208415 5212007 5214580 5220786 5229009 5286436 5257317 5285666 5300181 5373639
13827 5373639 5463778 5506416 5506159 5477592 5513875 5534434 5559527 5657082 5690896 5651531 5695661 5713532
13815 5713532 5712850 5765697 5871795 5915662 5940409 5939595 5935019 5996383 6043922 6034056 5985625 6062800
13803 6062800 6031154 6006453 6066697 6148711 6212350 6231776 6313172 6381988 6336913 6254448 6313915
13792 6313915 6363892 6360304 6415167 6531499 6641928 6631291 6668105 6701299 6632774 6679106 6739778
13781 6739778 6810042 6870336 6850022 6867692 7018427 7101623 7115977 7125886 7127081 7147914 7187710
13770 7187710 7222093 7310539 7366695 7391264 7351424 7330967 7429392 7444312 7490422 7566350 7581100
13759 7581100 7626792 7664555 7739053 7813811 7860356 7894777 7920959 7934748 8022912 8200212 8282975
13748 8282975 8351289 8373780 8437652 8464637 8545789 8629342 8670555 8704987 8731569 8741894 8782953
13737 8782953 8865329 8953755 8989151 9063531 9226607 9349521 9423417 9503124 9583639 9643679 9685567
13726 9685567 9672292 9667249 9759293 9878635 9934548 10105852 10212861 10245454 10370165 10511596
13716 10511596 10601346 10615484 10685841 10784990 10926282 11070469 11213097 11291989 11352088 11437582
13706 11437582 11533919 11662933 11820710 11955522 12089198 12217022 12286294 12428669 12638226 12822865
13696 12822865 12930689 13091552 13283875 13398994 13516722 13630053 13804064 14029366 14230109
13687 14230109 14434492 14656137 14856844 15027302 15221579 15416768 15571917 15754053 15914269
13678 15914269 16180108 16500175 16791980 17098004 17428088 17834509 18194800 18547883 18942113
13669 18942113 19294398 19765521 20266408 20830984 21387810 21929116 22452262 23099045 23848954
13660 23848954 24652404 25531179 26428141 27488132 28763780 30260241 31828434 33530224
13652 33530224 35678329 38321261 41686465 45880281 50768164 55173086 55323717 43376857
13644 43376857 17066535 -6556192 -14978706 -13698310 -9669199 -5669026 -2440060 251629
13636 251629 2599577 4640905 6401950 8005253 9529882 11099544 12647889 14068925
13628 14068925 15465071 16852661 18115566 19326650 20539501 21860932 23255451 24667511
13620 24667511 26159283 27841558 29610007 31459289 33477425 35711032 38110689 40790733
13612 40790733 43726900 47009039 50831195 55146309 59993247 65806333 73132625 82615349
13604 82615349 94603158 108959247 123621482 130359064 107057460 29730044 -60926994
13597 -60926994 -99462191 -97546415 -84348252 -71406827 -61107692 -53118937 -46415578
13590 -46415578 -40701049 -36086646 -32335407 -28626651 -24875531 -21391575 -18207914 -15387971
13582 -15387971 -12823555 -10391071 -8075751 -5932515 -3878226 -1775160 300714 2434008
13574 2434008 4605238 6838106 9201188 11596960 14193281 16924306 19864790 23016233
13566 23016233 26478000 30527045 35085452 40012190 45790688 52946125 62052418 73612876
13558 73612876 87610187 102684699 112405315 97826351 30790380 -66483833 -118698846
13551 -118698846 -122331206 -109490001 -95531783 -84220700 -75579100 -68521461 -62586789
13544 -62586789 -57850693 -53994600 -50375949 -46755276 -43388752 -40400472 -37796779 -35494492
13536 -35494492 -33336455 -31375927 -29616557 -27886035 -26269663 -24843134 -23424422 -21884563
13528 -21884563 -20380512 -18936084 -17570641 -16241810 -14908181 -13507788 -12001387 -10337379
13520 -10337379 -8636634 -6777036 -4780330 -2563913 -12702 3077985 6961298 11665396
13512 11665396 16720537 20334139 16952933 -1890254 -31687209 -51280374 -55211968 -52104784
13504 -52104784 -47653136 -43625005 -40465882 -37856146 -35613048 -33804897 -32287544 -30892816
13496 -30892816 -29607964 -28330942 -27232416 -26156963 -25175948 -24446010 -23728290 -22987680 -22388304
13487 -22388304 -21858046 -21317680 -20819609 -20351281 -19880210 -19372098 -18950197 -18650238 -18313503
13478 -18313503 -17967622 -17663518 -17382358 -17071014 -16830175 -16550437 -16346925 -16135995 -15932201
13469 -15932201 -15737781 -15563361 -15338430 -15126320 -14896670 -14667730 -14438228 -14251169 -14146499
13460 -14146499 -14007050 -13870310 -13657768 -13512258 -13346864 -13155673 -12995877 -12818860 -12707239
13451 -12707239 -12527367 -12353177 -12255853 -12135282 -12049014 -11842814 -11678408 -11605103 -11573985 -11455900
13441 -11455900 -11301637 -11243110 -11120680 -10959269 -10906703 -10848118 -10686521 -10593542 -10492448 -10378267
13431 -10378267 -10226249 -10099390 -10048158 -10084072 -10115942 -10062395 -9949485 -9822539 -9768767 -9716541
13421 -9716541 -9639700 -9484157 -9413102 -9341187 -9201296 -9097803 -9008346 -8985733 -8989182 -8906556 -8831224
13410 -8831224 -8808309 -8715615 -8665029 -8641212 -8609092 -8584686 -8504693 -8430569 -8412446 -8310165 -8184473
13399 -8184473 -8097864 -8113433 -8098800 -8095308 -8100708 -7996327 -7936868 -7903909 -7823068 -7706767 -7631699
13388 -7631699 -7497062 -7453500 -7452656 -7467639 -7520421 -7515738 -7474545 -7540220 -7545767 -7490584 -7417131 -7304241
13376 -7304241 -7234927 -7141957 -7029227 -7022864 -6976191 -6953765 -6985006 -6905834 -6840981 -6776479 -6680019
13365 -6680019 -6615029 -6630962 -6607030 -6587205 -6613990 -6514900 -6538124 -6512180 -6455239 -6386998 -6336610
13354 -6336610 -6311319 -6287286 -6264427 -6199212 -6185659 -6185041 -6153826 -6079779 -6079424 -6101117 -6101124 -5974735 -5866623
13341 -5866623 -5842195 -5843243 -5818924 -5804977 -5862670 -5919179 -5934311 -5896334 -5853090 -5820837 -5761709
13330 -5761709 -5693735 -5654737 -5630438 -5584849 -5504426 -5432249 -5364998 -5278203 -5202851 -5278460 -5497743
13319 -5497743 -5609441 -5543237 -5469082 -5451934 -5510910 -5523142 -5482902 -5406256 -5367728 -5355092 -5298523
13308 -5298523 -5275109 -5287349 -5345485 -5276853 -5186113 -5113294 -5064072 -5083988 -5133897 -5130081 -5027224
13297 -5027224 -4911456 -4825104 -4816547 -4816406 -4820404 -4822338 -4831214 -4868619 -4772200 -4684090 -4718415 -4703658
13285 -4703658 -4754862 -4707092 -4687119 -4663235 -4639211 -4653549 -4705516 -4623007 -4519924 -4549060 -4590838
13274 -4590838 -4550906 -4487375 -4445665 -4440801 -4507425 -4552969 -4483669 -4450594 -4416365 -4394720 -4328113
13263 -4328113 -4367999 -4395564 -4391183 -4359163 -4303289 -4284886 -4298917 -4279283 -4253308 -4264648 -4276485
13252 -4276485 -4266505 -4218571 -4180858 -4178849 -4202993 -4143656 -4060620 -4071254 -4059871 -4013848 -3989744 -3935788
13240 -3935788 -3943361 -3981937 -3954843 -3910782 -3844006 -3811972 -3831390 -3895757 -3856060 -3764180 -3796752
13229 -3796752 -3800873 -3753210 -3741073 -3722062 -3751696 -3740492 -3719244 -3738016 -3774943 -3687771 -3607390
13218 -3607390 -3608975 -3589985 -3652791 -3680214 -3604583 -3535670 -3543540 -3531030 -3525576 -3551069 -3591991 -3521480
13206 -3521480 -3499556 -3442167 -3366267 -3337607 -3405140 -3417669 -3480808 -3492293 -3450615 -3431351 -3410369
13195 -3410369 -3356298 -3309807 -3282300 -3285677 -3287131 -3235599 -3153490 -3165782 -3148851 -3185461 -3214205 -3216516
13183 -3216516 -3232700 -3202479 -3160176 -3048038 -3017918 -3014444 -3029096 -2929546 -2880295 -2893083 -2908916
13172 -2908916 -2928858 -2908388 -2948271 -2977363 -3050281 -3119607 -3233656 -3294828 -3291187 -3226806 -3181161
13161 -3181161 -3136088 -3141604 -3172752 -3156361 -3076779 -3043191 -3028400 -2937784 -2976229 -2950956 -2972572
13150 -2972572 -2978870 -2909684 -2899723 -2945887 -2945381 -2943228 -2978694 -2881554 -2789745 -2748767 -2711225 -2680247
13138 -2680247 -2647944 -2604456 -2560383 -2583367 -2534870 -2454292 -2401080 -2428757 -2403879 -2339795 -2250346
13127 -2250346 -2175130 -2098004 -2163355 -2443663 -2847480 -3063041 -3099463 -3022869 -2959020 -2947320 -2884218
13116 -2884218 -2833375 -2784428 -2774448 -2807076 -2855766 -2801210 -2744362 -2636206 -2531409 -2603826 -2593402
13105 -2593402 -2566478 -2605695 -2620142 -2596137 -2554078 -2519547 -2530840 -2524819 -2545044 -2506164 -2456295
13094 -2456295 -2445123 -2433333 -2368127 -2305699 -2285505 -2276727 -2226537 -2198783 -2109832 -2034704 -1958697
13083 -1958697 -1946458 -1908571 -1837868 -1889044 -2150633 -2553515 -2842428 -3029577 -3001674 -2937955
13073 -2937955 -2826303 -2693515 -2617720 -2640541 -2578740 -2512809 -2495700 -2500166 -2416305 -2389485 -2400783
13062 -2400783 -2412773 -2316049 -2314041 -2373217 -2433058 -2432666 -2386524 -2293033 -2298500 -2270901 -2186276 -2121714
13050 -2121714 -2067170 -2044145 -2096896 -2166960 -2145053 -2139126 -2181589 -2190222 -2155387 -2096754 -2069480 -2014398
13038 -2014398 -1918717 -1849145 -1825911 -1886883 -1966868 -2138526 -2199448 -2177088 -2178589 -2185639 -2202108
13027 -2202108 -2086706 -2011611 -2017276 -1996968 -2044826 -2055851 -2019678 -2050050 -1961807 -1919949 -1921033
13016 -1921033 -1927225 -1929925 -1971261 -1992233 -1941581 -1865200 -1920308 -1883177 -1799447 -1803575 -1824777 -1789588
13004 -1789588 -1784765 -1798920 -1698357 -1675224 -1709044 -1714576 -1697545 -1712592 -1708916 -1731373 -1684141 -1681887
12992 -1681887 -1619460 -1565027 -1515603 -1490974 -1471391 -1498656 -1548335 -1530492 -1495290 -1455750 -1393431
12981 -1393431 -1451154 -1525878 -1529264 -1440271 -1432489 -1453415 -1400799 -1374112 -1364740 -1401693 -1381016 -1378579
12969 -1378579 -1357284 -1355997 -1324146 -1261952 -1217134 -1105832 -1083084 -1147499 -1114971 -1044250 -1062018
12958 -1062018 -1102848 -1104475 -1155830 -1133677 -1114993 -1096664 -1036014 -965851 -992040 -1101345 -1139079
12947 -1139079 -1093121 -1025951 -946141 -861133 -913305 -938862 -889487 -826425 -814861 -768727 -754350
12936 -754350 -766564 -739644 -738528 -692489 -624253 -638850 -575382 -525090 -487521 -392492 -313651 -353097
12924 -353097 -436582 -444816 -379493 -237576 -153691 -142134 -159713 -169572 -119015 -67937 -90620 -47097
12912 -47097 -35360 32670 18208 104033 176497 250346 335730 353632 349512 421041 498612 568473
12900 568473 634367 766638 872267 922574 932538 963403 1023307 1154853 1263226 1419694 1645066
12889 1645066 1723054 1768260 1868854 1990457 2131569 2307649 2540834 2831017 3001568 3123784
12879 3123784 3301977 3508511 3759501 4037063 4354290 4730632 5114313 5499011 5968798
12870 5968798 6532569 7073210 7732475 8371226 9073104 10030119 11300138 12926773 15060081
12861 15060081 17618380 20924127 25134261 30128772 34346326 30748598 6579371 -24364129
12853 -24364129 -35392476 -33396154 -28815341 -24874202 -21988073 -19788591 -17903416 -16282898
12845 -16282898 -14951577 -13814941 -12836009 -12136517 -11466072 -10781145 -10170458 -9698085 -9300349
12836 -9300349 -9008866 -8636344 -8282328 -7951238 -7737888 -7601094 -7395322 -7162158 -6943381
12827 -6943381 -6725737 -6517453 -6390613 -6224533 -6084431 -5948497 -5814275 -5680972 -5562568
12818 -5562568 -5469176 -5397394 -5336721 -5318678 -5213214 -5048217 -4891693 -4876582 -4866378 -4805301 -4718786
12807 -4718786 -4647780 -4535204 -4415183 -4416167 -4346945 -4323705 -4360923 -4406746 -4402266 -4353856 -4302572
12796 -4302572 -4271210 -4220451 -4074925 -4000546 -3936334 -3917313 -3914254 -3843586 -3769727 -3766760 -3783421
12785 -3783421 -3723787 -3641537 -3658725 -3627077 -3651142 -3666664 -3631088 -3576388 -3603295 -3577451 -3563023
12774 -3563023 -3492296 -3401215 -3337260 -3320136 -3362139 -3379264 -3377638 -3328537 -3296205 -3269570 -3255662
12763 -3255662 -3240019 -3202730 -3228973 -3184300 -3151052 -3243406 -3252828 -3172128 -3128873 -3072265 -3004448
12752 -3004448 -2937625 -2958770 -3012704 -3018610 -3009486 -3000950 -2974969 -2914647 -2871737 -2867690 -2898090 -2932535
12740 -2932535 -3013274 -2988610 -2914707 -2855242 -2856251 -2839509 -2800124 -2821798 -2846399 -2774533 -2695205
12729 -2695205 -2690016 -2729823 -2713407 -2776136 -2744488 -2738891 -2727670 -2761688 -2777362 -2728384 -2635704 -2573644
12717 -2573644 -2579464 -2600930 -2633977 -2653333 -2628995 -2558156 -2613951 -2652024 -2638762 -2568626 -2530051
12706 -2530051 -2407094 -2417938 -2408098 -2355061 -2328718 -2370246 -2450781 -2429508 -2433883 -2464121 -2457144 -2431510
12694 -2431510 -2452347 -2457185 -2420363 -2351395 -2326047 -2373049 -2371043 -2395917 -2337144 -2265532 -2277393 -2335552
12682 -2335552 -2383729 -2358058 -2393357 -2415738 -2406915 -2369404 -2376529 -2383080 -2438645 -2441406 -2405683 -2409920
12670 -2409920 -2348041 -2294409 -2318552 -2288537 -2249139 -2233648 -2235322 -2176901 -2211177 -2196619 -2147684
12659 -2147684 -2186523 -2216179 -2232479 -2204339 -2192191 -2176830 -2154899 -2183346 -2195400 -2131268 -2113600
12648 -2113600 -2099285 -2064826 -2070176 -2082813 -2132802 -2223742 -2238395 -2185843 -2204254 -2239265 -2190490
12637 -2190490 -2144475 -2148164 -2081180 -2056131 -2114680 -2103193 -2092952 -2115621 -2132150 -2105197 -2035173
12626 -2035173 -2027188 -2092981 -2075616 -2009418 -2086727 -2101380 -2112109 -2144980 -2151236 -2128303 -2017801
12615 -2017801 -1993519 -2046221 -2009250 -1987386 -1916750 -1929068 -1972559 -1946222 -1965327 -1988158 -1996956
12604 -1996956 -2028853 -2042322 -2029010 -1964901 -1955379 -1963572 -1976167 -1966557 -1896169 -1830688 -1884722 -1890992
12592 -1890992 -1869729 -1855592 -1868763 -1861612 -1820253 -1790422 -1832976 -1828035 -1848279 -1838117 -1818279 -1768141
12580 -1768141 -1768951 -1771638 -1800338 -1809488 -1779173 -1819315 -1896791 -1957713 -2001486 -2035834 -1981839 -1924912
12568 -1924912 -1966070 -2001304 -1953358 -1934185 -1949256 -1927071 -1934107 -1940666 -1889987 -1892683 -1893102 -1853985
12556 -1853985 -1842087 -1818136 -1838110 -1853707 -1903009 -1908840 -1911676 -1862757 -1870048 -1856744 -1887783 -1958324
12544 -1958324 -1939350 -1842723 -1766917 -1766500 -1756632 -1742390 -1749339 -1779101 -1788511 -1826282 -1792559 -1755651
12532 -1755651 -1768545 -1766083 -1758478 -1810221 -1824704 -1748418 -1750813 -1804383 -1861980 -1845370 -1775794 -1742980
12520 -1742980 -1649539 -1629267 -1713251 -1724839 -1726178 -1713821 -1767932 -1755716 -1728686 -1713689 -1663208
12509 -1663208 -1670040 -1666288 -1629594 -1626134 -1667034 -1658947 -1674370 -1656262 -1668177 -1637029 -1718186 -1724211
12497 -1724211 -1714977 -1634081 -1565938 -1569580 -1533559 -1549812 -1582548 -1650132 -1622568 -1542447 -1568075 -1628512
12485 -1628512 -1628254 -1631216 -1656183 -1693992 -1698614 -1667648 -1597442 -1626759 -1688687 -1693355 -1648636 -1579599
12473 -1579599 -1533706 -1571813 -1547298 -1551533 -1569607 -1575844 -1606347 -1624336 -1575857 -1520689 -1440994 -1407706
12461 -1407706 -1378875 -1442595 -1484322 -1527018 -1534625 -1505857 -1526032 -1528703 -1511557 -1539710 -1517779 -1514528
12449 -1514528 -1482523 -1517458 -1560149 -1617113 -1641541 -1601499 -1542608 -1504874 -1504843 -1467531 -1477588 -1482176
12437 -1482176 -1498654 -1546488 -1502886 -1534493 -1518685 -1498934 -1514996 -1525380 -1520560 -1504148 -1501414 -1536929
12425 -1536929 -1551687 -1503294 -1508352 -1480718 -1550770 -1556146 -1471522 -1399638 -1404174 -1443283 -1498319 -1461944
12413 -1461944 -1327357 -1289941 -1381605 -1412401 -1398506 -1389979 -1463878 -1469406 -1441089 -1430840 -1406233
12402 -1406233 -1403807 -1412359 -1399396 -1420417 -1396138 -1322442 -1318015 -1299877 -1337393 -1355681 -1384750 -1387832
12390 -1387832 -1316083 -1337911 -1325930 -1326110 -1305778 -1266058 -1183166 -1154657 -1273347 -1463270 -1563786
12379 -1563786 -1556405 -1588836 -1583497 -1565277 -1516845 -1482133 -1459935 -1447439 -1414631 -1380045 -1358293 -1359423
12367 -1359423 -1360206 -1437700 -1427240 -1423953 -1481821 -1489290 -1455074 -1447606 -1396534 -1406099 -1409910 -1323583 -1312929
12354 -1312929 -1334570 -1276854 -1244333 -1287098 -1334851 -1336624 -1271306 -1206487 -1237537 -1313576 -1315101 -1320806
12342 -1320806 -1296038 -1280784 -1207206 -1207459 -1268754 -1227205 -1233203 -1274916 -1325290 -1285857 -1253747 -1250471
12330 -1250471 -1261412 -1307746 -1358503 -1279164 -1219011 -1257588 -1276365 -1222371 -1190871 -1198635 -1205264 -1194427
12318 -1194427 -1236030 -1251770 -1290988 -1342385 -1335571 -1341365 -1301564 -1206724 -1198897 -1235453 -1288500 -1301157
12306 -1301157 -1274052 -1277146 -1307158 -1323064 -1303446 -1229106 -1258503 -1284935 -1295886 -1342236 -1390545
12295 -1390545 -1417255 -1319783 -1289079 -1314170 -1328235 -1304708 -1255998 -1301601 -1274804 -1177519 -1188555
12284 -1188555 -1244774 -1294972 -1225962 -1197407 -1213893 -1227150 -1182327 -1175737 -1136306 -1124559 -1154982
12273 -1154982 -1185179 -1237997 -1318620 -1284687 -1233435 -1235519 -1247827 -1270250 -1311014 -1276476 -1228015
12262 -1228015 -1223187 -1301573 -1312062 -1200239 -1117790 -1134876 -1206186 -1248673 -1219690 -1208289 -1252806
12251 -1252806 -1253054 -1322698 -1308142 -1228671 -1165144 -1198940 -1313239 -1291683 -1213758 -1199802 -1197141 -1153838
12239 -1153838 -1167429 -1149440 -1160321 -1153552 -1137923 -1142703 -1167510 -1129502 -1095722 -1120412 -1116048 -1120284
12227 -1120284 -1217117 -1238910 -1215474 -1196506 -1245063 -1224357 -1163650 -1143534 -1123451 -1098039 -1153462
12216 -1153462 -1157511 -1127701 -1113472 -1146985 -1162235 -1127350 -1154658 -1133623 -1152858 -1094877 -1101376 -1181893
12204 -1181893 -1217572 -1238656 -1222127 -1247866 -1245189 -1196132 -1212826 -1272123 -1242626 -1201862 -1201002 -1164211
12192 -1164211 -1156287 -1184438 -1150657 -1152039 -1145759 -1094622 -1116689 -1158749 -1118177 -1078594 -1067274 -1079535
12180 -1079535 -1091034 -1082948 -1110212 -1074534 -1010623 -1112811 -1145287 -1153515 -1212172 -1213898 -1073474
12169 -1073474 -984147 -996417 -1037762 -1057042 -1065621 -1054797 -1041580 -1049409 -1045555 -1056850 -1040108 -1035717
12157 -1035717 -1009525 -993934 -935752 -947172 -966418 -960080 -919009 -978251 -983800 -951324 -963767 -1015724
12145 -1015724 -1069955 -1076547 -1011650 -965769 -949070 -959309 -1046059 -1137589 -1085513 -1030685 -1027849 -1013451
12133 -1013451 -1092286 -1139997 -1090574 -1046638 -1015857 -988363 -968796 -1002008 -1038872 -1044474 -1034572 -1049997
12121 -1049997 -1103375 -1080710 -1072663 -1077275 -1093437 -1047975 -1063661 -996166 -991681 -1014040 -1095095 -1121955
12109 -1121955 -1079465 -1037369 -1028640 -1011173 -1022260 -1061599 -1085934 -1084668 -1137240 -1176860 -1124422 -1093989
12097 -1093989 -1010944 -959830 -964131 -960564 -1001598 -998260 -967383 -989922 -977138 -959709 -1016094 -1050606
12085 -1050606 -1047819 -1060170 -941562 -898294 -892617 -966187 -998786 -999143 -1070860 -1114319 -1125628 -1055921
12073 -1055921 -978288 -935050 -977191 -1034543 -1053935 -996146 -963404 -938862 -977879 -1016679 -1018029
12062 -1018029 -1007557 -1000565 -1026363 -1049352 -1024934 -1010653 -1010259 -946554 -949442 -930080 -890021 -933081
12050 -933081 -939682 -911875 -866433 -900161 -956219 -1015666 -1043183 -988617 -994842 -997831 -972092 -957034
12038 -957034 -960435 -995413 -994772 -1021137 -1015798 -990516 -916412 -864934 -898215 -884187 -929027 -955559
12026 -955559 -931368 -875155 -870274 -947148 -989203 -1021868 -1001406 -913923 -900247 -921400 -884393 -825117
12014 -825117 -809965 -859542 -816396 -862106 -896517 -858818 -874435 -882526 -882513 -861635 -886693 -881438
12002 -881438 -915013 -904638 -791226 -784866 -822175 -896935 -968497 -946516 -888897 -848168 -903495
11991 -903495 -992303 -950310 -888493 -828266 -816017 -827329 -880233 -887180 -945196 -961487 -943156 -906103
11979 -906103 -902395 -960403 -944510 -853926 -867879 -826182 -830697 -880199 -834904 -838437 -856667 -872305
11967 -872305 -833555 -758960 -747675 -783328 -832313 -901374 -918804 -915106 -951581 -864376 -851984 -802628
11955 -802628 -744929 -785735 -776993 -840927 -902200 -893462 -910815 -977338 -933076 -897332 -879279 -916655
11943 -916655 -879556 -843521 -861452 -861590 -813312 -764430 -757020 -804448 -771094 -734007 -760335 -737331
11931 -737331 -672037 -731867 -834908 -830417 -786284 -825226 -863188 -852499 -849849 -814892 -830272 -832887
11919 -832887 -793069 -711402 -712298 -788324 -799734 -760843 -778157 -742066 -693036 -737593 -719242 -704040
11907 -704040 -767720 -836434 -801916 -768965 -692304 -703618 -729546 -782343 -802830 -786965 -824566
11896 -824566 -843027 -845461 -817891 -819564 -844308 -804652 -763060 -787937 -798522 -756156 -734495 -772569
11884 -772569 -815759 -805073 -729250 -684288 -695337 -714015 -804020 -802046 -758254 -748468 -731525 -774879
11872 -774879 -814320 -829779 -806243 -763366 -759118 -709349 -674623 -708242 -764615 -765093 -715942 -675672
11860 -675672 -723515 -787792 -815629 -783431 -761653 -753422 -767719 -768895 -818778 -840978 -782390 -787213
11848 -787213 -820020 -785541 -754915 -658159 -614864 -704406 -744407 -769004 -817616 -798002 -832510
11837 -832510 -894318 -887992 -849659 -805223 -767686 -769361 -747469 -740212 -746465 -712378 -740985 -770545
11825 -770545 -768580 -740173 -682124 -685232 -712291 -760697 -738335 -713686 -697630 -686050 -645449 -656179
11813 -656179 -677619 -674819 -704532 -759406 -799913 -759469 -683684 -666519 -660260 -732600 -744038 -751785
11801 -751785 -787404 -807021 -776066 -766584 -787675 -737057 -726847 -764832 -747764 -751612 -745229 -748180
11789 -748180 -729835 -756015 -710795 -755521 -728881 -712692 -743922 -753523 -714398 -654084 -609462 -621155
11777 -621155 -626158 -623833 -614729 -681149 -606082 -578380 -627303 -654428 -687228 -694864 -660549 -593435
11765 -593435 -566162 -580776 -631550 -611693 -685853 -743305 -790643 -801516 -763502 -733005 -678218
11754 -678218 -662589 -623393 -582487 -603547 -595442 -663024 -715012 -659872 -612052 -590505 -614048 -655884
11742 -655884 -679063 -688533 -700149 -658774 -613807 -573589 -624284 -774007 -786179 -772966 -732252
11731 -732252 -672403 -656721 -659742 -628464 -679199 -691379 -614928 -595814 -666772 -628918 -602937 -616580
11719 -616580 -555897 -538110 -569646 -562172 -616621 -607430 -579642 -597205 -649581 -627639 -634456 -622481
11707 -622481 -584136 -569294 -585146 -593502 -546510 -529297 -465999 -504602 -603738 -610608 -613430 -593023
11695 -593023 -557757 -544084 -588248 -601740 -575668 -640922 -618592 -628547 -636398 -652389 -644037 -607134
11683 -607134 -595097 -621987 -582280 -565078 -569453 -636207 -680646 -682337 -706683 -606596 -573864 -558344
11671 -558344 -523727 -496941 -445822 -452143 -526462 -616656 -590698 -613147 -665950 -713060 -764319 -753479
11659 -753479 -624479 -583243 -621719 -608436 -612064 -564838 -560069 -552256 -547848 -594465 -544327 -532668
11647 -532668 -511023 -464300 -489076 -514135 -539883 -546586 -572249 -626298 -648081 -570676 -505019 -485970
11635 -485970 -556439 -593683 -562054 -579961 -615371 -574404 -549031 -499835 -576475 -572158 -593631 -576072
11623 -576072 -577823 -610032 -653747 -707065 -678596 -613386 -484758 -489139 -516473 -527969 -519039 -508212
11611 -508212 -514911 -513430 -588125 -633484 -585891 -582288 -560858 -523722 -536847 -581003 -589514 -533315
11599 -533315 -516745 -564327 -559804 -593265 -555902 -540987 -568112 -678221 -652030 -576786 -485007
11588 -485007 -475471 -419910 -427438 -451454 -504018 -512359 -481182 -449669 -391374 -384174 -406996 -458013
11576 -458013 -505219 -497186 -446455 -414696 -400299 -422196 -445614 -395897 -415679 -482478 -487574 -454102
11564 -454102 -411263 -492044 -450091 -409402 -492110 -465633 -436321 -417822 -453000 -479884 -436514
11553 -436514 -406099 -453595 -437546 -435554 -442010 -493637 -465988 -394351 -398124 -430117 -525547 -504940
11541 -504940 -489578 -507963 -497994 -478090 -462042 -415895 -440859 -593796 -636572 -573982 -480411
11530 -480411 -453293 -495741 -518440 -503535 -503574 -476430 -508925 -476373 -446383 -378779 -365924 -449110
11518 -449110 -453903 -397793 -358043 -355681 -377818 -315631 -323329 -409721 -354211 -319756 -296734 -337085
11506 -337085 -312241 -360300 -413056 -452399 -471300 -531896 -507799 -440795 -454066 -409382 -416217 -452358
11494 -452358 -459518 -487058 -496328 -451887 -376870 -326157 -383723 -469196 -456772 -399473 -337678 -370311
11482 -370311 -375170 -349989 -375510 -369350 -366741 -363743 -401907 -414402 -443158 -482740 -501734 -550415
11470 -550415 -509223 -472788 -416345 -376603 -407094 -382683 -252969 -178644 -267523 -328809 -343641
11459 -343641 -289516 -333991 -399128 -427124 -423653 -422890 -446241 -511648 -524592 -530846 -563032 -570842
11447 -570842 -448531 -417063 -410166 -383838 -370181 -433333 -477205 -467775 -449838 -474485 -452797 -347106
11435 -347106 -358057 -358977 -390456 -363464 -386837 -473657 -477510 -449857 -433616 -433131 -423715 -455055 -441347
11422 -441347 -428102 -379057 -350391 -315971 -356659 -366576 -266586 -187532 -214495 -315881 -373361
11411 -373361 -319870 -329345 -400783 -408848 -342118 -347295 -343574 -326393 -322740 -334010 -293905 -274680
11399 -274680 -338917 -383556 -336616 -303882 -265368 -265882 -266996 -333727 -368213 -369557 -397944 -424220
11387 -424220 -363354 -330730 -319031 -285633 -310651 -359621 -406549 -408051 -436731 -379802 -343247 -321261
11375 -321261 -284543 -283731 -289066 -339715 -394778 -337297 -290411 -322744 -330988 -367999 -452628 -432962
11363 -432962 -405380 -448722 -484187 -422774 -374671 -371131 -444214 -392848 -353805 -304045 -266574 -290585
11351 -290585 -329922 -367426 -366002 -386824 -409225 -388797 -386443 -406829 -396101 -304535 -285892 -235180
11339 -235180 -224265 -246601 -285513 -319067 -329375 -351001 -281670 -278061 -287417 -311885 -322379 -313980
11327 -313980 -357052 -321383 -294055 -380785 -389598 -396980 -360034 -398706 -362764 -233591 -191665 -226183
11315 -226183 -216488 -304913 -363078 -329795 -337487 -403401 -407899 -403009 -342259 -279143 -324388 -286656
11303 -286656 -270537 -288904 -327724 -322928 -238939 -250583 -297505 -272157 -339664 -355007 -340115 -306938
11291 -306938 -243459 -217656 -221609 -234135 -296348 -333425 -317276 -278862 -184722 -213107 -209817 -216956
11279 -216956 -268864 -337253 -325046 -326965 -385798 -402290 -301685 -227897 -247454 -328870 -329478 -259651
11267 -259651 -164623 -167440 -187011 -262325 -310947 -310604 -330490 -294227 -229520 -234236 -284872 -285257 -293065
11254 -293065 -313425 -344646 -317640 -261336 -295038 -318134 -304278 -309100 -335786 -357523 -336901 -393733
11242 -393733 -416575 -388724 -357857 -360744 -337136 -379831 -412877 -355021 -312913 -275092 -228751 -239945
11230 -239945 -215822 -199519 -212556 -268536 -301810 -267154 -302260 -367541 -346210 -302415 -274546
11219 -274546 -222519 -184050 -207499 -212872 -222706 -262501 -214676 -238127 -270953 -236488 -237431 -270892
11207 -270892 -280234 -266470 -263499 -211781 -219150 -269467 -249164 -272245 -284058 -304519 -272695 -185711
11195 -185711 -218478 -267456 -308516 -257133 -259339 -150241 -147509 -193507 -242730 -247956 -247150 -205189
11183 -205189 -227808 -216966 -198442 -176847 -149517 -161076 -160763 -131887 -128661 -159222 -181506 -202813
11171 -202813 -287666 -272257 -230362 -217388 -178112 -121612 -127913 -131215 -159215 -137324 -55638 -41970
11159 -41970 -85053 -87457 -94110 -129586 -183983 -230339 -260573 -253701 -228543 -229693 -255690 -266548
11147 -266548 -199471 -146506 -169709 -173816 -149446 -129246 -112584 -95978 -61426 -95820 -168599 -190057
11135 -190057 -258908 -235612 -231279 -203664 -212753 -209470 -247702 -285576 -286010 -222179 -198454 -168191
11123 -168191 -172440 -196822 -209436 -223306 -249166 -267998 -304502 -246897 -116744 -85431 -123346
11112 -123346 -90667 -45157 -88071 -86212 -130677 -147870 -184184 -195571 -237107 -239116 -177685 -109239
11100 -109239 -77249 -101920 -149758 -140172 -152835 -182968 -128367 -83266 -101796 -123479 -127329 -70309
11088 -70309 -54826 -70287 -57050 -87479 -73218 -55478 -133195 -146504 -203892 -233611 -130140
11077 -130140 -98090 -95366 -30967 -12637 -42225 -42562 -47999 -39453 -114291 -192986 -186265 -174158 -193332
11064 -193332 -163246 -120520 -125961 -65502 23634 27826 -19368 -32329 17242 23523 6174 29135
11052 29135 -37756 -61367 -161146 -164340 -186295 -194624 -95385 -72723 -160836 -131166 -104125 -54297
11040 -54297 -85898 -114888 -122387 -103053 -84817 -30827 -95027 -149569 -197408 -229699 -198024 -177038
11028 -177038 -149451 -70305 -36488 -59343 -133400 -145259 -121977 -69181 -103394 -135186 -118546
11017 -118546 -104402 -138906 -140761 -171187 -186938 -113222 -151016 -167137 -60051 -34695 -51458
11006 -51458 -73692 -76749 -130180 -119259 -81128 -78789 -20567 24705 31304 -23197 -48099 -71626
10994 -71626 -46519 -54735 -32223 -428 -24856 -47240 -1378 8196 18270 20602 -33624 16105
10982 16105 45851 29713 10546 51580 15850 20536 49697 56268 24597 30497 59156 54607
10970 54607 28717 -48015 -34758 -57027 -88281 -73999 -66262 -18328 -884 -77660 -77658 -87828 -95923
10957 -95923 -8096 19379 -1661 -41682 25126 35953 -13094 572 -87334 -117813 -79352 15155
10945 15155 13721 -28753 -7111 38089 46405 47420 69720 -26432 -109520 -119648 -135719 -105477
10933 -105477 -25883 29980 -4418 -25038 -62474 -98350 -83591 -88806 -46770 -3678 53245 110970
10921 110970 141741 179464 53306 -71438 -60137 -9215 73153 58094 -42820 -61579 -18021
10910 -18021 58572 130489 210237 243153 243019 211808 132560 112414 99623 77268 42400 42430 84913
10897 84913 44062 48301 128370 89592 8261 -969 50552 20675 -9728 53229 7488 -38071
10885 -38071 -38678 19847 21659 29442 73104 46218 79567 77899 18603 12110 53318 88774 40272
10872 40272 57088 138111 166821 160894 65956 74110 80741 52236 28177 8393 5676 45838
10860 45838 30689 50562 57034 60735 84640 106407 70747 48471 -41970 -54977 -22751 4729
10848 4729 79643 95308 115542 161458 120437 59655 73705 125895 124498 63630 14493 79004
10836 79004 164457 202256 125886 66309 23997 42238 130818 162492 161674 129493 144480 106480
10824 106480 62572 118227 103015 75619 83769 118181 205462 265562 261665 211386 126427 37399
10812 37399 32461 55889 67274 45175 82668 123514 57971 42294 47873 107391 148856 153973
10800 153973 110651 213012 238951 196300 181167 194760 163252 125182 151460 176541 182034
10789 182034 182324 128190 117559 105848 170496 216941 264292 272000 219611 218039 258736 237424
10777 237424 177207 124165 142820 168346 112509 70550 142338 208036 246321 202075 175621
10766 175621 207451 216811 179020 138634 78588 121809 223474 241248 258118 199253 176704
10755 176704 207280 238964 240534 240217 250112 264960 297767 374589 339100 290095 332106 326854
10743 326854 281335 293737 264208 153076 221842 264235 242488 258307 269941 312044 313066
10732 313066 302693 352207 364992 320973 288097 291947 336195 376171 425661 423885 415966 387673
10720 387673 344248 331354 302307 360111 367865 359599 416573 483912 463232 462346 524062 554755
10708 554755 560651 518174 486404 526115 580875 639643 670012 698150 733163 733577 678399 721316
10696 721316 781638 813382 953201 1103461 1148590 1273684 1497296 1691616 1965427 2185728
10686 2185728 1845919 294901 -1181079 -1495793 -1340579 -1047554 -847007 -703310 -568049
10677 -568049 -448763 -461657 -444709 -367593 -280768 -298329 -243845 -199830 -198074 -162801 -166546 -152677
10665 -152677 -108053 -40053 9716 -44687 -77194 -66810 -16556 -61774 -32440 13090 81798
10654 81798 133747 113537 83522 34470 10691 62736 42551 79081 89767 93312 109083 181762
10642 181762 211988 194832 200413 267563 342883 260765 257500 283286 250294 187944 105696 -9713
10630 -9713 1875 53653 72911 31472 57901 64108 91008 103654 144798 184535 224200 289895
10618 289895 204548 168576 142145 124602 149738 137225 175887 198183 210815 226732 236948
10607 236948 187133 186478 209912 216526 230137 304944 324037 285046 319137 292391 267616 263555
10595 263555 168496 147562 243482 279907 266921 202834 162320 237266 236709 196219 161655 162002
10583 162002 162661 166296 146643 154608 166754 281461 306905 329612 339944 304201 272876 235256
10571 235256 265119 262751 302120 308088 304303 295344 275261 263244 298409 320476 302040 272960
10559 272960 285890 278025 264771 306225 348311 334704 343547 335468 289686 263328 295705 360930
10547 360930 387804 454254 409926 337087 368145 321895 287986 258190 227404 242164 223478
10536 223478 183271 232781 297928 374100 352308 258879 233081 282902 310408 329158 311831
10525 311831 304305 282158 254437 229537 236199 280124 265864 238644 244340 300844 387896 402075
10513 402075 361277 368741 387573 428372 431033 389926 405191 404818 360172 336036 312149 255229
10501 255229 246090 251517 258563 321069 337757 324638 352643 403193 417925 349656 341755 314825
10489 314825 321049 304443 303200 338833 365239 420444 441386 424891 445934 390334 333810 288524
10477 288524 280801 346193 355750 328146 389862 457562 445304 408646 421136 422610 392246 369594
10465 369594 408997 448367 397295 407081 379865 416654 453669 445781 425861 426599 446893 472461
10453 472461 485978 522931 494312 453046 378621 308578 390013 483944 473046 490293 455914
10442 455914 419404 409006 469992 387711 314968 322978 373249 348327 337977 350805 350965 390287
10430 390287 439942 405156 361639 395318 454959 484084 428263 411256 416516 415770 425044 453665
10418 453665 507356 471179 512173 511846 532378 511452 525170 532758 437452 445784 471841 415358
10406 415358 444183 464008 452916 424317 412199 433950 399214 397926 425215 441386 475160 456514
10394 456514 511168 548754 550491 551941 526504 484992 458246 466600 471434 470879 476137 450392 413634
10381 413634 394190 373063 385901 486141 477313 435747 462644 526752 535217 524521 526852 545408
10369 545408 526193 481261 498015 519883 462659 457894 386975 444972 580377 591379 557274
10358 557274 590551 546960 494538 474902 552085 610866 567934 604358 568862 530972 484595
10347 484595 533852 571394 577075 557895 581006 624508 593806 641419 700050 729744 735822 666479
10335 666479 588276 536428 525878 503271 502305 522076 508281 522514 552124 603318 557857 501945
10323 501945 468263 405795 394741 410332 518580 514348 530355 605104 654750 665430 662271 628602
10311 628602 639859 671144 652190 590610 540889 516672 534564 543621 559390 614618 621788 629019
10299 629019 640797 606682 583087 526653 592799 588353 544276 525775 559586 582808 583082 598365
10287 598365 579820 559229 612170 586510 515906 514097 510198 543379 543649 534255 596400 631983
10275 631983 551047 498483 460610 466516 526174 570827 589235 617943 684061 677498 677793 620440
10263 620440 595620 567159 559485 574909 600120 639894 702488 741943 675513 594726 665027 648250
10251 648250 601345 608412 643053 614435 616382 586087 591742 622745 609898 676248 669148 632831
10239 632831 670431 617288 602546 613329 652094 742131 655387 640623 672006 692931 649513
10228 649513 640092 712958 723815 712808 692609 679366 687656 723283 715299 661264 668183 703141
10216 703141 812602 784182 742392 716546 813453 814430 759120 753083 703970 670216 614943 647531
10204 647531 619717 598963 649898 671038 675773 733196 771142 821127 820395 846044 869897 880508
10192 880508 849127 796067 745000 734228 778698 839064 851403 843663 838489 739852 698502 670769
10180 670769 714003 702454 685488 639827 686254 696303 641685 694134 655620 742441 770500
10169 770500 784501 773997 782656 776850 748022 751927 814152 818195 773240 741970 813919 833923
10157 833923 908702 880145 831862 775386 804476 760821 769494 762576 770823 813049 831154 836408
10145 836408 853723 884617 875490 878795 890466 900378 859375 795608 770804 833690 868525 845066
10133 845066 857939 924069 900172 882015 866640 861123 826322 794044 754306 788098 798403 817880
10121 817880 827547 799404 784261 850220 839017 886421 906537 878046 876535 848865 822267 850400
10109 850400 881077 922303 878366 822626 816269 836107 830830 847721 857924 871853 894698 913673
10097 913673 906649 925880 902721 922932 1001659 1007277 960654 971060 923159 873512 929777 947035
10085 947035 896166 909467 914793 894287 980595 963444 971058 974215 957145 947802 953000 948485 956665
10072 956665 962932 1020738 1021336 998199 1013694 1049400 1067143 1038480 972676 887370 808062 834994
10060 834994 926446 947774 966175 967929 914542 890278 858878 923024 964345 959326 957616 962645
10048 962645 910689 852089 802544 799589 861220 950095 933794 910319 995279 960820 889737 947419
10036 947419 1008365 990865 958255 992594 997556 1027029 1086680 1093355 1083427 1039175 1000484 988995
10024 988995 993540 1012870 1045351 1036813 1027502 1030575 972224 952529 993262 945419 954040 979587
10012 979587 955038 961202 1033338 1031468 1040681 1069127 1017173 1025883 1064632 1021775 1007537 1043116
10000 1043116 1063650 1051001 1044448 994185 1018022 1077524 1177896 1218495 1189674 1189691 1182926 1135296
9988 1135296 1076281 1057170 1025349 1013855 1048878 1027656 1060285 1087854 1091321 1062533 1114103 1162873
9976 1162873 1170683 1076878 1049091 1045321 1066638 1119975 1084343 1049409 1057161 1047128 1054732 1101874
9964 1101874 1154193 1212907 1214756 1171470 1089406 1083125 1099887 1096062 1086277 1098084 1125607 1194427
9952 1194427 1202929 1202856 1230367 1215554 1167714 1197581 1203208 1178393 1132559 1147764 1144587 1085836 1100338
9939 1100338 1144551 1092088 1094186 1130422 1145868 1212332 1226847 1127038 1115832 1185929 1198280 1164313
9927 1164313 1170197 1196677 1249363 1237263 1203742 1229633 1263034 1293333 1306237 1297825 1319147 1226316
9915 1226316 1242497 1369776 1386999 1259950 1156566 1132766 1199925 1176428 1166315 1202098 1183070
9904 1183070 1180165 1189448 1248929 1284137 1229906 1183859 1234056 1264237 1247302 1286777 1366793 1355125
9892 1355125 1316714 1280961 1264910 1252748 1198614 1261428 1274012 1260261 1253473 1249765 1206477 1210012
9880 1210012 1255192 1246518 1263535 1289845 1341831 1368571 1384560 1356172 1340117 1389199 1390732 1395259
9868 1395259 1387656 1418882 1376860 1371843 1400634 1431102 1391334 1359147 1351609 1351399 1345348 1399543 1393537
9855 1393537 1446797 1370049 1266374 1242841 1223818 1239042 1224228 1235276 1279260 1326302 1329809
9844 1329809 1311430 1284753 1352550 1354617 1387696 1458967 1447748 1427509 1320378 1258908 1216915
9833 1216915 1305764 1323879 1346659 1414530 1404475 1371248 1465020 1510634 1471924 1470169 1384813 1356269
9821 1356269 1362832 1440863 1454451 1457812 1423514 1360258 1320111 1341830 1325687 1335178 1398286 1473606
9809 1473606 1491589 1413883 1411895 1440452 1453420 1510434 1469384 1458837 1500819 1512436 1499900 1498505
9797 1498505 1442906 1449989 1527434 1515825 1470436 1449572 1497396 1528168 1561134 1539689 1496336 1395576
9785 1395576 1357234 1391184 1409634 1538442 1612635 1562430 1501955 1429270 1426967 1465825 1472156 1518561
9773 1518561 1483865 1493700 1530999 1515734 1413471 1417984 1478682 1530956 1605567 1596539 1612556 1639969
9761 1639969 1587090 1594873 1609164 1626847 1663542 1594416 1526549 1530160 1509960 1511824 1641170 1710315
9749 1710315 1699894 1700083 1694206 1718585 1729351 1702941 1642690 1617898 1604546 1598366 1597026 1489534
9737 1489534 1495035 1557288 1599223 1610647 1583002 1642345 1654496 1670776 1681509 1678543 1669140 1576922
9725 1576922 1561821 1589124 1581703 1583877 1647613 1705055 1710767 1690514 1709754 1709195 1710290 1707046 1759640
9712 1759640 1824518 1800556 1831442 1814968 1702539 1684510 1698155 1675792 1720653 1760410 1760204 1786683
9700 1786683 1809478 1805671 1731869 1711663 1755131 1764475 1746813 1749870 1732302 1704301 1703577 1765156
9688 1765156 1783278 1795617 1812671 1836200 1812659 1732206 1704629 1741921 1762317 1785797 1775782
9677 1775782 1850433 1836793 1811711 1762792 1829525 1858939 1847866 1806050 1809982 1856283 1879192 1898562
9665 1898562 1863225 1858957 1920635 1926341 1922684 1895471 1923532 1947018 1920222 1884692 1850813 1866110
9653 1866110 1852620 1856399 1873247 1903246 1938520 1998197 2054792 1935539 1908526 1989685 2044129
9642 2044129 1993268 1987005 1978372 2011244 2050480 2051824 2034262 1962501 1948445 2002530 1961645 1928969
9630 1928969 1951720 1982394 1951076 1958461 2023650 2012093 1998036 2052583 2095764 2002781 2018611 2074407
9618 2074407 2039952 2031308 1998711 1991469 1994840 2016356 2043780 2024252 2065304 2052987 2066704 2087693
9606 2087693 2060421 2012763 2049937 2131730 2169927 2199663 2195857 2159583 2098968 2093425 2082360 2019017
9594 2019017 1981194 2033644 2060070 2086891 2036915 2087552 2148146 2132187 2097294 2066009 2065608 2113074
9582 2113074 2180580 2204304 2209052 2159810 2180860 2215077 2268054 2272845 2289833 2266525 2208171 2147133
9570 2147133 2144601 2144844 2155812 2153837 2176781 2208616 2223835 2209766 2242833 2270137 2180755 2179485
9558 2179485 2222315 2232042 2248783 2281451 2348834 2323745 2257127 2320948 2408494 2342879 2274011 2279876
9546 2279876 2292565 2289646 2238784 2240559 2256981 2310302 2431591 2415360 2370675 2346989 2333346 2378966
9534 2378966 2468098 2529384 2471416 2423760 2358661 2346306 2395845 2466251 2432723 2391290 2400507 2373714
9522 2373714 2347131 2430561 2420403 2437650 2490000 2499473 2470638 2493011 2471154 2468060 2531276 2494584
9510 2494584 2490989 2527933 2593376 2570944 2532244 2494617 2442458 2432128 2478387 2492769 2479954 2485139
9498 2485139 2499897 2484131 2526936 2585038 2589343 2579704 2576398 2563127 2517283 2490226 2534557 2559285
9486 2559285 2481654 2479821 2557343 2668375 2678067 2704383 2743735 2703556 2697828 2627505 2649085 2712041
9474 2712041 2760392 2761227 2751626 2695878 2679226 2697101 2677271 2712682 2745920 2751286 2711452 2733390
9462 2733390 2840295 2871230 2845711 2870467 2905291 2855359 2801966 2758257 2776915 2747007 2779002
9451 2779002 2798122 2787790 2801819 2731931 2730937 2773565 2799180 2879506 2884779 2858395 2863933 2902253
9439 2902253 2976415 2958859 2941449 2985003 2983826 2950569 2961218 2964509 3008879 2919565 2898288 2877555
9427 2877555 2867134 2926924 2951079 3012325 3068606 3062303 3048730 3045630 3145341 3246751 3237016 3181199
9415 3181199 3153952 3149866 3169118 3159935 3089082 3065533 3111348 3106924 3077253 3129946 3157454 3120953
9403 3120953 3152493 3165455 3119158 3049689 3079326 3081771 3093823 3074600 3158992 3248173 3195036 3133649
9391 3133649 3194258 3202711 3260467 3311360 3354428 3365303 3347290 3267160 3200049 3240954 3307350 3346883
9379 3346883 3377023 3441413 3396406 3321427 3294899 3257632 3317190 3383645 3480264 3503696 3493726 3483006
9367 3483006 3454021 3423443 3386135 3390803 3403095 3402691 3442532 3478293 3508359 3450923 3461384 3459700
9355 3459700 3487831 3553398 3558772 3521773 3480071 3510228 3554423 3547414 3616940 3642966 3677252 3675374
9343 3675374 3727520 3758861 3745491 3723660 3721897 3746047 3782542 3758022 3765100 3730869 3694905 3727680
9331 3727680 3734039 3670553 3719755 3764519 3759382 3792372 3815863 3826222 3828093 3776707 3854665 3872513
9319 3872513 3831118 3819181 3911126 4044753 4110115 4081342 4064623 4135687 4216515 4218865 4206573
9308 4206573 4177307 4191893 4179049 4192679 4293766 4281078 4275101 4346686 4337356 4305064 4335912 4429124
9296 4429124 4520520 4608622 4676427 4679593 4737073 4709206 4387991 3878434 3562171 3497102 3549951
9285 3549951 3634802 3690718 3754381 3885362 4061983 4100794 4117759 4165237 4205345 4213774 4220636
9274 4220636 4221366 4189533 4199138 4260303 4221134 4204746 4223040 4242050 4212970 4320239 4445723 4497945
9262 4497945 4499493 4509918 4582717 4691544 4713474 4753332 4886739 4954476 5013703 5124436 5157038
9251 5157038 5212537 5310983 5452906 5638590 5767788 5760914 5279850 4251335 3560946 3375924
9241 3375924 3433043 3617310 3759999 3895105 3960044 3972686 3999460 4095575 4203055 4224424 4260964
9230 4260964 4308285 4376086 4494535 4502748 4519025 4547528 4561116 4566795 4671868 4768898 4809843
9219 4809843 4814405 4839051 4810296 4784130 4901892 4931069 4964981 5053847 5086644 5062198 5072978
9208 5072978 5110616 5210748 5260027 5340617 5481969 5594709 5660701 5694084 5513513 5137652
9198 5137652 4693980 4493027 4494471 4644734 4845137 4869519 4885834 4918769 4905965 4883339 4906017
9187 4906017 5034189 5025520 5012569 5043703 5101001 5183608 5241197 5256950 5280169 5329089 5391473
9176 5391473 5393429 5369540 5450167 5562642 5589217 5549787 5610063 5641501 5664057 5664102 5654436 5654331 5677285
9163 5677285 5792376 5783622 5788296 5821776 5785010 5809737 5841218 5900909 5895515 5902985 5914554 5955657
9151 5955657 5984865 5985113 6073763 6102143 6135054 6144394 6097762 6100754 6113872 6203645 6330552 6303963
9139 6303963 6244045 6174640 6124801 6178859 6255479 6225398 6248372 6341733 6365944 6352884 6331587
9128 6331587 6393495 6517477 6604784 6577231 6549937 6591071 6636647 6738041 6801571 6833662 6879199
9117 6879199 6929665 7021206 7053945 7108665 7174389 7192484 7186582 7178513 7220574 7280060 7304907 7265071
9105 7265071 7353287 7462266 7547051 7556375 7548305 7581167 7639277 7640082 7641496 7673809 7617018 7466643
9093 7466643 7343258 7355061 7490873 7590449 7653216 7699228 7759970 7773464 7878436 7894543 7925138
9082 7925138 7967831 8033356 8046645 8059176 8153131 8233201 8278643 8348890 8357468 8304926 8374693 8423666
9070 8423666 8491755 8594569 8664922 8700189 8728348 8750506 8816604 8888666 8987971 9025319 9055920
9059 9055920 9100250 9131696 9152057 9170616 9239303 9330294 9410461 9487793 9494822 9552470 9524249 9558198
9047 9558198 9630633 9731433 9839014 9884836 9845750 9882655 9966741 10050569 10086094 10102980 10128311
9036 10128311 10113016 10119156 10211663 10307025 10412345 10542732 10604249 10669908 10727922 10687017 10756594
9025 10756594 10859616 11042131 11164958 11248457 11325615 11421797 11451971 11495315 11569875 11590061 11631282
9014 11631282 11710307 11774709 11841150 11889950 11999618 12116911 12246897 12371543 12546783 12614919
9004 12614919 12663475 12783249 12829521 12883749 12982372 13077771 13150829 13239551 13335657 13466842 13602269
8993 13602269 13702397 13811840 13861467 13977400 14137539 14294166 14458231 14557893 14622941 14743247
8983 14743247 14868724 14983726 15063969 15221576 15421118 15581176 15713529 15903375 16164819 16338009
8973 16338009 16464047 16528088 16542739 16554956 16645019 16914467 17173889 17270451 17432224 17677448
8963 17677448 17814230 18054938 18254870 18457937 18667578 18921892 19199056 19346458 19526041
8954 19526041 19746696 19970765 20207940 20468214 20790171 21080136 21264187 21409072 21655481
8945 21655481 21986661 22285516 22606718 22851248 23128521 23504303 23923345 24315437 24726931
8936 24726931 25045261 25386200 25761173 26161855 26575736 27053605 27537383 27989831 28472647
8927 28472647 29013223 29565592 30082632 30662421 31258872 31895192 32535301 33306764 34179282
8918 34179282 34991160 35856182 36786420 37729134 38662439 39739702 40909610 42223830 43672809
8909 43672809 45176247 46794334 48595708 50559609 52756548 55189068 57754498 60218982
8901 60218982 62930614 66476709 71085001 76656817 83421861 91644973 101756024 114351102
8893 114351102 129671415 146768285 158701562 143373155 69826752 -30351827 -82912704
8886 -82912704 -87594718 -75230125 -60942673 -48678545 -38695621 -30416717 -23385810 -17357570
8878 -17357570 -12085937 -7370052 -3070002 928441 4433292 7498499 10370049 13308717
8870 13308717 16310575 19295223 22316229 25307323 28425491 31593521 34952195 38608367
8862 38608367 42540774 46687807 51123623 55852523 60833459 65803294 70968533 77503386
8854 77503386 85979780 96411680 108923706 124005361 142852536 166607456 196392152
8847 196392152 231918251 264762329 257053852 126691044 -96063600 -225072598 -241362515
8840 -241362515 -216391752 -186783174 -161469576 -141287878 -125119752 -111830778 -100631944
8833 -100631944 -91005098 -82574752 -75041716 -68357131 -62839164 -58707091 -55033042 -51216024
8825 -51216024 -47308950 -43484588 -39913814 -36654900 -33426696 -30217581 -27112554 -23989476
8817 -23989476 -20881799 -17783529 -14621252 -11398954 -8159449 -4870946 -1544175 2278458
8809 2278458 6940925 12453812 18873689 26426284 35462161 46635873 60272511 76184151
8801 76184151 91025974 91394056 46891140 -48835607 -124726297 -144758182 -136360259 -122217889
8793 -122217889 -109262702 -98785711 -90402719 -83413511 -77491999 -72495001 -68205052 -64331896
8785 -64331896 -60932224 -58114642 -55895636 -54081685 -52217786 -50403565 -48628369 -46978848
8777 -46978848 -45595532 -44234035 -42979035 -41720600 -40528151 -39443258 -38389843 -37416126
8769 -37416126 -36683887 -35968967 -35269129 -34541964 -33830311 -33174020 -32598823 -32095417 -31518956
8760 -31518956 -30929313 -30352758 -29814576 -29304754 -28827141 -28367540 -27880166 -27474138 -27199780
8751 -27199780 -26830800 -26449852 -26134620 -25813804 -25428968 -25057068 -24725967 -24417362 -24164644
8742 -24164644 -23832812 -23546924 -23273429 -22875109 -22526415 -22326399 -22062671 -21774559 -21543952
8733 -21543952 -21340055 -21160617 -20920773 -20608546 -20386954 -20235982 -19967105 -19793627 -19616038
8724 -19616038 -19489901 -19373116 -19205960 -19054486 -18873260 -18716563 -18587872 -18477368 -18271535
8715 -18271535 -18077059 -17996633 -17875005 -17785637 -17680686 -17529340 -17393226 -17284220 -17151605 -16981165
8705 -16981165 -16782422 -16669882 -16522379 -16303835 -16161408 -16017743 -15837233 -15702092 -15636294 -15517006
8695 -15517006 -15352640 -15196307 -15102742 -15036990 -14964294 -14876945 -14836550 -14709704 -14580478 -14470430
8685 -14470430 -14347582 -14234628 -14101745 -14006813 -13973743 -13889908 -13830839 -13694318 -13590028 -13519216
8675 -13519216 -13422495 -13347540 -13362428 -13411080 -13322611 -13192671 -13128480 -13087310 -12983808 -12821599 -12740281
8664 -12740281 -12729692 -12728182 -12647415 -12563050 -12449184 -12445993 -12408574 -12290320 -12222629 -12113764 -12049464
8653 -12049464 -11989023 -11873849 -11826503 -11793946 -11783486 -11739237 -11658856 -11611583 -11602338 -11524757 -11451290
8642 -11451290 -11352799 -11232180 -11176023 -11182547 -11185578 -11131099 -11036121 -10970575 -10920610 -10845397 -10715514
8631 -10715514 -10680357 -10742097 -10646975 -10564478 -10482133 -10441920 -10439006 -10399123 -10364804 -10282438 -10167353
8620 -10167353 -10170590 -10163944 -10142364 -10108740 -10051426 -10012810 -9964489 -9897729 -9849926 -9822916 -9711792
8609 -9711792 -9626694 -9524395 -9458667 -9527161 -9590567 -9602824 -9602364 -9587678 -9588219 -9579708 -9498207 -9442544
8597 -9442544 -9349642 -9237546 -9161141 -9158741 -9150457 -9182147 -9187191 -9150175 -9057169 -9041982 -9049061 -9016037
8585 -9016037 -8955539 -8904774 -8888955 -8849059 -8786740 -8765782 -8778519 -8797951 -8788123 -8727367 -8673238 -8589416
8573 -8589416 -8608243 -8559903 -8488555 -8422177 -8366676 -8317384 -8271003 -8275560 -8212041 -8122502 -8138146 -8041145
8561 -8041145 -7940742 -8001917 -8118857 -8194476 -8239886 -8183229 -8126454 -8043959 -8014376 -7999260 -7964298
8550 -7964298 -7919882 -7917828 -7847484 -7818228 -7797173 -7848526 -7867603 -7810850 -7753132 -7709206 -7710577 -7657596
8538 -7657596 -7656025 -7629346 -7615509 -7539934 -7467597 -7457869 -7434222 -7431494 -7406339 -7387451 -7328716 -7227249
8526 -7227249 -7232957 -7271315 -7208704 -7159559 -7147329 -7108223 -7051751 -7062026 -7078721 -7068704 -7035354 -7009318
8514 -7009318 -7039974 -7054945 -7012932 -7004435 -6987029 -6982308 -6943434 -6952840 -6954083 -6941315 -6985012 -6906259
8502 -6906259 -6891020 -6907772 -6841179 -6767662 -6663779 -6607419 -6649362 -6648967 -6570669 -6474833 -6416822 -6317483
8490 -6317483 -6211097 -6186313 -6184263 -6080511 -6036241 -5942438 -5922367 -6110878 -6569008 -6930960 -7046601
8479 -7046601 -6922187 -6826071 -6741490 -6618559 -6608512 -6624339 -6628583 -6559621 -6524859 -6381650 -6323190
8468 -6323190 -6330706 -6314418 -6316847 -6284590 -6245572 -6151424 -6079892 -6015217 -6006171 -6028565 -6090170 -6136845
8456 -6136845 -6074682 -5978220 -5928504 -5857757 -5855917 -5852283 -5792333 -5653799 -5648655 -5600268 -5559834 -5433745
8444 -5433745 -5310219 -5261909 -5149244 -4935044 -4674817 -4638407 -5024187 -5986423 -6902391 -7203117
8434 -7203117 -7172306 -7024976 -6841864 -6654888 -6515305 -6479983 -6476738 -6375811 -6293666 -6208238 -6152395
8423 -6152395 -6146391 -6124735 -6069000 -6086950 -6070105 -6050405 -5966449 -5862967 -5797793 -5793008 -5811099 -5809979
8411 -5809979 -5768088 -5757056 -5778003 -5805102 -5788619 -5737789 -5629802 -5601421 -5598703 -5581489 -5591773
8400 -5591773 -5554450 -5533592 -5428110 -5191028 -5083657 -5069864 -5037781 -5154046 -5554948 -5950533
8390 -5950533 -6123441 -6167480 -6140815 -6090359 -6012569 -5973793 -5952596 -5918035 -5876573 -5831666 -5738859
8379 -5738859 -5619084 -5556447 -5618312 -5625858 -5566416 -5552183 -5553086 -5577423 -5592348 -5588082 -5514648 -5491303
8367 -5491303 -5500125 -5520787 -5471925 -5449084 -5370829 -5245985 -5242177 -5273530 -5283220 -5311717 -5334141 -5290330
8355 -5290330 -5223751 -5250705 -5325858 -5343072 -5273347 -5149550 -5106264 -5115634 -5167438 -5162320 -5190910 -5216343
8343 -5216343 -5155765 -5123537 -5092294 -5089482 -5055498 -5051514 -5069413 -5032808 -5031216 -5031462 -5022590 -5017669 -5006418
8330 -5006418 -4992740 -5018353 -4994417 -4952426 -4946504 -4937837 -5005904 -5009770 -4958627 -4942692 -4939355 -4940923
8318 -4940923 -4913222 -4924809 -4879898 -4832438 -4775877 -4841254 -4864247 -4865619 -4826128 -4765161 -4797063 -4691011
8306 -4691011 -4634171 -4690125 -4736376 -4775449 -4781567 -4752625 -4743738 -4744939 -4726743 -4712455 -4701922 -4614164
8294 -4614164 -4574228 -4645589 -4700844 -4682820 -4685937 -4692815 -4739066 -4720347 -4753835 -4674032 -4636573 -4633681
8282 -4633681 -4626785 -4690761 -4717647 -4722758 -4744273 -4674150 -4600879 -4610070 -4607598 -4535805 -4454988 -4482743
8270 -4482743 -4524242 -4514331 -4487565 -4526428 -4547011 -4537739 -4470225 -4391308 -4400109 -4495590 -4464286 -4475477
8258 -4475477 -4478672 -4460524 -4381165 -4334440 -4343674 -4379733 -4367091 -4368953 -4351799 -4412733 -4410740 -4422191
8246 -4422191 -4407850 -4437198 -4394103 -4401479 -4414808 -4374659 -4312361 -4249679 -4201582 -4206526 -4269929 -4348526
8234 -4348526 -4362890 -4326401 -4286431 -4245288 -4202804 -4213961 -4235034 -4244047 -4272255 -4209672 -4109641
8223 -4109641 -4123602 -4152988 -4217780 -4173233 -4099725 -4087223 -4051907 -4055001 -4100906 -4062276 -4048814 -4047704
8211 -4047704 -4088903 -4157034 -4170592 -4104623 -4084912 -4025662 -4001306 -3954028 -3992810 -4004909 -4007390 -4020850
8199 -4020850 -4029837 -3957432 -3945347 -4040044 -4077034 -4090731 -4068933 -4052804 -4122571 -4110984 -4163880 -4115910
8187 -4115910 -4058673 -3999305 -3923934 -3953255 -4029593 -3995862 -3963577 -3938030 -3868068 -3878465 -3924746
8176 -3924746 -3879913 -3853711 -3852849 -3852978 -3874222 -3889467 -3918631 -4000628 -3932800 -3934750 -3989205 -3934202
8164 -3934202 -3868028 -3786980 -3803571 -3819221 -3810300 -3839424 -3847484 -3819567 -3803258 -3804570 -3782333 -3829165
8152 -3829165 -3844106 -3817730 -3797347 -3811303 -3814176 -3833417 -3807304 -3816991 -3815695 -3826641 -3804876 -3790113
8140 -3790113 -3782484 -3839713 -3840342 -3811057 -3804104 -3779183 -3762653 -3788090 -3835399 -3827338 -3847425 -3768561
8128 -3768561 -3686071 -3670312 -3671346 -3674599 -3679581 -3676951 -3697535 -3694942 -3693519 -3724897 -3738923 -3719475 -3646497
8115 -3646497 -3662635 -3668657 -3664372 -3590362 -3510791 -3507964 -3617236 -3645035 -3587243 -3564891 -3647721 -3618828
8103 -3618828 -3570978 -3622775 -3597279 -3551707 -3582293 -3610735 -3539043 -3500425 -3483582 -3491099 -3506616 -3482790
8091 -3482790 -3521751 -3542441 -3530905 -3493869 -3411195 -3362378 -3382777 -3487783 -3605145 -3632705 -3566471
8080 -3566471 -3545053 -3535422 -3536418 -3497962 -3536781 -3526178 -3473780 -3410556 -3329494 -3408752 -3431446 -3424314
8068 -3424314 -3425137 -3398357 -3350497 -3362599 -3420129 -3411579 -3434419 -3490436 -3423246 -3402562 -3443552 -3397795
8056 -3397795 -3422215 -3335140 -3354614 -3361346 -3294388 -3254900 -3288848 -3353829 -3365480 -3411080 -3399983 -3397439
8044 -3397439 -3423116 -3455513 -3406678 -3422700 -3414070 -3379549 -3380130 -3403328 -3373936 -3330386 -3302780 -3341978
8032 -3341978 -3416760 -3390264 -3301100 -3259957 -3263537 -3289871 -3283931 -3283726 -3284463 -3386636 -3372912 -3300281
8020 -3300281 -3255416 -3248817 -3251161 -3299797 -3261041 -3257803 -3294970 -3313396 -3367643 -3374422 -3306546 -3219003
8008 -3219003 -3183650 -3198315 -3219639 -3209914 -3253211 -3226454 -3264020 -3300645 -3298009 -3233008 -3159085 -3199472
7996 -3199472 -3268845 -3310224 -3270665 -3250096 -3302997 -3356914 -3397824 -3400818 -3353892 -3297466 -3255252 -3254332
7984 -3254332 -3271325 -3273324 -3275372 -3260666 -3247843 -3242131 -3306292 -3317995 -3250324 -3187065 -3170762 -3108339
7972 -3108339 -3152640 -3214196 -3261897 -3249494 -3220203 -3180274 -3132180 -3148681 -3136532 -3153024 -3143828 -3129104
7960 -3129104 -3100901 -3107410 -3176216 -3209979 -3212579 -3237941 -3176678 -3097295 -3092014 -3134495 -3131444 -3141407
7948 -3141407 -3119232 -3143004 -3162817 -3124570 -3075342 -3117223 -3128876 -3159945 -3113142 -3076639 -3027327
7937 -3027327 -2999127 -2996321 -2966397 -2971413 -3023190 -3059084 -3092268 -3120680 -3121779 -3138542 -3152662 -3178212
7925 -3178212 -3174832 -3208736 -3196140 -3184820 -3156161 -3107732 -3077386 -3012337 -2958277 -2962424 -2987004 -3023922
7913 -3023922 -3020016 -3051640 -3074679 -3094375 -3118674 -3095925 -3050203 -2984000 -2957185 -3024325 -3006573 -2960106
7901 -2960106 -2909796 -2861055 -2878968 -2906845 -2974238 -2945570 -2952924 -2928671 -2957029 -2954759 -2939672 -2936669
7889 -2936669 -2979325 -2988298 -3001939 -2980614 -2942808 -2820538 -2797758 -2840263 -2920853 -2929160 -2954532 -2964828
7877 -2964828 -2955119 -2951679 -2913012 -2916264 -2896582 -2960262 -2994479 -2975114 -2975380 -3031879 -3043740 -2981076
7865 -2981076 -2925540 -2930059 -2952414 -2896914 -2928362 -2921704 -2813578 -2765923 -2766040 -2797467 -2784853 -2787950
7853 -2787950 -2867282 -2934394 -2864059 -2870775 -2844200 -2831832 -2838500 -2829402 -2933674 -2987009 -2897100 -2864498
7841 -2864498 -2850684 -2848777 -2843361 -2787880 -2833343 -2848020 -2851038 -2838224 -2851377 -2824033 -2799157 -2768789
7829 -2768789 -2819337 -2862070 -2851575 -2748318 -2707641 -2723471 -2779328 -2802755 -2788182 -2779757 -2715296
7818 -2715296 -2715155 -2692289 -2718875 -2771651 -2822538 -2834733 -2785109 -2703671 -2772035 -2789986 -2694714 -2680546
7806 -2680546 -2686596 -2615931 -2613819 -2699435 -2769023 -2747352 -2742341 -2723805 -2678071 -2706337 -2715172 -2676901
7794 -2676901 -2672588 -2662640 -2687117 -2720820 -2707159 -2749143 -2706385 -2699220 -2664214 -2619949 -2560786 -2594402
7782 -2594402 -2619846 -2597909 -2606187 -2624012 -2651815 -2650347 -2642782 -2625732 -2631978 -2628868 -2656586 -2674769
7770 -2674769 -2672641 -2621594 -2630947 -2646402 -2645466 -2670898 -2720647 -2695439 -2668368 -2679661 -2712851 -2679066
7758 -2679066 -2649853 -2627679 -2583909 -2628809 -2664185 -2655635 -2637083 -2638122 -2635281 -2684293 -2693587 -2726425
7746 -2726425 -2633312 -2540313 -2522095 -2481898 -2495252 -2597640 -2595318 -2594718 -2605614 -2599945 -2580590 -2595958
7734 -2595958 -2642997 -2660078 -2587893 -2541656 -2558875 -2616838 -2633152 -2640432 -2684530 -2681626 -2712571 -2632353
7722 -2632353 -2625423 -2606782 -2553332 -2512746 -2533651 -2534103 -2542729 -2556145 -2519105 -2450700 -2459198 -2457731 -2390720
7709 -2390720 -2432272 -2472136 -2476107 -2510458 -2524657 -2442810 -2463095 -2525711 -2541265 -2518016 -2513802 -2540158
7697 -2540158 -2597049 -2623732 -2620366 -2617682 -2633583 -2619447 -2627603 -2597340 -2584419 -2549663 -2517122 -2598239
7685 -2598239 -2601897 -2522707 -2494150 -2445379 -2438893 -2516647 -2528676 -2445701 -2376780 -2397924 -2428485 -2480885
7673 -2480885 -2447949 -2458437 -2487089 -2464752 -2409165 -2404720 -2401474 -2416377 -2490219 -2586401 -2526834 -2448154
7661 -2448154 -2445729 -2426619 -2400150 -2422100 -2462362 -2470875 -2460101 -2459578 -2485812 -2480535 -2452467 -2488156
7649 -2488156 -2550944 -2573595 -2486143 -2419149 -2388845 -2391449 -2407195 -2382035 -2365814 -2287942 -2343117 -2419143
7637 -2419143 -2383384 -2405137 -2367169 -2340435 -2366048 -2396141 -2434991 -2430793 -2427815 -2435139 -2467052 -2501889
7625 -2501889 -2455928 -2422286 -2448480 -2382872 -2385023 -2449953 -2469158 -2448873 -2467031 -2456057 -2427543 -2395553
7613 -2395553 -2354759 -2358469 -2345181 -2346967 -2358429 -2437043 -2468103 -2396989 -2370376 -2370721 -2370071 -2406822 -2395654
7600 -2395654 -2429556 -2363298 -2297449 -2323305 -2410330 -2392656 -2362294 -2350038 -2356846 -2338558 -2325738 -2382574
7588 -2382574 -2384773 -2354447 -2290351 -2313641 -2315934 -2330605 -2296683 -2314243 -2352647 -2375452 -2407519 -2368643
7576 -2368643 -2355384 -2329683 -2307337 -2346360 -2365205 -2336399 -2258887 -2217339 -2153221 -2151652 -2262041
7565 -2262041 -2316914 -2377838 -2334056 -2312914 -2326836 -2302871 -2286885 -2290175 -2252080 -2230290 -2303147 -2301294
7553 -2301294 -2267220 -2317435 -2322408 -2328267 -2329757 -2398056 -2375416 -2326701 -2357976 -2315408 -2314547 -2283696
7541 -2283696 -2281259 -2256930 -2209265 -2206365 -2264105 -2242081 -2248624 -2295976 -2355101 -2388098 -2369005 -2356856
7529 -2356856 -2344247 -2339113 -2318354 -2356345 -2297171 -2314880 -2298007 -2297409 -2324569 -2385197 -2416935 -2398121
7517 -2398121 -2343657 -2299243 -2326081 -2357450 -2384372 -2353611 -2310124 -2277152 -2323582 -2371805 -2367697 -2306325
7505 -2306325 -2252620 -2287925 -2307469 -2211746 -2250430 -2341630 -2419911 -2416507 -2334827 -2284613 -2326862 -2287721
7493 -2287721 -2242866 -2301752 -2319524 -2253107 -2252946 -2255158 -2310236 -2389646 -2389446 -2294384 -2266253 -2265980 -2222684
7480 -2222684 -2219522 -2230568 -2326674 -2289758 -2227574 -2188022 -2183716 -2220473 -2255914 -2287625 -2332748 -2253953
7468 -2253953 -2274715 -2290881 -2217574 -2169423 -2153516 -2142280 -2147846 -2193889 -2214508 -2230903 -2218865 -2184880
7456 -2184880 -2177249 -2188299 -2203065 -2168175 -2135839 -2147798 -2200488 -2234391 -2277108 -2243092 -2232914 -2299120
7444 -2299120 -2312524 -2176387 -2159379 -2225393 -2237624 -2209302 -2250090 -2264410 -2231712 -2165864 -2170596
7433 -2170596 -2258399 -2274532 -2234131 -2205641 -2245129 -2165847 -2072517 -1960413 -1942366 -2005758 -2081340
7422 -2081340 -2066208 -2020389 -2024579 -2048407 -2069162 -2166692 -2241114 -2196031 -2229587 -2229407 -2208333 -2138270
7410 -2138270 -2074187 -2117657 -2159075 -2217689 -2195288 -2206037 -2189832 -2171358 -2138177 -2123236 -2146231
7399 -2146231 -2182126 -2183405 -2150612 -2138893 -2156174 -2172465 -2141642 -2045028 -2059262 -2091965 -2094490 -2067908
7387 -2067908 -2092120 -2123242 -2155838 -2150572 -2123936 -2075261 -2110613 -2157095 -2140410 -2130568 -2078529 -2082936
7375 -2082936 -2065157 -2088536 -2048668 -2023537 -2045132 -2093715 -2133614 -2171944 -2102325 -2042836 -2008897
7364 -2008897 -2002128 -2040064 -2003900 -2000927 -2019976 -1999582 -1999501 -2079790 -2086846 -2112189 -2107255 -2105770 -2085262
7351 -2085262 -2064980 -2077736 -2056390 -2025918 -2062747 -2152496 -2192084 -2175900 -2120156 -2152356 -2219824
7340 -2219824 -2117815 -2037615 -2064161 -2061500 -1979806 -1936832 -1984816 -1996727 -2033214 -2104539 -2076807
7329 -2076807 -2098396 -2088070 -2117734 -2121338 -2087889 -2090678 -2087173 -2046717 -2042545 -2035174 -2068225 -2064571 -2041554
7316 -2041554 -2039196 -2067197 -2042036 -2039648 -1984512 -1962715 -1956417 -1986155 -1985372 -1971578 -1983629 -1992909 -2039935
7303 -2039935 -2062374 -2031274 -2018635 -2003600 -1978593 -2002097 -1956423 -1893044 -1900249 -1983002 -2027842 -2050887
7291 -2050887 -1978502 -2003261 -2015201 -1991889 -2009979 -1960514 -1927563 -2025958 -2081288 -1989378 -1899844
7280 -1899844 -1856732 -1958122 -2024717 -2009900 -1971105 -1964719 -1954986 -1942750 -1903721 -1936719 -1981592 -1971439
7268 -1971439 -1948379 -1974238 -2006391 -2011701 -2020417 -1988702 -1993979 -2001384 -2018081 -1916213 -1910487 -1873936
7256 -1873936 -1920590 -1976364 -1990199 -1956488 -1981507 -1993527 -1968643 -1908518 -1896862 -1922636 -1951557
7245 -1951557 -1945312 -1953638 -1982955 -1971266 -1964483 -1965241 -1898312 -1859187 -1900403 -1955685 -1988587 -1868319
7233 -1868319 -1843937 -1897379 -1971762 -1955726 -1919852 -1907633 -1938654 -1964425 -1938373 -1982095 -1964066
7222 -1964066 -1984261 -1977626 -1921326 -1898677 -1909574 -1966385 -1986556 -1995555 -2063407 -2075071 -2070338 -2022323
7210 -2022323 -1977064 -1911426 -1916487 -1959026 -1988954 -1942292 -1911099 -1941710 -1919243 -1922351 -1941983 -1890164
7198 -1890164 -1879453 -1823403 -1865144 -1917827 -1937033 -1947572 -1995382 -1989766 -1936186 -1939680 -1899691 -1803631
7186 -1803631 -1855983 -1956788 -1912665 -1861876 -1899259 -1950499 -1886592 -1833630 -1941424 -2043225 -1992558
7175 -1992558 -1928399 -1887871 -1864129 -1894047 -1835779 -1849584 -1820253 -1774789 -1781370 -1833296 -1828080 -1823877
7163 -1823877 -1873888 -1913574 -1933140 -1958080 -1967084 -1923470 -1922465 -1906620 -1852037 -1756492 -1826521 -1847811
7151 -1847811 -1779066 -1789034 -1823307 -1861965 -1929063 -1886413 -1802192 -1808912 -1799752 -1860891 -1841286 -1847137
7139 -1847137 -1829332 -1819929 -1814110 -1878373 -1913862 -1910532 -1911044 -1893999 -1878489 -1850840 -1847916 -1879361 -1859462
7126 -1859462 -1831219 -1791722 -1838313 -1858351 -1845059 -1847007 -1810862 -1801864 -1853613 -1823155 -1806918 -1835681
7114 -1835681 -1843396 -1886632 -1906119 -1902857 -1848131 -1798637 -1813756 -1781797 -1790292 -1836321 -1844636 -1868211
7102 -1868211 -1864365 -1840018 -1854631 -1851565 -1882933 -1845316 -1771684 -1723492 -1775318 -1803931 -1794927 -1843805
7090 -1843805 -1862956 -1764559 -1757507 -1709493 -1732084 -1776167 -1762023 -1806781 -1845349 -1825261 -1826670 -1850152
7078 -1850152 -1831834 -1861610 -1843258 -1883937 -1917000 -1927354 -1937748 -1857907 -1852295 -1869059 -1810367 -1778763
7066 -1778763 -1711719 -1720712 -1761699 -1794710 -1831104 -1798527 -1786081 -1821368 -1837352 -1814838 -1824306 -1904676
7054 -1904676 -1928687 -1904994 -1849279 -1808817 -1792164 -1839667 -1855376 -1859591 -1913395 -1959910 -1860266 -1785507
7042 -1785507 -1797414 -1859835 -1876998 -1863169 -1839003 -1766843 -1733778 -1769606 -1806080 -1835034 -1767588
7031 -1767588 -1784045 -1839026 -1761830 -1756070 -1752095 -1759878 -1765416 -1767820 -1735556 -1704162 -1730037 -1754430
7019 -1754430 -1780205 -1809883 -1709706 -1629764 -1628571 -1727185 -1761704 -1730999 -1696854 -1673755 -1682674 -1742913
7007 -1742913 -1774324 -1770360 -1690574 -1716407 -1748105 -1743130 -1738493 -1760724 -1825998 -1849050 -1809578 -1768790
6995 -1768790 -1714549 -1695104 -1754978 -1763154 -1744635 -1720022 -1701753 -1646362 -1670703 -1771415 -1855907
6984 -1855907 -1869912 -1858988 -1795721 -1731294 -1696002 -1702243 -1732225 -1763916 -1754679 -1697753 -1714878 -1707553
6972 -1707553 -1740938 -1777030 -1793905 -1757947 -1664531 -1599933 -1569746 -1614467 -1731443 -1767764 -1748432
6961 -1748432 -1769458 -1777294 -1740159 -1714420 -1728362 -1723848 -1782908 -1783792 -1818270 -1806962 -1758813 -1742793
6949 -1742793 -1804833 -1823966 -1829371 -1763346 -1729456 -1700071 -1684293 -1705987 -1726145 -1744778 -1754834 -1762133
6937 -1762133 -1800555 -1783277 -1798506 -1812073 -1780052 -1755729 -1792060 -1816246 -1836043 -1789964 -1774339
6926 -1774339 -1809810 -1892664 -1846490 -1858346 -1835489 -1794482 -1794255 -1757042 -1710231 -1680153 -1742048 -1766095
6914 -1766095 -1724450 -1666204 -1658328 -1639165 -1687053 -1769418 -1801691 -1762228 -1750334 -1765481 -1730933 -1700130
6902 -1700130 -1678387 -1693482 -1737364 -1756525 -1672665 -1598857 -1648835 -1731336 -1739709 -1734081 -1790672 -1730585
6890 -1730585 -1745701 -1762833 -1790084 -1744933 -1772231 -1763593 -1792917 -1774011 -1767092 -1782053 -1819951 -1698559
6878 -1698559 -1719177 -1741717 -1690080 -1711801 -1688818 -1634844 -1588903 -1585696 -1621396 -1668486 -1695609 -1673996
6866 -1673996 -1654240 -1763033 -1800160 -1799969 -1730365 -1650404 -1645191 -1681250 -1673353 -1623205 -1634479 -1645902
6854 -1645902 -1671617 -1675066 -1710742 -1736670 -1759646 -1750024 -1722550 -1709054 -1714287 -1710292 -1734516 -1731954
6842 -1731954 -1735731 -1729248 -1693399 -1658940 -1605791 -1637022 -1631098 -1677812 -1757089 -1737239 -1708760 -1729194
6830 -1729194 -1734859 -1674376 -1650723 -1644234 -1661953 -1567332 -1531322 -1547802 -1551775 -1597879 -1652326 -1694556
6818 -1694556 -1688618 -1676447 -1672787 -1664110 -1668800 -1642583 -1641209 -1637823 -1661873 -1741596 -1768975 -1739754 -1741983
6805 -1741983 -1764276 -1820029 -1780878 -1714291 -1698368 -1707396 -1675161 -1600904 -1532157 -1543856 -1542919 -1530849
6793 -1530849 -1564566 -1650272 -1708748 -1675613 -1668843 -1640333 -1634602 -1677184 -1631140 -1558987 -1547323 -1566088
6781 -1566088 -1567090 -1579876 -1634963 -1708519 -1691481 -1571075 -1499665 -1506352 -1504351 -1509933 -1594634 -1687421
6769 -1687421 -1639110 -1614560 -1595955 -1612682 -1645887 -1625056 -1599061 -1541129 -1543282 -1559992 -1520041 -1551264
6757 -1551264 -1608715 -1592366 -1609744 -1623431 -1700123 -1655272 -1583253 -1580338 -1599455 -1638391 -1600858 -1603311
6745 -1603311 -1580482 -1538992 -1586885 -1594228 -1605231 -1582640 -1569238 -1607477 -1566280 -1514634 -1522721 -1504953
6733 -1504953 -1585918 -1529985 -1486887 -1500904 -1528065 -1510452 -1472515 -1526918 -1565575 -1551625 -1493328
6722 -1493328 -1498799 -1550610 -1590177 -1568542 -1658316 -1642931 -1584525 -1564779 -1553010 -1543430 -1533531 -1538869
6710 -1538869 -1533228 -1564389 -1572083 -1572184 -1630486 -1626285 -1628301 -1655335 -1622958 -1579420 -1548819 -1510816 -1564866
6697 -1564866 -1677454 -1738833 -1656670 -1591654 -1561389 -1514769 -1497674 -1506352 -1557331 -1618127 -1599625
6686 -1599625 -1594109 -1609471 -1613102 -1584100 -1518108 -1503174 -1459915 -1481972 -1499362 -1528643 -1599676 -1579692
6674 -1579692 -1580575 -1541669 -1540536 -1573976 -1592276 -1561683 -1595038 -1587805 -1612635 -1572623 -1541487 -1549265
6662 -1549265 -1571168 -1580084 -1513874 -1509685 -1566466 -1679693 -1716249 -1585634 -1516340 -1505121 -1540376
6651 -1540376 -1513814 -1467842 -1511269 -1593048 -1555578 -1506507 -1509881 -1524747 -1560775 -1580423 -1557356 -1556675
6639 -1556675 -1543895 -1597300 -1646342 -1591453 -1545661 -1496073 -1462413 -1547896 -1641409 -1653075 -1607568
6628 -1607568 -1576287 -1525402 -1545957 -1572298 -1554028 -1508013 -1503311 -1491465 -1502215 -1522502 -1577275 -1626516
6616 -1626516 -1634085 -1589690 -1599332 -1625326 -1607602 -1582162 -1584168 -1525746 -1499381 -1509448 -1518139 -1490467
6604 -1490467 -1470277 -1551221 -1554746 -1585709 -1586030 -1611089 -1611255 -1632201 -1671388 -1603337 -1544755 -1521215
6592 -1521215 -1519378 -1527934 -1541086 -1486856 -1473656 -1522295 -1511011 -1495504 -1482237 -1479379 -1476550 -1445646
6580 -1445646 -1459333 -1433941 -1451742 -1522469 -1539284 -1589468 -1565473 -1558912 -1614782 -1583584 -1578264 -1582963
6568 -1582963 -1648497 -1665598 -1652054 -1567319 -1528845 -1528485 -1504285 -1576137 -1613148 -1569989 -1457828 -1430957
6556 -1430957 -1488025 -1537979 -1630891 -1603131 -1573842 -1508642 -1499435 -1462494 -1472079 -1531629 -1520803 -1554341
6544 -1554341 -1602510 -1552136 -1557787 -1530210 -1441629 -1416865 -1430916 -1424309 -1427542 -1438496 -1453669 -1433235
6532 -1433235 -1479967 -1481561 -1489930 -1490231 -1535579 -1526169 -1559966 -1551752 -1510773 -1517162 -1572828 -1549769 -1586190
6519 -1586190 -1597702 -1519507 -1460088 -1486855 -1539540 -1503487 -1389527 -1366312 -1416200 -1522395 -1534898
6508 -1534898 -1511065 -1473139 -1392423 -1349165 -1348522 -1403344 -1449145 -1578849 -1599107 -1594259 -1526332 -1497229
6496 -1497229 -1472388 -1509675 -1559074 -1554802 -1528858 -1497330 -1500493 -1425802 -1378635 -1399134 -1436794 -1481353
6484 -1481353 -1535583 -1550386 -1533816 -1497320 -1515218 -1515894 -1526958 -1516313 -1519448 -1557988 -1534618 -1487044
6472 -1487044 -1496349 -1484119 -1493232 -1514352 -1413781 -1362578 -1396168 -1422012 -1470452 -1498254 -1548961 -1574663
6460 -1574663 -1524922 -1463682 -1489091 -1510811 -1491364 -1477436 -1462107 -1510312 -1510971 -1441762 -1417255 -1539590
6448 -1539590 -1594619 -1605628 -1578290 -1536653 -1501827 -1484079 -1463831 -1499629 -1571208 -1559904 -1540389
6437 -1540389 -1503720 -1379220 -1355132 -1436025 -1483081 -1532218 -1472499 -1463356 -1480281 -1499272 -1495131 -1537357
6425 -1537357 -1493066 -1483830 -1487276 -1521372 -1561959 -1592924 -1589364 -1578690 -1504652 -1464870 -1477060 -1455828
6413 -1455828 -1442227 -1502787 -1459837 -1408960 -1424271 -1438647 -1414609 -1376461 -1414049 -1413662 -1404221 -1444272
6401 -1444272 -1447922 -1368746 -1352438 -1434839 -1413756 -1416191 -1436128 -1494594 -1463595 -1410085 -1353490 -1352630
6389 -1352630 -1324166 -1359773 -1424491 -1472514 -1448574 -1393758 -1459141 -1483474 -1491238 -1458552 -1468211 -1466391
6377 -1466391 -1457971 -1511472 -1528013 -1553757 -1577234 -1591484 -1547801 -1475440 -1493918 -1516666 -1537972 -1476845
6365 -1476845 -1482669 -1516569 -1476171 -1495965 -1524877 -1521278 -1513448 -1540626 -1504177 -1491392 -1525019 -1532045
6353 -1532045 -1488592 -1490674 -1509343 -1523758 -1462646 -1371872 -1396914 -1388261 -1377808 -1293194 -1290654 -1298441
6341 -1298441 -1339507 -1373238 -1446819 -1474562 -1417243 -1388094 -1374942 -1389121 -1378260 -1374984 -1361798 -1340078
6329 -1340078 -1321574 -1323761 -1371173 -1389152 -1417204 -1442227 -1486960 -1463232 -1525329 -1546437 -1506867 -1473303
6317 -1473303 -1481800 -1549823 -1594571 -1526550 -1485061 -1489048 -1419095 -1404761 -1427197 -1434340 -1415068 -1421309
6305 -1421309 -1406759 -1415111 -1401803 -1375405 -1329833 -1394157 -1438511 -1480432 -1501781 -1429724 -1372157 -1373162
6293 -1373162 -1378456 -1335467 -1344175 -1372799 -1382592 -1367922 -1391379 -1447439 -1409381 -1403215 -1456957 -1480676
6281 -1480676 -1444699 -1410207 -1487988 -1464962 -1455574 -1443340 -1372618 -1288146 -1289439 -1288458 -1384446 -1434253
6269 -1434253 -1416636 -1439724 -1420076 -1408427 -1378489 -1377472 -1413326 -1476337 -1449047 -1337495 -1301337
6258 -1301337 -1337127 -1346109 -1371844 -1432801 -1489136 -1440636 -1437547 -1437561 -1382803 -1361649 -1310519 -1307389 -1316749
6245 -1316749 -1305445 -1360454 -1421002 -1418877 -1411840 -1403869 -1396957 -1366458 -1373783 -1441915 -1498096 -1441864
6233 -1441864 -1413317 -1379343 -1382504 -1391932 -1368304 -1402163 -1386483 -1392846 -1401278 -1455703 -1421240 -1353966
6221 -1353966 -1326838 -1354988 -1393378 -1396394 -1385766 -1383779 -1330488 -1289397 -1304669 -1327273 -1312898 -1280924
6209 -1280924 -1309214 -1358705 -1441420 -1465466 -1466846 -1445461 -1477066 -1401445 -1375138 -1412572 -1417537 -1406320
6197 -1406320 -1503759 -1482316 -1387793 -1341744 -1359669 -1355228 -1358945 -1361291 -1360443 -1355002 -1357697 -1411867 -1355793
6184 -1355793 -1355411 -1349930 -1408460 -1390649 -1402512 -1453387 -1489559 -1428777 -1323217 -1320708 -1352145 -1343398
6172 -1343398 -1325597 -1363181 -1357689 -1399760 -1407370 -1349618 -1382550 -1417512 -1324576 -1304551 -1253275 -1226090
6160 -1226090 -1281049 -1367423 -1370040 -1365426 -1303413 -1253054 -1233528 -1261978 -1296139 -1316724 -1378943 -1388472
6148 -1388472 -1327560 -1343875 -1373906 -1362516 -1342741 -1321513 -1331024 -1309266 -1288701 -1299481 -1281055 -1233053
6136 -1233053 -1170390 -1225848 -1242214 -1267206 -1283571 -1310709 -1324849 -1315719 -1323521 -1338774 -1357417 -1374093
6124 -1374093 -1403608 -1370815 -1388115 -1401967 -1371024 -1383800 -1443239 -1383232 -1354948 -1372735 -1393703
6113 -1393703 -1451127 -1489840 -1401045 -1393306 -1440620 -1417218 -1393400 -1363144 -1275076 -1261417 -1250939 -1219978
6101 -1219978 -1263933 -1318688 -1380121 -1411538 -1401439 -1356153 -1383259 -1380453 -1392692 -1398361 -1429736 -1423373
6089 -1423373 -1474595 -1504764 -1426525 -1300752 -1300610 -1346510 -1409325 -1407509 -1324744 -1307222 -1321048 -1313687
6077 -1313687 -1322886 -1275907 -1264796 -1285720 -1344675 -1376798 -1379394 -1381730 -1309947 -1334810 -1350953 -1324683
6065 -1324683 -1299433 -1268072 -1282722 -1275238 -1310941 -1314275 -1346944 -1261698 -1301323 -1255970 -1186260 -1216450
6053 -1216450 -1241070 -1271197 -1382777 -1377050 -1383590 -1403208 -1401567 -1378592 -1375451 -1394691 -1329311 -1251374
6041 -1251374 -1280450 -1295700 -1356145 -1379026 -1311480 -1277871 -1278323 -1354557 -1387893 -1392721 -1440284 -1451073
6029 -1451073 -1422367 -1458179 -1444801 -1375696 -1368110 -1254591 -1212327 -1191374 -1199669 -1202758 -1176500 -1158113
6017 -1158113 -1164876 -1243631 -1259078 -1274312 -1293999 -1326779 -1332758 -1284361 -1237983 -1216582 -1167743 -1178090
6005 -1178090 -1164814 -1204163 -1263098 -1279366 -1258737 -1247004 -1261316 -1262871 -1181630 -1167345 -1241996 -1353847
5993 -1353847 -1339936 -1289708 -1266095 -1211054 -1155580 -1121099 -1163238 -1201684 -1299639 -1390980 -1389678 -1324576
5981 -1324576 -1289541 -1290760 -1237835 -1192934 -1176003 -1190664 -1267677 -1339056 -1415608 -1380402 -1326802 -1286103
5969 -1286103 -1306150 -1320289 -1348531 -1327616 -1295720 -1298125 -1280642 -1227593 -1243405 -1291715 -1296052 -1288791
5957 -1288791 -1203677 -1195023 -1268749 -1319583 -1308084 -1308265 -1388585 -1378718 -1330948 -1216256 -1195094 -1213398
5945 -1213398 -1258794 -1289024 -1272344 -1269626 -1296500 -1325495 -1301556 -1259899 -1207059 -1176052 -1141323 -1180974
5933 -1180974 -1219557 -1202526 -1172480 -1260806 -1322023 -1258183 -1278520 -1306843 -1297467 -1373828 -1420394 -1366281
5921 -1366281 -1250470 -1169997 -1156494 -1160853 -1207485 -1258618 -1211168 -1237323 -1262097 -1240646 -1260336
5910 -1260336 -1195974 -1198866 -1230513 -1248772 -1218600 -1229070 -1268539 -1272899 -1234274 -1206440 -1294024 -1383263
5898 -1383263 -1344880 -1305609 -1235426 -1140365 -1052318 -1144464 -1255107 -1239885 -1268334 -1293672 -1269415
5887 -1269415 -1180479 -1227175 -1286848 -1358392 -1415743 -1467773 -1429763 -1349633 -1276776 -1236073 -1228224 -1196413
5875 -1196413 -1245306 -1263173 -1252143 -1274135 -1281402 -1254634 -1285969 -1302797 -1348217 -1406151 -1406105 -1391137
5863 -1391137 -1288354 -1174888 -1240575 -1279996 -1271402 -1230981 -1168235 -1234692 -1301091 -1291458 -1231180
5852 -1231180 -1190233 -1166535 -1179402 -1133092 -1174335 -1187275 -1267008 -1302153 -1313647 -1287469 -1219253
5841 -1219253 -1178027 -1187082 -1195426 -1213584 -1247731 -1222309 -1179956 -1134877 -1186810 -1235219 -1282921 -1254724
5829 -1254724 -1206503 -1232126 -1236682 -1292666 -1264997 -1227334 -1204206 -1176670 -1192873 -1238235 -1240372 -1245973
5817 -1245973 -1259978 -1269261 -1255221 -1248425 -1246343 -1248406 -1221431 -1186521 -1173783 -1254841 -1289726 -1223870
5805 -1223870 -1226619 -1219612 -1227547 -1227646 -1254203 -1271157 -1247644 -1242138 -1295305 -1354205 -1365980 -1326704 -1355007
5792 -1355007 -1304574 -1277056 -1291771 -1293245 -1200583 -1142627 -1150903 -1169185 -1183413 -1210070 -1228428 -1252224
5780 -1252224 -1298715 -1342842 -1284932 -1299705 -1292873 -1303351 -1304613 -1242150 -1237343 -1261679 -1247624 -1226009
5768 -1226009 -1264994 -1241506 -1231559 -1194424 -1173647 -1218140 -1178865 -1177011 -1261616 -1314631 -1302087 -1279097
5756 -1279097 -1284268 -1216011 -1194406 -1199428 -1196630 -1160543 -1136800 -1205262 -1180302 -1179303 -1225809 -1231424 -1206869
5743 -1206869 -1163976 -1137270 -1138730 -1176112 -1227265 -1218434 -1239903 -1248536 -1261726 -1243182 -1185735 -1182907
5731 -1182907 -1183312 -1162464 -1161814 -1117678 -1052751 -1020747 -1087361 -1183401 -1222081 -1255212 -1194950 -1178347
5719 -1178347 -1209669 -1166109 -1178157 -1175761 -1171034 -1206594 -1274812 -1333732 -1261184 -1157253 -1162296 -1182836
5707 -1182836 -1172616 -1203043 -1222205 -1253475 -1282569 -1323898 -1332150 -1368712 -1263540 -1207810 -1167555
5696 -1167555 -1118557 -1022495 -1043129 -1147581 -1245493 -1307758 -1280454 -1289132 -1328288 -1312921 -1282128
5685 -1282128 -1236875 -1199352 -1205551 -1216726 -1235146 -1193477 -1143648 -1121561 -1072421 -1033904 -1015996 -1060286
5673 -1060286 -1081950 -1137768 -1137016 -1106183 -1131383 -1111916 -1187556 -1156427 -1188217 -1214043 -1231278 -1270032
5661 -1270032 -1259677 -1249251 -1181644 -1138249 -1162804 -1158283 -1193358 -1268845 -1273840 -1236533 -1193601 -1236377
5649 -1236377 -1315796 -1298840 -1247129 -1181312 -1191089 -1252674 -1266313 -1239168 -1282797 -1236748 -1153885 -1140160
5637 -1140160 -1187627 -1242072 -1187721 -1102847 -1109976 -1138638 -1160605 -1210972 -1226573 -1197694 -1209928 -1210493
5625 -1210493 -1207239 -1134887 -1081960 -1102806 -1134972 -1153334 -1164611 -1169201 -1110549 -1096170 -1116370 -1134613
5613 -1134613 -1189920 -1294472 -1325189 -1247554 -1110535 -1107044 -1159278 -1220541 -1199945 -1176249 -1168944
5602 -1168944 -1141096 -1150417 -1219149 -1254496 -1253099 -1255443 -1297892 -1342666 -1315047 -1276473 -1180753 -1182268
5590 -1182268 -1198686 -1230363 -1139754 -1121226 -1144554 -1168838 -1283107 -1335238 -1339102 -1301243 -1245813
5579 -1245813 -1157864 -1171562 -1229110 -1214917 -1217499 -1272023 -1266680 -1232182 -1237106 -1276266 -1252021 -1182173
5567 -1182173 -1167566 -1205539 -1311929 -1441486 -1397547 -1288847 -1203478 -1163405 -1193053 -1243695 -1244617
5556 -1244617 -1188037 -1186479 -1154096 -1166072 -1200314 -1246733 -1248041 -1185458 -1208097 -1264265 -1275905 -1253363
5544 -1253363 -1213479 -1262635 -1293470 -1293068 -1240481 -1162033 -1119932 -1177892 -1248025 -1223511 -1233954 -1315112
5532 -1315112 -1334458 -1363892 -1309176 -1279389 -1269787 -1292038 -1287164 -1235069 -1156547 -1109570 -1073860 -1072484
5520 -1072484 -1076892 -1028613 -991657 -1029840 -1003943 -1056783 -1078040 -1051712 -1054990 -1088315 -1125530 -1162451
5508 -1162451 -1095364 -1124089 -1190208 -1198565 -1205572 -1219563 -1187308 -1183612 -1166769 -1156099 -1187712 -1175329
5496 -1175329 -1202100 -1217890 -1179996 -1108312 -1100428 -1127784 -1158519 -1132054 -1082593 -1086536 -1141156 -1157381
5484 -1157381 -1111626 -1069092 -1069315 -1109828 -1064659 -1049051 -1082890 -1053283 -1069964 -1107961 -1162223 -1184071
5472 -1184071 -1130632 -1094912 -1117755 -1099113 -1128192 -1228723 -1224389 -1214334 -1203451 -1180818 -1127156
5461 -1127156 -1168797 -1224544 -1156177 -1132712 -1131434 -1146249 -1133942 -1135905 -1153488 -1193512 -1259134 -1210604
5449 -1210604 -1209337 -1175536 -1172901 -1138276 -1118189 -1098479 -1050343 -1084115 -1091602 -1110570 -1154163 -1148425
5437 -1148425 -1064476 -1028779 -1072848 -1125568 -1163780 -1161807 -1149433 -1142918 -1146621 -1140354 -1148318 -1188636
5425 -1188636 -1138329 -1087371 -1093115 -1114737 -1137180 -1136691 -1113726 -1078415 -1015630 -1058116 -1085153 -1067995
5413 -1067995 -1082394 -1086618 -1110443 -1120374 -1122046 -1168017 -1175814 -1161526 -1138212 -1176929 -1184744 -1166929
5401 -1166929 -1165707 -1178345 -1143951 -1036284 -997005 -1029699 -1087253 -1095399 -1051065 -1022516 -979897 -993543
5389 -993543 -1045908 -1044331 -1068891 -1080960 -1127057 -1160133 -1117469 -1087404 -1182145 -1205884 -1188567 -1166744
5377 -1166744 -1149282 -1108882 -1139393 -1157731 -1161679 -1114164 -1068060 -1082647 -1145231 -1162677 -1180050 -1253603
5365 -1253603 -1251286 -1226296 -1162374 -1064957 -1054107 -1115744 -1125948 -1147396 -1166649 -1120849 -1112262 -1123200
5353 -1123200 -1198538 -1177379 -1144311 -1167783 -1162120 -1164074 -1194701 -1165185 -1100341 -1074798 -1084361 -1133381
5341 -1133381 -1116456 -1158930 -1183281 -1164024 -1169843 -1138398 -1139159 -1161022 -1122362 -1126207 -1127040 -1088350 -1083229
5328 -1083229 -1093575 -1150230 -1178024 -1207106 -1144872 -1110590 -1117411 -1123250 -1129990 -1206233 -1210780 -1145586
5316 -1145586 -1085496 -1048868 -1031096 -1061316 -1082665 -1136063 -1203434 -1257220 -1188004 -1092597 -1003790
5305 -1003790 -971869 -1006988 -1017407 -1027767 -1107072 -1152187 -1157636 -1135616 -1126700 -1140390 -1040645 -1039984
5293 -1039984 -1048368 -983614 -957263 -959245 -992643 -1020992 -1046046 -1051089 -1103774 -1122134 -1117384 -1096442
5281 -1096442 -1134495 -1141366 -1105674 -1092649 -1063576 -1043084 -1050760 -1107149 -1142772 -1147523 -1145236 -1099177
5269 -1099177 -1029878 -976929 -1046084 -1145276 -1113495 -1049605 -1059937 -1052138 -1067837 -1035491 -1067853 -1074092
5257 -1074092 -1038153 -1081112 -1118172 -1056999 -1038040 -1142361 -1172207 -1150185 -1106069 -1084045 -1098540
5246 -1098540 -1054972 -1065263 -1064634 -1150862 -1172247 -1165752 -1137533 -1130564 -1140775 -1125711 -1078870 -1008457
5234 -1008457 -1060579 -1089262 -1051035 -1068282 -1058474 -1084578 -1120785 -1124785 -1180062 -1126652 -1104647 -1085272
5222 -1085272 -1008822 -970759 -988517 -974305 -986852 -979883 -961821 -1070178 -1112798 -1070400 -1063471 -1083114
5210 -1083114 -1139640 -1107730 -1044897 -994682 -1017892 -1014548 -1005864 -1033901 -1019184 -1114725 -1164567 -1158259
5198 -1158259 -1121195 -1113042 -1100520 -1094179 -1078038 -1084171 -1108627 -1083415 -1113764 -1160009 -1199307 -1237322
5186 -1237322 -1181717 -1215922 -1181288 -1106374 -1123388 -1156738 -1094738 -1072017 -1048628 -1061852 -1142309
5175 -1142309 -1211697 -1212209 -1189355 -1069430 -1024636 -1078714 -1152996 -1157969 -1036153 -993801 -1104402
5164 -1104402 -1179284 -1139109 -1115603 -1181109 -1231253 -1156424 -1092887 -1082110 -1036031 -989653 -1020846
5153 -1020846 -1049558 -1036342 -1018521 -984543 -938381 -948877 -978284 -1021639 -1073801 -1151275 -1157774 -1166918
5141 -1166918 -1044635 -1081853 -1083758 -1048759 -1006318 -1013159 -1021570 -982926 -994696 -1050199 -1050367 -1043817
5129 -1043817 -1063895 -1102314 -1059539 -1058111 -1080358 -1107020 -1132083 -1121374 -1105681 -1075897 -1046832 -1119447
5117 -1119447 -1163129 -1139525 -1155635 -1202402 -1243512 -1172922 -1056854 -995812 -1010182 -1027042 -1017274
5106 -1017274 -964094 -980497 -985670 -1043282 -1049450 -1043471 -1064712 -1062615 -1054792 -1096518 -1057075 -1033330
5094 -1033330 -1051313 -1019970 -1059819 -1183086 -1254364 -1213893 -1204907 -1210583 -1165644 -1132607 -1068150 -1049275
5082 -1049275 -1082140 -1132992 -1075874 -1044459 -1055082 -1083114 -1009889 -972918 -993932 -1060937 -1076331
5071 -1076331 -1058888 -1037220 -1061194 -1091981 -1133551 -1142424 -1151699 -1157364 -1166148 -1163658 -1164124 -1123872 -1048187
5058 -1048187 -1079428 -1094416 -1036103 -1029765 -1056509 -1103700 -1155500 -1094123 -1085523 -1124571 -1081523 -1019918
5046 -1019918 -1022021 -1084780 -1131962 -1069819 -1030809 -1050252 -1100149 -1088494 -1015939 -977517 -984678 -1012662
5034 -1012662 -1005325 -1025738 -1015424 -998328 -1061231 -1090805 -1150439 -1171135 -1096044 -1081749 -1061131 -1048476
5022 -1048476 -1076670 -1125634 -1086971 -1103922 -1132694 -1100700 -1077505 -1136394 -1121415 -1119381 -1121733 -1158453
5010 -1158453 -1139352 -1131279 -1122115 -1133495 -1122772 -1111124 -1093250 -1065300 -1078313 -1154126 -1167667 -1182326
4998 -1182326 -1198328 -1117769 -1050939 -1038721 -993321 -936543 -958848 -1034402 -1084386 -1050076 -1031234
4987 -1031234 -1078896 -1116675 -1011198 -987000 -990937 -983827 -996032 -1055767 -1097443 -1084959 -1090472 -1081254
4975 -1081254 -1020857 -1043520 -1068039 -1067357 -1083101 -1150797 -1127739 -1053653 -1091077 -1155919 -1195269 -1082275
4963 -1082275 -1038284 -1071905 -1023907 -1051900 -1041125 -997980 -988190 -951842 -1015718 -1095047 -1119005 -1089521
4951 -1089521 -1085758 -1049880 -1051003 -1115724 -1105303 -1097034 -1086742 -1146859 -1134277 -1068900 -1084928 -1103093
4939 -1103093 -1077203 -1071760 -1061704 -1080689 -1053746 -1018779 -957077 -895515 -892121 -951408 -1016383 -964192
4927 -964192 -1043094 -1114031 -1113345 -1067497 -1005781 -960299 -969369 -1087925 -1111094 -1065815 -1059018 -1048353
4915 -1048353 -1033796 -1063825 -1098626 -1034540 -935975 -935685 -987141 -954068 -1014870 -1082855 -1084293 -1076368
4903 -1076368 -1034404 -1048225 -1128764 -1050321 -999616 -1041944 -1075814 -1055691 -1112712 -1122745 -1074142
4892 -1074142 -1004124 -1034474 -1087915 -1098815 -962672 -895690 -936564 -956616 -960611 -1036455 -1104979
4881 -1104979 -1126385 -1114233 -1066174 -1040778 -1069101 -1134028 -1178505 -1177368 -1115654 -1072049 -1034580 -1074169
4869 -1074169 -1029391 -1039751 -1055375 -997681 -981779 -1016521 -1082630 -1142391 -1103315 -1012386 -1027086
4858 -1027086 -1133647 -1068684 -1000411 -1049039 -1051235 -1024408 -1014617 -1002297 -1006505 -1032578 -1050964 -1082078
4846 -1082078 -1086518 -1006888 -953263 -991611 -987740 -1032420 -1037484 -1026692 -974158 -1039866 -1088195 -1118499
4834 -1118499 -1115883 -1084031 -1026866 -1019025 -1027919 -998959 -984680 -960791 -963227 -932169 -926301 -958824
4822 -958824 -1029503 -978176 -999146 -1087540 -1112417 -1047655 -1034450 -1082229 -1069253 -1102572 -1174730 -1107154
4810 -1107154 -1022971 -998155 -1016912 -983682 -926360 -894367 -869257 -922914 -987647 -1012815 -941903
4799 -941903 -875298 -887802 -954155 -967487 -1003809 -1024248 -1010354 -1017733 -1013603 -1014924 -1012657 -943866
4787 -943866 -918692 -975526 -1052509 -1135701 -1145476 -1159853 -1136645 -1062004 -1014270 -1048896 -1145683 -1107606
4775 -1107606 -1027991 -1020942 -1016996 -1050439 -1072072 -1093191 -1156621 -1098799 -1028233 -1008757 -988965 -1004065
4763 -1004065 -1066462 -1084866 -1010268 -999480 -1012185 -999795 -1060979 -1090474 -1059578 -1030075 -968514
4752 -968514 -913626 -909257 -872507 -865780 -913988 -1006044 -1042609 -1059946 -1054459 -985842 -979796 -958611
4740 -958611 -1022228 -1054422 -1084036 -1128674 -1101018 -1083582 -1059294 -1015108 -995322 -1026086 -1083306 -1044766
4728 -1044766 -1023013 -971341 -979618 -1060983 -1067708 -1038204 -1015085 -945557 -926928 -970106 -971752 -947887
4716 -947887 -945738 -973909 -943287 -989624 -965926 -1016700 -1086575 -1074503 -1075669 -1079350 -1107727 -1100355
4704 -1100355 -1075574 -1053470 -1090563 -1080163 -998586 -954630 -946186 -933254 -947357 -1003237 -1009137 -1005951
4692 -1005951 -1013589 -1045080 -1103070 -1100554 -1037480 -1066811 -1081320 -1046468 -1021519 -1003208 -1015078 -1041129
4680 -1041129 -1094331 -1046314 -989006 -1045501 -1109495 -1025782 -952286 -1024294 -1081818 -1054785 -1027152
4669 -1027152 -1034620 -951658 -912748 -960998 -1013450 -1019421 -1018906 -1057691 -1000100 -1022100 -1035616 -968923
4657 -968923 -953055 -1020528 -1043549 -1008569 -960504 -966774 -964218 -1034272 -1013499 -992323 -954141 -932362
4645 -932362 -860790 -855236 -896348 -882411 -868784 -874616 -942369 -1030377 -1070356 -1024276 -1030756 -1016828
4633 -1016828 -1055611 -1087414 -1035184 -1004808 -999357 -996586 -985431 -982852 -960323 -955416 -961989 -982095
4621 -982095 -1057339 -1069682 -1036118 -1053802 -959386 -936499 -982007 -1045828 -1057466 -1059134 -1080791 -1072541
4609 -1072541 -1045482 -1062942 -1027956 -981601 -905889 -872225 -848091 -840649 -911841 -945658 -915910 -941376
4597 -941376 -937711 -950376 -930188 -916914 -942054 -1009972 -1076828 -1049175 -1073106 -1063630 -1044254 -1079436
4585 -1079436 -1052732 -1006005 -1010972 -1036409 -980880 -1020376 -1068098 -1106878 -1033364 -979267 -962215 -957648
4573 -957648 -976938 -944460 -994578 -1049272 -1073948 -1065955 -1013107 -983496 -1021529 -1023701 -953205 -947845
4561 -947845 -917621 -931469 -906295 -836569 -830484 -897072 -897561 -919926 -993556 -1013679 -967286 -971061
4549 -971061 -953610 -986028 -998900 -982909 -899686 -884707 -888591 -908503 -840712 -837052 -910530 -956183
4537 -956183 -990335 -1006741 -1043970 -1065634 -1084877 -1043309 -1058923 -1019642 -949939 -902891 -924648 -943872
4525 -943872 -928457 -950089 -940729 -973210 -1000976 -1043261 -1041190 -1044511 -954043 -912382 -982652 -1003903
4513 -1003903 -995021 -914914 -914067 -889852 -857469 -871639 -901126 -960086 -944823 -1015262 -1085209 -1064349
4501 -1064349 -997915 -929306 -897501 -931973 -959329 -970106 -928501 -883605 -892782 -873422 -858792 -937661
4489 -937661 -927075 -879858 -859129 -869451 -898473 -991326 -1071270 -1095384 -1096958 -1100255 -972653 -1000084
4477 -1000084 -1072666 -1072836 -1003952 -930351 -965145 -959539 -912039 -864184 -942568 -959998 -919612 -902067
4465 -902067 -911351 -970098 -934579 -923626 -961132 -938124 -887174 -922064 -935243 -995553 -976538 -917952
4453 -917952 -933021 -873903 -876954 -909100 -957341 -990869 -962868 -951994 -989695 -914936 -876040 -913822
4441 -913822 -990431 -1034671 -1049273 -1056617 -1056401 -1061099 -1069687 -1046542 -989794 -994027 -1018204 -1030791 -1001362
4428 -1001362 -918889 -929302 -906516 -924554 -937662 -904826 -901010 -905787 -887145 -928120 -938955 -935419
4416 -935419 -989104 -1002024 -1010686 -920047 -887745 -997511 -1054032 -1027715 -993441 -1012440 -1073305 -1077167
4404 -1077167 -1013897 -960873 -904995 -871328 -858169 -840812 -866537 -883805 -839254 -831123 -880397 -857793
4392 -857793 -837067 -930627 -982869 -969965 -1019077 -1036175 -1001424 -990429 -923647 -871566 -947682 -977912
4380 -977912 -997944 -1001162 -1026264 -1016706 -976519 -942852 -957836 -1011081 -1030478 -990538 -987444 -965163
4368 -965163 -884103 -839918 -839236 -931607 -935362 -880027 -868429 -874993 -903329 -980586 -986439 -940713 -946236
4355 -946236 -933198 -931987 -905962 -953434 -927267 -903292 -908550 -915709 -903381 -944344 -988296 -995057
4343 -995057 -1025443 -982961 -946965 -935851 -961863 -956423 -931444 -962924 -953315 -969416 -984610 -972725
4331 -972725 -967666 -996396 -982688 -983083 -1032596 -1095441 -1062748 -964864 -894147 -920090 -888371 -880530
4319 -880530 -979748 -943830 -900467 -954697 -961705 -949066 -894929 -855912 -836784 -906394 -1001812 -992716
4307 -992716 -1008720 -1016676 -983829 -953125 -926677 -997188 -1056140 -1070933 -1096087 -1096000 -1114000 -1027096
4295 -1027096 -952658 -929743 -968779 -952520 -900464 -918706 -1025033 -1093835 -1077692 -1041576 -1036270
4284 -1036270 -983069 -1005734 -979690 -957245 -1003546 -1018954 -1006201 -914848 -970875 -960894 -948785 -867073
4272 -867073 -876464 -951572 -985874 -981264 -924407 -897923 -917050 -904592 -925482 -985512 -1037434 -1010936
4260 -1010936 -939889 -934641 -882046 -949830 -1022982 -1030108 -1041460 -1009140 -936373 -909232 -986110 -1005142
4248 -1005142 -942668 -890161 -887499 -876691 -877595 -918802 -968157 -991504 -1013318 -950152 -914951 -879479
4236 -879479 -911056 -964317 -954951 -912705 -844903 -875697 -929529 -931828 -924241 -949248 -976469 -1035615
4224 -1035615 -1019620 -1023629 -963019 -943264 -940525 -925381 -857923 -869252 -897736 -905442 -907879 -902215
4212 -902215 -878308 -934615 -1047273 -983864 -961060 -1011051 -1024337 -983379 -957635 -875697 -849635
4201 -849635 -891760 -959668 -987621 -996271 -932920 -974942 -1036896 -1034278 -971940 -940068 -933853 -926938
4189 -926938 -913322 -864721 -827451 -874091 -888726 -931659 -958468 -942784 -914722 -858795 -865423 -844506
4177 -844506 -848478 -877291 -868352 -904410 -935677 -968860 -932094 -895935 -895668 -904085 -919543 -962275 -937081
4164 -937081 -877523 -868175 -950024 -1013316 -1011891 -908635 -923116 -872103 -911219 -941639 -900895 -908136
4152 -908136 -930453 -924680 -946195 -913172 -934838 -989565 -991454 -1009508 -983740 -955164 -1005818 -941302
4140 -941302 -941708 -983725 -967842 -892790 -812136 -814048 -874111 -939744 -1003619 -961617 -901153 -906992
4128 -906992 -974928 -1030050 -1049673 -1030271 -1013803 -1008634 -916020 -815497 -832334 -847839 -876636 -882156
4116 -882156 -944772 -946718 -951072 -948240 -957804 -965026 -916402 -971992 -940584 -914711 -944565 -953005 -988177
4103 -988177 -928315 -912269 -1037509 -1039417 -1039095 -1019998 -973659 -1007118 -1017728 -932366 -919218 -984943
4091 -984943 -1019811 -966534 -929064 -970104 -998759 -1028814 -1064590 -1024411 -979493 -958157 -957016 -1018582
4079 -1018582 -1016036 -1032219 -1050091 -1039762 -994150 -945381 -899176 -887929 -906689 -951880 -1024917 -1028193
4067 -1028193 -966769 -981066 -932219 -920526 -1009726 -1090747 -1104662 -1094633 -1017675 -914518 -891043
4056 -891043 -903584 -934560 -984982 -1044793 -987794 -919075 -883268 -828281 -853902 -911117 -933465 -923476
4044 -923476 -837984 -787112 -760273 -837041 -928714 -930552 -884564 -797696 -811188 -855138 -841731 -811944
4032 -811944 -782641 -763046 -859279 -994122 -992371 -983341 -937944 -912086 -902125 -890529 -862343 -925245
4020 -925245 -980240 -987771 -966937 -961760 -939059 -893734 -823921 -833939 -808396 -795083 -785975 -863527
4008 -863527 -878139 -885286 -897267 -946155 -943602 -922211 -883646 -938477 -982608 -982932 -966226 -940332
3996 -940332 -917996 -913892 -924623 -923649 -875803 -831000 -821038 -826917 -815116 -797949 -832308 -841231 -840506
3983 -840506 -818009 -899594 -901335 -891412 -894880 -872989 -865031 -917488 -910532 -883298 -855513 -910637 -901874
3970 -901874 -891416 -885468 -900158 -927246 -918860 -956385 -970508 -981273 -925250 -901312 -918669 -908915
3958 -908915 -885140 -860420 -785467 -857342 -952752 -981021 -968076 -949503 -933406 -934070 -961984 -953469
3946 -953469 -906586 -866029 -891974 -974024 -989557 -897232 -916555 -958076 -918909 -944362 -991018 -1006177
3934 -1006177 -1030621 -1042349 -1078919 -1019858 -968040 -909314 -952175 -983448 -992786 -1006418 -983338 -896737
3922 -896737 -853839 -837950 -876402 -935312 -1004902 -997555 -911653 -903447 -917676 -874968 -834247 -886458
3910 -886458 -889791 -936328 -931491 -925100 -934331 -922080 -929620 -980271 -964814 -952230 -863477 -875999 -865420
3897 -865420 -876984 -922782 -898271 -851028 -853820 -925728 -903938 -887396 -876936 -934108 -927618 -849356
3885 -849356 -796370 -774954 -792821 -846429 -864949 -872256 -858694 -907344 -920697 -907991 -869801 -864202
3873 -864202 -904064 -918983 -887299 -925267 -963003 -1021568 -1000280 -901097 -838709 -793722 -836441 -875039
3861 -875039 -845213 -783935 -832015 -879701 -909150 -948058 -938020 -978308 -975365 -977054 -979450 -991878
3849 -991878 -960853 -869921 -853536 -947391 -968596 -904118 -844331 -903901 -898205 -886616 -929254 -959660
3837 -959660 -941968 -955208 -943934 -847204 -798301 -826413 -816401 -760399 -824295 -930967 -951038
3826 -951038 -957875 -988286 -1008481 -913424 -921927 -853950 -728066 -719820 -748002 -760382 -772021 -790367
3814 -790367 -818164 -841914 -875394 -879661 -840438 -778844 -793977 -827576 -839821 -807221 -806298 -814437
3802 -814437 -802005 -825063 -845625 -848043 -875790 -900933 -893106 -830609 -785569 -794875 -815652 -777779
3790 -777779 -783748 -815031 -806413 -838168 -807379 -825829 -872312 -888280 -842180 -853113 -881298 -878818
3778 -878818 -870006 -900229 -907799 -937153 -888950 -828552 -820264 -788203 -756987 -799109 -825598 -909188
3766 -909188 -891874 -896112 -926951 -967262 -952291 -852406 -838388 -809952 -772183 -832142 -862658 -860155
3754 -860155 -852050 -835407 -852115 -877026 -890711 -902118 -931089 -895625 -885372 -945199 -935066 -870782
3742 -870782 -849200 -827724 -843424 -882412 -891427 -878519 -815971 -849423 -874530 -913278 -920861 -913528
3730 -913528 -925920 -906949 -871103 -847823 -828727 -869989 -910410 -894670 -875205 -869167 -885661 -901581
3718 -901581 -960028 -955587 -870773 -792223 -819493 -864122 -896055 -956860 -957867 -871610 -830526 -795635
3706 -795635 -841169 -848010 -864362 -818280 -766455 -789511 -815321 -863318 -858335 -808277 -820509 -790574
3694 -790574 -770132 -817326 -849792 -835086 -802337 -839050 -842345 -812054 -789343 -802565 -865274 -887744
3682 -887744 -909093 -875712 -865576 -861099 -869960 -915040 -924372 -948284 -941020 -869676 -799207 -778385
3670 -778385 -844936 -867032 -895301 -857311 -834367 -877185 -849552 -845003 -850757 -834949 -882401 -961200
3658 -961200 -1010455 -935117 -890542 -912597 -859706 -829195 -868241 -921274 -881098 -834890 -885306 -898032
3646 -898032 -826031 -792010 -806270 -840671 -835527 -777637 -753049 -740713 -787152 -848607 -898933 -881763
3634 -881763 -861598 -803969 -827850 -810721 -774840 -763441 -780888 -804344 -854670 -808945 -745488 -711865
3622 -711865 -764151 -754162 -809792 -844366 -899486 -859194 -807747 -815189 -753067 -750730 -780343 -783023
3610 -783023 -778105 -814731 -822642 -870582 -840555 -840717 -821615 -824896 -853908 -869885 -852181 -836529 -801285
3597 -801285 -830627 -839138 -857679 -900371 -939794 -894916 -852776 -882936 -878468 -911796 -886823 -884542
3585 -884542 -890837 -889754 -848590 -838832 -833815 -850038 -799049 -816733 -830892 -847799 -864011 -819732
3573 -819732 -783526 -793258 -903070 -922341 -902247 -880789 -880730 -857716 -885008 -906174 -916836 -879206
3561 -879206 -828939 -788898 -852110 -958465 -982491 -937839 -861470 -839705 -815069 -798678 -854249
3550 -854249 -835553 -787832 -795486 -830646 -884164 -880148 -843045 -752455 -650026 -673659 -754356 -833497
3538 -833497 -900616 -884276 -848255 -894609 -915072 -942670 -890633 -900456 -919906 -884655 -906538 -935693
3526 -935693 -899796 -878860 -903028 -923169 -979412 -978034 -918131 -905303 -911870 -978904 -943977 -878164
3514 -878164 -927833 -870915 -844701 -789787 -734188 -671604 -743894 -797098 -851531 -872339 -972307 -1018099
3502 -1018099 -928286 -923212 -902421 -969713 -958730 -916198 -904668 -904825 -843045 -893729 -884401 -881333
3490 -881333 -897779 -971818 -990692 -1010801 -987596 -969554 -945869 -954342 -962701 -960502 -1000638 -1042019
3478 -1042019 -1026189 -986090 -897072 -869753 -877426 -843009 -804129 -779376 -809008 -783181 -825561 -887007
3466 -887007 -882446 -920410 -882621 -908479 -877976 -843666 -832831 -876151 -893548 -881744 -896644 -962590
3454 -962590 -863836 -823856 -863093 -921942 -922583 -880707 -864947 -862283 -802629 -760827 -815949 -850881
3442 -850881 -891251 -898785 -919272 -928888 -893173 -823562 -800823 -830609 -921685 -944022 -904668 -841111
3430 -841111 -888876 -956817 -942731 -900719 -875689 -895391 -930620 -984089 -898178 -896155 -948458 -901490
3418 -901490 -818447 -831619 -857574 -855696 -808424 -812491 -813763 -720923 -727851 -803224 -867179 -908683
3406 -908683 -896424 -904981 -887819 -898822 -899823 -964213 -964278 -914397 -920897 -945040 -901632 -836943 -804848
3393 -804848 -849317 -942326 -950725 -916961 -958960 -984498 -902689 -795454 -811059 -891389 -982643 -996426
3381 -996426 -944092 -875650 -896791 -959554 -975487 -998930 -965316 -925540 -906084 -916638 -963114 -964729
3369 -964729 -873906 -892707 -938826 -921482 -870094 -808939 -781962 -828483 -898890 -921370 -881540 -855952
3357 -855952 -806482 -852139 -897428 -908717 -942397 -1001114 -977899 -866578 -830883 -843237 -908886
3346 -908886 -908057 -892469 -838546 -873640 -849634 -795678 -749644 -792058 -865578 -841555 -849512 -895022
3334 -895022 -914479 -888927 -897162 -891851 -847743 -828123 -818578 -869339 -894466 -899328 -896185 -861840 -837797
3321 -837797 -910628 -919010 -908316 -958964 -943595 -955534 -945816 -887084 -876027 -874934 -875674 -861406 -875674
3308 -875674 -832891 -841415 -860096 -854754 -812569 -706785 -670080 -707657 -675746 -689586 -669700 -695759
3296 -695759 -731220 -802058 -920295 -897406 -912520 -920341 -849429 -801769 -787112 -750807 -762037 -767318
3284 -767318 -810279 -786945 -751453 -766049 -817257 -861807 -927656 -918730 -897745 -850937 -880675 -870815
3272 -870815 -825365 -839247 -839060 -828535 -825938 -813626 -848599 -888768 -879441 -856456 -827614 -688485
3260 -688485 -691736 -759392 -786809 -798431 -814374 -783774 -762087 -754473 -769286 -785835 -767431 -791038
3248 -791038 -835881 -857993 -848351 -835047 -871461 -848177 -889357 -928231 -908915 -870521 -876149 -905413
3236 -905413 -897175 -854454 -852246 -922325 -917657 -942493 -993367 -998358 -957690 -933582 -943843 -870715
3224 -870715 -815494 -821867 -849618 -816233 -796993 -798816 -730134 -740487 -785866 -812523 -814558 -742637
3212 -742637 -741447 -825323 -800679 -816573 -755475 -742451 -782713 -779818 -828098 -843483 -833821 -780430
3200 -780430 -778500 -769430 -741303 -754895 -745688 -740805 -745803 -817688 -833159 -808772 -735765 -724879 -735552
3187 -735552 -705150 -742627 -775630 -833674 -843360 -901115 -921140 -831858 -790859 -804208 -819815 -809892
3175 -809892 -781128 -797201 -835497 -849502 -886714 -863958 -796214 -769529 -804739 -897346 -971413 -984069
3163 -984069 -892453 -812817 -770138 -781133 -842809 -868551 -836553 -796201 -845416 -890348 -904499 -817998
3151 -817998 -828371 -838718 -776834 -734852 -750084 -729033 -760075 -774128 -749057 -751072 -816942 -818917
3139 -818917 -809054 -782410 -767416 -779001 -825909 -847857 -907218 -919539 -913019 -912691 -842473 -763687
3127 -763687 -737396 -762587 -768543 -757317 -804653 -859321 -783417 -749038 -790862 -875669 -926070 -869207
3115 -869207 -895391 -872086 -815369 -774439 -792488 -861105 -928761 -923809 -842650 -733106 -764637 -802087
3103 -802087 -803244 -801144 -809349 -880912 -887566 -835929 -858765 -870341 -891690 -875906 -839357 -862657
3091 -862657 -862069 -815295 -801921 -835932 -773435 -786990 -848896 -825881 -810017 -797519 -787426 -805574
3079 -805574 -829560 -865798 -783540 -685391 -694908 -747921 -753443 -734028 -730421 -740882 -806473 -823487
3067 -823487 -815001 -791170 -774340 -831185 -824511 -841964 -771530 -731939 -766965 -739106 -745876 -798941
3055 -798941 -809540 -754782 -755601 -820177 -844355 -821872 -796893 -759664 -830576 -903425 -911527 -912594
3043 -912594 -865778 -831884 -783839 -796952 -865273 -893037 -818310 -801972 -801970 -760303 -754401 -766770 -777355
3030 -777355 -830793 -916506 -886419 -848420 -851238 -846156 -787490 -811418 -857220 -866000 -873029 -887475
3018 -887475 -881960 -829525 -774538 -765281 -810844 -758324 -670630 -659321 -723263 -770901 -786553 -801063
3006 -801063 -784762 -794982 -790777 -759549 -713628 -750968 -803498 -785422 -802093 -875654 -909342 -905307
2994 -905307 -904172 -838746 -817623 -762066 -756602 -740797 -717492 -723181 -771786 -812530 -808975 -750230
2982 -750230 -764087 -823974 -852044 -855344 -781161 -824277 -862471 -843906 -866162 -914965 -900093 -890988
2970 -890988 -828214 -730759 -737670 -822817 -895217 -897028 -953819 -974241 -845221 -794987 -766597 -809704
2958 -809704 -891916 -910960 -876533 -865855 -853988 -828661 -785502 -791803 -790640 -800207 -863923 -913828
2946 -913828 -869155 -843142 -865395 -828382 -793213 -716125 -674589 -677376 -676541 -681957 -756622 -857643
2934 -857643 -973969 -881121 -805846 -811560 -813347 -768655 -764240 -731614 -738309 -750884 -787045 -783373
2922 -783373 -742410 -794643 -808442 -742390 -782691 -831295 -809021 -769832 -843925 -914849 -877117 -815574
2910 -815574 -746129 -792000 -819191 -755048 -716890 -759022 -721172 -667997 -732628 -706067 -693106 -650069
2898 -650069 -685313 -719013 -727902 -703133 -739477 -804707 -850015 -837592 -818799 -803241 -773201 -780392
2886 -780392 -802714 -803749 -832746 -868236 -868051 -879698 -870006 -858668 -889027 -926748 -951217 -901240
2874 -901240 -784128 -785905 -863852 -841844 -798511 -796258 -818845 -824090 -899027 -919188 -899939 -773793
2862 -773793 -774696 -769450 -780361 -857254 -892968 -867984 -809971 -786894 -777178 -840350 -842875 -849918 -793662
2849 -793662 -718920 -693254 -682721 -716667 -764830 -781533 -757017 -785375 -753862 -748996 -711428 -728170
2837 -728170 -761801 -898737 -991949 -907157 -778028 -772378 -781108 -788791 -790857 -757167 -715435 -709094
2825 -709094 -693201 -754050 -811430 -833812 -831003 -805184 -722520 -627031 -682068 -711600 -698600 -707158
2813 -707158 -794332 -775698 -720977 -780918 -808993 -828498 -816397 -815072 -828770 -843591 -860212 -881488
2801 -881488 -878646 -843839 -793358 -677524 -656199 -642188 -600342 -656476 -691006 -668335 -732135 -814502
2789 -814502 -814356 -809874 -812280 -811158 -840024 -857701 -841425 -836268 -773178 -758724 -791793 -800476 -851220
2776 -851220 -833672 -805152 -800880 -774437 -798771 -780783 -724396 -737947 -795271 -826814 -795579 -777420
2764 -777420 -653676 -564578 -621236 -677691 -739087 -753666 -775946 -810354 -842187 -782181 -751124
2753 -751124 -706925 -754285 -839379 -798906 -694298 -725719 -816879 -790971 -811101 -804375 -812789 -764720
2741 -764720 -754177 -760184 -779022 -782723 -836406 -844050 -750346 -755938 -842599 -847384 -825139 -784209 -786163
2728 -786163 -813175 -806210 -811484 -761593 -721105 -739914 -750295 -736931 -716425 -718165 -711812 -712880 -730646
2715 -730646 -715616 -697869 -734643 -815736 -893390 -908213 -916213 -875693 -831829 -801130 -760790 -771216
2703 -771216 -797614 -829135 -839124 -807299 -769752 -810691 -765495 -710440 -661107 -653351 -712776 -790152
2691 -790152 -775211 -757964 -784473 -849767 -876975 -854543 -854799 -841210 -858579 -898095 -867121 -809674
2679 -809674 -791726 -822593 -848376 -788921 -807462 -812881 -819204 -817508 -835177 -836121 -876309 -924727 -869496
2666 -869496 -839556 -796740 -796121 -782944 -852601 -844950 -824101 -848684 -827408 -814754 -777565 -777837 -772860
2653 -772860 -755280 -737161 -765286 -793140 -785562 -780506 -852383 -922111 -882052 -887074 -887270 -804331 -773768
2640 -773768 -723006 -736421 -761897 -751370 -764344 -742936 -768326 -828335 -798519 -822386 -768871 -717199
2628 -717199 -621736 -634145 -653435 -614246 -684279 -686135 -674159 -732174 -721328 -687398 -676467 -695220
2616 -695220 -705851 -747412 -704948 -642279 -679746 -728553 -780254 -738105 -711759 -779397 -819664 -824057
2604 -824057 -871375 -880333 -821190 -829856 -844187 -831047 -802414 -731563 -720742 -742965 -719310 -759960
2592 -759960 -855025 -885805 -838395 -797526 -767692 -737811 -689439 -761107 -828002 -751407 -666126 -661906
2580 -661906 -672192 -668610 -756483 -809303 -732333 -701531 -680178 -722389 -776395 -775185 -810583 -790758
2568 -790758 -757428 -745427 -705399 -760955 -794393 -814453 -813391 -847991 -875822 -847533 -799938 -842785
2556 -842785 -834783 -823181 -807395 -758510 -759124 -727735 -732224 -747315 -764401 -767980 -700961 -695379 -730283
2543 -730283 -776160 -834882 -812021 -756543 -757930 -751454 -746693 -846907 -904635 -892038 -831579 -822360
2531 -822360 -784718 -747751 -677995 -694785 -768060 -793080 -756742 -776218 -833304 -827770 -777235 -777753
2519 -777753 -781613 -745007 -696934 -726280 -740145 -788822 -810179 -795142 -787273 -762924 -831867 -800462
2507 -800462 -674185 -677212 -640167 -668043 -668407 -673620 -718458 -699025 -720512 -718957 -687226 -731345
2495 -731345 -766446 -785089 -827769 -865572 -809023 -824068 -792317 -810983 -757601 -732864 -776108 -738856
2483 -738856 -755109 -816150 -798154 -738253 -830441 -890549 -824789 -830061 -890633 -846018 -768322 -796473
2471 -796473 -816635 -824805 -807387 -810801 -813693 -727309 -664615 -656422 -717189 -702213 -711374 -692120 -655338
2458 -655338 -701683 -783214 -751898 -740754 -743124 -793458 -884806 -945699 -896100 -836008 -879463 -798323
2446 -798323 -802990 -823218 -836210 -820152 -745343 -732752 -775274 -796794 -773685 -751199 -688836 -705429
2434 -705429 -732219 -685738 -672750 -666605 -618680 -589437 -648481 -689538 -675025 -744777 -747598 -715035
2422 -715035 -756138 -676722 -687508 -697280 -729654 -753659 -733170 -674240 -636924 -627429 -680119 -705709
2410 -705709 -743847 -751425 -764343 -684117 -641716 -643041 -711820 -776080 -783405 -790316 -790210 -747743 -668894
2397 -668894 -651393 -756979 -796350 -790813 -794421 -753696 -688802 -680561 -608615 -586721 -612969 -645685
2385 -645685 -685991 -791251 -865223 -844603 -859134 -833947 -728011 -672786 -680798 -683065 -692117 -657028
2373 -657028 -679744 -741157 -721070 -633590 -632686 -667786 -590747 -581518 -625367 -670400 -714496 -760953
2361 -760953 -792179 -736336 -692660 -640646 -667599 -680511 -675513 -697573 -726770 -690427 -753245 -798216
2349 -798216 -759359 -740223 -746875 -770391 -722093 -681003 -667596 -655487 -636584 -693869 -758053 -804363
2337 -804363 -817253 -813964 -717697 -730460 -779051 -768897 -797346 -793275 -781717 -769230 -719427 -698133
2325 -698133 -703794 -689251 -730277 -811944 -806252 -765397 -802838 -802421 -762218 -749185 -716158 -726911
2313 -726911 -748662 -712549 -732675 -824952 -805220 -780011 -753601 -777938 -772286 -695290 -662681 -666264
2301 -666264 -715791 -767279 -821079 -865846 -829307 -740623 -752375 -758673 -800895 -773229 -704471 -691295
2289 -691295 -664730 -677680 -690232 -729211 -737971 -726200 -767836 -758395 -684911 -608944 -587223 -591488
2277 -591488 -634528 -653487 -666427 -696214 -695905 -714311 -745318 -726385 -739659 -757006 -762406 -762025 -788658
2264 -788658 -785744 -787099 -780640 -755067 -727819 -689816 -650054 -688917 -765916 -814718 -818828 -831928
2252 -831928 -844856 -823826 -784584 -760894 -695781 -695786 -711829 -795244 -815260 -795451 -710260 -685204
2240 -685204 -685687 -725927 -745205 -731054 -723271 -723574 -747062 -788447 -842314 -836246 -789403 -752750 -697969
2227 -697969 -706736 -729253 -761629 -700142 -673614 -712885 -735807 -710951 -723265 -714111 -724825 -771706
2215 -771706 -781309 -739530 -741890 -722470 -699837 -739557 -820610 -789461 -800246 -787341 -695257 -637961
2203 -637961 -646718 -594019 -686277 -715351 -708767 -733514 -759494 -692124 -607731 -617009 -681348 -767812
2191 -767812 -783339 -765875 -782606 -792467 -730654 -729116 -780466 -741287 -707872 -781807 -799176 -752741
2179 -752741 -694115 -622490 -607367 -607612 -611888 -614425 -632339 -655132 -704423 -732945 -658855 -667614 -712864
2166 -712864 -752164 -712731 -678806 -728610 -740486 -769157 -815815 -861417 -900682 -820390 -780739 -816083
2154 -816083 -785774 -717255 -683220 -698170 -686244 -684983 -714489 -686871 -626342 -603827 -631168 -666292
2142 -666292 -677496 -641500 -555170 -687238 -792680 -849969 -827256 -796129 -736173 -747631 -755834
2131 -755834 -753179 -732187 -685140 -675406 -751756 -743417 -694726 -683788 -726517 -730423 -750623 -771589
2119 -771589 -714014 -666527 -686156 -791247 -882923 -837060 -786794 -742731 -752056 -776265 -676938 -642964
2107 -642964 -686329 -718874 -666045 -614389 -606807 -599675 -602789 -625712 -679226 -676462 -691213 -719388
2095 -719388 -730833 -705685 -679997 -753104 -754544 -753382 -786160 -788545 -792140 -713442 -709295 -710590 -674609
2082 -674609 -710423 -760901 -735172 -698682 -769112 -782145 -718165 -672857 -661928 -666719 -614961 -620932
2070 -620932 -616236 -677190 -769449 -757930 -731449 -704423 -708248 -697075 -620123 -599773 -667885 -701518
2058 -701518 -762634 -813676 -775297 -719034 -680451 -722006 -698829 -616424 -662054 -709288 -695158 -721019
2046 -721019 -756730 -814337 -860645 -895507 -855694 -775492 -743089 -772797 -890966 -926261 -846269
2035 -846269 -768871 -729912 -716964 -736457 -794618 -856958 -870704 -798909 -759488 -754842 -692590 -643755
2023 -643755 -655136 -684253 -678040 -717098 -806862 -848960 -776770 -747020 -745582 -742483 -725686 -666450
2011 -666450 -613283 -664597 -696904 -738398 -781797 -822135 -746792 -670848 -705320 -685422 -656639 -674757
1999 -674757 -697045 -762390 -765860 -676993 -641006 -583583 -610491 -629738 -644804 -764301 -766202 -654879
1987 -654879 -641921 -635286 -632715 -684270 -698776 -703776 -744807 -730891 -730925 -715004 -715188 -727956 -743496
1974 -743496 -775861 -808317 -814992 -774174 -779725 -757599 -705599 -682047 -690167 -690553 -645144 -669980 -687525
1961 -687525 -704750 -692798 -722496 -727060 -708368 -695516 -719926 -735227 -743529 -786604 -756004 -733520
1949 -733520 -737124 -768955 -779484 -754588 -767163 -845930 -870185 -844435 -796567 -769294 -690063 -708340
1937 -708340 -663772 -622649 -620035 -687391 -666548 -667012 -687678 -635625 -665895 -724522 -760377 -736893
1925 -736893 -719367 -799318 -850060 -833799 -775090 -791188 -784497 -750820 -733142 -746708 -758560 -734999
1913 -734999 -747400 -801084 -802311 -821668 -765917 -725626 -677323 -667690 -685158 -707902 -704428 -665259
1901 -665259 -717089 -703518 -702116 -780251 -780708 -659237 -602651 -624629 -645519 -645884 -675727 -684971 -624846
1888 -624846 -623582 -664799 -689365 -712650 -782103 -775020 -695659 -689886 -717736 -660885 -574008 -567229
1876 -567229 -603794 -594126 -591978 -646859 -610465 -531020 -605222 -676390 -718028 -723618 -687991 -653663
1864 -653663 -615121 -605724 -633181 -670687 -665469 -687272 -672607 -647528 -689592 -758164 -713293 -739065
1852 -739065 -734178 -684549 -632335 -592402 -635969 -660611 -640039 -675214 -722231 -771749 -744299 -723974
1840 -723974 -738458 -627644 -566632 -588849 -581773 -615921 -612409 -575086 -682139 -784133 -783405 -763129
1828 -763129 -799086 -814671 -835738 -802071 -752425 -704878 -722006 -766429 -762118 -704699 -667942 -657629
1816 -657629 -648930 -727999 -790088 -801972 -814973 -784894 -757563 -761020 -757235 -771061 -796452 -765835
1804 -765835 -680218 -625855 -654883 -658327 -649857 -674052 -741083 -781663 -779998 -719412 -741128 -745964
1792 -745964 -742337 -746977 -739796 -761075 -743640 -731450 -706824 -710181 -714052 -723935 -721219 -762227 -787981
1779 -787981 -782514 -758670 -736976 -702005 -741400 -771556 -721309 -683138 -618478 -628551 -757375 -818011
1767 -818011 -803209 -786414 -768113 -727735 -696546 -772176 -805101 -828354 -791184 -690243 -640906
1756 -640906 -635012 -670802 -747947 -734710 -733413 -699972 -736366 -698211 -693868 -634554 -609357 -644124
1744 -644124 -636229 -655605 -625028 -609012 -577783 -641051 -755154 -780804 -738314 -728793 -707975 -710401
1732 -710401 -702045 -724321 -725695 -654578 -641522 -663020 -603026 -640817 -717216 -705215 -688363 -685298
1720 -685298 -721731 -683144 -620784 -624435 -602147 -566520 -600849 -608083 -630806 -690643 -726884 -737946
1708 -737946 -751248 -755975 -750697 -748209 -696171 -677548 -739989 -799109 -818814 -805647 -809198 -784411
1696 -784411 -760253 -738165 -731624 -726354 -749191 -727235 -758322 -809261 -779508 -738824 -670935 -726265
1684 -726265 -736391 -669627 -660798 -727904 -693120 -672431 -691193 -740142 -706853 -698419 -718803 -673781
1672 -673781 -685570 -694076 -613977 -575609 -607950 -635292 -691657 -674027 -627523 -609961 -685431 -738678
1660 -738678 -719255 -752203 -807576 -808508 -813396 -784591 -730542 -732334 -784197 -822733 -849555 -819508
1648 -819508 -730741 -708752 -693283 -716254 -715247 -742982 -760173 -786291 -813227 -777617 -740467 -690095
1636 -690095 -721151 -752215 -725133 -736315 -774574 -790203 -718116 -703457 -652489 -628008 -603765 -637153
1624 -637153 -614395 -630711 -612755 -669863 -718514 -727655 -659123 -594049 -617672 -645151 -692337 -729559
1612 -729559 -688158 -641025 -595036 -601818 -633322 -663419 -716818 -697491 -730683 -746915 -749886 -749100
1600 -749100 -751564 -765608 -743373 -797406 -804435 -765540 -701865 -679499 -678146 -634882 -608876 -675300
1588 -675300 -722404 -725488 -785578 -794934 -721913 -663443 -651576 -643515 -695092 -741630 -832645 -856357
1576 -856357 -876838 -822353 -764933 -748078 -745967 -704593 -659435 -701770 -674448 -655679 -635642 -586270
1564 -586270 -587686 -625271 -637349 -613115 -617166 -688114 -728156 -695073 -714991 -722980 -729730 -666016
1552 -666016 -649838 -696470 -761084 -765847 -763084 -757384 -725678 -748140 -736398 -739530 -710682 -597144
1540 -597144 -571542 -631709 -680412 -664867 -634862 -691260 -737256 -726521 -721181 -686429 -620971 -649213
1528 -649213 -706099 -709945 -706555 -784786 -787765 -753609 -788495 -752206 -685079 -667649 -673303 -726167
1516 -726167 -762112 -781038 -751006 -735054 -722754 -717847 -726148 -732617 -700352 -726548 -724105 -755241
1504 -755241 -785031 -790074 -755197 -790801 -750750 -810719 -809157 -745683 -723254 -717694 -712469 -664333
1492 -664333 -603774 -572978 -564865 -576980 -579627 -584425 -660268 -723838 -746404 -749258 -716795 -688977
1480 -688977 -686959 -606210 -608614 -639848 -684144 -720043 -752734 -727991 -706717 -692199 -731571 -716984
1468 -716984 -657882 -647318 -652861 -658952 -725106 -727191 -710318 -665670 -620505 -590709 -618068 -609928
1456 -609928 -654872 -720162 -738778 -662528 -702532 -764137 -666420 -606183 -677898 -699020 -690503 -667193
1444 -667193 -703055 -758602 -708956 -711475 -755192 -724258 -630446 -614335 -658264 -724706 -734797 -726414
1432 -726414 -719504 -682033 -625611 -574824 -646192 -622706 -613299 -570311 -622192 -745105 -786408 -726380
1420 -726380 -641481 -727593 -815399 -741499 -674042 -660307 -673778 -675587 -758877 -813419 -826681 -796955
1408 -796955 -748971 -719749 -694790 -664765 -563138 -532658 -612974 -641056 -653623 -676882 -721374
1397 -721374 -724346 -730257 -769552 -699812 -670476 -650881 -670046 -647009 -698427 -741066 -716715 -643532
1385 -643532 -651787 -649093 -676796 -720740 -741933 -769240 -752057 -673914 -612568 -585884 -629657 -666042
1373 -666042 -646688 -678419 -684427 -624452 -607385 -622188 -633017 -677092 -654125 -642801 -612894 -557772
1361 -557772 -578798 -658454 -660491 -661595 -673876 -717107 -698631 -663542 -707442 -715565 -691028 -731883
1349 -731883 -714263 -714402 -684969 -639678 -667055 -685675 -743756 -727749 -794490 -803411 -710840 -770101
1337 -770101 -777846 -777395 -769611 -728114 -686417 -690669 -641745 -604403 -593580 -598054 -655659 -685961 -721360
1324 -721360 -708128 -654032 -615864 -590248 -626726 -680251 -710495 -622701 -595474 -644126 -631869 -603642
1312 -603642 -643673 -751130 -859551 -823303 -790393 -768658 -689152 -536005 -530104 -644449 -664107
1301 -664107 -673232 -716679 -729973 -721054 -758239 -767418 -683446 -675130 -744946 -747710 -731325 -705938 -755351
1288 -755351 -788487 -753552 -698690 -704390 -702185 -631913 -530885 -586226 -615233 -626668 -651768 -651369
1276 -651369 -682275 -637899 -624699 -647503 -664258 -707098 -721428 -683392 -625517 -616762 -619861 -634572
1264 -634572 -680130 -720324 -719802 -654685 -599598 -645832 -753937 -801862 -746642 -752708 -798504 -794359
1252 -794359 -720601 -658019 -572606 -567108 -613202 -595249 -568384 -578581 -630812 -613045 -619634 -658365
1240 -658365 -648906 -657398 -706790 -743809 -725898 -739326 -606217 -568036 -529811 -519046 -560661 -578289
1228 -578289 -628398 -719725 -781763 -811109 -810488 -763277 -777550 -717608 -679421 -708120 -706404 -726650
1216 -726650 -697182 -676809 -681791 -651180 -639575 -668875 -606673 -595484 -669102 -689369 -666940 -640233
1204 -640233 -638265 -668062 -643245 -740321 -738815 -615088 -582700 -532888 -569499 -593245 -613609 -623474
1192 -623474 -643879 -632659 -640277 -710058 -676101 -649570 -718668 -736373 -742224 -758812 -780601 -750969
1180 -750969 -761718 -807174 -804942 -768021 -794796 -821463 -751704 -731907 -699614 -650062 -651269 -607535
1168 -607535 -609203 -597887 -650907 -691083 -656328 -682696 -646747 -681666 -703044 -681817 -712013 -711306
1156 -711306 -699284 -658164 -621601 -608006 -598869 -551983 -493635 -450810 -524422 -602543 -658846 -647321
1144 -647321 -672118 -659179 -645570 -679030 -709865 -725282 -752046 -719405 -717145 -669852 -624288 -658331
1132 -658331 -684580 -723009 -640944 -661058 -656542 -643534 -631894 -650390 -651065 -571224 -616365 -730976
1120 -730976 -717771 -719176 -692186 -762047 -738306 -743944 -735179 -752486 -753930 -672766 -630320 -675249
1108 -675249 -690993 -652050 -561347 -589744 -602636 -561807 -568354 -631705 -619728 -585362 -591489 -655322
1096 -655322 -624781 -623931 -671479 -666432 -697894 -644325 -664137 -660143 -737527 -801518 -840569 -783244
1084 -783244 -717040 -633270 -627874 -615685 -612575 -629768 -699433 -686918 -680085 -666280 -687968 -706363
1072 -706363 -706499 -690496 -705857 -724139 -690296 -771711 -764536 -738191 -678420 -653570 -656073 -676743
1060 -676743 -675366 -667663 -660796 -666135 -735723 -725206 -727218 -709119 -704170 -668912 -671268 -667374 -587954
1047 -587954 -505640 -509934 -571324 -660995 -748114 -728681 -683650 -688848 -688947 -728174 -769508 -781142 -784071
1034 -784071 -695725 -594614 -607723 -712495 -731248 -711084 -639059 -612166 -602691 -569574 -562606 -548432
1022 -548432 -510721 -554374 -540690 -559756 -555853 -601482 -609942 -627109 -647037 -643875 -657160 -622183
1010 -622183 -596118 -600065 -618239 -596764 -590066 -622296 -656689 -685056 -648985 -643046 -697037 -699478
998 -699478 -694772 -677171 -588635 -496989 -513278 -546281 -560147 -604048 -656613 -697383 -694911 -673307
986 -673307 -690326 -722629 -714551 -729474 -742132 -782740 -743403 -667712 -627648 -657219 -724830 -705050
974 -705050 -681491 -686762 -681156 -649089 -709353 -691966 -593925 -591759 -565068 -566677 -529351 -457633 -495242
961 -495242 -587508 -680920 -731765 -688249 -582252 -539158 -543448 -570432 -610850 -659760 -704568 -741503
949 -741503 -802626 -849793 -858621 -828030 -808179 -731034 -735313 -727481 -696009 -681632 -659768 -643514
937 -643514 -571181 -546457 -531063 -500310 -526657 -596091 -651638 -684891 -660518 -709899 -734243 -678029
925 -678029 -675502 -691390 -696246 -729573 -658927 -539399 -596406 -576859 -515053 -481875 -557048 -670877
913 -670877 -640779 -539979 -579456 -566861 -664206 -709881 -716738 -642057 -593950 -640937 -655248 -644030
901 -644030 -616749 -598111 -691796 -768454 -805180 -789846 -807256 -758455 -689473 -681701 -687562 -667445
889 -667445 -656395 -718928 -759980 -717509 -687623 -708450 -753150 -750788 -791473 -705290 -689933 -645024
877 -645024 -569371 -577405 -596684 -632611 -621349 -692003 -720500 -700597 -670938 -663983 -597034 -575682
865 -575682 -547563 -585235 -619121 -650467 -644989 -637082 -597689 -608948 -609480 -644802 -677535 -661614 -671283
852 -671283 -686975 -675924 -651151 -667268 -675175 -677051 -680571 -665301 -706844 -692748 -634710 -561388
840 -561388 -574788 -590555 -590263 -638791 -589159 -604309 -629704 -654715 -760140 -730289 -699271 -694444
828 -694444 -693417 -651922 -614753 -619819 -618076 -680682 -700337 -742122 -736754 -749567 -740000 -773367 -766451
815 -766451 -740102 -702613 -710252 -744863 -731989 -747700 -726616 -659919 -632327 -662413 -714245 -638172
803 -638172 -587356 -569307 -582571 -609691 -617775 -571754 -572807 -580588 -563362 -590716 -599025 -621583 -643586
790 -643586 -606277 -681441 -705059 -711961 -710719 -668692 -579521 -590930 -665269 -654299 -623763 -616812
778 -616812 -656137 -658660 -673368 -736678 -745280 -689600 -589870 -528197 -519887 -498448 -537998 -531484 -538755
765 -538755 -629081 -699460 -695632 -678893 -693845 -685469 -732820 -795903 -750220 -657526 -582287 -544181
753 -544181 -579850 -590736 -582406 -519983 -532838 -575087 -606002 -647317 -644384 -587418 -553395 -617341
741 -617341 -750285 -847703 -815640 -731747 -662606 -682027 -680535 -653535 -589766 -607925 -568532 -591774
729 -591774 -645891 -642833 -598536 -591319 -578112 -595693 -640222 -663343 -641232 -628656 -598719 -583009
717 -583009 -617335 -668510 -673392 -642598 -625297 -602908 -615529 -668121 -694075 -709948 -715111 -696034
705 -696034 -702628 -636193 -539745 -581278 -644730 -639661 -713943 -788820 -756573 -699389 -736316 -730674
693 -730674 -662467 -624101 -599183 -589248 -626782 -692906 -699681 -738539 -723258 -702331 -650014 -580123
681 -580123 -599792 -607137 -595245 -648516 -612473 -646481 -692099 -727981 -713457 -631031 -590282 -581857
669 -581857 -535303 -497450 -572630 -565430 -553677 -631567 -727516 -701736 -642679 -642135 -692484 -706106
657 -706106 -699894 -689446 -657291 -651699 -668768 -672867 -685394 -748519 -773526 -761873 -738017 -759678
645 -759678 -755666 -753719 -776088 -763857 -688588 -692317 -667336 -653377 -661175 -650418 -659118 -640203 -595463
632 -595463 -609420 -668721 -686267 -692760 -640267 -623960 -574482 -583868 -607839 -588574 -651332 -719121
620 -719121 -701760 -672425 -693976 -728990 -673950 -645284 -679803 -661141 -678869 -660985 -646135 -665597
608 -665597 -676485 -675931 -668329 -648243 -592306 -571240 -582543 -663927 -655554 -631014 -659023 -680664 -708229
595 -708229 -723133 -731920 -693341 -634305 -623297 -637294 -613376 -643809 -671817 -652849 -657463 -658272 -726748
582 -726748 -722866 -720257 -671104 -635212 -597713 -578512 -594623 -579818 -670930 -746840 -719166 -707254
570 -707254 -721319 -745068 -741250 -707806 -688709 -633324 -575082 -542560 -593860 -593042 -588166 -619666 -570533
557 -570533 -506110 -532286 -552007 -554457 -629946 -615867 -576420 -619236 -660127 -662470 -629406 -659264
545 -659264 -694162 -597021 -616384 -687879 -682426 -710492 -730017 -681820 -578438 -573378 -622405 -691813
$$ [...]
##END NTUPLES=NMR SPECTRUM
##END=
