##TITLE=Analysis number 327745
Compound Code tl 00693
Book Reference 219295 b
Project Code adrs flro3
Chemist Name jom
##JCAMPDX= 6.0         $$ Bruker NMR JCAMP-DX V2.0
##DATA TYPE= NMR SPECTRUM
##DATA CLASS= NTUPLES
##ORIGIN= Bruker BioSpin GmbH
##OWNER= nmr
$$ XWIN-NMR		Version 3.5
$$ Tue Apr  3 13:03:50 2007 GMT Daylight Time (UT+1h)  MAYBRIDGE\nmr@NMR_250MHZ
##.OBSERVE FREQUENCY= 250.131544655141
##.OBSERVE NUCLEUS= ^1H
##.ACQUISITION MODE= SIMULTANEOUS (DQD)
##.ACQUISITION SCHEME= undefined
##.AVERAGES= 16
##.DIGITISER RES= 18
##SPECTROMETER/DATA SYSTEM= dpx250
##.PULSE SEQUENCE= zg30
##.SOLVENT NAME= DMSO
##.SHIFT REFERENCE= (INTERNAL, DMSO, 0, 16.522)
##AUDIT TRAIL= $$ (NUMBER, WHEN, WHO, WHERE, WHAT)
$$ ##TITLE= Audit trail, XWIN-NMR		Version 3.5
$$ ##JCAMPDX= 5.01
$$ ##ORIGIN= Bruker BioSpin GmbH
$$ ##OWNER= nmr
$$ C:\u/data/dgb/nmr/ADRS/350/pdata/1/auditp.txt
$$ ##AUDIT TRAIL=  $$ (NUMBER, WHEN, WHO, WHERE, WHAT)
(   1,<2007-04-03 13:03:26.94 +100>,<MAYBRIDGE\nmr>,<NMR_250MHZ>,
      <created by zg, POWCHK disabled, PULCHK disabled
       configuration hash MD5:
       49 4B E0 1D 92 C2 6B 37 9F E6 65 BC 52 41 86 1D
       data hash MD5: 64K
       07 49 76 78 51 34 C4 50 41 85 41 C8 76 8E 2C 8D>)
(   2,<2007-04-03 13:03:40.30 +100>,<MAYBRIDGE\nmr>,<NMR_250MHZ>,
      <Start of raw data processing
       ef LB = 0.3 FT_mod = 6 PKNL = 1 SI = 32K 
       data hash MD5: 32K
       63 85 66 7D 22 DC AC 3E 12 5C AB D6 80 50 0B B1>)
(   3,<2007-04-03 13:03:41.94 +100>,<MAYBRIDGE\nmr>,<NMR_250MHZ>,
      <apk 
       data hash MD5: 32K
       21 5B 9A 3D DD 15 64 C5 9D BF A8 BD 59 54 E5 C6>)
(   4,<2007-04-03 13:03:42.65 +100>,<MAYBRIDGE\nmr>,<NMR_250MHZ>,
      <abs ABSG = 5 
       data hash MD5: 32K
       A0 EE BA FE 20 A7 08 F8 DA 43 D4 98 1F 17 59 A0>)
$$ ##END=
$$ 
$$ hash MD5
$$ BC 3D 30 CC 77 0A 57 74 3F 1D 4D 7F 9B 93 E0 DC
##$RELAX= 
##$RELAX= 
##$RELAX= 
##$RELAX= 
##$RELAX= 
##$RELAX= 
##$RELAX= 
$$ Bruker specific parameters
$$ --------------------------
##$DU= <C:\u>
##$EXPNO= 350
##$NAME= <ADRS>
##$PROCNO= 1
##$TYPE= <nmr>
##$USER= <dgb>
##$AMP= (0..31)
100 100 100 100 100 100 100 100 100 100 100 100 100 100 100 100 100 100 
100 100 100 100 100 100 100 100 100 100 100 100 100 100 
##$AQSEQ= 0
##$AQ_mod= 3
##$AUNM= <au_zg>
##$AUTOPOS= <10 >
##$BF1= 250.13
##$BF2= 250.13
##$BF3= 250.13
##$BF4= 250.13
##$BF5= 500.13
##$BF6= 500.13
##$BF7= 500.13
##$BF8= 500.13
##$BYTORDA= 1
##$CFDGTYP= 0
##$CFRGTYP= 5
##$CHEMSTR= <none>
##$CNST= (0..31)
1 1 145 1 1 1 1 1 1 1 1 1 1 1 1 1 1 1 1 1 1 1 1 1 1 1 1 1 1 1 1 1 
##$CPDPRG= <>
##$CPDPRG1= <>
##$CPDPRG2= <>
##$CPDPRG3= <>
##$CPDPRG4= <mlev>
##$CPDPRG5= <mlev>
##$CPDPRG6= <mlev>
##$CPDPRG7= <mlev>
##$CPDPRG8= <mlev>
##$CPDPRGB= <>
##$CPDPRGT= <>
##$D= (0..31)
0 1 0 0 0 0 0 0 0 0.06 0 0 0 0 0 0 0.0002 0 0 0 0 0 0 0 0 0 0 0 0 0 0 
0 
##$DATE= 1175601805
##$DBL= (0..7)
120 120 120 120 120 120 120 120 
##$DBP= (0..7)
150 150 150 150 150 150 150 150 
##$DBP07= 0
##$DBPNAM0= <>
##$DBPNAM1= <>
$$ [...]
##$SUBNAM6= <"">
##$SUBNAM7= <"">
##$SUBNAM8= <"">
##$SUBNAM9= <"">
##$SW= 20.6930455092707
##$SWIBOX= (0..15)
0 0 3 0 0 0 0 0 0 0 0 0 0 0 0 0 
##$SW_h= 5175.983436853
##$TD= 65536
##$TD0= 1
##$TE= 683.16
##$TE2= 300
##$TE3= 300
##$TEG= 300
##$TL= (0..7)
0 120 120 120 120 120 120 120 
##$TP= (0..7)
150 150 150 150 150 150 150 150 
##$TP07= 0
##$TPNAME0= <>
##$TPNAME1= <>
##$TPNAME2= <>
##$TPNAME3= <>
##$TPNAME4= <>
##$TPNAME5= <>
##$TPNAME6= <>
##$TPNAME7= <>
##$TPOAL= (0..7)
0.5 0.5 0.5 0.5 0.5 0.5 0.5 0.5 
##$TPOFFS= (0..7)
0 0 0 0 0 0 0 0 
##$TUNHIN= 0
##$TUNHOUT= 0
##$TUNXOUT= 0
##$USERA1= <user>
##$USERA2= <user>
##$USERA3= <user>
##$USERA4= <user>
##$USERA5= <user>
##$V9= 5
##$VALIST= <valist>
##$VCLIST= <CCCCCCCCCCCCCCC>
##$VD= 0
##$VDLIST= <DDDDDDDDDDDDDDD>
##$VPLIST= <PPPPPPPPPPPPPPP>
##$VTLIST= <TTTTTTTTTTTTTTT>
##$WBST= 1024
##$WBSW= 4
##$XGAIN= (0..3)
0 0 0 0 
##$XL= 0
##$YL= 0
##$YMAX_a= 284077
##$YMIN_a= -236478
##$ZGOPTNS= <>
##$ZL1= 120
##$ZL2= 120
##$ZL3= 120
##$ZL4= 120
##$ABSF1= 16.522
##$ABSF2= -4.171173
##$ABSG= 5
##$ABSL= 3
##$ALPHA= 0
##$AQORDER= 0
##$ASSFAC= 0
##$ASSFACI= 0
##$ASSFACX= 0
##$ASSWID= 0
##$AUNMP= <proc_1d>
##$AZFE= 0.1
##$AZFW= 0.1
##$BCFW= 0
##$BC_mod= 0
##$BYTORDP= 0
##$COROFFS= 0
##$CY= 12.5
##$DATMOD= 1
##$DC= 0
##$DFILT= <>
##$DTYPP= 0
##$F1P= 14.0000005364418
##$F2P= -0.99999901652339
##$FCOR= 0.5
##$FTSIZE= 32768
##$FT_mod= 6
##$GAMMA= 0
##$GB= 0
##$INTBC= 1
##$INTSCL= 1
##$ISEN= 128
##$LB= 0.3
##$LEV0= 0
##$LPBIN= 0
##$MAXI= 10000
##$MC2= 0
##$MEAN= 0
##$ME_mod= 0
##$MI= 0
##$NCOEF= 0
##$NC_proc= -4
##$NLEV= 6
##$NOISF1= 0
##$NOISF2= 0
##$NSP= 0
##$NTH_PI= 0
##$NZP= 0
##$OFFSET= 16.522
##$PC= 1
##$PHC0= 226.7984
##$PHC1= 6.75558
##$PH_mod= 1
##$PKNL= yes
##$PPARMOD= 0
##$PSCAL= 4
##$PSIGN= 0
##$REVERSE= no
##$SF= 250.13
##$SI= 32768
##$SIGF1= 0
##$SIGF2= 0
##$SINO= 400
##$SIOLD= 32768
##$SREGLST= <1H.DMSO>
##$SSB= 0
##$STSI= 32768
##$STSR= 0
##$SW_p= 5175.98343685301
##$SYMM= 0
##$S_DEV= 0
##$TDeff= 65536
##$TDoff= 0
##$TI= <Analysis number 999999
Compound Code 99
Book Reference 9
Project Code 9>
##$TILT= no
##$TM1= 0
##$TM2= 0
##$TOPLEV= 0
##$USERP1= <user>
##$USERP2= <user>
##$USERP3= <user>
##$USERP4= <user>
##$USERP5= <user>
##$WDW= 1
##$XDIM= 32768
##$YMAX_p= 303511588
##$YMIN_p= -302206
$$ End of Bruker specific parameters
$$ ---------------------------------
##NTUPLES= NMR SPECTRUM
##VAR_NAME=  FREQUENCY,     SPECTRUM/REAL,   SPECTRUM/IMAG
##SYMBOL=    X,             R,               I
##VAR_TYPE=  INDEPENDENT,   DEPENDENT,       DEPENDENT
##VAR_FORM=  AFFN,          ASDF,            ASDF
##VAR_DIM=   32768,         32768,           32768
##UNITS=     HZ,            ARBITRARY UNITS, ARBITRARY UNITS
##FACTOR=    0.157963299565203, 1,           1
##FIRST=     4132.6476996994, 0,             0
##LAST=      -1043.33573715361, 0,           0
##MIN=       -1043.33573715361, -302206,     0
##MAX=       4132.6476996994, 303511588,     0
$$ Real data points
##PAGE= N=1
##DATA TABLE= (X++(R..R)), XYDATA
$$ [...]
15955a17956L583K9294J142j5727L7488L6205K4811n8308m0285N6986k9036k8589
$$ -117956 -114373 -85079 -83937 -99664 -62176 -25971 -1160 -59468 -99753 -42767 -71803 -100392
15943a00392k3366J00632N3285K584k7129L1907J6265K7825L781o1243l4926L0756
$$ -100392 -123758 -23126 30159 32743 5614 37521 53786 81611 85392 24149 -10777 19979
15931A9979j4418J5213J3090l1091N866n091m4551O9063K2338o7337r814M854
$$ 19979 5561 20774 33864 2773 8639 3548 -41003 28060 50398 -16939 -26753 -21899
15919b1899K388Q9169l1583j44484j6816R0948J0143k4220N5685k4441o2288k3511
$$ -21899 -19511 69658 38075 -106409 -123225 -32277 -22134 -46354 9331 -15110 -77398 -100909
15907a00909N1900P3294J5274O305p1548n8025P8759O2648K5637N600l7543n5131
$$ -100909 -49009 24285 39559 45864 -25684 -83709 -4950 57698 83335 88935 51392 -3739
15895c739j6073L5156j6347J9908M3384j6555M5118n6278p8521l6761M1968J5819
$$ -3739 -19812 15344 -1003 18905 62289 45734 90852 34574 -43947 -80708 -38740 -22921
15883b2921L8326N6648K3991M7250L2208O0507l7368o6324o1776j2773N5462p9607
$$ -22921 15405 72053 96044 143294 175502 236009 198641 132317 70541 57768 113230 33623
15871C3623l014J17992l4204j9545q6352p3252J2655k5106L464L4805Q9284k3913
$$ 33623 30609 148601 114397 94852 8500 -64752 -52097 -77203 -73739 -38934 50350 26437
15859B6437N355l263l1784K2230m6974j17358Q161P7029O9595j4724j0752K2299
$$ 26437 31792 28529 -3255 18975 -27999 -145357 -137196 -60167 9428 -5296 -16048 6251
15847F251M8193M792j23869n98O1429M0221M541k0984p7076J0068K4180J21366
$$ 6251 54444 59236 -64633 -65231 -3802 36419 40960 19976 -57100 -47032 -22852 98514
15835I8514k6181n0272k711j0149l2071L333o8954o7073M5247Q6323k2747l5932
$$ 98514 72333 22061 19350 9201 -22870 -19537 -88491 -155564 -110317 -23994 -46741 -82673
15823h2673L5809M4875L0537m7040o1715l9289p3062N1233N9699J62245M5155
$$ -82673 -46864 -1989 28548 -18492 -80207 -119496 -192558 -141325 -81626 80619 125774
15812A25774p9903q2784r1358R9318Q4308q323j4829j0776m5955l4246J7814o94
$$ 125774 45871 -36913 -128271 -28953 55355 47032 32203 21427 -24528 -58774 -40960 -41654
15800d1654q106L6293M64l9861n5267N1595J44801q515N0589n9056r0644N4459
$$ -41654 -49760 -13467 -13003 -52864 -108131 -56536 88265 79750 130339 71283 -19361 35098
15788C5098R2194q6389j9004j4455k1302j043J5174M3047M8011p1971m3120q652
$$ 35098 127292 40903 21899 7444 -13858 -14901 273 43320 91331 19360 -23760 -32412
15776c2412o9541J2536n7762j1169K5561N6407M1353n5841p5067j9338l393K2716
$$ -32412 -101953 -89417 -147179 -158348 -132787 -76380 -35027 -90868 -165935 -185273 -188666 -165950
15764a65950J87392L5831q4622m956m6867o982m917k2415l3661L1106J9651J27343
$$ -165950 21442 57273 -27349 -32305 -79172 -86154 -91071 -113486 -147147 -116041 -96390 30953
15752C0953J12678K000J7391n9791n6433K3762Q567l885q7162k5883N2177P8477
$$ 30953 143631 145631 163022 103231 46798 70560 79127 75242 -11920 -37803 14374 92851
15740I2851p392j0701M9032j9411R922K9273o2819m3857q170k3019Q1684N3437
$$ 92851 85459 74758 123790 104379 114301 143574 80755 36898 28728 5709 87393 140830
15728A40830J0864m0691L906m2157M8950K0656o2948P7854k3640o9606M088n2215
$$ 140830 151694 111003 114909 72752 121702 142358 79410 157264 133624 64018 68106 15891
15716A5891q3342q4537R712J1916j8828J2715M8306J11013M3865p4227r3543k0577
$$ 15891 -67451 -151988 -142276 -130360 -149188 -136473 -88167 22846 66711 -7516 -101059 -121636
15704a21636k3179Q0800j1087q2971l9240N318N6475K8788R2178J032n2617M842
$$ -121636 -144815 -64015 -75102 -158073 -197313 -191995 -135520 -106732 -14554 -13522 -66139 -61297
15692f1297M5549L7194M800K2604m6302K9174M4795j0660m9497k695p9990m461
$$ -61297 -15748 21446 26246 48850 2548 31722 76517 65857 16360 13665 -66325 -70786
15680g0786L5604r1742N4826K8649K7256k3502J0128p8658j07227K2476J63507
$$ -70786 -35182 -126924 -72098 -43449 -16193 -39695 -29567 -108225 -215452 -192976 -29469
15669b9469M2226j8947k8899K6870m1174q762p4991J5822J4434n4845n8527O0598
$$ -29469 12757 -6190 -35089 -8219 -49393 -58155 -133146 -117324 -102890 -157735 -216262 -155664
15657a55664M2429L3350k0411L4066J46895M8038J6583p467o9832Q021N759J9858
$$ -155664 -113235 -79885 -100296 -66230 80665 128703 145286 137819 67987 76008 81767 101625
15645A01625J6678M6161L472j30818n6335j8481M0576L5259O9115j2748l5092
$$ 101625 118303 164464 167936 37118 -19217 -37698 2878 38137 107252 94504 59412
15634E9412J1893l482k2226K1348n1531o6242P6673N5353l2856n9631l4508k0813
$$ 59412 71305 67823 45597 66945 15414 -50828 25845 81198 48342 -11289 -45797 -66610
15622f6610J30819k6501l090J846M1538l9274m4932J5217l1714q30Q659n2825
$$ -66610 64209 37708 34618 36464 78002 38728 -6204 9013 -22701 -23531 -14872 -67697
15610f7697J6271J3022P9513p7431j5435n9262P202O5140p23Q8027K611p5507
$$ -67697 -51426 -38404 41109 -36322 -51757 -111019 -103817 -38677 -39400 48627 51238 -24269
15598b4269l5377k7796j981J26964N9211j06344J9190N2478l0240j02714j6742
$$ -24269 -59646 -87442 -89423 37541 96752 -9592 9598 62076 31836 -70878 -87620
15587h7620N7868j2886p679m2796k1410l688J727j4850P3522L2863p7213o0957
$$ -87620 -29752 -42638 -50317 -93113 -114523 -118211 -116484 -131334 -57812 -24949 -102162 -163119
15575a63119J03267J0089K5933o1301K3433L9779m2606l5927m2002n1085L7067
$$ -163119 -59852 -49763 -23830 -85131 -61698 -21919 -64525 -100452 -142454 -193539 -156472
15564a56472P2424k0930j329k5430M1927Q663q0147M937L1721k1731j0450L4295
$$ -156472 -84048 -104978 -106307 -131737 -89810 -81147 -161294 -156357 -124636 -146367 -156817 -122522
15552a22522J14105O0789m7920L1771k8162o0905j4210N1899R2633o0579p7722
$$ -122522 -8417 52372 4452 36223 8061 -52844 -67054 -15155 77478 16899 -60823
15541f0823r4212p869O543P7645L1418M024K9299m5243n4658J00038J02970M000
$$ -60823 -155035 -162904 -156361 -78716 -47298 -43274 -13975 -59218 -113876 -13838 89132 93132
15529I3132K6983n7439j45989q4008Q1978J11874R037j19807o4824j307l5851
$$ 93132 120115 62676 -83313 -167321 -85343 26531 35568 -84239 -149063 -150370 -186221
15518a86221j0911L3830J5156J0079l8980J7792M8634k277K3705M8350N2472L5005
$$ -186221 -197132 -163302 -148146 -138067 -177047 -159255 -110621 -112898 -89193 -40843 11629 46634
15506D6634n5085r164k2516K5901n5587k0411n972M809j9021m3271k4265M0549
$$ 46634 -8451 -17615 -40131 -14230 -69817 -90228 -96200 -91391 -110412 -153683 -177948 -137399
15494a37399k0565J2677j3271L156o9921L3217M3298N4500Q6861p7788o458J904
$$ -137399 -157964 -145287 -158558 -155402 -225323 -192106 -148808 -94308 -7447 -85235 -91693 -89789
15482h9789k9452k1196Q093J313J8241M6192J01086K7865Q8335o0173q487J062
$$ -89789 -119241 -140437 -132344 -131031 -112790 -66598 34488 62353 150688 90515 82028 83090
15470H3090r7404K3961m1391n1436L7080j3174Q4198L4269o0804l6192J3134L1938
$$ 83090 -14314 9647 -31744 -83180 -46100 -59274 24924 59193 -1611 -37803 -24669 7269
15458G269O4454n9926n0657K1981p3795P350N8791M9890K3868K1041m1387n1685
$$ 7269 71723 11797 -38860 -16879 -90674 -83324 -24533 25357 49225 70266 28879 -22806
15446b2806o0096J5000L8229K8867L455P1657j07343J7673J9440M9967O141j8998
$$ -22806 -82902 -67902 -29673 -806 2649 74306 -33037 -15364 4076 54043 60184 41186
15434D1186L369j3135j6560j4337P3423M8151M0709k7870n7628p2045K8512P3782
$$ 41186 44555 31420 14860 523 73946 122097 162806 134936 77308 5263 33775 107557
15422A07557l40j00481n6450k3480K1173k32p4148K0464Q7539P675O0681n0179
$$ 107557 107217 6736 -49714 -73194 -52021 -52253 -126401 -105937 -18398 -10723 49958 -221
15410b21N9741N1028j22505n6351R4509O1743j0934j06649r5636L1507M8453P3789
$$ -221 59520 110548 -11957 -68308 26201 87944 77010 -29639 -125275 -93768 -45315 28474
15398B8474n4087j5254k5214m9789Q90r756Q1619M6624j911n61N1481l2634L7847
$$ 28474 -25613 -40867 -66081 -115870 -114980 -124736 -43117 3507 1596 1035 52516 19882 57729
15385E7729O9923l3893j03340o0197O5592K7578r3928n7835J16643q535n9439
$$ 57729 127652 93759 -9581 -69778 -4186 23392 -70536 -128371 -11728 -20263 -79702
15374g9702J15857J4165m6635L5255j968m3609j0208O9968L1383K2407l0720q0510
$$ -79702 36155 50320 3685 38940 36972 -6637 -16845 53123 84506 106913 76193 -4317
15362d317J1801k4782P5528P3755l663K2749k2521p9708p3802n2521K6209M4366
$$ -4317 7484 -17298 58230 131985 128322 151071 128550 48842 -24960 -77481 -51272 -6906
15350f906k3199J1300J0564J5567M8603n4444L5786M9862k0255M3720j7042k1573
$$ -6906 -30105 -18805 -8241 7326 55929 1485 37271 87133 66878 110598 93556 71983
15338G1983m9078j0456o7584n8762K0418P9184P6693l3190p7936O1930M1035K2607
$$ 71983 22905 12449 -55135 -113897 -93479 -14295 62398 29208 -48728 13202 54237 76844
15326G6844M265j00746j03036K0971J12192J37794K238r3131j7975M7012M6273
$$ 76844 81109 -19637 -122673 -101702 10490 148284 150522 57391 39416 86428 132701
15315A32701j5125J473k4602q0383n5546k0684q2094m2850J7252R906m1704J9832
$$ 132701 117576 119049 94447 14064 -41482 -62166 -144260 -187110 -169858 -159952 -201656 -181824
15303a81824Q9549J30663J6440j0268Q9274k1689p3586N421P08m6543L0427p6827
$$ -181824 -92275 38388 54828 44560 133834 112145 38559 43980 44688 -1855 28572 -48255
15291d8255j27528L8594P8309L7464O2811K4276j7944n3931M064m787l16M9476
$$ -48255 -175783 -137189 -58880 -21416 41395 65671 47727 -6204 -2140 -6927 -7243 42233
15279D2233n4589o4379L8649j0239n8328j6233L0148P0983o5004r3163L6622P5081
$$ 42233 -12356 -76735 -38086 -48325 -106653 -122886 -92738 -21755 -86759 -179922 -143300 -68219
15267f8219P0387K1602K0816k1981m8255q917O63j10228O2484R6708L5137m5390
$$ -68219 2168 23770 44586 22605 -25650 -34567 -33904 -144132 -81648 15060 50197 4807
15255D807l3989p9330k1694O1161R2518K4742p7507m5928O4126M1275j2203R138
$$ 4807 -29182 -108512 -130206 -69045 23473 48215 -29292 -75220 -11094 30181 17978 27116
15243B7116J7834P102n2385n6803m97Q6995L8063o1541r938L5965k4148o9667
$$ 27116 44950 52052 -333 -57136 -57633 29362 67425 5884 -4054 31911 7763 -61904
15231f1904K9036O6097K6743m9286m6834k2736J454R594N2043N5323J3364j00419
$$ -61904 -32868 33229 59972 10686 -36148 -58884 -57430 -47836 4207 59530 72894 -27525
15219b7525K6395J6272J7828n6930l2546J3147l4184l1548j544O8812M31n5066
$$ -27525 -1130 15142 32970 -23960 -56506 -43359 -77543 -109091 -110635 -41823 -41392 -96458
15207i6458P8916K0616k1984k1066O122j9358J7172N3537K0833n8652m8678j4053
$$ -96458 -17542 3074 -18910 -39976 -33854 -53212 -36040 17497 38330 -20322 -69000 -83053
15195h3053M1074M9338J8414k6276l8920l5879J1834N9161n774L679J06625K8881
$$ -83053 -41979 7359 25773 -503 -39423 -75302 -63468 -4307 -10081 -6402 100223 129104
15183A29104l9458m0233n6229k8009Q743L7992N8982m1069p2517l2578m1098O0051
$$ 129104 89646 49413 -6816 -34825 -26082 11910 70892 29823 -42694 -75272 -116370 -56319
15171e6319N7433l2652j13560n856O5961N0161n782J7654N9698k1797l4783r5787
$$ -56319 1114 -31538 -145098 -150954 -84993 -34832 -40614 -22960 36738 14941 -19842 -115629
15159a15629k2194N9793Q5505R4298n9864n1592r2031m0408L6091J1642m7103
$$ -115629 -137823 -78030 7475 101773 41909 -9683 -101714 -142122 -106031 -94389 -141492
15148a41492J10280L9438j6634O2312r3987j1669J4694K4281m1707k0196J1863
$$ -141492 -31212 8226 -8408 53904 -40083 -51752 -37058 -12777 -54484 -74680 -62817
15137f2817l8737K0339K0106P4526M2619n4352k8135j1057j2377L3250Q7064m9304
$$ -62817 -101554 -81215 -61109 13417 56036 1684 -26451 -37508 -49885 -16635 70429 21125
15125B1125q5125L3995K502l5302l671M2800p692k0809o224O2117M8061K9518
$$ 21125 -64000 -30005 -27503 -62805 -66476 -23676 -31368 -52177 -58401 3716 51777 81295
15113H1295n0281n0002R9383n251m3475L1385K687J2280L6709k174n8118J7019
$$ 81295 31014 -18988 80395 75144 31669 63054 65741 78021 114730 112556 54438 71457
15101G1457J01577r2726l1357n5232o1168L3317N941J9066n6839j6369Q780o2068
$$ 71457 173034 80308 48951 -6281 -67449 -34132 -28191 -9125 -65964 -82333 -73553 -135621
15089a35621j198j9500p5549M1139J12397L0244P4277l005m6621J6212M9122k3118
$$ -135621 -136819 -156319 -231868 -190729 -78332 -48088 26189 23184 -23437 -7225 41897 18779
15077A8779m1067n4429k4839J3219q38k8028O3678J5714K7814K4143N6024L817
$$ 18779 -22288 -76717 -101556 -88337 -89175 -117203 -53525 -37811 -9997 14146 70170 73987
15065G3987j12909L6702K9288o8804p3335p2292O3154R6242Q533o9562l3008J57411
$$ 73987 -38922 -2220 27068 -41736 -115071 -187363 -124209 -27967 -19434 -88996 -122004 35407
15053C5407k4309q6824m2875L7014O8736N7241K3931p9686l9565O204J9281N8301
$$ 35407 11098 -75726 -118601 -81587 -12851 44390 68321 -11365 -50930 -44726 -25445 32856
15041C2856r811l4796N9965l112J4836l1518q5597N536Q596l625r791M1318M6870
$$ 32856 23045 -11751 48214 45102 59938 28420 -57177 -51641 -43045 -46670 -56461 -15143 31727
15028C1727q6298j5151J0957k9996l9587M3828Q2490K8789k9480n4356j8802k8056
$$ 31727 -54571 -69722 -58765 -88761 -128348 -84520 -2030 26759 -2721 -57077 -75879 -103935
15016a03935O1362M7362p833k5721q915M7506P9799L2344J5752j02839r0262n0780
$$ -103935 -42573 4789 -3044 -28765 -37680 9826 89625 121969 137721 34882 -55380 -106160
15004a06160k1596Q2105M7141K9023n568l6611k9365n3176J1269l2383N643R7966
$$ -106160 -127756 -45651 1490 30513 24945 -11666 -41031 -94207 -82938 -115321 -109678 -11712
14992a1712N4221J477k5280R038m9877n3095L1422J435k5370q23J3221k3380J5751
$$ -11712 42509 43986 18706 27744 -22133 -75228 -43806 -42371 -67741 -68564 -55343 -78723 -62972
14979f2972K9800K2527j2730N708Q8560n7286N010r4885l7989Q1683o888J7015
$$ -62972 -33172 -10645 -23375 -17667 70893 13607 18617 -76268 -114257 -32574 -39462 -22447
14967b2447M3164L0274n7286K6815N3436J8054o60k1381l9591j4115r4900L8037
$$ -22447 20717 50991 -6295 20520 73956 92010 91350 69969 30378 16263 -78637 -40600
14955d0600O674M9876M482k3292K49O2976J7025r3850l9905L6603m0882l2225
$$ -40600 -33926 15950 20432 -2860 -2611 60365 77390 -16460 -56365 -19762 -60644 -92869
14943i2869L5748M561O756K1459K6401L5905j1118M9646j0015L8042K0753O5570
$$ -92869 -57121 -52560 -45804 -24345 2056 37961 26843 76489 66474 104516 125269 190839
14931A90839j9798p8073l0314j2534q030p4237p6679J2966j9524K0676J18453
$$ 190839 171041 92968 62654 50120 42090 -32147 -108826 -95860 -115384 -94708 23745
14920B3745r84o44M2502K7146m0191O9027J0861j0285l4159K3380n545K6606K3262
$$ 23745 22761 22117 64619 91765 51574 120601 131462 121177 87018 110398 104853 131459 154721
14907A54721k1457k0141o5856j05045P626K1288Q1813L3944m5124l648l9042q6441
$$ 154721 133264 113123 47267 -57778 -50152 -28864 52949 86893 41769 38121 -921 -87362
14895h7362R8039P3192M7708j8562l6372m7322m7147J9586L7182l0774o6408j6225
$$ -87362 10677 83869 131577 113015 76643 29321 -17826 1760 38942 8168 -58240 -74465
14883g4465N8984O6116l2969J6519l983k0343p820N4481J0540M9318l7427J0423
$$ -74465 -15481 50635 17666 34185 30202 9859 2039 56520 67060 116378 78951 89374
14871H9374m1722q9150m5831O227J5226N2977L4544q399J8643k1831L5700J2190
$$ 89374 47652 -41498 -87329 -81102 -65876 -12899 21645 13246 31889 10058 45758 57948
14859E7948p5136N5222K7263j18286k5348J7738k2453j3431O7760J3522l4413
$$ 57948 -17188 38034 65297 -52989 -78337 -60599 -83052 -96483 -28723 -15201 -49614
14848d9614q128k8512L6874l3083Q0399J41856j6163r8771j7966J31833L7134
$$ -49614 -57742 -86254 -49380 -82463 -2064 139792 123629 24858 6892 138725 175859
14837A75859r222m0302o4288l7750n8564m2248K2553R7941m979J7289M1430J8825
$$ 175859 166637 126335 62047 24297 -34267 -76515 -53962 43979 39000 56289 97719 116544
14825A16544j3375J7598J2805J4411j8654n0706N7103q0550j47139N2071J23365
$$ 116544 103169 120767 133572 147983 129329 78623 135726 55176 -91963 -39892 83473
14814H3473K7091N838m1185r2208K9379J0242j9402N8478N6775q179R82j40121
$$ 83473 110564 116402 75217 -16991 12388 22630 3228 61706 118481 110302 111284 -28837
14802b8837n4680j5738K6158l4501R1230J8162l7082m9936k3460k67m181p301
$$ -28837 -83517 -99255 -73097 -107598 -16368 1794 -35288 -85224 -108684 -108951 -113132 -120433
14790a20433O3425K3065m8699l38K0474n0032k9360l1200o4182N5028J61650J15585
$$ -120433 -57008 -33943 -82642 -82980 -62506 -112538 -141898 -173098 -237280 -182252 -20602 94983
14778I4983j1492m3126m3237n2571j6983j857K3601m544m1569k0901J9024N4207
$$ 94983 83491 40365 -2872 -55443 -72426 -74283 -50682 -55226 -96795 -117696 -98672 -44465
14766d4465M9224K4946j7092O5026p840n9588N828N4019l3969p793k595K5406
$$ -44465 4759 29705 12613 77639 69799 10211 16039 70058 36089 28296 25701 51107
14754E1107L2887O384l8107p4083K9625l943j26638j5684j5862K0044K7244Q0934
$$ 51107 83994 90378 52271 -21812 7813 3870 -122768 -138452 -154314 -134270 -107026 -26092
14742b6092n3597J6283P1470m7734P341K8314m6701N7213P1807k2468l4362k2645
$$ -26092 -79689 -63406 8064 -39670 -32329 -4015 -50716 6497 78304 55836 21474 -1171
14730a171o9921j9867J1047j4635K3059M5271n458J1052P0753N3771m9194l2443
$$ -1171 -71092 -90959 -79912 -94547 -71488 -26217 -31675 -20623 50130 103901 54707 22264
14718B2264K576L3350K247Q5180Q246q2431k5678L2371Q513J6892n1503k4334
$$ 22264 24840 58190 60437 145617 153863 71432 45754 78125 86638 103530 52027 27693
14706B7693q6044r6212J5387L3442k476j9807M5793N1893Q3426L6087l8813l525
$$ 27693 -58351 -154563 -139176 -105734 -108210 -128017 -82224 -30331 53095 89182 50369 46844
14694D6844M3387o1550j36620n2477J25774k558l6265L0799J2430o5749p654P6055
$$ 46844 90231 28681 -107939 -160416 -34642 -37200 -73465 -42666 -30236 -95985 -103639 -27584
14682b7584N4247K3082j1409n4415O5589P6778j8599m1328q0849p3414j9007J653
$$ -27584 26663 49745 38336 -16079 49510 126288 107689 66361 -14488 -87902 -106909 -105256
14670a05256O4177J14132L787m4253q7651k4167K1241J4182M0604p02N5430K9649
$$ -105256 -41079 73053 76840 32587 -55064 -79231 -57990 -43808 -3204 -3906 51524 81173
14658H1173J9399k4996K7040k8485q1593m6139l8014M722R6832O0611o8115r2806
$$ 81173 100572 75576 102616 74131 -7462 -53601 -91615 -86893 9939 70550 2435 -90371
14646i0371j4692L9324K7269K1267K8849J048m7531K2309M199k2979N986n6820
$$ -90371 -105063 -65739 -38470 -17203 11646 12694 -34837 -12528 -8329 -31308 -25322 -82142
14634h2142k1905k8697M7820L8910j13301p2067Q0732J54611O1887l8276M4425
$$ -82142 -104047 -132744 -84924 -46014 -159315 -231382 -150650 3961 65848 27572 71997
14623G1997j5105p9361r1985K4042K7512n6131O0360Q8915Q7712M7925L1364m9855
$$ 71997 56892 -22469 -114454 -90412 -62900 -119031 -58671 30244 117956 165881 197245 147390
14611A47390j19356k625n3423K7949J03584K5582q6209q6848N157r2848p8602
$$ 147390 28034 25409 -28014 -65 103519 129101 42892 -43956 -38799 -131647 -210249
14600b10249J14798P9681m7932L7147O8030R2850L0446j1679q9292k3066N2739
$$ -210249 -95451 -15770 -63702 -26555 41475 134325 164771 153092 63800 40734 93473
14589I3473p9020L39m690n4264j3584R0159J2804q3417j8406m0230n9453J4728
$$ 93473 14453 14792 10102 -44162 -57746 32413 45217 -38200 -56606 -96836 -156289 -141561
14577a41561r1J7823L675N2643q959l9163L3178j4502p0536L9386L2525R1539
$$ -141561 -141652 -123829 -120154 -67511 -76470 -115633 -82455 -96957 -167493 -128107 -95582 -4043
14565d043P1954r725N8883L1456o3077j0853o7778m9849J4247P273P915k1147
$$ -4043 67911 58186 117069 148525 85448 74595 6817 -43032 -28785 -21512 -13597 -34744
14553c4744m6864o1119Q6666N7380m249O184m8526l0709M3538P9342J06915k7276
$$ -34744 -81608 -142727 -56061 1319 -2930 3254 -45272 -75981 -32443 46899 153814 126538
14541A26538q5532j9022M4636J01516J1064q3345j00891j0395K1159M0068P990
$$ 126538 41006 21984 66620 168136 179200 95855 -5036 -15431 5728 45796 53786
14530E3786J0387N9805N5354j2695j07272p0985N5963P9743R895n4831m6960l126
$$ 53786 64173 123978 179332 166637 59365 -11620 44343 124086 133981 79150 32190 29064
14518B9064L2769m1023o3882J47169N7m4871r0394K7607P4015k3971q6440K755
$$ 29064 61833 20810 -43072 104097 104154 59283 -31111 -3504 70511 46540 -39900 -37145
14506c7145J7422L7945k0510o926k748l8143l9213M0121N9469j6541l9314N950
$$ -37145 -19723 18222 -2288 -9214 -11962 -50105 -89318 -49197 10272 -6269 -45583 -39633
14494c9633p490k6629o258j6126j1994K542R060N9225J2764l5803o687l5327l8077
$$ -39633 -47123 -73752 -80010 -96136 -108130 -105588 -96528 -37303 -24539 -60342 -67029 -102356 -140433
14481a40433J41073R9889l4802j4172k7236r1073n6599N0953M9059m0351O7133
$$ -140433 640 100529 65727 51555 24319 -66754 -123353 -72400 -23341 -63692 3441
14470C441K7370m0127J8802N6661K4941k3663O22m6058p8835o5871M7235P1610
$$ 3441 30811 -9316 9486 66147 91088 67425 68047 21989 -56846 -122717 -75482 -3872
14458c872K5849J4127p0451j5712N0186J05022k5011p5551k7215q314l5405p645
$$ -3872 21977 36104 -34347 -50059 127 105149 80138 4587 -22628 -30942 -66347 -73992
14446g3992M9449K7116q3698j4320j7183j4000N1701m7954K0345N4707K7263k4513
$$ -73992 -24543 2573 -81125 -95445 -112628 -126628 -74927 -122881 -102536 -47829 -20566 -45079
14434d5079j03004n607m1303M8709J43339j0703N7388n3382k9760O3088K3656
$$ -45079 -148083 -153690 -194993 -146284 -2945 -13648 43740 -9642 -39402 23686 47342
14423D7342p97m5829N5020o494j54805n1924R7837J23482J8106l5094m8677k1145
$$ 47342 46545 716 55736 49242 -105563 -157487 -59650 63832 81938 46844 -1833 -22978
14411b2978M3382k5675m5629n2149N4441P2652O4981P6854j0755q2385j20848
$$ -22978 20404 -5271 -50900 -103049 -48608 24044 89025 165879 155124 72739 -48109
14400d8109K2149R6367L9492o3755J2406o028k3126m2024j6682k0408M1868k4679
$$ -48109 -25960 70407 109899 46144 58550 52522 29396 -12628 -29310 -49718 -7850 -32529
14388c2529m9843j1850K5967O3196L2680l5276n0834m0345Q4290Q2851M8762j8780
$$ -32529 -82372 -94222 -68255 -5059 27621 -7655 -58489 -98834 -14544 68307 117069 98289
14376I8289k6350o283p7196o6939r556n0315k1331R4954k540r509M5662Q4474
$$ 98289 71939 65656 -11540 -78479 -88035 -138350 -159681 -64727 -67267 -76776 -31114 53360
14364E3360J1587m6107j8485J4102K1904k7795n9749j8507K6998O061m8281l8992
$$ 53360 64947 18840 355 14457 36361 8566 -51183 -69690 -42692 -36631 -84912 -123904
14352a23904Q8510M968N4139p1963r9393m8464M5483L1462J5171N1991M6653Q9235
$$ -123904 -35394 -30426 23713 -48250 -147643 -196107 -150624 -119162 -103991 -52000 -5347 83888
14340H3888l8376l3157k2852J01578l3415J163j5756k1238q2366O375Q7319n1626
$$ 83888 45512 12355 -10497 91081 57666 58829 43073 21835 -60531 -54156 33163 -18463
14328a8463P7341N6682O204l1878J9954k7277m5085r5438k0120M3074J03155M1242
$$ -18463 58878 115560 121764 89886 109840 82563 37478 -57960 -78080 -35006 68149 109391
14316A09391L1168m9894j6599K4271q0780j0832M6375l8774o785O236k7649j8643
$$ 109391 140559 90665 74066 98337 17557 6725 53100 14326 7541 13777 -13872 -32515
14304c2515N2052N6205l4613N7334j4896k7067Q109J9844l6643o5067l180l1943
$$ -32515 19537 75742 41129 98463 83567 56500 64609 84453 47810 -17257 -20437 -52380
14292e2380N8347N7334L2935o6477m0676M6807k23j02252l3221Q9716O4466L2694
$$ -52380 5967 63301 96236 29759 -10917 35890 35667 -66585 -99806 -10090 54376 87070
14280H7070q5404l7794j5117k3368N5815L5684P3325p558m2265j8318j4488J3283
$$ 87070 1666 -36128 -51245 -74613 -18798 16886 90211 82653 40388 22070 7582 20865
14268B0865o2238q209M2932n2204J7099j3109p3112k3994J4012M0880K1939O3983
$$ 20865 -41373 -49582 -6650 -58854 -41755 -54864 -127976 -151970 -137958 -97078 -75139 -11156
14256a1156Q770M2475j7554n1252k8328j2359n686n6007R706R584P3762N628N0394
$$ -11156 -2386 40089 22535 -28717 -57045 -69404 -75090 -131097 -121391 -111807 -38045 -32417 17977
14243A7977m552l492o3716r4415K7789O5230Q7710k603L691j05952n616J2399
$$ 17977 13425 9933 -53783 -148198 -120409 -55179 32531 29928 33619 -72333 -77949 -65550
14231f5550L3593J2920K3900L5921o185l161l8920k2357M0072j6506K4587O3637
$$ -65550 -31957 -19037 4863 40784 34599 31438 -7482 -29839 10233 -6273 18314 81951
14219H1951j3204L9021l6054p1184m4538M8441N1710m6592l7189l561K9444j550
$$ 81951 68747 107768 71714 530 -44008 4433 56143 9551 -27638 -31199 -1755 -3305
14207c305l6675l559J3393K0304J372j1319n4207K815P7107J06675J28646L9419
$$ -3305 -39980 -43539 -30146 -9842 -8470 -19789 -73996 -71181 5926 112601 241247 280666
14195B80666j02601l4058K8686L7490M329n7172j12684L177J8260K0528n2275
$$ 280666 178065 144007 172693 210183 214512 157340 44656 47833 66093 86621 34346
14184C4346l3767K9839k4018j2612O5981R0011l612j04108p9172O9856J6340l9348
$$ 34346 579 30418 6400 -6212 59769 149780 146168 42060 -37112 32744 49084 9736
14172I736K7621O7107N4791j6473l9708n7907L5314n2055J0703p170K4458n3596
$$ 9736 37357 104464 159255 142782 103074 45167 80481 28426 39129 31959 56417 2821
14160B821l9185Q347K604K6250k6821j6388J2882L7880J23891k7662j14542m3935
$$ 2821 -36364 -28017 -25413 837 -25984 -42372 -29490 8390 132281 104619 -9923 -53858
14148e3858L6990K3765k5662L2186Q081o1645J4425j8229j2062J5360M1886J8982
$$ -53858 -16868 6897 -18765 13421 21502 -40143 -25718 -43947 -56009 -40649 1237 20219
14136B0219R651j2850K3659K6892l7326q2551M3805M5723k5593m1651K9881M4238
$$ 20219 29870 17020 40679 67571 30245 -52306 -8501 37222 11629 -30022 -141 44097
14124D4097l6737M5835r572k0290n5962l4371L3808O0490J7083K5920m4088n3875
$$ 44097 7360 53195 43623 23333 -32629 -67000 -33192 27298 44381 70301 26213 -27662
14112b7662r6702p7785Q1017N7235P8700K4557n0740O098J8776j6329j6438m6541
$$ -27662 -124364 -202149 -121132 -63897 14803 39360 -11380 -5282 13494 -2835 -19273 -65814
14100f5814K8801k5190L4427P9533N5824o466p1937q0003K8840k7978K2040K3180
$$ -65814 -37013 -62203 -27776 51757 107581 101115 29178 -50825 -21985 -49963 -27923 -4743
14088d743L0990o7743O650L168q2174K6245L0191O1432l5984o3998n1540L303
$$ -4743 26247 -41496 -34846 -31678 -113852 -87607 -57416 4016 -31968 -95966 -147506 -144203
14076a44203l1057k6022Q0325L8297Q0173M1508K326l8246q699n585M8127P7787
$$ -144203 -175260 -201282 -120957 -82660 -2487 39021 41347 3101 -5598 -11183 36944 114731
14064A14731k7289l4158K3967N485m5066m2277K595l9308n4405L3211J26089J20315
$$ 114731 87442 53284 77251 82736 37670 -4607 -2012 -41320 -95725 -62514 63575 183890
14052A83890M3475j9765M115K8485l1940k0769q8777j8989J7267l9313j2948l502
$$ 183890 227365 207600 211715 240200 208260 187491 98714 79725 96992 57679 44731 41229
14040D1229J3006N4498M2651k5266l397n4497n0503K1910j8185o82l2843N04m2695
$$ 41229 54235 108733 151384 126118 122721 68224 17721 39631 21446 20764 -12079 -11575 -54270
14027e4270N8544k6118q4567N8267l927P28P0965J9399M2832M0531j7729q0529
$$ -54270 4274 -21844 -106411 -48144 -52071 -51343 19622 39021 81853 122384 104655 24126
14015B4126j06324M8997o8026n9495Q7145N9946M7638k5308m3106l8706J02975
$$ 24126 -82198 -33201 -101227 -160722 -73577 -13631 34007 8699 -34407 -73113 29862
14004B9862O0559q2426m0688j684L3265J5521n5219L9979J8000n5379J8522O2900
$$ 29862 90421 7995 -32693 -34377 -1112 14409 -40810 -831 17169 -38210 -19688 43212
13992D3212R0321Q1537j05606j45043J514K0264R6331M2820J9383m430m4839q6460
$$ 43212 133533 215070 109464 -35579 -34065 -13801 82530 125350 144733 140303 95464 9004
13980I004k7787m6451j1283J4647L4994K410K7647O1822k0433r7287r4993k9866
$$ 9004 -18783 -65234 -76517 -61870 -26876 -24466 3181 65003 44570 -52717 -147710 -177576
13968a77576M304Q8412O0666M0539k1994j580R304N1095M3223M260r251J7712
$$ -177576 -173272 -84860 -24194 16345 -5649 -7229 2075 53170 96393 100653 91402 109114
13956A09114m9222k5056k3696n7646Q2567j4394O4114k7893J2341K6547j8903
$$ 109114 59892 34836 11140 -46506 36061 21667 85781 57888 70229 96776 77873
13945G7873N3458J203j29876m4562P6518j5124j8595R7828K904o628p435n7172
$$ 77873 131331 132534 2658 -41904 34614 19490 895 98723 101627 94999 87564 30392
13933C0392o0832k3465P7894P5786L5221m20k8749n0809o7219r320R3398k5756
$$ 30392 -30440 -53905 23989 99775 134996 134576 105827 55018 -12201 -21521 71877 46121
13921D6121P2401J952k9135j2456n7598j3248k0211N116L8547l6977J7978K8943
$$ 46121 118522 120474 91339 78883 21285 8037 -12174 -7058 31489 -5488 12490 41433
13909D1433N026N6844p8680n5126m0845K0071M874J4029n9447p1061J6945J02879
$$ 41433 46459 103303 24623 -30503 -71348 -51277 -46403 -32374 -91821 -162882 -145937 -43058
13897d3058M4287J1869n4215j03145n7386L188J06426M9759J4006N590R2905L517
$$ -43058 1229 13098 -41117 -144262 -201648 -198460 -92034 -42275 -28269 -22679 70226 73743
13885G3743j12989M9367j1608j7907J9239K5292m873q6751M8547J9030N532l7278
$$ 73743 -39246 10121 -1487 -19394 -155 25137 20264 -66487 -17940 1090 6622 -30656
13873c0656J360L6878q3640m7460L6099P5389k9168o2302n1582P571M5207L6315
$$ -30656 -29296 7582 -76058 -123518 -87419 -12030 -41198 -103500 -155082 -147511 -102304 -65989
13861f5989O8745M5010k082L7452j2720m8369m606o7627j3681J4771q399L3615
$$ -65989 2756 47766 45684 83136 70416 22047 17441 -50186 -63867 -49096 -57495 -23880
13849b3880l4532j01032M7608N8921L9134N5695M401j6575k3412j0932J34401
$$ -23880 -58412 -159444 -111836 -52915 -13781 41914 46315 29740 6328 -4604 129797
13838A29797m6693n2380J694M2730k4556j5157R1157j3235k9049l7328j0118J0192
$$ 129797 83104 30724 32418 75148 50592 35435 126592 113357 84308 46980 36862 47054
13826D7054q2922M6952l3510l7913M7073M8638l5405J8502N0129L8179k3341K2544
$$ 47054 -35868 11084 -22426 -60339 -13266 35372 -33 18469 68598 106777 83436 105980
13814A05980k1893M1826r352j5366m6605J7716j3789m3575M1500k4825L8072r0183
$$ 105980 84087 125913 116561 101195 54590 72306 58517 14942 56442 31617 69689 -20494
13802b0494L810O2769N8761l1752j11820j2585N1549k1152K1528O5257P2079p4429
$$ -20494 -16684 46085 104846 73094 -38726 -51311 238 -20914 614 65871 137950 63521
13790F3521l6523k8240q9817L8427j3329J2209N0529J58616J9656K382r7359k4862
$$ 63521 26998 -1242 -91059 -52632 -65961 -53752 -3223 155393 175049 177431 80072 55210
13778E5210j5123K2376R9203j9957l1463o5743m7609k0682Q1553L0780K030o0130
$$ 55210 40087 62463 161666 141709 110246 44503 -3106 -23788 57765 88545 90575 30445
13766C0445q6475j2007p7420k6293N2145Q0824M2802M946n709l0920J8557m9889
$$ 30445 -56030 -68037 -145457 -171750 -119605 -38781 4021 8967 3258 -27662 -9105 -58994
13754e8994K9735N6998K8653k2920q2400N8113J7943k7894k7965L8322N7110K3167
$$ -58994 -29259 27739 56392 33472 -48928 9185 27128 -766 -28731 9591 66701 89868
13742H9868r1837l0982j4536J5498O9313J2025K0349O019j8258O851J957J4917
$$ 89868 -1969 -32951 -47487 -31989 37324 49349 69698 75717 57459 64310 66267 81184
13730H1184l6309m4505j6704K4407K3733L6503r36k5977j01148m6837J4291j782
$$ 81184 44875 370 -16334 8073 31806 68309 67373 41396 -59752 -106589 -92298 -94080
13718i4080l1589R2181R6339p8725l8514Q0204M7547j1442j3619N701J3600q673
$$ -94080 -125669 -33488 62851 -15874 -54388 25816 73363 61921 48302 54003 67603 58930
13706E8930p3283p2533j5821n3572M0944j003K2494l3364R040r9089K8966k7373
$$ 58930 -14353 -86886 -102707 -156279 -115335 -116338 -93844 -127208 -118168 -217257 -188291 -215664
13694b15664N1916m44j7971Q8262J03281n1189Q294M0798J0159L4641O125R1484
$$ -215664 -163748 -164192 -182163 -93901 9380 -41809 -33515 7283 17442 52083 58208 149692
13682A49692r4037o734Q2973j04006n8345Q4882k2745o9270J16120O8317n9945
$$ 149692 55655 48921 131894 27888 -30457 54425 31680 -37590 78530 146847 86902
13671H6902o5217J6384m1657N2518Q1680l6488l5758r7621L1065M5194O8288l4069
$$ 86902 21685 38069 -3588 48930 130610 94122 58364 -39257 -8192 37002 105290 71221
13659G1221J2719l6874k7211j02307n7503j216J22635O9718K0432p1402o8792
$$ 71221 83940 47066 19855 -82452 -139955 -141171 -18536 51182 71614 212 -68580
13648f8580l6418K1791j5359M5084L3265K0593K016m6184o4726k0931L1340J8590
$$ -68580 -104998 -83207 -98566 -53482 -20217 376 2392 -43792 -108518 -129449 -98109 -79519
13636g9519l0341J6556k676L4320Q8661o204J2548K4589o045n3189p9443p5459
$$ -79519 -109860 -93304 -95980 -61660 27001 20797 33345 57934 51889 -1300 -80743 -156202
13624a56202q1696K0288J16456O0763k2806J5817M2590m7812m1528N2353N2664
$$ -156202 -237898 -217610 -101154 -40391 -63197 -47380 -4790 -52602 -94130 -41777 10887
13613A0887K6640L3747n6357j25264l107M1405L8059L030k4119N7929K5443m3382
$$ 10887 37527 71274 14917 -110347 -113454 -72049 -33990 -30960 -55079 2850 28293 -15089
13601a5089q7252n505J10511M7946j0806n5115K0797k5244L4308k0176p9525N1308
$$ -15089 -102341 -107846 2665 50611 39805 -15310 5487 -19757 14551 -5625 -85150 -33842
13589c3842N5050j18749N8353J5961K0034M0677n8834n0606m3134P2973M0074
$$ -33842 21208 -97541 -39188 -23227 -3193 37484 -21350 -71956 -115090 -42117 -2043
13578b043J5815k863j04233p051J6642j1636J1609M8328L8874N986n7031J8562
$$ -2043 13772 10909 -93324 -100375 -83733 -95369 -83760 -35432 3442 9428 -47603 -29041
13566b9041L0997j11713K4999L0028m5253K7809J01475L9155l6694j7998J3977
$$ -29041 1956 -109757 -84758 -54730 -99983 -72174 29301 68456 31762 13764 27741
13555B7741j7801p7439N3008O0904K6069l657j9893R503P257k411n5349k7739
$$ 27741 9940 -67499 -14491 46413 72482 68825 48932 58435 65692 63281 7932 -19807
13543a9807k6312q096Q517J3445o3440m5636L0289N7679j1576l4574j38335L2087
$$ -19807 -46119 -54215 -45698 -32253 -95693 -141329 -111040 -53361 -64937 -99511 -237846 -205759
13531b05759O8263N4122P9964N7045l5520J8271m23J1734P9772j3868n4124o8778
$$ -205759 -137496 -83374 -3410 53635 18115 36386 35963 47697 127469 113601 59477 -9301
13519i301n4001r786M3692N0952O3204l4266j32466m7222J5500P5748K1849J1587
$$ -9301 -63302 -73088 -29396 21556 84760 50494 -81972 -129194 -113694 -37946 -16097 -4510
13507d510M1070k0072R407N8256N0655K6679j4612k5743l7866l0389k0719K8979
$$ -4510 36560 16488 25895 84151 134806 161485 146873 121130 83264 52875 32156 61135
13495F1135r31j6199J8161k7946L2910m63l702o495n8299m4049l285Q740o620
$$ 61135 60204 44005 62166 34220 67130 66667 62965 56470 -1829 -45878 -49163 -40423 -47043
13482d7043n4844r1369L6937J18591J04362j1758K1133j8044R702k2223m6814
$$ -47043 -101887 -193256 -156319 -37728 66634 54876 76009 57965 67667 45444 -1370
13471a370j0681M3699O3781N6147o68l6512K4406n0902J5325K4392k6909n8617
$$ -1370 -12051 31648 95429 151576 150908 114396 138802 87900 103225 127617 100708 42091
13459D2091Q9534J7554j4671o4457j15487L1908J7367k0627J0526n1585P18j3211
$$ 42091 131625 149179 134508 70051 -45436 -13528 3839 -16788 -6262 -57847 -57129 -70340
13447g0340P4709k7161o217J0861L9037Q7275l8093j15126j2032Q6663k014l0132
$$ -70340 4369 -22792 -29009 -18148 20889 108164 70071 -45055 -57087 29576 27562 -2570
13435b570n3004p1612P1144P8084J1593M9826n8050K1219l1933K0011K8612k0537
$$ -2570 -55574 -127186 -56042 22042 33635 83461 25411 46630 14697 34708 63320 42783
13423D2783o2002J1729j6838k1792k5963J12452L8916k9975l7283o2024M1567
$$ 42783 -19219 -7490 -24328 -46120 -72083 40369 79285 49310 12027 -49997 -8430
13412h430j2385K9865m3585n4134J8085N0007L8286j9598M823k846L175j6422
$$ -8430 -20815 9050 -34535 -88669 -70584 -20577 17709 -1889 2934 88 3263 -13159
13400a3159j6693J6956p2021m9517Q9877P9343J0428o974K978l236K0036k8921
$$ -13159 -29852 -12896 -84917 -134434 -44557 34786 45214 38240 41218 37982 58018 29097
13388B9097K4996O6179k2555o062Q9559K0711j03118o6746N9983Q5996o6884o0854
$$ 29097 54093 120272 97717 91655 181214 201925 98807 32061 92044 178040 111156 50302
13376E0302N3572M6355P49l8446m7727L2705N6870Q256n4919q6271j4357K187
$$ 50302 103874 150229 150978 112532 64805 97510 154380 162636 107717 21446 7089 9276
13364I276j0792k90J6311n262o6613n8615K3100N0852N1008q751k9238m3592M050
$$ 9276 -1516 -1806 14505 9243 -57370 -115985 -92885 -42033 8975 224 -29014 -72606 -68556
13351f8556J531Q7931J3286r7390p9070r353Q4408l0398n5547L4938R1420P842
$$ -68556 -67025 20906 34192 -63198 -142268 -151621 -67213 -97611 -153158 -118220 -26800 -18958
13339a8958K8408N054n830M9655N5433l955L819j1584l3286N129R1557M6138k2723
$$ -18958 9450 14504 8674 58329 113762 109807 113626 102042 68756 73885 165442 211580 188857
13326A88857n4341k1630j2517k6924J9246j4749j10977J7294J9770L3831J2159
$$ 188857 134516 112886 100369 73445 92691 77942 -33035 -15741 4029 37860 50019
13315E0019L6634k1249n4459l0221M1678L7761k6254p265p8521j1455N1734o364
$$ 50019 86653 65404 10945 -19276 22402 60163 33909 26644 -51877 -63332 -11598 -17962
13303a7962j7992P9343K5640J8528l357j16610M798O03L1716Q1550K6754j03057
$$ -17962 -35954 43389 69029 87557 84200 -32410 -27612 -27009 4707 86257 113011 9954
13291I954J5821K8964o0606L7167L1233n6009M0009L8336j8193J9050p1193m0978
$$ 9954 25775 54739 -5867 31300 62533 6524 46533 84869 66676 85726 14533 -26445
13279b6445P8993m2290l9721M55J8620j21883o7395R0135J7556O9219P5601O7548
$$ -26445 52548 10258 -29463 -29008 -10388 -132271 -199666 -109531 -91975 -22756 52845 120393
13267A20393m4030o4499L663Q5499p662l1067r608r797r239R413j943n2214M3085
$$ 120393 76363 11864 15527 101026 93364 62297 52689 42892 33653 43066 41123 -11091 31994
13254C1994N1152o5078M4378O9483k080l8117l7445l3663L7623K5372m4362p8251
$$ 31994 83146 18068 62446 131929 129849 91732 54287 20624 58247 83619 39257 -38994
13242c8994m3885Q19P3829M9158M4905P963J8078O805o1843j08998j8662M8696
$$ -38994 -82879 -82060 -8231 40927 85832 93795 111873 118678 56835 -52163 -70825 -22129
13230b2129j5341n1576J8638M8558l068p0156m6799M4444J11620k2950k2730k189
$$ -22129 -37470 -89046 -70408 -21850 -24918 -95074 -141873 -97429 14191 -8759 -31489 -33678
13218c3678J9304k2738k6278j7604J5898N5460l5955J20434P9876o1693p7817
$$ -33678 -14374 -37112 -63390 -80994 -65096 -9636 -45591 74843 154719 93026 15209
13207A5209J6381k8611J3004P900L252o3508l6214n2362j1845M8334P3597l3875
$$ 15209 31590 2979 15983 23883 27135 -36373 -72587 -124949 -136794 -88460 -14863 -48738
13195d8738K6269Q6695p7275q2324L562N8018J05012J5581k6930j00986N9588
$$ -48738 -22469 64226 -13049 -95373 -91811 -33793 71219 86800 59870 -41116 18472
13184A8472j5665J8947k482K5318j7072m4082M7526j5332l7414K432O1584r5N428
$$ 18472 2807 21754 19272 44590 27518 -16564 30962 15630 -21784 -19352 42232 42137 47565
13171D7565L062m4979q2271j181l6596M5123J81528l037r1885m1186k2459J4185
$$ 47565 50627 5648 -76623 -77804 -114400 -69277 112251 109214 17329 -23857 -46316 -32131
13159c2131l7678L2158L2092K3672M521K8667l8346m2038k4033p607r0507J7365
$$ -32131 -69809 -37651 -5559 18113 22634 51301 12955 -29083 -53116 -60723 -151230 -133865
13147a33865P9151N2377l9924n1984N3775r876K4575P0415K9894n0846J0835j7234
$$ -133865 -54714 -2337 -42261 -94245 -40470 -50346 -25771 44644 74538 23692 34527 17293
13135A7293j8992p462M7321j4380J1594k7657j5195j1944r1351j3256K9335N2938
$$ 17293 -1699 -9161 38160 23780 35374 7717 -7478 -19422 -110773 -124029 -94694 -41756
13123d1756O7052r445N6806N347p664l2033j8050Q057K9754k399l7225k9082M1313
$$ -41756 25296 15851 72657 78004 70340 38307 20257 28314 58068 55669 18444 -10638 30675
13110C0675m0412o5306j9823O9096N178p1659q7050K3696N6667M5725J7968L3692
$$ 30675 -9737 -75043 -94866 -25770 -20592 -92251 -179301 -155605 -98938 -53213 -35245 -1553
13098a553m2847l4765k7020P9736O1795k127r5457m9558O3924K5466K5638p888
$$ -1553 -44400 -79165 -106185 -26449 35346 33219 -62238 -111796 -47872 -22406 3232 -4656
13086d656O2845N7627q5491m0028m6258L4706j0360m0712l3936l7270R1075N2185
$$ -4656 58189 115816 30325 -9703 -55961 -21255 -31615 -72327 -106263 -143533 -52458 -273
13074b73L0465J4115K5154q6699n8731R4997J15231k9168o272j4499m5937m4139
$$ -273 30192 44307 69461 -17238 -75969 19028 134259 105091 98819 84320 38383 -5756
13062e756n9795k5514k8641m0743P9487J20747J2589q9778p2373R4871j0878k5501
$$ -5756 -65551 -91065 -119706 -160449 -80962 39785 52374 -37404 -109777 -14906 -25784 -51285
13050e1285j533q8754Q6773J04850J057K0154m1172J9674m799o3090l8126O6167
$$ -51285 -52818 -141572 -54799 50051 51108 71262 30090 49764 44965 -18125 -56251 9916
13038I916J27879P940P4832j0778o455j01010j1888k0316K8211l2711J6531k1755
$$ 9916 137795 145735 220567 209789 203334 102324 90436 70120 98331 65620 82151 60396
13026F0396O767j2639J8943L6228m9688m0298J3557R6535R15k5868K5261L8671
$$ 60396 67163 54524 73467 109695 60007 19709 33266 129801 130716 104848 130109 168780
13014A68780k4123n8788P938n7489q1437K0286m5450J9483J02803J648m8592L1706
$$ 168780 144657 85869 93807 36318 -45119 -24833 -70283 -50800 52003 53651 5059 36765
13002C6765m5516r1671o977J25591J3111K1394j5386M5705n6461n6423K6094J37312
$$ 36765 -8751 -100422 -107399 18192 31303 52697 37311 83016 26555 -29868 -3774 133538
12990A33538N7556q5442j11719l8714k5461N7628J2532l3354J1616n4811m3698
$$ 133538 191094 105652 -6067 -44781 -70242 -12614 -82 -33436 -21820 -76631 -120329
12979a20329m1803j4486N4118J11132J3603p241J6123j2641J9510j652l9545j0313
$$ -120329 -162132 -176618 -122500 -11368 2235 -5006 11117 -1524 17986 16334 -23211 -33524
12967c3524N0087J4265k7139k147j0161j6567l316J1663k5809j6522l2167J1516
$$ -33524 16563 30828 3689 1542 -8619 -25186 -28502 -16839 -42648 -59170 -91337 -79821
12955g9821q970K7733K577n568L2072J02522P0025K6627o1094n8886m2688n3717
$$ -79821 -88791 -61058 -58481 -64049 -31977 70545 140570 167197 106103 47217 4529 -49188
12943d9188O6181P071J9228p116q2883m1293j2083N2565K3981Q531r257p8790
$$ -49188 16993 24064 43292 36176 -46707 -88000 -100083 -47518 -23537 -15006 -24263 -103053
12931a03053j6960K0N2942M0564J3731J0228L9150j4340K7364q8597q8180L3758
$$ -103053 -120013 -119993 -67051 -26487 -12756 -2528 36622 22282 49646 -38951 -127131 -93373
12919i3373L3701n4060N5674L0190K2695P0667Q9406J1998l3162p0563p2714P8890
$$ -93373 -59672 -113732 -58058 -27868 -5173 65494 154900 166898 133736 63173 -9541 69349
12907F9349O1210l8687j684K9538l6586l3427p056n7555m8133k2338M1601o4735
$$ 69349 130559 91872 90188 119726 83140 49713 42657 -14898 -63031 -85369 -43768 -108503
12895a08503M5531P2837J807j1824j1664q762k4173k7247R1549J01958O829J3101
$$ -108503 -62972 9865 11672 -152 -11816 -20578 -44751 -71998 19551 121509 128338 141439
12883A41439n7945j45087l6182R5419J8331l0571K4817p3849K7947M3513j5754
$$ 141439 83494 -61593 -97775 -2356 15975 -14596 10221 -63628 -35681 7832 -7922
12872g922K9370J2988l8726J3146k8127N8355J6127N2589L2420K3017q5289q4054
$$ -7922 21448 34436 -4290 8856 -19271 39084 55211 107800 140220 163237 77948 -6106
12860f106J6982o6686l2122l9937N3333Q9478N5059p2324n6922O9051k907J3714
$$ -6106 10876 -55810 -87932 -127869 -74536 14942 70001 -2323 -59245 9806 6899 20613
12848B0613K824k4316J7981P1577J21330J7494j00791p7135l372Q4200Q375r5763
$$ 20613 23437 -879 17102 88679 210009 227503 126712 49577 46205 130405 138780 43017
12836D3017k5550Q8398m760p1781o000J4367k7716r390O7554k5329p9587m2583
$$ 43017 17467 105865 101105 29324 23324 37691 9975 585 68139 42810 -36777 -79360
12824g9360R867o2415l0848K6111o182L3948P3833j2471k9R1500J9763o1067K8216
$$ -79360 -69493 -131908 -162756 -136645 -142827 -108879 -35046 -47517 -47546 43954 63717 2650 30866
12811C0866R6279R5056L8994o8148j15244o7333j15224j3858J16030M2608o2577
$$ 30866 127145 222201 261195 193047 77803 10470 -104754 -118612 -2582 40026 -22551
12800b2551n6926P8687O7563P0631J6811j6859n1116n9734R070l1040L4617p0749
$$ -22551 -79477 -790 66773 137404 154215 137356 86240 26506 35576 4536 39153 -31596
12788c1596m9900k9958M4594P0308p4898L4837K7047M0389k5683q59j3436j6337
$$ -31596 -81496 -111454 -66860 3448 -71450 -36613 -9566 30823 5140 4281 -9155 -25492
12776b5492p8485N3685N4820l7913p203K9502R282J1844M1341n2965j1601q76
$$ -25492 -103977 -50292 4528 -33385 -40588 -11086 -1804 10040 51381 -1584 -13185 -14061
12764a4061k5525k1901J6945L9219Q4452N306l7862n7277o2426j9554M4415R2370
$$ -14061 -39586 -61487 -44542 -5323 79129 84435 46573 -10704 -73130 -92684 -48269 44101
12752D4101J124j6494n8330o4519k3236L6307O8996R609L2643K07J3784K8047
$$ 44101 45225 28731 -29599 -94118 -117354 -81047 -12051 -2442 30201 30408 44192 72239
12740G2239N8018m72n0426o1045Q71Q589n3237k7413k8964j9849O9081N4695o6787
$$ 72239 130257 129785 79359 18314 19185 27774 -25463 -52876 -81840 -101689 -32608 22087 -44700
12727d4700J2536O9496l6598k6160k9966R180R3963L7499N6031l67m3857k363
$$ -44700 -32164 37332 734 -25426 -55392 -46212 47751 85250 141281 140914 97057 94694
12715I4694l0492N6927J11271l0442j03961k9548k9999j2033j8498k1210j5410
$$ 94694 64202 121129 232400 201958 97997 68449 38450 26417 7919 -13291 -28701
12704b8701p5994N3467R3505j9378K8792J722j12295K5863O9537n155J1894Q4741
$$ -28701 -104695 -51228 42277 22899 51691 53413 -58882 -33019 36518 31363 43257 127998
12692A27998O95l1074o5694J3179N2010J5322n8880l7283j6148K1678O2518p740
$$ 127998 128693 97619 31925 45104 97114 112436 53556 16273 125 21803 84321 76581
12680G6581M2775m0889K9514K1930J9094o8536j5155L497J2536l7861n4447j0419
$$ 76581 119356 78467 107981 129911 149005 80469 65314 68811 81347 43486 -10961 -21380
12668b1380K7075J0297J5380m9477l8805K800j263l3933l9438P881Q0659O0978
$$ -21380 5695 15992 31372 -18105 -56910 -54110 -55373 -89306 -128744 -120863 -40204 20774
12656B0774q124k4419P1629K0974O539P5352J1977l6952o8362m221k1960n5172
$$ 20774 12650 -11769 59860 80834 87373 162725 174702 137750 69388 65167 43207 -11965
12644a1965p5536J2454Q1088m528j0894J5336p6138m8564M5473J7309J9281J722
$$ -11965 -87501 -75047 6041 1513 -9381 5955 -70183 -118747 -73274 -55965 -36684 -34962
12632c4962m285l5003K6141J004P742M513Q2642j2738P9827L1944k1733l3844
$$ -34962 -39247 -74250 -48109 -47105 -39363 -34850 47792 35054 114881 146825 125092 91248
12620I1248m2692K2030P2953k4584l8289K3078L6826r4529j00555L1510j4413
$$ 91248 48556 70586 143539 118955 80666 103744 140570 46041 -54514 -23004 -37417
12609c7417K1711m68l209m7009j2397k3627o3921K3163Q5831J48651K5212o1046
$$ -37417 -15706 -16174 -19383 -66392 -78789 -102416 -166337 -143174 -57343 91308 116520 55474
12597E5474p6917J3833N9909O648J2455k6110r0931j209k8876J25743J57111J08032
$$ 55474 -21443 -7610 52299 58947 71402 45292 -45639 -46848 -75724 50019 207130 315162
12585C15162J6136n0538n5249n4960j50646j70644j4351N7249K2873Q7363J9604
$$ 315162 331298 280760 225511 170551 19905 -150739 -165090 -107841 -84968 2395 21999
12574B1999J133n2063j4399Q7045J8670n4136L8351J4379N9111n4087j9422M7700
$$ 21999 23132 -28931 -43330 43715 62385 8249 46600 60979 120090 66003 46581 94281
12562I4281p8092p5377P391J6173O8572Q4956k6356m4639P0260N7364k9512q7169
$$ 94281 16189 -59188 -51797 -35624 32948 117904 91548 46909 117169 174533 145021 57852
12550E7852n8690j05597Q74P0170j658L9141N2558P132j2940k9883L882J31221
$$ 57852 -838 -106435 -105561 -35391 -37049 2092 54650 61782 48842 18959 22841 154062
12538A54062Q0940r6706o4490k8213k9428q3708p8934O1351M5767M9577N5622
$$ 154062 235002 138296 73806 45593 16165 -67543 -146477 -85126 -39359 10218 65840
12527F5840k7012p3472k0790P0306Q012k124M2583o1708n7548O046O3010R3855
$$ 65840 38828 -34644 -55434 14872 22884 20760 63343 1635 -55913 -49867 13143 106998
12515A06998J8725K9997o7205m6716l38N5382O0542J915m5196M599n274o6065
$$ 106998 125723 155720 88515 41799 41461 96843 157385 159300 114104 118703 113429 47364
12503D7364j6671J3003N2264o4488k5233K689L9604j0480n0902M035j4523j5191
$$ 47364 30693 43696 95960 31472 6239 8928 48532 38052 -12850 -8815 -23338 -38529
12491c8529l5284O0898L8127j4951N0941Q0431K7244M2006m6983p3015j253J6411
$$ -38529 -73813 -12915 25212 10261 61202 141633 168877 210883 163900 90885 89632 106043
12479A06043k4855L7870K0356o478m7434n9632k0854N478M9627O6689L1040n2623
$$ 106043 81188 119058 139414 132936 85502 25870 5016 10494 60121 126810 157850 105227
12467A05227j4270l9677q238l1169O6287o3479k5369O1194N9786m8862k1734J7090
$$ 105227 90957 51280 43042 11873 78160 14681 -10688 50506 110292 61430 39696 56786
12455E6786K2352J1692r393J4449o1370n7678K9590Q0486K5364L0108r621j03243
$$ 56786 79138 90830 81437 95886 34516 -23162 6428 86914 112278 142386 132765 29522
12443B9522m3893j14121j0032L4559K2962O1938K8824O7827L4650p0019l8350
$$ 29522 -14371 -128492 -138524 -103965 -81003 -19065 9759 77586 112236 42217 3867
12432C867l3120N834L6381j4386K8941l850L2989J9792k3370l276K4265N816L5483
$$ 3867 -29253 -23419 12962 -1424 27517 23667 56656 76448 53078 49802 74067 79883 115366
12419A15366j4087k955k3716j12052o1132L1299j9311P865R0940M5781K2325j9538
$$ 115366 101279 98324 74608 -37444 -98576 -67277 -86588 -78723 12217 57998 80323 60785
12407F0785K686K9309K5050j4836l280k6420J02070j2516q598p7798p1364n777
$$ 60785 63471 92780 117830 102994 99714 73294 175364 162848 154250 76452 5088 -689
12395f89L5820r494J5215J4050L244J02570J0785j09746n1666q067L9608k294
$$ -689 35131 25637 40852 54902 58146 160716 171501 61755 10089 2022 41630 39336
12383C9336J0939Q4177N2710l7423j6673j3941n5561o695P482K4977J19097P3447
$$ 39336 50275 134452 187162 149739 133066 119125 63564 56869 64351 89328 208425 281872
12371B81872l6096r9570p6656k5552k1829R41R4212J7888J9795J4053k2254j29871
$$ 281872 245776 146206 69550 43998 22169 23110 117322 135210 155005 169058 146804 16933
12359A6933K0311M2378n055k7892n733m7005O8257O9205j0570j3487k1503j8359
$$ 16933 37244 79622 74567 46675 40942 -6063 62194 131399 120829 107342 85839 67480
12347F7480L1570l0762k8260N578M4167N869N8247o069j240K9688K9425m8532
$$ 67480 99050 68288 40028 45606 89773 95642 153889 147820 146580 176268 205693 157161
12335A57161j71721k0096J26745J34844M5249j3631j23807K9530P025n3140R007
$$ 157161 -14560 -34656 92089 226933 272182 258551 134744 164274 171299 118159 127166
12324A27166O1476K5273j7913l6586m602j42354n2860Q4705P2694P5284K5149
$$ 127166 188642 213915 196002 159416 154814 12460 -40400 44305 116999 192283 217432
12313B17432j8396j37784Q475Q9341P7048m5659K5124P073p7264m2848l4041J2688
$$ 217432 199036 61252 69727 159068 236116 190457 215581 222654 145390 102542 68501 81189
12301H1189K0521J3855m8914k1128j01093K4268J22256N2175m7240j1598N6559
$$ 81189 101710 115565 66651 45523 -55570 -31302 90954 143129 95889 84291 140850
12290A40850m6519k3985Q7184O3405m6681k9375k3762n0120m5026M0359O6822
$$ 140850 94331 70346 157530 220935 174254 144879 121117 70997 25971 66330 133152
12279A33152l742K9518L04l2652J08042k273m2828J8623L195p1619m823m5713
$$ 133152 129410 158928 159232 126580 234622 232349 189521 208144 211339 139720 134897 89184
12267H9184n4711m5119k6278J04162k6206l6751J04565K1768M1685K2765k5152
$$ 89184 34473 -10646 -36924 67238 41032 4281 108846 130614 172299 195064 169912
12256A69912J08788J3783r5918n695l5762M7099J08520M8587Q769L8998l6846
$$ 169912 278700 292483 196565 190870 155108 202207 310727 359314 368083 407081 370235
12245C70235L0556J1774j57115n5364R117K6115m5745p0904M4657J05441N4299
$$ 370235 400791 412565 255450 200086 209203 235318 189573 118669 163326 268767 323066
12234C23066k2811j8160N8945L164J02l0785q7092j1223p0510p9075Q8578O3362
$$ 323066 300255 282095 341040 344204 344306 313521 226429 215206 144696 65621 154199 217561
12222B17561M0818M3421q8540l9009j1589l8036O6531j1142j08098Q68M8731P4412
$$ 217561 258379 301800 213260 174251 162662 124626 191157 180015 71917 72785 121516 195928
12210A95928P2532j1891m196j6367J0782J5384K6545J03350R9031n3063k834n4632
$$ 195928 268460 256569 252373 236006 246788 262172 288717 392067 491098 438035 435201 380569
12198C80569J5099K240k2024o7855k243j6131P802M6796P1891l4353q0492j8803
$$ 380569 395668 397908 375884 308029 305786 289655 297457 344253 416144 381791 301299 282496
12186B82496J0127k3873l021M8582N0422J12921r5526m7873N8060O0421o385o97
$$ 282496 292623 268750 265729 314311 364733 477654 382128 334255 392315 452736 446351 445654
12174D45654P6594l7501j39977q2592J1888Q511N2325K9230l6860J3781N5870
$$ 445654 522248 484747 344770 262178 274066 282577 334902 364132 327272 341053 396923
12163C96923l3930N328k9971J0722P725O2476N1353m0809o8031p0505o5728R9873
$$ 396923 362993 368321 338350 349072 356797 419273 470626 429817 361786 291281 225553 325426
12151C25426J0086L4157o248r45Q7506L4833l8571p1814J28845j8166n1439K112
$$ 325426 335512 369669 363421 362476 449982 484815 446244 374430 503275 485109 433670 435782
12139D35782j5708Q185j0707P7700M0348L5097n5318o4428K0468K4268n4821j1826
$$ 435782 420074 428259 417552 495252 535600 570697 515379 450951 471419 495687 440866 429040
12127D29040J31199l17L4192K4097J4947n5034j87641o6402L6038L5247N0659
$$ 429040 560239 559922 594114 618211 633158 578124 390483 324081 360119 395366 446025
12116D46025n59l0586M9689N0253M5627K2267l9801R8390L8134M4474K8800m6507
$$ 446025 445466 414880 464569 514822 560449 582716 542915 641305 679439 723913 752713 706206
12104G06206q895N2306L4108j5337J3959J2133J9692j7049k5704L9425l9321m2032
$$ 706206 697311 749617 783725 768388 782347 794480 814172 797123 771419 810844 771523 729491
12092G29491j4708l539Q8816K5458j9314m5959k7241N6032l2286J3587o0065n3354
$$ 729491 714783 711244 800060 825518 806204 760245 733004 789036 756750 770337 710272 656918
12080F56918O4654R3993J05218m3323p4641k3086L8585k549P162P0220N6952P0735
$$ 656918 721572 815565 920783 877460 802819 779733 818318 815769 822931 893151 950103 1020838
12068A020838k3768M0637J63j905l8417K6115l8740n4752K5515J6626O3376L886
$$ 1020838 997070 1037707 1037870 1035965 997548 1023663 984923 930171 955686 972312 1035688 1039574
12056A039574R0150K6611r82N6290M0369L0564K2824k2032J4320p8524M5790L5645
$$ 1039574 1129724 1156335 1155353 1211643 1252012 1282576 1305400 1283368 1297688 1219164 1264954 1300599
12044A300599M2668L8289L6348Q4426O7192r158l3637l9271N4276J1314m8412
$$ 1300599 1343267 1381556 1417904 1502330 1569522 1560364 1526727 1487456 1541732 1553046 1504634
12033A504634N3577M8979M9969m1341M94R1775o704N5821P8208M6846L230P3296
$$ 1504634 1558211 1607190 1657159 1615818 1616312 1708087 1701383 1757204 1835412 1882258 1885488 1958784
12021A958784J05095Q2089l5617J7525M1674l4955J8671J41677j2018k857N3776
$$ 1958784 2063879 2145968 2110351 2127876 2169550 2134595 2153266 2294943 2282925 2280068 2333844
12010B333844P7714J39085k1217j3348J01852J53282M3967N2422J2717M3268J61922
$$ 2333844 2411558 2550643 2529426 2516078 2617930 2771212 2815179 2867601 2880318 2923586 3085508
11999C085508J32800k3953n664O5847J82303R9375N4752Q4417J29306J69933Q5156
$$ 3085508 3218308 3194355 3188691 3254538 3436841 3536216 3590968 3675385 3804691 3974624 4059780
11988D059780N5023P0894M9445Q3994J59309J92381J42870R6622R4252J20364
$$ 4059780 4114803 4185697 4235142 4319136 4478445 4670826 4813696 4910318 5004570 5124934
11978E124934P2142J70248J68478O4062K10531K85091K05298J51585J93203K16306
$$ 5124934 5197076 5367324 5535802 5599864 5810395 6095486 6300784 6452369 6645572 6861878
11968F861878K54462K45890K65643K12770K28919K55739L20907K81096K99437
$$ 6861878 7116340 7362230 7627873 7840643 8069562 8325301 8646208 8927304 9226741
11959I226741L70098M17941L27255M07313N17467M40068M76531N24243N46948
$$ 9226741 9596839 10014780 10342035 10749348 11266815 11706883 12183414 12707657 13254605
11950A3254605M46640N24074N90344O30314P01200P21223O77268P77639P92635
$$ 13254605 13701245 14225319 14815663 15445977 16147177 16868400 17545668 18323307 19115942
11941A9115942Q65430Q80908R74269J027507J104628J004682J044997J161090
$$ 19115942 19981372 20862280 21836549 22864056 23968684 24973366 26018363 27179453
11933B7179453J132337J173519J246443J312516J331742J235429J259628J305914
$$ 27179453 28311790 29485309 30731752 32044268 33376010 34611439 35871067 37176981
11925C7176981J247886J291222J215890J004178Q86240Q49120P65711O20940M65820
$$ 37176981 38424867 39716089 40931979 41936157 42822397 43671517 44437228 45058168 45523988
11916D5523988L02175J88662R6189q6617l07625m21234n95513o69666p57005q58297
$$ 45523988 45826163 46014825 46111014 46024397 45716772 45295538 44700025 44030359 43273354 42415057
11906D2415057r12434r61431j005242j119475j089400j103620j096124j093601
$$ 42415057 41502623 40541192 39535950 38416475 37327075 36223455 35127331 34033730
11898C4033730j069485j155861j201389j136324j046074j071599j025303j045110
$$ 34033730 32964245 31808384 30606995 29470671 28424597 27352998 26327695 25282585
11890B5282585r05652q48129q98323q58843p61668q25217q01324o42628o92424
$$ 25282585 24376933 23528804 22630481 21771638 21009970 20184753 19383429 18740801 18048377
11881A8048377p45841o18055n17795n87977o14661n83922m64698n34593n42697
$$ 18048377 17302536 16684481 16166686 15578709 14964048 14380126 13915428 13380835 12838138
11872A2838138m33823m62894m08342l54165l04498m18348m31777k62182l03530
$$ 12838138 12404315 11941421 11533079 11178914 10874416 10456068 10024291 9762109 9458579
11863I458579l06078l35235l56843k93047k39764k87848k43383j29053j64591
$$ 9458579 9152501 8817266 8460423 8167376 7927612 7639764 7396381 7267328 7102737
11854G102737j97852j11018j94717j98246k55124k31375j96158k00833j63378
$$ 7102737 6904885 6793867 6599150 6400904 6145780 5914405 5718247 5517414 5354036
11845E354036j01365j15508j25073j40492j01549q5351r2041j07678j54252j46206
$$ 5354036 5252671 5137163 5012090 4871598 4770049 4684698 4592657 4484979 4330727 4184521
11835D184521l6824j11492n4692j15955j08676n9160J5859o8840q4704n3786m9494
$$ 4184521 4147697 4036205 3981513 3865558 3756882 3697722 3713581 3644741 3560037 3506251 3456757
11824C456757q7532j59222j52791p4170j04216R717Q9601k5031o9959r0977m9310
$$ 3456757 3369225 3210003 3057212 2983042 2878826 2888543 2978144 2953113 2883154 2792177 2742867
11813B742867m3628j28q4020q3658n524p7913m6045n8197k7037j9140m3346m2911
$$ 2742867 2699239 2699111 2615091 2531433 2525909 2447996 2401951 2343754 2316717 2297577 2254231 2211320
11801B211320j14903m873q873j1068r09n4198k6035m8468m2285n2226p1145L4369
$$ 2211320 2096417 2091544 2082671 2071603 2070694 2016496 1990461 1941993 1899708 1847482 1776337 1810706
11789A810706K3767k5981n2065J3262J2919l4163J1100j9992k9511r2068l4945
$$ 1810706 1834473 1808492 1756427 1769689 1782608 1748445 1759545 1739553 1710042 1617974 1583029
11778A583029L5632l9057q186l7161n2858M1204r4746k7868o897k4063l5405r452
$$ 1583029 1618661 1579604 1571418 1534257 1481399 1522603 1427857 1399989 1393092 1369029 1333624 1324172
11766A324172K188k4503P918n1872k5927J1408O278M4771p8241n5006j6056n225
$$ 1324172 1326360 1301857 1309775 1257903 1231976 1243384 1249662 1294433 1216192 1161186 1145130 1139905
11754A139905M342j9652M1764L5141m6394l2627j0647M481l0005j32306r8919
$$ 1139905 1144247 1124595 1166359 1201500 1155106 1122479 1111832 1116313 1086308 954002 855083
11743H55083k3595J944J20263P7946J9295n2402j667o5913j7106J14333n1404
$$ 855083 831488 833432 953695 1031641 1050936 998534 996867 930954 913848 1028181 976777
11732I76777l8821n4793j25348n3788o139R5596P4306p7617r0633k8481o2002
$$ 976777 937956 883163 757815 704027 697888 793484 867790 790173 699540 671059 609057
11721F09057P2302Q9423j5691P1826k9062j16329q0369k2714J4570k0725L825
$$ 609057 681359 770782 755091 826917 797855 681526 601157 578443 593013 572288 576113
11710E76113R4726j5679q4700N4967J0143P434M4007L6404l5443o772l438K4377
$$ 576113 670839 655160 570460 625427 635570 643004 687011 723415 687972 681200 677762 702139
11698G02139m3067l8776n8202l5956K4630k0257m9345p767q1573m3747K9585J10743
$$ 702139 659072 620296 562094 526138 550768 530511 481166 473399 391826 348079 377664 488407
11686D88407Q7161o9720k0649M7664K4243n3560k3376l005K303L8361J8762J8508
$$ 488407 575568 505848 485199 532863 557106 503546 480170 477165 479468 517829 536591 555099
11674E55099M1927L377j6529L4244O865q3777n7962l8998p452K8773O9376j1129
$$ 555099 597026 600403 583874 618118 624983 541206 483244 444246 436794 465567 534943 523814
11662E23814k9721Q5448p8082o2888J6674K8203n3315j5335m1877k2505L9608
$$ 523814 494093 579541 501459 438571 455245 483448 430133 414798 372921 350416 390024
11651C90024o5607M5406J4137L0719O145M317o9484l2582P7574J4267n0430K9702
$$ 390024 324417 369823 383960 414679 420824 425141 355657 323075 400649 414916 364486 394188
11639C94188Q2664k2898r6526n9631m6353l9777J31456R4367O382R081j20106
$$ 394188 476852 453954 357428 297797 251444 211667 343123 437490 443872 452953 332847
11628C32847n6928L3874L0899J8593n433n358k5656j14216n1579P542O2760N4504
$$ 332847 275919 309793 340692 359285 353852 348494 322838 208622 157043 164585 227345 281849
11616B81849J5463M6352N5465M4648o216j33643m5314K6782Q5445o8584q3462
$$ 281849 297312 343664 399129 443777 437561 303918 258604 285386 370831 302247 218785
11605B18785O3845J17354L488j08799l1368M2165J0821n9360k6208O7508n9720
$$ 218785 282630 399984 403472 294673 263305 305470 316291 256931 230723 298231 238511
11594B38511n4715m3189n4979M1826L4379N2351K1650p7403L5632j4730J5277
$$ 238511 183796 140607 85628 127454 161833 214184 235834 158431 194063 179333 194610
11583A94610K6190k5612k5414m2812J3749R127J8784P7419L0330l2575R411N628
$$ 194610 220800 195188 169774 126962 140711 149838 168622 246041 276371 243796 253207 258835
11571B58835N404k9855J2343K7833p2287q116n881N5663L4022o5676n9636n8804
$$ 258835 264239 234384 246727 274560 202273 194157 188276 243939 277961 212285 152649 93845
11559I3845L2722K6294L0995M5514O1161M2389P7492O5326n8299j15226j26879
$$ 93845 126567 152861 183856 229370 290531 332920 410412 475738 417439 302213 175334
11548A75334J8635L1621O878j4756Q3805Q4744J3726m5527q9848n3720L1636R325
$$ 175334 193969 225590 232468 217712 301517 386261 399987 354460 264612 210892 242528 251853
11536B51853J0502m2488k5097K7219O595p5150N8396L463j14076m2507K5773K6901
$$ 251853 262355 219867 194770 221989 228584 153434 211830 215293 101217 58710 84483 111384
11524A11384J3542K8481M9252R889M0067J4420m8937q1959M8323L1586m1367m6275
$$ 111384 124926 153407 202659 212548 252615 267035 218098 136139 184462 216048 174681 128406
11512A28406Q747J5718k2768q7235o2495L1403M8776O6415L1925j4268Q855J5720
$$ 128406 137153 152871 130103 42868 -19627 11776 60552 126967 158892 144624 153479 169199
11500A69199J8087p4300n9829K0507N7694R7901J123K6862K4742l6342l6065j00256
$$ 169199 187286 112986 53157 73664 131358 229259 230382 257244 281986 245644 209579 109323
11488A09323r9083M5457Q4842Q363K1731n2836J5738K4117k8453o2888M3919k9528
$$ 109323 10240 55697 140539 148902 170633 117797 133535 157652 129199 66311 110230 80702
11476H0702k6251O6673j1662K0697l435R3010L1346l8070K782M3045m6724m6006
$$ 80702 54451 121124 109462 130159 126724 219734 251080 213010 215792 258837 212113 166107
11464A66107j5805q978O8158l5378j20555j86304Q3534K38746J00280k7761j02225
$$ 166107 150302 141324 209482 174104 53549 -132755 -49221 189525 289805 262044 159819
11453A59819k2018j6645K5091m4492l3608P5324L1858P243P1925o0762J7845J2172
$$ 159819 137801 121156 146247 101755 68147 143471 175329 182572 254497 193735 211580 223752
11441B23752k4049P851j6545K6874n4411n3558L263O595P035L6082Q0380R8951
$$ 223752 199703 207554 191009 217883 163472 109914 113177 119772 126807 162889 243269 342220
11429C42220j4046o1016k4092J2281j31233p0473r2233l3686K2362L2916M1161
$$ 342220 328174 267158 243066 255347 124114 53641 -38592 -72278 -49916 -17000 24161
11418B4161N8098j478l0083p9432P36j1528L3869J00839J18869j1460m2561n8868
$$ 24161 82259 80781 50698 -28734 -27998 -39526 -5657 95182 214051 202591 160030 101162
11406A01162j24657K0344j3753L3401J7797L8132j4766M2365R7123m3989r6505
$$ 101162 -23495 -3151 -16904 16497 34294 72426 57660 100025 197148 153159 56654
11395E6654R620j6439o1485l3011R6607J7937K4620J7912j2094n8086J8936M2181
$$ 56654 66274 49835 -11650 -44661 51946 69883 94503 112415 100321 42235 61171 103352
11383A03352j5170J8317L3234P9892j3309j3311j8368o3414n0084m2287p1911
$$ 103352 88182 106499 139733 219625 206316 193005 174637 111223 61139 18852 -53059
11372e3059K6530K5618R076j065K7262j8661j3089K5338l2188j4656R970Q310
$$ -53059 -26529 -911 8165 7100 34362 15701 2612 27950 -4238 -18894 -8924 -614
11360f14L0907p325l3129J4593K8200J5561M89p1734R6024J3255o9047k3785Q309
$$ -614 30293 22968 -10161 4432 32632 48193 48682 -23052 72972 86227 17180 -6605 1704
11347A704q597K0280L4598J0723k108o950L650L3492R5774J2640j8776O5318k0711
$$ 1704 -6893 13387 47985 58708 56600 49650 53300 86792 182566 195206 176430 241748 221037
11334B21037j11269O480K9641m3499l7193l817J11971l3562n6187p8665o3048
$$ 221037 109768 116248 145889 102390 65197 61380 173351 139789 83602 4937 -58111
11323e8111M9022j2096k5839O5454N8581p4955J9959K5638m9015q562M4222L5092
$$ -58111 -9089 -21185 -47024 18430 77011 2056 22015 47653 -1362 -9924 34298 69390
11311F9390L0404J0898N1477M0831m3006k3628Q7971L3672l1770m8668n4324K490
$$ 69390 99794 110692 162169 203000 159994 136366 224337 258009 226239 177571 123247 125737
11299A25737K691K3778m6414n0682j9710N7513k9887j15695l8541L8461k967J27785
$$ 125737 128428 152206 105792 55110 35400 92913 63026 -52669 -91210 -52749 -55716 72069
11287G2069M7420j2671n0751J5672K2576j19743m7036K8518k4859P8302Q006J649
$$ 72069 119489 106818 56067 71739 94315 -25428 -72464 -43946 -68805 9497 17503 19152
11275A9152p2898O9592M8997j11467o925M0668R3394K4877o4064O5716O2832l6052
$$ 19152 -53746 15846 64843 -46624 -53549 -12881 80513 105390 41326 107042 169874 133822
11263A33822o864r083p6536j06498o0794M1762J11186N5135J5246l0124l1792
$$ 133822 126958 117875 41339 -65159 -125953 -84191 26995 82130 97376 67252 35460
11252C5460k36n8101N5293P7337j2088q6806K0569P832m4265o0262J3448r1520
$$ 35460 35224 -22877 32416 109753 97665 10859 31428 39260 -5005 -65267 -51819 -143339
11240a43339k1273Q1254J17165R628m9494r000R3761o2046n9761l3556J9224J8715
$$ -143339 -164612 -83358 33807 43435 -6059 -15059 78702 16656 -43105 -76661 -57437 -38722
11228c8722l0885M0125l8155L8487J0672L4662M1782K1248r6957m36J2466R5335
$$ -38722 -69607 -29482 -67637 -29150 -18478 16184 57966 79214 -17743 -18179 -5713 89622
11216H9622M8633q2419K7944K9020o3407k4922P768k2826m888K8489M5672k9043
$$ 89622 138255 55836 83780 112800 49393 24471 32239 9413 4525 33014 78686 49643
11204D9643Q330J25925k1357K100j143r9407o1920n365Q1874L5221l0586j7576
$$ 49643 57973 183898 162541 164641 163498 64091 2171 -3194 78680 113901 83315 65739
11192F5739j4039k9848J3581P4197m4324j05359k6368M3177L5741j1509j8681
$$ 65739 51700 21852 35433 109630 65306 -40053 -66421 -23244 12497 988 -17693
11181a7693k9603l2658k6468K8915m4315k3367J09458Q6021j3092j47494m2484
$$ -17693 -47296 -79954 -106422 -77507 -121822 -145189 -35731 50290 37198 -110296 -152780
11170a52780O7748J16214O0228O9149p76j35648p8538l0419k8997N235m335M959
$$ -152780 -85032 31182 91410 160559 159783 24135 -54403 -84822 -113819 -108584 -112919 -107960
11158a07960j3787L9545P6873M3752K3570l349j1986J1696M4506N1571l4205L3720
$$ -107960 -121747 -82202 -5329 38423 61993 58644 46658 58354 102860 154431 120226 153946
11146A53946m9960o0199O9063M256p6320o8742K6640l579J5952p648l1059m888
$$ 153946 103986 43787 112850 117106 40786 -27956 -1316 -4895 11057 3409 -27650 -32538
11134c2538p564j7730j2173l4038N0986P9426j2239L3614K5374M1965j17040r1453
$$ -32538 -40102 -57832 -70005 -104043 -53057 26369 14130 47744 73118 115083 -1957 -93410
11122i3410Q2256J16947M7262N4693n2200p6054q0208Q893j1318l4439J8776K7418
$$ -93410 -11154 105793 153055 207748 155548 79494 -714 8179 -3139 -37578 -18802 8616
11110H616K0558o6383r768L8108Q3646M5536o5390k5936J1292p5060Q304l8893
$$ 8616 29174 -37209 -46977 -8869 74777 120313 54923 28987 40279 -34781 -26477 -65370
11098f5370N0917k5874o2219P4845K6264K9614N8023n6341p886j3550l979o9075
$$ -65370 -14453 -40327 -102546 -27701 -1437 28177 86200 29859 21973 8423 4444 -64631
11086f4631K2152n1550L7752o682p5931j8173J17781O9916m6575j0707R577L3677
$$ -64631 -42479 -94029 -56277 -62959 -138890 -157063 -39282 30634 -15941 -26648 -17071 16606
11074A6606J603n692L015j0434r616l2225L1232l6113l2390L1455P3576J2421
$$ 16606 18209 12517 15532 5098 -4518 -36743 -5511 -41624 -74014 -42559 31017 43438
11062D3438j5385j137K1454m6051j73L6682O3810j8956J8652P1705j2007n9897
$$ 43438 28053 26916 48370 2319 2146 38828 102638 83682 102334 174039 162032 102135
11050A02135m0282M7324M1778M1578P1754k1223m9873q3095K5275R8412Q5710
$$ 102135 61853 109177 150955 192533 264287 243064 193191 110096 135371 233783 319493
11039C19493k8814p7088L4012L9243J6983N8979M4517J1293l1709k7432m827N4672
$$ 319493 290679 213591 247603 286846 303829 362808 407325 418618 386909 359477 354650 409322
11027D09322N2211q488P1504J49976J40613M3512l9783p4992j09593L64j33159
$$ 409322 461533 453045 524549 674525 815138 858650 818867 743875 634282 634646 501487
11016E01487j20591R3005O6461L4844n0025Q4512N826n8946l4265l5301r2667
$$ 501487 380896 473901 540362 575206 525181 609693 615519 556573 522308 487007 394340
11005C94340q6665k3105O4810j1135M8776K8066j1903o6571l9937o0432m479m2057
$$ 394340 307675 284570 349380 338245 387021 415087 403184 336613 296676 236244 231765 189708
10993A89708j06915p477O0288j5144n4400r126L4623L6270m3461n4685m2748r69
$$ 189708 82793 75316 135604 120460 66060 56934 91557 127827 84366 29681 -13067 -14036
10981a4036j1547q932n5103K9729M5530O9238L8944k3953m1733P3800p071p1867
$$ -14036 -25583 -34515 -89618 -59889 -14359 54879 93823 69870 28137 101937 94866 22999
10969B2999l8459N1393k4721J975l5243L929J37037Pp6558j9393K7761o4669p7694
$$ 22999 -15460 35933 11212 13187 -22056 -18127 118910 118917 42359 22966 50727 -13942 -91636
10956i1636k0536P0134L0233k7417J933O1144o0247p7383m9186J0130L2361r31
$$ -91636 -112172 -42038 -11805 -39222 -37289 23855 -36392 -113775 -162961 -152831 -120470 -121401
10944a21401L9039O8438l9703J6885J2970J9449k8574o362m8127l0849o3394O2605
$$ -121401 -82362 -13924 -53627 -36742 -23772 -4323 -32897 -39259 -87386 -118235 -181629 -119024
10932a19024J76076K8833q9507p085R0349j1990j03181J304J2462k4659o0148
$$ -119024 57052 85885 -3622 -10707 79642 67652 -35529 -34225 -21763 -46422 -106570
10921a06570k9551M513o4096K8696M7218K5598K9852j0656l275J10976J24395
$$ -106570 -136121 -131608 -195704 -167008 -119790 -94192 -64340 -74996 -78271 32705 157100
10910A57100q0250p0756q0035J3410n3364R3986l0723l5431M0044J6007K8038
$$ 157100 76850 6094 -73941 -60531 -113895 -19909 -50632 -86063 -46019 -30012 -1974
10899a974j7802n081P2775k3979J1042J07398M0138J7818o8494r1822p0487p5860
$$ -1974 -19776 -24857 47918 23939 34981 142379 182517 200335 131841 40019 -30468 -106328
10887a06328o7767J05705j6104J7181M5824l154L3191M0587m0319l2224K0731
$$ -106328 -174095 -68390 -84494 -67313 -21489 -24643 8548 49135 8816 -23408 -2677
10876b677L4818J0733m0252m3680L4762Q5592J3366o5439j4113j6341M8375Q850
$$ -2677 32141 42874 2622 -41058 -6296 79296 92662 27223 13110 -3231 45144 53994
10864E3994l5618l6996o0204N200O4779n0273O6643J19508O5166n882K7425K3237
$$ 53994 18376 -18620 -78824 -73624 -8845 -59118 7525 127033 192199 186317 213742 236979
10852B36979k7876m7092n1485o7893o6162M6918K2488m3533r81k1828L9810J40833
$$ 236979 209103 162011 110526 42633 -23529 23389 45877 2344 1363 -20465 19345 160178
10840A60178K4681n7390K7579J27748J02720j2069k9021P4522P8231K45248K13211
$$ 160178 184859 127469 155048 282796 385516 373447 344426 418948 497179 742427 955638
10829I55638K19651J55561O2303J36474M9204o373n9195j47564j75547j82246
$$ 955638 1175289 1330850 1393153 1529627 1578831 1572458 1513263 1365699 1190152 1007906
10819A007906j21873k6870k2417o4150j57774j35293n7241L3658J0563j36779
$$ 1007906 886033 859163 836746 772596 614822 479529 422288 455946 466509 329730
10809C29730j02931q235M0647J8526k6851n8802n6936j8397m7098j06049l5891
$$ 329730 226799 218564 259211 277737 250886 192084 135148 116751 69653 -36396 -72287
10798g2287L5584N1953m1936L2069k5307N3713N4798p3579j25560j3257M5085
$$ -72287 -36703 15250 -26686 5383 -19924 33789 88587 15008 -110552 -123809 -78724
10787g8724M0553M370n8841K2014L2433J5719Q2963P3568n5716m6676p2291Q867
$$ -78724 -38171 -33801 -92642 -70628 -38195 -22476 60487 134055 78339 31663 -40628 -31761
10775c1761Q1557M3624K5897R373p4202L6419m4215j1211R1379l8020J7796j0580
$$ -31761 49796 93420 119317 128690 54488 90907 46692 35481 126860 88840 106636 96056
10763I6056j4276Q6371k997l6648k8872J8250Q15m2999l8122K0531J4421R8283
$$ 96056 81780 168151 165154 128506 99634 117884 118699 75700 37578 58109 72530 170813
10751A70813j1201m5927j21554l8684N317K2080J4271l1764O224O2840O2277L0071
$$ 170813 159612 113685 -7869 -46553 -41236 -19156 -4885 -36649 -30425 32415 94692 124763
10739A24763j03952o682J00995J7714q7816O59M6169j6394k2642o8904j1731M397
$$ 124763 20811 14129 115124 132838 45022 45681 91850 75456 52814 -16090 -27821 -23424
10727b3424K1159K1711Q8494K3079j4911L5056l1371p8257l2031q7076m9149O4605
$$ -23424 -2265 19446 107940 131019 116108 151164 119793 41536 9505 -77571 -126720 -62115
10715f2115N7619k5157j8557j7003l8303k9870K4047N1785J15922K3779j8384
$$ -62115 -4496 -29653 -48210 -65213 -103516 -133386 -109339 -57554 58368 82147 63763
10704F3763j1048M955J6285J13245l3527j04243o4270n2947K7708J4742J9129
$$ 63763 52715 57670 73955 187200 153673 49430 -14840 -67787 -40079 -25337 -6208
10693f208O5031j9227R831L2044l9900L5043j13261M3878O5634K3995M9255M5953
$$ -6208 58823 39596 49427 81471 41571 76614 -36647 7231 72865 96860 146115 192068
10681A92068K4289n9807J6020Q0514O8195k9438L8872J46026P2684k0744o0181
$$ 192068 216357 156550 172570 253084 321279 291841 330713 476739 549423 528679 468498
10670D68498l432j9919l0054j08664j4908L8240M7092n8413l416K0690o5401k892
$$ 468498 465066 445147 415093 306429 291521 329761 376853 318440 315024 335714 270313 267421
10658B67421J3925k0178O8941R7835O4971P5017L4309R097J9244R0532L1581p5561
$$ 267421 281346 261168 330109 427944 492915 567932 602241 611338 630582 721114 752695 677134
10646F77134j00728m2473k4142K7501M6779J29298J79962M9261P9408J63761O1427
$$ 677134 576406 533933 509791 537292 584071 713369 893331 942592 1022000 1185761 1247188
10635A247188K11003L91365L36038K79423K20940J65881J50523K88070L77356
$$ 1247188 1458191 1849556 2185594 2465017 2685957 2851838 3002361 3290431 3667787
10626C667787N56188O49815Q90073J326987J758112K452375L198818M255720N395106
$$ 3667787 4223975 4873790 5763863 7090850 8848962 11301337 14500155 18755875 24150981
10617B4150981O051313N676261M080045J935207n383j025223q48420K33059K238933
$$ 24150981 30202294 35878555 39958600 41893807 41888424 40863201 40014781 40247840 42486773
10608D2486773M714372P596618J0462612J2163113J0922575O402127N77719m096872
$$ 42486773 47201145 54797763 65260375 77423488 88346063 94748190 95325909 91229037
10600I1229037o170243n295960k558907J001925N004714R460479J3373274J5124420
$$ 91229037 85058794 79762834 77203927 78205852 83210566 92671045 106044319 121168739
10592A21168739J2315143M847952l847013j0359520j2983788j1657599q197928
$$ 121168739 133483882 138331834 134484821 124125301 111141513 99483914 91285986
10585I1285986m272914l17598L321657O302736P405159N109020k05682o017810
$$ 91285986 87013072 86695474 90017131 96319867 103725026 108834046 108628364 102610554
10577A02610554r996682j1050919r853141p409305m727240k397696m69412P63555
$$ 102610554 92613872 81562953 71709812 64300507 59573267 57175571 56706159 57469714
10569E7469714R25104q5671k050594m293292n974889o372144n818806m758919
$$ 57469714 58394818 58309147 56258553 51965261 45990372 39618228 33799422 29040503
10561B9040503l756404l053036k435437k007097j695200j378370j178802j040434
$$ 29040503 25284099 22231063 19795626 17788529 16093329 14714959 13536157 12495723
10553A2495723r66256r40156j025484q72007p76418q06304o24994n89137n12046
$$ 12495723 11529467 10589311 9563827 8691820 7915402 7109098 6484104 5894967 5382921
10544E382921l80959l52724k20660l40065k54921k14818k76956k99459j96648
$$ 5382921 5001962 4649238 4428578 4088513 3833592 3618774 3341818 3042359 2845711
10535B845711j31077r2202r9950o0862j3330j59520j68294n8001j15678j18328
$$ 2845711 2714634 2622432 2522482 2461620 2448290 2288770 2120476 2062475 1946797 1828469
10525A828469p8688M1009m599j9321j0778J5041m7709j49937j05020L484j3876
$$ 1828469 1749781 1790790 1786191 1766870 1756092 1771133 1723424 1573487 1468467 1471951 1458075
10514A458075j6169n6468j2656L42j764k4982k2085O229l2653o6345l8566K9834
$$ 1458075 1441906 1385438 1372782 1373124 1371360 1346378 1324293 1330522 1297869 1231524 1192958 1222792
10502A222792p2843l7475N8683O183j3495N3735j3107L1881Q9169j9371o6316
$$ 1222792 1149949 1112474 1171157 1177340 1163845 1217580 1204473 1236354 1325523 1306152 1239836
10491A239836m4911J18222n2276K5208m5123O3289K2173m1735O37J65779J4961
$$ 1239836 1194925 1313147 1260871 1286079 1240956 1304245 1326418 1284683 1285320 1451099 1466060
10480A466060p7149J3980J00387J81582J13142L1843k8633n686Q4400N9964N7362
$$ 1466060 1388911 1402891 1503278 1684860 1798002 1829845 1801212 1795526 1879926 1939890 1997252
10469A997252Q5929M2169n6826R3399J07029K52171J65370Q2168L2204P9886J64685
$$ 1997252 2083181 2125350 2068524 2161923 2268952 2521123 2686493 2768661 2800865 2880751 3045436
10458C045436J94766J99728K02915J56702J90209K28532M43785M24573L53273
$$ 3045436 3240202 3439930 3642845 3799547 3989756 4218288 4662073 5086646 5439919
10449E439919M83546M99384O41629R03678J009244J154105J303562J368291J517704
$$ 5439919 5923465 6422849 7064478 7968156 8977400 10131505 11435067 12803358 14321062
10440A4321062J705700J767170J970125K117396K455436L149087M210298N446545
$$ 14321062 16026762 17793932 19764057 21881453 24336889 27485976 31696274 37142819
10432C7142819P391474J0320714J4606415K0182856K6614120L2303364L5757442
$$ 37142819 44534293 54855007 69461422 89644278 116258398 148561762 184319204
10425A84319204L6624429L3099084K5908533J7162853O397485m011820j4512798
$$ 184319204 220943633 254042717 279951250 297114103 303511588 299499768 284986970
10418B84986970k3093129k8622066l1714553l0248956k6565564k1736882j6638242
$$ 284986970 261893841 233271775 201557222 171308266 144742702 123005820 106367578
10411A06367578j2413066r573922p618686o294931n524141m929245m628097m416213
$$ 106367578 93954512 84380590 76761904 70466973 64942832 60013587 55385490 50969277
10403E0969277m154734l964173l773619l493861l167389k871790k631828k344190
$$ 50969277 46814543 42850370 39076751 35582890 32415501 29543711 26911883 24567693
10395B4567693k108308j919528j641159j457673j275901j192094j087991q82441
$$ 24567693 22459385 20539857 18898698 17441025 16165124 14973030 13885039 13002598
10387A3002598q02191p39442o48451n26467n04529n00229m11558m03895m46452
$$ 13002598 12200407 11460965 10812514 10286047 9781518 9281289 8869731 8465836 8019384
10378H019384m51779m38641l52101l80861l97930m13888k72068k57789l03581
$$ 8019384 7567605 7128964 6776863 6396002 5998072 5584184 5312116 5054327 4750746
10369D750746l89910l12901k05099j60922k65892j64312j57372k23582j50526
$$ 4750746 4360836 4047935 3842836 3681914 3416022 3251710 3094338 2870756 2720230
10360B720230p3495o4381j10667j24061j01071m0851j7227n6576k7300q3486j43491
$$ 2720230 2646735 2582354 2471687 2347626 2246555 2205704 2188477 2131901 2104601 2021115 1877624
10349A877624j09989l7026p5285L5062q138o4558m4035R368Q3358J1367m8960
$$ 1877624 1767635 1730609 1655324 1690386 1682248 1617690 1573655 1583023 1666381 1677748 1628788
10338A628788k6809p681n6038q4498r4215k2279O679m0147q0338m8584k0237p783
$$ 1628788 1601979 1594298 1538260 1453762 1359547 1337268 1343947 1303800 1223462 1174878 1154641 1146858
10326A146858R358n149l0897m6469k558p1659j17561m1535o0237j2032N2424Q9526
$$ 1146858 1156216 1151067 1120170 1073701 1071143 999484 881923 840388 780151 768119 820543 910069
10314I10069K9633K8767L4284k8300n6466k7013O6672J0535J0198o5521R1026
$$ 910069 939702 968469 1002753 974453 917987 890974 957646 968181 978379 912858 1003884
10303A003884J14132J15670O6496L1924k9590N2292P2347M8623L8309l6325o3416
$$ 1003884 1118016 1233686 1300182 1332106 1302516 1354808 1427155 1475778 1514087 1477762 1414346
10292A414346n3652j21502j17941l3681k434Q235p7157j0475p6844j05442o1610
$$ 1414346 1360694 1239192 1121251 1087570 1085136 1093371 1016214 1005739 928895 823453 761843
10281G61843K5698n2032n5869M8658J41511J1404l2707P5941L2384N2658k4669
$$ 761843 787541 735509 679640 728298 869809 881213 848506 924447 956831 1009489 984820
10270I84820M6223O7368K7258j2163k1025M0621k5144q0605q5454j76955P026
$$ 984820 1031043 1098411 1125669 1113506 1092481 1133102 1107958 1027353 941899 764944 771970
10259G71970M7943J7721q6624o6629n0873q9106o039p1005j02345O7739O8076
$$ 771970 819913 837634 751010 684381 633508 544402 538363 467358 365013 432752 500828
10248E00828j3186J7751k7914j8684j6024j9448k0484k6254K1317m6643k5203
$$ 500828 487642 505393 477479 458795 442771 423323 402839 376585 397902 351259 326056
10237C26056P7672m538l5226R8114N049r1668k2682O7380r374p5193P2424K411
$$ 326056 403728 399190 363964 462078 467127 375459 352777 420157 410783 335590 408014 410425
10225D10425K3113K47l8801K2581k7456k182l489q1120m5468Q8106L6693K998
$$ 410425 433538 433785 394984 417565 390109 387927 384438 303318 257850 345956 382649 385647
10213C85647j5009l7293l8572k903k6464k4126L7819J9727P1625j310r4350L8418
$$ 385647 370638 333345 294773 291870 265406 241280 279099 298826 370451 369141 274791 313209
10201C13209r371k2470l4356m4465N8008L3779j6424n9903P3103Q1877L764L299
$$ 313209 303838 281368 247012 202547 260555 294334 277910 218007 291110 372987 376751 380050
10189C80050L2553L2324K1398p3603q2907O5174J50946l1598n9715M2056P7000
$$ 380050 412603 444927 466325 392722 309815 374989 525935 494337 434622 476678 553678
10178E53678P3041q9728o585p1888P1600J08078r719n6875N5793P9747P4389p1979
$$ 553678 626719 536991 530406 458518 530118 638196 628477 571602 627395 707142 781531 709552
10166G09552J5378j1028N3542l5283p1547K1843K7837M6979J48391J11629P885
$$ 709552 724930 713902 767444 732161 660614 682457 710294 757273 905664 1017293 1025178
10155A025178m1681p423j3502m9269j04470j9764m7681q1070j3726Q1200P6781
$$ 1025178 983497 976074 962572 913303 808833 789069 741388 660318 646592 727792 804573
10144H04573O8627M5736o5559r629q6378o3254l2770o8250j11276j4744L2972
$$ 804573 873200 918936 853377 843748 757370 694116 661346 593096 481820 467076 500048
10133E00048K1304J33113N8038j6072n4249j7844k5745j18746o2348j7771L2685
$$ 500048 521352 654465 712503 696431 642182 624338 598593 479847 417499 399728 432413
10122D32413J07777n7170j34435n1560k2622k2788J3814k5004k1316k0425K811
$$ 432413 540190 483020 348585 297025 274403 251615 265429 240425 219109 198684 201495
10111B01495l9366p6725L99J08483L7520k519M8779N3005j7982q1529N459J5831
$$ 201495 162129 85404 85803 194286 231806 229287 278066 331071 313089 231560 237019 252850
10099B52850K2859Q554l0861l1342k7445n225l1646N9233k3413m2631M2109K3057
$$ 252850 275709 284263 253402 222060 194615 189390 157744 216977 193564 150933 193042 216099
10087B16099l190J9910o0343N844O0687J9267k0729m4433q0417J440J7560k9925
$$ 216099 212909 232819 172476 178320 239007 258274 237545 193112 112695 114135 131695 101770
10075A01770P2594K9147l1047m740l3888l4484l1339M5310N7024r476l3694p1748
$$ 101770 174364 203511 172464 167724 133836 99352 68013 113323 170347 160871 127177 55429
10063E5429n5430Q9498Q5718R9035J2839l1819o8349j40015j29737M7349N5775
$$ 55429 -1 89497 175215 274250 287089 255270 186921 46906 -82831 -35482 20293
10052B0293L6561J4582O7137N1769k0436K7037k7089L5472L221j3837L8476K7022
$$ 20293 56854 71436 138573 190342 169906 196943 169854 205326 208547 194710 233186 260208
10040B60208j5250m200k2714l1331n5904M1843k2947m7842L3247K1760L0405l7400
$$ 260208 244958 240758 218044 186713 130809 172652 149705 101863 135110 156870 187275 149875
10028A49875k1685O1252J0930j6210L7801J03292K7588P9767J35371J84342K25347
$$ 149875 128190 189442 200372 184162 221963 325255 352843 432610 567981 752323 977670
10017I77670K24884J83094M4235Q7196J29856R0494K8065n2449N590j77005k50983
$$ 977670 1202554 1385648 1429883 1517079 1646935 1737429 1765494 1713045 1718635 1541630 1290647
10006A290647j74695j40811j03891p7907j10976J3460n2672l5666p2868L7874
$$ 1290647 1115952 975141 871250 793343 682367 695827 643155 607489 534621 572495
9996E72495R016J1549J1391m7166j77131n0793K2023l1746p6488q4895j8722N3001
$$ 572495 581511 593060 604451 557285 380154 329361 351384 319638 243150 158255 139533 192534
9984A92534L5548k0179k9823j94O4686K0209q3557q5533l9650P5745Q498N2898
$$ 192534 228082 207903 178080 177886 242572 262781 179224 93691 54041 129786 138284 191182
9972A91182n0644o0317n1992J6442O9422N4814o0180L5594R185m5546N8928n1626
$$ 191182 140538 80221 28229 44671 114093 168907 108727 144321 153506 107960 166888 115262
9960A15262l2769K4790M4011o3102p3167J8037M6109o3998M5105L9748n1286l0316
$$ 115262 82493 107283 151294 88192 15025 33062 79171 15173 60278 100026 48740 18424
9948A8424l9054K901L6569J9238J262j0747r869q5954N4229P2411o2510r866L9433
$$ 18424 -20630 -17729 18840 38078 39340 28593 18724 -67230 -13001 59410 -3100 -12966 26467
9935B6467K5972k9727L954K1309J7843N9352J13610Q352q2381m8152J1806l1155
$$ 26467 52439 22712 26666 47975 65818 125170 238780 247132 164751 116599 128405 97250
9923I7250m4797K6371K1190k558M2806N4920n0065m0676q5516n5190J8380N0126
$$ 97250 52453 78824 100014 97456 140262 195182 145117 104441 18925 -36265 -17885 32241
9911C2241L2336j5921K9586J7084M1294j8031M5490l8870m3522j6676o7750m3184
$$ 32241 64577 48656 78242 95326 136620 118589 164079 125209 81687 65011 -2739 -45923
9899d5923Q7859N3671K9252o8027J6347L1927M3073J4676l4905K8319m144j7856
$$ -45923 41936 95607 124859 56832 73179 105106 148179 162855 127950 156269 152125 134269
9887A34269q38K0794P798k0206K9007m91o8528o8691k4307L6196L7100M631k181
$$ 134269 133431 154225 162023 141817 170824 170333 101805 33114 8807 45003 82103 86734 84553
9874H4553J787j2644l4354M4605N1895o8334o2659k7334O2413M0903k4025K1612
$$ 84553 86340 73696 39342 83947 135842 67508 4849 -22485 39928 80831 56806 78418
9862G8418k6693m1454o733J10867M3788j05953L4767J4708l9381j62347M35P2126
$$ 78418 51725 10271 3538 114405 158193 52240 87007 101715 62334 -100013 -99578 -27452
9850b7452N8340R2992k802n0777j01739q2391O853O519R8310M7816O2083m1917
$$ -27452 30888 123880 121078 70301 -31438 -113829 -106976 -100457 -2147 45669 107752 65835
9838F5835J5170P50J9822M7893J085P0033n1177k805p2400o9899O1310p387j5907
$$ 65835 81005 81755 101577 149470 150555 220588 169411 166606 94206 24307 85617 78230 62323
9825F2323P517k7957O5551K8422M697J2822m5590l7989N9939k398m612k6674O860
$$ 62323 69840 41883 107434 135856 140553 153375 107785 69796 129735 127337 122725 96051 102911
9812A02911r359j3842N9268L261J0167n207o8034j0238m0337O081P5968K3628
$$ 102911 93552 79710 138978 142239 152406 147199 79165 68927 28590 34671 110639 134267
9800A34267J5860n470j1383n2486K4683n6411l1993j8738q987J5068N1793L7978
$$ 134267 150127 144657 133274 80788 105471 49060 17067 -1671 -10658 4410 56203 94181
9788I4181j9025J4650k0181l0506M8828J241L7014m2585Q0243K3377j6551j06916
$$ 94181 75156 89806 69625 39119 87947 89188 126202 83617 163860 187237 170686 63770
9776F3770n0864N0724k882J0898m5657K9915q265k7249J6679j4031l3473l8338
$$ 63770 12906 63630 60748 71646 25989 55904 47639 20390 37069 23038 -10435 -48773
9764d8773K0119O123N524k0683O8180L0141M2944r351k0260l464K2452P0055o746
$$ -48773 -28654 -22531 -17007 -37690 30490 60631 103575 94224 73964 70500 92952 163007 156261
9751A56261q3215M2950L8879q5576j5515L0619p361N0020J17411r7376n1156p883
$$ 156261 73046 115996 154875 69299 53784 84403 77042 127062 244473 147097 95941 88058
9739H8058q7835j2305k9704R741L5802k2628O079M819j0641O380Q6413J9345j2600
$$ 88058 223 -12082 -41786 -32045 3757 -18871 -12792 -7973 -18614 -12234 74179 93524 80924
9726H0924J1646n634O9693L6956l0706j35116J6188M5504J8380M4710J1088o5867
$$ 80924 92570 86936 156629 193585 162879 27763 43951 89455 107835 152545 163633 97766
9714I7766r3621J7451P1670J8230M4228o700L240K4322n2934m9740n6779P5276
$$ 97766 4145 21596 93266 111496 155724 149024 152264 176586 123652 73912 17133 92409
9702I2409N8387n170n3011n5899o0334n0343M1071K9861P0015J3561L4477L6981
$$ 92409 150796 145626 92615 36716 -23618 -73961 -32890 -3029 66986 80547 115024 152005
9690A52005r3880l2996L1868o380m2931K4527Q0598o3713j20567J4307K0597J108
$$ 152005 58125 25129 56997 50617 7686 32213 112811 49098 -71469 -57162 -36565 -35457
9678c5457Q5395J1705o092O9676j867o6069l4491o9038m7350k4184k1034R9010
$$ -35457 49938 61643 55551 125227 123360 57291 22800 -46238 -93588 -117772 -138806 -39796
9666c9796J50328k960q1661p8222j6540m0941K8014J11362J68548M3839l6629
$$ -39796 110532 107572 25911 -52311 -68851 -109792 -81778 29584 198132 241971 205342
9655B05342J2994J12976J43017J96001L6994m1529o3397j17364j12710j35163
$$ 205342 218336 331312 474329 670330 707324 665795 602398 485034 372324 237161
9645B37161j1296J6921p1714l5008q6423m3472K0655k3893N2534J23714J1573
$$ 237161 225865 242786 171072 136064 49641 6169 26824 2931 55465 179179 190752
9634A90752o1473L1221K585o0705K0667k4887k6055K599j1706M7864K0935n1267
$$ 190752 129279 160500 163085 102380 123047 98160 72105 74704 62998 110862 131797 80530
9622H0530Q358Q9127k6388M5317O3915m3860k6117j9655m8004n6938n7770O1339
$$ 80530 88888 178015 151627 196944 260859 216999 190882 171227 123223 66285 8515 69854
9610F9854j9159m6638L8946N9058K7579k5052j10213m5211L2320m7239O9225P8411
$$ 69854 50695 4057 43003 102061 129640 104588 -5625 -50836 -18516 -65755 3470 81881
9598H1881m6376q3485k3897l5236J04815N2961k9218m7182L7625k1894o08P9909
$$ 81881 35505 -47980 -71877 -107113 -2298 50663 21445 -25737 11888 -10006 -10614 69295
9586F9295j3572r0939j05398o7384j0265O7139Q2551R7845L2993P225n6242n958
$$ 69295 55723 -35216 -140614 -207998 -218263 -151124 -68573 29272 62265 69490 13248 7290
9574G290l9535L4620P3248l1804o1560O3070P4985j10548m6098L02j0491m7312
$$ 7290 -32245 2375 75623 43819 -17741 45329 120314 9766 -36332 -36030 -46521 -93833
9562i3833l635K5869J04699L8055L2673L2163j17113m4588R6533R615j8477m0112
$$ -93833 -97468 -71599 33100 71155 103828 135991 18878 -25710 70823 80438 61961 21849
9550B1849m4275K3776K8131q55j7664m7926k9452K5338l3442m5172R5316m2914
$$ 21849 -22426 1350 29481 28626 10962 -36964 -66416 -41078 -74520 -119692 -24376 -67290
9538f7290j4346J3711J1734M332m325N4835N6915M6367O9374o392o1139m9782
$$ -67290 -81636 -67925 -56191 -51859 -56184 -1349 55566 101933 171307 164915 103776 53994
9526E3994o352m1169p2745K3597K6467P7615O4228k7539L118j2246m1401q6071
$$ 53994 47642 6473 -66272 -42675 -16208 61407 125635 98096 101214 88968 47567 -38504
9514c8504k702L8649M1480j0375o884O99k3623r099M5591j5610n1578j6765l4597
$$ -38504 -41206 -2557 38923 28548 21664 22363 -1260 -10359 35232 19622 -31956 -48721 -83318
9501h3318l6594j7234N3618J12223M858o5100l493K6639J4125O8751M7593K3087
$$ -83318 -119912 -137146 -83528 28695 33553 -31547 -35040 -8401 5724 74475 122068 145155
9489A45155k7913q5941j52355l1682M4041P2622M1861J9642n8525j301m80M0224
$$ 145155 117242 31301 -121054 -152736 -108695 -36073 5788 25430 -33095 -34396 -34876 5348
9477E348N2112P060m6381M5680k1195r2267k8398J4716M1652K694M1790M9899
$$ 5348 57460 64520 18139 63819 42624 -49643 -78041 -63325 -21673 -18979 22811 72710
9465G2710k6234J3720k3600L688n9147J5222N8427N8276k2107l7258Q382M155
$$ 72710 46476 60196 36596 40284 -18863 -3641 54786 113062 90955 53697 62079 66234
9453F6234L5388K2340k9471l1166l2783L0010K5786k7745k0956k262p7585L5279
$$ 66234 101622 123962 94491 63325 30542 60552 86338 58593 37637 35375 -42210 -6931
9441f931N5919J2732p6195r9647p916J5911L9529Q6231j5080J1658J7236J4141
$$ -6931 48988 61720 -14475 -114122 -122038 -106127 -66598 19633 4553 16211 33447 47588
9429D7588m428m0089q848p2797L3468o879L0771K9337k177L8289Q5928J16680
$$ 47588 43160 3071 -5777 -78574 -45106 -51985 -21214 8123 5946 44235 130163 246843
9417B46843P970p3446j21596q5619n2450M4467N8098k4592p2514p2740M2622J37252
$$ 246843 254813 181367 59771 -25848 -78298 -33831 24267 -325 -72839 -145579 -102957 34295
9405C4295J07313p8506k7341L7712n1351j0785O869n8311j9965M1858j03666N8907
$$ 34295 141608 63102 35761 73473 22122 11337 18206 -40105 -60070 -18212 -121878 -62971
9393f2971J25253N611j07921q5539J5484Q4543Q4117k7662M400M4961l1380j7128
$$ -62971 62282 67893 -40028 -125567 -110083 -25540 58577 30915 35315 80276 48896 31768
9381C1768M5174O3723Q368p837p1425o5159k0181l6579K8033L9299O1150l2103
$$ 31768 76942 140665 149033 141196 69771 4612 -15569 -52148 -24115 15184 76334 44231
9369D4231m2150k2127J9876J04405J1288L389J3938k6108o2796k4664J103n6594
$$ 44231 2081 -20046 -170 104235 115523 118912 132850 106742 43946 19282 20385 -36209
9357c6209K475P9432Q986L501P774N4288K4725m9469J8319L1418K171q305p5850
$$ -36209 -33734 45698 54684 58185 65959 120247 144972 95503 113822 145240 147411 139106 63256
9344F3256j7310k8549l8977k3280M7246M9553m7332m8545J0342J5192J1381J3404
$$ 63256 45946 17397 -21580 -44860 2386 51939 4607 -43938 -33596 -18404 -7023 6381
9332F381l2069l0662R3662K4258j9429l939K1888k8392O7197j3388o6771m0150
$$ 6381 -25688 -56350 37312 61570 42141 38202 60090 31698 98895 85507 18736 -21414
9320b1414R5644J43140n7971j33082r0068L0260J02856j04021k9155L6905J42621
$$ -21414 74230 217370 159399 26317 -63751 -33491 69365 -34656 -63811 -26906 115715
9309A15715K2507J0631N758o2373q924N8401L4779N199r0213q5136r0571o2534
$$ 115715 138222 148853 154611 92238 83314 141715 176494 181693 91480 6344 -84227 -146761
9297a46761R316J06608R9162o70o8505m3469R9585L9359J9350r617r4306l8257
$$ -146761 -137445 -30837 68325 67655 -850 -44319 55266 94625 113975 104358 10052 -28205
9285b8205O1098M303P774J2829K6982J6365m1925n3759K4564L2324O1816O4949
$$ -28205 32893 37196 44970 57799 84781 101146 59221 5462 30026 62350 124166 189115
9273A89115m8194r2058o8589K2163n7881j2019n249m245Q4341P6482n933o891
$$ 189115 140921 48863 -19726 2437 -55444 -67463 -72712 -76957 7384 83866 77933 71042
9261G1042q8130O598J8441J8125K8504O1476r015L5413J6951n1670K7936j27901
$$ 71042 -17088 -10490 7951 26076 54580 116056 107041 142454 159405 107735 135671 7770
9249G770p6970L7887J080J3206j6475N927J05212Q8144K9094m3682o9681k5070
$$ 7770 -69200 -31313 -30233 -17027 -33502 -27575 77637 165781 194875 151193 81512 56442
9237E6442k1549l0349Q9901M5794n846j00353j4380R704j9508j0476J3724m2485
$$ 56442 34893 4544 94445 140239 134393 34040 19660 29364 9856 -620 13104 -29381
9225b9381o8808K700r101o358k4453M3427N7844k6147R099p672P943K288M4188
$$ -29381 -98189 -95489 -104590 -110948 -135401 -91974 -34130 -60277 -51178 -58850 -50907 -48619 -4431
9212d431R4882m039j3743m5678k922n6618Q676n1290K1922K3367K6902K5844r907
$$ -4431 90451 86412 72669 26991 24069 -32549 -23873 -75163 -53241 -29874 -2972 22872 12965
9199A2965l4444m5238m8924K3277K1165k4527l2616k9591l3358k0531Q1298K1991
$$ 12965 -21479 -66717 -115641 -92364 -71199 -95726 -128342 -157933 -191291 -211822 -130524 -108533
9187a08533K7041K5157M5776k6140J4081L0108L630Q799N0959J03061l018q6467
$$ -108533 -81492 -56335 -10559 -36699 -22618 7490 11120 19919 70878 173939 170921 84454
9175H4454j19248j0639Q3858M8266o2609n6484m272k1904Q7222O8879K5905O4411
$$ 84454 -34794 -45433 38425 86691 24082 -32402 -36674 -58578 28644 97523 123428 187839
9163A87839j9768N486o1353j41743m6560n731R6333L7514L3222l0217j46055j3432
$$ 187839 168071 173557 112204 -29539 -76099 -81830 14503 52017 85239 55022 -91033 -104465
9151a04465J9992k7513K5529Q7723L6482J9759P9644M6702l7135j4736J4543n8008
$$ -104465 -84473 -111986 -86457 1266 37748 57507 137151 183853 146718 131982 146525 88517
9139H8517o9677m6376O3077r5142J462Q0970K0332Q28l2791R855m0355l5025m1004
$$ 88517 18840 -27536 35541 -59601 -58139 22831 43163 43991 11200 21055 -19300 -54325 -95329
9126i5329R769N4147r844J4165K4794O6569r907j24684o6221J67103N3751p6136
$$ -95329 -85560 -31413 -41257 -27092 -2298 64271 54364 -70320 -136541 30562 84313 8177
9114H177m5776K2300Q549J6111J8146q674j9534R540l2434q0772Q8138Q0954Q5645
$$ 8177 -37599 -15299 -6750 9361 27507 18833 -701 8839 -23595 -104367 -16229 64725 150370
9101A50370l5355r0344o9412K8960m366K30L1554p1385n8035L2222L4757k6329
$$ 150370 115015 24671 -44741 -15781 -20147 -19917 11637 -59748 -117783 -85561 -50804 -77133
9089g7133k8206O3258L2772k1925K7107q179n2121r571J7389R2021k854n0923
$$ -77133 -105339 -42081 -9309 -31234 -4127 -12306 -64427 -73998 -56609 35412 32558 -18365
9077a8365n8527L6692K8234M9758n2313Q8773R196r9548j7039J25040L7616n473
$$ -18365 -76892 -40200 -11966 37792 -14521 74252 83448 -16100 -33139 91901 129517 124044
9065A24044J6004q3159o0773N0969k0018k935j1932L2656J2325k3196M7279K8444
$$ 124044 140048 56889 -3884 47085 27067 24132 12200 44856 57181 33985 81264 109708
9053A09708m6834O8853j1040j13642j3230J3890m2837M016L0699N2082Q8534M3260
$$ 109708 62874 131727 120687 7045 -6185 7705 -35132 -31116 -417 51665 140199 183459
9041A83459l2249q9057o964P197R099k8133o9957l8314M3570L4787N5340K5328
$$ 183459 151210 62153 55189 62386 71485 43352 -26605 -64919 -21349 13438 68778 94106
9029I4106K0151k5241r0449q6939J613M056L1126k4434n8497O7606L0543K7640
$$ 94106 114257 89016 -1433 -88372 -86759 -82703 -51577 -76011 -134508 -66902 -36359 -8719
9017h719m7064q5983K2226P3691N4160L0255j6065o1729q155K2772N2582M9380
$$ -8719 -55783 -141766 -119540 -45849 8311 38566 22501 -39228 -47383 -24611 27971 77351
9005G7351P5901m2406j68846P600P0912P8422j21141r4556O0172P9366K6222r7658
$$ 77351 153252 110846 -58000 -50400 20512 98934 -22207 -116763 -56591 22775 48997 -48661
8993d8661r0762o7423N7283N6931O1428K7165r6449P345J0705O7646J5683n127
$$ -48661 -139423 -206846 -149563 -92632 -31204 -4039 -100488 -93143 -82438 -14792 891 -4236
8981d236J4954J0432j4796j6130M605k8311L8985K9228L3208M6306r516j20261
$$ -4236 10718 21150 6354 -9776 -5171 -33482 5503 34731 67939 114245 104729 -15532
8969a5532j76513p2412P3718N2317k9982N1524J4347p7423J15586P221M3223o4076
$$ -15532 -192045 -264457 -190739 -138422 -168404 -116880 -102533 -179956 -64370 -57149 -13926 -78002
8957g8002p2483J03974K1720k0352R3309k437l9781j5192P049p4880P7761M8096
$$ -78002 -150485 -46511 -24791 -45143 48166 45729 5948 -9244 -2195 -77075 686 48782
8945D8782o0406K9713l3642j338L5192J4609r311J261Q4906J593P741n1774r7208
$$ 48782 -11624 18089 -15553 -16891 18301 32910 23599 24860 109766 111359 119100 67326 -29882
8932b9882p3299P4984P3125R5954K9221j73100j93309P6055Q0375P2764l8850
$$ -29882 -103181 -28197 44928 140882 170103 -2997 -196306 -120251 -39876 32888 -5962
8921e962p854j01905p9909O1302J34006M405m6710n6197P3101L3589J6579M9065
$$ -5962 -13816 -115721 -195630 -134328 -322 4083 -42627 -98824 -25723 7866 24445 73510
8909G3510Q2498n3430J3090J5161o8758k466j8915M3532R424M4291N222p778m693
$$ 73510 156008 102578 115668 130829 62071 59605 40690 84222 93646 137937 143159 135381 130688
8896A30688q9096p0892O8276l2351k8958p9116q50J09483P8029o2800q684M1327
$$ 130688 41592 -29300 38976 6625 -22333 -101449 -102299 7184 85213 22413 13729 55056
8884E5056j576P4k0809q8740J6303J37032P3269p8848l0150j982j6307k4675J733
$$ 55056 53480 53554 32745 -55995 -39692 97340 170609 91761 61611 59629 43322 18647 20380
8871B0380N8881J2787k0576m7073l23o964k4931O7275O5120K929n6897o7118k9146
$$ 20380 79261 92048 71472 24399 24076 17112 -7819 59456 124576 127505 70608 3490 -25656
8858b5656K2049R7303p0348o4816r251M1344l1946q0563M322J169J0153J0359
$$ -25656 -3607 93696 23348 -41468 -50719 -9375 -41321 -121884 -117562 -116393 -106240 -95881
8846i5881M2812J08723L7418n8924J6188k980o2636L6483L1849n1452o5159J3017
$$ -95881 -53069 55654 93072 34148 50336 47356 -15280 21203 53052 1600 -63559 -50542
8834e0542k7414O1714o9608L700j6380K4332M3106k1757j0701N0862K3059Q012
$$ -50542 -77956 -16242 -85850 -82150 -98530 -74198 -31092 -52849 -63550 -12688 10371 18383
8822A8383J0946l3197K213j4234r988j7311r143J2500N7240m029k972l1059O4696
$$ 18383 29329 -3868 -1655 -15889 -25877 -43188 -52331 -39831 17409 13380 10408 -20651 44045
8809D4045Q0474p7387j5555Q5863j4251j2102l0333j4479K5886p250m6159m6119
$$ 44045 124519 47132 31577 117440 103189 91087 60754 46275 72161 64911 18752 -27367
8797b7367l4394n106O3342R694N3583O2475k3022m9391M3605J2764M7917m5435
$$ -27367 -61761 -66867 -3525 6169 59752 122227 99205 49814 93419 106183 154100 108665
8785A08665r3909j07038j5105M5638P5846l1302L746K6999M6659p6757l3396O6500
$$ 108665 14756 -92282 -107387 -61749 14097 -17205 -13459 13540 60199 -16558 -49954 16546
8773A6546J07886n7497j17236K4934P3979N6309M853q9969j3936K8926m6666K3088
$$ 16546 124432 66935 -50301 -25367 48612 104921 109774 19805 5869 34795 -11871 11217
8761A1217N7831K2539M5427m4506q0609k3541K9848L4339k4132n3709L8505P7749
$$ 11217 69048 91587 137014 92508 11899 -11642 18206 52545 28413 -25296 13209 90958
8749I0958p2928n4521o2698m7749L4417Q4725k4710K2008N980l4787k2032Q0505
$$ 90958 18030 -36491 -99189 -146938 -112521 -27796 -52506 -30498 -24518 -59305 -81337 -832
8737h32q002J5859J9457k6713k4383k53N5630p3257J28P5397j03914m5316J06346
$$ -832 -8834 7025 26482 -231 -24614 -24867 30763 -42494 -42366 33031 -70883 -116199 -9853
8724i853k139O646O185L3933k896J5327J3165k0721J8988M582M5304o6700n4590
$$ -9853 -11992 -5346 839 34772 31876 47203 60368 39647 58635 63217 108521 41821 -12769
8711a2769J3016J3278L4289K2444k2873k9215p846j7528J854J3448O3106M5530
$$ -12769 247 13525 47814 70258 47385 18170 10324 -7204 -5350 8098 71204 116734
8699A16734o9169p1557O850m1333l616j3579K6089k3160N874O6366j1020M1077
$$ 116734 47565 -23992 -17142 -58475 -62091 -75670 -49581 -72741 -66867 -501 -11521 29556
8687B9556N3432o1350o9077N9464P901l7999K9634M1053K4191k7594O0156Q800
$$ 29556 82988 21638 -47439 12025 19926 -18073 11561 52614 76805 49211 109367 118167
8675A18167j5832J1589j3945j07105l091n5990O976j4149j560Q8776J3244L4365
$$ 118167 102335 113924 99979 -7126 -10217 -66207 -59231 -73380 -74940 13836 27080 61445
8663F1445l9747l8330L1922N8428n4944j15259n1167R5664L0276q3817L6671Q5810
$$ 61445 21698 -16632 15290 73718 18774 -96485 -147652 -51988 -21712 -105529 -68858 16952
8651A6952l0269j4647n4303m940n5348K9545N4636j5406P362k123K6302R3697
$$ 16952 -13317 -27964 -82267 -87207 -142555 -113010 -58374 -73780 -66418 -68541 -42239 51458
8639E1458R3020N1545p4592q3208n559k0896l4987K8764L9578N206m1769p1263
$$ 51458 144478 196023 121431 38223 32664 11768 -23219 5545 45123 50329 8560 -62703
8627f2703n3747J24884P6086J7945l7935J7322k179m4683O9548K4288l3001P90
$$ -62703 -116450 8434 84520 102465 64530 81852 79673 34990 104538 128826 95825 96615
8615I6615J1865k7358j25808o7219j2727J5240N0866M4160J6962n9114n4179j0251
$$ 96615 108480 81122 -44686 -111905 -124632 -109392 -58526 -14366 2596 -56518 -110697 -120948
8603a20948J131K7103n4227J2710R880J06196l9513k6465R300K6386PK454J46379
$$ -120948 -119817 -92714 -146941 -134231 -124351 -18155 -57668 -84133 -74833 -48447 -48440 -45986 100393
8590A00393N0606m2059j02380j4608J24979J10916N2736p6753q9311q9124J7782
$$ 100393 150999 108940 6560 -8048 116931 227847 280583 203830 114519 25395 43177
8579D3177M2225J335j0659n9573n7993j9492k3563J6012P5545n7754n2816O3030
$$ 43177 85402 86737 76078 16505 -41488 -60980 -84543 -68531 7014 -50740 -103556 -40526
8567d0526P6345L202j09248l9895P499L5341j2600k2880P900J02753j6271k2159
$$ -40526 35819 39021 -70227 -110122 -102623 -67282 -79882 -102762 -94862 7891 -8380 -30539
8555c0539k259o6032o2057n2656Q73M3140J33683p6762L7124N1661K4988N2998
$$ -30539 -32798 -98830 -160887 -213543 -212670 -169530 -35847 -112609 -75485 -23824 1164 54162
8543E4162R7965R0223Q999l2829n3140k648j35340o4646l0385J7174J4922l0798
$$ 54162 152127 242350 251349 218520 165380 162732 27392 -37254 -67639 -50465 -35543 -66341
8531f6341j01143O3655o526l6868N3819O0305K3614O6311m9130K8894j3828m8038
$$ -66341 -167484 -103829 -110355 -147223 -93404 -33099 -9485 56826 7696 36590 22762 -25276
8519b5276K8953n7920q3443R3852N4829n1916n193o0441j767M0248l0260j2906
$$ -25276 3677 -54243 -137686 -43834 10995 -40921 -46114 -106555 -108322 -68074 -98334 -111240
8507a11240K545K9566M4222j369p8092M7642k7998m7188R6913O5034q7687l436
$$ -111240 -108695 -79129 -34907 -36276 -114368 -66726 -94724 -141912 -44999 20035 -67652 -71088
8495g1088J6635M9745r919n8747P0575M4061o1157l2953N74r279j9356L8718M3672
$$ -71088 -54453 -4708 -14627 -73374 -2799 41262 -19895 -52848 -52274 -61553 -80909 -42191 1481
8482A481J13264J8181Q952r0022k2304m783M916j5353l3452r1262o4476n5313
$$ 1481 114745 132926 141878 51856 29552 24769 29685 14332 -19120 -110382 -174858 -230171
8470b30171J28190N3632k9714m456J35399J9630k5337K8248m4783j3195K211l6232
$$ -230171 -101981 -48349 -78063 -82519 52880 72510 47173 75421 30638 17443 19654 -16578
8458a6578N3516j2872m7386O3549K5l270L7550O671N4720J4359L9256K644j8326
$$ -16578 36938 24066 -23320 40229 40254 36984 74534 81205 135925 150284 189540 192184 173858
8445A73858j4035o2032k5329j3136o7453p2592K2240J7222N2973p894J01496Q6097
$$ 173858 159823 97791 72462 59326 -8127 -80719 -58479 -41257 11716 3822 105318 191415
8433A91415p0396j32850q5978R1245J30259J0711m2528k809j2373L317L5366J411
$$ 191415 121019 -11831 -97809 -6564 123695 134406 91878 89069 76696 80013 115379 116790
8421A16790m032p9246M632o0245J5996M4290k4292K148K9607O9659o341p0162
$$ 116790 112758 33512 38144 -22101 -6105 38185 13893 16041 45648 115307 108966 38804
8409C8804O3633j1054r5497k5344l266o6601r0257O146J7408Q435Q7992O4636
$$ 38804 102437 91383 -4114 -29458 -32724 -99325 -189582 -183436 -166028 -157593 -69601 -4965
8397d965L71q00N4183N3737M4465l8500j42313j22683M3264P2782P5981l1478
$$ -4965 -4594 -5394 48789 102526 146991 108491 -33822 -156505 -113241 -40459 35522 4044
8385D044n4284K7963J01657k2004q0901m6666N0348L8116N2115l9534n9148l0548
$$ 4044 -50240 -22277 79380 57376 -23525 -70191 -19843 18273 70388 30854 -28294 -58842
8373e8842j2220L0889J7962j3689M5863N6800j27209J3121K5291k9285K7628n9052
$$ -58842 -71062 -40173 -22211 -35900 9963 66763 -60446 -47325 -22034 -51319 -23691 -82743
8361h2743j447P1537p051p2641L5165P1454J9057j03479j3230N1304J3697j5785
$$ -82743 -84190 -12653 -19704 -92345 -57180 14274 33331 -70148 -83378 -32074 -18377 -34162
8349c4162P3552j6143K9915j7298k8061m5114o2821N318J8934K4678L8632P1583
$$ -34162 39390 23247 53162 35864 7803 -37311 -100132 -94814 -75880 -51202 -12570 59013
8337E9013l8127k2761j3411m7515k1910K7191j6155P2525o9416q5406N7584J06318
$$ 59013 20886 -1875 -15286 -62801 -84711 -57520 -73675 -1150 -70566 -155972 -98388 7930
8325G930O8233J265q2910k5938K5758n3896M6127n7184L1494N008J2795m9080
$$ 7930 76163 77428 -5482 -31420 -5662 -59558 -13431 -70615 -39121 -34113 -21318 -70398
8313g0398j697M0946P0151q757k0500J7504L459j1817m7503r1974K1512R7491
$$ -70398 -72095 -31149 39002 30245 9745 27249 30708 18891 -28612 -120586 -99074 -1583
8301a583P8260p9638M544R033l4949N2722m0736L4141K7021p943m4030m7861o4972
$$ -1583 76677 -2961 1583 10616 -24333 28389 -12347 21794 48815 40872 -3158 -51019 -115991
8288a15991Q2465o629P002P9578K9420N3658P0115p1596l2818j4555k6750l9965
$$ -115991 -33526 -40155 -33153 46425 75845 129503 199618 128022 95204 80649 53899 13934
8276A3934R809l1329m4119M0560R0236N0151N372q1109m0364j21957j33254O4697
$$ 13934 23743 -7586 -51705 -11145 79091 129242 134614 53505 13141 -108816 -242070 -177373
8264a77373J60490J12480K3702q784n3696j3464O1956P0475p2359n3189n9951
$$ -177373 -16883 95597 119299 110515 56819 43355 105311 175786 103427 50238 -9713
8253i713q1706l4795N0269L8165k0742L7839J08555l2943q7940K6732N6120K6527
$$ -9713 -91419 -126214 -75945 -37780 -58522 -20683 87872 54929 -33011 -6279 49841 76368
8241G6368k4494L216j6248k0253j6216L9737L3201J6245q264p2589j904J4152
$$ 76368 51874 55090 38842 18589 2373 42110 75311 91556 83292 10703 8799 22951
8229B2951n6298R351J0127J1838M5209k392m3085j3634K4476K695p9717q463l5459
$$ 22951 -33347 -23996 -13869 -2031 43178 40786 -2299 -15933 8543 11238 -68479 -76942 -112401
8216a12401J23N8933M6483m7432m6139Q511K6670j7866J8009R171L8200o5814
$$ -112401 -112278 -53345 -6862 -54294 -100433 -91922 -65252 -83118 -65109 -55938 -17738 -83552
8204h3552m9422J8810Q1083K2365K7141j00287O5285P5153j5967l8891k3434n4861
$$ -83552 -132974 -114164 -33081 -10716 16425 -83862 -18577 56576 40609 1718 -21716 -76577
8192g6577R0665j3805K6115N4169K025j8065p7897o0138p724l8121o9451m1359
$$ -76577 14088 283 26398 80567 82592 64527 -13370 -73508 -81232 -119353 -188804 -230163
8180b30163L674J13188J01288J2424L626o036n0383o8678p4168p353L3618k362
$$ -230163 -226489 -113301 -12013 411 4037 -1999 -52382 -121060 -195228 -202581 -168963 -171325
8168a71325N2390M4303L8901J10138J3574l3962k7368m2108j9386J8222M1364
$$ -171325 -118935 -74632 -35731 74407 87981 54019 26651 -15457 -34843 -16621 24743
8157B4743k6723R672Q8327k0156j2651j2767q6145m1431J847n887j47O7625l8754
$$ 24743 -1980 7692 96019 75863 63212 50445 -35700 -77131 -75284 -81171 -81318 -13693 -52447
8144e2447L9477k9910l1162J06937j4407J1847m2789N37M139j44220m6963J22335
$$ -52447 -12970 -42880 -74042 32895 18488 30335 -12454 -11917 -7778 -151998 -198961 -76626
8132g6626K9174k6245J469J04259m5261p1174L8300n7855J0335Q0127R60P1362
$$ -76626 -47452 -73697 -72228 32031 -13230 -84404 -46104 -103959 -93624 -13497 -12537 58825
8120E8825L2312J5147J1339j5838J5010m9801O5884R369k4325j8710o5324k4853
$$ 58825 91137 106284 117623 101785 116795 66994 132878 142247 117922 99212 33888 9035
8108I035L5132K2883l4936m1043j5588l3664K9810M337J9024n2169m5785N897
$$ 9035 44167 67050 32114 -8929 -24517 -58181 -28371 -24034 -5010 -57179 -102964 -97067
8096i7067L2858j655N3243L9047o313m5956K600O750j8803o3778l1696M9830N8122
$$ -97067 -64209 -65864 -12621 26426 20113 -25843 -23243 -16493 -35296 -99074 -130770 -80940 -22818
8083b2818K2539o0572n5376J830j2558L5478M0331Q9150n5328r9787N1395M5490
$$ -22818 -279 -60851 -116227 -114397 -126955 -91477 -51146 38004 -17324 -117111 -65716 -20226
8071b0226k4754J3485Q660Q4396o908m6462L4814K9429p2281J27482K672q6692
$$ -20226 -44980 -31495 -22835 61561 54653 8191 43005 72434 153 127635 130307 43615
8059D3615q535r1743j1044K8021N3241L39q3975m2352L7477P5560N1099n3271
$$ 43615 35080 -56663 -67707 -39686 13555 13894 -70081 -112433 -74956 604 51703 -1568
8047a568l3253k0807r49J7266P5488J2250k0582l74k1283l9810j2316k5872n6378
$$ -1568 -34821 -55628 -56577 -39311 36177 48427 27845 27471 6188 -33622 -45938 -71810 -128188
8034a28188l2779j4944N6047Q4248O8189K6414j5015m2194j5212j3317K9478M3053
$$ -128188 -160967 -175911 -119864 -35616 32573 58987 43972 1778 -13434 -26751 2727 45780
8022D5780R704J9227j7049q7218M5215K430j3189J6872j7438j5631M5626O7862
$$ 45780 55484 74711 57662 -29556 15659 18089 4900 21772 4334 -11297 34329 102191
8010A02191O602n3093M2966k4778q3848M984j1770n0240O1659k1653l5799O3810
$$ 102191 108793 55700 98666 73888 -9960 -4976 -16746 -66986 -5327 -26980 -62779 1031
7998A031M984m7409k9725Q210N060Q9622J04860m3804k8968q6380j00900J57222
$$ 1031 6015 -41394 -71119 -62909 -57849 31773 136633 92829 63861 -22519 -123419 33803
7986C3803J3068m8011p3770m2560L9750K6142O0151P112q8378k0173NQ1640j8767
$$ 33803 46871 -1140 -74910 -117470 -77720 -51578 8573 15685 -72693 -92866 -92861 -11221 -29988
7973b9988j01510N5670O984J4891J12052j1560m6684k2056l1024K5555J03286
$$ -29988 -131498 -75828 -68844 -53953 58099 46539 -145 -22201 -53225 -27670 75616
7962G5616M0645j23849n6566l2463K2508L9867M9099J7777L2465j13447o5326
$$ 75616 116261 -7588 -64154 -96617 -74109 -34242 14857 32634 65099 -48348 -113674
7951a13674j6541M1221P2902P3544L8144J9959L4022j4367K1007n5527l0707k2143
$$ -113674 -130215 -88994 -16092 57452 95596 115555 149577 135210 156217 100690 69983 47840
7939D7840j0696m0063j1738k1739J2934J9394N0471k8301q0956m8117m0860j6517
$$ 47840 37144 -2919 -14657 -36396 -23462 -4068 46403 18102 -62854 -110971 -151831 -168348
7927a68348j0910N0270P1370O729M1407q104P2822o1067p5962m1409l91K1569
$$ -168348 -179258 -128988 -57618 -50889 -9482 -17586 55236 -5831 -81793 -123202 -123593 -102024
7915a02024P3629n9224m7478j690p561M7885K007j4307p196q16M5916J40385J5188
$$ -102024 -28395 -87619 -135097 -136787 -144348 -96463 -94456 -108763 -115959 -116775 -70859 69526 84714
7902H4714M2501k484o9497l3718l8167m3522M2745O3243p7k0834J9216q332n7240
$$ 84714 127215 124731 55234 21516 -16651 -60173 -17428 45815 45738 24904 44120 35788 -21452
7889b1452l3536K8381o4915K2676P0626m9254q2406l9742Q3374J1620M5809K6614
$$ -21452 -54988 -26607 -91522 -68846 1780 -47474 -129880 -169622 -86248 -74628 -28819 -2205
7877b205m3915j03950L8034K8251M6360J6833o6607o4427j8175P3982N1175J17779
$$ -2205 -46120 -150070 -112036 -83785 -37425 -20592 -87199 -151626 -169801 -95819 -44644 73135
7865G3135J08900o547r2740M4531J3914q6200r1042k2995L9250R078O4596j6360
$$ 73135 182035 175488 82748 127279 141193 54993 -36049 -59044 -19794 -10716 53880 37520
7853C7520j03467m7528q769M6427N1681M7328K943l9103l9938l0087J2056K429
$$ 37520 -65947 -113475 -122244 -75817 -24136 23192 26135 -12968 -52906 -82993 -70937 -68508
7841f8508l2934J8230L7295m284p152j5758m9424L3223O4185M932J9042o0612
$$ -68508 -101442 -83212 -45917 -50201 -57353 -73111 -122535 -89312 -25127 -20195 -1153 -61765
7829f1765O9960J5129k6746j04L0216p363O6396Q4671j1540o1169k9947m7420
$$ -61765 8195 23324 -3422 -3526 26690 19327 85723 170394 158854 97685 67738 20318
7817B0318n0086m482Q921o417m6396p3663O539K9671P635J8808j310N75N8949
$$ 20318 -29768 -34250 -25329 -31746 -78142 -151805 -145266 -115595 -107960 -89152 -90462 -89887 -30938
7804c0938M2471K0132l0177N4604n1865k0163M3636k7151j4527o004j8507P8391
$$ -30938 11533 31665 1488 56092 4227 -15936 27700 549 -13978 -19982 -38489 39902
7792C9902J7971p6713o1975j899k5717k1152N159K4238L2761M4255Q9470K1725
$$ 39902 57873 -18840 -80815 -82714 -108431 -129583 -124424 -100186 -67425 -23170 66300 88025
7780H8025j3296o1912k6334K6933o3597M976M2619n2989o6994L1180R6837k3346
$$ 88025 74729 12817 -13517 13416 -50181 -45205 -2586 -55575 -122569 -91389 5448 -17898
7768a7898l7683q7641k7411J36273P9974p5193m9277K7183J1608j6484O6300R6464
$$ -17898 -55581 -143222 -170633 -34360 45614 -29579 -78856 -51673 -40065 -56549 9751 106215
7756A06215L1956j17119n4499r0421l7668J00844Q7855R4378l0516j24201q3716
$$ 106215 138171 21052 -33447 -123868 -161536 -60692 27163 121541 91025 -33176 -116892
7745a16892r088L2469P5580P0286j143r2719n2718L4604L4543L5095L8667m5930
$$ -116892 -125980 -93511 -17931 52355 51212 -41507 -94225 -59621 -25078 10017 48684 2754
7733B754k9964R35l1039l0297k5244O8950M4821l0323k4641L9519J5648l709L1568
$$ 2754 -27210 -26275 -57314 -87611 -112855 -43905 916 -29407 -54048 -14529 1119 -2590 28978
7720B8978n0747n9138m8598L4011N1265R6519l261p6216N3222K5560K2307J0469
$$ 28978 -21769 -80907 -129505 -95494 -44229 52290 49029 -27187 26035 51595 73902 84371
7708H4371q3677k5722J1909P275L2060K1062K648p470L1074Q841k2151m9479j1493
$$ 84371 694 -25028 -13119 -5844 26216 47278 49926 42456 73530 82371 60220 10741 -752
7695g52N318l1061l464Q7138k2190r3745M537M4967p3596p387O9091P6973P5602
$$ -752 4566 -26495 -29959 57179 34989 -58756 -54219 -9252 -82848 -90235 -21144 55829 131431
7682A31431o8442k4781M6330n7063j03836L1357L3824k6577L6677j3636N263o3549
$$ 131431 62989 38208 84538 27475 -76361 -45004 -11180 -37757 -1080 -14716 -9453 -73002
7670g3002J6636N5058K3740K350J5661J9785j419l8236m2738M1553K1576r7835
$$ -73002 -56366 -1308 22432 24782 40443 60228 58809 20573 -22165 19388 40964 -56871
7658e6871P119M5792O0804J0220k1223j2981j612n8857k4327k0913O5243N1565
$$ -56871 -49752 -3960 56844 67064 45841 32860 31248 -27609 -51936 -72849 -7606 43959
7646D3959m1466m6503l1626o583J6461O5526J2404m1243L2600K096K5894N3080
$$ 43959 2493 -44010 -75636 -82219 -65758 -232 12172 -29071 3529 5625 31519 84599
7634H4599o600r1613n2037n5214Q041K3750j4918L6829k0381l4306J3607j1317
$$ 84599 77999 -13614 -65651 -120865 -112824 -89074 -103992 -67163 -87544 -121850 -108243 -119560
7622a19560O447J9281L8167r454M043M4854m1386k9394L7061L4622Q588j1064
$$ -119560 -113113 -93832 -55665 -65119 -61076 -16222 -57608 -87002 -49941 -15319 -6731 -17795
7610a7795l486Q7193j8180n7356k2659M8055N3431k3068l7722j11446O112J24091
$$ -17795 -21281 65912 47732 -9624 -32283 15772 69203 46135 8413 -103033 -96921 27170
7598B7170l8237j4404J0701m1582l0639l2258J0736K4469N5679M3614k1335N590
$$ 27170 -11067 -25471 -14770 -56352 -86991 -119249 -108513 -84044 -28365 15249 -6086 -496
7586d96O9802k6418K2713M3234m2523j4988o871j3930J1313M2275J3967r7990
$$ -496 69306 42888 65601 108835 66312 51324 44453 30523 41836 84111 98078 88
7574H8o626O2911L7504R723p4164n4402r154J03903J4756k0571L1870K6491K069
$$ 88 -6538 56373 93877 103600 29436 -24966 -34120 69783 84539 63968 95838 122329 124398
7561A24398m5268q7609q55R8874N2369m3774k0052q7366m0274L6771k5383L6955
$$ 124398 79130 -8479 -9334 89540 141909 98135 78083 -9283 -49557 -12786 -38169 -1214
7549a214j2948p9263j1331j4633J2092J42053M8385m4599j29609Q406J9972k8553
$$ -1214 -14162 -93425 -104756 -119389 -107297 34756 83141 38542 -91067 -82661 -62689 -91242
7537i1242P9133L7992O0221k085j83541o9127P4145O6999m8626K582j4120m1417
$$ -91242 -12109 25883 86104 84019 -99522 -168649 -94504 -27505 -76131 -73549 -87669 -129086
7525a29086K8561J8913k4324j906J1238j4665q2180m82J702k5142O5225P3773
$$ -129086 -100525 -81612 -105936 -107842 -96604 -111269 -193449 -193931 -192229 -217371 -152146 -78373
7513g8373P2366k4961m092O8678J6898q944R37r1962l0916P532N1566n328J1374
$$ -78373 -6007 -30968 -35060 33618 50516 41572 42509 -49453 -80369 -72837 -21271 -26599 -15225
7500a5225l9445m1948K6594M9337j0129J42272R328j5433k7112j9802p685k8022
$$ -15225 -54670 -96618 -70024 -20687 -30816 111456 120784 105351 78239 58437 50752 22730
7488B2730k3229n4754R9134P4919J9911n9564k5417r596L8033M8477n4256r7400
$$ 22730 -499 -55253 43881 118800 138711 79147 53730 44134 82167 130644 76388 -21012
7476b1012q8734O7505l5084j5898Q2113O4860k4569o5355n0551L1600L7426O0824
$$ -21012 -109746 -42241 -77325 -93223 -11110 53750 29181 -36174 -86725 -55125 -17699 43125
7464D3125m3468M636J07937m8823l5402n2788n7709l0087k7076L6709K8139l1735
$$ 43125 -343 4293 112230 63407 28005 -24783 -82492 -112579 -139655 -102946 -74807 -106542
7452a06542J8495Q9227N1564j0001K865j5247n1504J7105R0653M6949K8800K4489
$$ -106542 -88047 1180 52744 42743 45608 30361 -21143 -4038 86615 133564 162364 186853
7440A86853j2949o4180p1815l1243l4491N2420P6374L7192m4543p3108K199M6689
$$ 186853 173904 109724 37909 6666 -27825 24595 100969 138161 93618 20510 22709 69398
7428F9398K8896R689r6417j08629K9757q954n66N4476J8313m2294J797K9123l0803
$$ 69398 98294 107983 11566 -97063 -67306 -76260 -76826 -22350 -4037 -46331 -44534 -15411 -46214
7415d6214K7573O2696l1356l2677m756L5674K0928K9661j7440n1649p957O8390
$$ -46214 -18641 44055 12699 -19978 -24734 10940 31868 61529 44089 -7560 -15517 52873
7403E2873L8545j2295K3172k6869m7669j8637o228J9870K2891N4347O628L7788
$$ 52873 91418 79123 102295 75426 27757 9120 2892 22762 45653 100000 106628 144416
7391A44416L9571n1265o1991o3434m522P6562N875l4372j3115q2016k3530L4077
$$ 144416 183987 132722 70731 7297 2775 79337 85212 50840 37725 -44291 -67821 -33744
7379c3744j7399j8806L9031J4095R019k5956K153J4352m3297K2352l2415n6638
$$ -33744 -51143 -69949 -30918 -16823 -7804 -33760 -31607 -17255 -60552 -38200 -70615 -127253
7367a27253R2935N3848m6455K6238N7213K9215L8388o6502J7677K6956m7905j03881
$$ -127253 -34318 19530 -26925 -687 56526 85741 124129 57627 75304 102260 54355 -49526
7355d9526j4221N123M1420M177P2318M267J3057K4462j01935n0246k9483n7470
$$ -49526 -63747 -58624 -17204 -13027 59291 63558 76615 101077 -858 -51104 -80587 -138057
7343a38057l872O9623N3855O7448M870q994Q4844J7566j2995o0832k7738j6477
$$ -138057 -141929 -72306 -18451 48997 53867 44873 129717 147283 134288 73456 45718 29241
7331B9241r166Q0542n6126q8096M8799j8274o6155L380M2494K7561n286o4059
$$ 29241 20075 100617 44491 -43605 5194 -13080 -79235 -75855 -33361 -5800 -11086 -75145
7319g5145n4245j8549M8946p0886k0922P1462J09556N9155o5765o701m7722J6149
$$ -75145 -129390 -147939 -98993 -169879 -190801 -119339 -9783 49372 -16393 -23094 -70816 -54667
7307e4667P0583o5040j1243Q0735N981L927P57J2564p9602P35P4322M9729j72
$$ -54667 15916 -49124 -60367 20368 26349 30276 31033 43597 -36005 -35270 39052 88781 88609
7294H8609N2871K1364m0325J0504r650o3082l2827l8235R765K5976n4813m7806
$$ 88609 141480 162844 122519 133023 123373 60291 27464 -10771 -1006 24970 -29843 -77649
7282g7649L959N9374N4310l6519k6749m7221K324M436k0661M0507J06037p4093
$$ -77649 -73690 -14316 39994 3475 -23274 -70495 -68171 -63735 -84396 -43889 62148 -11945
7270a1945j06931k7551O6954O7262L5335j8846k0585n5176J4215J19598J7705
$$ -11945 -118876 -146427 -79473 -12211 23124 4278 -16307 -71483 -57268 62330 80035
7259H0035J2433L244r6191j3115k0979l652O6743P9101o6512j32408j5592L7039
$$ 80035 92468 95712 -479 -13594 -34573 -38225 28518 107619 41107 -91301 -106893 -69854
7247f9854J15166J02345o2510o6280J63j11709q1309j0458P1290l5860L251P2462
$$ -69854 45312 147657 85147 18867 19030 -92679 -173988 -184446 -113156 -149016 -145765 -73303
7235g3303J25297P9849J0583o8131L0443Q783k561m6155l1165m1765k7065j0159
$$ -73303 51994 131843 142426 74295 104738 113521 110960 64805 33640 -8125 -35190 -45349
7223d5349N8871j4805l7115p440m557M5958k8353m566N0322R9091o5618o075J734
$$ -45349 13522 -1283 -38398 -45838 -50395 -4437 -32790 -37356 12966 112057 46439 40364 42098
7210D2098K0478N5031n7295j39740j05320j9229Q9294J30880N7651k4624J5977
$$ 42098 62576 117607 60312 -79428 -184748 -203977 -114683 16197 73848 49224 65201
7199F5201o9041M4048P5053m4894q962m265j5798k3577n8960l4427P5636K1468
$$ 65201 -3840 40208 115261 70367 61405 57140 41342 17765 -41195 -75622 14 21482
7187B1482n54J13834P5528q2006o0903n8596l4696J4517K8734k554j8003l7121
$$ 21482 20928 134762 210290 128284 67381 8785 -25911 -11394 17340 14786 -3217 -40338
7175d0338n3865N066o106P7780L5481m7094J671m687n9545j5311M248j29j28118
$$ -40338 -94203 -89137 -95243 -17463 18018 -29076 -27405 -32092 -91637 -106948 -102700 -102829 -230947
7162b30947P1699N6778r944J2481Q0275l2265n7794m8929M375J4560N8995L4243
$$ -230947 -159248 -102470 -112414 -99933 -19658 -51923 -109717 -158646 -154271 -139711 -80716 -46473
7150d6473m3191K6451M9717K9606J7569o3082p9403K3422J05913q8986q1992K5034
$$ -46473 -89664 -63213 -13496 16110 33679 -29403 -108806 -85384 20529 -68457 -150449 -125415
7138a25415l8806J1743L1914N0946K2353l0413k035L3109M3911N5662O738l9790
$$ -125415 -164221 -152478 -120564 -69618 -47265 -77678 -79713 -46604 -2693 52969 59707 19917
7126A9917l3312O0683k9496l2493N2728k2646m2816k9895J7430O0541n4527n3185
$$ 19917 -13395 47288 17792 -14701 38027 15381 -27435 -57330 -39900 20641 -33886 -87071
7114h7071N1900R090r813N8079K0504O5168L7449r6801o5233K0556M3762q465
$$ -87071 -35171 -26081 -35894 22185 42689 107857 145306 48505 -16728 3828 47590 39125
7102C9125Q21l8347M5745j5332o2312m1862l4511M5342L9237j04685m7749L4207
$$ 39125 39946 1599 47344 32012 -30300 -72162 -106673 -61331 -22094 -126779 -174528 -140321
7090a40321p05L0685O5244K6094n7732k1354L2063P7045M2835n1155j5327K0505
$$ -140321 -141026 -110341 -45097 -19003 -76735 -98089 -66026 11019 53854 2699 -12628 7877
7078G877M3307J937K618j3049p5120q7800n7457R7560N3647R8071n518n6385M8114
$$ 7877 51184 53121 55739 42690 -32430 -120230 -177687 -80127 -26480 71591 66073 9688 57802
7065E7802N5468k1317j33816p4274K0569Q5345L2455j0740l6759j4619j6467K468
$$ 57802 113270 91953 -41863 -116137 -95568 -10223 22232 11492 -25267 -39886 -56353 -53885
7053e3885M8660J8271J2882J0938N1875n144k7257l9777l7461m0411N4670L9934
$$ -53885 -5225 13046 25928 36866 88741 83597 56340 16563 -20898 -61309 -6639 33295
7041C3295l2513J1822k8949j220M202L6065R1365l9542j7103p7757m7582l5031
$$ 33295 782 12604 -16345 -17565 -13363 22702 114067 74525 57422 -20335 -67917 -102948
7029a02948L9537J33404l0587j03018o2654M8356J14180L6006L0563j383j8807
$$ -102948 -63411 69993 39406 -63612 -126266 -77910 36270 72276 102839 101456 82649
7018H2649m6426Q553o70M4158m7728o827m8793k2514N7396J1842m5863o6060K7901
$$ 82649 36223 44776 44106 88264 40536 33709 -15084 -37598 19798 31640 -14223 -80283 -52382
7005e2382P8363j2848k2233J7538p6953n2466K0998L4154j081L518q9899R599
$$ -52382 25981 13133 -9100 8438 -68515 -120981 -99983 -65829 -66910 -63392 -153291 -143692
6993a43692J4475j0555N917O2179O883M7073K9155l7079j70J1878n3731k809p618
$$ -143692 -129217 -139772 -133855 -71676 -64793 -17720 11435 -25644 -25814 -13936 -67667 -70476 -78094
6980g8094o502l1240L3549L408R0490M9572K7893o7681p5531M2671J0054n4462
$$ -78094 -84596 -115836 -82287 -78879 11611 61183 89076 21395 -54136 -11465 -1411 -55873
6968e5873j7490N6509l3132l6843M0137L3539L3373r2847n3936P540j7914P8387
$$ -55873 -73363 -16854 -49986 -86829 -46692 -13153 20220 -72627 -126563 -119023 -136937 -58550
6956e8550P3331L786r116o6535m7259M4524N056N1046P5362L8730l7013q2506
$$ -58550 14781 18567 9451 -57084 -104343 -59819 -54763 -3717 71645 110375 73362 -9144
6944i144j00665L579P189P8470J12280N9913q9892j16451j04392j0856M4603P3626
$$ -9144 -109809 -106230 -99041 -20571 91709 151622 61730 -54721 -159113 -169969 -125366 -51740
6932e1740J7623r9189q4869k8386N7899K3752l956P0290Q9992O625K5949J8222
$$ -51740 -34117 -133306 -218175 -246561 -188662 -164910 -168866 -98576 -8584 -1959 23990 42212
6920D2212q423j4071K5158M1304M3417j3623p3454p4167k0023m0013o6980K6001
$$ 42212 33789 19718 44876 86180 129597 115974 42520 -31647 -51670 -91683 -158663 -132662
6908a32662O2127l7848R506J4930L4842P1809j1685p797k7704Q20r839M9530O3278
$$ -132662 -70535 -108383 -98877 -83947 -49105 22704 11019 3222 -24482 -23662 -33501 16029 79307
6895G9307j30004p303L7954j9451L660o2038q747J21867N259p5132j24163K8567
$$ 79307 -50697 -58000 -20046 -39497 -35837 -97875 -106622 15245 20504 -54628 -178791 -150224
6883a50224L8004N8137O6647M9759M054p5765k3985n5472N0157L4398P8625M997
$$ -150224 -112220 -54083 12564 62323 66377 -9388 -33373 -88845 -38688 -4290 74335 79332
6871G9332k7159l8275j220l8394n914J4221K5595q5500o2452o458N1661J6890
$$ 79332 52173 13898 12678 -25716 -31630 -17409 8186 -77314 -139766 -146224 -94563 -77673
6859g7673n7145K1524n847p374P5338K0500N7238J06321j0245p7308J1719K9139
$$ -77673 -134818 -113294 -119141 -126515 -51177 -30677 26561 132882 122637 45329 57048 86187
6847H6187p6545n9420l9679N388P9240J8236r1697m960j7803m332L9544J9746
$$ 86187 9642 -49778 -89457 -84069 -4829 13407 -78290 -83250 -101053 -105385 -65841 -46095
6835d6095K2260n382l261o0295n2056J7619R3755O6434j3614J9738L559N7268
$$ -46095 -23835 -29217 -32478 -92773 -144829 -127210 -33455 32979 19365 39103 42662 99930
6823I9930j11338j25884M1530j3011N1671J404l834J1776J10934N3907J949l5039
$$ 99930 -11408 -137292 -95762 -108773 -57102 -55698 -59532 -47756 63178 117085 119034 83995
6811H3995J7062L889J9475j2845M7684o6707q8069l0752O1692J9238j07096k6791
$$ 83995 101057 104946 124421 111576 159260 92553 4484 -26268 35424 54662 -52434 -79225
6799g9225M0752q0572r6187J4289M0343J28354R0704k0919l5776m2236M268M8919
$$ -79225 -38473 -119045 -215232 -200943 -160600 -32246 58458 37539 1763 -40473 -36205 12714
6787A2714m5246j710M4302R963o9642p9428K9198M6746K2077k3432m0023k3695
$$ 12714 -32532 -34242 10060 20023 -49619 -129047 -99849 -53103 -31026 -54458 -94481 -118176
6775a18176K2509R8723K9630L6898k9250q5591o1314M7513m6381l6667L6160M3840
$$ -118176 -95667 3056 32686 69584 40334 -45257 -106571 -59058 -105439 -142106 -105946 -62106
6763f2106o054J3971N6627m940O1893m462J2204J8401J6476l0259l5705K1442
$$ -62106 -68160 -54189 2438 -2502 59391 54929 67133 85534 102010 71751 36046 57488
6751E7488m3451k0142K8577K4395m8300n9383n3742O2557Q2169L8761j0788m120
$$ 57488 14037 -6105 22472 46867 -1433 -60816 -114558 -52001 30168 68929 58141 54021
6739E4021k0712m6429P6690J12424j0795r2814o7831M5006m6347R818J7723K5933
$$ 54021 33309 -13120 63570 175994 165199 72385 4554 49560 3213 13031 30754 56687
6727E6687n1338M7318N5842j3137j28295n0148N6590L4169Q002J5060K2118p8699
$$ 56687 5349 52667 108509 95372 -32923 -83071 -26481 7688 15690 30750 52868 -25831
6715b5831N642M9367m279j8525j1420K1004n2145r8240N058P4849P306j6856J4546
$$ -25831 -20189 29178 24899 6374 -5046 15958 -36187 -134427 -129369 -54520 -47214 -64070 -49524
6702d9524J59861P5886j21297j28734n6200L728J654l9395K0333O1999L269Q1310
$$ -49524 110337 186223 64926 -63808 -120008 -116280 -114626 -154021 -133688 -71689 -68420 12890
6690A2890R40p0164n569J5170n4612m4827k129J6680J8985M9950L6881n5690K7271
$$ 12890 13830 -56334 -61903 -46733 -101345 -146172 -148301 -131621 -112636 -62686 -25805 -81495 -54224
6677e4224K7914n6848l1916l449k8027L8522M6377k456J8797n9955j55822l4549
$$ -54224 -26310 -83158 -115074 -118523 -146550 -108028 -61651 -64107 -45310 -105265 -261087 -295636
6665b95636R3485L1941K5612J13941P8271M0537p962j37148j5932J05711l1811
$$ -295636 -202151 -170210 -144598 -30657 47614 88151 80189 -56959 -72891 32820 1009
6654A009j4272K4759l7016K7956M0944n0468p7271R7933N6530k2082L7968N1230
$$ 1009 -13263 11496 -25520 2436 43380 -7088 -84359 13574 70104 48022 85990 137220
6642A37220j8394m3501n7926m1636m1601N9521j736l3260n826m2690k6255o475
$$ 137220 118826 75325 17399 -24237 -65838 -6317 -8053 -41313 -47139 -89829 -116084 -122559
6630a22559m2288M534R0887k8970j6660P237K192l5032l8575L5797R9763J5930
$$ -122559 -164847 -160313 -69426 -98396 -115056 -107819 -105627 -140659 -179234 -143437 -43674 -27744
6618b7744q6111n7910O0475L0592O7074K0625O2078o1798r1226J596k313O527
$$ -27744 -113855 -171765 -111290 -80698 -13624 7001 69079 7281 -83945 -82349 -84662 -78135
6606g8135J396P4812R0924J2055q0975j09792L9704K7039k6086n8538R406Q1718
$$ -78135 -76739 -1927 88997 101052 20077 -89715 -50011 -22972 -49058 -107596 -98190 -16472
6594a6472k0954J9657P4734K8625l1609k9366l0823M2740R045l4729L1670n0914
$$ -16472 -37426 -17769 56965 85590 53981 24615 -6208 36532 45577 10848 42518 -8396
6582h396m6908m0788j1692n8911O4572J41190O9037k3497l3496n5451L6739n5954
$$ -8396 -55304 -96092 -107784 -166695 -102123 39067 108104 84607 51111 -4340 32399 -23555
6570b3555L4138m4939r6066P133M2370n7019l3703k3761Q438O9430Q9768O4161
$$ -23555 10583 -34356 -130422 -123289 -80919 -137938 -171641 -195402 -186964 -117534 -27766 36395
6558C6395N4252L0186n9011k6802K4947K6931m2741j5301r9916p0321O2148J24607
$$ 36395 90647 120833 61822 35020 59967 86898 44157 28856 -71060 -141381 -79233 45374
6546D5374J19049M2703p6851l5476m7252P822k5094K4529k8322n0224l1179o5390
$$ 45374 164423 207126 130275 94799 47547 55369 30275 54804 26482 -23742 -54921 -120311
6534a20311o815M7581L7544j8213l3257n498J5664k0633K4380K157J5305P6952
$$ -120311 -127126 -79545 -42001 -60214 -93471 -98969 -83305 -103938 -79558 -77401 -62096 14856
6522A4856P5006l0684p8600J1340L7448M65j5954L140m4846n461L6889O6911n6745
$$ 14856 89862 59178 -19422 -8082 29366 29831 13877 17017 -27829 -33290 3599 70510 13765
6509A3765j630p5013J6122l2617o5626J5329N0523l0391p4011J0787M3037N4982
$$ 13765 12135 -62878 -46756 -79373 -144999 -129670 -79147 -109538 -183549 -172762 -129725 -74743
6497g4743J156j2158j1131k3362o6455M5932P9503J6529l5649j06749j0154Q1199
$$ -74743 -73587 -85745 -96876 -120238 -186693 -140761 -61258 -44729 -80378 -187127 -197281 -116082
6485a16082J3923M7122L1128m51k5795m259o118m4732N1106k5848L5981J03150
$$ -116082 -102159 -55037 -23909 -24360 -50155 -54414 -60532 -105264 -54158 -80006 -44025 59125
6473E9125K4200Q0076m9806j06364l0207o4203M206j4522j2643M1710M7429P3312
$$ 59125 83325 163401 113595 7231 -22976 -87179 -82973 -97495 -110138 -68428 -20999 52313
6461E2313q607p0244J26575P1435j32266p9141M540o850J0660j2507j4788O9474
$$ 52313 43706 -26538 100037 171472 39206 -39935 -35395 -42245 -31585 -44092 -58880 10594
6449A0594J655L6733Q203n8919q064j3545K2056O4663j1695k5572p6185j01577
$$ 10594 12249 48982 57185 -1734 -9798 -23343 -1287 63376 51681 26109 -50076 -151653
6437a51653m6505M5997M0673K4738j3518j0239L3560Q8559n8852l5447L6877l8318
$$ -151653 -198158 -152161 -111488 -86750 -100268 -110507 -76947 11612 -47240 -82687 -45810 -84128
6425h4128k3985O4877R4039J561L5362L777q8955k0720l9293M8912Q2921N301
$$ -84128 -108113 -43236 50803 52364 87726 91503 2548 -18172 -57465 -8553 74368 79669
6413G9669o5882k6153m6299K2260n5999j06496J3285L0097O8969K7393L1126O3621
$$ 79669 13787 -12366 -58665 -36405 -92404 -198900 -185615 -155518 -86549 -59156 -28030 35591
6401C5591o4503l8925m7335L9457k6834L3508P3160K4922j9579l0456L9257j0999
$$ 35591 -28912 -67837 -115172 -75715 -102549 -69041 4119 29041 9462 -20994 18263 7264
6389G264M5842L4539l163J6656M6612m5979J7745r585n116l3274R165P1380k519
$$ 7264 53106 87645 84482 101138 147750 101771 119516 109931 104815 71541 80706 152086 149567
6376A49567Q504j189p3477J1767k9254n7291m6366J0940J16415L2990j41327l716
$$ 149567 158071 156882 83405 95172 65918 8627 -37739 -26799 89616 122606 -18721 -22437
6364b2437M7388j9536j9872K0580J5451q008j0594O6566Q0028q935p8805j41793
$$ -22437 24951 5415 -14457 6123 21574 13566 2972 69538 149566 140631 61826 -79967
6352g9967n0198P570P155J9462O4892P2813j2299k96N3486O3098l8243p6877n605
$$ -79967 -130165 -122595 -115440 -95978 -31086 41727 29428 29132 82618 145716 107473 30596 24991
6339B4991k0426n7606k8772Q8429Q0071l4422Q228K822J9489p3661n9557k5007
$$ 24991 4565 -53041 -81813 6616 86687 52265 60493 63315 82804 9143 -50414 -75421
6327g5421L8707l1689J6818O971n9594L765N8796k7516k5319k4105L756M2409
$$ -75421 -36714 -68403 -51585 -44614 -104208 -100443 -41647 -69163 -94482 -118587 -114831 -72422
6315g2422O0118L386l9889p7712m1494J04532M0577k5407l6170M3069N13m3302
$$ -72422 -12304 -8918 -48807 -126519 -168013 -63481 -22904 -48311 -84481 -41412 -40899 -84201
6303h4201p9951n1719R8299J6822q440M0853o367k031m1921N4682J8948j8703
$$ -84201 -164152 -215871 -117572 -100750 -109190 -68337 -74704 -76735 -118656 -63974 -45026 -63729
6291f3729L2906n6955P524O7517Q1887L0714p7529k4m1898j3659m581O2792M8274
$$ -63729 -30823 -87778 -80254 -12737 69150 99864 22335 22311 -19587 -33246 -37827 24965 73239
6278G3239m4640j44506n6687L2377k156K9774K5010M7048L9360P415j0850n0970
$$ 73239 28599 -115907 -172594 -140217 -142373 -112599 -87589 -40541 -1181 6234 -4616 -55586
6266e5586K4614m201P2451R3165l3776p8122o1091n0372L8686R4252R7810j2403
$$ -55586 -30972 -35173 37278 130443 96667 18545 -42546 -92918 -54232 40020 137830 125427
6254A25427n0216l8367l2475m6758N7155L7530k9375n3096J1284M9377P0055o4778
$$ 125427 75211 36844 4369 -42389 14766 52296 22921 -30175 -18891 30486 100541 35763
6242C5763r8053k3526J0654L3454M6410k2486J7676L6301r7474r0710L2980R9218
$$ 35763 -62290 -85816 -75162 -41708 4702 -17784 -108 36193 -61281 -151991 -119011 -19793
6230a9793M1412p1453K318k6150q1731n3979J3361N6984K8466Q3764Q6175p844
$$ -19793 21619 -49834 -47516 -73666 -155397 -209376 -196015 -139031 -110565 -26801 59374 51530
6218E1530n2782r7005n1305K415J00213O0790m0131j8266N94k7940N926O0166
$$ 51530 -1252 -98257 -149562 -147147 -46934 13856 -26275 -44541 -43947 -71887 -65961 -5795
6206e795n093k5889O4021o454j9258r089J0114k2813k9044P9488n1185j24245
$$ -5795 -10888 -36777 27244 20790 1532 -7557 2557 -20256 -49300 30188 -20997 -145242
6194a45242j484N9353N2270M3598Q9843j193j7917O226o4602n9876o810J2227
$$ -145242 -146726 -87373 -35103 8495 98338 97145 79228 85454 20852 -39024 -45834 -33607
6182c3607J1880Q8010j3699j04477n7005m048J0678J11738J7641J9908k6445M918
$$ -33607 -21727 66283 52584 -51893 -108898 -112946 -102268 9470 27111 47019 20574 25492
6170B5492J0617m8941o5981o3562l9511K8150J9003k5514J12901N0392l9815k2544
$$ 25492 36109 -12832 -78813 -142375 -181886 -153736 -134733 -160247 -47346 3046 -36769 -59313
6158e9313R7432k846m0917M3003L0107j02665K7453l175l1756l6518m6299n5569
$$ -59313 38119 35273 -5644 37359 67466 -35199 -7746 -10921 -42677 -79195 -125494 -181063
6146a81063L6521r837K8656l3040M6947P5300J9560l7833R736N1659j9577N4692
$$ -181063 -144542 -154379 -125723 -158763 -111816 -36516 -16956 -54789 -45053 6606 -12971 41721
6134D1721K3599l2930q1833l8688l3149L269L9493J08404M0385j0703k4664M5494
$$ 41721 65320 32390 -49443 -88131 -121280 -118011 -78518 29886 70271 59568 34904 80398
6122H0398K6728j666j00960j0171r844k1514l595q532l840m0493l5238M3008P1907
$$ 80398 107126 105460 4500 -5671 -15515 -37029 -40624 -49156 -52996 -93489 -128727 -85719 -13812
6109a3812P1964M0091K1927m1992q4273M8606K5410J7442J0050o0369o9029J38
$$ -13812 58152 98243 120170 78178 -6095 42511 67921 85363 95413 35044 -33985 -33847
6097c3847n4986N0149l282r7245J4114P5591Q1557N261j14158k5034J036N4569
$$ -33847 -88833 -38684 -41966 -139211 -125097 -49506 32051 37312 -76846 -101880 -100844 -46275
6085d6275k3918j10093N8329J37979J5005L8801l127m5697q14k2516J2461L6412
$$ -46275 -70193 -180286 -121957 16022 31027 69828 66701 21004 20190 -2326 10135 46547
6073D6547j9993n7406j7922J402O0440J08995p8599q6212K3819m2898R096J06104
$$ 46547 26554 -30852 -48774 -47372 13068 122063 43464 -42748 -18929 -61827 -52731 53373
6061E3373O241j6774R2848o059p1108k9022n8736L073L6756l293Q2907J3822k3253
$$ 53373 59614 42840 135688 129629 58521 29499 -29237 -26164 10592 7299 90206 104028 80775
6048H0775j82370q3894J1222R7818Q3318p5728p2521J4248N2299J2210l4185k0871
$$ 80775 -101595 -185489 -174267 -76449 6869 -68859 -141380 -127132 -74833 -62623 -96808 -117679
6036a17679N0489M7612K4950o069L2288M5441o3240p2796K5386k9586j5122P982
$$ -117679 -67190 -19578 5372 -697 31591 77032 13792 -59004 -33618 -63204 -78326 -70344
6024g0344J5257L360K1594j1837O1876K5201m7839m7743J1536m1489k295p336
$$ -70344 -55087 -51727 -30133 -41970 19906 45107 -2732 -50475 -38939 -80428 -82723 -90059
6012i0059l0086L0682j962q8595k4497R2262O1243J6684L6477K0707Q094l0116
$$ -90059 -120145 -89463 -91425 -180020 -204517 -112255 -51012 -34328 2149 22856 30950 834
6000H34J2107O2550J1398j774j7824m3894J0156K1992J3506j7788j48199q7272
$$ 834 12941 75491 86889 85115 67291 23397 33553 55545 69051 51263 -96936 -184208
5988a84208J19744Q3239J8538P266J5863J3171j25145k8682q3654M9268J04920
$$ -184208 -64464 18775 37313 44579 60442 73613 -51532 -80214 -163868 -114600 -9680
5977i680J2640n3080l885O9424k5248m6210q3342N9035j1436o1736j2088L3097
$$ -9680 2960 -50120 -54005 15419 -9829 -56039 -139381 -80346 -91782 -153518 -165606 -132509
5965a32509L4674J11Q9712k5997m8316K8841M2842K5701j2842l8523j1517J14383
$$ -132509 -97835 -97724 -8012 -34009 -82325 -53484 -10642 15059 2217 -36306 -47823 66560
5953F6560J7421j4308m8840M362m8224L8138M148M2773k0242j9603n9455n63J17458
$$ 66560 83981 69673 20833 25195 -23029 15109 19257 62030 41788 22185 -37270 -37833 79625
5940G9625J7887m5181k0851L8287m5191q2879o1272j4741N2572K3960M1129K6790
$$ 79625 97512 52331 31480 69767 24576 -58303 -119575 -134316 -81744 -57784 -16655 10135
5928A0135J5695L2631q7807j3305k8358J2683r442o4556l9884Q2843O2973M620
$$ 10135 25830 58461 -29346 -42651 -71009 -58326 -67768 -132324 -172208 -89365 -26392 -21772
5916b1772N7165J1592p2334j2101K1130M2385Q0973n2999n7725o6908K8439M6742
$$ -21772 35393 46985 -25349 -37450 -16320 26065 107038 54039 -3686 -70594 -42155 4587
5904D587N775j9817R3429J26664J757p9230o4424j6659J3028N8907q5107n9619
$$ 4587 10362 -9455 83974 210638 212395 133165 68741 52082 65110 124017 38910 -20709
5892b0709Q7805J0538M0491j0891m1885M9471P7919l6262j8170o3342l0583L98
$$ -20709 67096 77634 118125 107234 65349 114820 192739 156477 138307 74965 44382 44780
5880D4780j2803p2583k7223M3093Q1234l5075j10154j06915O5100J18807o3625
$$ 44780 31977 -40606 -67829 -24736 56498 21423 -88731 -195646 -130546 -11739 -75364
5869g5364k1761L463M8635N0389r903j60616r8182M8963J90943j3799j03767j704
$$ -75364 -97125 -93662 -45027 5362 -4541 -165157 -263339 -214376 -23433 -37232 -140999 -142703
5857a42703L3189L3443O8899M7055m5049p097q9005k9747J2735K2263O8655m818
$$ -142703 -109514 -76071 -7172 39883 -5166 -12263 -101268 -131015 -118280 -96017 -27362 -32180
5845c2180j719J2316k8792k8077L7223l8713N4776M3002m6593J123N0833l3288
$$ -32180 -33899 -21583 -50375 -78452 -41229 -79942 -25166 17836 -28757 -27634 23199 -10089
5833a0089o1359J6875K6033K673l4318l479P798j098K7738N6002K7293L505Q0266
$$ -10089 -71448 -54573 -28540 -25867 -60185 -63664 -55866 -56964 -29226 26776 54069 57574 137840
5820A37840l7304j4673J0077l1321o8300K2118P624m6342m2609r332Q6854M0964
$$ 137840 100536 85863 95940 64619 -3681 18437 26061 -20281 -62890 -72222 14632 55596
5808E5596M6239l919o3921j8118j8004k6776M4349l748q283J3345L02R0549j12352
$$ 55596 101835 97916 33995 15877 -2127 -28903 15446 11698 3415 16760 17062 107611 -4741
5795d741l6328r091L1365P2856j9781M6602p5064r4414K347N0469M5089L7952
$$ -4741 -41069 -50160 -18795 54061 34280 80882 5818 -88596 -86249 -35780 9309 47261
5783D7261k7416l030J7205p6850J907N1286k0816K9164k691n5486K4004n865k2931
$$ 47261 19845 16815 34020 -42830 -40923 10363 -10453 18711 16020 -39466 -15462 -21327 -44258
5770d4258j026k4883J4594j8817R8658P731j30353k5640O7504Q1196m3800n516
$$ -44258 -45284 -70167 -55573 -74390 24268 31999 -98354 -123994 -56490 24706 -19094 -24610
5758b4610j8917J11205J9694O935L2306n9682m8957m9154m4766J4728q9037n1233
$$ -24610 -43527 67678 87372 94307 126613 66931 17974 -31180 -75946 -61218 -150255 -201488
5746b01488J3504J06497J22033N9277l4042p4382M1540M5511n944j15462K749
$$ -201488 -187984 -81487 40546 99823 65781 -8601 32939 78450 72506 -42956 -40207
5735d0207M41L5021k015J9941m0127k4554N9360J09117L9004p5256l1594O0151
$$ -40207 -39766 -4745 -6760 13181 -26946 -51500 7860 116977 155981 80725 49131 109282
5723A09282j9689J8590J4051p9217m3930l5894k4416Q8001m9608K0742P9171J4875
$$ 109282 89593 108183 122234 43017 -913 -36807 -61223 26778 -22830 -2088 77083 91958
5711I1958o741n6169l9876j9206N5870J036K9964P1777n9750m0726l1939o8707
$$ 91958 85217 29048 -10828 -30034 25836 26872 56836 128613 68863 28137 -3802 -72509
5699g2509r7549k9738N1639N4921o2558L6244N7232M1155R807m3996K2907K4684
$$ -72509 -170058 -199796 -148157 -93236 -155794 -119550 -62318 -21163 -11356 -55352 -32445 -7761
5687g761j125p8575p2335K9280J5426M8181O2009L4232L8709P386O284j07588
$$ -7761 -8886 -87461 -159796 -130516 -115090 -66909 -4900 29332 68041 75427 81711 -25877
5675b5877j05766r9797Q8605J52466J00966N7393K7302j03079o9080n9990n4732
$$ -25877 -131643 -231440 -142835 9631 110597 167990 195292 92213 23133 -36857 -91589
5664i1589K145q5432j0489j5782M7381J03791P0901L2905j5904K7339p2616l2548
$$ -91589 -89444 -174876 -185365 -201147 -153766 -49975 20926 53831 37927 65266 -7350 -39898
5652c9898j5038P368O1945R0m4920J7533n614j8519p636l9883j2648j01998n1176
$$ -39898 -54936 -47568 14377 14467 -30453 -12920 -18534 -37053 -44689 -84572 -97220 -199218 -250394
5639b50394O0857K3104q350M7370K4445N4674K2718K7636n1275r1127J6886N4716
$$ -250394 -189537 -166433 -174783 -127413 -102968 -48294 -25576 2060 -49215 -140342 -123456 -68740
5627f8740L1972L8987O2128M0003j3960l0619j799M5769m1275M9813P7814n5791
$$ -68740 -36768 2219 64347 104350 90390 59771 57972 103741 62466 112279 190093 134302
5615A34302r0843j1295R450L3521n0118l8919R495O4511M0014n9734p0671p482
$$ 134302 43459 32164 41614 75135 25017 -13902 -4407 60104 100118 40384 -30287 -37769
5603c7769J03763N073j1779L340q512N1139L0576k8210k5289K3549r297j353m842
$$ -37769 65994 71067 59288 62628 54116 105255 135831 107621 82332 105881 96584 95231 90389
5590I0389j06978K6235L1341j9246k9031m5437p6269N4308P1057M2579n5305J1340
$$ 90389 -16589 9646 40987 21741 -7290 -52727 -128996 -74688 -3631 38948 -16357 -5017
5578e017l4052j9775M9846O867n4328L3541O4084K138m2424j4207Q6033j1951
$$ -5017 -39069 -58844 -8998 -2131 -56459 -22918 41166 43304 880 -13327 72706 60755
5566F0755J7024m9956j18691N0492K9347R1675J9364j26731l8841r2270n361K2171
$$ 60755 77779 27823 -90868 -40376 -11029 80646 100010 -26721 -65562 -157832 -163193 -141022
5554a41022j842K0317L5665j7435Q6028N6663N5557k1076j04737l7988L3339l0836
$$ -141022 -142864 -122547 -86882 -104317 -18289 38374 93931 72855 -31882 -69870 -36531 -67367
5542f7367l0808j3619M7681l3199N7823L2916K5629L2484K5808M2673l7198m7568
$$ -67367 -98175 -111794 -64113 -97312 -39489 -6573 19056 51540 77348 120021 82823 35255
5530C5255j48158n0896P3014P5929m866m4099L3603k8650k8857K4140J2866q5927
$$ 35255 -112903 -163799 -90785 -14856 -19722 -63821 -30218 -58868 -87725 -63585 -50719 -136646
5518a36646r156Q3772K3783l3326l9761O0071P6742L7134K1394n2875l464r4849
$$ -136646 -145802 -62030 -38247 -71573 -111334 -51263 25479 62613 84007 31132 27668 -67181
5506f7181k3693j0868O7796L9770J8398L7986k6336j0822P9474J6269K4092r733
$$ -67181 -90874 -101742 -33946 5824 24222 62208 35872 25050 104524 120793 144885 135152
5494A35152r6869k5628J5485r808K0660R8713N0532j02894j10060m1787j09958
$$ 135152 38283 12655 28140 18332 38992 137705 188237 85343 -24717 -66504 -176462
5483a76462j2778J01633N1321Q1340K144j3539J8038p9949p4762L3354n910k1304
$$ -176462 -189240 -87607 -36286 45054 47198 33659 51697 -28252 -103014 -69660 -75570 -96874
5471i6874L9559K6509j0327N2864O1197n9434o1908p4302J7185K2387j7398m923
$$ -96874 -57315 -30806 -41133 11731 72928 13494 -48414 -122716 -105531 -83144 -100542 -105465
5459a05465o4288N8815R0420K5025L4847j9592q610K5760K2945p0170m922K0713
$$ -105465 -169753 -110938 -20518 4507 39354 19762 11152 36912 59857 -10313 -15235 5478
5447E478O1736k2839k9328K4967r307p7920n4020m9029j3677M4031P8679M7766
$$ 5478 67214 44375 15047 40014 30707 -47213 -101233 -150262 -163939 -119908 -41229 6537
5435F537m9700L026J045M3744L6231n4143P2832J2877j20646o886J4447K8641
$$ 6537 -43163 -40137 -39092 4652 40883 -13260 59572 72449 -48197 -55083 -40636 -11995
5423a1995K4417n4895p933M4973L0198N924O3942J2513r0467l3764r7025k1678
$$ -11995 12422 -42473 -50406 -5433 24765 30689 94631 107144 16677 -17087 -114112 -135790
5411a35790K932O2152M5826M5119K7894L1520l3535l2535O850p589N8997K6329
$$ -135790 -132858 -70706 -24880 20239 48133 79653 46118 13583 20433 12844 71841 98170
5399I8170L596O3897l0104p4322j26055j02052P0734R1808N7170L549J5818p7298
$$ 98170 101766 165663 135559 61237 -64818 -166870 -96136 -4328 52842 56391 72209 -5089
5387e089l2194M8758n0649j05677j1330N3445K5138L2688M6354j338M1079o8269
$$ -5089 -37283 11475 -39174 -144851 -156181 -102736 -77598 -44910 1444 106 41185 -27084
5375b7084k4380k2285J9151l2876K4153K396J6569J9378m8297k5871M9671o0466
$$ -27084 -51464 -73749 -54598 -87474 -63321 -60925 -44356 -24978 -73275 -99146 -49475 -109941
5363a09941k4057j6901N9147m7618N009Q8387M5407j2393M3560P236M8626k6687
$$ -109941 -133998 -150899 -91752 -139370 -134361 -45974 -567 -12960 30600 37836 86462 59775
5351E9775M354p590L6524m734m6197K4374j00056j34282M1222O6772L2795M6089
$$ 59775 64129 56539 93063 88329 42132 66506 -33550 -167832 -126610 -59838 -27043 19046
5339A9046n3142n0311N5142j5541p8827K413L1264L4571J3492L336K4013K477
$$ 19046 -34096 -84407 -29265 -44806 -123633 -121220 -89956 -55385 -41893 -38557 -14544 -12067
5327a2067l0214J860m1226K0771L8223k5958l4833Q717j1796Q0208M2956K1694
$$ -12067 -42281 -40421 -81647 -60876 -22653 -48611 -83444 -74727 -86523 -6315 36641 58335
5315E8335l0178q4616k9838l2103O4597l2989L905J8625J6675j7488k2040M8528
$$ 58335 28157 -56459 -86297 -118400 -53803 -86792 -82887 -64262 -47587 -65075 -87115 -38587
5303c8587L971j4729M1655P0484m208o145r558l5371O2808M9264m3768m2117j8660
$$ -38587 -34616 -49345 -7690 62794 58586 52441 42883 7512 70320 119584 75816 33699 15039
5290A5039Q837K6476M317j00119m7128K4582O924m380n3133r5817K4566k5060
$$ 15039 23876 50352 54669 -45450 -92578 -67996 -61072 -65452 -118585 -214402 -189836 -214896
5278b14896l3553J4137L3649L7358o629j8098Q4411o7181L058j38J0200k63N2778
$$ -214896 -248449 -234312 -200663 -163305 -169934 -188032 -103621 -170802 -167744 -167882 -157682 -157945 -105167
5265a05167Q737P5028Q2033M1001j0201q708K8330O9527p59K8744J5878k9304
$$ -105167 -96430 -21402 60631 101632 91431 82723 111053 180580 179821 208565 224443 195139
5253A95139q6981k4891M4109k1201P729l0027p802R565J9847p0887j21941N4934
$$ 195139 108158 83267 127376 106175 113904 83877 76075 85640 105487 34600 -87341 -32407
5241c2407K5240k7771p0796N7106P0918L779j1791k5351j395N357J0986L1450
$$ -32407 -7167 -34938 -105734 -48628 22290 26069 14278 -11073 -12468 -7111 3875 35325
5229C5325o1203n6345J3549N8613O3625J4386L4196o4020j4121J6799m1250n2469
$$ 35325 -25878 -82223 -68674 -10061 53564 67950 102146 38126 24005 40804 -446 -52915
5217e2915j02262o8076J2614M0305J02822N6716o6985n3249K5435R0407J1669
$$ -52915 -155177 -223253 -210639 -170334 -67512 -10796 -77781 -131030 -105595 -15188 -3519
5206c519l6002m3825m1971m034J5181O2883Q9369k9526O021k837j9899L9770R903
$$ -3519 -39521 -83346 -125317 -129351 -114170 -51287 38082 8556 14577 11740 -8159 31611 41514
5193D1514p6004j3906j9006N6417O1219K6944o3468o3394o0187L9061N4402M8626
$$ 41514 -34490 -48396 -67402 -10985 50234 77178 13710 -49684 -109871 -70810 -16408 32218
5181C2218P5421K0075j53952j7407M3771P6199k3852j1743L5392k7464M0912j672
$$ 32218 107639 127714 -26238 -43645 126 76325 52473 40730 76122 48658 89570 87898
5169H7898n1783p2911r2054O0586P0195j0168L3858n7554j4329R802m7299J0052
$$ 87898 36115 -36796 -128850 -68264 1931 -8237 25621 -31933 -46262 -36460 -83759 -73707
5157g3707J06033m1097j0947K4518m67o7979J9418J19635j1225n6183O2722J4335
$$ -73707 32326 -8771 -19718 4800 4333 -63646 -44228 75407 64182 7999 70721 85056
5145H5056n236Q1739l7503J4333o5342l8411l9761n8326L3656m974L7835Q1407
$$ 85056 79820 161559 124056 138389 73047 34636 -5125 -63451 -29795 -34769 3066 84473
5133H4473l4622j12037R483P9197o5318L0743M5911O1552j7368j03863l7032L7735
$$ 84473 49851 -62186 -52703 26494 -38824 -8081 37830 99382 82014 -21849 -58881 -21146
5121b1146l4199r0913l3982K6531n591j8145J8346P7367R9443K1253n3995M9947
$$ -21146 -55345 -146258 -180240 -153709 -159300 -177445 -159099 -81732 17711 38964 -15031 34916
5109C4916J7388j05663n8070M8512j6966n1558K9109n732O5075J17132J5015q6135
$$ 34916 52304 -53359 -111429 -62917 -79883 -131441 -102332 -108064 -42989 74143 89158 3023
5097C023J7244O4354m6873l7035n3321l588K234M6948N3698K1811m4107j2801
$$ 3023 20267 84621 37748 713 -52608 -56196 -53962 -7014 46684 68495 24388 11587
5085A1587m4934o7491m1429L4349m5959k4163O5970K6373j3034K9340N2025M231
$$ 11587 -33347 -100838 -142267 -107918 -153877 -178040 -112070 -85697 -98731 -69391 -17366 -13135
5073a3135j2637o6840N3397M6315J3247m8551J5763L6852l3737m8977M3857m6726
$$ -13135 -25772 -92612 -39215 7100 20347 -28204 -12441 24411 -9326 -58303 -14446 -61172
5061f1172m3240N3668M9020M6729M9205o4505l6412j4547m3458r119Q6284L0325
$$ -61172 -104412 -50744 -1724 45005 94210 29705 -6707 -21254 -64712 -73831 12453 42778
5049D2778P995j0602k4385K0875L2151R8058M7876j4155j6636r0757K4348l9462
$$ 42778 50773 40171 15786 36661 68812 166870 214746 200591 183955 93198 117546 78084
5037G8084n2191m7298o4869j1260m985M2929N4608l514J895n7737n8532k9928
$$ 78084 25893 -21405 -86274 -97534 -102519 -59590 -4982 -8496 -6601 -64338 -122870 -152798
5025a52798N484N9259L8754K9884K2270k9444M4206k7425k1885P1014P4029k1670
$$ -152798 -147314 -88055 -49301 -19417 2853 -26591 17615 -9810 -31695 39319 113348 91678
5013I1678M8982L368j23455O368j5899Q60k0438r776K2959r01L5090N6255m02
$$ 91678 140660 144028 20573 26941 11042 11902 -8536 -18312 4647 3746 38836 95091 94689
5000I4689K195j5778j4777k0094N3718L8689j47065O8024P7173N120L4600j42510
$$ 94689 96884 81106 66329 46235 99953 138642 -8423 59601 136774 141894 176494 33984
4988C3984j54819P183Q2257L129J9422J7017k979m6237L1321P0933k037j2580
$$ 33984 -120835 -113652 -31395 -28266 -8844 8173 5194 -41043 -9722 61211 59174 46594
4976D6594n3006m0331L6295N9089O6677N2447o9339j11989n542O2958n2521p9970
$$ 46594 -6412 -46743 -10448 48641 115318 167765 98426 -13563 -19105 43853 -8668 -88638
4964h8638J3082J4177p95O6715L0609m8661L6320j2151k4644K5741K7829l4324
$$ -88638 -75556 -61379 -62174 4541 35150 -13511 22809 10658 -13986 11755 39584 5260
4952E260k0856n1110l1660m1590m9999R1942J10490n270L9344L0095L3494m5922
$$ 5260 -15596 -66706 -98366 -139956 -189955 -98013 12477 7207 46551 76646 110140 64218
4940F4218J2344m2909M1493m4842n5922O1871J2657o5995J6125J6799R6266L7898
$$ 64218 76562 33653 75146 30304 -25618 36253 48910 -17085 -960 15839 112105 150003
4928A50003l7584j34900L235n4373l6145O9508M4674o014k1662M5026K5888p2361
$$ 150003 112419 -22481 -19246 -73619 -109764 -40256 4418 -1596 -23258 21768 47656 -24705
4916b4705j4940q266P656R0599L7866n0740m5883k1960M2210l2185Q3367L7895
$$ -24705 -39645 -47911 -40255 50344 88210 37470 -8413 -30373 11837 -20348 63019 100914
4904A00914p3844q9676j9117L4166J188o1351m5805J7645J6926N9742L4570k5411
$$ 100914 27070 -62606 -81723 -47557 -46369 -107720 -153525 -135880 -118954 -59212 -24642 -50053
4892e0053j4875l129O9138L9011k0620l3172m7033Q581j2445K6052J32258m8310
$$ -50053 -64928 -68057 1081 40092 19472 -13700 -60733 -52152 -64597 -38545 93713 45403
4880D5403q844k616N4065M7578k6831j33913n9664j4408Q8954O6326K8909J35725
$$ 45403 36559 33943 88008 135586 108755 -25158 -84822 -99230 -10276 56050 84959 220684
4868B20684p2387q5359m3682r1847K60K0180r424P0563O1704q0958m4234M4750
$$ 220684 148297 62938 19256 -72591 -72331 -52151 -61575 8988 70692 -10266 -54500 -9750
4856i750o684n2955o4458j5379P5191j743N2909K8022n24p1050o8992j03086N6874
$$ -9750 -16434 -69389 -133847 -149226 -74035 -75778 -22869 5153 4629 -66421 -135413 -238499 -181625
4843a81625P7394L3863n8516K6700L747k5377p0520J3257K7299R090K1203O2929
$$ -181625 -104231 -70368 -128884 -102184 -98437 -123814 -194334 -181077 -153778 -144688 -123485 -60556
4831f0556P0424K0912N6497o1092m0027k480m2445J4767j4758k848l030k4730
$$ -60556 9868 30780 87277 26185 -13842 -16322 -58767 -44000 -58758 -61606 -64636 -89366
4819h9366o5475N6535M6845J01015Q4366K6394L9514o0925j3643l5030N8847J061
$$ -89366 -154841 -98306 -51461 49554 133920 160314 199828 138903 125260 90230 149077 150138
4807A50138j1006l9674k5996J9533j05928K6838P8748L541n2349n2515L4359j77
$$ 150138 139132 99458 73462 92995 -12933 13905 92653 96194 43845 -8670 25689 25512
4795B5512P1733q673N206J0426k680l9229m287o9879J01962L4850q6660p1144
$$ 25512 97245 88572 93778 104204 101524 62295 58008 -11871 90091 124941 38281 -32863
4783c2863m5426K1613K4984j9269n9643K3533J01077K5311K4018l217O1214N391
$$ -32863 -78289 -56676 -31692 -50961 -110604 -87071 14006 39317 63335 60118 121332 126723
4771A26723P49k0906l9705r2970m2784K3529L3411P3321m6968k3803j2697K1332
$$ 126723 127472 106566 66861 -26109 -68893 -45364 -11953 61368 14400 -9403 -22100 -768
4759g68J4556L1784J5017p2664K8777l3723j04062m1841R7291K2791j0185M3180
$$ -768 13788 45572 60589 -12075 16702 -17021 -121083 -162924 -65633 -42842 -53027 -9847
4747i847q0230j16488J8652L6289k965N6251L8393l083r037N4217N3047R887J542
$$ -9847 -90077 -206565 -187913 -151624 -154589 -98338 -59945 -63028 -72065 -17848 35199 45086 46628
4734D6628J1826Q8037j2007j6760n9214P9455P2537r1199n6831o8699L329Q130
$$ 46628 58454 146491 134484 117724 58510 137965 210502 119303 62472 -6227 -2898 5232
4722E232L9546M4845K5329K1155p4579o9396p7049N348N7111L7083P271l4768
$$ 5232 44778 89623 114952 136107 61528 -7868 -84917 -79569 -22458 14625 21896 -12872
4710a2872M1410N0915J3674j12476n8491Q8945M2072j08043q4054O7216K4421
$$ -12872 28538 79453 93127 -19349 -77840 11105 53177 -54866 -138920 -71704 -47283
4699d7283O119j3520J2387l4433N8031M8907j9422m5628n4055L0977J5508j9892
$$ -47283 -41164 -54684 -42297 -76730 -18699 30208 10786 -34842 -88897 -57920 -42412 -62304
4687f2304m6086j8709O2352K548N1444k1973L1537j4013L4387q365j9431m8263
$$ -62304 -108390 -127099 -64747 -62199 -10755 -32728 -1191 -15204 19183 10818 -8613 -56876
$$ [...]
##END NTUPLES=NMR SPECTRUM
##END=
