##TITLE=Analysis number 316922
Compound Code cc 00511
Book Reference 397/33/2
Project Code adrs
Chemist Name brucer
##JCAMPDX= 6.0         $$ Bruker NMR JCAMP-DX V2.0
##DATA TYPE= NMR SPECTRUM
##DATA CLASS= NTUPLES
##ORIGIN= Bruker BioSpin GmbH
##OWNER= nmr
$$ XWIN-NMR		Version 3.5
$$ Wed Feb  1 14:39:01 2006 GMT Standard Time (UT+0h)  MAYBRIDGE\nmr@NMR_250MHZ
##.OBSERVE FREQUENCY= 250.131544655141
##.OBSERVE NUCLEUS= ^1H
##.ACQUISITION MODE= SIMULTANEOUS (DQD)
##.ACQUISITION SCHEME= undefined
##.AVERAGES= 16
##.DIGITISER RES= 18
##SPECTROMETER/DATA SYSTEM= dpx250
##.PULSE SEQUENCE= zg30
##.SOLVENT NAME= CDCl3
##.SHIFT REFERENCE= (INTERNAL, CDCl3, 0, 16.522)
##AUDIT TRAIL= $$ (NUMBER, WHEN, WHO, WHERE, WHAT)
$$ ##TITLE= Audit trail, XWIN-NMR		Version 3.5
$$ ##JCAMPDX= 5.01
$$ ##ORIGIN= Bruker BioSpin GmbH
$$ ##OWNER= nmr
$$ C:\u/data/dgb/nmr/ADRS/15480/pdata/1/auditp.txt
$$ ##AUDIT TRAIL=  $$ (NUMBER, WHEN, WHO, WHERE, WHAT)
(   1,<2006-02-01 14:38:35.53 +000>,<MAYBRIDGE\nmr>,<NMR_250MHZ>,
      <created by zg, POWCHK disabled, PULCHK disabled
       configuration hash MD5:
       84 BC 41 DB A1 6E 1D 46 DA 25 12 A5 C1 ED C5 3A
       data hash MD5: 64K
       33 FF B6 0D D9 77 7F 88 74 91 4E 8A 1B 9A F3 7D>)
(   2,<2006-02-01 14:38:50.83 +000>,<MAYBRIDGE\nmr>,<NMR_250MHZ>,
      <Start of raw data processing
       ef LB = 0.3 FT_mod = 6 PKNL = 1 SI = 32K 
       data hash MD5: 32K
       7A 12 A5 FB 67 B9 4F 07 AB ED 63 C6 CC 72 F7 9D>)
(   3,<2006-02-01 14:38:53.00 +000>,<MAYBRIDGE\nmr>,<NMR_250MHZ>,
      <apk 
       data hash MD5: 32K
       17 15 84 7D 5B 8E FE 04 37 B2 5E 10 D7 54 9F E8>)
(   4,<2006-02-01 14:38:53.94 +000>,<MAYBRIDGE\nmr>,<NMR_250MHZ>,
      <abs ABSG = 5 
       data hash MD5: 32K
       E7 F2 49 A1 03 23 67 44 7E 09 B1 B3 67 E0 44 5C>)
$$ ##END=
$$ 
$$ hash MD5
$$ 04 3D 4A 90 18 39 A8 35 D4 5C 51 89 3C C1 11 EB
##$RELAX= 
##$RELAX= 
##$RELAX= 
##$RELAX= 
##$RELAX= 
##$RELAX= 
##$RELAX= 
$$ Bruker specific parameters
$$ --------------------------
##$DU= <C:\u>
##$EXPNO= 15480
##$NAME= <ADRS>
##$PROCNO= 1
##$TYPE= <nmr>
##$USER= <dgb>
##$AMP= (0..31)
100 100 100 100 100 100 100 100 100 100 100 100 100 100 100 100 100 100 
100 100 100 100 100 100 100 100 100 100 100 100 100 100 
##$AQSEQ= 0
##$AQ_mod= 3
##$AUNM= <au_zg>
##$AUTOPOS= <28 >
##$BF1= 250.13
##$BF2= 250.13
##$BF3= 250.13
##$BF4= 250.13
##$BF5= 500.13
##$BF6= 500.13
##$BF7= 500.13
##$BF8= 500.13
##$BYTORDA= 1
##$CFDGTYP= 0
##$CFRGTYP= 5
##$CHEMSTR= <none>
##$CNST= (0..31)
1 1 145 1 1 1 1 1 1 1 1 1 1 1 1 1 1 1 1 1 1 1 1 1 1 1 1 1 1 1 1 1 
##$CPDPRG= <>
##$CPDPRG1= <>
##$CPDPRG2= <>
##$CPDPRG3= <>
##$CPDPRG4= <mlev>
##$CPDPRG5= <mlev>
##$CPDPRG6= <mlev>
##$CPDPRG7= <mlev>
##$CPDPRG8= <mlev>
##$CPDPRGB= <>
##$CPDPRGT= <>
##$D= (0..31)
0 1 0 0 0 0 0 0 0 0.06 0 0 0 0 0 0 0.0002 0 0 0 0 0 0 0 0 0 0 0 0 0 0 
0 
##$DATE= 1138804713
##$DBL= (0..7)
120 120 120 120 120 120 120 120 
##$DBP= (0..7)
150 150 150 150 150 150 150 150 
##$DBP07= 0
##$DBPNAM0= <>
##$DBPNAM1= <>
$$ [...]
##$SUBNAM7= <"">
##$SUBNAM8= <"">
##$SUBNAM9= <"">
##$SW= 20.6930455092707
##$SWIBOX= (0..15)
0 0 3 0 0 0 0 0 0 0 0 0 0 0 0 0 
##$SW_h= 5175.983436853
##$TD= 65536
##$TD0= 1
##$TE= 293.16
##$TE2= 300
##$TE3= 300
##$TEG= 300
##$TL= (0..7)
0 120 120 120 120 120 120 120 
##$TP= (0..7)
150 150 150 150 150 150 150 150 
##$TP07= 0
##$TPNAME0= <>
##$TPNAME1= <>
##$TPNAME2= <>
##$TPNAME3= <>
##$TPNAME4= <>
##$TPNAME5= <>
##$TPNAME6= <>
##$TPNAME7= <>
##$TPOAL= (0..7)
0.5 0.5 0.5 0.5 0.5 0.5 0.5 0.5 
##$TPOFFS= (0..7)
0 0 0 0 0 0 0 0 
##$TUNHIN= 0
##$TUNHOUT= 0
##$TUNXOUT= 0
##$USERA1= <user>
##$USERA2= <user>
##$USERA3= <user>
##$USERA4= <user>
##$USERA5= <user>
##$V9= 5
##$VALIST= <valist>
##$VCLIST= <CCCCCCCCCCCCCCC>
##$VD= 0
##$VDLIST= <DDDDDDDDDDDDDDD>
##$VPLIST= <PPPPPPPPPPPPPPP>
##$VTLIST= <TTTTTTTTTTTTTTT>
##$WBST= 1024
##$WBSW= 4
##$XGAIN= (0..3)
0 0 0 0 
##$XL= 0
##$YL= 0
##$YMAX_a= 373708
##$YMIN_a= -365433
##$ZGOPTNS= <>
##$ZL1= 120
##$ZL2= 120
##$ZL3= 120
##$ZL4= 120
##$ABSF1= 16.522
##$ABSF2= -4.171173
##$ABSG= 5
##$ABSL= 3
##$ALPHA= 0
##$AQORDER= 0
##$ASSFAC= 0
##$ASSFACI= 0
##$ASSFACX= 0
##$ASSWID= 0
##$AUNMP= <proc_1d>
##$AZFE= 0.1
##$AZFW= 0.1
##$BCFW= 0
##$BC_mod= 0
##$BYTORDP= 0
##$COROFFS= 0
##$CY= 12.5
##$DATMOD= 1
##$DC= 0
##$DFILT= <>
##$DTYPP= 0
##$F1P= 14.0000005364418
##$F2P= -0.99999901652339
##$FCOR= 0.5
##$FTSIZE= 32768
##$FT_mod= 6
##$GAMMA= 0
##$GB= 0
##$INTBC= 1
##$INTSCL= 1
##$ISEN= 128
##$LB= 0.3
##$LEV0= 0
##$LPBIN= 0
##$MAXI= 10000
##$MC2= 0
##$MEAN= 0
##$ME_mod= 0
##$MI= 0
##$NCOEF= 0
##$NC_proc= -2
##$NLEV= 6
##$NOISF1= 0
##$NOISF2= 0
##$NSP= 0
##$NTH_PI= 0
##$NZP= 0
##$OFFSET= 16.522
##$PC= 1
##$PHC0= 101.2869
##$PHC1= 4.913167
##$PH_mod= 1
##$PKNL= yes
##$PPARMOD= 0
##$PSCAL= 4
##$PSIGN= 0
##$REVERSE= no
##$SF= 250.13
##$SI= 32768
##$SIGF1= 0
##$SIGF2= 0
##$SINO= 400
##$SIOLD= 32768
##$SREGLST= <1H.CDCl3>
##$SSB= 0
##$STSI= 32768
##$STSR= 0
##$SW_p= 5175.98343685301
##$SYMM= 0
##$S_DEV= 0
##$TDeff= 65536
##$TDoff= 0
##$TI= <Analysis number 999999
Compound Code 99
Book Reference 9
Project Code 9>
##$TILT= no
##$TM1= 0
##$TM2= 0
##$TOPLEV= 0
##$USERP1= <user>
##$USERP2= <user>
##$USERP3= <user>
##$USERP4= <user>
##$USERP5= <user>
##$WDW= 1
##$XDIM= 32768
##$YMAX_p= 375023762
##$YMIN_p= -249315
$$ End of Bruker specific parameters
$$ ---------------------------------
##NTUPLES= NMR SPECTRUM
##VAR_NAME=  FREQUENCY,     SPECTRUM/REAL,   SPECTRUM/IMAG
##SYMBOL=    X,             R,               I
##VAR_TYPE=  INDEPENDENT,   DEPENDENT,       DEPENDENT
##VAR_FORM=  AFFN,          ASDF,            ASDF
##VAR_DIM=   32768,         32768,           32768
##UNITS=     HZ,            ARBITRARY UNITS, ARBITRARY UNITS
##FACTOR=    0.157963299565203, 1,           1
##FIRST=     4132.6476996994, 0,             0
##LAST=      -1043.33573715361, 0,           0
##MIN=       -1043.33573715361, -249315,     0
##MAX=       4132.6476996994, 375023762,     0
$$ Real data points
##PAGE= N=1
##DATA TABLE= (X++(R..R)), XYDATA
$$ [...]
17028d6344K9418K1737M339p885n664O612Q225j2663q363O126J4563N526N668
17015B1295R699j9239k2666q597j79J2080q517j4266j1701J584L8319J7693L869
17002A9374q401j578J2356m767j9126j9713j1977J2301J7813J4704k4060l1202
16990d4276J0534J8050J8131J2157Q544q839j1856j0338K002R403l123j5685r323
16977b4619J7147J4675J3973N305L388j384j204k2798q736m768K115N02j4754
16964b1158l551O82L373o134k010O911J3558J0324j517j5613L024M887J0372q152
16950e004k955P906o315N393R481q635j591j0006j8904k314L873K67p559N061
16936c1302J8218J117j5852m114J5487M373p764J6122P8m445l083M503J888l029
$$ y = [-46344, -16926, 4811, 9150, 1265, -4399, 2213, 10438, -2225, -10588, -4462, 10101, 15627, 21295, 30994, 11755, -10911, -19508, -19687, -7607, -16124, -30390, -42091, -40507, -2188, 15505, 19374, 10973, 9395, 21751, 16984, -2142, -21855, -33832, -21531, -3718, 10986, -13074, -44276, -33742, -15692, 2439, 14596, 23140, 14301, 2445, -7893, -5891, 3512, 389, -15296, -24619, -7472, 7203, 21176, 26481, 29869, 28485, 27281, 4483, -4253, -9021, -6906, -6404, -21158, -24709, -24027, -20654, -26788, -28798, -21887, -8329, 1995, 478, -15135, -12111, -7224, 3148, -5004, -7959, -53, -6368, -975, 8506, -129, -1720, -11726, -30630, -32944, -29071, -28804, -36363, -31302, -13084, -11967, -27819, -31933, -16446, -12073, -19837, -3715, -3637, -8082, -11165, -6662, -4774, -7803]
16922g803k494j287R095j3521J66N225k4153J95L234K758N965M202K3515J3556
16908A8653l616k509K444m844M09o037m497n595q744K1363q403j6316L15k817
16894b0194L195L687P937r742m571m445m735n173l002P117K522K7185J682j2652
16880a1189L523K4751l42m847j2182q918Q87J3225K0089n674j7026j0671p396
16867a5770j241M559m901j557m509q308K010J1009R538O718J1102m649L452R116
16853A6569p659L336m922q423J130O192O072q401J0470M594m753m050k609L471
16839A1017J7760m940j2396j2737p21m70M96Q950K037O200K347K092p514j0217
16825A904j6462j141J5048K823p448k3577J1233J3346n990O377Q352k575J8009
$$ y = [-7803, -10297, -11584, -2489, -16010, -15844, -10619, -34772, -34577, -31343, -28585, -22620, -18418, 5097, 18653, 15037, 12528, 14972, 10128, 10537, 4500, 3, -5592, -14336, 7027, -1376, -17692, -17377, -20194, -16999, -13312, -5375, -15117, -19688, -24133, -28868, -34041, -37043, -29926, -27404, -219, 1463, -11189, -7666, 17085, 16743, 11896, -286, -9204, -8317, 4908, 24997, 19323, 2297, -8374, -15770, -17011, -12452, -17353, -18910, -23419, -31727, -29717, -18708, -9170, -2452, 8650, 4001, 7453, 16569, 8910, 12246, 7324, -1099, 31, 6223, 12295, 3894, 14364, 18958, 14205, 10155, 7546, 11017, 28777, 23837, 11441, -1296, -2017, -2487, -1991, 6959, 8996, 15196, 17543, 19635, 12121, 1904, -14558, -15699, -651, 2172, -5276, -28853, -17620, -4274, -10264, -3887, 4465, 1890, 19899]
16812A9899L690J2473J8066k1386k3905j5573L399J3787P404p632r239l00m997
16799d314k512j0412J0799N045o441L340M135P880l57r743M773N011m592j3467
16785a0855J894p577K783O38j87J3726J2794q244k509p076N759q73O739j875n637
16770e00J668R366J0023j2151M958K617j8761j0391Q006L496p840l968M433l534
16756a2578l1089J5506J3889r399M952k957j6162J2601M897J3891m958J7630J4687
16743B0910N50p221n042p212j1233k305J3401P499j4490J0711l132k807p460o904
16729a4735P003J0986p340Q97J7747j0267j1227l934J1017J1074M354j87j7872
16716b484j4558K206r41K780J347J2176j4338k0731J3091J8850p95j9887k422
$$ y = [19899, 23589, 36062, 54128, 32742, 8837, -6736, -3337, 10450, 17854, 10222, 983, 683, -4314, -6826, -17238, -6439, -1394, -7835, -4495, -360, 7520, 7163, -2580, 2193, 7204, 2612, -10855, -8961, -16538, -13755, -13117, -13304, 422, 13216, 4972, 2463, -4613, 1146, 273, 7012, 5137, -500, 1168, 10534, 20557, 8406, 13364, 15981, -2780, -13171, -5165, -1669, -9509, -13477, -9044, -12578, -43667, -28161, -14272, -23671, -18719, -21676, -37838, -25237, -20340, -6449, -11407, 6223, 20910, 21460, 14239, 9197, 1985, -9248, -11553, 1848, 9347, -5143, 5568, 2436, -371, -7831, -14735, -7732, 3254, -4086, -3189, 14558, 4291, -6936, -10870, 147, 11221, 15575, 15388, -2484, -17042, -14836, -15777, -12997, -11650, 526, -13812, -34543, -21452, -2602, -3397, -23284, -25706]
16703b5706R089Q346Q056m904j599j0530l104m933l646J4217K4057N665j6880
16690a872q441Q050j838j4325O629j0427o390L714J5935J1844J1890j423j842
16677A1504j4834n935R892K2250l415k0830r897P835o824J0243P770j6213J1672
16664C218j0297M834p152P575R338n666r336j756L820K827J6476l876j8116N064
16650c047J0864o732P626r377r782j1220m602p159J1390Q726j470N881J8573k816
16636F855o023o776K482L92m58L435l857o993Q150Q230n345p070J3958M188q87
16621A0281m088n193L621J2592n542k3834k3879O919J8774L674l942j598J3222
16608A007j2818n404O717K157k1399j868R764J2489K0792R38j6599Q77J824J5591
$$ y = [-25706, -16617, -8271, -215, -5119, -6718, -17248, -20352, -25285, -28931, -14714, 9343, 15008, -1872, -10313, -2263, -4101, -18426, -11797, -22224, -28614, -24900, -8965, 2879, 14769, 13346, 11504, -3330, -9265, 627, 22877, 19462, -1368, -11265, -3430, -10254, -11, 7759, -8454, 3218, -7079, -2245, -9397, -1822, 7516, 1850, -7486, -9242, -5422, -2595, 13881, 10005, -8111, -3047, 7817, 1085, 8711, -666, -10448, -21668, -26270, -33429, -22039, -13313, -14783, -8902, 9671, 6855, 832, -5944, -3462, -3070, -3528, -93, -3950, -10943, -2793, 5437, 92, -6978, 6980, 11168, 10281, 6193, 1000, 4621, 17213, 11671, -12163, -36042, -29123, -10349, -6675, -10617, -12215, 1007, -11811, -17215, -10498, -8341, -29740, -31608, -21844, -9355, 11437, 12375, -4224, -3347, -1523, 14068]
16594A4068l062P712n188K047J310o944n157q009K266J2027M830j7086p652j2401
16580b1239k4823m480J2812o194P222n212K569J7362J6831j1198j3818j0396J1662
16567b8902J1303Q555N649J4119J6737j8843o271K2083o131q989j4101J701J1617
16554H527l153J2013J61k0085O691L604J0873o763o534k5670j2224J3117M923
16541a4520J4966j0975J599j2638K184J606K738R926L105J3291j184l801m646
16528A651j55j6097m44o545p051M40J2221J4147M051o257l165p07M063p340p950
16513a9138O985j4700o165K365R5l728k534K750K5410P862r972L444P286J6376
16499A6336K67j2088o670l338Q270L767m626m468J9518m748j7577j1622q771J4315
$$ y = [14068, 11006, 18718, 13530, 15577, 16887, 9943, 4786, -3223, -957, 11070, 15900, -1186, -8838, -21239, -46062, -50542, -37730, -43924, -36702, -41914, -39345, -21983, -5152, -16350, -30168, -40564, -28902, -17599, -9044, -3395, 10724, 27461, 8618, 2347, 24430, 18299, 9310, -4791, -3090, 8527, 5374, 17387, 17548, -2537, 4154, 7758, 18631, 11868, 5334, -20336, -32560, -19443, -14520, 446, -10529, -8930, -21568, -19384, -17778, -15040, -5114, -2009, 11282, 10098, 6297, 1651, 1496, -14601, -15045, -21590, -28641, -28201, -15980, -1833, 2218, -4039, -7204, -7911, -3848, -11188, -19138, -12153, -26853, -33018, -30653, -30558, -34286, -36820, -34070, -8660, -798, -10770, -7326, -40, 16336, 16603, 4515, -2155, -5493, 2777, 6544, 1918, -2550, 16968, 12220, -5357, -16979, -25750, -11435]
16485a1435R039l438q742J5050j2916n606N734J2823J2387p080j4137m987k64
16472a3572q980J7603K1463k9529j3613R386J6343J2941p765L646k438j9367j0229
16459b4111J741O909r075j2073r407J053Q27Q824J5677J9271K357m326k789N662
16445E40n969J0138o975j8788q158m813J729O559M94J7628Q483P109P98M379j1425
16430A729p335O594l887k71N349J1299r189q552o572n910J6123J3370o115J247
16416G880K684O830J955J964j0409R256j1863R619r892j0734r96m214j0965n006
16402b3891M498N297j0320Q784L1187R569q965l092J1356K816Q02l093J0915N615
16388D1478k7037j8210k229L366Q904M790J4352M801K148j9668q748K446p158
$$ y = [-11435, -2396, -5834, -14576, 474, -12442, -18048, -12314, 509, 12896, 5816, -8321, -13308, -13572, -22552, -4949, 16514, -13015, -26628, -17242, -899, 12042, 4277, 7923, 5485, -13882, -24111, -22370, -15461, -24536, -36609, -46016, -44963, -44136, -35312, -19635, -364, 1993, -2333, -5122, 540, -5429, 4709, -2266, -21054, -29212, -34025, -32296, -25737, -25243, -7615, 868, 7977, 8775, 13154, 1729, -5606, 988, -2899, -3170, 2179, 13478, 4289, -4263, -10835, -16745, -622, 12748, 6633, 7880, 10564, 17394, 19349, 21313, 10904, 20160, 8297, 17916, 8024, -2710, -3706, -7920, -18885, -23891, -19393, -14096, -24416, -15632, 15555, 25124, 16159, 13067, 24423, 27239, 28041, 24948, 35863, 41478, 14441, -3769, -5998, -2632, 6272, 11062, 25414, 30215, 32363, 12695, 3947, 6393, -765]
16375g65k1236J2648K1918q261q310m43K091R26l996N696J2018q220K463K905
16361I434M671j3929O247j1291k4827l1303Q025K6364J9984J6901K3004N598r859
16348B9019j5682k316R725j5232q925j1498l237J2125m177M080J1215o778p988
16335i669r274L170Q908J226p623J742l1833J046J2779J8737N054k064j614l622
16321a3037O953j1280L142K6448R729j997j2262K968J642j2347j2832m803L114
16308a4562J526J8325K0006p288J265O858j5471M145M839Q65j3279j4433j1195
16295a8399L237K5732R585j2765j3854o699j4797J026J0749R222R38j806m129
16282a1960k1680j14K1717j572p41l889Q784m076L07K583k559n059L041j5344
$$ y = [-765, -22001, -9353, 12565, 4304, -4006, -4449, -2358, -1432, -5428, 268, 12286, 4066, 6529, 9434, 14105, 176, 6423, -4868, -29695, -60998, -52973, -26609, -6625, 10276, 33280, 38878, 29019, 13337, 11021, 20746, 5514, -3411, -14909, -18146, -6021, -10198, -6118, 5097, -1681, -9669, -18943, -15773, -6865, -5639, -13262, -11520, -43353, -42307, -29528, -10791, -5737, -7801, -9415, -13037, -6084, -17364, -14222, 12226, 21955, 19958, 7696, 10664, 12306, -41, -12873, -17676, -14562, -13036, 5289, 25295, 18007, 19272, 26130, 10659, 14804, 19643, 20508, 7229, -7204, -18399, -15162, 10570, 20155, 7390, -6464, -13163, -27960, -26934, -16185, -6963, -6025, -7831, -11960, -33640, -33754, -12037, -13609, -14350, -18239, -9455, -13531, -13224, -10641, -13200, -18259, -15218, -30562]
16268c0562q80K3422j3217R632O772j5846Q376M991k673J554J8082j0614j0466
16255a1429J680R81P075J3855m171j3179j1493L93P465k636l876l577J3465K952
16241b495j4450R268N362N037q63r992l90R266K1326o068m962J3663J0656k986
16227C2372p707k3558P049M856p698j2017m689J178O264M189M589r161j5572m27
16213b0332J1400J8349Q669j9589j9043j4467O671K1075L461j078m62l510j4296
16200b3152n835P634J6567K765j1061J469J9881O658q242j7688Q745J9891J366
16187A8998j2457j4024K486J5811P436J209j2378p205J3n752n595J4982j0013
16174f489J371l062M952J290n225m118j1424K132P670J9979J8082j706k4671j6456
$$ y = [-30562, -31442, -8020, -21237, -11605, -4833, -20679, -12303, -7312, -9985, -8431, 9651, -963, -11429, -9749, -8768, -1693, 12162, 7991, -5188, -16681, -16288, -8823, -11459, -15335, -18912, -5447, -2495, -16945, -7677, -2315, 2722, 1859, -8133, -8523, 743, 22069, 16001, 11039, 24702, 35358, 32372, 24665, 1107, 8156, 13012, 5314, -6703, -11392, -10214, -3950, 239, 4828, -4333, -19905, -20332, -8932, 9417, 18086, -1503, -20546, -35013, -28342, -7267, -3806, -4884, -5346, -8856, -23152, -28987, -21353, -4786, -2021, -13082, -11613, 8268, 14926, 6684, -11004, -2259, 17632, 18998, 6541, -7483, -4997, 10814, 18250, 19459, 7081, -124, -111, -5863, -11458, 3524, -6489, -5118, -8180, -3228, -1938, -7163, -11281, -22705, -20573, -12903, 7076, 25158, 23452, -1219, -17675]
16160a7675k1024J5876j794O285K6771j4266k3250O519J0187m879J1839K2550
16148A7139R258L439j8510j4596j2775J0628j588n129l397j9700K6386J2571K4587
16135B8313J8634P03j7083j0896p146r853M992J3781k50q208l119o155j7427k1283
16121c4997J4203q785o387Q408R410j347j7176m056N435L757j852L650J5022J5242
16107E27J1416O270Q125m362j5287R176O957P39j503j4049j8407j500j2552k670
16093b7120O311O654M973P750L655R290N476j0615j5214M830J4401k1392j2116
16080b3117J285J5752J0505j5413j2651j143J2554J3606J1580j6616k1968J5542
16068a0084M989j584L099j795o784k28j954r784J139J4140R736j212M431J3077
$$ y = [-17675, -38699, -22823, -24617, -18332, 8439, -5827, -29077, -22558, -12371, -17250, -5411, 17139, 26397, 29836, 11326, -3270, -16045, -5417, -7005, -12134, -15531, -35231, -8845, 3726, 28313, 46947, 47650, 30567, 19671, 12525, 2672, 7664, 21445, 21195, 12987, 9868, 3713, -13714, -34997, -20794, -29579, -35966, -27558, -18148, -19495, -36671, -40727, -35292, -31535, -33387, -29737, -14715, 527, 11943, 18213, 26338, 21976, 6689, 15865, 22822, 23561, 22058, 8009, -10398, -11898, -24450, -27120, -20809, -14155, -9182, -1432, 2223, 11513, 16989, 6374, -8840, -4010, 10391, -11001, -23117, -21832, -6080, 4425, -10988, -23639, -24782, -12228, 1378, 12958, -3658, -25626, -10084, -5095, -6679, -3580, -5375, -12159, -12387, -14341, -24125, -22986, -8846, 890, -322, 4109, 17186]
16054A7186m066J235j5436n494M663l31j5447n556R794J9547k9105l0362Q675
16041d4697K1601J8958j706n544m199l378R906q380L920P453J781o431o366J0064
16027g018K0885m002j3681J6870J6199p45j5750j6773P660l796q169R776R113
16014A0569K056R87L605j1426j1527n21J0516j7788j9752R395J2540j381l538
16001a6265Q889J8366R136j325m967j3693L892j2877j0585M212m997j226K8774
15988G334K3682j0668j1504l660l763J898J4099q276j0502n225q054p786P221
15975a5204p632J79J2653m001J0051P543Q287J5854j0623j1070k267q869k0263
15962b5362l175L485O35L319L263j1457J8886j0221j2812P046J2944O672n571
$$ y = [17186, 13120, 14355, -1081, -6575, -1912, -2243, -17690, -23246, -13452, 6095, -23010, -53372, -44697, -23096, -4138, -5844, -11388, -15587, -18965, -9059, -17439, -13519, -6066, -4285, -10716, -17082, -7018, 13867, 9865, -3816, 13054, 29253, 28508, 12758, -4015, 3645, -151, -8320, 1456, 10569, 12625, 13612, 17217, 5791, -5736, -6257, 4259, -13529, -33281, -23886, -11346, -12727, -16265, -7376, 10990, 20126, 18801, 13834, 141, 4033, -8844, -19429, -15217, -20214, -21440, 7334, 31016, 20348, 8844, 5184, 1421, 3319, 17418, 9142, -1360, -6585, -14639, -22425, -15204, -22836, -22657, -10004, -14005, -3954, 3589, 11876, 27730, 17107, 6037, 3770, -5099, -25362, -28537, -25052, -24417, -21098, -17835, -29292, -10406, -20627, -33439, -26393, -13449, -6777, -12348]
15949a2348Q451n613j3926N082Q382m940l875L844R49j757M697n075R834p099
15935a3394k45O242P23P185L015l544j5554J8137R267j6943N265J4228k351L698
15921A5729l548L013q516j4864k221j949J457n759Q368L386J4523Q448p257q989
15907A821R306m051l621r172J1930Q990j3489r534o66M161j3534m650j349J8792
15893e066K4827O117j7457j0371o695q467q929L974k924O037J4483L236J5177
15880A3942k983n953Q830K019M050j5245N906j036J937m928j752n9O105j901p034
15865A898r250O07n378j1816j534l133R017M984k148Q636J9186J703k3346r740
15851b0314l61J1360L718l900n487j575R195K689q679p74O576j2667J1503R947
$$ y = [-12348, -3897, -9510, -23436, -18354, -9972, -14912, -18787, -14943, -13994, -15751, -11054, -16129, -6295, -13394, -13639, -7397, -6674, 511, 3526, -18, -15572, 2565, 11832, -5111, 154, 14382, 12031, 15729, 12181, 15194, 6678, -8186, -10407, -12356, -10899, -16658, -8290, -4904, 9619, 18067, 10810, 1821, 11127, 7076, 3455, -5717, 6213, 15203, 1714, -7820, -8486, -4325, -17859, -22509, -23858, -5066, 19761, 25878, 8421, -1950, -8645, -17112, -26041, -22067, -24991, -18954, -4471, -1235, 13942, 10959, 5006, 13836, 15855, 19905, 4660, 10566, 9530, 11467, 6539, 4787, 4728, 10833, 8932, 1898, -7352, -6745, -12123, -23939, -25473, -28606, -19589, -14605, -16753, -8117, 11069, 12772, -10574, -20314, -20675, -9315, -5597, -9497, -14984, -16559, -7364, -4675, -13354, -14128, -7552, -20219, -8716, 1231]
15837A231n081k0678J03k437O204j57n267J5682J8515p864M477Q744j2264K785
15823C993j1721k6512O662K7175P382M846p350o688m767o459o662J9994J7340
15810A7233J6246j3295j9711j567k902o03j233N325N013r643R66J6333O792j431
15796A7523Q186L446k83J090n94N135J756k63q957k8232N48J13j8463K564J7165
15781G34J1891l9n256Q420j647j4837j140k0267N010J7829M727k238m414l73j0532
15766a2132l856j210N001N14o151R227P963J507L558o640r357J547J883j0050
15752a8196J5283P225j0315k657J4399P555p073K174J1524l966j5493P750K563
15739A0773r69j7263j2984P712J6683O851O171l417r352j0162l322J371M967n224
$$ y = [1231, -3850, -24528, -24425, -26862, -20658, -20815, -26082, -10400, 8115, 251, 4728, 13472, 1208, 3993, -7728, -34240, -27578, -403, 6979, 11825, 4475, -2213, -6980, -13439, -20101, -107, 17233, 33479, 20184, 473, -1094, -3996, -4599, -5832, -507, 4506, -5137, -4171, 12162, 18954, 17523, 25709, 29155, 28872, 29962, 29368, 34503, 36259, 35996, 27039, -1193, -645, -532, -18995, -16431, 734, 12625, 12586, 7330, 15750, 14103, -734, -1874, -22141, -17131, 698, 5425, 3187, -1227, -1600, -12132, -15988, -17198, -12197, -11683, -17834, -8607, -644, 863, 4421, -2219, -11576, -10029, -8146, -18196, -2913, 4312, -6003, -8660, 5739, 13294, 6221, 8395, 19919, 15953, 460, 8210, 10773, 9804, -7459, -20443, -12731, 3952, 10803, 16974, 13557, 4205, -5957, -9279, -7908, -2941, -8165]
15725h165P775l838j868J4453J0248K217O390o66l1940j965L071J965n986o377
15711a4686o935J677K4225J873r489m33J3989K08k2330k2817M344J5245J7792
15698B663Q009j7792n366J3558j5748J0586K122N594j3455n078q638p058J3100
15685a7503l73j018J1719N689k852L514M762j0363o04J1273N508j3164o058J4856
15671E386M444j9831j2089R776L0070J0388q444k4960j7776R619R53o095K489
15658a6070J2856J5873l605j0107j3173N686J0750k015j221l585j371J4791O134
15645A4943l656p936p602Q233j1112L216N941q053m741K24p307J1135Q222j4428
15631a2921L801j6947k043Q809j4193J4016K695N543L358L781l521J4208P175
$$ y = [-8165, -390, -4228, -6096, 8357, 18605, 20822, 27212, 26546, -5394, -7359, -4288, -2323, -8309, -14686, -21621, -19944, 4281, 6154, -3335, -3768, 10221, 10429, -11901, -34718, -30374, -15129, 2663, 10672, -7120, -12486, 1072, -14676, -4090, -1968, 3626, -9829, -14907, -23545, -30603, -17503, -17876, -18894, -7175, -1486, -4338, -824, 3938, -6425, -7029, 4244, 9752, -3412, -9470, 5386, 9830, -10001, -22090, -12314, 17756, 28144, 19700, -5260, -23036, -13417, -12464, -18559, -16070, -3214, 12659, 9054, -1053, -14226, -8540, 2210, 195, -1026, -4611, -5982, 8809, 14943, 11287, 3351, -4251, 3982, -7130, -3914, 2027, -6026, -10767, -10543, -17850, -6715, 1507, -12921, -9120, -26067, -28110, -19301, -33494, -19478, -16783, -11240, -7882, -4101, -7622, 6586, 13761]
15618A3761k716J0351k970L146J126M515J4128J4345j1884k1612l414n6k0076
15605a356j922J3208J468j1561N329j5463L608J8660M579n908n139k283n937k2112
15591b4829J1076j571N251J1947o555k1132J6263J2865n764m318j5585J3133K1397
15578A2178O833j7001j9876r08Q68K967J3228q243Q081j0738q603K6964J6411
15565B2161r391l1913m187K3J6418L1529k892j9079j77J6723L087q078m403n823
15551C998j5374j939O673N527K3075l381j2337o89N096k2089j1012N990K358o994
15537b1098o422k098J1598j7202J5777J7885q7p690j852m00M98J5658J3626l508
15523A4685m839R726O722j4904k0693l870P573K8710J0087J3048l031l1283j8889
$$ y = [13761, 11045, 21396, 18426, 21572, 22698, 27213, 41341, 55686, 43802, 22190, 18776, 18720, -1356, -3278, 9930, 11398, -163, 5166, -10297, -6689, 11971, 16550, 10642, 5503, 3220, -2717, -24829, -13753, -15324, -10073, 1874, -4681, -25813, -9550, 3315, -2449, -6767, -22352, -9219, 12178, 19011, 2010, -17866, -18774, -17906, -14939, -1711, -9954, -1873, -12611, -21214, 5750, 22161, 12770, -19143, -23330, -23307, -6889, 24640, 21748, 2669, 2492, 19215, 22302, 14224, 9821, 3998, -11376, -13315, -6642, -1115, 21960, 18579, 6242, 5553, 10649, -11440, -22452, -16462, -14104, -21098, -27520, -29618, -18020, -35222, -19445, -1560, -1647, -9337, -11189, -11589, -11091, 4567, 18193, 14685, 9846, 19572, 26294, 11390, -9303, -13173, -5600, 23110, 33197, 46245, 43214, 11931, -6958]
15510f958o727j6808j1165K1598o892k520J121j2225J9075J7688K4271J9109j2649
15497B6918o351J3875j1034p262j743r83k1179R662J2125n798L969q837j0195
15484f833j3154K595J0278l433l211R026M051j0373l18R342j909O004R885k517
15470I433q840o186M45K599R104P624J6099j1530o170m800K820O452K995o996
15456A3049r920L081K51J0126L716J906j1035j6927l109J6308J2713k172j5006
15443B981j7524j637Q811L255M444K907j0030j555k8811M337L0250k293j6805
15430b1670j3935J4440J7344j0646j2475J252J1463j562P125j124R844O07J0675
15417A1338j722q41J140J1283M209j5872p167j2453l804L206L684r312J748J7521
$$ y = [-6958, -13685, -30493, -41658, -20060, -26952, -29472, -28351, -40576, -21501, -3813, 20458, 39567, 26918, 20567, 34442, 23408, 16146, 14403, 13420, -7759, 1903, 14028, 8230, 12199, 3362, -6833, -19987, -17392, -7114, -10547, -13758, -4732, -681, -11054, -11372, -2030, -3939, 2065, 11950, 9433, 593, -5593, -5148, -2549, 6555, 14179, 30278, 18748, 12578, 7778, 10598, 17050, 20045, 13049, 3129, 6210, 6461, 16587, 20303, 22209, 11174, -5753, -8862, 7446, 20159, 17987, 2981, -14543, -16180, -7369, -4114, 330, 3237, -6793, -8348, -37159, -32822, -2572, -4865, -21670, -35605, -21165, -3821, -14467, -26942, -25690, -14227, -15789, -8664, -9788, 56, 663, 11338, 9616, 8775, 9915, 21198, 25407, 9535, 2368, -10085, -13889, -10683, -6999, -16311, -14563, 2958]
15403B958K2344j2023l1308m617J8460J6941q687n516Q139P363j0243J6495Q167
15390B8473j9383j3073R465P47k3988P291J8118m336j1976Q406L162p511j9273
15377b3878L558J5379j952j0126j0379p535Q55P361l097j581R238k204j990P703
15363a8648K457q253r320P432J6203M93Q482j696j6575m714J4362O115J7507J293
15349A5138j09j1999o853K966J0509R870l541o302j7250m338K1253K5530n356
15336B9518j1507j2204j0375J417N749l9M725n346K547J0070Q521J3971Q244p671
15322C7620k3615m682q173k3076j5386P68J3519R170J414l940J251L424k1336
15309c3042j4944N567J0775J1140P784j499j1097Q987L579Q313J3273n361J2258
$$ y = [2958, 25302, 13279, -18029, -22646, -4186, 12755, 4068, -1448, 6691, 14054, 3811, 20306, 28473, 9090, -3983, 5482, 6229, -17759, -10468, 7650, 3314, -8662, -256, 2906, -4605, -23878, -20320, -4941, -6893, -17019, -27398, -34933, -34078, -26717, -29814, -31395, -22157, -24361, -26351, -18648, -16191, -24444, -33764, -26332, -10129, -9636, -1154, -2850, -19425, -24139, -9777, -3662, 13845, 15138, 15029, 3030, -3823, -857, 9652, 19522, 15981, 9679, -7571, -11909, 9344, 34874, 29518, 18011, 5807, -4568, -3151, 2598, 2559, 7284, 1938, 4485, 14555, 23076, 37047, 45291, 37620, 14005, 9323, 1150, -21926, -37312, -36544, -23025, -13855, -12441, -16381, -15130, -11706, -33042, -47986, -42419, -31644, -20504, -12720, -14219, -25316, -16329, -12750, -4437, 8836, 3475, 15733]
15296A5733N674j3546r631l433j3583j0366O322L140J0228p319n133J1758N210
15283d946J4951J771O957K429m369r91j7585o922p919o161R673O013q580q90Q989
15268g580K1123O540q87r828R671j0462p065Q616o874N070m793j1366j0537J3889
15254d483k979l735Q118K758k439J3572l588p70m954j2778Q566J3063Q8j1290
15240h51j3129J3322J4203o657j6676p778O495l371p395M313m638J5109J0556
15227C503k465j3558q886Q74L227l712j285n46J3322L05n904J4412O722P937J2465
15212B6411q201p991J2303m586j6760j4310J4664J2208K188j0965o353k557J5027
15199A1078R046p801o358m462p964J486K157J7399o978j7534n25K5912k167k0169
$$ y = [15733, 21407, 7861, -1770, -5203, -18786, -29152, -22830, -19690, -9462, -16781, -21914, -10156, -4946, 10005, 11776, 18733, 21162, 16793, 15802, -1783, -8705, -16624, -22785, -13112, -7099, -15679, -16569, -7580, 13543, 20083, 19196, 9368, 19039, 8577, 1512, 10128, 3254, 8324, 3531, -7835, -18372, -4483, -7462, -11197, -3079, -321, -2760, 10812, 7224, 6454, 1500, -11278, -2712, 10351, 10439, -851, -13980, -658, 13545, 6888, -9788, -17566, -11071, -14442, -21837, -17524, -22162, -7053, 3503, 1038, -12520, -21406, -20532, -17305, -21017, -22302, -22848, -9526, -9221, -15125, -713, 6009, 13946, 26411, 18210, 10219, 22522, 17936, 1176, -13134, 1530, 13738, 15926, 4961, -1392, -3949, 11078, 20124, 12323, 5965, 1503, -6461, -4975, -2818, 14581, 7603, -9931, -10456, 15456, 13289, -6880]
15185f880p763J9268M388O330M770k745l360O299K382J686p837j155k2731k7726
15171c5074N217Q220O277L78l116J2789O783j0953n059J279n368j405J5189J3510
15157H667j577j4656K6134j314O575K263N283K477j3629k027j1077j0172K2067
15144A9014J829j5377O205J7876P29j5375j4680j7311j7723K352K2737K5808m820
15131A1264p201O13j5391R264J8458j7136j2420p818P112K4346J164q687L177
15118F745l376k897m695j8253j016J2341J8373j0733k171J289K765r81j7934j5127
15104c5670K594J8904J2905J4282L336j557L888j0160O961o07O543k303L911J227
15090B4254j3338J177O214M644r548o055p505j4533o676n39R843O494J7338J0294
$$ y = [-6880, -14643, 4625, 9013, 15343, 20113, 17368, 14008, 20307, 22689, 24375, 16538, 15383, -7348, -35074, -29857, -21637, -15360, -14982, -18098, -5309, 1474, -9479, -14538, -13259, -18627, -20032, -4843, 8667, 7090, -7566, 18568, 17254, 23829, 26092, 31375, 33852, 20223, 18196, 7119, -3053, 19014, 20843, 5466, 11671, 29547, 30276, 14901, 221, -17090, -34813, -32461, -9724, 16084, 11264, 4063, 4676, -10715, -1451, 17007, -129, -12549, -20367, -13255, 11091, 12255, 3568, 6745, 3369, 472, -4223, -22476, -23492, -11151, 7222, -3511, -5682, -4393, -1628, -2609, -20543, -35670, -33076, -14172, -1267, 13015, 16351, 14794, 18682, 8522, 15483, 14876, 21419, 19116, 23027, 24254, 10916, 12093, 18307, 22951, 13403, 7348, -157, -14690, -21366, -21905, -12062, -5568, 11770, 22064]
15076B2064j2475j889j0234j598M367l14l89p45N972R768k447j2194n122j721
15062f957q24R801N491r906j62J29K146o7L217J894J6316p425j4165k456o435
15047i403k520q039j2656P806O07l722J86K5516k337m084J567J7152j7454J114
15033f267J4798r697J1663J0385m382P071M97R956j2455r069P562P923J1364n602
15019C3747o639j1545o901j5697q359R06K652J3645P018k836R894Q014J8130r777
15005C2252j3303l538L606J4505q223j8327m615Q40P881J7108j193k165J106o721
14991A9213k394o829L613j6867K666J1818M836l55N367N779j0742j2052m401P547
14977G199J7375J4920k5121l0159l771R409q395K275R135J2784J1100p215J709
$$ y = [22064, 9589, 7700, -2534, -4132, 235, -79, -468, -1213, 4759, 14527, 12080, -114, -5236, -6957, -7781, 2020, 7511, -2395, -2557, -2428, -282, -349, 2868, 4762, 21078, 13653, -512, -2968, -9403, -11923, -19962, -32618, -24812, -24205, -27927, -27741, -2225, -4562, -8646, -7079, 10073, -7381, -6267, 8531, -1166, 10497, 20882, 16500, 23571, 24068, 34024, 21569, 12500, 20062, 27985, 39349, 33747, 27108, 15563, 8662, -7035, -15394, -14488, -11836, 1809, 8827, 5991, 15885, 23899, 42029, 32252, 18949, 15411, 19017, 33522, 25299, 6972, 2357, 3197, 11078, 28186, 26993, 24828, 25934, 19213, 16819, 9990, 13603, -3264, -598, 11220, 16056, 15701, 21068, 26847, 16105, 4053, -348, 7199, 24574, 39494, 14373, -15786, -19557, -10148, -18543, -16268, -7133, 5651, 16751, 9536, 11245]
14964A1245n113L185o765j2912j2126O743J4403M763q400q311Q188K085R499L214
14950I698l69n808p444J75j2452J126J9861n865j0372k0529n606J1061J0236P700
14936h588J5005K022j1792k469M300Q707j8629r554O599K0176J1473O023l350
14923A9923j0006P012J4893m385m451n098k2706J1335l26n524j6508k235P109
14910a0967j6118j2669J1720J0178m737m889J5069K1060j5102k3927m071J2704
14898b1749J0417q957J760K36j2016J9966K0030j1408j5372l700J049L488l032
14885a9288M626R239Q445L551o062L926K4864k477j2117p373j071K753R862K0291
14871C9169l9428k9947J1638M381J50p043R233j229J2165L674O877l418L048j6321
$$ y = [11245, 6132, 9317, 2552, -10360, -22486, -15743, -1340, 3423, -4977, -13288, -5100, -3015, 6484, 9698, 9329, 3521, -3923, -3748, -16200, -15074, 4787, -1078, -11450, -31979, -37585, -26524, -16288, -8588, 6417, 8439, -3353, -5822, -1522, 7185, -11444, -20998, -14399, 5777, 17250, 23273, 19923, 9917, 16929, 31822, 27437, 22986, 17888, -4818, 6517, 6191, 667, -15841, -18076, -10967, -27085, -39754, -28034, -17856, -22593, -27482, -12413, 8647, -6455, -30382, -34453, -21749, -11332, -20289, -18529, -18293, -30309, -10343, 9687, -1721, -17093, -20793, -19744, -16256, -19288, -14662, -5423, 3022, 6573, 511, 4437, 29301, 26824, 14707, 7334, 6263, 9016, 18878, 39169, -259, -30206, -18568, -14187, -14037, -21080, -11847, -13076, -911, 2763, 9640, 6222, 9270, -7051]
14857g051M488K2630L795j4744j0415K1585K5585j9428j0759J3153L724J0703
14845D3266l703j8002q723J1858J509k1402L835j599L516Q830j849k1404j0309
14832a4177q351K2557k010q185j771O433J0046N373L352J716J1255J469m350k6010
14818b653J222k615l384j3215M463J5540R697p517K9J079n514R527Q116j3797
14804I78l783N835J4600l968j2675l220K484M132J2288j2763q151m370j1570J1659
14790h524j165n900j651K4697Q749J419j2909M788l962j2325p820j374M967O093
14776d917O751J6055M98j2886o720k007J6888o28J0473K962j5879k6660l267J2176
14762g161N453j349R158j384j4393J6975J10J978J5242k0062j6599K4178J9947
$$ y = [-7051, -2563, 20067, 23862, 9118, -1297, 20288, 45873, 26445, 15686, 28839, 32563, 43266, 39563, 21561, 12838, 24696, 26205, 4803, 8638, 7039, 10555, 19385, 17536, -3868, -14177, -22528, 29, -1981, -10166, -11937, -5504, 4542, 9915, 13267, 14983, 26238, 27707, 23357, -2653, -1431, -4046, -7430, -20645, -16182, -642, 9055, 1538, 1567, 2646, -2868, 6659, 14775, 978, -2805, 3030, 17630, 13662, 987, -2233, 251, 4383, 16671, 3908, -4243, -8613, -20183, -8524, -9689, -15589, -17240, 7457, 16206, 17625, 4716, 9504, 5542, -6783, -14603, -15977, -11010, -4917, 1834, 17889, 18387, 5501, -1219, -3226, 13662, 13034, 23507, 26469, 10590, -16070, -19337, -7161, -1708, -3057, 6101, 4717, -9676, 7299, 7409, 9387, 24629, 4567, -12032, 12146, 32093]
14749C2093q675m823o834J409j8560j8124K763r960m810J7682r55o957J6932l290
14735a2109j0500J6644J7209M745m960q435m196L090J0564m083p897J3J1149J4534
14721B5768j383j5209J5214j1572j4616p70J1935O035N439J4407o085j7415j2657
14708i09q939P364J890Q421o006o795N569m588k862K3225m787q691j104n334J075
14693b471R066J0028k903m666L273q345k1168j0368n6J2089K4233J8643O668k227
14679C1796j2186j3852O146N744J469j1466j4181m107P433q281m409O818J4818
14666E742J8864J2219j7122k0935j0443N805K1286n249N792m457j2253n152K221
14653c682k072j2339j0358N648k642j64o523P939K343J320r0j753K3867J2215
$$ y = [32093, 23418, 18595, 11761, 13170, -5390, -23514, -20751, -30711, -35521, -17839, -18794, -25751, -8819, -12109, -22609, -5965, 11244, 15989, 11029, 2594, -1602, 1488, 12052, 7969, 72, 85, 11234, 25768, 24385, 9176, 24390, 12818, -1798, -2568, 9367, 15402, 20841, 35248, 29163, 11748, -909, -9848, -2484, -594, 7827, 1821, -4974, 595, -3993, -6855, 16370, 11583, 2892, 1788, -3546, -2471, 6595, 16623, 13720, 9054, 12327, 3982, -17186, -27554, -27610, -15521, 8712, 27355, 34023, 31796, 19610, 5758, 11904, 17648, 19117, 7651, -6530, -10637, -3204, -11485, -15894, -9076, 5742, 24606, 36825, 19703, -1232, -11675, -5870, 15416, 10167, 15959, 11502, -751, -5903, -3682, -5754, -18093, -28451, -22803, -25445, -25609, -32132, -24193, -21850, -20530, -20620, -22373, 1494, 13709]
14639A3709j1001o197R325Q254o906k5700O16R020l350O193J246J3486j1532m696
14625g533K3558j236r204q640q81K395j2445r202M717K0162J0540J5655j4206
14612A3680k162K0049l677j5486n490Q3k044q292o009j0226j916j8228R66J3892
14598b4860j0330O386J6477R726J7344q982o504M31Q417o325j3121L753R666J215
14584C293j5771P974J0676j0900K642r096q485O483J2096k009o246k510N816r154
14570a5191K469J5607N670j6639j1785K59M553q951J0842J3149O176N187r787
14557A559n081p163r890k174O678K5081K120o576M949Q375j778J288j2301l822
14543A265j4012J916K7422J2027m580l092k244J895K5108O033j4862l3920k9860
$$ y = [13709, 2708, -3489, 5836, 14090, 7184, -18516, -17900, -8880, -12230, -6037, -4791, 8695, -2837, -7533, 16025, 14789, 5585, -3055, -3936, -1541, -13986, -23188, -18471, 1691, 12231, 27886, 13680, 11518, 31567, 27890, 12404, 6914, 6997, 4953, -3339, -9348, -19574, -21490, -39718, -38752, -24860, -35190, -28804, -12327, -2601, 14743, 5761, -743, -312, 8105, 1780, -11341, -7588, 2078, 3293, -12478, -4504, 6172, -4728, -2086, -11182, -19667, -13184, -1088, -3097, -9343, -11853, -6037, -15191, -12722, 2885, 8555, -8084, -19869, -19610, -15057, -24008, -13166, -17, 6159, 11346, 1559, -3522, -10685, -20575, -22749, -16071, 9010, 11130, 4554, 9503, 17878, 16100, 17388, 5087, 1265, -12747, -10831, 16591, 28618, 24038, 20946, 18702, 20597, 45705, 51738, 36876, 2956, -26904]
14530b6904L850J3758n341J315J796Q040J2360O263N332L648n931l3057Q960Q606
14516B695j9890r467J0042K4166k314j1474L0129J2536j0379p585k947j6192k819
14503c499o636m527j3915J1537L936r568r222R253J9376L487N448k094q007l972
14489h403m138r480j091L3616M933m43P379o775j1101J1355O668m195j395p183
14475I747l283m683J3864k018r657K28o08k776K412K0084j2232j7145l1840j3351
14461e1258J6818O799K122K136J5159L206J3260M230k092J0787l128j1071m039
14448B929J4552l732p824M452Q806l240L574K723M292j4363n037m82J8314j1614
14434A3350k0653j2782n686O805J1333K4432L162j2607M392L502J121j9582j5820
$$ y = [-26904, -23054, -9296, -14637, -13322, -11526, -3486, 8874, 15137, 20469, 24117, 18186, -14871, -5911, 2695, -17195, -26662, -16620, 7546, 5232, -6242, 23887, 36423, 26044, 18459, 15512, -680, -3499, -10135, -14662, -28577, -17040, -13104, -22672, -31894, -22641, -3265, 222, 5670, 3576, -4431, -8403, -12541, -22021, -23112, 10504, 15437, 14994, 22373, 15598, 4497, 15852, 22520, 18325, 16930, 9747, 6464, 1781, 15645, 13627, 3970, 4198, 3590, 814, 3226, 23310, 11078, -6067, -37907, -51258, -34440, -27641, -25519, -23383, -8224, -5018, 8242, 12472, 10380, 21167, 18039, 6968, 2929, 17481, 13749, 5925, 10377, 19183, 15943, 19517, 22240, 26532, 12169, 7132, 6650, 24964, 13350, -7303, -20085, -25771, -18966, -7633, 16799, 19961, 7354, 11746, 15248, 16369, -3213, -19033]
14421a9033k763R206P352q672k572K479J1112R363j5660M967J2999l62j6094K318
14407e360J1251J7200k296M38k3381P715J6952J781O714N328j0806k4480Q555
14394I611K3470o069k3783L710J0197k2786k743o069R353j401o583L0571J4022
14381C1500j387l437N63k3431n342n106k867J7326J1844P866j7782j7476k23P245
14367g07J8112N669q288j9630O363l829r447L380O969o73j6783P019R622j1391
14353a3614l660K819q65J237Q932K4770p837p687r093j6872p121O969J0623J6486
14339E087p846L820p543j6162l882J2492P653J7855n390j3096Q10O35L99P767
14325B599O934r747l07p032Q854O877K0518P00j8342k0878m186j244P006K0507
$$ y = [-19033, -21796, -12590, -5238, -13910, -16482, -14003, -2891, 6472, -9188, -4221, 8778, 8416, -7678, -5360, 5891, 23091, 20795, 21233, -2148, 5567, 22519, 24300, 31014, 36342, 25536, 1056, 9611, 33081, 27012, 3229, 6939, 17136, -5650, -8393, -14462, -5109, -6510, -13093, 17478, 31500, 30113, 26676, 27239, 3808, -1534, -6640, -9507, 7819, 19663, 27529, 9747, -7729, -7952, -707, 17405, 23074, 14786, -4844, 1519, -2310, -11757, -8377, -1408, -2081, -18864, -11845, -2223, -13614, -17274, -14455, -15320, -14083, -5151, 19619, 11782, 4095, -4998, -21870, -28991, -22022, -11399, 5087, -2759, 1061, -6482, -22644, -26526, -14034, -6381, 11474, 6084, -7012, -6202, -5567, -5168, 2599, 9533, -214, -521, -7553, 1301, 8178, 28696, 29396, 11054, -9824, -14010, -15254, -8248, 12259]
14311A2259o212j4484P540J2814K36m234P585j7495k4133R545O65J4137J1041
14298I264p813r001J039J0029k80N941j5210p349P526k280r899J524J9364q511
14284e656m651J6810J1155p269j6061R577N711L065j1039k743o447J5166k015
14271E603j7780q172J9220J0495L077M096q355k4567j755Q369K016l444J402P455
14257b340J3736o044j6715l760J5739k462j7240j7007L327J4402O429L411J9667
14244A1143O854K135j2932n241Q732N20R769N600j5879j2664k384J3414O348r454
14230E961o257N132R351j5406o371j506r342j472P417k850Q73P779R209P228M131
14215A3877p973l221q482J0994L083o004j2741r598j3896O554J056Q473J2966
$$ y = [12259, 6047, -8437, -897, 11917, 12153, 7919, 15504, -1991, -26124, -16579, -15914, -1777, 9264, 1451, -7550, -6511, 3518, 3238, 9179, -6031, -13380, -5854, -8134, -18033, -16509, 2855, -5656, -10307, 6503, 17658, 10389, -5672, 3905, 9616, 12681, 1642, -1101, -7548, 7618, 5603, -12177, -20349, -1129, 9366, 12443, 16539, 8184, -16383, -18138, -9769, -7753, -11197, -9795, -2340, 11396, 5352, -11363, -15123, 616, -1846, -19086, -36093, -32766, -18364, -11935, -8524, 11143, 17997, 20132, 7200, 1959, 10691, 11211, 20980, 26580, 10701, -1963, -4347, 9067, 15415, 5961, -296, 4836, 14187, -1219, -7590, -9096, -18438, -19910, -12493, -15343, -14470, -6691, 2518, 9746, 13877, 5904, 2683, -5799, 5195, 8278, 2274, -10467, -20065, -33961, -27407, -26351, -17878, -4912]
14202d912M458m509j302N858J1186K0570M171q831k6587q269N501k07r930J5M431
14187h357j0916M171J4036p825l54n921J1753q03L508k18J5497R596k4203k3142
14173b3178L465Q456J5811q128Q446R480j4052p768j2289j6917L881J6598q869
14160b5064j2728K497R535K1124J8846J1897J333o160j3493k6749K644J8627L881
14147F190p356L93o096J4465l590l866j9344k739J8059J5164l352r967j2175l0
14133a4244n141J5007P752r202k67K5408Q707j2042j180J0433n868j1942k0253
14120a2832l132j5923N595J7323K6384k946q487j6606k403J1139k856j303P353
14107A306O22J037R139l467M221K388J977q34k257j3702j00R643k476j4328j8623
$$ y = [-4912, -454, -4963, -6265, -407, 10779, 31349, 35520, 26689, 102, -8167, -2666, -2873, -12803, -12788, -8357, -19273, -15102, -1066, -8891, -9245, -15166, -3413, -4216, -708, -926, 14571, 24167, -36, -23178, -19713, -11257, 4554, -3574, 4872, 14352, 300, -7468, -19757, -36674, -32793, -16195, -25064, -37792, -35295, -25760, -4636, 14210, 26107, 27440, 21280, 7787, -18962, -16318, 2309, 6190, -1166, -773, -6869, 7596, 4006, 140, -19204, -21943, -3884, 11280, 7928, -2039, -14214, -14244, -19385, -4378, 3374, -5828, -6095, 19313, 28020, 15978, 14798, 25231, 19363, 7421, -12832, -15964, -31887, -26292, -8969, 17415, 14469, 5982, -10624, -13027, -1888, -4744, -6047, 1306, 1928, 2965, 12104, 8637, 12858, 15246, 17223, 16389, 14132, 430, 330, 9973, 7497, -6831, -25454]
14092b5454R12J2337J1020P886K009p397Q928j1534p634R910M172L023J8052J4024
14078D0254j3360j2476r529j5243Q402l484k273q75K3383l78n745k0108k0986
14065c2418J6362K5843R162k3293r350m250J6246R245N011k1346o004P843O77
14052f272J3921K0057O953j4007j9909j1983L164J0542M424K310j899J330P984
14039A6615M671q618O281K644j7308P251K524k6708n457J26j1264P915k146J3757
14025i717Q611M138m125M400N375n357O877k77P381p859n077j2053L240K498J0220
14010H275N78J2427j4280l762J0975M737J1328r772j7694j3321L546L54J4687
13997H078j2838j7139O732n996j132Q024K7172J5262j0867k5897p139P128J2373
$$ y = [-25454, -24542, -12205, -1185, 6701, 8710, 1313, 10241, -1293, -8927, 983, 5155, 8178, 26230, 40254, 26894, 14418, 4889, -10354, -1952, -5436, -7709, -8584, 14799, 14421, 8676, -11432, -32418, -16056, 9787, 18949, -4344, -13694, -17944, -1698, 7547, 12558, -8788, -14792, -6949, -6272, 7649, 27706, 34659, 20652, 743, -11240, -8076, 2466, 6890, 9200, 7301, 8631, 16615, 21286, 12668, 18949, 21593, 4285, 11536, 14060, -12648, -18105, -17979, -29243, -21328, -23474, -9717, -1106, 3032, -1093, 3307, 8682, 3325, 10202, 9925, 17306, 9447, 4370, -7683, -4443, -1945, 8275, 8853, 21280, 7000, 3238, 14213, 18950, 30278, 20506, 2812, -10509, -6963, -6609, 8078, -4760, -21899, -15167, -21163, -22295, -14271, 12901, 28163, 17296, -8601, -15740, -8612, 3761]
13984C761R442p899j4196J341J5307n715o394m627j4435J3347K6219j0511j1586
13971e946L586M813k782k632j0436k004J920j418n21J2480N077L741P110r606
13957C382j4733j501P882r466j6195m299J4173o137j3427J0087N005p394m954
13944c7577J665J4129Q550O618L345k700p440J1140P541O394j121p165j3587R756
13930d52P004l000p627j4887K34J0930Q575R11P971L472k4530n278q7l658j4992
13915c5414J2253K0996O556j3573K426J1398j355N142j2154j0749P497J377O890
13902A290o670j5555M030J2923J1681k037L153J428m602Q775K413K899j6180J475
13888E023J2044J0827J35N982p407j9741j796P448m384j1330M181j0808m411j0973
$$ y = [3761, 13203, 5304, -8892, -7551, 7756, 2041, -4353, -8980, -23415, -10068, 16151, 5640, -5946, -2360, 2453, -329, -2961, -13397, -15401, -13481, -14899, -15420, -2940, 2137, 5878, 12988, 3382, -11351, -12852, -4970, -14436, -30631, -34930, -20757, -26894, -40321, -30234, -25229, -32623, -37577, -35912, -21783, -13233, -6615, -3270, -5970, -13410, -2270, 5271, 11665, 10544, 3379, -10208, -452, 6552, 3552, -4075, -18962, -18728, -7798, 777, 1688, 9659, 13131, -11399, -16677, -16764, -20422, -35414, -23161, -2165, 4391, -9182, -6756, 4642, 3287, 8429, -3725, -14474, -6977, -5600, 1290, -5380, -20935, -16905, -3982, 7699, 5662, 8815, 10243, 5641, 14416, 16829, 19728, 3548, 5023, 17067, 27894, 28029, 34011, 26604, 6863, 5067, 12515, 8131, -3199, 982, -9826, -14237, -25210]
13874b5210l466O190J5420J971r997l560k0189L128L3463K0898o795j0273M002
13861E582J304K301M887k0213j8348M376J7706J0305K10J523j5342p598Q966J339
13847c002J340l916m361M24N099q713N019O540L494j545m054L274J1579m416j1931
13832e169r881P248M492P781R773j4406k173J564N454j7880k959J0910M627J789
13818A170K4579J1824N586J768k8558k0532R280j4021Q006L964r749MQ959R753
13804A2033j4274k1110j4465M684J2823O598j4402p46J4960J0035Q390P17p461
13791b218p942n53l099j365O094n978J4231j586l589J0846N606K026J0591j97
13777B2867j15N47M613p206j0976k038J5651N297j2886l338J6384n38j1072J1640
$$ y = [-25210, -28676, -22486, -7066, -5095, -15092, -18652, -38841, -35713, -2250, 18648, 11853, 1580, 5582, 6886, 9187, 14074, -6139, -24487, -20111, -2405, 7900, 8110, 9633, -5709, -13307, -4341, -3002, -1662, -5578, -9939, -9515, -4416, -13129, -8110, -1570, 1924, 379, -3675, -401, 11178, 6762, -5169, -15050, -7802, -3310, 4471, 14244, -162, -2335, -771, 4683, -13197, -16156, -5246, -619, 1170, 25749, 37573, 43159, 44927, 16369, -4163, 5117, -8904, -898, 3066, -6683, -6679, 2280, 12033, -2241, -23351, -37816, -33132, -20309, -13711, -28113, -28859, -13899, -3864, 4526, 5243, -2218, -10160, -10713, -13812, -15177, -9083, -15061, -830, -2416, -6005, 4841, 10447, 12473, 23064, 22867, 22752, 23299, 27912, 20706, 9730, 7692, 23343, 28640, 15754, 12416, 28800, 28262, 17190, 28830]
13763B8830r165n414m958K668K226J574L37p398l831k0168L174J526j2P780j442
13748d273L2O756J2336J7609l863J913k022j0781L306l416L144m905m990r969
13734H77m752Q026L500J34N491k505m155p055J128Q360n975N442m252j7114J4539
13719A689O784k925K585N817J1419R8o536r692m295J0279j5916j0039J2645l315
13705a402P81o73O122k3187k4118R968J1291R564O107J0855L700N007P987q741
13691A3261k7840j6557J3318M974q209k843J0993O921J0427k616K8457K7926o435
13678E1777r449j4635j5909j1276k1421p598j68J0568J7261O367J2842m447j3613
13665B99r730j012r523o818O486R332Q32q032N67N347J575j0554P1M000l193J8167
$$ y = [28830, 19665, 14251, 9293, 11961, 14187, 15761, 16098, 8700, 4869, -15299, -12125, -10599, -10611, -2831, -4273, -4241, 2515, 14851, 32460, 28597, 30510, 28488, 17707, 21013, 17597, 20741, 15836, 10846, 877, -3875, 4151, 7651, 7785, 13276, 10771, 6616, -439, 689, 9049, 3074, 8516, 4264, -12850, 1689, 8473, 5548, 8133, 13950, 25369, 25467, 18931, 9239, 4944, 15223, -693, -10732, 1913, -1402, -621, -1294, 4828, -18359, -42477, -32509, -21218, -11654, -5547, 5308, 9008, 14015, 22002, 13261, -14579, -31136, -17818, -12844, -21053, -23896, -12903, -5982, 4445, 1829, 30286, 58212, 51777, 42328, 27693, 11784, 508, -20913, -28511, -28679, -18111, -850, 5517, 18359, 13912, 299, -9431, -10443, -19966, -26784, -20298, -10966, -10134, -18166, -17599, -12252, -10677, -21231, -21160, -17160, -20353, -2186]
13649b186J4299N316l807L609k2214J874K2441J0688k6674j9461P4L56J351K8815
13635A4481P120l162o321M487J538Q590p564p316l235M074K29J1705P486j4908
13621A7204j2193m421N386l152J3907r621J8352q276k8304k3803K3802K3734p942
13608D673k2101p884J5562J2534k517n946r471J1888K1037J1409Q799K723n752
13595C4954l9933k086J5242n38j5864n964O317j052L525K914r576o696R563J4555
13581E361K118l39J3646n643p424M568J316j0776k356n402L851j3471O34L4531
13567B0614Q276j3631o498J0632p698o785K845O878K899n152Q115O709q550l05
13553A8349L768j2064r488R059P46K15q424p252k2372O977P69j174l859j8269
$$ y = [-2186, 12113, 17429, 13622, 17231, -4983, -3109, 19332, 30020, 3346, -16115, -16041, -15685, -14334, 14481, 21601, 18439, 12118, 16605, 18143, 26733, 19169, 11853, 8618, 12692, 12921, 24626, 32112, 17204, 5011, 590, 5976, 2824, 16731, 7110, 25462, 17186, -11118, -34921, -11119, 12615, 4673, -17428, -25312, -9750, 2784, 267, -5679, -15150, -3262, 17775, 29184, 37983, 40706, 34954, -4979, -7065, 8177, 7639, -8225, -14189, -7872, -8924, -5399, -2485, -12061, -18757, -9194, 5361, 7479, 7140, 20786, 15143, 7719, 12287, 13603, 2827, 471, -4931, -1080, -14551, -13917, 20614, 28890, 15259, 8761, 19393, 11695, 4910, 7755, 14633, 17532, 12380, 20495, 27204, 18654, 18349, 22117, 10053, 565, 9624, 10370, 10585, 2161, -5091, -27463, -20486, -19717, -20891, -24750, -43019]
13539d3019m4L1075J4975p280J9237M033k0921P46R521J3495J630p922j0618J4293
13525A9201J75m163j9853o562J21O489K3155R058k1427k708l854j1025J3798J0288
13511A2693L389m724p708m279R022l037O632R88m176p110p51r52q642j5878k1294
13496d5827J225q985J4066J2568N631l888j6907J293P881K1659m80M879j451j2311
13482b0647L82j0809m392J6264P65J1098j6160k458n060J5597R180n916J8365
13469F209J6065j0879k0026m188M437p372K1851L17K816O247j4827j2510O85m96
13455a1671o041N000P127N798r323j6768j6164J7783K5049J1101J7663M55j5184
13442A4825j5457J1264p604j4519n26k956J2479J163j9751j7061K0954L6012n378
$$ y = [-43019, -43063, -11988, 2987, -4293, 14944, 18977, -1944, -1198, 8323, 21818, 23448, 15526, 4908, 19201, 19376, 15213, -4640, -11202, -11081, -4592, 18563, 27621, 6194, 3486, -368, -11393, 2405, 12693, 16082, 11358, 3650, -629, 8393, 5356, 11988, 12976, 8800, 1690, 939, -13, -8655, -24533, -45827, -44602, -53587, -39521, -26953, -21322, -25210, -42117, -40824, -32943, -11284, -11764, -6885, -8336, -20647, -20265, -31074, -35466, -19202, -18437, -7339, -23499, -25957, -31017, -15420, -6240, -12156, 6209, 22274, 11395, -8631, -12819, -8382, -15754, 6097, 6414, 9230, 15477, 650, -11860, -11175, -11671, -17712, -12712, -5585, 213, -9110, -25878, -42042, -24259, 790, 11891, 29554, 30009, 14825, -632, 10632, 3028, -11491, -12017, -14973, -2494, -1331, -21082, -38143, -17189, 18823, 13445]
13429A3445p054j1927J1765o726k3489J3252J5526K275j131j5777p308j932m510
13416b3591n590m95R379J7004J8542M53k0016j1862M572R905k444J389R670o612
13402C04N060O660P71o018j2711L010K415l682K267j82J0030r166l525k25R527
13387D535J716j3588k509j0415Q884P822j8500J0378J7629O984J1342j6321o647
13374A310J0075K5350J6260l0887l481o738j6776j2828k304J7822P342m357j2475
13361a1687n149J3540J0845J5489J1844j5938k449j6709n879O010l67o280j6133
13348b2863R870L76M212J1438R515R703j6646n506J6858L478j1793K096j4898
13335d160p793Q224K4461J0180K416l79o08L34j0201k0282p538o379P083L630
$$ y = [13445, 6391, -5536, 6229, -497, -23986, -10734, 4792, 7067, 5936, -9841, -17149, -19081, -23591, -29181, -29676, -20297, -3293, 15249, 15702, -4314, -16176, -11604, -1699, -4143, -2754, 6916, 304, 5364, 12024, 12795, 6777, -5934, -2924, -509, -4191, -1924, -2106, 7924, -1242, -4767, -4992, 4535, 6251, -7337, -9846, -20261, -11377, -3555, -22055, -11677, 5952, 12936, 24278, 7957, 1310, 11385, 36735, 52995, 22108, 18627, 11889, -4887, -17715, -20019, -2197, 5145, 788, -11687, -16836, -3296, 7549, 23038, 34882, 18944, 16495, -214, -6093, -83, -450, -6730, -22863, -12993, -12617, -8405, 3033, 12548, 22251, 5605, 99, 16957, 20435, 8642, 10738, -4160, -11953, -3729, 20732, 30912, 33328, 32949, 32341, 32675, 22474, 2192, -5346, -11725, -4642, -1012]
13321a012j5156j8559M707K5480l056j700k812J6854K116N865M909P451r822j3617
13307A648J6205j02J149j9715K938J6607j2854j1558l387p715P481j739O627O585
13293B170L23l350j3540O326J2539j004k0087j4278J450M392O705J3630K1562
13280A6838J2995j7141J828J7508O471j2679O492j1644k3403K169J397J36O84
13267A651M548r319j6965J196Q58n421J9651K1292K330p206k778j5567j1616J0387
13253f959k029L930J5141j1187o854J0625j634J63o505N28P235N002M429n341
13239F544m994J890j6966J1821J789m450l689K433n554R557J5793q288N191J6890
13225B7967o302q211j3138q670k093J3677n47M710K642j0126j4924k3607n784
$$ y = [-1012, -16168, -34727, -30020, -4540, -7596, -9296, -12108, 4746, 6862, 12727, 17636, 25087, 15265, 1648, 17853, 17751, 18900, -815, 2123, 18730, 5876, -5682, -9069, -16784, -9303, -11042, -4415, 2170, 2493, -857, -14397, -8071, 4468, 3464, -16623, -30901, -29451, -25059, -18354, -4724, 16838, 29833, 12692, 14520, 32028, 38499, 25820, 32312, 20668, -2735, -566, 831, 967, 1651, 6199, -3120, -20085, -18889, -18031, -23452, -3801, 17491, 19821, 12615, 9837, -5730, -17346, -6959, -8988, -5058, 10083, -1104, -7958, 2667, 1033, 1196, -5309, -4781, 2454, 7456, 11885, 6544, 1550, 3440, -13526, -1705, 84, -4366, -8055, -5622, -11176, -1619, 14174, 5886, 11077, 27967, 21665, 13454, 316, -8354, -10447, 3230, 2683, 7393, 10035, -91, -15015, -38622, -44406]
13212d4406J8127R794o611j202P950r196k475O045Q892J859q631l114J2783o786
13198a6971o45J6895K0095n458K725o772n313L336J531N964r735o39j0461m568
13184a0016K032k993j5939K1021J6054m907N207J106J3528K992j5270q527M176
13171H464J918k390L281r50m685R151m694J8066J7438j2538j2107J1098o442j1253
13157A4357K817p428J0519K343r621j0814J7616j5515j0435J8164J1061l691L549
13144B2922k1762P20J5564J0541j7501l593k6782m154L768J6314l241N903J1349
13131A0048l659ll737J0107J4363R112r62j5117k812l094O11m582o388J1245k839
13116A2293O625J719o021K454p47l651q155q471J2755L337l615j6876r844J5354
$$ y = [-44406, -26279, -16485, -23096, -24298, -16348, -25544, -28019, -21974, -13082, -11223, -19854, -22968, -10185, -16971, -17616, -721, 19374, 13916, 16641, 9869, 4556, 7892, 9423, 15387, 5652, 5013, -5448, -10016, -7984, -10977, -26916, -5895, 10159, 5252, 10459, 11565, 25093, 28085, 12815, 4288, 8464, 10382, 7992, 11273, 10323, 5638, 14789, 10095, 28161, 45599, 33061, 20954, 32052, 25610, 14357, 17174, 9746, 20265, 22608, 12987, 2173, 19789, 4274, -6161, 12003, 23064, 19373, 22922, 1160, 1880, 17444, 27985, 10484, 6891, -19891, -24045, -20277, -3963, -7204, -1301, 10048, 6389, 6386, 2649, 12756, 27119, 36231, 35269, 20152, 17340, 14246, 14857, 10275, 3887, 15132, 12293, 18918, 20637, 14616, 17070, 16323, 12672, 4517, -3954, 8801, 12138, 8523, -8353, -18197, -2843]
13102b843Q248L525j0554P201J3685L478o237k477O116l628j9512r36K2585o801
13088A1850j9052N541J8267j962n623k334L1393j3425j4090j5830J2235J2618
13076A9588l264j0595l732q265j391J3061j229j3832j6565K824N167q270j0164
13063c6667q353J5487R631K329J852K99O717o27L782j1397j43k1418p195J5158
13049c0545M4382N353o234o064j9159P097N312k7431j6621K763N920m3J3162R661
13035a2447J2422N706J0937O195J1709j9609k4477j0455K4245J1210j2638n118
13023b320Q06o283q000J2008J5400O727k2559j0845m41Q381J5144j1258j3762
13010a7002o879j4588J8928K9576L256j547J764O934j844K327l4666j9163l091
$$ y = [-2843, 5405, 8930, -1624, 5577, 19262, 22740, 16503, 14026, 20142, 16514, -2998, -3934, 18651, 11850, -7202, -1661, 16606, 14644, 9021, 6687, 38080, 24655, 10565, -5265, 6970, 19588, 16324, 5729, 1997, -6268, -7659, 5402, 4173, -9659, -26224, -23400, -18233, -26503, -36667, -45020, -29533, -19902, -17573, -15721, -15422, -8705, -9332, -5550, -16947, -17090, -38508, -45703, -30545, 13837, 19190, 12956, 6892, -12267, -5170, 142, -27289, -43910, -41147, -35227, -35270, -22108, -12447, -25, 5681, 16618, 22813, 34522, 14913, -9564, -20019, 4226, 15436, 2798, -2320, -1514, -7797, -15797, -3789, 11611, 18338, -4221, -15066, -15507, -7126, 8018, -3240, -17002, -23881, -38469, -19541, 10035, 13291, 11744, 13508, 20442, 18598, 20925, -13741, -32904, -35995]
12997c5995J5200K5588K1203M885N61k7796j087J4314N64m159L249j8111o022
12984g606o894j0336O862J606O583J490j5056N185K2245R35j4161P523k552K17
12970c959m084j9006j0709N167J0575R344L372j2153Q970K906M42N036K0926M61
12956A7288j9575k754J6963n902j5416R076K5397q942n079j1585p519J3190o452
12943a310j3463O248M677j3998n921J5216P546l616m000J609J0705J673L381q21
12929G926j1967Q597J0094m941j298J881o222L97P554L238J2917j5710k7177K27
12915a4484K7209N657l830l92j5537r805Q276p842O863J8539j1690Q308J1353
12902B2625m565j7129m641r692J0373j410J3211N582P689k243j2565J2179J8981
$$ y = [-35995, -20795, 4793, 25996, 30881, 31442, 3646, 2559, 16873, 17437, 13278, 16527, -1584, -7606, -14500, -24836, -17974, -16368, -9785, -8295, -23351, -18166, 4079, 5014, -9147, -1624, -4176, -3959, -8043, -27049, -37758, -32591, -22016, -12672, -9300, -21453, -12483, -9577, -9135, -4099, 16827, 17288, -2287, -5041, 11922, 6020, -9396, -320, 25077, 16135, 11056, -529, -8048, 5142, -1310, -14773, -8525, -3848, -17846, -23767, -8551, -1005, -4621, -8621, -7012, 3693, 5366, 8747, 7926, -4041, 4556, 14650, 9709, 8411, 10292, 4070, 4467, 12021, 15259, 28176, 12466, -14711, -14484, 12725, 18382, 14552, 14160, -1377, -11182, -2906, -10748, -3885, 14654, 2964, 11272, 22625, 18060, 931, -3710, -13402, -3029, -4439, 8772, 14354, 22043, 19800, 7235, 19414, 38395]
12889C8395m621l682j7736j2390p941P52J807J3274J3295l2044o753P781Q957
12876i06M296P712p400P506q47j8672r432K4470l699K231o516K263K444N623k1848
12861a2775L101r031J000m696M282O873j373P380J3873L55n474l48n671Q008L242
12846H746l415J9106j14j8946o083R934J1196o399j5167p524j223R496K0761k300
12832A8068p298j7185j1364o840Q832K2550J1166j3275M29k805j2253R505K762
12819B292q977j9779m880k57N196J8527Q004j3299j5458j871P045J4058j245J3982
12805C338J3243j5003n237O164k1331j845J8068L840j2492J0899K149k119M419
12792D093M661k0020N942l258j5951P635j3938m399J4433M785J6840Q353o424
$$ y = [38395, 33774, 30092, 12356, -34, -7975, -7223, -5416, 7858, 21153, -10891, -17644, -9863, -906, 3390, 11102, 3702, 11208, 10361, -8311, -17743, 6727, 3028, 5259, -1257, 1006, 3450, 9073, -12775, -9674, -18705, -17705, -22401, -18119, -11246, -12619, -5239, 8634, 8989, 3515, 3167, -2504, 5504, 8746, 5331, 24437, 24323, 5377, -706, 9228, 20424, 14025, -1142, -8666, -9889, -393, 20368, 18068, 10770, -6415, -17779, -24619, -15787, 6763, 17929, 4654, 5083, 2278, -9975, -470, 2292, -6685, -26464, -31344, -31601, -26405, -7878, 126, -13173, -28631, -30502, -23457, -9399, -10644, 3338, 16581, 1578, -3659, 2505, -18826, -20671, -2603, 1237, -11255, -356, 1793, -326, 4093, 8754, -11266, -5324, -8582, -24533, -16898, -30836, -35235, -20802, -16017, 823, 9176, 2752]
12779B752M256j4153k176J1322J1950j1020l4K228j3896j0840J2487L358O466
12766B700n203m610J7990m312J03L351m487j267K0224J2814l2960m373P48o412
12752e694O869j862Q54k1618P422J2553P691R489j2396j2361m063j721k3249p740
12738d5826K0007l678Q727K072J1160J0119R276J528p374n044j5486K5975J6765
12725B8221o889o006M529q808o604n540K0088M201J5623m943j4086j3670k858
12712C258R278j0678k0233J0239P43k0085J037j090k229P181l508J4061K1573
12699I547j427k5130j0869P810j121L684K822J729m443k075Q16J1608J3822K378
12685I151j210J7954j7458j4906K453p275O498Q046J492J1657j77m567j3220J0164
$$ y = [2752, 7008, -7145, -9321, 2001, 13951, 2931, 2897, 5125, -8771, -19611, -7124, -3766, 2700, -2503, -7113, 10877, 6565, 6668, 10019, 5532, 4265, 24489, 37303, 4343, -30, 718, -5694, 1175, -687, 167, -21451, -14029, -1476, 6215, 15704, 3308, -9053, -13116, -14837, -38086, -45826, -25819, -29497, -20770, -18698, -7538, 2581, 11857, 13385, 6011, 967, -14519, 11456, 28221, 21332, 15326, 19855, 11047, 4443, -1097, 18991, 23192, 38815, 33872, 19786, 6116, 3258, 12536, 1858, -18375, -8136, -7393, -27478, -26441, -27531, -29760, -22579, -26087, -12026, 9547, 8120, -17010, -27879, -20069, -21190, -17506, -14684, -12955, -17398, -19473, -18657, -7049, 6773, 9151, 7941, 25895, 8437, -6469, -4016, -11291, -4793, 3253, 4745, 16402, 16225, 11658, -1562, 8602]
12671H602n786Q8K3051Q798r146q584p567O964j534j2707q946R495P495r774J0909
12656A1358K675J149N02Q28j1560j0573J851j24q714K2850Q899j62p276K493k459
12641A1737n771j3094N725k301k0967Q826Q945P482q730l35K0937l569J0606N103
12627B4594N111J813j0161m0166R129R552j7329K289K3106J3179j6274j2498j5983
12614b3638k244J5658M724J2825J0366J94j0053K579m983j0610O596M82n378j1133
12600a4615l551P919Q169L986p00P718l528P045j484j0065k001o072R491q56j8313
12585a6857l326J0245M120N483n358L14Q421L929j3772k1030j0918m374J2746
12572c0377K7361J4155l805j6695l990J818k677J2445O450K610M377p108J0560
$$ y = [8602, 2816, 2904, 25955, 34753, 25607, 17023, 9456, 16420, 14886, 2179, -6767, 2728, 10223, 449, 11358, 14033, 15182, 15684, 16512, 4952, -5621, -3770, -3894, -12608, 10242, 19141, 18979, 11703, 14196, 11737, 5966, -7128, -1403, -3704, -24671, -15845, -6900, 582, -8148, -8483, 12454, 8885, 19491, 24594, 29705, 31518, 21357, -18809, -9680, -128, -17457, -15168, 7938, 21117, 4843, -7655, -23638, -25882, -10224, -5500, 7325, 17691, 17885, 7832, 10411, 5428, -5182, 1414, 1896, -3482, -14615, -18166, -10247, -2078, 1908, 1208, 8926, 5398, 12443, 10959, 894, -1107, -7179, 2312, 1456, -16857, -20183, -9938, -5818, -335, -5693, -5379, 3042, 6971, -6801, -27831, -38749, -43123, -30377, -3016, 11139, 7334, -9361, -13351, -11533, -14210, -1765, 4685, 7295, 11672, 4564, 15124]
12559A5124P439m628m082j7843q520l130n563K195P486J5844l065o358J3276m735
12545C440N743K307m542j7707p83J2244J0857J520q47j909o347R745l507q374
12531A840J0242J6924m465j2035M313l609j5706k270N629N7R903j830p250N308
12517G051Q857k929P927N600k1051k5623j0622P297K02O418J4110O851J982J692
12503G762m746J7466q77n146N548R492L539K227j6159p922J2798p902r077j3616
12489f613k04j909j0835J9125L312p430L065j4626j4120K6142J8713O963k1293
12476B90n220n199J2298J4490m510o401r353J6867R436J4351j6608k5596j9672
12463b4827Q410l696r816R119J3954Q091N145K736l759o203J3794K686j2850k183
$$ y = [15124, 22563, 17935, 13853, -3990, -12510, -15640, -21203, -19008, -11522, 4322, 1257, -5101, 8175, 3440, 9183, 11490, 6948, -10759, -11542, 702, 11559, 13079, 12232, 10323, 3976, 13721, 10214, 1840, 12082, 29006, 24541, 12506, 16819, 13210, -2496, -4766, 863, 920, 10823, 8993, 1743, 7051, 15908, 12979, 20906, 26506, 5455, -20168, -30790, -23493, -23291, -16873, -2763, 4088, 6070, 7762, 3016, 20482, 19605, 14459, 20007, 29499, 33038, 35265, 19106, 11184, 23982, 16080, 7003, -6613, -6817, -8726, -19561, -436, 2876, -4554, -1489, -16115, -30235, -4093, 14620, 21583, 290, -4930, -10129, 2169, 16659, 12149, 5748, -3605, 13262, 22698, 37049, 20441, -5155, -24827, -16417, -20113, -29929, -20810, -6856, 1235, 6380, 9116, 5357, -846, 12948, 15634, 2784, 601]
12449F01J690j1514k962K6598J4763j1083J132l348J9022J2711k6573k2879J654
12436a88j711J6661N554j3784j5641j3789r846k46K2253N333N298m636J0928L75
12422F561l830O316K520K199j804m692J5937J5685j1558j0519l004J3139j281
12409B5669j696j245k2039j5101J4281J3959j570k105k7347k5716n71M425J7881
12396b1175R632k248J779Q788K0921K261mj3684q47M294L659J937L704L294N225
12381B7536j8462j114m021k4950L806J7659j0731r982K977l442J5155J4029j2626
12368d166N042R013k398K280J1755J0181j3454j7983n481M303o706m411n291j0223
12354b7539N172J2343q659m628O394M091r698p277J0687J4467J2663j105j1020
$$ y = [601, 2291, -9223, -12185, 14413, 29176, 18093, 19225, 15877, 34899, 47610, 21037, -1842, -188, -1899, 14762, 20316, 6532, -9109, -22898, -32744, -32990, -10737, -5404, -106, -4742, 6186, 6561, 2731, 9047, 11567, 13766, 11962, 7270, 23207, 38892, 27334, 16815, 13811, 26950, 25669, 23973, 22728, 689, -14412, -131, 13828, 12258, 10153, -17194, -42910, -43481, -39056, -21175, -11543, -13791, -12012, -3224, 17697, 19958, 19954, 6270, 5423, 9717, 13376, 15313, 19017, 22311, 27536, 9074, 7960, 3939, -21011, -17205, 454, -10277, -20259, -17282, -20724, -5569, 8460, -4166, 876, 9889, 7491, 9771, 21526, 31707, 18253, 270, -5211, -908, -7614, -12025, -17316, -27539, -22367, -10024, -18683, -23311, -16917, -12826, -22524, -29801, -19114, -4647, 8016, 6911, -4109]
12341d109q270J0592L1528q953j3046M571L68j2627o246J5525j9128p205p32M767
12327a2965J4684k387O463j163R296K727j8677k030R428K862M964j5596r643p867
12313a9904k670N022Q176J6154o371j7185J3377J2863j869L916J7211K063j0890
12300A9893k5876k170O830k817M145P043J0591m822j3082q447M603K361K232j0120
12286i636k0530j010j0665J3374K4551J6385M947j3298q971r437K984M344J5692
12273H730J0444j775n666j4252p910J4690K2070J8250l550m752N513j7535n434
12260A8823q334K183j7020M287J0389J5056m935n407k2376j0007q066J4706R930
12247g71P655K2431J861j3220p740K248R454K165m416k0036j5129N579J317J6554
$$ y = [-4109, -12379, -1787, 29741, 20788, 7742, 12313, 12681, 54, -6192, 9333, -9795, -17000, -17732, -12965, 1719, -668, 5795, 4632, 13928, 16655, -2022, -4052, 5376, 8238, 13202, -2394, -12037, -19904, -22574, -17552, -9376, 6778, 407, -16778, -3401, 9462, 7593, 11509, 28720, 30783, 19893, -5983, -8153, -1323, -4140, 5, 7048, 17639, 12817, -265, -8712, -4109, -1748, 484, -9636, -30166, -31176, -41841, -28467, -3916, 12469, 17416, 4118, -4853, -14290, -11306, -6962, 8730, 19174, 17399, 11733, -2519, -10429, 4261, 26331, 44581, 41031, 36279, 41792, 24257, 18823, 10489, 12672, -4348, -61, 10328, 25384, 20449, 15042, -7334, -17341, -25407, -10701, -771, 6884, 29315, 31176, 17956, 10216, 12464, 21918, 24083, 19667, -369, -15498, -9919, -8602, 7952]
12233G952P49k118R641k599r225P174J0095o470j2642j1495N390L816M070n903
12219a565k20k281K4335q100k586n465j390K889J0658Q228L673k8836M268J463
12205E071N111O842m303L316o16L282k443j3166k128l677N971L033o483m24n145
12190e759R42l858o64J9580q399J455Q056l235l575j226O191N586j2297j1047
12176h250M10r185L102m60J1443M117q031J1536J158j2509j0281l886J8513L1088
12162B8765k801j3079k827j1252p016m144j3591p976l848K2623J5713p74j0881
12149a1088P991r022j180J3973K6777R471j0076k1373j1743j0218J916K1362j719
12136E071k090M846J7461p485p570j9824j4859k19N466L69J7325J4894J2163J7426
$$ y = [7952, 8701, 6583, 16224, 13625, 4400, 11574, 21669, 15199, 2557, -8938, -3548, 268, 4338, -1565, -1785, -4066, 20269, 12169, 9583, 4118, 2728, 5617, 16275, 24503, 28176, -660, 3608, 5071, 10182, 17024, 12721, 16037, 15421, 18703, 16260, 3094, 966, -2711, 3260, 6293, -190, -614, -5759, -4817, -8675, -9339, 10241, 1842, 3297, 11353, 8118, 4543, 3317, 9508, 15094, 2797, -8250, -7840, -17025, -13923, -14383, -2940, 1177, -6854, 4682, 5840, -6669, -16950, -20836, -2323, 28765, 25964, 12885, 10058, -1194, -8210, -12354, -25945, -33921, -37769, -15146, 567, -207, -11088, -3097, -12119, -13299, 674, 27451, 36922, 26846, 5473, -6270, -16488, -14572, 6790, 5071, 2981, 7827, 25288, 17803, 10233, -9591, -24450, -24669, -19203, -18834, -1509, 13385, 25548, 42974]
12122D2974o227J183k1303n317j2784P847J4754K0184j022j7547n860M163k1691
12109f46l730Q107j942p701J638j0611P867J5607K1295j0197j3768o624L988J549
12095D832N177M827j3477J797Q53j2657L185r58J3189P477j048P129q754j5687
12081d115j7080K052J6788L90J2551N977Q109q58j0053R282n548n415l29j0415
12067A336j928J9929m608p992m459n548k4244p756M867J8924J5413j793j3452
12054a1311M571Q729P281o620j7129J1891J4589o218Q00r916L394K076R697K171
12040A4005M782o633j3444L434O154l76K532k52j5351m749j5762K48J479N225
12026a8708J3059J6115J8703j8214j3869k014J2815N076k851o170j6675K988R718
$$ y = [42974, 36747, 37930, 16627, 11310, -1474, 6373, 21127, 41311, 40289, 22742, 16882, 21045, -646, -4376, 3731, 1789, -5912, -4274, -14885, -7018, 8589, 29884, 19687, 5919, -705, 3283, 4832, 10009, 14836, 1359, 3156, 4009, -8648, -5463, -6421, 6768, 14245, 13197, 20326, 11572, -4115, -21195, -19143, -2355, -1965, 10586, 16563, 24672, 23814, 13761, 23043, 17495, 12080, 11751, 1336, -592, 19337, 14729, 6737, 2278, -3270, -27514, -35270, -30403, -11479, 3934, 2141, -11311, -6740, 1989, 9270, 2650, -14479, -2588, 12001, 5783, 6583, -3333, 61, 2137, 11834, 14005, 18787, 12154, -1290, 2144, 8298, 7922, 10454, 10202, -5149, -9898, -25660, -25412, -23933, -18708, -5649, 10466, 29169, 10955, -2914, -4928, 7887, 12963, 10112, 3942, -12733, -9745, -27]
12013b7n662K0581N878j0634l832L222j978M647n555j3489m55L527n281N226O287
11998B455O707J1596Q135k774r525M690L103q355p656j7204J0173K4488L934k4092
11984E675j6395K621k320L550Q841j1947m191J5764J1523N150j921l736N457j1201
11970F870K402l702j8407n468J6242J7949Q080j0000m150j2892l27Q843Q855n720
11956H575M912J4210o815j3463r501m836P244r501J5772k396j674J8893l650o726
11942A1044k0483K184J8729N366Q5K796j8496j3087J3324k134L75M045n50K2275
11928B5473M472L328L026n930j7601j91J2261M87j3205j6129J2018K6904M106
11915C9019j7907j34J6886l221j3190r941J536l095J5111j182k0139m198J1019
$$ y = [-27, -5689, 14892, 20770, 10136, 6304, 9526, 7548, 12195, 6640, -6849, -7304, -3777, -9058, -3832, 2455, 9162, 20758, 28893, 26119, 16594, 21284, 24387, 16032, 8376, -8828, 1345, 25833, 29767, 5675, -10720, -8099, -10419, -6869, 1972, -9975, -14166, 1598, 13121, 18271, 16350, 12614, 18071, 6870, 9272, 5570, -12837, -18305, -2063, 15886, 23966, 13966, 9816, -3076, -3403, 5440, 14295, 8575, 13487, 27697, 20882, 7419, -2082, -6918, 326, -9175, 6597, 4201, 2527, 21420, 17770, 11044, -9439, -7255, 11474, 16840, 16925, 19721, 1225, -11862, 1462, -672, -297, 3748, 3198, 25473, 29945, 33273, 36299, 30369, 12768, 12577, 24838, 25325, 12120, -4009, 8009, 34913, 39019, 21112, 20978, 37864, 34643, 21453, 11512, 13048, 9953, 25064, 23882, 3743, -455, 10564]
11902A0564L729o904l588J0034P575o908j595j528k03P616J91K440j4653O736
11888A3506m116q565j6333O695R416J4058r043p907o201K820Q17J5979K854K481
11874A6461J1922p064p207p24r66o513j557N859J1719P168j0954k1569j4353P486
11860a0292K0163Q601j870J8010J4371P388l3825j1879K5718J5262po960k2937
11847B1743m518J080L247l472K199Q512j7046o205N962J3904J1487j974q708k590
11833B3621J1800p343N344r567L156p161q030j3041J352J0617j3245j5982K291
11820a6188q858J4090L197L419J9531n478j4208j0704P269K2523l405j8928k250
11807i990J0254Q593J5349j5785k4476j3756J3909K9025Q432k1626N955M486j5547
$$ y = [10564, 14293, 7389, 3801, 13835, 21410, 14502, 12907, 11379, 11176, 18792, 18983, 21423, 6770, 13506, 9390, 825, -15508, -8813, 603, 14661, 5618, -2289, -8490, -5670, -4853, 11126, 13980, 16461, 28383, 21319, 14112, 13388, 12422, 5909, 4352, 10211, 21930, 29098, 18144, -3425, -17778, -10292, 9871, 18472, 16602, 34612, 48983, 56371, 22546, 10667, 36385, 51647, 51640, 44680, 21743, 17225, 18305, 21552, 18080, 20279, 28791, 11745, 5540, 11502, 25406, 36893, 34919, 26211, 23621, 35421, 28078, 33422, 23855, 27011, 19850, 11820, -1221, 131, 10748, -2497, -18479, -16188, -25046, -10956, -7759, -4340, 15191, 9713, -4495, -15199, -7930, 14593, 11188, -7740, -9990, 264, 8857, 24206, 8421, -16055, -29811, -15902, 13123, 21555, -71, 5884, 10370, -5177]
11794e177r539J6640R295m064Q869q139k0049o584p364q924K3274N133n900p080
11780a9609M572J6492o190j1421k181J2073Q399J672q982P552J1685M678O318
11767B5058j8925K798j53Q080M947l939k9494k1461L089J7363J1573J2444j572
11754I808j6249K024J3193O947P478N336l872j5415o777l268n87p427r076m030
11740b1915r807k798K1223M500L1211R925j8335n891o390P010R99j1882P481n06
11726D825J1845J9031k992n711k8237j3435M25J0619m324r600R466R79n717q98
11712a3724O20Q141l98P600J0978l300l952Q938m749J9434J7127j6564j8932o648
11698D571l434p90J841J2903r976j2600q672J6935N34j5970P699J4304M595j3955
$$ y = [-5177, -14716, 1924, 11219, 7155, 16024, 7885, -12164, -18748, -26112, -35036, -11762, -6629, -12529, -19609, -15037, 1455, -4735, -16156, -18337, -6264, 2135, 3807, -5175, 2377, 14062, 18740, 25058, 6133, 8931, 8778, 16858, 21805, 17866, -11628, -33089, -30000, -12637, -1064, 11380, 9808, -6441, -4417, 8776, 15723, 23201, 28537, 24665, 9250, 2473, -795, -1382, -8809, -17885, -21915, -31722, -34520, -13297, -8797, 22414, 32339, 14004, 8113, 1723, 8733, 9732, -2150, 5331, 4825, 16670, 35701, 32709, 26998, -1239, -14674, -14249, -3630, -7954, -17554, -8088, -7109, -12826, -13724, -13104, -4963, -5361, 2239, 13217, 9917, 5965, 14903, 10154, 29588, 46715, 30151, 11219, 4571, 1137, 347, 2188, 15091, 5115, -7485, -16157, 778, 1312, -14658, -6959, 7345, 11940, -2015]
11684b015P91J5852R609J364r038j13p30K8156M867j3937j2193q108j649K553
11670A5409j5306r043J0253K0639k220p431j6074j629M0744J6411j1713j9913
11658B0127k7797p647j456j4129O252J7615L246q28O751J9897K962m389k2514
11645a910j6797J3451J606R396M077j0906Q946K0123J021p840j4991j0009J1491
11632G658J875l529j4827p219N269o8J6557M512Q180L329O216j3387q243K61J2310
11617A8894m371J388P256k097q846n417l022O675j466j129R66N886r585j7042
11603a1910N22J4649O350O515J898m976j4637j2550K269J4277R984j339j4166
11590c114r5M778r28j0597Q543R461J2090j947k0106n8j3587k180J4061P949R073
$$ y = [-2015, -1224, 14628, 24237, 25601, 16563, 16450, 15720, 43876, 48743, 34806, 22613, 14505, 12856, 15409, 103, -8940, 1313, 21952, 19732, 12301, -3773, -5402, 35342, 51753, 40040, 20127, -7670, -15317, -16773, -30902, -24650, -7035, -3789, -4617, 2134, 22031, 24993, 20604, -1910, -18707, -5256, -3650, 5746, 9823, -1083, 7863, 27986, 29007, 21167, 6176, -3833, 7658, 9533, 6004, -8823, -16042, -10773, -10841, 5716, 10228, 18408, 21737, 27953, 14566, 6323, 6584, 18894, 14523, 15911, 23167, 21070, 12224, 6807, 3785, 10460, 8994, 7865, 8831, 14717, 5132, -11910, -11388, 3261, 9611, 16126, 18024, 13048, -1589, -14139, -11870, 2407, 12391, 11052, -3114, -3209, 1569, 641, -9956, -1413, 8048, 20138, 18191, -1915, -1973, -15560, -17740, -3679, 4270, 13343]
11575A3343r21j5033n78j4315p251K3856L028j3836J908L877R545m097M406Q042
11561A1974L926Q541o865r909l043n170J1950m892k4060J0163q451K3333K955
11548A0452j1623R729J4612j638j7217j5328n519K727k0414J3141J5689Q042M225
11535F878k645N259n973M968K1785j4734j1887m208l053R122J0335O762j0134
11522A2475o177j0768N593L668k336L354n814J9813K433j2040k4513O050R685
11509A423R547J1407j8498l0J3285q78n699n812N254k1026j2669M018J6750J2009
11495I081q271K5829K7875j3175k8446j3753l289q807p705J4461J3785K7910n329
11482C0166M327j1369j2584q921K843j523J431O785J2573j0624n913P798R399
$$ y = [13343, 12422, -2611, -3189, -17504, -24755, -899, 2129, -11707, -9799, -5922, 3623, -474, 3932, 11974, 15900, 24441, 17576, 7667, 4624, -546, 11404, 6512, -17548, -7385, -15836, 7497, 10452, -1171, 8558, 23170, 21532, 4315, -11013, -16532, -13805, -34219, -21078, -5389, 2653, 6878, 4233, 9492, 3519, 8487, 30272, 15538, 3651, -557, -3610, 5512, 15847, 22609, 12475, 6298, -4470, 1123, 4791, 2455, 5809, -5, 19808, 22241, 10201, -14312, -8262, 1423, 10970, 22377, 3879, 3849, 17134, 16256, 10557, 4745, 9999, -11027, -23696, -19678, -2928, 9081, 810, 26639, 54514, 41339, 12893, -860, -4149, -12956, -20661, -6200, 7585, 35495, 30166, 34493, 23124, 10540, 1619, 4462, 2939, 4370, 11155, 23728, 13104, 7191, 14989, 24388]
11469B4388J3415L435O367k0926k6216k425j4850p895Q327J3514n300o807j2193
11456b7166J6657J0910q403R345Q539l025J4187L1700m007o374J935m740j6190
11443B3368j3754M435n299p454J6140J0252j3870j5401L785J3453k249m965l150
11430E291n636Q768N566K968R281j2910j2526r563K698j1669M314J4963L312m863
11416fJ2892J2095j4218j2495o244r354J3060K4940M045N199j3194k3688q02J1323
11402C553L262n973R317J4586k6260j7627J2392K905P90M484J781j6656J2159
11389a287J3841J2364j8901k5674J094J1416l485J380J631J8158l210O927J1618
11376B5872k938j8401J820J5068O045Q210j1518j6288j2013m255L800J0061j6496
$$ y = [24388, 37803, 41238, 47605, 26679, 463, -1962, -16812, -24707, -16380, -2866, -8166, -14973, -27166, -10509, 401, -8002, 1343, 9882, 6857, 21044, 52744, 48737, 42363, 44298, 39558, 23368, 9614, 14049, 8750, 1296, 17436, 27688, 13818, -1583, 2202, 15655, 13406, 8441, 5291, -345, 8423, 13989, 16957, 26238, 13328, 802, -8761, -6063, -17732, -13418, 1545, 4857, -6, 12886, 24981, 10763, -1732, -7976, -17330, -4270, 20670, 24715, 29914, 16720, -6968, -7770, 3553, 6815, 842, 10159, 24745, -1515, -19142, -6750, -3845, -3055, 1429, 3210, -13446, -1287, 12554, 24918, 6017, -19657, -18563, -7147, -10632, -9252, -7621, 10537, 7327, 14254, 25872, 22934, 4533, 6353, 21421, 27466, 35676, 24158, 7870, -4143, -8398, -4598, 5463, -11033]
11363a1033P440J6512l03j9452l058J8697J1280j106j0050K187L802J2960m574
11350B3302M31k684j0575o031N363q244K276k388K214k792L830J4082m315K8066
11336D2535O923k5448k475n071P4P124K2593J3504m968n278r716j0207k657R850
11322C6783j817k718r404o048J8365j6539j5099r924J5373J7556k785k816L239
11309B4166K593j962l650J1929K664j6698N219J2209j4801j4962J345J0549Q349
11296B6950o294j0056j9419L961K4648J4392o168j5320J3546n928r463J3428J328
11283B5605m734l535J3530j0286p206r872l677J4817L199N102P43j0119n958L623
11269A1232K738M497o526K754Q309K039J2504j653m866m003k95P32r268j160r660
$$ y = [-11033, -3593, 12919, 12616, -6836, -9894, 8803, 20083, 18977, 8927, 11114, 14916, 27876, 23302, 23733, 21049, 10474, 4443, 9806, 1562, 3838, 1450, 3664, 872, 4702, 18784, 14469, 42535, 49458, 24010, 21535, 16464, 16538, 23662, 46255, 59759, 54791, 49513, 39797, 29590, 26933, 36783, 34966, 32248, 22844, 16796, 35161, 18622, 3523, -6401, 8972, 26528, 23743, 20927, 24166, 26759, 24797, 21147, 33076, 35740, 19042, 24261, 36470, 21669, 6707, 8052, 18601, 26950, 20656, 10600, -8819, -4858, 19790, 34182, 28014, 12694, 26240, 20312, 10849, 24277, 25605, 20871, 17336, 30866, 20580, 13374, 3502, -175, 14642, 17841, 22943, 23686, 13567, 7609, 11232, 13970, 18467, 11941, 14695, 23004, 25043, 37547, 35894, 31028, 27025, 26730, 27462, 18194, 17034, 7374]
11254G374l006J0679l257J4242J0443n502n685L290J0301Q159j6956j5975L294
11241A7401L311j5262j4150K625K3380J3658j5310j0350l142N89L489L831L138
11228A3208J4545J6871p484j5163R16Q263J4853M252m926j5653j085R241q316
11215B9522q353j1689j1528J0143P858p812m879J6304j746P516j9896M4K0270
11202B5754J7463J2460L993m444K716p619j2056q199J23J0503m141N327J2801
11189E4681L095K106K207K5604K4710L1158j1168k8003k1306k1013p641q19j3608
11176D0003n962m296M423P105J0057N637o171r774K2744o886l960J2863J6574
11163H2357j5567k6636j8542j8507N01K1665J5250J1999j741L699O7J0449J4842
$$ y = [7374, 4368, 15047, 11790, 26032, 36475, 30973, 25288, 28578, 38879, 47038, 30082, 14107, 17401, 20712, 5450, -8700, -6075, 17305, 30963, 15653, 5303, 2161, 2750, 6239, 10070, 13208, 27753, 44624, 37140, 21977, 22893, 31156, 46009, 50261, 45335, 29682, 28597, 37838, 29522, 21169, 9480, -2048, 8095, 15953, 8141, 3262, 19566, 17820, 25336, 5440, 5484, 25754, 43217, 55677, 59670, 55226, 57942, 50323, 38267, 30068, 30191, 40694, 36553, 41880, 54681, 57776, 59882, 62089, 87693, 112403, 143561, 132393, 104390, 83084, 62071, 54430, 53611, 40003, 34041, 29745, 34168, 41273, 51330, 56967, 50796, 41022, 63766, 56880, 52920, 65783, 82357, 66790, 40154, 21612, 3105, 3606, 25271, 40521, 52520, 50779, 54478, 54545, 64994, 79836]
11150G9836j6999k6557j3946o85k7025j1084M974K3381J7649P481N233M859k205
11137D4912k460j4494j1847N165J1648R759o687j0190l718j807N743n293M771
11124B5502j5p369N114J2698o103j1912l54L6936j521k5771j5858O611J7229J5015
11110E0202n607q272o127J6680Q353n241q152r855n697M235m219L828k219n952
11096B1957L182K2870J8307O196N87j0421N78J4369N56O401J4237j2297k3585
11083F2937m52O677J3059O719Q080J2448K2357L2432K9653N2005J09634J86031
11071E41580K98313M64868N30235J62610l89766n70143l78163k17748j19334q4106
11061B38346o1680k2096l1697l2285R33l342J1959J4776j0668j0214N736q243
$$ y = [79836, 62837, 36280, 22334, 21649, -5376, -16460, -11486, 11895, 29544, 37025, 42258, 47117, 44912, 42452, 27958, 16111, 21276, 32924, 42683, 35996, 25806, 22088, 20281, 26024, 20731, 25502, 25487, 18118, 23232, 35930, 29827, 17915, 17561, 54497, 52976, 27205, 11347, 17958, 35187, 50202, 44595, 36323, 30196, 46876, 55229, 49988, 41836, 31981, 26284, 30519, 26300, 30128, 27909, 21957, 25139, 48009, 66316, 72512, 73099, 62678, 63256, 77625, 78181, 84582, 98819, 86522, 62937, 62485, 69162, 82221, 88940, 97020, 109468, 131825, 164257, 193910, 245915, 355549, 541580, 839893, 1304761, 1834996, 1997606, 1607840, 1037697, 659534, 441786, 322452, 238346, 176666, 154570, 122873, 90588, 91521, 88179, 100138, 114914, 104246, 94032, 99768, 91525]
11049I1525j1621R25k7069q479L1157J1948j0391m418J1870m400M30J3804j3808
11036H1473j9919j8139m679O801O055O030l952p103J0313J7782Q623J6502K0272
11023A20059J6689J6746j0397j2722R636k321l6776j9473M287J5978L481n194
11011I9993J0548K0652J2116R211L5475O4655P2944R6164J57061K94891N03809
11000A377519P25468O56161l2792o98699p24808m50750k53786j53816r2418n4121
10990B97958m1791k7853m8480k2177j554l0843j3598j7344L751R221O172j2232
10978A01230k289P389O329l513k0082r840p540R635J326o033k912M920K7118K0202
10964A25940N980k7127k5612J661k913m277k4752m087L833J2542j288n43j585
$$ y = [91525, 79904, 80829, 53760, 45281, 76438, 88386, 77995, 73577, 85447, 81047, 81477, 95281, 81473, 61554, 43415, 38736, 45537, 51592, 57622, 53670, 46567, 56880, 74662, 83285, 99787, 120059, 136748, 153494, 143097, 130375, 140011, 137690, 100914, 81441, 85728, 101706, 105187, 99993, 110541, 131193, 143309, 152520, 187995, 252650, 325594, 421758, 578819, 873710, 1377519, 2102987, 2759148, 2726356, 2027657, 1302849, 852099, 598313, 444497, 352079, 297958, 256167, 228314, 179834, 157657, 156103, 125260, 111662, 94318, 98069, 107290, 113462, 101230, 98941, 106330, 112659, 109146, 89064, 79224, 71684, 81319, 82645, 76612, 73700, 78620, 105738, 125940, 131920, 104793, 79181, 80842, 77929, 73652, 48900, 44813, 48646, 61188, 59900, 59357, 57772]
10951E7772N000P58j4141k5365k223O988P527R707J656J2138m148j8142P371J7410
10937F2308N874p113j2Q23p074p93q59j2787R61K1978m406M139O841k4969p137
10922C7774K669r865M317j614K0483K7040N8159K8123K4182L7522J8630l6532
10910B10888k8668j8550l7764j7808j1463k3503j482M963j3431j4292K2231m716
10898F6405j1918k648Q06k595J7383J8441j4712n825K2186R434j7958j1896J1405
10885G8508m308k2701k3782j4703j38L176K1448L3914Q987j3554j9028O96K5817
10872G4332j8385j7188O168L339l374j2444q923J7398L9631K6264R29K526L069
10859A13342Q956j5077j1612j1655m967q206p199r769M465N402o705m1884k0166
$$ y = [57772, 62772, 63530, 49389, 24024, 21801, 28789, 36316, 46023, 47679, 59817, 55669, 37527, 44898, 62308, 68182, 61069, 61057, 61880, 54806, 54013, 53154, 40367, 41328, 63306, 58900, 63039, 69880, 44911, 37774, 40443, 30578, 34895, 33281, 53764, 80804, 138963, 167086, 191268, 228790, 247420, 210888, 182220, 163670, 125906, 108098, 96635, 73132, 71650, 76613, 63182, 48890, 71121, 66405, 54487, 51839, 52645, 50050, 67433, 85874, 71162, 65337, 87523, 96957, 78999, 67103, 78508, 74200, 51499, 27717, 13014, 12876, 16052, 37500, 71414, 80401, 66847, 47819, 48515, 74332, 55947, 38759, 44927, 48266, 44892, 32448, 23525, 40923, 80554, 106818, 107747, 110273, 113342, 122298, 107221, 95609, 83954, 78987, 70781, 63582, 53813, 58278, 63680, 56975, 15091, -5075]
10846e075M799K8244N5623K5220j951j5744j5004l813K0030J5134o184j6648J5065
10833I9696n411J532J2439K098r393r771r537j0250q54p54J8693J4251l576L224
10819A02387j0675J1535J6170M116o975K6276K4516N100J0904m349k5015m678
10807A49312n808n254j2890k944L493M42J1581q747p208k0827L518J3955p459
10794A11164j5687j0762R319k4758m3195o4154r5802k4071L2625p2809n1185K16742
10782c2573K15798M4116Q110M794k2954J9590l085j7705J089o248J6300P300j5651
10769B18881J0957J7673J7873L713j0303O22J206J2532R743k2384j1622j0992
10757B37899J5282R064R222m38L295J3456o597l300l259K1383m118N88m275J392
$$ y = [-5075, -276, 27968, 83591, 108811, 106860, 91116, 76112, 72299, 92329, 107463, 101279, 84631, 99696, 94285, 95817, 108256, 110354, 100961, 91190, 81653, 71403, 70549, 69795, 88488, 102739, 99163, 102387, 91712, 103247, 119417, 123533, 116558, 142834, 167350, 172450, 183354, 179005, 153990, 149312, 143504, 138250, 125360, 122416, 125909, 126351, 137932, 129185, 121977, 101150, 104668, 118623, 111164, 95477, 84715, 94034, 69276, 26081, -38073, -133875, -157946, -125321, -198130, -249315, -32573, 183225, 227341, 235451, 240245, 217291, 236881, 233796, 216091, 217180, 210932, 227232, 234532, 218881, 229838, 247511, 265384, 269097, 258794, 259416, 260622, 273154, 282897, 260513, 248891, 237899, 253181, 262245, 271467, 271029, 274324, 287780, 281183, 277883, 274624, 296007, 291889, 292477, 288202, 289594]
10743B89594J3320n067j2886k812M918J408L2635J5564J0135K8045M486j335l39
10730C77666j3886O260L0556J1296K2711K733M260N780O767J1558j335j0770K0687
10717D74283L7525K2077K0208M8074M2099L8381J887j5824j3769J8338K5888M0743
10705G39910J7173J2601L0384L3870K9712L8333L9817L2155K8584K3993K7431
10694A053963N9653Q3203Q3011O5601O7806J29632J70013J59641J48666J68686
10684B189875K56029L95350N94826P91217O41355O0842k97461p4212L35206N36799
10674E429826O73624R50436J363469J669364J541517J258550J597653K588249
10666A7072688L976409N999539R216980J4952910K5599741M5612169P9094534
$$ y = [289594, 302914, 297847, 284961, 282149, 287067, 288475, 321110, 336674, 346809, 374854, 379340, 378005, 377666, 363780, 370040, 400596, 411892, 434603, 437336, 441596, 447376, 454143, 465701, 464366, 453596, 474283, 511808, 533885, 554093, 602167, 644266, 682647, 684534, 668710, 654941, 673279, 699167, 739910, 757083, 769684, 800068, 833938, 863650, 901983, 941800, 973955, 1002539, 1026532, 1053963, 1113616, 1196819, 1279830, 1345431, 1413237, 1542869, 1712882, 1872523, 2021189, 2189875, 2445904, 2841254, 3436080, 4227297, 4868652, 4929494, 4632033, 4557821, 4893027, 5429826, 6103450, 7053886, 8417355, 10086719, 11628236, 12886786, 14484439, 17072688, 21049097, 27048636, 36265616, 51218526, 76818267, 122430436, 201524970]
10659B01524970J08021254O5477538m6700554j10869693q5725793m6888080k6028271
10652E8811371j5739744r970093o533825m562318l329008k378848j733141j644620
10644A2919774j863003j708802j312517r74716o54495m05502k64884j33865P5446
10635E677436J35390l06121p86211p74032n24971l86263l34392k61466k18715
10626B220655j97518j73393j55579j42067j04750j02111r7451j57742j49184j05798
10616H35062q2493m2583m9459n7020m5383n4135k5159j1844j5259k9373n3917
10605C68437m2786k5363j5637J223M642J2619j3696j1011k148j5823j2156j7637
10593B30664j1801n497j7300r247m60K711k8539j5533O277j9249j9215J0860K0759
$$ y = [201524970, 309546224, 375023762, 328323208, 217453515, 131727722, 84839642, 58811371, 43071627, 33101534, 26567709, 22005391, 18676383, 16297535, 14564394, 12919774, 11056771, 9347969, 8035452, 7060736, 6406241, 6000739, 5735855, 5601990, 5677436, 5812826, 5506705, 4720494, 3946462, 3421491, 3035228, 2700836, 2439370, 2220655, 2023137, 1849744, 1694165, 1552098, 1447348, 1345237, 1247786, 1090044, 940860, 835062, 752569, 709986, 660527, 603507, 558124, 503989, 478830, 466986, 451727, 422354, 368437, 325651, 300288, 284651, 285874, 290516, 303135, 289439, 278428, 276280, 260457, 248301, 230664, 218863, 213366, 196066, 186819, 186359, 189070, 160531, 144998, 151275, 132026, 112811, 123671, 144430]
10580A44430K2516p07j7053r034K628j5376m1919n731J1592k4362j9732j8428
10568B8824l021R454K2184L932N780r152k0354j912n448M119Q448r026m304j1052
10554A8472N946n32N59J4733j0944k4657J9065K2868n681l4P485Q072j1759k4193
10540A9400p469J3404j923r081r916M7552J08823J21077J02764J9195m7931k5328
10528C30567l6453p3200o7265k4016O07j9914j6755k4103M698j829p621j5953
10516D8763p76L57J581O061P653m587J9192j340k8702q750m216k4855j2822j6181
10502a8622l874M1169K0809M24M180j4647j6849J151o962J4395L1381L2924Q341
10489I3820j3761j6317k2015j4960k9620r916N917N19R344j2710k8638k264K7468
$$ y = [144430, 166946, 166239, 149186, 140152, 142780, 127404, 85485, 79754, 91346, 66984, 47252, 28824, 25803, 35257, 57441, 61373, 67153, 58001, 37647, 35735, 30287, 34406, 42854, 33828, 29524, 18472, 24418, 23886, 24445, 39178, 28234, 3577, 22642, 45510, 39829, 39795, 47280, 55352, 43593, 19400, 11931, 25335, 23412, 14331, 4415, 51967, 160790, 281867, 384631, 403826, 355895, 330567, 294114, 220914, 153649, 129633, 130240, 110326, 93571, 69468, 74166, 72337, 64716, 48763, 47987, 48344, 49925, 55986, 63639, 59052, 78244, 76904, 48202, 39452, 35236, 10381, -2441, -18622, -22496, 18673, 39482, 39906, 44086, 29439, 12590, 13741, 6779, 21174, 52555, 85479, 93820, 80059, 63742, 41727, 26767, -2853, -12769, -6852, -6333, 3011, -9699, -38337, -40601, -13133]
10476a3133j0045k0797l762q97L0002O7356K0925n975n331l3399j7127k704l540
10463A573j9491J0387R858j9941N407P823J8370J2698J421p566J888J6586O456
10450D5469r450k0144j4773R048J7973K0949j1386p051O144J6n204l6797j2682
10437a7888L8756L2933J959j2941j2179l0732k6835n458L180K69K670J0764J5472
10424c0R271j6014J4242J9499j1422p234k821j1989J325L877J6353M649K17J6069
10410C5992j805o292j0063j3596M619P990M958j0840j7857k80M949r33N490K8584
10396C0916L174j5008m344O65J7340L192p049j334j740m644p006j714K80R950
10382B2678J4454o486J752o970k5274l055m762j0238L556j859j5545Q291N347
$$ y = [-13133, -23178, -43975, -47737, -48634, -18632, 48724, 69649, 63674, 58343, 24944, 7817, 5113, 1573, -17918, -7531, 2327, -17614, -12207, -4384, 13986, 26684, 28105, 20539, 22427, 39013, 45469, 36019, 15875, 1102, 10150, 28123, 49072, 37686, 30635, 36779, 36795, 31591, -5206, -17888, 20868, 53801, 55760, 42819, 30640, -92, -26927, -32385, -29205, -28936, -26266, -15502, -30, 9241, -6773, 7469, 26968, 15546, 8312, 5491, -6498, -5173, -1296, 15057, 19706, 19923, 35992, 34187, 27895, 17832, 4236, 8855, 16845, 21803, 10963, -6894, -7174, -2225, -3158, 2332, 30916, 34090, 19082, 14738, 15403, 32743, 35935, 28886, 27552, 25812, 21168, 14162, 12448, 12728, 22678, 37132, 30646, 32398, 25428, 154, -2901, -7663, -17901, -14345, -16204, -31749, -23458, -18111]
10369a8111L260r734k963L094K224O594j1470J0510J4060l39m443j1010k7192
10356d5520l901J3477p43k068o129J170J1664r43K915L763j0009J4436J8914k886
10342e860M044j2289j5773p850M098J5369J7205J1532J886M095k701k054j3478
10329a776p324k125n913M298Q856L087J6153K3360j4915j5374j513m948J864j0910
10315g180n382p13L94J1699l41K847J2208Q97k4941o627J0282m296J1160K760
10301B767o769j1232p472K971l94P310M507j5776l531J2598P739Q710M482n165
10287G45q225l261J6584j2049j7618N180O708j4788r420K198J3113J0834k308
10274a2307K7193J3402K270j1118j4480P629P803j422j1697J5414R16J5232M614
$$ y = [-18111, -14851, -24585, -27548, -24454, -22230, -15636, -27106, -16596, -2536, -2875, -7318, -18328, -45520, -49421, -35944, -36687, -38755, -44884, -43714, -32050, -32993, -30078, -26315, -36324, -21888, -2974, -5860, -1816, -14105, -29878, -37728, -33630, -18261, -1056, 10476, 12362, 16457, 13756, 11702, -1776, -9100, -11225, -17138, -12840, -3984, -897, 15256, 38616, 23701, 8327, 6814, 1866, 3730, -7180, -12562, -13275, -12881, -1182, -1523, 1324, 13532, 14429, -10512, -17139, -6857, -11153, 7, 2767, -4002, -15234, -22706, -19735, -20129, -12819, -8312, -24088, -27619, -15021, -7282, 1428, 5910, 745, -7480, -10741, 5843, -6206, -23824, -18644, -11936, -26724, -36144, -33946, -20833, -9999, -12307, 14886, 28288, 30558, 19440, 4960, 12589, 20392, 18970, 7273, 22687, 23603, 38835, 43449]
10261D3449j4976L254Q180q639N433K7167J0347j0559J5052J7446K887J2313M6882
10248A58236M8380Q9854J33111K29348M09671N50883L74956k05939n71186m71925
10238G45389k60613j52283r3740n8036k6991l8189j5099k8376p202N546k3791
10227D6615k3647k0364l4798k107J8900J0731J4142J173K11j4079j9248P600J1501
10214c370j800O33J6923o819j2270n142K774P668R170r270j1864j1725J3447K3941
10200A2296L716j972j4401j977Q985J0023m625m157M78j162N861m843n007k970
10186B45L159J2176j3977k51O6j4287r38J403O968R417N7n094O084j3029k960
10171a0961N991R65o110l208O162n493j5960j5449J1282J3706L378L420l096j3578
$$ y = [43449, 28473, 31727, 39907, 31268, 36701, 63868, 74215, 63656, 78708, 96154, 99041, 111354, 158236, 206616, 296470, 429581, 658929, 1068600, 1619483, 1994439, 1788500, 1217314, 745389, 484776, 332493, 238753, 180717, 153726, 115537, 100438, 72062, 64860, 70406, 46615, 22968, 2604, -32194, -34301, -15401, -4670, 9472, 10645, 10856, -3223, -22471, -14871, -3370, -5170, -4537, 12386, 5567, -6703, -11845, -9071, -1403, 7767, -1503, -13367, -25092, -11645, 12296, 16012, 14040, -361, -2338, 6647, 16670, 12045, 7888, 8366, 7204, 13065, 8222, 3215, 245, 3404, 15580, 1603, 1352, 1418, -12869, -13807, -12404, -5436, 3981, 4038, -1056, 5028, -8001, -10961, -4970, -4005, -10115, -13323, -7161, -12654, -28614, -44063, -32781, -19075, -15697, -12277, -15373, -28951]
10157b8951L637J2703N754L26K960P827j030O67K618n377J1257J5637r078k3593
10143d643k3702n223m29J3430L304J1062J0511K259K33K845N395R048P834m221
10129B7703j1170n429j4417J9251L969q502n095j354l969l397M84j5809j1766
10116b9501L514J7999K1827J0276m471j5126L164N671q124j7496j8064R126o865
10103b8070Q263Q209K187N125q161r775L1P75r732M787J1773q475J112J6722K571
10088b658p57k3046k294L3447p952j4045n481j0544K966n685M882M847o390K953
10074b9757L92J1563J1357R300m655l0243j0219J7526J3137R184P91k97O58m326
10060e589K771r14L307J2369J1966J3290k7023k2578p51n981J241N974L096j591
$$ y = [-28951, -25314, -12611, -6857, -6531, -3571, 4256, 3226, 3893, 6511, 1134, 12391, 28028, 18950, -4643, -28345, -33568, -33997, -20567, -17263, -6201, 4310, 6569, 6802, 9647, 15042, 24090, 31924, 27703, 16533, 11104, -3313, 15938, 19907, 11405, 6310, 4956, 987, -2410, -1926, -17735, -29501, -25987, -7988, 13839, 24115, 19644, 4518, 7682, 13353, 5229, -12267, -30331, -21205, -28070, -19807, -11598, -9411, -4286, -12447, -22222, -22191, -21416, -31148, -26361, -14588, -23063, -21951, -5229, -2658, -3415, -26461, -28755, 4692, -3260, -17305, -22786, -33330, -30364, -36049, -31167, -26320, -32710, -29757, -29365, -17802, -6445, 2855, -1800, -32043, -42262, -24736, -11599, -2415, -1624, -1921, -1263, -5589, -2818, -3732, -425, 11944, 23910, 37200, 10177, -12401, -13152, -19133, -17892, -11918, -8822, -10413]
10046a0413j5164M143L151J129o94p218N637P324M336p468j0984k989J38N813
10032b3259J366Q106L908L090J4644J0832j4741n600J1313m838l4894L54J2084
10019a7635K0964L884k4349q257j7403Q252K4772Q040O331j726k407L050P028
10006A0544J6216k299O307k1439j7544J5568J6857P263O206q379l269q247k0864
9993c080N962J4784M493n718r091j769J941r81p288j2349J5356J6076j5842j1037
9979h543N981O103m813p631j4754J2551M112j0116k0821j251R234k287J0157L276
9965a8802Q549m822o099J955K137k126q00p150m265M762O331J9377j9274j8850
9951c9077J4530P019n696j132K5145L3910K3495j2803l1392l0894j8467J4829
$$ y = [-10413, -25577, -21434, -18283, -17154, -17848, -25066, -19429, -12105, -7769, -15237, -26221, -29210, -29072, -23259, -21893, -13787, -9879, -6789, 7855, 18687, 3946, -1654, 9659, 4821, -30073, -29719, -17635, 3329, 7213, -17136, -25393, -42796, -34544, -9772, -1732, 4599, 2873, 466, 3516, 10544, 26760, 24461, 30768, 9329, -8215, 7353, 24210, 31473, 37679, 29300, 26031, 17784, -3080, 2882, 17666, 22159, 16441, 7350, 5581, 7522, 6541, -747, -13096, 2260, 18336, 2494, -8543, -2562, 3541, -1272, -8903, -23657, -11106, -6994, -17110, -37931, -39182, -29948, -32235, -22078, -18802, -10253, -15075, -21174, -19219, -17082, -19208, -20008, -27158, -31423, -26661, -20330, -953, -20227, -39077, -24547, -17528, -23224, -24356, 789, 34699, 58194, 45391, 13999, -16895, -35362, -20533]
9939b0533K9729r731q828j3905N718J9302K603j723j639o13k358j4719Q505J0442
9925B250J2649r678r53J4144j2797j1821j141L255n575j0129o53N499J6317M849
9911F216j0297J478J0744J0128L536j3243k5950k863J3007O902j000j414p693
9898a0449J4121R335j6130q929j729J5033K3459J0889j4288p328j1708j2706J1822
9885A392O80q535l071r656J0560O040Q033j5245m616K0002N259q562n923n819
9871i461N712L442J3326P895p548q845m607O803o492k1526O687R341J560J3404
9857I691R661k744j4113r226n173O049n188J6413n098j3793N975J0968L316q674
9843a936k117N080Q684r776j468j7906m124R201R328K7887J559k3344Q658J8978
$$ y = [-20533, 9196, -535, -9363, -23268, -17550, 1752, 4355, 2632, 993, 380, -1978, -16697, -8192, 2250, 14899, 5221, 4268, 18412, 5615, -6206, -7347, -4092, -9667, -19796, -20449, -14950, 1367, 6216, -4081, -2603, 8141, 18269, 21805, 8562, -17388, -20251, -7244, -342, -1342, -2756, -10449, 3672, 13007, -3123, -12052, -13781, 1252, 24711, 35600, 21312, 13984, 2276, -10430, 1392, 2072, -6463, -9534, -19190, -8630, -2590, 5443, -9802, -14418, 5584, 10843, 2281, -3642, -9461, -3749, -307, 13019, 20914, 13366, 4521, -86, 6717, 225, -21301, -14614, -5273, -3713, 9691, 19352, 16608, 2495, -6731, -11904, -5855, -11043, 5370, 272, -13521, -7546, 3422, 6738, -1936, -4053, 1027, 9711, -65, -1533, -19439, -23563, -14362, -5034, 22853, 24412, 1068, 9726, 28704]
9829B8704Pj0176k7884J155L549p430r194j1673j1648J2468L4076J2159j5095
9816i82q373m998J516o681j584Q241M250k100J447J5465K9681m936j5925m232
9802A0789j2813j5391j2644q31K486l841J0123N761K272O902l018q263J6199P568
9788E299o960o937r088N974J4077j941j0934K096n864Q838J8973M138l798j2244
9774A629q563J4459Q828L141J3291j8380k0855J780M642M256J5117o736J791r714
9760D686q46K575J239j4663j1571K299J5973O039j2917l702O628J3513J4082m925
9746A8410j3716q94J1071n983j1716n635j37j514N183m817J4527R00q383J2208
9732I504m356j4258R554k047K139J0745O078P63j970j2128j6907l157Q001k575
$$ y = [28704, 28711, 18535, -9349, -8194, -4645, -12075, -21269, -32942, -44590, -32122, 1954, 14113, -982, -9355, -14353, -12837, -19518, -21102, -12861, -8611, -10711, -9264, 6201, 35882, 30946, 15021, 10789, -2024, -17415, -30059, -30890, -28404, -32245, -22122, -16361, -14089, -7187, -10205, -18468, -2269, 5299, -1661, -8598, -17686, -11712, 2365, 424, -10510, -8414, -14278, -5440, 13533, 17671, 13873, 1629, -6934, 7525, 16353, 19494, 32785, 14405, -6450, -4670, -28, 4228, 19345, 12609, 14400, 4686, 3840, 6415, 7654, -7009, -18580, -16281, -308, 5731, -7186, -10888, -4260, 9253, 23335, 18410, 4694, 3800, 14871, 8888, -2828, -8463, -8600, -10114, -4931, -9748, 4779, 5679, -2704, 9504, 5148, -9110, 444, -1603, 536, 11281, 17359, 18122, 16152, 4024, -12883, -16040, -8039, -10614]
9718a0614n256K4962J0455o183k3178k576J7550j1683l364n200j2279p73J1239
9705a6900J2303J033n818J342L959J0849n910j0746q230Q995M936j2196K554P442
9691f387q080j4266n317J0547J320K7709O556p652N809m91J239j0770n168L264
9677a687q286P511J3473o359R312n097k048j677J1420q7O3o044p054l487m055
9662d102j3383O950P854P857q432j0457o698Q813L745j552j501M629K9322J2611
9648C5656j2249P323j2889k3051k3442J1024J8132k396j7428o882P794J1413Q312
9635A317q871R304k498j8751K250K1348j4376k1716j416J0254l599K419Q569k093
9621a7859j6672J4912M394P067n31m40P998L6021J8808P84R875j3889k1896J094
$$ y = [-10614, -15870, 9092, 19547, 13364, -9814, -12390, 5160, -6523, -9887, -15087, -27366, -28139, -16900, -4597, -3564, -9382, -8040, -4081, 6768, 858, -9888, -18118, -9123, -4187, -16383, -13829, -6387, -14467, -28733, -34050, -23503, -22183, 5526, 12082, 4430, 10239, 9748, 10987, 217, -4951, -1687, -9973, -2462, 11011, 4652, 13964, 8867, 6819, 5142, 16562, 16475, 16538, 10494, 3440, -47, -4102, -17485, -10535, -2681, 5176, -3256, -13713, -20411, -11598, -7853, -9405, -10906, -6277, 23045, 35656, 23407, 30730, 17841, -5210, -28652, -17628, 504, -1892, -19320, -26202, -18408, -6995, 1317, -7554, 1750, -748, -19499, -17249, 4099, -10277, -31993, -33409, -23155, -26754, -24335, -15766, -17859, -34531, -19619, -15225, -8158, -8689, -9129, -1131, 34890, 53698, 54482, 64357, 50468, 28572, 29666]
9607B9666j2475k9733j0882J2584R021J6537j2836O131O349j2439O727J1510r29
9594A9231o049j5851k2077K57K0729J0303Q587J1161n415l663l638K98o41R741
9580B2973j9394n067O353k547R190J0521J090L15p966l526k91m203j500L423k01
9565I170q10m620K560J616l451M813J2561L3014L886k5214j1887M03P342o520
9551B2863j949q071Q475K275n334k0174q221J0516J9995J0585m476L194J0567
9538D0245j3243k0846K780L989N844N592r036j6981Q879J6515Q825j2992P818
9525B7389l45k252Q151k0796n203J0248J7593O565j3263r526J252n505k106O067
9511A8269O617Q82n454p416Q215L291m003N733j3232p29M582L606M733P992Q678
$$ y = [29666, 17191, -12542, -23424, -10840, -1819, 14718, 1882, 8013, 14362, 1923, 8650, 20160, 19231, 13182, -2669, -24746, -24489, -3760, 6543, 15130, 26291, 20876, 17213, 13575, 13873, 13232, 22973, 3579, -1488, 4865, 2318, 11508, 22029, 23119, 23434, 15468, 11942, 11651, 7448, 5948, 9371, 9170, 8360, 3740, 6300, 7916, 4465, 9278, 21839, 54853, 58739, 33525, 21638, 22041, 29383, 22863, 20914, 12843, 21318, 23593, 18259, -1915, -10136, 380, 20375, 30960, 26484, 29678, 40245, 27002, 6156, 8936, 12925, 18769, 24361, 15325, -1656, 7223, 23738, 32563, 19571, 27389, 27044, 24792, 32943, 12147, 6944, 17192, 34785, 41350, 28087, 18561, 19813, 14308, 12202, 18269, 24886, 25768, 20314, 12898, 21113, 24404, 20401, 26134, 12902, 12173, 16755, 20361, 25094, 33086, 41764]
9496D1764P634m101p342K008O373J593o222r639k0824j5702M795K0102l859K088
9482A8668p290K345K994l734J790L557m101j655P73j933l745q855k872n348J1506
9467B100P282Q759J7004L643k1497m630J728n193j731k25J4787K1367Q908k425
9453D9877j2794M499J0693n465q576Q62M809J7520k691j2033m712K568j3332l768
9439B7457j1843k9071m433J0968J1528M543J1303J3359L015j2360R76Q921Q769
9426D3132k087O14j5N667l205j4275M507N156k011q54N039P152J106q915j6012
9411B4999r779Q062P381N855j099j3228J0112n714m597L544k606k855k1594J7011
9397A5492J4087O71p460L531j8003N141K4487P6R483J611j9150l303o935j2248
$$ y = [41764, 49398, 45297, 37955, 39963, 46336, 47929, 41707, 32068, 11244, -4458, 337, 20439, 16580, 18668, 11378, 13723, 16717, 12983, 14773, 18330, 14229, 12574, 13347, 11414, 7669, -1186, -4058, -9406, 2100, 9382, 18141, 35145, 38788, 17291, 12661, 14389, 9196, 7465, 7240, 22027, 43394, 52302, 49877, 37083, 41582, 52275, 46810, 38234, 39096, 43905, 61425, 58734, 46701, 41989, 44557, 31225, 27457, 15614, -13457, -17890, -6922, 4606, 9149, 20452, 33811, 36826, 24466, 25442, 34363, 43132, 41045, 41659, 41644, 47311, 44106, 29831, 34338, 39494, 37483, 36629, 41668, 48820, 49926, 41011, 24999, 15220, 23282, 30663, 36518, 35419, 22191, 32303, 26589, 21992, 25536, 22930, 20075, -1519, 15492, 29579, 30250, 22790, 26321, 8318, 13459, 37946, 38022, 47505, 49116, 29966, 26663, 19728, 7480]
9383G480L48o06l460O309Q845O066j774J6407o342j7228j084K1106P405k274K950
9368D4148l732K281p123k5214j0077k60L742K546J7205P420j852q872l326o740
9354A0146N267J486J3182j0792p755J4286M52l835M720P012J5657j9831p639K6019
9340D8375J7969k684j0675K027j4433l867m850J2085J8349k555K086p124l699
9327E1004l071m86L693j1576J1487P283Q577L913j5257j806J6894m685l1054k946
9313C1970l232L685Q486j3022J8598N797j015P042r990O070K5815K2453j2288
9300I0369k3773k890J0132n926r153l59R704p690J866L82q31j1636O477J4942
9286G1614o755O136p164j760k288M66P594O077M34j3574k0712P63K0714O416Q253
$$ y = [7480, 7828, 7222, 3762, 10071, 18916, 24982, 23208, 39615, 33273, 16045, 14961, 36067, 43472, 41198, 44148, 40416, 42697, 35574, 10360, 283, 23, 3765, 6311, 23516, 30936, 29084, 20212, 16886, 10146, 15413, 16899, 30081, 19289, 11534, 25820, 26272, 22437, 27157, 34169, 49826, 29995, 22356, 48375, 66344, 63660, 52985, 55012, 40579, 36712, 31862, 43947, 62296, 59741, 61827, 54703, 51004, 47933, 47447, 51140, 39564, 51051, 58334, 66911, 70824, 55567, 53761, 70655, 65970, 34916, 31970, 28738, 32423, 40909, 27887, 46485, 52282, 51267, 58309, 48319, 54389, 80204, 102657, 90369, 66596, 63706, 73838, 67912, 58759, 58400, 68104, 60414, 62280, 62662, 61831, 50195, 56672, 71614, 64859, 70995, 63831, 62071, 59783, 60249, 67843, 73920, 74354, 60780, 40068, 40831, 61545, 67961, 76214]
9271G6214K219j3472r343m17M204q79J0952m556J662Q346K2162q668k2912p894
9257E7618J5645J4235P578j1338r764M782M229Q022n168N644n151j6867J461J9290
9243I0216J5090N889j1967n907p438M067J3511R386k822K478j794j0490O07l39
9229A00487n829J8793J3489j1685j7901m252J1556J5415Q6L882n738p673j0247
9216A00383N867o914k912J4367K122j3940n558p378j0965n214L2K2998J7689M369
9202A14946j0143m45J0392N304J2674m100j6120n545j3791k2775k458P986m687
9189G1238P224J2511P545o38J4549j2314J397J751k635K0177J692k187j5064K035
9175A07281j1902m17j1304j1060O349J399K0804K8999J098q029J4304m746l775
$$ y = [76214, 78433, 64961, 55618, 55201, 59405, 58526, 69478, 64922, 66584, 74930, 97092, 88424, 65512, 57618, 73263, 87498, 95076, 83738, 73974, 78756, 82985, 91007, 85839, 91483, 86332, 69465, 70926, 90216, 105306, 111195, 99228, 93321, 85883, 89950, 103461, 112847, 110025, 112503, 110709, 100219, 100826, 100487, 94658, 113451, 126940, 115255, 97354, 93102, 104658, 120073, 120159, 124041, 118303, 110630, 100383, 106250, 99336, 96424, 110791, 112913, 98973, 93415, 86037, 75072, 69858, 69890, 92888, 110577, 114946, 104803, 104358, 114750, 120054, 132728, 128628, 112508, 106963, 93172, 70397, 67939, 75925, 71238, 78462, 90973, 98518, 97880, 112429, 100115, 101512, 103263, 100628, 120805, 122497, 120310, 105246, 107281, 95379, 94962, 83658, 72598, 78947, 80346, 101150, 130149, 131247, 123218, 137522, 132776, 129001]
9162A29001O888L514L064K734q386q722n175j733j798J473Q264J1859j1305O65
9148A30343N619j2690j1157q331K657R809p317M254n141J610K9350J5438J3362
9135A67806j1436j2456j5771j1505J2973J9287j4114m276k195n103r013j6089
9123I8108M886P347K16o19K302L485L963n52L971O290j3142j1735J457q314m221
9108I3442J3943J3497l105k0040j720O791n274J9284K6806J1616n016k6161j2243
9095A11820n590n734J3698k367K3351O755j1323l053j970l241o51l270p501j031
9081A09893j1029M60k37q513m290k449J3920J599K982J0471j3562p658M452o500
9067H9539k13p257j4892J414K7279O836J081m754o319k011j991r91L982n72m975
$$ y = [129001, 135889, 139403, 142467, 145201, 136815, 128093, 122918, 121185, 119387, 120860, 129124, 140983, 129678, 130343, 135962, 123272, 112115, 103784, 106441, 116250, 108933, 113187, 108046, 109656, 139006, 154444, 167806, 156370, 143914, 128143, 116638, 129611, 148898, 134784, 130508, 128313, 123210, 114197, 98108, 102994, 110341, 110557, 109938, 112240, 115725, 119688, 119136, 123107, 129397, 116255, 104520, 105977, 97663, 93442, 107385, 120882, 117777, 97737, 96017, 102808, 97534, 116818, 143624, 155240, 150224, 124063, 111820, 106230, 100496, 114194, 111827, 135178, 141933, 130610, 127557, 125587, 122346, 121695, 118425, 110924, 109893, 98864, 99324, 99087, 90574, 86284, 83835, 97755, 99354, 102336, 112807, 99245, 91587, 96039, 89539, 89326, 82069, 67177, 68591, 95870, 102706, 103787, 99033, 92714, 90703, 88712, 87721, 91703, 91131, 86156]
9052H6156J8803J0561p203k82r818j4029J188k147n71m805j4166J4142O946j9512
9038F5263j3734J839J1022J3440Q607j0886k2121J5507r05K754O694j265j0976
9025F5239j4196P868J4186m02m831l072n763q776L988L620O654J8150M803n580
9011H1888J6413j242j8396j2247J1437Q419Q826p993l4173L563o774J7964J0380
8998G8065j9293M003p837j6989p800j331J0021K2318J544P200n899n470N349j6638
8984D7243O998N033Q912m914p972k069q072l599k47r176P832J2198J7984m456
8970F5695j6060j7544R367J1239k56P88j6024J0047N684O96o442Q00p332k78K1615
8955F1995J0941k4783k8635p349N057N628L488p42L668P303k854j4180P63K3555
$$ y = [86156, 104959, 115520, 108317, 108035, 98217, 84188, 85376, 83229, 82658, 77853, 63687, 77829, 84775, 65263, 51529, 53368, 64390, 77830, 86437, 75551, 53430, 68937, 68032, 70786, 77480, 76215, 65239, 51043, 58911, 73097, 72695, 67864, 64792, 59029, 50253, 54241, 57861, 64515, 82665, 87468, 81888, 98301, 97059, 78663, 66416, 77853, 86272, 95098, 87105, 52932, 56495, 49721, 67685, 78065, 58772, 62775, 54938, 37949, 30149, 28818, 38839, 61157, 62701, 69901, 64002, 58532, 63881, 47243, 54241, 59274, 68186, 63272, 55300, 53231, 45159, 41560, 41313, 32137, 39969, 52167, 70151, 65695, 49635, 32091, 41458, 52697, 52441, 53229, 37205, 47252, 52936, 53632, 47190, 47990, 40658, 40380, 61995, 72936, 48153, 19518, 12169, 17226, 22854, 26342, 25600, 29268, 36571, 33717, 19537, 20300, 43855]
8941D3855N007N113N699q425n033O275Q990J2900n146l322L013k5139j1569J290
8927C3508K2626J1000j2002l502O94l199N883J1099J0961m206M907j7400j920
8914E8449n577k777o060j1852k0734L903r58R686N098Q434J6119N247K365j535
8900E9808l538n730n910K1805K899N872K86R941K0637N755O573j428N125L390
8886A25485J2615K6268J3407O788J7227K2011L1011M8717O8702Q9140J20744K01603
8874G83718L28178M76490P35355R28411O49851j70046q30852q89719o14868l77157
8864A019361k26586j55488j19167r9043n5952m8053l8165l7330l3757j2418k6743
8853A66659j6194p001j4416n614j5838j7626N708m60j1294k4131R964q642j2755
$$ y = [43855, 48862, 53975, 59674, 51249, 46216, 52491, 61481, 74381, 69235, 65913, 68926, 43787, 32218, 33508, 56134, 67134, 55132, 51630, 52324, 49125, 55008, 66107, 77068, 72862, 77769, 60369, 58449, 52872, 50095, 44035, 32183, 11449, 15352, 14394, 24080, 29178, 37612, 53731, 58978, 61343, 59808, 56270, 50540, 44630, 66435, 69334, 75206, 75492, 85433, 106070, 111825, 118398, 116970, 122095, 125485, 138100, 164368, 177775, 184563, 201790, 223801, 254812, 303529, 372231, 461371, 582115, 783718, 1111896, 1588386, 2323741, 3252152, 3902003, 3731957, 2901105, 2011386, 1396518, 1019361, 792775, 637287, 518120, 419077, 363125, 315072, 276907, 239577, 205820, 193402, 166659, 150465, 143464, 129048, 123434, 107596, 89970, 95678, 95218, 83924, 59793, 69757, 61115, 48360]
8840D8360r977K610J3127R35m601m338p936j235J0460J5162p543j2135p2j3156
8826B9661r123j3602J5665J0218j0990J2785J002N814n245J2199k075j7288N510
8813C4531P867L60j2701n835j2231J2012R072n540k025J2292j4023j3187o145
8800D447j2577N887K9529j1710j0973n670o477q418J6275q20j3999L862K8914
8787A8270O451l719J2801R645m607n567L494k0236m998J2713o365J0168M4j3569
8773A4525Q71J4030j0327j5124j11K434J1827q025M869lj0555j5500j3518J771
8759b2836P71P842p416O088O165j2987K747R13P73p634p37R265O260j562J108
8744a1240J7896K6508K7013k609k0375j487Q166o462k7168j6195k554o915o186
$$ y = [48360, 38383, 40993, 54120, 55055, 50454, 46116, 38180, 36945, 47405, 62567, 55024, 42889, 42817, 29661, 20538, 6936, 22601, 32819, 21829, 34614, 35616, 41430, 36185, 48384, 46309, 29021, 34531, 42398, 42758, 30057, 24222, 11991, 24003, 33075, 27535, 25510, 37802, 23779, 10592, 4447, -8130, -2243, 27286, 15576, 4603, -1067, -7544, -15962, 313, -507, -14506, -10644, 18270, 24721, 21002, 33803, 43448, 38841, 33274, 36768, 16532, 11534, 24247, 17882, 28050, 28094, 14525, 15396, 29426, 19099, 3975, 3864, 6298, 18125, 10100, 14969, 14966, 4411, -11089, -24607, -22836, -22065, -14223, -21639, -15551, -9386, -22373, -19626, -18713, -17940, -25574, -26311, -17046, -10786, -12348, -11240, 6656, 33164, 60177, 57568, 37193, 35706, 43872, 37410, 10242, -5953, -8507, -15422, -21608]
8731b1608J0165J0243j968R201N119q346j0592J7074J3937N116k882j0054N194
8718B0599L987m95l7q286n557M149K0954J3024L306j3329n320q344j0348j9888
8704e585J619J6376M233N616Q961j0145j6866j1345J1345P799r912j748O795j3805
8690f662q027Q478J1646q987M65K217O101j1472p046J7506Q460L66j3357j85K574
8675B077m403J1034l553j3616n397o872M376q20J7385K928j0352n815K4626K3134
8661C4732o78J141l134o064k0319o398K220j6868p742K3251N710l112k010L748
8647D477o287M188K4308P601j616k0521J226o1j7811J3186J3402p102p967J4193
8633B1216J2145j0363k2501j8237M78O214O1r556J4800j5116m850n483J7448n482
$$ y = [-21608, -11443, -1200, -3168, 6033, 11152, 2806, -7786, 9288, 23225, 28341, 25459, 15405, 20599, 24586, 24091, 24054, 15768, 10211, 14360, 35314, 48338, 51644, 38315, 32995, 24651, 14303, -5585, -3966, 12410, 16643, 22259, 31220, 21075, 4209, -7136, 4209, 12008, 2096, 348, 7143, -6662, -14689, -6211, 5435, -3552, -3087, -870, 5231, -6241, -13287, 4219, 12679, 13045, -312, -497, 2077, -2326, 8708, 5155, -8461, -13858, -20730, -16354, -17174, 211, 3139, -7213, -13028, 11598, 34732, 34054, 35195, 32061, 25997, 5678, -720, 1500, -15368, -23110, 141, 5851, 2739, 729, 4477, -1810, 2378, 26686, 34287, 32671, 12150, 13376, 13315, -4496, 8690, 22092, 14990, 7023, 21216, 33361, 22998, 497, -17740, -17262, -11048, -10987, -20543, -5743, -20859, -25709, -31192, -13744, -19226]
8619a9226J1616L139j0270l127P064o036K673J1440R33P42k722Q180R839K0118
8605C4363m488j290r00l517Q817J1751j9927j9338J3748L318p163j920m020j8641
8591i207P840L065J2130K600k5795o383J782J5400N799J552O669L203k1029p948
8577a0322j452J5596L2940J7360l534k9911j5289m47O50J7341J8720j4809j9779
8564G064j44l2N194k462j0344k04J4657p523o871m830m052m152P23J6499O05r876
8548e748J812r434k155K1808K4958m776J688p484j7279j8363J4752J3469J327
8535A4575L164O986j6234j2455l989o783M39P061J8553P121j1481L164K077j1461
8521G37N069p054k4070k721K0382K3381J1249j4343q665P68J2695j4178j5630
$$ y = [-19226, -7610, -4471, -14741, -17868, -10804, -16840, -14167, -2727, -1794, -1052, -3774, 4406, 14245, 34363, 29875, 28585, 27685, 24168, 32985, 44736, 24809, 5471, 19219, 22537, 15374, 13454, 9434, -9207, -1367, 1698, 13828, 16428, -9367, -15750, -13968, 1432, 7231, 8783, 15452, 18655, -2374, -10322, -11774, 3822, 36762, 54122, 50588, 20677, 5388, 4941, 5591, 22932, 41652, 26843, 7064, 6920, 6888, 12082, 9620, -724, -928, 13729, 6206, -665, -5495, -9547, -13699, -12976, 3523, 4128, -5748, -3936, -13370, -15525, 6283, 31241, 26465, 28153, 20669, 3390, -14973, -221, 13248, 14575, 17739, 24725, 8491, -3964, -7953, -14736, -14297, -7236, 11317, 18438, 6957, 10121, 12198, 737, 5806, -1248, -25318, -28039, -7657, 15724, 26973, 12630, 3965, 4733, 17428, 3250, -12380]
8508a2380Q424J3223J2289j5194j1347O745M665j4644j523R947J6319l438r502
8495C584k2255m64K7375K798r488k3446K417K1749R138m344j2788j1821N186p700
8481b0059L605J0458o687j1737P388J232q496j4581Q36J2797N332Q168m330J1181
8467d893j2282O983n089P405Q39J31n056j5724J0181J4134N413m02j1880j1413
8453b1653J1604J3153J1307J5858k0270k2750K0541N673r707p143k875P549p538
8440f251j1922o998K2144L1520N310p187n179j3083j711J2245J0119j5678q183
8427E146j1946k1190j4906K4831P229J2189J4215L000j3211j3849J5413J5854
8415B2775k96j4543J89k0101m916J0234J8624J1363n653K674k2871j4472j276
$$ y = [-12380, -3956, 9267, 21556, 6362, -4985, 1760, 6425, -8219, -9742, 205, 16524, 13086, 3584, -18671, -19135, 8240, 11038, 1550, -21896, -19479, 2270, 11408, 7064, -5724, -17545, -12359, -20059, -16454, -5996, -12683, -24420, -17032, -15800, -24296, -38877, -38041, -25244, -19912, -11744, -16074, -4893, -17175, -10192, -15281, -7876, -7037, -6906, -11962, -27686, -17505, -3371, 2042, 1640, -10240, -21653, -10049, 3104, 14411, 30269, 9999, -12751, 7790, 13463, 3756, -3387, -6262, 1287, -6251, -18173, -25171, -3027, 28493, 33803, 26616, 21437, 8354, 6643, 18888, 29007, 13329, 5146, -6800, -27990, -42896, -18065, -10836, 1353, 15568, 18568, 5357, -8492, 6921, 22775, 22479, 7936, 8125, -11976, -16892, -6658, 11966, 23329, 17676, 20350, -2521, -16993, -18269]
8402a8269P844J7786J1161k288j2091k664o589q854M169k247P46J9861M763k0146
8388f818j1265K4697J6803o741n459j4802k0167N349K2729J4414M539l944j7874
8375A461k3514Q390K347n193K518O939J7016l568J513R729K0064L404k3032O778
8361B4852Q742j1199l343l715k0362n916l885Q706Q094n99M100j5950k68M500
8347f243j0708J5922J0029j8118J2397L049L292n085m606Q896q986r574j4797
8334b4532L739n795J2463J7414J7783J02j5171k976N842K807j1085o891J4714
8321H414J262m322M79j0985j4480q165O938Q855J1519P400Q45j7262j2434R824
8307a2112O703p510K2551J1824j1132k163o016o262P515o835Q692L521j8213q250
$$ y = [-18269, -10425, 7361, 18522, 16234, 4143, 1479, -5110, -13964, -9795, -12042, -11296, 8565, 13328, -6818, -18083, 6614, 23417, 16676, 11217, -3585, -23752, -18403, 4326, 18740, 23279, 19335, 1461, -22053, -13663, -11316, -16509, -13991, -7052, 9964, 6396, 7909, 17638, 37702, 41106, 18074, 24852, 33594, 22395, 19052, 15337, -5025, -10941, -14826, -6120, 1974, 1375, 5475, -10475, -10743, -6243, -16951, -1029, 9000, -9118, 3279, 6328, 9620, 4535, -71, 8825, -161, -9735, -24532, -20793, -26588, -14125, 3289, 21072, 21174, 6003, 3027, 8869, 11676, 591, -6300, 8414, 9676, 5354, 5833, -5152, -19632, -27797, -20859, -12004, -485, 6915, 7760, -9502, -21936, -12112, -5409, -12919, 9632, 21456, 10324, 8161, 2145, -4117, 3398, -3437, 5255, 8776, -9437, -17687]
8293a7687m247J0706O686P860m403M54J3056j1575l607O181q324j9184p552R766
8279b1870J5671L523q896n708K3984L139K897m005K1m251n204r615j1858p83L129
8264a9826P704n494J9847k987O953J6109J0149o930j6553M789J4176j2030J967
8251A7874j0866p181M891j284J7888M597k4450j5709R647j5844mJ3540o910j4802
8237b8613P110K9311J6223j82j9387j5510J2M74j1105N602K909J0014L093p349
8223g398M666m832J0486L173J8057p99j9823j6155j484r465o993m232r095o284
8209e0178J0263J7216J9237o140Q164r230M219k395l821J1371j034N782J1076
8196A4530j6077j1356J1864J4776k1985k666M375J2007J1059j184J45J7785p712
$$ y = [-17687, -21934, -11228, -4542, 3318, -1085, -631, 12425, 850, -2757, 3424, -4900, -24084, -31636, -21870, -6199, -2676, -11572, -17280, 6704, 9843, 12740, 8735, 8756, 4505, -699, -10314, -22172, -22955, -19826, -12122, -17616, 2231, -756, 6197, 22306, 32455, 25525, 8972, 13761, 27937, 15907, 17874, 7008, -173, 4718, 3434, 21322, 25919, 1469, -14240, -4593, -20437, -20441, -6901, -13811, -28613, -21503, 7808, 24031, 23849, 4462, -11048, -11036, -10562, -21667, -16065, -13156, -3142, -49, -7398, -2732, -7564, 2922, 6095, 24152, 23353, 3530, -12625, -14109, -23574, -30567, -34799, -43894, -50178, -39915, -22699, -3462, -9602, -1438, -10668, -6449, -8844, -12665, -1294, -2328, 3454, 14530, -1547, -12903, -1039, 13737, -8248, -10914, -6539, 5468, 16527, 15343, 15488, 33273, 25561]
8183B5561j8426j2813L048L129J4126j0004r75J4751M027J590r977q624r579j9751
8169b3917J2016K1723j5279j1099n116J993l610J3469q34R946J1029l115p743
8156e37J78J4097O46j0640l159L755M093j1289O554O846k048m545N106J0734j3328
8141F463j3104m09l837K4456N658R767n87j4439j7461O70P639p123m876K0273
8127A3090J7838q683j7883j8211O255J727l941J2355J7471j1393j2311j2017o703
8114b2406K299J6637K3187K485m370r660k231m824j122K1259J1210q13k4409l516
8100C726J2590o875j69N697j0944O582l0783j1198J7774K3138J1137k411k167
8087A6097J0091n290j1334O24L394p957j1865K473J9243J0604j1048o779K897
$$ y = [25561, 7135, -5678, -2630, 499, 14625, 4621, 3646, 18397, 22424, 24014, 14037, 5413, -4166, -23917, -11901, 9822, -5457, -16556, -21672, -19679, -23289, -9820, -10654, -708, 10321, 7206, -537, -359, 13738, 14384, 3744, 585, 4340, 8433, -2856, 3698, 10544, 8496, 3951, 9057, 19791, 6463, -6641, -7050, -10887, 13569, 19227, 28994, 28407, 13968, -3493, -2823, 4816, -2307, -7183, 13090, 30928, 22245, 4362, -13849, -7594, -5867, -9808, 2547, 20018, 8625, -3686, -15703, -22406, -20107, -3470, 19717, 22202, 17832, 8172, 5941, 1117, -5, 21254, 32464, 31651, 7242, 3726, 16316, 9441, 9272, 14969, 4025, 10607, -20176, -31374, -13600, 9538, 20675, 18264, 16097, 26188, 20898, 9564, 10188, 13582, 5625, -6240, -3767, 15476, 26080, 15032, 8253, 11150]
8074A1150k723J258q401M893J1364m297j2979r660o160l612Q442J5151l087R584
8060A0923P038n738j3163l788K0827K3719o174l9175j7011J1038L573M887o579
8047i623M996j820o109N171M82p910O810l503k359r455j0380J7894J9468q88q183
8032e409k1941L661K0300k792k6086l336L265L038j761J8403K7118J2695o666
8019B0489k1603N58N608J2645q380j1792r487N479Q866L035N94j1719p923k313
8005a5943o104r472M363K0924j2262p725J5926p304N552J2477j619k998J1054
7992F869j1328p563R5J3014Q068P484P497k764l670r179J813j4612j8160L884
7978a8552J0133K3J5818q110L055N101R8l538k778M061q800n50m326j7483j4780
$$ y = [11150, 8427, 9685, 1284, 6177, 17541, 13244, 265, -9395, -15555, -19167, -10725, 4426, 1339, 10923, 17961, 12223, -940, -4728, 16099, 39818, 33644, -5531, -22542, -11504, -7931, -3044, -9623, -4627, -6447, -12556, -7385, -6903, -14813, -8003, -11506, -13865, -23320, -33700, -15806, 3662, 2774, -5409, -27350, -23689, -3389, -6181, -32267, -35603, -32338, -29300, -31061, -12658, 14460, 27155, 20489, -1114, -556, 5052, 17697, 9317, -2475, -11962, -6483, 2383, 5418, 6012, -5707, -13630, -15943, -22047, -31519, -27156, -6232, -18494, -26219, -10293, -17597, -12045, 432, -1187, -4185, 6869, -4459, -12022, -11927, 1087, 9155, 16639, 24136, 21372, 17702, 8523, 10336, -4276, -22436, -18552, -8419, -8396, 7422, -688, 2367, 7468, 7566, 4028, 1250, 5311, -3489, -4039, -8365, -25848, -40628]
7963d0628J6185L0169R149j838j0096J6474j0649j1784R438k234K231j2216j0962
7950a6761o269K131l491j315j157q000K0318P21n497m802p521j4405Q71J3548
7936c1629Q661J6596l876q895K939O385N240L546M424k214j1120k679q100Q406
7922a2316J2852m138M992M95K541k5891j712J5869Q320j1908j802R468K411n407
7908f226j7623l235K935M954J5967J6708K243m282j1470j2153k448Q475Q265m198
7894b088j1567j2340O426J6640J2055J3819m928k0332K46K1552J0112R512n167
7881C3940j3380j6837j2955P547J1889R14J2323J0503k9822j4536m165j7042J5926
7868a5695J9173P145r520R686M484K386j0377j0464P908l036o403q997J2978Q230
$$ y = [-40628, -24443, 5726, 14875, 13037, 2941, 19415, 8766, -3018, 6420, 4186, 6417, -5799, -16761, -23030, -20899, -24390, -25705, -26862, -34862, -14544, -13823, -19320, -24122, -31643, -46048, -45177, -31629, -22968, -6372, -10248, -19143, -16204, -9819, -4579, -1033, 3391, 1177, -9943, -12622, -20722, -12316, 536, -3602, 1390, 1885, 4426, -21465, -23177, -7308, 1012, -10896, -12698, -3230, -819, -6226, -23849, -27084, -24149, -19195, -3228, 13480, 15723, 11441, -29, -12182, -14630, -6155, 2110, -2088, -13655, -25995, -19569, -2929, 9126, 22945, 18017, -2315, -2069, 19483, 29595, 39107, 33940, 20560, 3723, -9232, -1685, 10204, 11118, 23441, 33944, 4122, -10414, -14579, -31621, -15695, 3478, 10623, 1103, 10789, 15273, 17659, 7282, -3182, 4726, 1690, -4713, -13710, -732, 7498]
7854G498o89r712M486J0687j4574J678L970o191P106Q20J286N733J2090p641l876
7839A2671M431j538k571R575m02k1643r113Q31j245k016o26J1952L545r969r519
7824a5637K3621R748O061J0223K209q844r777m885J4922r627j2446n968j5939
7811a6339J4227M436N050n332k050l479K821M500k370M798J1427n82L754R026
7797B9887k55m26k1728r637o128j600m783p087L722j9286N525J7949r86p11Q205
7782g339J1510j2431j3555q344J707Q973m797J7241J1887M581n180n021l734j1757
7768a6259l852J728n371p729N420J1115N365j6626p105L0103R048P522n560k0716
7754a2917m535p881M182j729J6311O208k1883o285J4969Q193k223p814K063Q821
$$ y = [7498, 6809, -2903, 1583, 12270, -2304, -626, 3344, -2847, 4259, 5079, 6365, 12098, 24188, 16547, 12671, 17102, 15564, 12993, 22568, 22166, 523, -8590, -7759, -9004, -11020, -11646, 306, 3851, -6118, -15637, 7984, 17732, 23793, 34016, 36225, 27381, 17604, 12719, 27641, 18014, 5568, -400, -16339, -2112, 2324, 7374, 2042, -8, -3487, -666, 3834, 1464, 6262, 17689, 17107, 20861, 29887, 29632, 29206, 7478, -2159, -8287, -9887, -14670, -21757, -18035, -37321, -31796, -13847, -14833, -15544, -7339, 4171, -8260, -21815, -30159, -28452, -19479, -24276, -7035, 4852, 9433, 4253, -768, -4502, -16259, -20111, -18383, -23754, -31483, -26063, -14948, -9583, -26209, -33314, -3211, 5837, 13359, 7799, -12917, -17452, -25333, -21151, -22880, -6569, -361, -22244, -28529, -13560, -5367, -7590, -15404, -13341, -4520]
7740d520J66M578q189K6n38k5379J480K407Q28J8638R356n655j0338L604m44k419
7724a6399Q957L618L974k662p23m934r68j424O000j5186p815j1859k343J1989
7710b9775K4015M15j9833M977Q363K2697Q724j4752j8846q53m012o954J1168J0026
7696d640j070Q74K75J3736n037k243J0318j2411j6859r078P255J469P836J2267
7682B692r05J469J148j653L868M938p528j4040j959q730k1191M367K211N146K1471
7667h696J3384K698j6617l6K223k389m008q184j6600Q597K0475j315L787J801
7653d880j3362j089J0542j279L439j0316o1q144J4763O965l77j4584j455m42L224
7638a7056J3624J1421j340J0967j5612j7121n319O803N499J3355P964Q84o454
$$ y = [-4520, -4354, 224, -7965, -7939, -8477, -33856, -32376, -29969, -29141, -10503, -1147, -6802, -17140, -13536, -13980, -16399, -7442, -3824, 150, -2512, -3235, -8169, -9137, -10561, -4561, -19747, -27562, -39421, -41764, -29775, -5760, -5345, -25178, -20201, -11838, 10859, 19583, 4831, -14015, -14868, -18880, -25834, -14666, -4640, -5710, -4836, -4561, 9175, 4138, 1895, 12213, -198, -17057, -26135, -18880, -17411, -9575, 2692, 1787, 3256, 4404, 2751, 6619, 11557, 4029, -10011, -11970, -20700, -41891, -37524, -35313, -30167, -8696, 4688, 7386, -9231, -9267, -7044, -9433, -13441, -21625, -38225, -29628, -9153, -10468, -6681, -4880, -18242, -19331, -8789, -10068, -6629, -16945, -17006, -25150, -10387, -3422, -3799, -18383, -19838, -20280, -17056, -3432, 7989, 6649, 17616, 2004, -15117, -20436, -13633, -8134, 5221, 13185, 14069, 7615]
7625G615J992J351r556k0282k935J6341J9647l604j3985j2524J2527N311j5716
7612a3818R413K5887K6581P197j3400k1871r222O546k007K157k111j6373R724
7599H703r039j0940K163Q212P534Q863o635j2439P945R780j6033N204K2370k672
7585B3016l231j3107j0419n30L020J131M499J1206r862j9425k151L42j1599Q110
7571a9000j0025j0387J2020N105J4789l583K4082J6739N698j7894m761J3934k890
7558B3827O555j9275p038K3024j1526l3039J4062R112J1236J3395j6805p47N959
7545A8740L193q343l417j0612j8968p73j3431l75O925R207J4944M77j78N334L246
7530E969j9369n751j19K255J0240j964o257l242L403J2889J5001J806j0363l1863
$$ y = [7615, 9607, 10958, 1402, -18880, -21815, -5474, 14173, 10569, -3416, -15940, -3413, 1898, -13818, -4405, 21482, 48063, 55260, 41860, 19989, 10767, 17313, 15306, 17463, 15352, -1021, 8703, -336, -11276, -9113, -901, 6633, 15496, 8861, -3578, 4367, 14147, -1886, 3318, 25688, 23016, 19785, 6678, -3741, -4271, -1251, -120, 4379, 15585, 5723, -13702, -15853, -15511, -27110, -19000, -29025, -39412, -27392, -22287, -7498, -11081, 13001, 29740, 35438, 17544, 12783, 26717, 23827, 30382, 11107, 4069, 27093, 15567, -17472, -3410, 5702, 16938, 30333, 13528, 12781, 18740, 21933, 13590, 10173, -439, -19407, -20180, -33611, -33986, -27061, -17854, -2910, -2433, -2611, 2723, 5969, -13400, -19151, -19270, -17015, -6775, -8739, -14996, -18238, -14835, -1946, 13055, 14861, 4498, -27365]
7516b7365q075M313J327K823p548n98N986J3907K5990O122m024j6471j7210N456
7502a5367k59L449m422p353l313P32J8965J2993j1884M579J5103p736j9017p748
7488b1278K509o075P391K6885J2057j0630k5985J6149J118j615k981L899K438
7475C882L166n531l675L782J2539k511O943r655m631m212o958m061N908J8071
7461A3057j1041J6972Q600r761p191j4065P442J3299L992k492k0522j1752P852
7448e610N260p268J0347J4535k0342j5508n898O808o71j3146R502Q667R553m587
7434h358k54J8884O353j7301J270J986n936o238M275J0399N04j3729j311J1693
7420B237j134m902J1031m880Q203M835J578p575L321n671j0008l873p162q313
$$ y = [-27365, -35440, -31127, -29800, -26977, -34525, -35123, -29137, -15230, 10760, 16882, 12858, -3613, -20823, -15367, -15626, -12177, -16599, -23952, -27265, -26533, -7568, 5425, -6459, -1880, 13223, 5487, -13530, -21278, -18769, -24844, -17453, 9432, 21489, 10859, -15126, 1023, 2141, 526, -2455, 1444, 3882, 7048, 1517, -2158, 1624, 14163, 11652, 18595, 8940, 4309, 97, -6861, -10922, -5014, 13057, 2016, 18988, 27588, 17827, 10636, -3429, 4013, 17312, 21304, 18812, -1710, -13462, -5610, -350, -7618, 2729, 17264, -3078, -18586, -24484, -17676, -18347, -31493, -21991, -13324, -3771, -8358, -8612, 10272, 16625, -676, 594, 2580, -3356, -9594, -5319, 5080, 5584, -8145, -9456, 2237, 1103, -3799, 7232, 2352, 10555, 15390, 16968, 9393, 12714, 7043, -2965, -6838, -14000, -22313]
7406b2313j1168K0637R773q19L299r274R877R330j1026K023J730P836k4449j2349
7392b6893L552J3908p864o204K559J1308J589L340q932j4577P08J0717R483K200
7378e106j0678J1064R329Q04k7450Q021N905r99j396J176L024J896K513K516P40
7363A359M915k367n139M113o571L798O060p391j4114J2958J3369j701K651q36
7349A1104Q067M441q127m58J0722l300k9615R1o18J2724M901M53l154p355M413
7334D289O526o475n497n644N997k662N889L214o919Q566k795l807j7375P768j1644
7319b0569n066K442K7345j1968j4634N489J2914M723K143k1898l720J5483R42
7306f374N14p04q234Q911M670P295Q602q951l082O640M665j056j0614q802P049
$$ y = [-22313, -33481, -12844, -3071, -3890, -591, -9865, 12, 9342, -1684, 339, 2069, 9905, -14544, -26893, -23341, -9433, -17297, -23501, -20942, -9634, -8045, -4705, -13637, -28214, -27506, -16789, -7306, -5106, -15784, -4720, 4609, 5413, -22037, -14016, -8111, -9110, -10506, -9330, -6306, -4410, -1897, 619, 1359, 6274, 3907, -1232, 2881, -3690, 108, 6168, -1223, -15337, -2379, 10990, 9289, 11940, 11104, 19171, 23612, 15485, 15027, 25749, 22449, -7166, -7075, -7693, 5031, 9932, 10385, 7231, -124, 4289, 10815, 4340, -1157, -6801, -804, -3466, 2423, 5637, -1282, 7284, 4489, 682, -16693, -8925, -20569, -25635, -23193, 4152, -7816, -22450, -16961, -4047, 676, 2819, -19079, -22799, -7316, -6374, -5860, -6564, -14798, -5887, -1217, 6078, 14680, 5729, 2647, 9287, 13952, 12896, 2282, -6520, 529]
7291E29K5743Q976j4570k0248J112N230j296K2208l350j0947j121k003n590J5392
7277B0065j745r972j7153J4176M009l32r14l486N849k1065k114k33J594L545L622
7262d154p350j0023N840l675M788p791k5794Q286K2550l683R903J9152k768l682
7248A599q147m225J201J4226m016j0157J1898J4682O504j7501n510o093j2505
7235a8044J219J9054j2616J947J771Q572m77m77j1476j8220J1186J6676L504p652
7221e033J0795P020q841k129J575k414j5813r05j185J1641N789J0019l511j3318
7207f310M889J725n419J1064M72n581n807R759Q121o194l2q248p408n643n86Q454
7191f744n83j5019j565Q215M748q822N90K6401J9833m975k3217k3911P434R327
$$ y = [529, 26272, 35248, 20678, 430, 1542, 6772, 5476, 27684, 24334, 13387, 12266, 10263, 4673, 20065, 18320, 8348, -8805, 5371, 9380, 9048, 8134, 4648, 10497, -10568, -12682, -12915, -11321, -7776, -4154, -11504, -21527, -15687, -19362, -14574, -22365, -48159, -39873, -17323, -21006, -11103, 8049, 5281, 1599, -6548, -10773, -9572, 4654, 638, -9519, 2379, 17061, 23565, 6064, 554, -5539, -18044, -16825, 2229, -10387, -8440, -6669, 1903, 1426, 949, -10527, -28747, -17561, -885, 2619, -5033, 5762, 12782, 3941, 1812, 3387, 973, -14840, -15745, -16930, -5289, 500, 10519, 7008, -6310, -1421, 304, -5115, 5949, 6421, 840, -4967, 4792, 12913, 6719, 6687, -1561, -8969, -14612, -15198, -6744, -7327, -22346, -23911, -15696, -10948, -19770, -19180, 7221, 27054, 22079, -1138, -25049, -17615, -8288]
7177h288k07J770J2115j4852m805j719J4137K012P945P421j5292k102J5141q670
7163D606p072j5252J1008k71j3676J1334J4885p77J0013Q332o243m983j795j2676
7149b567j0148O33o35J1418J3438J5398j846k3741j5459J686K416j0737q865J8797
7135a0212J7903O594p798j9774j2106j7974J5434N116J4831L3305o528j1344j3461
7122f014o424K336j6284K178l747n663J4184N988j2914j24J0679R561J2351m671
7108A436Q503K014o957j249k3313n197K1441L141j8046j3284j578j555K6280K4203
7094A5839j3609q698J3235N553R510O161o355k154Q098K650j5941k5579k3773
7081c5063M776K3068Q754q022j4775P72K555m017R655J5256J7740r30p393J0986
$$ y = [-8288, -8495, -6725, 5390, -9462, -14267, -15986, -1849, 163, 8108, 15529, 237, -1865, 13276, 4606, -2466, -17718, -6710, -6981, -20657, -9323, 5562, 4785, 14798, 23130, 16887, 11904, 10109, -2567, -12715, -12082, -12717, -1299, 12139, 27537, 25691, 1950, -13509, -11823, -9407, -20144, -29009, -10212, 7691, 14285, 6487, -13287, -25393, -43367, -27933, -22817, -7986, 25319, 18791, 7447, -6014, -12438, -10102, -26386, -24208, -27955, -33618, -19434, -13446, -26360, -26484, -15805, -6244, 6107, 1436, 9939, 11953, 4996, 3747, -19566, -24763, -3322, -181, -18227, -31511, -33089, -34644, -8364, 15839, 2230, -6468, 6767, 12320, 21830, 27991, 21636, 19482, 27580, 30230, 14289, -11290, -35063, -30287, -7219, 1535, -6487, -21262, -20490, -17935, -21952, -12297, 2959, 20699, 19769, 12376, 23362]
7067B3362L44j6766Q238k485j1176P001r682K92k875l6229j2156L8508K2625j809
7053G192q66j2009O188J4576J2646K221r021j6463J0822K1119k2216k2953n664
7040a4428J6237N865O626n576j2999n304J2449n23R82J1568J300j1916M500p795
7026I86k4065L92L794R092L203M432J2148L0274N741P40j7271j0612L415n23p717
7011A4029L011J022N531j8635r023M915j3675P368o370j5302J1394J2531j677
6998d881o458J842N043n440k6919m343Q37J1801R826p471q09J40R219K744J3793
6983a076o118q436P574N720j2260m457J9487K020K500J335j7804P968P178k2726
6969a9095j3961R304N614J384L1802L326j5132O363M53j694j5615O584r464M130
$$ y = [23362, 23706, 6940, 15178, 12693, 1517, 8518, -1164, -872, -3747, -39976, -52132, -13624, 9001, 7192, 6326, -5683, 505, 15081, 27727, 29948, 20927, 4464, 15286, 36405, 14189, -8764, -14428, 1809, 7674, 14300, 8724, -4275, -9579, 2870, 2347, 3329, 14897, 16197, 4281, 8781, 986, -23079, -22687, -18893, -9801, -6598, -2166, 9982, 40256, 45997, 46737, 29466, 18854, 22269, 21746, 14029, 17040, 18062, 23593, 4958, -4065, 850, -12825, -5457, -11827, -27129, -15735, -3204, -4881, -11339, -9497, -4454, -9894, -36813, -41156, -40319, -28518, -18692, -26163, -26972, -26832, -17613, -14869, -1076, -7194, -15630, -8056, -2336, -14596, -19053, 434, 2454, 4954, 6289, -11515, -3547, 3631, -19095, -33056, -23752, -18138, -16754, 15048, 18374, 3242, 9605, 10058, 8364, -7251, -667, -10131, -6001]
6955f001k87O65q938O379J4445R053k4075o058j2155K185r434M949J9484k913
6941a2701L088J6863O292j5840o090o082O750L443K676m499J0684J6672j792j8082
6927A382r508p136R817N776M001M282n2J3820j4233m631j008N217j0748Q364m731
6912F12r25Q626N201o758q729j3008K854K5936J3800o418o595j877l771J532K0872
6897C1352o936P444j3122o922o282n219n318J7026J8558J553j5631q062O506j0498
6883D449K523m204M312L2386J764j5382j4548j4600N025j0954j2780j803J344
6870b2468N797M388J1688j616N197K624p202K149K0585j873j7524o336p507n473
6856a7571k666J0340J3447j905J3045j4342r166K1273j8357j6196n206M155R135
$$ y = [-6001, -6288, -5623, -14561, -8182, 6263, 15316, -8759, -14817, -26972, -24787, -34221, -29272, -9788, -12701, -9613, 7250, 13542, -2298, -8388, -14470, -7720, -4277, -1601, -6100, 4584, 21256, 19464, 1382, -8126, -15262, -5445, 331, 4332, 8614, 8562, 22382, 8149, 3518, 2510, 7727, -3021, 5343, 612, -313, 8313, 13514, 6756, -1973, -14981, -12127, 13809, 27609, 21191, 14596, 12719, 8948, 10480, 31352, 24416, 31860, 18738, 11816, 5534, 315, -5003, 12023, 30581, 32134, 16503, 8441, 14947, 4449, 6972, 2768, 7080, 39466, 41230, 25848, 11300, -3300, 1725, -9229, -22009, -23812, -22468, -16671, -12283, -595, -2211, 2986, 5610, -1592, 557, 21142, 19269, 1745, -4591, -12098, -17571, -20237, -9897, 3550, 1645, 14690, 348, -8818, 12455, -5902, -22098, -27304, -23149, -14014]
6843a4014l380o703L15k664J578J2191M822M124L352j8784L356J7421l506l935
6829e827m242j4371r907J5258N926k7822l896J2027K4675J7132j1631j5769L441
6816a5006R959N81j5014J4443O630j2377k1404n15J6128J7420J1294n167j3723
6803f751j539J4542L971J0661q624k0722k7655j1421J6169L022J092P849O602
6790a2804j8154K051N201J310P03R594O914q482O188O168o323j5298N679L1659
6776A4406J9762m193p243j5374j023M562L675q51L818j1678j9280m7N802J1443
6762C779M287j0104L69p107J035N649j745K1849l371m351k09Q082r065j789N827
6747A3136k1109p609l656j8R272J7497n25J6612q08q2m325O300j939j5025J4882
$$ y = [-14014, -17394, -24097, -23782, -26446, -24868, -12677, -7855, -3731, -379, -19163, -15807, 1614, -1892, -5827, -10069, -24440, -34347, -19089, -13163, -40985, -44881, -32854, -8179, 8953, -2678, -18447, -15006, -5047, -4466, -19480, -5037, 1593, -10784, -32188, -32703, -16575, 845, 12139, 6972, -6751, -8290, 6252, 10223, 20884, 12260, -8462, -36117, -47538, -31369, -28347, -27255, -19406, -12804, -30958, -28907, -23706, -22396, -21693, -12099, -5185, -13667, -7479, -1311, -7634, -22932, -17253, 14406, 34168, 29975, 22732, 7358, 6335, 10897, 14572, 13721, 17539, 5861, -13419, -13466, -7664, 3779, 8066, -2038, -1669, -8776, -7741, -2092, -3837, 18012, 14641, 10290, 10081, 18163, 9098, 7309, 13136, -7973, -15582, -19238, -19256, -9984, 7513, 6988, 23600, 22792, 22710, 18385, 24685, 22746, 7721, 22603]
6732B2603k459J0240l863j2324q651p532J1385Q355L510p449Q90M64O161K2582
6718D3912n164j1673j9133j4627L143l970P71M980N245j3177r210r517J0380J6837
6704a203J1666N781J3378J8404j3274j4139j1064J6913J4638j2772k2198j3221
6692g091J2408J929j3268j9121j7573p46J0690p842Q617J6030K1354j238L470
6679G619R54j0000M059n246q960l095j2173O087J4485j1294Q689K3465j604j761
6665A1225J282n925J0589Q206J556j3387k7276J4561O647K096n49j956M18J6375
6651B3862m034k0212q397L110J129j4807j5773J792J122J6159K0122J0539k8148
6638a3536j5722k034M809J7636J9346N504j8103j0273J4212R518m495j0721l5
$$ y = [22603, 20144, 30384, 26521, 14197, 5546, -1986, 9399, 17754, 21264, 13815, 14705, 15169, 21330, 43912, 38748, 27075, 7942, -6685, -3542, -7512, -6741, -1761, 3484, -9693, -18903, -28420, -18040, -1203, 10463, 16244, 29622, 48026, 34752, 20613, 9549, 26462, 41100, 28328, 6130, -7091, 5317, 7246, -6022, -25143, -42716, -43462, -32772, -40614, -31997, -15967, 5387, 4149, 7619, 8573, -1427, 2632, -2614, -11574, -14669, -26842, -20755, -6270, -17564, -8875, 14590, 12986, 11225, 12507, 6582, 17171, 25377, 26933, 13546, -13730, 831, 7478, 9574, 9025, 7069, 7487, 23862, 19828, -384, -8781, -5671, -4542, -19349, -35122, -33330, -32208, -16049, 4073, 14612, -13536, -29258, -31292, -26483, -8847, 10499, 16003, -2100, -12373, 1839, 11357, 6862, -3859, -3894]
6625c894q728q502J8330K2096j1428j277Q142j2196j3002n943r460K0955P494
6612B587j1985m732J3193J937j5788p345N472J6426J2074M452o841o752j687l31
6598F80q253j984m281j6078L112O773n260m369Q129J0716K254L844N210l920j1524
6583a4951j2807l737n01K1293K156J008R456O842J4028Q213J360j8060j3241n502
6569d443m699P896L283J808L59J0544M434j5934J508r736N170N686n552j4534
6555a4210n977J0676j176j2637j5686J8433P452O216P333P024J019P619o247L148
6541A2987j6286j18R927j0116l636R702J0419J56m283N99q190o871M932N719R361
6526A4302J562P428q748n455Q570r76j2072m163j6646J0476J0711J4137J1350
$$ y = [-3894, -12622, -21124, -2794, 19302, 7874, 6597, 14739, 2543, -10459, -16402, -25862, -4907, 2587, -9398, -14130, -937, 1000, -14788, -22133, -16661, -235, 11839, 16291, 9450, 2698, 1011, 680, -7573, -9557, -13838, -29916, -26804, -20031, -25291, -29660, -21531, -10815, -8561, -4717, 493, -3427, -14951, -27758, -31495, -31996, -10703, -8547, -7539, 1917, 8759, 22787, 31000, 32360, 14300, 1059, -4443, -9142, -1246, 2037, 3845, 4204, 14748, 19182, 3248, 4756, -4980, 190, 5876, 324, -14210, -20187, -9511, -10687, -23324, -39010, -20577, -13125, -6909, 424, 7448, 8467, 16086, 9839, 12987, -3299, -3417, 6510, -3606, -7242, 2460, 12879, 13035, 8752, 9351, 1161, -5710, -778, 4941, 14302, 15864, 23292, 14544, 9089, 17659, 16683, 4611, 448, -16198, -5722, 4989, 19126, 30476]
6513C0476Q193j1514k203j0349j0536j0786q166q912l044j4075L164J1265j2230
6500c8717o738K3095K2314K299j3207n585o568o805J0543J6772J6840K5827k4583
6487A5487r886J3166l166q111k3786k3603o082J5899L630L061J3109J1593J8810
6474B0121Q30k7553q29J0865n37m977J7933J5850m789k0720l249r037j885m926
6460a2903j0647m021Q216P978K3874J0795o318j2797K567K384n592K4094P792
6447C5422K369K759l1469j3794l959j4066M627R945P3j0069l723j0875j5308K135
6433d5933N766M015J9678K9328P751p584N456o581j6121k505q70J0633m180j3768
6419a4915P007J1700q000o690J3745K5377P951k4936j0427j2071j1395J057J5380
$$ y = [30476, 38669, 27155, 24952, 14603, 4067, -6719, -14885, -23797, -26841, -40916, -37752, -26487, -38717, -45455, -22360, -46, 2253, -10954, -16539, -23107, -29912, -19369, -2597, 14243, 40070, 15487, 5601, 18767, 15601, 7490, -16296, -39899, -45981, -30082, -26452, -23391, -10282, 1311, 20121, 20951, -6602, -7431, 3434, 2897, -2080, 15853, 31703, 26914, 6194, 2945, -6092, -7977, -12903, -23550, -27571, -19355, -11377, 12497, 23292, 16974, 4177, 6744, 9128, 3536, 27630, 35422, 37791, 40550, 9081, -4713, -8672, -22738, -18111, -8166, -8093, -18162, -21885, -32760, -48068, -45933, -40167, -36152, -16474, 12854, 20605, 13021, 18477, 11896, -4225, -6730, -7600, 3033, -1147, -14915, -7908, 3792, -4208, -10898, 2847, 28224, 36175, 11239, 812, -11259, -22654, -21597, -6217]
6406f217R268M053J2045J532k603j217p704k1455J7462L809j1144j204J6910O041
6392A9576l692R625o174j1568j9713l962R249j0734j4977L186J1680M596J0260
6379b648n44M346J4241p988j438n102J0059O153m616l900P380j8k674P927P720
6364B8898j5242J656J2118l311m201j5386P698J3738O455j2364l594l137k573
6351A0755j0894J3057J2540k6409k0343P600q99O969r593L289n327o233J477J8932
6337e079Q906l82P839L515J2478J820j3475j5115j8193j6716Q105K1188J2664
6324G555J0631J3366P92k843m346j7714j0020m253P225L476J758r736j669R484
6310C706j5396J1552O623J1069J4304j9655m492P605k378j3619j3041o283r951
$$ y = [-6217, 3051, 7104, 19149, 20681, 18078, 16861, 9157, -12298, 5164, 8973, -2171, -3375, 13535, 19576, 15884, 25509, 19335, 7767, -11946, -15908, -6659, -17393, -32370, -29184, -17504, -12908, -2648, -3192, 1154, 15395, 7407, 5969, 867, 10926, 17079, 12463, 8563, 15943, 15925, 13251, 21178, 28898, 13656, 15312, 27430, 24119, 19918, 4532, 12230, 25968, 32423, 20059, 16465, 13328, 10755, -139, 12918, 25458, -951, -21294, -13694, -14593, -7624, -17217, -13928, -19255, -25488, -24011, -5079, 3827, 3445, 11284, 14799, 27277, 29097, 15622, 507, -17686, -34402, -26297, -5109, 7555, 18186, 31552, 32344, 29501, 25155, 7441, -2579, -6832, 393, 3869, 5627, -4109, -5778, 3706, -11690, -138, 6485, 17554, 31858, 12203, 7711, 15316, 12938, -681, -13722, -20005, -29956]
6297b9956l834J2374J1522Q124l247q492P75N112k203M341p510p477J941j3777
6283c2307O167J0071P322J1795J7594j4079j1216P854k043P58l174Q59j134r034
6269a0567L675P757N503j6935j8052j6431J7695N953J0817K1084o79k2613K91
6256a2502J3282J1151o18J4o997j0087j0730o00K925J9989Q088p767n757j74p767
6241g550l393J6197j0428J0142J362j3198k525M113O549M819Q737M246O924m752
6227B1243j8988j5930n631N333J3036M935k9389n788M976K339Q650M929j3808
6214b4093o924L724O382J7692M11k090P840l250q732J988j6232r729J1197K3551
6200A735J0488L738Q108j7770j5369j1419j1282r772J970L687P853n543N240O197
$$ y = [-29956, -33790, -21416, -9894, -1770, -5017, -13509, -12734, -7622, -9825, -5484, -12994, -20471, -18530, -32307, -26140, -16069, -8747, 3048, 20642, 6563, -4653, 3201, 1158, 1916, -1258, -399, -1533, -10567, -6892, 865, 6368, -10567, -28619, -45050, -27355, -21402, -10585, 10499, 9820, -12793, -12502, 780, 11931, 11313, 11327, 4330, -5757, -16487, -17087, -14162, 5827, 13915, 6148, 391, 217, -7550, -10943, 5254, -5174, 4968, 6330, -6868, -9393, -5280, 1269, 6088, 14825, 19071, 25995, 21243, 2255, -13675, -19306, -13973, -937, 3998, -25391, -31179, -26203, -23864, -15214, -10285, -24093, -31017, -27293, -20911, -3219, -2808, -4898, 2942, -308, -9040, -7052, -23284, -33013, -21816, 1735, 12223, 15961, 24069, 6299, -9070, -20489, -31771, -41543, -39573, -35886, -28033, -33576, -28336, -22139]
6186b2139J0478n714M582P082P843K860K075j8945k7222p587R418K3143J4502
6173C76O982m805L477M528P31p449M147k3984k166K4602k111n213n058j94N12
6158e625M320J3794m136q104k325r552r63q824L927M613k604P572J2457K2656
6144B7206R09j6967L042R913j7724j3234O080J5578j2376r95k551L909J594r695
6130e311j6262R492O092J3906n485l465P167K432L86j1689p699m236L0940K864
6116A9132k3279P526J1596k1376j280j415k023J499P807K471j329k530p134j1834
6102b2169o14K060N107P935N189J1898k288k974j3611L360J9072n391j7864o635
6088a6925J6013L635N72j3527J643J3755N988P066J212n56J312k479J04Q159n735
$$ y = [-22139, -11661, -17375, -12793, -5711, 2132, 4992, 7067, -11878, -39100, -46687, -37269, -14126, 376, 7358, 2553, 6030, 10558, 11289, 3840, 7987, -15997, -18163, 6439, 4328, -885, -5943, -6137, -5625, -1305, 12489, 8353, 249, -2076, -11628, -12591, -21415, -17488, -12875, -15479, -7907, 4550, 27206, 28115, 11148, 14190, 24103, 6379, -6855, -775, 14803, 2427, 1432, -1119, 2790, 4384, -5311, -21573, -12081, -5989, 7917, 2432, -1033, 6134, 8566, 8952, -2737, -10436, -14672, 16268, 19132, -4147, 3379, 14975, -6401, -7681, -9096, -11119, -9620, -1813, 658, -671, -3201, -10335, -22169, -22783, -20723, -15616, -7681, -2492, 9406, 7118, 4144, -9467, -6107, 12965, 7574, -10290, -16925, -912, 2723, 3295, -10232, -8589, 5166, 11154, 18220, 19432, 18876, 20188, 17709, 17813, 25972, 20237]
6073B0237m232j243j5469j7798J3389J3351j2225o498O881O005O271L653n509
6060F813L272k0581k0988P598L2203J6804K225P801j1395Q138p059j9656P064
6047A2239n213r842Q790P091n021q212j745k433J350m008O768l86J5630L885j1635
6032G258j9005p929J4538O994K3675J8351j795j1557j7328o544l986J813j1179
6019f694m528r505L322J2807Q826m273j2086O936J1500k472k807L553K433q72
6005F140p668p316j2383M458J1709J2331Q387N573n458o807q16J0278j0258k0142
5991a1972j6529P079J0256R270J0568j2307j1643L347K394P264K222j1993j1849
5978b3893j0294P149L587q81j31P714r076j117K2895L429M982n510o241N026n021
$$ y = [20237, 16005, 14762, -707, -18505, -5116, 8235, -3990, -10488, -3607, 2398, 8669, 12322, 6813, 10085, -10496, -31484, -23886, 8317, 25121, 27346, 35147, 23752, 31890, 24831, 5175, 12239, 7026, -2816, 5974, 13065, 8044, -168, -1913, -4346, -2996, -7004, -236, -622, 15008, 18893, 7258, -11747, -19676, -5138, 1856, 25531, 43882, 42087, 30530, 13202, 6658, 2672, 4485, -6694, -11222, -20727, -17405, -4598, 4228, -45, -12131, -5195, 6305, 3833, 1026, 4579, 7012, 6140, -1528, -8844, -21227, -16769, -5060, 7271, 15658, 21231, 15773, 8966, 8150, 18428, 8170, -11972, -28501, -21422, -11166, -1896, 8672, -3635, -15278, -11931, -9537, -2273, -51, -12044, -23893, -34187, -27038, -23451, -24332, -24463, -16749, -25825, -26942, -4047, -618, 4364, -1146, -7387, -2361, -7382]
5963g382J9924J135J0890J4171l0421l910j9206J406k22n127o467n864K5571M740
5949g62P966L562k1484o500K212Q046r097J0620O724L841K1675J7128j1645j1168
5935B1118j7445j7899J0928J6847k309O300n491N627n479o618k166K699L784L498
5921A3394M707r178j2351R625m843o847J0186o719K075p182J081J2586N153k141
5907I546L649j91R265O985n440j4766o020j2786j0574J737j7409M545P907p880
5893c1432L411J3638K2346Q189j2453N704P635j612n765j4639r38r055Q601K741
5879c629J1293N896j807o698K125N865j0664M87k180j660l453J488L404Q168N26
5864I161p721K980Q437J227k4807M005J3790J1115o193j9676m885m890L431N482
$$ y = [-7382, 12542, 13677, 24567, 38738, 8317, 4407, -14799, -13393, -13615, -18742, -25209, -31073, -5502, -762, 7204, 10766, -10718, -17218, -15006, -6960, -16057, -5437, 1287, 5128, 26803, 43931, 32286, 21118, 3673, -14226, -3298, 13549, 11240, 17540, 12049, 17676, 12197, 5579, 3413, 6112, 9896, 13394, 18101, 8923, -3428, 6197, 1354, -5493, 4693, -2026, 49, -7133, -6052, 6534, 11687, 9546, 13195, 13004, 22269, 29254, 23814, 9048, 3028, -9758, -20332, -18595, -36004, -31459, -23552, -31432, -28021, -14383, 7963, 16152, 3699, 9403, 17038, 15426, 9661, -4978, -5916, -14971, -6370, -3629, 7664, 13560, 11753, 5055, 7180, 13045, 2381, 2868, 688, -972, -4425, -2937, 467, 8635, 9161, 1440, 4420, 12857, 14084, -10723, -6718, 7072, 18187, 11994, -7682, -12567, -17457, -14026, -8544]
5850h544M296p330K904n85K277O88j3336J3102J4057j8607k435p002M722P622
5836h171J1514J71j3834j5975o628J5681j293N542L252L353o321L79n177J13K974
5821a4420P389p582L073j0448J1600J7005M704L654j7347j4006K713J7297K7699
5808C1331m652j4092k973J4117j8376j9210K885j4465Q021J1691j0549j0492m795
5795c1559R254K524K2660j99j4117m265N410J3714L689r035J5821L1289K931m814
5781D3303l1948R467L476n543r027J051J1625k860O286q137j0183P64J4468J754
5767B4496m833o831n1j6194j041O219k547J2187r30o921N164K953O437r213k264
5752F631p954p948k731J7094O52k926J2578O245k5918j216l24k2905K982J4746
$$ y = [-8544, -4248, -11578, -8674, -9259, -6982, -6294, -19630, -6528, 7529, -11078, -13513, -20515, -15793, -8171, 3343, 3514, -10320, -26295, -32923, -17242, -18535, -12993, -9741, -6388, -12709, -12330, -17507, -17394, -14420, -7031, -14613, -11540, -21988, -10388, 6617, 11321, 14975, -2372, -16378, -13665, 3632, 31331, 26679, 12587, 9614, 23731, 5355, -13855, -10970, -25435, -17414, -5723, -16272, -26764, -31559, -22305, -19781, 2879, 2680, -11437, -15702, -10292, 3422, 7111, -1924, 13897, 45186, 48117, 43303, 11355, 20822, 24298, 18755, 9728, 10779, 22404, 19544, 25830, 17693, 7510, 8274, 22742, 24496, 19663, 12832, 12781, -3413, -4454, 1765, -782, 11405, 10475, 3554, 8718, 11671, 18108, 8895, 6631, -1323, -9271, -12002, 5092, 5744, 2818, 15396, 21641, -4277, -5493, -5817, -28722, -25740, -10994]
5738a0994k126k528k475J2078J803o554K4716K2573o789j2971l19j2331j7047
5725a2964r834R531l076n41P280M722p359J0110k550m72J3629J0179M394q305
5711A4744j1228r046N650K699k915J3882j4204j013k829o006J0340j1733L482
5698h177Q257N308Q630K1398m766l4573K119J0644k0999j6411K3253K0862K751
5685A8296k7122j4298K827n96J6419J0788l087O110K706K180Q857R048j4997l3569
5671a6438p272m890J3687J9637L699P023P600l993K157l707j4170j827M815J8419
5657B4740j3585l2146l593L466O137J2511j78J049r203j7298r116L682M090n442
5643c4886J0469N885m098O434P498j4735n199J2828K375J5737J0343l929J898
$$ y = [-10994, -13120, -15648, -18123, -6045, -4242, -10796, 13920, 36493, 29704, 16733, 16414, 4083, -12964, -22798, -13267, -16343, -16884, -9604, -4882, -12241, -2131, -4681, -5153, 8476, 18655, 23049, 14744, 3516, -5530, 120, 2819, -96, 13786, -418, -1431, -4260, -10266, 74, -11659, -8177, 80, 5388, 14018, 35416, 30650, -3923, -1804, 8840, -12159, -28570, -5317, 15545, 18296, -8826, -23124, -20297, -20893, -4474, 6314, 3227, 9337, 12043, 14223, 23080, 32128, 17131, -16438, -23710, -28600, -14913, 4724, 8423, 15446, 23046, 19053, 21210, 17503, 3333, 1506, 6321, 24740, 11155, -20991, -24584, -21118, -14981, -2470, -2648, -1599, -10802, -28100, -37216, -33534, -29444, -34886, -24417, -18532, -22630, -16196, -8698, -23433, -28632, -15804, -13429, 2308, 12651, 8722, 10620]
5630A0620J3554l030K077o58q590j4979m902k343O427j480n234m517m122K874
5616a4303j604K0904Q508J219p964k878j2021j538j897Q385o754M111r584o441
5602b1857Q79J8850J4179j140q731j7356N990J1203J1610m129K681N678K041j6784
5588C114q600K3041K5958j0998q414j988J0858j9465j1616P642l718l102O386
5575I098J5899p19j2749q494M911n389r107p888lJ1615N526j9790M489j705m583
5560a8889o228Q102J2510p746r189J252J0018l533j1229J6624K8860J1826j3624
5547A8754n905q584o699k1821j1411J3937k79p655J975J6708O495R8p139J0165
5533a361J4468p232J678J565k295j0816j0012O266O777j1693L059M53Q132N098
$$ y = [10620, 24174, 21144, 23221, 22563, 13973, -1006, -5908, -8251, -1824, -3304, -8538, -13055, -17177, -14303, -15907, 4997, 13505, 14724, 6760, 3882, -8139, -9677, -11574, -3189, -9943, -5832, -15416, -21857, -20978, -2128, 12051, 10911, 2180, -15176, -9186, 2017, 13627, 9498, 12179, 17857, 19898, 3114, -5486, 17555, 43513, 32515, 24101, 22113, 32971, 13506, 1890, 9532, 5814, 2712, 9098, 24997, 24278, 11529, 3035, 7946, 2557, -6550, -14438, -14441, -2826, 2700, -17090, -12601, -14306, -18889, -25117, -17015, -4505, -12251, -21440, -20188, -10170, -13703, -24932, -8308, 20552, 32378, 18754, 12849, 4265, -2434, -24255, -35666, -21729, -22008, -29663, -27688, -10980, -4485, -4387, -11526, -1361, 13107, 5875, 7553, 9118, 6823, -3993, -14005, -7739, -962, -12655, -9596, -9143, -1011, 4087]
5519D087K671j4489j2750q905Q995k167J5454O855J504k80M468M533k86m595M064
5504I159k081P043o108q620n301l0452j4206J2921J9663q159o484R103J0373k1351
5490c4500J0528m17J0356R590K939m046j9683j004K7551J5066K760P02j4793o467
5476a418J1089L733j0844k8043J656J7630K0190N827j316o095j5364M595j284
5463C56l614q474O087j370k401j330J2782Q725r37j468j822J968p698j0647j6055
5448b5898P758Q891n045j5456j2313J1158K2574J6385J4829q528k1895J5401J0170
5435A8031R501j2282j7833m598J1835K141m345P496p120q220j2033l986p170M569
5421b4014P740J2800K8530J5093n31J573j0264j4943q204R18j6769q102k733O93
$$ y = [4087, 6758, -7731, -20481, -29386, -20391, -22558, -7104, -249, 1255, 975, 5443, 9976, 9690, 5095, 9159, 7078, 14121, 8013, -607, -5908, -36360, -50566, -37645, -17982, -26141, -32625, -23522, -13149, -34500, -23972, -24389, -14033, -4443, -1504, -5550, -25233, -26237, 1314, 16380, 19140, 19842, 5049, -1418, 9671, 13404, 2560, -25483, -23827, -6197, 13993, 19820, 18504, 12409, -2955, 1640, 356, -3258, -11732, -5645, -7015, -9416, -10746, 2036, 10761, 9824, 8356, 6534, 8502, 804, -9843, -25898, -18140, -9249, -14294, -29750, -42063, -30905, -8331, 8054, 22883, 14355, -7540, 7861, 18031, 27532, 15250, -2583, -7181, 4654, 6795, 2450, 9946, 2826, -5394, -17427, -21413, -28583, -24014, -16274, -3474, 25056, 40149, 39618, 41191, 30927, 15984, 7780, 8698, -8071, -16173, -18906, -18213]
5407a8213o821N05K7012J486J99l018r668K214q023J5355J6058J324q774l192
5393F444K1522r297j277j2096o714l22p462J8946m210l513L048j901P69L150j1817
5378d730N734J6894l580r527j019J0198O473j0698o001Q49Q917J8521j5334o297
5364A0400J2371m678M243R52j5870m268k376O97j0660J0708j3430j3047p81J5479
5350a0260k887J0052M126R81o504j8449M660K515l279L365J8765J0533R129J629
5336B4376j2297n002q609j9060N15Q136J8392R820Q75j3152j6369j282m8P529
5322f176J0160m623p268K562K2587K6075j6302j1653m918J9454m476j0100j8566
5309c244k048l77l240O452J0647r239j3846J579O001O941q494K6539N196l045
$$ y = [-18213, -25034, -24529, 2483, 3969, 4168, 1150, -8518, -6304, -14327, 1028, 17086, 18410, 9636, 6444, 27966, 18669, 17392, 5296, -1418, -1740, -9202, 9744, 5534, 2021, 5069, 3168, 3937, 7087, -4730, 1004, 17898, 14318, 4791, 3772, 13970, 20443, 9745, 3744, 4593, 13510, 32031, 16697, 10400, 22771, 18093, 22336, 23288, 7418, 3150, 774, 1471, -9189, 1519, -11911, -24958, -25739, -10260, -13147, -3095, 1031, 2012, -4492, -22941, -18281, -15766, -19045, -15680, 3085, 13618, 22747, 24376, 12079, 7077, -1532, -20592, -20077, -11941, 6451, 16271, 17146, 3994, -12375, -13657, -13705, -6176, 3984, -639, -7907, -5345, 17242, 43317, 27015, 15362, 10444, 29898, 25422, 15322, -3244, -5292, -5669, -8909, -2457, 8190, -1049, -14895, -13316, -7315, -374, -8868, 17671, 22867, 19822]
5295A9822N051j861n656J1306o856j1028k491j0667o035J1823J8095r967n524
5282F012m061O589Q447j6555N395N46J0589J7701P40j7170k4149K041r33p739
5268a2547j4917J8871J9320m034J0727M502K052k939k092j6073j3133j3780P500
5255a6543M387N133N597J5729J0317j4903O579q183m271M308o549q843J805j1029
5241a6466k0260Q564J6939O583K210O952K4702M520k9170k3906m665P380J4716
5228a901Q227Q066K260l5804p458j1767J372L1392M340l808o66K110J0821J2219
5214A9403J2317k8073j5141J2163J014K702j3743m655j0648P967R651M395r822
5201a2470L069J0767Q236k840n003P505O834q523q197j5321m165K502M625J1178
$$ y = [19822, 24873, 23012, 17356, 28662, 21806, 10778, 8287, -2380, -8415, 3408, 21503, 11536, 6012, 1951, 8540, 16987, 432, 5827, 6373, 16962, 34663, 35403, 18233, -5916, -3875, -4808, -12547, -27464, -8593, 10727, 6693, 17420, 21922, 23974, 21035, 18943, 2870, -10263, -24043, -16543, -12156, -7023, -1426, 14303, 24620, 9717, 16296, 8113, 3842, 8150, 1601, -7242, -5437, -16466, -36726, -28162, -11223, -4640, -2430, 4522, 29224, 33744, 4574, -19332, -23997, -16617, -1901, 6326, 14392, 16652, -19152, -26610, -38377, -37005, -5613, -1273, -5081, -5747, -3637, 7184, 19403, 31720, 3647, -11494, 669, 1683, 4385, -9358, -14013, -24661, -16694, -7043, -2648, -12470, -9401, 1366, 9602, 6762, 1759, 9264, 16098, 7575, -622, -15943, -20108, -17606, -12981, -1803]
5187a803K4595n79j8384p253J0024n575l773k716N405j219n827K50K91n019J2564
5172I81P412o924N156p077K467m896L016M274m777n465N450P954R730l935k0901
5157g535l928N006O680J195N061j7783j0221J3427N16N87J2501o626J485j0350
5143i985J0217J4935l014j6868n218M600k642M844R498J1360j0381l0473K615
5130b0512O896O712O439N172P074q785k971q21J1454J372J1423Q186k720j7982
5116A0937k7607p852J0058J6635N797j1140P115J4576Q523K80k0631p984k368
5103c661j4449O16n202P464O351Q147l365m906j8052k222r834l444J8961n713
5089b9309N513r685n670l149Q296M810J440J8365P022q029Q675r472k241m36M826
$$ y = [-1803, 22792, 22213, 3829, -3424, 6600, 1025, -2748, -5464, -59, -1278, -7105, -6855, -6564, -11583, 981, 8393, 1469, 6625, -452, 2015, -2881, 135, 4409, -368, -5833, -383, 7571, 17301, 13366, -7535, -11463, -6457, 223, 1418, 6479, -11304, -21525, -8098, -7582, -6995, 5506, -1120, 365, -9985, 232, 15167, 12153, -4715, -9933, -5333, -7975, -3131, 6367, 17727, 7346, -23127, -20512, -13616, -6904, -465, 4707, 11781, 2996, 25, -796, 10658, 12030, 23453, 31639, 28919, 10937, -16670, -24522, -14464, 2171, 7968, -3172, 3943, 18519, 27042, 27322, 6691, -1293, -3661, -18110, -17494, -22696, -15232, -8881, -734, -4099, -9005, -27057, -29279, -39113, -42557, -23596, -29309, -23796, -33481, -39151, -42300, -34004, -29194, -27754, -9389, -2367, -10396, -1721, -11193, -13434, -13870, -9044]
5074i044L960J8864l096j3518N882l269m594j6826j4813q039m424R734K2613K4106
5060G536n989j1686M767N573r642J0344n370l350O162j1329j7756J323n721N167
5046b9971J9621M918j783O575J1268M459K030l040P005L651k841j5207k472j0657
5032f444o224J7008l123k0300Q784J2817J62K24P535k306j1417k1468O30J57N737
5017a8228j40P262Q462N95J4498R2j5218R988j2827K375O771R51j0906J7282q428
5002B529j7409N641L009L397j2817p41L0293K1699j7330k2376L621R148j3177
4989d513O018K986l7191M743L0982J46o678l553K1707L855q556J326P147N606
4975B4025k1008N465J4898R354o877O391j4528k4217j8126l526K380J2508J0737
$$ y = [-9044, -5084, 13780, 10684, -2834, 3048, -221, -4815, -21641, -36454, -44493, -48917, -39183, -16570, 7536, 1547, -10139, -5372, 201, -9441, 903, -4467, -7817, -1655, -12984, -30740, -29417, -35138, -29971, -10350, -5432, -7215, -640, 10628, 15087, 17117, 14077, 21082, 24733, 21892, 6685, 4213, -6444, -12668, 4340, 1217, -19083, -10299, 2518, 2680, 2904, 10439, 8133, -3284, -24752, -24122, -23965, -18228, -18368, -11106, -2644, -2049, 12449, 12541, -2677, 7311, -5516, -3141, 3630, 4581, -6325, 10957, 2529, -14880, -9239, -6230, -2833, -15650, -16391, 13902, 35601, 18271, -4105, -484, 8664, -4513, 1505, 4491, -32700, -27957, 3025, 3171, -3507, -7060, 14647, 18502, 9946, 11272, 18419, 24025, 3017, 8482, 23380, 32734, 25857, 32248, 17720, -6497, -24623, -28149, -25769, -13261, -2524]
4962b524n56p084k39J0085j3818p198J7471J6784j043j119Q989j9928k4248J229
4948b3199J4555K2030l616j0609J0438M722m266j4437N65M405j0724R245J680
4935G89J844j946J0060o097j4453o033n698K412J1904K059r258M980P988J880
4921D31j8866j16Q02O973J3224j8095j3338k347O772R004K0351O640P904j8985
4907C54Q280O895j4685m149k395p107j93l98l241R985J8978o594j2574j5359j4037
4892c6240N531K855J1339q889K85J4940k546Q470J7255J4364K493m371j5646m381
4878E459J612Q256r960r151J1585N180L30o165m61O45j2981j2448O300k230o626
4863b0655O124N60m834J5J2576M97J3549k298L651j390O183j3760j3432j5953
$$ y = [-2524, -3080, -10164, -10403, -318, -14136, -21334, -3863, 12921, 11878, 10759, 19748, -180, -24428, -23199, -8644, 13386, 9770, -839, 9599, 14321, 10055, -4382, -3817, 588, -10136, -891, 789, 2633, 687, 10747, 4650, -9803, -15836, -21534, -19122, -7218, -5159, -14417, -9437, -1449, 431, -18435, -18551, -17749, -10776, 2448, -15647, -28985, -31332, -24560, -15556, 4795, 11435, 19339, 354, 8634, 15529, 844, -3305, -5700, -12807, -13000, -13398, -16639, -6654, 12324, 5730, -6844, -22203, -36240, -30709, -27854, -16515, -25404, -25119, -10179, -12725, -4255, 13000, 27364, 29857, 25486, 9840, 5459, 7071, 15327, 5367, -3784, 7801, 12981, 13311, 7146, 6685, 7330, -5651, -18099, -11799, -14029, -20655, -14531, -13971, -18805, -18790, -6214, -5717, 7832, 5534, 9185, 7795, 13978, 218, -13214, -29167]
4849b9167Q056Q383J5213K7819J1137j4854j3437K183M773j0064M01j6022r200
4836a4779n598K160R678q719j4696q695J9111J3090k890J3072k7458J233Q329
4823a6162J5806k88l717L904j6270J0704J5819j0781r859J1679J0653N999p475
4810A0012j987o703K565M872j7797j0375J3474j360l28L0273J0471j950l2242
4797a075k6465M43K594J986J1391P003k915Q282K3811K2903J001k1936k5481j7893
4783a6351o935Q122q66Q518P117M956p42m31p766n241R290O839l546j2720l705
4768a3461j3886n389J2415J1355L389J1316p577o198j3510n626L2548K5332o921
4755B3787k0741n905r484J0880M214k2778j0564J7918j502n991o110P796J1482
$$ y = [-29167, -21111, -12728, 2485, 30304, 41441, 26587, 13150, 15333, 20106, 10042, 10443, -5579, -14779, -20377, -18217, -8539, -17258, -31954, -40649, -21538, -8448, -11338, 1734, -25724, -24491, -16162, -356, -644, -4361, -457, -16727, -6023, 9796, -985, -10844, 835, 11488, 17487, 10012, 8025, 1322, 3887, 8759, -9038, -19413, -5939, -7299, -7627, 22646, 33117, 31167, -1075, -27540, -27097, -24503, -22517, -11126, -4123, -7038, 1244, 25055, 47958, 48959, 27023, 1542, -16351, -23286, -15164, -16030, -7512, -395, 4561, 3819, 3388, -4378, -9619, -329, 6510, 2964, -9756, -13461, -27347, -32736, -20321, -8966, -5577, 5739, -1838, -8036, -21546, -27172, 5376, 30708, 23787, 3046, -2859, -12343, -1463, 2751, -20027, -30591, -12673, -14175, -20166, -26276, -18480, -6998]
4742f998j4062k1421J5269K2135L025L100N894j2573k828J0629L556j3292l693
4729a1259n045Q503K1850J2498r738l0933q685Q871J4837m62j685L702n226L623
4715H51j162q106j6144k9L82q92K901k09M550P280n438J9083J0782j0863p866
4700d880m43k4647Q216J5853k738m519Q849M740R777q22j0124J133R154K02j2275
4685b524p638n30N84l246k0918J2885K0218J0221j7801j2389j0580L776J2771
4672a5171j399J2214J3404J8409J0259j2023j6979n715O532J0165k530j2450K894
4659G610Q582m58r483l5033j2905J5844J3278J0546Q508M187L508n50r844j3482
4645i692l961l420J0382K064j2414N807J045j302j0884k819R831R091j414p927
$$ y = [-6998, -21060, -42481, -27212, -5077, -2052, 1048, 6942, -5631, -8459, 2170, 5726, -7566, -11259, -16304, -7801, 14049, 26547, 16809, -14124, -22809, -13938, 899, 437, -1248, 2454, -2772, 851, -311, -8417, -24561, -24590, -24208, -25100, -22199, -22408, -17858, -10578, -16016, 3067, 13849, 2986, -4880, -5323, -29970, -21754, -5901, -8639, -13158, -4309, 431, 10208, 9386, -738, 395, 9549, 9751, -2524, -10162, -10692, -10108, -13354, -34272, -21387, -1169, 9052, -8749, -21138, -31718, -27942, -15171, -16570, -4356, 9048, 27457, 37716, 25693, 8714, 2999, 9531, 19696, 17166, 4716, 7610, 16192, 15734, 6251, -28782, -41687, -25843, -12565, -2019, 6489, 10676, 14184, 13634, 3790, -9692, -13653, -17073, -6691, -4627, -17041, -11234, -10189, -11491, -22375, -25194, -15363, -6272, -7686, -15613]
4631a5613m583r05J2441J0748O597j6173k3548Q671P713o74P491l297j0013m179
4617b5324J1183J2428J1563r793j38Q142l794O199M863j736l154O355j1340j1623
4603f169J4797l059J35L187j0591J114O243j02l601J402Q478P924j084o710j3788
4588a824j311j2721l403Q303P597O851r014J418L4283P237q779j5616k9569M762
4574a1786J6848N32j0651j6556m313O94J653k030J0348M756K6351m795j1801q171
4560h921r650j3519M414K0062J0812P994N141k0554o564P697j3027j2981P803
4547b1293Q255J1561M741Q460j240j2650j7987L374J5656P364J3650R968n144
4534B4715l2157j3042o85j35J5410K1096P404j7393m540m838L792p667o97m555
$$ y = [-15613, -20196, -21101, -8660, 2088, 8685, -7488, -31036, -22365, -14652, -15326, -7835, -11132, -21145, -25324, -14141, -1713, 9850, 57, -81, 8061, 4267, 10466, 15329, 13593, 10439, 16794, 5454, -6169, 8628, 5569, 5704, 8891, -1700, -586, 5657, 5555, 1954, 3356, 11834, 19758, 18674, 11964, -1824, -3135, -15856, -19259, -10956, -3359, 3492, -5522, -4104, 30179, 37416, 28637, 13021, -16548, -11786, 5062, 5594, -5057, -21613, -25926, -25232, -23579, -25609, -15261, -10505, 15846, 11051, -750, -8921, -18571, -32090, -27676, -7614, 3198, 11192, 16333, -4221, -10785, -3088, -16115, -29096, -21293, -13038, -1477, 3264, 11724, 10484, -2166, -20153, -16779, -1123, 6241, 19891, 29859, 24715, -7442, -20484, -21169, -21304, -5894, 15202, 22606, 5213, 673, -4165, -373, -8040, -8737, -13292]
4520a3292q246O459j2307j4571l233J6256L4524J9783k4187q379o341M953m219
4507a2800r81Q140j1512N313k573L615J9361L466j7687l607J958q132J8061N097
4493G719j4315J0512R463n911J2167k413j570n335J6550j2735j3980n904J0210
4480D458J1192n179l469q445k927m731o474m375K0920J1233O737j7203k515M479
4466C701Q501J4926l143R566j1497j5874p247J1788J3215j6821j670J2927O890
4453B5262j955k7546q099l337K371P313J9718k022l779M864m868J11L951N316
4439A7300J210L004j2003R741J510j7052j5598M660j3142k227K3899R087j5845
4426e456n031J3650J5919K49j2126J474j0964j7003J0270n492L113K801K089n292
$$ y = [-13292, -21538, -15079, -27386, -41957, -45190, -28934, 5590, 25373, 1186, -7193, -13534, -8581, -12800, -13781, -5641, -17153, -11840, -14413, -10798, 8563, 12029, -5658, -9265, -7307, -15439, 2622, 7719, -6596, 3916, 13379, 7468, 19635, 17222, 15652, 10317, 26867, 14132, 152, -5752, 4458, 15650, 10471, 7002, -1443, -4370, -9101, -15575, -19950, 970, 12203, 18940, 1737, -778, 3701, 12202, 27128, 23985, 33551, 22054, 6180, -1067, 10721, 23936, 7115, 5445, 18372, 25262, 23307, -4239, -12338, -15675, -13304, -5991, 13727, 11705, 7926, 12790, 7922, 8033, 11984, 17300, 18510, 21514, 9511, 19252, 20762, 3710, -11888, -7228, -20370, -22597, 1302, 10389, -5456, -10487, 3163, 19082, 19331, 7205, 8679, -2285, -19288, -9018, -14510, -11397, -8596, -6507, -11799]
4412a1799q541r736J1798J6381J0401j466j7866m953L682Q385K5459N377j1133
4399A5989R559L054k4716j0108K1196M567q459j3984q403k648Q855Q813p137j2828
4385a6250M743J699L905K312L249P253J1875j1900K952N111K2439l566l2359o977
4371e514K3330J9159j2594l58k890j001l011O598J3551J917k9261k2102R798j2764
4357a5142m1K2754K5383N616L115m868j9667k1206O65Q551R043q0j053P06k589
4342A1187l551M972l07p517k740P856o18j2507J0812M336J5164q606p617J4284
4328B5148m112j9665p692J6130L262q865n377j1710J4375R779j53J807j020r438
4314B469k2619q915J5810P664N237q725q836O004J0987M622j112J1716o067J693
$$ y = [-11799, -20340, -30076, -18278, -1897, 8504, 7038, -10828, -15781, -12099, -3714, 21745, 27122, 15989, 25548, 28602, 3886, -6222, 14974, 19541, 11082, -2902, -11305, -13953, -5098, 3715, -3422, -16250, -11507, -9808, -5903, -3591, -342, 6911, 18786, 6886, 9838, 14949, 37388, 33822, 1463, -5514, 17816, 36975, 24381, 24023, 21133, 20132, 17121, 23719, 37270, 39187, 9926, -12176, -2378, -15142, -15183, 7571, 32954, 38570, 41685, 36817, 17150, -4056, -3391, 5160, 14203, 14123, 13070, 13776, 11187, 7636, 12608, 12301, 4784, 2044, 9900, 9282, -3225, 7587, 11923, 27087, 18481, 10864, 25148, 21036, 1371, -6321, 9809, 13071, 4206, -1171, -12881, 1494, 11273, 11120, 12927, 11907, 2469, -20150, -29065, -13255, -5591, -354, -9079, -17915, -11911, -924, 3698, 2586, 14302, 8235, 9928]
4300I928M184j538n667P099r578p981r776Q041N028q210j0794J6962J4790l873
4286H615j1656J8537L007q642R76j0153O372J1241j0128j8571n515J99K379K909
4272a0430K5496J5145n354p208q6k82o571J326n909o631l477j0763n878m401j460
4257b6483J7451M184P240j2351M222l914l332J2863N050r103J0410J3793j0929
4244I101J184n980J3343J1081j3791k511j9896k99J554q595J1726o213o256P037
4230h515M440Q622P88l00P428J511j955j707J79J1417o3j1756N4R212k0330o302
4214g277J2705j0684j959O664M549j7318j0062L223L171N24K361K4936J1593k859
4200A9567l931j4012j0765k0378j9420J4202M83j8326Q264K3303N821j438O221
$$ y = [9928, 14112, 12574, 6907, 14006, 4428, -3553, -13329, -5288, -260, -8470, -19264, -2302, 12488, 8615, -3041, 15496, 18503, 9861, 10837, 684, 7056, 18297, 8169, -10402, -15917, -15718, -13339, -10430, 15066, 30211, 24857, 17649, 17563, 17281, 10710, 12036, 6127, -504, -3981, -14744, -20622, -25023, -26483, -9032, -4848, 2392, -9959, -5737, -9651, -12983, -120, 4930, -4173, 6237, 20030, 9101, 10285, 4305, 17648, 28729, 14938, 12427, -7469, -7768, -6214, -14809, -3083, -9296, -15552, -8515, -4075, 4547, 5335, 5035, 12463, 13974, 12019, 10312, 10491, 21908, 21845, 10089, 10143, 19355, -975, -7277, 5428, -5256, -7215, -551, 3998, -13320, -23382, -20159, -16988, -16464, -14103, 10833, 22426, 19567, 15636, 1624, -9141, -29519, -48939, -34737, -34254, -52580, -44316, -21013, -15192, -16630, -10409]
4187a0409j8781j186J1953Q182j393J8095J2626p446q226k249J0738p996M029
4174G937J0655k2156k824P732r857K904Q964j2530j5333J0654P117m519m83Q852
$$ y = [-10409, -29190, -30376, -18423, -10241, -11634, 6461, 19087, 11641, 3415, 1166, 11904, 3908, 7937, 18592, -3564, -6388, 1344, -8513, -5609, 3355, -9175, -24508, -13854, -6737, -11256, -11739, -2887]
$$ [...]
##END NTUPLES=NMR SPECTRUM
##END=
