##TITLE=Analysis number 319567
Compound Code cc 00607
Project Code adrs
Chemist Name stevep
##JCAMPDX= 6.0         $$ Bruker NMR JCAMP-DX V2.0
##DATA TYPE= NMR SPECTRUM
##DATA CLASS= NTUPLES
##ORIGIN= Bruker BioSpin GmbH
##OWNER= nmr
$$ XWIN-NMR		Version 3.5
$$ Fri May 19 08:54:10 2006 GMT Daylight Time (UT+1h)  MAYBRIDGE\nmr@NMR_250MHZ
##.OBSERVE FREQUENCY= 250.131544655141
##.OBSERVE NUCLEUS= ^1H
##.ACQUISITION MODE= SIMULTANEOUS (DQD)
##.ACQUISITION SCHEME= undefined
##.AVERAGES= 16
##.DIGITISER RES= 18
##SPECTROMETER/DATA SYSTEM= dpx250
##.PULSE SEQUENCE= zg30
##.SOLVENT NAME= CDCl3
##.SHIFT REFERENCE= (INTERNAL, CDCl3, 0, 16.522)
##AUDIT TRAIL= $$ (NUMBER, WHEN, WHO, WHERE, WHAT)
$$ ##TITLE= Audit trail, XWIN-NMR		Version 3.5
$$ ##JCAMPDX= 5.01
$$ ##ORIGIN= Bruker BioSpin GmbH
$$ ##OWNER= nmr
$$ C:\u/data/dgb/nmr/ADRS/4690/pdata/1/auditp.txt
$$ ##AUDIT TRAIL=  $$ (NUMBER, WHEN, WHO, WHERE, WHAT)
(   1,<2006-05-19 08:53:20.91 +100>,<MAYBRIDGE\nmr>,<NMR_250MHZ>,
      <created by zg, POWCHK disabled, PULCHK disabled
       configuration hash MD5:
       84 BC 41 DB A1 6E 1D 46 DA 25 12 A5 C1 ED C5 3A
       data hash MD5: 64K
       DE DA 17 C2 CD FC 3C 9F EB 48 31 D9 FB CD B8 E3>)
(   2,<2006-05-19 08:53:40.64 +100>,<MAYBRIDGE\nmr>,<NMR_250MHZ>,
      <Start of raw data processing
       ef LB = 0.3 FT_mod = 6 PKNL = 1 SI = 32K 
       data hash MD5: 32K
       77 E0 C7 A5 F7 8E 75 D0 BB 71 A3 A5 67 23 CD 02>)
(   3,<2006-05-19 08:53:44.80 +100>,<MAYBRIDGE\nmr>,<NMR_250MHZ>,
      <apk 
       data hash MD5: 32K
       35 75 AD 2C 50 85 72 C6 7A 2D A7 EA BF 69 56 F5>)
(   4,<2006-05-19 08:53:46.59 +100>,<MAYBRIDGE\nmr>,<NMR_250MHZ>,
      <abs ABSG = 5 
       data hash MD5: 32K
       90 78 92 36 C7 B4 1B CC FB D4 79 A4 A1 5F F9 63>)
$$ ##END=
$$ 
$$ hash MD5
$$ 25 DB B9 71 1D A4 3E 9B 73 53 B4 D4 3B 36 C6 E0
##$RELAX= 
##$RELAX= 
##$RELAX= 
##$RELAX= 
##$RELAX= 
##$RELAX= 
##$RELAX= 
$$ Bruker specific parameters
$$ --------------------------
##$DU= <C:\u>
##$EXPNO= 4690
##$NAME= <ADRS>
##$PROCNO= 1
##$TYPE= <nmr>
##$USER= <dgb>
##$AMP= (0..31)
100 100 100 100 100 100 100 100 100 100 100 100 100 100 100 100 100 100 
100 100 100 100 100 100 100 100 100 100 100 100 100 100 
##$AQSEQ= 0
##$AQ_mod= 3
##$AUNM= <au_zg>
##$AUTOPOS= <1 >
##$BF1= 250.13
##$BF2= 250.13
##$BF3= 250.13
##$BF4= 250.13
##$BF5= 500.13
##$BF6= 500.13
##$BF7= 500.13
##$BF8= 500.13
##$BYTORDA= 1
##$CFDGTYP= 0
##$CFRGTYP= 5
##$CHEMSTR= <none>
##$CNST= (0..31)
1 1 145 1 1 1 1 1 1 1 1 1 1 1 1 1 1 1 1 1 1 1 1 1 1 1 1 1 1 1 1 1 
##$CPDPRG= <>
##$CPDPRG1= <>
##$CPDPRG2= <>
##$CPDPRG3= <>
##$CPDPRG4= <mlev>
##$CPDPRG5= <mlev>
##$CPDPRG6= <mlev>
##$CPDPRG7= <mlev>
##$CPDPRG8= <mlev>
##$CPDPRGB= <>
##$CPDPRGT= <>
##$D= (0..31)
0 1 0 0 0 0 0 0 0 0.06 0 0 0 0 0 0 0.0002 0 0 0 0 0 0 0 0 0 0 0 0 0 0 
0 
##$DATE= 1148025199
##$DBL= (0..7)
120 120 120 120 120 120 120 120 
##$DBP= (0..7)
150 150 150 150 150 150 150 150 
##$DBP07= 0
##$DBPNAM0= <>
##$DBPNAM1= <>
##$DBPNAM2= <>
$$ [...]
##$SUBNAM6= <"">
##$SUBNAM7= <"">
##$SUBNAM8= <"">
##$SUBNAM9= <"">
##$SW= 20.6930455092707
##$SWIBOX= (0..15)
0 0 3 0 0 0 0 0 0 0 0 0 0 0 0 0 
##$SW_h= 5175.983436853
##$TD= 65536
##$TD0= 1
##$TE= 295.16
##$TE2= 300
##$TE3= 300
##$TEG= 300
##$TL= (0..7)
0 120 120 120 120 120 120 120 
##$TP= (0..7)
150 150 150 150 150 150 150 150 
##$TP07= 0
##$TPNAME0= <>
##$TPNAME1= <>
##$TPNAME2= <>
##$TPNAME3= <>
##$TPNAME4= <>
##$TPNAME5= <>
##$TPNAME6= <>
##$TPNAME7= <>
##$TPOAL= (0..7)
0.5 0.5 0.5 0.5 0.5 0.5 0.5 0.5 
##$TPOFFS= (0..7)
0 0 0 0 0 0 0 0 
##$TUNHIN= 0
##$TUNHOUT= 0
##$TUNXOUT= 0
##$USERA1= <user>
##$USERA2= <user>
##$USERA3= <user>
##$USERA4= <user>
##$USERA5= <user>
##$V9= 5
##$VALIST= <valist>
##$VCLIST= <CCCCCCCCCCCCCCC>
##$VD= 0
##$VDLIST= <DDDDDDDDDDDDDDD>
##$VPLIST= <PPPPPPPPPPPPPPP>
##$VTLIST= <TTTTTTTTTTTTTTT>
##$WBST= 1024
##$WBSW= 4
##$XGAIN= (0..3)
0 0 0 0 
##$XL= 0
##$YL= 0
##$YMAX_a= 510725
##$YMIN_a= -487608
##$ZGOPTNS= <>
##$ZL1= 120
##$ZL2= 120
##$ZL3= 120
##$ZL4= 120
##$ABSF1= 16.522
##$ABSF2= -4.171173
##$ABSG= 5
##$ABSL= 3
##$ALPHA= 0
##$AQORDER= 0
##$ASSFAC= 0
##$ASSFACI= 0
##$ASSFACX= 0
##$ASSWID= 0
##$AUNMP= <proc_1d>
##$AZFE= 0.1
##$AZFW= 0.1
##$BCFW= 0
##$BC_mod= 0
##$BYTORDP= 0
##$COROFFS= 0
##$CY= 12.5
##$DATMOD= 1
##$DC= 0
##$DFILT= <>
##$DTYPP= 0
##$F1P= 14.0000005364418
##$F2P= -0.99999901652339
##$FCOR= 0.5
##$FTSIZE= 32768
##$FT_mod= 6
##$GAMMA= 0
##$GB= 0
##$INTBC= 1
##$INTSCL= 1
##$ISEN= 128
##$LB= 0.3
##$LEV0= 0
##$LPBIN= 0
##$MAXI= 10000
##$MC2= 0
##$MEAN= 0
##$ME_mod= 0
##$MI= 0
##$NCOEF= 0
##$NC_proc= -2
##$NLEV= 6
##$NOISF1= 0
##$NOISF2= 0
##$NSP= 0
##$NTH_PI= 0
##$NZP= 0
##$OFFSET= 16.522
##$PC= 1
##$PHC0= 170.578
##$PHC1= 1.143792
##$PH_mod= 1
##$PKNL= yes
##$PPARMOD= 0
##$PSCAL= 4
##$PSIGN= 0
##$REVERSE= no
##$SF= 250.13
##$SI= 32768
##$SIGF1= 0
##$SIGF2= 0
##$SINO= 400
##$SIOLD= 32768
##$SREGLST= <1H.CDCl3>
##$SSB= 0
##$STSI= 32768
##$STSR= 0
##$SW_p= 5175.98343685301
##$SYMM= 0
##$S_DEV= 0
##$TDeff= 65536
##$TDoff= 0
##$TI= <Analysis number 999999
Compound Code 99
Book Reference 9
Project Code 9>
##$TILT= no
##$TM1= 0
##$TM2= 0
##$TOPLEV= 0
##$USERP1= <user>
##$USERP2= <user>
##$USERP3= <user>
##$USERP4= <user>
##$USERP5= <user>
##$WDW= 1
##$XDIM= 32768
##$YMAX_p= 346661971
##$YMIN_p= -56296
$$ End of Bruker specific parameters
$$ ---------------------------------
##NTUPLES= NMR SPECTRUM
##VAR_NAME=  FREQUENCY,     SPECTRUM/REAL,   SPECTRUM/IMAG
##SYMBOL=    X,             R,               I
##VAR_TYPE=  INDEPENDENT,   DEPENDENT,       DEPENDENT
##VAR_FORM=  AFFN,          ASDF,            ASDF
##VAR_DIM=   32768,         32768,           32768
##UNITS=     HZ,            ARBITRARY UNITS, ARBITRARY UNITS
##FACTOR=    0.157963299565203, 1,           1
##FIRST=     4132.6476996994, 0,             0
##LAST=      -1043.33573715361, 0,           0
##MIN=       -1043.33573715361, -56296,      0
##MAX=       4132.6476996994, 346661971,     0
$$ Real data points
##PAGE= N=1
##DATA TABLE= (X++(R..R)), XYDATA
$$ [...]
17080A226l00k228k543P238M534k917R90k964j0792l909J616r34M174M292n860
17065h377O84K556K419M030M455O30q425n186j446K304j870k684K265Q361n648
17050e932M920N351P99m601o701o377M44J13j363L942O866L626N301j05m48m132
17034A703L70j110k56L607l522j560K480R306l034o967k505l273p70J68N407P093
17018G137L907J664k261q746m620J592O830l561j285N138L207l956q602p611K957
17003h210K392L043K294j268k529O891J0205Q8q732m762J269L624L014K976r980
16988C15n404m833O61O04l690Q378N576m026j799n733K951Q843J90n253q32p98
16972d850k253j936N479L13N717J126K16L499j296j978l305n937n767J508K835
$$ plain form
17080 1226 926 -1302 -3845 3393 7927 5010 6000 3036 -7756 -11665 -10049 -10983 -6809 -2517 -8377
17065 -8377 -7693 -5137 -2718 1312 5767 6397 -2028 -7214 -8660 -6356 -8226 -10910 -8645 -284 -5932
17050 -5932 -1012 4339 5138 537 -6164 -12541 -12097 -11984 -13347 -9405 -2539 1087 6388 6283 5835 1703
17034 1703 2073 963 707 4314 792 -768 1712 11018 7984 1017 -1488 -4761 -5531 -5363 44 7137
17018 7137 11044 12708 10447 1701 -2919 -1327 5503 1942 657 5795 9002 5046 -3556 -11167 -8210
17003 -8210 -5818 -2775 -481 -1749 -4278 2613 12818 12906 4174 -588 681 4305 7319 10295 315
16988 315 -5089 -9922 -9261 -8657 -12347 -3969 1607 -2419 -4218 -9951 -7000 1843 2033 -3220 -4052 -4850
16972 -4850 -7103 -9039 -3560 -3247 2470 3596 3812 7311 6015 4037 732 -5205 -10972 -9464 -6629
16957f629N296K600m127K10J335m045p760J434R920L884K671p906k633K836P09
16942b205n993r258O832P579m466k93M008N261N086K921r663l055p86n062k706
16927a1800j939j548J158L613O060M722j771K539j136k878m145M447M772k552
16913d58n136M548J031n916M600N458R63l416k030m421l628J953j266N386O484
16898D152K951m993m365j346q119J523N545j599l211o188L498J0850O651O18j299
16883D668p383l392M325n114k798N921Q191j058o193l419N920q96L227J859J297
16868E155M737L416J632k917m534n942k517P84l93l160k085m444p82K773K916
16853e361O353L521m153m419m097L224K122k882M795N836L773n067m465M915O218
$$ plain form
16957 -6629 -1333 1267 -2860 -2650 -1315 -5360 -13120 -11686 -1766 2118 4789 -3117 -5750 -2914 -2205
16942 -2205 -8198 -17456 -10624 -3045 -7511 -7804 -3796 1465 6551 9472 -191 -3246 -4032 -9094 -11800
16927 -11800 -13739 -15287 -14129 -10516 -4456 266 -1505 1034 -102 -2980 -7125 -2678 2094 -458
16913 -458 -5594 -1046 -15 -5931 -1331 4127 5090 1674 -356 -4777 -8405 -6452 -7718 -2332 4152
16898 4152 7103 2110 -2255 -3601 -11720 -10197 -4652 -6251 -9462 -15650 -12152 -1302 5349 5967 4668
16883 4668 -2715 -6107 -1782 -6896 -9694 -3773 4418 3360 -2833 -6252 -332 -1228 1999 3858 5155
16868 5155 9892 13308 14940 12023 7489 1547 -970 -186 -579 -3739 -5824 -10268 -11050 -8277 -5361
16853 -5361 992 4513 360 -4059 -8156 -4932 -2810 -5692 -897 4939 8712 3645 -820 4095 10313
16838A0313l040o593L65M131M85k853R5q14j231p619n59j825k995O361J202M065
16822e12K250K00o26n041Q77K787q002q153N295J2366K169n961k714M063O882
16807E880n805l816L459K713K681o382m683K785j097r156o822L781J643K192Q462
16792d165K546O668K591k51J849r119l307o753l170O908L46L020P916K445j318
16777F206P382k548o005J178O017J153o259j0k171k043o027J623K56l764K85j177
16761e904m860R81K300Q245J344J71J207J526k600l154M632k135k903n495o41
16746g286J955q800n64J2631K589J109j345l194j106J876J941k8k22P17L427r05
16730B795K13N55q66L787p753J575l455j985m752O265O560K015L606k312q23l050
$$ plain form
16838 10313 7273 680 1045 5176 5661 2808 2903 2089 858 -6761 -7320 -9145 -12140 -5779 -4577 -512
16822 -512 1738 1938 1312 -3729 -2852 -65 -8067 -16220 -10925 1441 3610 -2351 -5065 -1002 5880
16807 5880 75 -3741 -282 2431 5112 -1270 -5953 -3168 -4265 -13421 -20243 -16462 -14819 -12627 -4165
16792 -4165 -1619 5049 7640 7389 9238 119 -3188 -9941 -13111 -6203 -5857 -2837 5079 7524 6206
16777 6206 13588 11040 5035 6213 12230 13383 7124 7114 4943 2900 -3127 -1504 -1248 -5012 -4727 -5904
16761 -5904 -10764 -9783 -7483 762 2106 2277 3484 5010 2410 -744 3888 1753 -1150 -6645 -7286
16746 -7286 -5331 -14131 -14695 -2064 525 1634 289 -2905 -4011 -2135 -194 -222 -444 273 3700 2795
16730 2795 3008 3563 2697 6484 -1269 306 -3149 -5134 -9886 -3621 2939 4954 8560 6248 5425 2375
16714B375M237K823o586p726J611J759K660n14n526K972M804P50J389J1555N164
16699B1747l692p448p608o494l372k215J996N500P220o369r544j954k79L212L086
16684f214L010j84l395j368L195R337N480o966n068o37J458N014K761k978m205
16669g60K153K495M367j954n101r47j921m768N442j449L42n00k852K945K998o77
16653a87K905J245j0515n721P343L260O809J405o027n436j372J147j97m291j988
16638a1620O156N091k110m71L703J470l094o805O954K761J499k199l237N373K877
16623F348J562O33l187k680K235p619M163m774l529p90kN142K331Q103m063r495
16607e622K569k765o291Q45Q215N472K57K02k840K10k080J65J328N37k51K255
$$ plain form
16714 2375 6612 9435 2849 -4877 -3266 -1507 1153 639 -4887 -1915 2889 3639 5028 16583 21747
16699 21747 18055 10607 2999 -3495 -6867 -9082 -7086 -1586 5634 -735 -10279 -12233 -12512 -9300 -6214
16684 -6214 -3204 -3388 -6783 -8151 -4956 4381 9861 2895 -2173 -2810 -1352 3662 6423 3445 -760
16669 -760 1393 3888 8255 6301 1200 253 -1668 -6436 -994 -2443 -2101 -2601 -5453 -2508 490 -187
16653 -187 2718 3963 -6552 -12273 -4930 -1670 5139 6544 517 -4919 -6291 -5144 -5341 -9632 -11620
16638 -11620 -5464 -373 -2483 -2954 749 2219 -875 -7680 -726 2035 3534 1335 -1902 3471 6348
16623 6348 7910 8543 5356 2676 4911 -2708 1455 -3319 -6848 -7638 -7640 -2498 -167 7936 3873 -5622
16607 -5622 -3053 -5818 -12109 -11264 -3049 2423 2680 2882 42 252 -1828 -1663 -335 202 -49 2206
16591B206k345n552O14M642K689l856J199l722K464j806M365J865n202l986J816
16576d609N821N469o386r48M108l887l516L477k809l311R141R37R49K52j051l602
16560C5N90L992J57K602n202l979r36j0399l124P084Q797O76l001Q80q241M594
16544e475K449K083K330m980J009M615j53J150L237J695M79J777l332n998j018
16529a32J594l950j146O37n678R06J826M99M96j1940k863J0555R239L731l563
16514B11l401p149k525N35O350n99o41j511q390p61N790P906P51k499Q89L578
16498a466L451j871o863o044K723K105k668J08J855o80N716j937O88P063M560
16483F740r96r693M703L509J465L386l983j019K75j807q43K494o639k187K037
$$ plain form
16591 2206 -139 -5691 -5077 -435 2254 -1602 -403 -4125 -1661 -3467 898 2763 -2439 -6425 -4609
16576 -4609 1212 6681 295 -653 3455 -432 -3948 -471 -3280 -6591 2550 3487 4436 4688 3637 35
16560 35 625 4617 4774 7376 2174 -1805 -2741 -13140 -16264 -9180 -383 293 -2708 -1828 -10069 -5475
16544 -5475 -3026 -943 1387 -3593 -2584 2031 1878 3028 6265 7960 8439 10216 6884 886 -132
16529 -132 1462 -2488 -3634 -2997 -8675 -7769 -5943 -5444 -4948 -16888 -19751 -9196 43 3774 211
16514 211 -3190 -10339 -12864 -12329 -5979 -6578 -7219 -8730 -17120 -17881 -12091 -4185 -3434 -5933 -5044 -1466
16498 -1466 1985 114 -6749 -12793 -10070 -7965 -10633 -10525 -8670 -9350 -3634 -5571 -4883 2180 6740
16483 6740 5744 -3949 754 4263 5728 9114 5131 4112 4387 2580 1737 4231 -2408 -4595 -2558
16468b558l305L22n42N135N381K092L180P63j1379j3322k899K639O996J011L635
16453b851J507N982J0531l257k321l02m270m708l770j642k88L44j27Q926k678
16438A076o607P262k776k634J025J050M5p184j873O000j789J198o036k657k97
16423a4197l11K430J2365j450r56K82k207l045J290N698J524o019N943J043k098
16408B92J010N722J685l147m274o956K927m817K407L160K90L921M639m76l623
16393B760l611o720K087o43K568R05J40r92Q88J770K825L689l243n420J089k218
16377d126m331J449K474P14J07N145O556J2367J295r979n737m358J345K237n004
16362A54l705k607j203O85n593L705M489q17P93K87K345J479l76M332L8l332N70
$$ plain form
16468 -2558 -5863 -5541 -6083 -948 4433 6525 9705 10468 -911 -14233 -17132 -14493 -7497 -6486 -2851
16453 -2851 -1344 4638 15169 11912 9591 9289 5019 311 -3459 -5101 -5389 -5045 -5172 3754 1076
16438 1076 -5531 1731 -1045 -3679 -2654 -1604 -1559 -8743 -10616 -4616 -6405 -5207 -11243 -13900 -14197
16423 -14197 -14508 -12078 287 -1163 -2119 -1837 -4044 -7089 -5799 -101 1423 -4596 1347 2390 292
16408 292 1302 7024 8709 5562 1288 -5668 -2741 -7558 -5151 -1991 -1701 2220 6859 6383 2760
16393 2760 -851 -7571 -5484 -6127 -3559 -2654 -2514 -3506 -2618 -848 1977 5666 2423 -2997 -1908 -4126
16377 -4126 -8457 -7008 -4534 -3820 -3713 1432 7988 20355 21650 11671 5934 1576 2921 5158 154
16362 154 -3551 -6158 -7361 -6676 -12269 -8564 -4075 -4892 -4099 -3812 -1467 12 -364 3968 4006 674 1244
16345A244k256K671j125j743n230k015j898K732M902N539k473L433N178L982J915
16330A4856l114m263o699k436j736l028M753k642k394k167m663J563M709P80O561
16315H0L751L098n103p031M498j893l370k16k461j548M129M843n1J456n700p295
16299a2813J905N168J125j661M644j739k143k33Q726O540k905n63m44K365K020
16284I992o676q027k702L171J284l230Q338l200m508k541Q094Q628k482p754P342
16269E729O446J094o250P61R51k325m009o035l197j295K875N023P408o484n874
16254e182L079K833P61o409q732J716Q047Q407M851L58l69J549m266o737K625
16239B531l12j636j011O118j0534j316N348L587p35N434R930k881j2690n147L103
$$ plain form
16345 1244 -1012 1659 534 -1209 -6439 -8454 -10352 -7620 -2718 2821 348 3781 8959 12941 14856
16330 14856 11742 7479 780 -1656 -3392 -6420 -1667 -4309 -6703 -8870 -13533 -11970 -7261 -6481 80
16315 80 3831 6929 1826 -5205 -707 -2600 -5970 -6186 -8647 -10195 -6066 -1223 -1274 182 -5518 -12813
16299 -12813 -10908 -5740 -4615 -6276 -1632 -3371 -5514 -5747 2979 9519 6614 6051 5607 7972 9992
16284 9992 3316 -4711 -7413 -4242 -2958 -6188 2150 -1050 -5558 -8099 -5 8623 6141 -1613 5729
16269 5729 12175 13269 7019 7780 8731 6406 2397 -3638 -6835 -8130 -5255 -232 7176 692 -5182
16254 -5182 -2103 730 1491 -4918 -13650 -11934 -3887 4520 9371 9729 9360 10909 6643 -94 2531
16239 2531 2219 583 -428 5690 -4844 -6160 -812 2775 2040 7474 17404 14523 1833 -3314 -211
16224b11l409j535k894m914M765P006L996J960m062j3433J631r53J888K000k699
16209a0864J88M608k703k652O480J143l5M740l476k431K828n87m039n577O522
16194e855O051n02P246R159p041n676q9N20L442O043p929m165k653k92J175J441
16178H75N403L196l389j0042m252N087Q525p092m48M533J743R42n884r394n570
16163a5767K09N186K588k720L694q16j837N445L838k912m858r24L678j844j511
16148h551J174R85M183o38l412N050M512K050R57r15m054L677J432p476k141N598
16132B431M804J1185o925o413k658l150n125k256K433O212M41n080j515k48q047
16117a3911o03O549j466J26k446k099Q056Q018K505J413m385o477k633j932J140
$$ plain form
16224 -211 -3620 -5155 -8049 -12963 -8198 -1192 2804 4764 702 -12731 -11100 -12053 -10165 -8165 -10864
16209 -10864 -10676 -6068 -8771 -11423 -4943 -3800 -3835 905 -2571 -5002 -2174 -2761 -6800 -12377 -5855
16194 -5855 196 -306 6940 16099 9058 3382 3293 3813 7255 13298 5369 1204 -1449 -1741 -566 875
16178 875 6278 9474 6085 -3957 -8209 -3122 5403 -1689 -2137 2396 4139 5081 -803 -10197 -15767
16163 -15767 -15558 -10372 -7784 -10504 -6810 -7626 -9463 -4018 -180 -3092 -7950 -8874 -5196 -7040 -8551
16148 -8551 -7377 -6392 -2209 -2847 -6259 -1209 3303 5353 6310 5395 1341 5018 6450 -1026 -3167 2431
16132 2431 7235 18420 11495 5082 2424 -726 -5851 -8107 -5674 538 979 -4101 -5616 -5864 -13911
16117 -13911 -14514 -7965 -9431 -9305 -11751 -13850 -5794 2224 4729 6142 1757 -4720 -7353 -9285 -8145
16102h145P05O03L309J766k903k922O817J219Q87l58n152o954K27N464J048m507
16086h896n67N411o10r320m746O77N496R202M899k638J501J96j28l107q580R81
16070a0229N481O872L669r25j773q80l295K203k533j225lj797j771K038k209l672
16054a0049J049O451r24L215J0524P944j500l526N026K3292K3568P929L578k0963
16040E5614k8734j6192r752K956R91M01k844k448M991J715Q3l544P61k844K88
16025A442k506m014L139k41J196j640k783n864M255P677O341n45m424J760L90
16010D183m808M709k277j317j937j347n775J81L114N575r59l430l438J341L446
15995b739o781m52Q224P536P072q765n873k480J025O013K147J457K247j020N53
$$ plain form
16102 -8145 -7440 -6837 -3528 -1762 -4665 -7587 -770 449 1336 978 -4174 -11128 -10901 -5437 -4389 -8896
16086 -8896 -9463 -4052 -4662 -13982 -18728 -18051 -12555 -3353 1546 -1092 409 605 477 -2630 -11210 -10229
16070 -10229 -4748 2124 5793 4868 3095 2215 -1080 1123 -1410 -2635 -2638 -4435 -6206 -4168 -6377 -10049
16054 -10049 -9000 -2549 -3473 -258 10266 18210 16710 13184 18210 41502 65070 72999 76577 55614
16040 55614 26880 10688 936 3892 4883 5284 2440 -8 4983 6698 6781 3237 3998 1154 1442
16025 1442 -1064 -5078 -1939 -2180 -984 -2624 -5407 -11271 -7016 661 7002 6457 2033 3793 4183
16010 4183 -625 4084 1807 490 -1447 -2794 -8569 -8388 -5274 301 -658 -4088 -7526 -6185 -2739
15995 -2739 -9520 -9972 -1748 5788 12860 4095 -1778 -4258 -3233 2780 4927 6384 8631 7611 8164
15980H164k972n4n813j1038p52n44N215M505K166L000N667M94n72J336q086r586
15964h870L881M149J576P270l264l13k294K890O336k103N036j0053p688M639j023
15949A69J134K678n257m973M416P469N188J30k794p921p705j039N326L525j331
15934i85n31j468l140P93L221k314o00O546L879j1814l070M264Q15K65n05l162
15918g806J1984Q443L46k657o31k148k787q33N64n888m876M290K666J693M599
15903F959j177M981Q06m313m849q076N509O653n132j188k131j578j538L284M996
15888C206J040m985o047Q223M521P39Q25q073l389j393L55J462o88j38M074M886
15872D618o216j046l43n503L451R179N166L358K658l388L569l524n616N317p321
$$ plain form
15980 8164 5192 5138 -675 -11713 -12465 -13009 -7794 -3289 -1123 1877 7544 8038 7466 8802 716 -8870
15964 -8870 -4989 -840 736 8006 4742 4429 2135 5025 11361 9258 14294 4241 -3447 1192 169
15949 169 1303 3981 -1276 -6249 -1833 5636 10824 10954 8160 239 -7466 -8505 -3179 346 -985
15934 -985 -1516 -2984 -6124 -5331 -2110 -4424 -5024 1522 5401 -6413 -9483 -5219 -4404 -4139 -4644 -7806
15918 -7806 4178 12621 12967 10310 9679 7531 4744 3911 4475 -1413 -6289 -1999 667 2360 6959
15903 6959 5782 10763 11569 7256 2407 -5669 -160 6493 1361 173 -1958 -3536 -5074 -1790 3206
15888 3206 4246 -739 -6786 1437 5958 6697 7522 -551 -3940 -5333 -4978 -3516 -4204 -4342 -268 4618
15872 4618 -1598 -2644 -2987 -8490 -5039 4140 9306 12664 15322 11934 15503 11979 6363 11680 4359
15857D359L553L182m45q666l231n19K251J810K929m901n402J358j416j324K068
15842d394m834p49j003j573J892m97n469l1L868m007n0P892L728P77Q7M762L172
15825C571M218n789J36K596k97r358j606L591P734j866m734m908m393Q282k222
15810e045l704K024P469K10n761n38j644P002L071l730N623J255j916N32p324
15795b476K423j181j813M153l503l99L042o368l300O843K689q687m89O134N370
15780B438l54m490K26j416K175K712O110O55k866k680l457n005r805m399j436
15765b1592M402R039L389k863M188J334n194K152K101J572n59J23l05o181q720
15750a7114N47O716M138K181O326L448l882k111l102m939L88p583q465m93L210
$$ plain form
15857 4359 7912 11094 10649 1983 -1248 -1767 484 2294 5223 322 -5080 -3722 -5138 -6462 -4394
15842 -4394 -9228 -9977 -10980 -12553 -10661 -11158 -16627 -16658 -12790 -16797 -16847 -8955 -5227 -4450 -4363 399 3571
15825 3571 7789 2000 2136 4732 4435 -4923 -6529 -2938 4796 2930 -1804 -6712 -11105 -2823 -5045
15810 -5045 -8749 -6725 744 954 -4807 -5345 -6989 13 3084 -646 4977 6232 4316 4848 -2476
15795 -2476 -53 -1234 -3047 1106 -2397 -2796 246 -6122 -9422 -2579 110 -8577 -9066 -2932 2438
15780 2438 2084 -2406 -2180 -3596 -1421 1291 7401 8056 5190 2510 -947 -5952 -15757 -20156 -21592
15765 -21592 -17190 -8151 -4762 -7625 -3437 -2103 -7297 -5145 -3044 -1472 -2031 -1908 -2213 -8394 -17114
15750 -17114 -16567 -9851 -5713 -3532 2794 6242 2360 249 -2853 -7792 -7404 -14987 -23452 -23945 -20735
15735b0735M12L850M727M551Q387P889K346k166o832p245o608r98L718j253K264
15720g693l056j180J90m550N645l02J584N109L238l389k670O642J155n696l334
15705h307k488L29Q727k134p328j54Q686o52l203k873o59M709M62K001M60l512
15689e936m585P23l52q6j640O079K806k385o603o306R58Q325k549n139R54j589
15673a7325Q802l598j735l882L926p43L496L963N315P90K216J380l93n821q736
15658a2345L127j296J430O719L99n430J716m028J588K643J112l515M778Q608J494
15643G000o026n169o979l690J293J851Q52M779R62M226K535j1353N71J417O43
15628g088L159J2996R15o941m010k961j962K811J717N041P348J989j0038m728
$$ plain form
15735 -20735 -20323 -16473 -11746 -7195 1192 9081 11427 9261 2429 -4816 -11424 -12422 -8704 -9957 -7693
15720 -7693 -10749 -11929 -11739 -16289 -10644 -10946 -9362 -4253 -1015 -4404 -7074 -432 723 -4973 -8307
15705 -8307 -10795 -10466 -1739 -3873 -11201 -11355 -2669 -3321 -6524 -9397 -10056 -5347 -4885 -2884 -2424 -5936
15689 -5936 -10521 -9798 -10150 -10236 -11876 -5797 -2991 -5376 -11979 -18285 -17327 -9002 -11551 -16690 -15736 -17325
15673 -17325 -8523 -12121 -13856 -17738 -13812 -14555 -11059 -7096 -1781 -991 1225 2605 2212 -3609 -12345
15658 -12345 -9218 -10514 -9084 -2365 -1966 -7396 -5680 -9708 -8120 -5477 -4365 -7880 -3102 5506 7000
15643 7000 974 -4195 -11174 -14864 -13571 -11720 -10868 -6089 -5127 -901 1634 -9719 -9148 -7731 -7088
15628 -7088 -3929 9067 9982 3041 -969 -3930 -5892 -3081 -1364 3677 11025 13014 2976 -1752
15614a752m53Q368M884l582o193m944l813K045M529n423K921q32o170j361L572
15599h204K497L620j521O17Q23J715l375p627k776K988N197O074k900R345M221
15584A0694o189o367N952K064l085n960j862L217k07l636o582l378P33R488L530
15569a588m512n15p93k944j989O323o091L189J692L733k057J15M312J636o443
15554e932J789R138K635K517m939k886o87J560M16Q644P421m213r644j2376n702
15539a2259m598j012O954R898l128J766r3j414l210L504O176N285K336l635j605
15524D965Q94K608j56J073k375m593J949J292J280L408o42K790n569p724k91n665
15508f756M416Q003k493M505o45j004q758J456K181j116j689J265q90j656j751
$$ plain form
15614 -1752 -2205 6163 11047 7465 1272 -3672 -7485 -5440 -911 -6334 -3413 -4245 -10415 -11776 -8204
15599 -8204 -5707 -2087 -3608 -2991 -2168 -453 -3828 -11455 -14231 -11243 -6046 28 -2872 6473 10694
15584 10694 4505 -1862 4090 6154 3069 -2891 -4753 -1536 -1743 -5379 -11961 -15339 -14606 -5118 -1588
15569 -1588 -6100 -6615 -7408 -10352 -12341 -6018 -12109 -8920 -7228 -3495 -5552 -5437 -1125 511 -5932
15554 -5932 -4143 4995 7630 10147 5208 2322 1635 3195 3611 12255 19676 15463 5819 -6557 -12259
15539 -12259 -16857 -17869 -10915 -1017 -4145 -2379 -2472 -3886 -7096 -3592 2584 7869 10205 6570 4965
15524 4965 5859 8467 8311 9384 7009 2416 4365 5657 6937 10345 9703 12493 6924 -800 -1091 -6756
15508 -6756 -2340 5663 3170 7675 7030 6026 -2732 -1276 905 -211 -1900 -635 -1525 -3181 -4932
15493d932l464J226K081J088J001k915K809O118Q21j025m744P770N541l355j1534
15478c514p879J313P642O258L575j246j240m827K646J320J292j16o759k856k597
15463f988l19L253M589Q01o967J619l29J506L974J96r401j226P495M698l846l127
15447d072M155L445M153M026j951m006k384m848J80K881K091m278j503L219L055
15432D163j235K118L273L160J604j954n521k159j0676j356J960L669K819K859
15418B724J963m443n866K786P301O21J839p301p220J304Q156P4l004k818L01M692
15402A109m528k077m42k108j091k273M7Q173L529L880m942p935K798M883n843
15387f820l071J804K192j063k12Q81m659k274O753J0919L505n654n027R3l19q44
$$ plain form
15493 -4932 -8396 -7170 -5089 -4001 -3000 -5915 -3106 3012 3833 2808 -1936 5834 11375 8020 -3514
15478 -3514 -11393 -10080 -2438 3820 7395 6149 4909 82 2728 4048 5340 5224 -1535 -4391 -6988
15463 -6988 -7307 -4054 535 1336 -5631 -4012 -4341 -2835 1139 1335 -8066 -9292 -1797 2901 -945 -4072
15447 -4072 83 3528 7681 11707 9756 5750 3366 -1482 -1302 1579 3670 -608 -2111 1108 4163
15432 4163 2928 5046 8319 11479 13083 11129 5608 3449 -7227 -8583 -6623 -2954 -135 2724
15418 2724 4687 244 -5622 -2836 4465 5086 6925 -376 -7596 -6292 1864 1938 -1066 -3884 -3583 1109
15402 1109 -3419 -5496 -5938 -8046 -9137 -11410 -11363 -3190 339 4219 -723 -8658 -5860 -977 -6820
15387 -6820 -9891 -8087 -5895 -6958 -7170 -6289 -10948 -13222 -6469 4450 7955 2301 -2726 -2633 -2952 -3796
15371c796J017p64J681o684k563J107o761K634M281P649M044l932L45m64m871
15356g077m670M515P604q13j795k630M729K735O800P710J780j1166q330k431m403
15341g442O55m878J471M652p918r29K323J471O787k580r49L484N309K204o050
15326b390n75N163l455n914m077N108O237m492k081R32O472k81j240l515Q50N093
15310A835k034k58q33o759J858J956l37L782m085n173Q21J0051P956n559j0578
15295g357j643J565Q783P2J07J548j590k965J4K739J692n150r841L068P153m386
15279f191k236j911M379P076J766p144o103m640j521O109K705K887k617j584J859
15264g166j119M913L076J258n705n57P20m95l890O243M274m266L828J006k20j568
$$ plain form
15371 -3796 -2779 -3543 -1862 -8546 -11109 -10002 -16763 -14129 -9848 -2199 1845 -2087 -1742 -2206 -7077
15356 -7077 -11747 -7232 372 -441 -2236 -4866 -137 2598 9398 17108 18888 7722 -608 -3039 -7442
15341 -7442 -6787 -11665 -10194 -5542 -13460 -14389 -12066 -10595 -3808 -6388 -7337 -3853 1456 3660 -2390
15326 -2390 -2965 2198 -1257 -7171 -11248 -6140 97 -4395 -6476 -5544 928 647 -593 -4108 -3258 1835
15310 1835 -199 -457 -1290 -8049 -6191 -4235 -4572 -790 -4875 -10048 -9227 824 8780 3221 -7357
15295 -7357 -9000 -7435 1348 1420 1527 3075 1485 -1480 -1466 1273 2965 -2185 -12026 -8958 -1805 -6191
15279 -6191 -8427 -10338 -5959 1117 2883 -4261 -10364 -15004 -16525 -10416 -7711 -4824 -7441 -9025 -7166
15264 -7166 -8285 -3372 -296 962 -4743 -5300 -4580 -5075 -8965 -2722 1552 -2714 1114 2120 1900 332
15248C32j274N545J037o084m587m604l301M112O636L744J87m93q48m962n772L622
15232f710P768P788j289r742o389P487J838j205l599p237L198R655M061k847m405
15217a628K633K026J014r86O20n247r011m271n69L319L854M028q65p396J638q33
15201a1674j30L493K934N185J950K761p378n793j874n95l096l885M175O011l675
15186a1591m361P00L702P808K040n578j172K750j363l330J890j038K99N539P441
15171C736M340Q45l443m436N29M44L516q082p384O940K804j4165m154J0611J142
15156f757n58J071k196J473O947R209K069n136p202L38j318M281m732L7J556R83
15140F5o982p646L723O781O729q283K231L121J43r206O82M094N258K317K48j24
$$ plain form
15248 332 -942 4603 5640 -444 -5031 -9635 -12936 -8824 -2188 1556 1743 1250 402 -4560 -10332 -6710
15232 -6710 1058 8846 7557 -2185 -8574 -1087 751 -454 -4053 -11290 -8092 1563 5624 2777 -1628
15217 -1628 1005 3031 4045 3059 3679 -1568 -10579 -14850 -15419 -12100 -8246 -4218 -5083 -12479 -10841 -11674
15201 -11674 -11804 -8311 -5377 -192 1758 4519 -2859 -8652 -10526 -11121 -14217 -18102 -13927 -7916 -11591
15186 -11591 -15952 -15252 -11550 -3742 -1702 -7280 -8452 -5702 -7065 -10395 -8505 -9543 -9244 -3705 3736
15171 3736 8076 8921 5478 1042 1571 2015 5531 -2551 -9935 -2995 -191 -14356 -18510 -7899 -6757
15156 -6757 -7315 -6244 -8440 -6967 -20 9189 11258 6122 -1080 -742 -2060 2221 -2511 -2474 -918 65
15140 65 -6917 -14563 -10840 -4059 2670 -5613 -3382 -261 -118 -9324 -8642 -4548 710 3027 3275 3151
15124C151p79n88j15n791m266j665M879o38M94J137m356m919O806M631k567O104
15108A518o41j443p19J224m548n724l675R876N884K83L813r57m970o861q896K081
15092a3755Q317l563p52P342K878K314m148q634j755n002j241N486J946n013j641
15077a7221m41J2680K957m683l091L8N138n85L647o838n340L801K500L15J374
15062e749m153o73l716k988L522M768M433p31k703p166q04L039J513N413M484
15047a511M112o468o484l10N107L012O768P44Q029J741l072k732j203o074k588
15032i29M138M407k165k703p663m74L260O500j964K387N73k516O901q232m626
15017c106m37j442L01J754o753j102K795N187Q81l802k590J988J478j570M160
$$ plain form
15124 3151 2372 1784 1669 -4122 -8388 -10053 -5174 -5812 -5318 -4181 -8537 -13456 -6650 -2019 -4586 1518
15108 1518 877 -566 -1285 -61 -4609 -10333 -14008 -4132 1752 2035 5848 4891 -79 -6940 -15836 -13755
15092 -13755 -5438 -9001 -9753 -2411 467 2781 -1367 -10001 -11756 -16758 -17999 -12513 -10567 -15580 -17221
15077 -17221 -17662 -4982 -2025 -6708 -9799 -9761 -4623 -5208 -1561 -8399 -13739 -9938 -7438 -7123 -5749
15062 -5749 -9902 -10575 -14291 -17279 -13757 -8989 -4556 -5287 -7990 -15156 -15960 -12921 -11408 -5995 -1511
15047 -1511 2601 -3867 -10351 -10661 -5554 -2542 4226 4970 12999 14740 11668 8936 7733 1659 -929
15032 -929 3209 7616 5451 2748 -4915 -5389 -2129 4371 2407 4794 5367 2851 9752 1520 -3106
15017 -3106 -3543 -4985 -4684 -2930 -9683 -10785 -7990 -2803 -1922 -5724 -8314 -6326 -4848 -6418 -2258
15002b258P520P756r191p089K64K919Q591M825p481l064o287q299o5L022O500
14987b337N21l395j674O135J041L855M013p707q240l799m504M828O251J006j565
14972e571M381R602K268q867j0256M141qJ764R84R50K282M393n022p253J44K720
14956c348N58j985l768K210J975k216l101p25m92N032N27K560N491k617j890l61
14940b150P53J352q021k505K931k491l657P30q27l37k03J0499Q065p183j633L688
14924i89l325r439M975K658K155J045N66J354j559n762m592M683j745o395K489
14909a3881n2O232P705K12j108J347Q32q510l265j107K825k026m138Q02N659K306
14893f167k940j354Q50O65J308J281N566J0072n201r068j196m29k184K156k486
$$ plain form
15002 -2258 5262 13018 3827 -3262 -2998 -79 8512 13337 5856 2792 -3495 -11794 -11859 -8837 -2337
14987 -2337 -1816 -5211 -6885 -750 291 4146 8159 452 -7788 -11587 -16091 -11263 -5012 -4006 -5571
14972 -5571 -1190 8412 10680 1813 -8443 -4302 -4310 -2546 -1562 -612 1670 6063 1041 -6212 -6068 -3348
14956 -3348 -2790 -4775 -8543 -6333 -4358 -6574 -9675 -10400 -10892 -5860 -5333 -2773 2718 101 -1789 -2150
14940 -2150 -1397 -45 -8066 -10571 -7640 -10131 -13788 -13058 -13885 -14222 -14425 -3926 4139 -3044 -4677 -989
14924 -989 -4314 -13753 -8778 -6120 -3965 -2920 -2354 -1000 -2559 -8321 -12913 -8230 -9975 -16370 -13881
14909 -13881 -13933 -7701 4 216 -892 455 1287 -7223 -10488 -11595 -8770 -10796 -14934 -14132 -8473 -6167
14893 -6167 -9107 -10461 -9611 -8946 -7638 -6357 -791 9281 4080 -4988 -6184 -6613 -8797 -6641 -9127
14878i127k93L439K765Q405R20K936k097o43K769m664p073R439L336n06j438M019
14862A2187M077N24n566j474j134j1947K243O137j793K114j21k026j789n760P172
14847B844O175j523m458M506K779m493l784o211j613m390J785K281K577j348M366
14832e07j205l615J995Q011K875m640j897j641K875J91M170J539J809J991m587
14817G364m003K046p745o012k977p619K637j984M142Q050M519k020k031q402O996
14802g039k668k867J823J961m515J601J2684L284L663o366j984N234l460m649
14788c298K608K928n396l036k14j14P350M221n389o92J730K693l82p963N191J457
14772A694o615k469j448k810L392Q31j496j692L417J386n187O045K650k557k592
$$ plain form
14878 -9127 -9420 -5981 -3216 5189 6109 9045 6948 6305 9074 4410 -2663 6776 10112 9606 8168 12187
14862 12187 16264 16788 11222 9748 8614 -3333 -1090 5047 3254 5368 5247 3221 1432 -4328 2844
14847 2844 9019 7496 3038 7544 10323 5830 2046 -4165 -5778 -10168 -8383 -6102 -3525 -4873 -507
14832 -507 -1712 -5327 -3332 4679 7554 2914 1017 -624 2251 2442 6612 8151 9960 11951 7364
14817 7364 3361 5407 -2338 -8350 -11327 -18946 -16309 -18293 -14151 -6101 -1582 -3602 -5633 -14035 -7039
14802 -7039 -9707 -12574 -10751 -8790 -13305 -11704 980 4264 7927 1561 -423 4811 1351 -3298
14788 -3298 -690 2238 -3158 -6194 -6408 -6522 828 5049 -340 -1032 698 3391 3009 -4954 237 1694
14772 1694 -4921 -7390 -8838 -11648 -8256 -7425 -8921 -10613 -7196 -5810 -10997 -4952 -2302 -4859 -7451
14757g451K624O60n659m093K361P843K279k368K068P13L823K536k170O4l775m393
14741d938L539J375L736m423L043J526m150p42o91k845J143L392K312K60o385
14726c848O312j752p257o877L288Q041K692o81L951K44m890L339L538p981p214
14711i095L402K16m544o003k671m439J579R885P431J98l691k009K910J400n20
14696e951J232R93l824J469J292J745Q19m66l005K39j570l495J63N366p88l973
14680i754O842r20m194j873O3K461j696Q942M950o771P55N494l579Q65l0m781
14664c226k950q74J954K291k981N09J711l511M906L874l20k975J633N64J939L34
14648B878n390L486n274n32L862N086l803o296J715Q9m10k208j964q28K196q66
$$ plain form
14757 -7451 -4827 -4167 -9826 -13919 -11558 -3715 -1436 -3804 -1736 -1023 2800 5336 3166 3230 -545 -4938
14741 -4938 -1399 -24 3712 -711 2332 3858 -292 -1034 -1725 -4570 -3427 -35 2277 2537 -3848
14726 -3848 2464 712 -6545 -13422 -10134 -2093 599 -82 3869 4113 -777 2562 6100 -1881 -9095
14711 -9095 -5693 -5477 -10021 -16024 -18695 -23134 -21555 -11670 -4239 -4041 -7732 -9741 -6831 -5431 -5951
14696 -5951 -4719 -3726 -7550 -6081 -4789 -3044 -2225 -2691 -5696 -5457 -7027 -10522 -10359 -4993 -5781 -9754
14680 -9754 -2912 -3832 -8026 -9899 -9836 -7375 -9071 -129 4821 -1950 -1195 4299 720 1585 1555 -3226
14664 -3226 -6176 -7050 -5096 -2805 -5786 -5277 -3566 -7077 -2171 1703 1383 -1592 41 605 2544 2878
14648 2878 -2512 974 -4300 -4832 -970 4116 313 -5983 -4268 -4179 -4589 -6797 -8761 -9589 -7393 -8259
14632h259k482l126j24J392M662K298n181L34M248J516O261L416j005L446O403
14617A3799n473q138o3o576l656q038O366K018K766j985K284L191J585K257O144
14602F481N97J795n516L36N038j213J363j484n368k825N594P031o111j1089K619
14587b752j257j561P792R123l710q063l761N936j769l269K121j890m079j289k626
14572a1054M97J1279N371k669R23j754k902K593J557k508l299n027j340l997J71
14557a2159N450N490k756l875K726j398j189l399P119l717K154J405l972L698
14543d423j289m644J778O776L33j248m488L312R77l144N755L818K485K385J277
14528I660L472J065o481l233j072k096n114m588J300k382o04M014K902N949R96
$$ plain form
14632 -8259 -10741 -13867 -13991 -12599 -7937 -5639 -10820 -10486 -6238 -4722 1539 4955 3950 7396 13799
14617 13799 8326 188 125 -6451 -10107 -18145 -11779 -9761 -6995 -8980 -6696 -3505 -1920 337 6481
14602 6481 7078 8873 3357 3693 8731 7518 8881 7397 2029 -796 4798 11829 5718 -5371 -2752
14587 -2752 -4009 -5570 2222 11345 7635 -428 -4189 1747 -22 -3291 -1170 -3060 -7139 -8428 -11054
14572 -11054 -10557 722 6093 3424 4347 2593 -309 2284 3841 1333 -1966 -6993 -8333 -12330 -12159
14557 -12159 -6709 -1219 -3975 -7850 -5124 -6522 -7711 -11110 -3991 -7708 -5554 -4149 -8121 -4423
14543 -4423 -5712 -10356 -8578 -1802 -1469 -2717 -7205 -3893 -2916 -6060 -305 3513 5998 8383 9660
14528 9660 13132 14197 7716 4483 3411 1315 -3799 -8387 -7087 -9469 -10073 -6059 -3157 2792 3788
14513C788l844p12k589O500P354j344J862k523n564k784p114k417q32m44L217
14498g446L706P9M60J076m532r33k790L803J5659N866j531K27m027K411j585j308
14482I135L05k865o862O757K575p070m517m071K416J151K555m851k307j323k433
14467a1405j265O551N570K690N872M81j062M40j658L844k061K391K947l885n471
14452C979l507J4M142M83K201k098j061j621J835P05p44m03k683m326j569j915
14436f568p487m305N875P706k886n018m058o584J1265M530m799J684L555M699
14422b391N282m617p042M850n147j314M117L873P85o607N281N160K544M143J487
14407A0404q20p716n271N30J559j120L792P52p453n351j880M74j518N45N876J0734
$$ plain form
14513 3788 -56 -768 -3357 3143 10497 9153 11015 8492 2928 144 -6970 -9387 -10219 -10663 -7446
14498 -7446 -3740 -3661 -3201 -2125 -6657 -7590 -10380 -6577 9082 14948 13417 13644 9617 12028 10443 9135
14482 9135 9440 6575 -287 6470 9045 1975 -2542 -6613 -4197 -3046 -491 -5342 -7649 -8972 -11405
14467 -11405 -12670 -6119 -549 2141 8013 8494 7432 7872 6214 10058 7997 10388 13335 9450 3979
14452 3979 472 486 4628 5111 7312 5214 4153 2532 4367 5072 4328 3925 1242 -3084 -4653 -6568
14436 -6568 -14055 -18360 -12485 -4779 -7665 -12683 -16741 -23325 -12060 -7530 -12329 -10645 -7090 -2391
14422 -2391 2891 -1726 -8768 -3918 -9065 -10379 -6262 -2389 -1604 -8211 -2930 2230 4774 8917 10404
14407 10404 9584 1868 -3403 -2873 -1314 -2434 1358 2110 -5343 -10694 -12574 -12100 -13618 -13073 -7197 3537
14391C537R332J443m419p071l208N735J791l027R7o746p81n882P712K709q281
14376g059M07K117J747M292j604L072r65p016j993J907N287R20l619n839M090
14361d256k395l32K458k71r0J686k07r99Q86P85K691k888p121p8M537j944m802
14344a2340k576J968j451J011K218P365J975l141L805L047L440n430n303P293
14330A881l435M743O624l20l667J82K572J246l627o079J822L078k230k136J47
14315H01M400k541k58O381J111o928j336j797j176j731j278J024n634m567J899
14300a1630R047l52K083M289L149K884O32n458n518l421M513M310N167j061k330
14285F304o016q230n891Q711O720m030n11p70k402n674m05L269m59K458k039R195
$$ plain form
14391 3537 12869 14312 9893 2822 -386 5349 7140 4113 4210 -2536 -3317 -9199 -1487 1222 -7059
14376 -7059 -6652 -4535 -2788 1504 -100 2972 2007 -5009 -7002 -5095 192 1112 -2507 -8346 -4256
14361 -4256 -6651 -6983 -4525 -4796 -4886 -3200 -3407 -4406 -3520 -2735 -44 -2932 -10053 -10131 -5594 -7538 -12340
14344 -12340 -14916 -12948 -14399 -13388 -11170 -3805 -1830 -4971 -1166 1881 5321 -109 -5412 1881
14330 1881 -1554 3189 9813 9493 5826 6008 8580 9826 6199 120 1942 5020 2790 654 801
14315 801 5201 2660 2402 8783 9894 2966 1630 -167 -1343 -3074 -4352 -3328 -8962 -13529 -11630
14300 -11630 -2583 -2935 -852 3437 6586 9470 10102 4644 -874 -4295 218 4528 9695 8634 6304
14285 6304 288 -7942 -13833 -5122 1598 -2432 -2943 -3713 -6115 -11789 -12194 -8925 -9384 -6926 -8965 230
14269B30N768k205q090p041o488J168L445R65J326L391m322M511K995N705k154
14254g96k698r49L348R226M22o394j320l439p543J261M886P317k899l224o453
14239i255j667L054J213M08M07L666J94L755j424O23k177P021M236m79l006l09
14223F260m86j176k905o54j899J664M125l790l467J817k196j762k002l803J004
14208i270k190L604l466J150J396L34K826J3005N47l161M198o60j697J343N257
14193A3216l862j1055p85L655K43j788J25k828l516j047M217K702M164K467n245
14178F63M03R716M272n050l391o207j568k531P74P606L922j0323q266K172n78
14163h386J396Q453n76o006N008K952m175J743K506N787p892r197r02j836P142
$$ plain form
14269 230 5998 3793 -4297 -11338 -17826 -16658 -13213 -12248 -10922 -7531 -11853 -7342 -4347 1358 -796
14254 -796 -3494 -4443 -1095 8131 8553 2159 839 -2600 -10143 -8882 -3996 3321 422 -2802 -9255
14239 -9255 -10922 -7868 -6655 -6247 -5840 -2174 -1980 1775 351 974 -1203 5818 10054 9575 6569 6260
14223 6260 5774 4598 1693 1039 -860 804 4929 1139 -2328 -511 -2707 -4469 -6471 -10274 -9270
14208 -9270 -11460 -7856 -11322 -10172 -8776 -8442 -5616 7389 7936 4775 8973 8313 6616 7959 13216
14193 13216 9354 -1701 -2486 1169 1412 -376 -251 -3079 -6595 -7642 -3425 -723 3441 5908 663
14178 663 1066 10782 15054 10004 6613 406 -1162 -3693 -2919 4687 8609 -1714 -9980 -7808 -8386
14163 -8386 -6990 1463 887 -5119 -111 2841 -1334 409 2915 8702 810 -8387 -9289 -11125 -3983
14148c983K215j40J041l50J797o7n838k571J841P559K058l519J433n86k837l810
14132e757Q03K302o82j05J196J481m41L794l892l236O807N882J247p004l318o40
14116a563K887M535L339q78L820l495O9o49l66k42o592q498K364N533j435m224
14100e395M479L271k580M570J856o57J523J744m226k819m16L595k146r175j116
14085g492Q426r37l475K17k068n99L452O020K700o443o12O557j956o598j818J127
14069c499N081K489l47n191q146n907q2J491O034L049J719M69K187l72n255L07
14053e973Q300l081J064N626P540L051l412j989p350l231k756J390J92n446p859
14038a3934Q784N717M182m385k316L199M079Q5m072p988L433M278M72j247J323
$$ plain form
14148 -3983 -1768 -1908 -867 -1217 580 513 -5325 -7896 -6055 1504 3562 43 1476 890 -1947 -5757
14132 -5757 -4954 -2652 -3334 -3439 -2243 -762 -1203 2591 -1301 -4537 2270 8152 9399 2395 -923 -1563
14116 -1563 1324 5859 9198 8320 12140 8645 8714 8065 7699 7457 865 -7633 -5269 264 -1171 -5395
14100 -5395 -916 2355 -225 4345 6201 5544 7067 8811 4585 1766 1350 4945 2799 -6376 -7492
14085 -7492 934 -3 -3478 -3261 -5329 -5928 -2476 3544 6244 -199 -811 5746 3790 -2808 -4626 -3499
14069 -3499 1582 4071 3724 -1467 -9613 -15520 -15602 -14111 -8077 -5028 -3309 -2840 -653 -1025 -6280 -5973
14053 -5973 2327 -754 310 5936 13476 16527 13115 11126 3776 545 -2211 -821 -629 -6075 -13934
14038 -13934 -5150 567 4749 364 -1952 1247 5326 5411 1339 -6649 -3216 1062 1534 287 1610
14023A610K187j802l954j541l594L433P160j142L841j603k433N610l929o669k732
14008e558P584J741P14j195M75o253K316K000k414l244J0571P913m795l903m561
13993A391J122K007M744P64j2379l993n811J044J3264j314l960M655j429j863
13979a758L078K211n923j282L972J880N100J51O2k258o250l314K003J23L576R519
13963A0890J374l060n123m557k882M601M645L88q621o24L880m780m107K479J269
13948d228l016K090r073L21N032P632L835K550Jk927l340n276Q60K278J318K476
13932E33j755k181o191n172L14Q700L930o344n055P02N036P292K01L28N995L133
13916I466N879n750j2822l040M065R343J301n198o000J078j549n090K17K828M634
$$ plain form
14023 1610 3797 1995 -1959 -3500 -7094 -3661 3499 2357 6198 4595 2162 7772 3843 -2826 -5558
14008 -5558 2026 3767 4481 3286 3761 -2492 -176 1824 -590 -3834 6737 14650 9855 5952 1391
13993 1391 2513 4520 9264 10028 -2351 -6344 -12155 -11111 2153 839 -3121 1534 105 -1758
13979 -1758 1320 3531 -2392 -3674 298 2178 7278 7429 7491 5233 -1017 -4331 -2328 -2205 1371 10890
13963 10890 12264 9204 4081 -476 -3358 1243 5888 6276 -2345 -2969 911 -3869 -7976 -5497 -4228
13948 -4228 -7244 -5154 -14227 -13906 -8874 -1242 2593 5143 5144 2217 -1123 -6399 -5539 -3261 -1943 533
13932 533 -1222 -3403 -9594 -14766 -14452 -5752 -1822 -8166 -13221 -12519 -7483 -191 10 338 6333 9466
13916 9466 15345 9595 -3227 -6267 -2202 7141 8442 3244 -2756 -1678 -3227 -8317 -8100 -5272 -638
13901f38J749L756N235M517l220j1237p708m906P65j740P383O739k72k209j043
13886b829Q247O46q879m260n459j492Q401N690j528l442O885j680K718k406m502
13871c890m491l859L265L424N932j956N763R540n15M392K551j964m072o535o05
13856F980L78p528n246L723L914L490J990j148j405k531m829n891m242J928L974
13841f443K518m275l372P036J1542K522n911o971l147O861R00l356J844L336J708
13826D792j933j1030k491Q107M376J001L731M25k364j059n701M00M87L077Q342
13811A0160k530j809j827n671J50L553J006J461k116n326k736K785K715J094m160
13796c251n146k976m43R121R52k466O605l071k112K810O338R08J043o107r993
$$ plain form
13901 -638 1111 4867 10102 14619 11399 162 -7546 -12452 -11687 -13427 -6044 695 423 -1786 -2829
13886 -2829 5418 6064 -2815 -7075 -12534 -14026 -5625 65 -1463 -4905 1980 300 3018 612 -3890
13871 -3890 -8381 -12240 -8975 -5551 381 -1575 4188 13728 13213 17605 20156 18192 14120 7585 6980
13856 6980 7358 -170 -5416 -1693 2221 5711 7701 6553 5148 2617 -2212 -8103 -12345 -10417 -6443
13841 -6443 -3925 -8200 -11572 -4536 7006 9528 3617 -3354 -6501 360 1260 -2096 -252 3084 4792
13826 4792 2859 -8171 -10662 -2555 1821 2822 6553 6978 4614 3555 -2146 -1746 -1259 1818 10160
13811 10160 7630 5821 3994 -1677 -1527 2026 3032 4493 2377 -2949 -5685 -2900 -185 909 -3251
13796 -3251 -8397 -11373 -11816 -2695 -1743 -4209 2396 -675 -2787 23 6361 7269 8312 2205 -7788
13781g788J266O907k748P169l79p09J594q917m905M829N012K389J157k205l381
13766g09p50l534j444P54P247o972p469k62J0341j125L924l684o378M512J80J985
13750c384P838M016K7j598L549m166K466l829p091m429l991l072j13O663N18L993
13734b603j05M181J245j716M796J082l033j005K4N57p199n432K155M305n504K169
13718f083O638k253j880O563M250q342J85l35O33P344p18j538J787M677j056o969
13702B903m28J59l58p90j797l47j66K0J586K558j819m115n492j141J690K48m20
13685g709q57K518L567j141n723n010P556l697P44P066J659n192L850N814K253
13670E698l435J081o30o819k487M612n13m37k742j7j396j894K746j367M40K168
$$ plain form
13781 -7788 -6522 385 -2363 4806 4427 3718 5312 -3605 -8510 -3681 1331 3720 4877 2672 -709
13766 -709 -1459 -4993 -6437 -5683 1564 -5408 -12877 -13139 -2798 -3923 1 -3683 -10061 -5549 -5369 -3384
13750 -3384 4454 8470 8497 6899 10448 6282 8748 4919 -2172 -6601 -10592 -13664 -13777 -7114 -6596 -2603
13734 -2603 -2708 1473 2718 1002 5798 6880 3847 2842 2866 3423 -3776 -9208 -7053 -2748 -8252 -6083
13718 -6083 555 -1698 -3578 2985 7235 -1107 -922 -1257 -624 6720 6002 4464 6251 10928 9872 2903
13702 2903 2475 2634 2276 1486 -311 -658 -824 -804 782 3340 1521 -2594 -8086 -9227 -7537 -7289 -7709
13685 -7709 -8566 -6048 -2481 -3622 -9345 -14355 -6799 -10496 -9752 -2686 -1027 -6219 -2369 3445 5698
13670 5698 2263 3344 2714 -4105 -6592 -1980 -2493 -2930 -5672 -5689 -7085 -8979 -6233 -7600 -7160 -4992
13654d992M878O264j834j1284p45M12N153K453j622J659m299j002Q33k385j812
13639h323J61J039r07n750m05J0014N984l030J895k078K067k133m120q89j424
13624g899L330r38k609O115J0436m114o969L455k151l956n047o335j058N054K88
13609a2398R89K942K51J1886p97K406k148K833M31n051k823N473N188J949N35
13594A1666L172j3166j0160j713l677M665k215k773O800L888m308l345k33L65
13580a1034K665O953l049p260K84L589l79j443P57j11p73j408K588m040o016N615
13564a3062J128M46o61L333Q871P977P45n219j336j385L891m715q934M279M50
13549d192M866J419j985n947J157P13M794M092J930k026l235l864m521K084M216
$$ plain form
13654 -4992 -114 6150 4316 -6968 -7713 -7301 -2148 305 -1317 342 -3957 -4959 -4126 -6511 -8323
13639 -8323 -8162 -7123 -8030 -13780 -14185 -4171 1813 -1217 678 -1400 667 -1466 -5586 -6475 -7899
13624 -7899 -4569 -5507 -8116 -2001 8435 4321 -2648 807 -1344 -5300 -10347 -16682 -17740 -12686 -12398
13609 -12398 -11409 -8467 -8216 3670 2873 5279 3131 5964 6395 1344 -1479 3994 9182 11131 11666
13594 11666 14838 1672 -8488 -10201 -13878 -9213 -11428 -14201 -7401 -3513 -7821 -11166 -11399 -11034
13580 -11034 -8369 -1416 -4465 -11725 -11441 -7852 -8231 -9674 -8917 -9028 -9801 -11209 -8621 -12661 -18677 -13062
13564 -13062 -11934 -11488 -12149 -8816 55 8032 8777 3558 2222 837 4728 13 -8921 -4642 -4192
13549 -4192 674 2093 108 -5839 -4682 -3969 825 4917 6847 4821 1586 -2278 -6799 -4715 -499
13534d99O156L447l801k170n690J349L343J9l681k912l976l37N843K943k202r66
13518c134M850n424m960K855j083m00K275N284L730P56q857m064M988p542m019
13503a4745J1094J878M695r42N77j469m020O093L593j610n265m222j2500L902
13489a2941J588J0870P970k039m658p889k418m34M805J211N333j781m898M665
13475f16K618p164q032K700N685k408M693K683m876l717j29j808j80K237K071
13460f243K530K798J083K450J736k859P53o247m392m213J1039L570J528L9J716
13445E288N936P26n765n474M04l213m305l384K65O921m35m436Q145n2o531N84
13429e326O981L318j712K634L049l563j877L968p16l367j812k508j793m74O046
$$ plain form
13534 -499 5657 9104 5303 3133 -2557 -1208 2135 2154 -1527 -4439 -8415 -8752 -2909 34 -2168 -3134
13518 -3134 1716 -3708 -8668 -5813 -6896 -7296 -5021 263 3993 4749 -4108 -8172 -3184 -10726 -14745
13503 -14745 -3651 -1773 2922 1980 2557 1088 -2932 3161 6754 5144 -121 -4343 -16843 -12941
13489 -12941 -11353 -483 7487 5448 790 -7099 -9517 -9951 -5146 -3935 1398 -383 -5281 -616
13475 -616 2002 -5162 -13194 -10494 -4809 -7217 -2524 159 -4717 -8434 -8563 -10371 -10551 -8314 -6243
13460 -6243 -3713 -915 168 2618 4354 1495 2248 -3999 -8391 -12604 -1565 2005 3533 3572 5288
13445 5288 11224 11950 6185 711 1115 -2098 -6403 -9787 -9522 -2601 -3036 -7472 673 621 -5910 -5326
13429 -5326 1655 4973 3261 5895 8944 5381 3504 7472 6756 3389 1577 -931 -2724 -3198 2848
13414B848j230l81r237N630J121K917L842l273l037J428M88M494m648J793L293
13399F048j298r288n360Q10K430l61L856L585L270J852l006j574J030l266l723
13384d995Q813K344j164o189o178n339Q150M695Q377o07o565p208M564M815J2367
13369A5880J471j0030j859l050k413J312P181M472L078j1268r416M928p99M22
13355i1j64j185m414M291R434J339o407j4110n175K387R240Q54N10o47L980N793
13339E635j661p671m630l76L293r88r03L602L151n75k021L252k090p602l560J0640
13323b504N209J34n51o25p963J354K682q556j428M841l56K794J336p0j776k455
13307g934J286k87j95J723j201K130N627N979q278k976O705O069l254j891K748
$$ plain form
13414 2848 1618 1237 -8000 -2370 -1249 1668 5510 2237 -800 628 1116 5610 962 2755 6048
13399 6048 4750 -4538 -9898 -9088 -6658 -7019 -3163 422 3692 5544 2538 964 1994 -1272 -4995
13384 -4995 3818 6162 4998 -1191 -7369 -12708 -4558 137 8514 7907 1342 -5866 -1302 3513 15880
13369 15880 17351 7321 5462 2412 -1 1311 8492 12964 16042 4774 -4642 286 -513 -91
13355 -91 -255 -1440 -5854 -1563 7871 9210 2803 -11307 -16482 -14095 -4855 -4001 -3491 -4138 -158 5635
13339 5635 3974 -3697 -8327 -8703 -5410 -6398 -7301 -3699 -548 -1123 -3144 108 -1982 -9584 -13144 -2504
13323 -2504 2705 2839 2288 1663 -6300 -4946 -2264 -10820 -12248 -7407 -7763 -4969 -3633 -3703 -5479 -7934
13307 -7934 -6648 -6935 -7130 -5407 -6608 -4478 1149 7128 -1150 -4126 2579 8648 5394 3503 6251
13292F251o244m512l24M428J007k866q028j569n238O145J204P141M646m356m006
13277f321N07J535k866m121J487Q623P936m380J058k820M03j711J68j959m570
13262g031J476Q145l739m808k360L241q061l877K804K107P423P469M354r971j08
13247b936k672n257O239N153n347k662Q40R54o712p504L569P193J727M398L631
13232F14J788J984k891J997K899j271k250N58q80l666n407n08N79L332j081n990
13216a0193Q45r91J704L301K370k015P565K231p883m318R016J117k796L09j267
13201a005o527j23m072K902j676o674K477J979J364K538Q073P344Q55K344m381
13186E418j897m401J521K483k499n928j0404N876O964J217j998m58j311q67n16
$$ plain form
13292 6251 7 -4505 -4829 -401 606 -2260 -10288 -11857 -17095 -10950 -9746 -2605 2041 -2315 -6321
13277 -6321 -5814 -4279 -7145 -11266 -9779 -1156 6780 2400 3458 638 1041 -670 -502 -2461 -7031
13262 -7031 -5555 2590 -1149 -5957 -8317 -5076 -13137 -17014 -14210 -12103 -4680 2789 7143 -2828 -2936
13247 -2936 -5608 -10865 -4626 527 -4820 -7482 -6642 -5688 -12400 -19904 -16335 -9142 -7415 -3017 614
13232 614 2402 4386 1495 3492 6391 5120 2870 3428 2548 -1118 -6525 -7033 -6454 -3122 -4203 -10193
13216 -10193 -9348 -10339 -8635 -5334 -2964 -4979 2586 4817 -3066 -7384 1632 2749 -47 262 -1005
13201 -1005 -7532 -7655 -11727 -8825 -10501 -17175 -14698 -12719 -11355 -8817 -744 6600 7455 9799 5418
13186 5418 3521 -880 641 3124 625 -5303 -15707 -9831 -2867 -1650 -3648 -4106 -5417 -6284 -6800
13171f800q127r91J0771J293k323m221J13k663l786L859P410R99j887l171l590
13156a3114N678J0269l53J970m646k090J962j588l395M18j174Q0p6r31Q12N967
13140b11j424k326j421L853l928K137K4q55j434Q51M840j652l677j0408k743m482
13124b2856O946O267K724J248R743M032o793J751K90k078k736L071k605Q94J789
13109A687n325j451l263l302L979P311Q053p42k076j365m843j772O636m136m611
13094e220K9K492k569L521L810K304J187q49J149l523n914m336J144J54j909j743
13078a0273O995L947k774j83M264p457k799n947m402K310J0055P526p891p978
13064a4607M15N472P201Q03O087L45m139K971O066q378p478k707O368n82K051
$$ plain form
13171 -6800 -14927 -15918 -5147 -3854 -6177 -10398 -10285 -12948 -16734 -12875 -5465 -4466 -6353 -9524 -13114
13156 -13114 -7436 2833 2480 4450 -196 -2286 -324 -1912 -5307 -4889 -6063 -5983 -6059 -6990 -6178 -211
13140 -211 -1635 -3961 -5382 -1529 -5457 -3320 -3296 -4151 -5585 -4734 106 -1546 -5223 -15631 -18374 -22856
13124 -22856 -15910 -9643 -6919 -5671 4072 8104 1311 3062 3352 1274 -1462 1609 -996 -102 1687
13109 1687 -3638 -5089 -8352 -11654 -7675 -364 7689 6947 4871 3506 -1337 -3109 3527 -609 -5220
13094 -5220 -5191 -2699 -5268 -1747 2063 4367 5554 4705 5854 2331 -3583 -7919 -6775 -6621 -8530 -10273
13078 -10273 -3278 669 -2105 -2288 1976 -5481 -8280 -14227 -18629 -16319 -6264 1262 -6629 -14607
13064 -14607 -14192 -8720 -1519 -716 5371 5716 1577 4548 10614 2236 -5242 -7949 -1581 -2163 -112
13049a12K624l322Q947O636j0405j5275l256K677J139j143N61J214Q361R012p138
13034E20l452p012k776J153n179L650P722P27l205O011j007M27m787j62J695m879
13018a0554p45Q892L335j975M24P0n867k365J595M503L833k188k109J680N405
13003C934k804o184k332j4P518M533l972j855j07n431K156N252j786k75l930o17
12987e914K330K326J209O010J463j176j998n277m54M323L594J238n916j523l280
12972c045l078L95m615L4M192N447q978o288L364J0403l85J124N927M758l600
12957E655j1629p76m99J289M124N868P421j782o281r287j10M262J661N927J539
12942G382J423J979j964q626m932l527O601Q470o576m193J142J923L35J962k624
$$ plain form
13049 -112 2512 -810 8137 14773 4368 -10907 -14163 -11486 -10347 -11490 -10929 -9715 -1354 7658 520
13034 520 -2932 -9944 -12720 -11567 -16746 -13096 -5374 -4647 -7852 -1841 -2848 -2421 -7208 -7370 -5675 -10554
13018 -10554 -11299 -2407 928 -1047 -623 -553 -6420 -8785 -7190 -2687 1146 -1042 -3151 -1471 3934
13003 3934 1130 -5054 -7386 -7400 118 4651 679 -1176 -1283 -6714 -4558 694 -1092 -1367 -5297 -5914
12987 -5914 -3584 -1258 -49 5961 7424 6248 4250 -1027 -1481 2842 6436 7674 1758 235 -3045
12972 -3045 -6123 -5728 -10343 -10309 -6117 -670 -9648 -15936 -12572 -2169 -2554 -1430 4497 9255 5655
12957 5655 -5974 -6750 -7249 -5960 -1836 4032 11453 9671 3390 -5897 -6007 -1745 -84 5843 7382
12942 7382 8805 10784 8820 194 -4738 -8265 -1664 6806 230 -3963 -2821 -898 -563 1399 -1225
12927a225P74M204L756O4p090KQ21K491K999p743L83r42o386l196J059J209Q1
12910h739M353Q664L879r033k785K209j315m613K176N486J274O84j747R01P263
12895H657L491M13q698p044L294j512p132m71N185L162k840J012P324L318o961
12880A198j52j449J87l765L625l732n029L078P885M954K348l787p516J452Q432
12865G729k608n2m425m139M019P628R09j849r380J77k855O02N81L92O443P973
12849A1145j395l725n085j175l324K07L121M82k062j954l826N874M998m791n515
12834g025k057j046k018j199Q10M370n11L675K219N514m542l716L426N046P58
12819C704o408Q15J028j349M091k322l799n505n22K478O047L045K026L709m834
$$ plain form
12927 -1225 -451 3753 7509 7573 483 485 1306 3797 6796 -947 -564 -1506 -7892 -11088 -10029 -8820 -8739
12910 -8739 -4386 4278 8157 -876 -3661 -1452 -2767 -7380 -5204 282 1556 2240 493 1394 8657
12895 8657 12148 12561 3863 -3181 113 -1399 -8531 -9002 -3817 -655 -3495 -2483 4841 8159 1198
12880 1198 1046 -403 -216 -3981 -356 -4088 -9117 -6039 1846 6800 9148 5361 -2155 -703 7729
12865 7729 5121 5069 644 -3495 524 8152 9061 7212 -2168 -1991 -4846 -4244 -3663 -3271 3172 11145
12849 11145 9750 6025 940 -235 -3559 -3352 -231 251 -1811 -3765 -7591 -1717 3281 -1510 -7025
12834 -7025 -9082 -10128 -12146 -13345 -12535 -8165 -8676 -5001 -2782 2732 -1810 -5526 -2100 2946 3704
12819 3704 -2704 -1889 -861 -2210 1881 -441 -4240 -9745 -10267 -7789 -1742 1303 3329 7038 2204
12804B204l094J604M389j15o472K11j507k433n318o453R80R51QN225P839J0677
12788H696n828p162M599J949j219n353m543L775M891m92q653n112k145L67N551
12773a0679R033l537o11j624l084m527N074L4o026J361M176K866L64j792l009
12758a1981M771L667K545M437oK30n41K930N43K684j148k724q811l842N078O242
12742D074K933o550K87K911K842k375o883l155J074K452l077o201K638M419L391
12727a220K154n179n161K946J483L441K149k9k386j478k406n550m496m726R239
12712a1219J1752J511O226J961K269k610n70k037o920r247P56N790L858j953K151
12697A718j63R68M480M508N32n132j1906n81O246M392K60O396n227r707j274K13
$$ plain form
12804 2204 -890 714 5103 4988 -1484 -1273 -2780 -5213 -10531 -16984 -16004 -15053 -15045 -9820 -1981 8696
12788 8696 2868 -4294 305 2254 1035 -4318 -8861 -5086 -195 -687 -9340 -14452 -16597 -16230 -10679
12773 -10679 -1646 -5183 -5794 -7418 -10502 -15029 -9955 -9921 -15947 -14586 -10410 -7544 -7180 -8972 -11981
12758 -11981 -7210 -3543 -998 3439 3433 3663 3122 6052 6595 9279 8131 5407 -3404 -7246 -2168 4074
12742 4074 7007 457 744 3655 6497 4122 -2761 -5916 -4842 -2390 -5467 -11668 -9030 -4611 -1220
12727 -1220 934 -4245 -9406 -6460 -4977 -1536 613 584 -1802 -3280 -5686 -11236 -15732 -20458 -11219
12712 -11219 533 2044 8270 10231 12500 9890 9320 7283 363 -8884 -8128 -2338 1520 -433 1718
12697 1718 1555 2523 7003 11511 12043 6911 -4995 -5576 670 5062 5322 11718 6491 -3216 -4490 -4277
12681d277L23M599N341j036k828j809n366o639p28K533M576l218j06K669P649
12666A683j876k215q347L367M17O11J369k478K644L440r70J560l071o918K146
12651h638O254Q691K161o557K958j088l887o326l516l913K362O021k995k678R254
12636a897j849n508k562j494O661J548N803M469K465K100j083n151k118P11K866
12621D961N58k170k374l568j985N502Q241j420p270m758M12L2M233L046L126j616
12605D950n593O03l190o915l084j079K834l585m404j418M3L323P417L805R18Q39
12589d536k927L217n993q47N189M988L180P982n142n437R174M983J150l737p025
12574D219p415j294o48M537O692k983k662K708j923j301p30L420p0k67o817j673
$$ plain form
12681 -4277 -3954 645 5986 4950 2122 313 -5053 -11692 -12420 -9887 -5311 -8529 -8635 -5966 1683
12666 1683 -193 -2408 -10755 -7388 -6971 -6360 -4991 -7469 -4825 -1385 -2355 -795 -3866 -10784 -8638
12651 -8638 -2384 6307 8468 1911 4869 3781 -106 -6432 -9948 -13861 -11499 -5478 -8473 -11151 -1897
12636 -1897 -3746 -9254 -11816 -13310 -6649 -5101 702 5171 7636 9736 8653 3502 1384 2095 4961
12621 4961 5519 3349 975 -2593 -4578 924 9165 7745 475 -4283 -3871 -3839 394 3440 6566 4950
12605 4950 -643 -40 -3230 -10145 -13229 -14308 -11474 -15059 -19463 -20881 -20838 -17515 -10098 -6293 -5375 -4536
12589 -4536 -7463 -4246 -10239 -11086 -5897 -909 2271 10253 5111 -326 8848 13831 14981 11244 4219
12574 4219 -3196 -4490 -5138 -601 6091 3108 446 3154 1231 -70 -800 2620 2550 2283 -4534 -6207
12558f207J718N220L319n723K585m67m97l81o80q428O282N382p45m623j676O990
12542B069L364M511J059j005k524l314o329k426k580j134Q13P357o85o647J749
12527e722L469j252L821J418P46l292J645j61m132j569p60l623L621K571L111
12512a09r26K51m942j488l96J489k054J624J997O562j264k727l05J789L516R54
12496C971j355m220K109O9j108m722N135L685j674K444M842k531J879L65j524
12481G365l000k894r466L18N155P126J462p4j668m72R344j526j0723n339n020
12466i412j705K416N61j481J811M215Q491M692J853m25j557o692m338L682L806
12451E917j760p757L154P242l959Q145m009l686k310M671k737k599L4N202k092
$$ plain form
12558 -6207 -4489 731 4050 -1673 912 445 -52 -433 -1113 -9541 -3259 2123 1378 -3245 -4921 2069
12542 2069 5433 9944 11003 9998 7474 4160 -2169 -4595 -7175 -8309 -7496 -139 -824 -7471 -5722
12527 -5722 -2253 -3505 316 1734 2480 -812 833 672 -3460 -5029 -5789 -9412 -5791 -3220 -109
12512 -109 -1035 -784 -5726 -7214 -7610 -6121 -8175 -6551 -4554 2008 744 -1983 -2288 -499 3017 3971
12496 3971 2616 -1604 505 574 -534 -5256 -121 3564 1890 4334 9176 6645 8524 8889 7365
12481 7365 4365 1471 -7995 -7677 -2522 4604 6066 5992 4324 3852 13196 11670 947 -4392 -9412
12466 -9412 -11117 -8701 -8140 -9621 -7810 -3595 4896 9588 11441 11016 9459 2767 -1571 2111 5917
12451 5917 4157 -3600 -446 6796 2837 10982 6973 3287 977 5648 2911 312 346 5548 3456
12436C456l374j864O48O175K722j806n865k685L532P079q843L810J073o833R6
12421b679K969o764l946J0637J0506J0305K25q503p049k852J158O286j1146k463
12407c316L148l415j599k975j228K923P148j848m483j131m711n946J95j686K162
12392a6762J1040Q215J47k428n070K009J350j659n056L562R809J031j334j612
12378C242o458N397K288k186j916K658K361N660j382r745n035K092R225Q23j567
12363E457l318j849m276n768J021k827O07J600Q884O792N189p228p787l188O360
12348c31L163k972n169K015M253K076O58M38n775l831P563P934j174m745m038
12333F5K417Q986q0J955K22l727L352K835Q82J558n199o172r322n808k385K166
$$ plain form
12436 3456 82 -1782 -1134 5041 7763 5957 92 -2593 939 8018 -825 2985 4058 -2775 -2679
12421 -2679 290 -6474 -10420 217 10723 21028 21253 12750 5701 2849 4007 10293 -853 -3316
12407 -3316 -168 -3583 -5182 -8157 -9385 -6462 686 -1162 -5645 -6776 -11487 -17433 -17238 -18924 -16762
12392 -16762 -5722 2493 2640 212 -4858 -2849 -1499 -3158 -8214 -4652 5157 6188 4854 3242
12378 3242 -3216 2181 4469 2283 367 3025 5386 11046 9664 -81 -5116 -3024 6201 7024 5457
12363 5457 2139 290 -3986 -9754 -8733 -11560 -10953 -9353 -469 6323 11512 4284 -3503 -6691 -331
12348 -331 2832 -140 -5309 -3294 959 3035 3693 4131 -1644 -5475 2088 10022 8848 4103 65
12333 65 2482 11468 11388 13343 13565 9838 13190 16025 16907 18465 13266 7094 -2228 -8036 -10421 -8255
12317h255j680k610L931K424N339Q746N282q45n772n432K267L857k607J92L829
12302H666r189o742n966J664M419P365M77l100K610P70n760l656L009L417R50
12287a066K689K842Q25k463N485m18k349P74j916o412L012k082M557P350K402
12272A3230J403r22n380n933k579o629O61M446l176l938K241L396J825P119q74
12257D890M595J682k452n975o176k600n146N093O872K54j256O40P6J711K517n491
12241g66o0m11m741K803O895K904M27m592j4k298l622o41J872K550L432K134l895
12224A977O52n011o08m132m154p48P03L340j24O877J394m477j307K28O65k514
12208g239O474N03r1J702j222q65q45J1298O06q756n515K982K355k719Q03M766
$$ plain form
12317 -8255 -9935 -12545 -8614 -6190 -851 7895 13177 12332 6560 1128 3395 7252 4645 4837 8666
12302 8666 -523 -7265 -13231 -11567 -7148 217 694 -2406 204 974 -4786 -8442 -5433 -2016 -1066
12287 -1066 1623 4465 5290 2827 8312 7894 5545 6319 4403 -2009 1003 -1079 3478 10828 13230
12272 13230 14633 13711 8331 2398 -181 -6810 -6149 -1703 -4879 -8817 -6576 -3180 -1355 5764 4890
12257 4890 9485 11167 8715 2740 -3436 -6036 -11182 -6089 783 1037 -219 421 497 2208 4725 -766
12241 -766 -826 -1237 -5978 -3175 3720 6624 7051 2459 2445 147 -3475 -4116 -2244 306 3738 5872 1977
12224 1977 2629 -2382 -2990 -7122 -11276 -12024 -11321 -7981 -8105 -1228 166 -4311 -5618 -5390 -4725 -7239
12208 -7239 -765 -262 -353 1349 127 -738 -1583 9715 10321 1565 -3950 -968 1387 -1332 -529 4237
12192D237J090J909p254m58L662L35j983l174j936M607k559j040j491R535L125
12177H605n780q53m536O066Q606j959j346l653m33j942J614L87K99n277M570K264
12161F632o610j600q08L98L875l451j056M132o414M088O848j549l315l18K91M22
12145A565l184k449M542J0786l424p665j579O528K144K76R149L60j1414k111m576
12130a052n798J538O254k939j541j51K530K009K494o234m6L376J620l951m236
12115f127L764j223o813K818N066l64J171O366M399p610p370M506J4099P4m908
12100G848k627K405l718K816O439m571L065J547M90k63j921p201L722O165j839
12085A2357n841q01j258K811o446L621L772j963j02L872m355l105J186N206k820
$$ plain form
12192 4237 5327 7236 -18 -476 3186 3521 1538 -1636 -3572 1035 -1524 -2564 -4055 5480 8605
12177 8605 2825 1972 -2564 3502 12108 10149 8803 5150 4717 2775 4389 4776 5075 -202 4368 6632
12161 6632 22 -1578 -2386 -1988 1887 -1564 -2620 1512 -4902 -814 6034 4485 1170 852 1143 1565
12145 1565 -1619 -4068 474 11260 7836 171 -1408 5120 7264 7540 16689 17049 5635 3524 -1052
12130 -1052 -6850 -5312 942 -1997 -3538 -3689 -1159 850 3344 -2890 -2936 440 2060 -1891 -6127
12115 -6127 -2363 -3586 -10399 -7581 -2515 -2879 -1708 4658 9057 1447 -5923 -1417 12682 12756 7848
12100 7848 5221 7626 3908 6724 13163 8592 11657 13204 13694 13431 11510 4309 8031 14196 12357
12085 12357 6516 5715 4457 7268 822 4443 8215 6252 6150 10022 5667 2562 3748 8954 6134
12070F134N46R00p478l341M966N15j145N724J893m121q077m244M746m824n816
12055a3622l544P044M884Q292K396l466l639o935L023J1032J0557p600o606m474
12041b658L567n24L242j08m278k715o20k595n160N489J7966L521m061o677n397
12026a008L893Q451l029j859J15j098l54m438M451N719j697j2896r085o07K734
12011a0708l021M961O106K657N788R21K507j116n920R65l882n038O44K005L791
11996F60K297K315m743Q7M497k02q602p657j442N852N421L547j584J159m92K724
11980C837j72J880J542j225l469m266j161j064K325L142N09r07j693O63K103N152
11964G196m634m686L07N766M935j280o776R86m835l333N269N321q660J450R422
$$ plain form
12070 6134 6680 7580 102 -3239 1727 2242 1097 6821 8714 4593 -3484 -7728 -2982 -7806 -13622
12055 -13622 -17166 -10122 -5238 3054 5450 1984 -1655 -8590 -5567 5465 16022 8422 1816 -2658
12041 -2658 909 385 3627 3519 -759 -3474 -4094 -6689 -11849 -6360 11606 15127 11066 4389 -1008
12026 -1008 2885 11336 8307 6448 6563 5465 5111 673 5124 10843 9146 -3750 -12835 -13442 -10708
12011 -10708 -13729 -8768 -2662 -5 5783 6704 9211 8095 2175 3140 -742 -5780 -5136 -3131 660
11996 660 2957 5272 529 616 5113 4911 -3691 -11348 -12790 -6938 -1517 2030 446 1605 1113 3837
11980 3837 3665 5545 7087 5862 2393 -1873 -3034 -4098 -1773 1369 1878 971 -722 -59 2044 7196
11964 7196 2562 -2124 -1817 3949 8884 7604 828 1814 -3021 -6354 -1085 4236 -4424 -2974 6448
11949F448P36k621k906L66j28k018L700J53p112n914j70Q503L559l479K48j756
11933b391M34q664o503J816R125L552O206j364K006j568k196j887m190n82j340
11918g546l451k428K327M398J577l00N345n650N038P32k783j22O912o235o856
11903i042O13J031R398N504p368k477N461j645m464m895M986J697k47r282m641
11888a5371M140K967Q132L365n137j0960K743P907P92K828j54J147o117p45n900
11873a0363J170p37m06l862R043Q4J442P8o739M988K12j559l977M046P754K992
11857D166j327k326j919o371J139l003m060K842J223n148O024K654m255P179K318
11842h64r20k010J253J701k055k177J8j453l458l159K616P811L015k368l358K353
$$ plain form
11949 6448 7184 4563 1657 2023 1895 -123 3577 3730 -3382 -9296 -9466 -963 2596 -883 -635 -2391
11933 -2391 -1957 -10621 -17124 -15308 -6183 -2631 3575 2211 4217 2649 453 -1434 -5624 -6206 -7546
11918 -7546 -10997 -13425 -11098 -6700 -5123 -5423 -78 -5728 -690 42 -2741 -2863 4049 -2186 -9042
11903 -9042 -8429 -7398 2000 7504 136 -2341 3120 1475 -2989 -7884 -2898 -1201 -1448 -10730 -15371
11888 -15371 -11231 -8264 -132 3233 -1904 -12864 -10121 -2214 -1422 1406 1252 2399 -3718 -4463 -10363
11873 -10363 -9193 -9930 -10336 -14198 -5155 -5071 -3629 -3551 -10290 -5302 -5090 -6649 -10626 -6580 1174 4166
11857 4166 2839 513 -1406 -7777 -6638 -9641 -13701 -10859 -9636 -14784 -8760 -6106 -10361 -3182 -864
11842 -864 -1784 -3794 -2541 -840 -2895 -5072 -5054 -6507 -9965 -13124 -10508 -2697 318 -2050 -5408 -3055
11826c055L037j244n171O150L772K131l11l14m369l81j413n865m35L086O301k727
11810h08J574r73m667O573P82k352j473J100R548l305K33L242L207R1M589o018
11794A1343j443M907O951J961k644p404r491k968O160M645l01o142L589J879K162
11779A3204M086L308k679j0872m713O327L856P763J730r78J824p643m712k285
11765H216j704J591o37k908O20M774n83q284m439J26J061O117J286n68K74K363
11749G305n95L931m197n940j071L753j877l318K854P918O744o735n593k843L645
11734C981j025j113n864j163J0266L067l315M11L436k549N414J536m195k100q08
11719E979K564J22o640L28Q34p32o97J769K055p130k176N331L781n621J2560N694
$$ plain form
11826 -3055 -18 -1262 -6433 -283 3489 5620 5309 4995 626 245 -1168 -7033 -7468 -4382 1919 -808
11810 -808 766 -207 -4874 1699 2481 129 -1344 -244 9304 5999 6232 9474 12681 12772 17361 11343
11794 11343 9900 14807 21758 23719 21075 13671 4180 1212 7372 12017 11716 5574 9163 11042 13204
11779 13204 17290 20598 17919 7047 2334 8661 12517 20280 22010 21032 22856 15213 10501 8216
11765 8216 6512 8103 7466 4558 5178 9952 9369 1085 -3354 -3228 -2167 3950 5236 4668 4942 7305
11749 7305 6710 10641 6444 504 -567 3186 1309 -2009 845 8763 15507 8772 3179 336 3981
11734 3981 2956 1843 -4021 -5184 5082 8149 4834 5245 8681 6132 11546 13082 8887 6787 5979
11719 5979 8543 8665 2025 2353 3187 2455 1758 3527 5582 -1548 -3724 1607 5388 -233 12327 18021
11703A8021n498j166j190K546j243k236m87k657k966k227j548N501K795L932j562
11688A0015k233k428j125K834l107K161L963n05L17p005j1798K612J3762j070
11674F393M511P931k818l840L211l28o36j47j808P08k102q237M210k086k551J000
11658C411M936M016j267L236l679J980j601k337o78N687J531n421j869o24L514
11643A0835L208J342J889p562J457o16l966J608K457n839J37p58N021L535L564
11628A6312l253m298N061J587o372k877p14K516j763L402Q48q841n503L529J501
11613A135P85m22k567k759l789O46O152R585k812K576j108p55K924N078m789j093
11597H787m95m170J83l469L620k51n448O493R181L44M067p94n079M24k654l796
$$ plain form
11703 18021 12523 11357 10167 12713 11470 9234 8747 6090 3124 897 -651 4850 7645 11577 10015
11688 10015 7782 5354 4229 7063 3956 6117 10080 9575 9892 2887 -8911 -6299 7463 6393
11674 6393 10904 18835 16017 12177 15388 15060 14424 14277 12469 13177 11075 2838 7048 4962 2411 3411
11658 3411 8347 12363 11096 14332 10653 12633 11032 8695 8017 13704 15235 9814 7945 7321 10835
11643 10835 14043 15385 17274 9712 11169 10553 6587 8195 10652 4813 4950 4192 9213 12748 16312
11628 16312 13059 8761 13822 15409 9037 6160 5446 7962 6199 9601 10449 1608 -3895 -366 1135
11613 1135 1920 1498 -1069 -3828 -7617 -6971 -819 8766 5954 8530 7422 6667 9591 14669 9880 8787
11597 8787 8292 4122 4305 836 4456 4205 -1243 5250 14431 14775 18842 18048 12969 13393 10739 6943
11581F943n012n513L060N485K400O959n05O43J246N315l137p878k809O95j139
11566F753q485k608O661j283n321M737O612K797n173k036L045L602K138o036m852
11551E51K986O62O81L378M152J610J459n065K576k017K428M457j32k083k722k935
11535I986m220M795K602j157j294j151j0219r611k492R473J4718J1023l73m015
11521A8065Q96l406m669Q04k796M245J561l315j531n876o928K470K609Q74k488
11506E15k925J446P225j01q08K293j378O333M70m118k428j607l749O286M678J864
11490A3996k512L0k419n026M53J696k447j219J915O402N991o167n004K028J249
11475H966k526M304N622k26l799m684j447M922p09k327l377K521O686r705l318
$$ plain form
11581 6943 1931 -3582 -522 4963 7363 14322 13817 14460 15706 21021 17884 10006 7197 7892 6753
11566 6753 -1732 -4340 2321 1038 -4283 454 7066 9863 4690 2654 5699 9301 11439 5403 551
11551 551 3537 4199 4880 8258 12410 14020 15479 10414 12990 10973 13401 17858 17726 15643 12921 9986
11535 9986 5766 10561 13163 12006 10712 9561 -658 -10269 -12761 -3288 11430 22453 22080 18065
11521 18065 18961 15555 10886 11690 8894 13139 14700 11385 9854 3978 -2950 -480 2129 3003 515
11506 515 -2410 -964 6261 6160 5352 7645 6267 12600 13070 8952 6524 4917 1168 7454 12132 13996
11490 13996 11484 11514 9095 4069 4522 6218 3771 2552 4467 10869 16860 10693 5689 7717 8966
11475 8966 6440 10744 16366 16140 12341 7657 6210 11132 10423 8096 4719 7240 13926 4221 903
11460I03O400O88l419M398P762r80j1320j360J692r00J751o420m290O387K569
11445C861p93L41P899L7j02p89k388j915m65l092K138R78J908N000K065J766j524
11428A4925K195O154M242k023p270p330k808L552k340q091J255n809L525M616
11414D793P865J783o51L503j819p637m110l01M222j512L07l60n25O98Q044O741
11398B1041k113J072m149q916n388J675J131M351N624K221N156m463j2416o099
11384a273P479N278j358p852O02P15J661l852M58J2760O907n093o897n322L150
11369G363O713o97o746p642M245l837L391M573Q813l255l047M316m606k382n04
11354F698M635L700j218l561Q91K334J925K840k716k546l384l191M135N655l652
$$ plain form
11460 903 7303 7991 4572 8970 16732 15752 4432 3072 4764 3864 5615 -805 -5095 1292 3861
11445 3861 3068 3409 11308 11345 11243 10454 8066 6151 5686 2594 4732 5710 7618 12618 14683 16449 14925
11428 14925 17120 23274 27516 25493 18223 10893 8085 11637 9297 1206 2461 -3348 177 4793
11414 4793 12658 14441 13790 17293 15474 7837 3727 3426 7648 6136 6443 6083 5558 6256 14300 21041
11398 21041 18928 20000 15851 6935 1547 3222 4353 8704 14328 16549 21705 17242 4826 -1273
11384 -1273 6206 11484 10126 2274 2876 3591 5252 1400 1858 14618 21525 16432 9535 4213 7363
11369 7363 14076 13379 6633 -1009 3236 -601 2790 7363 16176 12921 9874 14190 9584 7202 6698
11354 6698 11333 15033 13815 10254 11145 13479 15404 18244 15528 12982 9598 6407 10542 16197 12545
11339A2545m786Q5k248m729j526P624P714K333L750j868l682q087Q08M016m216
11324G733M209m76K274J2161L737j1166r744l680M300K673L371K550m534p735
11310E673p103J947j165j423K943j066J440m72N185O029N479K271l475m328m71
11295A1464J20r957l547P293Q615n498n692R89P252j020q2N055M295k532L043
11280A9798m892l262K804K068m952o153j436N744R912Q195o73j2554o391K84j049
11265G443j018L539J66P10O174K565K973M630l151k879m142l752L983J1032N338
11250C3611l760j1131Q86q26K302J183m9J393k785j049j294M139k84o701m53m464
11234A0718L361j134j508l066Q791N948p407o937J848L335J184j558n39N919N468
$$ plain form
11339 12545 7759 7844 5596 867 -659 6965 14679 17012 20762 18894 15212 7125 7933 11949 7733
11324 7733 11942 11466 13740 25901 29638 18472 8728 5048 9348 12021 15392 17942 13408 5673
11310 5673 -1430 517 -648 -2071 872 -194 1246 774 5959 11988 17467 19738 16263 11935 11464
11295 11464 11584 1627 -1920 5373 13988 8490 2798 3787 11039 10019 9937 14992 19287 16755 19798
11280 19798 14906 11644 14448 16516 11564 5411 3975 9719 19631 27826 27153 14599 8208 8492 7443
11265 7443 6425 9964 10130 10840 17014 19579 22552 27182 24031 21152 17010 13258 17241 28273 33611
11250 33611 29851 18720 19606 18780 21082 22265 22216 23609 20824 19775 18481 22620 22336 15635 15182 10718
11234 10718 14079 12945 11437 8371 17162 23110 15703 8766 10614 13949 15133 13575 13036 18955 24423
11219B4423m750n576k525J184l632N328P691j761J946p486o236o462J732J1276
11205A5152M737j0460l465o720L866M335k094o163P315L695L335k350m336L053
11191I900K719K661J300j683J0387O851k968j4132m667r22K722J0125L47q615
11177A4025k328M414N635l931p25j02l255L52L923p07l469j560P184N014m548
11162A9922o8j105r049j396N623K197n297Q44m108J253Q513M854K857l96l587
11147B1057J622l22o393q088o95k593k618l367K520l010J957N747N088P074j022
11132A6957l619k78n198L187J911J154J015M091K442J921k86M243j823l782n631
11117A6304l783n288M833N864j218m014Q290L744k939k171J1023m573l045L250
$$ plain form
11219 24423 19673 14097 11572 12756 9124 14452 22143 20382 22328 14842 8606 2144 3876 15152
11205 15152 19889 9429 5964 -756 3110 7445 5351 -812 6503 10198 13533 11183 6847 9900
11191 9900 12619 15280 16580 14897 25284 32135 29167 15035 10368 9446 12168 22293 22640 14025
11177 14025 11697 16111 21746 17815 17090 16988 13733 14085 18008 17301 13832 12272 19456 24470 19922
11162 19922 19854 18749 9700 8304 13927 16124 10827 11671 7563 8816 17329 22183 25040 24644 21057
11147 21057 22679 22357 15964 7876 7181 4588 1970 -1397 1123 -1887 70 5817 10905 17979 16957
11132 16957 13338 13060 7862 11049 12960 14114 15129 19220 21662 23583 23297 27540 25717 21935 16304
11117 16304 12521 7233 12066 17930 16712 12698 20988 24732 21793 19622 30645 26072 23027 26277
11103B6277N117N095m544p502J041r60p693M075M024n370J100j483O70M282J0495
11088C4624k313o884Q23j115Q693M570M896j1373m992M87q39M72J02J128M768
11073C3047K347l19j244j306m550o260p46K649L234N977M133K48k50N852N333
11058D8145J911J680M621J0081J4600K3371M9774Q0487Q9585Q1047K6840l8750
11046C93392q5413q5343n8687l3769k1955j4315r562m314n202P8J762q109m34
11033F8129L605M745L79l56J443j320j280N738j245o7k109p790j079o219o507
11018E6067J511m062r947j229N926N096J458K478o710n384R814L706p996p018
11004D3710j128N121K9j683K701k185j176p15j53n754L7M74M292J0728J365j1180
$$ plain form
11103 26277 31394 36489 31945 24443 25484 24524 16831 20906 24930 19560 20660 19177 19847 24129 34624
11088 34624 32311 25427 26250 25135 33828 38398 43294 31921 26929 27416 26577 27049 27151 28279 33047
11073 33047 35394 35075 33831 32525 27975 21715 20969 23618 26852 32829 36962 37210 36960 42812 48145
11058 48145 50056 51736 56357 66438 81038 104409 154183 234670 324255 405302 432142 393392
11046 393392 307979 222636 163949 130180 108225 93910 84348 80034 74832 74910 76672 68563 68129
11033 68129 71734 76479 76858 76502 77945 76625 75345 81083 79838 79771 77662 69872 68793 62574 56067
11018 56067 57578 53516 43569 42340 48266 53362 54820 57298 50588 45204 55018 58724 50728 43710
11004 43710 42582 47703 47732 46049 48750 46565 45389 44674 44521 38767 38804 39278 43570 54298 55663 44483
10988D4483P10p40J130J802n705p916J963J391J882p00n879K271l56m756l4N086
10972C4632p01l598K536K413L099P268J661m754Q063L802O820J133j385j085L241
10957F3145o707j1877j761K280K376K37j013M97P278M980k403M01L26O269N331
10942F9359m205o357j4397m727K619Q344j418l741k364L887Q240K756j546n306
10928E1144j0922n223k757j285K855j62K735q58j744M705L854L568m441j099l048
10913C7322R522Q250J555M597O709J041p574j0698p142q02j559Q939J808l291
10899D8677R86J579j173K636L497M750K944K329N376L775N571P698j3038j5416
10885F0191p498K83L205k100L872q01J263M423q513j0807M690l78M741M578o51
$$ plain form
10988 44483 45193 44453 45583 47385 41680 33764 35727 37118 39000 38300 32421 34692 34336 29580 29546 34632
10972 34632 33931 30333 32869 35282 38381 45649 47310 42556 50619 54421 61241 62374 60989 59904 63145
10957 63145 56438 44561 42800 45080 47456 47693 46680 47177 54455 59435 57032 57433 57759 64028 69359
10942 69359 65154 58797 44400 39673 42292 50636 49218 45477 43113 47000 55240 57996 56450 51144
10928 51144 40222 34999 32242 30957 33812 33650 36385 35527 33783 38488 42342 45910 41469 40370 37322
10913 37322 46844 55094 56649 61246 67955 68996 61422 50724 43582 42780 41221 50160 51968 48677
10899 48677 49663 51242 50069 52705 56202 60952 63896 66225 71601 75376 80947 88645 75607 60191
10885 60191 52693 52976 56181 54081 57953 57152 58415 62838 54325 43518 48208 47830 52571 57149 56498
10870E6498J0198J3007O346N218M208N358n2j158L138Q666r164m171l809j026
10856I3257o17q692J1060J3760J0022P216Q127P361J0889J9555K5249M1555O3082
10843C01824J24052K20087L43682M25973L94810K05175r3130l33928m17422l35989
10833H35134k12830j22117p4338m8710l5236j8414k4444j0982k2058k2469j8030
10822B25506j2999j1143l966k213p123J97l416o061k885j229j0134M21l61l280
10808A61314O804L647o714j0456m886N673P051J611j87n973o757r898o493m084
10794A30652m33L628M29m140p391N635M885K219j1248j4379q065r327m194N1J462
10779H9784L881O329K371j77n132J687M356N705J086q127j229J970K933P246P481
$$ plain form
10870 56498 66696 79703 86049 91267 95475 100833 100781 99623 102761 111427 102263 98092 94283 93257
10856 93257 92640 83948 95008 108768 118790 126006 134133 141494 152383 171938 197187 238742 301824
10843 301824 425876 645963 989645 1415618 1810428 2015603 1922473 1588545 1171123 835134
10833 835134 622304 500187 425849 377139 341903 323489 299045 288063 266005 243536 225506
10822 225506 212507 201364 197398 195185 188062 188259 184843 178782 175897 174668 164534 164955 164594 161314
10808 161314 168118 171765 165051 154595 149709 155382 162433 164044 163857 157884 151127 141229 134736 130652
10794 130652 130219 133847 134276 130136 122745 128380 133265 135484 124236 109857 101792 92465 88271 88322 89784
10779 89784 93665 99994 102365 102188 97056 98743 103099 108804 109890 101763 100534 102504 105437 112683 120164
10764A20164L640k512m841r741p811p955l905m95P580Q120J382K910l778o985
10750I5773l597p562n655Q80j989M890J5318R216Q10q828l366L415K872N29n104
10735I7602j7211j8542p926L801K42n706j657Q756J3377J5863N386l476j1359
10722G9150n017M579L1M913J0124K529R297J4326J3528O03k724l634j3334o699
10708A07672j5990j0720O28L983p057p649j916Q955P280o702k175J13n458M70
10694G1434P396J732p85Q730R509J9245J7357J7068J9190K0670J8756K3915K3729
10681B57946J7125L512j2797j7827k7423k3753r827l951R647J0666J1920J6394
10669B31632J6568P671N495J1153K8547O1487J35682K34169L59647M33615L76796
$$ plain form
10764 120164 123804 121292 116451 106710 98899 90944 87039 86544 94124 102244 103626 106536 102758 95773
10750 95773 92176 84614 78959 79839 77850 82740 98058 107274 108084 99256 95890 99305 102177 102706 97602
10735 97602 80391 61849 53923 57724 57966 52260 50603 59359 72736 88599 93985 90509 79150
10722 79150 74133 78712 78743 83656 93780 96309 105606 119932 133460 134063 131339 127705 114371 107672
10708 107672 91682 80962 81590 85573 78516 70867 68951 77906 85186 78484 76309 76422 70964 71434
10694 71434 78830 80562 79777 88507 98016 117261 134618 151686 170876 191546 210302 234217 257946
10681 257946 275071 278583 265786 247959 220536 196783 186956 183005 192652 203318 215238 231632
10669 231632 248200 255871 261366 272519 301066 362553 498235 732404 1092051 1525666 1902462
10658A902462J72784j15591l46262m07927l16206j96105j17216o8163m0225k7423
10648D40128k5471k2114j8559j5036q936m142R635J8197M4132P5922Q4984P9036
10636F57776L5455k8564q4430j05161p8296l8024k0535j9737j2747j3597o968
10625B85172J66r309k826J0661J4717J072k0397k8010l9031m6346l8178j4848
10613A12843j719J2329K1655R899L672L646j67l432n486j0423j8104j6404r806
10600I8503R98K587M639O199O072Q350O251l004o460n797o038Q652K0708J4684
10586A56344J1296Q225Q695N898M133J61p567m761l3O608o521j5729j9347k1316
10572A26086j2382n268M068J4981J4375K0680J1517l456j233J1203L529P050R491
$$ plain form
10658 1902462 2075246 1959655 1613393 1205466 889260 693155 575939 507776 467551 440128
10648 440128 414657 392543 373984 358948 350012 345870 355505 373702 417834 493756 578740 657776
10636 657776 693231 664667 580237 475076 396780 358756 338221 318484 305737 292140 285172
10625 285172 285338 276029 273203 283864 298581 299653 279256 251246 212215 165869 127691 112843
10613 112843 111124 123453 145108 155007 158679 162325 162158 158726 153240 142817 124713 108309 98503
10600 98503 99501 102088 106727 112926 118998 127348 133599 130595 124135 118338 112300 120952 141660 156344
10586 156344 167640 175865 184560 190458 194591 194752 187185 182424 182391 188999 182478 166749 147402 126086
10572 126086 113704 108436 112504 127485 141860 162540 174057 170601 169368 180571 184100 191150 200641
10559B00641J6063J0496J7599L3285N2891P5588O1379K7269j3407m1068m0756
10548C99980k0646k6170k0089j8016o578P41Q774K338o825m606l388O479J0907
10535C22901L08j41m243j1536q711M085J4832O648J3376Q552J156N584K528o259
10521C49080p145n514j6411j5806j6869j1115K854J4546J9506L7284M5003M2470
10509D37883K8282J9563K4604J8640K0690L3467M0166L4103J7339J6386K151N69
10497F93843k432j7203j6757k5020l0490k8994j1481J2993K2670K7478M0356L2235
10485F97198J9858o470j9487j3637L886K7892N9929O4940L8675P410j0448r464
10473H60282J0102K0968K2423L4443M0721M2074N0224N1512N8968O8773O2639
$$ plain form
10559 200641 216704 227200 244799 278084 330975 406563 467942 495211 481804 440736 399980
10548 399980 379334 353164 333075 315059 308481 309222 317996 320334 313509 308903 305515 311994 322901
10535 322901 323209 323068 318825 307289 298578 302663 317495 324143 337519 346071 347227 352811 355339 349080
10521 349080 341935 336421 320010 304204 287335 276220 279074 293620 313126 350410 395413 437883
10509 437883 466165 485728 510332 528972 549662 583129 623295 657398 674737 691123 693274 693843
10497 693843 691411 674208 657451 632431 601941 572947 561466 574459 597129 624607 664963 697198
10485 697198 717056 710586 691099 677462 681348 709240 769169 834109 872784 880194 869746 860282
10473 860282 870384 891352 913775 948218 988939 1031013 1081237 1132749 1191717 1260490 1323129
10462A323129M6850O2405Q9245J12186J35735J40366J22158J09740J22096K00090
10452B464000L47668N36985O70272O37218M32509J46348k0499J4881K08975M44565
10442E882922O96279R90430J377859J866426K388797K890959L437233M351320
10434B3882225O268922J0234799J8047788L2302673N2805157P1096309P2963783
10427B87601656N1305512P754803l9162625o9227583o9120536m9738100l0177880
10420H9235247j8005290j1244849p326755n007452l698118l047460k743229k519158
10412C5642936k273710k013624j777607j554835j337100j082959q03101n73142
10404B4226858m70252n50012q27798j101757j243889j179200j015708q50582p13168
$$ plain form
10462 1323129 1369979 1432384 1521629 1633815 1769550 1909916 2032074 2141814 2263910 2464000
10452 2464000 2811668 3348653 4018925 4656143 5088652 5235000 5214501 5229382 5438357 5882922
10442 5882922 6579201 7569631 8947490 10813916 13202713 16093672 19530905 23882225
10434 23882225 30151147 40385946 58433734 90736407 143541564 214637873 287601656
10427 287601656 338907168 346661971 307499346 238271763 169151227 119413127 89235247
10420 89235247 71229957 59985108 52658353 47650901 43952783 40905323 38162094 35642936
10412 35642936 33369226 31355602 29577995 28023160 26686060 25603101 24800000 24226858
10404 24226858 23756606 23206594 22378796 21277039 20033150 18853950 17838242 16987660 16274492
10395A6274492o22233n73528n32898n07383m98317m61595m34982m10567l91603
10386A1841386l75192l57137l28645l02473k69478k45971k37530k26211k11379
10377I287370j83398j55721j58405j75819k26858k67687k91856k94196k70286
10368G263144k38298j92345j63822j50824j40459j37792j50055j60785j67634
10359E761130j72686j74227j67274j53917j33481j26786j16879j02550q6336p7505
10349D449489q1052r0735j00094j06759j08151r8938r4276p6812p6642p9157q1325
10338C455548q1035p7092p4016o7629o7543n8908n7082n7954n6745o0799o8755
10327B727990n1901l3824k2270j7061k0999k5959k5813l7378n7897o2214o5987
$$ plain form
10395 16274492 15652259 15078731 14545833 14038450 13540133 13078538 12643556 12232989 11841386
10386 11841386 11466194 11109057 10780412 10477939 10208461 9962490 9724960 9498749 9287370
10377 9287370 9103972 8948251 8789846 8614027 8387169 8119482 7827626 7533430 7263144
10368 7263144 7024846 6832501 6668679 6517855 6377396 6239604 6089549 5928764 5761130
10359 5761130 5588444 5414217 5246943 5093026 4959545 4832759 4715880 4613330 4526994 4449489
10349 4449489 4368437 4277702 4177608 4070849 3962698 3863760 3769484 3692672 3616030 3536873 3455548
10338 3455548 3374513 3297421 3223405 3155776 3088233 3029325 2972243 2914289 2857544 2796745 2727990
10327 2727990 2676089 2642265 2619995 2602934 2581935 2555976 2530163 2492785 2434888 2372674 2306687
10316B306687p3970p2042n6453l8956l2611q500P538M694o776j7140l7678n3841
10304A920952m2501k8681O026N1242N1696K4811L590l2358m8344l8646j0620P478
10292A864645J8587J6340J9620K5790M7029M4932M9901M8838M2773N6039Q1810
10281B316304R2759J07911R4234P2641M5243M8614J03465K18396L99049N92300
10271D090916O73438N84969L52183J12767J4849J31732L75224O76257J047851
10262H060186J510352K054496K585556L027689L494014M364642O369967J0666295
10254D2133197J9187245L4482030N5430940P2365555P1330634M6628169J287810
10247C42845580m4001171p0413825o6810540m6766054k8048597j6663884j0361535
$$ plain form
10316 2306687 2232717 2160675 2104222 2065266 2032655 2024155 2031693 2036387 2029611 2012471 1974793 1920952
10304 1920952 1878451 1849770 1855796 1907038 1958734 1983545 1987135 1954777 1906433 1867787 1857167 1864645
10292 1864645 1883232 1899572 1919192 1944982 1992011 2036943 2086844 2135682 2178455 2234494 2316304
10281 2316304 2409063 2516974 2611208 2683849 2729092 2777706 2881171 3099567 3498616 4090916
10271 4090916 4764354 5349323 5701506 5814273 5829122 5960854 6336078 7012335 8060186
10262 8060186 9570538 11625034 14210590 17238279 20732293 25096935 31466902 42133197
10254 42133197 61320442 95802472 151233412 223598967 294929601 341557770 342845580
10247 342845580 298844409 228430584 161620044 114853990 86805393 70141509 59779974
10240E9779974o755098m690047l619834l137034k905125k651013k351851k049902
10232C1620070j778413j523761j248689r53444p01146n77711o46424q65271j110490
10223B2214721j243024j193390j047898q95916p66021o66992n96731n47924n25643
10214A4731182n15518n08524m74810m34610m13513l84264l69340l60214l46510
10205A0923879l16818k88387k65697k62700k67846k70876k55922k30117k04634
10196H560882j81222j84247k13847k41925k48440k45510k07129j86050j67280
10187F685232j52866j54071j51184j59257j67677j72964j68069j70040j65087
10178E224017j46944j18003j16889j15222j04231r8263r6258j03068j20255j17162
$$ plain form
10240 59779974 53024876 48334829 44714995 41577961 38672836 36021823 33669972 31620070
10232 31620070 29841657 28317896 27069207 26115763 25414617 24836906 24190482 23325211 22214721
10223 22214721 20971697 19778307 18730409 17834493 17068472 16401480 15804749 15256825 14731182
10214 14731182 14215664 13707140 13232330 12797720 12384207 11999943 11630603 11270389 10923879
10205 10923879 10607061 10318674 10052977 9790277 9522431 9251555 8995633 8765516 8560882
10196 8560882 8379660 8195413 7981566 7739641 7491201 7245691 7038562 6852512 6685232
10187 6685232 6532366 6378295 6227111 6067854 5900177 5727213 5559144 5389104 5224017
10178 5224017 5077073 4959070 4842181 4726959 4622728 4524465 4428207 4325139 4204884 4087722
10168D087722j14500j05213r7704p6402o2289m8156n3453p5529q4170r6591r1898
10157C181817r5180r1873r2807q4069p1757n9215n3879n8816n9347n0496n3834
10146B410544n3598n5230n0821n5109o1252o2695m9586m3137m8754m9398n7708
10135A823256n0246m4827l7568l4523l2585l4022m2318m1057l6577l4868k3042
10124A411623n341J1328J4389m394j8090m1003n7180n2766l5141k9180k9123j3775
10112A151347k1316j6200j4303j782j0891j0104N154J6130R732p207l0601n2429
10100A017530m6750m0984m8466m5990m5408m0452l8062l2268l1150k8523j8821
10089F00656j7053j1202n168j752j5522j2183j7378k1315l0877j8967m155P49
$$ plain form
10168 4087722 3973222 3868009 3770305 3693903 3631614 3583458 3530005 3454476 3370306 3273715 3181817
10157 3181817 3086637 2994764 2901957 2817888 2746131 2686916 2633037 2574221 2514874 2464378 2410544
10146 2410544 2356946 2301716 2250895 2195786 2134534 2071839 2022253 1979116 1930362 1880964 1823256
10135 1823256 1773010 1728183 1690615 1656092 1623507 1589485 1547167 1506110 1469533 1434665 1411623
10124 1411623 1406282 1417610 1431999 1427605 1409515 1368512 1311332 1258566 1223425 1194245 1165122 1151347
10112 1151347 1130031 1113831 1099528 1097746 1086855 1076751 1081905 1098035 1107767 1100560 1069959 1017530
10100 1017530 970780 929796 881330 835340 789932 749480 711418 679150 648000 619477 600656
10089 600656 583603 572401 567233 565481 549959 537776 520398 499083 468206 449239 445084 445833
10077D45833m562o349L814J4701K0261J6289L359l2017n3883m3437l8344j6707
10065C08958L400K2183J1094J113o008q316j8827l8419m2420l2153p061K331N843
10052B01718N545N756k619K839J24j0005O00N138O347m202j3624j4880l132p094
10038A72511r213O43M710L929Q797J5737J5045L835j0420j1106p072O87J741L439
10024A93263P87N400Q369J1004K1777L2870K5367L5795N6409Q6029J53653K57912
10012H88635L64515M23657L51147J24389j86255l78770m10427l08594j86564j11947
10002E69786p1621m8069k3264j3885j5888j3438j6191j4964k2499k1769k3638
9991B84560k5571j4674o129l571O626J4486J5473l5n389j1928p36j768m215m757
$$ plain form
10077 445833 441271 434922 438736 453437 473698 489987 493346 461329 407446 364009 325665 308958
10065 308958 312358 334541 345635 346748 340740 332424 313597 275178 232758 200605 193544 195875 201718
10052 201718 207263 213019 210400 213239 213363 203358 203958 209096 215443 211241 197617 182737 179605 172511
10038 172511 163298 163941 168651 172580 181377 197114 212159 215994 205574 194468 187396 188083 189824 193263
10024 193263 194050 199450 207819 218823 240600 273470 298837 334632 391041 477070 630723 888635
10012 888635 1253150 1676807 2027954 2152343 1966088 1587318 1176891 868297 681733 569786
10002 569786 498165 450096 426832 412947 397059 383621 367430 352466 329967 308198 284560
9991 284560 258989 244315 238186 234615 241241 255727 271200 271165 265776 253848 253112 251344 247129 242372
9977B42372n769k176K39Q879M123k403j290j3322j9673j6255q641j3346j8105
9964A54633j4881r031o378L664O187J098L736n517p786J767N478j015l708o535
9950A21712k781N251N306Q884K566n813o039n781j1856j5199j6941j7031p569
9937E4709k218j953k845K639o11k216l905K233K500Q053K88k197m415L940P357
9922F1359M562K321n131n548l25k462k99k870l309p743n717n41P500O585M611
9907E2993m241j617l964J078O68l466l511J064R089K762j1643j2638n30P047J4945
9892D8036R117L117j1121r828n241O45j666j385o195o920k756O876P66m227j399
9877A7819r75l320q53n198L684R645Q28k045K331J088P207K386l031M489M543
$$ plain form
9977 242372 236603 234427 234666 243545 247668 245265 243975 230653 210980 194725 186084 172738 154633
9964 154633 139752 130721 124343 128007 134194 135292 139028 133511 125725 127492 132970 131955 128247 121712
9950 121712 118931 124182 129488 138372 140938 135125 129086 123305 111449 96250 79309 62278 54709
9937 54709 52491 50538 47693 50332 49721 47505 43600 45833 48333 56386 56674 54477 50062 54002 61359
9922 61359 65921 68242 63111 57563 57238 54776 54477 51607 48298 40555 34838 34297 41797 48382 52993
9907 52993 48752 47135 43171 44249 44917 41451 37940 39004 48093 50855 39212 26574 26044 33091 48036
9892 48036 57153 60270 49149 39321 34080 34725 33059 31674 25479 18559 15803 22679 23445 19218 17819
9877 17819 16844 13524 12671 7473 11157 20802 21630 19585 21916 23004 30211 32597 29566 34055 38598
9862C8598o415q96N540J848N283N851N595r14p803K34k386J72J07O482J0517O683
9846F8496Q558J4338J3256K4628K8944K8800M6606Q5274J66411K72337L80492
9835A138140M28276L28142Q2218k03955l93137m03220k87486j72179r6558o4505
9825C55736m3142k4761k2623j9852j1540j5342j6101r211j2097j3863o615j1757
9813A48832j3379j5361j3504j0034n861M580M690K639j456N504L014o942n877
9800I6845j994q860p804N037J759o589k610n470O196l630j1495m391o487n914
9786D4593m56m058j340p299O474L694M681K104j770L856R013n93o365K326O47
9771E5507l500n690n088j632q71K51J160l606L565J033p185m643R007J0051P399
$$ plain form
9862 38598 32183 31287 36827 38675 43958 49809 55404 54490 46687 46921 44535 44707 44814 51296 61813 68496
9846 68496 77054 91392 104648 129276 158220 187020 233626 318900 485311 757648 1138140
9835 1138140 1566416 1894558 1976776 1772821 1379684 976464 688978 516799 420241 355736
9825 355736 312594 287833 265210 245358 233818 218476 202375 193164 181067 167204 160589 148832
9813 148832 135453 120092 106588 96554 90693 95273 99963 102602 101146 106650 109664 102722 96845
9800 96845 94851 85991 78187 83224 84983 78394 75784 70314 76510 72880 61385 56994 50507 44593
9786 44593 44137 40079 38739 31440 37914 41608 46289 48393 46623 50479 59492 58899 52534 54860 55507
9771 55507 52007 46317 41229 39597 38726 38977 40137 36531 40096 41129 33944 29301 38308 48359 55758
9756E5758O376l571o147l30N379J615l759q86k597o092J450K050p75n709n485
9741C7277k162l169o596j533m107m278O429O874L205r135r208r692l043N352N010
9726A1224l448L577J497l683n25M253J1405J234m214J655O711N469n478o779L412
9711B6310o555o120m39O502MQ35K704k384n018O860J3520j426q250m266L8p005
9695A5310M971J772o300k138K869M84l735m637m550n99o280O01l671K919R698
9680F714J1j755J572j216P1j988O76J061j270J790l632r78l847n098j633Q943
9664e79j52P854M500o266j979M21l149O022K060j175l933K511M678P65m454J21
9648G245m617K638k659M010L472L572o63l331k06l415L968p399m135O029K4k454
$$ plain form
9756 55758 62134 58563 52416 52086 57465 59080 55321 54435 51838 45746 47196 49246 48471 42762 37277
9741 37277 35115 31946 25350 23817 19710 15432 21861 28735 31940 22805 13597 3905 862 6214 11224
9726 11224 7776 11353 12850 9167 8642 12895 24300 25534 21320 22975 29686 35155 29677 22898 26310
9711 26310 19755 13635 13196 19698 19702 20537 23241 20857 15839 22699 36219 34793 26543 22277 22315 15310
9695 15310 20281 22053 15753 13615 16484 16968 13233 8596 4046 3447 -2833 -2232 -5903 -2984 6714
9680 6714 6725 4970 6542 5326 5397 3409 4085 5146 3876 5666 2034 1056 -2791 -7889 -9522 -579
9664 -579 -731 7123 11623 5357 3378 3799 650 6672 8732 7557 3624 6135 10813 11578 7124 7245
9648 7245 2628 5266 2607 6617 10089 13661 12998 9667 9461 6046 10014 2615 -1520 4509 4533 2079
9632B079k53r36J414O77j855j171O933m284k187m498K32m311k53o57j502p82O017
9615e337k68k318P385L538N719K421N806n253q747J819P857N115n052j2374l579
9600c268L331N430k447r76m365l384N313P959L596K01o163n549P57j833N207O231
9584A0040P002K697L265qp102m606M292k487o403j121J195L076n248q755m086
9569h249N043J77K140L889q60L576N097q919K000L658j269n923n978J64J152l373
9553g675J487O348R964N655k059m531j5042l867P298Q370L990o611o732r948q130
9538b1483o160j353P917P487P971M242P391L8k352o596l792l636L052N340M475
9523B541J231n995P152J968m284J059R02m688m263M471N746j450K025m604o899
$$ plain form
9632 2079 1826 890 2304 2981 1126 -45 6888 2604 417 -4081 -3849 -8160 -8413 -9070 -10572 -11354 -5337
9615 -5337 -5605 -7923 -538 3000 8719 11140 16946 11693 2946 4765 12622 17737 12685 311 -3268
9600 -3268 63 5493 3046 2070 -2295 -5679 -366 7593 11189 11390 5227 -322 435 -1398 3809 10040
9584 10040 17042 19739 23004 22996 15894 11288 15580 13093 6690 5569 6764 9840 4592 -4163 -8249
9569 -8249 -3206 -3029 -889 3000 2140 5716 10813 1894 3894 7552 6283 360 -5618 -5454 -4302 -7675
9553 -7675 -6188 160 10124 15779 13720 9189 -5853 -9720 -2422 5948 9938 3327 -3405 -13353 -21483
9538 -21483 -27643 -28996 -21079 -13592 -5621 -1379 6012 6050 3698 -2898 -6690 -10326 -7274 -1934 2541
9523 2541 3772 -2223 4929 6897 2613 3672 4574 -114 -4377 94 5840 4390 6415 1811 -5088
9508e088O891p4M336l962K054k591m265L104P528N786n408q82M100K812K754O40
9492A7735l385k324j2014o077L516k276m611L414Q180L267j122j28k46j36J547
9477E340P388P6K447Q076k574m534p59m16K170l799k605J000k21l580j419j345
9461E245l215K98n937q23K120P65M147J882l02n107K573m0J725o230q999j12J629
9444a0381k151M920N8J297Q520n389n968k49L791N056N6k907J533O823l104o668
9428d763J205j709L262N476m092J749J457o954l673K527M707r857r00Q087j091
9413d569L647m593m809n28O33K633K029N777j660m539M873l331k718J832N383
9398F0Q56K649M97n958m13J0747j627L44M022K507n950K11j813N384j80j481l989
$$ plain form
9508 -5088 1803 1729 6065 2103 4157 1566 -2699 405 7933 13719 8311 7429 11529 14341 17095 17735
9492 17735 14350 12026 12 -6065 -2549 -4825 -9436 -6022 2158 5425 4303 4175 3929 3793 5340
9477 5340 12728 12804 15251 23327 20753 16219 15460 15044 17214 13415 10810 11810 11589 8009 6590 5245
9461 5245 2030 2328 -3609 -4432 -2312 -1547 2600 4482 4180 -927 1646 1606 3331 -2899 -11898 -12010 -10381
9444 -10381 -12532 -7612 -7554 -6257 2263 -3126 -9094 -9343 -5552 -496 -440 -3347 -1814 5009 1905 -4763
9428 -4763 -3558 -5267 -2005 3471 -621 1128 2585 -4369 -8042 -5515 -808 -10665 -11565 -3478 -4569
9413 -4569 -922 -5515 -10324 -10852 -10219 -7586 -5557 220 -1440 -5979 -1106 -4437 -7155 -5323 60
9398 60 916 3565 4062 -1896 -2309 8438 6811 7155 11177 13684 7734 7945 6132 11516 11336 9855 5866
9381E866k498N29K119O26n87m577l14L189M035L316l75P47l353k42p168K801J0998
9364A5112M319j676L244L737O538l919m560N48o846m537n023k802N094P76K612
9349A2617k515k726k290L190J04M384l936K146L237n865l07O491K070l634p404
9334E562N847m945l900L460O219N989L214P345p50k420m983j31L659J404J928
9319B7498j733m877N220j83j583q23K01L442o3R50J088J975k435J587J531O280
9303C8075L458n907m787L719Q293L293J2934R65k336J051O818Q859L223k904j324
9288G3430M018J0615J4276J3208J3358J5524J4089J3486J8755L1172K8890L5796
9276B86617N6624N9588P0723J03114J36920J87414K46146L34307L95550M06535
$$ plain form
9381 5866 3368 3897 6016 6642 6055 1478 1164 4353 8388 11704 11329 12076 8723 8481 1313 4114 15112
9364 15112 19431 17755 20999 24736 31274 27355 22795 23343 16497 11960 6937 4135 9229 10005 12617
9349 12617 10102 7376 5086 8276 8380 12764 8828 10974 14211 8346 8039 14530 16600 12966 5562
9334 5562 11409 6464 2564 6024 12243 18232 21446 28791 28041 25621 20638 20507 24166 25570 27498
9319 27498 25765 20888 26108 25925 24342 23519 23720 27162 27099 28049 29137 31112 28677 30264 31795 38075
9303 38075 41533 35626 30839 34558 42851 46144 59078 60043 57707 58758 65576 74435 77658 74754 73430
9288 73430 77448 88063 102339 115547 128905 144429 158518 172004 190759 221931 250821 286617
9276 286617 343241 402829 473552 576666 713586 901000 1147146 1481453 1877003 2283538
9266B283538L17264J19788j02073k85066l68702l52173k75499k10341j67471j23597
9256H35668j01927p3980n5976n5323m8212l1623k7101k9842j5171j2567k2303
9245C61643k1420j2438j5507j8948j6053r535p277j5925j0546j040o527j638j1401
9232B13388o094o557j2797q562q729q171k925j0650r102j032N882O169j2635j0460
9218A27725M600n268k160j820k546r557l322o322n703k551L960L194P26K241o425
9203I6772p128o226l490J469R46m531k864n711P6J728p211k486m821n41M610l826
9187E6766n644o06k948k715K168q335r830o458M510N904P235K205N381k52n167
9172D2214M964m15m250J194j282M193o703m347J479L70q34l843q978J032R853
$$ plain form
9266 2283538 2600802 2720590 2618517 2333451 1964749 1612576 1337077 1126736 959265 835668
9256 835668 733741 659761 603785 548462 500250 468627 441526 411684 396513 383946 361643
9245 361643 340223 327785 312278 293330 277277 267742 260465 244540 233994 232954 226427 224789 213388
9232 213388 207294 200737 187940 179378 170649 162478 159553 148903 139801 138769 144651 150820 138185 127725
9218 127725 132325 127057 124897 123077 120531 110974 107652 101330 95627 93076 97036 100230 100956 103197 96772
9203 96772 89644 83418 79928 81397 82343 77812 74948 69237 69313 71041 63830 61344 56523 55982 60592 56766
9187 56766 51122 50516 47568 44853 47021 38686 28856 22398 26908 32812 40047 42252 47633 47381 42214
9172 42214 47178 46763 42513 43707 42425 46618 39915 35568 37047 37417 36583 32740 23762 24794 34647
9157C4647N357L68j721k669n623j1705J52N436K379j724j020l17r78J0777m98
9142C2861l669r53k082M788m493j1686J94L718n275p770M569M957L473J194o104
9127A3722q047n27M287O49L393K915l8m641j331O309O458l916o172k165K072J441
9111A4409K150J11K735q9o057J452K017j281n371n837m054O405Q436j225m083
9096I718M370R38o211J951M736O088l377m973n602J839M019j479m785P215K816
9081A7263k583o373m10M483N25k934M91o092k202j742L38L270o07l554O239j329
9065D783q70R576J0722m635j0085k420j438j439j419J0858l009P283j37j2816
9051D954l84N655n962K47L872N334q65r207l631K820j471K337J299m6l158l74
$$ plain form
9157 34647 40004 40372 38651 35982 30359 18654 18806 24242 26621 24897 23877 23560 22582 33359 32861
9142 32861 29192 28239 26157 30945 26452 14766 14960 18678 13403 5633 10202 15159 18632 19826 13722
9127 13722 5675 5148 9435 10084 13477 16392 16354 11713 10382 16691 23149 19233 13061 10896 12968 14409
9111 14409 16559 16670 19405 19316 13259 14711 16728 15447 10076 4239 185 6590 15026 13801 9718
9096 9718 14088 15026 8815 10766 15502 21590 18213 13240 7638 9477 13496 12017 7232 14447 17263
9081 17263 14680 8307 7897 12380 12905 9971 10462 4370 2168 426 764 4034 3427 -127 6112 4783
9065 4783 3913 13489 24211 19576 9491 7071 5633 4194 2775 13633 10624 17907 17770 4954
9051 4954 4570 10225 4263 4510 8382 13716 12851 3644 13 2833 1362 3699 4998 4952 1794 1420
9035A420K053P726o9n98K67m627J744j638m461K627l781l539J797j010K466Q65
9019A242N750L272k34K289k43p576k813l643J294R20J406L718Q781j252l79K349
9003A4881k598k501N79k213m75L66L001J704l308q91j113j710n838k655O22q34
8987b983l045K677M048Q894O6p441J90Q620M421J198k170K75n94j478n842l795
8971C041J905j337m318n245L012m26M972O715M76j828o577l241o000J877M264
8956b710J512M578K558l27L303m733k63Q875K60o156m600k296P25J1226n47j291
8940A0114k693n0q106j531K104P48L383M081m368L597j143n143k381n416L95J348
8924e061m1l449k06K823L967k403L559L253j329k093L46K646j419J387Q713M146
$$ plain form
9035 1420 3473 11199 11130 10532 10799 6172 7916 6278 1817 4444 663 -2876 -1079 -2089 377 1242
9019 1242 6992 10264 10030 12319 12076 4500 1687 -1956 -662 258 1664 5382 14163 12911 12532 14881
9003 14881 12283 9782 10361 8148 7673 8039 11040 12744 9436 8545 7432 5722 -116 -2771 -2149 -2983
8987 -2983 -6028 -3351 697 9591 9657 2216 2406 11026 15447 16645 14475 14750 14156 12678 6836 3041
8971 3041 4946 3609 -709 -5954 -2942 -3368 1604 8319 8795 6967 390 -2851 -8851 -6974 -2710
8956 -2710 -1198 3380 5938 5611 8914 4181 3918 12793 13053 6897 2297 1 726 11952 11405 10114
8940 10114 7421 7371 -735 -2266 -162 586 3969 8050 3682 7279 6136 993 -1388 -6804 -6409 -5061
8924 -5061 -5102 -8551 -8757 -5934 -1967 -4370 -811 2442 1113 -980 -634 2012 593 1980 10693 14839
8908A4839r447n998K078R886m042o463O240P096m378l801Q14J275m13L878k609
8893H955k257n314j1079O064J876n091L920r93K773K987j434J281q50p97j977
8878a936j8K56j415n07M866k364p97m706J277K290N124J0321j673q48P01l827
8862F744j686N719m202l947O657O630j564l550n956l418K699K282P249M759q55
8847A7561l199o83k005j620k517n228N706M066R68n94n725l168M771k798l625
8832A910j954J704M692J481J964r105j209O926Q33m799j248K718j823k535k964
8817c409q90J447N38P801k727M736N08l054l926l142J962k225N920p04m996J889
8801b72K497K638L602p2k686j785l813l280J312j043Q99N482k92m68J588o022
$$ plain form
8908 14839 5392 -606 1472 11358 7316 853 7093 14189 9811 6010 6824 8099 7686 11564 8955
8893 8955 6698 1384 -9695 -3631 -1755 -6846 -2926 -3919 -1146 1841 407 1688 838 41 -1936
8878 -1936 -1954 -1698 -3113 -3620 1246 -1118 -1915 -6621 -5344 -3054 2070 12391 10718 9870 10571 6744
8862 6744 5058 10777 6575 2628 9285 15915 14351 10801 4845 1427 4126 6408 13657 18416 17561
8847 17561 14362 13679 11674 10054 7537 2309 8015 12081 13049 12455 6730 3562 8333 5535 1910
8832 1910 -44 1660 6352 7833 9797 692 -517 6409 7242 2443 1195 3913 2090 -445 -3409
8817 -3409 -4299 -2852 -2314 5487 2760 7496 8004 4950 1024 -2118 -156 -2381 3539 2835 -2161 -272
8801 -272 2225 4863 8465 8393 5707 3922 109 -3171 -1859 -2902 -2003 3479 3187 2719 4307 -1715
8785a715l765L07R39M061M368M093r29n418m37M255M497o10m174l41Q97n733l944
8768c649P828O690J711n006M385L836J877o710o803J396k280L016N503N414o421
8753A0787n928m298K70K256m2K335p6k382l063j99O958j578q481N313M145K285
8737H302L08K734n293j15J994j106O814O48K46r806o679L270j515L722j543j407
8721E74N376M297J782o15K000l104J292J221M514j853m403P79j897n71m466m836
8705I0K351L772O16j455m021j987J685k382N96o164j0722R597K395K865M573L597
8689E406J805N679K06J794J56K066M368j58P27r176n126l01k782J3609R210J501
8673B8984J512l880K64n507J402P194M615KP193j885l33n098j1361o352J767K073
$$ plain form
8785 -1715 -5480 -5173 -4234 -173 4195 8288 7359 1941 1504 5759 10256 9646 5472 5131 6028 295 -3649
8768 -3649 4179 10869 12580 7574 11959 15795 17672 10962 4159 5555 3275 6291 11794 17208 10787
8753 10787 4859 561 831 3087 3045 5380 5304 2922 -141 -340 6618 5040 -3441 1872 6017 8302
8737 8302 8610 11344 6051 5936 7930 6824 13638 14286 14532 4726 -1953 1317 -198 3524 1981 574
8721 574 5950 10247 12029 11414 13414 10310 11602 12823 17337 15484 11081 11860 9963 9392 4926 90
8705 90 2441 6213 6829 5374 1353 -634 1051 -1331 -735 -6899 -17621 -8024 -5629 -2764 1809 5406
8689 5406 7211 12890 13096 14890 15046 17112 21480 21322 22049 12873 7747 7446 4664 18273 27483 28984
8673 28984 30496 26616 26880 21373 22775 29969 34584 34586 41779 39894 39561 34463 23102 16750 18517 20590
8657B0590l111N5K56K915N08k417p306l934M705J197o254k694Q132l209K73j406
8641H300j160M434P40M651k359l896k199O648L701j279o37o862J09K959m210l355
8625E585M092O44K932N349J964n211P63L871L241N05R20J101J348M072j2481m510
8609A4185J789j160J820P505k555L523n453j984r28Q28p83K925N92J990j214Q18
8593B1898M203M443p76l631p34j427k640P939O779o020M032P173J460J847N712
8578E0258M314K744m076n1Q810N230J329L528o012k138K62m847p506l059m810
8563D3976p953j482n966K292j354k415L905L699P28n540p537l059P96J2k130K815
8547B0787l620K929K725j997o402K107L137o896J342N037L291L51j906r03k73
$$ plain form
8657 20590 17479 17534 17790 20705 21213 18796 11490 7556 12261 13458 7204 4510 12642 9433 9706 8300
8641 8300 7140 11574 12314 16965 14606 10710 8511 15159 18860 17581 16944 10082 10191 13150 8940 5585
8625 5585 9677 10321 13253 18602 20566 15355 16118 19989 23230 23735 24655 25756 27104 31176 18695 14185
8609 14185 15974 14814 16634 24139 21584 25107 19654 17670 16742 17570 16787 19712 20304 22294 21080 21898
8593 21898 26101 30544 29768 26137 25403 23976 21336 29275 36054 30034 34066 41239 42699 44546 50258
8578 50258 54572 57316 53240 53189 61999 67229 68558 72086 66074 63936 64198 59351 51845 48786 43976
8563 43976 36023 34541 28575 30867 29513 27098 31003 34702 35430 29890 22353 19294 20090 20102 17972 20787
8547 20787 17167 20096 22821 20824 14422 16529 19666 12770 14112 19149 22440 22791 20885 19982 19709
8532A9709R55j098l781n084n619R259J724l323k69l448j738k652l511m369J082
8517b163k522p35J087J479m04K579K966J292K966k719l9p52N126L9o527n421K33
8500c515q04L126m550m754Q399L066k449j636K738J836n452j78N218m424J251
8485b128P004m358k835k292N819O962P22L171m00k171l886k56J266j223L971j093
8469H273J981L063k947J557m548m730N937L680r20o841m191m589k962J0162Q961
8454A1886l233n597J773N049J446J196J756m66j160k531n605n062k705N939O493
8439I179k206L740k113n789K543L949l702P97l425p334k880M545Q464K791j373
8424G186l947KP005k885j599M654o523q277l499N728M085N183l275m975k959M6
$$ plain form
8532 19709 20664 19566 15785 10701 5082 14341 16065 12742 12473 9025 7287 4635 1124 -3245 -2163
8517 -2163 -4685 -5420 -4333 -2854 -3258 -679 2287 3579 6545 3826 3787 3035 8161 8200 1673 -3748 -3515
8500 -3515 -4319 -1193 -5743 -10497 -2098 968 -1481 -3117 -379 1457 -3995 -4173 1045 -3379 -2128
8485 -2128 4876 518 -2317 -4609 1210 8172 8894 12065 11665 9494 5608 5352 6618 5395 9366 8273
8469 8273 10254 13317 10370 11927 7379 2649 8586 12266 11346 4505 314 -4275 -7237 2925 11886
8454 11886 8653 3056 4829 9878 11324 12520 14276 13810 12650 10119 4514 -548 -3253 2686 9179
8439 9179 6973 10713 8600 2811 5354 9303 5601 6398 2973 -4361 -7241 -2696 5768 8559 7186
8424 7186 3239 3241 10246 7361 5762 10416 3893 -4384 -7883 -2155 1930 7113 3838 -1137 -4096 -4050
8408d050N114l604N70m41l129J42Q914Q371m863j651p220q03P140L801o69k854
8392D768p333r85O52J949K41j190L704l969L037l970J333M605k352j384j233q46
8376b973N449Q355P702J835o243m841l063j10m60L497l917q364J5n648R09K585
8360e272J056O301O174M871k525q129r995R04K827L917K369j513k989j541L037
8345e08K277J726l722j970P705J195l687m685K609L907K965k576l256L134r11
8330D203R29J977r45q228K866L176k912j545j320L00P206M567q09q5k773j284
8314E323j152k229k261M633J291r82k336J730K002l330l761k757k497m443m38
8299a1207O334J0105J170o073N128j758l084K832l149L218J65m767J267L999L936
$$ plain form
8408 -4050 1064 -2540 -1970 -2411 -5540 -5398 3516 11887 7024 5373 -1847 -2650 4490 8291 7622 4768
8392 4768 -2565 -3550 -2898 -949 -708 -1898 1806 -2163 874 -3096 -1763 2842 490 -894 -2127 -2973
8376 -2973 2476 10831 18533 20368 14125 9284 6221 6111 5651 9148 5231 -3133 -3118 -8766 -7857 -5272
8360 -5272 -4216 2085 8259 13130 10605 2476 -7519 -6615 -3788 129 2498 985 -2004 -3545 -508
8345 -508 1769 3495 -227 -2197 5508 6703 3016 -1669 940 4847 7812 5236 1980 5114 4203
8330 4203 5132 7109 6164 -2064 802 3978 1066 -479 -1799 -1499 5707 10274 9465 9380 6607 5323
8314 5323 4171 1942 -319 4314 5605 4623 2287 4017 6019 2689 -1072 -3829 -6326 -10769 -11207
8299 -11207 -4873 5232 6402 329 5457 3699 615 3447 298 3516 3681 -1086 181 4180 8116
8284H116L770k564o666p766l243Q150N71n857J346J72L268J139k064l369n47J713
8268c831l421m073j100O622P107l56l230K508N703J470K292n229k882J682l582
8253c20j177n37k937O342K595N852n09J287k775n668k004l580p4N282P910P506
8237A7193p678n102K565l306q958j872J904J264P287j195K0O061R395j719j4353
8222A506j928O855j105l686m638j450n791K390N616l045J440L014L229O570n62
8207H415j0177o289M362N467j950L081j495P66K831q169K300N857o262L275j424
8192E88j612j336M16o035M706M965l894J302N885J012O13m090n165n280j786N315
8176d396N86L668m432O274O090j600n782l924m043J0261l341n603k125l427L807
$$ plain form
8284 8116 11886 9322 2656 -5110 -8353 -203 368 -5489 -4143 -3971 -703 436 -1628 -4997 -5544 -3831
8268 -3831 -7252 -11325 -12425 -5803 1304 948 -2282 226 5929 7399 9691 4462 1580 3262 -320
8253 -320 -1497 -2034 -4971 1371 3966 9818 9309 10596 7821 2153 149 -3431 -3505 1777 9687 17193
8237 17193 9515 4413 6978 3672 -5286 -7158 -5254 -3990 3297 2102 2122 8183 17578 15859 1506
8222 1506 -422 6433 5328 1642 -2996 -4446 -10237 -7847 -2231 -5276 -3836 -822 2407 8977 8415
8207 8415 -1762 -8051 -3689 1778 -172 2909 1414 2180 5011 -3158 -858 4999 -1263 2012 588
8192 588 -1024 -2360 -1944 -7979 -3273 1692 -2202 -900 4985 5997 6610 2520 -2645 -7925 -9711 -4396
8176 -4396 -3810 -142 -4574 1700 7790 6190 408 -3516 -7559 2702 -639 -6242 -8367 -11794 -7987
8161g987M475Q805O52J057q67L536j479o62l807m528m61j315j045J787J383o437
8145f893L583M135M921K33P69Q19k873k550p782M339M16j466k298K405j270L987
8129D75M477M279k408q407m320J0324K499J072J384q844l369M299m001Q096K969
8114H525k296K094J581m250n503p430j978L306m19J664L010M019K944M31J496
8099G194K710M37o686J186o41m316k722P369J0754L669j56M511p240p322n216
8084C531l36o031K093Q315k430p060J057J657m079j759o624l7J1371N416p180
8069b096R82Q075m443p409m450Q562N393m934k421Q072K236J770K235o188o937
8054a553l232Q355N26K281J39M659M229O49K173J317q995j175p094m733L34N9
$$ plain form
8161 -7987 -3512 5293 5945 7002 6135 9671 8192 7530 3723 -805 -1266 -2581 -3626 -1839 -456 -6893
8145 -6893 -3310 825 5746 5979 6748 7567 4694 2144 -5638 -1299 -883 -2349 -4647 -2242 -3512 475
8129 475 4952 9231 6823 -1584 -5904 4420 6919 7991 9375 531 -2838 1461 -2540 5556 8525
8114 8525 6229 8323 9904 5654 151 -7279 -9257 -5951 -6370 -4706 -1696 2323 5267 5698 7194
8099 7194 9904 10341 3655 4841 4200 -116 -2838 4531 15285 18954 18798 23309 16069 8747 3531
8084 3531 3195 -2836 -743 7572 5142 -1918 -861 796 -3283 -5042 -11666 -11703 -332 5084 -2096
8069 -2096 -1114 6961 2518 -4891 -9341 -779 4614 -320 -2741 5331 7567 9337 11572 5384 -1553
8054 -1553 -4785 3570 4096 6377 6516 11175 15404 16053 18226 19543 10548 9373 2279 -2454 -2120 -2061
8038b061N42M836J46P88N952N218J0704O49j1233m733K334r95j431j0640j520
8023a444O822q31R095M186k099j218l328j211O993J624l279l851m724P071O764
8008B0570M632o489o03N920K283j257n84o030j0616R76N700N656P214p57j0523
7993A6092j946L265O630O04p140n541k857n47O827O258l371o267J409Q553Q501
7978C0470L539M705L008l772l707k389L55R39o049K124Q267p122o314M619J065
7963B9738n225j0178o134o725J00O545J617M32M73N080j440j629O08M760O244
7948B4266J530j882o439N073j377o167j912Q135K24j16M849M01k525N859n357
7933B4562o399J011K740N131K10O837N017j693j264K37j2622k861m148J152k522
$$ plain form
8038 -2061 -1519 3317 3463 4251 10203 15421 26125 26774 15541 10808 13142 12147 10716 76 -1444
8023 -1444 5378 4547 13642 17828 15729 14511 11183 9972 16965 18589 15310 11459 6735 13806 20570
8008 20570 25202 18713 18110 24030 26313 25056 24472 18442 7826 8802 14502 20158 27372 26615 16092
7993 16092 14146 17411 24041 24645 17505 11964 9107 8560 15387 21645 18274 12007 13416 21969 30470
7978 30470 34009 38714 41722 37950 34243 31854 32209 33148 27099 29223 37490 30368 24054 28673 29738
7963 29738 24513 14335 8201 1476 1576 8121 9738 10170 10643 15723 14283 12654 13262 18022 24266
7948 24266 25796 23914 17475 22548 21171 15004 13092 21227 21451 21335 26184 26585 24060 29919 24562
7933 24562 18163 19174 21914 27045 27255 34092 39109 37416 36152 36389 23767 20906 16758 17910 15388
7918A5388j278j746p64R566l755k694K146l893N13L642M698P57l05l458l908q058
7902F851k800L013R973K544k513r491j87n90P083K085j120n488q214p02J856J0153
7886A2453K051n549k9Q383M427l613k382q69m472p828L698p81O910J47K675l783
7870A1438m150K453J549o24j884k065j547J038M884O682l09n942J623k306q19
7855A0021O271N81j4610k824N467K678p17K765N755q91l053K808L216n737m265
7840G465L152L93J03K410o579n373p458o65J648m418l910L504J1189P673k784
7825F350l33J849j327k192J16P35L260j216J2j063M00oL997n010J520L817l658
7808G251l977r441Q73M141L942m43k606J408P777j424m96l893j126M998P953q44
$$ plain form
7918 15388 14110 12364 11600 21166 17411 14717 16863 12970 13483 17125 21823 22580 22275 18817 14909 6851
7902 6851 4051 7064 17037 19581 17068 7577 7390 6800 13883 15968 14848 9360 1146 444 2300 12453
7886 12453 14504 8955 8926 17309 21736 18123 15741 14872 10400 2572 6270 5489 12399 12546 15221 11438
7870 11438 7288 9741 11290 10666 8782 6717 5170 6208 11092 17774 17465 11523 13146 10840 10021
7855 10021 16292 16873 2263 -561 4906 7584 6867 9632 15387 14496 11443 14251 17467 11730 7465
7840 7465 10617 11010 11113 13523 6944 1571 -5887 -6552 -4904 -9322 -13232 -9728 1461 9134 6350
7825 6350 6017 7866 6539 4347 4463 5198 8458 7242 7254 6191 6591 6585 10582 5572 7092 10909 7251
7808 7251 3274 -6167 -5294 -1153 2789 2346 -260 1148 8925 7501 7005 3112 1986 6984 14937 14093
7792A4093j5952j1905M513M620L226M670L24J229l94K746k683q063p614J149L514
7777f527P268m55l968k401m462Q30K31L968k283P32M041N288l168j918o46J514
7761a956o3N745K411p561p701o400N839O123K826m664K433R052l310m436n916
7746g578l001Q289j918K861M520J636K438n844l853K421r15P36K569L192N69Q49
7730F971k405j787r6m301N267n92o234j680M693L984L690K74m010n978J146J855
7714G97J069k196j532r67K84R6k170K425J0223M465n73m358l706m270o396K681
7698d128K025j387l301n694P377O8L95L487j770M33J830k863L14Q37k844N821
7682F00M742M59J349J862O315L044J399n351m239n239m919R36j0535o058L819
$$ plain form
7792 14093 -1859 -13764 -9251 -4631 -1405 3265 3589 4818 4424 7170 4487 -3576 -11190 -10041 -6527
7777 -6527 741 286 -3682 -6083 -10545 -9715 -9484 -5516 -7799 -7067 -3026 2262 -906 -2824 -3470 -1956
7761 -1956 -2019 3726 6137 -1424 -9125 -15525 -9686 -3563 -737 -5401 -2968 6084 2774 -1662 -7578
7746 -7578 -10579 -2290 -4208 -1347 3173 4809 7247 1403 -2450 -29 -944 -208 2361 5553 6122 6971
7730 6971 4566 2779 2683 -1618 3649 3057 -3177 -4857 -164 3820 7510 7784 3774 -2204 -1058 797
7714 797 1866 -330 -1862 -2829 -2545 -2449 -4619 -2194 8029 12494 11921 7563 3857 -413 -6809 -4128
7698 -4128 -2103 -3490 -6791 -12485 -5108 -5040 -4645 -1158 -2928 -2495 -665 -3528 -3214 -2377 -5221 600
7682 600 5342 5801 7150 9012 15327 18371 19770 14419 10180 4941 22 958 -9577 -15635 -11816
7667a1816n31N998P373j144p020m856L515Q914J969K739k552m806k633j72L141
7652a881J981m468J549R538J958j308l782p47L320m704n896j45J443M257M307
7637E422j210m72J003n28L667j90j263k563q420j200M245K084k263R779k673m794
7621F24l822m518k306J225j131L909K103J565P92M160l6M257M742m269q403n563
7605f671J774K38l807l2K321L004P82j746m531K043J785m889L601N127P85k783
7589b999j175L379J470M308J658m019o38q396j532K914N552p65M86N738k08o888
7573a115j0629M116k10j227L732n25n223N738L915L91L119J654P503K795M33k142
7557A2325q90j867k668r392j0808M368O329P574L105o297J780Q439k582m931r25
$$ plain form
7667 -11816 -12347 -6349 1024 -120 -7140 -11996 -8481 433 2402 5141 2589 -2217 -4850 -5022 -1881
7652 -1881 100 -4368 -2819 6719 8677 7369 3587 2840 6160 1456 -4440 -4585 -3142 1115 5422
7637 5422 4212 3740 4743 4215 7882 7692 6429 3866 -4554 -5754 -1509 575 -1688 8091 5418 624
7621 624 -3198 -7716 -10022 -8797 -9928 -6019 -3916 -2351 -1559 2601 2565 6822 11564 7295 -1108 -6671
7605 -6671 -4897 -4659 -8466 -8498 -6177 -3173 -2391 -4137 -8668 -6625 -4840 -9729 -6128 -1001 -216 -2999
7589 -2999 -4174 -795 675 4983 6641 2622 1984 -6412 -7944 -5030 522 -243 243 5981 5773 -1115
7573 -1115 -11744 -7628 -7838 -9065 -5333 -5858 -11081 -5343 -1428 -1037 2082 3736 11239 14034 14467 12325
7557 12325 11435 9568 6900 -2492 -13300 -8932 -2603 4971 8076 1779 3559 11998 9416 4485 3560
7542C560j038o83k494j706O704J0001n555o837M68N117m9m824L343m026j2855
7527a0874j598O969l447n299Q76R14N468j79M50o72j80M8J233J880M453O630K90
7510F962l812j37m71P845r73q035K047l152k858j213L334L27k351K77M685N97
7494C072j303o164k572P98l753J705J436M570M942P721L433m194n567K372J02
7479F598L10j868o996m828M982K693k283n330J173O017Q218n17n443r596l758
7464a0628r71j895N757j426M325l47M130K280p73N85J837m814n281p618L194L162
7448h483k93p9J974N82k517k652L49O844J3121N842p66r331o065K306L637j293
7432C176l037k829m117q554K010J305j688M511j017L807Q434K680m288m994p24
$$ plain form
7542 3560 2522 1839 -655 -2361 4343 14344 8789 1952 2420 7537 7488 2664 6007 1981 -10874
7527 -10874 -12472 -5503 -8950 -14249 -13373 -12459 -6991 -7170 -6720 -7392 -7572 -7524 -6291 -4411 42 6672 6962
7510 6962 3150 3013 2542 10387 9414 1379 3426 274 -2584 -3797 -463 -136 -2487 -2210 2475 3072
7494 3072 1769 -4395 -6967 -6169 -9922 -8217 -6781 -2211 2731 10452 13885 9691 4124 6496 6598
7479 6598 6908 5040 -1956 -6784 -1802 891 -1392 -6722 -5549 468 8686 8169 2726 -6870 -10628
7464 -10628 -11599 -13494 -7737 -9163 -4838 -5185 -1055 1225 452 1037 2874 -1940 -7221 -14839 -11645 -8483
7448 -8483 -8776 -8855 -6881 -6299 -8816 -11468 -11119 -4275 8846 14688 13922 4591 -1474 832 4469 3176
7432 3176 139 -2690 -6807 -15361 -13351 -12046 -13734 -9223 -10240 -6433 2001 4681 393 -4601 -5325
7417e325M322N457k191m956l911R16N023Q98j702L161K096l239N96r94m75L469
7401C145n921q026M519L607M517R115r353p391k081j861J929o106M038Q159j398
7386c108o58L08O766N478K445o510l233m737p438J862k463l800M3N203M690P927
7370B775n876j735L03m08k619j143L622m651M816j192r162k811O690J0141M838
7355C588k514q2K995o397K938L080K652R658j520j0829j0540J365J248k366R64
7340e760L216P961k3l676l849k279q26j882K419O152N401m230l421n523L199R377
7324F256L568K190o191j1495K655N987J732k078k409k880j771j215O563J246m021
7309a863o726m187K040K373K081j644N89N237k388j531l248N738J0696n477q545
$$ plain form
7417 -5325 -1003 4454 2263 -2693 -6604 -5688 -665 233 -1469 1692 3788 549 1145 151 -324 3145
7401 3145 -2776 -10802 -6283 -2676 1841 10956 1603 -5788 -7869 -9730 -7801 -13907 -9869 -1710 -3108
7386 -3108 -3766 -3458 3308 8786 11231 4721 1488 -3249 -10687 -8825 -11288 -15088 -15045 -9842 -5152 2775
7370 2775 -3101 -4836 -4533 -4941 -7560 -8703 -5081 -9732 -4916 -6108 -15270 -18081 -11391 -1250 3588
7355 3588 1074 992 3987 -2410 528 3608 6260 15918 14398 3569 -6971 -5606 -4358 -6724 -5760
7340 -5760 -2544 5417 5394 1718 -2131 -4410 -5236 -7118 -4699 1453 6854 2624 -797 -6320 -3121 6256
7324 6256 9824 12014 5823 -5672 -3017 2970 4702 2624 215 -2665 -4436 -5651 912 2158 -1863
7309 -1863 -8589 -12776 -10736 -8363 -6282 -7926 -7337 -2100 -4488 -6019 -9267 -3529 7167 1690 -6855
7294f855j313N306M435r067P12k84j199Q33k060O97L433N831L403N92n913q822
7278a0271J057L516n406j293L646P716O961o88j1330L799L981M029O2r10J718
7263F587K708M177m388m056o274O88J053j177k553K387j669N755K149o232j0365
7248a1210P952K517p499j854L965j660m795l071o550m664O726J0744L456L066
7234b877L84K773K562N10p86j2043m352Q944O792J082l161O362K07N88l76Q91
7218G500n656J362q89j417j872J250M843P6q1P547L78k474k759j0099n356m852
7202a2499O693K720o583o95J646m246k397O396k8J228N285J72O611M938o172k968
7186A01k285J923N200P40M418O433j2487j3064j594J007K740L854j486l212m438
$$ plain form
7294 -6855 -8168 -2862 1573 -7494 -6782 -7066 -8265 -7432 -9492 -8795 -5362 469 3872 4464 -1449 -10271
7278 -10271 -9214 -5698 -11104 -12397 -8751 -1035 5926 5238 -6092 -2293 1688 5717 5779 4869 6587
7263 6587 9295 13472 9084 5028 -1246 -558 495 -682 -3235 -848 -2517 3238 5387 -845 -11210
7248 -11210 -3258 -741 -8240 -10094 -6129 -7789 -12584 -15655 -22205 -26869 -20143 -9399 -5943 -2877
7234 -2877 -2493 280 2842 3352 2566 -9477 -13829 -4885 1907 2989 -172 6190 6397 6985 6609 7500
7218 7500 1844 3206 2317 900 -972 278 5121 5197 5116 12663 13041 10567 7808 -2291 -7647 -12499
7202 -12499 -5806 -3086 -9669 -10364 -8718 -12964 -15361 -8965 -8993 -7765 -2480 -2308 4303 9241 3069 101
7186 101 -2184 -261 4939 5679 10097 16530 4043 -9021 -10615 -9608 -6868 -3014 -4500 -7712 -12150
7171a2150M977R098N34n882O41k642p4L207K57N757K050n242r92K058l058k546
7155d007J176j576J40j511K802j190O64l233k514J605M938N807O15m519Q31n696
7139e668j389Q490J744l200r009L65L582P018K846q027l847L985j797K791N694
7124C578K990l091r80l801l003l814O197j987l096J591O370k246Q393J0168k460
7109A4809o815r456o139P060N057j150l132m738n588O19P999O739l541j964o859
7094g099J494M460Q55K098M39P00r249j820N856m39L067L174l38m800m682K504
7078c780L982K751L463N14k569m574j902L164l682l703n71Q45j050q37k00J184
7062f965M268K021k000K14M153k420n003m153Q490J626N823K352m21n449j580
$$ plain form
7171 -12150 -7173 1925 2459 -3423 -2782 -5424 -5498 -2291 -2034 3723 5773 531 -461 1597 -1461 -4007
7155 -4007 -2831 -4407 -4267 -5778 -2976 -4166 -3502 -6735 -9249 -7644 -2706 3101 3716 -803 28 -5668
7139 -5668 -7057 1433 3177 -23 -9032 -8667 -5085 1933 4779 -3248 -7095 -3110 -4907 -2116 3578
7124 3578 6568 3477 2497 -1304 -4307 -8121 -1924 -3911 -7007 -5416 954 -1292 7101 17269 14809
7109 14809 7994 -1462 -7601 -541 4516 3366 234 -4504 -10092 -9473 -1474 5265 1724 -240 -7099
7094 -7099 -5605 -1145 -290 1808 2247 2947 -6302 -8122 -2266 -2705 362 3536 3198 -1602 -6284 -3780
7078 -3780 202 2953 6416 6930 4361 -213 -2115 1049 -2633 -6336 -6907 -6062 -7112 -7949 -8149 -6965
7062 -6965 -2697 -676 -2676 -2462 1691 -729 -5732 -9885 -1395 231 6054 8406 7985 2536 956
7047I56M085p55r087m358L028L9m404k104r04K572L815O511M458l86l3k79j388
7030A766j945m33n153p658P11L82M647M736O443n464k829J114L259l3L52RK375
7013B279l487k213J757q9J376N773O034J724K006k25r307n069j392k41K054l914
6997b934J276P292L285k210m679n71o30p59j324j73M921J2942n212q017o64r69
6981A574m6J73j997q955J425K158l066k606M91J1161j925k749K579N46n606p977
6965a4820j099O707l018Q91N360l166J953P856M427j326k959m084k737L51K249
6950c415K137K257k892m027R37o93K947M449o879j0776J022q5Q057J0547l376
6935B10o432n136K803J1574P68j683l40n336M168R446N37J267J768j496q367J317
$$ plain form
7047 956 5041 4286 -4801 -9159 -6131 -6092 -10496 -12600 -13504 -10932 -7117 -606 3852 3466 3433 3154 1766
7030 1766 -179 -612 -5765 -13423 -12712 -12330 -7683 -2947 3496 -1968 -4797 -3683 -424 -457 -105 -96 2279
7013 2279 -1208 -3421 -1664 -1753 -377 5396 11430 13154 15160 14935 5628 559 -833 -1074 980 -2934
6997 -2934 -1658 5634 8919 6709 2030 1459 829 70 -1254 -1427 3494 16436 11224 3207 2543 1574
6981 1574 1528 1701 -296 -9251 -7826 -5668 -8734 -11340 -10849 312 -1613 -4362 -1783 -1237 -6843 -14820
6965 -14820 -15919 -9212 -12230 -11339 -5979 -9145 -7192 664 5091 3765 806 -3278 -6015 -5664 -3415
6950 -3415 -1278 979 -1913 -5940 -5003 -5696 -2749 1700 -5179 -15955 -14933 -15018 -6961 3586 210
6935 210 -6222 -11358 -8555 3019 3787 2104 1764 -3572 596 10042 10579 11846 13614 12118 3751 5068
6919E068L548j072J488K431n500m045n373O85K544l636l382M259j848j774P17
6904e890O282L767L96j763p361n758j070L888j816o480K077Q949J2356P37n322
6889B992p026l993j537J981K404l769L535l171p814q331l67N995K909M059M297
6874g836K898K059M3L710m200k941O757Q231j744k382o848O780L566p417j809
6859a133q285J156M007k661m751j154M569P8N20M696O053J002M41m231k114K047
6843B40m403o618m268K524M850j82J9J774n696k612K153l200J359Q370L785o884
6827h789k580P208P382o151k530M182l77k229k936k662K058J386j471l604M574
6812f539M588l320q02N37M7j400q85M79O26P08O238r93p428P783M255J848p27
$$ plain form
6919 5068 8616 7544 9032 11463 5963 1918 -3455 -2770 -226 -3862 -7244 -2985 -4833 -6607 -5890
6904 -5890 392 4159 4555 2792 -4569 -10327 -11397 -7509 -9325 -15805 -13728 -4779 7577 8314 2992
6889 2992 -4034 -8027 -9564 -7583 -5179 -8948 -5413 -8584 -16398 -24729 -25096 -19101 -16192 -12133 -7836
6874 -7836 -4938 -2879 -2836 874 -3326 -6267 490 8721 6977 4595 -2253 4527 8093 676 -1133
6859 -1133 -9418 -8262 -4255 -6916 -11667 -12821 -8252 -8174 -7654 -2958 3095 4097 4538 307 -1807 240
6843 240 -4163 -10781 -15049 -12525 -7675 -7857 -7838 -6064 -11760 -14372 -12219 -15419 -14060 -5690 -1905 -8789
6827 -8789 -11369 -4161 3221 -2930 -5460 -1278 -1655 -3884 -6820 -9482 -7424 -6038 -7509 -11113 -6539
6812 -6539 -1951 -5271 -6073 -5536 -5489 -6889 -7774 -7295 -6669 -5961 277 -716 -8144 -361 3894 5742 5015
6795E015n715m835K075P285m035j181M252j337l205L981j105q43N037j803n984
6780b398j459J216j620L805J073J382l581m449N665K44M235j323m146O18k230
6765b968J369j918Q10J665k721k353k877J355O342N262m915N20K750p06k117L214
6749B712k624L539m125L386J536p521l970l59M58M575j9K275Q904J0858J3010
6734C2635O301N165o421j7354j2226q591P96N482p665k40N331O914j923n942k157
6719A05j033J04J078l938j884L20M424J3337O193L182M695j1731p265J212K105
6704A0904q29m513l644J005l032r549l418L006k675Q0Q32R709J1068J926L228
6689A4098j023n627j393q75R40k201j906O01J129O878l202o981l446M281j65k804
$$ plain form
6795 5015 -700 -5535 -3460 3825 -210 -1391 2861 1524 -1681 2300 1195 352 5389 3586 -2398
6780 -2398 -3857 -2641 -4261 -456 617 1999 -1582 -6031 -366 -122 4113 2790 -1356 -738 -2968
6765 -2968 -1599 -3517 -2707 -1042 -3763 -6116 -8993 -7638 -1296 3966 -949 -429 2321 1615 -502 2712
6749 2712 88 3627 -498 2888 4424 -3097 -7067 -7426 -6968 -2393 -2412 -137 8767 19625 32635
6734 32635 38936 44101 37680 20326 8100 -491 305 5787 -1878 -2118 3213 10127 8204 2262 105
6719 105 -928 -824 254 -3684 -5568 -5248 -824 12513 18706 21888 26583 14852 7587 8799 10904
6704 10904 10075 5562 1918 2923 -109 -9658 -13076 -10070 -12745 -12665 -11833 -2124 8944 10870 14098
6689 14098 13075 7448 6055 5180 6120 3919 2013 2614 3743 10621 7419 438 -3008 1273 1108 -1696
6673a696j900o706L961K51n279n760J504N329M146J688O944K256m62M40l156k034
6657d74M245m93n601m08o042o299n566J205N012O726J354k537n52Q911J532j372
6641c59M80J281j430j922N02J387k130j539p32K96J261n00J914n32J738N271l133
6624A853O04k812j0215m507J3821N120K546k653M50j391l803k147k602Q794l076
6609a8p699l68Q974L440o126P996Q02q267m368P789N914o546n710j812j781L389
6593d391J558k330M34Q01n566j79J667N023M651k644o247N00K322J702q11o3j
6576c574J160j0242j150J895O444L834j18k15k135l906L395n8o50o026o493M727
6560a3112J3257J0840k245m259j078J203r161o15k530M561J0228J770r6p226l022
$$ plain form
6673 -1696 -3596 -10302 -6341 -6090 -11369 -17129 -15625 -10296 -6150 -4462 2482 4738 4276 4716 1560 -474
6657 -474 3771 3278 -2323 -2731 -8773 -15072 -20638 -19433 -14421 -7695 -6341 -8878 -9430 -519 1013 -359
6641 -359 121 1402 -28 -1950 -1448 -61 -2191 -3730 -4462 -4166 -2905 -3405 -1491 -2023 -285 4986 1853
6624 1853 2457 -355 -10570 -15077 -1256 3864 6410 3757 4207 2816 -987 -3134 -5736 3058 -18
6609 -18 -7717 -8085 889 4329 -1797 6199 7001 -1266 -5634 2155 8069 1523 -4187 -5999 -7780 -4391
6593 -4391 -2833 -5163 -4729 -3928 -9494 -9673 -8006 -2983 1668 -976 -7223 -6723 -4401 -2699 -3510 -3573 -3574
6576 -3574 -2414 -12656 -13806 -11911 -5467 -1633 -1751 -1966 -4101 -8007 -4612 -4670 -5320 -11346 -17839 -13112
6560 -13112 145 10985 8740 4481 3403 4606 -4555 -5170 -7700 -3139 7089 8859 8763 1537 -1485
6545a485n792l276j503q39J0312R377n402J860Qq949L005L749J160j731o75Q24
6529F43l033P46L565k773M309J158o820K491M673k389j913m164j152M844N646
6514E831M013j016m86M710j222j380m048o168j740r06O635K005n71o121K806L145
6498E487k795n552j231O308p779j646L27K595j509k63Q93m482l354P46J19N033
6482g103O260m407j989j622p426L977P30k213L602P072J097o287n179M441J103
6467g944L483R05j333J812m53r05l319L22K032O512O22j014n36M466n332K969
6451B287M018o492p448l52N394J431m164J243q767r788p99Q754K441n95k643k330
6435a7810N733Q830O303K468m172J341J553L032o653m694L757N360K317m84k001
$$ plain form
6545 -1485 -7277 -10553 -12056 -12895 -2583 6794 1392 3252 3260 -5689 -2684 1065 2225 494 -181 643
6529 643 -2390 -1644 1921 -852 3457 4615 -2205 286 4959 2570 657 -3507 -4659 185 5831
6514 5831 9844 8828 8342 13052 11830 10450 6402 234 -1506 -2412 4223 6228 5657 -464 2342 5487
6498 5487 2692 -2860 -4091 2217 -5562 -7208 -6881 -4286 -5795 -6058 -5165 -9647 -13001 -12255 -12136 -7103
6482 -7103 -843 -5250 -7239 -8861 -16287 -12310 -11580 -13793 -10191 -3119 -2022 -8309 -13488 -9047 -7944
6467 -7944 -4461 -3556 -4889 -3077 -3530 -4435 -7754 -7432 -5400 1112 1734 720 184 4650 -682 2287
6451 2287 6305 -187 -7635 -7987 -2593 -1162 -5326 -4083 -12850 -22638 -23437 -14683 -12242 -12837 -15480 -17810
6435 -17810 -12077 -3247 3056 5524 1352 2693 4246 7278 625 -4069 -312 5048 7365 6881 4880
6420D880k158K713L110L872J304j701J716l243l982q58j15q211J131M895n558
6405b205N32J630J807K004L681J85o251k970j425o010j330K411P879k11P92j009
6389d90l92j833j743K488J771l311O485l471r733n380O210P221R57m260N74L138
6373a769N617L166j718n559r593k206j527K495L475M467M57j4983k492P221l485
6358a6434L838K941J648k219L079J227m905M828l63O589m19M73K703K453j712
6343C727n80j225M18N471L62J189k201N048J70q830j0310M385l313p68R08j680
6327g229M44J853j198l785k384m718J735K357K466k543k17Q165K529l661K807
6312c379J501k942P80k468p526l386l147M444L748Q137M344r00M138o013n179
$$ plain form
6420 4880 2722 5435 8545 12417 13721 12020 13736 10493 6511 5653 5538 -2673 -1542 3353 -2205
6405 -2205 -1673 -43 1764 3768 7449 7634 1383 -1587 -3012 -9022 -10352 -7941 -62 -273 519 -490
6389 -490 -882 -2715 -4458 -1970 -199 -3510 2975 -496 -10229 -15609 -9399 -2178 -1221 -5481 -4907 -1769
6373 -1769 3848 7014 5296 -263 -9856 -12062 -13589 -11094 -7619 -3152 -2695 -17678 -20170 -12949 -16434
6358 -16434 -12596 -9655 -8007 -10226 -7147 -5920 -10825 -5997 -6360 229 -190 283 2986 5439 3727
6343 3727 3147 1922 2340 7811 8173 9362 7161 12209 12379 3549 -6761 -2376 -5689 -6457 -5549 -7229
6327 -7229 -6785 -4932 -6130 -9915 -12299 -17017 -15282 -12925 -10459 -13002 -13219 -5054 -2525 -6186 -3379
6312 -3379 -1878 -4820 -4040 -6508 -14034 -17420 -20567 -16123 -12375 -4238 106 -794 3344 -2669 -7848
6297g848K722r69M814q748j848l534O07J231m692N245O980o27K483K907j823m929
6281h029k585o321j959j370P404N656l59M189J550j740l528l79k637J416m537
6266a3229J759N347R182O461J21l418j674m466o052M918J0984m674n390l646L221
6251e56M88l803K205R00N31m305L5m515j942M522K594k717k316J091L844N282
6235A338L171q477l171N107K641n046o171K950Q74M419k87j299Q83r68L015j63
6219a184K198O7m608Q034l970n992m405L850L876J867p960Q70k790k557p06P78
6203a2632M836O85L277O63J53J376k183J97P02k764j011O039J035q066M091n82
6187d184p567L153L689O385M138k724l163P11N549q00n762n340k654m416K451
$$ plain form
6297 -7848 -5126 -6095 -1281 -10029 -11877 -15411 -14804 -13573 -18265 -13020 -6040 -6667 -4184 -1277 -3100 -8029
6281 -8029 -10614 -16935 -18894 -20264 -12860 -7204 -7563 -3374 -1824 -3564 -7092 -7471 -10108 -8692 -13229
6266 -13229 -11470 -6123 3059 9520 9641 6223 4549 83 -5969 -1051 9933 5259 -131 -3777 -556
6251 -556 -68 -3871 -1666 -766 -235 -4540 -4505 -9020 -10962 -6440 -3846 -6563 -8879 -7788 -3944 1338
6235 1338 4509 -3968 -7139 -2032 609 -4437 -10608 -7658 -6784 -2365 -2652 -3951 -3068 -4036 -1021 -1184
6219 -1184 1014 1081 -3527 4507 537 -5455 -9860 -6010 -2134 -267 -8227 -7357 -10147 -12704 -13410 -12632
6203 -12632 -7796 -7111 -3834 -3171 -3018 -1642 -3825 -3628 -2926 -5690 -6701 -662 373 -7693 -3602 -4184
6187 -4184 -11751 -8598 -4909 1476 5614 2890 -273 438 5987 5187 -575 -5915 -8569 -12985 -10534
6172a0534J1680K284n359l711J69J99M316M373k871l377R378M027k428o493n643
6157c990o22J683N031O433J043m266l841L378Q926j570o786o287n895j596K218
6142f141N827q128l252O066n815j897M34J1595O417j795j474l23l03M38J251P42
6126C642k936K142M057L996j412J514j191m880k286k464k460J05r59R60m281l55
6110f808J660P890R25p41o839n590J949j608k322K201M719L97m731l455K458M53
6094i442K673L23m574l118j387K040O476M222r20o513m339O405Q868l282k919
6079e487J947m707m810P59O567M45k730j129L064J705j2477n716J3802Q74L766
6064d127M286m044J614k244M507J716M044L150p02N77J621j305J654r72L070P31
$$ plain form
6172 -10534 1146 3430 -1929 -5640 -5471 -5272 -956 3417 546 -2831 6547 10574 8146 1653 -3990
6157 -3990 -4612 -2929 2102 8535 9578 5312 1471 4849 13775 12205 5419 -868 -6763 -8359 -6141
6142 -6141 -314 -8442 -11694 -5628 -11443 -13340 -12906 -1311 5106 3311 1837 1514 1211 1649 2900 3642
6126 3642 706 2848 6905 10901 9489 11003 9812 4932 2646 182 -2278 -2173 -3132 -2172 -6453 -6808
6110 -6808 -5148 2742 3667 2926 -3913 -9503 -7554 -9162 -11484 -9283 -4564 -4167 -8898 -12353 -9895 -9442
6094 -9442 -6769 -6446 -11020 -14138 -15525 -13485 -7009 -2787 -3707 -10220 -14559 -8154 714 -2568 -5487
6079 -5487 -3540 -8247 -13057 -12298 -5731 -5286 -8016 -9145 -6081 -4376 -16853 -22569 -8767 -7893 -4127
6064 -4127 159 -3885 -2271 -4515 -8 1708 5752 8902 8200 8777 10398 9093 10747 9775 12845 13576
6048A3576n860J710k958j095L107l707n564O83J031L7L349Q81o528n659k470l665
6032a3132K870L724K788j935J591J729j970L911k314n810m342K404j715L597m902
6017a3506L795M609L465l661j82l042k756K468q48J740K285m092K323O876j576
6002b102K472P106M963r63n256m326K521K564M94J010L575m092l312j100K723
5987F277L940k088r0m172J225K174K758j115k797o599m643l343j574k207J579
5972a0675O939l805j376K728N586J174m712k407P898M358j739K45J042n465m947
5957e156K851K956J244j987q148J704N112L056L415O20j462l676J736L069K396
5942G730J0062j497j653l966q513l931N48n929l267l330J296O020K893J270Q344
$$ plain form
6048 13576 7716 9426 6468 5373 8480 4773 -791 -108 923 960 4309 5190 -1338 -6997 -9467 -13132
6032 -13132 -10262 -6538 -3750 -5685 -4094 -2365 -4335 -424 -2738 -8548 -12890 -10486 -12201 -8604 -13506
6017 -13506 -9711 -5102 -1637 -5298 -5480 -8522 -11278 -8810 -9658 -7918 -5633 -9725 -7402 -526 -2102
6002 -2102 370 7476 12439 11476 6220 1894 4415 6979 7473 8483 12058 7966 4654 3554 6277
5987 6277 10217 8129 8039 3867 5092 7266 10024 8909 6112 -487 -5130 -8473 -10047 -12254 -10675
5972 -10675 -3736 -7541 -8917 -6189 -603 571 -4141 -6548 1350 5708 3969 4214 5256 -209 -5156
5957 -5156 -2305 651 1895 -92 -8240 -6536 -1424 1632 5047 5667 4205 529 2265 5334 7730
5942 7730 17792 16295 14642 10676 2163 -1768 -1220 -7149 -10416 -13746 -12450 -6430 -3537 -2267 6077
5927F077J671J130j052p19j971M679j475o885o492o577J71j692N092J1261P12
5912C930K637n086p806k1J984n790k46N074N892q02q003o040N673J879k648J69
5896i204M929N705P649J836l306q247k719P039l797M90R95j515M748L473J344
5881I420Q83m692o507j0597Q71M480J366k62N698O60l281l61j392P276K143J470
5865G175m360K392Q291K236o422j0036o264l322R40M872M888k373N500K543l935
5850B125l926n021p817L122N814k064q744N862M793K055K016L358m544o916N251
5835d636K576K177j429P379m872m264J945M4k898k699R874K556k916P414K795
5820A3046o600k947p043L099J965j650j292R069L283n420K579j852r470O898K991
$$ plain form
5927 6077 7748 8878 7826 7107 5136 9815 8340 1455 -5037 -11614 -11443 -13135 -8043 3218 3930
5912 3930 6567 1481 -6325 -6346 -4362 -10152 -10398 -5324 568 -234 -8237 -14277 -8604 -6725 -9373 -9204
5896 -9204 -4275 1430 9079 10915 7609 -638 -3357 3682 -115 375 1370 -145 4603 8076 9420
5881 9420 10303 5611 -896 -11493 -10622 -6142 -4776 -5038 660 1320 -1961 -2322 -3714 3562 5705 7175
5865 7175 2815 5207 13498 15734 9312 -724 -6988 -10310 -9370 -4498 390 -1983 3517 6060 2125
5850 2125 -1801 -6822 -14639 -11517 -5703 -7767 -16511 -10649 -5856 -3801 -1785 1573 -2971 -9887 -4636
5835 -4636 -2060 117 -1312 6067 1195 -3069 -1124 -1080 -3978 -6677 3197 5753 2837 10251 13046
5820 13046 6446 3499 -3544 -445 1520 -130 -1422 7647 10930 5510 8089 6237 -3233 3665 6656
5805F656L60R90m651l365N555j363j0319q77J488n677p50R53j07J086L059K104
5789d858m20N94m99J250n29k826M238L860L970K558k861J509m720m120N924J49
5773C219N57l15L088l079q179r19K054L438M45QR00l233R061j678r802k749J3055
5756E871K885p19n264m867L594M833k939k70Q62m479r244l253L388J788l211l435
5740a4460k120P689J0265K850j2j1441Q06J0151n289k815k52n217J190M78L365
5725d812q25l005R79N295j465l536n227j708N76P984M588o399m882J256L963J707
5709e511K031k832r411l240L415K226L722N008N483n66M474k04o786k619J921
5694b889j731J433m159q591J089N764J303K390j152k14L068J081l735L836K737
$$ plain form
5805 6656 7016 8006 3355 -10 5545 4182 -6137 -7014 -5526 -11203 -11953 -11000 -11107 -10021 -6962 -4858
5789 -4858 -5278 -4684 -5183 -3933 -4462 -7288 -3050 810 4780 7338 4477 5986 1266 -2854 3070 3219
5773 3219 3776 3461 6549 3470 -4709 -5628 -3574 -136 309 317 1217 -2016 7045 5367 -4435 -7184 5871
5756 5871 8756 8037 2773 -2094 1500 6333 3394 3124 3986 -493 -9737 -12990 -9602 -7814 -11025 -14460
5740 -14460 -16580 -8891 1374 4224 4212 -7229 -6423 3728 -1561 -4376 -4628 -9845 -8655 -8177 -4812
5725 -4812 -5637 -8642 -7663 -2368 -3833 -7369 -12596 -14304 -13728 -5744 -1156 -7555 -12437 -11181 -7218 -5511
5709 -5511 -3480 -6312 -15723 -18963 -15548 -13322 -9600 -4592 891 325 4799 4595 -2191 -4810 -2889
5694 -2889 -4620 -3187 -7346 -15937 -14848 -9084 -7781 -5391 -6543 -6757 -3689 -2608 -6343 -2507 230
5679B30p66K798N31J20l924n686o57J0287o00N08n48m574j5576M37L636r5M058
5662i821n20J02m754M80L064k308m531o32Q817N844J576J392M66K109l254k173
5646d143K414L937j491l386n778j504J58j164N571M606K813K185J031n719m001
5631d471M108L000n631l509L206M47j886M669J648J631L033m702p586j530k857
5616a0430q34L840Q0j792K042K109o274L744M962N292m223n050K519K038m675
5601f652l612M252J42J048r44K506l267n745J312N691J677m126M011L563M418
5586D274N543l867q89L221k258m328n436k602J475M872L373K744j113k620m87
5571A902l17M759l107j0250J465J0774J388M61j438q53o255o662m648K540Q147
$$ plain form
5679 230 -536 2262 2793 2913 -1011 -6697 -7354 2933 2333 2841 2293 -2281 -17857 -17420 -13784 -13879 -9821
5662 -9821 -10341 -10239 -14993 -14513 -11449 -13757 -18288 -18920 -10103 -4259 -2683 -1291 -825 1284 -1970 -4143
5646 -4143 -1729 2208 717 -2669 -8447 -9951 -9793 -10957 -5386 -780 2033 4218 5249 -470 -4471
5631 -4471 -363 2637 -2994 -6503 -3297 -2850 -4736 -67 1581 3212 6245 1543 -6043 -7573 -10430
5616 -10430 -11264 -7424 -7344 -9136 -7094 -4985 -11259 -7515 -2553 2739 -1484 -6534 -4015 -1977 -6652
5601 -6652 -10264 -6012 -5870 -4822 -5766 -3260 -6527 -12272 -10960 -5269 -3592 -7718 -3707 -144 4274
5586 4274 9817 5950 5061 8282 6024 1696 -3740 -6342 -4867 5 3378 6122 5009 2389 1902
5571 1902 1585 6344 3237 -7013 -5548 5226 6614 7075 5637 4784 -1471 -8133 -12781 -10241 -2094
5556b094j191l412L868N280k844R00l595j785k506J569Rm735Q99j483K573M046
5540d501N586k926j397j906n69K212j126l80M58j734J2212M233r091k801K473
5525G43j534J438N165K552K088o343j184k765K986N942n312q402j547M503k343
5510d013O58L085J504R78r551K916J0665K396j87o691m264o395l213O863L294
5495a955k234j715M816N072K65L168n53J063l617o667p807J315N663O359k528
5480F45J431j730l234l393M598J256l263j0220n340J381L59M103P663R74l176
5465g946j247P484M777m675K591k497j98K74K501J273K77O63M019j853o261j418
5449b236k8m357Q318j831j645r88l977n474l915k547n219P585P825j293j450L251
$$ plain form
5556 -2094 -3285 -6697 -2829 2451 -393 507 -3088 -4873 -7379 -5810 -5801 -10536 -9637 -11120 -8547 -4501
5540 -4501 1085 -1841 -3238 -5144 -5713 -3501 -4627 -5007 -4549 -6283 5929 10162 1071 -1730 743
5525 743 -791 647 5812 8364 10452 4109 2925 160 3146 9088 3776 -4626 -6173 -1670 -4013
5510 -4013 -3355 -270 1234 2212 -7339 -4423 6242 8638 8451 1760 -2504 -8899 -12112 -5249 -1955
5495 -1955 -4189 -5904 -1088 3984 4249 7417 6864 7927 4310 -2357 -10164 -8849 -3186 3173 645
5480 645 2076 346 -2888 -6281 -1683 -427 -3690 -13910 -19250 -17869 -17510 -13407 -5744 -4770 -7946
5465 -7946 -9193 -1709 3068 -1607 984 -1513 -1711 -1437 1064 2337 2614 3277 7296 5443 -818 -2236
5449 -2236 -2264 -6621 1697 -134 -1779 -2767 -6744 -12218 -16133 -18680 -23899 -16314 -8489 -9782 -11232 -7981
5433g981M568J276l038K441j135n810N909j677p021M570J85r7Q73J482J103j351
5417e703k543p46l18Q7K577P814J0778l815m259j836m952m025l79m679P10R86
5401a0303l535l923k759J1339O509K360M78L170k002O95n385K252J2420P03l244
5386H775J6J61J415q270n426K459M063j431J584j894l6J348l423l823J571J737
5370a174O246j590n412n580l624N61m701m441L048J0333J520j14p47j596n49j372
5354i192p419j310J0447J350r06J670O961K002r09r753k614k20Q612J38R87R2
5338f4K542J51j915p353r876k45O319L148o59L710L840J383J666j964p391K054
5322d654L721j430p780k248Q625M270P3M817n948n49M857M92J586J76q454k445
$$ plain form
5433 -7981 -3413 -2137 -5175 -2734 -3869 -9679 -3770 -5447 -12468 -7898 -7713 -7810 -6937 -5455 -4352 -5703
5417 -5703 -8246 -8992 -9310 -9223 -6646 1168 11946 8131 3872 2036 -2916 -6941 -7320 -11999 -11289 -10303
5401 -10303 -13838 -17761 -20520 -9181 -2672 -312 166 3336 1334 2029 -3356 -1104 11316 12019 8775
5386 8775 8791 8952 10367 2097 -3329 -870 3193 1762 3346 1452 1416 2764 -659 -4482 -2911 -1174
5370 -1174 5072 3482 -1930 -7510 -11134 -10573 -15274 -19715 -16667 -6334 -4814 -4928 -5675 -7271 -7820 -9192
5354 -9192 -16611 -17921 -7474 -6124 -7030 -5360 1601 3603 2694 -7059 -9673 -9893 -1281 -1143 -156 -64
5338 -64 2478 2629 714 -6639 -16515 -16760 -10441 -7293 -7952 -4242 -402 981 2647 683 -6708 -4654
5322 -4654 -933 -2363 -10143 -12391 -3766 504 577 5394 -554 -1103 3754 4246 5832 6008 -2446 -4891
5306d891j83J991l756l813M803O433P048j371l644L316K810o762j0093L012P738
5291B638M273J514q319n729n495K100L132j878j82J715J998n049N992O76J61L71
5275b082J182J740j197o200l30O000N806j052L299o773m1K34K666J293n360m624
5259e439M458L243K076M91k573p920n205j226K779k341L721N810l720j162L753
5244c255N316o676l02K288K013J224o38n481n803M04O485j3J819k130j786K904
5228c631M472L754m383o786k54L753O052J192o2k366k903Q28m291k163l968J790
5212h966P061r68k918O027j053p438o100m777N145q68j147K215N625L925M064
5197a73m822M726j124m094N433K158K64l583k65k588M980J121k812q569l673J260
$$ plain form
5306 -4891 -5074 -3083 -6839 -10652 -5849 584 7632 6261 2617 5933 8743 1981 -8112 -5100 2638
5291 2638 6911 8425 106 -5623 -11118 -9018 -5886 -7764 -7946 -6231 -4233 -9282 -3290 -2614 -2453 -2082
5275 -2082 -900 840 -357 -6557 -6887 -887 4919 3867 7166 393 352 586 3252 4545 -815 -5439
5259 -5439 -981 2262 4338 4829 2256 -5664 -10869 -12095 -9316 -11657 -7936 -2126 -5846 -7008 -3255
5244 -3255 2061 -4615 -4917 -2629 -616 608 -30 -5511 -11314 -10910 -4425 -4438 -2619 -4749 -6535 -3631
5228 -3631 841 4595 212 -6574 -6828 -3075 2977 4169 4107 1741 -1162 -334 -4625 -6788 -10756 -8966
5212 -8966 -1905 -2873 -5791 236 -817 -8255 -14355 -19132 -13987 -14855 -16002 -13787 -8162 -4237 -173
5197 -173 -4995 -269 -1393 -5487 -54 2104 2368 -1215 -1480 -4068 912 2033 -779 -9348 -13021 -11761
5181a1761L432J802M0N821P782k129q562k242j25l342K291J742K677K756M33j364
5165g49q14K258l328L679Q137K718o601p390p656M976L675n225p5L76K603P00
5149b716k010K058O696k77q560o46L476Q25o89j217k070P39k015J947O59m209
5133h009J659J517K589L98k769J371J84J268l521M7O670J1719q767j4433o075
5118a6152L974J3086M530j141j491k892K144M835q354q046k048K538J648m168
5104a1537m567J356K272K012j777L982L822L967J488k496K760l320l908j899L146
5089d699J393r40k595J431L986j020l013m046n712Q525O130l06r963k873L689
5074a0013j114M149J588M940R979o830j0173J344m916l25M801j09k963M035L248
$$ plain form
5181 -11761 -8329 -6527 -6487 -666 7116 4987 -3575 -5817 -5942 -9284 -6993 -5251 -2574 182 615 -749
5165 -749 -1563 695 -2633 1046 9183 11901 5300 -2090 -9746 -4770 -1095 -6320 -6395 -6019 -3416 -2716
5149 -2716 -4726 -2668 4028 3751 -4809 -5455 -1979 -1154 -1843 -3060 -5130 -4391 -6406 -4459 -3800 -8009
5133 -8009 -6350 -4833 -2244 -1846 -4615 -3244 -3060 -1792 -5313 -5266 1404 13123 4356 -10077 -16152
5118 -16152 -12178 908 5438 4297 2806 -86 2058 6893 -1461 -9507 -11555 -9017 -7369 -11537
5104 -11537 -16104 -14748 -12476 -10464 -12241 -8259 -4437 -470 1018 -1478 1282 -2038 -5946 -7845 -4699
5089 -4699 -3306 -4246 -6841 -5410 -1424 -2444 -5457 -9503 -15215 -6690 -560 -866 -10829 -13702 -10013
5074 -10013 -11127 -6978 -5390 -450 9529 2699 -7474 -6130 -11046 -11371 -6570 -6679 -9642 -5607 -2359
5059b359j128K858K210l41L175K388j328j366n310m849j970l786N943O49m537
5044i751N13M015R84j208J127K484O57p664m308M383R026N787j154n125l424J882
5028a776k48m068k432M328M647M599K750l183j98Q6m125j131K590Q23m04l37J3
5011A934Q255M713p368q517K273k039N226J371p157n85N728O342K774K696l223
4996A2423J47q660m927n44J483L764o812j746K295j624m890n596J478J1009K892
4981F92O052O77q747n594L839O807K85j864O769P039l901o70m268o695J416Q4
4965A921k209k321n258j053R608O222j26m562J350m705Q2k729L769m09j56r03
4949a479m439Q92L471N248K73q43l402l275M376P68p74j649n78O1J266J541l446
$$ plain form
5059 -2359 -3487 -629 1581 1240 4415 6803 5475 4109 -1201 -6050 -8020 -11806 -5863 -5214 -9751
5044 -9751 -9238 -5223 -4239 -5447 -4320 -1836 -1179 -8843 -13151 -8768 258 6045 4891 -234 -3658 -1776
5028 -1776 -2024 -6092 -8524 -4196 451 5050 7800 4617 4419 4505 380 -751 1839 2662 2258 1921 1934
5011 1934 10189 14902 7534 -983 1290 -749 4477 5848 -1309 -1894 3834 10176 12950 15646 12423
4996 12423 12570 3910 -1017 -1561 -78 3686 -3126 -4872 -2577 -4201 -9091 -14687 -13209 -2200 692
4981 692 6744 7421 -1326 -6920 -3081 3726 4011 2147 8916 15955 12054 11384 7116 421 1837 1921
4965 1921 -288 -2609 -7867 -8920 688 6910 6784 2222 3572 -1133 -1051 -3780 -11 -420 -576 -1479
4949 -1479 -5918 -5026 -1555 3693 3966 3123 -279 -3554 822 1590 816 -833 -1411 -1350 -84 1457 -1989
4932a989M075M190j45o005p685M030n74L641J039k868r199m617N247N439K270
4917c151m25l247o673j809O943j853K691j339P103Q219K558m17l350l755k0k465
4901i90J101K674K972K771M433n490j409j544l495J704L329O34m453j097k896
4886a756p320q62m102j517J255M052N490l251j671o42p12K281M790l531o48K47
4870g897K951N692o26q65K444j241l515K611k669J918l793k021q01O345J0797
4855I330O64j0258k037L552j282L632l720l754j608L9k938q758L21Q225k869L918
4839g543J434l072j269L965j913r00M133o797l597L169O390M513K218O89M503
4824E923o219O07q74O87L009L162O375j421m914K11j728Q46r62o675p85o809k973
$$ plain form
4932 -1989 2086 6276 6131 126 -7559 -3529 -4103 -462 577 -2291 -11490 -16107 -10860 -5421 -3151
4917 -3151 -3576 -6823 -13496 -15305 -8362 -10215 -7524 -8863 -1760 6459 9017 8600 5250 1495 1475 -990
4901 -990 111 2785 5757 8528 12961 7471 6062 4518 1023 2727 6056 6690 2237 1140 -1756
4886 -1756 -9076 -9938 -14040 -15557 -14302 -10250 -4760 -8011 -9682 -10324 -11036 -8755 -3965 -7496 -8144 -7897
4870 -7897 -4946 746 120 -745 1699 458 -3057 -446 -3115 -1197 -4990 -7011 -7812 -1467 9330
4855 9330 9994 -264 -2301 1251 -31 3601 -119 -3873 -5481 -5442 -8380 -17138 -16817 -8592 -11461 -7543
4839 -7543 -6109 -9181 -10450 -6485 -8398 -9298 -5165 -11962 -15559 -12390 -6000 -1487 731 1420 5923
4824 5923 -296 311 -563 124 3133 6295 12670 11249 6335 6546 4818 5664 4702 -1973 -2758 -9567 -12540
4807a2540M654M483n429M001L35M600q536J972M657k23N471k775M10K196L656
4792F932j2j534n907P731Q814k473L733m998p470K911K117p398p224n665N892
4777d551J349n105k761R651J844J340n47j163k665k197M609l200o136k434J117
4762a0849j479L435J117r5j163k089P673M717j693j490l148l468j430N540J94
4747d228K952p512o10Q147P415N351J561p909k640q662o855K354M196r59O342
4732a057M596Q41l626l393p95K515J777l378L522J84n382l716j612L793M284M080
4716B633Q507K72m864k399m162l290m806k236K212L097n031K816j898J550j545
4701i144J88J348R366J972M536l470p187k408J111j835J456j161N446M498l08
$$ plain form
4807 -12540 -7886 -3403 -8832 -4831 -4496 104 -8432 -6460 -1803 -2026 3445 670 1080 3276 6932
4792 6932 6920 5386 -521 7210 16024 13551 17284 12286 4816 7727 9844 2446 -4778 -10443 -4551
4777 -4551 -3202 -8307 -11068 -1417 427 1767 1220 57 -2608 -4805 -196 -3396 -9532 -11966 -10849
4762 -10849 -12328 -8893 -7776 -7871 -9034 -11123 -3450 1267 -426 -1916 -5064 -8532 -9962 -4422 -4228
4747 -4228 -1276 -8788 -9398 -1251 6164 11515 13076 5167 2527 -6135 -12990 -10636 -6440 -7399 -1057
4732 -1057 3539 4380 754 -2639 -3434 -919 858 -2520 1002 1186 -4196 -7912 -9524 -5731 -1447 2633
4716 2633 11140 11412 6548 4149 -13 -3303 -8109 -10345 -8133 -5036 -10067 -7251 -9149 -7599 -9144
4701 -9144 -8956 -7608 1758 3730 8266 4796 -2391 -4799 -3688 -5523 -4067 -5228 218 4716 4408
4686D408o581j904N07L707P844R41m068p29K494k803k901o697j825L966O634Q149
4670A1142l185o786n429j151L080L310Q002p045o101R39M979Q88M631J845l917
4655E202l50r84m882m3K864k974m773o50M698P318K81p705J373J347M916K643
4639H281l119k241K327K199r836M84M51J55L805o94q88R91K497L516j472p645
4623a189K188k340k222P686k451r382J545O181n765L843L638l3l581o427J972
4608f337M658l425N369L089M665n97j293k162J185J255k903k699K117J758l263
4593A417m914J288K453k781m70l052n352O08Q797K865m909m124M169R81k91K467
4577h48K89K159K17l843o530j330l917j837Q77R734J1544O15k900p470o009k665
$$ plain form
4686 4408 -2173 -4077 -3570 137 7981 8922 4854 4125 6619 3816 915 -5782 -7607 -3641 2993 11142
4670 11142 7957 1171 -4258 -5409 -2329 981 8983 1938 -4163 -3224 1755 2643 7274 9119 5202
4655 5202 4852 3868 -1014 -1057 1807 -1167 -5940 -6590 -1892 5426 5707 -1998 -625 722 5638 8281
4639 8281 5162 2921 5248 7447 -2389 -1905 -1454 -1299 2506 1812 924 1915 4412 7928 6456 -1189
4623 -1189 999 -1341 -3563 4123 1672 -7710 -6165 16 -5749 -1906 1732 1699 -1882 -8309 -6337
4608 -6337 -1679 -5104 265 3354 8019 7422 6129 3967 5152 6407 3504 805 2922 4680 1417
4593 1417 -3497 -2209 244 -2537 -3007 -6059 -11411 -10803 -2006 859 -4050 -8174 -4005 -3024 -3315 -848
4577 -848 -559 1600 1817 -2026 -8556 -9886 -13803 -15640 -14763 -5029 6515 7130 4230 -3240 -9249 -11914
4561a1914O712M937m729l775K487N09n617O105N357J194M87k516l381k44l314
4546g702N207o96o473j633M177M56N670k955l962K388K412L213Q04k240j929J850
4530a413M967k379n423J467n907K69Q570N91n355N051M23R518M43p462o119J336
4514a423K053M242M14m848o24K96j581p48L457n675k369L947M235M097j008k522
4498A943L733K2N35n817m260K806L057k773n321k294L742R19l269j462R36R364
4482A861m840k818M297O55K11l813K653K167k860J087J696j907Q117J889L120
4467A1515o223p542m476O665Q557K248o163o921J483M64m632J969N431o456j0401
4452a4482k379P333O798J999n240K910K293r92k297p958k599Q00N409J295K890
$$ plain form
4561 -11914 -5202 -265 -4994 -8769 -6282 -5773 -11390 -5285 72 1266 1753 -763 -4144 -4388 -7702
4546 -7702 -2495 -3191 -9664 -11297 -7120 -6664 -994 -3949 -7911 -5523 -3111 102 906 -1334 -3263 -1413
4530 -1413 3554 1175 -4248 -2781 -8688 -8419 151 742 -4613 438 861 10379 10822 3360 -2759 -1423
4514 -1423 630 4872 5286 438 -186 110 -1471 -2219 1238 -4437 -6806 -2859 1376 5473 4465 1943
4498 1943 5676 5698 6233 416 -3844 -1038 2019 -754 -6075 -8369 -4627 -3708 -6977 -8439 -7503 1861
4482 1861 -2979 -5797 -1500 -845 -634 -4447 -1794 373 -2487 -1400 296 -1611 6506 8395 11515
4467 11515 5292 -2250 -6726 -61 8496 10744 4581 -2340 -857 -393 -5025 -3056 2375 -4081 -14482
4452 -14482 -16861 -9528 -2730 -731 -5971 -3061 -768 -1760 -4057 -12015 -14614 -13814 -8405 -7110 -4220
4437d220K55J618J832M59L45m372q99k470j59K651N63J679K507k520L87J502m245
4420e087k376l411k999J034j176M368R755K202m869j718n453p131L255M007J0382
4405G83J0302M607p384r791j2699p554M057M406O796N17l000m373N306M186J308
4390b533J084K026n119r729k386O607P528m088l193K822L368L565r670l908p01
4375a4327q39N050R608R89J756J61l236L869L843m576R2j394j921J198k419J825
4359c21J86J04J357L555J276p021k087l9l814M083J938J644N345r7J611k306j904
4342C510J770M870n878n114k335j1943n03O335O014K39J30k306K999P327k182
4327B933j263j252p453N761O39J064k015J453J287q180O7K128L467L2r57q842
$$ plain form
4437 -4220 -3965 -2347 -515 -56 289 -4083 -4982 -7452 -7611 -4960 -4397 -2718 -211 -2731 -2344 -842 -5087
4420 -5087 -7463 -10874 -13873 -12839 -14015 -9647 108 2310 -2559 -4277 -9730 -16861 -13606 -9599 783
4405 783 11085 15692 8308 -1483 -14182 -21736 -17679 -13273 -6477 -5960 -8960 -13333 -8027 -3841 -2533
4390 -2533 -1449 577 -4542 -14271 -16657 -10050 -2522 -6610 -9803 -6981 -3613 -48 -9718 -13626 -14327
4375 -14327 -15166 -10116 -508 481 2237 2398 -838 3031 6874 2298 2390 996 -925 273 -2146 -321
4359 -321 -135 -31 1326 4881 6157 -864 -2951 -2990 -6804 -2721 -783 861 6206 6109 7720 5414 3510
4342 3510 5280 10150 4272 -842 -3177 -15120 -15623 -9288 -3274 -3035 -2905 -5211 -2212 5115 2933
4327 2933 1670 418 -7035 -1274 -635 429 -1586 -133 1154 -7026 -6959 -4831 -1364 -1332 -2289 -11131
4311a1131p182O608M989n612J612l057k417P495L338k70l70J636N856L602O562
4296A1659j1616r764k590J543p23J302N868L487M967j625k610j901K879j925K3
4281a026J869N175k480o722j540R788l86l646j584m746K632l545l157N381j452
4266e439J374Q059j034j752j320n120n750L124Q143M492L062m742k913M223m925
4251e18k722k531k997R868N306k337j930o24K731j149l194r243k326L269J328
4236g069K726p5j330M538K262p701j0397J232Q226M85M060N669L318J834m96l181
4220D101n436J155O185l001o224L963K73p6K325k438n1J450l43n820K664K246
4204I73j078j325j621m761k664M954O52m097L931o143n88J630M471j20K547j176
$$ plain form
4311 -11131 -18313 -11705 -6716 -12328 -10716 -13773 -16190 -8695 -5357 -5627 -5997 -4361 1495 5097 11659
4296 11659 43 -9721 -12311 -10768 -11491 -10189 -4321 -834 4133 2508 -102 -2003 876 -1049 -1026
4281 -1026 843 6018 3538 -3184 -4724 5064 4678 1032 -552 -5298 -2666 -6211 -9368 -3987 -5439
4266 -5439 -4065 3994 2960 1208 -112 -5232 -10982 -7858 285 4777 7839 3097 184 4407 -518
4251 -518 -3240 -5771 -8768 1100 6406 4069 2139 1515 4246 3097 -97 -9340 -11666 -8397 -7069
4236 -7069 -4343 -4418 -5748 -1210 1052 -6649 -17046 -15814 -7588 -7103 -3043 2626 5944 7778 7282 4101
4220 4101 -1335 -180 6005 3004 -3220 743 1016 940 3265 827 776 2226 1883 -3937 -1273 973
4204 973 -105 -1430 -3051 -7812 -10476 -5522 -4870 -8967 -5036 -11179 -11767 -10137 -5666 -5786 -3239 -4415
4188d415L138k703k285J788J168k850k789K169J532K553n611n733m093K598J411
4173a4122M960K732O734P71o411l82L996r0l769j460K709P030K348k292n983j859
4157e088k492r829n575o81O090L320J3571O669l451K638K02o354k144k745m379
4142a0248K11N854K865k380J84l34j985j079L687N945k921k426l603N897J476
4127A143p939j232K600L695N02j477l795m690N11k142O480N664J753r77n093m535
4111i532j690j317P754K385j423M722Q481L722r827o868m588M385M25N036l8r08
4095G19n52J053M980J521j1251j686k652k12J17L819j250N0M56K105K362J421
4079A000J602M64k025Q34L086J847p09n904J170N52L922k482l437O722L685J900
$$ plain form
4188 -4415 -1277 -3980 -6265 -4477 -3309 -6159 -8948 -6779 -5247 -2694 -8305 -14038 -18131 -15533 -14122
4173 -14122 -9162 -6430 304 1075 -5336 -5718 -1722 -1812 -5581 -7041 -4332 2698 5046 2754 -3229 -5088
4157 -5088 -7580 -17409 -22984 -23665 -17575 -14255 -684 5985 2534 5172 5374 -980 -3124 -5869 -10248
4142 -10248 -10037 -4183 -1318 -3698 -3514 -3848 -5833 -6912 -3225 2720 -201 -2627 -6230 -333 1143
4127 1143 -6796 -8028 -5428 -1733 -1231 -2708 -6503 -11193 -10682 -12824 -6344 -680 1073 96 -4997 -9532
4111 -9532 -11222 -12539 -4785 -2400 -3823 899 9380 13102 3275 -3593 -8181 -3796 -3371 1665 1627 719
4095 719 167 1220 6200 7721 -3530 -5216 -7868 -8080 -7963 -4144 -5394 -5344 -4888 -2783 -421 1000
4079 1000 2602 3066 1041 1875 4961 6808 6099 195 1365 1917 5839 3357 -80 6642 10327 12227
4063A2227l217Q759l997j3386k242O8n24n68m737L595k227l553L621k869k663
4048a1713Q661P963M331m100l765k295j559o09k049N126M256j473J965J765N797
4033A2301r677j2821j271M281l476J001L478j960Q63N413j16l751k65P032P82
4018A814l410l27N044j709l679j131P139n709K46n536P041M499K060J895q77k800
4002D560J2k544j863m647m807P029Q427k19o632k519k751j071L107k703k253K335
3986f539N519K75L880l797l711L668J491J897N053M921k932k614n843J146L022
3971E436j104l06K521n210J692J0188K117m894p375o629m21k952j241K526K729
3956b923K892k961J132R314l533o448K478P782O031m324o228k909r89j1171o137
$$ plain form
4063 12227 9010 17769 13772 386 -1856 -1788 -2312 -2880 -7617 -4022 -6249 -9802 -6181 -9050 -11713
4048 -11713 -3052 4911 9242 5142 1377 -918 -2477 -3086 -5135 -9 4247 2774 4739 6504 12301
4033 12301 2624 -10197 -11468 -7187 -10663 -9662 -6184 -8144 -7281 -1868 -1984 -5735 -6000 1032 1814
4018 1814 -1596 -1923 3121 1412 -2267 -3398 3741 -1968 -1722 -7258 -217 4282 6342 8237 7360 4560
4002 4560 4572 2028 165 -4482 -9289 -2260 6167 5948 -684 -3203 -5954 -7025 -3918 -6621 -8874 -6539
3986 -6539 -1020 -745 3135 -662 -4373 -705 786 2683 7736 12657 9725 7111 1268 2414 5436
3971 5436 4332 4026 6547 1337 3029 13217 15334 10440 3065 -3564 -3985 -6937 -8178 -5652 -2923
3956 -2923 -31 -2992 -1860 7454 3921 -2527 -49 7733 13764 9440 3212 303 -686 -11857 -17994
3941a7994p33Q942N377N847r01K49p664K345k534o454K009J089J520J737L188
3926c977k353L223K147K231L495k044L45J840o29n141j749l815k959P250N539
3911C403P1K840p943n426K204L751j923o833p086N616J405q173j921L624J962
3896a4429L690L309P403P008N93r569l341M69K100k919o38o56Q37K561k823k103
3880h508M173k543M624P516J363j018j380j000k813N376o075m550R809K206K775
3865I955o207q652l634l470N801P589M366K16l042M48p28J094j570o413m33K747
3849a933l199l356J1200r74j188K118m721r221P229K234O361m852q545j040L412
3834f475N020O12l224l552j155K85j0221j510J4439K706j089j936O802O034p442
$$ plain form
3941 -17994 -18727 -9785 -4408 1439 538 787 -6877 -4532 -7066 -13520 -11511 -10422 -8902 -7165 -3977
3926 -3977 -6330 -3107 -960 1271 4766 2722 3067 4907 4278 -863 -2612 -6427 -9386 -2136 3403
3911 3403 3474 6314 -1629 -7055 -4851 -1100 -3023 -9856 -16942 -11326 -9921 -18094 -20015 -16391 -14429
3896 -14429 -10739 -7430 -27 6981 7574 -1995 -5336 -4867 -2767 -5686 -6324 -6980 -6143 -3582 -6405 -8508
3880 -8508 -4335 -6878 -2254 5262 6625 5607 4227 3227 414 5790 -285 -4835 4974 7180 9955
3865 9955 3748 -4904 -8538 -12008 -6207 1382 5748 5964 2922 3370 2642 3736 2166 -4247 -4680 -1933
3849 -1933 -5132 -8488 2712 1738 550 2668 -2053 -11274 -4045 -1811 4550 -302 -8847 -9887 -6475
3834 -6475 -1455 -843 -4067 -7619 -8774 -8489 -18710 -20220 -5781 -3075 -4164 -6100 702 6736 -706
3819g06q815l489M039Q112P306M380j705J285p917r912j091M058K99M727L823
3804D394J291m026m888k3M382P156q62m861J428O091o278q055j346K611N65r90
3788c411o153J688N296k330K319J235q80P954L166r86k436Q31k31l875p650l90
3772e853J792R50o66m776j685m290P012N682R903K248p68M527l054o948m485l035
3756c446l276l885N074K595K978j305J06J730Q311M852k685j0892k016L264P74
3741B179m738M762J003n461J213J860J710M954J754J81L959j982p700K272K817
3726H783m787r495n761K589J39O08N812j57L601n600o375N56O46L730m19N315
3710h15K016L338NJ843N618o03L78J035j280l500j129K243p08p461m988M790N687
$$ plain form
3819 -706 -9521 -13010 -8971 -859 6447 10827 9122 10407 2490 -7422 -8513 -4455 -4156 571 4394
3804 4394 5685 1659 -3229 -3252 1130 8286 7424 2563 3991 10082 3804 -4251 -5597 -2986 -2421 -3411
3788 -3411 -9564 -7876 -2580 -4910 -2591 -1356 -2236 5718 8884 7898 5462 6293 6062 2187 -5463 -5853
3772 -5853 -4061 -3111 -3777 -8553 -10238 -14528 -7516 -1834 8069 10317 9549 14076 11022 4074 -411 -3446
3756 -3446 -6722 -10607 -5533 -2938 40 -1265 -1159 571 8882 13734 11049 157 -1859 1405 2179
3741 2179 -2559 2203 3206 -2255 -1042 818 2528 7482 9236 9417 13376 11394 3694 5966 8783
3726 8783 3996 -5499 -11260 -8671 -8532 -7924 -2112 -2269 1332 -4268 -10643 -10087 -9441 -5711 -6130 -815
3710 -815 1201 4539 4544 6387 12005 11402 11780 12815 11535 8035 6906 9149 8441 980 -4008 782 6469
3693F469l987j094N78O332M911k806q742j782M219k328l774o197q60L035O37o32
3677f021j138Q47j700j828J26k055M367P060J614k999L175k348l668j721p587
3662a3876j905N839J677M696K452n369m211L216L245j277k331J033q93J709J543
3647d452l588k514M89O11K142L199NN084R631j969l954l186k038J531o761P40
3631e030L657P89j823m707O542j839n650N679K929k907P66M376Q088k618q853
3616f01m846m980O80O605j357j108m727K615L656N235q49p75l852O705J144M07
3600C952P698N852K951q791k009l802k720j0035k499j740P14k42K44N49k071K862
3584i087R107K273o836n629O548Q862L948k923O44r9j264n036M886k931p877n138
$$ plain form
3693 6469 2482 1388 1966 8298 13209 10403 1661 -121 4098 1770 -2004 -8201 -9061 -6026 -5389 -6021
3677 -6021 -7159 -6312 -8012 -9840 -9714 -11769 -7402 -342 1272 -1727 1448 -900 -4568 -6289 -13876
3662 -13876 -15781 -9942 -8265 -3569 -1117 -6486 -10697 -7481 -4236 -5513 -7844 -6811 -7704 -5995 -4452
3647 -4452 -8040 -10554 -10065 -9454 -7312 -4113 -4108 976 10607 8638 4684 1498 -540 991 -5770 -5030
3631 -5030 -1373 -584 -2407 -7114 -572 -2411 -8061 -2382 547 -2360 -1594 2782 10870 8252 -601
3616 -601 -5447 -10427 -9747 -3142 -4499 -5607 -10334 -7719 -4063 1172 323 -452 -4304 2401 3545 3952
3600 3952 11650 17502 20453 11662 9653 5851 3131 -6904 -9403 -11143 -10429 -10671 -10427 -9878 -11949 -9087
3584 -9087 20 2293 -4543 -10172 -3624 5238 9186 6263 6907 6808 5544 508 5394 2463 -5414 -10552
3568a0552Q453L629L76J0J284M381k326O99L288n990o30M379o680n853M867O618
3552E953L706j716p675k242j268o781K118O713L444j38q95n854k859k767K175
3537h086M86J08Q69K581Q90L578O81l32O37K108J941K672l036j0041O041Q34j369
3520E62p82M24Q15o761o795L612P238l622j135l051L010J851Q592M348k416j784
3504D106M483k250q691Q68l917j0332M827P406q25J55O705K73j450L607k705p133
3488d873r042j8R437J078r91M69L411L915l693O70j077j034N727l667k623L718
3472A407j227n587PL485q953k193M636N400K721M78m023L818M724N36q663k37
3456c671l803M010M165k728J835N884L787o943j0938l449o069L361O377k68j892
$$ plain form
3568 -10552 -2099 1530 1906 1916 3200 7581 5255 5954 9242 3252 2622 7001 321 -5532 -665 5953
3552 5953 9659 7943 268 -1974 -3242 -10023 -7905 -1192 2252 2114 1219 -4635 -7494 -10261 -8086
3537 -8086 -7600 -7492 -6623 -4042 -3152 426 1107 775 1412 3520 5461 8133 5097 -4944 1097 1931 562
3520 562 -220 204 1019 -5742 -12537 -8925 -1687 -5309 -6444 -9495 -6485 -4634 3958 8306 5890 4106
3504 4106 8589 6339 -2352 -1484 -5401 -15733 -10906 -3500 -4325 -4170 2535 2808 1358 4965 2260 -4873
3488 -4873 -13915 -13933 -4496 -3418 -4409 -3940 -529 3386 -307 363 -714 -1748 3979 312 -2311 1407
3472 1407 180 -5407 -5400 -1915 -10868 -13061 -8425 -3025 -304 174 -3849 -31 4693 5229 -3434 -3671
3456 -3671 -7474 -3464 701 -2027 -192 5692 9479 2536 -8402 -11851 -17920 -14559 -8182 -8450 -10342
3441a0342M232N520M012k47m56m757J395O171l598m655O3J470n634M07l92m24
3425g235N670O034L289L602J048K18m730o524l848j743K395N925L778k756m678
3410D45p536j773q58L787J2144K271j848m571m751l370O549K191J949L958l029
3395E558k419L949K919k019l048O36K596k20o137q08K931M943m21o268J832j698
3379B326l426r19L696m139m353P26N010M971j287k322m126R67N487M139m682k086
3363a8l304J052M203K27m94K286K947L967n422q740l753O267M332m780J828K671
3347C269j276M276R71k324o122l17M003k517Q90O064l43o107j779P27K889J543
3331C847L893N870m133p804k22J75p86j32M725J639l282M58j584n64m508m671
$$ plain form
3441 -10342 -6110 -590 3422 3175 2719 -2038 -643 5528 1930 -2725 -2662 -1192 -6826 -6419 -6811 -7235
3425 -7235 -1565 4469 7758 11360 12408 12626 7896 1372 -2476 -4219 -1824 4101 7879 5123 445
3410 445 -7091 -8864 -9722 -5935 6209 8480 6632 2061 -2690 -6060 489 2680 4629 8587 5558
3395 5558 3139 7088 10007 7988 4940 5576 8172 7952 1815 1007 3938 8881 8460 2192 4024 2326
3379 2326 -1100 -2019 1677 -2462 -6815 -6089 -1079 3892 2605 283 -3843 -2876 2611 6750 2068 -18
3363 -18 -3322 -2270 1933 2160 1666 3952 6899 10866 5444 -3296 -7049 -782 3550 -1230 598 3269
3347 3269 1993 6269 7240 4916 -1206 -1523 2480 -37 853 6917 6574 467 -1312 -585 2304 3847
3331 3847 7740 13610 9477 1673 1451 1626 840 708 5433 7072 3790 4248 2664 2100 -2408 -7079
3315g079J008m10k412L940N185J78r81P070L701m312k870k738J183L415J675R48
3299G501m36J391J705m405j1173K676r92K69j777l240o685R562P404m111O55J0974
3283I318M26n862r210m269r42Q58N210Q509J403Q63k348q220k073M719Q140O602
3267A3124p215k909l148j727o367j751n79P171L190Q30k007K414l628n616r38
3252i156O625R72K569K559n517l75l075N136M701K049l422j5l438o190L553L133
3236A09J210P283O5o467o482j542L37N871L403J415M631k270o066L47k149k391
3220b696L426K969j884l394K74j16O40j808L628R397M122n164j0500k320K464
3205i62k788p15m491k002K42O398O868j928k515K374O724o18J639m187k566n195
$$ plain form
3315 -7079 -6071 -6481 -8893 -4953 232 410 -571 6499 10200 5888 3018 280 1463 4878 6553 7501
3299 7501 7065 8456 10161 5756 -5417 -2741 -3733 -3464 -5241 -8481 -15166 -5604 1800 -2311 -1656 9318
3283 9318 9744 3882 -5328 -9597 -10539 -9681 -4471 4038 5441 6304 3956 -4264 -6337 -1618 6522 13124
3267 13124 5909 3000 -148 -1875 -8242 -9993 -10572 -3401 -211 619 -1388 1026 -2602 -8218 -9156
3252 -9156 -2531 -1559 1010 3569 -1948 -2323 -5398 -262 4439 6488 3066 3051 -387 -6577 -3024 109
3236 109 1319 8602 8667 2200 -4282 -5824 -5487 384 3787 5202 9833 7563 1497 1844 -305 -2696
3220 -2696 730 3699 1815 -1579 -1305 -1421 -781 -2589 1039 10436 14558 9394 -1106 -3426 -962
3205 -962 -3750 -4465 -8956 -10958 -10716 -4318 2550 622 -1893 481 7205 6587 8226 4039 1473 -3722
$$ [...]
##END NTUPLES=NMR SPECTRUM
##END=
