##TITLE=Analysis number 316371
Compound Code cc 01405
Project Code adrs
Chemist Name fudan
##JCAMPDX= 6.0         $$ Bruker NMR JCAMP-DX V2.0
##DATA TYPE= NMR SPECTRUM
##DATA CLASS= NTUPLES
##ORIGIN= Bruker BioSpin GmbH
##OWNER= nmr
$$ XWIN-NMR		Version 3.5
$$ Thu Jan 12 12:08:19 2006 GMT Standard Time (UT+0h)  MAYBRIDGE\nmr@NMR_250MHZ
##.OBSERVE FREQUENCY= 250.131544655141
##.OBSERVE NUCLEUS= ^1H
##.ACQUISITION MODE= SIMULTANEOUS (DQD)
##.ACQUISITION SCHEME= undefined
##.AVERAGES= 16
##.DIGITISER RES= 18
##SPECTROMETER/DATA SYSTEM= dpx250
##.PULSE SEQUENCE= zg30
##.SOLVENT NAME= CDCl3
##.SHIFT REFERENCE= (INTERNAL, CDCl3, 0, 16.522)
##AUDIT TRAIL= $$ (NUMBER, WHEN, WHO, WHERE, WHAT)
$$ ##TITLE= Audit trail, XWIN-NMR		Version 3.5
$$ ##JCAMPDX= 5.01
$$ ##ORIGIN= Bruker BioSpin GmbH
$$ ##OWNER= nmr
$$ C:\u/data/dgb/nmr/ADRS/14540/pdata/1/auditp.txt
$$ ##AUDIT TRAIL=  $$ (NUMBER, WHEN, WHO, WHERE, WHAT)
(   1,<2006-01-12 12:07:50.68 +000>,<MAYBRIDGE\nmr>,<NMR_250MHZ>,
      <created by zg, POWCHK disabled, PULCHK disabled
       configuration hash MD5:
       62 19 C7 07 E1 42 D1 B7 37 6C 3D D0 77 39 F9 E6
       data hash MD5: 64K
       EA 0A BC 05 03 1E F0 E6 56 26 62 C2 D9 A7 70 C8>)
(   2,<2006-01-12 12:08:09.02 +000>,<MAYBRIDGE\nmr>,<NMR_250MHZ>,
      <Start of raw data processing
       ef LB = 0.3 FT_mod = 6 PKNL = 1 SI = 32K 
       data hash MD5: 32K
       DC AD 76 70 9B CC 42 A3 ED FC 03 45 F9 FC CC B7>)
(   3,<2006-01-12 12:08:11.18 +000>,<MAYBRIDGE\nmr>,<NMR_250MHZ>,
      <apk 
       data hash MD5: 32K
       F4 26 91 C7 34 71 25 3B 02 95 EA 67 08 BB 3E 3F>)
(   4,<2006-01-12 12:08:11.91 +000>,<MAYBRIDGE\nmr>,<NMR_250MHZ>,
      <abs ABSG = 5 
       data hash MD5: 32K
       17 BC FE 45 84 05 D0 87 BE 2B DD 75 99 4E AA C1>)
$$ ##END=
$$ 
$$ hash MD5
$$ 36 AE 8C 21 1D 61 11 D4 D6 E8 11 B1 12 8F C7 78
##$RELAX= 
##$RELAX= 
##$RELAX= 
##$RELAX= 
##$RELAX= 
##$RELAX= 
##$RELAX= 
$$ Bruker specific parameters
$$ --------------------------
##$DU= <C:\u>
##$EXPNO= 14540
##$NAME= <ADRS>
##$PROCNO= 1
##$TYPE= <nmr>
##$USER= <dgb>
##$AMP= (0..31)
100 100 100 100 100 100 100 100 100 100 100 100 100 100 100 100 100 100 
100 100 100 100 100 100 100 100 100 100 100 100 100 100 
##$AQSEQ= 0
##$AQ_mod= 3
##$AUNM= <au_zg>
##$AUTOPOS= <13 >
##$BF1= 250.13
##$BF2= 250.13
##$BF3= 250.13
##$BF4= 250.13
##$BF5= 500.13
##$BF6= 500.13
##$BF7= 500.13
##$BF8= 500.13
##$BYTORDA= 1
##$CFDGTYP= 0
##$CFRGTYP= 5
##$CHEMSTR= <none>
##$CNST= (0..31)
1 1 145 1 1 1 1 1 1 1 1 1 1 1 1 1 1 1 1 1 1 1 1 1 1 1 1 1 1 1 1 1 
##$CPDPRG= <>
##$CPDPRG1= <>
##$CPDPRG2= <>
##$CPDPRG3= <>
##$CPDPRG4= <mlev>
##$CPDPRG5= <mlev>
##$CPDPRG6= <mlev>
##$CPDPRG7= <mlev>
##$CPDPRG8= <mlev>
##$CPDPRGB= <>
##$CPDPRGT= <>
##$D= (0..31)
0 1 0 0 0 0 0 0 0 0.06 0 0 0 0 0 0 0.0002 0 0 0 0 0 0 0 0 0 0 0 0 0 0 
0 
##$DATE= 1137067669
##$DBL= (0..7)
120 120 120 120 120 120 120 120 
##$DBP= (0..7)
150 150 150 150 150 150 150 150 
##$DBP07= 0
##$DBPNAM0= <>
##$DBPNAM1= <>
##$DBPNAM2= <>
$$ [...]
##$SUBNAM7= <"">
##$SUBNAM8= <"">
##$SUBNAM9= <"">
##$SW= 20.6930455092707
##$SWIBOX= (0..15)
0 0 3 0 0 0 0 0 0 0 0 0 0 0 0 0 
##$SW_h= 5175.983436853
##$TD= 65536
##$TD0= 1
##$TE= 294.16
##$TE2= 300
##$TE3= 300
##$TEG= 300
##$TL= (0..7)
0 120 120 120 120 120 120 120 
##$TP= (0..7)
150 150 150 150 150 150 150 150 
##$TP07= 0
##$TPNAME0= <>
##$TPNAME1= <>
##$TPNAME2= <>
##$TPNAME3= <>
##$TPNAME4= <>
##$TPNAME5= <>
##$TPNAME6= <>
##$TPNAME7= <>
##$TPOAL= (0..7)
0.5 0.5 0.5 0.5 0.5 0.5 0.5 0.5 
##$TPOFFS= (0..7)
0 0 0 0 0 0 0 0 
##$TUNHIN= 0
##$TUNHOUT= 0
##$TUNXOUT= 0
##$USERA1= <user>
##$USERA2= <user>
##$USERA3= <user>
##$USERA4= <user>
##$USERA5= <user>
##$V9= 5
##$VALIST= <valist>
##$VCLIST= <CCCCCCCCCCCCCCC>
##$VD= 0
##$VDLIST= <DDDDDDDDDDDDDDD>
##$VPLIST= <PPPPPPPPPPPPPPP>
##$VTLIST= <TTTTTTTTTTTTTTT>
##$WBST= 1024
##$WBSW= 4
##$XGAIN= (0..3)
0 0 0 0 
##$XL= 0
##$YL= 0
##$YMAX_a= 495605
##$YMIN_a= -424078
##$ZGOPTNS= <>
##$ZL1= 120
##$ZL2= 120
##$ZL3= 120
##$ZL4= 120
##$ABSF1= 16.522
##$ABSF2= -4.171173
##$ABSG= 5
##$ABSL= 3
##$ALPHA= 0
##$AQORDER= 0
##$ASSFAC= 0
##$ASSFACI= 0
##$ASSFACX= 0
##$ASSWID= 0
##$AUNMP= <proc_1d>
##$AZFE= 0.1
##$AZFW= 0.1
##$BCFW= 0
##$BC_mod= 0
##$BYTORDP= 0
##$COROFFS= 0
##$CY= 12.5
##$DATMOD= 1
##$DC= 0
##$DFILT= <>
##$DTYPP= 0
##$F1P= 14.0000005364418
##$F2P= -0.99999901652339
##$FCOR= 0.5
##$FTSIZE= 32768
##$FT_mod= 6
##$GAMMA= 0
##$GB= 0
##$INTBC= 1
##$INTSCL= 1
##$ISEN= 128
##$LB= 0.3
##$LEV0= 0
##$LPBIN= 0
##$MAXI= 10000
##$MC2= 0
##$MEAN= 0
##$ME_mod= 0
##$MI= 0
##$NCOEF= 0
##$NC_proc= -3
##$NLEV= 6
##$NOISF1= 0
##$NOISF2= 0
##$NSP= 0
##$NTH_PI= 0
##$NZP= 0
##$OFFSET= 16.522
##$PC= 1
##$PHC0= 80.52173
##$PHC1= 11.30523
##$PH_mod= 1
##$PKNL= yes
##$PPARMOD= 0
##$PSCAL= 4
##$PSIGN= 0
##$REVERSE= no
##$SF= 250.13
##$SI= 32768
##$SIGF1= 0
##$SIGF2= 0
##$SINO= 400
##$SIOLD= 32768
##$SREGLST= <1H.CDCl3>
##$SSB= 0
##$STSI= 32768
##$STSR= 0
##$SW_p= 5175.98343685301
##$SYMM= 0
##$S_DEV= 0
##$TDeff= 65536
##$TDoff= 0
##$TI= <Analysis number 999999
Compound Code 99
Book Reference 9
Project Code 9>
##$TILT= no
##$TM1= 0
##$TM2= 0
##$TOPLEV= 0
##$USERP1= <user>
##$USERP2= <user>
##$USERP3= <user>
##$USERP4= <user>
##$USERP5= <user>
##$WDW= 1
##$XDIM= 32768
##$YMAX_p= 315684954
##$YMIN_p= -129183
$$ End of Bruker specific parameters
$$ ---------------------------------
##NTUPLES= NMR SPECTRUM
##VAR_NAME=  FREQUENCY,     SPECTRUM/REAL,   SPECTRUM/IMAG
##SYMBOL=    X,             R,               I
##VAR_TYPE=  INDEPENDENT,   DEPENDENT,       DEPENDENT
##VAR_FORM=  AFFN,          ASDF,            ASDF
##VAR_DIM=   32768,         32768,           32768
##UNITS=     HZ,            ARBITRARY UNITS, ARBITRARY UNITS
##FACTOR=    0.157963299565203, 1,           1
##FIRST=     4132.6476996994, 0,             0
##LAST=      -1043.33573715361, 0,           0
##MIN=       -1043.33573715361, -129183,     0
##MAX=       4132.6476996994, 315684954,     0
$$ Real data points
##PAGE= N=1
##DATA TABLE= (X++(R..R)), XYDATA
$$ [...]
19618D3504J3410l1170n2507k7463K1453L6643J7986J9088k7576k5311J1032l728
$$ 43504 56914 25744 -26763 -54226 -32773 3870 21856 40944 13368 -11943 -911 -4639
19606d639L227O394k5958K7893J6524N545n015j4386L9554l579j0499j9902j6148
$$ -4639 -1412 4982 -20976 6917 23441 28986 23971 9585 49139 45560 35061 15159 -989
19593i89r174L9093J0084k5038K746Q007k4573Q653j9115l8673J95L3905j1169
$$ -989 -10163 28930 39014 13976 16722 24729 156 8809 -10306 -48979 -48784 -14879 -26048
19580b6048Q9K7649L338O260k0567j6605M455o008j7016J4146j0994J6105j1191
$$ -26048 -25959 1690 5028 11288 -9279 -25884 -21429 -27437 -44453 -30307 -41301 -25196 -36387
19567c6387K6468M2261Q646N435m5360k5150j4058N2705L7118k1785k3145K7619
$$ -36387 -9919 32342 40988 46423 1063 -24087 -38145 14560 51678 29893 6748 34367
19555C4367n651j8857K8818r680o4773n2685J3818N3911J3843p100r039K2072
$$ 34367 28716 9859 38677 28997 -35776 -88461 -74643 -20732 -6889 -13989 -23028 -956
19543i56J5466l541J2962j5141k0595R70O08R299k5729p776M0590N6056j7791
$$ -956 14510 10969 23931 8790 -11805 -10835 -10227 -928 -26657 -34433 6157 62213 44422
19530D4422m5961p352J4563q444K5714N907O633l612o982l597n610n9433L738
$$ 44422 -1539 -8891 5672 -2772 22942 28849 35482 31870 24888 21291 15681 -43752 -40014
19517d0014R433J2369nj4844j3581k260L0129K5832j379j8176K1539J6157J5625
$$ -40014 -30581 -18212 -18217 -33061 -46642 -48902 -18773 7059 5680 -12496 9043 25200 40825
19504D0825k9467J5322N151J2139j130J1868k8282l013j020k1778K2707J8565
$$ 40825 11358 26680 31831 43970 42840 54708 26426 23413 22393 615 23322 41887
19492D1887l211n793J884l330l729R941k8297O708l402L8744n051l2861l378Q123
$$ 41887 38676 32883 34767 31437 27708 37649 9352 16060 12658 51402 46351 13490 10112 18235
19478A8235l0550N691k52L3655K2922j5180l6954J6478J3168J0376j4071j36J7464
$$ 18235 -12315 -6624 -6876 26779 49701 34521 -2433 14045 27213 37589 23518 23382 40846
19465D0846p881k1508J3834K0350j8353m6603k8151L5935K4301n590j0245k6526
$$ 40846 32965 11457 25291 45641 27288 -19315 -47466 -11531 12770 7180 -3065 -29591
19453b9591O919N564O852K7769O362j5266r835M892k5573K3313K2404k2537K398
$$ -29591 -22672 -17108 -10256 17513 23875 8609 -1226 3666 -21907 1406 23810 1273 3671
19440C671R937M743l6143J1300J4590j0328q673m84k329p060L1644n867j6111
$$ 3671 13608 18351 -17792 -6492 8098 -2230 -10903 -11387 -13716 -20776 10868 5001 -11110
19427a1110K1298J4160j3630j8539o404J3999M6898j8768J0915k3000m1600K4105
$$ -11110 10188 24348 10718 -7821 -14225 -226 46672 27904 38819 15819 -25781 -1676
19415a676m248J3614K4841m421j6639J475r611p031M199K4709P6l2946k0459j435
$$ -1676 -5924 7690 32531 28110 11471 12946 3335 -3696 503 25212 25288 -7658 -28117 -29552
19401b9552K0729K6187J6996O176l757J918K500j2232j6149J0731l0645P759P997
$$ -29552 -8823 17364 34360 40536 36779 38697 41197 28965 12816 23547 -7098 661 8658
19388H658J2834j012k3436k0147P458n086j4141R922J5255q769k6514J6647J8618
$$ 8658 21492 20480 -2956 -23103 -15645 -20731 -34872 -24950 -9695 -18464 -44978 -28331 -9713
19375i713m659N0621J938N674j0103L1649K463j9928p180k0073p363L354K3520
$$ -9713 -14372 36249 38187 43861 33758 65407 67870 47942 40762 20689 13326 16680 40200
19362D0200K5753m787K8582J9459l0233L313j2577k0622k4663j7553k0464j7771
$$ 40200 65953 61166 89748 109207 78974 82287 69710 49088 24425 6872 -13592 -31363
19350c1363J5585J4066j5976M618M0722N0447l6519m5940J2705J8965K1878K3790
$$ -31363 -15778 -1712 -17688 -13070 27652 78099 41580 -4360 8345 27310 49188 72978
19338G2978j1183k6116n299j2560r237K3650m466l0753p143o987k7202L33K4759
$$ 72978 61795 35679 30380 17820 8583 32233 27767 -2986 -10129 -17116 -44318 -43985 -19226
19325a9226J6526J9085M542l1238K097r106K2366J5125k7450M480K613Q136L2135
$$ -19226 -2700 16385 20927 -10311 -8214 -17320 5046 20171 -7279 -2799 -186 7950 40085
19312D0085K4476l056k8841j6762Q204l2638P753J9367l050J4276j6532p389L418
$$ 40085 64561 61505 32664 15902 24106 -8532 -779 18588 15538 29814 13282 5893 9311
19299I311o867J863J0064o307j5929J5053M762m3074j4225l232K9074J736J2960
$$ 9311 2444 4307 14371 8064 -7865 7188 11950 -31124 -45349 -48581 -19507 -17771 -4811
19286d811L2814k0327K187K8438L2317K4261k717o5260m618k745M0292p038k0593
$$ -4811 28003 7676 9863 38301 70618 94879 92162 26902 22284 19539 59831 52793 32200
19273C2200j4790R995R00j5858k893O917J7501Q465K2572l024Q699n0465l3972
$$ 32200 17410 27405 28305 12447 9554 16471 33972 42437 65009 61985 70684 20219 -13753
19260a3753j879q857R142J9527K0743L534p534k292j3897k2882J2501K1598P089
$$ -13753 -15632 -24489 -15347 4180 24923 28457 20923 18631 4734 -18148 -5647 15951 23040
19247B3040j440Q053M098j0508o284Q589j4809l2089K311J8893p108N924p015
$$ 23040 21600 29653 33751 23243 16959 25548 10739 -21350 -19039 -146 -7254 -1330 -8345
19234h345J4237K9667j0381m3117J4259M4153J2979j4560j3770J3979j6795j6829
$$ -8345 5892 35559 25178 -17939 -3680 40473 53452 38892 25122 39101 22306 5477
19222E477P706L1231Q941k4734l0567l1546J9033j7237j2228J7296J2849K6606
$$ 5477 13183 44414 53355 28621 -1946 -33492 -14459 -31696 -43924 -26628 -13779 12827
19210A2827O361j2494l5289n475J8651K3123J2461j8945L586K5353L3400j9345
$$ 12827 19188 6694 -28595 -34070 -15419 7704 20165 1220 4806 30159 63559 44214
19198D4214M728j619j0393j330N209k9139k2851R159K2870Q92j312J3522O01l5843
$$ 44214 48942 47323 36930 35600 40809 11670 -11181 -2022 20848 21740 20428 33950 34551 -1292
19184a292O613M287q845J1274L4551J7852o020J1131L9536J4694j0520m9452l6977
$$ -1292 5321 9608 763 12037 46588 64440 58420 69551 109087 123781 113261 63809 26832
19171B6832K1246M223l7800l6452J3445K8869O221j2743L8631K2760l2634m6792
$$ 26832 48078 52301 14501 -21951 -8506 20363 26584 13841 52472 75232 42598 -4194
19159d194j4230M179j746K0968L224J5146M808j5026J4558L0169L129J6412q538
$$ -4194 -18424 -14245 -15991 4977 8201 23347 28155 13129 27687 57856 60985 77397 68859
19146F8859l4155Q19L3143j806k2466k7440k3727j5722L9574j1753O423J2955
$$ 68859 34704 35523 68666 66860 44394 16954 -6773 -22495 17079 5326 11749 24704
19134B4704k3988O898k9856k4384J1471r458m518K8732M6256o115M555n047K0830
$$ 24704 716 7614 -22242 -46626 -35155 -44613 -49131 -20399 25857 19742 24297 19250 40080
19121D0080J7869M04k1991m9646m9357M7516J4764O347L6157J3048k083J5591
$$ 40080 57949 58353 36362 -13284 -62641 -15125 -361 5986 42143 55191 53108 68699
19109F8699O902m3960l9505k2892k1374K2543K1444J5041O535j6634J2697k9458
$$ 68699 75601 31641 -7864 -30756 -52130 -29587 -8143 6898 13433 -3201 9496 -19962
19097a9962j3453R368L9680N0151M6207J4266m0645j5882K365M97j3063k6842
$$ -19962 -33415 -24047 15633 65784 111991 126257 85612 69730 72095 72592 59529 32687
19085C2687j2259J4711L5446k2525k4590k8579M4571Q734O806l996j887n1916
$$ 32687 20428 35139 70585 48060 23470 -5109 39462 48196 55002 51006 49119 -2797
19073b797J4545q272j3812L6133L454j3071p48j7069M904J3318n772r946j664
$$ -2797 11748 3476 -10336 25797 29251 16180 15432 -1637 3267 16585 10813 867 -797
19060g97r190o882M0582M1416j8740p909j1846l0937o381K0323K3493J8629J7355
$$ -797 -9987 -16869 23713 65129 46389 38480 26634 -4303 -10684 9639 33132 51761 69116
19047F9116O719j6356k7691l354q552o409n475K332O687j0908J6630K9299q479
$$ 69116 75835 59479 31788 28434 19882 13473 7998 10330 17017 6109 22739 52038 43559
19034D3559m391m4565J9203K2255j311J2776q054l3177k9499R058j0075N219K6689
$$ 43559 39168 -5397 13806 36061 34750 47526 39472 6295 -23204 -14146 -24221 -19002 7687
19021G687k723j5855o296K414P888k6491l5400J9857M2151M9087L4127j9515j3819
$$ 7687 4964 -10891 -17187 -14773 -6885 -33376 -68776 -48919 -6768 42319 76446 56931 43112
19008D3112p587j4665j5230j8229M0716K0115p894j6379j4782L599j0155k5051
$$ 43112 35525 20860 5630 -12599 28117 48232 40338 23959 9177 12776 2621 -22430
18996b2430m753j508q980J1826J9316M4428n564l4216j8637K768P99j2451K243
$$ -22430 -27183 -28691 -37671 -25845 -6529 37899 32335 -1881 -20518 -17750 -16951 -29402 -27159
18983b7159L525j0628M838n216L0698K2115J7084Q539P946m552j9765J1243J0113
$$ -27159 -23634 -34262 -29424 -34640 -3942 18173 35257 43796 51742 47190 27425 38668 48781
18970D8781j0957J4954K3099j1169n0748n148R285J7856j0360J9850J3687J093
$$ 48781 37824 52778 75877 64708 13960 8812 18097 35953 25593 45443 59130 60223
18958F0223n92j5139l5148k6060J5787O8078Q346m3865l1914J3787M6365N1257
$$ 60223 59631 44492 9344 -16716 -929 67149 75495 31630 -284 13503 59868 111125
18946A11125p236l8153n4584n391K0470j1330K2846J4752o872k9796j5354L3480
$$ 111125 103889 65736 11152 5761 26231 14901 37747 52499 45627 15831 477 33957
18934C3957M7562J5069j0180k8552m4349m1722O444L9291J2223K3255M694p830
$$ 33957 81519 96588 86408 57856 13507 -28215 -21771 17520 29743 52998 57692 49862
18922D9862k3507j2916o38P518L6125k6157l359J2379k9322j8861K1687P290J1651
$$ 49862 26355 13439 12801 20319 56444 30287 26928 39307 9985 -8876 12811 20101 31752
18909C1752K895Q24K0865o388j3467k15L3662l2446j2865j817L116O560k0073
$$ 31752 34647 35471 56336 49948 36481 36266 69928 37482 24617 22800 25916 32476 12403
18896A2403k3054j9551K648M196L8972M425j432J0147K0421k72L30Q356j6784
$$ 12403 -10651 -30202 -27554 -23358 15614 20039 18607 28754 49175 48903 49233 57589 40805
18883D0805k5049m882K2440J9636L2789J0609j8006Q055L7241r661k2429J313
$$ 40805 15756 10874 33314 52950 85739 96348 78342 86397 123638 113977 91548 92861
18871I2861M414Q1Q498L2957K9371K5626J3531J2849k7324l9501j2383j9922r787
$$ 92861 97275 97356 105854 138811 168182 193808 207339 220188 192864 153363 140980 121058 111271
18858A11271K4166K1170J0892J0261M7914L8212k0449o8510n4201j4062k1709
$$ 111271 135437 156607 167499 177760 225674 263886 243437 174927 120726 106664 84955
18847H4955j7947L298k6536l768k0902M1066M2432M089m7935J0765J2334j1593
$$ 84955 67008 70306 43770 40002 19100 60166 102598 106687 58752 69517 81851 70258
18835G0258m0531k3630r397j0426l623K1197J7533J7814K441k716l3836O25K9492
$$ 70258 29727 6097 -3300 -13726 -17349 3848 21381 39195 41636 38920 5084 5709 35201
18822C5201J8309K5636J8709J2500K8699L2540K7131J7774o025J467m1587q529
$$ 35201 53510 79146 97855 110355 139054 171594 198725 216499 210474 211941 170354 161825
18810A61825N58k4182m065K2935N2400J2617k4266P681j4661n3999l5675J8272
$$ 161825 162383 138201 134136 157071 209471 222088 197822 205503 190842 136843 101168 119440
18798A19440K6781j6553j1362n899l600r654k0137K965j1422k3593j2309k6109
$$ 119440 146221 129668 118306 112407 108807 99153 79016 81981 70559 46966 34657 8548
18786H548K8100K4834J0934o380q498l298m362J5618O891m7509M6110K4905j7663
$$ 8548 36648 61482 72416 66036 57538 54240 49878 65496 72387 24878 70988 95893 78230
18773G8230l311J6048L6553N3372O9604M0498P920m4344n1227l1742k7083n0547
$$ 78230 74919 90967 127520 180892 250496 290994 298914 254570 203343 171601 144518 93971
18761I3971j5647J8944n221j3458K6602P593l5273j9937j746k572J5101j603p302
$$ 93971 78324 97268 92047 78589 105191 112784 77511 57574 55828 53256 68357 66754 59452
18748E9452O409j3128J7036n470L3825K2312k695k2845K1942j2530m3801Q860
$$ 59452 65861 52733 69769 64299 98124 120436 117741 94896 116838 104308 60507 69367
18736F9367r051j0520M765m752K682M767p340J4838r105j4180j5520k3720q76
$$ 69367 60316 49796 54561 49809 52491 57258 49918 64756 55651 41471 25951 2231 1355
18723A355M544J4321p393J3243L9969j5334J6560K0129Q195j2331J6541l6265
$$ 1355 5899 20220 12827 26070 66039 50705 67265 87394 95589 83258 99799 63534
18711F3534k0022L0874J1290L8771J8886k6451m4476l508k901k4079J0020j8951
$$ 63534 43512 74386 85676 124447 143333 116882 72406 68898 65997 41918 51938 32987
18699C2987n4896K8465M2175M3271j9555j6862L9941l908p06k4169j2132K2119
$$ 32987 -21909 6556 48731 92002 72447 55585 95526 91618 90912 66743 54611 76730
18687G6730k6146l8155j541O940q622J2853L5429j9521K6211K4971K568K963l315
$$ 76730 50584 12429 10888 17828 9206 22059 57488 37967 64178 89149 91717 94680 91365
18674I1365j9398q305j0140m696M856m818K5647L3363J6439j2833j0865l9417
$$ 91365 71967 63662 53522 48826 53682 48864 74511 107874 124313 111480 100615 61198
18662F1198j4508L43l5165J7662J4784k7249M0068J3833l8369k4700K5515o304
$$ 61198 46690 47033 11868 29530 44314 17065 57133 70966 32597 7897 33412 27108
18650B7108p034j1076Q938J142l276K2020j1998j6149J5113J1396L1312L178l0196
$$ 27108 20074 8998 17936 19078 15802 37822 25824 9675 24788 36184 67496 70674 40478
18637D0478r565J9523J7454N298L3944J8365n9733l6730O121K0865j7296M725
$$ 40478 30913 50436 67890 73188 107132 125497 65764 29034 35155 56020 38724 43449
18625D3449o032Q461J6092J3164M342K1500Q620m346k3181j2526r544J398N918
$$ 43449 37417 45878 61970 75134 79476 100976 109596 105250 82069 69543 59999 61397 67315
18612F7315K576j7047N496J3546L116J9214J8229j9089M479k4737j2972l123k6141
$$ 67315 69891 52844 58340 71886 75002 94216 112445 93356 97835 73098 60126 57003 30862
18599C0862J3515M2228J6441M0911j2093l9931o657L973K8612L6629l733k2217
$$ 30862 44377 86605 103046 143957 131864 91933 85276 89249 117861 154490 150757 128540
18587A28540m870l7019k6160N981L4794j9766q25j1478j5538J4611K7097K7018
$$ 128540 123670 86651 60491 66472 101266 81500 80675 69197 53659 68270 95367 122385
18575A22385j1990l220J485L2939r379j1345n239n775k6061n8657J4013J9261
$$ 122385 110395 107175 108660 141599 132220 120875 115636 109861 83800 25143 39156 58417
18563E8417q15l676j5653J9568L2110J7415l141j7987j98L5782J0990J0223j0350
$$ 58417 57602 53926 38273 57841 89951 107366 104225 86238 86040 121822 132812 143035 132685
18550A32685k9050j3321R740j3143j345K5899J3132M42k3465J5415j9425m70j189
$$ 132685 103635 90314 100054 86911 85566 111465 124597 125039 101574 116989 97564 97094 95905
18537I5905J4112J4113O747R595l1269o959k5906J4352M5405K7179m035m62K2854
$$ 95905 110017 124130 130877 140472 109203 102244 76338 90690 136095 163274 159239 158777 181631
18524A81631M1808O230k3772l6994l4555l1184J4992J229K13m553k42j451k4428
$$ 181631 223439 229669 205897 168903 134348 103164 118156 119385 119598 115045 114803 113352 88924
18511H8924m9385J4543M1612O408j3374k2696q19J6614J2398J9281L2065J6025
$$ 88924 39539 54082 95694 102102 88728 66032 65213 81827 94225 113506 145571 161596
18499A61596J9118J7644n624l2152k3433k7578L4970K652l2758j4658k51l633
$$ 161596 180714 198358 192734 160582 137149 109571 144541 147193 114435 99777 99526 95893
18487I5893N269M8646K0640K7090K765o899q940M808k3357q09L4752J8333M9529
$$ 95893 101162 149808 170448 197538 200303 193404 184464 189272 165915 165106 199858 218191 267720
18474B67720K4955q432j0249m778k0917q08j2083n701J4573j4999k9522l6117
$$ 267720 292675 284243 273994 269216 248299 247491 235408 229707 244280 229281 199759 163642
18462A63642j3744K479l230J6331J4356o404J4423P505J5571M5843j506k5027
$$ 163642 149898 152377 149147 165478 179834 173430 187853 195358 210929 256772 255266 230239
18450B30239n635N660l2283j8012L2791J4364k9910J9263M5022K6941j075n404
$$ 230239 224604 230264 197981 179969 212760 227124 197214 216477 261499 288440 287365 281961
18438B81961Q518N451j3206l3164j7121M6343j3875J8301J9105K7088N151o501
$$ 281961 290479 295930 282724 249560 232439 278782 264907 283208 302313 329401 334552 328051
18426C28051j3925R910r750o950k5093p446K5753M9301J5511K583L9364N3633
$$ 328051 314126 324036 314286 307336 282243 274797 300550 349851 365362 367945 407309 460942
18414D60942j3152m0915K2715K4615K7669K7252K2148M1170O0387Q2790L3475
$$ 460942 447790 406875 429590 454205 481874 509126 531274 572444 632831 715621 749096
18403G49096j6536j2989n1376k0778J960j5007P194L6512M8358O4989P0747k6745
$$ 749096 732560 719571 668195 647417 649377 634370 641564 678076 726434 791423 862170 835425
18391H35425m6045L9131K4256M7296J08247M3544K4362J4868P410p147K0427P7454
$$ 835425 789380 828511 852767 900063 1008310 1051854 1076216 1091084 1098494 1091347 1111774 1189228
18379A189228M9339J605N3307R4406J00514Q5581O9818m9171p6922j6365O6505
$$ 1189228 1238567 1240172 1293479 1387885 1488399 1573980 1643798 1594627 1517705 1501340 1567845
18368A567845Q7604N2423O7957J49949J89466J77823K14128J79040J66006K51478
$$ 1567845 1655449 1707872 1775829 1925778 2115244 2293067 2507195 2686235 2852241 3103719
18358C103719L95135M84053N50224P16280Q46898J042641J378808J790689K371755
$$ 3103719 3498854 3982907 4533131 5249411 6096309 7138950 8517758 10308447 12680202
18349A2680202L265200M565373N997068O783367M452983k610595p308475o058375
$$ 12680202 15945402 20510775 26507843 33291210 37744193 35133598 27825123 21766748
18341B1766748l259688j111006O09037K193646L673724N356477O430527M016792
$$ 21766748 18507060 17396054 18005091 20198737 23872461 29228938 35659465 39676257
18333C9676257l812623r111998p809627n056728l076545j840365j053423o47121
$$ 39676257 35863634 26751636 18942009 13885281 10808736 8968371 7914948 7267827
18325G267827m36016l65067k69342k63181k87428k01334j35122j15961r4377J8839
$$ 7267827 6831811 6466744 6197402 5934221 5646793 5445459 5310337 5194376 5099999 5118838
18315E118838N1056L7460O0054Q4110P8409J49210K50273L75538M75651N84756
$$ 5118838 5169894 5207354 5267408 5351518 5429927 5579137 5829410 6204948 6680599 7265355
18305G265355P23450J010001J395163J814057K333204L133997M431749N990730
$$ 7265355 7988805 8998806 10393969 12208026 14541230 17675227 22106976 28097706
18297B8097706P401748O765577O60424p030103q029899m989646k150201j54905
$$ 28097706 35499454 42265031 42925455 35895352 27865453 22875807 20725606 20570701
18289B0570701J545799L293607N117243O650135O036846l39013q554084r897000
$$ 20570701 22116500 25410107 30527350 37177485 43214331 42875318 34321234 24424234
18281B4424234o993189m383290k735424j692687j075845p42344n32554m17626
$$ 24424234 17431045 13047755 10312331 8619644 7543799 6801455 6268901 5851275
18273E851275l06051k66332k77521k81984k18991j54072j74432j99581k41352
$$ 5851275 5545224 5278892 5001371 4719387 4500396 4346324 4171892 3972311 3730959
18264C730959j75469o5103q8870j01174j07810o5965j6938p9557j37667j47299
$$ 3730959 3555490 3490387 3401517 3300343 3192533 3126568 3109630 3030073 2892406 2745107
18254B745107j50767j13930r6641q4372j62013j85200r5009m8196j18421j01191
$$ 2745107 2594340 2480410 2383769 2299397 2137384 1952184 1857175 1808979 1690558 1589367
18244A589367m1340k3558k7313l2410m7146l6985q6951m2135m2123k7894p4586
$$ 1589367 1548027 1524469 1497156 1464746 1417600 1380615 1293664 1251529 1209406 1181512 1106926
18233A106926m6301m0543n8659o1241n8769o7465k4386j9898j3038R889K0590
$$ 1106926 1060625 1020082 961423 900182 841413 773948 749562 729664 716626 726515 747105
18222G47105j7777o6618o8343l0476j829k8450m8272o5065k6407R542K5914J0716
$$ 747105 729328 662710 594367 563891 562062 533612 485340 420275 393868 403410 429324 440040
18210D40040K3847n69j3527N409K2859q966l6589k6222m6554l0489J623k0192
$$ 440040 463887 463318 449791 455200 478059 469093 432504 406282 359728 329239 330862 310670
18198C10670o796k2922J9800j1230n1603k8891J5951n253J4896J327J2798l859
$$ 310670 303874 280952 300752 289522 237919 209028 224979 219726 234622 235949 248747 244888
18186B44888k0534j8867N793J106j0696K7830P321J2124M1020K7177Q964k7589
$$ 244888 224354 205487 211280 212386 201690 229520 236841 248965 289985 317162 326126 298537
18174B98537N203M4518k9445n329J6633k7294N013j24k1927j0581K2885K5407
$$ 298537 303740 348258 318813 313484 330117 302823 307836 307712 285785 275204 298089 323496
18162C23496r197l0474j7873L0801L2660M9025M2926L6704L1043M7419J09072
$$ 323496 314299 283825 265952 296753 329413 378438 421364 458068 489111 536530 645602
18151F45602O2191L2669J7634k9921L85K3211l6195L8280N5197m1206j01247q4997
$$ 645602 707793 740462 758096 728175 728560 751771 715576 753856 809053 767847 666600 581603
18139E81603j528j7599Q326Q9869O2897j8554J2157N7231J01103N0925Q9691J16869
$$ 581603 580075 562476 570802 660671 723568 705014 717171 774402 875505 926430 1016121 1132990
18127A132990J13143J63284J87201K34193K53884L70040M27585N24142O85706
$$ 1132990 1246133 1409417 1596618 1830811 2084695 2454735 2882320 3406462 4092168
18118D092168Q61667J067745J416276J798006K206198K902662M283530O218773
$$ 4092168 4953835 6021580 7437856 9235862 11442060 14344722 18628252 24847025
18110B4847025Q429529R864106N272172p758444j3360827r678070n722730l337577
$$ 24847025 33276554 43140660 48412832 40654388 27293561 17615491 11892761 8555184
18102H555184j886560j085567p34435o21296n02595l40415k43727k98324k42560
$$ 8555184 6668624 5583057 4848622 4227326 3724731 3384316 3140589 2842265 2599705
18093B599705r5391r3402j06939q9607o8404o7163r0966l7963p6806m9685l1632
$$ 2599705 2504314 2410912 2303973 2214366 2145962 2078799 1987833 1949870 1873064 1823379 1791747
18082A791747m6084m3704l0403j7720m4408n7960l5438k6126n2819n8413q3542
$$ 1791747 1745663 1701959 1671556 1653836 1609428 1551468 1516030 1489904 1437085 1378672 1295130
18071A295130k4918m8787m2395N711L1656P5605j3399m7711n0819r4903j14400
$$ 1295130 1270212 1221425 1179030 1184741 1216397 1292002 1278603 1230892 1180073 1085170 970770
18060I70770o3697n1396m8333n9913k3089m986q0420m1481K969l894o790k9955
$$ 970770 907073 855677 807344 747431 724342 719356 638936 597455 600424 596530 589740 559785
18048E59785m0256k2725m8421k8540m2338J569p586P850j892K457m694r79N911
$$ 559785 519529 496804 448383 419843 377505 379074 371488 379338 377446 379903 375209 374230 380141
18035C80141K5775j9310m6383j5410j010n943j9278L045J1513j2793n257j7716
$$ 380141 405916 386606 340223 324813 323803 317860 298582 301627 313140 300347 295090 277374
18023B77374j8639j7153J9342M0414J6736L757K5701K3188Q396o606n3352l4570
$$ 277374 258735 241582 260924 301338 318074 321831 347532 370720 379116 372510 319158 284588
18011B84588j7128K5341j6586m696m276Q306J4071j8696m4328l6192j7813j0253
$$ 284588 267460 292801 276215 271519 267243 275549 289620 270924 226596 190404 172591 162338
17999A62338J3648P20n503j2749Q419J2648n480m912j8647k2287l426P7L1294
$$ 162338 175986 176706 171203 158454 166873 179521 174041 169129 150482 128195 124769 124846 156140
17986A56140N0366J0445r946j1094o472K0932r568o0623R206L3750j4200j3084
$$ 156140 206506 216951 207005 195911 189439 210371 200803 140180 149386 183136 168936 155852
17974A55852J6216l061m7450j9939O61L6613M8973P8821M6063j0250m4165l7912
$$ 155852 172068 169007 121557 101618 102279 138892 187865 266686 312749 302499 258334 220422
17962B20422l7919j9953L4103Q111l0237K7701L2406m022J4971R368K0183l2726
$$ 220422 182503 162550 196653 204764 174527 202228 234634 230612 245583 254951 275134 242408
17950B42408k4918l1570n5159r359N094J8644K9647O2805J9086j1678l1153p566
$$ 242408 217490 185920 130761 121402 126496 145140 174787 237592 256678 245000 213847 206281
17938B06281K8069k5052N293n374o175m0584K8024L7644k247j2182k1466J6550
$$ 206281 234350 209298 214591 209217 203042 162458 190482 228126 225879 213697 192231 208781
17926B08781o74j5547L325k5178q707J154M7834K0116j4177L2940L9462K4265
$$ 208781 208107 192560 195885 170707 162000 163154 210988 231104 216927 249867 289329 313594
17914C13594K1251L2149L2215j406n2659l7382j8679l184K819j0124J8404P0437
$$ 313594 334845 366994 399209 397803 345144 307762 289083 285899 288718 278594 296998 367435
17902C67435L2033R531K804J1157K010Q336l7114m4649K1759R99K5093o820J2759
$$ 367435 399468 408999 411803 422960 424970 433306 396192 351543 373302 374301 399394 392574 405333
17889D05333J1968M7971M4546K3496j3189J149K3210Q721r191n3382q41J9554
$$ 405333 417301 465272 509818 533314 520125 521274 544484 553205 544014 490632 489791 509345
17877E09345L3203N4213o282N202L1601L2433P6307O2680O6543O1174K8690J4497
$$ 509345 542548 596761 590479 595681 627282 659715 736022 798702 865245 926419 955109 969606
17865I69606R417J552N9789M3594j1740R180P1610N8987L1409O0437N2661k3893
$$ 969606 979023 980575 1040364 1083958 1072218 1081398 1153008 1211995 1243404 1303841 1356502 1332609
17853A332609K0030P1987P9908K5217M6498J02451J20612J10961J44869J61696
$$ 1332609 1352639 1424626 1504534 1529751 1576249 1678700 1799312 1910273 2055142 2216838
17843B216838J79656K67365L24817M20019N91330O67317P27874R08693J169380
$$ 2216838 2396494 2663859 2988676 3408695 4000025 4667342 5395216 6303909 7473289
17834G473289J507014J998342K789633L865050N134599N999101L908954k692279
$$ 7473289 8980303 10978645 13768278 17633328 22767927 28767028 32675982 29983703
17826B9983703o560902n023671k594011q51474N51254J950354L246654M567445
$$ 29983703 23422801 18399130 15805119 14953645 15504899 17455253 20701907 25269352
17818B5269352N504377L362015l759359p965488o447321l987584k313489j369288
$$ 25269352 30773729 34135744 30376385 22410897 15963576 11975992 9662503 8293215
17810H293215q36902n04708l85548l45025l03825k45076k80399k69176q3218N1561
$$ 8293215 7456313 6951605 6566057 6221032 5917207 5672131 5391732 5122556 5039338 5090899
17800E090899J2934j9933K698M9454O3511L0902J05784R0398J89042L30249M72690
$$ 5090899 5103833 5083900 5086598 5136052 5199563 5230465 5336249 5426647 5615689 5945938 6418628
17789F418628O53745Q63023J027337J207791J515083J971877K475132L409369
$$ 6418628 7072373 7935396 8962733 10170524 11685607 13657484 16132616 19541985
17781A9541985M912826O768998Q687855R013579K789826p749854j0394471o893349
$$ 19541985 24454811 31223809 39911664 48925243 51715069 43965215 33570744 26677395
17773B6677395l448906r74675J158573L124272N050152O873214P049511J333756
$$ 26677395 23228489 22253814 23412387 26536659 31586811 38460025 45509536 46843292
17765D6843292q398166j0973642p895446m950454k956857j735362r92325o43567
$$ 46843292 38445126 27471484 19576038 14625584 11668727 9933365 8941040 8297473
17757H297473n21275n33353n87568n49815m82538l83987j59581n8490k0905k1001
$$ 8297473 7776198 7242845 6655277 6105462 5622924 5238937 5079356 5020866 4999961 4978960
17747D978960o4723j11978j91598l65643l47875l00188j90076j13749j12864j29131
$$ 4978960 4914237 4802259 4610661 4245018 3897143 3596955 3406879 3293130 3180266 3051135
17737C051135o7064n7604o8102n3973p8693j27842j70822j64932q9266j17726
$$ 3051135 2984071 2926467 2858365 2804392 2725699 2597857 2427035 2262103 2172837 2055111
17727B055111j51669j10844n6309p2334k664j4856o2106o0539m6388o6130k9624
$$ 2055111 1903442 1792598 1736289 1663955 1661291 1646435 1584329 1523790 1477402 1411272 1381648
17716A381648l4009p6886j05160p8992p1343l1104j5507k4202l5421j0920l2911
$$ 1381648 1347639 1270753 1165593 1086601 1015258 984154 968647 944445 909024 898104 865193
17705H65193l6193j0720n2883m3260j0992m7155l7755O58K481J9100J0452J6619
$$ 865193 829000 818280 765397 722137 711145 663990 626235 626893 629374 648474 658926 675545
17693F75545p564o214o0810j2694j3132l321J8178p85M454m5089m1977j3792k4849
$$ 675545 667981 661767 600957 588263 575131 571810 589988 589203 593657 548568 506591 492799 467950
17680D67950j3170k0410l6364j4467l9701j0697m347L1675O518L256L0128N190
$$ 467950 454780 434370 398006 383539 343838 333141 328794 360469 366987 370243 400371 405561
17668D05561M2490N1221O650r722o3076k0078K9453k3411o412j8741j2084j26
$$ 405561 448051 499272 505922 496200 433124 413046 442499 419088 412676 393935 381851 381725
17656C81725J8460M9493L3702k8159k2486J2675L2322K5293q451q796j225O450
$$ 381725 400185 449678 483380 455221 432735 445410 477732 503025 494574 485778 484553 491003
17644D91003N2131L2405O1180R4562J05144J19012P3398K805L745L9653Q465K1545
$$ 491003 543134 575539 636719 731281 836425 955437 1028835 1031640 1035385 1075038 1083503 1105048
17632A105048O5783K5645o4384l2089J7390p101l3074P2136J06854J0109k7489
$$ 1105048 1170831 1196476 1132092 1100003 1117393 1110292 1077218 1149354 1256208 1266317 1238828
17621A238828L9095O4986Q6166R0170J19241J61939J70568K31111K85365L62185
$$ 1238828 1277923 1342909 1429075 1519245 1638486 1800425 1970993 2202104 2487469 2849654
17611B849654L93919M52509M92037N87728Q38006J140913J477153J854973K284747
$$ 2849654 3243573 3696082 4188119 4775847 5613853 6754766 8231919 10086892 12371639
17602A2371639K886926L965085N480129P312924Q760071O629023k590929j0802521
$$ 12371639 15258565 19223650 24703779 32016703 40776774 47405797 44814868 34012347
17594C4012347j0486561p017687m264887k511200j464971q17892n55708m75220
$$ 34012347 23525786 16508099 12243212 9732012 8267041 7449149 6893441 6418221
17586F418221l50775k97880l66674l97807k95620k44575k70570j77089n9222q2476
$$ 6418221 6067446 5769566 5402892 5005085 4709465 4464890 4194320 4017231 3958009 3875533
17576C875533n9258j985Q800j8779k3008K9663R4765M0188N7850J29030K08764
$$ 3875533 3816275 3814290 3823090 3804311 3781303 3810966 3905731 3945919 4003769 4132799 4341563
17565D341563K55850K39843K89605L79509N28756O36204O81669Q66546J185123
$$ 4341563 4597413 4837256 5126861 5506370 6035126 6671330 7352999 8219545 9404668
17556I404668J628673K199955K816053L553602M559637O148871Q417904J1049684
$$ 9404668 11033341 13233296 16049349 19602951 24162588 30311459 38729363 49779047
17548D9779047J2242752P424711m491005j4157313j4986187j0754267o742630
$$ 49779047 62021799 69446510 64955505 50798192 35812005 25057738 18315108
17541A8315108m057555k427582j557687j101335p60273n42773n10526n96492n94388
$$ 18315108 14257553 11829971 10272284 9170949 8410676 7867903 7357377 6760885 6166497
17532F166497m77227l85669l35116k43262j85843j23891p8155n0063m7480n2756
$$ 6166497 5689270 5303601 4968485 4725223 4539380 4415489 4337334 4287271 4239791 4187035
17522D187035k5565k0741J4440k3541n4188R904J1816k6121p0771n6033k0468
$$ 4187035 4161470 4140729 4155169 4131628 4077440 4087344 4099160 4073039 4002268 3946235 3925767
17511C925767O7664K03353J69182J89614L32259N36658P55310J027670J361622
$$ 3925767 3993431 4196784 4365966 4555580 4887839 5424497 6179807 7207477 8569099
17502H569099J675299K207413L055132M197987N116089M221597j095719o470063
$$ 8569099 10244398 12451811 15506943 19704930 24821019 29042616 27946897 21476834
17494B1476834o555705m440402k717868j626434j036035o48845m80413l62769
$$ 21476834 14921129 10480727 7762859 6136425 5100390 4451545 3971132 3608363
17486C608363k73227k09284k37337k91656k67331j81538r5505o6921m4034n0457
$$ 3608363 3335136 3125852 2888515 2596859 2329528 2147990 2052485 1985564 1941530 1891073
17476A891073r436R149k8885n7914o7457n1762K3825j0861o8459r7610o2014n2833
$$ 1891073 1881637 1890786 1861901 1803987 1736530 1684768 1708593 1697732 1629273 1531663 1469649 1416816
17464A416816o7991r4961j25200j08737o1346q1413p6362o6060q33Q444m6522
$$ 1416816 1348825 1253864 1128664 1019927 958581 877168 800806 734746 733913 742357 695835
17453F95835l7033J085k128j1016m9821j965J9261R172q015J1016K4215K8178
$$ 695835 658802 659887 657759 646743 596922 594957 614218 623390 615375 626391 650606 678784
17441F78784l0555r1510o7312p1900n2712o758m484j9826k4375j1046j6744k6729
$$ 678784 648229 556719 489407 417507 364795 358037 353553 333727 309352 298306 281562 254833
17429B54833k1451K543K1916K6529J5025J8449L137k2959l2607j1291l0336j6959
$$ 254833 233382 235925 257841 284370 299395 317844 320981 298022 265415 254124 223788 206829
17417B06829n0637l8590k6609k0524l957J0770j128J6028M52j5437k857K5015
$$ 206829 156192 117602 90993 70469 66512 77282 76154 92182 92634 77197 74340 99355
17405I9355K4509n83j2275l2223m3125K2858K6010K0626m397j0806L472r130l1052
$$ 99355 123864 123281 111006 78783 35658 58516 84526 105152 100755 89949 93421 84291 53239
17392E3239K6202K1227k2797m804N136k0108J9290K0454m636J257j0506k5873
$$ 53239 79441 100668 77871 73067 78203 58095 77385 97839 93203 94460 83954 58081
17380E8081K439l0525j0328K225M3251N0050K2523o2321l674N446l211L892M9831
$$ 58081 60520 29995 19667 21892 65143 115193 137716 75395 71721 77167 73956 77848 127679
17367A27679j1487n5497j2961k918j6264p175l3984k6133J8013L6523J0493J7048
$$ 127679 116192 60695 47734 44816 28552 21377 -12607 -38740 -20727 15796 26289 43337
17355D3337M2572K1763k2588L812j0064k7926j2188j1540O046N4672L0553l6666
$$ 43337 85909 107672 85084 88896 78832 50906 38718 27178 33224 87896 118449 81783
17343H1783k2186j0882L955K498k6391k2515k303K5288L1994J4412j6748j4307
$$ 81783 59597 48715 52670 55168 28777 6262 3959 29247 61241 75653 58905 44598
17331D4598l253k9026k8061Q504R484j355k6670j2789K4014L6646M915J2268N215
$$ 44598 41345 12319 -15742 -7238 2246 891 -25779 -38568 -14554 22092 27007 39275 44490
17318D4490m63l81J3910J8080K2598M1459L9154L2933o711j8971p9525n1755J0417
$$ 44490 44027 43646 57556 75636 98234 139693 178847 211780 205069 186098 106573 54818 65235
17305F5235K8501O1320P1674K1459K561K1111r718k7868k8028l5971m0977r938
$$ 65235 93736 155056 226730 248189 250750 271861 262143 234275 206247 170276 129299 119361
17293A19361J8938J4252Q079l6290j136j0306k0045j8048N40N938o704j9530l1544
$$ 119361 138299 152551 160630 124340 123204 112898 92853 74805 75345 81283 74579 55049 23505
17280B3505K3921K0645Q707J1872L373j4361j4459k6676J6700p899q024L5808
$$ 23505 47426 68071 76778 88650 92023 77662 63203 36527 53227 45328 37304 73112
17268G3112p388P539K5108j6487L164O449K5982M5675N3369n701k7511r338o119
$$ 73112 65724 73263 98371 81884 85048 91497 117479 163154 216523 210822 183311 173973 167854
17255A67854j3736p973k4107K0682k52j6414Q075K1886j0142m4676l2462j3863
$$ 167854 154118 146145 122038 142720 142468 126054 134129 156015 145873 101197 68735 54872
17243E4872J5948o879K5223Q671K069l605k2559j7301n242J5424p905l3232p110
$$ 54872 70820 63941 89164 97835 99904 96299 73740 56439 51197 66621 58716 25484 18374
17230A8374k428p133M92P373n181N364K7728Q519J4798j1554J0210j7698J1184
$$ 18374 15946 8813 9305 16678 11497 16861 44589 53108 67906 56352 66562 48864 60048
17217F0048J7783j1542k0162o482k5395o0486q940K5262O1848M1398k9885j8433
$$ 60048 77831 66289 46127 39645 14250 -46236 -55176 -29914 31934 73332 43447 25014
17205B5014K9215J0200l9225m5145k1022J3028M2230L1338j1701o897Q568k3519
$$ 25014 54229 64429 25204 -19941 -40963 -27935 14295 45633 33932 27035 35603 12084
17193A2084k2506J0205K6783O82j2477j2257o868J0144L0255p107R712M378k1806
$$ 12084 -10422 -217 26566 27248 14771 2514 -4354 5790 36045 28938 38650 43028 21222
17180B1222N733k1263k4903k2939R635K3178K5827J0677n7256j8990J0360K2609
$$ 21222 26955 5692 -19211 -42150 -32515 -9337 16490 27167 -30089 -49079 -38719 -16110
17168a6110J8196M387q11j403J3176l6211l5951K5602K7096n348N747l5182j4407
$$ -16110 2086 6473 5662 4259 17435 -18776 -54727 -29125 -2029 -7377 -1630 -36812 -51219
17155e1219j2147j6058K4372M3901O955j7222m456j4557K6521K7653r545J801
$$ -51219 -63366 -79424 -55052 -11151 -4196 -21418 -25874 -40431 -13910 13743 4198 5999
17143E999K476L923k031k1666j5788k550L3707J956k9271j2427k1159o562J946
$$ 5999 8475 12398 10367 -11299 -27087 -29637 4070 6026 -23245 -35672 -56831 -63393 -61447
17130f1447J6430k0012K7769J1306L6263J7501K0211l774j9006q317j5885J0380
$$ -61447 -45017 -65029 -37260 -25954 10309 27810 48021 44247 25241 16924 1039 11419
17118A1419j5304n5927J48J8580j2828j5733O3372M4328j0483j6797k7553l32
$$ 11419 -3885 -59812 -59664 -41084 -53912 -69645 -6273 38055 27572 10775 -16778 -17110
17106a7110k0786o935Q520J3201j2025j0907j4444L1198L7994L1116l8676K448
$$ -17110 -37896 -44831 -36311 -23110 -35135 -46042 -60486 -29288 8706 39822 1146 3594
17094C594k1070k0389M1899J4438j2803n78k905P855J7185Q184J4049M130K2033
$$ 3594 -17476 -37865 4034 18472 5669 5091 2186 10041 27226 35410 49459 53589 75622
17081G5622K3873M7628L1570M675m450j2870r508o3388o7206k8993J2022J7632
$$ 75622 99495 147123 178693 183368 178918 166048 156540 93152 25946 -3047 8975 26607
17069B6607M1082M16r939l7570j0288J3675k0212k7820N4073L9554l0557J9889
$$ 26607 67689 68105 58166 20596 10308 23983 3771 -24049 30024 69578 39021 58910
17057E8910r492o625J1970J4411j8093q591k4377J4816K3472j4696j4189n711
$$ 58910 49418 42793 54763 69174 51081 42490 18113 32929 56401 41705 27516 21805
17045B1805j722k029M8580J1262N3o640q172K0937P774k7109L1015k4624j0253
$$ 21805 20083 18054 66634 77896 77949 71309 63137 84074 91848 64739 95754 71130 60877
17032F0877K1836N2213P8948Q6713M3473l555l9058o0573m9181p9483n6246j0739
$$ 60877 82713 134926 213874 300587 344060 340505 301447 240874 191693 112210 55964 45225
17020D5225L9879l509l1855m3208N958P186j0032J1369m509n0643m5400L8675
$$ 45225 85104 81595 49740 6532 12490 19676 9644 21013 16504 -34139 -79539 -40864
17008d0864L7279L5693O122L050k2003m0716m0325k7062K3539J1451J286K6199
$$ -40864 -3585 32108 38230 41280 19277 -21439 -61764 -88826 -65287 -53836 -52550 -26351
16996b6351J8691L9866L540m0909N688L3374L7133j6213r550J9052K88m4751q116
$$ -26351 -7660 32206 35746 -5163 525 33899 71032 54819 45269 64321 64609 19858 11742
16983A1742K0308L0161K2347L6336j1321j4936J0491P933l5258j7676O28j0182
$$ 11742 32050 62211 84558 120894 109573 94637 105128 113061 77803 60127 60755 50573
16971E0573j7296J8950q986n3442N41J1039j0197l512k6515M124K722J2583J8125
$$ 50573 33277 52227 43241 -10201 -9660 1379 -8818 -12330 -38845 -34721 -31999 -19416 -1291
16958a291K3266r732q882l2743J654k3648J3412J4104j582M218j0220j056L1312
$$ -1291 21975 12243 3361 -29382 -27728 -51376 -37964 -23860 -25442 -21224 -31444 -32500 -1188
16945a188J8281p875j3870k6836j5056j7405J5501L2744K7104k512l0853j2180
$$ -1188 17093 9218 -4652 -31488 -46544 -63949 -48448 -15704 11400 8888 -21965 -34145
16933c4145L543p114j138Q645k067L3527K5342J3985l0428k0423m804j8916j1989
$$ -34145 -30602 -37716 -38854 -30209 -32276 1251 26593 40578 10150 -10273 -15077 -33993 -45982
16920d5982p40R575r821j9890J1811K3001N0878L166l2760k0959n687j7026K8977
$$ -45982 -46722 -37147 -46968 -66858 -55047 -32046 18832 21998 -10762 -31721 -37408 -54434 -25457
16907b5457O002M573j0687j505j8249m557J6246k5740J6410K9070p729l3380j0639
$$ -25457 -19455 -14882 -25569 -27074 -45323 -49880 -33634 -59374 -42964 -13894 -21623 -55003 -65642
16894f5642J1269J5111N86N901L1402j5587n2108O222M0322j984r097J5893J4511
$$ -65642 -54373 -39262 -38676 -32775 -1373 -16960 -69068 -62846 -22524 -24508 -33605 -17712 -3201
16881c201J4192N967j7576k1227r964j3248K749J3924l5788k1790L3217N1609
$$ -3201 10991 16958 -618 -21845 -31809 -45057 -42308 -28384 -64172 -85962 -52745 -1136
16869a136l559l6232J909J7343m412J2606k7297k6045K0232k345k1597J4258R139
$$ -1136 -4695 -40927 -39018 -21675 -26087 -13481 -40778 -66823 -46591 -48936 -70533 -56275 -47136
16856d7136j0878o433m363K2973J1319r112j1881r89K1311k0861k2520N1226J7003
$$ -47136 -58014 -64447 -68810 -45837 -34518 -43630 -55511 -56500 -35189 -56050 -78570 -27344 -10341
16843a0341J3357j1726m8779l5445J3417K9839J1227j3889o838K0414J0567o715
$$ -10341 3016 -8710 -57489 -92934 -79517 -49678 -38451 -52340 -59178 -38764 -28197 -34912
16831c4912n100L843N168O896M4291M219k2331j6937k0548j4907L5678L7104j5247
$$ -34912 -40012 -36169 -31001 -24105 20186 24405 2074 -14863 -35411 -50318 -14640 22464 7217
16818G217k4389L280k0096K6681L0765J5714K437m084l6656M058K5456K7448l7098
$$ 7217 -17172 -13892 -33988 -7307 23458 39172 41609 37525 869 4927 30383 57831 20733
16805B0733j1176J0729J7344L289m7562j9344J4981J5889K90k0248L2057K2422
$$ 20733 9557 20286 37630 40919 -6643 -25987 -11006 4883 5173 -15075 16982 39404
16793C9404m9415k9880L6446M422k0737m241L4887o724n1975K3575J5020j6052
$$ 39404 -10011 -39891 -3445 977 -19760 -24001 10886 4162 -47813 -24238 -9218 -25270
16781b5270j436J3621l1206l7251k1762K1613N073M3960L6303Q05j8634M14L817
$$ -25270 -26706 -13085 -44291 -81542 -103304 -81691 -76618 -32658 3645 4450 -14184 -13770 -9953
16768i953J9747j9385o3742L231J5573L8877J7543j4198l113k4545j6178K0426
$$ -9953 9794 -9591 -73333 -70102 -54529 -15652 1891 -12307 -15420 -39965 -56143 -35717
16756c5717k0314K500K3326R502K6225L0733m213o173j4143j5732l9867L434K4453
$$ -35717 -56031 -53531 -30205 -20703 5522 36255 32042 25869 11726 -4006 -43873 -40439 -15986
16743a5986K301K0453K5315K4524J8784K6122j7j2732l7045k7278l5118j9103
$$ -15986 -13685 6768 32083 56607 75391 101513 101496 88764 51719 24441 -10677 -29780
16731b9780M041J7228Q1k6709l486J1591J3398N360P496L9862K8308k2760k0739
$$ -29780 -25739 -8511 -8430 -35139 -38625 -27034 -13636 -8276 -780 39082 67390 44630 23891
16718B3891L788K04J3037K764L127O150k4039m720L7284k999m9183n9798k0090
$$ 23891 27679 27883 40920 43684 46811 52961 28922 24202 61486 58487 9304 -50494 -70584
16705g0584k327K713K1588M5261n889j7948r002J6781J8164Q789j2147l147j7424
$$ -70584 -72911 -70198 -48610 -3349 -9238 -27186 -36188 -19407 -1243 7546 -4601 -7748 -25172
16692b5172K3611L98n3825j0500L9316M31r688J054K372N243J9484M621j8151
$$ -25172 -1561 -1163 -54988 -65488 -26172 -25741 -35429 -34375 -32003 -26760 -7276 -2655 -20806
16679b0806J1573M1036J3936j1659m8012k8163m194L4857L7180L2232P206l1133
$$ -20806 -9233 31803 45739 34080 -13932 -42095 -46289 -11432 25748 57980 65186 34053
16667C4053m3170m7828m0954L906L4685J6308K1660J0572k2965o527L378j0208
$$ 34053 -9117 -56945 -97899 -93993 -59308 -43000 -21340 -10768 -33733 -40260 -36882 -47090
16655d7090k1214L9640K4848K1920k1493J551n450k2505L516J3049J2997J8625
$$ -47090 -68304 -28664 -3816 18104 -3389 -1838 -7288 -29793 -26277 -13228 -231 18394
16643A8394K9696k8309M8302K6840n4999j6895K1216j9390O116P131P944j4346
$$ 18394 48090 19781 68083 94923 39924 23029 44245 24855 30971 38102 46046 31700
16631C1700J5575l0277k9585j7929Q012j3045k0063N431q919J6899L5213j8189
$$ 31700 47275 16998 -12587 -30516 -22504 -35549 -55612 -50181 -59100 -42201 -6988 -25177
16619b5177q572P753k444J1566J0176J0581j679j0649J5235Q779l108K1040K6563
$$ -25177 -33749 -25996 -28440 -16874 -6698 3883 2204 -8445 6790 15569 12461 33501 60064
16606F0064q06k2849l2826p389K1731L5460l206m0497k042l962K1328J6174j2061
$$ 60064 59258 36409 3583 -3806 17925 53385 50179 9682 7640 3678 25006 41180 29119
16593B9119q180r083j4685p686n727L297l425R425J5795k4358n1068R772O2922
$$ 29119 20939 11856 -2829 -10515 -16242 -12945 -16370 -6945 8850 -15508 -66576 -56804 6118
16580F118K6828J1079L0593k2270l1536j7959o0340j5048N0133O4942J1237K736
$$ 6118 32946 44025 74618 52348 20812 2853 -57487 -72535 -22402 42540 53777 56513
16568E6513l0510m580J1104K6171l6044m4334j9905k2369k7247j7931L959M9608
$$ 56513 26003 21423 32527 58698 22654 -21680 -41585 -63954 -91201 -109132 -105173 -55565
16556e5565L3197k5523k5715K5361L2367k169j1571l4262m880j8515q510L2494
$$ -55565 -22368 -47891 -73606 -48245 -15878 -18047 -29618 -63880 -68760 -87275 -95785 -63291
16544f3291K3994j2923K4864P374k494k6737N428K3771K352j356o392L183K0626
$$ -63291 -39297 -52220 -27356 -19982 -22476 -49213 -43785 -20014 -17662 -19018 -25410 -22227 -1601
16531a601l5398n984L7200N460l4186J3946k2527J3220r684o776Q660J7961Q762
$$ -1601 -36999 -42983 -5783 -323 -34509 -20563 -43090 -29870 -39554 -46330 -37670 -19709 -10947
16518a0947p055P642r133j2084N644J8774j3788J2656L7001J3477k3799j5661
$$ -10947 -18002 -10360 -19493 -31577 -25933 -7159 -20947 -8291 28710 42187 18388 2727
16506B727l807m428l6435l3195J2436N2112J5827k556j3009k2509N964J4926r677
$$ 2727 -1080 -5508 -41943 -75138 -62702 -10590 5237 2681 -10328 -32837 -26873 -11947 -21624
16493b1624k736m531k3631J2315J8693k9664m543K483M727j774J0891k501J1698
$$ -21624 -24360 -28891 -52522 -40207 -21514 -51178 -55721 -53238 -48511 -50285 -39394 -41895 -30197
16480c0197j277r829J0338k5451j1279L1563K7632j6750l8325j7902K020j091
$$ -30197 -31474 -41303 -30965 -56416 -67695 -36132 -8500 -25250 -63575 -81477 -79457 -80548
16468h0548K6006L8266L2502l626j3275k8165p109l191p246K348J6044n558o367
$$ -80548 -54542 -16276 16226 12600 -675 -28840 -35949 -39140 -46386 -44038 -27994 -33552 -39919
16455c9919J7404K2197N836O778J5886k0516n1615J1293K4488l875k8003N0696
$$ -39919 -22515 -318 5518 12296 28182 7666 -43949 -32656 -8168 -12043 -40046 10650
16443A0650K5899j3338j5052j2365k8971n691J3814j195j6964j3565J7320Q887
$$ 10650 36549 23211 8159 -4206 -33177 -38868 -25054 -26249 -43213 -56778 -39458 -30571
16431c0571l7443l748K4430J8509j6980q784Q868L5839M08j1409j0731L630J5118
$$ -30571 -68014 -71762 -47332 -28823 -45803 -54587 -45719 -9880 -9472 -20881 -31612 -27982 -12864
16418a2864K7887K621n703q356j9918l4842M5997K9474l4262Q968K1803J899j4375
$$ -12864 15023 17644 11941 3585 -16333 -51175 -5178 24296 -9966 -998 20805 22704 8329
16405H329j7106K312o790M0913N120l2897l5151j4654K5787j5000n779J9521K7917
$$ 8329 -8777 -6465 -13255 27658 32778 -119 -35270 -49924 -24137 -39137 -44916 -25395 2522
16392B522n926o4512j1235K6470M458Q464J4872K21j291K5024K2988l503j3494
$$ 2522 -3404 -67916 -79151 -52681 -48223 -39759 -24887 -24666 -25957 -933 22055 18552 5058
16379E058j2193N494l172o251k850J0361l107k1665l5814j3849K2825o051J968
$$ 5058 -7135 -1641 -4813 -11064 -13914 -3553 -6660 -28325 -64139 -77988 -55163 -61214 -59246
16366e9246r69r16K1805J0449M3792J8245n5131m6103j6347K4126K5816K1183
$$ -59246 -60215 -61131 -39326 -28877 14915 33160 -21971 -68074 -84421 -60295 -34479 -13296
16354a3296j165j5950J4565J6464k1309l2078R132k1381J9098M4872j349m525
$$ -13296 -14461 -30411 -15846 618 -20691 -52769 -43637 -65018 -45920 -1048 -2397 -6922
16342f922K5060K7591j5314m5081k1452j8914J3015K3467K0782l933J8000p459
$$ -6922 18138 45729 30415 -14666 -36118 -55032 -42017 -18550 2232 -1701 16299 8840
16330H840o859j1789k8043J1134J8576J1047L2963j3658k3337k9375L367P193
$$ 8840 1981 -9808 -37851 -26717 -8141 2906 35869 22211 -1126 -30501 -27134 -19941
16318a9941l4398M4417L7156j7123m1470j5842J6392J9534R184k118L6267k0940
$$ -19941 -54339 -9922 27234 10111 -31359 -47201 -30809 -11275 -2091 -4209 32058 11118
16306A1118j3487n313q256l1526r169R154L1395K166j3635K2604L7050L8902J5036
$$ 11118 -2369 -7682 -15938 -47464 -56633 -47479 -16084 -13918 -27553 -4949 32101 71003 86039
16293H6039k4010k2798J5379o699j7487j1779n2686k8873J9938J182j7049J5178
$$ 86039 62029 39231 54610 47911 30424 18645 -34041 -62914 -42976 -41794 -58843 -43665
16281d3665M066k1059J1582L5449K4102J4623q447j7957k9812l5903j7815K498
$$ -43665 -39599 -60658 -49076 -13627 10475 25098 16651 -1306 -31118 -67021 -84836 -82338
16269h2338K1370J6557K210L9693M1534k8477j9514j8609Q053J3186j4168L6015
$$ -82338 -60968 -44411 -42201 -2508 39026 10549 -8965 -27574 -19521 -6335 -20503 15512
16257A5512J667k714r690P286K2379J5249j4700M695j3209l8541N242j5392k9044
$$ 15512 17179 14465 4775 12061 34440 49689 34989 39684 26475 -12066 -6824 -22216 -51260
16244e1260M8384K4464j8980l4385k245j888J2042j1819p837J6929J3230L030
$$ -51260 -2876 21588 2608 -31777 -34022 -35910 -23868 -35687 -43524 -26595 -13365 -10335
16232a0335q494j0624K7579j46O634m0116j2301j310K5774J7891J2404j6190j2497
$$ -10335 -18829 -29453 -1874 -2020 4614 -35502 -47803 -49113 -23339 -5448 6956 -9234 -21731
16219b1731j1837n70R547K8480J4105l5071m7569N75M0417L1947M757k2214k931
$$ -21731 -33568 -34138 -24591 3889 17994 -17077 -64646 -64071 -23654 8293 13050 -9164 -12095
16206a2095M4686j4114l9475J6211J473P944L9611J8851r738q689q269J9958K120
$$ -12095 32591 18477 -20998 -4787 -3314 4630 44241 63092 53354 44665 36396 56354 58474
16193E8474o416p471k9309j6848k2648k5127l5765J4555q4P9K5418L8137K225
$$ 58474 52058 44587 15278 -1570 -24218 -49345 -85110 -70555 -70639 -70560 -45142 -7005 -4780
16180d780l0857J9933R894l8792l0790K9968J8314j1839j743J4673j9980o211
$$ -4780 -35637 -15704 -5810 -44602 -75392 -45424 -27110 -38949 -40692 -26019 -45999 -52210
16168e2210J1854L1256j0161k6228L012k005J9793J6138k3246m3585o956M5789
$$ -52210 -40356 -9100 -19261 -45489 -42477 -44482 -24689 -8551 -31797 -75382 -82338 -36549
16156c6549K2826p880J1288R651M4477k5437l8156k1322k2311o010L7241K6634
$$ -36549 -13723 -21603 -10315 -664 43813 18376 -19780 -41102 -63413 -69423 -32182 -5548
16144e548K5942n786l8458j1886j3010M913J1758K6311K4515Q38L219J6713j215
$$ -5548 20394 14608 -23850 -35736 -48746 -43833 -32075 -5764 18751 19589 22808 39521 38306
16131C8306R36M605l8465k5240M190l3982o766J4740j1840O111J1059J5493l301
$$ 38306 39242 43847 5382 -19858 -15668 -49650 -56416 -41676 -53516 -47405 -36346 -20853 -24154
16118b4154P79L3237K0962n621l2614k3632K4820J3751m169m4292j5845j6309
$$ -24154 -23375 9862 30824 25203 -7411 -31043 -6223 7528 3359 -40933 -56778 -73087
16106g3087l129j1436K4661M6824K0777j0301J0008J3402J207q915p403k7866
$$ -73087 -76216 -87652 -62991 -16167 4610 -5691 4317 17719 18926 10011 2608 -25258
16094b5258k2208M5837Q587J5608K1847j1860q796l3309J480o180K2109J1522
$$ -25258 -47466 -1629 6958 22566 44413 32553 23757 -9552 -8072 -14252 7857 19379
16082A9379p108k1866j3371l7043M810L7576j7204k2257j463L4140L5163L611
$$ 19379 12271 -9595 -22966 -60009 -55199 -17623 -34827 -57084 -58547 -24407 10756 14367
16070A4367j4661n074j7142J2510j763k2535o136k770N293K1654K499J765J2689
$$ 14367 -294 -5368 -22510 -10000 -11763 -34298 -40434 -43204 -37911 -16257 -13758 -11993 696
16057F96R8j3887n569p43j9109M321L1035K1799L754l3224k0257K826j6284l7295
$$ 696 794 -13093 -18662 -19405 -38514 -34193 -3158 18641 22395 -10829 -31086 -28260 -44544 -81839
16043h1839j2786L652K6174J7931K2678k6423J2373M0499J2065L7359j1032k0365
$$ -81839 -94625 -90973 -64799 -46868 -24190 -50613 -38240 2259 14324 51683 40651 20286
16031B0286J0470q654N448J5332J0565j8137m6818m8010K3260J5204j12K0916
$$ 20286 30756 22102 27550 42882 53447 35310 -11508 -59518 -36258 -21054 -21166 -250
16019b50j1080k7315k7237J7067K9577J8655K9963j0228m5282k4054P354J3858
$$ -250 -11330 -38645 -65882 -48815 -19238 -583 29380 19152 -26130 -50184 -42830 -28972
16007b8972L3823J5624k3990l7306j454j0687O033J3660m656k7971j0318J1752
$$ -28972 4851 20475 -3515 -40821 -42275 -52962 -46929 -33269 -37925 -65896 -76214 -64462
15995f4462M8606Q530o057n5422K6128K6721j1182k063M551j4088M525J0082j5334
$$ -64462 -15856 -7326 -13383 -68805 -42677 -15956 -27138 -29201 -24650 -38738 -34213 -24131 -39465
15982c9465K1399k7352J444J5383p12o792j3340P660M7107J0688P262j2378j5933
$$ -39465 -18066 -45418 -43974 -28591 -29303 -36095 -49435 -41775 5332 16020 23282 10904 -5029
15969e029J2290j3083J7533J0218k423q335j2307m946J1744L3665j3101j2264
$$ -5029 7261 -5822 11711 21929 19506 11171 -1136 -6082 5662 39327 26226 13962
15957A3962M167K2284J4464k9912l2021l105K029p543j9772Q793K9288k2256k2553
$$ 13962 18129 40413 54877 24965 -7056 -10161 -8132 -15675 -35447 -26654 2634 -19622 -42175
15944d2175L2354M3334l846J0788J0608o2954m9968q354L4705K8608j5136p466
$$ -42175 -9821 33513 29667 40455 51063 -11891 -61859 -70213 -35508 -6900 -22036 -29502
15932b9502n810j7910j7393J6884M460J36J3845K4906j5083Q766m236k5813j874
$$ -29502 -35312 -53222 -70615 -53731 -49271 -49135 -35290 -10384 -25467 -16701 -20937 -46750 -48624
15919d8624K9093P122O231r444p756J9100J8244p998J1749o424n561r405L6465
$$ -48624 -19531 -12409 -6178 -15622 -23378 -4278 13966 5968 17717 11293 5732 -3673 32792
15906C2792N441n6047p121J4994p635J2420l599K832k2954J7140P117J7306m26
$$ 32792 38233 -17814 -24935 -9941 -17576 -5156 -8755 -5923 -28877 -11737 -4620 12686 12260
15893A2260J0394l5897J5906J8684j4083r491j1658j3254q678j515K9809R327
$$ 12260 22654 -13243 2663 21347 7264 -2227 -13885 -27139 -35817 -37332 -7523 1804
15881A804j6353J6059p826J4203K8215j8294K4342o849N310k0886l0145j0208
$$ 1804 -14549 1510 -6316 7887 36102 17808 42150 35301 40611 19725 -10420 -20628
15869b0628J9013j9399j5753O882J7287R928k220Q678m631P78J9710j9760k4800
$$ -20628 -1615 -21014 -36767 -29885 -12598 -2670 -4890 3788 -843 -65 19645 -115 -24915
15856b4915K965J1230O84L220J9190o867J3335k9314n6898J655O355k0749K6682
$$ -24915 -21950 -10720 -10036 -6816 12374 5507 18842 -10472 -67370 -65715 -59360 -80109 -53427
15843e3427Q305p29K1555J3379K546j3984L0413j1696j4247J5255r293l573J1611
$$ -53427 -45122 -45851 -24296 -10917 -8371 -22355 8058 -3638 -17885 -2630 -11923 -15496 -3885
15830c885J3332j1280k9027K8065K4026l5503n890J9201L0895Q708J1619J3093
$$ -3885 9447 -1833 -30860 -2795 21231 -14272 -20162 -961 29934 38642 50261 63354
15818F3354k0133j6753l299K185L210l9770j3519J4234j0728j1778l437J8869
$$ 63354 43221 26468 23169 25354 28564 -11206 -24725 -10491 -21219 -32997 -36434 -17565
15806a7565J5125r164j6233K3393J6331M913j9526j815K989J1628J1030P478j3026
$$ -17565 -2440 -11604 -27837 -4444 11887 16800 -2726 -4541 -1552 10076 21106 28584 15558
15793A5558r208M2546j6299j7024o461k4223J602k952l627J0495J0825r646k2182
$$ 15558 6350 48896 32597 15573 9112 -15111 -13509 -16461 -20088 -9593 1232 -8414 -30596
15780c0596j7288K6454J2960j9076R850Q141j7683J8941J3298j109L0953j0293
$$ -30596 -47884 -21430 -8470 -27546 -17696 -9555 -27238 -8297 5001 3892 34845 24552
15768B4552k4832K600o240k0466J3921J5793K4843l869o062j3912j2078J634P502
$$ 24552 -280 2320 -3920 -24386 -10465 5328 30171 26302 20240 6328 -5750 -4116 3386
15755C386K8580k4627j6450j7460j243o400J0748L0652K4442R101l3783m3019
$$ 3386 31966 7339 -9111 -26571 -27814 -34214 -23466 7186 31628 40729 6946 -36073
15743c6073j5642j5116L7158K3684L2194j6403l1361K3855Q202J6430J9320l7137
$$ -36073 -51715 -66831 -29673 -5989 26205 9802 -21559 2296 10498 26928 46248 9111
15731I111j7867m0078m1855j0986K2529L0922K3736J4108j9486p290o490p300
$$ 9111 -8756 -48834 -90689 -101675 -79146 -48224 -24488 -10380 -29866 -37156 -43646 -50946
15719e0946N881Q955M1542L6285L3822Q146m0654n1859K359o701o061l8969J0300
$$ -50946 -45065 -36110 5432 41717 75539 83685 43031 -8828 -6469 -13170 -19231 -58200 -47900
15706d7900J4577n14K5754K6403K117o5710k4332K2469m3879P567K1848K9880
$$ -47900 -33323 -33837 -8083 18320 20437 -45273 -69605 -47136 -91015 -83448 -61600 -31720
15694c1720J8894j2070k79J6388M32l960k7978k887J2365K8742k1740K8346k4475
$$ -31720 -12826 -24896 -25175 -8787 -8355 -12315 -40293 -43180 -30815 -2073 -23813 4533 -19942
15681a9942l2599J5249K4633m454J8857m2533k8245K1050K491J3869L7232M651
$$ -19942 -52541 -37292 -12659 -17113 1744 -40789 -69034 -47984 -45493 -31624 5608 10259
15669A0259j6551j5691J6936N343j7260j1745R966K092M4211j3705q05k345m518
$$ 10259 -6292 -21983 -5047 296 -16964 -28709 -18743 -16651 27560 13855 13050 10705 6187
15656F187J2780q791k2739K4170j1237n34J4036n058l45l0151q554k0481M528
$$ 6187 18967 10176 -12563 11607 370 -164 13872 8814 8469 -21682 -30236 -50717 -46189
15643d6189K7287L2946j4528m2344j651q592J2206K0292K9639J0143j0522k1197
$$ -46189 -18902 14044 -484 -42828 -44479 -53071 -40865 -20573 9066 19209 8687 -12510
15631a2510M420j8721n927J274J73j1702j4773j7908j6120k6185J5661O0091K4493
$$ -12510 -8090 -26811 -32738 -31464 -31291 -42993 -57766 -75674 -91794 -117979 -102318 -42227 -17734
15618a7734k560n0027r387n670r264J9662k542L481L1743J4131P970k441k0317
$$ -17734 -20294 -70321 -79708 -85378 -94642 -74980 -77522 -74041 -42298 -28167 -20197 -22638 -42955
15605d2955J1260J3371J2020P124l416J5413J4149J4984l5666k3548J4663L4862
$$ -42955 -31695 -18324 -6304 820 -2596 12817 26966 41950 6284 -17264 -2601 32261
15593C2261K0548K4383l0351k3716k412k7362K555L4489N296K4372k3335j3235
$$ 32261 52809 77192 46841 23125 20713 -6649 -4094 30395 35691 60063 36728 23493
15581B3493l5120K68O463J3511K8126l894p899J0222K5956M195j1663N690K0301
$$ 23493 -11627 -11359 -4896 8615 36741 32847 24948 35170 61126 65321 53658 59348 79649
15568G9649j2336k1092j4507J1728q289n662J9808k0822l4565r860L2308K492
$$ 79649 67313 46221 31714 43442 35153 29491 49299 28477 -6088 -15948 16360 18852
15556A8852m968J3833R565m5772j2808j7218N054o869N407L6350j4516k367L873
$$ 18852 13884 27717 37282 -8490 -21298 -38516 -33462 -40331 -34924 1426 -13090 -15457 -11584
15543a1584P255L5455k7927l0532L689P755M2108K5477l5896k3524n625K2022
$$ -11584 -4329 31126 3199 -27333 -23644 -15889 26219 51696 15800 -7724 -13349 8673
15531H673L6445j0905M34P856l3840j6694j2287p069J4246l4093J6000K6594l4708
$$ 8673 45118 34213 34647 42503 8663 -8031 -20318 -27387 -13141 -47234 -31234 -4640 -39348
15518c9348k5593K280j1660k2278K3294L5561J5710J5874P043R447k4089k3137
$$ -39348 -64941 -62661 -74321 -96599 -73305 -37744 -22034 -6160 883 10330 -13759 -36896
15506c6896l5073j3508M60K583M3740L5777J4093k0332o569k256j1315J0075L8884
$$ -36896 -71969 -85477 -85017 -82434 -38694 -2917 11176 -9156 -15725 -17981 -29296 -19221 19663
15493A9663J6978J9891j9572k8784j3794J8960L849k1369l1469j0487K5398L0121
$$ 19663 36641 56532 36960 8176 -5618 13342 17191 -4178 -35647 -46134 -20736 9385
15481I385J0615k4543K32k6311L774L367K9707l125P372J3326k8755k2124P343
$$ 9385 20000 -4543 -4311 -30622 -26848 -23481 6226 3101 10473 23799 -4956 -27080 -19737
15468a9737L1976K0423l4215l4888J9840N425K0656J0367M881j1817m3376K6229
$$ -19737 12239 32662 -1553 -36441 -16601 -11176 9480 19847 24728 12911 -30465 -4236
15456d236L0183k0721k2726l314J6083K3310o826M278j775M223K881k3768O921
$$ -4236 25947 5226 -17500 -20814 -4731 18579 11753 16031 14256 18479 21360 -2408 4513
15443D513j0110k4911K221J591j7819p866p073L5449j0721k8331N489J0291J1095
$$ 4513 -5597 -30508 -28287 -26696 -44515 -52381 -59454 -24005 -34726 -63057 -57568 -47277 -36182
15430c6182M188K7512P611R32n268j33J7118K9258k4631j5844p898o613j2636
$$ -36182 -31994 -4482 3129 4061 -1207 -1340 15778 45036 20405 4561 -3337 -9950 -22586
15417b2586K8365l2361k9013L955J8946q757j3868J4759J1829M328K923j2548
$$ -22586 5779 -26582 -55595 -51640 -32694 -41451 -55319 -40560 -28731 -24403 -21480 -34028
15405c4028j5598L2580l56k1702K8530J4408k0505J806J7648K8233L0562K3847
$$ -34028 -49626 -17046 -17402 -39104 -10574 3834 -16671 -14865 2783 31016 61578 85425
15393H5425l5412N172k5066j3287K9687q126k4720k5842J4319K6075k3371N294
$$ 85425 50013 55185 30119 16832 46519 38393 13673 -12169 2150 28225 4854 10148
15381A0148J9829Q527J513O337n1154k313j0578j9994K6360K1853o95n761K0569
$$ 10148 29977 38504 40017 46354 -4800 -7113 -17691 -37685 -11325 10528 9833 4072 24641
15368B4641p272R609l2104j4290l955k9220K638K9786M2690j3052k4589k0746
$$ 24641 17369 26978 -5126 -19416 -23371 -52591 -49953 -20167 22523 9471 -15118 -35864
15356c5864o849J3915K5964O739J4562J4484L7508k586l4667j49j7559P361J5238
$$ -35864 -42713 -28798 -2834 3905 18467 32951 70459 67873 33206 33057 15498 22859 38097
15343C8097K353k4021m3862j8295k780P498L1424O020Q648j0558L928l3089o765
$$ 38097 40450 16429 -27433 -45728 -48508 -41010 -9586 -3566 5082 -5476 -1548 -34637 -41402
15330d1402L3824k7110j4833L551J6766l557j8464J9934J4082j1772L6087Q865
$$ -41402 -7578 -34688 -49521 -45970 -29204 -32761 -51225 -31291 -17209 -28981 7106 15971
15318A5971K660J8894j8546l9965n851J3354J6760K9731M6921k7688k8644k3213
$$ 15971 18631 37525 18979 -20986 -26837 -13483 3277 33008 79929 52241 23597 384
15306C84J2174Q987l2013j6366k1168K218k1187N326N6182M5220j3344m7345k2116
$$ 384 12558 21545 -10468 -26834 -48002 -45784 -66971 -61645 -5463 39757 26413 -20932 -43048
15293d3048j0740p763m38J7811k93N906l063J4632K6149N716j8430o627k800K9841
$$ -43048 -53788 -61551 -61989 -44178 -44471 -38565 -41628 -26996 -847 4869 -13561 -20188 -22988 6853
15279F853K9608l1779k8142M999L8006L916P303l0652m679J0187k4471j6130m530
$$ 6853 36461 4682 -23460 -18461 19545 23461 30764 112 -4567 5620 -18851 -34981 -39511
15266c9511L3798J9667J5062k795k7575j6281J4800J6639r840j6729j8148m0035
$$ -39511 -5713 13954 29016 26221 -1354 -17635 -2835 13804 3964 -12765 -30913 -70948
15254g0948P099K1998L2733J3316k0302K1675K1168N731k1688l3844j0578J955
$$ -70948 -63849 -41851 -9118 4198 -16104 5571 26739 32470 10782 -23062 -33640 -31685
15242c1685p463r011J1275L4337k938m5380l721k394M952J7884K4737K2108L4005
$$ -31685 -39148 -48159 -36884 -2547 -5485 -50865 -54586 -56980 -52028 -34144 -9407 12701 46706
15229D6706J1170j3403m316k2360q323l6476o131L1015J1626l7384j8302k179
$$ 46706 57876 44473 40157 17797 9474 -27002 -33133 -2118 9508 -27876 -46178 -48357
15217d8357L5393J886j0463K9517Q421J3724K3874K4626m968p081J640r884q968
$$ -48357 -12964 -11078 -21541 7976 16397 30121 53995 78621 73653 66572 68212 58328 49360
15204D9360j36L7474K3766J0316r468k7447l3758l6221l3389K8757L3802j1822
$$ 49360 49224 86698 110464 120780 111312 83865 50107 13886 -19503 9254 43056 31234
15192C1234k4275j8277J626r725M7530n871j9900P745K3664k205Q79J8617M46
$$ 31234 6959 -11318 -9692 -19417 28113 22242 2342 10087 33751 31546 32425 51042 51488
15179E1488J053K5961j159k5733j1720K2835k0861l3378k9653r82r400l031L9174
$$ 51488 52541 78502 77343 51610 39890 62725 41864 8486 -21167 -22149 -31549 -34580 4594
15166D594J277k5470O889N1218P307J8673K593l5276k5879m569l1038k0716L2785
$$ 4594 5871 -19599 -12710 38508 45815 64488 67081 31805 5926 1357 -29681 -50397 -17612
15153a7612K9085k0850j6392L3389L0922o221m197j1992K3685r184Q842k6488
$$ -17612 11473 -9377 -25769 7620 38542 32321 28124 16132 39817 30633 39475 12987
15141A2987L954l208j8988K7273J0772l2468k2319j2250M17P841J2756k232J848
$$ 12987 16941 13733 -5255 22018 32790 322 -21997 -34247 -33830 -25989 -13233 -15465 -13617
15128a3617J5325J9310O292J9990j8607k7735k5293j3666l546K4471K8333K2752
$$ -13617 1708 21018 27310 47300 28693 958 -24335 -38001 -41547 -17076 11257 34009
15116C4009K4581k2828r470j9620j3285M5208L7938m031j6766k2498Q486J6118
$$ 34009 58590 35762 26292 6672 -6613 38595 76533 72502 55736 33238 41724 57842
15104E7842q639K104j8637k945M09p714N103M127k7292m7729k7533Q852p693P057
$$ 57842 49203 51307 32670 29725 30134 22420 27523 31650 4358 -43371 -70904 -62052 -69745 -62688
15090f2688M1597J5566k7205K2606O131k8700Q068l686j075L9151j6129p573K3647
$$ -62688 -21091 -5525 -32730 -10124 -3993 -32693 -24625 -28311 -29386 9765 -6364 -13937 9710
15077I710L0934K2217l503n1606j6686J9745J3223J6802m8918l6399L8805K4338
$$ 9710 40644 62861 59358 7752 -8934 10811 24034 40836 -8082 -44481 -5676 18662
15065A8662n63j7269m996j6128N37j0251Q303K4353j7587O116K1316j5623j4579
$$ 18662 18099 830 -4166 -20294 -19757 -30008 -21705 2648 -14939 -8823 12493 -3130 -17709
15052a7709J7432O30J1667K4721M3534l8956n8313l7025r283K3216K9863J032
$$ -17709 -277 353 12020 36741 80275 41319 -16994 -54019 -63302 -40086 -10223 -9191
15040i191J0882O74j6543J7335k7283j5672m4841P065K4682J4609K7595j1752
$$ -9191 1691 2365 -14178 3157 -24126 -39798 -84639 -77574 -52892 -38283 -10688 -22440
15028b2440k3198J3927N57K6491J1257k4604k348o684K5651N487L930N145j1520
$$ -22440 -45638 -31711 -31154 -4663 6594 -18010 -20358 -27042 -1391 4096 8026 13171 1651
15015A651m849p952L1174m44m2741o054j093j1879r531L8060J4221J2272l791
$$ 1651 -3198 -11150 20024 19580 -23161 -29215 -30308 -42187 -51718 -13658 563 12835 9044
15002I044m484k770m995J877m492j3095P520j6048r528j35p832j249J2415J7439
$$ 9044 4560 1790 -3205 -1328 -5820 -18915 -11395 -27443 -36971 -37106 -44938 -46187 -33772 -16333
14988a6333k8102L1322K6418k0535N14J4723M3357r65k320k6634l2420n0963N037
$$ -16333 -44435 -13113 13305 -7230 -6716 8007 51364 50399 48079 21445 -10975 -61938 -56901
14975e6901M0567K4814j5055l080N737j0620j3240l379l8457j2987L3166M4121
$$ -56901 -16334 8480 -6575 -9655 -3918 -14538 -27778 -31157 -69614 -82601 -49435 -5314
14963e314P837R222j2241k9334k20J750J485N2110M52P521R286j0044q240p095
$$ -5314 2523 11745 -496 -29830 -30050 -28300 -26815 25295 25747 33268 42554 32510 24270 17175
14949A7175j5855m832n077k9177j0722R39K9622J4742J8369K6645j5241k3266
$$ 17175 1320 -3512 -8589 -37766 -48488 -47549 -17927 -3185 15184 41829 26588 3322
14937C322L2660R226m0756Q35j1134j8823n603L0636n677j7297K7783L931k773
$$ 3322 35982 45208 4452 5287 -5847 -24670 -30273 363 -5314 -22611 5172 9103 6330
14924F330k5057K7342L9615L9898j7973m0683k9362O485L429M919K2107j1484
$$ 6330 -18727 8615 48230 88128 70155 29472 110 6595 10024 14943 37050 25566
14912B5566K1583R849l2316K0234L040j1376J0165j1786J3069K6890k2050q778
$$ 25566 47149 56998 24682 44916 47956 36580 46745 34959 48028 74918 52868 44090
14900D4090l874j2028o367j9829j5899J078k9105k2570J5860L5747L6123J9056
$$ 44090 40216 28188 21821 1992 -13907 -12829 -41934 -64504 -48644 -12897 23226 42282
14888D2282p292K4157M427j5612j6550k7248q320K2031k5765k2957j5872r902
$$ 42282 34990 59147 63574 47962 31412 4164 -4156 17875 -7890 -30847 -46719 -56621
14876e6621L642l156K8979r950m922J9048l261R537P483J1497J8514M804l1920
$$ -56621 -52979 -56135 -27156 -37106 -42028 -22980 -26241 -16704 -9221 2276 20790 25594 -6326
14863f326k7687n409L490M2101j4048J1329L1275J7656o2539n2324J5549O9393
$$ -6326 -34013 -39422 -35932 6169 -7879 3450 34725 52381 -10158 -62482 -46933 22460
14851B2460L2979j2674K464m9592l4454L7664m2018k1039m944L4887O8223K666
$$ 22460 55439 42765 45229 -4363 -38817 -1153 -43171 -64210 -69154 -34267 33956 36622
14839C6622k7310K324J4746o805j7163Q204L749j990k5102j1385J2087L2727n052
$$ 36622 9312 11636 26382 19577 2414 10618 14367 12377 -12725 -24110 -12023 20704 15652
14826A5652K0544J8552j2544k5709q475L322j0371R121J5762l6347m390j1074
$$ 15652 36196 54748 42204 16495 8020 11342 971 10092 25854 -10493 -14883 -25957
14814b5957K07K8729K9023K5302k487r728J7103k1052J1028j3791m1342P260J6723
$$ -25957 -25750 2979 32002 57304 54817 45089 62192 41140 52168 38377 -2965 4295 21018
14801B1018L78p517J9990J4388j7435o578J4849N9j4385m7860K6138j014l893
$$ 21018 21396 13879 33869 48257 30822 24244 39093 39152 24767 -23093 3045 2031 -1862
14788a862p759K358O924M8421k3437k1929M277P158k1507k8028K501L2842N34
$$ -1862 -9621 -7263 -339 48082 24645 2716 6993 14151 -7356 -35384 -32883 -41 493
14775D93J0828k8537K055P675K1297K637k774O590K2014J963l1209k1340j6222
$$ 493 11321 -17216 -15161 -7486 13811 16448 13674 20264 42278 44241 13032 -8308 -24530
14762b4530J2059J5784N556j5663j326Q745j4594q665J847J3950Q509M376M3904
$$ -24530 -12471 3313 8869 -6794 -8120 625 -13969 -22634 -20787 -6837 1672 6048 49952
14749D9952j2708j6262J902L945N17j4749K819J657l409k2130o545Q345l24J5187
$$ 49952 37244 20982 22884 26829 27346 12597 15416 17073 13664 -8466 -15011 -6666 -6990 8197
14735H197L7233m1937n2392L5798M5576k6484j5422l5514j2016K844R943J5235
$$ 8197 45430 3493 -48899 -13101 32475 5991 -9431 -44945 -56961 -54117 -44174 -28939
14723b8939J8644r156l4382n484K6342L2350o335k23m760O986K8637K9316K4132
$$ -28939 -10295 -19451 -53833 -59317 -32975 -625 -6960 -7183 -11943 -4957 23680 52996 77128
14710G7128k3708n3042N362L7140J1407j4683n3560J4630J9756j4181R574J751
$$ 77128 53420 378 5740 42880 54287 39604 -13956 674 20430 6249 15823 17574
14698A7574k814M333O579j1373K6907r03p499r140J880M520l477k1148l7091l0289
$$ 17574 14760 19093 25672 14299 41206 40303 32804 23664 25544 30064 26587 5439 -31652 -61941
14684f1941j5742J9080P393M073M157L1793K0621J8679j947J1988J0743k3878
$$ -61941 -77683 -58603 -51210 -47137 -42980 -11187 9434 28113 26166 38154 48897 25019
14672B5019l7905j251j3121o417K3068K4015P201r860J189K285q528j4183J2002
$$ 25019 -12886 -14137 -27258 -33675 -10607 13408 20609 10749 11938 14223 5695 -8488 3514
14659C514L6582L601j2554j081K502J1346k0638k6267J8670K7989J7069k9241
$$ 3514 40096 43697 31143 30062 32564 43910 23272 -2995 15675 43664 60733 31492
14647C1492k1731l784J3168M623J340k3457P722K5605j7748l3959r193K6205K0678
$$ 31492 9761 5977 19145 23768 25108 1651 9373 34978 17230 -16729 -25922 283 20961
14634B0961n136j6247M10M222J1063K7677J2441j4381j4080J8666j4279K2749
$$ 20961 15825 -422 -12 4210 15273 42950 55391 41010 26930 45596 31317 54066
14622E4066L6934J1980J3359j9257l4772j9427O667J32l0120j0009L901K822R676
$$ 54066 91000 102980 116339 97082 62310 42883 49550 49682 19562 9553 13454 16276 25952
14609B5952m346j4282P652n366J419j4626Q254Q036K7488J9744j3742j8123K4878
$$ 25952 21606 7324 14976 9610 11029 -3597 4657 12693 40181 59925 46183 28060 52938
14596E2938n046J2674J2109o5826k4070J0960N524n276l348J1932j2288n567K0571
$$ 52938 47892 60566 72675 6849 -17221 -6261 -737 -6013 -9361 2571 -9717 -15284 5287
14583E287m66M236J5991J9977r731Q67J9773N68k4999p60n856k0814p938K6128
$$ 5287 4821 9057 25048 45025 35294 36161 55934 56502 31503 30743 24887 4073 -3865 22263
14569B2263N1021n858l6015N393J7488J9764n333m6516l7446j0310q02m46M8812
$$ 22263 73284 67426 31411 36804 54292 74056 68723 22207 -15239 -25549 -26351 -26797 22015
14556B2015P997j0707O992j32k2071K0928K4757J7323N961k006l104j3665p587
$$ 22015 30012 19305 26297 26165 4094 25022 49779 67102 73063 71057 67953 54288 46701
14543D6701J0402l460k9048o788p974k3395k6799J8738K2206R913J8879K9882
$$ 46701 57103 53643 24595 17807 9833 -13562 -40361 -21623 583 10496 29375 59257
14531E9257o313k0965J669j5659k165K2232k7257N133j1439O757j7150j5350n977
$$ 59257 52944 31979 33648 17989 15824 38056 10799 15932 4493 11250 -5900 -21250 -27227
14518b7227Q74j9369K5799M8810K9693j7912l2223J4676J0151k1762j5935N900
$$ -27227 -26353 -45722 -19923 28887 58580 40668 8445 23121 33272 11510 -4425 1475
14506A475K8342n320j8983m9941n39j6724K352L2676L1144L228p530K2909l0582
$$ 1475 29817 24497 5514 -44427 -44966 -61690 -59338 -26662 4482 7710 180 23089 -7493
14493g493l5831J3873J9384k8889J8851Q817O041J1909Q655o045L0932P442n700
$$ -7493 -43324 -29451 -10067 -38956 -20105 -11288 -5247 6662 15317 9272 40204 47646 41946
14480D1946k2761l318Q005l1063j0097K2119J0539l5137k4933N269j1163n676
$$ 41946 19185 15867 23872 -7191 -17288 4831 15370 -19767 -44700 -39431 -50594 -56270
14468e6270o166L9124N0714M9030L1023j8125k7892k899m683k2151n5848o625
$$ -56270 -62436 -23312 27402 76432 107455 89330 61438 58539 53856 31705 -24143 -30768
14456c0768L899o13Q62Q275K2271J1108j9007n869p348O744j5639Q468p561J5621
$$ -30768 -26869 -27482 -26620 -18345 3926 15034 -3973 -9842 -17190 -10446 -26085 -17617 -25178 -9557
14442i557K0887k9630l247K8964R461J316J4349K8568K943j9913k0763m8408l9421
$$ -9557 11330 -18300 -21547 7417 16878 18194 32543 61111 64054 44141 23378 -25030 -64451
14429f4451P166L0296P410K1728P110K0091K2827K403J1203k6170m4585n514r386
$$ -64451 -57285 -26989 -19579 2149 9259 29350 52177 54580 65783 39613 -4972 -10486 -19872
14416a9872L4939J1668L0938k3155k4890j2078K0612J5445j3963J7341M5891M2192
$$ -19872 15067 26735 57673 34518 9628 -2450 18162 33607 19644 36985 82876 125068
14404A25068j5881l7515j8359j0749K678L2023j395k3718J0341j649k4814K744
$$ 125068 109187 71672 53313 42564 45242 77265 75870 52152 62493 60844 36030 38774
14392C8774K354j8621p868l0387j0858j152N3633N6250n609m7746j5573R947K2616
$$ 38774 41128 22507 14639 -15748 -26606 -27758 25875 82125 76516 28770 13197 23144 45760
14379D5760m174K031q263K3838J726Q739K6271J467r874J8729P76M331n82l265
$$ 45760 41586 43617 35354 59192 60918 69657 95928 97395 87521 106250 107026 111357 110775 107510
14365A07510k1798p496k3441j3243o537m3861j720Q525L42L622J2410M1026L8148
$$ 107510 85712 78216 54775 41532 34995 -8866 -10586 -2061 -1719 1903 14313 55339 93487
14352I3487k473J891k5991n8813l382M3193L1060J9420K1801J4535L0687J5230
$$ 93487 91014 92905 66914 8101 4719 47912 78972 98392 120193 134728 165415 180645
14340A80645J1655L8176M6864K9120M3205O9889J08790J25437J50380K14507K56987
$$ 180645 192300 230476 277340 306460 349665 419554 528344 653781 804161 1018668 1275655
14329A275655K35189N184k94051l56091k83131j65254j04997o4973o8254l4823
$$ 1275655 1510844 1516028 1221977 865886 582755 417501 312504 247531 179277 144454
14319A44454N533K4177j4196j2360j9905j7168j9504O773K467K7151L13j1830
$$ 144454 149987 174164 159968 147608 127703 110535 91031 97804 100271 127422 127735 115905
14307A15905L6329K6119m1606l5672k1934r521j7530L178J4352k3324j7695K2018
$$ 115905 152234 178353 136747 101075 79141 69620 52090 55268 69620 46296 28601 50619
14295E0619L110n026J1451k5654j758K5181J6035j614j3774j4786R813j4796L0477
$$ 50619 53729 48703 60154 34500 32742 57923 73958 72344 58570 43784 53597 38801 69278
14282F9278K1918k1929p978j7745J6426j6783j2826l733N2503L9520j0841j266
$$ 69278 91196 69267 61289 43544 59970 43187 30361 26628 79131 118651 107810 106544
14270A06544P669k6108q136j8722n36J1344M4099J2834j1563k6193j909m845k8496
$$ 106544 114213 88105 79969 61247 60711 72055 116154 128988 117425 91232 89323 84478 55982
14257E5982m1562K5220K1480J979K9727j9775k4849k588j8737k483J5890L6491
$$ 55982 14420 39640 61120 63099 92826 73051 48202 45614 26877 24394 40284 76775
14245G6775L0422K1139k7383j6014K121J8343j2704R698O864J2138J3118j6849
$$ 76775 107197 128336 100953 84939 87060 105403 92699 102397 109261 121399 134517 117668
14233A17668k0922n489l3325J3792K0772j928j3525o856Q748r291k4602M189L2908
$$ 117668 96746 91257 57932 71724 92496 90568 77043 70187 78935 69644 45042 49231 82139
14220H2139m0419k3947J9918L2916j5563j8400R8j2043K562l1010j330Q868K5454
$$ 82139 41720 17773 37691 70607 55044 36644 36742 24699 27261 -3749 -5079 3789 29243
14207B9243J0668N2627n326n1197l120J2954J0882K2511m354n4114k5563K0826
$$ 29243 39911 92538 87212 36015 32895 45849 56731 79242 74888 20774 -4789 16037
14195A6037L4518j3533j1845l695k9260m901L7078J9065K5795L4688n369l8829
$$ 16037 50555 37022 25177 21482 -7778 -12679 24399 43464 69259 103947 98578 59749
14183E9749l350j0504k200p243K1013k751Q467j5166J4919L774k602m4487K4579
$$ 59749 56399 45895 43695 36452 57465 54714 63181 48015 62934 66708 64106 19619 44198
14170D4198j532j9801K332q947K538k1335l6901N3360P0587m66j486q777O553
$$ 44198 42666 22865 25197 16250 18788 -2547 -39448 13912 84499 84033 82547 73770 80323
14157H0323J1376M0622L9139L8556M3609N2405M8691R9879R7226J20466J77791
$$ 80323 91699 132321 171460 210016 253625 306030 354721 454600 551826 672292 850083
14146H50083L20322L73341L99005K81860k40738n37055m24269k64918j59575j26138
$$ 850083 1170405 1543746 1942751 2224611 1983873 1446818 1022549 757631 598056 471918
14136D71918p0152o8089l9184L3223r716q503k9361o906l137q350k559J0445m657
$$ 471918 401766 333677 294493 327716 318000 309497 280136 273230 270093 261743 259184 269629 264972
14123B64972m8632j1980P1435O1267l146m5350o2388J988j1792k3267O532L9848
$$ 264972 216340 204360 275795 337062 333916 288566 226178 228166 216374 193107 199639 239487
14111B39487R36j8505k7606p239j9964J5721M6198L866l4852k2151K3739O750
$$ 239487 240423 221918 194312 187073 167109 182830 229028 232894 198042 175891 199630 206380
14099B06380p344J2210l0963m4933K0334J2148L3451R669l6217k0307j3864k5404
$$ 206380 199036 211246 180283 135350 155684 167832 201283 210952 174735 154428 140564 115160
14087A15160K1195m992k242N148j2628k3825p743j7027k6230j3984L8088L6024
$$ 115160 136355 131363 129121 134269 121641 97816 90073 73046 46816 32832 70920 106944
14075A06944J9821N6023J4192m245M040j5980O79K002M7660J06257L3074J779
$$ 106944 126765 182788 196980 192735 196775 180795 181474 183476 231136 337393 370467 372246
14063C72246O0364j7845q4015q9407l0143L0057K4777l2905k6175l026k0224M2791
$$ 372246 432610 414765 330750 241343 211200 241257 266034 233129 206954 203928 183704 226495
14051B26495Q5683Q4184k9838j2790j1301r2019q4824p980L515M2448R7309J26853
$$ 226495 312178 396362 366524 353734 342433 250414 165590 157610 161125 203573 300882 427735
14039D27735J94094L10449J58688o0951j14266p5848o5648r7192r3658q2216q383
$$ 427735 621829 932278 1090966 1030015 915749 839901 774253 677061 583403 501187 492804
14028D92804K5610K9355M866m3889m5283l5555J9799J3575l1554K2342L0721J8127
$$ 492804 518414 547769 552635 508746 463463 427908 447707 461282 429728 452070 482791 500918
14016E00918O063l6806L6407O4730P321J1495j1707k3248n4684p4600o7504l5338
$$ 500918 506981 470175 506582 571312 578633 590128 578421 555173 500489 425889 358385 323047
14004C23047o655k6733j9108N0121J1248J7340j4935P674L046l0552J7571K0783
$$ 323047 316392 289659 270551 320672 331920 349260 334325 341999 345045 314493 332064 352847
13992C52847l963L5935J9300l5491J4654M5057P3852P9911K0213l062j3845K429
$$ 352847 348884 384819 404119 368628 383282 428339 502191 582102 602315 599253 585408 587837
13980E87837K637m7940j8391o815r560p009K7422r753J2948J1869q505j9338J5598
$$ 587837 590474 542534 524143 517328 507768 500759 528181 518428 531376 543245 534740 515402 531000
13967E31000K5192J2710j8790k5872q666n1109n2272k9028L658R4476M9136j6140
$$ 531000 556192 568902 550112 524240 515574 464465 412193 383165 386823 481299 530435 514295
13955E14295J8061N0976N6579L7115L5348N2189L7157J9296l6051j7596N22o6905
$$ 514295 532356 583332 639911 677026 712374 764563 801720 821016 784965 767369 767891 700986
13943G00986k5418m928k5421L736K8066M4320L1460K3688K3974K3560J7006o574
$$ 700986 675568 670640 645219 648955 677021 721341 752801 776489 800463 824023 841029 834455
13931H34455k2312j346j1053k2250J835K7075j9681m7278N1196R0990O1235Q6847
$$ 834455 812143 810797 799744 777494 779329 806404 786723 739445 790641 881631 942866 1029713
13919A029713J77006J72866L6475p6764k8262M7904M5268n1503m1348n4069j07607
$$ 1029713 1206719 1379585 1416060 1339296 1311034 1358938 1404206 1352703 1311355 1257286 1149679
13908A149679n3139J15314J72381K4354j2128J37505J05853j9236N9267J63367
$$ 1149679 1096540 1211854 1384235 1408589 1396461 1533966 1639819 1620583 1679850 1843217
13898A843217R4036K4324Q6098K12481J38632K13361M43988N77111M71175K06977
$$ 1843217 1937253 1961577 2047675 2260156 2398788 2612149 3056137 3633248 4104423 4311400
13888D311400J00886J35208K9645j57434L1326L08337k66953p00630m43937o3009
$$ 4311400 4412286 4547494 4577139 4419705 4451031 4759368 4492415 3791785 3347848 3284839
13878C284839o9581m6520M89174M04224M3714J07203L84861N83909M93533N01145
$$ 3284839 3215258 3168738 3657912 4062136 4105850 4213053 4597914 5181823 5675356 6176501
13868F176501P59110R13201J119000J343457J590415J976714K526740L089176
$$ 6176501 6935611 7848812 8967812 10311269 11901684 13878398 16405138 19494314
13860A9494314L639414M433313N436050O780467Q939408J1715288J4752242J9430980
$$ 19494314 23133728 27567041 33003091 39783558 48722966 60438254 75190496 94621476
13852I4621476K7864931L9681841N3051385O2082289L8383032l7753004q2310510
$$ 94621476 122486407 162168248 215219633 277301922 315684954 277931950 195621440
13845A95621440o6020490m1004223k4448912j4358639q451637n639520m195555
$$ 195621440 129600950 88596727 64147815 49789176 41337539 35698019 31502464
13838C1502464l272367k436982j819058j844074k018475j729406j184833r43259
$$ 31502464 28230097 25793115 23974057 22129983 20111508 18382102 17197269 16254010
13830A6254010q96435o52102m56984l84893l94245n43708m31402m00016l08752
$$ 16254010 15357575 14705473 14248489 13863596 13469351 12925643 12494241 12094225 11785473
13821A1785473k28006l04792k35709k59053l49898k36137k35073n40038n84193
$$ 11785473 11557467 11252675 11016966 10757913 10408015 10171878 9936805 9396767 8812574
13812H812574m37883l21467n21014p64008n55211j75961q0690J5138N8842l2384
$$ 8812574 8374691 8053224 7532210 6768202 6212991 6037030 5956340 5971478 6030320 5997936
13802E997936j95217l10295j87839j89755k12917k09197j79021k28946l11106
$$ 5997936 5802719 5492424 5304585 5114830 4901913 4692716 4513695 4284749 3973643
13793C973643l02922j43279o3385q9463j18981j22300j72161l17837l27950k04679
$$ 3973643 3670721 3527442 3464057 3374594 3255613 3133313 2961152 2643315 2315365 2110686
13783B110686m0051O54p8113j37969r1145J575K7030R9247Q6368L5499q6764p8888
$$ 2110686 2070635 2071289 1993176 1855207 1764062 1765637 1792667 1891914 1978282 2013781 1927017 1848129
13771A848129o4105p2567j06396j30446j13010q8055o9577n3141l7217l5274J4541
$$ 1848129 1784024 1711457 1605061 1474615 1361605 1273550 1203973 1150832 1113615 1078341 1092882
13760A092882l0457m9593m6409k9129n3497m7674l3953k9417m5781k5987K1638
$$ 1092882 1062425 1012832 966423 937294 883797 836123 802170 772753 726972 700985 722623
13749G22623Q098M1141L7600k6443l9132j8640k1948j3192K9378N3974L1087K2949
$$ 722623 730721 771862 809462 783019 743887 725247 703299 690107 719485 773459 804546 827495
13737H27495L5376j8832k7685k2723K0034J0149j7469l6317J4268K9497P9624
$$ 827495 862871 844039 816354 793631 813665 823814 806345 770028 784296 813793 893417
13726H93417Q0289N8094j0450l0225m8736j6145k2802o4085m5256q0466p0390
$$ 893417 973706 1031800 1021350 991125 942389 926244 903442 839357 794101 713635 643245
13715F43245p043o997m4720k1827L7492K4218k8958N183k7457m6944n3587j6962
$$ 643245 636202 629205 584485 562658 600150 624368 595410 600593 573136 526192 472605 455643
13703D55643Q227L6878L1620K0216R456l98L793O4688Q9989N8191O9814N1778
$$ 455643 463870 500748 532368 552584 562040 561642 565435 630123 720112 778303 848117 899895
13691H99895L7514N8895J36209J29042J82832K14983L18089M84430O22735P44432
$$ 899895 937409 996304 1132513 1261555 1444387 1659370 1977459 2461889 3084624 3829056
13681C829056N67979k38010r30334q18716n26223l60898k34202j15707q224j5459
$$ 3829056 4397035 4159025 3228691 2409975 1883752 1522854 1288652 1172945 1164721 1149262
13671A149262l5734m6166N417M5847j8879p3931p6124p3408q1239p6922j8146
$$ 1149262 1113528 1067362 1072779 1118626 1099747 1025816 949692 876284 795045 718123 699977
13660F99977k395M2557R7123J85225J97070Q0628J9796J0129K2122J6341k3214
$$ 699977 697582 740139 837262 1022487 1219557 1300185 1319981 1330110 1352232 1368573 1345359
13649A345359r516J2615j6759n480K6442O1142J23871L9396M784K4100O5000Q1366
$$ 1345359 1335843 1348458 1331699 1326219 1352661 1413803 1537674 1577070 1581854 1605954 1670954 1752320
13637A752320M6646O0334P6140n873n1117j769L0867R1527R6889M8474n421J0206
$$ 1752320 1798966 1859300 1935440 1929567 1878450 1876681 1907548 1999075 2095964 2144438 2139017 2149223
13625B149223O4308Q5694J40720J84188K27926K03384J63932K18494K79503K88753
$$ 2149223 2213531 2299225 2439945 2624133 2852059 3055443 3219375 3437869 3717372 4006125
13615D006125L71206M06315M29834M29599M51358O14913P86501J044445J314530
$$ 4006125 4377331 4783646 5213480 5643079 6094437 6709350 7495851 8540296 9854826
13606I854826J576155K048799K672386L410487M149177M044602K177629n24842
$$ 9854826 11430981 13479780 16152166 19562653 23711830 27756432 29934061 29409219
13598B9409219j303852j65512J306917J849755O16132k061576l595580l128029
$$ 29409219 28105367 27939855 29246772 31096527 31712659 29651083 26055503 22927474
13590B2927474j846306n82534M08289J331706K263057L334539M600344O133895
$$ 22927474 21081168 20498634 20906923 22238629 24501686 27836225 32436569 38570464
13582C8570464P416014P125721L949081j86689k534703m073311m956105l768439
$$ 38570464 45986478 53112199 57061280 56874591 54339888 50266577 45310472 41542033
13574D1542033j343182R95397K559802K215815q67488m420191n370477m063480
$$ 41542033 40198851 41194248 43754050 45969865 45102377 40682186 35311709 31248229
13566C1248229k133329m45475J077132K565285M246781O090592P609772P166413
$$ 31248229 29114900 28669425 29746557 32311842 36558623 42649215 50258987 57425400
13558E7425400K505024m130117p101478n401601k178402P50921L409303O010734
$$ 57425400 59930424 55800307 48698829 43297228 41118826 41869747 45279050 51289784
13550E1289784Q235445R367176P459792J993865k318731k055994k14428j257149
$$ 51289784 59525229 68892405 76352197 78346062 76027331 73971337 73756909 72499760
13542G2499760o403124j1069347j1345167q931149o293193m284495k953594k157648
$$ 72499760 66096636 55027289 43682122 34750973 28457780 24173285 21219691 19062043
13534A9062043j692915j350434j112666r51827p91787o53619n69391m39828l64894
$$ 19062043 17369128 16018694 14906028 13954201 13162414 12508795 11939404 11499576 11134682
13525A1134682k83811k76280k28745j84518j81226j95937k19615k30449j84433
$$ 11134682 10850871 10574591 10345846 10161328 9980102 9784165 9564550 9334101 9149668
13516I149668j58045j81762k20081k09271j87515j63805j46186j56038j47606
$$ 9149668 8991623 8809861 8589780 8380509 8192994 8029189 7883003 7726965 7579359
13507G579359j36056o1284N091J297L8902J89900K45811K50071K59202M15633
$$ 7579359 7443303 7382019 7387110 7388407 7427309 7617209 7863020 8113091 8372293 8787926
13497H787926N08329N89298P90208J029170J210091J506679J846701K220470K769857
$$ 8787926 9296255 9885553 10675761 11704931 12915022 14421701 16268402 18488872 21258729
13488B1258729L404659M295706N553644P184498Q977350J0257329R469204M920761
$$ 21258729 24663388 28959094 34512738 41697236 50674586 60931915 70401119 75321880
13480G5321880q59282k511900m96898O21718k585537p979851r760925p521167
$$ 75321880 74462598 71950698 71453800 72075518 69489981 61510130 51749205 44228038
13472D4228038m308471j470283J077898L481023N567776O351729L275621l653717
$$ 44228038 39919567 38449284 39527182 43008205 48575981 54927710 58203331 54549614
13464E4549614q434353p973608n190221k638918p85158N93526J900237L252329
$$ 54549614 46115261 38141653 32951432 30312514 29527356 30120882 32021119 35273448
13456C5273448M483658N187736M150887P49816k435361k647374o14072J826555
$$ 35273448 39757106 44944842 49095729 49845545 47410184 44762810 44148738 45975293
13448D5975293L806286M463622L047300P03813j541619n067660q232588q030357
$$ 45975293 49781579 54245201 57292501 57996314 56454695 51387035 43154447 35124090
13440C5124090n659730l398418j768036o72775R7037P87853J569397K390367L087739
$$ 35124090 29464360 26065942 24297906 23625131 23722168 24510021 26079418 28469785 31557524
13431C1557524L114184J712965r63659k584282j927636l52689P08688J32699k348913
$$ 31557524 34671708 36384673 35421014 32836732 30909096 30556407 31265095 31397794 29048881
13422B9048881m487759m490537l459056k446162j718829j234948r67112p84017
$$ 29048881 24561122 20070585 16611529 14165367 12446538 11211590 10244478 9460461
13414I460461o50030n84931m79226l83499l50899l03005k95221k91670k66077
$$ 9460461 8810431 8225500 7746274 7362775 7011876 6708871 6413650 6121980 5855903
13405E855903j98638j97101j93405j79388j75805j54956j69322j75274k16970
$$ 5855903 5657265 5460164 5266759 5087371 4911566 4756610 4587288 4412014 4195044
13396D195044j41015q3920j32211j94108j52689j53471j55712j12575j21789j08418
$$ 4195044 4054029 3970109 3837898 3643790 3491101 3337630 3181918 3069343 2947554 2839136
13386B839136j22415j36801j24348j07455j06225m8620l9491p6619m1119r2672
$$ 2839136 2716721 2579920 2455572 2348117 2241892 2193272 2153781 2077162 2036043 1943371
13376A943371n2797j3938l2318o2416k1783J5325l1503j4761K8873K6184M8218
$$ 1943371 1890574 1876636 1844318 1781902 1760119 1775444 1743941 1729180 1758053 1784237 1832455
13365A832455P2434J63411K10288K23215J01078j83105l73503l10736k46466j55458
$$ 1832455 1904889 2068300 2278588 2501803 2602881 2419776 2046273 1735537 1489071 1333613
13355A333613o5891m3596j0307k0337m9899o5425l5048k2519n1703J5075m0553
$$ 1333613 1267722 1224126 1213819 1193482 1143583 1078158 1043110 1020591 968888 983963 943410
13344I43410p5509k9828j9673k5516l6346l7373l3763m5296m1669n938O502j278
$$ 943410 867901 838073 818400 792884 756538 719165 685402 640106 598437 592499 599001 597723
13332E97723M1729j560l3436k9431J1461k2896l7015o0695p971M327J7063J4741
$$ 597723 639452 637892 604456 575025 586486 563590 526575 465880 457909 462236 479299 494040
13320D94040m3696k1805N867n521k2499n6760l6939J6775K8654j4861l0677p33
$$ 494040 450344 428539 434406 428885 406386 349626 312687 329462 358116 343255 312578 311845
13308C11845R613q845m4631J216L4545K3182l646j3091k0449l1368j6664J6515
$$ 311845 321458 312613 267982 269198 303743 326925 323279 310188 289739 258371 241707 258222
13296B58222j0337j7417m0497o763L436O122J204K2582L363L2145K8312L944Q354
$$ 258222 247885 230468 189971 183208 186644 192766 193970 216552 219915 252060 280372 284316 292670
13283B92670l392k5671m3598m467J8091J9599J0588j6095N3229M4863j8190k9015
$$ 292670 289278 263607 220009 215542 233633 253232 263820 247725 300954 345817 327627 298612
13271B98612l5083j3976K3775Q410n254m5573j8827k0921l327M5132M1675Q109
$$ 298612 263529 249553 273328 281738 276484 230911 212084 191163 187836 232968 274643 282752
13259B82752O7j0699R258j708j7149n760J5698K0731K1806J6623O551J5536k6140
$$ 282752 282819 272120 281378 279670 262521 256761 272459 293190 314996 331619 338170 353706 327566
13246C27566j0076q952j8489k8760p106O037M4558J4295M716K5739J0972j9842
$$ 327566 317490 308538 290049 261289 254183 260220 304778 319073 323789 349528 360500 340658
13234C40658k93j5923R512L8963m531j7717k087j9070j6033j8985j3520K955l4274
$$ 340658 340365 324442 333954 372917 368386 350669 348582 329512 313479 294494 280974 283929 249655
13221B49655N445M3294M344j3505J369l5570k0898J5022J47l6465l8770j5956
$$ 249655 255100 298394 302738 289233 290602 255032 234134 249156 249303 212838 174068 158112
13209A58112j0193L6995J1826L7461J0432k4448j5126O235R351Q112K2738k5533
$$ 158112 147919 184914 196740 234201 244633 220185 205059 211294 220645 228757 251495 225962
13197B25962m5658k227K9095R374J3702J644L070P61l757p111l6081L657p667
$$ 225962 180304 178077 207172 216546 230248 231892 234962 235723 231966 224855 188774 192431 184764
13184A84764j8045o529j0153L2557K436k1573N07k578r570p25K6401Q671k0016
$$ 184764 166719 160190 150037 182594 185030 163457 163964 161386 151816 151091 177492 186163 166147
13171A66147j5930K157P009J9198l4561r831M7221k6081q386K4778q63q80N67
$$ 166147 150217 152374 159383 178581 144020 134189 181410 155329 146943 171721 170858 169978 170545
13158A70545o977j8691N5516M8967j6610j0929m135j3921J5155J2983K2494r248
$$ 170545 163568 144877 200393 249360 232750 221821 217686 203765 218920 231903 254397 245149
13146B45149J072j735k5233j1265j3011l13K700l1509m660j4775k4670J631n637
$$ 245149 246221 244486 219253 207988 194977 194664 197364 165855 161195 146420 121750 123381 117744
13133A17744K5944J6531K9595J6371k8087o528K8391k630L0672Q606L5448L7695
$$ 117744 143688 160219 189814 206185 178098 171570 199961 197331 228003 236609 272057 309752
13121C09752K1198M3658N8925O8064J5592j7308p2178o9172k8803K46j9619J212
$$ 309752 330950 374608 433533 501597 517189 499881 427703 358531 329728 329974 310355 311567
13109C11567K2471J1643K3434J7453j1172k4814q093R95l0462k4299K0076N0952
$$ 311567 334038 345681 369115 386568 375396 350582 342489 343484 313022 288723 308799 359751
13097C59751K0568J735P170K5308J1353K9797K5984l6086k5189l2870k6884o463
$$ 359751 380319 382054 389224 414532 425885 455682 481666 445580 420391 387521 360637 354174
13085C54174K0139K3539L1627q18l9585j733K414k9048m4735l9201k9344J5736
$$ 354174 374313 397852 429479 428661 389076 387343 389757 360709 315974 276773 247429 263165
13073B63165M0291J6702m512M6005P881K4942M5737n102j0105o1610o2169k3684
$$ 263165 303456 320158 315646 361651 369532 394474 440211 435109 425004 363394 301225 277541
13061B77541j6353m4772l0244l2110l0580j3328r463j6228K778J5545m0084N110
$$ 277541 261188 216416 186172 154062 123482 110154 100691 84463 87241 102786 62702 67812
13049F7812L2067k2369K2793K2411k7609j5334J1205K3923k3689k8724k055n782
$$ 67812 99879 77510 100303 122714 95105 79771 90976 114899 91210 62486 60431 54649
13037E4649o624L677J0573L1459J7078l1077k8198M467r656J4465K2397l3271
$$ 54649 48025 51702 62275 93734 110812 79735 51537 56004 46348 60813 83210 49939
13025D9939J3042K7146k5216J990J7329J9159J1203O580q212m5998K9278L8338
$$ 49939 62981 90127 64911 66901 84230 103389 114592 121172 112960 66962 96240 134578
13013A34578M0724M4360K7477N8559P2124O7237J6598p4715l8272l6415n4158
$$ 134578 175302 219662 247139 305698 377822 445059 461657 386942 348670 312255 258097
13002B58097m5097l7299k7611j4415K9572L5413J6870M0869R5523j5720n1918
$$ 258097 213000 175701 148090 133675 163247 198660 215530 256399 351922 336202 284284
12991B84284l7290J0370K288R927K9442M2241K7239J4577L5780P4106k938l9716
$$ 284284 246994 257364 259652 269579 299021 341262 368501 383078 418858 492964 490026 450310
12979D50310o6059l8836p0215j0719q745r487L7029J2705K6923j5295n6068l1127
$$ 450310 384251 345415 275200 264481 255736 246249 283278 295983 322906 307611 251543 220416
12967B20416n0687j6547K1916N070J0575J3296J5700L7131M7766M908L9590K3060
$$ 220416 169729 153182 175098 180168 190743 204039 219739 256870 304636 309544 349134 372194
12955C72194k7263j1916m6388m6768j7880l6231o3053k3338m49k0105m47P700
$$ 372194 344931 333015 286627 239859 221979 185748 122695 99357 98908 78803 78356 86056
12943H6056L3190L2607n3169l0585J209L1369J4289k989m263l4945j0691L3168
$$ 86056 119246 151853 98684 68099 69308 100677 114966 111977 107714 72769 62078 95246
12931I5246M88k1044O46o38k4981J403K7364j4613n1495k43J8689J0901K7963
$$ 95246 95734 74690 75336 74698 49717 51120 78484 63871 12376 12133 30822 41723 69686
12918F9686k824j9694p142K5305Q499j8803o823j2882j2899K9967K947k0708k4034
$$ 69686 66862 47168 40026 65331 73830 55027 48204 35322 22423 52390 55337 34629 10595
12905A0595O124l050r07m923j6852j755L5639N903J3726l9411r394K0393M3118
$$ 10595 16719 13669 12762 7839 -9013 -10768 24871 30774 44500 5089 -4305 16088 59206
12892E9206R9K0850J1162q75j4576l6982k0887k2738L671R602K5428l437P831
$$ 59206 59305 80155 91317 90442 75866 38884 17997 -4741 -1070 8532 33960 30523 38354
12879C8354k3597k1686Q009K8642N0126K8333l1427j3494k5495q943k7945k473
$$ 38354 14757 -6929 1080 29722 79848 108181 76754 63260 37765 28822 877 -1596
12867a596p999M5193K8509L1577l746k8462k3824k7262o0601k8997j706K9514
$$ -1596 -9595 35598 64107 95684 91938 63476 39652 12390 -48211 -77208 -78914 -49400
12855d9400K0863N1729O5084L3436k572j4712r398n0192k5274k8231J6636J6055
$$ -49400 -28537 23192 88276 121712 119140 104428 95030 44838 19564 -8667 7969 24024
12843B4024J8508L8679K8472k7866J1306j9230m7082l924J1811j5448k0829J0470
$$ 24024 42532 81211 109683 81817 93123 73893 26811 22887 34698 19250 -1579 8891
12831H891P192k3297m5519j81N783j9927K4169L4927q721Q276J2638k1858n80
$$ 8891 16083 -7214 -52733 -52914 -47131 -67058 -42889 -7962 -16683 -8407 4231 -17627 -18207
12818a8207L0256P072J4029M813l518j7548R113J4130J259R77J0038r656l1398
$$ -18207 12049 19121 33150 37963 34445 16897 26010 40140 41399 42376 52414 42758 11360
12805A1360l0538J5202J1403M545J0435K8651j9663m236k725j6932j1928M2720
$$ 11360 -19178 -3976 7427 11972 22407 51058 31395 27159 24434 7502 -4426 38294
12793C8294J6277k7773P994J212L8698j0960k2555r467l9377l707K1526L1172
$$ 38294 54571 26798 34792 36004 74702 63742 41187 31720 -7657 -11364 10162 41334
12781D1334J6267N65l9265n2333J2306K6243J3136j7124k09L6017R09j8610L993
$$ 41334 57601 58166 18901 -33432 -21126 5117 18253 1129 920 36937 37846 19236 23229
12768B3229L1126J9625J384L5442K229k7627O070M580J1280m6351l1782O667J487
$$ 23229 54355 73980 75364 110806 113035 85408 91478 96058 107338 60987 29205 35872 37359
12755C7359k1224O357k0008l8355Q405Q004J081o341K2313O6733R428j9179l0495
$$ 37359 16135 22492 2484 -35871 -27466 -19462 -18381 -24722 -2409 64324 73752 54573 24078
12742B4078m6622l747J3690L0342J7625k1905J9412K3194J1888j2945N52Q827
$$ 24078 -22544 -26291 -12601 17741 35366 13461 32873 56067 67955 55010 55562 64389
12730F4389j9905k0800m5583M5098K2560m7102j3028k838L7426M0923j4767l5744
$$ 64389 44484 23684 -21899 23199 45759 -1343 -14371 -17209 20217 61140 46373 10629
12718A0629M471j506m235O963K7925l0814l9709R256K4940J6303l686j435j0761
$$ 10629 15100 13594 9359 16322 44247 13433 -26276 -17020 7920 24223 20537 19102 8341
12705H341k5369l430N537q353J9907L399j2700n435K6067J6525k989j7850q88
$$ 8341 -17028 -20458 -14921 -23274 -3367 32 -12668 -18103 7964 24489 21500 3650 2762
12692B762k4071N257j5818n708J0526N132N251K634j115k6855j4883K6392M0241
$$ 2762 -21309 -16052 -31870 -37578 -27052 -21920 -16669 -14035 -15150 -42005 -56888 -30496 9745
12679I745L5823P320j9284J1364K6475r097m3122m4327k5657J2347K1756j0519
$$ 9745 45568 52888 33604 44968 71443 62346 19224 -25103 -50760 -38413 -16657 -27176
12667b7176k374K2550K0678k0099l1134L0185L621k8598n012L3210N65J7331K0699
$$ -27176 -29550 -7000 13678 -6421 -37555 -7370 -3749 -32347 -37359 -4149 -3584 13747 34446
12654C4446j4601l9302r414k5266J3487K3462J9524K3523p983j2196k0482k6018
$$ 34446 19845 -19457 -28871 -54137 -40650 -17188 2336 25859 17876 5680 -14802 -40820
12642d0820k2481J6861J1647J0596K3408J2171l3765l1089l6901N3235O9625L0726
$$ -40820 -63301 -46440 -34793 -24197 -789 11382 -22383 -53472 -90373 -37138 32487 63213
12630F3213r146m8990J0980P568j0881R548K4j082K601K1414J8009j456o48K212
$$ 63213 54067 5077 16057 23625 12744 22292 22316 21234 23835 45249 63258 61802 61154 63366
12616F3366M608k0735j8859l6177j8734l4202M274M3804L2040O825k5065j1001
$$ 63366 67974 47239 28380 -7797 -26531 -60733 -56459 -12655 19385 26210 1145 -9856
12604i856J9338j2378k1688j0790l927j5578K0492M7189J502M014O541J7768k6266
$$ -9856 9482 -2896 -24584 -35374 -39301 -54879 -34387 12802 14304 18318 24859 42627 16361
12591A6361l2749m964J3298m598J6220k408M572J3429P472j7126l350l576j5795
$$ 16361 -16388 -21352 -8054 -12652 3568 1160 5732 19161 26633 9507 6157 2581 -13214
12578a3214L0210l858j4378J801J1535L6583K4893o426k0499l830N719k8262j2392
$$ -13214 16996 13138 -1240 561 12096 48679 73572 67146 46647 42817 48536 20274 7882
12565G882l086p966N491J4797N6331l721m4772o3454J7092L5973J7543k7439L150
$$ 7882 4796 -3170 2321 17118 73449 69728 24956 -38498 -21406 14567 32110 4671 7821
12552G821P232Q650J3385n455K8754J4014j8357m5337k4428k3935n784R951J6888
$$ 7821 15053 23703 37088 31633 60387 74401 56044 10707 -13721 -37656 -43440 -33489 -16601
12539a6601N1625N146l6697o874J5377J7032j0662K3926j6444j6035j1371K0813
$$ -16601 35024 40170 3473 -3401 11976 29008 18346 42272 25828 9793 -1578 19235
12527A9235J8226P469r639l0312k6503Q163K7780L1475J6638J2731O445l3703
$$ 19235 37461 44930 35291 4979 -21524 -13361 14419 45894 62532 75263 81708 48005
12515D8005J3267j535k3857k1851r613J0439j0880k8429j1895J980j0949P535
$$ 48005 61272 59737 35880 14029 4416 14855 3975 -24454 -36349 -34369 -45318 -37783
12503c7783L3585O113p912J7010p085N2453J2099o4069o3545R304O412j5885j731
$$ -37783 -4198 1915 -5997 11013 3928 56381 68480 4411 -59134 -49830 -43418 -59303 -61034
12490f1034k1023o074j778M3598M0187k9763k7751j4171K945L3208K9249k3658
$$ -61034 -82057 -88131 -89909 -46311 -6124 -35887 -63638 -77809 -74864 -41656 -12407 -36065
12478c6065Q120L2761K1406o178J4828J6967j5325m1175j0713j9562P452o129
$$ -36065 -27945 4816 26222 20044 34872 51839 36514 -4661 -15374 -34936 -27484 -33613
12466c3613k2968q818j1964K272M8051M464K0721K807J4776J1317R700O101o409
$$ -33613 -56581 -65399 -77363 -75091 -27040 -22576 -1855 952 15728 27045 36745 42846 36437
12453C6437K9635P367j029o889k4162k4701k6977m0697J3066K6147J5082J0466
$$ 36437 66072 73439 72410 65521 41359 16658 -10319 -51016 -37950 -11803 3279 13745
12441A3745k5770j4247R146N1017O86n750J9238m735j3529J985q560m455l5505
$$ 13745 -12025 -26272 -17126 33891 34577 28827 48065 43330 29801 31786 23226 18771 -16734
12428a6734j4673J8057O476k765j0756K0321K5437L284j9176Q211M90K99k0617
$$ -16734 -31407 -13350 -6874 -9639 -20395 -74 25363 28647 9471 17682 18172 18471 -2146
12415b146M607R706q072J4528J794k733o470r477j0552K5857K8495q208k6800
$$ -2146 2461 12167 4095 18623 20417 17684 11214 1737 -8815 17042 45537 37329 10529
12402A0529p206M511k7679K4912l791m0928l5961K521K1988l3832p107J2270K7667
$$ 10529 3323 7834 -19845 5067 1276 -39652 -75613 -73092 -51104 -84936 -92043 -79773 -52106
12389e2106J0101K4900L9986J8130R630j2263l3050o800J2978j0452j0485j971
$$ -52106 -42005 -17105 22881 41011 50641 38378 5328 -1472 11506 1054 -9431 -11402
12377a1402K7061j4441J582J1210m252R619j3440k1278O352K3685J7894J2812
$$ -11402 15659 1218 2800 14010 9758 19377 5937 -15341 -8989 14696 32590 45402
12365D5402j6120k4938j1120N313j0702L806O462P236j4312j4696mK4077q553
$$ 45402 29282 4344 -6776 -1463 -12165 -8359 -1897 5339 -8973 -23669 -23673 404 -8149
12352h149J2377p132k2870j2499J7017M380J6050J6513j1131j0562J3818J8333
$$ -8149 4228 -2904 -25774 -38273 -21256 -16876 -826 15687 4556 -6006 7812 26145
12340B6145j7856l138l26M984k6905j394K3104J8387m566l5853r216L3115l389
$$ 26145 8289 5151 4825 9809 -17096 -18490 4614 23001 18435 -17418 -26634 6481 3092
12327C092j3142J0278k967l266L761K0552l8513l9039J6175p088j3411J9246L6583
$$ 3092 -10050 228 -2739 -6005 -2244 18308 -20205 -59244 -43069 -50157 -63568 -44322 -7739
12314g739J0613L0784O310k5984j2539j3484k3197j2322K2950L4227m982m453
$$ -7739 2874 33658 39968 13984 1445 -12039 -35236 -47558 -24608 9619 4637 184
12302A84K2813M602j5169p298L153L638p452k8250J1671K6779K2339N0O464J4601
$$ 184 22997 27599 12430 5132 8285 11923 4471 -23779 -12108 14671 37010 37060 43524 58125
12288E8125m184k3370l0022O394J0935J117j8568j2260m066K7905j7181k8110
$$ 58125 53941 30571 549 6943 17878 18995 427 -11833 -15899 12006 -5175 -33285
12276c3285l383J268M6711k088q990j4065m135J0456Q915k2003R391J0165N8147
$$ -33285 -36668 -35400 11311 9223 233 -13832 -17967 -7511 1404 -20599 -11208 -1043 57104
12263E7104L0173k1879k9706l0979L2663r319j7046K228J1151L0275M465j8217
$$ 57104 87277 65398 35692 4713 37376 28057 11011 13239 24390 54665 59130 40913
12251D0913k2247r914M478j6312K8859J2289j6838m613j3639K9223M489r058J4216
$$ 40913 18666 8752 13230 -3082 25777 38066 21228 16615 2976 32199 36688 27630 41846
12238D1846K5710j1860j6405k4916j3441k706J037L307J1546K968k3381j4671
$$ 41846 67556 55696 39291 14375 934 -1772 -735 2572 14118 17086 -6295 -20966
12226b0966j756j6595K997J5433J0207L384J8600j0579j8472k4187j643m116K1854
$$ -20966 -22722 -39317 -36320 -20887 -10680 -7296 11304 725 -17747 -41934 -43577 -47693 -25839
12213b5839P021L1277J314k0301p438L214j1838R269k016J079O555J4009k6501
$$ -25839 -18818 12459 13773 -6528 -13966 -10752 -22590 -13321 -15337 -14258 -7703 6306 -20195
12200b0195l1673M018K3844J0810J8688O466J4348m0503l1195L0191K5146J538
$$ -20195 -51868 -47850 -24006 -13196 5492 11958 26306 -14197 -45392 -15201 9945 11483
12188A1483n473k3916l5203j8058N9206j217j408K819L6333K5930k5027j0759
$$ 11483 6010 -17906 -53109 -71167 -11961 -13178 -14586 -11767 24566 50496 25469 14710
12176A4710j231p368J0183J2676n3156k44L9431j3109r45M2560J6180q665K1060
$$ 14710 13479 6111 16294 28970 -24186 -24430 15001 1892 947 43507 59687 51022 72082
12163G2082j03j3401o898l0744k7178j092J2470K401J6086n359k9540j8128M1172
$$ 72082 71979 58578 51680 20936 -6242 -7334 5136 7537 23623 18264 -11276 -29404 11768
12150A1768J0447k4182j0331J776K1349k6135J9002l3650k1197L946L3858J5669
$$ 11768 22215 -1967 -12298 -10522 10827 -15308 3694 -29956 -51153 -47207 -13349 2320
12138B320m369J3856j09k732J6032j3075j0808J4448J5P035M398l0017m000M248
$$ 2320 -2049 11807 11698 8966 24998 11923 1115 15563 15578 22613 27011 -3006 -7006 -2758
12124b758K3584n914j3552J9633L633P413l400l725p353q196K8048J2381k4849
$$ -2758 20826 14912 1360 20993 24626 32039 28639 24914 17561 9365 37413 49794 24945
12111B4945m719J7245j2877N660j3404j9378J8450J859j3059K0109Q315k863J2776
$$ 24945 20226 37471 24594 30254 16850 -2528 15922 17781 4722 24831 33146 30283 43059
12098D3059j8055Q505j5589j3092N727j738K5519L8111K882l9925k2500j9252
$$ 43059 25004 33509 17920 4828 10555 8817 34336 72447 75329 35404 12904 -6348
12086f348m2253R083O549K5655J8377J0626j4821k1279j2224J9177j702L2108
$$ -6348 -48601 -39518 -32969 -7314 11063 21689 6868 -14411 -26635 -7458 -9160 22948
12074B2948k2330j5356m3209j0274K1619k7334j1844K5373L8376P0470L9870O138
$$ 22948 618 -14738 -57947 -68221 -46602 -73936 -85780 -60407 -22031 48439 88309 94447
12062I4447l8959m7859j9847k594j347J2493J7029l3756j4091J8737N722n962
$$ 94447 55488 7629 -12218 -14812 -16159 -3666 13363 -20393 -34484 -15747 -10025 -15987
12050a5987l4861j8413J0768J7401J498l924r031J1908J4864R860k8632Q479K2055
$$ -15987 -50848 -69261 -58493 -41092 -39594 -43518 -52549 -40641 -25777 -15917 -44549 -36070 -14015
12037a4015L0876L8091N629J4292j4374m5563j4729L3098K0090m4937l6528L070
$$ -14015 16861 54952 60581 74873 60499 14936 207 33305 53395 8458 -28070 -25000
12025b5000J6743K1857L2548R481l9984l9802K817N8626K5142j5474k4340j5551
$$ -25000 -8257 13600 46148 55629 15645 -24157 -21340 37286 62428 46954 22614 7063
12013G063k0710Q154P291L164J1186k5847j7962J7474K3882R05M422j5335m0350
$$ 7063 -13647 -5493 1798 4962 16148 -9699 -27661 -10187 13695 14600 19022 3687 -36663
12000c6663j0346N5590K2179R076j4547K0373M664k6112k257J6462l692K1591
$$ -36663 -47009 8581 30760 39836 25289 45662 50326 24214 21957 38419 34727 56318
11988E6318l4218j6426k9103n019L3144J813J8395L0609J2143j1612l5926q702
$$ 56318 22100 5674 -23429 -28448 4696 6509 24904 55513 67656 56044 20118 11416
11976A1416J0298k6238N993J7270M811P013K9672L1093J297k0687j8222l7084
$$ 11416 21714 -4524 1469 18739 23550 30563 60235 91328 92625 71938 53716 16632
11964A6632j0111j3889L1534N468k7066J5392K4220L955p974k2508j7813J6261
$$ 16632 6521 -7368 24166 29634 2568 17960 42180 46135 38161 15653 -2160 14101
11952A4101N4462k7940k8012j1011R556O570K3791K7478k0914l0535j6714j0650
$$ 14101 68563 40623 12611 1600 11156 17726 41517 68995 48081 17546 832 -9818
11940i818J2m943J5272k2755r561O045K5342L1567j806r602J2978K0476L276j3622
$$ -9818 -9806 -14749 523 -22232 -31793 -25748 -406 31161 29355 19753 32731 53207 56483 42861
11926D2861r576K76q268l4335P809k0269k6657J5264k3653O583L7223J802k7130
$$ 42861 33285 33561 25293 -9042 -1233 -21502 -48159 -32895 -56548 -49965 -12742 -10940 -38070
11913c8070J2243J195K6922J4759K8728J6778k3459K7441P869k4280l6870l2144
$$ -38070 -25827 -24632 2290 17049 45777 62555 39096 66537 74406 50126 13256 -18888
11901a8888j5745k1460K2063N047j0596k0037L0615K0342j9914k9018J31K5834
$$ -18888 -34633 -56093 -34030 -28983 -39579 -59616 -29001 -8659 -28573 -57591 -57460 -31626
11889c1626q710j7742K835K0669L600J307p021J1027J5620l851P224J4716J8380
$$ -31626 -40336 -58078 -55243 -34574 -30974 -29667 -36688 -25661 -10041 -13892 -6668 8048 26428
11876B6428n574j5748j2206j9913N647p485J2011j1192O739k383J4621J1851j4661
$$ 26428 20854 5106 -7100 -27013 -21366 -28851 -16840 -28032 -21293 -23676 -9055 2796 -11865
11863a1865k6293O577L2311L614J3758k027m725K6999j9408k2670j0155L4766
$$ -11865 -38158 -31581 730 4344 18102 16075 11350 38349 18941 -3729 -13884 20882
11851B0882L0458k1172L890J1851j0817j6413j1889k0287j7918o86J3502O383
$$ 20882 51340 30168 34058 45909 35092 18679 6790 -13497 -31415 -32101 -18599 -12216
11839a2216l8489L215K6396J0492o286L2491K999j6015M071J7423j1242k2271
$$ -12216 -50705 -47490 -21094 -10602 -16888 15603 18602 2587 6658 24081 12839 -9432
11827i432O452j4358p470L965n367l445k7607J6104J8596K9118j4497k8044P714
$$ -9432 -2980 -17338 -24808 -20843 -26210 -29655 -57262 -41158 -22562 6556 -7941 -35985 -28271
11814b8271j401J4072L6520P120j3241k0031j366J3543k4184k8502k1528L6488
$$ -28271 -29672 -15600 20920 28040 14799 -5232 -6598 6945 -17239 -45741 -67269 -30781
11802c0781J1666J5988m129j2455K5845J8937O449J4777R553L881j187m2294j1298
$$ -30781 -19115 -3127 -7256 -19711 6134 25071 31520 46297 55850 59731 58544 16250 4952
11789D952K4602K8912j1091l2158r00o113n412K4272j3462Q972O10k2496r389
$$ 4952 29554 58466 47375 15217 14317 8204 2792 27064 13602 22574 23184 688 -8701
11776h701k1223k834o932q562L3726M1569M5080l094k5814j0033j5240J9637k277
$$ -8701 -29924 -32758 -39690 -48252 -14526 27043 72123 69029 43215 33182 17942 37579 35302
11763C5302K8074M9196j6265j9715k1854m4439k0487O574J1090m117n3721M375
$$ 35302 63376 112572 96307 76592 54738 10299 -10188 -3614 7476 3359 -50362 -45987
11751d5987J7364N048J6151J9676M991j5392m3018l685J8502K8130j1163k8424
$$ -45987 -28623 -23575 -7424 12252 17243 1851 -41167 -44852 -26350 1780 -9383 -37807
11739c7807j3390m126K9796J9043j7640p567M84j5020K1827J7591M489j4576j9875
$$ -37807 -51197 -55323 -25527 -6484 -24124 -31691 -31207 -46227 -24400 -6809 -2320 -16896 -36771
11726c6771J5388M9638J2929j3462n122P712r4n6381j2670k3918K5239M9526K7374
$$ -36771 -21383 28255 41184 27722 22600 30312 30218 -26163 -38833 -62751 -37512 12014 39388
11713C9388j2723K6273M496k3358j9909J0886j7555M858k8633o049L499M226J9685
$$ 39388 26665 52938 57434 34076 14167 25053 7498 12356 -16277 -22326 -18827 -14601 5084
11700E084q573j3712K0045K9036J7610j9275l1052J2928J5390k1960k3943M428
$$ 5084 -3489 -17201 2844 31880 49490 30215 -837 12091 27481 5521 -18422 -13994
11688a3994Q527N950M866L898n651J3461K556n1175m7465l0125J8046M2691K7694
$$ -13994 -5467 483 5349 9247 3596 17057 19613 -31562 -79027 -109152 -91106 -48415 -20721
11675b0721j3274m3249M2922R080M5154J0632J1976n337q041j4929l3914M072
$$ -20721 -33995 -77244 -34322 -25242 19912 30544 42520 37183 29142 14213 -19701 -15629
11663a5629M496Q533j698L171k6537K0107L16K2706R237O258k9286o196M6071
$$ -15629 -11133 -2600 -4298 -1127 -27664 -7557 -7241 15465 24702 30960 1674 -4522 41549
11650D1549L6884j5300n1291n0691j0K0803L8979J1255K0411l085k1645j5668
$$ 41549 78433 63133 11842 -38849 -38859 -18056 20923 32178 52589 49504 27859 12191
11638A2191j9160j6298O940K6239J8898k6632j4027j4405l097K0055l070k096
$$ 12191 -6969 -23267 -16327 9912 28810 2178 -11849 -26254 -29351 -9296 -12366 -14462
11626a4462L4864J2740k9926o847L770J5352q581n3943J4026j359J0337K0544
$$ -14462 20402 33142 3216 -3631 139 15491 6910 -47033 -33007 -34366 -24029 -3485
11614c485k766k1709k4571K0838J9854k4446q670J510j4484K3694J3308K1493
$$ -3485 -6251 -27960 -52531 -31693 -11839 -36285 -44955 -43445 -57929 -34235 -20927 566
11602E66M0199L3736M2111J2245l2809o1178n0269K234J6002o512L893M219p444
$$ 566 40765 74501 116612 128857 96048 34870 -15399 -13165 2837 -3675 218 4437 -3007
11589c007p596p856J6230L4515K6293l0713k9573m010k903M200J5371J6073M465
$$ -3007 -10603 -18459 -2229 32286 58579 27866 -1707 -5717 -8620 -4420 10951 27024 31489
11576C1489K2877l597o646J1059n962j6764k2111l0365q966K934L3674j147L028
$$ 31489 54366 50769 44123 55182 49220 32456 10345 -20020 -28986 -26052 7622 6475 9503
11563I503J5412q374k415n689j5182P496r022l27L6749k0040j7252Q006R555j7078
$$ 9503 24915 16541 14126 8437 -6745 751 -8271 -8598 28151 8111 -9141 -1135 8420 -8658
11549h658j0599m31J8475o911j6740J9075j0235n941R137n760j0409J5805J5444
$$ -8658 -19257 -19688 -1213 -8124 -24864 -5789 -16024 -21965 -12828 -18588 -28997 -13192 2252
11536B252Q355M3598j6020j3727Q802r064L2667J1322k7680j5037l5805O950J9660
$$ 2252 10607 54205 38185 24458 33260 24196 56863 68185 40505 25468 -10337 -3387 16273
11523A6273j5191k2936m8306j5245M1145M6101j6352N019N580J6632P759k6330
$$ 16273 1082 -21854 -70160 -85405 -44260 1841 -14511 -9492 -3912 12720 20479 -5851
11511e851j4267M5032J8245k7515n3955J509J0983K7797K9486k7706K3082J2910
$$ -5851 -20118 24914 43159 15644 -38311 -36802 -25819 1978 31464 3758 26840 39750
11499C9750J2937J4055j6842o773j7503j1262j3772J5111L551k6833j918j0884
$$ 39750 52687 66742 49900 43127 25624 14362 590 15701 19252 -7581 -9499 -20383
11487b0383K4505N324j4998K2933J3460K1011J7666o071n2328o2842J0337K2697
$$ -20383 4122 9446 -5552 17381 30841 51852 69518 63447 11119 -51723 -41386 -18689
11475a8689l2929L2269L3076L524l218j7053J3337M863j3319J4231O280n764J0789
$$ -18689 -51618 -19349 13727 17251 14033 -3020 10317 15180 1861 16092 22372 16608 27397
11462B7397k600k848k6833j5467P383j3786j7365J0544q983j5483M342J5276j8181
$$ 27397 24797 21949 -4884 -20351 -12968 -26754 -44119 -33575 -42558 -58041 -53699 -38423 -56604
11449e6604K145K4527j0434j219K1084K9844J3361P236k5581j8527J583K8105
$$ -56604 -54459 -29932 -40366 -41585 -20501 9343 22704 29940 4359 -14168 -12585 15520
11437A5520o520j9328j5855o847k674M7795j5853p65K382J7937L4777j3719J4449
$$ 15520 9000 -10328 -26183 -33030 -35704 12091 -3762 -4527 -2145 15792 50569 36850 51299
11424E1299j2051m7818n907M188r307k0872j1828j8901M6725K5547j1723j5127
$$ 51299 39248 -8570 -14477 -10289 -19596 -40468 -52296 -71197 -24472 1075 -10648 -25775
11412b5775j2655J6111L9257M8114j3894l6296j8016K6494m038p368J4020k8645
$$ -25775 -38430 -22319 16938 65052 51158 14862 -3154 23340 19302 11934 25954 -2691
11400b691k1890j0310L5881J8039l5443N489N1004L3031p148l1941l6881m7068
$$ -2691 -24581 -34891 990 19029 -16414 -10925 40079 73110 65962 34021 -2860 -49928
11388d9928K0184M9769J4909l6236k3021J3678o310J2717j5259k8743j2514Q975
$$ -49928 -29744 20025 34934 -1302 -24323 -10645 -16955 -4238 -19497 -48240 -60754 -51779
11376e1779P159k1582L1114L3208J2815j2113r135j07J0600M787o587L440k5546
$$ -51779 -44620 -66202 -35088 -1880 10935 -1178 -10313 -10420 180 4967 -1620 1820 -23726
11363b3726J6341J4350J526K8091r854L112l2620k9624m7205J9100K4657J5391
$$ -23726 -7385 6965 8491 36582 26728 29840 -2780 -32404 -79609 -60509 -35852 -20461
11351b0461n065j2061q651K4647K3590r480k2055J3813J2918l4977j6989L117
$$ -20461 -25526 -37587 -46238 -21591 1999 -7481 -29536 -15723 -2805 -37782 -54771 -51654
11339e1654o223N109L820R793P576K3562K0516J1127K0238N552k2504m0976q319
$$ -51654 -57877 -52768 -48948 -39155 -31579 -8017 12499 23626 43864 49416 26912 -14064 -22383
11326b2383L5534J7231l326n731p823l6330k8839J5302L5769L3264j0734j2607
$$ -22383 13151 30382 27056 21325 13502 -22828 -51667 -36365 -596 32668 21934 9327
11314I327Q753Q70o357j5094o51K88J4932R229n441m935J0607J4948J8750p822
$$ 9327 18080 18950 12593 -2501 -3152 -2864 12068 21297 15856 10921 21528 36476 55226 47404
11300D7404J0512l0522k4258J1390m748k861l0766J6789L0289L254k6711j8230
$$ 47404 57916 27394 3136 14526 9778 6917 -23849 -7060 23229 26483 -228 -18458
11288a8458k1476J0007O453K9391l52m116K3364O741K4422J0445l0813l8945l0568
$$ -18458 -39934 -29927 -23474 5917 5565 1449 24813 31554 55976 66421 35608 -3337 -33905
11275c3905L30N0735j914K266M278k0861J7992J4788j7420k8010N073K0725R713
$$ -33905 -33575 17160 15246 17512 21790 929 18921 33709 16289 -11721 -6648 14077 23790
11262B3790l1339j6065J8603j3289k4503L1870q507l2216l882J7555l94K0127
$$ 23790 -7549 -23614 -5011 -18300 -42803 -10933 -19440 -51656 -55538 -37983 -38377 -18250
11250a8250M0149K5470p700l7936j114M127m3674r658J7728k4540l7531K9781
$$ -18250 21899 47369 39669 1733 619 4746 -38928 -48586 -30858 -55398 -92929 -63148
11238f3148M9619Q831l0246J8385k122Q429K2137J1607o419k1274r604L7554J4982
$$ -63148 -13529 -4698 -34944 -16559 -18681 -10252 11885 23492 17073 -4201 -13805 23749 38731
11225C8731l260J3400k7602p3454J2203J4967l921o16K9739J48l1304J1462N837
$$ 38731 35471 48871 21269 -52185 -39982 -25015 -28936 -29552 187 335 -30969 -19507 -13670
11212a3670J317J1869J2204O220R857m7183o848J8254j20k65L3435O361l4464
$$ -13670 -12353 -484 11720 17940 27797 -19386 -26234 -7980 -8100 -8365 25070 31431 -3033
11199c033j0558r141k9715J2126M5473Q27j8584J4249K649m049l8213j6891K2726
$$ -3033 -13591 -22732 -52447 -40321 5152 5979 -12605 1644 4293 244 -37969 -54860 -32134
11186c2134o318J6888r503q063j8723K3781j6691J0105K7835O032k5793J4521
$$ -32134 -38452 -21564 -31067 -39130 -57853 -34072 -50763 -40658 -12823 -6791 -32584 -18063
11174a8063Q618M8405k7696l0859j798k0171J4134J3762r853J2450K8683J4744
$$ -18063 -9445 38960 11264 -19595 -21393 -41564 -27430 -13668 -23521 -11071 17612 32356
11162C2356p440n3390l1223k5287n508Q547L5889K8688K8604P060M232J8162K8934
$$ 32356 24916 -28474 -59697 -84984 -90492 -81945 -46056 -17368 11236 18296 22528 40690 69624
11149F9624n81K626n54k8542l4689m6913k6873Q333K3455m331q287J5453j435
$$ 69624 69043 71669 71115 42573 7884 -39029 -65902 -57569 -34114 -38445 -46732 -31279 -32714
11136c2714M616j2164O615N9432l997l1643O705K1774K101j4710p109k5172j5319
$$ -32714 -28098 -40262 -33647 25785 21788 -9855 -3150 18624 20725 6015 -1094 -26266 -41585
11123d1585j365J2650p95K9864L0959Q254k0443j6016K5324J9161L0326o223k8812
$$ -41585 -42950 -30300 -31095 -1231 29728 37982 17539 1523 26847 46008 76334 70111 41299
11110D1299l0349n4805L5223j4383j6203L674K2203j277k1574R992l8829K5724
$$ 41299 10950 -43855 -8632 -23015 -39218 -35544 -13341 -14618 -36192 -26200 -65029 -39305
11098c9305K9570K7183p372O741r105m759K7060j9910j0468p127o618L2259K744
$$ -39305 -9735 17448 10076 16817 7712 2953 30013 10103 -365 -7492 -14110 18149 20893
11085B0893k909n999k0388j4794m979M2036J3239m404j3493k0617J750M0004J6077
$$ 20893 17984 11985 -8403 -23197 -28176 13860 27099 22695 9202 -11415 -9665 30339 46416
11072D6416J583j0929l7661k9529j420K3527J5507k3298j5775J1856P32J7412
$$ 46416 47999 37070 -591 -30120 -31540 -8013 7494 -15804 -31579 -19723 -18991 -1579
11060a579j7080k7720j2304L0147N4562k883k4097k3143K7582j4718k8907m044
$$ -1579 -18659 -46379 -58683 -28536 26026 23143 -954 -24097 3485 -11233 -40140 -44184
11048d4184j4795k761K0124K300Q20J0034O80m49n091m651Q669M8239n561k4064
$$ -44184 -58979 -61740 -41616 -39316 -38496 -28462 -27782 -28231 -33322 -37973 -29304 18935 13374 -10690
11034a0690q819J5443K7580j0550l5702O289N1617L3708k187m5138n1052k9945
$$ -10690 -19509 -4066 23514 12964 -22738 -16449 35168 68876 66689 21551 -29501 -59446
11022e9446j2032J5540K6927J4629K7920L4732o260J563l8003j8426N943Q687
$$ -59446 -71478 -55938 -29011 -14382 13538 48270 42010 43573 5570 -12856 -6913 1774
11010A774J3016n372K1365k0166m0166J6169K4589l890m888K1831J2159m48k5214
$$ 1774 14790 9418 30783 10617 -29549 -13380 11209 7319 2431 24262 36421 35973 10759
10997A0759j2817j4043M220m1755Q544K6286K6397R566J6677j4279k7164K6971
$$ 10759 -2058 -16101 -11881 -53636 -45092 -18806 7591 17157 33834 19555 -7609 19362
10985A9362q398j4542o444k202q675n2187k110K8109K5846K3035r431O196j3572
$$ 19362 10964 -3578 -10022 -12224 -20899 -73086 -75196 -47087 -21241 1794 -7637 -1441 -15013
10972a5013j1357n304l213j4095o434J0076K6731N891q625L8999j758j8559r07
$$ -15013 -26370 -31674 -34887 -48982 -55416 -45340 -18609 -12718 -21343 17656 15898 -2661 -3568
10959c568r435M8795L0613J817j9261k4521k4996m918K4164Q08N709J8139k7765
$$ -3568 -13003 35792 66405 68222 48961 24440 -556 -5474 18690 19498 25207 43346 15581
10946A5581l2988M2949J3322l113K5727j098l0962k0752l315K1923j4251l4665
$$ 15581 -17407 25542 38864 35751 61478 60380 29418 8666 5351 27274 13023 -21642
10934b1642j5111J6970N522J2438J2196J2485j0444k6331k8384J730L1279R302
$$ -21642 -36753 -19783 -14261 -1823 10373 22858 12414 -13917 -42301 -40571 -9292 10
10922A0N804p899P360Q387m1009k1125J3170J6495P81m200K2508J7249K4283L944
$$ 10 5814 -2085 5275 13662 -27347 -48472 -35302 -18807 -18026 -22226 282 17531 41814 45758
10908D5758n8397l1212P611j7333r019J1451o175K6900J0649J1868J6435q180
$$ 45758 -12639 -43851 -36240 -53573 -62592 -51141 -57316 -30416 -19767 -7899 8536 356
10896C56K3092M0508j7613Q565Q109l0251k0815J2630l6608j7896q090L583L9750
$$ 356 23448 63956 46343 54908 63017 32766 11951 24581 -12027 -29923 -38013 -34430 5320
10883E320J3334k614j5730l360J070K996J4981P959J1213O307k2962M654l8154
$$ 5320 18654 16040 310 -3050 -1980 1016 15997 23956 35169 41476 18514 23168 -14986
10870a4986j7041k1784n577p91j2600L3364K9326J2800n897j7851l864l902J4594
$$ -14986 -32027 -53811 -59388 -60179 -72779 -39415 -10089 2711 -3186 -21037 -24901 -28803 -14209
10857a4209L5364o524j0267L8827K530k2713k4239L356L2013k5465O816L6553
$$ -14209 21155 14631 4364 43191 45721 23008 -1231 2125 34138 8673 15489 52042
10845E2042j6107l6480j1400k7413l4133J4624j7320o948L8483M1335J1581l839
$$ 52042 35935 -545 -11945 -39358 -73491 -58867 -76187 -83135 -44652 -3317 8264 4425
10833D425m8235k4101K5862L7776K0682j0108Q709l9474j7978L4912K0400j6028
$$ 4425 -43810 -67911 -42049 -4273 16409 6301 15010 -24464 -42442 -7530 12870 -3158
10821c158n625M494n95R352R123j7483n527j0532k1168L4880L001m0199j8366
$$ -3158 -8783 -4289 -4884 4468 13591 -3892 -9419 -19951 -41119 -6239 -3238 -43437 -61803
10808f1803J0579J5803K2944L2786K7607M374p870k5901J86J1457j0760k4438
$$ -61803 -51224 -35421 -12477 20309 47916 52290 44420 18519 18705 30162 19402 -5036
10796e036l9177N329K6371j8252k3034J2367J7149J6270n850J0938J3741O558
$$ -5036 -44213 -38884 -12513 -30765 -53799 -41432 -24283 -8013 -13863 -2925 10816 17374
10784A7374O801M756J230o140K449j0142k1498K6931p40k7419L408K6998O08k7474
$$ 17374 24175 28931 30161 24021 26470 16328 -5170 21761 21021 -6398 -2990 24008 24616 -2858
10770b858R205j8362k299K1730J5474O462m7974J024K2076J1735J6977L4150K0872
$$ -2858 6347 -12015 -14314 7416 22890 29352 -18622 -17598 4478 16213 33190 67340 88212
10757H8212q082k1526k9017k2075j0769k0999j0242j0594J3810K1080J4045N569
$$ 88212 80130 58604 29587 7512 -3257 -24256 -34498 -45092 -31282 -10202 3843 9412
10745I412k481O329J1944o511j1056J2669K1387j2486k4853K2354K5656P39O2923
$$ 9412 6931 13260 25204 18693 7637 20306 41693 29207 4354 26708 52364 53103 116026
10732A16026K8415K3987N1424N4878J04917R3741n8106j07005j06855p4734n409
$$ 116026 144441 168428 219852 274730 379647 473388 415282 308277 201422 126688 121279
10721A21279l0157j3082M738j1897N277J2194l8170l2900k6539n69K3220j5046
$$ 121279 91122 78040 82778 70881 76158 88352 50182 17282 -9257 -9826 13394 -1652
10709a652q544K4556L0831k9523m5997j4751K8752L6550K1557L137M919q858m030
$$ -1652 -10196 14360 45191 15668 -30329 -45080 -16328 20222 41779 44916 49835 40977 36947
10696C6947J4070m2724l4980L7496o789j8736J9563L9825K4502k242j4581j2860
$$ 36947 51017 8293 -26687 10809 4020 -14716 4847 44672 69174 66932 52351 39491
10684C9491K2213O383l4433k9332k2500k5336R147n48j4639L2734J3452l3172
$$ 39491 61704 68087 33654 4322 -18178 -43514 -34367 -34915 -49554 -16820 -3368 -36540
10672c6540l9607N750J4384K8535k7626J2488J2749k613j3878l292k645L054L4070
$$ -36540 -76147 -70397 -56013 -27478 -55104 -42616 -29867 -32480 -46358 -49650 -52295 -49241 -15171
10659a5171M9126L2259k7113l4309k8826j7202l759J3460K0648K7171J861J9634
$$ -15171 33955 66214 39101 4792 -24034 -41236 -44995 -31535 -10887 16284 18145 37779
10647C7779j128m730j8706r640L1933k365m1117N103r183J6654J0959L190k4613
$$ 37779 36651 31921 13215 3575 35508 33143 -7974 -2871 -12054 4600 15559 18749 -5864
10634e864M122Q223J5433p779J7449J3627p165J0231K202k529l222k7990o3949
$$ -5864 -1742 6481 21914 14135 31584 45211 38046 48277 50479 47950 44728 16738 -47211
10621d7211j0084N7566N2968J4341l5664m9445N361L0106M833k383k8380J5480
$$ -47211 -57295 271 53239 67580 31916 -17529 -12168 17938 22771 20388 -7992 7488
10609G488P924m739p384P339L2988j8574j8638j7855m3354q749K7354k747R244
$$ 7488 15412 10673 3289 10628 43616 25042 6404 -11451 -54805 -63554 -36200 -38947 -29703
10596b9703M3374m613k3078j3501J9392m485J8752K5103J4662j1647j9732j47
$$ -29703 13671 9058 -14020 -27521 -8129 -12614 6138 31241 45903 34256 14524 14377
10584A4377K8081j9315j5537J8697Q101o392l244J4864J1244j0940l9645l0352
$$ 14377 42458 23143 7606 26303 34404 28012 24768 39632 50876 39936 291 -30061
10572c0061R496J1427k5189l0921J9047Q87j1932J7443N6356l5461n2296k3161
$$ -30061 -20565 -9138 -34327 -65248 -46201 -45314 -57246 -39803 16553 -18908 -71204 -94365
10560i4365L7533J5144J0517K2159k700j0739j3369j936K6648J4757J7568l0255
$$ -94365 -56832 -41688 -31171 -9012 -11712 -22451 -35820 -37756 -11108 3649 21217 -9038
10548i038m0261j0774J5272J0958J4105k9846o957l167k0060l575K8184M1028
$$ -9038 -49299 -60073 -44801 -33843 -19738 -49584 -56541 -59708 -79768 -83343 -55159 -14131
10536a4131K4417J401j7450j3276k8510N242J9015O577m6572j5565L0276L3224
$$ -14131 10286 11687 -5763 -19039 -47549 -42307 -23292 -16715 -63287 -78852 -48576 -15352
10524a5352J5395j3047L626K0590Q37o1672j801J751J4941R545L6539Q107m4081
$$ -15352 43 -13004 -9378 11212 12049 -49623 -51424 -49673 -34732 -25187 11352 19459 -24622
10511b4622K417L6036l4661q975J0522J0222J2914M2400r632l771k4646j9966
$$ -24622 -22205 13831 -20830 -29805 -19283 -9061 3853 46253 36621 32850 8204 -11762
10499a1762k9058k1347L46M7378J3055J5201m50j0992M7j8854J5833J3766O141
$$ -11762 -40820 -62167 -61821 -14443 -1388 13813 13363 2371 2418 -16436 -603 13163 19304
10486A9304k9960j2683L351j1893j5646j2783M0144M5614L8589q999l5972j5053
$$ 19304 -10656 -23339 -19988 -31881 -47527 -60310 -20166 25448 64037 55038 19066 4013
10474D013J496j4542k807j70l62R283J8362l0188Q081K9174k547K4095j573r251
$$ 4013 5509 -9033 -11840 -12010 -12372 -3089 15273 -14915 -6834 22340 19793 43888 42315 33064
10460C3064K4131k437k9539k1497k2165J2018K9101J6325j7097j6013K931N895
$$ 33064 57195 54758 25219 3722 -18443 -6425 22676 39001 21904 5891 8822 14717
10448A4717J0037M1458l3658l5780O705O556k743J2827O707k4763L7759L7008
$$ 14717 24754 66212 32554 -3226 3479 10035 7292 20119 26826 2063 39822 76830
10436G6830k1939O379O783j0042j5645j6250j8904k5911K0234J7153O97m47L3823
$$ 76830 54891 61270 68053 58011 42366 26116 7212 -18699 1535 18688 19385 18938 52761
10423E2761M7828q37m2467l6235k6536J141P491K1508J5334j294k9471r792l152
$$ 52761 100589 99752 57285 21050 -5486 -4345 3146 24654 39988 38694 9223 -569 -3721
10410c721k210k4969j8528J1216L5676K4380m9776O299j2261J1722l3557r658
$$ -3721 -5931 -30900 -49428 -38212 -2536 21844 -27932 -21633 -33894 -22172 -55729 -65387
10398f5387K3048M6960J8432l3809j0355K9227J7835j4515j9879M054Q15n380
$$ -65387 -42339 4621 23053 -10756 -21111 8116 25951 11436 -8443 -4389 -3574 -8954
10386h954p48L783j0673k4809n997O795K8389J5806K2079K455p36K0322K1601
$$ -8954 -9702 -5919 -16592 -41401 -47398 -40603 -12214 3592 25671 28126 27390 47712 69313
10373F9313l6628m9395j6767R505J4895j5604k9748j2661M7331o744l0758J7547
$$ 69313 32685 -16710 -33477 -23972 -9077 -24681 -54429 -67090 -19759 -26503 -57261 -39714
10361c9714L1757r00l2140M044L0995q858P722J233K3968j3004P843K5241j2781
$$ -39714 -7957 -8857 -40997 -36953 -5958 -14816 -7094 -5861 18107 5103 12946 38187 25406
10348B5406l2298P091L299l5979p917J3171J7858J8584R005k8537J1666Q678k7637
$$ 25406 -6892 199 3498 -32481 -40398 -27227 -9369 9215 18220 -10317 1349 10027 -17610
10335a7610P217O1503K0162J5471l218j2005k0833r448k2629j5205J2063J2364
$$ -17610 -10393 51110 71272 86743 83525 71520 50687 41239 18610 3405 15468 27832
10323B7832J9378K4373m032j5209m758m0541k0878L4678L4128N0172k650k7529
$$ 27832 47210 71583 67551 52342 47584 7043 -13835 20843 54971 105143 102493 74964
10311G4964j0617k5046L167o182L639j3150q656m563n427n174O889O919Q434L40
$$ 74964 64347 39301 42468 36286 39925 26775 18119 13556 8129 2955 9844 16763 25197 25537
10297B5537j0667k0507L4230J978J6556j7750k7956L2592L2822J4942m9718j6019
$$ 25537 14870 -5637 28593 30571 47127 29377 1421 34013 66835 81777 32059 16040
10285A6040J3361l6331n457J7136j4748O898j2234l1871J2350j646L7016J6816
$$ 16040 29401 -6930 -12387 4749 -9999 -3101 -15335 -47206 -34856 -36502 514 17330
10273A7330m681m235j3629J4700Q828K488j1651J5003O297l4241k8335J8537m1293
$$ 17330 12649 8414 -5215 9485 18313 20801 9150 24153 30450 -3791 -32126 -13589 -54882
10260e4882j698p529K4521L7286J6372j0757k9752J5583K6801k073Q168J5166
$$ -54882 -56580 -64109 -39588 -2302 14070 3313 -26439 -10856 15945 13872 22040 37206
10248C7206J136P29j001l4696L711O372q776J4253n2481k1612L0466q09J0327
$$ 37206 38342 39071 38070 3374 7085 13457 4681 18934 -33547 -55159 -24693 -25502 -15175
10235a5175J8946l596l5822J3109L1639j1459r658k553K6053K1069k1515n0967
$$ -15175 3771 175 -35647 -22538 9101 -2358 -12016 -14569 11484 32553 11038 -39929
10223c9929j2886K3217K7030J1603k2554k4580P961K710j7642M188L148M128K2571
$$ -39929 -52815 -29598 -2568 9035 -13519 -38099 -30138 -27428 -45070 -40882 -37734 -33606 -11035
10210a1035J311N280k216j5470k0372Q100p86m84K3741J9159k5297r257m2567
$$ -11035 -9724 -4444 -6660 -22130 -42502 -34402 -35188 -35672 -11931 7228 -18069 -27326 -69893
10197f9893J7789L8034K8006K9240j1154m892j0303k3179K9843j4988k3322p592
$$ -69893 -52104 -14070 13936 43176 32022 27130 16827 -6352 23491 8503 -14819 -22411
10185b2411K886n849m870q225J1171K3930K9137L6498J0429K888k535k0350m3799
$$ -22411 -19525 -25374 -30244 -38469 -27298 -3368 25769 62267 72696 75584 73049 52699 8900
10172H900j1804K053k3548p427J4708M3075K4174j8806k5451l9322j5929o511
$$ 8900 -2904 -851 -24399 -31826 -17118 25957 50131 31325 5874 -33448 -49377 -55888
10160e5888N3153K5786j0011j1569l4901K210J0485Q311n160K4670K4883L848
$$ -55888 -2735 23051 13040 1471 -33430 -31220 -20735 -12424 -17584 7086 31969 35817
10148C5817P948n1110K2231j8126o395r051J1097r252R488J2670k057m971j0676
$$ 35817 43765 -7345 14886 -3240 -9635 -18686 -7589 -16841 -7353 5317 3260 -1711 -12387
10135a2387K3459L893j2592L0591j1055j2475l6224o61K1649J8617K8753l6258
$$ -12387 11072 14965 2373 32964 21909 9434 -26790 -27451 -5802 12815 41568 5310
10123E310l8814j0968l073J5018K4909q330K4304L4058l570l2009k979N3311R304
$$ 5310 -33504 -44472 -47545 -32527 -7618 -15948 8356 42414 38844 6835 3856 57167 66471
10110F6471m58k6426l1838k2611J6264K0179J0910J1252j9471M038L1609j4081
$$ 66471 66013 39587 7749 -14862 1402 21581 32491 43743 24272 28310 59919 45838
10098D5838j4798K208J0323k9473l8674o620N3126J7706J687l1255J0380j3648
$$ 45838 31040 33248 43571 14098 -24576 -31196 21930 39636 41323 10068 20448 6800
10086F800k1204m068j1865p842J1896J2040k597J8513N919q019K9729r416q895
$$ 6800 -14404 -18472 -30337 -38179 -26283 -14243 -16840 1673 7592 -427 29302 19886 10991
10073A0991P755j0958q40J7573O15j904J5081N61K6987K7190j3773m7939N310
$$ 10991 18746 7788 6948 24521 25136 23232 38313 38874 65861 93051 79278 31339 36649
10060C6649N3338K5916J9398O627K7950P1400P3864Q4077J06709J93035K87645
$$ 36649 89987 115903 135301 141928 169878 241278 315142 399219 505928 698963 986608
10049I86608K82778J45010k44040m23793k83859j49321o6391k0169P048j2444
$$ 986608 1269386 1414396 1170356 746563 462704 313383 246992 226823 233871 221427
10039B21427n5522l1539j9380j1834M249O107k818J8j6490k0538K1508o88M323
$$ 221427 165905 134366 114986 103152 107401 113508 110690 110708 94218 73680 95188 94500 98823
10026I8823k4798k2300m6431J4282Q59k1546j001j160J9220m103O106N535q826
$$ 98823 74025 51725 5294 19576 20435 -1111 -2112 -3272 15948 11845 17951 23486 14660
10013A4660k0855j2400k6448o035J6581l61j2877K5591M5967j0183j5527L3681
$$ 14660 -6195 -18595 -45043 -51078 -34497 -34858 -47735 -22144 23823 13640 -1887 31794
10001C1794L1874m310M924l6276l768L4093k4771k7539J6032j4283j6551o066
$$ 31794 63668 59358 64282 28006 24238 58331 33560 6021 22053 7770 -8781 -14847
9989a4847N924L531k7972K4623q919J4358J1113K6830j392K4152k1062j3344j0587
$$ -14847 -8923 -5392 -33364 -8741 -17660 -3302 7811 34641 33249 57401 36339 22995 12408
9976A2408j6419J2734k8371n2585Q575N1413J7299K8752K2336P415L4048j5346
$$ 12408 -4011 8723 -19648 -72233 -63658 -12245 5054 33806 56142 63557 97605 82259
9964H2259q7082l4334o724J7704j9802q919Q924L9983K1439J9435l4758n7662
$$ 82259 -4823 -39157 -45881 -28177 -47979 -56898 -47974 -7991 13448 32883 -1875 -59537
9952e9537L1567J6006K7944l397r411N3461l148j2351J4692J5858k1887l5732
$$ -59537 -27970 -11964 15980 12583 3172 56633 53485 41134 55826 71684 49797 14065
9940A4065M605J5124J1732j9943j1025M6278K8441j1015l1537N646n0429J712
$$ 14065 18670 33794 45526 25583 14558 60836 89277 78262 46725 52371 1942 3654
9928C654l865l7002j2197M2330L0583k2871l611K6424P122k87K7993l6504m5193
$$ 3654 -211 -37213 -49410 -7080 23503 632 -2979 23445 30567 30280 58273 21769 -23424
9915b3424J9475K5779M398l4612k7245K0465L204k038l246j003J9805k2421j6371
$$ -23424 -3949 21830 26228 -8384 -35629 -15164 -11960 -13998 -17244 -18247 1558 -20863 -37234
9902c7234O877j0822P875M2048l95q615K8751J4202J8095j979n0278k3380j5109
$$ -37234 -30357 -41179 -33304 8744 8349 -266 28485 42687 60782 58803 8525 -14855 -29964
9889b9964m379J6672M9617Q938k5405L6084J8518m2559m2612K9139N051J3634
$$ -29964 -34343 -17671 31946 40884 15479 51563 70081 27522 -15090 14049 19100 32734
9877C2734n022J1553J709l4801O77M2425j2849J2676j5250l0805p094J4008L5931
$$ 32734 27712 39265 40974 6173 6850 49275 36426 49102 33852 3047 -4047 9961 45892
9864D5892l3055j9782k6303o273L0162K3411L7412L6660K658l4943j9552J3268
$$ 45892 12837 -6945 -33248 -39521 -9359 14052 51464 88124 90782 55839 36287 49555
9852D9555K0120K2778M0652Q0425P0646J3543n7680p7686p0530k2062K037r681
$$ 49555 69675 92453 133105 213530 284176 297719 240039 162353 91823 69761 71798 62117
9840F2117j6984J8500k4409n3194j1992K0147J6528L1363k0412l0343j4991L4828
$$ 62117 45133 63633 39224 -13970 -25962 -5815 10713 42076 21664 -8679 -23670 11158
9828A1158k459m1453k0352K2815K669J2344p254j7150J0673K2099Q802r628K0572
$$ 11158 8699 -32754 -53106 -30291 -27622 -15278 -22532 -39682 -29009 -6910 1892 -7736 12836
9815A2836k2743j1523P870J1915P449J0855j2307P243k4533j011K6345J8649K007
$$ 12836 -9907 -21430 -13560 -1645 5804 16659 4352 11595 -12938 -13949 12396 31045 33052
9802C3052j9191j2899o645J845J3741L810J5613j5484K724j0328k4301j0994r399
$$ 33052 13861 962 -5683 -3838 9903 13713 29326 13842 16566 6238 -18063 -29057 -38456
9789c8456K1060k0543K3780R578L2192K6750k1499R458L0513p759l0293j3868
$$ -38456 -17396 -37939 -14159 -4581 27611 54361 32862 42320 72833 65074 34781 20913
9777B0913l234J651K698N940k949l1146J6500K6316M137k3150r609k2091M079
$$ 20913 17679 19330 22028 27968 25019 -6127 10373 36689 40826 17676 8067 -14024 -9945
9764i945Q514K4118J1702j985K169j57l1427J3096L8440k1957l0873k3979n6294
$$ -9945 -1431 22687 34389 32404 34573 34416 2989 16085 54525 32568 1695 -22284 -78578
9751g8578k1057M8070P743K7824K8863Q190m3891k9150j2962j7375J9911J6606
$$ -78578 -99635 -51565 -43822 -15998 12865 21055 -22836 -51986 -64948 -82323 -62412 -45806
9739d5806K1998N5297L9543m5180K532k2459K3726L4988K882j1564K6058j884
$$ -45806 -23808 31489 71032 25852 28384 5925 29651 64639 67521 55957 82015 80131
9727H0131j2689j6132k0741J3737M3424L01l4114J1842K102P54q545l1834Q065
$$ 80131 67442 51310 30569 44306 87730 88031 53917 65759 67861 68615 60070 28236 36301
9714C6301K2167M502l9770L963L436j9328j5027M4413J8280o461l3697k7908P499
$$ 36301 58468 62970 23200 27163 30599 11271 -3756 40657 58937 52476 18779 -9129 -1630
9701a630p516O37P429K4833L3356l8684m4326p975L7486J7433q095M539l698R619
$$ -1630 -9146 -8509 -1080 23753 57109 18425 -25901 -33876 3610 21043 12948 17487 13789 23408
9687B3408J1695q080l7080k4166J2515K6983J7225j0800J9127J6319j2184j0340
$$ 23408 35103 27023 -10057 -34223 -21708 5275 22500 11700 30827 47146 34962 24622
9675B4622n189o569k2253j4586j3833J6784R360j5351p60J4878j0509N638O294
$$ 24622 19433 12864 -9389 -23975 -37808 -21024 -11664 -27015 -27775 -12897 -23406 -17768 -11474
9662a1474k352k6503j7743K7124K5580L812k5284j9984K0359L2954K083j2010
$$ -11474 -13826 -40329 -58072 -30948 -5368 -1556 -26840 -46824 -26465 6489 8572 -3438
9650c438m030q224j5309L3559M189j5584l639O97l3873J5532L3652K0068p749
$$ -3438 -7468 -15692 -31001 2558 6747 -8837 -12476 -11779 -45652 -30120 3532 23600 15851
9637A5851j2543j3386k0922j3629m833L9267J6568l353j9823Q851L6311L7624
$$ 15851 3308 -10078 -31000 -44629 -49462 -10195 6373 3020 -16803 -7952 28359 65983
9625F5983J5514j5506l1333o3463k3835J1252L81K5989o295J806K5252K0115J6956
$$ 65983 81497 65991 34658 -28805 -52640 -41388 -41007 -15018 -21313 -19507 5745 25860 42816
9612D2816r386J0374l6750j1714j5246N849K0910l44j5317j1829l8141K707O403
$$ 42816 33430 43804 7054 -4660 -19906 -14057 6853 6509 -8808 -20637 -58778 -56071 -49668
9599d9668N756L8264P25j7351p528Q245K1075J5494K5832J1684k7941L0131P453
$$ -49668 -43912 -5648 -4923 -22274 -29802 -21557 -482 15012 40844 52528 24587 54718 62171
9586F2171k8993k5243j7684l6353j68K6985J6840q144N135L3000J2176L902j4402
$$ 62171 33178 7935 -9749 -46102 -46270 -19285 -2445 -10589 -5454 27546 39722 43624 29222
9573B9222L941j3084j7003q460m597k1210k5333M727M2988L1671J4978p358p531
$$ 29222 33163 20079 3076 -5384 -9981 -31191 -56524 -51797 -8809 22862 37840 30482 22951
9560B2951j2298l8106k8793R954K0748L4735j03k6753o235M1045M3784K7469k3267
$$ 22951 10653 -27453 -56246 -46292 -25544 9191 9088 -17665 -23900 17145 60929 88398 65131
9547F5131k5480K7610O042m6008r622J5079k7983j5082Q055K1740K3135k7031
$$ 65131 39651 67261 73303 27295 17673 32752 4769 -10313 -2258 19482 42617 15586
9535A5586k5241k6517K0680l4257j1342J6364J5809q847j0710K1747L3528k0035
$$ 15586 -9655 -36172 -15492 -49749 -61091 -44727 -28918 -37765 -48475 -26728 6800 -13235
9523a3235J6889J4426k0396j0980j9133P91K0733M7664k8676m1978j581R712M6298
$$ -13235 3654 18080 -2316 -13296 -32429 -31638 -10905 36759 8083 -33895 -35476 -25764 20534
9510B0534k146j9539j274j3765j9506k623K5321J6326K7787k9575p044j796m3310
$$ 20534 18388 -1151 -2425 -16190 -35696 -38319 -12998 3328 31115 1540 -5504 -7300 -50610
9497e0610o64Q041N1462J1002k5177N472J0110q491J2209j5512K3033p199J0406
$$ -50610 -51274 -43233 8229 19231 -5946 -474 9636 1145 13354 -2158 20875 13676 24082
9484B4082J0180j7074J3072j9191k3182j6972n93L2043L6894M9373j6212l6118
$$ 24082 34262 17188 30260 11069 -12113 -29085 -29678 2365 39259 88632 72420 36302
9472C6302k4126k1499K3863l3908l7958O800R381J3330L5320o855l6330J7197
$$ 36302 12176 -9323 14540 -19368 -57326 -50526 -41145 -27815 7505 650 -35680 -18483
9460a8483L3346J2090l247m98r519p531N653K4719R97j3122L6779K5678l971k4525
$$ -18483 14863 26953 23706 23208 13689 6158 11811 36530 37527 24405 61184 86862 82891 58366
9446E8366l5386n117J9017O588J1179J2263J9469j2839j5476j0206k1129j2759
$$ 58366 22980 17863 36880 43468 54647 66910 86379 73540 58064 47858 26729 13970
9434A3970j915K1723k3430j1065Q801K87o767p115j6797K4674K505J4445K1396
$$ 13970 12055 33778 10348 -717 8084 8371 1604 -5511 -22308 2366 4871 19316 40712
9421D0712j3175k8652L1661J7331k3673q717K9997M955n102J0738J5167K491l4765
$$ 40712 27537 -1115 30546 47877 24204 15487 45484 50439 45337 56075 71242 73733 38968
9408C8968R264k6637r560L4359M125K0586M443k4825l2161n4193l542j1628P996
$$ 38968 48232 21595 12035 46394 50519 71105 75548 50723 18562 -35631 -39173 -50801 -42805
9395d2805J891o079K4589M6981q500q321m211J2135J7509L1879J9188k717k2540
$$ -42805 -40914 -46993 -22404 24577 16077 7756 3545 15680 33189 65068 84256 81539 58999
9382E8999J7902L655k5960j3182k550K616l2360J936k3520O067J7401J9905q20
$$ 58999 76901 80556 54596 41414 38864 41480 9120 11056 -12464 -6397 11004 30909 30089
9369C0089l412J2223R893j9897J5799L8508K6762j750l9193n0393o5046J7387
$$ 30089 26677 38900 48793 28896 44695 83203 109965 108215 69022 18629 -46417 -29030
9357b9030o636J2295L2791k762J230K0256j7036j4525K3705o049J6886Q057l7110
$$ -29030 -35666 -23371 9420 6658 7888 28144 11108 -3417 20288 14239 31125 39182 2072
9344B072l2450j5701L3244N521O588J1808N2373m65j3234R741j951m1246j4436
$$ 2072 -30378 -46079 -12835 -7314 -726 11082 63455 62990 49756 59497 57546 16300 1864
9331A864j7657N590L3287Q908k5237l4527j4702J588K5220J6248J3713O253k3637
$$ 1864 -15793 -10203 23084 31992 6755 -27772 -42474 -40886 -15666 582 14295 20548 -3089
9318c089O891k7592l5648j2J1110O2299M1203m7172l7836M9053L502o260n091
$$ -3089 3802 -23790 -59438 -59450 -48340 13959 55162 7990 -29846 19207 22709 16449 11358
9305A1358J948j8103P778n03J7962J1711m87K331j7276n321o390L267k9566j4746
$$ 11358 13306 -4797 2981 2478 20440 32151 31664 33995 16719 11398 5008 8275 -21291 -36037
9291c6037J1379J6872K7238q190k0110j3338k863j7621J3595K8489K4631j0878
$$ -36037 -24658 -7786 19452 11262 -8848 -22186 -25049 -42670 -29075 -586 24045 13167
9279A3167P72j507j1563j4607Q156J4538M619M082J9614L7624j0411k753n648
$$ 13167 13939 12432 869 -13738 -5582 8956 13575 17657 37271 74895 64484 61731 56083
9266E6083q177m462J1373j194k5290l2281l2899Q710K672Q800m025r831J9006
$$ 56083 47906 43444 54817 53623 28333 -3948 -36847 -28137 -25465 -16665 -20690 -30521 -11515
9253a1515J4245l7932L3671J6565k9009L584M8398L6156k3103k1692j8577q812
$$ -11515 2730 -35202 -1531 15034 -13975 -10391 38007 74163 51060 29368 10791 1979
9241A979j1168L55n06l6428j5233J2155K0956J1502j734o640j2341Q655J7503
$$ 1979 -9189 -8834 -9340 -45768 -61001 -48846 -27890 -16388 -18122 -24762 -37103 -28448 -10945
9228a0945O93M0002K2904n191k7894k4783K9158J2457J3730l032m829P63J7864
$$ -10945 -10252 29750 52654 47463 19569 -5214 23944 36401 50131 47099 42270 43033 60897
9215F0897m573l5603K420J8147l6189l1829K1269L0823N618k2945m2712R408M069
$$ 60897 56324 20721 23141 41288 5099 -26730 -5461 25362 30980 8035 -34677 -25269 -21200
9202b1200J4398J7288k1234M609K7870N124R470M569k8496l3698m1534K3004K3061
$$ -21200 -6802 10486 -10748 -6139 21731 26855 36325 40894 12398 -21300 -62834 -39830 -16769
9189a6769L922K1016K469r338L9478L0015k1654j8841j2402J323j8844m364K0373
$$ -16769 -12847 8169 10638 1300 40778 70793 49139 30298 17896 19219 375 -3989 16384
9176A6384J0107j1188J170K33L0789Q928k9571q248J8177K5742K4936l7948O818
$$ 16384 26491 15303 16473 16706 47495 56423 26852 18604 36781 62523 87459 49511 56329
9163E6329M3693j2353k2846q268k2979k1443R872L2334J7640K3879N8971M6681
$$ 56329 100022 87669 64823 56555 33576 12133 22005 54339 71979 95858 154829 201510
9151B01510M2779j6014k1749j2894l2880l6817l5749L3782J8370r374O261J0058
$$ 201510 244289 228275 206526 193632 160752 123935 88186 121968 140338 130964 137225 147283
9139A47283m112O426J2228n047M4881n122K302L9051M4359N0115M2418O5227J05891
$$ 147283 143171 149597 161825 156778 201659 196537 198839 237890 282249 332364 374782 440009 545900
9126E45900Q4049Q8722J19476J98983K71106L22477M00100N14997O61675Q64886
$$ 545900 629949 718671 838147 1037130 1308236 1630713 2030813 2545810 3207485 4072371
9116D072371J200663J671821K110389K254343J140567j556637k978849k446599
$$ 4072371 5273034 6944855 9055244 11309587 12450154 10893517 7914668 5468069
9108E468069j594311j006463n98885l83397k90958k16299j59827j28563q5302
$$ 5468069 3873758 2867295 2268410 1885013 1594055 1377756 1217929 1089366 1004064
9099A004064p3563q5718l0019r979m4383n4019k1306n9752m7152k4311L237l5019
$$ 1004064 930501 844783 814764 804785 760402 706383 685077 625325 578173 553862 557099 522080
9087E22080k5854O58j4540k1201Q173K05k5560o205Q936j9221n3944l6922J8612
$$ 522080 496226 496884 482344 461143 469316 469521 443961 437756 446692 427471 373527 336605 355217
9074C55217J7421m3890j4624j8360k5877k5572M647N44j5124j131K0549j0985
$$ 355217 372638 328748 314124 295764 269887 244315 248962 249506 234382 233251 253800 242815
9062B42815j3568L798O770p769l913j4673m5858k5400O77J4228k3293P7k8125
$$ 242815 229247 233045 239815 232046 228133 213460 167602 142202 142879 157107 133814 133891 105766
9049A05766m0327J3023K9929K9951J2900k4882j9020k8523R664J5585k1608k450
$$ 105766 65439 78462 108391 138342 151242 126360 107340 78817 88481 104066 82458 80008
9037H0008J1791J1359j0293k3965p798J4089p068j1198M23L0358K6410n1450l3077
$$ 80008 91799 103158 92865 68900 61102 75191 68123 56925 57348 87706 114116 62666 29589
9024B9589R42p754j6610P491J0182J2928p174K2083K8303k0613j9088N823r1l0298
$$ 29589 30531 22777 6167 13658 23840 36768 29594 51677 79980 59367 40279 46102 46011 15713
9010A5713j0309J8441J0884l8850K998j2197k5095j96p055J4454J0846N0279J8242
$$ 15713 5404 23845 34729 -4121 -1123 -13320 -38415 -38611 -45666 -31212 -20366 29913 48155
8997D8155k2096l5389k55o17M7690K7399J68k8101L310J6167K2666J0856k311
$$ 48155 26059 -9330 -9585 -10202 37488 64887 65055 36954 40264 56431 79097 89953 87642
8984H7642j8423l5711Q965k2665j0242K3169O454j447q377J8417M519K020k5221
$$ 87642 69219 33508 42473 19808 9566 32735 39189 37742 29365 47782 52301 54321 29100
8971B9100m4246n624L0355J7772j0681K5558J2006J0552k5422m3800j9176J7375
$$ 29100 -15146 -20770 9585 27357 16676 42234 54240 64792 39370 -4430 -23606 -6231
8959f231L4382M601N441j1423r330J0472J1220m1489j874J5261J0630r163j3795
$$ -6231 28151 32752 38193 26770 17440 27912 39132 -2357 -4231 11030 21660 12497 -1298
8946a298K0065o831l420L5670l4550n5243J174J5336J3523O755J1330M769k7268
$$ -1298 18767 11936 8516 44186 9636 -45607 -44433 -29097 -15574 -8819 2511 7280 -19988
8933a9988l798Q45j0482p01P074j4256J0185K3725J9863r540j4080j7370K6300
$$ -19988 -23786 -22941 -33423 -34124 -27050 -41306 -31121 -7396 12467 2927 -11153 -28523 -2223
8920b223Q978J5951k46N965k7346m9833j0136L1925K2388N001J8920L088j3282
$$ -2223 6755 22706 22460 28425 1079 -48754 -58890 -26965 -4577 424 19344 22432 9150
8907I150K6955j6599j6640M5113J5160l6141m3489N351M7270k7116K790N279K2308
$$ 9150 36105 19506 2866 47979 63139 26998 -16491 -11140 36130 9014 11804 17083 39391
8894C9391L2691m548k4188J734J733n960l6666J6004m642l6999m419L143j275
$$ 39391 72082 67534 43346 45080 46813 40853 4187 20191 15549 -21450 -25869 -22726 -24001
8881b4001J0776L2807J4383m4138n3481K395O0651M939k3842K147J3553k9139
$$ -24001 -13225 19582 33965 -10173 -63654 -61259 -608 4331 -19511 -17364 -3811 -32950
8869c2950L0871O676j4806K0147J4721k0649R20K7500j8196p99R787K2751m255
$$ -32950 -2079 4597 -10209 9938 24659 4010 4930 32430 14234 13435 23222 45973 41718
8856D1718o457J15J275l6554M157J7740k4797j0475K1373j4728L622J6521j8284
$$ 41718 35261 35376 36651 97 4254 21994 -2803 -13278 8095 -6633 -3011 13510 -4774
8843d774j8839N237L2206j1640k071q666n641L5715J0751J702k6536m136K3998
$$ -4774 -23613 -18376 13830 2190 119 -8547 -14188 21527 32278 33980 7444 3308 27306
8830B7306k6182j2093K5029N1730o3m4470J5505J029o772p946k2223K1465K418
$$ 27306 1124 -10969 14060 65790 65727 21257 36762 37791 31019 23073 850 22315 24733
8817B4733J8839K2743k0515k7666J4368j06N02L6990m150m0330j9175J0298j5572
$$ 24733 43572 66315 45800 18134 32502 32396 32898 69888 65738 25408 6233 16531 959
8804I59Q660J0137k2538j7905J1686L49O74m760O100l664Q290M8030L1769m369
$$ 959 9619 19756 -2782 -20687 -9001 -8652 -7978 -12738 -6638 -10302 -2012 46018 77787 73418
8790G3418j5651k7146k1008j8110k838P413J064k8428j3904j655J5401J3563J0235
$$ 73418 57767 30621 9613 -8497 -11335 -3922 -2858 -31286 -45190 -46845 -31444 -17881 -7646
8777g646L820K6110r91k1376j5265M0380M2508K0624l0748m5098j4699j4514k6513
$$ -7646 -3826 22284 21293 -83 -15348 25032 67540 88164 57416 12318 -2381 -16895 -43408
8764d3408j2988Q405M2443J4417K0313J3141l4016Q582q561k4684o799m148J6472
$$ -43408 -56396 -47991 -5548 8869 29182 42323 8307 16889 8328 -16356 -23155 -27303 -10831
8751a0831k6077l393M7567K0334J2947J6500r004J9089k1187P19m3020k5173M237
$$ -10831 -36908 -40301 7266 27600 40547 57047 48043 67132 45945 46664 3644 -21529 -17292
8738a7292M3917J5054j256k383o989R364J482j3352l4101L200m746l3719J4670
$$ -17292 26625 41679 40423 38040 31051 40415 41897 28545 -5556 -2356 -7102 -40821 -26151
8725b6151K3053L3476n238k829K3012l897n416j5526J3053o520j1409J8819P135
$$ -26151 -3098 30378 25140 22311 45323 41426 36010 20484 33537 27017 15608 34427 41562
8712D1562J523R892r760o90n051Q60L4589j955m2056l8934k4138L6056M6018L5166
$$ 41562 43085 52977 43217 42527 37476 38336 72925 70970 28914 -10020 -34158 1898 47916 83082
8698H3082k1529j4855L5530o99j2813m6739l4206M78N951m20J658J8291J0390
$$ 83082 61553 46698 82228 81529 68716 21977 -12229 -11751 -5800 -6220 -4562 13729 24119
8685B4119p125l419j7355q101j6314J3307j5139k0841L2437O861m553K9232K6333
$$ 24119 16994 13575 -3780 -11881 -28195 -14888 -30027 -50868 -18431 -11570 -16123 13109 39442
8672C9442j8083j0985J5613J0251J5831o208m2450m668L5399K1572k6949o0301
$$ 39442 21359 10374 25987 36238 52069 45861 3411 -1257 34142 55714 28765 -31536
8660c1536K5124j02J2597k9675K0973J5079K0084K4033P447j0062l0518O52j8730
$$ -31536 -6412 -6514 6083 -23592 -2619 12460 32544 56577 64024 53962 23444 24096 5366
8647E366L4969N0599K0840J0826p85K154k7735p584l2935l5449j9186L5054J30
$$ 5366 40335 90934 111774 122600 121815 123969 96234 88650 55715 20266 1080 36134 36264
8634C6264J619j8932J1544K9120J4155P67j5614j8799J1568n949J519R224J705
$$ 36264 37883 18951 30495 59615 73770 74537 58923 40124 51692 45743 47262 56486 58191
8621E8191K523J4033j4687O526j1192J0026J851Q375J9565J0530J0190L3529j0535
$$ 58191 60714 74747 60060 66586 55394 65420 67271 75646 95211 105741 115931 149460 138925
8608A38925Q85j3688m5416q651K7383N0364M2764L3426K1110n3721n0131L5753
$$ 138925 139810 126122 80706 72055 99438 149802 192566 225992 247102 193381 143250 179003
8596A79003L729m633N442L8864j6680m7057j8437K0874l2425n4388P376J1387
$$ 179003 182732 178099 183541 222405 205725 158668 140231 161105 128680 74292 81668 93055
8584I3055k1900k306K160p555n286J716M041J0409j8901j1867j4506q080K2776
$$ 93055 71155 68849 71009 63454 58168 59884 63925 74334 55433 43566 29060 20980 43756
8571D3756R372j7006o482K5744j4526j948O600j7011J6299j2911l883J2829J0181
$$ 43756 53128 36122 29640 55384 40858 38910 45510 28499 44798 31887 28004 40833 51014
8558E1014M159j6319K8609J9970J3778p837k0908m272p487j1713Q511j6270O069
$$ 51014 55173 38854 67463 87433 101211 93374 72466 68194 60707 48994 57505 41235 47304
8545D7304m6213j9151K4943l901q535J6814j9384j2516k257L3859K9218jk7819
$$ 47304 1091 -18060 6883 2982 -5553 11261 -8123 -20639 -22896 10963 40181 40180 12361
8532A2361l1693l5385J0175K4873K4180j9413q881K7900j5112L557M1652j0338
$$ 12361 -19332 -54717 -44542 -19669 4511 -14902 -23783 4117 -10995 -7438 34214 23876
8520B3876N094j7554L1670k2694j6606P566m2765k0847J1861R248k823K6558J2339
$$ 23876 28970 11416 43086 20392 3786 11352 -31413 -52260 -40399 -31151 -33974 -7416 4923
8507D923k4013k0103n479K5363n088l1099j2755J1375J8992L5289O601J5345J4277
$$ 4923 -19090 -39193 -44672 -19309 -24397 -55496 -68251 -56876 -37884 -2595 4006 19351 33628
8494C3628j915j8738O874N993P890j6042O951J2398P023L350k7522l6881J9184
$$ 33628 31713 12975 19849 25842 33732 17690 24641 37039 44062 47412 19890 -16991 2193
8481B193m313k6549L1244L8952o421q399L2319l1227m1075k024K353m295J8145
$$ 2193 -2120 -28669 2575 41527 35106 26707 59026 27799 -13276 -15300 -12947 -17242 903
8468I03l880j4368K735K372o445p141k2343o258J5580K4721R176K4056p76j3152
$$ 903 -2977 -17345 -14610 -12238 -18683 -25824 -48167 -54425 -38845 -14124 -4948 19108 18332 5180
8454E180k8251k0268k0840J9242L2009k403j3563M310k6180J2344L0137O671L2676
$$ 5180 -23071 -43339 -64179 -44937 -12928 -15331 -28894 -24584 -50764 -38420 -8283 -1612 31064
8441C1064J9588j6479k7672J7483K736l9705K4221j019j8985R424k2256q572q665
$$ 31064 50652 34173 6501 23984 26720 -12985 11236 10217 -8768 656 -21600 -30172 -38837
8428c8837n730J0553l596K773J720P293J9954K3576l239l8667l118l485L4940
$$ -38837 -44567 -34014 -37610 -34837 -33117 -25824 -5870 17706 14467 -24200 -27318 -30803 4137
8415D137R160k2164k1326P219J479K6356L6266J0173j4842K3356J1699k5364P797
$$ 4137 13297 -8867 -30193 -22974 -21495 4861 41127 51300 36458 59814 71513 46149 53946
8402E3946J3588k4640j6136l9317j3783J3222j4761K8027L6597P830J6802j3818
$$ 53946 67534 42894 26758 -12559 -26342 -13120 -27881 146 36743 44573 61375 47557
8390D7557p1177k048R374J543N986J9076j4017k9332K867L7722K2130J1426l1403
$$ 47557 -23620 -25668 -16294 -14751 -8765 10311 -3706 -33038 -30171 7551 29681 41107 9704
8377I704m7788k5777K9198M912J1726p813Q404K0122j1482j3590k4518J1197O6171
$$ 9704 -38084 -63861 -34663 -29751 -18025 -25838 -17434 2688 -8794 -22384 -46902 -35705 30466
8364C0466J8457k0361m9346j5032j7235L7318L528o262k2195j7692M6368N0767
$$ 30466 48923 28562 -20784 -35816 -53051 -15733 -12205 -18467 -40662 -58354 -11986 38781
8352C8781j9318q524j8144J0174L2269j9970L236R945j6409k1747j9921K0347
$$ 38781 19463 10939 -7205 2969 35238 15268 18504 28449 12040 -9707 -29628 -9281
8340i281J3471K184j8222P641J2213K534J6341K405l8466k2184J7752J3515Q391
$$ -9281 4190 6374 -11848 -4207 8006 10540 26881 29286 -9180 -31364 -13612 -97 8294
8327H294p14J1421l671j4474R687r367k771J6175k8389n171P836L6085p004k1995
$$ 8294 7580 19001 15330 856 10543 1176 -1595 14580 -13809 -18980 -11144 24941 17937 -4058
8313d058M505J7015l0812Q740l0101k6283K6152J840L1401J7027O632j4602j4474
$$ -4058 447 17462 -13350 -4610 -34711 -60994 -34842 -33002 -1601 15426 22058 7456 -7018
8300g018l0011L9394j691L492K1854M490K0901o630r579M021j6361O665j8439
$$ -7018 -37029 2365 674 4166 26020 30510 51411 44781 35202 39223 22862 29527 11088
8287A1088j7315j6542J2693K82m424m386j8455P486L5354j4090n197r426m4004
$$ 11088 -6227 -22769 -10076 -9794 -14218 -18604 -37059 -29573 5781 -8309 -13506 -22932 -66936
8274f6936K6410R54L3416L7012k8889k2727M487k9456j0682J7934K3370j2391
$$ -66936 -40526 -39572 -6156 30856 1967 -20760 -16273 -45729 -56411 -38477 -15107 -27498
8262b7498R844Q060j6133N803K7303j0008k3585J9007L4216L0140l6058r293k84
$$ -27498 -17654 -9594 -25727 -19924 7379 -2629 -26214 -7207 27009 57149 21091 11798 11514
8249A1514k459O11Q812q295J883Q870l622K030Q51J9309K9800P422l4093k2048
$$ 11514 9055 9666 18478 10183 12066 20936 17314 19344 20195 39504 69304 76726 42633 20585
8235B0585k2645m216J7165J2632q71o864m5809k946J4695N714J8288j7194L916
$$ 20585 -2060 -6276 10889 23521 22650 15786 -30023 -32969 -18274 -12560 5728 -11466 -7550
8222g550K9387L720l5025K6420K4583K7918K2638k1507q995k5470k1349l619P678
$$ -7550 21837 25557 -9468 16952 41535 69453 92091 70584 61589 36119 14770 11151 18829
8209A8829J4110j8934j6093R739L552M174j2286k4425K484J2816L0058M2020J9192
$$ 18829 32939 14005 -2088 7651 11203 15377 3091 -21334 -18850 -6034 24024 66044 85236
8196H5236n218l4688j3571L908J1556Q982k7021o4076r660Q278K2512J3901l3589
$$ 85236 80018 45330 31759 35667 47223 56205 29184 -34892 -44552 -36274 -13762 139 -33450
8183c3450J4698R802K703R319j073K134M01J2621O385j646j4222l7390L3503K0351
$$ -33450 -18752 -8950 -6247 3072 1999 4133 4534 17155 23540 21894 7672 -29718 3785 24136
8169B4136l2632k7736q280k0877J9989q301L5807K3014l7770l1033J0753N9488
$$ 24136 -8496 -36232 -44512 -65389 -45400 -53701 -17894 5120 -32650 -63683 -52930 6558
8157F558N703l667j2577J0560J281m55k0799n157M4777K0463l1674J076p602j5574
$$ 6558 12261 8594 -3983 6577 7858 7403 -13396 -18553 26224 46687 15013 16089 8487 -7087
8143g087k2678l8043J7462J0677K3619l648J0656M3364K1474k495R627K832k3065
$$ -7087 -29765 -67808 -50346 -39669 -16050 -19698 -9042 34322 55796 53301 62928 65760 42695
8130D2695k4770o923J5513P964Q634k794n5733j8324L0165K0288J0906n080l8315
$$ 42695 17925 11002 26515 34479 43113 40319 -15414 -33738 -3573 16715 27621 22541 -15774
8117a5774M713J7264L7914k7988k1746k0696j2660K5682K0967L4237j7146n797
$$ -15774 -11061 6203 44117 16129 -5617 -26313 -38973 -13291 7676 41913 24767 18970
8105A8970o337j748j5071l028K6309J0929j8821l3573j1268N0p948P062j4064
$$ 18970 12633 10885 -4186 -7214 19095 30024 11203 -22370 -33638 -33588 -41536 -34474 -48538
8092d8538J7552j4869J159O7740J8978l5412J8791K1726j8807o614R456J2003
$$ -48538 -30986 -45855 -44696 23044 42022 6610 25401 47127 28320 21706 31162 43165
8080D3165l6365K038k0396O66o317K3972J2243O313Q210J5435N593k2019J9140
$$ 43165 6800 8838 -11558 -10892 -17209 6763 19006 25319 33529 48964 54557 32538 51678
8067E1678J4842P583m946l3017l2396r486O629l300p651j0277Q614q552J1880
$$ 51678 66520 74103 69157 36140 3744 -5742 887 -2413 -10064 -20341 -11727 -20279 -8399
8054h399j2158O701J531J6874k9978O531n10J4710K0833m959L1215j4013J101
$$ -8399 -20557 -13856 -12325 4549 -25429 -18898 -19408 -4698 16135 11176 42391 28378 29479
8041B9479K1665p306k3948k2049p822l82J2334p604n286J7696J6066q758j5496
$$ 29479 51144 43838 19890 -2159 -9981 -10363 1971 -5633 -10919 6777 22843 14085 -1411
8028a411Q359K1952N323J6903K5253o533m239l1842j4101j4646J8027L4409j3306
$$ -1411 6948 28900 34223 51126 76379 69846 65607 33765 19664 5018 23045 57454 44148
8015D4148l7928L2046L6184L603j9091K4774K7272J0824k7454j7969J1339m375
$$ 44148 6220 38266 74450 78053 58962 83736 111008 121832 94378 76409 87748 83373
8003H3373j7790j6091J4851J7239k9030l7276O870J0846q260J6634K1414J6834
$$ 83373 65583 49492 64343 81582 52552 15276 22146 32992 24732 41366 62780 79614
7991G9614N4118J4108l7303l0922Q944j3933m3642K977L754k5510l3408k801o601
$$ 79614 133732 147840 110537 79615 88559 74626 30984 33961 37715 12205 -21203 -24004 -30605
7978c0605K0152L7554O838r201K0024K0584K2139l6438K161K5973K5355n135M944
$$ -30605 -10453 27101 33939 24738 44762 65346 87485 51047 53208 79181 104536 99401 104345
7965A04345M979j4439o301j6167q11Q658M6410O310Q003p542K0682j6694l633
$$ 104345 109324 94885 88584 72417 71606 80264 126674 132984 140987 133445 154127 137433 133800
$$ [...]
##END NTUPLES=NMR SPECTRUM
##END=
