##TITLE=Analysis number 313887
Compound Code cc 01906
Project Code adrs
Chemist Name fudan
##JCAMPDX= 6.0         $$ Bruker NMR JCAMP-DX V2.0
##DATA TYPE= NMR SPECTRUM
##DATA CLASS= NTUPLES
##ORIGIN= Bruker BioSpin GmbH
##OWNER= NMR
$$ XWIN-NMR		Version 3.5
$$ Tue Sep 27 08:57:19 2005 GMT Daylight Time (UT+1h)  MAYBRIDGE\NMR@NMR_250MHZ
##.OBSERVE FREQUENCY= 250.131544655141
##.OBSERVE NUCLEUS= ^1H
##.ACQUISITION MODE= SIMULTANEOUS (DQD)
##.ACQUISITION SCHEME= undefined
##.AVERAGES= 16
##.DIGITISER RES= 18
##SPECTROMETER/DATA SYSTEM= dpx250
##.PULSE SEQUENCE= zg30
##.SOLVENT NAME= CDCl3
##.SHIFT REFERENCE= (INTERNAL, CDCl3, 0, 16.4492)
##AUDIT TRAIL= $$ (NUMBER, WHEN, WHO, WHERE, WHAT)
$$ ##TITLE= Audit trail, XWIN-NMR		Version 3.5
$$ ##JCAMPDX= 5.01
$$ ##ORIGIN= Bruker BioSpin GmbH
$$ ##OWNER= NMR
$$ C:\u/data/dgb/nmr/ADRS/9980/pdata/1/auditp.txt
$$ ##AUDIT TRAIL=  $$ (NUMBER, WHEN, WHO, WHERE, WHAT)
(   1,<2005-09-27 08:56:55.97 +100>,<MAYBRIDGE\NMR>,<NMR_250MHZ>,
      <created by zg, POWCHK disabled, PULCHK disabled
       configuration hash MD5:
       62 19 C7 07 E1 42 D1 B7 37 6C 3D D0 77 39 F9 E6
       data hash MD5: 64K
       33 98 93 FA 5B 49 BE 63 7D 21 0F 8A 1E DE C9 72>)
(   2,<2005-09-27 08:57:09.38 +100>,<MAYBRIDGE\NMR>,<NMR_250MHZ>,
      <Start of raw data processing
       ef LB = 0.3 FT_mod = 6 PKNL = 1 SI = 32K 
       data hash MD5: 32K
       D9 5B 14 6E 20 37 DC E4 59 73 C0 97 77 7F 85 E1>)
(   3,<2005-09-27 08:57:11.14 +100>,<MAYBRIDGE\NMR>,<NMR_250MHZ>,
      <apk 
       data hash MD5: 32K
       61 22 03 E0 50 81 F8 47 65 18 8B 85 4C 1E C7 14>)
(   4,<2005-09-27 08:57:11.88 +100>,<MAYBRIDGE\NMR>,<NMR_250MHZ>,
      <abs ABSG = 5 
       data hash MD5: 32K
       D9 A8 1C 41 6D D0 83 B3 61 7B DA 81 AD EC 86 61>)
$$ ##END=
$$ 
$$ hash MD5
$$ 14 DB 10 2F 76 5A AF 99 11 B3 6D B4 F3 FC 39 4E
##$RELAX= 
##$RELAX= 
##$RELAX= 
##$RELAX= 
##$RELAX= 
##$RELAX= 
##$RELAX= 
$$ Bruker specific parameters
$$ --------------------------
##$DU= <C:\u>
##$EXPNO= 9980
##$NAME= <ADRS>
##$PROCNO= 1
##$TYPE= <nmr>
##$USER= <dgb>
##$AMP= (0..31)
100 100 100 100 100 100 100 100 100 100 100 100 100 100 100 100 100 100 
100 100 100 100 100 100 100 100 100 100 100 100 100 100 
##$AQSEQ= 0
##$AQ_mod= 3
##$AUNM= <au_zg>
##$AUTOPOS= <2 >
##$BF1= 250.13
##$BF2= 250.13
##$BF3= 250.13
##$BF4= 250.13
##$BF5= 500.13
##$BF6= 500.13
##$BF7= 500.13
##$BF8= 500.13
##$BYTORDA= 1
##$CFDGTYP= 0
##$CFRGTYP= 5
##$CHEMSTR= <none>
##$CNST= (0..31)
1 1 145 1 1 1 1 1 1 1 1 1 1 1 1 1 1 1 1 1 1 1 1 1 1 1 1 1 1 1 1 1 
##$CPDPRG= <>
##$CPDPRG1= <>
##$CPDPRG2= <>
##$CPDPRG3= <>
##$CPDPRG4= <mlev>
##$CPDPRG5= <mlev>
##$CPDPRG6= <mlev>
##$CPDPRG7= <mlev>
##$CPDPRG8= <mlev>
##$CPDPRGB= <>
##$CPDPRGT= <>
##$D= (0..31)
0 1 0 0 0 0 0 0 0 0.06 0 0 0 0 0 0 0.0002 0 0 0 0 0 0 0 0 0 0 0 0 0 0 
0 
##$DATE= 1127807814
##$DBL= (0..7)
120 120 120 120 120 120 120 120 
##$DBP= (0..7)
150 150 150 150 150 150 150 150 
##$DBP07= 0
##$DBPNAM0= <>
##$DBPNAM1= <>
##$DBPNAM2= <>
$$ [...]
##$SUBNAM7= <"">
##$SUBNAM8= <"">
##$SUBNAM9= <"">
##$SW= 20.6930455092707
##$SWIBOX= (0..15)
0 0 3 0 0 0 0 0 0 0 0 0 0 0 0 0 
##$SW_h= 5175.983436853
##$TD= 65536
##$TD0= 1
##$TE= 294.16
##$TE2= 300
##$TE3= 300
##$TEG= 300
##$TL= (0..7)
0 120 120 120 120 120 120 120 
##$TP= (0..7)
150 150 150 150 150 150 150 150 
##$TP07= 0
##$TPNAME0= <>
##$TPNAME1= <>
##$TPNAME2= <>
##$TPNAME3= <>
##$TPNAME4= <>
##$TPNAME5= <>
##$TPNAME6= <>
##$TPNAME7= <>
##$TPOAL= (0..7)
0.5 0.5 0.5 0.5 0.5 0.5 0.5 0.5 
##$TPOFFS= (0..7)
0 0 0 0 0 0 0 0 
##$TUNHIN= 0
##$TUNHOUT= 0
##$TUNXOUT= 0
##$USERA1= <user>
##$USERA2= <user>
##$USERA3= <user>
##$USERA4= <user>
##$USERA5= <user>
##$V9= 5
##$VALIST= <valist>
##$VCLIST= <CCCCCCCCCCCCCCC>
##$VD= 0
##$VDLIST= <DDDDDDDDDDDDDDD>
##$VPLIST= <PPPPPPPPPPPPPPP>
##$VTLIST= <TTTTTTTTTTTTTTT>
##$WBST= 1024
##$WBSW= 4
##$XGAIN= (0..3)
0 0 0 0 
##$XL= 0
##$YL= 0
##$YMAX_a= 303240
##$YMIN_a= -335809
##$ZGOPTNS= <>
##$ZL1= 120
##$ZL2= 120
##$ZL3= 120
##$ZL4= 120
##$ABSF1= 16.44923
##$ABSF2= -4.243942
##$ABSG= 5
##$ABSL= 3
##$ALPHA= 0
##$AQORDER= 0
##$ASSFAC= 0
##$ASSFACI= 0
##$ASSFACX= 0
##$ASSWID= 0
##$AUNMP= <proc_1d>
##$AZFE= 0.1
##$AZFW= 0.1
##$BCFW= 0
##$BC_mod= 0
##$BYTORDP= 0
##$COROFFS= 0
##$CY= 12.5
##$DATMOD= 1
##$DC= 0
##$DFILT= <>
##$DTYPP= 0
##$F1P= 14.0000005364418
##$F2P= -0.99999901652339
##$FCOR= 0.5
##$FTSIZE= 32768
##$FT_mod= 6
##$GAMMA= 0
##$GB= 0
##$INTBC= 1
##$INTSCL= 1
##$ISEN= 128
##$LB= 0.3
##$LEV0= 0
##$LPBIN= 0
##$MAXI= 10000
##$MC2= 0
##$MEAN= 0
##$ME_mod= 0
##$MI= 0
##$NCOEF= 0
##$NC_proc= -3
##$NLEV= 6
##$NOISF1= 0
##$NOISF2= 0
##$NSP= 0
##$NTH_PI= 0
##$NZP= 0
##$OFFSET= 16.44923
##$PC= 1
##$PHC0= -78.51893
##$PHC1= 17.59851
##$PH_mod= 1
##$PKNL= yes
##$PPARMOD= 0
##$PSCAL= 4
##$PSIGN= 0
##$REVERSE= no
##$SF= 250.130018201362
##$SI= 32768
##$SIGF1= 0
##$SIGF2= 0
##$SINO= 400
##$SIOLD= 32768
##$SREGLST= <1H.CDCl3>
##$SSB= 0
##$STSI= 32768
##$STSR= 0
##$SW_p= 5175.98343685301
##$SYMM= 0
##$S_DEV= 0
##$TDeff= 65536
##$TDoff= 0
##$TI= <Analysis number 999999
Compound Code 99
Book Reference 9
Project Code 9>
##$TILT= no
##$TM1= 0
##$TM2= 0
##$TOPLEV= 0
##$USERP1= <user>
##$USERP2= <user>
##$USERP3= <user>
##$USERP4= <user>
##$USERP5= <user>
##$WDW= 1
##$XDIM= 32768
##$YMAX_p= 512126801
##$YMIN_p= -142480
$$ End of Bruker specific parameters
$$ ---------------------------------
##NTUPLES= NMR SPECTRUM
##VAR_NAME=  FREQUENCY,     SPECTRUM/REAL,   SPECTRUM/IMAG
##SYMBOL=    X,             R,               I
##VAR_TYPE=  INDEPENDENT,   DEPENDENT,       DEPENDENT
##VAR_FORM=  AFFN,          ASDF,            ASDF
##VAR_DIM=   32768,         32768,           32768
##UNITS=     HZ,            ARBITRARY UNITS, ARBITRARY UNITS
##FACTOR=    0.157963299565203, 1,           1
##FIRST=     4114.44624784657, 0,            0
##LAST=      -1061.53718900644, 0,           0
##MIN=       -1061.53718900644, -142480,     0
##MAX=       4114.44624784657, 512126801,    0
$$ Real data points
##PAGE= N=1
##DATA TABLE= (X++(R..R)), XYDATA
$$ [...]
$$ plain form
20834 -47803 -28648 29624 25171 26685 8296 14772 -3275 -4066 -19875 -27939 -16351 1158 -33486
20821 -33486 -75854 -63495 -60364 -71565 -62126 -29479 -11420 -3330 13037 37522 66490 33722
20809 33722 -22973 -32391 -19620 -20502 -36547 -27310 -38768 -65192 -43802 -27829 -34726 -52931 -70296
20796 -70296 -58267 -21756 -10037 14931 32511 50168 58285 49671 46272 50943 48586 -24295 -50032
20783 -50032 -12552 5663 14210 26595 -4102 -28559 -22245 12256 24703 17015 868 -60915
20771 -60915 -54086 -19400 4745 40092 52148 19213 -9148 -5822 3630 13363 18102 29639 9400
20758 9400 -11813 -30380 -44574 -45708 -47292 -10192 -6108 8290 -16769 -57254 -60107 -42350 -4379
20745 -4379 -3344 -24468 -22 12956 1118 -19558 5504 24094 3345 -17027 29254 19211
$$ packed form
20834d7803J9155N8272m453J514j8389O476j8047p91j5809q064J1588J7509l4644
20821c3486m2368J2359L131j1201R439L2647J8059Q090J6367K4485K8968l2768
20809C3722n6695r418J2771q82j6045R237j1458k6424K1390J5973o897j8205j7365
20796g0296J2029L6511J1719K4968J7580J7657Q117q614l399M671k357p2881k5737
20783e0032L7480J8215Q547J2385l0697k4457O314L4501J2447p688j6147o1783
20771f0915O829L4686K4145L5347J2056l2935k8361L326R452R733M739J1537k0239
20758I400k1213j8567j4194j134j584L7100M084J4398k5059m0485k853J7757L7971
20745d379J035k1124K4446J2978j1838k0676K5062J8590k0749k0372M6281j0043
$$ plain form
20733 19211 18868 44016 46830 42640 15870 3776 18469 30146 22978 -6710 -11721 -7167 -32275
20720 -32275 -21825 11522 -19042 -42515 -47657 -49312 -40358 -15266 11924 16060 30183 52646
20708 52646 1655 14554 31799 16491 18555 17015 -6460 -47731 -90909 -61379 -44054 -21388
20696 -21388 625 73756 65286 46450 48619 34566 14036 -27539 -30208 -16756 1984 18585
20684 18585 -1486 -18915 -19897 -27591 -28947 -15542 -30376 -46813 -25116 2891 -24829 -24668 -6826
20671 -6826 -26985 -46342 -70614 -58181 -14448 -13758 -71615 -68707 -31483 9941 25538 28946 61333
20658 61333 5518 -37966 -59258 -81129 -76376 -51237 -26569 -32721 -28919 -44226 -110339 -119604
20646 -119604 -64550 -25720 -19128 39733 39664 21163 16917 -1835 10423 7156 -9396 -9623 8157
$$ packed form
20733A9211l43K5148K814m190k6770j2094J4693J1677p168k9688n011M554k5108
20720c2275J0450L3347l0564k3473n142j655Q954K5092K7190M136J4123K2463
20708E2646n0991J2899J7245j5308K064j540k3475m1271m3178K9530J7325K2666
20696b1388K2013P3131q470j8836K169j4053k0530m1575k669J3452J8740J6601
20684A8585k0071j7429r82p694j356J3405j4834j6437K1697K8007k7720J61J7842
20671f826k0159j9357k4272J2433M3733O90n7857K908L7224M1424J5597L408L2387
20658F1333n5815m3484k1292k1871M753K5139K4668o152L802j5307o6113r265
20646a19604N5054L8830O592N8861o9j8501m246j8752J2258l267j6552k27J7780
$$ plain form
20633 8157 16359 8288 15993 20174 8512 -3027 -3675 12190 16273 25342 -13548 19675 12314 -10412
20619 -10412 -29320 -30591 -33524 -24714 -32157 -54600 -96729 -91986 -25189 -10220 -21017 -28520 -17432
20606 -17432 19208 16618 5448 -24560 -81856 -83995 -79748 -87418 -63404 -31030 -25559 -3810 34374
20593 34374 62281 49516 29003 -16581 -32682 -29494 -34728 -43362 -37622 -12046 16051 36423
20581 36423 46683 36089 -11819 4770 13260 21135 26955 31066 -13212 -22763 -40829 -30183 -20680
20568 -20680 -17678 -37552 -27642 -7569 5434 3160 15743 39958 60604 97269 102022 98382 60171
20555 60171 17874 -27044 -37256 -21567 8561 18092 -24585 -32971 -29812 -20969 -38283 -46093 -75294
20542 -75294 -76937 -17065 -24443 -46121 -42602 -31632 -24975 -27220 -18556 -1468 18939 8642 -8509
$$ packed form
20633H157Q202q071P705M181j1662j1539o48J5865M083R069l8890L3223p361k2726
20619a0412j8908j271k933Q810p443k2443m2129M743O6797J4969j0797p503J1088
20606a7432L6640k590j1170l0008n7296k139M247p670K4014L2374N471K1749L8184
20593C4374K7907j2765k0513m5584j6101L188n234q634N740K5576K8097K0372
20581C6423J0260j0594m7908J6589Q490P875N820M111m4278r551j8066J0646R503
20568b0680L002j9874R910K0073J3003k274J2583K4215K0646L6665M753l640l8211
20555F0171m2297m4918j0212J5689L0128R531m2677q386L159Q843j7314p810k9201
20542g5294j643N9872p378k1678L519J0970O657k245Q664J7088K0407j0297j7151
$$ plain form
20529 -8509 -29477 -9854 -5925 2332 13126 -27882 -73968 -87616 -81881 -50090 18078 8270 -6392
20516 -6392 -20787 -28169 11753 13748 -18210 -27288 -36463 -70191 -56417 -42158 2993 -3450 -26365
20503 -26365 13040 21266 3922 -5507 3327 -15999 -31544 -23863 13990 26872 3172 -24903
20491 -24903 -19805 -9146 -6497 18119 16710 26346 39157 47098 18951 -23986 5167 42075 10337
20478 10337 22278 17424 -4555 -9487 -12546 -1896 -4810 -23538 -41400 -30303 415 -14369
20466 -14369 -26917 -41951 -51101 -65909 -40519 -8207 19652 50760 42676 2656 -23316 -20958
20454 -20958 -6713 -13364 3757 3734 33848 20095 21393 -23252 -8519 5942 24046 -4566 -46795
20441 -46795 -94614 -94488 -68701 -41305 -67683 -55558 -17921 -27385 -41035 -24661 -48442 -74038
$$ packed form
20529h509k0968J9623L929Q257J0794m1008m6086j3648N735L1791O8168r808j4662
20516f392j4395p382L9922J995l1958r078r175l3728J3774J4259M5151o443k2915
20503b6365L9405Q226j7344r429Q834j9326j5545P681L7853J2882k3700k8075
20491b4903N098J0659K649K4616j409R636J2811P941k8147m2937K9153L6908l1738
20478A0337J1941m854k1979m932l059J0650k914j8728j7862J1097L0718j4784
20466a4369j2548j5034r150j4808K5390L2312K7859L1108q084m0020k5972K358
20454b0958J4245o651J7121k3L0114j3753J298m4645J4733J4461J8104k8612m2229
20441d6795m7819J26K5787K7396k6378J2125L7637r464j3650J6374k3781k5596
$$ plain form
20429 -74038 -82082 -96163 -81026 -20635 16367 4763 6394 -14725 -52989 -58030 11489 52218
20417 52218 15274 -6948 -15235 18574 26941 22209 4759 9698 -26575 -55455 -33120 -44523
20405 -44523 -76449 -95477 -72221 -62248 -80438 -107266 -101079 -46369 2328 1783 18170 20953 31225
20392 31225 25963 18314 24721 52774 43164 73307 94724 55885 33705 -7427 -54770 -43218
20380 -43218 -7543 -19291 -22733 -31246 -72870 -55053 -10789 -27200 -20968 5029 3726 -58329
20368 -58329 -24852 -4228 -15324 -939 261 15261 13150 86 -26074 -6030 29724 43616
20356 43616 84110 77601 67945 80358 69067 32074 -10670 -2689 17545 -7078 -1290 -6461 -363
20343 -363 776 -12558 5772 -4987 -33144 43298 85187 60538 17639 11976 -2421 -33882
$$ packed form
20429g4038q044j4081J5137O0391L7002j1604J631k1119l8264n041O9519M0729
20417E2218l6944k2222q287L3809Q367m732j7450M939l6273k8880K2335j1403
20405d4523l1926j9028K3256R973j8190k6828O187N4710M8697n45J6387K783J0272
20392C1225n262p649O407K8053r610L0143K1417l8839k2180m1132m7343J1552
20380d3218L5675j1748l442q513m1624J7817M4264j6411O232K5997j303o2055
20368e8329L3477K0624j1096J4385J200J5000k111j3064k6160K0044L5754J3892
20356D3616M0494o509r656J2413j1291l6993m2744P981K0234k4623N788n171O098
20343c63J139j3334J8330j0759k8157P6442M1889k4649m2899n663j4397l1461
$$ plain form
20331 -33882 -12521 34409 51114 33589 -22078 18004 34744 -21888 -58204 -73641 -30558 -70481
20319 -70481 -57607 -17892 -2447 -4210 -17493 -11280 -25862 -64125 -77972 -49683 1230 19769
20307 19769 54606 80782 61846 6609 -36433 -39398 -80081 -76237 -26459 21068 56959 64774
20295 64774 20013 34307 53764 4304 -29471 -17003 -762 4045 14888 12093 43835 55338
20283 55338 44731 27235 23231 33721 45624 34775 54681 62124 23380 -10279 2713 -7450
20271 -7450 18563 39454 14845 5150 8038 -22481 -96314 -74266 -22269 24660 42561 24187
20259 24187 25670 8905 -12434 1631 -19052 18521 40072 44458 49869 -4064 -13355 22821
20247 22821 17346 27349 41942 37044 33868 -25051 7827 50684 46704 -6483 -42241 -8174
$$ packed form
20331c3882K1361M6930J6705j7525n5667M0082J6740n6632l6316j5437M3083l9923
20319g0481J2874L9715J5445j763j3283O213j4582l8263j3847K8289N0913J8539
20307A9769L4837K6176j8936n5237m3042k965m0683L844M9778M7527L5891P815
20295F4774m4761J4294J9457m9460l3775J2468J6241M807J0843k795L1742J1503
20283E5338j0607j7496m004J0490J1903j0849J9906P443l8744l3659J2992j0163
20271g450K6013K0891k4609r695K888l0519p3833K2048N1997M6929J7901j8374
20259B4187J483j6765k1339J4065k0683L7573K1551M386N411n3933r291L6176
20247B2821n475J0003J4593m898l176n8919L2878M2857l980n3187l5758L4067
$$ plain form
20235 -8174 38822 22641 15806 12996 -2542 -26068 -31718 -19807 -19420 -7477 -16991 5533 -24082
20222 -24082 -64350 -37657 -20623 -36020 -29393 -19270 -8082 26612 28061 -213 -24186 -18748
20210 -18748 -22111 -26475 -25845 -42562 -30337 -45615 -32044 41025 53438 38811 29861 31956 26539
20197 26539 -3879 -32824 2682 20484 5279 -8959 -24586 -50922 -56207 -72572 -21164 12093
20185 12093 -16665 -10341 983 10754 52195 12958 -37652 -19392 -29954 5914 2213 7094
20173 7094 21912 4601 5615 15947 28415 40024 2924 -11113 -9753 -14427 -21345 -38178 -58059
20160 -58059 -61066 -35161 -24138 -54668 -71994 -51317 -28544 -40242 -9629 55537 50956 12428
20148 12428 -23745 -22769 -2371 -25005 -36170 -28307 12573 10802 -13712 -38737 -41047 -21018 -25766
$$ packed form
20235h174M6996j6181o835k810j5538k3526n650J1911L87J1943r514K2524k9615
20222b4082m0268K6693J7034j5397O627J0123J1188L4694J449k8274k3973N438
20210a8748l363m364O30j6717J2225j5278J3571P3069J2413j4627q950K095n417
20197B6539l0418k8945L5506J7802j5205j4238j5627k6336n285j6365N1408L3257
20185A2093k8758O324J1324R771M1441l9237n0610J8260j0562L5868l701M881
20173G094J4818j7311J014J0332J2468J1609l7100j4037J360m674o918j6833j9881
20160e8059l007K5905J1023l0530j7326K0677K2773j1698L0613O5166m581l8528
20148A2428l6173R76K0398k2634j1165P863M0880j771k4514k5025k310K0029m748
$$ plain form
20135 -25766 -24683 -8463 -46759 -25975 -13633 28925 10324 5252 -10600 -3184 -27680 -58410
20123 -58410 -56524 -11383 25314 17872 28286 -15258 -32392 -29542 -2595 2460 -15396 -4565
20111 -4565 -11339 32842 59635 34971 26608 36381 -10204 -33894 -61173 -61455 -10756 1948 -31872
20098 -31872 -28836 -30391 -15185 -8910 -13697 -20519 -36807 -39562 -56335 -54309 2354 38427 27188
20085 27188 28958 2036 13018 33824 28916 -13394 -35407 -26135 3052 23497 28931 32645 17039
20072 17039 -22011 -72818 -95699 -41312 -2619 10939 39621 39239 38762 17380 -697 -31877
20060 -31877 -21923 -1421 -15028 -13827 -2022 -340 -38275 -59232 -43745 -66496 -75637 -34063
20048 -34063 -5446 28177 41647 32104 42770 25757 6341 26602 32147 8499 19057 7489
$$ packed form
20135b5766J083J6220l8296K0784J2342M2558j8601n072j5852P416k4496l0730
20123e8410J886M5141L6697p442J0414m3544j7134K850K6947N055j7856J0831
20111d565o774M4181K6793k4664q363R773m6585k3690k7279k82N0699J2704l3820
20098c1872L036j555J5206O275m787o822j6288k755j6773K026N6663L6073j1239
20085B7188J770k6922J0982K0806m908m2310k2013R272K9187K0445N434L714j5606
20072A7039l9050n0807k2881N4387L8693J3558K8682l82m77k1382j8077l1180
20060c1877R954K0502j3607J201J1805J682l7935k0957J5487k2751r141M1574
20048c4063K8617L3623J3470r543J0666j7013j9416K0261N545k3648J0558j1568
$$ plain form
20036 7489 30674 58393 42449 42716 45014 62681 24569 18527 -10471 -45045 -16113 21986 9845
20023 9845 -41657 -73120 -38392 -26157 556 -15449 -9206 397 14969 9023 8579 -21 -5088
20010 -5088 -56293 -70304 -61595 -17228 -1664 22768 13443 -69034 -90066 -52938 -29127 -5140
19998 -5140 1231 -30011 -26891 16225 24474 4899 16942 7881 -16851 -25044 -17283 -7256 9909
19985 9909 8765 -24405 -79607 -34205 -42513 -48529 -29727 -20066 -20394 -34911 -36315 -63367 -90153
19972 -90153 -55426 -21502 -62961 -42593 -50123 -69449 -61024 14204 -5975 -53966 -12690 3669
19960 3669 2168 19073 46132 27836 3862 -47070 -70795 -78946 -41535 -47251 -23266 18105
19948 18105 37904 72853 74322 21886 9183 -912 -35575 -27482 -27368 -28284 -41611 8233 83796
$$ packed form
20036G489K3185K7719j5944K67K298J7667l8112o042k8998l4574K8932L8099j2141
20023I845n1502l1463L4728J2235K6713j6005O243R603J4572n946m44q600n067
20010e088n1205j4011Q709M4367J5564K4432r325q2477k1032L7128K3811K3987
19998e140O371l1242L120M3116Q249j9575J2043r061k4732q193P761J0027J7165
19985I909j144l3170n5202M5402q308o016J8802R661l28j4517j404k7052k6786
19972i0153L4727L3924m1459K0368p530j9326Q425P5228k0179m7991M1276J6359
19960C669j501J6905K7059j8296k3974n0932k3725q151L7411n716K3985M1371
19948A8105J9799L4949J469n2436j2703j0095l4663Q093J14r16j3327M9844P5563
$$ plain form
19935 83796 60908 5068 -67917 -73394 -43610 14012 9348 -23252 7287 14611 9787 -3884
19923 -3884 -10834 -21740 -16342 5112 -4778 -39746 -55477 -62326 -94703 -94063 -53173 -34529 -78553
19910 -78553 -77254 -55396 -17309 7678 26085 -3158 -10895 -16967 -29684 -14388 -37623 -63014
19898 -63014 -84507 -82648 -72039 -97762 -52178 -11259 -13165 862 -28644 -39456 3656 -38680
19886 -38680 -56968 -57010 -66614 -44098 -61209 -78136 -60120 -34765 -6640 11145 22353 50605
19874 50605 74239 52739 29877 11157 17490 46628 5542 -43838 -42509 6655 16927 -20486
19862 -20486 -72085 -90768 -87358 -34604 20165 6096 -50859 -39739 -5603 19545 20128 4581
19850 4581 -16718 -3071 22542 23346 25138 -4876 8934 -22287 -15121 31730 17662 20280 25652
$$ packed form
19935H3796k2888n5840p2985n477K9784N7622m664l2600L0539P324m824j3671
19923c884o950j0906N398K1454r890l4968j5731o849l2377O40M0890J8644m4024
19910g8553J299K1858L8087K4987J8407k9243p737o072j2717J5296k3235k5391
19898f3014k1493J859J0609k5723M5584M0919j906J4027k9506j0812M3112m2336
19886c8680j8288m2r604K2516j7111j6927J8016K5355K8125J7785J1208K8252
19874E0605K3634k1500k2862j8720O333K9138m1086m9380J329M9164J0272l7413
19862b0486n1599j8683L410N2754N4769j4069n6955J1120L4136K5148N83j5547
19850D581k1299J3647K5613Q04J792l0014J3810l1221P166M6851j4068K618N372
$$ plain form
19837 25652 47928 5151 -14516 19048 -10254 -26221 -34377 -31544 -35849 -28375 21604 66853
19825 66853 72001 54437 26296 -14526 -5290 -9435 -13371 12683 22477 3020 -32363 9632 58723
19812 58723 32559 15124 36074 56131 33763 -2167 -69361 -50703 -33855 -22875 5833 23150
19800 23150 51591 44909 17491 -25047 -69399 -34498 30558 54752 56541 76282 63109 33638
19788 33638 30865 48049 58631 43393 3679 4149 29981 -20098 -54960 -63275 -94692 -112417
19776 -112417 -71066 -54242 -12870 5871 37913 74962 84974 79548 40376 7493 25625 -1049
19764 -1049 -37141 -51257 -27256 1821 -14267 -21093 -3108 1747 -8927 -286 28033 5519
19752 5519 15447 26080 19500 9891 16804 31758 10796 20828 -1767 -44932 -40348 4913 31812
$$ packed form
19837B5652K2276m2777j9667L3564k9302j5967q156K833m305P474M9979M5249
19825F6853N148j7564k8141m0822R236m145l936K6054R794j9457l5383M1995M9091
19812E8723k6164j7435K0950K0057k2368l5930o7194J8658J6848J0980K8708J7317
19800B3150K8441o682k7418m2538m4352L4901O5056K4194J789J9741j3173k9471
19788C3638k773J7184J0582j5238l9714M70K5832n0079l4862q315l1417j7725
19776a12417M1351J6824M1372J8741L2042L7049J0012n426l9172l2883J8132k6674
19764a049l6092j4116K4001K9077j6088o826J7985M855j0674Q641K8319k2514
19752E519R928J0633o580r609O913J4954k0962J0032k2595m3165M584M5261K6899
$$ plain form
19739 31812 13623 -19356 -31314 -12479 -30504 -53699 -74769 -59009 -50408 -83916 -80593 -66976
19727 -66976 -60755 -50058 -60578 -64282 -40100 -14062 -10456 -6403 -19942 -9674 10148 22885
19715 22885 12090 3887 113 -11477 -30878 -41013 -22473 -11520 13049 -3935 -31621 -55010
19703 -55010 -71284 -85254 -51738 -39829 -44482 -42168 -67902 -56295 -72913 -44199 -34317 -12552
19691 -12552 -8972 -13911 -28710 -39001 -25010 31442 86238 68632 14346 -28811 -46124 -45622
19679 -45622 -68336 -53773 -27831 -47271 -25828 -22724 -45072 -39776 -7541 -19514 -10654 -10701 -22703
19666 -22703 -3922 22046 30025 40240 13064 4916 2603 11279 20592 1885 -26556 -46628 -22910
19653 -22910 -1429 22348 33962 35847 21828 17890 -313 -36201 7037 20854 5061 -6453
$$ packed form
19739C1812j8189l2979j1958J8835j8025k3195k1070J5760Q601l3508L323J3617
19727f6976O221J0697j0520l704K4182K6038L606M053j3539J0268J9822J2737
19715B2885j0795q203l774j1590j9401j0135J8540J0953K4569j6984k7686k3389
19703e5010j6274j3970L3516J1909m653K314k5734J1607j6618K8714R882K1765
19691a2552L580m939j4799j0291J3991N6452N4796j7606n4286m3157j7313N02
19679d5622k2714J4563K5942j9440K1443L104k2348N296L2235j1973Q860m7j2002
19666b2703J8781K5968P979J0215k7176q148k313Q676R313j8707k8441k0072K3718
19653b2910K1481K3777J1614J885j4019l938j8203l5888M3238J3817j5793j1514
$$ plain form
19641 -6453 18286 33267 17039 74798 120052 79628 75141 76683 15459 -19282 -10978 -12613 -37030
19628 -37030 -45981 -21047 21208 33903 6861 16835 34927 49631 28912 35646 37078 27431 30192
19615 30192 -11223 -34477 -59333 -23888 -26429 -28402 -26024 -135 2179 -5993 -55878 -77230 -48770
19602 -48770 -16859 -21101 -41755 -61123 -26617 -12413 -51698 -60793 -24786 18084 -5162 -20747
19590 -20747 -8285 -27732 -24874 -64016 -46057 5728 21691 27805 22898 44377 21206 -41996
19578 -41996 -14535 32663 33234 37703 40768 40186 22735 -17893 -43850 -10223 37466 51498 32730
19565 32730 24665 27116 18185 6829 15151 54014 85205 37726 -12321 26852 36558 23182 -24646
19552 -24646 6928 19362 -16968 -15949 17679 495 -20895 -32684 -1970 5066 9404 -11671
$$ packed form
19641f453K4739J4981j6228N7759M5254m0424m487J542o1224l4741Q304j635k4417
19628c7030q951K4934M2255J2695k7042R974J8092J4704k0719O734J432r647K761
19615C0192m1415k3254k4856L5445k541j973K378K5889K314q172m9885k1352K8460
19602d8770L1911m242k0654j9368L4506J4204l9285r095L6007M2870k3246j5585
19590b0747J2462j9447K858l9142J7959N1785J5963O114m907K1479k3171o3202
19578d1996K7461M7198N71M469L065n82j7451m0628k5957L3627M7689J4032j8768
19565C2730q065K451q931j1356Q322L8863L1191m7479n0047L9173R706j3376m7828
19552b4646L1574J2434l6330J019L3628j7184k1390j1789L0714P036M338k1075
$$ plain form
19540 -11671 26788 46857 -53128 -108295 -116733 -142083 -133783 -72186 -23384 10833 -9354 -54182
19528 -54182 -60060 -76071 -65018 -57911 -53665 -43617 -55255 -68518 -55525 -41382 7809 26211
19516 26211 53081 49665 15858 -2888 -2739 -37716 -59720 -44749 6574 -21767 -48463 -13263
19504 -13263 4603 2354 -29950 -50358 -8433 -13963 -1163 33592 -13517 -51410 -45521 -59128
19492 -59128 -74398 -70986 -3264 16369 57618 13338 -55409 -55857 -26964 -32996 -13894 32113
19480 32113 38135 21124 -5323 -29684 -25944 -47719 -49487 -48214 -11669 -4418 -2627 13952 29298
19467 29298 12238 16739 20791 47892 45908 29261 799 13637 -15018 -35191 -60042 -47387
19455 -47387 -17359 -20327 -23667 -10125 27401 59735 71094 56882 48140 63862 61120 53268 36513
$$ packed form
19540a1671L8459K0069r9985n5167q438k5350Q300O1597M8802L4217k0187m4828
19528e4182n878j6011J1053P107M246J0048j1638j3263J2993J4143M9191J8402
19516B6211K6870l416l3807j8746J49l4977k2004J4971N1323k8341k6696L5200
19504a3263J7866k249l2304k0408M1925n530J2800L4755m7109l7893N889j3607
19492e9128j5270L412O7722J9633M1249m4280o8747m48K8893o032J9102M6007
19480C2113O022j7011k6447k4361L740k1775j768J273L6545P251J791J6579J5346
19467B9298j7060M501M052K7101j984j6647k8462J2838k8655k0173k4851J2655
19455d7387L0028k968l340J3542L7526L2334J1359j4212q742J5722k742p852j6755
$$ plain form
19442 36513 18344 23079 24558 50123 54462 19882 295 68171 79776 32304 -20421 -60451
19430 -60451 -73096 -27948 -22173 -34741 -48634 -37741 -31424 -30459 -42634 -30021 -11716 -48733
19418 -48733 -90778 -76462 -29480 5853 -4574 -7545 10075 8152 10749 29147 59221 57059
19406 57059 37201 27857 27887 -5352 -20229 -6662 -23594 -33842 -38372 -89184 -75412 -57054 -31993
19393 -31993 -11739 -18050 26968 28643 -8746 -33003 -6688 -4677 7792 27232 37142 -5572
19381 -5572 5392 27623 27292 29318 13933 34941 75203 66002 30959 51008 92892 35788 18367
19368 18367 44636 51369 68577 91162 76724 42950 21354 8160 -8739 -6927 -22714 -32189
19356 -32189 2395 -24408 -52901 28404 26597 1616 -17919 -12594 19796 45454 44459 12596
$$ packed form
19442C6513j8169M735J479K5565M339l4580j9587O7876J1605m7472n2725m0030
19430f0451j2645M5148N775j2568j3893J0893O317R65j2175J2613J8305l7017
19418d8733m2045J4316M6982L5333j0427k971J7620j923K597J8398L0074k162
19406E7059j9858r344L0l3239j4877J3567j6932j0248m530n0812J3772J8358K5061
19393c1993K0254o311M5018J675l7389k4257K6315K011J2469J9440R910m2714
19381e572J0964K2231l31K026j5385K1008M0262r201l5043K0049M1884n7104j7421
19368A8367K6269O733J7208K2585j4438l3774k1596j3194j6899J812j5787r475
19356c2189L4584k6803k8493Q1305j807k4981j9535N325L2390K5658r95l1863
$$ plain form
19344 12596 -18959 -31747 -26873 -3571 7883 27296 31762 -11190 -12464 -34330 5033 12308
19332 12308 26318 35405 42433 27098 29811 -9159 -13121 -21525 12097 26677 15619 -29160 -4716
19319 -4716 40806 66852 31457 5052 -1338 -10050 -4626 -18889 -17765 -9755 16671 33483 26361
19306 26361 33479 39106 12831 -28329 -45157 -25243 49809 79049 48661 36895 42744 -16156
19294 -16156 -22424 18524 3845 -3446 13940 -540 -24020 -47378 -75609 -50612 14542 48889
19282 48889 56323 49194 33290 44919 33872 32180 25949 35023 42435 43259 -6487 -63046 -20073
19269 -20073 34363 43995 32227 -39590 -71918 -62608 -4978 28790 5099 11862 62690 43440
19257 43440 42624 34728 48927 58421 10396 -1457 9750 7632 12664 -11211 -33522 -21404 6337
$$ packed form
19344A2596l1555j2788M874K3302J1454J9413M466m2952j274k1866L9363P275
19332A2308J4010R087P028j5335K713l8970l962q404L3622J4580j1058m4779K4444
19319d716M5522K6046l5395k6405o390q712N424j4263J124Q010K6426J6812p122
19306B6361P118N627k6275m1160j6828J9914P5052K9240l0388j1766N849n8900
19294a6156o268M0948j4679p291J7386j4480k3480k3358k8231K4997O5154L4347
19282D8889P434p129j5904J1629j1047j692o231R074P412Q24m9746n6559M2973
19269b0073N4436R632j1768p1817l2328R310N7630L3768k3691O763N0828j9250
19257D3440q16p896J4199R494m8025j1853J1207k118N032k3875k2311J2118K7741
$$ plain form
19244 6337 21944 2400 27030 29328 14626 2258 1166 -24337 -48841 -52533 -57830 -86084 -86328
19231 -86328 -76087 -58958 -30617 -13507 -24780 -35134 -35335 -25820 -2274 33727 47168 36605
19219 36605 51955 46368 10428 -13915 -4659 -24912 -23892 -15715 -4763 -31500 -58578 -49100 -49529
19206 -49529 -30419 -52911 -40601 -39818 -3775 26783 1927 -3887 -28202 -33136 -15379 23947
19194 23947 37791 34865 42443 8646 621 -43843 -66341 -64313 -46189 -30019 8269 50290
19182 50290 91876 112365 74917 52663 61473 45381 40297 17799 31729 65563 96622 97780
19170 97780 108930 129415 120711 91176 111296 153962 154530 266520 345991 368588 352932 344701
19158 344701 339905 315673 283817 237702 247073 211166 170510 194242 177336 135303 143499 198419
$$ packed form
19244F337J5607j9544K4630K298j4702j2368j092k5503k4504l692n297k8254k44
19231h6328J0241J7129K8341J7110j1273j0354k01R515K3546L6001J3441j0563
19219C6605J5350n587l5940k4343R256k0253J020Q177J0952k6737k7078R478m29
19206d9529J9110k2492J2310P83L6043L0558k4856n814k4315m934J7757L9326
19194B3947J3844k926P578l3797q025m4464k2498K028J8124J6170L8288M2021
19182E0290M1586K0489l7448k2254Q810j6092n084k2498J3930L3834L1059J158
19170I7780J1150K0485q704k9535K0120M2666N68J11990P9471K2597j5656q231
19158C44701m796k4232l1856m6115R371l5907m0656K3732j6906m2033Q196N4920
$$ plain form
19146 198419 243771 247834 299772 325681 350887 375192 332807 270145 263515 260893 254375 235034
19134 235034 202683 177304 147445 136795 78608 35812 74974 68017 65636 73445 93738 72453
19122 72453 56544 44856 85289 62607 33565 32879 64140 69282 90507 89285 71968 33024
19110 33024 28040 43228 69488 107724 126698 135538 123266 95751 40844 -12693 -9403 33969
19098 33969 64337 85296 134292 164136 203900 283896 425017 455664 428583 378090 379561 276134
19086 276134 211004 205553 271703 275522 234377 217103 231167 284475 289983 278299 308203 308991
19074 308991 342190 361740 365889 343735 288694 232092 177810 125305 114812 137478 125257 115661
19062 115661 111171 81550 70563 29235 8314 46567 68918 78080 78258 26957 -11044 -13927
$$ packed form
19146A98419M5352M063N1938K5909K5206K4305m2385o2662o630k622o518j9341
19134B35034l2351k5379k9859j0650n8187m2796L9162o957k381P809K0293k1285
19122G2453j5909j1688M0433k2682k9042o86L1261N142K1225j222j7317l8944
19110C3024m984J5188K6260L8236J8974Q840j2272k7515n4907n3537L290M3372
19098C3969L0368K0959M8996K9844L9764P9996J41121L0647k7081n0493J471j03427
19086B76134o5130n451O6150L819m1145j7274J4064N3308N508j1684K9904P88
19074C08991L3199J9550M149k2154n5041n6602n4282n2505j0493K2666j2221r596
19062A15661m490k9621j0987m1328k0921L8253K2351R162J78n1301l8001k883
$$ plain form
19050 -13927 -36325 -51113 -43082 -36692 -53790 -34732 20815 24775 4716 -11229 -5694 -36771
19038 -36771 -31914 3799 42178 52520 30478 18309 20924 33985 36280 54961 52248 81253
19026 81253 89195 71278 84785 60687 31076 40235 50051 18016 -1470 31247 16321 3333
19014 3333 1193 -39551 -51799 -15033 20624 13960 -19416 -13855 -1928 5092 25344 -6809 14597
19001 14597 12061 2475 6827 -22667 -26427 -11744 -22664 -20775 -10378 4507 -19875 -27962 5996
18988 5996 65516 66050 69030 22233 -13817 -2165 -13028 22 7827 11499 12710 6736 34328
18975 34328 51751 42914 16331 -15328 -24278 -1256 18074 26266 39095 26741 14758 -42688
18963 -42688 -83964 -64093 4264 51662 32072 23131 32939 31881 56210 68722 -14453 -32192
$$ packed form
19050a3927k2398j4788Q031O390j7098J9058N5547L960k0059j5945N535l1077
19038c6771M857L5713L8379J0342k2042j2169K615J3061K295J8681k713K9005
19026H1253P942j7917J3507k4098k9611R159R816l2035j9486L2717j4926j2988
19014C333k140m0744j2248L6766L5657o664l3376N561J1927P020K0252l2153K1406
19001A4597k536r586M352k9494l760J4683j0920J889J0397J4885k4382q087L3958
18988E996N9520N34K980m6797l6050J1652j0863J3050P805L672J211n974K7592
18975C4328J7423q837k6583l1659q950K3022J9330Q192J2829j2354j1983n7446
18963d2688m1276J9871O8357M7398j9590q941R808j058K4329J2512q3175j7739
$$ plain form
18951 -32192 -9677 -17852 -10876 10628 19687 8176 42960 29498 -1114 25599 27177 56677
18939 56677 58349 20456 -20100 -21828 -25777 -29859 1445 -25051 -25827 -984 -5504 -15458 -27225
18926 -27225 -8965 6411 -30738 -21817 -15703 -12780 13354 20456 -8123 -32584 -42048 -28207 -6711
18913 -6711 27665 35345 -751 -43684 -53999 -26594 15303 14047 8598 6676 16441 11961 37060
18900 37060 41103 27419 6582 -11017 11111 23690 15809 20129 30850 30571 27900 4302 -17278
18887 -17278 716 -6491 -4047 -3709 18299 23188 29616 43038 71598 54258 32746 59459 81985
18874 81985 65593 46664 26965 -12734 -43046 -46080 17203 49240 40910 46085 8959 -31052
18862 -31052 -22532 -71614 -98244 -63903 -13367 27991 70528 83575 52900 20116 15599 17317
$$ packed form
18951c2192K2515q175O976K1504R059j1511L4784j3462l0612K6713J578K9500
18939E6677J672l7893m0556j728l949m082L1304k6496p76K4843m520r954j1767
18926b7225J8260J5376l7149Q921O114K923K6134P102k8579k4461r464J3841K1496
18913f711L4376P680l6096m2933j0315K7405M1897j256n449j922R765m480K5099
18900C7060M043j3684k0837j7599K2128J2579p881M320J0721k79k671k3598k1580
18887a7278J7994p207K444L38K2008M889O428J3422K8560j7340k1512K6713K2526
18874H1985j6392j8929j9699l9699l0312l034O3283L2037q330N175l7126m0011
18862c1052Q520m9082k6630L4341N0536M1358M2537J3047l0675l2784m517J718
$$ plain form
18850 17317 31031 10494 -12051 -2262 -2755 -8866 -23824 -2980 83 -21041 -13465 16785 4523
18837 4523 -58525 -38641 39981 44216 35494 1260 -28259 -93232 -64139 -27588 -16209 -4612
18825 -4612 27339 69492 87856 77336 50453 47833 61067 49169 6334 -15203 -6766 35803
18813 35803 11269 -10099 29200 62382 100909 63631 -212 -15249 -7198 2078 -4267 -9858
18801 -9858 22260 33220 35606 -16920 -77727 -84570 -1970 54750 31183 42892 47202 5615
18789 5615 -22867 -8830 -24792 -37813 -5769 11654 18578 44596 72823 43897 32467 -22715
18777 -22715 -68397 -96235 -18794 49810 61089 36128 48370 69053 102439 165930 266678
18766 266678 390204 387506 311073 205865 111594 68484 47207 57302 63615 41678 3988
$$ packed form
18850A7317J3714k0537k2545R789m93o111j4958K0844L063k1124P576L0250j2262
18837D523o3048J9884P8622M235q722l4234k9519o4973K9093L6551J1379J1597
18825d612L1951M2153J8364j0520k6883k620J3234j1898m2835k1537Q437M2569
18813C5803k4534k1368L9299L3182L8527l7278o3843j5037Q051R276o345n591
18801i858L2118J0960K386n2526o0807o843Q2600N6720k3567J1709M310m1587
18789E615k8482J4037j5962j3021L2044J7423O924K6018K8227k8926j1430n5182
18777b2715m5682k7838P7441O8604J1279k4961J2242K0683L3386O3491J00748
18766B66678J23526k698p6433j05208r4271m3110k1277J0095O313k1937l7690
$$ plain form
18755 3988 -37258 -47469 -19302 58510 74290 40682 -12419 -50758 -79256 -83506 -74126 -56945
18743 -56945 -73457 -44553 -51685 -61379 -53171 -57619 -58247 -39331 -36140 -20943 -23342 16775 9165
18730 9165 -5780 8857 32713 52444 56140 59638 65054 86505 61954 -2239 -4671 15217 27879
18717 27879 49057 45452 52248 28524 19901 5656 10497 12101 -20614 -47768 -37396 -3468 18186
18704 18186 33649 3614 659 4472 31730 29039 12367 102 -12364 -57403 -37042 -39619
18692 -39619 -37698 -37037 -5519 44128 43424 35711 1942 -36234 -19668 15336 25827 44698 29206
18679 29206 20113 12514 10735 31672 26817 -14020 -35980 -39676 -23853 42430 82774 55757 -3988
18666 -3988 -24679 -24431 -25698 -31312 -43173 -60317 -75080 -53827 -18886 9266 58530 62838 24249
$$ packed form
18755C988m1246j0211K8167P7812J5780l3608n3101l8339k8498m250R380J7181
18743e6945j6512K8904p132r694Q208m448o28J8916L191J5197k399M0117p610
18730I165j4945J4637K3856J9731L696L498N416K1451k4551o4193k432J9888J2662
18717B7879K1178l605O796k3724q623j4245M841J604l2715k7154J0372L3928K1654
18704A8186J5463l0035k955L813K7258k691j6672j2265j2466m5039K0361k577
18692c9619J921O61L1518M9647p04p713l3769l8176J6566L5004J0491J8871j5492
18679B9206r093p599j779K0937m855m0837k1960l696J5823O6283M0344k7017n9745
18666c988k0691K48j267n614j1861j7144j4763K1253L4941K8152M9264M308l8589
$$ plain form
18653 24249 -20049 25689 12472 -6411 -23224 5196 -4231 11698 23143 50001 105731 73615
18641 73615 63818 54657 39414 12415 5390 -7536 -6237 16620 6486 -37592 -32666 9290 15605
18628 15605 -27317 9752 40468 38698 47404 48600 36796 40954 37066 4138 33855 72735 39147
18615 39147 47001 30685 7785 9360 23635 30352 38335 36830 680 14323 36814 35597 34499
18602 34499 32494 56286 48270 46857 70160 39491 28984 22845 36614 33000 63441 71247 68657
18589 68657 81445 63263 34736 54145 77609 75942 42166 30038 57721 43959 36979 28832
18577 28832 27291 27073 25197 48551 69357 24858 36841 60025 19975 -19407 2266 21124
18565 21124 1302 -11303 22691 65548 7411 -5442 -22127 -30559 -35652 -27385 142 49034
$$ packed form
18653B4249m4298M5738j3217j8883j6813K8420r427J5929J1445K6858N5730l2116
18641G3615r797r161j5243k6999p025j2926J299K2857j0134m4078M926M1956O315
18628A5605m2922L7069L0716j770Q706J196j1804M158l888l2928K9717L8880l3588
18615C9147P854j6316k2900J575J4275O717P983j505l6150J3643K2491j217j098
18602C4499k005K3792q016j413K3303l0669j0507o139J3769l614L0441P806k590
18589F8657J2788j8182k8527J9409K3464j667l3776j2128K7683j3762o980q147
18577B8832j541k18j876K3354K0806m4499J1983K3184m0050l9382K1673J8858
18565B1124j9822j2605L3994M2857n8137j2853j6685q432n093Q267K7527M8892
$$ plain form
18553 49034 57717 62872 89224 94365 62674 41078 48880 51413 55371 48876 43479 74128 76006
18540 76006 83755 64076 58261 51864 33684 32373 73908 50493 28275 18827 31660 40960 29041
18527 29041 43676 55735 48226 36929 59323 35921 49672 43080 26396 32242 22166 42776
18515 42776 66271 73107 31504 16022 23257 44905 48672 38895 47903 21619 -13560 -23820 -33385
18502 -33385 -33918 -31806 -21624 -17146 -9720 2721 24500 72986 87516 70132 34894 63554 62993
18489 62993 48368 70705 86675 60068 41298 41919 35564 -13147 -44232 -52912 933 36416
18477 36416 41140 44580 -20819 -43227 -48991 -12247 -158 30703 47255 62013 54157 58751 36543
18464 36543 17545 15596 41282 3929 -25213 -8614 11295 -6797 -2765 -25518 -36172 -4026
$$ packed form
18553D9034Q683N155K6352N141l1691k1596P802K533L958o495n397L0649J878
18540G6006P749j9679n815o397j8180j311M1535k3415k2218r448J2833R300j1919
18527B9041J4635J2059p509j1297K2394k3402J3751o592j6684N846j0076K0610
18515D2776K3495O836m1603j5482P235K1648L767r777R008k6284l5179j0260r565
18502c3385n33K112J0182M478P426J2441K1779M8486J4530j7384l5238K8660n61
18489F2993j4625K2337J5970k6607j8770O21o355m8711l1085q680N3845L5483
18477C6416M724L440o5399k2408n764L6744J2089L0861J6552J4758p856M594k2208
18464C6543j8998j949K5686l7353k9142J6599J9909j8092M032k2753j0654L2146
$$ plain form
18452 -4026 44627 48165 17553 55494 66868 75528 80878 61811 58577 91380 103486 93397 43719
18439 43719 20808 66577 124281 111871 83635 80812 25116 18738 23083 73201 104251 85417
18427 85417 53147 6915 2063 23113 23299 22054 16669 9622 15100 28782 62157 38867 20624
18414 20624 36142 47190 72087 64172 46301 58509 53237 51190 58980 85632 60603 50701 22157
18401 22157 9329 29588 24840 11912 16040 -3559 6752 52476 101934 80476 38131 23548
18389 23548 10476 28810 85215 97975 88904 87237 100620 106499 45363 -14085 -16595 26067
18377 26067 21355 43548 59248 37011 31693 61048 67623 43181 25856 39996 26352 59825
18365 59825 102787 147082 166771 175393 150354 123503 119683 104588 102994 91467 92420 88656 57569
$$ packed form
18452d026M8653L538l0612L7941J1374Q660N350j9067l234L2803J2106j0089m9678
18439D3719k2911M5769N7704j2410k8236k823n5696o378M345N0118L1050j8834
18427H5417l2270m6232m852K1050J86j245n385p047N478J3682L3375k3290j8243
18414B0624J5518J1048K4897p915j7871J2208n272k047P790K6652k5029r902k8544
18401B2157j2828K0259m748j2928M128j9599J0311M5724M9458k1458m2345j4583
18389B3548j3072J8334N6405J2760r071j667J3383N879o1136n9448k510M2662
18377B6067m712K2193J5700k2237n318K9355O575k4442j7325J4140j3644L3473
18365E9825M2962M4295J9689Q622k5039k6851l820j5095j594j1527R53l764l1087
$$ plain form
18352 57569 49176 33105 29593 8747 5955 38459 -5072 -67655 -78534 -62049 -32101 10835
18340 10835 35635 37509 31618 -716 27337 58516 27878 -49087 -5412 24837 40527 10404
18328 10404 13122 70390 108851 143058 125190 21458 -7335 17533 26300 20117 33253 17311
18316 17311 12840 37975 66522 65884 71479 84744 66378 29598 13723 -2631 -38542 -52499
18304 -52499 379 21506 -19939 -42524 15246 56040 31646 18829 1403 -2069 -12044 15740
18292 15740 11341 -7655 16944 51366 54474 62960 57380 33436 -9246 -22743 34954 9428
18280 9428 -30737 -22580 5036 49756 87146 61773 57833 55318 16031 5164 27387 77572
18268 77572 70230 19546 36395 73930 85338 46578 -29782 -48487 -5273 31372 12819 11465
$$ packed form
18352E7569q393j6071l512k0846k792L2504m3531o2583j0879J6485K9948M2936
18340A0835K4800J874n891l2334K8053L1179l0638p6965M3675L0249J5690l0123
18328A0404K718N7268L8461L4207j7868j03732k8793K4868Q767o183J3136j5942
18316A7311m471K5135K8547o38N595J3265j8366l6780j5875j6354l5911j3957
18304e2499N2878K1127m1445k2585N7770M0794k4394j2817j7426l472r975K7784
18292A5740m399j8996K4599L4422L108Q486n580k3944m2682j3497N7697k5526
18280I428m0165Q157K7616M4720L7390k5373l940k515l9287j0867K2223N0185
18268G7572p342n0684J6849L7535J1408l8760p6360j8705M3214L6645j8553j354
$$ plain form
18256 11465 1408 6088 12188 11720 -182 18099 13920 -623 -7249 12432 45536 79120 63560
18243 63560 26067 39547 67300 131079 146169 108049 73003 51777 45390 60140 73187 103005
18231 103005 112906 90978 89597 102696 100644 117801 134030 155024 127891 94765 77356 74876
18219 74876 56979 79025 109255 164226 173389 123749 105254 126265 190165 180343 145578 131673
18207 131673 98195 90912 96147 116991 168747 188947 174193 173765 151096 119275 106415 112002
18195 112002 153400 149246 105165 85722 109573 148607 166253 139123 137058 121870 117067 122906
18183 122906 158008 147921 134765 124158 160540 184032 150886 127321 123693 138402 126779 151572
18171 151572 143669 147626 189775 180418 150892 129908 141982 153854 147098 117213 132359 175851
$$ packed form
18256A1465j0057M680O100m68j1902J8281m179j4543o626J9681L3104L3584j5560
18243F3560l7493J3480K7753O3779J5090l8120l5046k1226o387J4750J3047K9818
18231A03005R901k1928j381J3099k052J7157J6229K0994k7133l3126j7409k480
18219G4876j7897K2046L0230N4971R163m9640j8495K1011O3900r822l4765j3905
18207A31673l3478p283N235K0844N1756K0200j4754m28k2669l1821j2860N587
18195A12002M1398m154m4081j9443K3851L9034J7646k7130k065j5188m803N839
18183A22906L5102j0087j3156j0607L6382K3492l3146k3565l628J4709j1623K4793
18171A51572p903L957M2149r357k9526k0984J2074J1872o756k9885J5146M3492
$$ plain form
18159 175851 177902 171142 182571 188424 230424 257644 239102 257790 273690 290396 298540 326443
18147 326443 355348 396499 395630 425310 441198 431623 376439 400281 467828 483834 492927 478980
18135 478980 466108 506069 592528 636022 636378 679233 744359 845808 972062 1055187 1156331
18124 1156331 1273228 1431388 1625112 1885593 2183660 2621632 3133596 3837854 4787915
18115 4787915 6050199 7879163 10494038 14225489 20335347 31712572 52053716 74711636
18107 74711636 79125842 68262908 49743182 31384244 19523645 12713248 8703777
18100 8703777 6245413 4669323 3583183 2778202 2249091 1880293 1553445 1238151 1040008
18091 1040008 911045 804656 704637 629350 598940 531144 460428 408073 401507 365199 305778
$$ packed form
18159A75851K051o760J1429N853M2000K7220j8542J8688J5900J6706Q144K7903
18147C26443K8905M1151q69K9680J5888r575n5184K3842O7547J6006R093j3947
18135D78980j2872L9961Q6459M3494L56M2855O5126J01449J26254Q3125J01144
18124A156331J16897J58160J93724K60481K98067M37972N11964P04258R50061
18115D787915J262284J828964K614875L731451O109858J1377225K0341144K2657920
18107G4711636M414206j0862934j8519726j8358938j1860599o810397m009471
18100H703777k458364j576090j086140q04981n29111l68798l26848l15294j98143
18091A040008j28963j06389j00019p5287l0410o7796p0716n2355o566l6308n9421
$$ plain form
18080 305778 277055 260058 228694 180634 171715 145083 149294 154594 166837 172425 175536 162958
18068 162958 152293 148528 126943 129305 184647 221524 201306 201161 203571 201225 207750 182541 167379
18055 167379 132056 120628 79420 70704 79397 75125 82717 62775 16313 203 15361 -2520
18043 -2520 -7507 21971 9852 -16685 -26556 -8446 9877 16388 3933 27584 9652 -21515
18031 -21515 -19254 -799 -8365 24038 24237 -9880 -30353 -29479 -4141 -13038 17768 11782 -14910
18018 -14910 -21226 3066 12043 37250 53581 51334 10437 3515 15175 19633 30932 55896 64106
18005 64106 65544 95718 89784 64664 84023 79638 93239 126220 155196 166382 159753 150511 152492
17992 152492 190805 183263 171180 106660 73504 65416 79521 79009 73106 65224 50718 63281 105993
$$ packed form
18080C05778k8723j6997l1364m8060q919k6632M211N300J2243N588L111j2578
18068A62958j0665l765k1585K362N5342L6877k0218j45K410k346O525k5209j5162
18055A67379l5323j1428m1208q716Q693m272P592j9942m6462j6110J5158j7881
18043b520m987K9478j2119k6537r871J8110J8323O511j2455K3651j7932l1167
18031b1515K261J8455p566L2403J99l4117k0473Q74K5338q897L0806n986k6692
18018a4910o316K4292Q977K5207J6331k247m0897o922J1660M458J1299K4964Q210
18005F4106J438L0174n934k5120J9359m385J3601L2981K8976J1186o629r242J981
17992A52492L8313p542j2083o4520l3156q088J4105n12n903p882j4506J2563M2712
$$ plain form
17979 105993 130740 114335 78742 107565 122576 106709 94454 87987 101550 103254 67130 37786
17967 37786 35857 78614 100447 99454 67549 52315 46912 82087 125616 174386 129905 103148
17955 103148 142492 172238 145738 87548 78047 81126 76044 77172 88678 98956 119429 134463
17943 134463 133745 158143 148219 112192 88442 70462 88589 92065 93116 52552 26178 14516
17931 14516 2678 32951 22544 6855 24678 32632 46497 33582 24017 35674 28112 30500
17919 30500 54440 63573 69083 72356 67812 56365 14612 -12207 -27428 -28733 5900 38047 20932
17906 20932 -16726 15106 6707 -32925 899 -7694 -31228 -14923 15561 3857 7655 21688
17894 21688 51586 29311 37194 58711 32227 23345 17353 4116 24405 81495 95918 67662
$$ packed form
17979A05993K4747j6405l5593K8823J5011j5867j2255o467J3563J704l6124k9344
17967C7786j929M2757K1833r93l1905j5234n403L5175M3529M8770m4481k6757
17955A03148L9344K9746k6500n8190r501L079n082J128J1506J0278K0473J5034
17943A34463p18K4398r924l6027k3750j7980J8127L476J051m0564k6374j1662
17931A4516j1838L0273j0407j5689J7823P954J3865j2915r565J1657p562K388
17919C0500K3940R133N510L273m544j1447m1753k6819j5221j305L4633L2147j7115
17906B0932l7658L1832q399l9632L3824q593k3534J6305L0484j1704L798J4033
17894B1688K9898k2275P883K1517k6484q882n992j3237K0289N7090J4423k8256
$$ plain form
17882 67662 13560 1146 32782 31022 8733 -23409 -23553 -8727 -16225 -17483 -10126 -11188 15164
17869 15164 -1385 -13048 11238 3429 3388 35779 23618 49088 87539 90628 63531 53890 37658
17856 37658 46226 61532 69459 119450 126504 85429 72359 53942 40237 -9725 15743 51381
17844 51381 28811 59896 101471 82280 62767 43807 38363 42803 64827 109250 95956 81456
17832 81456 89770 116884 119497 112825 102153 61425 56661 106313 93249 81547 59120 29807
17820 29807 16479 37122 29398 67193 76775 20790 -26610 -62556 -59472 -5083 2480 -14033
17808 -14033 -20840 -30649 21039 61930 81575 66962 51616 68890 67340 38026 1758 -8416
17796 -8416 -4172 13760 40868 62236 93048 105923 48866 8972 38959 62607 58164 39007
$$ packed form
17882F7662n4102j2414L1636j760k2289l2142j44J4826p498j258P357j062K6352
17869A5164j6549j1663K4286p809m1L2391j2161K5470L8451L089k7097r641j6232
17856C7658Q568J5306P927M9991P054m1075j3070j8417j3705m9962K5468L5638
17844E1381k2570L1085M1575j9191j9513j8960n444M440K2024M4423j3294j4500
17832H1456Q314K7114K613o672j0672m0728m764M9652j3064j1702k2427k9313
17820B9807j3328K0643p724L7795R582n5985m7400l5946L084N4389P563j6513
17808a4033o807r809N1688M0891J9645j4613j5346J7274j550k9314l6268j0174
17796h416M244J7932K7108K1368L0812J2875n7057l9894K9987K3648m443j9157
$$ plain form
17784 39007 47231 21608 29855 8799 45004 40375 30562 912 -25403 -22119 -4590 -10818 -12482
17771 -12482 -562 40893 28772 -55042 -61488 -19955 -5324 16507 43499 13768 10034 20037
17759 20037 6908 -3428 -27398 -23518 34346 70011 85765 73368 28617 -3636 32171 38571
17747 38571 14734 -4591 14999 -1107 5167 36473 11229 -5667 -9831 -2860 37242 30375
17735 30375 -10346 -26121 -15 15440 21880 32567 53054 64842 39548 -5560 37726 62204
17723 62204 32939 29510 72486 62802 60673 57407 67465 82671 107253 155405 187906 214584
17711 214584 216011 187485 201301 222223 241662 260658 302154 291611 284647 267447 290666 350266
17699 350266 365024 371599 364276 399364 446341 498653 520772 521104 548045 594068 595842 624643
$$ packed form
17784C9007Q224k5623Q247k1056L6205m629r813k9650k6315L284J7529o228j664
17771a2482J1920M1455j2121q3814o446M1533J4631K1831K6992k9731l734J0003
17759B0037j3129j0336k3970L880N7864L5665J5754j2397m4751l2253L5807O400
17747C8571k3837j9325J9590j6106O274L1306k5244j6896m164O971M0102o867
17735C0375m0721j5775K6106J5455O440J0687K0487J1788k5294m5108M3286K4478
17723F2204k9265l429M2976r684k129l266J0058J5206K4582M8152L2501K6678
17711B14584J427k8526J3816K0922J9439J8996M1496j0543o964j7200K3219N9600
17699C50266J4758O575p323L5088M6977N2312K2119L32K6941M6023J774K8801
$$ plain form
17687 624643 644020 662071 682682 713484 682158 628917 590005 550393 470326 411077 420347 374592
17675 374592 327264 330086 347230 364320 354312 347783 390930 409664 482550 526360 477464 399297
17663 399297 353562 328938 268484 243688 239703 225236 176340 122823 128867 168521 190516 206218
17651 206218 203275 152186 160162 139139 109982 128880 136048 127030 124705 106927 113921 131319 142402
17638 142402 158139 128965 140640 144953 146345 165017 164176 197971 255413 268580 268862 302050 304062
17625 304062 270504 272005 241670 215333 230276 196632 161674 141281 120996 153289 203799 245423
17613 245423 244265 237937 221434 283118 321810 252694 212071 196153 186287 176251 186403 209294
17601 209294 212132 171475 178007 201333 206660 176109 153572 124311 91329 58380 38823 39076
$$ packed form
17687F24643J9377J8051K0611L0802l1326n3241l8912l9612q0067n9249R270m5755
17675C74592m7328K822J7144J7090j0008o529M3147J8734P2886M3810m8896p8167
17663C99297m5735k4624o0454k4796l985j4467m8896n3517O044L9654K1995J5702
17651B06218k943n1089P976k1023k9157J8898P168r018k325j7778O994J7398J1083
17638A42402J5737k9174J1675M313J392J8672q41L3795N7442J3167K82L3188K012
17625C04062l3558J501l0335k6337J4943l3644l4958k0393k0285L2293N0510M1624
17613B45423j158o328j6503O1684L8692o9116m0623j5918r866j0036J0152K2891
17601B09294K838m0657O532K3326N327l0551k2537k9261l2982l2949j9557K53
$$ plain form
17589 39076 53924 59539 88611 102009 71446 78673 59806 56946 55358 48463 53624 68404 76057
17576 76057 84364 42653 24317 75960 106128 87311 98351 106341 17530 -27899 21782 48559
17564 48559 23119 -7336 27947 98842 98296 52680 6995 69531 93356 78612 38063 8978
17552 8978 25886 51746 79452 84322 82584 91217 68738 42010 81199 117651 102605 71723
17540 71723 77645 73524 82642 64439 72772 63964 30450 -23936 -12504 37949 55180 75768 114499
17527 114499 147367 187915 198587 198810 184852 175076 168185 177086 195793 246396 250309 206599 181523
17514 181523 187161 152614 176014 189745 173364 153665 133106 101031 106918 150809 147198 142162
17502 142162 127195 166056 202956 249166 266161 266214 234690 203001 181602 222375 223551 192225
$$ packed form
17589C9076J4848N615K9072J3398l0563P227j8867k860j588o895N161J4780P653
17576G6057Q307m1711j8336N1643L0168j8817J1040P990q8811m5429M9681K6777
17564D8559k5440l0455L5283P0895n46m5616m5685O2536K3825j4744m0549k9085
17552H978J6908K5860K7706M870j738Q633k2479k6728L9189L6452j5046l0882
17540G1723N922m121R118j8203Q333q808l3514n4386J1432N0453J7231K0588L8731
17527A14499L2868M0548J0672K23j3958r776o891Q901J8707N0603L913m3710k5076
17514A81523N638l4547K3400J3731j6381j9699k0559l2075N887M3891l611n036
17502A42162j4967L8861L6900M6210J6995N3l1524l1689k1399M0773J176l1326
$$ plain form
17490 192225 161451 107531 71993 74595 70779 84426 81219 56419 60186 48111 80636 91988
17478 91988 38668 27096 76313 130804 178617 194302 186987 247291 308734 272407 234336 245294
17466 245294 256715 221364 222980 234566 254911 224293 205643 182908 196018 197822 164260 161649
17454 161649 176310 202805 204485 192948 220078 241867 283722 322068 359841 374918 412833 457530
17442 457530 571977 626730 561310 420225 290695 232464 218852 181080 162722 130679 124502
17431 124502 98332 125524 178104 189428 184060 146268 94152 92847 109158 71466 58193 86331
17419 86331 96423 105878 122004 109212 64613 72894 92672 81349 82705 39803 61018 77926
17407 77926 50198 30331 48872 69091 82894 81336 98753 90540 94283 115274 148868 156662
$$ packed form
17490A92225l0774n3920l5538K602l816J3647l207k4800L767j2075L2525J1352
17478I1988n3320j1572M9217N4491M7813J5685p315O0304O1443l6327l8071J0958
17466B45294J1421l5351J616J1586K0345l0618j8650k2735J3110J804l3562k611
17454A61649J4661K6495J680j1537K7130K1789M1855L8346L7773J5077L7915M4697
17442D57530J14447N4753o5420j41085j29530n8231j3612l7772j8358l2043o177
17431A24502k6170K7192N2580J1324n368l7792n2116j305J6311l7692j3273K8138
17419H6331J0092R455J6126j2792m4599Q281J9778j1323J356m2902K1215J6908
17407G7926k7728j9867J8541K0219J3803j558J7417q213L743K0991L3594P794
$$ plain form
17395 156662 124300 113604 135123 129357 137453 87487 87753 89120 94129 102105 67556 49618 56091
17382 56091 22350 40156 72561 90360 77152 64280 56448 54558 85710 107571 101360 111159
17370 111159 87254 32800 59946 96824 98249 99642 139875 153597 134108 113980 56326 63086
17358 63086 80780 80892 63515 52137 87582 130267 171329 147132 120996 102660 101846 112367
17346 112367 114592 143236 134067 135080 145254 127926 148459 128053 117459 136338 114330 128218
17334 128218 167713 133125 105444 126862 138163 133719 123786 119343 131454 111083 66233 68701
17322 68701 95510 94505 114943 126197 129954 126757 94249 73069 79446 109918 106318 90298 57796
17309 57796 88885 158399 180778 160450 134087 135463 129545 95130 141288 182502 160116 129900
$$ packed form
17395A56662l2362j0696K1519n766Q096m9966K66J367N009P976l4549j7938O473
17382E6091l3741J7806L2405J7799j3208j2872p832j890L1152K1861o211R799
17370A11159k3905n4454K7146L6878J425J393M0233J3722j9489k0128n7654O760
17358F3086J7694J12j7377j1378L5445M2685M1062k4197k6136j8336q14J0521
17346A12367K225K8644r169J013J0174j7328K0533k0406j0594J8879k2008J3888
17334A28218L9495l4588k7681K1418J1301m444r933m443J2111k0371m4850K468
17322F8701K6809j005K0438J1254L757l197l2508k1180O377L0472l600j6020l2502
17309E7796L1089O9514K2379k0328k6363J376n918l4415M6158M1214k2386l0216
$$ plain form
17297 129900 90844 119602 123358 139671 118187 135153 127416 127269 138697 130371 152770 148193 123831
17284 123831 130735 127298 152232 165731 182412 150508 127262 143790 158098 179405 195933 212156
17272 212156 208799 223111 213471 194546 164904 169120 206918 214187 205108 206030 206147 204706 238091
17259 238091 213268 175231 167375 189200 190740 203921 193294 195472 195740 202526 212462 130405 121784
17246 121784 145145 168931 207567 207185 164511 140805 165719 198729 223469 254921 224568 188469
17234 188469 207504 204133 214285 208578 190975 249307 277149 267767 293605 301437 313603 301609
17222 301609 309898 321042 336201 354648 374325 393266 399127 383716 339266 341766 387959 406765
17210 406765 420328 450490 433399 433603 446580 477129 491440 506927 506142 532231 588397 611162
$$ packed form
17297A29900l9056K8758L756J6313k1484J6966p737j47J1428q326K2399m577k4362
17284A23831O904l437K4934J3499J6681l1904k3246J6528J4308K1307J6528J6223
17272B12156l357J4312r640j8925k9642M216L7798P269r079R22J17j441L3385
17259B38091k4823l8037p856K1825J540J3181j0627K178K68O786R936q2057q621
17246A21784K3361K3786L8636l82m2674k3706K4914L3010K4740L1452l0353l6099
17234A88469J9035l371J0152n707j7603N8332K7842r382K5838P832J2166j1994
17222C01609Q289J1144J5159J8447J9677J8941N861j5411m4450K500M6193J8806
17210D06765J3563L0162j7091K04J2977L0549J4311J5487p85K6089N6166K2765
$$ plain form
17198 611162 611913 626371 649040 693855 732291 723959 723143 799939 932643 1008190 1064575 1153203
17186 1153203 1263580 1388773 1515143 1648701 1850940 2015126 2131793 2372555 2649666
17177 2649666 2983403 3385903 3921718 4611697 5654437 7192969 9529773 13026502 17120902
17168 17120902 20158638 22053059 24183666 27965577 32509897 34016286 32105463 28725240
17160 28725240 25898151 24281495 22419153 19773429 16852350 14523803 13524177 14147935
17152 14147935 16521033 20565744 24783947 27454161 29392248 32352151 37463536 41766492
17144 41766492 41363449 37651346 32989737 29608677 27044170 23468921 18985884 14392154
17136 14392154 10617859 8031704 6316457 5196611 4516286 4073349 3784957 3617855 3497473
$$ packed form
17198F11162P51J4458K2669M4815L8436q332q16P6796J32704P5547N6385Q8628
17186A153203J10377J25193J26370J33558K02239J64186J16667K40762K77111
17177B649666L33737M02500N35815O89979J042740J538532K336804L496729M094400
17168A7120902L037736J894421K130607L781911M544320J506389j910823l380223
17160B8725240k827089j616656j862342k645724k921079k328547r99626O23758
17152A4147935K373098M044711M218203K670214J938087K959903N111385M302956
17144D1766492m03043l712103m661609l381060k564507l575249m483037m593730
17136A4392154l774295k586155j715247j119846o80325m42937k88392j67102j20382
$$ plain form
17127 3497473 3405813 3407050 3447936 3455102 3488495 3584086 3774087 4002129 4314727 4767016 5421788
17116 5421788 6369148 7781437 10040231 13474854 17412284 20356859 22272609 24439664
17108 24439664 28177814 32592296 33989729 32021472 28619718 25794005 24241498 22381212
17100 22381212 19683568 16743636 14501439 13584284 14217972 16668072 20746138 24863038
17092 24863038 27461464 29355578 32357030 37477813 41639302 41102672 37268099 32591224
17084 32591224 29249150 26616881 22971116 18410897 13711959 9915153 7285996 5579195
17076 5579195 4432305 3655909 3151680 2775514 2464229 2225279 2061936 1925433 1818293
17067 1818293 1726734 1591057 1438896 1328019 1273642 1188425 1105431 1018229 937815 858340 795865
$$ packed form
17127C497473r1660J237M0886P166L3393R5591J90001K28042L12598M52289O54772
17116E421788R47360J412289K258794L434623L937430K944575J915750K167055
17108B4439664L738150M414482J397433j968257l401754k825713j552507j860286
17100B2381212k697644k939932k242197r17155O33688K450100M078066M116900
17092B4863038K598426J894114L001452N120783M161489n36630l834573m676875
17084C2591224l342074k632269l645765m560219m698938l796806k629157j706801
17076E579195j146890p76396n04229l76166l11285k38950j63343j36503j07140
17067A818293r1559j35677j52161j10877n4377q5217q2994q7202q0414p9475o2475
$$ plain form
17056 795865 788168 782128 746931 706800 680193 681593 669847 649653 601410 576723 538582 554355
17044 554355 581104 606900 651941 690144 716930 761044 771685 813973 866431 942647 992197
17033 992197 1034841 1030979 1045765 1072278 1176349 1314192 1448695 1584722 1681583 1800366 1974370
17022 1974370 2226328 2528799 2832006 3153468 3530459 4103400 4900253 5962824 7521526
17013 7521526 10048420 13973169 18853660 22533586 23983568 24448447 25990013 30825655
17005 30825655 37777502 40937493 38689713 33656443 28657773 26547720 26525454 25641519
16997 25641519 23121230 19883138 17279899 16657699 18155251 20541921 21781266 21785992 21754871
16988 21754871 23428530 27943769 32581794 32874305 29664892 25126321 21685666 20599632
$$ packed form
17056G95865p697o040l5197m0131k6607J400j1746k0194m8243k4687l8141J5773
17044E54355K6749K5796M5041L8203K6786M4114J0641M2288N2458P6216M9550
17033I92197M2644l862J4786K6513J04071J37843J34503J36027R6861J18783J74004
17022A974370K51958L02471L03207L21462L76991N72941P96853J062571J558702
17013G521526K526894L924749M880491L679926J449982M64879J541566M835642
17005C0825655O951847L159991k247780n033270m998670k110053k2266q83935
16997B5641519k520289l238092k603239o22200J497552K386670J239345M726l1121
16988B1754871J673659M515239M638025K92511l209413m538571l440655j086034
$$ plain form
16980 20599632 20171916 18356112 15393648 12054145 9200420 7230387 5971275 5169017
16972 5169017 4676786 4497248 4454446 4498795 4563251 4726727 5073601 5644324 6540982 7901446
16962 7901446 9951498 13230809 17920840 22244073 24353843 24931686 25714704 29170285
16954 29170285 35852692 41015445 40347200 35963382 30430055 27057203 26598018 26303133
16946 26303133 24163835 20954105 17847603 16297648 16998003 19258417 21009334 21318530
16938 21318530 21132812 21976296 25465764 30562660 32558006 30290017 25977624 21796545
16930 21796545 19847431 19415063 18167743 15457043 12033484 8815969 6419368 4805679
16922 4805679 3734415 3008826 2514774 2173128 1897494 1660825 1491106 1332640 1263899
$$ packed form
16980B0599632m27716j815804k962464l339503k853725j970033j259112q02258
16972E169017m92231j79538m2802M4349O4456J63476L46874N70723Q96658J360464
16962G901446K050052L279311M690031M323233K109770N77843P83018L455581
16954B9170285O682407N162753o68245m383818n533327l372852m59185k94885
16946B6303133k139298l209730l106502j549955P00355K260414J750917L09196
16938B1318530j85718Q43484L489468N096896J995346k267989m312393m181079
16930B1796545j949114m32368j247320k710700l423559l217515k396601j613689
16922D805679j071264p25589m94052l41646k75634k36669j69719j58466o8741
$$ plain form
16913 1263899 1155667 1063831 984799 893998 804067 751235 713057 671556 599465 543683 510704
16902 510704 507681 463553 436813 406790 336834 280406 273509 247790 225243 195372 185587 203875
16890 203875 221139 155551 156349 131715 112258 63733 45968 50367 79205 98714 81658 98828
16878 98828 123383 145375 160071 164221 142951 128455 94605 75678 65056 76725 98284 85225
16866 85225 69970 32462 65160 66258 55746 60057 76662 93439 100537 74357 42175 -7386
16854 -7386 2 34156 45871 97957 78863 44526 28060 -2756 -21600 -49796 -34356 -11046
16842 -11046 -13092 293 797 -3998 -9571 19315 21443 28343 57555 84978 86558 101937 90323
16829 90323 73172 80727 71723 66897 52987 25320 26006 57371 41695 4515 -6774 -25194 -11158
$$ packed form
16913A263899j08232r1836p9032r0801q9931n2832l8178m1501p2091n5782l2979
16902E10704l023m4128k6740l0023o9956n6428o897k5719k2547k9871r785J8288
16890B03875J7264o5588P98k4634j9457m8525j7765M399K8838J9509j7056J7170
16878I8828K4555K1992J4696M150k1270j4496l3850j8927j0622J1669K1559j3059
16866H5225j5255l7508L2698J098j0512M311J6605J6777P098k6180l2182m9561
16854g386P388L4154J1715N2086j9094l4337j6466l0816j8844k8196J5440K3310
16842a1046k046J3385N04m795n573K8886K128O900K9212K7423J580J5379j1614
16829I0323j7151P555r004m826j3910k7667O86L1365j5676l7180j1289j8420J4036
$$ plain form
16816 -11158 -13011 -28210 -17041 -26912 -22453 -4382 -22214 -37855 -43947 -58108 -22924 -10132
16804 -10132 -30840 -11014 -28074 -23067 2768 6929 43356 -13320 -1229 12047 13549 28192
16792 28192 30949 35369 16910 -156 9077 11033 11649 20669 27686 23586 27044 35961 7315 -17150
16778 -17150 -26389 -35409 -46548 -22717 -36753 -39609 -55087 -19376 -14319 25433 60146 87424
16766 87424 123459 144608 165379 166291 194562 249224 286817 295355 317254 327026 339209 271313
16754 271313 220536 231784 238684 215127 177320 135072 132728 147833 173970 194891 230070 264947
16742 264947 255666 275656 306461 291965 246790 208831 190311 167782 155873 110406 48700 13786
16730 13786 9766 53317 52104 50020 76962 25657 23989 70257 37631 2155 -1265 37432 52772
$$ packed form
16816a1158j853j5199J1169r871M459J8071j7832j5641o092j4161L5184J2792
16804a0132k0708J9826j7060N007K5835M161L6427n6676J2091J3276J502J4643
16792B8192K757M420j8459j7066R233J956O16R020P017m100L458Q917k8646k4465
16778a7150r239r020j1139K3831j4036k856j5478L5711N057L9752L4713K7278
16766H7424L6035K1149K0771R12K8271N4662L7593Q538K1899R772J2183o7896
16754B71313n0777J1248O900k3557l7807m2248k344J5105K6137K0921L5179L4877
16742B64947r281J9990L0805j4496m5175l7959j8520k2529j1909m5467o1706l4914
16730A3786m020M3551j213k084K6942n1305j668M6268l2626l5476l420L8697J5340
$$ plain form
16717 52772 78709 133022 181372 160149 160737 144111 168748 267565 335171 331714 349844 304075
16705 304075 254922 214394 199716 192013 148500 87348 98564 154782 213683 195634 177574 207384
16693 207384 225159 245905 310188 339961 303227 278483 254655 215387 198090 182826 177257 146563
16681 146563 76378 47853 67358 52493 18957 -33185 -58680 -52480 -22712 7541 17000 56539
16669 56539 27755 10124 -973 -32401 -18626 -33579 -35085 -14312 12644 -12608 -47858 -63759
16657 -63759 -62590 -2102 20480 -5762 -43103 -66709 -91023 -59608 -32874 11628 4725 -17789
16645 -17789 -19918 -27346 8615 40726 52585 121161 158766 143890 159888 187693 204762 159029
16633 159029 136901 153586 148849 99740 96010 95974 82347 56874 23141 33608 33620 63054 85580
$$ packed form
16717E2772K5937N4313M8350k1223N88j6626K4637R8817O7606l457J8130m5769
16705C04075m9153m0528j4678p703m3513o1152J1216N6218N8901j8049j8060K9810
16693B07384J7775K0746O4283K9773l6734k4744k3828l9268j7297j5264n569l0694
16681A46563p0185k8525J9505j4865l3536n2142k5495O200K9768L0253R459L9539
16669E6539k8784j7631j1097l1428J3775j4953j506K0773K6956k5252l5250j5901
16657f3759J169O0488K2582k6242l7341k3606k4314L1415K6734M4502o903k2514
16645a7789k129p428L5961L2111J1859O8576L7605j4876J5998K7805J7069m5733
16633A59029k2128J6685m737m9109l730l6j3627k5473l3733J0467J2K9434K2526
$$ plain form
16620 85580 89769 96772 116346 165173 163989 165867 129715 126395 93941 47848 2424 -39376 -17489
16607 -17489 14201 7170 25233 81743 81653 44217 39523 12082 -12728 -26319 -24716 7619 32559
16594 32559 44867 73946 92977 29519 19576 25590 47707 50787 11929 -25902 -16551 40508
16582 40508 78342 98787 139585 169494 196396 187348 175072 129317 99361 103573 122031 72279
16570 72279 65266 49012 23852 46573 77270 114926 92776 108893 157961 170135 133181 122414
16558 122414 149789 149273 189310 189136 125229 72564 28881 -19951 -41959 -30318 -6675 -40373
16546 -40373 -34534 -20745 -18388 17817 31325 16642 39859 -8050 -24165 2216 33325 -18344
16534 -18344 -2150 50834 48688 30019 -10589 -5582 -8132 -9704 -26834 -75183 -80855 -90580 -69163
$$ packed form
16620H5580M189P003J9574M8827j184J878l6152l320l2454m6093m5424m1800K1887
16607a7489L1690p031J8063N6510r0l7436m694k7441k4810j3591J603L2335K4940
16594C2559J2308K9079J9031o3458r943O014K2117L080l8858l7831R351N7059
16582D0508L7834K0445M0798K9909K6902r048j2276m5755k9956M212J8458m9752
16570G2279p013j6254k5160K2721L0697L7656k2150J6117M9068J2174l6954j0767
16558A22414K7375n16M0037j74o3907n2665m3683m8832k2008J1641K3643l3698
16546d0373N839J3789K357L6205J3508j4683K3217m7909j6115K6381L1109n1669
16534a8344J6194N2984k146j8669m0608N007k550j572j7130m8349n672r725K1417
$$ plain form
16521 -69163 -62150 -54662 -48930 -29039 -48343 -51985 -49972 -51488 -43958 -3511 55120 35148 23566
16508 23566 -11580 -54847 -70667 -94425 -81351 -21685 37887 29811 25213 12574 3562 100
16496 100 17734 59891 65503 95869 120764 140195 104301 90056 142342 182328 240073 204256
16484 204256 170659 169538 191368 176407 107536 63894 51723 39822 43231 44402 63972 50133
16472 50133 77812 88610 143412 193160 202926 153797 97559 55577 23260 13235 6054 -4192
16460 -4192 29296 27626 41973 26071 -9670 -6943 22055 -2874 -7051 -17983 -55028 8515
16448 8515 23707 21433 22794 1993 4126 64571 95828 64140 43921 53981 81339 119820
16436 119820 136670 111613 123136 120843 103216 85039 97243 130050 147661 92523 41893 73612
$$ packed form
16521f9163P013P488N732J9891j9304l642K013j516P530M0447N8631j9972j1582
16508B3566l5146m3267j5820k3758J3074N9666N9572q076m598j2639r012l462
16496A00J7634M2157N612L0366K4895J9431l5894j4245N2286L9986N7745l5817
16484B04256l3597j121K1830j4961o8871m3642j2171j1901L409J171J9570j3839
16472E0133K7679J0798N4802M9748R766m9129n6238m1982l2317j0025p181j0246
16460d192L3488j670J4347j5902l5741K727K8998k4929m177j0932l7045O3543
16448H515J5192k274J361k0801K133O0445L1257l1688k0219J0060K7358L8481
16436A19820J6850k5057J1523k293j7627j8177J2204L2807J7611n5138n0630L1719
$$ plain form
16424 73612 107105 100191 79063 63118 89104 59493 119229 154921 155194 137722 123214 96678
16412 96678 130800 135341 128902 97984 77286 70096 49249 40594 5401 20222 15476 -7780 -17566
16399 -17566 -5971 6979 6291 -12444 -57438 -46960 -29937 -3456 5185 -47443 -50255 -21101
16387 -21101 -10051 -35412 -38951 619 9171 -23373 -33275 -49256 -48290 -58109 -99565 -56733 -14117
16374 -14117 -29798 -27454 12539 5013 -26757 -40730 -60317 -32101 3934 20468 27966 10437
16362 10437 -20595 -37369 -68753 -53516 -14098 -5366 -21978 -35014 -54647 -71248 -83337 -62450
16350 -62450 -40846 -66061 -32141 -25620 -62419 -59900 -33923 -26107 -54125 -32859 37 -500 14969
16337 14969 -11427 -33802 -65493 -73624 -70437 -68640 -3019 30802 23827 12198 -5667 -27266
$$ packed form
16424G3612L3493o914k1128j5945K5986k9611N9736L5692K73j7472j4508k6536
16412I6678L4122M541o439l0918k0698p190k0847q655l5193J4821m746k3256r786
16399a7566J1595J2950o88j8735m4994J0478J7023K6481Q641n2628k812K9154
16387b1101J1050k5361l539L9570Q552l2544r902j5981R66r819m1456M2832M2616
16374a4117j5681K344L9993p526l1770j3973j9587K8216L6035J6534P498j7529
16362A0437l1032j6774l1384J5237L9418Q732j6612j3036j9633j6601j2089K0887
16350f2450K1604k5215L3920O521l6799K519K5977P816k8018K1266L2896n37J5469
16337A4969k6396k2375l1691q131L187J797O5621L3821o975j1629j7865k1599
$$ plain form
16325 -27266 -31759 -16984 -43342 -74745 -88860 -91481 -64147 -2813 20917 38386 64127 58726
16313 58726 6957 -17931 -21345 -49287 -69932 -15556 2107 -38349 -58289 -90062 -64392 -62591
16301 -62591 -89787 -90339 -96607 -80971 -57707 -73030 -89441 -65071 -41321 -79537 -100307 -83802
16289 -83802 -50243 -12824 4963 66594 66953 6622 -21788 -43535 -56769 -78718 -82960 -69182
16277 -69182 -61870 -82822 -104118 -73234 -50568 -12311 5207 5244 -3928 -17744 831 19384 20959
16264 20959 34502 25338 -7543 -16589 -2139 -34788 -40325 -42890 -43972 -53116 -52172 -40361 -51270
16251 -51270 -64245 -46442 -42886 -67740 -72551 -48497 -13503 -9504 -7905 4664 11751 3829 -10262
16238 -10262 -65375 -59176 -64696 -35601 -39611 -44780 -47659 -74336 -75555 -94984 -92304 -51963 -42004
$$ packed form
16325b7266m493J4775k6358l1403j4115k621K7334O1334K3730J7469K5741n401
16313E8726n1769k4888l414k7942k0645N4376J7663m0456j9940l1773K5670J801
16301f2591k7196n52o268J5636K3264j5323j6411K4370K3750l8216k0770J6505
16289h3802L3559L7419J7787O1631L59o0331k8410k1747j3234k1949m242J3778
16277f9182P312k0952k1296L0884K2666L8257J7518L7r172j3816J8575J8553J575
16264B0959J3543r164l2881r046J4450l2649n537k565j082r144R44J1811j0909
16251e1270j2975J7803L556k4854m811K4054L4994L999J599J2569P087p922j4091
16238a0262n5113O199n520K9095m010n169k879k6677j219j9429K680M0341R959
$$ plain form
16225 -42004 -28901 -13933 -10283 -8398 11633 18015 37064 51720 7934 -45426 -29985 -8642
16213 -8642 4395 -6950 -16413 11451 40966 40900 -4847 -18400 -32155 -44940 -51293 -5430 42646
16200 42646 68513 70852 64567 52722 40560 16369 -21438 -510 -8691 -27211 -42066 -43153
16188 -43153 -41309 -35985 -1371 13828 -828 -9208 -25086 -48290 -41805 -27294 -56273 -54081 -2637
16175 -2637 -19912 -41320 -35348 -11033 -3442 24895 17851 -16619 -12275 -21719 -21970 -64997 -101649
16162 -101649 -99105 -85827 -55133 -23480 -25665 -29995 -14653 2846 -34555 -66102 -59843 -44648
16150 -44648 -55254 -97002 -112535 -105846 -64502 -41178 -7301 15241 18967 -15422 -20406 -31763
16138 -31763 -37616 -98743 -93806 -62181 -27525 2826 25963 48664 26272 27587 -26485 -60641
$$ packed form
16225d2004J3103J4968L650J885K0031O382J9049J4656m3786n3360J5441K1343
16213h642J3037j1345r463K7864K9515o6m5747j3553j3755j2785o353M5863M8076
16200D2646K5867K339o285j1845j2162k4191l7807K0928q181j8520j4855j087
16188d3153J844N324L4614J5199j4656q380j5878k3204O485J4511k8979K192N1444
16175b637j7275k1408N972K4315P591K8337p044l4470M344r444k51m3027l6652
16162a01649K544J3278L0694L1653k185m330J5342J7499l7401l1547O259J5195
16150d4648j0606m1748j5533O689M1344K3324L3877K2542L726l4389m984j1357
16138c1763n853o1127M937L1625L4656L0351K3137K2701k2392J315n4072l4156
$$ plain form
16126 -60641 -25437 30254 44499 -14902 -38667 -40633 -6918 24109 -12569 -25123 -50726 -50014
16114 -50014 -43687 -27493 1064 40312 18367 -1257 -28951 -64563 -65034 -42674 16758 19208
16102 19208 -33119 -70191 -66992 -50558 -35118 -49085 -73180 -74900 -56656 -36282 -33230 -73660
16090 -73660 -45667 4289 3451 -33327 -34372 -9322 33666 67196 35643 42567 43906 31245 43846
16077 43846 65997 60166 29507 15243 15100 -15057 -26525 -44528 -49028 -57670 -63488 -26271 1346
16064 1346 4692 10058 -48982 -72376 -66042 -61697 -48092 -32851 -15051 18851 10609 2430 47564
16051 47564 23230 19117 816 -25394 10158 57102 59139 63806 37121 5358 -49388 -64007
16039 -64007 -45331 -29288 -34298 -73755 -77132 -23886 -26991 -52639 -52611 -59856 -67913 -79222 -78863 -72171
$$ packed form
16126f0641L5204N5691J4245n9401k3765j966L3715L1027l6678j2554k5603P12
16114e0014O327J6194K8557L9248k1945j9624k7694l5612m71K2360N9432K450
16102A9208n2327l7072L199J6434J5440j3967k4095j720J8244K0374L052m0430
16090g3660K7993M9956q38l6778j045K5050M2988L3530l1553O924J339j2661J2601
16077D3846K2151n831l0659j4264j43l0157j1468j8003m500q642n818L7217K7617
16064A346L346N366n9040k3394O334M345J3605J5241J7800L3902q242q179M5134
16051D7564k4334m113j8301k6210L5552M6944K037M667k6685l1763n4746j4619
16039f4007J8676J6043n010l9457l377N3246l105k5648K8p245q057j1309L59O692
$$ plain form
16025 -72171 -78743 -86479 -42221 -27799 -36529 -9388 -6625 -7185 -1048 -11796 -23774 -48428 -84387
16012 -84387 -76444 -84773 -69718 -63958 -39117 -9079 14929 -23709 -71013 -84417 -56651 -62098
16000 -62098 -51625 -43332 -36019 -19544 -35201 -49447 -21214 -5255 -13896 -19807 -32938 -31838 -28388
15987 -28388 -42579 -28262 -17755 11648 -11521 -8023 10903 -3521 -19965 23458 63402 41578
15975 41578 18927 13079 -20925 -19902 -13354 18424 15416 -37410 -59711 -57229 -44535 -22447 -21162
15962 -21162 -49280 -54065 -47939 -61573 -98899 -80988 -63134 -62092 -3091 19 -22054 -57759
15950 -57759 -74216 -37006 -3540 -9986 -21022 -35064 8437 12798 12613 47688 -1080 -56071
15938 -56071 -34804 -20412 -4329 -40957 -44854 -43233 -7006 7790 -12639 -50917 -77923 -69038
$$ packed form
16025g2171o572p736M4258J4422q730K7141K763n60O137j0748j1978k4654l5959
16012h4387P943q329J5055N760K4841L0038K4008l8638m7304j3404K7766n447
16000f2098J0473Q293P313J6475j5657j4246K8233J5959q641n911j3131J100L450
15987b8388j4191J4317J0507K9403k3169L498J8926j4424j6444M3423L9944k1824
15975D1578k2651n848l4004J023O548L1778l008n2826k2301K482J2694K2088J285
15962b1162k8118m785O126j3634l7326J7911J7854J042N9001L110k2073l5705
15950e7759j6457L7210L3466o446j1036j4042M3501M361j85L5075m8768n4991
15938e6071K1267J4392J6083l6628l897J621L6227J4796k0429l8278k7006Q885
$$ plain form
15926 -69038 -36204 -32508 -23363 491 27828 18319 -2801 -39293 -58268 -66526 -38825 -37310 -31858
15913 -31858 -41995 -17384 -37884 -52941 -51008 12601 42963 10827 2990 -1340 -13224 -54196
15901 -54196 -93540 -55869 -56412 -26161 -13301 6440 42572 41059 16629 -3256 -11406 -17649 1728
15888 1728 4970 23515 58394 108220 83743 69359 78383 69977 19636 -5195 26580 13405
15876 13405 39821 83628 69721 24305 8915 -9422 -16608 -1961 8651 1705 -12342 -35645
15864 -35645 -37945 -30753 -29171 4682 595 -65130 -89040 -98893 -61185 26332 50658 22539 36109
15851 36109 54573 79997 86656 62865 7340 10013 56724 21290 -19592 -32322 -67453 -34125
15839 -34125 18816 15040 21745 25009 -36164 -73448 -11325 5524 3049 -11255 -12079 6584 1940
$$ packed form
15926f9038L2834L696R145K3854K7337r509k1120l6492j8975q258K7701J515N452
15913c1858j0137K4611k0500j5057J933O3609L0362l2136p837m330j1884m0972
15901e4196l9344L7671n43L0251J2860J9741L6132j513k4430j9885q150o243J9377
15888A728L242J8545L4879M9826k4477j4384R024q406n0341k4831L1775j3175
15876A3405K6416M3807j3907m5416j5390j8337p186J4647J0612o946j4047k3303
15864c5645k300P192J582L3853m087o5725k3910r853L7708Q7517K4326k8119J3570
15851C6109J8464K5424O659k3791n5525K673M6711l5434m0882j2730l5131L3328
15839c4125N2941l776O705L264o1173l7284O2123J6849k475j4304q24J8663m644
$$ plain form
15826 1940 8967 20642 12031 -28535 -83787 -94759 -51078 -50301 -38451 -30160 -31788 -42447 -42059
15813 -42059 -36801 4917 -3511 9938 46422 38634 -8979 -44111 -41001 -63033 -48695 -5826
15801 -5826 10860 10650 28524 31778 7000 -29146 -61161 -60049 -67460 -72582 -50477 3127 42909
15788 42909 26062 28827 45390 44003 32132 25168 3662 -20528 -21697 2861 17397 38797
15776 38797 64774 34436 38868 42438 31103 28046 28783 -6421 -15186 -10752 -38231 -17610 9619
15763 9619 -37833 -82124 -34813 21713 55808 47482 33865 49603 76086 127671 121372 115974
15751 115974 129616 92414 35553 29030 24322 3159 -13745 -22885 -28321 -45061 -45575 -33357 -42043
15738 -42043 -34265 -17704 -11865 -10625 -33698 -24949 -42841 -42664 -21811 4567 23278 29969 34025
$$ packed form
15826A940P027J1675q611m0566n5252j0972M3681P77J1850Q291j628j0659L88
15813d2059N258M1718q428J3449L6484p788m7613l5132L110k2032J4338M2869
15801e826J6686k10J7874L254k4778l6146l2015J112p411n122K2105N3604L9782
15788D2909j6847K765J6563j387j1871o964k1506k4190j169K4558J4536K1400
15776C8797K5977l0338M432L570j1335l057P37l5204q765M434k7479K0621K7229
15763I619m7452m4291M7311N6526L4095q326j3617J5738K6483N1585o299n398
15751A15974J3642l7202n6861o523m708k1163j6904r140n436j6740n14J2218q686
15738d2043P778J6561N839J240k3073Q749j7892J77K0853K6378J8711O691M056
$$ plain form
15725 34025 30560 -14444 -50662 -68432 -57583 -44519 -51568 -41702 -38431 -47665 -51041 -58276 -31970
15712 -31970 16197 6866 25554 12780 -438 10104 19485 -16097 -51362 -90052 -85664 -73802
15700 -73802 -57662 -41760 -17092 -17241 -2712 -2427 -2341 3976 8406 2985 -27276 -43512 -35019 -47626
15686 -47626 -66623 -67960 -12826 -7670 -25799 -8590 33942 17358 -7900 -9428 -16568 15238
15674 15238 27333 687 -12635 -4199 37269 55661 58891 10799 -9104 8524 8954 12085 -1269
15661 -1269 22616 13111 9901 8096 -2941 20905 63960 62630 52808 18859 6988 -20309 -15369
15648 -15369 -49381 -51309 -64888 -35031 -21428 -14080 -28428 -25844 -36078 -45685 -171 36714
15636 36714 -5610 -32039 -70110 -63553 -36644 5239 22866 61364 57022 86118 95839 78861
$$ packed form
15725C4025l465m5004l6218j7770J0849J3064p049R866L271r234l376p235K6306
15712c1970M8167r331J8688j2774j3218J0542R381l5582l5265l8690M388J1862
15700g3802J6140J5902K4668j49J4529K85Q6O317M430n421l0261j6236Q493j2607
15686d7626j8997j337N5134N156j8129J7209M2532j6584k5258j528p140L1806
15674A5238J2095k6646j3322Q436M1468J8392L230m8092j9903J7628M30L131j3354
15661a269K3885r505l210j805j1037K3846M3055j330r822l3949j1871k7297M940
15648a5369l4012j928j3579K9857J3603P348j4348K584j0234r607M5514L6885
15636C6714m2324k6429l8071O557K6909M1883J7627L8498m342K9096R721j6978
$$ plain form
15624 78861 26668 8432 14668 20639 14823 -3251 -25496 -22824 -17042 4463 23160 29317 -1873
15611 -1873 21438 30031 52788 69377 118275 120214 78396 31490 5076 18446 62496 67030
15599 67030 120034 138372 128317 165374 216999 281578 354810 465093 601542 877365 1278071
15588 1278071 1891476 2445711 2514770 2193998 1677788 1193439 806311 535974 365164 310100
15578 310100 258646 188773 139889 118230 62565 36341 13876 187 -15044 13372 50382
15567 50382 75371 75133 106913 70460 59532 62526 56850 58273 16514 714 3635 31739 18943
15554 18943 42152 44152 49531 30938 36922 70986 61835 78006 62216 22659 48798 25411
15542 25411 -3320 -30546 -52654 -36999 4350 15990 16983 2366 -12602 -32209 -10064 14551
$$ packed form
15624G8861n2193j8236O236N971n816j8074k2245K672N782K1505J8697O157l1190
15611a873K3311Q593K2757J6589M8898J939m1818m6906k6414J3370M4050M534
15599F7030N3004J8338j0055L7057N1625O4579P3232J10283J36449K75823M00706
15588A278071O13405N54235O9059l20772n16210m84349l87128k70337j70810n5064
15578C10100n1454o9873m8884k1659n5665k6224k2465j3689j5231K8416L7010
15567E0382K4989k38L1780l6453j0928K994n676J423m1759j5800K921K8104j2796
15554A8943K3209K000N379j8593N984L4064r151J6171j5790l9557K6139k3387
15542B5411k8731k7226k2108J5655M1349J1640R93j4617j4968j9607K2145K4615
$$ plain form
15530 14551 28906 28742 -11208 -22082 10772 26196 -6302 -18825 16172 23109 -2062 -13924
15518 -13924 -43963 -39518 -17065 14400 -18181 14732 28995 -12589 3788 67117 80098 91519
15506 91519 72636 29748 36122 47573 18387 -9418 -42488 -59049 -40816 19282 65678 116359
15494 116359 93577 76790 65967 46390 12738 -22084 -18615 8296 33471 10686 3504 17102
15482 17102 -2439 -34924 -43339 -16915 -46060 -62560 -46151 -32065 -1163 28825 -2362 -21735
15470 -21735 -10593 27792 52139 40325 39547 13463 -20840 -49164 -11909 42426 49701 55850
15458 55850 53171 46725 66753 60608 12900 3402 -10767 -44893 -26786 17783 -239 4165 -16090
15445 -16090 -16595 -14619 17101 38519 59240 69735 83430 98425 124299 113477 101608 66498
$$ packed form
15530A4551J4355j64l9950j0874L2854J5424l2498j2523L4997O937k5171j1862
15518a3924l0039M445K2453L1465l2581L2913J4263m1584J6377O3329J2981J1421
15506I1519j8883m2888O374J1451k9186k7805l3070j6561J8233O0098M6396N0681
15494A16359k2782j6787j0823j9577l3652l4822L469K6911K5175k2785p182J3598
15482A7102j9541l2485q415K6424k9145j6500J6409J4086L0902K9988l1187j9373
15470b1735J1142L8385K4347j1814p78k6084l4303k8324L7255N4335P275O149
15458E5850k679o446K0028o145m7708r498j4169l4126J8107M4569j8022M404k0255
15445a6090n05J976L1720K1418K0721J0495J3695J4995K5874j0822j1869l5110
$$ plain form
15433 66498 35972 68819 68447 21222 6110 3160 11529 3585 -34933 -36455 -14135 -26253 17294
15420 17294 51646 24520 44950 16617 -529 -37113 -54318 -42698 -8744 1224 -37156 -23959
15408 -23959 -9850 -23149 -13913 7884 55505 58554 50387 42889 54727 53627 47810 44332 -8867
15395 -8867 -59936 -59981 -32332 -3493 -19374 -27109 -8503 4940 35480 84353 90694 51669 44634
15382 44634 62664 26824 6625 -5786 -43000 -24441 9804 17627 40685 88180 87147 55906
15370 55906 55837 57689 29932 22280 14681 -14263 -39335 23573 24773 -32643 15993 23352 -33088
15357 -33088 -39820 -97 -11538 -9014 -4605 -38314 -47179 9091 41060 76159 31346 52790
15345 52790 84160 63110 61142 70460 35281 40216 29047 -10157 29028 73187 46398 36893
$$ packed form
15433F6498l0526L2847l72m7225j5112k950Q369p944l8518j522K2320j2118M3547
15420A7294L4352k7126K0430k8333j7146l6584j7205J1620L3954R968l8380J3197
15408b3959J4109j3299R236K1797M7621L049q167p498J1838j100n817l478n3199
15395h867n1069m5K7649K8839j5881p735J8606J3443L0540M8873O341l9025p035
15382D4634J8030l5840k0199j2411l7214J8559L4245P823K3058M7495j033l1241
15370E5906o9J852k7757p652p599k8944k5072O2908J200n7416M8636P359n6440
15357c3088o732L9723j1441K524M409l3709q865N6270L1969L5099m4813K1444
15345E2790L1370k1050j968R318l5179M935j1169l9204L9185M4159k6789r505
$$ plain form
15333 36893 34784 22250 38672 45351 33573 5268 46795 49731 54598 46026 25090 4810 11552
15320 11552 -5101 32126 58240 74878 87120 87416 110811 72840 103613 175154 201947 245381
15308 245381 280848 299370 282244 284307 272060 256551 230843 154442 153568 133958 111287 103548
15296 103548 102499 75869 61548 37746 44562 22326 12914 18426 24905 -6779 -19852 -37972
15284 -37972 -71254 -14504 20418 34645 35382 48983 66163 56393 31363 43650 22074 19239
15272 19239 22765 58792 90258 130587 147883 127078 92906 113076 77615 78278 63062 62676 89969
15259 89969 114851 142516 143445 142171 139555 119140 91845 46004 40216 78334 119489 120767 94259
15246 94259 84131 28661 5963 31693 6322 -33524 9937 37791 31787 85593 121911 144957
$$ packed form
15333C6893k109j2534J6422O679j1778k8305M1527K936M867q572k0936k0280O742
15320A1552j6653L7227K6114J6638J2242K96K3395l7971L0773P1541K6793M3434
15308B45381L5467J8522j7126K063j2247j5509k5708p6401q74j9610k2671p739
15296A03548j049k6630j4321k3802O816k2236r412N512O479l1684j3073j8120
15284c7972l3282N6750L4922J4227P37J3601J7180r770k5030J2287k1576k835
15272A9239L526L6027L1466M0329J7296k0805l4172K0170l5461O63j5216l86K7293
15259H9969K4882K7665R29j274k616k0415k7295m5841n788L8118M1155J278k6508
15246I4259j0128n5470k2698K5730k5371l9846M3461K7854o004N3806L6318K3046
$$ plain form
15234 144957 173912 202478 190228 199396 181989 186839 222957 194603 149596 159825 143809 112180
15222 112180 134320 134789 182161 214852 220376 232046 240124 214716 175508 140552 98185 -1602
15210 -1602 -114748 -106652 -106879 -71463 -36618 6585 49871 89536 97735 93363 116820 99089 32598
15197 32598 25018 35136 15172 798 -10180 28475 40745 55096 47342 57381 38047 -33571
15185 -33571 -27236 269 -8462 -18898 47221 167502 230742 293317 337932 314202 305359 298618
15173 298618 285044 268904 249688 254674 190815 155535 129702 87471 101294 118326 187272 213557
15161 213557 208015 229769 238943 238909 240225 242571 232227 237127 249285 270098 293097 292650 254582
15148 254582 216719 196775 179831 229979 277450 346366 409293 412620 399213 375128 325259 348097
$$ packed form
15234A44957K8955K8566j2250R168j7407M850L6118k8354m5007J0229j6016l1629
15222A12180K2140M69M7372L2691N524J1670Q078k5408l9208l4956m2367r9787
15210a602j13146Q096k27L5416L4845M3203M3286L9665Q199m372K3457j7731o6491
15197C2598p580J0118j9964j4374j0978L8655J2270J4351p754J0039j9334p1618
15185c3571O335K7505q731j0436O6119J20281O3240O2575M4615k3730q843o741
15173B98618j3574j6140j9216M986o3859l5280k5833m2231J3823J7032O8946K6285
15161B13557n542K1754R174l4J316K346j0344M900J2158K0813K2999m47l8068
15148B54582l7863j9944j6944N0148M7471O8916O2927L327j3407k4085m9869K2838
$$ plain form
15136 348097 406400 415449 402085 427148 432580 462962 517089 547111 537777 503850 495797 531741
15124 531741 593688 605014 587847 567543 562994 579850 624999 682176 736817 743834 729508 804266
15112 804266 876617 901672 911556 901191 878040 859129 832181 832219 869363 912362 918874 954411
15100 954411 965600 1029718 1196294 1403142 1552182 1648871 1692889 1733759 1751485 1746957 1843235
15089 1843235 1995620 2170717 2360877 2585561 2779510 2923175 3097818 3323571 3575120
15080 3575120 3949058 4467552 5167092 6040292 7138074 8356582 9316230 9949642 10496769
15071 10496769 11202724 12378340 14179541 16734581 19888347 23271783 27224164 32464623
15063 32464623 39919519 50718067 66344512 88898560 123818171 183694672 287304444
$$ packed form
15136C48097N8303R049j3364K5063N432L0382N4127L0022r334l3927q053L5944
15124E31741O1947J1326j7167k0304m549J6856M5149N7177N4641P017j4326P4758
15112H04266P2351K5055R884j0365k3151j8911k6948L8L7144M2999O512L5537
15100I54411J1189O4118J66576K06848J49040R6689M4018M0870J7726m528R6278
15089A843235J52385J75097J90160K24684J93949J43665J74643K25753K51549
15080C575120L73938N18494O99540Q73200J097782J218508R59648O33412N47127
15071A0496769P05955J175616J801201K555040L153766L383436L952381N240459
15063C2464623P454896J0798548J5626445K2554048L4919611N9876501J03609772
$$ plain form
15056 287304444 426881724 512126801 487891782 397861821 280527450 184191089 122623919
15049 122623919 84999837 61487958 46265490 36167494 29392699 24847557 21418060
15042 21418060 18414826 15756437 13468132 11702301 10492228 9814769 9482589 9048518
15034 9048518 8324273 7364957 6378629 5569667 4982465 4556442 4174558 3874576 3620143
15025 3620143 3385444 3153750 2973079 2757265 2603986 2460388 2273247 2105567 1991873
15016 1991873 1886269 1760442 1695054 1698442 1656625 1610842 1581379 1551685 1492482 1432452 1377906
15005 1377906 1345608 1289023 1210822 1112190 1066387 966799 933930 925223 951934 969500 955321
14994 955321 955829 974102 970922 927001 920447 916736 926601 962758 1058403 1212476 1388353 1617260
$$ packed form
15056B87304444J39577280Q5245077k4235019r0029961j17334371r6336361o1567170
15049A22623919l7624082k3511879j5222468j0097996o774795m545142l429497
15042B1418060l003234k658389k288305j765831j210073o77459l32180m34071
15034I048518p24245r59316r86328q08962n87202m26023l81884k99982k54433
15025C620143k34699k31694j80671k15814j53279j43598j87141j67680j13694
15016A991873j05604j25827o5388L388m1817m5783k9463k9694n9203o0030n4546
15005A377906l2298n6585p8201r8632m5803r9588l2869q707K6711J7566j4179
14994I55321N08J8273l180m3921o554l711R865L6157R5645J54073J75877K28907
$$ plain form
14982 1617260 1994353 2656871 3545224 4379590 4765967 4547566 3846188 2990456 2244088
14973 2244088 1674636 1304909 1079902 954175 834496 769549 659410 586338 583372 606587
14963 606587 592828 558794 521069 499703 481894 455530 443909 433734 427398 413167 408315 400706
14951 400706 396843 377852 367672 410959 464055 520243 538134 542252 479448 422877 394302 375938
14939 375938 335391 289223 253095 268882 261142 238148 215522 213178 152195 177386 307986 439925
14927 439925 572559 594846 528355 488316 442280 398528 388643 361916 345655 350596 394377 445038
14915 445038 414736 372875 306627 275812 226140 174645 136211 146438 200882 258424 279079
14904 279079 296898 376154 441524 437204 353892 259749 171359 105745 35766 1755 -5486 41573
$$ packed form
14982A617260L77093O62518Q88353Q34366L86377k18401p01378q55732p46368
14973B244088n69452l69727k25007j25727j19679o4947j10139p3072k966K3215
14963F06587j3759l4034l7725k1366j7809k6364j1621j0175o336j4231m852p609
14951D00706l863j8991j0180M3287N3096N6188J7891M118o2804n6571k8575j8364
14939C75938m0547m6168l6128J5787p740k2994k2626k344o0983K5191J30600J31939
14927D39925J32634K2287o6491m0039m6036m3752r885k6727j6261M941M3781N0661
14915D45038l0302m1861o6248l0815m9672n1495l8434J0227N4444N7542K0655
14904B79079J7819P9256O5370m320q3312r4143q8390o5614o9979l4011p241M7059
$$ plain form
14892 41573 59954 50400 96703 115697 110567 99148 76146 61053 77442 73003 83162 73597
14880 73597 93565 61555 47702 97642 111518 109852 109377 124362 104246 114083 123495 125130 123879
14867 123879 106888 85939 82789 67696 70340 82746 98752 86449 76872 89284 61139 69247
14855 69247 53399 64762 57678 -1222 27820 69103 84711 118665 165905 162007 87310 52084
14843 52084 58750 36995 57266 46469 40051 62493 41967 49266 92868 114747 114338 126074 81032
14830 81032 60188 45044 49222 120327 160373 138341 127555 108263 109931 105537 104166 107301 140965
14817 140965 145081 110214 91298 85210 79103 74143 50573 85330 73162 42181 32859 36876 54406
14804 54406 51938 62639 88881 95993 103561 81498 113647 130296 105502 111537 133695 138185 108221
$$ packed form
14892D1573J8381r554M6303J8994n130j1419k3002j5093J6389m439J0159r565
14880G3597J9968l2010j3853M9940J3876j666m75J4985k0116R837R412J635j251
14867A23879j6991k0949l150j5093K644J2406J6006j2303r577J2412k8145Q108
14855F9247j5848J1363p084n8900K9042M1283J5608L3954M7240l898p4697l5226
14843E2084O666k1755K0271j0797o418K2442k0526P299M3602K1879m09J1736m5042
14830H1032k0844j5144M178P1105M0046k2032j0786j9292J668m394j371L135L3664
14817A40965M116l4867j8916o088o107m960k3570L4757j2168l0981r322M017J7530
14804E4406k468J0701K6242P112P568k2063L2149J6649k4794O035K2158M490k9964
$$ plain form
14791 108221 73579 96286 154190 165242 174721 137798 106158 136992 167901 186750 198946 259365
14779 259365 361334 457162 541783 632754 699437 787981 897748 1032541 1147923 1186878 1156154
14768 1156154 1129095 1141838 1199508 1159908 1056848 867838 691924 602319 465272 364654
14758 364654 346586 319324 280617 223741 177111 143469 118202 99360 93774 114617 89509 80814
14746 80814 77488 63578 46369 22011 9437 44580 63980 32778 6366 13096 26956 47794
14734 47794 60736 83872 55677 61230 89304 61076 44111 53038 67314 99140 118817 94507
14722 94507 92149 97102 90836 91036 83464 95547 106548 57905 9956 -7984 443 12717 5940
14709 5940 24154 54562 34954 32117 36644 11036 17312 54568 39951 43985 70007 61422 41368
$$ packed form
14791A08221l4642K2707N7904J1052R479l6923l1640L0834L0909J8849J2196O0419
14779B59365J01969R5828Q4621R0971O6683Q8544J09767J34793J15382L8955l0724
14768A156154k7059J2743N7670l9600j03060j89010j75914q9605j37047j00618
14758C64654j8068k7262l8707n6876m6630l3642k5267j8842n586K0843k5108q695
14746H0814l326j3910j7209k4358j2574L5143J9400l1202k6412O730J3860K0838
14734D7794J2942K3136k8195N553K8074k8228j6965Q927J4276L1826J9677k4310
14722I4507k358M953o266K00p572J2083J1001m8643m7949j7940Q427J2274o777
14709E940J8214L0408j9608k837M527k5608O276L7256j4617M034K6022q585k0054
$$ plain form
14696 41368 14702 6450 -3607 28620 53294 30881 -7927 21583 72543 51422 20716 31150
14684 31150 40414 54600 46401 44660 24700 7826 4452 34601 82768 109152 142262 147836 110224
14671 110224 72443 79902 92024 85391 84088 91653 77472 49913 22896 59163 37994 -21670
14659 -21670 -34065 31731 72721 71535 45603 52219 8459 -62237 -35393 -3669 34698 18992
14647 18992 13395 30911 24796 50067 50428 33873 39286 44651 40117 -7915 17487 -26757 -37584
14634 -37584 -48585 -40889 37910 66981 32614 33015 43101 25922 26860 40196 47682 47092 54325
14621 54325 70737 77626 69429 59246 45010 31753 26499 6824 -21539 -21792 -22802 -30406 4870
14608 4870 -9813 -36842 1154 29561 55815 14851 11571 34082 37369 58963 123809 115073
$$ packed form
14696D1368k6666q252j0057L2227K4674k2413l8808K9510N0960k1121l0706J0434
14684C1150R264J4186q199j741j9960j6874l374L0149M8167K6384L3110N574l7612
14671A10224l7781P459J2122o633j303P565j4181k7559k7017L6267k1169n9664
14659b1670j2395O5796M0990j186k5932O616m3760p0696K6844L1724L8367j5706
14647A8992n597J7516o115K5271L61j6555N413N365m534m8032K5402m4244j0827
14634c7584j1001P696P8799K9071l4367M01J0086j7179R38J3336P486n90P233
14621E4325J6412O889q197j0183j4236j3257n254j9675k8363k53j010p604L5276
14608D870j4683k7029L7996K8407K6254m0964l280K2511L287K1594O4846q736
$$ plain form
14596 115073 88978 69196 56454 88293 102377 53996 49394 87554 117887 96370 82664 51393
14584 51393 34982 63864 54735 11380 -17490 -5988 -18128 -16677 54327 52602 48472 56017 73382
14571 73382 93954 108483 104130 80681 53711 52747 70234 92033 63995 54493 46349 50014 110207
14558 110207 186693 175381 161022 128414 110297 133471 154478 137767 163542 186766 158512
14547 158512 112945 113912 96353 78173 66451 65687 51136 58266 86415 88666 84092 54691 51767
14534 51767 65117 135832 101263 64319 65355 96917 150255 172794 133675 173268 218254 233566
14522 233566 322370 445627 565481 779539 1115238 1634507 2262774 2554491 2381381 1925379
14512 1925379 1358763 921260 663733 526382 385390 306099 232276 148250 117778 116039
$$ packed form
14596A15073k6095j9782j2742L1839J4084m8381m602L8160L0333k1517j3706l1271
14584E1393j6411K8882r129m3355k8870J1502j2140J451P1004j725m130P545J7365
14571G3382K0572J4529m353k3449k6970r64J7487K1799k8038r502q144L665O0193
14558A10207P6486j1312j4359l2608j8117K3174K1007j6711K5775K3224k8254
14547A58512m5567R67j7559j8180j1722p64j4551P130K8149K251m574k9401k924
14534E1767J3350P0715l4569l6944J036L1562N3338K2539l9119L9593M4986J5312
14522B33566Q8804J23257J19854K14058L35699N19269O28267K91717j73110m56002
14512A925379n66616m37503k57527j37351j40992p9291p3823q4026l0472j739
$$ plain form
14502 116039 92546 66069 79981 78336 118671 139326 86324 43495 49772 91423 78674 103281
14490 103281 136080 122166 145111 165572 171565 163509 169222 144815 108697 87557 124373 128093
14478 128093 99630 127903 159171 158128 102089 127707 179067 177045 135052 117239 126896 160000
14466 160000 166507 168437 164734 101700 64271 67919 66598 67386 71339 90851 101054 21249 -18038
14453 -18038 3779 21218 -6015 -16774 -21805 -16320 -32547 -28376 1280 28726 51720 75947
14441 75947 86970 103600 116400 89442 99915 97125 79991 99651 100496 87831 69075 97042
14429 97042 124351 170557 209351 218087 235823 253511 243747 291724 257871 204790 249292 253337
14417 253337 229140 247634 273927 274978 233886 206465 229021 276808 294876 283293 270836 231472
$$ packed form
14502A16039k3493k6477J3912j645M0335K0655n3002m2829O277M1651j2749K4607
14490A03281L2799j3914K2945K0461N993q056N713k4407l6118k1140L6816L720
14478A28093k8463K8273L1268j043n6039K5618N1360k022m1993j7813R657L3104
14466A60000O507J930l703o3034l7429L648j321P88L953J9512J0203p9805l9287
14453a8038K1817J7439k7233j0759n031N485j6227M171K9656K7446K2994K4227
14441G5947J1023J6630J2800k6958J0473k790j7134J9660Q45j2665j8756K7967
14429I7042K7309M6206L8794Q736J7736J7688r764M7977l3853n3081M4502M045
14417B53337k4197J8494K6293J051m1092k7421K2556M7787J8068j1583j2457l9364
$$ plain form
14405 231472 233900 267098 293981 336273 371789 415941 450189 456245 426235 467498 494545 484852
14393 484852 554307 576064 582674 613099 586298 556822 519788 522548 523577 581781 604594 572302
14381 572302 538619 551167 580073 606334 615159 624035 623084 634213 633812 635770 631320 621137 612139
14368 612139 614505 644003 690446 731225 747832 728081 710646 737028 778203 793975 791642 809459
14356 809459 820578 835548 870569 925584 960070 1023887 1078470 1150965 1229219 1312010 1336957
14345 1336957 1408236 1547353 1714902 1877391 2043562 2200483 2413129 2679381 2982505 3298125
14335 3298125 3618480 3987756 4450603 4946230 5459714 5950114 6375515 6858742 7463557
14326 7463557 8236077 9153828 10081314 11087749 12372519 14142216 16489800 19399493 22931420
$$ packed form
14405B31472K428L3198K6883M2292L5516M4152L4248O056l0010M1263K7047r693
14393D84852O9455K1757O610L0425k6801k9476l7034K760J029N8204K2813l2292
14381E72302l3683J2548K8906K6261Q825Q876r51J1129m01J958m450j0183q998
14368F12139K366K9498M6443M0779J6607j9751j7435K6382M1175J5772k333J7817
14356H09459J1119J4970L5021N5015L4486O3817N4583P2495P8254Q2791K4947
14345A336957P1279J39117J67549J62489J66171J56921K12646K66252L03124L15620
14335C298125L20355L69276M62847M95627N13484M90400M25401M83227O04815
14326G463557P72520R17751R27486J006435J284770J769697K347584K909693L531927
$$ plain form
14317 22931420 27624914 34342796 44464134 59673215 79903264 99205767 112504304
14310 112504304 124324788 142651182 174050811 209475163 227492764 224567098 214013506
14303 214013506 212011046 224012178 231375118 217844048 189033107 157252214 134424570
14296 134424570 120683485 106211349 88456557 69482970 52317580 39455784 30519249
14289 30519249 24505178 20432840 17336452 14746968 12549786 10792259 9465517 8370375
14281 8370375 7439932 6600034 5874580 5293366 4777970 4358631 4033962 3726264 3428232
14272 3428232 3163798 2925806 2718901 2564198 2439970 2297364 2212486 2132916 2042329 1961809
14262 1961809 1883389 1831970 1770652 1679163 1597378 1552652 1486678 1436842 1360388 1310795 1269277
$$ packed form
14317B2931420M693494O717882J0121338J5209081K0230049J9302503J3298537
14310A12504304J1820484J8326394L1399629L5424352J8017601k925666j0553592
14303B14013506k002460J2001132P362940j3531070k8810941l1780893k2827644
14296A34424570j3741085j4472136j7754792j8973587j7165390j2861796q936535
14289C0519249o014071m072338l096388k589484k197182j757527j326742j095142
14281H370375r30443q39898p25454n81214n15396m19339l24669l07698k98032
14272C428232k64434k37992k06905j54703j24228j42606q4878p9570r0587q0520
14262A961809p8420n1419o1318r1489q1785m4726o5974m9836p6454m9593m1518
$$ plain form
14251 1269277 1215122 1162216 1130189 1118280 1087842 1020897 995899 961561 932955 894745 860448
14240 860448 842450 770494 704278 667037 617463 609627 643325 680965 708316 675848 610921 556053
14228 556053 515945 523225 529635 489471 469875 500577 506878 486600 491626 484853 453636 442400
14216 442400 457059 506375 529900 481809 430063 387243 378258 368843 355423 354220 328107 305394
14204 305394 338151 361979 365857 354198 360613 320522 321237 346547 360307 375796 352617 330057
14192 330057 304510 308970 314811 340236 307025 286516 259813 241701 237588 257075 249069 267176
14180 267176 302068 280493 329983 334880 291143 305628 365164 378870 343979 320442 275714 284339
14168 284339 318664 301086 300567 283671 281185 300981 266693 272464 278022 280716 308627 308736 276117
$$ packed form
14251A269277n4155n2906l2027j1909l0438o6945k4998l4338k8606l8210l4297
14240H60448j7998p1956o6216l7241m9574p836L3698L7640K7351l2468o4927n4868
14228E56053m0108P280O410m0164j9596L0702O301k0278N026o773l1217j1236
14216D42400J4659M9316K3525m8091n1746m2820q985r415j3420j203k6113k2713
14204C05394L2757K3828L878j1659O415m0091P15K5310J3760J5489k3179k2560
14192C30057k5547M460N841K5425l3211k0509k6703j8112m113J9487q006J8107
14180B67176L4892k1575M9490M897m3737J4485N9536J3706l4891k3537m4728Q625
14168B84339L4325j7578n19j6896k486J9796l4288N771N558K694K7911J09l2619
$$ plain form
14155 276117 246053 295069 297412 292542 310414 324287 302695 224504 210475 205209 139350 130724
14143 130724 120147 134284 193802 186141 153262 139028 148382 93759 92596 79902 72718 94419
14131 94419 87460 73435 30743 -13925 -34473 -10624 22558 14621 33218 90904 79108 58005
14119 58005 114088 96205 83618 66254 48826 76027 77556 74586 38229 30422 49473 37096
14107 37096 22567 55491 73665 94026 118237 98896 64523 57414 44823 30060 56623 83733
14095 83733 73973 45972 54819 58107 67069 55071 36241 65427 58521 68102 95623 82845 73194
14082 73194 37989 23083 -11202 10538 48592 48746 86544 97110 88135 79933 63606 67300 41532
14069 41532 40865 28572 40602 44995 32680 48909 60392 39372 31857 23313 26459 37228 64584
$$ packed form
14155B76117l0064M9016K343m870J7872J3873k1592p8191j4029n266o5859q626
14143A30724j0577J4137N9518p661l2879j4234R354n4623j163j2694p184K1701
14131I4419o959j4025m2692m4668k0548K3849L3182p937J8597N7686j1796k1103
14119E8005N6083j7883j2587j7364j7428K7201J529k970l6357p807J9051j2377
14107C7096j4529L2924J8174K0361K4211j9341l4373p109j2591j4763K6563K7110
14095H3733r760k8001Q847L288Q962j1998j8830K9186o906R581K7521j2778r651
14082G3194l5205j4906l4285K1740L8054J54L7798J0566q975q202j6327L694k5768
14069D1532o67j2293J2030M393j2315J6229J1483k1020p515q544L146J0769K7356
$$ plain form
14056 64584 53871 28213 45414 79273 96631 73758 77067 107151 80088 57007 83237 86632
14044 86632 74143 57599 54254 118998 151655 158441 145554 99496 72137 52273 27758 21895
14032 21895 41632 37620 57985 93237 130570 99048 80819 68918 19532 -3386 49499 87533
14020 87533 91644 61768 55815 12024 8716 52555 27538 -8401 -6099 15237 -735 -21010
14008 -21010 -43122 -18126 10273 57654 31312 34230 19775 31289 91953 102190 147698 121314
13996 121314 96678 86813 76928 76482 96264 82033 62642 32052 36493 60164 113594 117601 101033
13983 101033 66948 41809 46253 71604 108630 84021 10760 -35037 -70175 -75527 -16968 23986
13971 23986 9844 17866 54170 10432 -36849 -14190 16405 -8920 -33625 -12546 -8799 4056
$$ packed form
14056F4584j0713k5658J7201L3859J7358k2873L309L0084k7063k3081K6230L395
14044H6632j2489j6544l345O4744L2657O786j2887m6058k7359j9864k4515n863
14032B1895J9737m012K0365L5252L7333l1522j8229j1901m9386k2918N2885L8034
14020H7533M111k9876n953m3791l308M3839k5017l5939K302K1336j5972k0275
14008b1010k2112K4996K8399M7381k6342K918j4455J1514O0664J0237M5508k6384
13996A21314k4636r865r885m46J9782j4231j9391l0590M441K3671N3430M007j6568
13983A01033l4085k5139M444K5351L7026k4609p3261m5797l5138n352N8559M0954
13971B3986j4142Q022L6304m3738m7281K2659L0595k5325k4705K1079L747J2855
$$ plain form
13959 4056 -10089 -4902 15728 7533 1184 -10986 -12647 -9066 -1671 36493 45410 49596 28777
13946 28777 33478 54379 23030 2096 -27921 -46756 -24755 23531 -5031 -30702 22555 73198
13934 73198 68378 42418 46416 36879 32200 30890 30231 47797 46184 17683 -19330 -2648 16435
13921 16435 4691 1299 1190 12548 39682 -9646 -22908 677 10335 52139 56822 12316 -2453
13908 -2453 24423 53765 33969 11078 20849 31703 46910 39405 -3133 -11435 34893 22536
13896 22536 17085 24921 -12621 -18821 -23365 10210 -370 23806 37987 18983 1487 -37068
13884 -37068 -40395 -30084 -11482 343 -11199 27482 19791 -25741 -22426 3414 13309 -21146
13872 -21146 -24155 -34562 -42046 -81143 -81201 -52207 -13344 -3792 -1553 15570 59274 47202 -1758
$$ packed form
13959D056j4145N187K0630q195o349j2170j661L581P395L8164Q917M186k0819
13946B8777M701K0901l1349k0934l0017j8835K2001M8286k8562k5671N3257N0643
13934G3198m820k5960L998r537m679j310o59J7566j613k8501l7013J6682J9083
13921A6435j1744l392j09J1358K7134m9328j3262K3585R658M1804M683m4506j4769
13908b453K6876K9342j9796k2891R771J0854J5207p505m2538q302M6328j2357
13896B2536n451P836l7542o200m544L3575j0580K4176J4181j9004j7496l8555
13884c7068l327J0311J8602J1825j1542L8681p691m5532L315K5840R895l4455
13872b1146l009j0407p484l9097n8K8994L8863R552K239J7123M3704j2072m8960
$$ plain form
13859 -1758 -31810 18319 84322 87218 89954 99502 80299 77461 114583 131244 105958 119720 150813
13846 150813 194301 241378 249272 269246 351434 468711 558153 618124 695605 833344 1002456
13835 1002456 1126868 1143039 1124338 1113500 1165609 1178123 1086119 945168 835732 744397 678745
13824 678745 595795 512703 427107 328872 246988 186416 163111 116634 112703 77817 75990 118019
13812 118019 148195 114969 37777 4772 -17460 -645 51061 22676 -1237 -14494 -924
13801 -924 16411 -7018 13220 19991 9018 10786 -28338 -41993 -16895 32354 28539 11642 1565
13788 1565 9826 -4998 24253 43310 65212 72405 24175 -18651 -31009 -46490 -39589 -16235
13776 -16235 -15503 -30155 -46143 -44955 -33124 -21548 -50713 -65218 -12778 -3045 6727 5083 14970
$$ packed form
13859a758l0052N0129O6003K896K736R548j9203k838L7122J6661k5286J3762L1093
13846A50813M3488M7077P894J9974Q2188J17277Q9442N9971P7481J37739J69112
13835A002456J24412J6171j8701j0838N2109J2514r2004j40951j09436r1335o5652
13824F78745q2950q3092q5596r8235q1884o0572k3305m6477l931l4886j827M2029
13812A18019L0176l3226p7192l3005k2232J6815N1706k8385k3913j3257J3570
13801i24J7335k3429K0238O771j0973J768l9124j3655K5098M9249l815j6897j0077
13788A565Q261j4824K9251J9057K1902P193m8230m2826j2358j5481O901K3354
13776a6235P32j4652j5988J188J1831J1576k9165j4505N2440R733R772j644R887
$$ plain form
13763 14970 45456 19727 -5386 6859 3260 19645 -12820 -18475 -25168 -41087 -11931 -14821
13751 -14821 -16513 -20869 -20618 -41683 -57231 -22947 -40301 -89621 -85586 -49415 -17313 -21096 -47444
13738 -47444 -26119 -11272 17793 34380 32258 38446 4207 13712 13638 -16602 -25715 9937 41338
13725 41338 66517 42615 35488 33852 32722 25187 -9250 -28060 -26461 -39448 -10869 32020 19148
13712 19148 -19461 -32518 -17509 -2591 26503 36398 75694 51739 29638 -4469 -30657 -40230
13700 -40230 -61370 -93237 -49407 -56860 -48486 -46502 -61458 -41227 -41759 -17751 -33091 -12291 -19107
13687 -19107 -35543 -13581 20116 20342 39957 29630 33991 67721 28124 -9413 -44825 -41381
13675 -41381 -55296 -46356 -23272 47532 79313 51572 21992 47568 57227 49513 44668 52136 51270
$$ packed form
13763A4970L0486k5729k5113J2245l599J6385l2465n655o693j5919K9156k890
13751a4821j692m356K51k1065j5548L4284j7354m9320M035L6171L2102l783k6348
13738d7444K1325J4847K9065J6587k122O188l4239R505p4l0240r113L5652L1401
13725D1338K5179k3902p127j636j130p535l4437j8810J599j2987K8579M2889j2872
13712A9148l8609j3057J5009J4918K9094R895L9296k3955k2101l4107k6188r573
13700d0230k1140l1867M3830p453Q374J984j4956K0231n32K4008j5340K0800o816
13687a9107j6436K1962L3697K26J9615j0327M361L3730l9597l7537l5412L444
13675d1381j3915Q940K3084P0804L1781k7741k9580K5576R659p714m845P468q66
$$ plain form
13662 51270 33681 27980 -8564 -1808 32509 26143 -17307 -72459 -60877 -31875 -39319 -44851 9593
13649 9593 9259 -3995 -15511 -3806 8245 29246 37713 32387 -14544 -26532 -13063 -26030 -11529
13636 -11529 -13320 18205 100260 114284 97070 96481 77291 58744 76497 34329 32034 51455
13624 51455 44877 -33649 -54099 -53874 -46970 -51094 -48914 3788 58201 57731 22779 5925 -13250
13611 -13250 -11942 -879 -18832 -11251 11700 684 18724 46267 65353 72910 72539 98369 91955
13598 91955 83797 49546 -795 23819 55733 89394 118961 126493 170117 212024 183314 139401
13586 139401 140495 103574 63517 43326 10540 -31 -10455 7877 29828 42593 42094 34656
13574 34656 42302 34012 33186 19666 25014 8405 -13462 -13762 -5825 -6951 -32592 -38513 -13982 6456
$$ packed form
13662E1270j7589n701l6544O756L4317o366m3450n5152J1582K9002p444n532N4444
13649I593l34j3254j1516J1705J2051K1001Q467n326m6931j1988J3469j2967J4501
13636a1529j791L1525Q2055J4024j7214n89j9190j8547J7753m2168k295J9421
13624E1455o578p8526k0450K25O904m124K180N2702N4413m70l4952j6854j9175
13611a3250J308J1063j7953P581K2951j1016J8040K7543J9086P557l71K5830o414
13598I1955q158l4251n0341K4614L1914L3661K9567P532M3624M1907k8710m3913
13586A39401J094l6921m0057k0191l2786j0571j0424J8332K1951J2765m99p438
13574C4656P646q290q26j3520N348j6609k1867l00P937j126k5641n921K4531K0438
$$ plain form
13560 6456 6616 26929 64560 71698 36046 10086 -1993 28877 80268 95076 69395 31350
13548 31350 355 2074 103470 133363 134846 173176 177517 167747 162293 128867 115561 73428
13536 73428 91262 100210 94049 80997 54150 41338 67259 76144 44171 49787 35793 -796
13524 -796 5694 25955 16637 35361 -2247 -10137 7384 27388 9892 -28766 -11518 -5839 -26390
13511 -26390 -17024 -17468 12638 35411 -2150 -10364 13448 33890 24068 -7149 26643 48997 64413
13498 64413 57591 62645 77596 69245 82167 61438 67300 53701 21007 25343 7644 17057 60
13485 60 -63785 -87881 -83446 -26726 4680 12118 18845 40938 8285 -4626 32662 54155 29571
13472 29571 9696 -19326 -10465 -12268 6914 40054 37125 40966 64095 66787 76379 68931 44506
$$ packed form
13560F456J60K0313L7631P138l5652k5960j2079L0870N1391J4808k5681l8045
13548C1350l0995J719J01396K9893J483L8330M341r770n454l3426j3306m2133
13536G3428J7834Q948o161j3052k6847j2812K5921Q885l1973N616j3994l6589
13524g96O490K0261r318J8724l7608p890J7521K0004j7496l8658J7248N679k0551
13511b6390R366m44L0106K2773l7561q214K3812K0442r822l1217L3792K2354J5416
13498F4413o822N054J4951q351J2922k0729N862j3599l2694M336j7699R413j6997
13485F0o3845k4096M435N6720L1406P438O727K2093l2653j2911L7288K1493k4584
13472B9571j9875k9022Q861j803J9182L3140k929L841K3129K692R592p448k4425
$$ plain form
13459 44506 37219 66648 42820 -3291 -27561 -60 31017 37788 40972 38352 58620 77581
13447 77581 41749 12580 26168 9117 -42603 -11402 1818 -15895 30048 66247 55110 46320
13435 46320 39035 38423 43114 57513 59721 30064 56965 90674 77482 26954 8172 13600 47302
13422 47302 55336 17345 -28268 -51295 -46053 -8566 7780 3276 -6150 -39507 -32206 2111 9186
13409 9186 5446 -15738 -14771 -25174 -28820 -24582 12462 33797 45879 10911 2278 -10455 -34666
13396 -34666 -48506 -66287 -27223 31855 36327 16683 7915 15848 64549 42901 -20829 -2391
13384 -2391 -17444 -55600 -78563 -17357 493 2387 2989 -17928 -9784 36285 51309 28643 26282
13371 26282 29117 19839 16199 19986 -8311 2359 44055 88551 82952 50381 75327 23638 -36369
$$ packed form
13459D4506p287K9429k3828m6111k4270K7501L1077O771L184k620K0268J8961
13447G7581l5832k9169J3588j7051n1720L1201J3220j7713M5943L6199j1137q790
13435D6320p285o12M691J4399K208k9657K6901L3709j3192n0528j8782N428L3702
13422D7302Q034l7991m5613k3027N242L7487J6346m504r426l3357P301L4317P075
13409I186l740k1184R67j0403l646M238L7044K1335J2082l4968q633j2733k4211
13396c4666j3840j7781L9064N9078M472j9644q768P933M8701k1648o3730J8438
13384b391j5053l8156k2963O1206J7850J894O02k0917Q144M6069J5024k2666k361
13371B6282K835r278l640L787k8297J0670M1696M4496n599l2571K4946n1689o0007
$$ plain form
13358 -36369 -25973 -10419 -15392 4359 37157 98507 138880 108697 47582 33340 44882 48720
13346 48720 52758 81697 65111 81955 81031 45385 20482 29735 28246 52322 29498 488 -26181
13333 -26181 -71266 -37277 997 43112 54455 65661 55376 39478 -2714 -18331 -18259 -20181
13321 -20181 -6940 55192 66947 56240 57767 55163 67045 77119 53497 44408 46812 6958
13309 6958 49092 67200 63014 7755 -10622 -17855 -22710 -20583 -4450 21079 45419 64408 53614
13296 53614 36276 44415 55470 28785 67350 88552 79269 48510 19280 -5889 -20354 -35448
13284 -35448 -28362 -12388 35192 97005 105705 57555 46216 33943 19917 -24338 -29175 130
13272 130 -22121 -60709 -71965 -30816 -5976 -33668 -11197 -15572 -8057 19178 35311 27404 -8371
$$ packed form
13358c6369J0396J5554m973J9751L2798O1350M0373l0183o1115j4242J1542L838
13346D8720M038K8939j6586J6844r24l5646k4903R253j489K4076k2824k9010k6669
13333b6181m5085L3989L8274M2115J1343J1206j0285j5898m2192j5617P2j922
13321b0181J3241O2132J1755j0707J527k604J1882J0074k3622r089K404l9854
13309F958M2134J8108m186n5259j8377p233m855K127J6133K5529K4340J8989j0794
13296E3614j7338Q139J1055k6685L8565K1202r283l0759k9230k5169j4465j5094
13284c5448P086J5974M7580O1813Q700m8150j1339j2273j4026m4255m837K9305
13272A30k2251l8588j1256M1149K4840k7692K2471m375P515K7235J6133p907l5775
$$ plain form
13259 -8371 -42886 -23921 -7401 -38575 -41628 -71974 -77411 -26676 -11167 -22685 -299 25134
13247 25134 -9307 -48284 -35722 -17535 2506 22760 58888 59208 16088 57626 73609 40892
13235 40892 3478 19963 3819 -11600 18705 22766 -24679 -31124 -30769 -44694 -39498 -7060 21733
13222 21733 37953 42817 37126 27940 42338 33221 70144 61511 28178 29027 27286 54248 60653
13209 60653 29341 -4084 -15500 -41514 -63542 -43457 -19278 -9242 14421 23254 -11103 -25741
13197 -25741 -22607 -4826 9813 -11538 17966 39090 57541 55632 27128 3044 31684 43483
13185 43483 64004 93862 83148 72503 55735 50567 105198 86770 59180 32329 18038 50519
13173 50519 66802 83974 38499 -41488 -79293 -43574 -4288 -12265 -3826 20607 47256 66122
$$ packed form
13259h371l4515J8965J6520l1174l053l0346n437N0735J5509j1518K2386K5433
13247B5134l4441l8977J2562J8187K0041K0254L6128L20m3120M1538J5983l2717
13235D0892l7414J6485j6144j5419L0305M061m7445o445L55j3925N196L2438K8793
13222B1733J6220M864n691r186J4398r117L6923q633l3333Q49j741K6962O405
13209F0653l1312l3425j1416k6014k2028K0085K4179J0036K3663Q833l4357j4638
13197b5741L134J7781J4639k1351K9504K1124J8451j909k8504k4084K8640J1799
13185D3483K0521K9858j0714j0645j6768n168N4631j8428k7590k6851j4291L2481
13173E0519J6283J7172m5475p9987l7805L5719L9286p977Q439K4433K6649J8866
$$ plain form
13161 66122 97077 52732 41863 51172 41585 6975 -57648 -109774 -115544 -105114 -80547 -35488
13149 -35488 -10754 -799 -22671 -61618 -84215 -76883 -36233 -17621 -7979 1429 21990 18793 -10232
13136 -10232 10329 -10319 -22916 31 15138 24126 32760 52424 52706 37112 47867 64970
13124 64970 41454 49691 84181 121167 113879 91765 73195 52234 15502 17152 35740 49467
13112 49467 53834 4874 -20966 -28187 -73036 -64959 15473 41378 45231 -2524 -28739 -33025 -29065
13099 -29065 -24466 -2861 12324 31676 -823 8144 -15079 -46903 -38145 -4742 36092 46515
13087 46515 10167 -27873 -33829 -48710 -31241 -16409 9723 -10850 -38440 -69654 -40247 -51944
13075 -51944 -88347 -81038 -58290 -40983 -17035 -7385 -18885 342 -12548 -24439 -6237 26514
$$ packed form
13161F6122L0955m4345j0869R309r587l4610o4623n2126n770J0430K4567M5059
13149c5488K4734R955k1872l8947k2597P332M0650J8612R642R408K0561l197k9025
13136a0232K0561k0648j2597K2947J5107Q988Q634J9664K82j5594J0755J7103
13124F4970k3516Q237L4490L6986p288k2114j8570k0961l6732J650J8588J3727
13112D9467M367m8960k5840p221m4849Q077Q0432K5905L853m7755k6215m286L960
13099b9065M599K1605J5185J9352l2499Q967k3223l1824Q758L3403M0834J0423
13087D6515l6348l8040n956j4881J7469J4832K6132k0573k7590l1214K9407j1697
13075e1944l6403P309K2748J7307K3948R650j1500J9227j2890j1891J8202L2751
$$ plain form
13063 26514 -3343 -37592 -50831 -61358 -32340 -27057 -29881 -49605 -54805 -37677 -18112 -23210
13051 -23210 -45096 -47497 -64430 -43041 -54496 -58648 -16424 -6110 8511 97 13532 24465
13039 24465 -27619 -32903 -35243 -6670 -18742 -9605 -27802 -49075 -68860 -64609 -32225 -13452
13027 -13452 -17337 12551 51739 46298 50393 41739 40509 58087 29264 15278 -5999 -42018 -43717
13014 -43717 -46683 -48331 -84486 -87426 -45985 -35988 -34306 -57880 -107215 -102872 -42734 -23096 -15754
13001 -15754 -29610 -29144 15765 -16327 2621 19877 -7703 -28913 17270 25805 -29790 17712
12989 17712 42251 60753 62306 48398 34149 45049 49337 20729 -94 5189 -22227 -15809
12977 -15809 14299 -4549 -40015 -96207 -66809 -24284 20163 37491 28111 1072 15270 32590
$$ packed form
13063B6514k9857l4249j3239j0527K9018N283k824j9724n200J7128J9565n098
13051b3210k1886k401j6933K1389j1455m152M2224J0314J4621q414J3435J0933
13039B4465n2084n284k340K8573j2072R137j8197k1273j9785M251L2384J8773
13027a3452l885K9888L9188n441M095q654j230J7578k8823j3986k1277l6019j699
13014d3717k966j648l6155k940M1441R997J682k3574m9335M343O0138J9638P342
13001a5754j3856M66M4909l2092J8948J7256k7580k1210M6183Q535n5595M7502
12989A7712K4539J8502J553j3908j4249J0900M288k8608k0823N283k7416O418
12977a5809L0108j8848l5466n6192K9398M2525M4447J7328r380k7039J4198J7320
$$ plain form
12965 32590 21146 11722 32992 -4296 -53014 -107350 -89702 -50042 -45155 -72713 -86604 -51017
12953 -51017 -37863 -48710 1369 28162 46254 37010 16629 -13620 8378 -40979 -72670 -67704
12941 -67704 -41799 -14127 -15765 -23166 -47967 -54180 -38586 -18550 -21082 -12054 -18381 -7665 13466
12928 13466 4010 1004 17688 -12120 -3782 10901 -12967 3277 23074 15289 -14100 -70291
12916 -70291 -86299 -62887 -41172 -48075 -28053 -42431 -39466 -25674 -17877 -15462 19632 30900
12904 30900 22102 26485 47886 30112 15860 14298 -30804 -39840 -39959 -31414 -23903 -14682 -11141 38485
12890 38485 17793 19243 36112 36303 14462 -2680 -9282 -925 1331 14075 1954 8870 -10582
12877 -10582 -37475 -45393 -40513 -42873 -35070 -62298 -70893 -75344 -81346 -31185 9278 19574 2429
$$ packed form
12965C2590j1444r424K1270l7288m8718n4336J7648L9660M887k7558j3891L5587
12953e1017J3154j0847N0079K6793J8092r244k0381l0249K1998m9357l1691M966
12941f7704K5905K7672j638p401k4801o213J5594K0036k532R028o327J0716K1131
12928A3466r456l006J6684k9808Q338J4683k3868J6244J9797p785k9389n6191
12916g0291j6008K3412K1715o903K0022j4378K965J3792P797K415L5094J1268
12904C0900q798M383K1401j7774j4252j562m5102r036j19Q545P511R221L541M9626
12890C8485k0692J450J6869J91k1841j7142o602Q357K256J2744j2121O916j9452
12877a0582k6893p918M880k360P803k7228q595m451o002N0161M0463J0296j7145
$$ plain form
12864 2429 -11861 -25913 -42426 -41263 -23317 1229 -27990 -87335 -113281 -125944 -133547 -119945
12852 -119945 -104883 -60084 -11098 -45663 -89592 -46261 5952 38275 36500 -3088 -20096 -53918
12840 -53918 -78237 -69308 -49044 -29873 1770 37708 38413 25153 24772 33806 1543 -47690 -40065
12827 -40065 1428 22646 69315 28873 -50343 -43217 -52801 6047 -185 9718 -1930 -22850
12815 -22850 -52565 -57145 -43636 -9106 2675 -3194 -12843 9666 54741 35350 29687 -3752
12803 -3752 39660 46583 48812 51116 47362 40103 24022 49233 73852 83489 49354 9075 1355
12790 1355 3176 53252 157386 241339 309579 296330 236529 193253 150411 55703 42674 67626
12778 67626 46113 1497 -53576 -54985 -24081 8509 33934 62007 30973 24564 9441 -24602
$$ packed form
12864B429j4290j4052j6513J163J7946K4546k9219n9345k5946j2663p603J3602
12852a19945J5062M4799M8986l4565m3929M3331N2213L2323j775l9588j7008l3822
12840e3918k4319Q929K0264J9171L1643L5938P05j3260l81R034l2263m9233P625
12827d0065M1493K1218M6669m0442p9216P126r584N8848o232R903j1648k0920
12815b2850k9715m580J3509L4530J1781n869r649K2509M5075j9391n663l3439
12803c752M3412O923K229K304l754p259j6081K5211K4619R637l4135m0279p720
12790A355J821N0076J04134Q3953O8240j3249n9801m3276m2842r4708j3029K4952
12778F7626k1513m4616n5073j409L0904L2590K5425K8073l1034o409j5123l4043
$$ plain form
12766 -24602 -42672 -48762 -50053 -64244 -32185 -26919 8043 15148 30910 49658 18667 -12023
12754 -12023 -50883 -27376 6245 2503 1065 23065 28468 29316 11713 10575 34926 24613 650
12741 650 -21040 -15948 -32574 -48164 -62069 -52506 -33259 -37974 -53103 -18760 1024 13731 45659
12728 45659 29152 605 1811 41875 42563 23677 16328 9625 34179 53484 40523 -2439 -29214
12715 -29214 -19342 -25243 -22377 -16996 18681 -13881 -10441 22471 1631 -4264 -37102 -33236 1868
12702 1868 -24654 -39853 19814 25827 27185 -10097 4050 28086 41264 50066 42438 17154 -14781
12689 -14781 -13024 31262 5130 -29258 -14080 22277 27056 -14322 -15912 15840 28352 16457
12677 16457 -23158 -22111 -1969 31848 59019 20740 -15688 -18023 -8550 2198 -5584 -15597
$$ packed form
12766b4602j8070o090j291j4191L2059N266L4962P105J5762J8748l0991l0690
12754a2023l8860K3507L3621l742j438K2000N403Q48j7603j138K4351j0313k3963
12741F50k1690N092j6626j5590j3905R563J9247m715j5129L4343J9784J2707L1928
12728D5659j6507k8547J206M0064O88j8886p349o703K4554J9305j2961m2962k6775
12715b9214R872n901K866N381L5677l2562L440L2912k0840n895l2838L866L5104
12702A868k6522j5199N9667O013J358l7282J4147K4036J3178Q802p628k5284l1935
12689a4781J757M4286k6132l4388J5178L6357M779m1378j590L1752J2512j1895
12677A6457l9615J047K0142L3817K7171l8279l6428k335R473J0748p782j0013
$$ plain form
12665 -15597 -41046 -72033 -72040 -70892 -40017 -23137 -16678 -17454 -32477 -42341 -31848 -41243 -7304 234
12651 234 4131 3253 -1509 -18468 -9362 17817 10477 35903 54719 78466 68230 61662 58549 44914
12637 44914 41732 47007 10658 2015 30538 29499 36966 40568 46648 90081 104941 103331 64656
12624 64656 53665 55394 52342 32820 2869 -25251 -32008 -11118 1057 3243 24380 20501 -20155
12611 -20155 -35224 -22396 -6395 -13552 -3871 24848 16570 -28148 -45269 -18964 1786 14625
12599 14625 13172 -12388 -10028 19646 49192 63058 77536 12629 -39402 -40890 -24876 -2803
12587 -2803 -11171 -35981 -36547 19257 14034 -9952 -58134 -88199 -43333 -25464 -53022 -53927 -77392
12574 -77392 -36344 -37601 -68769 -90865 -77422 -90347 -65498 -15244 22324 44686 67910 65739
$$ packed form
12665a5597k5449l0987pJ148L0875J6880O459p76j5023r864J0493r395L3939P538
12651B34L897q78m762j6959R106K7179p340K5426J8816K3747j0236o568l113j3635
12637D4914l182N275l6349q643K8523j039P467L602O080M3433J4860j610l8675
12624F4656j0991J729l052j9522k9951k8120o757K0890J2175K186K1137l879m0656
12611b0155j5069J2828J6001p157R681K8719q278m4718j7121K6305K0750J2839
12599A4625j453k5560K360K9674K9546J3866J4478o4907n2031j488J6014K2073
12587b803q368k4810n66N5804n223k3986m8182l0065M4866J7869k7558r05k3465
12574g7392M1048j257l1168k2096J3443j2925K4849N0254L7568K2362K3224k171
$$ plain form
12562 65739 15691 -26315 -33298 -16741 -12069 -17400 2111 19101 22197 2075 -3865 20595 48454
12549 48454 53081 46173 56533 62277 37651 13888 1662 2701 21670 36225 -12420 -9601 -40242
12536 -40242 -78608 -48666 -20504 -7208 7316 -8756 -10890 -6698 9324 2599 -11989 -11014 -29239
12523 -29239 -15295 -16860 -11727 -20009 -3106 34816 24998 15195 -13414 -43679 -80894 -69856 -54791
12510 -54791 -71972 -43210 -9360 515 4058 -11321 9107 29906 12271 -22864 -55738 -68735
12498 -68735 -15237 37955 6773 -20711 -10509 -21472 -26714 -6385 -14792 -58801 -42073 -55259
12486 -55259 -51387 -34998 -40953 -25487 -5478 -18027 -40518 -55885 -34701 5873 -32386 -35480
12474 -35480 -14053 -12311 -30513 -43815 -40480 -68965 -60902 963 46849 66217 28872 -36952
$$ packed form
12562F5739n0048m2006o983J6557M672n331J9511J6990L096k0122n940K4460K7859
12549D8454M627o908J0360N744k4626k3763j2226J039J8969J4555m8645K819l0641
12536d0242l8366K9942K8162J3296J4524j6072k134M192J6022o725j4588R75j8225
12523b9239J3944j565N133q282J6903L7922r818r803k8609l0265l7215J1038J5065
12510e4791j7181K8762L3850R875L543j5379K0428K0799j7635l5135l2874j2997
12498f8735N3498N3192l1182k7484J0202j0963n242K0329q407m4009J6728j3186
12486e5259L872J6389n955J5466K0009j2549k2491j5367K1184M0574l8259l094
12474c5480K1427J742j8202j3302L335k8485Q063O1865M5886J9368l7345o5824
$$ plain form
12462 -36952 -52899 -70929 -22349 19082 39964 52087 25066 -29935 -44704 -20271 6725 21489
12450 21489 22811 3983 -44053 -31992 -9001 -19275 -4155 -13495 -30709 -16565 -31994 -31692
12438 -31692 6816 20543 48623 45177 64561 46869 21170 9183 -6972 -36819 -63670 -43114
12426 -43114 -18282 17685 -32255 -49663 -46173 -12934 1634 -21802 -40088 -11957 11787 14283
12414 14283 -14338 2255 31552 48952 25613 12295 -29111 -68624 -30491 -12991 -37536 -37029
12402 -37029 -49598 -53989 -13662 8858 30857 16121 35855 49007 68910 32730 39538 75783
12390 75783 109674 102152 68671 39639 50852 42320 32772 22154 17667 -36632 -63784 -73401 -47355
12377 -47355 -33805 22325 5007 5876 11400 -20801 -26559 -37054 -25792 -43668 -37521 -12409 -18797
$$ packed form
12462c6952j5947j8030M8580M1431K0882J2123k7021n5001j4769K4433K6996J4764
12450B1489J322j8828m8036J2061K2991j0274J5120r340j7214J4144j5429L02
12438c1692L8508J3727K8080l446J9384j7692k5699j1987j6155k9847k6851K0556
12426d3114K4832L5967m9940j7408L490L3239J4568k3436j8286K8131K3744K496
12414A4283k8621J6593K9297J7400k3339j3318m1406l9513L8133J7500k4545N07
12402c7029j2569m391M0327K2520K1999j4736J9734J3152J9903l6180O808L6245
12390G5783L3891p522l3481k9032J1213q532r548j0618m487n4299k7152r617K6046
12377d7355J3550N6130j7318Q69N524l2201n758j0495J1262j7876O147K5112o388
$$ plain form
12364 -18797 5553 14419 28703 23166 -7067 -16033 -20775 -22614 -36588 -60515 -39062 -34056 15059
12351 15059 40710 -1282 -23022 -1690 -9270 -9316 -21355 -9672 614 -21088 -34264 -12302
12339 -12302 14253 71972 33259 39796 33318 -17529 11703 -4707 -28014 -6789 14049 21661
12327 21661 44349 38323 28422 21660 -4897 -37362 -41987 -69502 -64619 -39697 15093 21390 18069
12314 18069 11612 -9650 -50282 -48641 -5518 -12449 -28894 -41166 -77535 -46640 18552 -17047
12302 -17047 -25834 35094 -982 -32828 -22881 -16392 -29763 7273 -9067 -32002 -17528 -22296
12290 -22296 -13164 5443 16567 30634 30537 -29694 -40540 -51619 -57381 -41796 -14824 -7375 -18256
12277 -18256 -4168 -10507 1757 25721 17655 5143 -53179 -118208 -106184 -38153 18501 58828
$$ packed form
12364a8797K4350Q866J4284n537l0233q966m742j839j3974k3927K1453N006M9115
12351A5059K5651m1992k1740K1332p580m6j2039J1683J0286k1702j3176K1962
12339a2302K6555N7719l8713O537o478n0847K9232j6410k3307K1225K0838P612
12327B1661K2688o026r901o762k6557l2465m625k7515M883K4922N4790O297l321
12314A8069o457k1262m0632J641M3123o931j6445j2272l6369L0895O5192l5599
12302a7047q787O0928l6076l1846R947O489j3371L7036j6340k2935J4474m768
12290b2296R132J8607J1124J4067r7o0231j0846j1079n762J5585K6972P449j0881
12277a8256J4088o339J2264K3964q066j2512n8322o5029J2024O8031N6654M0327
$$ plain form
12265 58828 49672 47849 50932 72473 51815 -3347 -16931 6050 -4239 -10118 -39496 -26266
12253 -26266 -39664 -47370 -58020 -50655 -59419 -21374 11057 59030 22840 -26384 -51170 -45189
12241 -45189 -32580 -18848 -49005 -19750 165 -21963 -25917 -15402 -46163 -33807 -23854 13916
12229 13916 12966 3844 -10638 8535 9019 12116 24742 64910 82122 33469 16761 -6916 -52429
12216 -52429 -48859 -42057 -2449 33879 17427 20376 22612 -7680 23520 24481 -18347 66 32637
12203 32637 38117 19658 -49515 -41978 -45264 -34904 18417 32428 -13280 -30935 -21642 -71814
12191 -71814 -62566 -35999 -34524 -72491 -104239 -127060 -132203 -115013 -61788 3025 31687 22157
12179 22157 14775 42700 44253 37415 -13738 -90579 -86897 -41487 -63802 -91347 -107763 -111541 -51978
$$ packed form
12265E8828r156j823L083K1541k0658n5162j3584K2981j0289n879k9378J3230
12253b6266j3398p706j0650P365q764L8045L2431M7973l6190m9224k4786N981
12241d5189J2609J3732l0157K9255J9915k2128l954J0515l0761J2356R953L7770
12229A3916r50r122j4482J9173M84L097J2626M0168J7212m8653j6708k3677m5513
12216e2429L570O802L9608L6328j6452K949K236l0292L1200R61m2828J8413L2571
12203C2637N480j8459o9173P537l286J0360N3321J4011m5708j7655R293n0172
12191g1814R248K6567J475l7967l1748k2821n143J7190N3225O4813K8662r530
12179B2157p382K7925J553o838n1153p6841L682M5410k2315k7545j6416l778N9563
$$ plain form
12166 -51978 15423 59774 17330 -30812 -18654 2674 -6083 -12365 -19118 -4858 32685 2974
12154 2974 -22425 -2524 30008 28558 21404 42870 71824 86434 58395 19282 37932 58927
12142 58927 42586 59668 46309 22569 -23688 -44600 -56358 -74534 -83229 -63319 -46731 -54367
12130 -54367 -38985 -51911 -60236 -32980 -4980 9529 -13472 -7321 5224 -26874 -49835 -79886
12118 -79886 -89913 -74069 -41467 -27682 -60322 -87940 -78953 -15715 -27357 -51439 -68362 -88524
12106 -88524 -58146 15738 44767 -982 -6431 916 36597 46738 21335 -24716 -57196 -51040
12094 -51040 -23392 12699 48321 42879 -34680 -70111 -69400 -52110 -27614 -7526 -1074 3142 -18056
12081 -18056 -44782 -29566 -6224 -6380 -12598 -27655 -6749 17171 34549 43292 52183 27787 11352
$$ packed form
12166e1978O7401M4351m2444m8142J2158K1328q757o282o753J4260L7543k9711
12154B974k5399J9901L2532j450p154K1466K8954J4610k8039l9113J8650K0995
12142E8927j6341J7082j3359k3740m6257k0912j1758j8176q695J9910J6588p636
12130e4367J5382j2926q325K7256K8000J4509k3001O151J2545l2098k2961l0051
12118g9886j0027J5844L2602J3785l2640k7618Q987O3238j1642k4082j6923k0162
12106h8524L0378P3884K9029m5749n449P347L5681J0141k5403m6051l2480O156
12094e1040K7648L6091L5622n442p7559l5431P11J7290K4496K0088O452M216k1198
12081a8056k6726J5216K3342j56o218j5057K0906K3920J7378Q743Q891k4396j6435
$$ plain form
12068 11352 11428 11999 -31244 2322 -3725 26096 30583 4613 -7300 -32045 -32583 -43136 -50049 -46219
12054 -46219 -80795 -51296 -16763 -7187 -2087 -529 -29009 -52442 -22148 -17607 -23888 -23020 -133
12041 -133 -3627 10090 638 -6130 -14690 25847 61120 42463 36161 16152 -7444 -31563 -43034
12028 -43034 -29942 -60111 -44286 2517 42739 8801 -34640 -28878 17312 17531 23840 -16597
12016 -16597 -75721 -51961 -9408 15387 32120 49599 24517 -26497 -64255 -75187 -52398 -3713
12004 -3713 4910 -1589 18610 8325 14606 13952 -6730 -31605 -50239 -58538 -53966 -21958 -26570
11991 -26570 -28631 -17865 -5816 -14760 13521 61420 30274 -27469 -24982 -48677 -81108 -117063
11979 -117063 -106752 -73380 -31772 -6249 -27802 11611 -24661 -75308 -23046 13935 7764 9887
$$ packed form
12068A1352P6N71m3243L3566o047K9821M487k5970j1913k4745n38j0553o913L830
12054d6219l4576K9499L4533R576N100J558k8480k3433L0294M541o281Q68K2887
12041a33l494J3717r452o768q560M0537L5273j8657o302k0009k3596k4119j1471
12028d3034J3092l0169J5825M6803M0222l3938m3441N762M6190K19O309m0437
12016a6597n9124K3760M2553K4795J6733J7479k5082n1014l7758j0932K2789M8685
12004c713Q623o499K0199j0285O281o54k0682k4875j8634q299M572L2008m612
11991b6570k061J0766J2049q944K8281M7899l1146n7743K487k3695l2431l5955
11979a17063J0311L3372M1608K5523k1553L9413l6272n0647N2262L6981o171K123
$$ plain form
11967 9887 17526 552 -50139 -44123 -14643 7513 5758 -21184 -15528 -11766 -12831 -38044 -33362
11954 -33362 -12255 23911 46329 24238 25073 29568 9976 8762 -3110 -42803 -59796 -82345
11942 -82345 -70793 -32123 -21145 25289 25233 23971 32625 6180 -42169 -76699 -93735 -60962 -25595
11929 -25595 -4860 16768 20921 576 -14500 -36174 -23148 -57352 -53625 -58643 -62451 -54173 -59167
11916 -59167 -40084 -33284 -28250 -14202 -7900 -45901 -3326 58765 75381 56044 -4487 -25476
11904 -25476 -8385 -1159 9265 58919 75812 15005 -6196 -54 1991 4694 18077 3489
11892 3489 -25770 -3986 38501 70390 27105 100 26944 17204 -733 -14145 -38985 -15170
11880 -15170 5794 32042 36756 -7521 -15921 34467 46232 -20804 10430 45581 2272 7902
$$ packed form
11967I887P639j6974n0691O016K9480K2156j755k6942N656L762j065k5213M682
11954c3362K1107L6166K2418k2091Q35M495j9592j214j1872l9693j6993k2549
11942h2345J1552L8670J0978M6434n6j262Q654k6445m8349l4530j7036L2773L5367
11929b5595K0735K1628M153k0345j5076k1674J3026l4204L727n018l808Q278m994
11916e9167J9083O800N034J4048O302l8001M2575O2091J6616j9337o0531k0989
11904b5476J7091P226J0424M9654J6893o0807k1201O142K045K703J3383j4588
11892C489k9259K1784M2487L1889m3285k7005K6844r740j7937j3412k4840K3815
11880a5170K0964K6248M714m4277q400N0388J1765o7036L1234L5151m3309N630
$$ plain form
11868 7902 18866 15752 27427 22274 62587 74578 44211 34885 3156 41107 51688 19537
11856 19537 27045 3736 -24398 -11785 35428 8571 -9937 -32163 -31090 -46589 -23955 -10461
11844 -10461 -25106 -29827 -11795 15535 60728 66517 12653 -7541 -9047 36506 47529 21505
11832 21505 10517 5382 2806 -3974 -3334 6339 33053 23663 6413 -15937 -8536 -8259 35431 39139
11818 39139 -3142 -30365 -18223 -29136 -41390 -51341 -37214 -11996 -7134 -57507 -26462 1758
11806 1758 -28970 -6896 -4455 -22041 -53858 -68595 -117124 -132578 -86962 -58490 -73403 -64977
11794 -64977 -72662 -85761 -79432 -71642 -51099 -34019 -54161 -43394 -56484 12913 62533 59441
11782 59441 29537 -12304 -21827 -17925 22713 15078 -2280 -1320 -6717 -27588 -12793 -50710 -58279
$$ packed form
11868G902J0964l114J1675n153M0313J1991l0367r326l1729L7951J0581l2151
11856A9537P508k3309k8134J2613M7213k6857j8508k2226J073j5499K2634J3494
11844a0461j4645m721J8032K7330M5193N789n3864k0194j506M5553J1023k6024
11832B1505j0988n135k576o780O40R673K6714r390j7250k2350P401K77M3690L708
11818C9139m2281k7223J2142j0913j2254r951J4127K5218M862n0373L1045K8220
11806A758l0728K2074K441j7586l1817j4737m8529j5454M5616K8472j4913Q426
11794f4977p685j3099O329P790K0543J7080k0142J0767j3090O9397M9620l092
11782E9441k9904m1841r523L902M0638p635j7358R60n397k0871J4795l7917p569
$$ plain form
11769 -58279 -27067 -12560 32061 -32026 -74310 -59170 -33734 -25967 -48006 -35187 16169 54036
11757 54036 28921 -24827 -9534 16367 362 -17412 -27475 -53716 -65147 -32566 -14162 30897
11745 30897 30922 -9102 2835 26838 -26423 -37549 -11590 -27265 18915 37176 21447 16345
11733 16345 28944 11240 -3149 -25631 -40541 -19333 21860 29652 4386 -13830 -23375 -29639
11721 -29639 -21099 -2791 28449 34702 43604 40981 8795 -9019 855 7368 -42601 -94969 -69718
11708 -69718 -38828 -43315 -48558 -55576 -36970 -9823 -16918 -36500 -60682 -75336 -29640 -9957
11696 -9957 17727 11737 16716 18950 10066 -13957 -21704 27258 71957 2496 -21066 11353 11899
11683 11899 -25217 20597 24965 47522 78521 82490 -9827 -59158 -56745 14333 50493 35956
$$ packed form
11769e8279L1212J4507M4621o4087m2284J5140K5436P767k2039J2819N1356L7867
11757E4036k5115n3748J5293K5901j6005j7774j0063k6241j1431L2581J8404M5059
11745C0897K5m0024J1937K4003n3261j1126K5959j5675M6180J8261j5729n102
11733A6345J2599j7704j4389k2482j4910K1208M1193P792k5266j8216r545o264
11721b9639Q540J8308L1240O253Q902k623l2186j7814R874O513m9969n2368K5251
11708f9718L0890m487n243p018J8606K7147p095j9582k4182j4654M5696J9683
11696i957K7684n990M979K234q884k4023p747M8962M4699o9461k3562L2419N46
11683A1899l7116M5814M368K2557L0999L969r2317m9331K413P1078L6160j4537
$$ plain form
11671 35956 2161 28297 14328 -15171 -58011 -63396 -46337 -30284 -15076 7812 71929 112181
11659 112181 68980 38445 23976 4068 -20425 52 14295 -4356 -23703 1515 -19044
11648 -19044 -22601 -8076 27536 22198 40848 78356 52763 10969 31728 47668 39924 32547
11636 32547 20092 18706 2109 -328 6796 40826 59377 49181 26043 244 -11938 -16892
11624 -16892 -17099 8877 6744 6291 49791 27805 20397 -4350 -37810 -7019 -4638 -13459 -23126
11611 -23126 4229 -6616 14001 -9890 -59477 -64639 -61794 -31437 950 -3841 -15408 -59906
11599 -59906 -56198 -42393 -52560 -62360 -51602 -36443 -50536 -58687 -44893 -2022 -19243 -93014
11587 -93014 -141108 -88020 -81524 -83056 -54075 -68313 -76261 -77832 -77534 -61301 -63006 -49177 -53987
$$ packed form
11671C5956l3795K6136j3969k9499m2840n385J7059J6053J5208K2888O4117M0252
11659A12181m3201l0535j4469j9908k4493K0477J4243j8651j9347K5218k0559
11648a9044l557J4525L5612n338J8650L7508k5593m1794K0759J5940p744p377
11636C2547j2455j386j6597k437P124L4030J8551j0196k3138k5799j2182m954
11624a6892k07K5976k133m53M3500k1986p408k4747l3460L0791K381q821r667
11611b3126K7355j0845K0617k3891m9587n162K845L0357L2387m791j1567m4498
11599e9906L708J3805j0167r800J0758J5159j4093q151J3794M2871j7221p3771
11587i3014m8094N3088O496j532K8981j4238p948j571K98J6233j705J3829m810
$$ plain form
11574 -53987 -60875 -30244 -42713 -59430 -88811 -103891 -67880 -43043 -49742 -51852 -27743 16992
11562 16992 13011 -6767 -28467 -46086 -65862 -59517 -42146 -19480 22588 14648 -20057 -1741
11550 -1741 15697 33869 9784 10348 -14082 -37740 -71404 -45651 -43133 -36401 -12221 13472 -19946
11537 -19946 -63961 -31651 -395 23045 11387 27273 21821 -4988 -29448 -25153 -45961 -57776
11525 -57776 -48855 -12858 -24209 -17450 -24993 -44376 -734 -5808 -6532 -17797 -24897 -32667 740
11512 740 31121 17469 -14745 -5257 -21269 -4206 15810 28972 43302 2632 4014 -5590 -43994
11499 -43994 -69154 -58655 -23508 -18194 -41827 -59870 -56869 -81375 -142480 -129823 -79824 -63018
11487 -63018 -37682 -40528 -22645 3199 -6144 -14210 -20023 -13103 -40362 -56621 -36679 -42424 -45894
$$ packed form
11574e3987o888L0631j2469j6717k9381j5080L6011K4837o699k110K4109M4735
11562A6992l981j9778k1700j7619j9776O345J7371K2666M2068p940l4705J8316
11550a741J7438J8172k4085N64k4430k3658l3664K5753K518O732K4180K5693l3418
11537a9946m4015L2310L1256K3440j1658J5886n452k6809k4460M295k0808j1815
11525e7776Q921L5997j1351O759p543j9383M3642n074p24j1265p100p770L3407
11512G40L0381j3652l2214R488j6012J7063K0016J3162J4330m0670J382r604l8404
11499d3994k5160J0499L5147N314k3633j8043L001k4506o1105J2657M9999J6806
11487f3018K5336k846J7883K5844r343q066n813O920k7259j6259J9942n745l470
$$ plain form
11474 -45894 -15625 19841 -27857 -24795 -15314 -27380 -26407 -18043 -53001 -74739 -54433 -15287 -17119
11461 -17119 -44044 -23992 -21280 -34521 -26172 -54446 -44981 -43109 -23403 10648 14230 17044 -34981
11448 -34981 -46380 21160 33942 12214 -6103 -11465 -29233 -57961 -81817 -74739 -117923 -121021
11436 -121021 -84861 -64511 -12438 -2759 -28298 -51289 -59064 -45344 -29036 -30133 -21717 -2330
11424 -2330 -5193 -14187 -65818 -60650 -26992 -16885 -10710 -26669 -57275 -57308 -46997 -25133 -45218
11411 -45218 -50253 -65953 -46468 -24594 -59424 -47830 -49673 -75060 -49751 -33356 -8824 15214
11399 15214 46610 19507 -18900 22597 21150 47309 45609 5160 -15771 -45785 -85130 -47077
11387 -47077 11583 10503 -35763 -63633 -50261 10477 47974 31894 -16635 -27124 11691 78542
$$ packed form
11474d5894L0269L5466m7698L062R481j2066R73Q364l4958k1738K0306L9146j832
11461a7119k6925K0052K712j3241Q349k8274R465J872J9706L4051L582K814n2025
11448c4981j1399O7540J2782k1728j8317n362j7768k8728k3856P078m3184l098
11436a21021L6160K0350N2073R679k5539k2991p775J3720J6308j097Q416J9387
11424b330k863q994n1631N168L3658J0107O175j5959l0606l3J0311K1864k0085
11411d5218n035j5700J9485K1874l4830J1594j843k5387K5309J6395K4532K4038
11399A5214L1396k7103l8407M1497j447K6159j700m0449k0931l0014l9345L8053
11387d7077N8660j080m6266k7870J3372O0738L7497j6080m8529j0489L8815O6851
$$ plain form
11375 78542 81421 50276 41776 22133 35392 8801 9780 -9294 -555 -377 -5146 10094 16077
11362 16077 10726 -24061 -23911 20193 32193 11346 -26967 -18851 -19474 12427 13448 -10907 17908
11349 17908 40152 66229 105555 110332 70663 30249 36752 28144 15598 16322 7252 4622 23296
11336 23296 85856 73110 25304 5490 -4293 -14010 -29308 -40597 -41155 -41257 -49225 -20699 -49467
11323 -49467 -80221 -51303 -32849 -50550 -64690 -37046 -14221 -27496 -38913 5649 18862 -10050
11311 -10050 3660 22890 28516 22305 70181 45036 35086 42368 6428 -26228 -33976 -46869 -37971
11298 -37971 -43464 -40109 -49151 -43495 -16839 41624 61327 57034 82950 54412 11556 3145 1681
11285 1681 -43183 -48588 -24535 -39556 -2181 -1242 16141 -9972 -48730 -55289 -18610 -9172 -11945
$$ packed form
11375G8542K879l1145q500j9643J3259k6591R79j9074Q739J78m769J5240N983
11362A6077n351l4787J50M4104J2000k0847l8313Q116o23L1901J021k4355K8815
11349A7908K2244K6077L9326M777l9669m0414O503q608j2546P24r070k630J8674
11336B3296O2560j2746m7806j9814r783r717j5298j1289n58j02p968K8526k8768
11323d9467l0754K8918J8454j7701j4140K7644K2825j3275j1417M4562J3213k8912
11311a0050J3710J9230N626o211M7876k5145r950P282l5940l2656p748j2893Q898
11298c7971n493L355r042N656K6656N8463J9703m293K5916k8538m2856q411j464
11285A681m4864n405K4053j5021L7375R39J7383k6113l8758o559L6679R438k773
$$ plain form
11272 -11945 -14231 -11723 -19487 -51484 -82797 -54118 -51732 -69393 -60467 -39125 15836 53544 37039
11259 37039 20409 32436 8440 -20303 12303 31182 10408 5213 -15824 -15056 -396 -12671
11247 -12671 -8717 10400 26550 -537 -13940 -11883 -17271 -12321 33073 23705 3982 50685 49373
11234 49373 70897 72494 58064 58889 24097 -18016 -28094 -12677 8100 5710 16258 32486
11222 32486 52088 13793 -15552 13469 36489 -6585 -17868 -16043 -35458 -23402 -54108 -32168
11210 -32168 -24957 -48058 -48734 -21428 7809 23928 30435 26548 -28936 -46698 -37013 -16421 -21491
11197 -21491 -18337 5618 14556 31761 25784 -5615 -9437 11672 53791 7444 -42934 -59463
11185 -59463 -11220 11190 26098 23262 37204 40552 47611 59819 91787 67390 33608 8446
$$ packed form
11272a1945k286K508p764l1997l1313K8679K386j7661Q926K1342N4961L7708j6505
11259C7039j6630J2027k3996k8743L2606J8879k0774n195k1037P68J4660j2275
11247a2671L954J9117J6150k7087j3403K057n388M950M5394r368j9723M6703j312
11234D9373K1524J597j4430Q25l4792m2113j0078J5417K0777k390J0548J6228
11222C2486J9602l8295k9345K9021K3020m3074j1283J825j9415J2056l0706K1940
11210c2168P211k3101o76K7306K9237J6119O507l887n5484j7762R685K0592n070
11197b1491L154K3955Q938J7205n977l1399l822K1109M2119m6347n0378j6529
11185e9463M8243K2410J4908k836J3942L348P059J2208L1968k4397l3782k5162
$$ plain form
11173 8446 40145 11364 -14301 22640 53214 32981 -27742 -39731 -17167 -51025 -3098 12722
11161 12722 19650 48706 8531 -25917 -15381 4277 25226 -7477 -46874 -45993 -32704 -11380
11149 -11380 -19080 -78511 -62705 -32457 -53940 -47559 -39780 -51517 -67582 -61940 -54143 -30442 -36790
11136 -36790 -26573 -63700 -84193 -97601 -40617 -3598 13460 -1168 56712 127625 122491 25449
11124 25449 31103 3757 -6838 -23871 -8184 36263 41331 22983 -17217 -25606 2018 10804
11112 10804 -26315 -29200 -45336 -55387 -44310 -33382 -7725 -2878 -7321 21964 21992 17254 27657
11099 27657 6531 -34070 -63574 -69307 -47646 -21348 -21174 -25609 -22749 -41068 -39508 -41831 -12138
11086 -12138 64334 21178 -20067 12740 18636 -29528 -49820 -6384 -1851 -18259 -32001 -10935
$$ packed form
11173H446L1699k8781k5665L6941L0574k0233o0723j1989K2564l3858M7927J5820
11161A2722O928K9056m0175l4448J0536J9658K0949l2703l9397Q81J3289K1324
11149a1380p700n9431J5806L0248k1483O381P779j1737j6065N642P797K3701o348
11136c6790J0217l7127k0493j3408N6984L7019J7058j4628N7880P0913n134r7042
11124B5449N654k7346j0595j7033J5687M4447N068j8348m0200q389K7624Q786
11112A0804l7119k885j6136j0051J1077J0928K5657M847m443K9285K8m738J0403
11099B7657k1126m0601k9504n733K1661K6298J74m435K860j8319J560k323K9693
11086a2138P6472m3156m1245L2807N896m8164k0292M3436M533j6408j3742K1066
$$ plain form
11074 -10935 16237 -11206 -12077 -12693 -53612 -72073 -43812 -35330 -23579 -16636 23395 17804 -11901
11061 -11901 -29842 -2805 -1187 32415 72927 58953 14288 -12095 -2831 1618 -25383 -49283
11049 -49283 -36174 -14575 -24272 -27699 -21998 -35501 -45556 -17283 -26247 -56436 -69330 -36787
11037 -36787 -21129 6956 20746 -2821 -36199 -69770 -66816 -26411 -1985 -2856 -16823 -17048 -35777
11024 -35777 -9605 18310 -7142 28311 79739 49496 33264 8009 17818 13128 -9136 -44443
11012 -44443 -54970 -27194 17554 34643 44133 50590 13411 -13795 -31861 -28766 -14415 14645
11000 14645 -9360 -43966 -42603 -4521 21839 -9122 -26623 -10609 -18254 -18563 -4777 5974
10988 5974 18074 20829 -54740 -93466 -29237 9790 8074 -2688 21439 46741 76445 65724
$$ packed form
11074a0935K7172k7443q71o16m0919j8461K8261Q482J1751O943M0031n591k9705
11061a1901j7941K7037J618L3602M0512j3974m4665k6383R264M449k7001k3900
11049d9283J3109K1599r697l427N701j3503j0055K8273q964l0189j2894L2543
11037c6787J5658K8085J3790k3567l3378l3571K954M0405K4426q71j3967k25j8729
11024c5777K6172K7915k5452L5453N1428l0243j6232k5255R809m690k2264l5307
11012d4443j0527K7776M4748J7089R490O457l7179k7206j8066L095J4351K9060
11000A4645k4005l4606J363L8082K6360l0961j7501J6014p645l09J3786J0751
10988E974J2100K755p5569l8726O4229L9027j716j0762K4127K5302K9704j0721
$$ plain form
10976 65724 -8009 -6827 23309 29943 17905 7478 -17231 -36204 -13697 -26038 -27441 17849
10964 17849 42538 40010 10876 -16225 -22661 -13715 -1412 31469 33701 -11611 -29495 -22937 -25323
10951 -25323 -33231 -48017 -35253 -60462 -108875 -83978 -73482 -58965 -35916 -46297 -37904 -2424
10939 -2424 -22282 -4868 -23431 -21143 -6074 15678 22773 14226 42238 51115 11316 -18871 -13546
10926 -13546 -38612 -79177 -122279 -99870 -65504 -72678 -66082 -68241 -68410 -98853 -113948 -42437 -30262
10913 -30262 -20769 -11861 -16316 2514 -7338 14094 21702 3515 5146 -14693 -69125 -68390 -63247
10900 -63247 -71610 -23415 7585 42413 54934 37041 36533 19039 -19327 -51121 -65039 -75449
10888 -75449 -58971 -60123 -60767 -55103 -62886 -49660 -50054 -58783 -26780 -5975 -31347 -42389 -65319
$$ packed form
10976F5724p3733J182L0136O634j2038j0427k4709j8973K2507j2341j403M5290
10964A7849K4689k528k9134k7101o436Q946J2303L2881K232m5312j7884O558k386
10951b5323p908j4786J2764k5209m8413K4897J0496J4517K3049j0381Q393L5480
10939b424j9858J7414j8563K288J5069K1752P095q547K8012Q877l9799l0187N325
10926a3546k5066m0565m3102K2409L4366p174O596k159j69l0443j5095P1511J2175
10913c0262R493Q908m455J8830r852K1432P608j8187J631j9839n4432P35N143
10900f3247q363M8195L1000L4828J2521j7893n08j7494l8366l1794j3918j0410
10888g5449J6478j152o44N664p783J3226l94q729L2003K0805k5372j1042k2930
$$ plain form
10875 -65319 -70315 -50627 -65576 -72583 -94278 -101349 -95849 -88407 -56671 -58322 -83680 -80968 -46837
10862 -46837 22129 49624 28788 -16079 -43620 -37798 -45148 -70290 -39893 -13994 -42971 -27543
10850 -27543 -16244 -7981 -8560 -19713 -27890 -10507 31811 34250 16678 7224 1280 -13322 21821
10837 21821 -12784 -25458 -16310 -22448 -17423 -52722 -47259 -35755 -620 -10260 -22764 -19697 -19019
10824 -19019 -1301 25262 11992 -14486 -10047 4736 14972 65478 53233 40331 55837 26099
10812 26099 -9148 25264 28085 19701 15603 22788 18357 23121 86809 102049 62959 28302 26663
10799 26663 4087 23545 17981 854 -4714 18156 -3223 12380 26082 23556 12381 -10889
10787 -10889 -22757 -41907 -42886 -41409 -52622 -36963 13494 45598 19943 -17647 -27074 -30420 -1566
$$ packed form
10875f5319m996J9688j4949p007k1695p071N500P442L1736j651k5358K712L4131
10862d6837O8966K7495k0836m4867k7541N822p350k5142L0397K5899k8977J5428
10850b7543J1299Q263n79j1153q177J7383M2318K439j7572r454n944j4602L5143
10837B1821l4605j2674R148o138N025l5299N463J1504L5135r640j2504L067O78
10824a9019J7718K6563j3270k6478M439J4783J0236N0506j2245j2902J5506k9738
10812B6099l5247L4412K821q384m098P185m431M764O3688J5240l9090l4657j639
10799B6663k2576J9458n564j7127n568K2870k1379J5603J3702k526j1175k3270
10787a0889j1868j9150r79J477j1213J5659N0457L2104k5655l7590r427l346K8854
$$ plain form
10774 -1566 30987 21075 7367 9719 -41894 -49214 -45614 -51877 -45935 -52694 -69811 -71489 -61934 -52951
10760 -52951 -59788 -64716 -55180 -37584 10116 29416 -32431 -52801 -78113 -86376 -53288 -42065
10748 -42065 -33280 -30458 -24793 -34131 -56700 -31368 -31263 -24025 -44386 -76978 -84717 -77329 -78702 -55676
10734 -55676 -49140 -25247 14373 24672 3442 5305 -24492 -29032 -56162 -79567 -103058 -80130
10722 -80130 -35809 -16221 -45017 -51518 -29322 -7171 -2165 -25786 -8368 -15077 -41612 -73118
10710 -73118 -56542 -16538 -15883 -38105 -62110 -91129 -89087 -44440 10335 1352 9498 -13807 -57949
10697 -57949 -72558 -74777 -53231 -26723 -32098 -26531 -14082 15758 25116 8312 9454 -42636 -71637
10684 -71637 -53130 -27750 -18663 12738 43973 25481 65323 65371 55043 33725 32471 -27543 -33046
$$ packed form
10774a566L2553r912j3708K352n1613p320L600o263N942o759j7117j678R555Q983
10760e2951o837m928R536J7596M7700J9300o1847k0370k5312q263L3088J1223
10748d2065Q785K822N665r338k2569K5332J05P238k0361l2592p739P388j373K3026
10734e5676O536K3893L9620J0299k1230J863k9797m540k7130k3405k3491K2928
10722h0130M4321J9588k8796o501K2196K2151N006k3621J7418o709k6535l1506
10710g3118J6576M0004O55k2222k4005k9019K042M4647N4775q983Q146k3305m4142
10697e7949j4609k219K1546K6508n375N567J2449K9840R358j6804J142n2090k9001
10684g1637J8507K5380R087L1401L1235j8492L9842M8j0328k1318j254o0014n503
$$ plain form
10671 -33046 -12953 -48978 -36680 -32990 -30559 -16953 -7442 -14560 4368 15873 47382 -1046
10659 -1046 -58468 -52876 -18904 -52427 -56482 -8919 31498 7108 -32078 -61988 -60994 -30609 -972
10646 -972 5883 12225 -50250 -58464 -9671 -19190 -38605 -77781 -60681 20678 32994 11957 -19078
10633 -19078 -34579 -44432 -12047 -33330 -62264 -57687 -28082 -934 -11977 -15920 -26204 2815
10621 2815 18922 -2188 4200 48290 74892 22629 -35504 -40275 -51701 -23405 -24990 -50981
10609 -50981 -81171 -74474 -60215 -85047 -80955 -97712 -77377 -40785 -29627 -34298 -48530 -41909
10597 -41909 -3952 -4199 -7793 -10082 -12338 38655 71039 39066 12630 9766 12697 5689 4323
10584 4323 -24866 -21969 -14873 -22221 -91558 -89821 -36428 -39604 -53115 -57413 -7872 18171 15161
$$ packed form
10671c3046K0093l6025J2298L690K431J3606R511p118J8928J1505L1509m8428
10659a046n7422N592L3972l3523m055M7563M0417k4390l9186k9910R94L0385K9637
10646i72O855O342o2475q214M8793r519j9415l9176J7100Q1359J2316k1037l1035
10633a9078j5501r853L2385k1283k8934M577K9605K7148j1043l943j0284K9019
10621B815J6107k1110O388M4090K6602n2263n8133m771j1426K8296j585k5991
10609e0981l0190O697J4259k4832M092j6757K0335L6592J1158m671j4232O621
10597d1909L7957k47l594k289k256N0993L2384l1973k6436k864K931p008j366
10584D323k9189K897P096p348o9337J737N3393l176j3511m298M9541K6043l010
$$ plain form
10571 15161 67276 90940 50625 44048 29702 20323 -16379 -29412 -16681 -15454 -21203 -9856
10559 -9856 -10916 -7064 -28375 -10566 -6072 -24443 -32639 -62563 -87978 -66107 -54787 -22102 -12141
10546 -12141 -22704 -84535 -73827 -57533 -66453 -107853 -121112 -80631 -24676 -9661 14155 47821
10534 47821 41422 22780 -32232 -23547 -49211 -82420 -65965 -57819 -58401 -29054 -800 2335 -3621
10521 -3621 -9877 581 -27516 -22315 38372 25896 -16250 -39860 -61209 -90169 -72173 -21861
10509 -21861 9918 -17527 -51239 -70425 -85705 -57907 -61843 -60314 -66775 -61758 -43388 -9782
10497 -9782 -11845 -27927 -60879 -61478 -81141 -50055 -15592 -7583 13315 -3041 -12053 -25545 -194
10484 -194 20954 -214 -17662 -19981 -40680 -64082 -26813 -5773 -17062 -56730 -71074 -33766
$$ packed form
10571A5161N2115K3664m0315o577j4346r379l6702j3033J2731J227n749J1347
10559i856j060L852k1311J7809M494j8371q196k9924k5415K1871J1320L2685R961
10546a2141j0563o1831J0708J6294q920m1400j3259M0481N5955J5015K3816L3666
10534D7821o399j8642n5012Q685k5664l3209J6455Q146n82K9347K8254L135n956
10521c621o256J0458k8097N201O0687j2476m2146k3610k1349k8960J7996N0312
10509b1861L1779k7445l3712j9186j5280K7798l936J529o461N017J8370L3606
10497i782k063j6082l2952n99j9663L1086L4463Q009K0898j6356r012j3492K5351
10484a94K1148k1168j7448k319k0699k3402L7269K1040j1289l9668j4344L7308
$$ plain form
10472 -33766 915 4627 6206 -7313 -35526 -25306 -25147 -44820 -37211 -26688 -16345 -38980 -87618
10459 -87618 -106406 -92856 -86517 -84410 -66484 -69570 -63884 -39306 -30898 -23681 -46452 -38690 -49257
10446 -49257 -42419 -22172 -2046 -6325 -26163 -2189 12231 51541 94735 33430 -15545 -21314
10434 -21314 -16458 -24784 -40277 -35328 -15427 5507 553 -41949 -74504 -57823 -28402 -6163
10422 -6163 21250 21737 15057 49840 77683 25009 20457 -12778 -22250 -21267 -38908 -78504 -80846
10409 -80846 -69416 -40695 -39700 -25385 -23067 -17563 -17373 -17907 -39345 -31716 -11475 -42185 -37805 -24464
10395 -24464 -38699 -24846 -28345 -76739 -69468 -62336 -52019 -33539 -14738 -33898 -50689 -51716
10383 -51716 -63199 -92387 -86613 -51766 -11799 -9855 -41852 -38856 -52719 -57701 -50935 -58443 -60397
$$ packed form
10472c3766L4681L712J579j3519k8213J0220J59j9673P609J0523J0343k2635m8638
10459h7618j8788J3550O339K107J7926l086N686K4578Q408P217k2771P762j0567
10446d9257O838K0247K0126m279j9838K3974J4420L9310M3194o1305m8975n769
10434b1314M856q326j5493M949J9901K0934m954m2502l2555J6681K9421K2239
10422f163K7413M87o680L4783K7843n2674m552l3235r472R83j7641l9596k342
10409h0846J1430K8721R95J4315K318N504J90n34k1438P629K0241l0710M380J3341
10395b4464j4235J3853l499m8394P271P132J0317J8480J8801j9160j6791j027
10383e1716j1483k9188N774L4847L9967J944l1997K996j3863m982O766p508j954
$$ plain form
10370 -60397 -39949 -4108 25856 30151 6982 -22267 7935 -1055 -23501 50064 49468 24575
10358 24575 9113 3711 8442 58704 55211 25501 -11798 -24949 13252 81948 135966 168412
10346 168412 186102 248857 286087 299445 360203 404554 369832 369753 416189 429862 387709 299127
10334 299127 227130 168184 117617 72979 18573 7794 32148 6452 23189 54278 62538 6053
10322 6053 -22914 -39678 -12778 -5767 -9372 -14188 -32276 -16250 17276 10187 -39760 -45908 -34126
10309 -34126 -51850 -54462 -15144 29103 53350 80306 58519 59728 58905 53605 39038 34998 10581
10296 10581 -408 757 38094 78658 77106 54783 58252 25081 4119 -35260 -34085 -49470
10284 -49470 -46072 -20974 -19610 -42535 -40505 -30097 -32066 -18851 -14959 -35302 -38643 -11996 4061
$$ packed form
10370f0397K0448L5841K9964M295k3169k9249L0202q990k2446P3565n96k4893
10358B4575j5462n402M731N0262l493k9710l7299j3151L8201O8696N4018L2446
10346A68412J7690O2755L7230J3358O0758M4351l4722p9M6436J3673m2153q8582
10334B99127p1997n8946n0567m4638n4406j0779K4354k5696J6737L1089Q260n6485
10322F053k8967j6764K6900P011l605m816j8088J6026L3526p089m9947o148J1782
10309c4126j7724k612L9318M4247K4247K6956k1787J209q23n300j4567m040k4417
10296A0581j0989J165L7337M0564j552k2323L469l3171k0962l9379J175j5385
10284d9470L398K5098J364k2925K030J0408j969J3215L892k0343l341K6647J6057
$$ plain form
10271 4061 15525 -7305 -40743 -20583 -22533 -42049 -25768 -4966 35717 40081 5366 -54907
10259 -54907 -50728 7018 24637 -13221 -36480 -18605 -12601 -33970 -28200 -6453 -22463 -66093
10247 -66093 -56792 -14176 19160 29504 2796 59379 67153 42255 12338 -9028 43979 29684
10235 29684 16952 28649 38919 19131 -26403 -18720 -27208 -43238 -39335 22805 39917 50309
10223 50309 51439 22927 -6262 -60756 -67256 -17504 48434 73705 50643 13360 221 -2560
10211 -2560 4560 14998 26753 40768 -7727 -27776 -63091 -97459 -37665 21731 37818 49419
10199 49419 74558 88983 55764 78652 81566 50228 25087 55724 47232 -6425 -36124 -10462
10187 -10462 -1065 17934 31199 36606 44674 34714 -260 -39046 -51283 -48665 -43393 -21682 -8329
$$ packed form
10271D061J1464k2830l3438K0160j950j9516J6281K0802M0683M364l4715o0273
10259e4907M179N7746J7619l7858k3259J7875O004k1369N770K1747j6010m3630
10247f6093R301M2616L3336J0344k6708N6583P774k4898k9917k1366N3007j4295
10235B9684j2732J1697J0270j9788m5534P683q488j6030L903O2140J7112J0392
10223E0309J130k8512k9189n4494o500M9752O5938K5271k3062l7283j3139k781
10211b560P120J0438J1755J4015m8495k0049l5315l4368N9794N9396J6087J1601
10199D9419K5139J4425l3219K2888K914l1338k5141L0637q492n3657k9699K5662
10187a0462R397J8999J3265N407Q068r960l4974l8786j2237K618N272K1711J3353
$$ plain form
10174 -8329 -19159 17110 51297 37662 -15559 926 567 20089 3419 -47301 -36876 -16407
10162 -16407 17977 17171 -6819 -17239 -11315 -9765 -34244 -71842 -82800 -58245 -68434 -51789
10150 -51789 3318 25863 -15951 -57976 -15182 11183 5395 -30727 -31470 -2940 -3107 -37945 -26741
10137 -26741 -16364 -9582 -17391 -46903 -65068 -88811 -76772 -71077 -76755 -57896 -33664 -37716 -66843
10124 -66843 -57460 -35231 -41421 -29812 -7947 -10290 3609 10396 -6393 3264 -22607 -53642 -17950
10111 -17950 -11988 -44079 -52345 -21874 3492 24877 40602 39845 22335 29566 19541 -12020 -28045
10098 -28045 -21064 -6607 6592 -5669 -23573 13472 -5012 -33007 -3182 19867 43988 75561
10086 75561 26075 -6109 -6099 -19810 -43375 -93695 -118540 -106153 -82643 -45644 13381 47891
$$ packed form
10174h329j0830L6269L4187j3635n3221J6485l59J9522j6670n0720J0425K0469
10162a6407L4384q06k3990j0420N924J550k4479l7598j0958K4555j0189J6645
10150e1789N5107K2545m1814m2025M2794K6365n788l6122p43K8530j67l4838J1204
10137b6741J0377O782p809k9512j8165k3743J2039N695n678J8859K4232m052k9127
10124f6843R383K2229o190J1609K1865k343J3899O787j6789R657k5871l1035L5692
10111a7950N962l2091q266L0471K5366K1385J5725p57j7510P231j0025l1561j6025
10098b8045O981J4457J3199j2261j7904L7045j8484k7995K9825K3049K4121L1573
10086G5561m9486l2184J0j3711k3565n0320k4845J2387K3510L6999N9025L4510
$$ plain form
10074 47891 43141 -2590 -13333 -23257 -44530 -45400 -67253 -53330 -24655 -34020 -11610 368 -12788
10061 -12788 5081 46716 79112 92401 102602 49317 30979 36205 33870 4785 -37915 -60743
10049 -60743 -89344 -39938 -43159 -25047 -29914 -14983 -19737 -10951 -21252 -5580 2527 17113 21153
10036 21153 2120 -12606 6918 -7923 -24922 5587 14886 -29277 -26404 -30678 -39881 -25046
10024 -25046 -29148 -4240 -30516 -27573 13655 4791 -58646 -23589 17980 8859 13495 5645 20713
10011 20713 15334 -16003 -75133 -64448 -62598 -35222 -35093 -3738 39758 13127 889 -16392
9999 -16392 25847 68212 94153 60525 17686 -544 787 5637 34709 38890 61547 21898
9987 21898 122 11256 738 -12750 -31583 -37110 -28637 -1435 -15786 -38219 -37122 -8168
$$ packed form
10074D7891m750m5731j0743r924k1273q70k1853J3923K8675r365K2410J1978j3156
10061a2788J7869M1635L2396J3289J0201n3285j8338N226k335k9085m2700k2828
10049f0743k8601M9406l221J8112m867J4931m754Q786j0301J5672Q107J4586M040
10036B1153j9033j4726J9524j4841j6999L0509R299m4163K873m274r203J4835
10024b5046m102K4908k6276K943M1228q864o3437L5057M1569r121M636p850J5068
10011B0713n379l1337n9130J0685J850K7376J29L1355M3496k6631j2238j7281
9999a6392M2239M2365K5941l3628m2839j8230J331M850K9072M181K2657l9649
9987B1898k1776J1134j0518j3488j8833n527Q473K7202j4351k2433J097K8954
$$ plain form
9975 -8168 24906 12496 -3920 -5940 569 -5790 -12596 -30753 -50285 -4350 -5131 5072 18301
9962 18301 -12273 -24479 -32442 -32226 -22864 -2370 46180 70490 71142 74447 78220 90992 98574 66838
9948 66838 51869 -18327 -31932 13197 36867 7360 -16161 2358 -12127 -28626 -12612 -11554
9936 -11554 -32394 -43901 -12907 -12278 -2141 -27885 -27426 -45330 -33542 9314 -3429 -5587 -760
9923 -760 -19663 -1069 15950 -5224 -9512 -35004 -51170 -56610 -72712 -91751 -49012 9340 34134
9910 34134 22552 5276 234 -13591 -14514 -22069 -25769 148 20913 7038 51691 85661 77548
9897 77548 38229 14201 25741 10076 4944 -10861 -25386 -3449 -2010 16586 39079 39867 10921
9884 10921 -26824 -50627 -85747 -102423 -61688 -69744 -72211 -55340 -32495 -28753 5580 55542
$$ packed form
9975h168L3074j2410j6416k020O509o359o806j8157j9532M5935p81J0203J3229
9962A8301l0574j2206p963K16R362K0494M8550K4310O52L305L773J2772P582l1736
9948F6838j4969p0196j3605M5129K3670k9507k3521J8519j4485j6499J6014J058
9936a1554k0840j1507L0994O29J0137k5744M59j7904J1788M2856j2743k158M827
9923g60j8903J8594J7019k1174m288k5492j6166n440j6102j9039M2739N8352K4794
9910C4134j1582j7276n042j3825r23p555l700K5917K0765j3875M4653L3970q113
9897G7548l9319k4028J1540j5665n132j5805j4525K1937J439J8596K2493P88k8946
9884A0921l7745k3803l5120j6676M0735q056k467J6871K2845L742L4333M9962
$$ plain form
9872 55542 73736 93296 91365 86113 58469 25236 19450 43369 54577 28386 71131 82563
9860 82563 72205 29203 -17600 1337 -8733 -41688 -75131 -83638 -56783 -26128 -60832 -82649
9848 -82649 -50300 -45284 -62514 -62679 -10008 10754 -41578 -74724 -4468 33971 7944 -7171
9836 -7171 16966 40896 44250 49969 5920 -20497 -12650 46382 60680 33828 12516 10217 37585
9823 37585 -2833 -35580 -85413 -100141 -85540 -25171 -7661 -29062 -33753 -40175 -72090 -69214
9811 -69214 -58557 -87939 -84523 -75152 -45058 -11719 5314 2602 -23970 -43533 -47733 -44289 -51393
9798 -51393 -8301 4414 -12495 8358 25010 -14276 -45470 -22647 -26736 -45679 -51356 -63616
9786 -63616 -73199 -101123 -83942 -34788 -21078 -20902 1690 -9574 11838 14012 15784 15601 -32132
$$ packed form
9872E5542J8194J9560j931n252k7644l3233n786K3919J1208k6191M2745J1432
9860H2563j0358m3002m6803J8937j0070l2955l3443q507K6855L0655l4704k1817
9848h2649L2349N016j7230j65N2671K0762n2332l3146P0256L8439k6027j5115
9836g171K4137K3930L354N719m4049k6417P847N9032J4298k6852k1312k299K7368
9823C7585m0418l2747m9833j4728J4601O0369J7510k1401m691o422l1915K876
9811f9214J0657k9382L416R371L0094L3339J7033k712k6572j9563m200L444p104
9798e1393M3092J2715j6909K0853J6652l9286l1194K2823m089j8943n677j2260
9786f3616r583k7924J7181M9154J3710J76K2592j1264K1412K174J772j83m7733
$$ plain form
9773 -32132 -1486 -5465 -24302 -27885 -8548 46560 41710 27813 38953 47174 16126 -17336 -42165
9760 -42165 -50702 -49229 -17552 -11668 -42210 -66074 -93081 -79348 -43836 -14088 -22460 -3017 22306
9747 22306 -5613 -40272 -59405 -66571 -24585 -17121 2673 16624 1825 17573 20015 6403
9735 6403 22935 -30962 -47077 -35591 -17315 -26105 -3853 337 -22864 -20530 -10624 1100 -5821
9722 -5821 698 -2238 8058 -541 36747 18199 294 -14528 -32494 -50734 11382 3126 -23694
9709 -23694 -14182 -32561 -37400 -16808 -48574 -45794 -26462 -14554 -56692 -77773 -111399 -115528 -129474
9696 -129474 -112837 -61924 -58956 -50960 -7261 3828 16738 17083 -9876 -11551 30570 53651 16767
9683 16767 -16483 -33087 -27460 -6949 -4662 3390 -19556 -23967 4956 6881 706 13747 -33465
$$ packed form
9773c2132L0646l979j8837l583J9337N5108m850j3897J1140Q221l1048l3462k4829
9760d2165q537J473L1677N884l0542k3864k7007J3733L5512K9748q372J9443K5323
9747B2306k7919l4659j9133p166M1986P464J9794J3951j4799J5748K442j3612
9735F403J6532n3897j6115J1486J8276q790K2252M190k3201K334R906J1724o921
9722e821O519k936J0296q599L7288j8548j7905j4822j7966j8240O2116q256k6820
9709b3694R512j8379m839K0592l1766K780J9332J1908m2138k1081l3626m129j3946
9696a29474J6637N0913K968P996M3699J1089J2910L45k6959j675M2121K3081l6884
9683A6767l3250j6604N627K0511K287Q052k2946m411K8923J925o175J3041m7212
$$ plain form
9670 -33465 -45763 -27109 -40321 -48387 -37032 -28097 -24568 -19025 19535 19745 10374 26135 48512
9657 48512 62265 79540 106699 97199 37808 -5118 -15761 -47220 -26285 -23688 -1062 63049
9645 63049 68286 48308 28861 4931 -67175 -85100 -57852 -29647 -50867 -68627 -53272 -54879
9633 -54879 -41418 -10608 -5073 -26333 8426 21233 -1089 34936 22144 1793 856 20390
9621 20390 31148 2906 6558 -1404 -5096 11720 25693 36059 6714 -35560 -41407 -31275 21224
9608 21224 29503 -22155 -4559 14709 14151 7661 -189 19250 20184 13503 39625 20480 14364 18029
9594 18029 -7467 -43307 -24232 -24629 -52145 -21311 8712 27059 14817 -1397 -22382 20709
9582 20709 22616 20987 34971 14658 1734 -14022 -42917 -64340 -43693 5086 -8180 -43511
$$ packed form
9670c3465j2298J8654j3212q066J1355Q935L529N543L8560K10r371J5761K2377
9657D8512J3753J7275K7159r500n9391m2926j0643l1459K0935K597K2626O4111
9645F3049N237j9978j9447k3930p2106j7925K7248K8205k1220j7760J5355j607
9633e4879J3461L0810N535k1260L4759J2807k2322L6025j2792k0351r37J9534
9621B0390J0758k8242L652p962l692J6816J3973J0366k9345m2274n847J0132N2499
9608B1224Q279n1658J7596J9268n58o490p850J9439R34o681K6122j9145o116L665
9594A8029k5496l5840J9075l97k7516L0834L0023J8347j2242j6214k0985M3091
9582B0709J907j629J3984k0313j2924j5756k8895k1423K0647M8779j3266l5331
$$ plain form
9570 -43511 -11631 -41294 -34163 -78940 -62457 -3836 25258 18132 5758 38523 24291 -32603
9558 -32603 -74456 -72795 -22579 7275 -10858 -47448 -44262 -43179 -72427 -53372 -13041 91
9546 91 1682 -49925 -73347 -35772 -30168 -16908 11082 -8845 -24529 -39212 -45926 -53026 -87716
9533 -87716 -74309 -45135 -40672 -56284 -66569 -68964 -78461 -66498 -25727 -8331 6847 -8732
9521 -8732 -15722 -18712 -4303 6959 -34 21507 23520 -6307 -9884 -51917 -55648 -61359 -21518
9508 -21518 30995 34274 19300 -15355 -42728 31396 50980 5997 -22113 -19649 -2102 -28426
9496 -28426 -57147 17803 58756 25011 23546 24325 -7016 -19512 -35525 -50847 -11376 30111
9484 30111 37257 24729 24657 49178 57321 26210 -17310 -53905 -55721 -21501 38325 24131 -4737
$$ packed form
9570d3511L1880k9663P131m4777J6483N8621K9094p126j2374L2765j4232n6894
9558c2603m1853J661N0216K9854j8133l6590L186J083k9248J9055M0331J3132
9546I1J591n1607k3422L7575N604J3260K7990j9927j5684j4683o714p100l4690
9533h7716J3407K9174M463j5612j0285k395r497J1963M0771J7396J5178j5579
9521h732o990k990J4409J1262o993K1541K013k9827l577m2033l731n711L9841
9508b1518N2513L279j4974l4655k7373P4124J9584m4983k8110K464J7547k6324
9496b8426k8721P4950M0953l3745j465P79l1341j2496j6013j5322L9471M1487
9484C0111P146j2528p2K4521Q143l1111m3520l6595j816L4220N9826j4194k8868
$$ plain form
9471 -4737 -14848 -4470 8770 -19497 -7238 21091 34083 10341 -21331 -11114 6127 32745
9459 32745 40452 34273 56520 66923 64603 24905 -12911 -19038 -5991 -5122 2367 -17855 -23945
9446 -23945 -37608 -10921 -9520 3072 32054 50295 25010 22284 19607 29875 51831 19813
9434 19813 21768 42359 44015 73620 41277 -1108 -31990 -41306 -45732 -5022 76475 91164 76494
9421 76494 48811 10317 10607 2347 24530 30414 -2720 -34690 -8611 59618 63112 50467 59410
9408 59410 73441 63663 17712 -24783 -30012 -26098 -303 13740 16602 2098 -5045 -19961 -24063
9395 -24063 926 452 -3885 -28819 -25910 37300 64114 33524 4190 20731 40719 37826 -6471
9382 -6471 -14848 35079 48876 22381 -20575 -35848 -56409 -55469 -11700 17724 10212 20063 27589
$$ packed form
9471d737j0111J0378J3240k8267J2259K8329J2992k3742l1672J0217J7241K6618
9459C2745P707o179K2247J0403k320l9698l7816o127J3047Q69P489k0222o090
9446b3945j3663K6687J401J2592K8982J8241k5285k726k677J0268K1956l2018
9434A9813J955K0591J656K9605l2343m2385l0882r316m426M0710Q1497J4689j4670
9421G6494k7683l8494K90q260K2183N884l3134l1970K6079O8229L494j2645Q943
9408E9410J4031r778m5951m2495n229L914K5795J4043K862j4504p143j4916m102
9395b4063K4989m74m337k4934K909O3210K6814l0590k9334J6541J9988k893m4297
9382f471q377M9927J3797k6495m2956j5273k0561R40M3769K9424p512R851P526
$$ plain form
9369 27589 51442 40633 43930 31138 -10922 -21878 -27040 764 8959 -21512 -37201 -23141
9357 -23141 -31031 183 35803 58858 59630 45456 15143 -18143 -31712 -23374 -25119 -61408 -77755
9344 -77755 -39262 -4321 23627 29776 33262 50623 86104 -1451 3911 42490 26500 -7088
9332 -7088 9065 32823 1314 16188 8983 -5737 -21047 266 55095 79049 66012 46747
9320 46747 32074 4724 20056 43189 47176 59668 69084 43657 19446 56095 38125 12847
9308 12847 -3540 34023 29340 13787 35245 49066 36589 16158 -29618 -85665 -67135 -14022
9296 -14022 -3797 -35102 -21231 -21406 -33577 -13475 -14353 -30409 -25294 17102 15533 -31531 -44597
9283 -44597 -32232 -1840 5046 6014 7717 21110 8907 52988 54399 41857 39726 94047 104895
$$ packed form
9369B7589K3853j0809L297j2792m2060j0956n162K7804Q195l0471j5689J4060
9357b3141p890L1214L5620K3055P72j4174l0313l3286j3569Q338j745l6289j6347
9344g7755L8493L4941K7948O149L486J7361L5481q7555N362L8579j5990l3588
9332g088J6153K3758l1509J4874p205j4720j5310K1313N4829K3954j3037j9265
9320D6747j4673k7350J5332K3133L987J2492R416k5427k4211L6649j7970k5278
9308A2847j6387L7563m683j5553K1458J3821j2477k0431m5776n6047J8530N3113
9296a4022J0225l1305J3871j75j2171K0102q78j6056N115M2396j569m7064j3066
9283d4597J2365L0392O886R68J703J3393j2203M4081J411j2542k131N4321J0848
$$ plain form
9270 104895 116977 109005 125365 114600 169786 140216 104909 80889 36795 50720 36880 14000
9258 14000 -2768 -16072 -26678 -4217 26793 32789 35631 -6939 -15146 590 8399 -19639 -22337
9245 -22337 -26390 -63300 -43203 3868 -5833 1542 57699 40423 31372 30687 29412 37427 24829
9232 24829 19431 34364 69939 38817 9264 -8539 -66618 -80681 -57213 -62044 -66793 -68665 -28268
9219 -28268 -7370 7002 -2622 -25625 -83253 -62947 -66426 -67370 -84444 -73226 -38462 -23725 -25475
9206 -25475 8458 31394 27664 19604 2925 15066 56552 59063 48593 33168 11814 853
9194 853 -45726 -26650 -8354 -17308 -17512 -22300 -11722 26222 42193 35975 37207 -38972 -52488
9181 -52488 -7835 -3059 12760 4084 -13393 -3612 11297 27823 6239 31932 38070 11547 -16520
$$ packed form
9270A04895J2082p972J6360j0765N5186k9570l5307k4020m4094J3925j3840k2880
9258A4000j6768j3304j0606K2461L1010N996K842m2570q207J5736P809k8038k698
9245b2337m053l6910K0097M7071r701P375N6157j7276r051o85j275Q015j2598
9232B4829n398J4933L5575l1122k9553j7803n8079j4063K3468m831m749j872M0397
9219b8268K0898J4372r624k3003n7628K0306l479r44j7074J1218L4764J4737j750
9206b5475L3933K2936l730q060j6679J2141M1486K511j0470j5425k1354j0961
9194H53m6579J9076J8296q954k04m788J0578L7944J5971o218J232p6179j3516
9181e2488M4653M776J5819q676j7477R781J4909J6526k1584K5693O138k6523k8067
$$ plain form
9168 -16520 -11749 -8485 -18162 -26116 -9894 -28161 -41498 -8314 -31893 -73652 -53272 -9995 14350
$$ packed form
9168a6520M771L264r677p954J6222j8267j3337L3184k3579m1759K0380M3277K4345
$$ [...]
##END NTUPLES=NMR SPECTRUM
##END=
