##TITLE=Analysis number 316463
Compound Code cc 02103
Book Reference 428/170/9
Project Code adrs
Chemist Name janep
##JCAMPDX= 6.0         $$ Bruker NMR JCAMP-DX V2.0
##DATA TYPE= NMR SPECTRUM
##DATA CLASS= NTUPLES
##ORIGIN= Bruker BioSpin GmbH
##OWNER= nmr
$$ XWIN-NMR		Version 3.5
$$ Mon Jan 16 12:35:47 2006 GMT Standard Time (UT+0h)  MAYBRIDGE\nmr@NMR_250MHZ
##.OBSERVE FREQUENCY= 250.131544655141
##.OBSERVE NUCLEUS= ^1H
##.ACQUISITION MODE= SIMULTANEOUS (DQD)
##.ACQUISITION SCHEME= undefined
##.AVERAGES= 16
##.DIGITISER RES= 18
##SPECTROMETER/DATA SYSTEM= dpx250
##.PULSE SEQUENCE= zg30
##.SOLVENT NAME= CDCl3
##.SHIFT REFERENCE= (INTERNAL, CDCl3, 0, 16.522)
##AUDIT TRAIL= $$ (NUMBER, WHEN, WHO, WHERE, WHAT)
$$ ##TITLE= Audit trail, XWIN-NMR		Version 3.5
$$ ##JCAMPDX= 5.01
$$ ##ORIGIN= Bruker BioSpin GmbH
$$ ##OWNER= nmr
$$ C:\u/data/dgb/nmr/ADRS/14770/pdata/1/auditp.txt
$$ ##AUDIT TRAIL=  $$ (NUMBER, WHEN, WHO, WHERE, WHAT)
(   1,<2006-01-16 12:35:14.57 +000>,<MAYBRIDGE\nmr>,<NMR_250MHZ>,
      <created by zg, POWCHK disabled, PULCHK disabled
       configuration hash MD5:
       62 19 C7 07 E1 42 D1 B7 37 6C 3D D0 77 39 F9 E6
       data hash MD5: 64K
       ED D4 E7 49 11 91 30 B1 4B 21 75 2B 2A B7 AD A7>)
(   2,<2006-01-16 12:35:32.29 +000>,<MAYBRIDGE\nmr>,<NMR_250MHZ>,
      <Start of raw data processing
       ef LB = 0.3 FT_mod = 6 PKNL = 1 SI = 32K 
       data hash MD5: 32K
       9A 49 13 84 81 BD C3 8D 55 65 16 47 A6 4E AE 82>)
(   3,<2006-01-16 12:35:34.87 +000>,<MAYBRIDGE\nmr>,<NMR_250MHZ>,
      <apk 
       data hash MD5: 32K
       04 E8 02 CF 7F 9A 93 D6 76 BB 8A A9 FC C9 59 80>)
(   4,<2006-01-16 12:35:35.64 +000>,<MAYBRIDGE\nmr>,<NMR_250MHZ>,
      <abs ABSG = 5 
       data hash MD5: 32K
       1E 92 69 06 C4 F2 8D 1C 2B 55 EF 22 B5 2E D1 67>)
$$ ##END=
$$ 
$$ hash MD5
$$ 34 51 9E B8 63 3D FF BB C8 11 DF E3 F7 4C 9E 73
##$RELAX= 
##$RELAX= 
##$RELAX= 
##$RELAX= 
##$RELAX= 
##$RELAX= 
##$RELAX= 
$$ Bruker specific parameters
$$ --------------------------
##$DU= <C:\u>
##$EXPNO= 14770
##$NAME= <ADRS>
##$PROCNO= 1
##$TYPE= <nmr>
##$USER= <dgb>
##$AMP= (0..31)
100 100 100 100 100 100 100 100 100 100 100 100 100 100 100 100 100 100 
100 100 100 100 100 100 100 100 100 100 100 100 100 100 
##$AQSEQ= 0
##$AQ_mod= 3
##$AUNM= <au_zg>
##$AUTOPOS= <28 >
##$BF1= 250.13
##$BF2= 250.13
##$BF3= 250.13
##$BF4= 250.13
##$BF5= 500.13
##$BF6= 500.13
##$BF7= 500.13
##$BF8= 500.13
##$BYTORDA= 1
##$CFDGTYP= 0
##$CFRGTYP= 5
##$CHEMSTR= <none>
##$CNST= (0..31)
1 1 145 1 1 1 1 1 1 1 1 1 1 1 1 1 1 1 1 1 1 1 1 1 1 1 1 1 1 1 1 1 
##$CPDPRG= <>
##$CPDPRG1= <>
##$CPDPRG2= <>
##$CPDPRG3= <>
##$CPDPRG4= <mlev>
##$CPDPRG5= <mlev>
##$CPDPRG6= <mlev>
##$CPDPRG7= <mlev>
##$CPDPRG8= <mlev>
##$CPDPRGB= <>
##$CPDPRGT= <>
##$D= (0..31)
0 1 0 0 0 0 0 0 0 0.06 0 0 0 0 0 0 0.0002 0 0 0 0 0 0 0 0 0 0 0 0 0 0 
0 
##$DATE= 1137414909
##$DBL= (0..7)
120 120 120 120 120 120 120 120 
##$DBP= (0..7)
150 150 150 150 150 150 150 150 
##$DBP07= 0
##$DBPNAM0= <>
##$DBPNAM1= <>
$$ [...]
##$SUBNAM7= <"">
##$SUBNAM8= <"">
##$SUBNAM9= <"">
##$SW= 20.6930455092707
##$SWIBOX= (0..15)
0 0 3 0 0 0 0 0 0 0 0 0 0 0 0 0 
##$SW_h= 5175.983436853
##$TD= 65536
##$TD0= 1
##$TE= 294.16
##$TE2= 300
##$TE3= 300
##$TEG= 300
##$TL= (0..7)
0 120 120 120 120 120 120 120 
##$TP= (0..7)
150 150 150 150 150 150 150 150 
##$TP07= 0
##$TPNAME0= <>
##$TPNAME1= <>
##$TPNAME2= <>
##$TPNAME3= <>
##$TPNAME4= <>
##$TPNAME5= <>
##$TPNAME6= <>
##$TPNAME7= <>
##$TPOAL= (0..7)
0.5 0.5 0.5 0.5 0.5 0.5 0.5 0.5 
##$TPOFFS= (0..7)
0 0 0 0 0 0 0 0 
##$TUNHIN= 0
##$TUNHOUT= 0
##$TUNXOUT= 0
##$USERA1= <user>
##$USERA2= <user>
##$USERA3= <user>
##$USERA4= <user>
##$USERA5= <user>
##$V9= 5
##$VALIST= <valist>
##$VCLIST= <CCCCCCCCCCCCCCC>
##$VD= 0
##$VDLIST= <DDDDDDDDDDDDDDD>
##$VPLIST= <PPPPPPPPPPPPPPP>
##$VTLIST= <TTTTTTTTTTTTTTT>
##$WBST= 1024
##$WBSW= 4
##$XGAIN= (0..3)
0 0 0 0 
##$XL= 0
##$YL= 0
##$YMAX_a= 564857
##$YMIN_a= -557857
##$ZGOPTNS= <>
##$ZL1= 120
##$ZL2= 120
##$ZL3= 120
##$ZL4= 120
##$ABSF1= 16.522
##$ABSF2= -4.171173
##$ABSG= 5
##$ABSL= 3
##$ALPHA= 0
##$AQORDER= 0
##$ASSFAC= 0
##$ASSFACI= 0
##$ASSFACX= 0
##$ASSWID= 0
##$AUNMP= <proc_1d>
##$AZFE= 0.1
##$AZFW= 0.1
##$BCFW= 0
##$BC_mod= 0
##$BYTORDP= 0
##$COROFFS= 0
##$CY= 12.5
##$DATMOD= 1
##$DC= 0
##$DFILT= <>
##$DTYPP= 0
##$F1P= 14.0000005364418
##$F2P= -0.99999901652339
##$FCOR= 0.5
##$FTSIZE= 32768
##$FT_mod= 6
##$GAMMA= 0
##$GB= 0
##$INTBC= 1
##$INTSCL= 1
##$ISEN= 128
##$LB= 0.3
##$LEV0= 0
##$LPBIN= 0
##$MAXI= 10000
##$MC2= 0
##$MEAN= 0
##$ME_mod= 0
##$MI= 0
##$NCOEF= 0
##$NC_proc= -3
##$NLEV= 6
##$NOISF1= 0
##$NOISF2= 0
##$NSP= 0
##$NTH_PI= 0
##$NZP= 0
##$OFFSET= 16.522
##$PC= 1
##$PHC0= 89.96484
##$PHC1= -15.8049
##$PH_mod= 1
##$PKNL= yes
##$PPARMOD= 0
##$PSCAL= 4
##$PSIGN= 0
##$REVERSE= no
##$SF= 250.13
##$SI= 32768
##$SIGF1= 0
##$SIGF2= 0
##$SINO= 400
##$SIOLD= 32768
##$SREGLST= <1H.CDCl3>
##$SSB= 0
##$STSI= 32768
##$STSR= 0
##$SW_p= 5175.98343685301
##$SYMM= 0
##$S_DEV= 0
##$TDeff= 65536
##$TDoff= 0
##$TI= <Analysis number 999999
Compound Code 99
Book Reference 9
Project Code 9>
##$TILT= no
##$TM1= 0
##$TM2= 0
##$TOPLEV= 0
##$USERP1= <user>
##$USERP2= <user>
##$USERP3= <user>
##$USERP4= <user>
##$USERP5= <user>
##$WDW= 1
##$XDIM= 32768
##$YMAX_p= 362770432
##$YMIN_p= -385563
$$ End of Bruker specific parameters
$$ ---------------------------------
##NTUPLES= NMR SPECTRUM
##VAR_NAME=  FREQUENCY,     SPECTRUM/REAL,   SPECTRUM/IMAG
##SYMBOL=    X,             R,               I
##VAR_TYPE=  INDEPENDENT,   DEPENDENT,       DEPENDENT
##VAR_FORM=  AFFN,          ASDF,            ASDF
##VAR_DIM=   32768,         32768,           32768
##UNITS=     HZ,            ARBITRARY UNITS, ARBITRARY UNITS
##FACTOR=    0.157963299565203, 1,           1
##FIRST=     4132.6476996994, 0,             0
##LAST=      -1043.33573715361, 0,           0
##MIN=       -1043.33573715361, -385563,     0
##MAX=       4132.6476996994, 362770432,     0
$$ Real data points
##PAGE= N=1
##DATA TABLE= (X++(R..R)), XYDATA
$$ [...]
$$ plain form
26008 -273 -129 313 -3604 -8662 -9715 -12513 -12994 -19028 -25867 -17361 -6517 4330 -2035 -5988 -2462
25993 -2462 -6808 -1687 -1728 6629 3299 532 -3015 -3853 6832 5347 -6820 -13023 -9532 -8661 -2557
25978 -2557 -7051 -3159 1442 -3430 -8545 2402 4434 -222 7986 4820 15327 18463 14768 17361
25964 17361 19246 5182 2851 -722 -2469 -7872 -11407 -13931 -10635 -13980 -15163 -13293 -13920 -1306
25950 -1306 1409 -11204 -4180 -13601 -14663 -14478 -793 -488 -872 1424 12992 16248 -4792 -9466
25936 -9466 -21068 -23335 -13998 944 3664 -7486 -260 9827 -605 30 9337 2029 -251 -4682
25922 -4682 -14368 -12481 -6961 -1365 -14548 -14311 -5174 -3964 -9626 -22121 -30284 -28537 -16027 -4643
25908 -4643 -9895 -22968 -13635 -1002 -5974 -10208 -15273 -1960 3790 9098 17082 14424 9665 15918
$$ packed form
26008b73J44M42l917n058j053k798m81o034o839Q506J0844J0847o365l953L526
25993b462m346N121m1Q357l330k767l547q38J0685j485j2167o203L491Q71O104
25978b557m494L892M601m872n115J0947K032m656Q208l166J0507L136l695K593
25964A7361J885j4064k331l573j747n403l535k524L296l345j183J870o27J2614
25950a306K715j2613P024r421j062J85J3685L05l84K296J1568L256k1040m674
25936i466j1602k267R337J4942K720j1150P226J0087j0432O35R307p308k280m431
25922d682r686J887N520N596j3183K37R137J210n662j2495q163J747J2510J1384
25908d643n252j3073R333J2633m972m234n065J3313N750N308P984k658m759O253
$$ plain form
25894 15918 16251 3524 -659 3666 23890 16458 4895 -1344 -2142 6470 7624 10254 22764 23927
25880 23927 5914 13150 25547 20771 9576 7738 6333 -8428 -15842 -10688 -12886 -7332 -7215 2703
25866 2703 1840 -8305 -18238 -12293 -12722 -12621 -5057 -2514 -12468 -1740 21427 14971 -16585 -28929
25852 -28929 -32882 -16383 646 -41 2051 3866 -6759 -17515 -18597 -15489 -5838 -4334 -16190
25839 -16190 -29972 -13442 -8280 725 -546 5941 7388 17026 30266 26376 8850 1965 6249
25826 6249 16719 9264 -1848 -9692 2323 22671 30964 19365 11262 17177 11455 1832 2550 -3379
25812 -3379 2985 11591 4569 15760 4146 -18425 -25247 -7493 1630 11684 10806 2271 -1674 -2052
25798 -2052 -3861 3634 687 13576 11386 391 -19232 -24832 -20968 -15449 -18639 -9649 -10819 -7905
$$ packed form
25894A5918L33j2727m183M325K0224p432j1563o239p98Q612J154K630J2510J163
25880B3927j8013P236J2397m776j1195j838j405j4761p414N154k198N554J17R918
25866B703q63j0145r933N945m29J01P564K543r954J0728K3167o456l1556j2344
25852b8929l953J6499J7029o87K092J815j0625j0756j082L108R651J504j1856
25839a6190j3782J6530N162R005j271O487J447R638J3240l890j7526o885M284
25826F249J0470p455j1112p844J2015K0348Q293j1599q103N915n722r623P18n929
25812c379O364Q606p022J1191j1614k2571o822J7754R123J0054q78q535l945l78
25798b052j809P495k947J2889k190j0995j9623n600L864N519l190Q990j170K914
$$ plain form
25784 -7905 -1463 -10531 -8529 -6549 8087 297 -10835 -15202 -30138 -29621 -12209 -2863 -2422 3254
25770 3254 16900 14128 20553 11406 12997 18990 14567 16040 8223 10204 14258 13548 10090 6450 5751
25755 5751 6673 15880 3960 -3958 -14660 -736 21475 19532 8099 4234 4191 17213 28633 19182
25741 19182 -769 1168 3345 3392 16716 16367 14719 13236 -1399 -9301 -18958 -13527 5854 7697
25727 7697 -4065 -16381 -18102 -13126 -9066 -8088 -21755 -19508 -8383 -93 2884 16519 10287 -1442
25713 -1442 -10010 -16681 -22788 -20844 -4535 -6978 -11840 -4816 5554 19513 15870 10966 3670 1981
25699 1981 13627 16647 11437 15682 9577 -564 3051 6376 5053 -5451 -13394 -15653 -2712 694
25685 694 -4163 -2990 6530 -2205 -13808 1778 7553 -3469 -453 -6249 -187 5614 18414 27928
$$ packed form
25784g905O442r068K002J980J4636p790j1132m367j4936N17J7412R346M41N676
25770C254J3646k772O425r147J591N993m423J473p817J981M054p10l458l640o99
25755E751R22R207j1920p918j0702J3924K2211j943j1433l865m3J3022J1420r451
25741A9182j9951J937K177M7J3324l49j648j483j4635p902r657N431J9381J843
25727G697j1762j2316j721M976M060R78j3667K247J1125Q290K977J3635o232j1729
25713a442q568o671o107J944J6309k443m862P024J0370J3959l643m904p296j689
25699A981J1646L020n210M245o105j0141L615L325j323j0504p943k259J2941L406
25685F94m857J173R520q735j1603J5586N775j1022L016n796O062N801J2800R514
$$ plain form
25671 27928 15184 3092 -1448 -425 -2938 -10204 -4698 -5246 -4375 -4577 -13069 -18078 -12948 2550
25657 2550 -4234 5407 16852 26284 26519 8058 2632 8750 11165 -3468 -12021 -7857 16196 22617
25643 22617 5434 -3059 1630 4413 3207 13876 13098 -2470 -15419 -18476 -23604 -14746 395
25630 395 10472 4165 -14790 -21570 -11318 -7084 7947 13473 1057 -14466 -17751 -27762 -29159
25617 -29159 -18615 -17857 -20028 -6948 -669 481 -13386 -7068 -3417 -2500 1806 -1036 -4915 9852
25603 9852 16928 2161 -3498 -6750 -7366 2146 -6411 -9352 -5083 -7942 1090 17536 20726 18922
25589 18922 11087 -4576 2083 11452 15640 20427 14899 18773 22026 20830 33434 29417 20690 2781
25575 2781 -5435 7925 -1289 7102 16332 8967 7047 3102 8261 6615 -3873 7143 7731 -1006
$$ packed form
25671B7928j2744j2092m540J023k513p266N506n48Q71k02q492n009N130J5498
25657B550o784R641J1445R432K35j8461n426O118K415j4633q553M164K4053O421
25643B2617j7183q493M689K783j206J0669p78j5568j2949l057n128Q858J5141
25630C95J0077o307j8955o780J0252M234J5031N526j2416j5523l285j0011j397
25617b9159J0544P58k171J3080O279J150j3867O318L651R17M306k842l879J4767
25603I852P076j4767n659l252o16R512q557k941M269k859R032J6446L190j804
25589A8922p835j5663O659R369M188M787n528L874L253j196J2604m017q727j7909
25575B781q216J3360r214Q391R230p365j920l945N159j646j0488J1016N88q737
$$ plain form
25561 -1006 -4 -8534 -3033 1033 397 -8987 -21671 -19803 7546 19660 24637 29974 24865 7388
25547 7388 -4856 -5845 -3849 1433 1183 11373 20227 34419 37306 16682 -6246 -12983 -9749 -12481
25533 -12481 -14837 -12933 -13610 -6262 -2301 2015 1036 -18804 -14251 -14193 -15369 -12408 -13191 -401 140
25518 140 -2933 -155 4013 15699 23033 23464 20748 18560 24624 17882 72 -4237 -10622 -6963 -5569
25503 -5569 -2933 5871 4761 749 -1163 -8236 -3256 -7412 -5422 3781 13533 4421 -3145 3498 1004
25488 1004 -13879 -25165 -20536 -5967 -1092 5321 11854 9500 6547 1002 1406 5326 963 6146
25474 6146 11126 8989 4479 653 -2568 3496 -68 -267 4190 17057 2450 -2735 5773 3069
25460 3069 -11367 -9088 -14327 -25193 -16145 -6046 -6954 -13623 -7782 376 3179 88 -1052 -3843
$$ packed form
25561a006J002q530N501M066o36r384j2684J868K7349J2114M977N337n109j7477
25547G388j2244r89J996N282k50J0190Q854J4192K887k0624k2928o737L234k732
25533a2481k356J904o77P348L961M316r79j9840M553N8j176K961p83J2790N41
25518A40l073K778M168J1686P334M31k716k188O064o742j7810m309o385L659J394
25503e569K636Q804j110m012j912p073M980m156J990R203R752r112p566O643k494
25488A004j4883j1286M629J4569M875O413O533k354k953n545M04L920m363N183
25474F146M980k137m510l826l221O064l564j99M457J2867j4607n185Q508k704
25460C069j4436K279n239j0866R048J0099r08o669N841Q158K803l091j140k791
$$ plain form
25446 -3843 -4201 13247 23369 17003 3442 -8419 -6139 -5579 8103 18051 12756 16114 12779 15792
25432 15792 12262 4831 2523 11062 17825 9701 10963 9223 5300 12471 22766 18283 938 -8902
25418 -8902 -12682 -12717 -6157 3876 -2244 -6993 -8494 1290 10901 4105 -4740 -15303 -993 -3660
25404 -3660 488 9640 11124 11048 6702 9046 22991 18697 3968 -5125 3783 5074 13962 16709 12134
25389 12134 -2973 -10966 -10247 -6723 -8177 5910 10226 2187 -4865 -6472 -8135 -3608 23316 31759
25375 31759 22549 18508 5747 10832 25740 27684 9889 459 1159 7737 8023 13436 13483 9406 4555
25360 4555 1406 4435 -7488 -21249 -32734 -16320 -14510 -28180 -17937 -19210 -9943 431 2800
25347 2800 12061 12039 -7197 -23662 -25264 -17505 -179 9124 13219 19635 33147 38731 41999 41053
$$ packed form
25446c843l58J7448J0122o366j3561j1861K280N60J3682R948n295L358l335L013
25432A5792l530p431k308Q539O763q124J262j740l923P171J0295m483j7345r840
25418h902l780l5O560J0033o120m749j501R784R611o796q845j0563J4310k667
25404c660M148R152J484p6m346K344J3945m294j4729r093Q908J291Q888K747m575
25389A2134j5107p993P19L524j454J4087M316q039p052j607j663M527K6924Q443
25375C1759r210m041j2761N085J4908J944j7795r430P00O578K86N413M7m077m851
25360D555l149L029j1923j3761j1485J6414J810j3670J0243j273R267J0374K369
25347B800R261k2j9236j6465j602P759J7326R303M095O416J3512N584L268r46
$$ plain form
25333 41053 36108 29338 13209 3080 -2563 -6229 -1979 -10195 -1718 12426 12076 25614 30946 5115
25319 5115 -6660 -3447 -4412 4356 3914 -973 4208 7890 12640 16604 19147 12137 13849 7190 -3323
25304 -3323 -3562 -7723 -23714 -25688 -6787 15207 25750 15649 -8242 -15873 -5512 -4453 10675
25291 10675 5532 -15777 -15957 -18135 -17293 -11747 -10811 -12414 -16444 -20955 -17457 -10084 -23296 -20086 -20913
25276 -20913 -9929 11624 4213 -1744 -8507 3478 874 7620 6515 22586 26586 19810 13157
25263 13157 27990 23259 14206 12371 -1296 -16751 -2085 2081 8582 9733 654 2308 -5898
25250 -5898 -9848 -2737 1595 3134 5982 14594 14379 6121 2900 -5131 477 8764 12485 25363 31459
25235 31459 26383 25463 43299 44783 39548 33436 24158 15725 14049 18094 6253 -1592 1303 11113
$$ packed form
25333D1053m945o770j6129j0129n643l666M250q216Q477J4144l50J3538N332k5831
25319E115j1775L213r65Q768m42m887N181L682M750L964K543p010J712o659j0513
25304c323k39m161j5991j974J8901K1994J0543j0101k3891p631J0361J059J5128
25291A0675n143k1309j80k178Q42N546R36j603m030m511L498P373j3212L210q27
25276b0913J0984K1553p411n957o763J1985k604O746j105J6071M000o776o653
25263A3157J4833m731r053j835j3667j5455J4666M166O501J151r079J654q206
25250e898l950P111M332J539K848Q612k15q258l221q031N608Q287L721J2878O096
25235C1459n076r20J7836J484n235o112r278q433j676M045j1841p845K895R810
$$ plain form
25221 11113 11569 -736 -1203 5157 2465 -13400 -12833 -17568 -15809 -7187 15842 19041 7171 -7292
25207 -7292 248 512 -11283 -30133 -26951 -21460 -5479 10963 10208 11428 17267 16941 10470 13441
25193 13441 14594 6162 7559 5292 8243 7153 4702 -15341 -34769 -28956 -15628 -13218 -17332 -12502
25179 -12502 -4433 17 13440 13479 18934 21527 15771 1752 1462 399 5808 13197 23062 14132 1541
25164 1541 -2678 -292 -706 3087 582 4506 19127 30847 25480 14374 7694 18673 15132 11813
25150 11813 17150 16893 15845 16710 13322 12841 20012 17057 13322 17217 7662 -4159 -5056 -5109 -2882 9679
25134 9679 7677 -2222 4158 3783 7030 2300 -4892 -8269 -6087 -1734 920 4171 2842 -1819 -15865
25119 -15865 -13981 -17782 -34322 -41671 -18978 -7055 -6240 4634 18536 19054 6997 12063 13273
$$ packed form
25221A1113M56j2305m67O360k692j5865N67m735J759Q622K3029L199j1870j4463
25207g292P540K64j1795j8850L182N491J5981J6442p55J220N839l26o471K971
25193A3441J153q432J397k267K951j090k451k0043j9428N813J3328K410m114M830
25179a2502Q069M450J3423L9N455K593n756j4019k90j063N409P389R865q930j2591
25164A541m219K386m14L793k505L924J4621J1720n367j1106o680J0979l541l319
25150A1813N337k57j048Q65l388m81P171k955l735L895r555j1821q97n3K227J2561
25134I679k002r899O380l75L247m730p192l377K182M353K654L251j329m661j4046
25119a5865J884l801j6540p349K2693J1923Q15J0874J3902N18j2057N066J210
$$ plain form
25106 13273 50 -5423 3904 -1434 -14940 -20690 -24446 -16961 -5448 16098 6753 -6106 -5904
25093 -5904 6350 13082 1661 -2233 3275 -2873 -16837 -8445 -154 -1837 -865 1355 2859 -5799
25079 -5799 -17639 -14118 -10840 -18456 -26297 -11643 7240 2011 -2693 3409 13936 18138 12717 1427
25065 1427 -10229 -4009 -1670 -9448 -3004 -5499 -11709 -12385 -12535 -2962 -3405 -16739 -11661 -10229 -6095
25050 -6095 -10675 -13193 -12298 -14451 -15375 -13872 -12521 -4617 -13402 -10180 -8919 253 -1664 1559 -6069
25035 -6069 -1294 9311 4734 2789 -1899 2415 3974 6922 4477 5729 10394 5042 10109 11571
25021 11571 5994 8649 -4830 -18626 -19868 -6313 127 -806 15808 11246 16650 15326 3275
25008 3275 -2602 1461 6939 8256 -1103 -13867 -19189 -14499 -5943 -9297 -1054 -11377 -19234 -13212
$$ packed form
25106A3273j3223n473R327n338j3506n750l756P485J1513K1546r345j2859K02
25093e904J2254O732j1421l894N508o148j3964Q392Q291j683R72K220J504q658
25079e799j1840L521L278p616p841J4654J8883n229m704O102J0527M202n421j1290
25065A427j1656O220K339p778O444k495o210o76j50R573m43j3334N078J432M134
25050f095m580k518Q95k153r24J503J351P904q785L222J261R172j917L223p628
25035f069M775J0605m577j945m688M314J559K948k445J252M665n352N067J462
25021A1571n577K655j3479j3796j242J3555O440r33J6614m562N404j324j2051
25008C275n877M063N478J317r359j2764n322M690Q556l354Q243j0323p857O022
$$ plain form
24994 -13212 -6909 15770 22681 23014 20329 3738 -8401 -3767 -1967 -14413 -7456 -8046 -7869 9156
24980 9156 12936 7328 -4196 -13280 -10712 -16088 -17750 -10742 -8446 -10409 -14560 -27173 -29856 -18813
24966 -18813 -5192 -6460 -14854 -14165 -11247 -1141 12647 20674 24142 7957 1251 112 -4070 -1036
24952 -1036 7508 12930 5294 8346 6452 4482 1775 3638 -9335 -14018 1335 11382 1464 1091
24938 1091 -1889 -13182 -9160 6373 17880 6316 7725 3914 -3527 3462 6809 3898 4272 -4752
24924 -4752 -1384 -1153 7038 12693 19731 11673 3671 -2676 -9432 -12232 -279 -585 6043 997 -1823
24909 -1823 -2447 4395 7852 18197 19067 -1593 -17122 -20554 -4149 8399 8157 7521 16228 11469
24895 11469 3028 -10340 -8934 -2622 -1781 818 6168 20402 8916 -4915 -5673 2386 8260 10510
$$ packed form
24994a3212O303K2679O911L33k685j6591j2139M634J800j2446O957n90J77J7025
24980I156L780n608j1524r084K568n376j662P008K296j963m151j2613k683J1043
24966a8813J3621j268q394O89K918J0106J3788Q027L468j6185o706j139m182L034
24952a036Q544N422p636L052j894j970k707J863j2973m683J5353J0047r918l73
24938A091k980j1293M022J5533J1507j1564J409l811p441O989L347k911L74r024
24924d752L368K31Q191N655P038q058q002o347o756k800J1953l06O628n046k820
24909a823o24O842L457J0345Q70k0660j5529l432J6405J2548k42o36Q707m759
24895A1469q441j3368J406O312Q41K599N350J4234j1486j3831p58Q059N874K250
$$ plain form
24881 10510 11164 12906 6511 10505 18744 13404 9063 2625 -1488 1893 366 -8094 -15449 -21447 -19226
24866 -19226 -14267 -4297 2232 -2907 -663 -3228 11732 21411 17474 8798 1505 22 1552 3643
24852 3643 8574 7738 6066 9947 6476 1897 -3055 9072 15714 15370 10849 17649 7370 -20176
24838 -20176 -22876 -13601 4581 2670 6309 2019 -838 -6677 3984 7085 1660 -7701 -14105 -12213
24824 -12213 -10272 -5767 -3081 3703 655 3230 3948 3502 -6344 -7377 -2212 7543 4218 5592 3962
24809 3962 3595 17665 22509 23513 10474 -10251 -22616 -11311 9259 7744 -7489 -17257 -20615
24796 -20615 -10148 -1111 17210 14643 10049 -109 -2806 559 -4237 -865 13226 13320 2965 -796
24782 -796 -5992 -10258 -13721 -4512 400 -4186 -11595 -14492 -23480 -32438 -33863 -33332 -33145 -24819 -24951 -17675
$$ packed form
24881A0510O54J742o395L994Q239n340m341o438m113L381j527q460p355n998K221
24866a9226M959R970O529n139K244k565J4960R679l937q676p293j483J530K091
24852C643M931q36j672L881l471m579m952J2127O642l44m521O800j0279k7546
24838b0176k700R275J8182j911L639m290k857n839J0661L101n425r361o404J892
24824a2213J941M505K686O784l048K575P18m46r846j033N165R755l325J374j630
24809C962l67J4070M844J004j3039k0725j2365J1305K0570j515j5233r768l358
24796b0615J0467R037J8321k567m594j0158k697L365m796L372J4091R4j0355l761
24782g96n196m266l463R209M912m586p409k897q988q958j425N31J87Q326j32P276
$$ plain form
24766 -17675 -3340 753 -6255 -6557 -12792 -10265 -8282 -16163 -18948 -15439 -21796 -25442 -20097 -18816
24752 -18816 -18011 -14189 -16703 -10804 -7204 -6516 999 5946 291 -6482 -6150 2022 11802 6114 1329
24737 1329 4073 -2407 -869 12514 28268 12473 -7325 -14271 -14354 -18019 -19977 -2120 -1201 -6345
24723 -6345 -13345 -12375 12935 14355 4421 2741 6962 2139 -4311 -6284 -5716 5684 -2894 -9705 1813
24708 1813 14325 8127 11962 6528 -11697 -10746 -12889 -2730 20709 12887 -6894 -23741 -27142
24695 -27142 -25850 -18408 -16338 -6892 -7785 -3273 -2670 -9528 -18962 -26692 -26279 -15806 -16633 -16797 -20064
24680 -20064 -12801 -17176 -12454 -11302 -16414 -7011 -319 -4685 1691 -467 -11016 -7147 -14253 -17070
24666 -17070 -11892 -6571 -7853 -7763 -6592 -6992 -14240 -12057 -15947 -15802 4385 14651 11501 18961 12935
$$ packed form
24766a7675J4335M093p008l02o235K527J983p881k785L509o357l646N345J281
24752a8816Q05L822k514N899L600O88P515M947n655o773L32Q172R780n688m785
24737A329K744o480J538J3383J5754j5795j9798o946q3l665j958J7857R19n144
24723f345p000R70K5310J420r934j680M221m823o450j973N68J1400q578o811J1518
24708A813J2512o198L835n434j8225R51k143J0159K3439p822j9781j6847l401
24695b7142J292P442K070R446q93M512O03o858r434p730M13J0473q27j64l267
24680b0064P263m375M722J152n112R403O692m366O376k158j0549L869p106k817
24666a7070N178N321j282R0J171m00p248K183l890J45K0187J0266l150P460o026
$$ plain form
24651 12935 15489 8186 -7167 -4235 -591 -3152 5811 887 -18437 -14055 -9214 -7532 -18848 -26800
24637 -26800 -14272 -7190 2882 11644 2447 -10371 -13478 -985 8070 6705 -262 10889 22450
24624 22450 28704 26594 20785 6465 -10816 -7776 5946 5383 4643 6707 6461 -3830 -924 16181
24610 16181 27202 30686 16532 421 -6775 1809 -1370 -5376 -1292 -3378 1437 9261 -922
24597 -922 -19430 -18466 -3884 -3568 8921 10984 11121 -1421 -7409 -23205 -27349 -16395 -11946 -7923
24583 -7923 -9916 -5559 4698 -6196 -9603 -919 13362 14356 11668 6395 2179 10638 8838 12779
24569 12779 21361 20051 13459 16917 10163 11629 5603 6776 14656 7339 -3359 8246 2306 -17871
24555 -17871 -19530 -14269 -11102 -1117 2322 -748 2175 751 6510 7166 12908 12044 -684 -745 3952
$$ packed form
24651A2935K554p303j5353K932L644k561Q963m924j9324M382M841J682j1316p952
24637b6800J2528P082J0072Q762r197j2818l107J2493R055j365o967J1151J1561
24624B2450O254k110n809j4320j7281L040J3722n63p40K064k46j0291K906J7105
24610A6181J1021L484j4154j6111p196Q584l179m006M084k086M815P824j0183
24597i22j8508R64J4582L16J2489K063J37j2542n988j5796m144J0954M449M023
24583g923j993M357J0257j0894l407Q684J4281R94k688n273m216Q459j800L941
24569A2779Q582j310o592L458o754J466o026J173P880p317j0698J1605n940k0177
24555a7871j659N261L167R985L439l070K923j424N759O56N742q64j2728o1M697
$$ plain form
24540 3952 3634 6030 -12968 -8686 3175 4510 20934 23379 24778 27537 25311 15718 7001 -1180
24526 -1180 11790 18521 20906 18354 9918 22753 19960 7231 5576 16799 14746 -982 -4667
24513 -4667 -103 -8587 -25040 -27826 -2628 11697 7598 1839 -3299 -7042 -9712 15 344 -5535
24499 -5535 -951 5022 -11397 -19284 -3144 -3539 -9109 408 996 14386 13269 -5558 -13193 -10743
24485 -10743 3100 -649 -6085 -2193 2704 2189 3111 951 -2241 9277 13258 8539 23103 37761
24471 37761 39203 27349 6667 9134 11837 -7753 -9175 2009 8356 9870 4710 -7171 -15446
24458 -15446 -5915 509 -7080 -6832 -7519 -10127 -13020 -3587 15849 22022 9315 7144 19346 21228
24444 21228 6164 -10935 -27155 -28890 -14429 5113 4810 -6411 -5128 -992 4160 4531 -730
$$ packed form
24540C952l18K396j8998M282J1861J335J6424K445J399K759k226r593q717q181
24526a180J2970O731K385k552q436J2835k793j2729j655J1223k053j5728l685
24513d667M564q484j6453k786K5198J4325m099n759n138l743k670R727L29n879
24499e535M584N973j6419p887J6140l95n570R517N88J3390j117j8827p635K450
24485a0743J3843l749n436L892M897n15R22k160l192J1518L981m719J4564J4658
24471C7761J442j1854k0682K467K703j9590j422J1184O347J514n160j1881q275
24458a5446R531O424p589K48o87k608k893R433J9436O173j2707k171J2202J882
24444B1228j5064j7099j6220j735J4461J9542l03j1221J283M136N152L71n261
$$ plain form
24431 -730 -16913 -16659 -15995 -23470 -14848 -5573 -14552 -12368 608 8639 8230 1455 1208 -2208 -9673
24416 -9673 -20064 -8475 -1310 -5920 -4730 -8312 -5517 -4772 -2633 -4445 -4834 230 1650 1229 -2519
24401 -2519 -6542 -15053 -14196 4503 12663 15327 4736 11952 16032 5275 4846 -649 10016 22385
24387 22385 16873 16537 9348 -855 8517 998 -6909 -5518 -6763 -2857 1561 10658 12055 2110
24373 2110 -10012 -17305 -23883 -31866 -19196 -519 14245 9705 3652 -329 -4860 -3106 4075 8443
24359 8443 13970 8531 -8138 -12252 -21936 -10210 1527 3799 1284 12476 21676 16082 6093 -3129
24345 -3129 5695 5818 1114 -4712 -5158 -16507 -17601 -6660 2957 -1037 -17086 -9968 4138 2093
24331 2093 14790 6076 3798 -1803 216 -1858 -13364 -16036 -2566 -9006 -8428 7398 9734 2418
$$ packed form
24431g30j6183K54O64p475Q622R275q979K184J2976Q031m09o775k47l416p465
24416i673j0391J1589P165m610J190l582K795P45K139j812l89N064J420m21l748
24401b519m023q511Q57J8699Q160K664j0591P216M080j0757m29n495J0665J2369
24387B2385n512l36p189j0203R372p519p907J391j245L906M418R097J397r945
24373B110j2122p293o578p983J2670J8677J4764m540o053l981m531J754P181M368
24359H443N527n439j6669m114r684J1726J1737K272k515J1192R200n594r989r222
24345c129Q824J23m704n826m46j1349j094J0941R617l994j6049P118J4106k045
24331B093J2697q714k278n601K019k074j1506k672J3470o440N78J5826K336p316
$$ plain form
24317 2418 6220 7294 7010 -6630 -8713 -3866 143 5629 4369 23747 24751 11518 -123 -9219
24303 -9219 -12124 -11035 -15799 -3669 -6532 -6977 -3480 -10316 7098 12394 7790 4754 1661 -211
24289 -211 1203 2094 -465 596 85 -11781 -14184 -413 -1809 -7765 16869 24899 15830 1922
24275 1922 3387 16132 22327 18283 6670 -7118 -16868 -18597 -9774 -1931 11622 18335 5076
24262 5076 -6792 -9449 -21756 -27275 -27288 -12208 6218 440 -5490 -12119 -12519 -13977 -14000 619 -4136
24247 -4136 -8975 -11564 -2525 9010 6136 -10870 -2805 9621 14345 17531 16417 19622 23327 9419
24233 9419 -3045 3962 1184 -8843 -21231 -19092 -23047 -23861 -31557 -29004 -14713 -15532 -18961 -23373
24219 -23373 -27023 -20129 -12929 -13402 -31880 -24814 -13145 -11353 -22427 -24330 -780 -5713 -19266
$$ packed form
24317B418L802J074k84j3640k083M847M009N486j260J9378J004j3233j1641r096
24303i219k905J089m764J2130k863m45L497o836J7414N296m604l036l093j872
24289b11J414Q91k559J061n11j1866k403J3771j396n956K4634Q030r069j3908
24275A922J465J2745O195m044j1613j3788r750j729Q823P843J3553O713j3259
24262E076j1868k657j2307n519j3J5080J8426n778n930o629m00j458k3J4619m755
24247d136m839k589R039J1535k874j7006Q065J2426M724L186j114L205L705j3908
24233I419j2464P007k778j0027j2388K139l955q14p696K553J4291q19l429m412
24219b3373l650O894P200m73j8478P066J1669J792j1074j903K3550m933j3553
$$ plain form
24206 -19266 -12301 1074 3290 -3005 464 -11739 -11194 -8276 -8210 -6543 -22274 -32499 -26158 -15128
24192 -15128 -5804 -1196 7991 5197 2039 -661 -7333 -8967 -8173 3862 9458 -5481 -11807 -10717
24178 -10717 -7820 3476 3166 11803 17596 20264 5835 1276 11897 11650 7048 -1241 -8619 -11283
24164 -11283 -13316 -358 2941 2449 12915 18745 21123 20769 6859 1200 9101 5443 -11560 -10963
24150 -10963 -5849 -9488 -399 16498 18130 32997 28659 20672 15356 -2875 -14927 -19009 -22643
24137 -22643 -13455 1636 -3414 -2834 2607 1394 -9762 -8094 1244 -5925 -51 7824 23240 18010
24123 18010 -4255 -10080 -500 10852 26828 25994 20451 8259 13966 17622 19142 15468 3912
24110 3912 6769 2909 -3444 -6367 -3546 7084 -965 -21244 -19390 -14501 -6958 -6474 -22199 -16831
$$ packed form
24206a9266O965J3375K216o295L469j2203N45K918O6J667j5731j0225O341J1030
24192a5128R324M608R187k794l158k700o672j634P94J2035N596j4939o326J090
24178a0717K897J1296l10Q637N793K668j4429m559J0621k47m602q289p378k664
24164a1283k033J2958L299m92J0466N830K378l54j3910n659P901l658j7003N97
24150a0963N114l639R089J6897J632J4867m338p987n316j8231j2052m082l634
24137b2643R188J5091n050N80N441j213j1156J668R338p169N874P875J5416n230
24123A8010k2265n825R580J1352J5976q34n543j2192N707L656J520l674j1556
24110C912K857l860o353k923K821J0630q049k0279J854M889P543M84j5725N368
$$ plain form
24096 -16831 6879 10366 1473 5555 -4567 -1705 14884 10846 6463 4828 1399 5893 7473 11600
24082 11600 18340 12699 -14009 -38232 -29987 -20026 -16651 2953 13504 2215 -2765 4546 4022
24069 4022 -378 5671 14095 6911 4548 -5074 -18755 -17749 -24734 -20995 -15034 -13521 -9208 -5260
24055 -5260 -7234 -15575 -25145 -26138 -5259 -2150 -1977 -110 10273 15959 14209 1743 7821 1518
24041 1518 -6971 -14698 -10660 -7465 -12604 -5511 -6564 -4791 -3285 -4721 -763 15178 1092 -17165
24027 -17165 -21328 -15516 -8607 -9770 -20019 -6924 9762 12568 9199 5554 1523 -11662 -16227
24014 -16227 -170 9162 -2835 -14479 -21567 -23378 -13278 -3442 10941 20704 2019 -8960 -7558
24001 -7558 5158 2113 9707 24538 13107 4846 978 4502 9208 -4854 -17843 -18288 -16539 -17888
$$ packed form
24096a6831K3710L487q893M082j0122K862J6589m038m383j635l429M494J580M127
24082A1600O740n641k6708k4223Q245R961L375J9604J0551j1289m980P311n24
24069D022m400O049Q424p184k363r622j3681J006o985L739N961J513M313L948
24055e260j974q341r570r93K0879L109J73J867J0383N686j750j2466O078o303
24041A518q489p727M038L195n139P093j053J773J506j436L958J5941j4086j8257
24027a7165m163N812O909j163j0249J3095J6686K806l369l645m031j3185m565
24014a6227J6057R332j1997j1644p088j811J0100R836J4383R763j8685j0979J402
24001g558J2716l045P594J4831j1431q261l868L524M706j4062j2989m45J749j349
$$ plain form
23987 -17888 -17783 -17151 -4651 9973 4477 -5095 -9224 10052 12062 10825 -4156 -10536 -17502 -18082
23973 -18082 -7835 -5298 -8529 -8843 5514 2945 3224 3454 2760 4746 -149 1449 6582 457 -2630
23958 -2630 955 -1579 -5713 45 2918 150 -2755 -814 7373 13537 6213 -2960 4593 11312 6999
23943 6999 6618 3439 3799 5343 4892 5975 -11688 -17681 -21271 -20559 -10499 -828 43 11916 14278
23928 14278 7409 13635 3486 -4784 5668 6217 4118 1838 -4685 -12720 -7610 1486 -1946 -11339
23914 -11339 -13043 -5071 -5601 -7608 4469 7115 -660 3762 258 -1549 1745 -9415 -19846 -10386
23900 -10386 -4717 -1546 -5503 2884 1204 -16794 -19364 -14016 -14473 -9747 229 2116 5323 -14803
23886 -14803 -21046 -19102 -17817 -28104 -25732 -21974 -19471 -13358 -6946 -16247 -9299 -3455 -3673 -6778
$$ packed form
23987a7888J05O32J2500J4624n496r572m129J9276K010j237j4981o380o966n80
23973a8082J0247K537l231l14J4357k569K79K30o94J986m895J598N133o125l087
23958b630L585k534m134N758K873k768k905J941Q187O164p324r173P553O719m313
23943F999l81l179L60J544m51J083j7663n993l590P12J0060R671Q71J1873K362
23928A4278o869O226j0149q270J0452N49k099k280o523q035N110R096l432r393
23914a1339j704P972n30k007J2077K646p775M422l504j807L294j1160j0431R460
23900a0386N669L171l957Q387j680j7998k570N348m57M726R976J887L207k0126
23886a4803o243J944J285j0287K372L758K503O113O412r301O948N844k18l105
$$ plain form
23872 -6778 2539 5631 -4738 -8685 -18567 -31216 -37414 -35133 -15230 -11438 -16860 -3401 3901 -13235
23858 -13235 -20530 -16050 2964 4402 -14473 -9834 -1914 -13330 -20815 -23828 -21136 -20090 -13558 -6297
23844 -6297 -13290 -14115 -8304 -975 -924 988 7596 5957 4830 3506 4710 8267 4902 5573 7250 18559
23828 18559 20043 8933 -1641 -11781 -6754 -2870 -10752 -2750 -3936 -2569 -2840 4369 -58 -3038
23814 -3038 -5307 -1977 -7940 -3022 6482 11436 7946 5365 2720 -2641 -11185 -6356 1756 -1125 2079
23799 2079 -7563 -13141 394 18073 25130 13389 9691 8823 17926 16384 7111 -1117 -3956 -21214
23785 -21214 -23858 -22788 -768 1872 1332 -11416 -5848 -2285 28 4621 -5854 -12392 -6640 -4223
23771 -4223 -6155 -27814 -28075 -14650 -10132 -9770 -5691 -3133 10420 4991 -2810 -13310 -36994 -32191
$$ packed form
23872f778R317L092j0369l947r882j2649o198K281J9903L792n422J3459P302j7136
23858a3235p295M480J9014J438j8875M639P920j1416p485l013K692J046O532P261
23844f297o993q25N811P329N1J912O608j639j127j324J204L557l365O71J677J1309
23828A8559J484j1110j0574j0140N027L884p882Q002j186J367k71P209m427k980
23814c038k269L330n963M918R504M954l490k581k645n361q544M829Q112k881L204
23799B079r642n578J3535J7679P057j1741l698q68R103j542r273q228k839j7258
23785b1214k644J070K2020K640n40j2748N568L563K313M593j0475o538N752K417
23771d223j932k1659k61J3425M518L62M079K558J3553n429p801j0500k3684M803
$$ plain form
23757 -32191 -22814 -19276 -18912 -24361 -19497 -9294 -3678 -4310 -3081 2842 7245 706 -10116 -19761
23743 -19761 -21715 -15538 -793 213 -3699 -729 -2722 -1883 -4894 -8993 -4463 2734 -1769 704
23729 704 4758 -1364 3134 2239 -11002 -22798 -20795 -7559 3772 4309 7652 -6469 -15276 -11805
23715 -11805 -3299 6511 -2959 3503 5223 -7866 -546 -2896 -9246 -12384 -11848 -2122 3549 -3156
23701 -3156 -3025 -3873 -1322 810 -4265 -6660 -5850 -20746 -11958 4815 3002 44 -13030 -7599 305
23686 305 12783 6632 -95 4166 4582 10586 24768 13234 9152 6554 17296 9972 5360 1191
23672 1191 -3772 -2668 -2002 -2688 -5663 3044 -2370 3372 6818 15703 8380 12437 16075 14342 658
23657 658 -6157 -17160 -13877 -1457 8264 12451 4728 3837 6790 7924 -3294 -6840 -13674 -6712
$$ packed form
23757c2191R377L538L64n449M864J0203N616o32J229N923M403o539j0822r645
23743a9761j954O177J4745J006l912K970j993Q39l011m099M530P197m503K473
23729G04M054o122M498q95j3241j1796K003J3236J1331N37L343j4121q807L471
23715a1805Q506R810r470O462J720j3089P320k350o350l138N36R726N671o705
23701c156J31q48K551K132n075k395Q10j4896Q788J6773j813k958j3074N431P904
23686C05J2478o151o727M261M16O004J4182j1534m082k598J0742p324m612m169
23672A191m963J104O66o86k975Q707n414N742L446Q885p323M057L638j733j3684
23657F58o815j1003L283J2420R721M187p723q91K953J134j1218l546o834O962
$$ plain form
23643 -6712 -1968 -10454 -12271 -8895 129 2670 5229 13375 23087 21883 26639 20081 9918 4280
23629 4280 2505 8776 9713 10987 -648 5603 10318 1778 2858 6832 3119 -8467 -2117 754
23615 754 4977 6427 6387 12283 6327 4300 18262 15451 14223 5806 -6458 -9284 -9191 667 2730
23600 2730 18188 19353 14363 7405 13061 25263 9381 -1461 -2090 9910 11359 11374 10873 591
23586 591 -8891 -7560 4802 9301 -4429 -6723 2216 -2469 -16044 -15508 4423 6354 -4733 -15121
23572 -15121 -10272 7476 10403 7295 9071 9072 8805 4379 192 8749 5348 -6013 1689 7669 3857
23557 3857 2806 5954 11596 14611 28393 35791 23832 -2233 -10738 -16161 -6419 14880 19313 22487
23543 22487 5172 912 8341 9207 4822 2527 -3057 -5566 -1498 -252 2337 1053 -3643 -13269
$$ packed form
23643f712M744q486j817L376R024K541K559Q146R712j204M756o558j0163n638
23629D280j775O271R37J274j1635O251M715q540J080L974l713j1586O350K871
23615G54M223J450m0N896n956k027J3962k811j228q417j2264k826R3R858K063
23600B730J5458J165m990o958N656J2202j5882j0842o29J2000J449J5n01j0282
23586E91r482J331J2362M499j3730k294Q939m685j3575N36J9931J931j1087j0388
23572a5121M849J7748K927l108J776Jk67m426m187Q557l401j1361P702N980l812
23557C857j051L148N642L015J3782P398j1959k6065q505n423R742K1299M433L174
23543B2487j7315m260P429Q66m385k295n584k509M068J246K589j284m696r626
$$ plain form
23529 -13269 2583 285 6186 10414 10529 12364 8658 14150 28064 6011 -10318 -5873 -709 4503
23515 4503 7142 9318 -3201 -9271 -7245 -10233 2643 3716 -74 -1867 1017 -4501 -11709 -24669
23501 -24669 -22223 -24577 -18797 -4821 -5395 -5662 3184 14979 18642 17530 9249 -4419 -16803 -17542
23487 -17542 -24106 -17863 -10780 -1618 -4237 -13049 -16614 -24218 -15896 -24471 -6696 4613 2201 -10765
23473 -10765 -3247 -1528 -19623 -21282 -11104 -1393 -11953 -18367 -20830 -19868 -13598 -11889 -10692 660
23459 660 2801 -3840 -9156 8333 13595 6739 4516 6881 1609 -1211 -7497 -8300 -12435 -11153 -457
23444 -457 9710 15385 18098 7663 10076 11137 12527 4878 -4130 -17818 -17838 -14213 -6313 -8152 -16566
23429 -16566 -8754 -3648 -9466 -4681 -1738 3972 -18485 -21716 -9353 8827 16091 16919 17647 15322
$$ packed form
23529a3269J5852k298N901M228J15J835l706N492J3914k2053j6329M445N164N212
23515D503K639K176j2519o070K026k988J2876J073l790j793K884n518p208j2960
23501b4669K446k354N780J3976n74k67Q846J1795L663j112q281j3668j2384p39
23487a7542o564O243P083R162k619q812l565p604Q322q575J7775J1309k412j2966
23473a0765P518J719j8095j659J0178R711j0560o414k463R62O270J709J197J1352
23459F60K141o641n316J7489N262o856k223K365n272k820o286q03m135J282J0696
23444d57J0167N675K713j0435K413J061J390p649r008j3688k0L625P900j839q414
23429a6566P812N106n818M785K943N710k2457l231J2363J8180P264Q28P28k325
$$ plain form
23415 15322 16203 11926 102 150 -10073 -2539 -2262 -7605 -15841 -5147 -4061 -8741 -191 -2392 -6785
23400 -6785 -4959 -634 -6963 -23228 -17697 -9260 -15495 -18162 -4270 -4965 -8830 -22196 -19487 -10103
23386 -10103 1875 -4691 -10239 -22425 -11872 1232 -848 4573 3741 3262 2294 833 9345 11400
23372 11400 -8872 -20113 -6331 4651 10672 7947 -554 -6562 -19831 -26803 -16515 -12479 -5085
23359 -5085 -10223 -21393 -26205 -22478 -15180 -8574 -17507 -26540 -12866 -4469 -7474 -2767 -14352 -25150
23345 -25150 -17118 -5933 11799 16394 12457 11316 14127 4571 -3777 -12516 -22785 -21434 -10152
23332 -10152 -9956 -21869 -31700 -9664 -6604 -15225 -12770 -8838 -12386 -19081 -28460 -31834 -31038 -30814 -25177
23317 -25177 -13174 1770 3771 3050 1251 -12778 -9199 7758 535 -7429 -9585 -13710 -11603 -8287
$$ packed form
23415A5322Q81m277j1824M8j0223P534K77n343q236J0694J086m680Q550k201m393
23400f785J826M325o329j6265N531Q437o235k667J3892o95l865j3366K709R384
23386a0103J1978o566n548j2186J0553J3104k080N421q32m79r68j461Q512K055
23372A1400k0272j1241J3782J0982O021k725q501o008j3269o972J0288M036P394
23359e085n138j1170m812L727P298O606q933r033J3674Q397l005M707j1585j0798
23345b5150Q032J1185J7732M595l937j141K811r556q348q739j0269J351J1282
23332a0152J96j1913r831K2036L060q621K455L932l548o695r379l374P96K24N637
23317b5177J2003J4944K001p21j799j4029L579J6957p223p964k156m125K107L316
$$ plain form
23303 -8287 -1987 -12758 -27167 -16337 -6667 -9969 73 9143 4900 -7272 3697 19438 22639
23290 22639 12950 15453 5651 86 4836 6234 7097 4355 4198 18784 19765 2760 -1807 -6011 -8350
23275 -8350 -6342 -7154 -6701 -10210 2138 6055 3589 9844 8808 9277 14270 6388 -3284 2138 -4762
23260 -4762 -14645 -17671 -14341 -11461 -3116 -1086 9704 6428 11754 18955 36032 33879 22081 22886
23246 22886 10544 4496 -4129 -14609 -2882 -2518 -25144 -15741 -702 -2591 -7984 -3517 7841
23233 7841 7867 14744 5556 -6757 -3369 5956 6144 -47 -673 14069 24993 12500 -1202 551
23219 551 -43 -3352 -14416 -17138 -29712 -30632 -36139 -23280 -8826 1144 9890 10743 6225 1784 3238
23204 3238 11460 2899 7188 4957 8605 18032 12634 5612 7543 15188 10966 -2083 -2866 12946
$$ packed form
23303h287O300j0771j4409J0830R670l302J0042R070m243j2172J0969J5741L201
23290B2639r689K503r802n565M750J398Q63k742j57J4586R81j7005m567m204k339
23275h350K008q12M53l509J2348L917k466O255j036M69M993p882r672N422o900
23260d762r883l026L330K880Q345K030J0790l276N326P201J7077k153j1798Q05
23246B2886j2342o048q625j0480J1727L64k2626R403J5039j889n393M467J1358
23233G841K6O877r188j2313L388R325J88o191o26J4742J0924j2493j3702J753
23219E51n94l309j1064k722j2574r20n507J2859J4454R970Q746Q53m518m441J454
23204C238Q222q561M289k231L648R427n398p022J931P645m222j3049p83J5812
$$ plain form
23190 12946 14614 11520 12547 19851 28266 22188 20535 10745 -5046 -6862 -3924 -238 -4961 -12654
23176 -12654 -17340 -4115 -587 -4843 1025 9301 7096 -10414 -12730 -7241 -10644 -9672 4107 9275
23162 9275 2946 -6972 -4992 5956 -255 5903 10622 11535 11959 18119 24434 23305 16733 2725 4549
23147 4549 13732 15069 12513 -7048 -9991 -3698 -4215 -9158 -8203 -16955 -17849 -14342 -3622 -4399 1220
23132 1220 -3379 -339 3188 2602 4856 -675 -15807 -15271 -1113 1675 -2670 -5268 -12887 -14401 -14474
23117 -14474 1023 18989 7249 -12863 -12116 5011 7103 3796 5312 -11630 -14248 -12966 -9612
23104 -9612 -6513 -13991 -14030 -12523 -13467 -3741 9537 4043 1333 -9277 -17813 -17660 -18418 2265 2764
23089 2764 -10975 -27004 -21624 -27711 -25611 -9734 -1064 -3230 -2002 -1832 9146 7251 12851 8143
$$ packed form
23190A2946J668l094J027P304Q415o078j653r790j5791j816K938L686m723p693
23176a2654m686J3225L528m256N868Q276k205j7510k316N489l403R72J3779N168
23162I275o329r918J980J0948o211O158M719R13M24O160O315j129o572j4008J824
23147D549R183J337k556j9561k943O293n17m943R55q752q94L507J0720p77N619
23132A220m599L040L527n86K254n531j5132N36J4158K788m345k598p619j514p3
23117a4474J5497J7966j1740k0112P47J7127K092l307J516j6942k618J282L354
23104i612L099p478l9J507r44R726J3278n494k710j0610q536J53p58K0683M99
23089B764j3739j6029N380o087K100J5877Q670k166J228J70J0978j895N600m708
$$ plain form
23075 8143 11435 14227 14877 15888 3558 8570 4946 -4291 -2275 1081 3669 2501 -12575 -11961 -3631
23060 -3631 -2200 -2216 -3529 -5726 -16517 -12305 -5376 -12217 -19500 -12504 3215 -2093 -6094 3308 78
23045 78 10698 20977 16536 15638 14431 -5200 -7025 -7063 -763 3180 -7590 -4454 -17253 -20728 -14520
23030 -14520 -17245 2689 -301 8644 13078 25601 17705 653 -10212 -16770 -19300 -18500 -11188 -7254
23016 -7254 -12455 -14207 -9733 -2791 4418 -2010 -5483 -4818 -4170 -14609 -4395 -4010 -7709 6948 20290
23001 20290 12446 11832 11870 11087 5575 14983 13574 -3247 -2484 3298 -3383 -13249 -12186 -2752 6034
22986 6034 646 -4622 3228 4408 5195 3313 -172 -8255 -18529 -22917 -13136 -1239 6553 5941 2413
22971 2413 3736 15563 17818 15218 12635 -9201 -1289 8772 10126 7755 1319 564 -4543 -2495
$$ packed form
23075H143L292K792O50J011j2330N012l624r237K016L356K588j168j5076O14Q330
23060c631J431j6j313k197j0791M212O929o841p283O996J5719n308m001R402l230
23045G8J0620J0279m441q98j207j9631j825l8O300L943j0770L136j2799l475O208
23030a4520k725J9934k990Q945M434J2523p896j7052j0865o558k530Q00P312L934
23016g254n201j752M474O942P209o428l473O65O48j0439J0214L85l699J4657J3342
23001B0290p844o14L8p83n512R408j409j6821P63N782o681r866J063R434Q786
22986F034n388n268P850J180P87j882l485q083j0274m388R781J1897P792o12l528
22971B413J323J1827K255k600k583k1836P912J0061J354k371o436p55n107K048
$$ plain form
22957 -2495 -9762 -8059 103 -8491 -9087 -12755 -4374 7607 8727 94 -2692 -2712 -1317 8740 5491
22942 5491 -5238 -5196 -1611 1726 7133 -6931 -6548 7763 10689 15439 -1655 -2959 48 1513
22928 1513 936 -2900 2308 6652 4379 -6631 -11756 -25039 -11252 -14322 -2843 7213 26166
22915 26166 47723 44967 31112 25702 10783 8819 7048 6816 7824 11782 17090 13591 1358 -13903
22901 -13903 -12918 -7293 -8071 -12541 -5198 -5150 -5724 -4890 3940 -2024 -14456 -17341 -19358 -14739 -8381 3582
22885 3582 -3024 -10704 -1740 -7348 -6359 -4951 3094 2824 -11221 -12462 -5681 3080 3115 6547 19619
22870 19619 15745 11923 11082 8605 3608 2069 8990 -10384 -15797 -7015 -4303 -12372 -10048 1095
22856 1095 -6495 -5538 -7689 6265 19781 16182 719 2574 10664 14893 -5047 -9026 -10934 -18720
$$ packed form
22957b495p267J703Q162q594n96l668Q381J1981J120q633k786k0J395J0057l249
22942E491j0729M2L585L337N407j4064L83J4311K926M750j7094j304L007J465
22928A513n77l836N208M344k273j1010n125j3283J3787l070J1479J0056J8953
22915B6166K1557k756j3855n410j4919j964j771k32J008L958N308l499j2233j5261
22901a3903R85N625p78m470P343M8n74Q34Q830n964j2432k885k017M619O358J1963
22885C582o606p680Q964n608R89J408Q045k70j4045j241O781Q761L5L432J3072
22870A9619l874l822q41k477m997j539O921j9374n413Q782K712q069K324J1143
22856A095p590R57k151J3954J3516l599j5463J855Q090M229j9940l979j908p786
$$ plain form
22842 -18720 -9740 5349 1006 -6531 -22345 -26568 -16805 -4941 -4852 -7648 -9449 -7525 6111 20379
22828 20379 21170 22187 22225 23272 2656 -6510 -5227 4541 -7108 -2945 4840 -1312 -4948 3893 -4028
22813 -4028 -14157 -9193 -2893 -368 4905 -4479 -18743 -17270 -15882 -13952 -13402 -6647 -7639 -17979
22799 -17979 -22694 -28586 -36563 -31577 -21943 -14780 -15748 -22208 -21290 -23082 -20791 -15663 -22134 -15689 -4113
22784 -4113 6763 2363 -619 1569 -5912 -8438 -11713 -21410 -23850 -21849 -14623 -9307 162 7125
22770 7125 9162 31480 34386 27298 27997 18504 32071 31083 29734 24389 7975 -10267 -15541 -12657
22756 -12657 -17313 -5869 1956 1688 -7209 -5141 -15305 -22628 -12702 4361 8476 13576 13727 1932
22742 1932 -3656 -987 9139 22353 22514 16942 7931 -6397 -2238 4076 -10520 -9838 -1498 -1593 9451
$$ packed form
22842a8720Q980J5089m343p537j5814m223R763J1864Q9k796j801J924J3636J4268
22828B0379P91J017L8J047k0616r166J283R768j1649M163P785o152l636Q841p921
22813d028j0129M964O300K525N273r384j4264J473J388J930N50O755r92j0340
22799a7979m715n892p977M986R634P163r68o460R18j792K291N128o471O445J1576
22784d113J0876m400k982K188p481k526l275r697k440K001P226N316R469O963
22770G125K037K2318K906p088O99r493J3567r88j349n345j6414j8242n274K884
22756a2657m656J1444P825k68q897K068j0164p323R926J7063M115N100J51j1795
22742A932n588K669J0126J3214J61n572r011j4328M159O314j4596O82Q340r5J1044
$$ plain form
22727 9451 29136 34741 46367 41266 37922 34165 24811 19497 7811 7051 10214 1552 -14366 -9351
22713 -9351 4304 2032 -4034 -7933 4321 -8675 -14847 -12288 -13739 -8131 8359 20299 11313
22700 11313 9783 708 -8147 -16750 -26788 -28247 -18256 -9272 -1573 -8645 -9512 -12177 -5813 3109
22686 3109 9494 17786 12263 4627 -596 4236 6202 9795 15645 20377 17864 1792 -4112 5529
22672 5529 16545 8985 4032 459 -6967 -7672 -3943 537 9630 16232 15082 9518 1451 -8920
22658 -8920 -11119 -4421 -6405 -6593 -3732 -2085 2769 13400 -312 -5047 -834 -2947 -1751 -1482 -7709
22643 -7709 -13608 -17381 -13803 -14276 -1991 -9642 -12490 -1289 9094 10850 7734 -388 -5447 -5557
22629 -5557 2670 -4315 1221 1551 -2677 2001 -3832 -6628 -260 25594 30819 8697 1750 4902
$$ packed form
22727I451J9685N605J1626n101l344l757r354n314j1686p60L163q662j5918N015
22713i351J3655k272o066l899J2254j2996o172K559j451N608J6490J1940q986
22700A1313j530r075q855q603j0038j459R991Q984P699p072q67k665O364Q922
22686C109O385Q292n523p636n223M832J966L593N850M732k513j6072n904R641
22672E529J1016p560m953l573p426p05L729M480R093O602j150n564q067j0371
22658h920k199O698j984j88K861J647M854J0631j3712m735M213k113J196K69o227
22643g709n899l773L578m73J2285p651k848J1201J0383J756l116q122n059j10
22629e557Q227o985N536L30m228M678n833k796O368K5854N225k2122o947L152
$$ plain form
22615 4902 -6773 -20651 -12900 1135 6048 -4200 -3318 -3870 -705 -2256 1031 -525 17872 30106
22601 30106 25890 13263 -12567 -8145 7125 11723 13240 12056 6729 -2994 -2682 -6609 -20343 -11050
22587 -11050 -9078 -12404 1742 2996 -4345 2417 -6604 -5100 -580 4876 4968 -10565 -5982 -852
22573 -852 -4319 -10877 -20883 -18634 -15731 -17858 -22720 -20681 -22870 -11175 -10373 17086 28987 19204
22559 19204 7889 7000 9818 9016 12109 12252 -1408 -12194 -23707 -36069 -32388 -15739 -3207
22546 -3207 1216 -9569 -9473 -7796 -4404 -4488 2421 3532 -168 -21174 -21824 -26755 -11690 -6859 1821
22531 1821 3538 6802 -87 5740 6054 -3784 -7281 484 10258 32293 46188 49021 35562 12971
22517 12971 -20 -13729 -8383 -21931 -28265 -20012 -18521 -2738 -2077 -3087 -5836 -9812 -3895 5129
$$ packed form
22615D902j1675j3878P751J4035M913j0248Q82n52L165j551L287j556J8397J2234
22601C0106m216j2627k5830M422J5270M598J517j184n327r723L12l927j3734R293
22587a1050J972l326J4146J254p341O762r021J504M520N456R2j5533M583N130
22573h52l467o558j0006K249K903k127m862K039k189J1695Q02K7459J1901r783
22559A9204j1315q89K818q02L093J43j3660j0786j1513j2362L681J6649J2532
22546c207M423j0785R6J677L392q4O909J111l700k1006o50m931J5065M831Q680
22531A821J717L264o889N827L14r838l497P765R774K2035J3895K833j3459k2591
22517A2971j2991j3709N346j3548o334Q253J491J5783O61j010k749l976N917R024
$$ plain form
22503 5129 5996 5817 6656 -2558 989 -16973 -26023 -20604 -17088 -23028 -30084 -25690 -12773 -3796 -5737
22488 -5737 -17948 -25151 -4840 11287 17731 5792 -6758 -17518 -16173 -16727 -13498 1967 2530
22475 2530 4543 10399 7493 5250 8526 5170 4801 13161 12924 -4237 -2272 -6554 950 20419 17421
22460 17421 4197 15529 10171 7578 -916 -44 -3896 -10630 -9566 5122 23370 33727 15987
22447 15987 -8282 -13524 -1437 -7583 -13109 -16981 -11108 3755 7509 15839 16373 16924 2923 -9764
22433 -9764 -9116 -4083 -7197 -7966 -1144 841 9109 3192 -7968 -17946 -17556 -21053 -21010 -11684 -4172 -8963
22417 -8963 -14815 -14930 -14447 1328 3736 3709 -2691 -11682 -19610 -26382 -16380 -12071 -7773 -2323 9329
22402 9329 7225 2542 4153 -11398 -12426 -8157 -3550 -3123 -9861 -25239 -33035 -13453 -141 -4723
$$ packed form
22503E129Q67j79Q39r214L547j7962r050N419L516n940p056M394J2917Q977j941
22488e737j2211p203K0311J6127O444j1939j2550j0760J345n54L229J5465N63
22475B530K013N856k906k243L276l356l69Q360k37j7161J965m282P504J9469k998
22460A7421j3224J1332n358k593q494Q72l852o734J064J4688J8248J0357j7740
22447A5987k4269n242J2087o146n526l872N873J4863L754Q330N34N51j4001j2687
22433i764O48N033l114p69O822J985Q268n917j1160r978L90l497M3R326P512m791
22417h963n852j15M83J5775K408k7o400q991p928o772J0002M309M298N450J1652
22402I329k104m683J611j5551j028M269M607M27o738j5378p796J9582J3312m582
$$ plain form
22388 -4723 -13146 -2316 2328 9749 8651 9459 3642 -1405 -6845 -15950 -18808 -4859 1217 3414
22374 3414 -9196 -7848 -1275 4280 -2380 -14292 -14458 -12418 1604 -2439 -8325 -4178 5242 -662
22360 -662 -2191 -8922 -9999 -5274 -2933 9902 19365 12781 7758 13249 8992 7689 2199 -11404
22346 -11404 -4667 -193 -3269 -5830 -17051 -16603 -15392 -26535 -31613 -25889 -20454 -2390 4860 -8529
22332 -8529 -3765 6358 5033 4067 -2195 701 7489 6933 -2185 -25407 -33692 -21215 -2573 8902
22318 8902 5943 5519 7686 5188 -4668 -782 2926 -4911 -14842 -9113 -7526 -7432 10508 8022 3030
22303 3030 2816 -3743 -3545 -15701 -14455 -7652 -12257 2482 13843 23969 15692 3044 -394 -4436
22289 -4436 465 9827 7189 15743 18526 -2341 -19144 -20603 -30904 -22972 -10511 -2264 705 -1396
$$ packed form
22388d723q423J0830M644P421j098Q08n817n047n440r105k858J3949O076K197
22374C414j2610J348O573N555o660j1912j66K040J4022m043n886M147R420n904
22360f62j529o731j077M725K341J2835R463o584n023N491m257j303n490j3603
22346a1404O737M474l076k561j1221M48J211j1143n078N724N435J8064P250j3389
22332h529M764J0123j325r66o262K896O788n56r118k3222q285J2477J8642J1475
22318H902k959m24K167k498r856L886L708p837r931N729J587R4J7940k486m992
22303C030k14o559J98j2156J246O803m605J4739J1361J0126q277j2648l438m042
22289d436M901R362k638Q554K783k0867j6803j459j0301P932J2461Q247K969k101
$$ plain form
22275 -1396 -7 -7587 -13311 -10985 -11485 -10436 -6822 -4499 -9026 -6733 -20893 -18011 -8913 -7389 -6247
22260 -6247 -5618 -1223 406 -2195 -15508 -18201 -16204 -11778 -4406 -4558 -37 8348 14033 5779 11015
22245 11015 13240 17566 14464 13537 11995 5503 -1764 5190 6261 -9140 -21379 -20749 -13983 -5895
22231 -5895 -7000 -6255 -8007 -16897 -21950 -23667 -24963 -28511 -21505 -14815 -15807 -1391 -10239 -20644 -18446
22216 -18446 -6443 4875 3587 -12470 1251 11348 6576 4104 -2815 2704 2339 -6274 -5356 -3319
22202 -3319 -7204 -17184 -15926 -475 -3742 -9899 -11195 -13175 -3992 -7581 -13752 -2232 2330 3052
22188 3052 -7415 -5763 -10968 -10230 -8030 -12542 -13492 -9531 -6717 -6099 -10148 -17013 -18281 -16016 -11419
22173 -11419 -12383 -4334 -1966 -5448 -1140 -15134 -37787 -33940 -8646 -3205 -7560 -3597 -1453 2518
$$ packed form
22275a396J389p580n724K326n00J049L614K323m527K293j4160K882R098J524J142
22260f247O29M395J629k601j3313k693J997M426P372j52M521Q385N685q254N236
22245A1015K225M326l102r27j542o492p267O954J071j5401j2239O30O766Q088
22231e895j105P45j752q890n053j717j296l548P006O690r92J4416q848j0405K198
22216a8446J2003J1318j288j6057J3721J0097m772k472o919N519l65q613R18K037
22202c319l885r980J258J5451l267o157j296j980R183l589o171J1520M562P22
22188C052j0467J652n205P38K200m512r50L961K814O18m049o865j268K265M597
22173a1419r64Q049K368l482M308j3994k2653L847K5294N441m355L963K144L971
$$ plain form
22159 2518 -9021 -1711 6367 14293 8433 5683 991 5617 3565 5802 -1646 1057 -12624 -27538
22145 -27538 -26091 -14371 -9344 -14742 -13838 -9089 -9976 2428 972 -6156 4118 -7868 -3724 6826
22131 6826 14507 14587 18781 20836 11868 2721 2744 6490 182 -11511 -6324 7274 15145 23639 12152
22116 12152 4517 -6985 -13562 -26077 -8226 -22439 -41971 -32143 -23856 -24363 -23038 -31441 -24984
22103 -24984 -2586 13278 5148 -3058 -11194 -7986 -12683 -10424 -3119 -3954 -11210 -12514 -16435 -18142
22089 -18142 -2275 5601 4330 1701 -7546 -15161 -10742 -12251 -16997 -9514 -2553 12324 24882 14282
22075 14282 -4008 -16778 -22519 -20696 -21743 -20854 -12103 -16959 -24348 -32926 -17317 6147 2806 -2164
22061 -2164 -23544 -37552 -26910 -12915 -7840 -666 4013 2975 2111 -12737 -9273 -4923 2666 6424
$$ packed form
22159B518j1539P310Q078P926n860k750m692M626k052K237p448K703j3681j4914
22145b7538J447J1720N027n398R04M749q87J2404j456p128J0274j1986M144J0550
22131F826P681Q0M194K055q968r147K3L746o308j1693N187J3598P871Q494j1487
22116A2152p635j1502o577j2515J7851j4213j9532R828Q287n07J325q403O457
22103b4984K2398J5864q130q206q136L208m697K259P305q35p256j304l921j707
22089a8142J5867P876j271k629r247p615M419j509m746P483O961J4877J2558j0600
22075A4282j8290j2770n741J823j047Q89Q751m856p389q578J5609K3464l341m970
22061b164k1380j4008J0642J3995N075P174M679j038q64j4848L464M350P589L758
$$ plain form
22047 6424 1743 -3515 330 -4342 -13716 -11015 -1207 1453 -4974 7698 2647 -10596 -8760 2726
22033 2726 16469 16303 17721 14192 -4609 -26644 -18840 -16616 -10486 2140 3151 4688 1779 -979
22019 -979 522 -8447 5113 9113 -5395 -14373 -4289 15862 4393 -13963 -14314 -4805 2411 1479
22005 1479 -4686 -11106 -15296 -14921 -5618 3488 -3172 -5510 -15373 -21413 -20142 -19624 -28481 -31109 -13032
21990 -13032 1882 -3204 -12073 -16060 -18837 -20855 -25892 -24223 -13775 -10789 -18880 -14411 360 6073
21976 6073 -463 -6533 -11177 -28469 -20886 -5342 -4029 -9028 -26467 -21139 839 4245 -5197 -12188
21962 -12188 -17023 -34723 -17059 8609 8253 -6672 -19022 -12324 -6464 -2683 9009 5381 -7760
21949 -7760 -605 102 4407 2138 -7380 -4500 -10249 -22979 -21091 -12689 -10811 -9879 549 2988 -1981
$$ packed form
22047F424m681n258L845m672r374K701R808K660o427J2672n051j3243J836J1486
22033B726J3743j66J418l529j8801k2035P804K224O130J2626J011J537k909k758
22019i79J501q969J3560M000j4508q978J0084K0151j1469j8356l51R509P216r32
22005A479o165o420m190L75R303R106o660k338r863o040J271N18q857k628J8077
21990a3032J4914n086q869l987k777k018n037J669J0448K986q091M469J4771N713
21976F073o536o070m644j7292P583J5544J313m999j7439N328K1978L406r442o991
21962a2188m835j7700J7664K5668l56j4925j2350O698N860L781J1692l628j3141
21949g760P155P07M305k269r518K880n749j2730J888Q402J878R32J0428K439m969
$$ plain form
21934 -1981 -5542 593 -2128 1228 6632 8442 7488 10147 11741 10012 758 7606 8517 102 -11391
21919 -11391 -10931 -3728 -1585 -13682 -15043 -15275 -18737 -33282 -39709 -32104 -21117 -6117 -3286 -6640
21905 -6640 -10005 -20338 -15863 -523 15403 22221 16636 3453 -12109 -14665 -21889 -30300 -12523
21892 -12523 405 7723 5205 -2989 -11987 -11542 -10676 -1438 661 -3060 315 -1931 1658 -1615 -13407
21877 -13407 -13708 -6621 -5253 2173 2064 1759 -13319 -36625 -35228 -12662 -1411 -16147 -9032 -13260
21863 -13260 -9569 -11905 -26900 -24980 -37304 -38951 -27445 -12604 -9032 -7946 -7979 -6033 5797 -400
21849 -400 -6928 -14552 -17381 -15786 -23029 -27018 -2573 -8975 -13380 -28250 -18842 -10043 -15939 -12074
21835 -12074 -7096 -8865 416 11046 7687 -5518 -6277 -10522 -11202 -11793 -19473 -15486 -11581 -10092 -4706
$$ packed form
21934a981l561O135k721L356N404J810r54K659J594j729r254O848R11q415j1493
21919a1391M60P203K143j2097j361k32l462j4545o427P605J0987J5000K831l354
21905f640l365j0333M475J5340J5926O818n585j3183j5562k556p224q411J7777
21892a2523J2928P318k518q194q998M45Q66R238K099l721L375k246L589l273j1792
21877a3407l01P087J368P426j09l05j5078k3306J397K2566J1251j4736P115m228
21863a3260L691k336j4995J920j2324j647J1506J4841L572J086l3J946J1830o197
21849d00o528p624k829J595p243l989K4445o402m405j4870R408Q799n896L865
21835a2074M978j769R281J0630l359j3205p59m245o80n91p680L987L905J489N386
$$ plain form
21820 -4706 2662 10322 1818 6333 1012 335 -6374 -12308 -11924 -17145 -4069 1630 11325 5120 13530
21805 13530 14682 13121 15137 6508 -5960 11872 3889 -9728 -14336 -30035 -32917 -25515 -9141
21792 -9141 -1953 -6332 -8389 -50 5155 5251 1954 8080 6631 4711 4959 717 586 6932 20985
21777 20985 25788 3569 -13689 -28349 -31379 -26502 -18148 -18851 -1960 -2334 -6235 10103 9217 1423
21763 1423 -3318 -10319 -3105 4822 7620 844 -7862 -11109 -2305 15514 22198 17992 21821 23053
21749 23053 19600 24844 13289 15795 22007 29051 14964 17261 20499 15269 3971 3703 811 2827
21735 2827 4932 -5563 -19395 -16891 -7117 -8819 -18141 -28288 -33424 -34428 -32026 -46971 -28759
21722 -28759 -15686 -22314 -29763 -14616 -4394 7097 1671 5802 18815 20249 11177 4135 11967
$$ packed form
21820d706P368P660q504M515n321o77o709n934L84n221J3076N699R695o205Q410
21805A3530J152j561K016q629j2468J7832p983j3617m608j5699k882P402J6374
21792i141P188m379k057Q339N205R6l297O126j449j920K48m242j31O346J4053
21777B0985M803k2219j7258j4660l030M877Q354p03J6891l74l901J6338q86p794
21763A423m741p001P214P927K798o776q706l247Q804J7819O684m206L829J232
21749B3053l453N244j1555K506O212P044j4087K297L238n230j1298k68k892K016
21735B827K105j0495j3832K504R774j702r322j0147n136j004K402j4945J8212
21722b8759J3073o628p449J5147J0222J1491n426M131J3013J434r072p042P832
$$ plain form
21709 11967 5041 812 -6835 -8305 -24103 -18516 10857 13384 -5602 -14387 -26833 -19305 -4887
21696 -4887 3301 7309 -172 -5730 -9466 -16767 -6740 -1252 -5534 -14455 3250 -6325 -23593 -18778
21682 -18778 -8484 -12923 -5196 -9279 -9335 -2430 -3604 -14177 -14614 -9181 -10423 -12894 -7951 -4656 -6110
21667 -6110 -5491 -685 -10351 -11646 -5633 -13847 -20391 -24103 -19810 -12389 -17757 -23190 -11768 -4794 -3961
21652 -3961 -4609 8424 24518 11529 474 1511 -1014 6221 9697 -6205 -12059 -14112 594
21639 594 7311 12068 3839 7521 11267 4435 -7166 -34500 -33313 -24115 -23796 -18700 -13829 -6141 -8900
21624 -8900 -1353 -6568 -17927 -12662 -1380 -4092 -15074 -24087 -24095 -33587 -27902 -21397 -9530 -9423 -7205
21609 -7205 2998 -7783 -26696 -33125 -40156 -44925 -33549 -18510 -13842 -25261 -25466 -14940 -2506
$$ packed form
21709A1967o926m229p647j470j5798N587K9373K527j8986q785j2446P528J4418
21696d887Q188M008p481n558l736p301J0027N488m282q921J7705r575j7268M815
21682a8778J0294m439P727m083n6O905j174j0573m37N433j242k471M943L295j454
21667f110O19M806r666j295O013q214o544l712M293P421n368n433J1422O974Q33
21652c961o48J3033J6094j2989j1055J037k525P235L476j5902n854k053J4706
21639E94O717M757q229L682L746o832j1601k7334J187R198L19N096M871P688k759
21624h900P547n215j1359N265J1282k712j0982r013qr492N685O505J1867J07K218
21609g205J0203j0781j8913o429p031m769J1376J5039M668j1419k05J0526J2434
$$ plain form
21596 -2506 772 4655 11341 7228 -2047 -8958 -11324 -14688 -6544 737 11393 20661 3247 -5041
21582 -5041 1690 -8999 -12449 -32592 -42989 -27740 -6787 667 -1788 -8316 -536 -2229 -2762 -9801
21568 -9801 -23954 -28407 -22777 -24128 -37997 -24561 -7266 2186 1644 12943 12742 8382 6826 12806
21554 12806 2506 -5488 -10462 -14217 -10715 -13613 -11906 -15960 -13327 -9046 7790 -4889 -4041 1933
21540 1933 -561 -4523 -20934 -19638 -6647 15888 12094 11822 1433 -6381 -1491 -363 485 4058
21526 4058 -4814 -22562 -20285 -15268 -20200 -13599 -21316 -23176 -22198 -14998 -853 5027 11483 10967 9539
21511 9539 9709 346 -5178 -2740 -4585 -14211 -14323 -22603 -26097 -12273 -8531 -13411 -7741 -689 4586
21496 4586 26913 21617 13768 -2769 -11716 -9842 -14001 -11333 -1729 -2564 -2901 -4675 -9347 1563
$$ packed form
21596b506L278L883O686m113r275o911k366l364Q144P281J0656R268j7414q288
21582e041O731j0689l450k0143j0397J5249K0953P454k455o528P780j693n33p039
21568i801j4153m453N630j351j3869J3436J7295R452n42J1299k01m360j556N980
21554A2806j0300p994m974l755L502k898J707m054K633M281J6836j2679Q48N974
21540A933k494l962j6411J296J2991K2535l794k72j0389p814M890J128Q48L573
21526D058q872j7748K277N017m932O601p717j860R78P200J4145N880O456n16j428
21511I539J70r363n524K438j845r626j12q280l494J3824L742m880N670P052N275
21496D586K2327n296p849j6537q947J874m159K668R604q35l37j774m672J0910
$$ plain form
21482 1563 19582 9817 5548 7419 18093 3110 -1562 1321 -2391 -6669 -3761 3422 642 9776
21468 9776 13829 7155 -184 11596 17570 -277 -1630 1463 -4232 -4323 -439 -4894 -632 -5334 -11136
21453 -11136 -11856 -12856 -15642 -18657 -14885 -13314 -13872 -20536 -14655 -5875 -3996 -11721 -2748 -3217 477
21438 477 957 -168 9456 1952 -14652 -21666 -13754 -8723 -13615 -9574 7990 -693 -9626 -1938 -7441
21423 -7441 -1201 149 -1216 -6256 -16102 -19927 -12914 -10081 -8785 -4287 -6878 -11241 -7747 -13322 -3062
21408 -3062 435 639 2369 4191 7927 3694 -15030 -19820 -20700 -20588 -16924 -23839 -38705 -18648 -1661
21393 -1661 -2384 -57 4335 16886 12086 -2863 -17936 -23274 -20342 -6256 -1663 622 -7488 -10268
21379 -10268 -17912 -13130 3383 12651 9941 -3541 -857 -12442 -25352 -25140 -20030 -12891 128
$$ packed form
21482A563J8019r765m269J871J0674j4983m672K883l712m278K908P183k780R134
21468I776M053o674p339J1780N974j7847j353L093n695r1L884m455M262m702n802
21453a1136p20j000k786l015L772J571n58o664N881Q780J879p725Q973m69L694
21438D77M80j125R624p504j6604p014P912N031m892M041J7564q683q933P688n503
21423g441O240J350j365n040r846l825P013K833J296M498k591m363L494n575J0260
21408c062L497K04J730J822L736m233j8724m790q80J12L664o915j4866K0057J6987
21393a661p23K327M392J2551m800j4949j5073n338K932J4086M593K285q110k780
21379a0268p644M782J6513R268k710j3482K684j1585j2910K12N110P139J3019
$$ plain form
21366 128 -6027 -10778 -13287 -17826 -6305 -1507 1146 6004 -1312 -14880 -5213 598 -12677 -3733
21352 -3733 -3005 1239 1182 -3868 5460 11303 1885 -8222 -8125 4196 12564 9515 -8700 -13122 -2894
21337 -2894 -3463 -2812 -8480 -20652 -16898 -8850 -2218 -3045 -5371 -11520 -1864 11661 3837 4632 4606 -18731
21321 -18731 -25319 -15724 -12236 -19550 -30021 -16330 -7370 2999 4668 9562 19254 21793 24082 21932
21307 21932 25608 28360 17454 3516 9111 5552 -6978 -496 -9005 -20359 -18277 -11937 -7938
21294 -7938 -5855 -6258 -9199 -2907 -10040 -16285 -30031 -25635 -22226 -11979 -8443 -11707 -15151 -18446
21280 -18446 -10267 -4861 1348 6456 -3730 -9295 -6133 -3326 -1034 3353 -18731 -26432 -20577 -16980
21266 -16980 880 -7578 -6261 -9696 -22629 -16748 4947 2084 -4417 3387 11557 15770 28343
$$ packed form
21366A28o155m751k509m539J1521M798K653M858p316j3568R667N811j3275Q944
21352c733P28M244n7n050R328N843r418j0107R7J2321Q368l049j8215m422J0228
21337b894n69O51n668j2172L754Q048O632q27k326o149R656J3525p824P95k6k3337
21321a8731o588R595L488p314j0471J3691Q960J0369J669M894R692K539K289k150
21307B1932L676K752j0906j3938N595l559j2530O482q509j1354K082O340L999
21294g938K083m03k941O292p133o245j3746M396L409J0247L536l264l444l295
21280a8446Q179N406O209N108j0186n565L162K807K292M387k2084p701N855L597
21266a6980J7860q458J317l435j2933N881K1695k863o501P804Q170M213J2573
$$ plain form
21253 28343 39553 39285 22745 74 -5556 -3324 -10114 -12778 -7837 313 14310 16930 7918 1070
21239 1070 -9020 -2130 6192 15208 16027 14731 11831 12262 13851 7971 6353 2283 15595 22024 7710
21224 7710 -1704 1556 -11235 -9958 -7599 -11629 85 6662 8671 -7576 -19565 -13732 3249
21211 3249 3687 -5631 3236 7491 5886 1826 5023 17455 24822 28469 18789 15111 10836 -8361
21197 -8361 -8871 -4583 -4984 -6881 -1594 16112 21072 9112 -1160 -4178 -626 441 -2710 -4734
21183 -4734 4159 -2735 -16769 -25064 -19787 -15553 870 3365 -3591 -1678 13392 15633 5448 99
21169 99 -1892 6315 7007 7134 -6480 -14029 -18490 -11591 433 13286 12943 2914 -3510 9422 12515
21154 12515 14675 13375 5053 -483 5433 7882 1544 -5487 -13460 -12815 -10194 -11795 -18143 -26709 -19176
$$ packed form
21253B8343J1210k68j6540k2671n630K232o790k664M941Q150J3997K620r012o848
21239A070j0090O890Q322R016Q19j296k900M31J589n880j618m070J3312O429j4314
21224G710r414L260j2791J277K359m030J1714O577K009j6247j1989N833J6981
21211C249M38r318Q867M255j605m060L197J2432P367L647r680l678m275j9197
21197h361n10M288m01j897N287J7706M960j1960j0272l018L552J067l151k024
21183d734Q893o894j4034q295N277M234J6423K495o956J913J5070K241j0185n349
21169I9j991Q207O92J27j3614p549m461O899J2024J2853l43j0029o424J2932L093
21154A2515K160j300q322n536N916K449o338p031p973O45K621j601o348q566P533
$$ plain form
21139 -19176 2018 -2331 -3946 -10309 3558 13683 11515 3229 5661 8157 15660 6854 -11462
21126 -11462 -19935 -14495 -16774 -31241 -22762 -884 -2010 -6534 2714 1323 4413 7846 10923 18197
21112 18197 21396 25597 17546 17878 5127 -18280 -19702 -15077 -17422 -11848 1274 1860 -17029 -19765
21098 -19765 -22217 -21306 -10301 -10508 -19779 -24073 -18650 -14477 -12720 -11896 -8140 -2992 -6416 -6294 11085
21083 11085 23871 15941 11918 17349 14725 10493 139 -21186 -24327 -22380 -17228 -28856 -33243
21070 -33243 -31310 -24355 -21150 -24848 -24520 -8877 11590 9147 4496 2650 -4035 -13353 -9219 -8673
21056 -8673 3644 6522 452 -5989 -6992 247 13161 9283 7715 -1730 -207 -12752 -22532 -11173
21042 -11173 -5316 -23114 -23527 -11218 4760 14166 10756 11061 -1509 -14689 -7876 563 -6413 -8311
$$ packed form
21139a9176K1194m349j615o363J3867J0125k168q286K432K496P503q806j8316
21126a1462q473N440k279j4467Q479K1878j126m524R248j391L090L433L077P274
21112A8197L199M201q051L32j2751k3407j422M625k345N574J3122N86j8889k736
21098a9765k452R11J1005k07r271m294N423M173J757Q24L756N148l424J22J7379
21083A1085J2786p930m023N431k624m232j0354k1325l141J947N152j1628m387
21070c3243J933O955L205l698L28J5643K0467k443m651j846o685r318M134N46
21056h673J2317K878o070o441j003P239J2914l878j568r445J523j2545r780J1359
21042a1173N857j7798m13J2309J5978R406l410L05j2570j3180O813Q439o976j898
$$ plain form
21028 -8311 -1615 -5772 -9573 978 -445 3278 -13606 -25247 -15261 -17165 -19474 -4181 5028 7190
21014 7190 2322 -10403 -14808 -9138 -5626 -8579 -13284 -17097 -19190 -14753 -5348 -3103 351 517 -10904
20999 -10904 -12983 2240 2977 384 2704 -4711 2491 9850 25901 24325 27567 27809 11067 -1372
20985 -1372 -9203 -9399 -12895 -20390 -15036 2638 -5841 -10681 2445 -5788 -20121 -17081 -12755 -5208
20971 -5208 -9379 7140 25478 13717 12354 4897 -7490 -2150 -7317 -13900 -15147 -4706 1226
20958 1226 2081 2233 -3518 -7469 -6484 13127 6350 4649 -4035 -7117 -3520 -4889 -4980 571 -3183 1734
20942 1734 13388 -5582 -10988 -7928 -592 4534 15396 21770 22367 29302 30573 18456 13970 17021
20928 17021 584 -13598 -16015 -14704 -10961 -6550 2875 18261 17766 6910 4763 8706 16041 8822
$$ packed form
21028h311O696m157l801J0551j423L723j6884j1641R986j904k309J5293R209K162
21014G190m868j2725m405N670L512k953m705l813k093M437R405K245L454J66j1421
20999a0904k079J5223P37k593K320p415P202P359J6051j576L242K42j6742j2439
20985a372p831j96l496p495N354J7674q479m840J3126q233j4333L040M326P547
20971e208m171J6519J8338j1761j363p457j2387N340n167o583j247J0441N932
20958A226Q55J52n751l951R85J9611o777j701q684l082L597j369r1N551l754M917
20942A734J1654j8970n406L060P336N126J0862O374N97O935J271j2117m486L051
20928A7021j6437j4182k417J311L743M411R425J5386m95j0856k147L943P335p219
$$ plain form
20914 8822 -1635 -3433 -10307 -22618 -26712 -23512 -20123 -13780 -19411 -34528 -35604 -35437 -28652 -32878
20900 -32878 -38907 -30612 -10174 -13293 -3921 -3217 -8236 10300 -983 -11883 -9101 -4266 12094
20887 12094 9145 3751 8416 -4773 -1609 1185 139 -6611 -3248 546 -1990 -7118 -19633 -14633
20873 -14633 -17028 -12083 -6381 -7529 -7557 -9360 4955 -4236 -10336 -1484 -1266 -7931 -70 -9538 -19900
20858 -19900 -20475 -2833 9864 13330 10730 2147 4626 -517 655 38 10845 20284 -354 -7173
20844 -7173 -14105 -12041 -919 -4330 -14721 -14454 -9026 -10914 -8663 -7137 10219 4342 -10077 -4821
20830 -4821 2108 12043 7948 1250 -976 5373 -5343 -11762 -12279 -19565 -8741 -6386 -14333 -14248 1321
20815 1321 9156 6731 4092 -8791 -15653 -16041 -8382 -13306 553 4052 408 -8435 -23571 -25391
$$ packed form
20914H822j0457j798o874j2311m094L200L389O343n631j5117j076J67O785m226
20900c2878o029Q295K0438l119R372P04n019J8536j1283j0900K782M835J6360
20887A2094k949n394M665j3189L164K794j046o750L363L794k536n128j2515N000
20873a4633k395M945N702j148k8j803J4315r191o100Q852K18o665P861r468j0362
20858a9900n75J7642J2697L466k600q583K479n143J172o17J0807R439k0638o819
20844g173o932K064J1122l411j0391K67N428j888K251J526J7356n877j4419N256
20830d821O929R935m095o698k226O349j0716o419n17p286J0824K355p947Q5J5569
20815A321P835k425k639j2883o862l88P659m924J3859L499l644q843j5136j820
$$ plain form
20801 -25391 -21585 -18700 -16007 -6216 -5695 -15696 -14654 -6849 -7984 -3888 4790 6960 12994 13761 9218
20786 9218 4123 8131 1339 4643 16296 20027 15059 10983 9853 2373 -4541 -820 18344 14292
20772 14292 -500 -16067 -12955 -11024 -4682 2721 3621 -3080 -2100 5189 15709 10480 10234 7157
20758 7157 3431 -9078 -6342 -1453 -8874 -11880 819 11524 6699 -9324 -20720 -16056 -6096
20745 -6096 7505 10692 6677 7988 9770 5641 8781 20016 2012 6382 13057 3470 937 10177
20731 10177 6792 -2722 -8393 1974 -6706 -9909 4182 18306 3089 -3885 1736 5011 1808
20718 1808 853 -8129 -23763 -27770 -33699 -25300 -17350 -2973 -330 -958 -15510 -7463 -5522 -2396
20704 -2396 -2596 0 8380 5836 10667 15613 8472 5952 15789 33259 46612 32495 10889 -149
$$ packed form
20801b5391L806K885K693R791N21j0001J042P805j135M096Q678K170O034P67m543
20786I218n095M008o792L304J1653L731m968m076j130p480o914L721J9164m052
20772A4292j4792j5567L112J931O342P403R00o701R80P289J0520n229k46l077
20758G157l726j2509K736M889p421l006J2699J0705m825j6023j1396M664R960
20745f096J3601L187m015J311J782m129L140J1235j8004M370O675r587k533R240
20731A0177l385r514n671J0367q680l203J4091J4124j5217o974N621L275l203
20718A808r55q982j5634m007n929Q399P950J4377K643o28j4552Q047J941L126
20704b396k00K596Q380k544M831M946p141k520R837J7470J3353j4117k1606j1038
$$ plain form
20690 -149 -8508 1152 4268 -3636 -4977 -9487 78 -15277 -17996 -7000 -6872 -25260 -31608 -21421
20676 -21421 -1438 2813 -10462 -15448 -14287 -6477 -12595 -12146 -16872 -15033 -13139 -12886 -11663 -16222
20662 -16222 -5623 -8735 -8077 1214 10835 19767 11600 -9374 -16723 -15360 -1745 1583 7980 18984
20648 18984 14849 13428 20981 8090 -8498 10258 4298 -816 -2316 -7169 -8405 -11 5744 1891
20634 1891 60 7569 3721 1621 9066 6349 12201 5342 6862 11287 963 -14780 -11460 -317
20620 -317 7521 3747 -5095 -18563 -17794 -22021 -10448 2741 10585 11341 15269 16950 1416 -5240
20606 -5240 10673 14742 8771 7432 2645 12149 11680 -4986 2342 5021 -3746 -287 4289 -12
20592 -12 10394 16414 5428 840 -2415 -5378 16941 18773 28457 15939 -374 -6588 -18866 -4638
$$ packed form
20690a49q359R660L116p904j341m510R565j5355k719J0996J28j8388o348J0187
20676b1421J9983M251j3275m986J161P810o118M49m726J839J894K53J223m559
20662a6222J0599l112O58R291R621Q932q167k0974p349J363J3615L328O397J1004
20648A8984m135j421P553j2891j6588J8756n960n114j500m853j236Q394N755l853
20634A891j831P509l848k100P445k717N852o859J520M425j0324j5743L320J1143
20620c17P838l774q842j3468P69m227J1573J3189P844P56L928J681j5534o656
20606e240J5913M069n971j339m787R504m69j6666P328K679q767L459M576m301
20592a2J0406O020j0986m588l255k963K2319J832R684j2518j6313o214j2278J4228
$$ plain form
20578 -4638 9502 10582 8160 -927 -15370 -19698 -16571 -23801 -22334 -7732 -12278 -16425 -19968 -25538
20564 -25538 -20968 -18511 -21085 -21528 -19310 -21633 -16861 -8378 -10343 -16555 -8366 -2429 -4413 -15934
20550 -15934 -25719 -23601 -29480 -46761 -35101 -16959 -10584 -15947 -19294 -6252 7486 4677 -3192
20537 -3192 -459 4473 -1604 3595 5552 4304 15531 1029 -12389 -30259 -30145 -1363 26248
20524 26248 33823 37872 40542 22872 8470 -3139 -14512 -23557 -25512 -23347 -2202 8770 13010
20511 13010 18988 23278 14002 8387 -14379 -25477 -32311 -30585 -39136 -33942 -27007 -18603 -10082 10688
20497 10688 26290 35840 12935 -5874 -3924 2489 -4588 -15435 -12821 -10315 -2958 -4774 -24392
20484 -24392 -19875 5073 8881 15785 15189 -3937 -3829 6102 -5768 -25096 -22450 -15372 -8730 5435
$$ packed form
20578d638J4140J080k422r087j4443m328L127p230J467J4602m546m147l543n570
20564b5538M570K457k574m43K218k323M772Q483j965o212Q189N937j984j1521
20550a5934r785K118n879j7281J1660J8142O375n363l347J3042J3738k809p869
20537c192K733M932o077N199J957j248J1227j4502j3418j7870J14K8782K7611
20524B6248P575M049K670j7670j4402j1609j1373r045j955K165K1145J0972M240
20511A3010N978M290r276n615k2766j1098o834J726q551N194O935Q404Q521K0770
20497A0688J5602R550k2905j8809J950O413p077j0847K614K506P357j816j9618
20484b4392M517K4948L808O904n96j9126J08R931j1870j9328K646P078O642J4165
$$ plain form
20470 5435 11291 8684 -747 -13445 -8386 4224 -4144 -6261 6171 23542 16455 7264 6969 8399
20456 8399 21068 22482 2835 823 820 12254 4769 758 9135 17302 15622 18002 13931 10358 8189
20441 8189 3597 8948 16673 6061 3446 -7080 -11440 -14898 -8223 10546 11079 10754 15414 17818
20427 17818 16742 11956 -750 -5383 -2970 -4745 -11441 -1957 7753 9135 8096 8448 4764 -166
20413 -166 -7471 -14748 -11816 -5108 -16012 -13066 2354 4897 -669 111 -11453 -20359 -20038 -13842 -10298
20398 -10298 -2437 2437 15725 20490 19135 15383 14415 12891 2022 -1306 -8669 -17352 -18681 -10061
20384 -10061 -11711 -13804 -24387 -27045 -15303 -11156 -15190 -7477 11042 6522 8523 14529 4948 -9632
20370 -9632 -16679 -12167 -20604 -26515 -21131 -5633 -7309 -10555 -6462 5866 9483 -5756 -14432 -3726
$$ packed form
20470E435N856k607r431j2698N059J2610q368k117J2432J7371p087r191k95J430
20456H399J2669J414j9647k012lJ1434p485m011Q377Q167j680K380m071l573k169
20441H189m592N351P725j0612k615j0526m360l458O675J8769N33l25M660K404
20427A7818j076m786j2706m633K413j775o696R484R710J382j039L52l684m930
20413a66p305p277K932O708j0904K946J5420K543n566P80j1564q906L21O196L544
20398a0298P861M874J3288M765j355l752r68j524j0869l328p363q683j329Q620
20384a0061j650k093j0583k658J1742M147m034P713J8519m520K001O006r581j4580
20370i632p047M512q437n911N384J5498j676l246M093J2328L617j5239q676J0706
$$ plain form
20356 -3726 -11076 -14604 -11893 -8361 2054 1563 17221 13022 1382 -6116 -9144 374 -8868 -20726
20342 -20726 -9434 5661 11009 14008 4252 9626 15453 18999 22551 28827 39576 35708 18496
20329 18496 17606 5545 -10507 -5164 -2211 -3627 -3412 -8063 348 4518 6139 9302 -2467 -14834
20315 -14834 -25632 -26995 -16066 -11130 -21632 -15561 -20672 -28418 -26537 -9941 -4928 97 8111
20302 8111 11424 21010 18445 19291 15509 6510 6421 3529 -943 -14185 -5096 898 -12854 -18147 -5815
20287 -5815 1281 5070 7933 4388 -1600 -16857 -16386 -11727 7498 -1235 -11585 -14121 -14760 -11235
20273 -11235 -6291 6490 942 -221 -1207 2687 9144 10183 14438 10630 848 -4356 -3478 -5526 15906
20258 15906 22244 5234 13004 36158 41123 41339 38355 24977 22072 16376 20935 29361 14893 20159
$$ packed form
20356c726p350l528K711L532J0415m91J5658m199j1640p498l028R518r242j1858
20342b0726J1292J5095N348K999r756N374N827L546L552O276J0749l868j7212
20329A8496q90j2061j6052N343K953j416K15m651Q411M170J621L163j1769j2367
20315a4834j0798j363J0929M936j0502O071n111p746J881J6596N013N025Q014
20302H111L313R586k565Q46l782q999q9k892m472j3242R089N994j3752n293J2332
20287e815P096L789K863l545n988j5257M71M659J9225q733j0350k536o39L525
20273a1235M944J2781n548j163r86L894O457J039M255l808r782n204Q78k048K1432
20258A5906O338j7010P770K3154M965K16k984j3378k905n696M559Q426j4468N266
$$ plain form
20244 20159 37829 32490 33218 37582 40679 60030 69666 68440 75705 74337 70557 65253 69820 83052
20230 83052 105164 110800 122498 151090 192266 243928 285818 343165 470337 706181 1112453
20219 1112453 1480231 1504242 1345868 1197395 1272659 1586275 1707921 1570279 1417823 1469921
20209 1469921 1707422 1679958 1461951 1246995 1214954 1430776 1556953 1340026 981180 650975
20199 650975 433977 289983 201318 136624 107011 100833 87163 66315 59968 62952 64953 52540
20187 52540 39973 30930 37478 26550 26739 29891 34488 36623 30197 28793 34917 26156 27011 43004
20173 43004 43934 35316 22081 9416 11948 12964 9886 6505 9366 7759 1305 664 2913 8619
20159 8619 11710 2889 3362 -3489 -9679 -530 12465 12635 6585 -6476 -13529 -1892 471 3305
$$ packed form
20244B0159J7670n339P28M364L097J9351R636j226P265j368l780n304M567J3232
20230H3052K2112N636J1698K8592M1176N1662M1890N7347J27172K35844M06272
20219A112453L67778K4011j58374j48473P5264L13616J21646j37642j52456N2098
20209A469921K37501k7464k18007k14956l2041K15822J26177k16927l58846l30205
20199F50975k16998j43994q8665o4694k9613o178j3670k0848o347K984K001j2413
20187E2540j2567r043O548j0928J89L152M597K135o426j404O124q761Q55J5993
20173D3004R30q618j3235j2665K532J016l078l381K861j607o454o41K249N706
20159H619L091q821M73o851o190R149J2995J70o050j3061p053J1637K363K834
$$ plain form
20145 3305 142 -1863 -9546 -7698 14982 15949 -11070 -24514 -8660 14856 12095 4759 1960 -9682
20131 -9682 -13854 3796 16397 6638 -8842 -25844 -32960 -19879 -10318 -3000 4988 13585 15171
20118 15171 27426 23805 17054 27954 27952 21231 977 -7314 -11370 2116 5850 88 -679 -6447
20104 -6447 -121 11277 21676 11963 17956 26790 7301 -10464 -20062 -17357 -14182 -16316 -5021
20091 -5021 7422 7227 -10021 -5445 -545 -3361 -3655 -5635 1275 16761 21600 13556 16766 17190 19920
20076 19920 5930 3108 -2604 7206 2413 -426 9187 18629 4076 -13080 -11289 -8580 2465
20063 2465 16847 23197 25663 22683 13386 14495 10745 14559 7481 2155 -3715 -6985 8619 11835
20049 11835 17662 33078 30983 20865 23506 33775 36987 33125 25938 34976 22050 11393 23420
$$ packed form
20145C305l163k005p683J848K2680R67k7019j3444J5854K3516k761p336k799j1642
20131i682m172J7650J2601r759j5480j7002p116J3081R561P318P988Q597J586
20118A5171J2255l621o751J0900ko721k0254q291m056J3486L734n762p67n768
20104f447O326J1398J0399r713N993Q834j9489j7765r598K705L175k134J1295
20091e021J2443j95j7248M576M900k816k94j980O910J5486M839q044L210M24K730
20076A9920j3990k822n712R810m793k839R613R442j4553j7156J791K709J1045
20063B465J4382O350K466k980r297J109l750L814p078n326n870l270J5604L216
20049A1835N827J5416k095j0118K641J0269L212l862p187R038j2926j0657J2027
$$ plain form
20036 23420 25404 25306 23247 23336 25820 26526 26014 9984 -10458 -4337 6404 -4814 8875 28671
20022 28671 28407 22537 21182 12100 13541 -463 -13316 -12384 -2421 -13194 -33058 -41490 -41810 -47391
20008 -47391 -38531 -31756 -33729 -43796 -34828 -23987 -38335 -52189 -39110 -20106 -7855 -9665 -23964
19995 -23964 -38392 -465 20962 22870 23838 16897 23065 15199 4599 3864 13669 15181 16980 26256
19981 26256 23554 20992 8899 3308 30083 36686 22033 12042 11453 16571 23296 27067 13961 16057
19967 16057 3244 -804 -7621 -13364 -14451 -10188 -2602 -12819 -21164 -16860 -1984 547 -5202 3827
19953 3827 11846 27585 37536 31522 9597 -1041 -3405 9381 27524 31269 30124 23267 20873
19940 20873 23053 15865 7552 -6986 -21971 -23831 -25851 -16228 -9781 -9000 -13439 -18839 -10357 -17471
$$ packed form
20036B3420J984r8k059Q9K484P06n12j6030k0442O121J0741j1218J3689J9796
20022B8671k64n870j355r082J441j4004j2853R32R963j0773j9864q432l20n581
20008d7391Q860O775j973j0067Q968J0841j4348j3854J3079J9004J2251j810j4299
19995b3964j4428L7927K1427J908R68o941O168p866j0600p35R805J512J799R276
19981B6256k702k562j2093n591K6775O603j4653r991n89N118O725L771j3106K096
19967A6057j2813m048o817n743j087M263P586j0217q345M304J4876K531n749R029
19953C827Q019J5739R951o014k1925j0638k364J2786J8143L745j145o857k394
19940B0873K180p188q313j4538j4985j860k020R623O447P81m439n400Q482p114
$$ plain form
19926 -17471 -10747 -4592 5670 13164 14378 22059 24425 18642 23653 31514 24185 13464 21433 28142
19912 28142 34530 24631 25776 37268 47048 49465 51847 47036 28370 23179 25117 11821 15074 17386
19898 17386 13623 3965 9261 21823 38655 31203 23121 21027 24268 22033 26545 27354 44551 43414
19884 43414 17503 10837 9297 977 -3184 -840 -7409 -13168 -2238 4469 -1087 -1794 7542 15738
19870 15738 29562 35872 40534 44988 41663 52899 49673 46487 46025 57048 67475 67887 62670 53632
19856 53632 44034 46915 72765 77171 63762 46595 50782 73385 74980 59168 22433 19916 57298
19843 57298 71604 59654 26830 9190 25219 46528 39294 11121 -4754 -3499 13784 14437
19831 14437 -1706 -12004 586 13930 15660 11461 5738 14652 23531 28032 19891 9080 8045
$$ packed form
19926a7471O724O155J0262P494J214P681K366n783N011P861p329j0721P969O709
19912B8142O388r899J145J1492R780K417K382m811j8666n191J938j3296L253K312
19898A7386l763r658N296J2562J6832p452q082k094L241k235M512Q09J7197j137
19884D3414k5911o666j540q320m161K344o569n759J0930O707n556p07R336Q196
19870A5738J3824O310M662M454l325J1236l226l186m62J1023J0427M12n217r038
19856E3632r598K881K5850M406j3409j7167M187K2603J595j5812l6735k517L7382
19843E7298J4306j1950l2824j7640J6029K1309p234k8173j5875J255J7283O53
19831A4437j6143j0298J2590J3344J730m199n723Q914Q879M501q141j0811j035
$$ plain form
19818 8045 14894 26945 34270 42095 40513 33342 20330 45505 67390 84798 85944 84458 99199
19805 99199 110254 126972 140024 137819 160663 179923 196129 216280 196450 197750 246564 283068
19793 283068 303198 293236 256932 267012 282876 286146 260301 236149 222666 216204 204166 212565
19781 212565 197585 187838 180924 159052 148783 133330 99885 83552 79517 71709 68963 82734
19769 82734 88399 85204 59366 58407 52083 64323 84244 84625 57386 55911 61721 51135 58384 58963
19755 58963 72323 82350 62111 60714 73004 80926 74721 61615 61256 74183 101894 106910 99554
19742 99554 92606 88746 106238 129465 122385 122620 139576 154220 142553 148034 153694 144742 130968
19729 130968 133547 130692 122525 119319 116916 93670 105384 119106 112164 98239 86837 73184 62369
$$ packed form
19818H045O849J2051P325P825j582p171j3012K5175K1885J7408J146j486J4741
19805I9199J1055J6718J3052k205K2844J9260J6206K0151j9830J300M8814L6504
19793B83068K0130r962l6304J0080J5864L270k5845k4152j3483o462j2038Q399
19781B12565j4980r747o914k1872j0269j5453l3445j6333m035p808k746J3771
19769H2734N665l195k5838r59o324J2240J9921L81k7239j475N810j0586P249N79
19755E8963J3360J0027k0239j397J2290P922o205j3106l59J2927K7711N016p356
19742I9554o948l860J7492K3227p080K35J6956J4644j1667N481N660q952j3774
19729A30968K579k855q167l206k403k3246J1714J3722o942j3925j1402j3653j0815
$$ plain form
19716 62369 56615 48382 42425 60948 67036 72614 71365 68029 62867 70309 66941 70638 70182 39296
19702 39296 41515 73768 81196 97700 104203 86544 102009 111146 126854 122246 112100 123698 125345
19689 125345 134519 141786 123531 123707 136258 163063 167272 175938 183919 186127 191284 211295 249383
19676 249383 330543 447110 558493 605497 525329 429725 470558 527778 567067 569353 499776
19665 499776 501800 547391 561086 528011 417548 396532 423613 468687 480324 373768 254589
19654 254589 198378 138549 114929 127907 147847 165999 179231 171071 144093 131008 158175 196146
19642 196146 197797 189270 193610 208386 215405 208105 183219 189010 205109 218431 221472 208638 183943
19629 183943 184976 202585 214170 231877 235348 259740 306357 321651 294172 267386 252217 275915
$$ packed form
19716F2369n754q233n957J8523O088N578j249l336n162P442l368L697m56l0886
19702C9296K219L2253P428J6504O503j7659J5465R137J5708m608j0146J1598J647
19689A25345R174P267j8255J76J2551K6805M209Q666P981K208N157K0011L8088
19676B49383Q1160J16567J11383M7004q0168r5604M0833N7220L9289K286o9577
19665D99776K024M5591J3695l3075j10463k1016K7081M5074J1637j06556j19179
19654B54589n6211n9829k3620J2978J9940J8152J3232q160k6978j3085K7167L7971
19642A96146J651q527M340J4776P019p300k4886N791J6099J3322L041j2834k4695
19629A83943J033J7609J1585J7707L471K4392M6617J5294k7479k6786j5169K3698
$$ plain form
19617 275915 295637 323321 336367 346638 385187 411171 429761 449504 464844 492643 515435
19606 515435 549906 589197 624475 639850 638098 642485 667156 718163 789511 848537 872227 887674
19594 887674 920955 977335 1038610 1101286 1158906 1215380 1303953 1414966 1534937 1673490 1847258
19583 1847258 2107491 2495792 3080313 3575897 3733801 3772957 3902609 4313117 4946726 5325516
19573 5325516 5533017 5887177 6650602 7593239 7974437 8096717 8359202 9109166 10317996
19564 10317996 11204296 11587612 12108772 13143196 14863687 16631791 17994331 19393593
19556 19393593 21341656 24228283 28036189 32230990 37318810 44786922 56738097 76422636
19548 76422636 111084681 174195971 253890214 273468152 247783067 215834386 215482867
$$ packed form
19617B75915J9722K7684J3046J0271L8549K5984J8590J9743J5340K7799K2792
19606E15435L4471L9291L5278J5375j752M387K4671N1007P1348N9026K3690J5447
19594H87674L3281N6380O1275O2676N7620N6474Q8573J11013J19971J38553J73768
19583A847258K60233L88301N84521M95584J57904L9156J29652M10508O33609L78790
19573E325516K07501L54160P63425R42637L81198J22280K62485P49964J208830
19564A0317996Q86300L83316N21160J034424J720491J768104J362540J399262
19556A9393593J948063K886627L807906M194801N087820P468112J1951175J9684539
19548G6422636L4662045O3111290P9694243J9577938k5685085l1948681l51519
$$ plain form
19541 215482867 265070113 307364147 290410938 258439400 251217050 292983141 309914874
19534 309914874 275385925 229389863 206689961 234593610 278911856 259480947 202177172
19527 202177172 136803720 88496513 59747382 42948121 33106982 27059838 22847506
19520 22847506 19559994 16960968 15068263 13734119 12597731 11594651 10503504 9513436
19512 9513436 8828670 8518985 8439436 8188712 7606814 7035507 6778339 6865818 6904126 6451065
19502 6451065 5724463 5167287 5000378 5008136 4757195 4376810 4072496 4015735 4176076 4152697
19492 4152697 3783719 3335706 2953493 2679337 2478294 2336129 2244741 2156536 2063326 1964266
19482 1964266 1873653 1827604 1777384 1712604 1648071 1586853 1539833 1525021 1488670 1431874 1383351
$$ packed form
19541B15482867M9587246M2294034j6953209l1971538p222350M1766091J6931733
19534C09914874l4528949m5996062k2699902K7903649M4318246j9430909n7303775
19527B02177172o5373452m8307207k8749131j6799261r841139o047144m212332
19520B2847506l287512k599026j892705j334144j136388j003080j091147r90068
19512I513436o84766l09685p9549k50724n81898n71307k57168Q7479L8308m53061
19502F451065p26602n57176j66909P758k50941l80385l04314n6761J60341k3379
19492D152697l68978m48013l82213k74156k01043j42165r1388q8205r3210r9060
19482A964266r0613m6049n0220o4780o4533o1218m7020j4812l6351n6796m8523
$$ plain form
19471 1383351 1352948 1320419 1284737 1242831 1195910 1153076 1129442 1118488 1094464 1065542 1038696
19460 1038696 1031315 1019800 1002048 1002403 1006448 981943 930827 895059 876426 880949 876842 854910
19448 854910 815842 816825 825928 814959 787869 739203 710649 718503 715845 691603 661196 649391
19436 649391 640985 637008 635669 621460 611625 619900 632934 633862 606328 581255 595002 610113 617473
19423 617473 638122 649317 632494 576538 500878 405668 319499 321008 362162 351976 314306 249879
19411 249879 207174 208474 220482 220584 154115 140258 162441 162369 124727 45824 -42268 -12923 64400
19398 64400 132453 179362 188942 211651 233799 239826 224612 226495 245026 270177 295805 282059
19386 282059 267655 281964 276442 268662 273670 269660 257554 251820 255577 267503 252551 258860 276773
$$ packed form
19471A383351l0403l2529l5682m1906m6921m2834k3634j0954k4024k8922k6846
19460A038696p381j1515j7752L55M045k4505n1116l5768j8633M523m107k1932
19448H54910l9068R83R103j0969k7090m8666k8554P854k658k4242l0407j1805
19436F49391q406l977j339j4209r835Q275J3034R28k7534k5073J3747J5111P360
19423F17473K0649J1195j6823n5956p5660r5210q6169J509M1154j0186l7670o4427
19411B49879m2705J300J2008J02o6469j3857K2183p2l7642p8903q8092K9345P7323
19398F4400O8053M6909R580K2709K2148O027j5214J883J8531K5151K5628j3746
19386B82059j4404J4309n522p780N008m010j2106n734L757J1926j4952O309J7913
$$ plain form
19373 276773 272656 277088 286635 277936 257013 245045 251994 270302 277060 267140 247086 245523 245455 245576
19359 245576 245079 240887 235395 228890 230359 209515 201632 194611 180412 154976 150696 151437 153376 149437
19345 149437 149056 151831 151774 165860 159641 153131 163629 146464 153950 173441 191355 199111 204284 200876
19331 200876 180962 173687 187984 192448 187320 194631 200110 200690 201564 196298 214893 246454 284722
19318 284722 282576 266256 243380 229505 236813 245169 261256 275927 266681 259448 233365 217463
19306 217463 213288 205970 212812 229823 250719 266813 268704 271683 290983 324084 350820 399786
19294 399786 478273 567501 762707 1117746 1533251 1599365 1381557 1078940 841010 722231
19284 722231 689929 734438 875902 1191533 1677018 2009877 2154134 2225607 1994215 1596129
$$ packed form
19373B76773m117M432R547q699k0923j1968O949J8308O758r920k0054j563o8J21
19359B45576m97m192n492o505J469k0844p883p021j4199k5436m280P41J939l939
19345A49437l81K775n7J4086o219o510J0498j7165P486J9491J7914P756N173l408
19331B00876j9914p275J4297M464n128P311N479N80Q74n266J8595L1561L8268
19318B84722k146j6320k2876j3875P308Q356J6087J4671r246p233k6083j5902
19306B17463m175p318O842J7011K0896J6094J891K979J9300L3101K6736M8966
19294C99786P8487Q9228J95206L55039M15505O6114k17808l02617k37930j18779
19284G22231l2302M4509J41464L15631M85485L32859J44257P1473k31392l98086
$$ plain form
19274 1596129 1196641 891670 693546 591993 596961 713672 963895 1330993 1469915 1263758
19264 1263758 941168 666957 497307 378780 299662 259937 236315 224494 236047 239100 222487
19253 222487 213006 216147 204282 193464 194313 191460 192321 197283 213931 233206 237452 235685 230692 207520
19239 207520 173641 158666 151697 141328 166191 167700 131282 121126 138978 171585 175473 174228
19227 174228 139230 122228 141894 146745 107702 78843 84647 100428 118489 126512 124506 131527
19215 131527 129228 120191 117011 120088 123873 112770 112937 129914 137214 147056 146970 134481 139327 142401
19201 142401 166763 171823 147390 133105 132448 137016 144925 151612 165955 159676 157239 145170 142608
19188 142608 134443 130215 135953 129373 126572 116537 105589 111991 104988 99239 82675 81314 91496
$$ packed form
19274A596129l99488l04971j98124j01553M968J16711K50223L67098J38922k06157
19264A263758l22590k74211j69650j18527p9118l9725k3622j1821J1553L053j6613
19253B22487r481L141j1865j0818Q49k853Q61M962J6648J9275M246j767m993k3172
19239B07520l3879j4975o969j0369K4863J509l6418j0156J7852L2607L888j245
19227A74228l4998j7002J9666M851l9043k8859N804J5781J8061Q023k006P021
19215A31527k299r037l180L077L785j1103J67J6977P300R842q6j2489M846L074
19201A42401K4362N060k4433j4285o57M568P909O687J4343o279k437j2069k562
19188A42608q165m228N738o580k801j0035j0948O402p003n749j6564j361J0182
$$ plain form
19175 91496 102933 118400 111303 97836 77047 72535 82801 93104 85319 83172 90353 90764 81304
19162 81304 73220 71017 74130 84698 94740 103068 108198 103684 104377 106080 109607 110772 114919 118067
19148 118067 110565 129794 144518 134801 127320 122027 125541 128591 140110 127883 125098 127434 132584
19135 132584 140728 125351 126025 130977 124344 114689 113207 111454 114580 126019 130181 136025 135817 129952
19121 129952 130739 138323 144334 133493 130152 133689 141884 147192 137871 123022 128098 126586 125123 119587
19107 119587 112572 117362 118792 107652 104535 103661 95750 89761 93185 93981 104817 106041 99723 99790 97937
19092 97937 95611 103611 85740 74359 66375 48851 46033 47174 43410 36974 54482 67187 83359
19079 83359 102817 115653 117349 94900 108484 128218 140915 137664 142531 153939 162601 169452 166647
$$ packed form
19175I1496J1437J5467p097j3467k0789m512J0266J0303p785k147P181M11r460
19162H1304q084k203L113J0568J0042Q328N130m514O93J703L527J165M147L148
19148A18067p502J9229J4724r717p481n293L514L050J1519j2227k785K336N150
19135A32584Q144j5377O74M952o633r655j482j753L126J1439M162N844k08n865
19121A29952P87P584O011j0841l341L537Q195N308r321j4849N076j512j463n536
19107A19587p015M790J430j1140l117q74p911n989L424P96J0836J224o318O7j853
19092I7937k326Q000j7871j1381p984j7524k818J141l764o436J7508J2705J6172
19079H3359J9458J2836J696k2449J3584J9734J2697l251M867J1408Q662O851k805
$$ plain form
19066 166647 152241 141815 148133 157674 167547 175167 162206 153687 147094 139825 126953 119342 110455
19053 110455 106545 101699 103203 99136 105444 121003 123917 113208 113030 112698 116424 121428 117671 119386
19039 119386 126159 135546 132361 118036 114609 115653 103072 96292 124686 141685 148029 149657 134519
19026 134519 126207 119559 123172 121682 110559 107806 96777 90863 88557 85599 93811 110560 128193
19013 128193 123027 105254 111515 125460 135224 130759 120921 119370 112509 120322 121882 126372 137952
19000 137952 149356 157718 138621 140552 164218 171802 173980 171330 167358 174753 174807 170455 174467 172612
18986 172612 176629 171870 165571 164137 154024 153888 159386 164897 171228 167590 162087 150916 154031 154365
18972 154365 144263 132646 136931 127633 128333 136039 132607 136430 141121 134058 135587 135543 116689 103198
$$ packed form
19066A66647j4406j0426O318R541R873P620j2961q519o593p269j2872p611q887
19053A10455l910m846J504m067O308J5559K914j0709j78l32L726N004l757J715
19039A19386O773R387l185j4325l427J044j2581o780K8394J6999O344J628j5138
19026A34519q312o648L613j490j1123k753j1029n914k306k958Q212J6749J7633
19013A28193n166j7773O261J3945R764m465r838j551o861P813J560M490J1580
19000A37952J1404Q362j9097J931K3666P584K178k650l972P395N4m352M012j855
18986A72612M017m759o299j434j0113j36N498N511O331l638n503j1171L115L34
18972A54365j0102j1617M285r298P00P706l432L823M691p063J529m4j8854j3491
$$ plain form
18958 103198 97941 107824 118165 134722 141694 148188 146858 154568 154126 145642 137903 154370 149841 147930
18944 147930 143829 143330 166666 181369 187621 193456 201394 224332 218712 185889 152126 151811 154649
18931 154649 174539 178450 174468 192748 221060 231180 227504 217388 202625 187002 157394 144366
18919 144366 126558 130849 136449 145091 160002 171366 182908 202479 189465 162197 151438 147968
18907 147968 147401 140278 131249 127707 132085 137404 144529 167538 193730 200301 185107 187031 197593
18894 197593 198771 209995 221805 235408 252164 265582 294670 320788 324669 316519 314705 324078
18882 324078 325152 349155 373908 404451 433143 471610 501332 501164 516578 531919 537025 547100
18870 547100 590459 634758 729358 872990 1124312 1539031 1873645 1851215 1671082 1532832
$$ packed form
18958A03198n257R883J0341J6557O972O494j330P710m42q484p739J6467m529j911
18944A47930m101m99K3336J4703O252N835P938K2938n620l2823l3763l15K838
18931A54649J9890L911l982J8280K8312J0120l676j0116j4763j5623k9608j3028
18919A44366j7808M291N600Q642J4911J1364J1542J9571j3014k7268j0759l470
18907A47968n67p123r029l542M378N319P125K3009K6192O571j5194J924J0562
18894A97593J178J1224J1810J3603J6756J3418K9088K6118L881q150j814R373
18882C24078J074K4003K4753L0543K8692L8467K9722j68J5414J5341N106J0075
18870E47100M3359M4299R4600J43632K51322M14719L34614k2430j80133j38250
$$ plain form
18860 1532832 1664923 1957247 2013692 1908062 1806198 1918752 2136817 2064628 1841220 1648459
18850 1648459 1678051 1891052 1928321 1665655 1292196 969412 783340 651640 545539 470719
18840 470719 416052 382152 352481 330782 313831 297259 281172 282258 286400 287384 290863 301941
18828 301941 299376 281728 264803 253064 277611 291168 305242 319154 321300 340199 332521 308612
18816 308612 279619 272306 272223 267335 263679 269342 286429 303992 316442 322064 315455 316311 293872 267411
18802 267411 263760 251688 251352 257956 284305 311603 319051 311539 295605 274655 268057 249438 226224
18789 226224 227282 250430 259441 261545 248342 270643 286608 288608 274739 261763 253431 265904
18777 265904 292146 294072 273913 293967 318049 337207 364119 391975 424911 465473 477920 455632
$$ packed form
18860A532832J32091K92324N6445j05630j01864J12554K18065p2189k23408j92761
18850A648459K9592K13001L7269k62666l73459l22784j86072j31700j06101p4820
18840D70719n4667l3900k9671k1699j6951j6572j6087J086M142R84L479J1078
18828C01941k565j7648j6925j1739K4547J3557J4074J3912K146J8899p678k3909
18816C08612k8993p313q3m888l656N663J7087J7563J2450N622o609Q56k2439k6461
18802B67411l651j2072l36O604K6349K7298P448p512j5934k0950o598j8619k3214
18789B26224J058K3148R011K104j3203K2301J5965K000j3869j2976q332J2473
18777B65904K6242J926k0159K0054K4082J9158K6912K7856L2936M0562J2447k2288
$$ plain form
18765 455632 430174 406556 395627 383195 404682 463484 535189 630001 728796 776132 748789
18754 748789 637035 536735 476695 462750 537822 700448 902183 1028399 1089324 1090415 1013617
18743 1013617 931368 823005 620589 499447 465796 474055 572175 753722 846047 878424 864869
18732 864869 808047 642056 493432 422766 354842 359537 394566 425805 438688 438470 439734 422746
18720 422746 404503 414344 417431 424565 454727 490957 518004 533872 544825 533062 518231 514140
18708 514140 508659 503432 512223 516707 544440 574553 579521 573728 594275 606079 632522 650572 666926
18695 666926 679842 706495 769804 834319 836801 805308 795960 820676 843458 875763 927597 986967
18683 986967 1045671 1115652 1195977 1261125 1308712 1354797 1393782 1449918 1626094 1925237 2387093
$$ packed form
18765D55632k5458k3618j0929j2432K1487N8802P1705R4812R8795M7336k7343
18754G48789j11754j00300o0040j3945P5072J62626K01735J26216O0925J091p6798
18743A013617q2249j08363k02416j21142l3651Q259R8120J81547R2325L2377j3555
18732H64869n6822j65991j48624p0666o7924M695L5029L1239J2883k18J264j6988
18720D22746j8243R841L087P134L0162L6230K7047J5868J0953j1763j4831m091
18708E14140n481n227Q791M484K7733L0113M968n793K0547J1804K6443J8050J6354
18695F66926J2916K6653O3309O4515K482l1493r348K4716K2782L2305N1834N9370
18683I86967N8704O9981Q0325O5148M7587M6085L8985N6136J76176K99143M61856
$$ plain form
18672 2387093 2756049 2762866 2598686 2418218 2347711 2363726 2442607 2594559 2895448 3419734
18662 3419734 4062923 4491994 4864711 5143099 5092131 4948211 4855562 4936565 5235521 5844313
18652 5844313 6686987 7465917 8459294 9537347 10012605 10042037 9979876 10225003 10901373 11992098
18642 11992098 13555207 15240713 17218367 19559055 21723680 24197755 27267227 31118799
18634 31118799 36659923 45374192 59771239 85143211 132604931 210043575 257490729
18627 257490729 234458909 183003709 131802057 101492544 89949087 92776145 110862778
18620 110862778 152225144 229288424 310519189 340097710 362770432 357578438 296830552
18613 296830552 220711647 151812879 108702457 87793321 82589865 92112048 122318140
$$ packed form
18672B387093L68956O817j64180j80468p0507J6015P8881J51952L00889N24286
18662C419734O43189M29071L72717K78388n0968j43920r2649Q1003K98956O08792
18652E844313Q42674P78930R93377J078053M75258K9432o2161K45127O76370J090725
18642A1992098J563109J685506J977654K340688K164625K474075L069472L851572
18634C1118799N541124Q714269J4397047K5371972M7461720P7438644M7447154
18627B57490729k3031820n1455200n1201652l0309513j1543457K827058J8086633
18620A10862778M1362366P7063280Q1230765K9578521K2672722n191994o0747886
18613B96830552p6118905o8898768m3110422k0909136n203456R522183L0206092
$$ plain form
18606 122318140 183817405 246534229 237052066 185309372 123484005 77888035 51069306
18599 51069306 35511356 26507786 21408601 18398937 16523273 15207671 13856077 12415848
18591 12415848 10838011 9205313 7818242 6748054 6029778 5609189 5518481 5979285 6802478
18582 6802478 7444718 7223019 6272289 5166900 4282116 3655371 3302495 3141855 3175652
18573 3175652 3440945 3872765 4092911 4160184 4156238 3829625 3323803 2802927 2444401 2225924
18563 2225924 2123427 2100492 2166143 2378618 2713565 2786964 2530014 2155496 1807990 1544499
18553 1544499 1377275 1292751 1232713 1169629 1128877 1099250 1076993 1065023 1036872 1013057 978023
18542 978023 899658 822503 778004 783998 791601 777327 770950 775565 764501 742515 718729 687478
$$ packed form
18606A22318140O1499265O2716824r482163n1742694o1825367m5595970k6818729
18599E1069306j5557950r003570n099185l009664j875664j315602j351594j440229
18591A2415848j577837j632698j387071j070188p18276m20589r0708M60804Q23193
18582F802478O42240k21699r50730j105389q84784o26745l52876j60640L3797
18573C175652K65293M31820K20146O7273l946l26613n05822n20876l58526k18477
18563B225924j02497k2935O5651K12475L34947P3399k56950l74518l47506k63491
18553A544499j67224q4524o0038o3084m0752k9627k2257j1970k8151k3815l5034
18542I78023p8365p7155m4499N994P603j4274o377M615j1064k1986k3786l1251
$$ plain form
18530 687478 685505 681883 669284 652089 646637 651727 649181 618649 591099 551543 541626 541036 537248
18517 537248 522497 517296 526860 535251 524215 504814 468594 446402 443674 440761 444840 466686 497536
18504 497536 517545 484611 387782 295749 174554 111022 135992 196279 271033 355445 424083
18493 424083 418737 385418 338850 193766 26631 -55795 -127670 -142495 -71343 8574 90218
18482 90218 182060 241190 233590 169090 89313 -3798 -100765 -107424 -50268 17696 63558 99662
18470 99662 126406 151694 158505 163824 154303 149542 156508 174782 170098 158714 171920 173128 196698
18457 196698 210740 189528 173273 161382 155330 139475 143588 166520 172676 159819 150391 153424
18445 153424 166073 182895 175504 165655 163730 147769 109055 103322 79361 59499 86262 120649
$$ packed form
18530F87478j973l622j2599j7195n452N090k546l0532k7550l9556r917n90l788
18517E37248j4751n201R564Q391j1036j9401l6220k2192k728k913M079K1846L0850
18504D97536K0009l2934r6829r2033j21195o3532K4970O0287P4754Q4412O8638
18493D24083n346l3319m6568j45084j67135q2426p1875j4825P1152P9917Q1644
18482I0218R1842N9130p600o4500p9777r3111r6967o659N7156O7964M5862L6104
18470I9662K6744K5288O811N319r521m761O966J8274m684j1384J3206J208K3570
18457A96698J4042k1212j6255j1891o052j5855M113K2932O156j2857r428L033
18445A53424J2649J6822p391r849j925j5961l8714n733k3961j9862K6763L4387
$$ plain form
18433 120649 122784 135843 159845 162374 129450 109587 87245 52134 44276 40365 44209 76698
18421 76698 110154 107286 98943 98631 89449 86899 86963 74931 64802 52351 59150 85759 104508 124649
18407 124649 139617 135106 121912 115665 106608 107655 122427 135667 135891 135515 132466 131088 112715
18394 112715 106378 115264 121979 114830 131659 148078 151412 139634 121417 120972 120827 135840 138089
18381 138089 109199 101859 115246 133700 161790 160805 146015 119177 97753 86795 70758 69808
18369 69808 86214 102327 129518 149170 157987 157349 144087 124716 112740 107385 96805 93263 85179
18356 85179 70746 83209 114375 122741 116914 118800 100771 92207 102829 94017 78008 91522 108995
18343 108995 99598 87349 73329 65971 75135 82168 81058 71080 83900 107918 123405 132251 123179
$$ packed form
18433A20649K135J3059K4002K529l2924j9863k2342l5111p858l911L844L2489
18421G6698L3456k868q343l12r182k550O4j2032j0129j2451O799K6609J8749K0141
18407A24649J4968m511j3194o247r057J047J4772J3240K24l76l049j378j8373
18394A12715o337Q886O715p149J6829J6419L334j1778j8217m45j45J5013K249
18381A38089k8890p340J3387J8454K8090r85j4790k6838k1424j0958j6037r50
18369F9808J6406J6113K7191J9652Q817o38j3262j9371j1976n355j0580l542q084
18356H5179j4433J2463L1166Q366n827J886j8029q564J0622q812j6009J3514J7473
18343A08995r397j2249j4020p358R164P033j110r978J2820K4018J5487Q846r072
$$ plain form
18330 123179 128824 123152 119144 111038 111874 115350 118878 136975 117356 92872 92639 93174 108820 133253
18316 133253 145302 134604 138257 144277 138513 107586 91351 84719 70135 57125 59918 62640 70484
18303 70484 76762 75504 82342 99928 96479 65782 45732 32744 42020 49080 57631 65116 79596
18290 79596 87008 101118 110164 111051 105599 111298 115727 114298 104921 92276 95073 100792 102943 94110
18276 94110 99908 106836 109875 121274 120740 98488 89010 106722 115052 116992 106180 102849 106268 115739
18262 115739 112578 103815 98551 102505 93948 88758 84037 82036 83005 73566 62504 60123 68022 68339
18248 68339 70257 72627 65102 67175 69724 58232 59084 82049 93858 92419 81860 88479 99215
18235 99215 91711 66385 74836 91850 89943 94020 96454 92514 95928 105131 107945 84426 85990 89808
$$ packed form
18330A23179N645n672m008q106Q36L476L528J8097j9619k4484k33N35J5646K4433
18316A33253J2049j0698L653O020n764l0927j6235o632j4584j3010K793K722P844
18303G0484O278j258O838J7586l449l0697k0050j2988R276P060Q551P485J4480
18290G9596P412J4110R046Q87n452N699M429j429r377j2645K797N719K151q833
18276I4110N798O928L039J1399n34k2252r478J7712Q330J940j0812l331L419R471
18262A15739l161q763n264L954q557n190m721k001R69r439j1062k381P899L17
18248F8339J918K370p525K073K549j1492Q52K2965J1809j439j0559O619J0736
18235I9215p504k5326Q451J7014j907M077K434l940L414R203K814k3519J564L818
$$ plain form
18221 89808 102365 107972 106953 124635 142339 166000 193524 205474 221044 256569 263219 255512
18209 255512 240144 216007 209618 236679 223725 191546 148269 114397 107647 94368 83962 86995
18197 86995 101724 111822 106512 101463 112719 137008 147609 144459 139602 150852 168930 170382 146987
18184 146987 124375 116306 110112 105345 110900 113765 117055 117280 116928 114718 108930 117013 124654 112993
18170 112993 105956 98983 107219 103989 96832 102221 107362 119865 136869 133691 125971 122340 113872 99619
18156 99619 112005 136088 152638 172182 171230 166695 159839 169769 195273 216501 231590 242434 231217
18143 231217 228897 238987 247766 263181 281759 294209 298258 300848 309338 309670 319429 347273 365872
18130 365872 394133 424730 477626 520642 551845 589073 642654 708034 791831 900864 1021804
$$ packed form
18221H9808J2557N607j019J7682J7704K3661K7524J1950J5570L5525O650p707
18209B55512j5368k4137o389K7061j2954l2179m3277l3872o750j3279j0406L033
18197H6995J4729J0098n310n049J1256K4289J0601l150m857J1250J8078J452k3395
18184A46987k2612q069o194m767N555K865L290K25l52k210n788Q083P641j1661
18170A12993p037o973Q236l230p157N389N141J2503J7004l178p720l631q468j4253
18156I9619J2386K4083J6550J9544r52m535o856R930K5504K1228J5089J0844j1217
18143B31217k320J0090Q779J5415J8578J2450M049K590Q490L32R759K7844J8599
18130C65872K8261L0597N2896M3016L1203L7228N3581O5380Q3797J09033J20940
$$ plain form
18119 1021804 1151213 1306754 1534433 1823575 2183559 2763872 3680941 5168042 7886903
18110 7886903 13257264 22492931 27803522 24155102 17148412 10417058 6249718 3950484
18102 3950484 2634306 1871629 1413019 1117987 902529 747339 648161 574420 496422 436032
18092 436032 395125 363917 326536 293942 267655 252713 256858 249380 252650 248249 223696 202873
18080 202873 206207 197373 193313 181899 179301 194804 210885 222033 211917 207955 214472 215835 222228
18067 222228 229927 254446 263813 274283 293932 313582 316645 346777 399710 473301 608552 847321
18055 847321 1265887 1660809 1679180 1490497 1323490 1390700 1670220 1754255 1532199 1216195
18045 1216195 965370 885322 980817 1279058 1636680 1649206 1453081 1260069 1274466 1521330
$$ packed form
18119A021804J29409J55541K27679K89142L59984N80313R17069J487101K718861
18110G886903N370361R235667N310591l648420p006690o731354m167340k299234
18102C950484j316178p62677m58610k95032k15458j55190r9178p3741p7998o0390
18092D36032m0907l1208l7381l2594k6287j4942M145p478L270m401k4553k0823
18080B02873L334q834m060j1414k598J5503J6081J1148j0116l962O517J363O393
18067B22228P699K4519R367J0470J9649J9650L063L0132N2933P3591J35251K38769
18055H47321M18566L94922J8371j88683j67007O7210K79520Q4035k22056l16004
18045A216195k50825q0048R5495K98241L57622J2526j96125j93012J4397K46864
$$ plain form
18035 1521330 1611189 1378982 1029423 711840 495244 370689 309520 280831 247218 204115
18025 204115 176174 171746 178531 186767 185335 174197 149085 131041 131837 141487 144742 156953 173650
18012 173650 170552 157113 155226 161727 159107 141691 140508 142097 141932 139487 124934 130141 138198 139737
17998 139737 131424 126512 138168 150649 153995 154213 152931 148774 154857 166960 168127 170933 169294 166622
17984 166622 167865 168755 161956 166603 160629 155107 165830 170305 179573 193609 205917 220030 216655
17971 216655 234066 251472 245363 259316 271744 282408 296830 335037 370207 421366 514326 687387
17959 687387 1004959 1414601 1508628 1297649 1007028 784732 679175 651022 694146 836441
17949 836441 1126378 1600175 1955762 2105778 2190473 2001020 1606204 1180739 858550 660217
$$ packed form
18035A521330Q9859k32207l49559l17583k16596j24555o1169k8689l3613m3103
18025B04115k7941m428O785Q236j432j1138k5112j8044P96R650L255J2211J6697
18012A73650l098j3439j887O501k620j7416j183J589j65k445j4553N207Q057J539
17998A39737q313m912J1656J2481L346K18j282m157O083J2103J167K806j639k672
17984A66622J243Q90o799M647n974n522J0723M475R268J4036J2308J4113l375
17971B16655J7411J7406o109J3953J2428J0664J4422L8207L5170N1159R2960J73061
17959F87387L17572M09642R4027k10979k90621k22296j05557k8153M3124J42295
17949H36441K89937M73797L55587J50016Q4695j89453l94816m25465l22189j98333
$$ plain form
17939 660217 574397 574794 674833 917696 1296073 1500329 1330017 996479 656158 439350
17929 439350 324982 263312 237922 228042 227000 203150 177185 160675 135464 131318 120876 123530
17917 123530 116054 97280 112370 119484 123839 135059 145235 128913 128671 142619 141713 145993 142050
17904 142050 135664 141632 143917 142819 156607 169715 169989 163683 146992 144508 152458 150179 152956 149643
17890 149643 152190 155762 159905 158850 152116 143496 129959 135619 144865 149655 165081 179955 168387
17877 168387 160432 142437 132281 143895 149201 148782 145280 131685 124658 137191 137862 131985 140589
17864 140589 154911 154812 143079 122699 122690 124296 127867 144298 152236 137318 133265 139518 141955 145763
17850 145763 146746 144595 149599 175083 179007 163690 159108 162810 157038 152453 157115 175221 177662 180757
$$ packed form
17939F60217q5820L97J00039K42863L78377K04256j70312l33538l40321k16808
17929D39350j14368o1670k5390r880j042k3850k5965j6510k5211m146j0442K654
17917A23530p476j8774J5090P114M355J1220J0176j6322k42J3948r06M280l943
17904A42050o386N968K285j098J3788J3108K74o306j6691k484P950k279K777l313
17890A49643K547L572M143j055o734q620j3537N660R246M790J5426J4874j1568
17877A68387p955j7995j0156J1614N306m19l502j3595p027J2533O71n877Q604
17864A40589J4322r9j1733k0380rJ606L571J6431P938j4918m053O253K437L808
17850A45763R83k151N004K5484L924j5317m582L702n772m585M662J8106K441L095
$$ plain form
17836 180757 175829 170559 165215 172350 165601 156221 161352 172584 178805 178628 175003 178656 183010 188107
17822 188107 185425 192053 205191 198081 183252 178258 162115 157975 169123 166996 153814 150034 140161
17809 140161 125755 125790 143952 147370 152519 163032 166824 163774 145664 140718 153577 160958 160314 160379
17795 160379 163448 165469 185332 194052 194455 195392 187290 185775 193370 198030 199820 198192 204846 210199
17781 210199 223511 237965 252443 262762 263287 236492 228382 242367 260744 282281 301664 306467
17769 306467 342592 428643 629303 1002114 1257484 1127993 841058 562228 398870 333940
17759 333940 305887 256116 213389 198560 188421 188613 180322 186543 198008 192526 181403 180494 190565
17746 190565 202644 206111 195139 190211 182388 184464 191933 197947 189698 189366 214605 237809 251970
$$ packed form
17836A80757m928n270n344P135o749r380N131J1232O221j77l625L653M354N097
17822A88107k682O628J3138p110j4829m994j6143m140J1148k127j3182l780r873
17809A40161j4406L5J8162L418N149J0513L792l050j8110m946J2859P381o44O5
17795A60379L069K021J9863Q720M03R37q102j515P595M660J790j628O654N353
17781B10199J3312J4454J4478J0319N25k6795q110J3985J8377K1537J9383M803
17769C06467L6125Q6051K00660L72811K55370j29491k86935k78830j63358o4930
17759C33940k8053m9771m2727j4829j0139J92q291O221J1465n482j1123r09J0071
17746A90565J2079L467j0972m928p823K076P469O014q249l32K5239K3204J4161
$$ plain form
17733 251970 252781 263974 273292 299218 335670 357075 348994 327939 333997 340406 362329 400947 392745
17720 392745 394125 394363 392320 416938 427652 430174 428618 431165 414530 408484 407019 408051 402854 412788
17706 412788 414478 388418 382195 370137 361172 344301 339135 324325 312250 296589 279757 279142 291436
17693 291436 300754 283163 277007 270651 276660 291112 298722 299992 292488 273320 246680 213869 212879
17680 212879 238364 257796 273542 274804 287563 301505 302552 299928 294299 285007 280046 292778 281981
17667 281981 264700 286236 301917 314455 322307 333942 357889 386616 384877 394871 411552 418172
17655 418172 413196 373888 350861 351852 364443 376107 368057 363585 370104 364519 359069 346072 336254
17642 336254 349536 353424 353884 360454 360624 349129 328255 309295 316348 326427 332988 342884 336014
$$ packed form
17733B51970Q11J1193R318K5926L6452K1405q081k1055O058O409K1923L8618q202
17720C92745J380K38k043K4618J0714K522j556K547j6635o046j465J032n197R934
17706D12788J690k6060o223j2058q965j6871n166j4810j2075j5661j6832o15J2294
17693B91436R318j7591o156o356O009J4452P610J270p504j9168k6640l2811r90
17680B12879K5485J9432J5746J262J2759J3942J047k624n629r292m961J2732j0797
17667B81981j7281K1536J5681J2538P852J1635K3947K8727j739R994J6681O620
17655D18172m976l9308k3027R91J2591J1664q050m472O519n585n450j2997r818
17642C36254J3282L888M60O570J70j1495k0874j8960P053J0079O561R896o870
$$ plain form
17629 336014 319556 295682 285277 306800 346142 370710 375479 363518 371390 394857 413448 435262
17617 435262 455786 457284 433578 414990 434537 456067 453593 468914 464252 443818 469450 483338
17605 483338 512654 547973 567024 583026 630618 722726 855716 953560 957989 856889 792045
17594 792045 803199 828486 856528 813366 682248 624010 612419 666701 795030 912100 942949
17583 942949 865799 826719 844890 874725 892760 856299 723356 634748 577012 546271 544084
17572 544084 548878 548879 542296 568147 586915 584159 590295 606112 615515 628775 637851 646129 651946 670441
17558 670441 687701 691491 688087 685414 685248 701409 725123 757415 787243 805780 804065 800406 812628
17545 812628 836202 848480 855329 881324 882997 902150 940376 971965 1006494 1031837 1072623 1113075
$$ packed form
17629C36014j6458k3874j0405K1523L9342K4568M769j1961P872K3467J8591K1814
17617D35262K0524J498k3706j8588J9547K1530k474J5321m662k0434K5632J3888
17605D83338K9316L5319J9051J6002M7592R2108J32990R7844M429j01100o4844
17594G92045J1154K5287K8042m3162j31118n8238j1591N4282J28329J17070L0849
17583I42949p7150l9080J8171K9835J8035l6461j32943q8608n7736l0741k187
17572E44084M794Jo583K5851J8768k756O136J5817R403J3260R076Q278N817J8495
17558F70441J7260L790l404k673j66J6161K3714L2292K9828J8537j715l659J2222
17545H12628K3574J2278O849K5995J673J9153L8226L1589L4529K5343M0786M0452
$$ plain form
17533 1113075 1148845 1177083 1190338 1212462 1262610 1293195 1318453 1331469 1338934 1374253 1432016
17522 1432016 1523149 1611477 1648715 1656763 1691143 1776474 1859984 1932536 2007351 2060886 2119489
17511 2119489 2198691 2344853 2518569 2666349 2801825 2933613 3120494 3384636 3704923 4081644
17501 4081644 4556643 5191089 5855105 6200383 6365026 6551873 6934506 7553629 8092641
17492 8092641 8476811 8907773 9472893 10219460 11236471 12759013 14565061 15913982 17081173
17483 17081173 18341599 20124965 22642586 25285402 28026123 31586342 36451292 43031665
17475 43031665 52460189 67296630 92429578 137972567 215638349 279743803 272319362
17468 272319362 236217361 208212780 224560728 279816510 289403695 246614803 189452505
$$ packed form
17533A113075L5770K8238J3255K2124N0148L0585K5258J3016P465L5319N7763
17522A432016R1133Q8328L7238Q048L4380Q5331Q3510P2552P4815N3535N8603
17511B119489P9202J46162J73716J47780J35476J31788J86881K64142L20287L76721
17501D081644M74999O34446O64016L45278J64643J86847L82633O19123N39012
17492H092641L84170M30962N65120P46567J017011J522542J806048J348921J167191
17483A7081173J260426J783366K517621K642816K740721L560219M864950O580373
17475D3031665R428524J4836441K5132948M5542989P7665782O4105454p424441
17468B72319362l6102001k8004581J6347948N5255782R587185m2788892n7162298
$$ plain form
17461 189452505 147427711 136063524 157961519 219340503 279234834 271032140 232076446
17454 232076446 198251574 205638069 254056660 263934355 218174460 154400813 98592745
17447 98592745 63674706 43254793 31230815 24232720 19783909 16826198 14638255 12585246
17439 12585246 10813145 9643044 9124384 8782179 8094646 7142988 6321470 5789911 5429571
17430 5429571 4958692 4445316 4001812 3613500 3391999 3459335 3656687 3607335 3329185 3009093
17420 3009093 2882241 2987647 3061403 2871670 2505203 2124690 1814830 1596247 1477677 1397620
17410 1397620 1328302 1244034 1147665 1074663 1001895 968422 945848 906716 857698 792732 730444
17399 730444 720899 724555 713372 683574 639078 609389 570660 550992 536135 500764 458059 414507
$$ packed form
17461A89452505m2024794j1364187K1897995O1378984N9894331q202694l8955694
17454B32076446l3824872P386495M8418591R877695m5759895o3773647n5808068
17447I8592745l4918039k0419913j2023978o998095m448811k957711k187943k053009
17439A2585246j772101j170101n18660l42205o87533r51658q21518n31559l60340
17430E429571m70879n13376m43504l88312k21501O7336J97352m9352k78150l20092
17420C009093j26852J05406P3756j89733l66467l80513l09860k18583j18570q0057
17410A397620o9318q4268r6369p3002p2768l3473k2574l9132m9018o4966o2288
17399G30444r545L656j1183k9798m4496k9689l8729j9668j4857l5371m2705m3552
$$ plain form
17387 414507 403447 411723 411936 401360 389491 373243 373169 366253 373702 354899 343119 330882 323302
17374 323302 324166 313161 283881 268291 256258 244284 243391 244490 244446 228402 215991 189557 182067
17361 182067 181538 166570 157453 152833 148403 156347 150665 160199 144049 140356 157216 158356 166861 178532
17347 178532 192719 212118 183890 102548 39015 -65921 -136251 -132534 -116213 -146995 -200999
17336 -200999 -261041 -234770 -149551 -68025 -27890 -45016 -101936 -184654 -215196 -190234 -190802 -233431
17324 -233431 -288043 -380371 -385563 -323282 -266655 -203385 -156662 -146657 -133351 -91877 -66486 -53231
17312 -53231 -55522 -63865 -48289 -39546 -58444 -61142 -60771 -69034 -84798 -77383 -48931 -35231 -27054
17299 -27054 -26624 -44892 -59467 -60269 -31480 2874 21822 36026 78193 147104 232946 262170
$$ packed form
17387D14507j1060Q276K13j0576j1869j6248p4o916P449j8803j1780j2237p580
17374C23302Q64j1005k9280j5590j2033j1974q93J099m4j6044j2411k6434p490
17361A82067n29j4968r117m620m430P944n682R534j6150l693J6860J140Q505J1671
17347A78532J4187J9399k8228q1342o3533j04936p0330L717J6321l0782n4004
17336b00999o0042K6271Q5219Q1526M0135j7126n6920q2718l0542K4962n68m2629
17324b33431n4612r2328n192O2281N6627O3270M6723J0005J3306M1474K5391J3255
17312e3231k291q343J5576Q743j8898k698L71q263j5764P415K8452J3700Q177
17299b7054M30j8268j4575q02K8789L4354J8948J4204M2167O8911Q5842K9224
$$ plain form
17287 262170 225453 153648 72722 17460 -6495 -5992 -3893 -6790 1488 53533 169885 205239
17275 205239 139472 78082 13133 -37576 -61261 -65886 -72309 -76619 -86689 -110038 -132433 -127833
17263 -127833 -116073 -119807 -110909 -95766 -78662 -87905 -95766 -103080 -75134 -61078 -67225 -95522 -106268
17250 -106268 -107156 -108242 -95778 -76829 -56976 -35522 -30419 -37633 -69697 -72359 -57222 -54108 -50366
17237 -50366 -48322 -52450 -57404 -72800 -76934 -69660 -56104 -59660 -68905 -63095 -57482 -53309 -61581 -71048
17223 -71048 -63566 -55074 -26577 20067 35731 2546 -7298 -2463 1566 6441 10101 -4101 -1431
17210 -1431 24301 33068 18636 -1044 -30075 -27030 -32562 -32118 -53048 -44846 -45176 -52248 -56349 -51977
17196 -51977 -46342 -34762 -43911 -75729 -76497 -59247 -26699 -10314 -6617 -27108 -35429 -46575 -50878
$$ packed form
17287B62170l6717p1805q0926n5262k3955N03K099k897Q278N2045J16352L5354
17275B05239o5767o1390o4949n0709k3685m625o423m310j0070k3349k2395M600
17263a27833J1760l734Q898J5143J7104r243p861p314K7946J4056o147k8297j0746
17250a06268q88j086J2464J8949J9853K1454N103p214l2064k662J5137L114L742
17237e0366K044m128m954j5396m134P274J3556l556r245N810N613M173q272r467
17223g1048P482Q492K8497M6644J5664l3185r844M835M029M875L660j4202K670
17210a431K5732Q767j4432j9680k9031L045n532M44k0930Q202l30p072m101M372
17196e1977N635J1580r149l1818p68J7250L2548J6385L697k0491q321j1146m303
$$ plain form
17183 -50878 -35050 -24354 -18303 -12428 -21486 -47293 -59659 -64744 -58931 -48845 -44357 -46099 -45942
17170 -45942 -43642 -30578 1443 20373 33626 36201 23751 -1185 -12925 -5257 31398 78751
17158 78751 55183 15725 -2939 11489 34113 62287 91678 83339 42159 -7409 -39096 -38230
17146 -38230 -19955 -37266 -40183 -26905 -2768 22078 9006 -9007 -18675 -25693 -22164 -19449 4815
17133 4815 18524 15577 11009 5706 -20493 -22603 -25231 -35206 -45616 -44647 -35440 -37600 -40744 -34024
17119 -34024 -34772 -38884 -48210 -42650 -37605 -45924 -36775 -43795 -43802 -39917 -52097 -63335 -61501 -58474 -71043
17104 -71043 -82490 -71494 -63700 -67661 -67095 -66087 -67215 -64210 -68455 -64964 -53972 -57964 -81448 -98958
17090 -98958 -90428 -79315 -63538 -64383 -60177 -60928 -57730 -55078 -62876 -67441 -62594 -66153 -62636 -59507
$$ packed form
17183e0878J5828J0696O051N875r058k5807j2366n085N813J0086M488j742J57
17170d5942K300J3064L2021J8930J3253K575j2450k4936j1740P668L6655M7353
17158G8751k3568l9458j8664J4428K2624K8174K9391q339m1180m9568l1687Q66
17146c8230J8275j7311k917J3278K4137K4846j3072j8013r668p018L529K715K4264
17133D815J3709k947m568n303k6199k110k628r975j0410R69R207k160l144O720
17119c4024p48m112r326N560N045q319R149p020pL885j2180j1238J834L027j2569
17104g1043j1447J0996P794l961N66J008j128L005m245L491J0992l992k3484j7510
17090i8958Q530J1113J5777q45M206p51L198K652p798m565M847l559L517L129
$$ plain form
17076 -59507 -62586 -66544 -69020 -68199 -70633 -80208 -71583 -46763 -43840 -48538 -58703 -52384 -41010 -43667
17062 -43667 -51668 -45761 -36502 -40683 -57533 -61053 -44995 -34425 -21574 -19254 -16819 -31366 -37205
17049 -37205 -44115 -50383 -43612 -45851 -50772 -58749 -49587 -42229 -37026 -44861 -60104 -77746 -86975 -77173
17035 -77173 -81390 -78285 -66679 -43865 -30703 -18667 -20848 -34236 -41209 -40337 -37013 -50427 -64637
17022 -64637 -56879 -55435 -44812 -45106 -44484 -54810 -55678 -52419 -54228 -56071 -54350 -45584 -51570 -47386 -61041
17007 -61041 -59152 -37868 -31938 -24483 -24638 -43114 -59457 -56661 -48189 -17761 -6272 -15332 -18233
16994 -18233 -25674 -26577 -6237 -4557 -19050 -18096 -27181 -46198 -30941 -17358 -25565 -17153 -8825 -4578
16980 -4578 -16299 -24536 -26313 -29969 -35658 -36692 -49191 -52766 -56567 -54765 -43494 -43951 -46451 -49188
$$ packed form
17076e9507l079l958k476Q21k434r575Q625K4820K923m698j0165O319J1374k657
17062d3667q001N907R259m181j6850l520J6058J0570J2851K320K435j4547n839
17049c7205o910o268O771k239m921p977R162P358N203p835j5243j7642r229R802
17035g7173m217L105J1606K2814J3162J2036k181j3388o973Q72L324j3414j4210
17022f4637P758J444J0623k94O22j0326q68L259j809j843J721Q766n986M184j3655
17007f1041J889K1284N930P455j55j8476j6343K796Q472L0428J1489r060k901
16994a8233p441r03K0340J680j4493R54r085j9017J5257J3583q207Q412Q328M247
16980d578j1721q237j777l656n689j034j2499l575l801J802J1271m57k500k737
$$ plain form
16966 -49188 -49923 -47559 -47388 -45882 -54676 -66844 -57959 -45334 -44835 -51361 -49060 -59333 -57016 -57269 -38361
16951 -38361 -22156 -14121 -24277 -39945 -34764 -21938 -15115 -29602 -46437 -46488 -42218 -43326 -53540
16938 -53540 -45734 -33637 -38302 -30991 -30889 -33016 -35784 -36078 -36635 -36823 -32985 -32409 -24841 -27818 -31833
16923 -31833 -41595 -48181 -46329 -37455 -16720 -10111 -23317 -34735 -33066 -35469 -38948 -39629 -32260 -30772
16909 -30772 -10980 2592 6468 5494 -333 -324 -452 3730 3950 14666 25359 32814 46816 57095
16895 57095 66997 77237 74913 72567 83336 95579 110814 131344 160480 202452 250758 324934
16883 324934 440473 626345 938960 1376488 1577224 1453941 1252240 1162565 1344301 1581758
16873 1581758 1497338 1228986 943849 792581 808349 1013839 1407539 1612178 1481339 1263777
$$ packed form
16966d9188p35K364J71J506q794j2168Q885J2625M99o526K301j0273K317k53J8908
16951c8361J6205Q035j0156j5668N181J2826O823j4487j6835n1M270j108j0214
16938e3540P806J2097m665P311J02k127k768k94n57j88L838N76P568k977m015
16923c1833r762o586J852Q874K0735O609j3206j1418J669k403l479o81P369J488
16909c0772J9792J3572L876r74n827Rj28M182K20J0716J0693P455J4002J0279
16895E7095R902J0240k324k346J0769J2243J5235K0530K9136M1972M8306P4176
16883C24934J15539J85872L12615M37528K00736j23283k01701q9675J81736K37457
16873A581758q4420k68352k85137j51268J5768K05490L93700K04639j30839k17562
$$ plain form
16863 1263777 1170750 1328326 1549026 1441149 1113303 745765 477667 305600 196642 131895
16853 131895 95161 66428 58492 63640 65768 60364 52747 53129 50952 35062 17588 10575 15584
16840 15584 14966 12645 -3032 8497 26654 17403 19173 37015 49260 71700 87743 98556 108331
16827 108331 119675 116536 109175 98193 95844 100219 78238 57159 45811 26760 17053 6521
16815 6521 3356 3437 -8486 -24490 -27639 -24337 -8479 -101 -6744 -35698 -35988 -40160 -49034 -41145
16801 -41145 -35918 -38927 -30505 -22752 -22345 -23795 -32253 -41251 -30769 -18792 -21827 -30944 -30651 -28401
16787 -28401 -40444 -43893 -49871 -44475 -27718 -15538 -17249 -24596 -27025 -16840 -20375 -27927 -18597
16774 -18597 1445 3535 -7733 -22974 -34254 -24669 -22588 -19579 -19075 -27195 -31967 -29871 -24302 -37230
$$ packed form
16863A263777r3027J57576K20700j07877l27846l67538k68098j72067j08958o4747
16853A31895l6734k8733p936N148K128n404p617L82k177j5890j7474p013N009
16840A5584o18k321j5677J1529J8157r251J770J7842J2245K2440J6043J0813R775
16827A08331J1344l139p361j0982k349M375k1981k1079j1348j9051r707j0532
16815F521l165Q1j1923j6004l149L302J5858Q378o643k8954k90m172q874P889
16801d1145N227l009Q422P753M07j450q458q998J0482J1977l035r117K93K250
16787b8401j2043l449n978N396J6757J2180j711p347k429J0185l535p552R330
16774a8597K0042K090j1268j5241j1280R585K081L009N04q120m772K096N569j2928
$$ plain form
16760 -37230 -30237 -18099 -21822 -32291 -42241 -44880 -36263 -22068 -11687 -29018 -44594 -49969 -40463
16747 -40463 -36606 -24503 -19762 -26748 -30781 -23977 -21041 -20690 -27320 -36352 -37370 -41010 -31767 -25222
16733 -25222 -26395 -31442 -24547 -23210 -15129 -11586 -27250 -24660 -17516 -17984 -22044 -26827 -24974 -18990
16719 -18990 -25769 -30655 -34465 -35929 -28546 -17909 -8256 -13901 -18811 -20730 -22878 -24195 -32761 -33027
16705 -33027 -23688 -24013 -26684 -37541 -46497 -41700 -22948 -10022 -16470 -9147 -1648 -4376 -18989 -35640
16691 -35640 -38544 -23817 -24961 -27458 -36974 -47375 -46677 -31631 -21375 -30396 -29982 -27503 -30585 -35691
16677 -35691 -28909 -18535 -20334 -30711 -32183 -28037 -29363 -35589 -36749 -37309 -21128 -18474 -20685 -28774
16663 -28774 -26613 -21803 -31010 -39481 -43040 -38704 -34861 -28122 -29000 -14411 114 -10665 -25630 -27465
$$ packed form
16760c7230O993J2138l723j0469r950k639Q617J4195J0381j7331j5576n375R506
16747d0463L857J2103M741o986m033O804K936L51o630r032j018l640R243O545
16733b5222j173n047O895J337Q081L543j5664K590P144m68m060m783J853N984
16719a8990o779m886l810j464P383J0637R653n645m910j919k148j317q566k66
16705c3027R339l25k671j0857q956M797J8752J2926o448P323P499k728j4613j6651
16691c5640k904J4727j144k497r516j0401O98J5046J0256r021M14K479l082n106
16677c5691O782J0374j799j0377j472M146j326o226j160n60J6181K654k211q089
16663b8774K161M810r207q471l559M336L843O739q78J4589J4525j0779j4965j835
$$ plain form
16649 -27465 -35436 -27720 -30505 -43548 -45571 -25657 -26401 -40916 -36893 -28886 -21139 -21682 -19388 -18249
16635 -18249 -19219 -14251 -10010 -5861 -9202 -9316 -6831 -16905 -13703 -24518 -33431 -30296 -32273 -40637
16621 -40637 -38855 -30679 -18269 -13868 -14414 -8636 -10456 -27430 -39774 -34083 -31672 -26809 -13952 -7862
16607 -7862 -11061 -9343 -20126 -24774 -22747 -8276 -8688 -13495 -31460 -43350 -32943 -34431 -38173 -46890
16593 -46890 -42700 -30625 -31459 -24496 -13051 5672 7653 -9750 -19979 -12213 -10436 -12120 -7015
16580 -7015 -3261 6406 11452 13584 9024 -2187 259 16871 12842 6960 5293 -2762 -7796 2618
16566 2618 6918 6566 2324 -2086 5195 -8722 -28738 -22945 -14265 -21363 -22010 -9895 1004 -11678
16552 -11678 -24386 -23823 -8210 -11862 -5949 -8405 -14383 -5867 -12732 -24770 -26536 -18918 -1492 3995
$$ packed form
16649b7465p971P716k785j3043k023J9914p44j4515M023Q007P747n43K294J139
16635a8249r70M968M241M149l341j14K485j0074L202j0815q913L135j977q364
16621d0637J782Q176J2410M401n46N778j820j6974j2344N691K411M863J2857O090
16607g862l199J718j0783m648K027J4471m12m807j7965j1890J0407j488l742q717
16593d6890M190J2075q34O963J1445J8723J981j7403j0229P766J777j684N105
16580g015L754R667N046K132m560j1211K446J6612m029n882j667q055n034J0414
16566B618M300l52m242m410P281j3917k0016N793Q680p098o47J2115J0899j2682
16552a1678j2708N63J5613l652N913k456n978Q516o865j2038j766P618J7426N487
$$ plain form
16538 3995 -8796 -22712 -26627 -15899 -7096 -16193 -16403 -21068 -22910 -35228 -50102 -36293 -31813
16525 -31813 -32734 -24497 -8142 9274 5652 -9920 -24278 -21257 -14268 -9105 -7217 -8576 -20920
16512 -20920 -22674 -9549 2995 18568 34096 27929 9350 -9514 -23800 -20431 -14620 -27688
16500 -27688 -22821 -17419 -26876 -33433 -34057 -24760 -1802 10732 6509 -2374 -5459 -9181 -630 4103
16486 4103 -2984 -2465 2762 -8930 -9852 -21376 -29302 -29176 -17534 -26591 -25789 -28075 -29823 -38533 -31918
16471 -31918 -20230 -14872 -22544 -26357 -20535 -19275 -24216 -30982 -16841 -7480 -10083 -17271 -17480 -19671
16457 -19671 -14683 5154 1032 -5396 -3768 -19574 -28581 -9691 4640 2077 -3310 -11913 -18981
16444 -18981 -26863 -19929 219 -8905 -7863 -16001 -13879 -20173 -32640 -44864 -27221 -10679 5769
$$ packed form
16538C995j2791j3916l915J0728Q803r097k10m665j842j2318j4874J3809M480
16525c1813r21Q237J6355J7416l622j5572j4358L021O989N163J888j359j2344
16512b0920j754J3125J2544J5573J5528o167j8579j8864j4286L369N811j3068
16500b7688M867N402r457o557o24R297K2958J2534m223q883l085l722Q551M733
16486D103p087N19N227j1692r22j1524p926J26J1642r057Q02k286j748q710O615
16471c1918J1688N358p672l813N822J260m941o766J4141R361k603p188k09k191
16457a9671M988J9837m122o428J628j5806r007J8890J4331k563n387q603p068
16444a8981p882O934K0148r124J042q138K122o294j2467j2224J7643J6542J6448
$$ plain form
16431 5769 7278 421 -5606 -2443 -14712 -22827 -40982 -37987 -24058 -18277 -23331 -18745 2233 1397
16417 1397 -9976 -5858 -7873 -7425 -9177 -18877 -23669 -7771 -1688 399 -16183 -25052 -25145 -24366 -14577
16402 -14577 -18539 -20416 -17591 -5581 -8525 -9110 3954 -9208 -27564 -33511 -18858 -17697 -8994
16389 -8994 -19867 -28396 -38499 -43340 -49309 -31499 -17150 -16709 -14612 1396 8620 -1476 -11604
16376 -11604 -27209 -25257 -23172 -26929 -24910 -32139 -28279 -27758 -19162 -19157 -13389 -13475 -17352 -28503 -19903
16361 -19903 -4779 5871 -500 -7231 -8290 -20300 -18095 -10735 -13568 -17119 -26979 -27811 -34328 -26278
16347 -26278 -4373 4966 6189 3664 -8733 -7441 -22244 -35365 -33491 -26146 -10792 -156 -5259
16334 -5259 -23393 -35425 -38891 -26746 -13431 -13098 -34088 -47720 -29814 -8769 -14697 -25586 -29111
$$ packed form
16431E769J509o857o027L163j2269q115j8155K995J3929N781n054M586K0978q36
16417A397j1373M118k015M48j752r700m792J5898O083K087j6582q869r3P79R789
16402a4577l962j877K825J2010k944n85J3064j3162j8356n947J4653J161Q703
16389h994j0873q529j0103m841n969J7810J4349M41K097J6008P224j0096j0128
16376a1604j5605J952K085l757K019p229L860N21Q596NN768q6l877j1151Q600
16361a9903J5124J0650o371o731j059j2010K205P360k833l551r860q32o517Q050
16347b6278K1905R339J223k525j2397J292j4803j3121J874P345J5354J0636n103
16334e259j8134j2032l466J2145J3315L33k0990j3632J7906K1045n928j0889l525
$$ plain form
16321 -29111 -21603 -16084 -13162 -12618 -17957 -15483 -17488 -29704 -41926 -24017 -14276 -19892 -13892 -7476
16307 -7476 -4296 -9233 -10253 -8760 -14186 -22224 -27631 -38164 -38910 -30159 -26526 -30214 -30843 -32448 -27871
16292 -27871 -11545 -467 7669 12417 10474 17991 7895 -3869 -27843 -33767 -24008 -10523 -5413
16279 -5413 10244 14479 14070 -567 -14347 -24995 -37308 -22107 -18686 -23345 -23801 -29065 -23323 -11142
16265 -11142 -9595 -17349 -28217 -29927 -30895 -26408 -25429 -27579 -17945 -11156 -19625 -23041 -13544 -3999 -4659
16250 -4659 -11822 -15169 -17440 -18544 -23836 -23560 -18101 -12380 -7950 202 3553 -8797 -16766 -8203 266
16235 266 -13547 -13436 -12176 -20336 -24796 -30659 -27209 -16718 -8694 -5806 -14524 -9444 -3011 -1416 1203
16220 1203 6897 -9349 -23141 -19599 -12404 -19840 -21209 -20983 -27228 -25759 -36891 -31587 -12954 5036
$$ packed form
16321b9111P508N519K922N44n339K474k005j2216j2222J7909R741n616O000O416
16307g476L180m937j020J493n426q038n407j0533p46Q751L633l688o29j605M577
16292b7871J6326J1078Q136M748j943P517j0096j1764k3974n924R759J3485N110
16279e413J5657M235m09j4637j3780j0648j2313J5201L421m659m56n264N742J2181
16265a1142J547p754j0868j710r68M487R79k150R634O789q469l416R497R545o60
16250d659p163l347k271j104n292K76N459N721M430Q152L351j2350p969Q563Q469
16235B66j3813J11J260q160m460n863L450J0491Q024K888q718N080O433J595K619
16220A203N694j6246j3792L542P195p436j369K26o245J469j1132N304J8633J7990
$$ plain form
16206 5036 -739 -11922 -14850 -5109 13860 12496 -7343 -4163 -8502 -20724 -19328 -17421 -13742 -21512
16192 -21512 -15737 -9108 -11432 -11849 -20358 -9439 -2978 18848 17667 2529 -1951 -8119 -5373 -14754
16178 -14754 -11137 5035 2269 -4216 103 -5237 -9817 -3678 -10976 -27687 -31271 -33081 -26790 -4930
16164 -4930 -2141 -10817 -6265 -17770 -17765 -21819 -25029 -17946 -22499 -25585 -16426 -12434 -6723 -573 -8639
16149 -8639 -19838 -19635 -16081 -28770 -28932 -26421 -32875 -31520 -13857 -12632 -14950 -23432 -33290 -27282
16135 -27282 -27650 -28420 -27517 -24666 -25932 -17618 -9751 -11829 -15854 -3862 4003 6495 -2465 -2903 8275
16120 8275 15562 -2934 -17129 -11347 -4274 -5769 878 -4293 -2449 -550 -5140 -17917 -20367 -19129
16106 -19129 -738 9500 4629 -533 -4642 -5198 -4203 -3882 -13099 -9770 -19367 -17877 -13070 -13508 -20666
$$ packed form
16206E036n775j1183k928R741J8969j364j9839L180m339j2222J396J907L679p770
16192b1512N775O629k324m17q509J0919O461K1826j181j5138m480o168K746r381
16178a4754L617J6172k766o485M319n340m580O139p298j6711l584j810O291K1860
16164d930K789q676M552j1505Nm054l210P083m553l086R159L992N711O150q066
16149h639j1199K03L554j2689j62K511o454J355J7663J225k318q482r858O008
16135b7282l68p70R03K851j266Q314P867k078m025J1992P865K492q960m38J1178
16120H275P287j8496j4195N782P073j495O647n171J844J899m590j2777k450J238
16106a9129J8391J0238m871n162m109n56R95L21r217L329r597J490M807m38p158
$$ plain form
16091 -20666 -27370 -16459 129 958 -7962 -2803 4343 13855 2293 -8269 -14662 -24438 -21395 -23549
16077 -23549 -23519 -13381 -13902 -30187 -30957 -35774 -34411 -26800 -17788 -15728 -11080 -9178 -20705 -22606 -6065
16062 -6065 -4037 -3908 -8754 -10539 2556 12887 18082 18543 17167 11694 -7127 -9303 -1263 -4972
16048 -4972 -9812 -8987 -19820 -22055 -16354 -6715 3970 -800 -20756 -31260 -17574 -18976 -22902 -25392
16034 -25392 -35198 -29073 -18050 -20618 -14835 -16525 -8655 -10251 -10252 -15790 -12180 -6917 -6065 -15790 -23346
16019 -23346 -16479 -10534 -15024 -16061 -15484 -15302 -10768 -10763 -1889 -521 -3261 -16559 -23004 -14558 -10702
16004 -10702 -6413 9727 5288 -428 8450 16364 8710 -11234 -13670 -8509 -11415 -12709 -9941 -3319
15990 -3319 -522 -20490 -17819 -10729 -12264 -105 700 -7589 -17010 -19928 -19266 -7367 -7355 -1190 -109
$$ packed form
16091b0666o704J0911J6588Q29q920N159P146R512j1562j0562o393r776L043k154
16077b3549L0J0138n21j6285p70m817J363P611R012K060M648J902j1527j901J6541
16062f065K028J29m846j785J3095J0331N195M61j376n473j8821k176Q040l709
16048d972m840Q25j0833k235N701R639J0685m770j9956j0504J3686j402l926k490
16034b5392r806O125J1023k568N783j690P870j596jn538L610N263Q52r725p556
16019b3346O867N945m490j037N77J82M534NQ874J368k740j3298o445Q446L856
16004a0702M289J6140m439n716Q878P914p654j9944k436N161k906j294K768O622
15990c319K797j9968K671P090j535J2159Q05q289r421k918O62J1899J2O165J081
$$ plain form
15975 -109 -17765 -18940 -8871 -11725 -5177 -7949 -9267 513 -5460 -5033 -174 -5584 -14043 -26007
15961 -26007 -30171 -25029 -12975 -9903 -10000 -12793 -9836 -5510 -5943 -9412 -23089 -39795 -50384 -39913
15947 -39913 -36868 -27879 -20681 -25550 -27540 -33591 -27890 -15729 -8810 -23753 -21531 -4668 -450 -7330
15933 -7330 -10058 -10944 -4247 17138 18779 3476 -7025 3239 -7499 -18010 -26601 -29556 -15914
15920 -15914 5651 -1242 -2671 -1945 3424 1280 -5927 4257 -4216 -5242 -4264 12018 25882 24259
15906 24259 23241 12791 5134 -9245 -34450 -44334 -22331 -6442 -1424 -8362 -15580 -23162 -27898
15893 -27898 -28280 -19120 -15614 -7752 -8550 -19140 -18604 -7801 -3269 -15299 -31655 -29134 -16137 -13417
15879 -13417 -19730 -17976 -11938 -11073 -6857 2651 -3424 -19782 -33098 -23370 -5700 5433 8422 10698
$$ packed form
15975a09j7656j175J0069k854O548k772j318R780n973M27M859n410q459j1964
15961b6007m164N142J2054L072r7k793K957M326m33l469j3677j6706j0589J0471
15947c9913L045Q989P198m869j990o051N701J2161O919j4943K222J6863M218o880
15933g330k728q86O697K1385J641j5303j0501J0264j0738j0511q591k955J3642
15920a5914K1565o893j429P26N369k144p207J0184q473j026R78J6282J3864j623
15906B4259j018j0450p657j4379k5205r884K2003J5889N018o938p218p582m736
15893b7898l82R160L506P862p98j0590N36J0803M532j2030j6356K521J2997K720
15879a3417o313J754O038Q65M216R508o075j6358j3316R728J7670J1133K989K276
$$ plain form
15865 10698 -974 -16498 -7795 1050 4254 6261 9133 915 2444 -1845 -4723 -6655 -7682 369
15851 369 7659 4035 -5165 -11865 -24417 -35576 -23705 -5493 250 -5141 -13581 -15878 -13944 -463
15837 -463 12533 25396 14749 1980 12097 9035 5039 7975 8705 -10353 -12009 -7099 271 -863
15823 -863 -12501 4651 17590 8524 7691 24573 22345 10021 -1796 3040 8632 18070 26778 61480
15809 61480 122405 157574 131954 96853 56024 15387 -4179 -15488 -11067 -8004 -2924 -7736
15797 -7736 -15935 -15330 -12255 -18184 -8131 -483 12474 32536 50384 80859 151153 176668 138148
15784 138148 113921 87205 44926 22634 18727 2692 -5542 -2076 -8561 -12834 -2329 -10265 -30779
15771 -30779 -22721 -11028 -25430 -24411 -11372 -10584 -15571 -12006 -6227 -6241 -20864 -23404 -11502 -2760
$$ packed form
15865A0698j1672j5524Q703Q845L204K007K872q218J529m289k878j932j027Q051
15851C69P290l624r200o700j2552j1159J1871J8212N743n391q440k297J934J3481
15837d63J2996J2863j0647j2769J0117l062l996K936P30j9058j656M910P370j134
15823h63j1638J7152J2939r066q33J6882k228j2324j1817M836N592R438Q708L4702
15809F1480O0925L5169k5620l5101m0829m0637j9566j1309M421L063N080m812
15797g736q199O05L075n929J0053P648J2957K0062J7848L0475P0294K5515l8520
15784A38148k4227k6716m2279k2292l907j6035q234L466o485m273J0505p936k0514
15771c0779Q058J1693j4402J019J3039P88m987L565N779j4j4623k540J1902Q742
$$ plain form
15757 -2760 -14202 -20210 -10463 -1147 14967 6719 -6946 1232 9729 -5541 -8577 2793 12786
15744 12786 20889 16016 20187 15465 13051 1539 3236 764 -3265 5247 2370 -17127 -29386 -43563
15730 -43563 -42790 -27906 -10579 -4403 -11529 -14185 -15414 -12732 2180 -3302 7577 13362 942
15717 942 -4210 -13484 -11766 -5022 -15313 -12569 -2974 874 2624 3779 -10231 -4706 4877 10744
15703 10744 -11315 -24628 -19524 -9494 -5197 -6707 -15433 -16259 -18498 -11540 -6546 5322 13407 25049
15689 25049 13535 -3624 -2508 4048 2441 -2845 -10280 -15463 -8970 -1340 -8988 -13777 -14296 -22111
15675 -22111 -21500 -25216 -33133 -30375 -31404 -26443 -19827 -17428 -10065 -11009 -23585 -22850 -24074 -24031 -15794
15660 -15794 -8576 11174 18955 703 -7380 -7863 4858 7879 9253 18026 8775 16158 19346 24737
$$ packed form
15757b760j1442o008R747R316J6114q248j3665Q178Q497j5270l036J1370R993
15744A2786Q103m873M171m722k414j1512J697k472m029Q512k877j9497j2259j4177
15730d3563P73J4884J7327O176p126k656j229K682J4912n482J0879N785j2420
15717I42n152r274J718O744j0291K744R595L848J750J155j4010N525R583N867
15703A0744k2059j3313N104J0030M297j510q726q26k239O958M994J1868Q085J1642
15689B5049j1514j7159J116O556j607n286p435n183O493P630p648m789n19p815
15675b2111O11l716p917K758j029M961O616K399P363r44j2576P35j224M3Q237
15660a5794P218J9750P781j8252q083m83J2721L021J374Q773r251P383L188N391
$$ plain form
15646 24737 31523 44020 41743 31758 39394 53304 108308 153944 149601 107435 69482 46952 28412
15633 28412 5139 -8335 -17955 -19988 -21125 -22534 -16522 5748 10168 9298 -12305 -17956 -6221
15620 -6221 14792 52459 86798 110660 104217 84682 52142 24721 8400 8069 5560 378 -892
15607 -892 2203 -5336 -20715 -39626 -34204 -10153 12723 30881 23139 21123 20133 18314 25216 26360
15593 26360 28069 20195 1825 -478 -8755 -15295 154 5835 21107 17811 9474 846 -5488 -5175
15579 -5175 7259 18462 15973 2571 7022 -90 -129 3270 -11864 -14695 -11548 -2876 -18674 -23425
15565 -23425 -29124 -27026 -25270 -26377 -15393 -9781 -2327 -9098 -10079 -4510 -5747 6121 8830 9315
15551 9315 9812 -2515 6529 17066 13128 -1573 -8133 -10632 -2002 8590 2183 -2181 -4174 5897
$$ packed form
15646B4737O786J2497k277r985P636J3910N5004M5636m343m2166l7953k2530j8540
15633B8412k3273j3474r620k033j137j409O012K2270M420q70k1603n651J1735
15620f221K1013L7667L4339K3862o443j9535l2540k7421j6321l31k509n182j270
15607h92L095p539j5379j8911N422K4051K2876J8158p742k016r90j819O902J144
15593B6360J709p874j8370k303q277o540J5449N681J5272l296q337q628o334L13
15579e175J2434J1203k489j3402M451p112l9L399j5134k831L147Q672j5798m751
15565b3425n699K098J756j107J0984N612P454o771r81N569j237J1868K709M85
15551I315M97j2327R044J0537l938j4701o560k499Q630J0592o407m364j993J0071
$$ plain form
15537 5897 5209 -3631 -3042 9376 -1674 2960 -4521 -19044 -12807 -2794 -6999 -6503 1272 -6206
15523 -6206 -3825 8233 12094 2814 1316 7318 9764 4171 -5651 -6029 -1993 1170 -8517 -9688 -14307
15508 -14307 -12919 -6981 -4334 929 -3397 -9006 278 2876 -3506 -9034 -7793 -16487 -13020 -18241
15494 -18241 -12538 543 8002 16164 5285 -8846 -9546 -3645 -4857 -21329 -24362 -14274 -22303
15481 -22303 -31308 -32288 -27896 -27881 -16850 -3068 3305 -8017 -9929 -12970 -18050 -23544 -18499 -13915
15467 -13915 -5963 4880 11586 9323 3375 1487 -6244 -7219 8576 18378 21934 32002 37916 14631
15453 14631 4428 -876 -335 3457 -10208 -21877 -16672 -13186 -13970 -10333 -2071 1887 -1774 -17554
15439 -17554 -14763 -19657 -34480 -40953 -32819 -20652 -4533 -5272 -7751 10338 23949 25659 17630
$$ packed form
15537E897o88q840N89J2418j1050M634p481j4523O237J0013m205M96P775p478
15523f206K381J2058L861r280j498O002K446n593r822l78M036L163r687j171m619
15508a4307J388N938K647N263m326n609R284K598o382n528J241q694L467n221
15494a8241N703J3081P459Q162j0879j4131p00N901j212j6472l033J0088q029
15481b2303r005r80M392J5J1031J3782O373j1322j912l041n080n494N045M584
15467a3915P952J0843O706k263n948j888p731r75J5795R802L556J0068N914k3285
15453A4631j0203n304N41L792j3665j1669N205L486p84L637Q262L958l661j5780
15439a7554K791m894j4823o473Q134J2167J6119p39k479J8089J3611J710q029
$$ plain form
15426 17630 10770 7134 -12532 -26272 -28088 -29229 -18379 -8684 -12099 -25983 -18562 -12686 -9574
15413 -9574 -5202 -4620 -6276 -6576 8482 22492 14092 17570 6169 -9319 -17285 -18720 -35493 -22214
15399 -22214 -7170 -9858 -16498 -15367 -152 -8005 -3389 6183 14847 16955 12948 -1269 -3441 6936
15385 6936 13440 15894 6328 8180 5260 -4589 -17919 -23314 -13203 3255 3997 17650 16955 -51
15371 -51 -9187 1603 6911 -1877 -17617 -20419 -17526 -13624 -6615 -5908 1810 2758 2719 4190 8620 1089
15355 1089 -329 6139 3400 -7789 -25089 -30461 -14171 -11226 -12584 -15285 -17898 -16815 -9391 5203
15341 5203 1621 -12758 -2535 -1508 2593 -1340 -2862 -1314 3453 2635 -13813 -13676 -11693 -5412
15327 -5412 -3431 -10952 -12529 -7307 -21193 -28495 -31431 -19972 -18327 -13379 5889 -297 -9087 -11839
$$ packed form
15426A7630o860l636j9666j3740j816j141J0850R695l415j3884P421N876L112
15413i574M372N82j656l00J5058J4010q400L478j1401j5488p966j435j6773J3279
15399b2214J5044k688o640J131J5215p853M616R572Q664K108m007j4217k172J0377
15385F936O504K454r566J852k920r849j3330n395J0111J6458P42J3653o95j7006
15371e1r136J0790N308q788j5740k802K893L902P009P07P718R48l9J471M430p531
15355A089j418O468k739j1189j7300n372J6290K945j358k701k613J083P424J4594
15341E203l582j4379J0223J027M101l933j522J548M767q18j6448J37J983O281
15327e412J981p521j577N222j3886p302k936J1459J645M948J9268o186q790k752
$$ plain form
15313 -11839 -11208 -14082 -6681 11664 11446 -6862 -19120 -9821 -20591 -23582 -11975 -11458 -11911 -7972
15299 -7972 -8354 716 -6373 -14081 -5287 7277 -6254 -3475 1022 -477 3014 2739 -8953 -20776
15285 -20776 -25526 -25533 -18716 -13828 -110 -5716 -20210 -9944 -7019 -10940 -23441 -21269 -17704 -26169
15271 -26169 -28964 -18813 -16539 -13046 -13118 -11233 -7813 -1281 -971 689 2478 -956 4331 8636 300
15256 300 -1359 -5092 12577 24282 14685 8508 5897 8149 5556 13723 7872 -645 154 1997 22720
15241 22720 20938 11007 -6877 -6416 -2963 -14769 -18418 -10009 -12354 -15670 -15456 -13311 -4262 -16706
15227 -16706 -9779 -6309 -13356 -23749 -17417 -10046 -7830 -6671 -8131 -5133 -9553 -5933 -14411 -7194
15213 -7194 9843 4812 -9099 -13216 -15159 -9908 -14948 -29158 -26819 -6165 -2796 -8812 -14743 -21983
$$ packed form
15313a1839O31k874P401J8345k18j8308j2258R299j0770k991J1607N17m53L939
15299g972l82R070p089p708Q794J2564j3531K779M497j499L491k75j1692j1823
15285b0776m750pO817M888J3718n606j4494J0266K925l921j2501K172L565q465
15271b6169k795J0151K274L493p2J885L420O532L10J660J789l434N287M305q336
15256C00j659l733J7669J1705r597o177k611K252k593Q167n851q517P99J843K0723
15241B2720j782r931j7884M61L453j1806l649Q409k345l316K14K145R049j2444
15227a6706O927L470p047j0393O332P371K216J159j460K998m420L620q478P217
15213g194J7037n031j3911m117j943N251n040j4210K339K0654L369o016n931p240
$$ plain form
15199 -21983 -20420 -17099 -14723 -16669 -22710 -15082 1491 10282 11372 10709 -6356 891 3321 -897
15185 -897 -1533 2546 10591 4544 5054 6109 14986 11255 12776 1080 -15346 -11383 -11657 -14476 -22593
15170 -22593 -27786 -18029 -10387 -21792 -21740 -17714 -15041 -18462 -27263 -29302 -20573 -28779 -18798 -15051 -9266
15155 -9266 8773 5671 -2670 -9844 -13422 -1481 9044 18849 24936 14249 -3494 -18512 -11449
15142 -11449 10676 22037 5465 -1557 11680 -3404 -3928 5004 13205 11290 11708 3427 -5942 -15772
15128 -15772 -26669 -13828 -15808 -21135 1208 4471 15177 6593 -1282 819 939 8412 10124 14974
15114 14974 25503 18669 15670 15520 12103 8294 10431 2508 -1191 -3968 1433 4748 12144 11455 -3332
15099 -3332 -11155 -13962 -13987 -8702 314 12439 25105 16589 5018 25150 59326 71259 78811 83960
$$ packed form
15199b1983J563L321K376j946o041P628J6573Q791J090o63j7065P247K430m218
15185h97o36M079Q045o047N10J055Q877l731J521j1696j6426L963k74k819q117
15170b2593n193R757P642j1405N2M026K673l421q801k039Q729q206R981L747N785
15155i266J8039l102q341p174l578J1941J0525R805O087j0687j7743j5018P063
15142a1449K2125J1361j6572p022J3237j5084n24Q932Q201j915M18q281r369r830
15128a5772j0897J2841j980n327K2343L263J0706q584p875K101J20P473J712M850
15114A4974J0529o834k999j50l417l809K137p923l699k777N401L315P396o89j4787
15099c332p823k807k5N285R016J2125J2666q516j1571K0132L4176J1933P552N149
$$ plain form
15085 83960 82700 102876 124317 135807 133313 137304 135184 123236 102263 77036 61772 60997 42146
15072 42146 37051 30803 42580 40383 29983 18095 5229 19806 26375 28858 24175 24587 19124
15059 19124 11677 14964 19890 15009 14328 19285 3787 -624 10857 15645 5928 -6107 -7849 -8653
15045 -8653 -13038 -16846 -17838 -5390 -13202 -18958 -7479 7643 8049 -2443 -15558 -12659 -6035 1631
15031 1631 -3799 7084 17281 8204 13359 9723 1867 17398 25473 17966 10838 13463 3744 -781
15017 -781 3492 1294 -11661 -19060 -7098 1306 -13151 -7521 -913 4802 12852 5765 1619 -7007
15003 -7007 -22252 -30273 -26639 -9453 -8793 -20306 -17681 -10954 2282 -680 -2663 -2402 -15727 -8250
14989 -8250 -5464 -13563 -9755 2401 2278 -5574 -14808 -22515 -27945 -29975 -4898 2642 -7682 -4434
$$ packed form
15085H3960j260K0176K1441J1490k494L991k120j1948k0973k5227j5264p75j8851
15072D2146n095o248J1777k197j0400j1888j2866J4577O569K483m683M12n463
15059A9124p447L287M926m881o81M957j5498m411J1481M788r717j2035j742q04
15045h653m385l808r92J2448p812n756J1479J5122M06j0492j3115K899O624P666
15031A631n430J0883J0197r077N155l636p856J5531Q075p507p128K625r719m525
15017g81M273k198j2955p399J1962Q404j4457N630O608N715Q050p087m146q626
15003g007j5245q021L634J7186O60j1513K625O727J3236k962j983K61j3325P477
14989h250K786q099L808J2156j23p852r234p707n430k030K5077P540j0324L248
$$ plain form
14975 -4434 -14189 -25558 -28087 -18633 -17514 -30175 -32114 -21918 -19003 -21806 -26420 -9945 -5379 3128
14961 3128 -8920 -14371 -14596 -15815 -6868 -7808 -11129 -6520 5748 -1000 -3338 -1218 -1801 -9483 -12664
14946 -12664 -12123 -6383 2290 4748 2762 -4218 6058 -535 -5307 -5030 -3315 -7659 -18971 -19322 -21058
14931 -21058 -19302 -30483 -24802 -28776 -31085 -20630 -14021 -8326 -11764 -11277 -10067 -10080 3451 -2774
14917 -2774 -2087 -841 -11305 -8006 -3360 -1933 -10207 -18755 -16932 -16648 -17730 -15707 -6294 1317 -1893
14902 -1893 -11114 -18224 -14627 -1267 3592 17627 4778 7593 3135 -15765 -12896 -16120 -15539 -17539
14888 -17539 -14900 -14651 -16338 -7300 -3240 2761 2505 -2065 16832 29932 16648 17194 10083 2609
14874 2609 -9772 -6078 -13309 -22413 -25419 -24370 -12868 -6739 -13743 -17749 -10589 -9693 -19313 -11330
$$ packed form
14975d434r755j1369k529R454J119j2661j939J0196K915k803m614J6475M566Q507
14961C128j2048n451k25j219Q947r40l321M609J2268o748k338K120n83p682l181
14946a2664N41N740Q673K458j986o980J0276o593m772K77J715m344j1312l51j736
14931b1058J756j1181N681l974k309J0455O609N695l438M87J210j3J3531o225
14917b774O87J246j0464L299M646J427q274q548J823K84j082K023R413P611l210
14902a893r221p110L597J3360M859J4035j2849K815m458j8900K869l224N81k000
14888a7539K639K49j687R038M060O001k56m570J8897J3100j3284N46p111p474
14874B609j2381L694p231r104l006J049J1502O129p004m006P160Q96r620P983
$$ plain form
14860 -11330 4844 9487 12538 2382 -12542 -11733 -8095 -21320 -21877 -20994 -16220 -8423 12279 24232
14846 24232 11883 6147 15956 21950 19416 13818 25393 19603 14272 16827 2048 -19733 -29476
14833 -29476 -29590 -40122 -32983 -27440 -31192 -31169 -22157 -16019 -18937 -9289 -4261 10467 5506 -3441 -8110
14818 -8110 -13831 -15650 -21824 -18484 -20810 -32168 -20810 -10535 -11244 -21853 -29026 -33043 -29543 -23587
14804 -23587 -15326 -19430 -21440 -17104 -26259 -44496 -32015 -13029 1661 -9529 -23715 -21912 -19496
14791 -19496 -15786 -15429 -4911 -132 -10261 -20932 -16698 1872 -4057 13793 18186 6064 5359
14778 5359 4559 -7112 -17618 -6713 9416 6166 -8827 -2993 -10120 -23546 -15733 -11318 -12821
14765 -12821 5761 7707 -8656 -8435 -12643 -15774 -10962 -8620 -991 1667 5862 -3659 -16898 -14578
$$ packed form
14860a1330J6174M643L051j0156j4924Q09L638j3225n57Q83M774P797K0702J1953
14846B4232j2349n736R809N994k534n598J1575n790n331K555j4779k1781r743
14833b9476j14j0532P139N543l752K3R012O138k918R648N028J4728m961q947m669
14818h110n721j819o174L340k326j1358J1358J0275p09j0609p173m017L500N956
14804b3587Q261m104k010M336r155j8237J2481J8986J4690j1190j4186J803K416
14791a9496L710L57J0518M779j0129j0671M234J8570n929J7850M393j2122p05
14778E359q00j1671j0506J0905J6129l250j4993N834p127j3426P813M415j503
14765a2821J8582J946j6363K21m208l131M812K342P629K658M195r521j3239K320
$$ plain form
14751 -14578 2089 10130 -48 -19260 -11718 9727 4711 -3065 -11232 -3531 1661 357 2865
14738 2865 364 1483 6426 8856 13822 10602 -252 -12260 -1822 5088 -5999 -17337 -9849
14725 -9849 -9137 -19756 -9317 -1141 -3042 -11174 -19751 -14623 -14899 -7203 3781 5921 2465 -675
14711 -675 3749 18481 12158 -4409 6630 8925 -11738 -21906 -20499 -16981 2943 7095 3537
14698 3537 2468 3234 7469 5714 -4615 -9193 -6983 -6470 -2970 -8099 -3590 888 -2572 -2811 -9169
14683 -9169 -11200 5143 9174 6150 6732 -5582 -20962 -20912 -11988 -9719 -17079 -14013 -5985 -5112 -7346
14668 -7346 946 -121 -4905 -8563 -19004 -714 -1650 -11150 -11174 -13667 -25060 -26970 -8968 8703
14654 8703 9651 -673 -2420 4266 1895 10901 6141 -6368 -14501 -17107 6167 19259 10845 -2675
$$ packed form
14751a4578J6667Q041j0178j9212P542K1445n016p776q167P701N192j304K508
14738B865k501J119M943K430M966l220j0854j2008J0438O910j1087j1338P488
14725i849P12j0619J0439Q176j901q132q577N128k76P696J0984K140l456l140
14711f75M424J4732o323j6567J1039K295k0663j0168J407L518J9924M152l558
14698C537j069P66M235j755j0329m578K210N13L500n129M509M478l460k39o358
14683i169k031J6343M031l024N82j2314j5380N0Q924K269p360L066Q028Q73k234
14668g346Q292j067m784l658j0441J8290r36r500k4k493j1393j910J8002J7671
14654H703R48j0324j747O686k371R006m760j2509q133k606K3274J3092q414j3520
$$ plain form
14640 -2675 -7353 -22910 -15638 -21308 -24566 -16684 -1536 6393 2565 -3233 -487 6163 5850 -14203
14626 -14203 -21835 -13176 -2672 6769 -1353 85 8833 18609 20178 13587 5108 -2583 -21751 -33324
14612 -33324 -23555 -19320 -10677 -8278 -15807 -15973 -15874 -17801 -18024 -18490 -1415 9727 13885 8938 -688
14597 -688 -4691 -14206 -28756 -30608 -29319 -6902 7074 18196 13427 -4256 -6637 -8512 6368
14584 6368 19194 9560 8995 10869 13226 10501 12921 13950 5181 4552 12513 12868 15139 5177 -1133
14569 -1133 -7345 -7585 -10008 -22096 -18086 -8230 11043 22369 6441 -20285 -21466 -12478 6478
14556 6478 15004 7470 -7888 6739 7289 -3402 1911 11597 10467 -3860 -12875 -17122 -9613 -14449
14542 -14449 -12357 -15187 -14670 -957 11214 17741 11286 10826 5307 2575 6733 15143 20835 10479
$$ packed form
14640b675m678j5557P272n670l258P882J5148P929l828n798K746O650l13k0053
14626a4203p632Q659J0504R441q122J438Q748R776J569o591q479p691j9168j1573
14612c3324R769M235Q643K399p529j66R9j927k23m66J7075J1142M158m947r626
14597f88m003r515j4550j852J289K2417J3976J1122m769j7683k381j875J4880
14584F368J2826r634n65J874K357k725K420J029q769o29P961L55K271r962o310
14569a133o212k40k423j2088M010R856J9273J1326j5928k6726j181Q988J8956
14556F478Q526p534j5358J4627N50j0691N313R686j130j4327r015m247P509m836
14542a4449K092k830N17J3713J2171O527o455m60n519k732M158Q410N692j0356
$$ plain form
14528 10479 -542 -12169 -26783 -18733 -4470 -3754 -2888 -16491 -13104 2103 8929 -4227 -13657
14515 -13657 -21632 -18681 -3464 5759 9011 -7420 -8771 201 8475 3813 -4807 -6869 1791 4487
14501 4487 5469 6052 15148 7982 -2608 -1602 -5754 5044 4380 4459 -2830 -9554 -2620 -2018 -12205
14486 -12205 -8433 -16256 -13969 8180 16031 7770 -5226 -12107 -8373 -17061 -19511 -18542 -11531 -1845
14472 -1845 4078 -1840 -1144 -3054 -10806 2287 3307 13646 8549 4507 1535 -7791 -3372 -5652
14458 -5652 -5290 -10199 -21645 -30377 -25297 6018 11713 12106 -2830 -2078 1840 3323 5594 12819 25709
14443 25709 25721 27984 27536 22870 15215 12888 14558 8507 4736 -482 2367 2397 -5345 -2346 -19727
14428 -19727 -31115 -20141 -6856 -10092 -6430 -6204 -3040 131 -4666 -5751 -5487 -1842 -4185 -11385
$$ packed form
14528A0479j1021j1627j4614Q050J4263P16Q66j3603L387J5207O826j3156r430
14515a3657p975K951J5217R223L252j6431j351Q972Q274m662q620k062Q660K696
14501D487R82N83R096p166j0590J006m152J0798o64P9p289o724O934O02j0187
14486a2205L772p823K287K2149P851q261j2996o881L734q688k450R69P011R686
14472a845N923n918O96j910p752J3093J020J0339n097m042k972r326M419k280
14458e652L62m909j1446q732N080L1315N695L93j4936P52L918J483K271P225J2890
14443B5709J2K263m48m666p655k327J670o051l771n218K849L0p742K999j7381
14428a9727j1388J0974J3285l236L662K26L164L171m797j085K64L645k343p200
$$ plain form
14414 -11385 -22561 -18861 -22570 -14622 -4419 2848 -3265 -2978 -9088 -15591 -28721 -14385 -1476
14401 -1476 11078 13788 18932 32140 17670 9902 14015 306 -19965 -22375 -21000 -5958 -8560
14388 -8560 3428 -656 4947 -2152 -6989 -3037 -10204 -24440 -11106 -6623 -16406 -10222 -11740 -7307
14374 -7307 -4981 -4379 3325 6902 8162 8175 5604 5007 -1141 -5162 -16909 -24756 -4260 7402 1874
14359 1874 -5154 -16851 -19359 -16087 -19052 -17163 -2913 6579 14632 23214 17948 10372 8793 4978
14345 4978 -1091 -8258 -11345 -21434 -18420 -9901 -9392 -12431 -6171 -14323 -18091 -9010 -24516 -27823
14331 -27823 -19625 -12948 -7836 -423 -6877 -758 7656 -2845 -10338 -4708 -3635 11250 11408 287
14317 287 128 7839 4400 1342 6260 5641 5045 343 -5241 -12000 -12741 -6730 -8736 -12802 -490 15728
$$ packed form
14414a1385j1176L700l709P948J0203P267o113K87o110o503j3130J4336J2909
14401a476J2554K710N144J3208j4470p768M113j3709k0271k410J375J5042k602
14388h560J1988m084N603p099m837L952p167j4236J3334M483r783O184j518M433
14374g307K326O02P704L577J260J3k571n97o148m021j1747p847K0496J1662n528
14359A874p028j1697k508L272k965J889J4250R492Q053Q582n266p576j579l815
14345D978o069p167l087j0089L014Q519N09l039O260q152l768R081j5506l307
14331b7823Q198O677N112P413o454O119Q414j0501p493N630J073J4885J58j1121
14317B87j59P711l439l058M918o19n96m702n584o759p41O011k006m066J2312J6218
$$ plain form
14301 15728 18544 4938 -22898 -31714 -22766 -12071 -13529 -14082 -10845 -21896 -14302 -5265 -6569 6614
14287 6614 28352 17209 11505 7229 -6922 -7479 5520 6216 -3095 -1865 4036 4358 -11453 -8989
14273 -8989 474 -3602 771 -9667 -22105 -27214 -13139 5537 13880 -7720 -17077 3439 17421
14260 17421 20949 15881 17482 15763 3457 -5340 -4684 11892 14255 18667 16652 16938 5651 -8140
14246 -8140 -13185 -9093 1097 2313 8674 9238 20767 11997 3622 11317 11409 5398 2417 9465 9504
14231 9504 221 14392 23844 20782 13105 13521 4469 6030 26034 46737 52473 38439 34803 42270
14217 42270 49924 47086 44106 36733 34119 27564 15612 -8561 -11813 -11968 -8922 9238 28250 39555
14203 39555 32139 18355 16593 1812 8979 14098 -356 1956 5148 -8074 -12223 -5066 4923
$$ packed form
14301A5728K816j3606k7836q816Q948J0695j458n53L237j1051P594R037j304J3183
14287F614K1738j1143n704m276j4151n57J2999O96r311J230N901L22j5811K464
14273h989R463m076M373j0438j2438n109J4075J8676Q343k1600r357K0516J3982
14260A7421L528n068J601j719j2306q797O56J6576K363M412k015K86j1287j3791
14246h140n045M092J0190J216O361N64J1529q770q375P695R2o011k981P048L9
14231I504r283J4171R452l062p677M16r052J561K0004K0703N736j4034l636P467
14217D2270P654k838k980p373k614o555j1952k4173l252j55L046J8160J9012J1305
14203C9555p416j3784j762j4781P167N119j4454K312L192j3222m149P157R989
$$ plain form
14190 4923 4508 9653 18338 20125 12982 9567 19081 27544 24857 35697 48780 57993 62320 42442
14176 42442 28358 30759 29853 37386 47538 47161 39554 24073 20224 19464 15503 9399 563 -810
14162 -810 -8797 -8820 -16053 -25547 -11679 -1186 -6587 -3531 -4929 223 6048 258 1580 11411 18427
14147 18427 17155 1791 7988 13841 10567 5084 12089 19183 28054 26303 20733 16161 31801 43886
14133 43886 47686 48543 45981 45043 42220 24586 15638 10831 20140 26761 14603 7393 13690 9388
14119 9388 -5293 -6417 -156 8353 3505 -9868 -20027 -5009 -6423 -5598 9238 15116 8683 1678
14105 1678 16668 12492 -4586 -17583 -10965 5999 19949 15329 16654 15192 5165 89 -12869
14092 -12869 -6103 4245 9353 -2369 -9065 -11099 -1526 -16750 -6082 -7443 -2342 -6449 -5733 -12708
$$ packed form
14190D923m15N145Q685J787p143l415R514Q463k687J0840J3083R213M327j9878
14176D2442j4084K401r06P533J0152l77p607j5481l849p60l961o104q836j373
14162h10p987k3p233r494J3868J0493n401L056j398N152N825n790J322R831P016
14147A8427j272j5364O197N853l274n483P005P094Q871j751n570m572J5640J2085
14133D3886L800Q57k562r38k823j7634q948m807R309O621j2158p210O297m302
14119I388j4681j124O261Q509m848j3373j0159J5018j414Q25J4836N878o433p005
14105A678J4990m176j7078j2997O618J6964J3950m620J325j462j0027n076j2958
14092a2869O766J0348N108j1722o696k034R573j5224J0668j361N101m107P16o975
$$ plain form
14078 -12708 -13625 -4023 4296 4230 -8340 -17664 -3331 -5135 -10638 -12812 2077 14680 8877 -1725
14064 -1725 3248 8222 12095 6546 9620 1169 -3840 -988 6114 3036 7344 12983 15224 4691
14050 4691 8114 14294 26798 27661 22636 23706 6670 -17100 -6990 2636 -12788 -17658 -10930 -13248
14036 -13248 -14580 -17921 -9242 -21592 -30154 -16014 -7565 -16604 -13424 2352 20916 20484 12259 13203
14022 13203 -4156 -10214 -8926 -869 1429 -4112 1260 10575 12279 3160 2820 -3441 -10533 -5125
14008 -5125 200 -7894 -9501 1742 13290 21016 12709 13695 10074 -4264 8655 15026 -549 -9485
13994 -9485 -7126 -9445 -19898 -18083 -23474 -21964 -20371 -16181 -11415 -5999 2208 -6806 -10660 -6514
13980 -6514 -3044 905 -18062 -19022 -12153 -6752 3413 9794 5103 2964 10960 10646 -14 3604
$$ packed form
14078a2708r17R602Q319o6j2570r324J4333j804n503k174J4889J2603n803j0602
14064a725M973M974L873n549L074q451n009K852P102l078M308N639K241j0533
14050D691L423O180J2504Q63n025J070j7036k3770J0110R626j5424m870O728k318
14036a3248j332l341Q679j2350q562J4140Q449r039L180J5776J8564m32q225R44
14022A3203j7359o058J288Q057K298n541N372R315J704r119l40o261p092N408
14008e125N325q094j607J1243J1548P726q307R86l621j4338J2919O371j5575q936
13994i485K359k319j0453J815n391J510J593M190M766N416Q207r014l854M146
13980f514L470L949j8967r60O869N401J0165O381m691k139P996l14j0660L618
$$ plain form
13966 3604 -1024 4516 12006 21437 16185 11421 4700 7656 11594 16774 15635 14798 8006 13953 16252
13951 16252 11812 3205 3767 8815 9424 6060 -4882 -7478 -9233 -5442 -9402 -15541 -14938 -236 1936
13936 1936 15220 34355 43619 41914 25037 15390 -5965 241 10377 13409 13343 8984 1308 -5501
13922 -5501 3596 24657 27970 19917 12441 1800 4371 4932 -5649 -1321 -4951 -9972 -21652 -30217
13908 -30217 -11782 12794 12128 847 8713 15878 18607 4445 7754 18047 16456 13165 5674
13895 5674 516 -11443 -20191 -21939 -6519 6587 16464 19967 20670 25523 10109 -2248 -17962
13882 -17962 -33206 -22084 -1907 7731 9884 -4232 -2749 9467 9100 -2865 -2490 -977 -5613
13869 -5613 -14584 -14752 -10918 -23862 -19969 -15419 -3207 -474 -7882 -10068 -9187 -16177 -20979 -675
$$ packed form
13966C604m628N540P490R431n252m764o721K956L938N180j139q37o792N947K299
13951A6252m440q607N62N048O09l364j0942k596j755L791l960o139O03J4702K172
13936A936J3284J9135R264j705j6877r647k1355O206J0136L032o6m359p676o809
13922e501R097K1061L313q053p476j0641K571N61j0581M328l630n021j1680q565
13908c0217J8435K4576o66j1281P866P165K729j4162L309J0293j591l291p491
13895E674n158j1959q748j748J5420J3106R877L503P03M853j5414j2357j5714
13882a7962j5244J1122K0177R638K153j4116J483J2216l67j1965L75J513m636
13869e613q971j68L834j2944L893M550J2212K733p408k186Q81o990m802K0304
$$ plain form
13855 -675 5993 -2829 171 970 -3748 -869 12713 9345 189 2957 -4151 -18659 -6109 3133
13841 3133 8506 7592 -8646 -17881 -26262 -23429 -7929 -1874 -10181 2972 17789 4937 1912 5548
13827 5548 7489 5190 14829 8080 6047 7813 -1314 -1698 -3459 -955 -2330 17741 18212 28239 18765
13812 18765 13028 6682 8358 8008 2314 10549 10977 7251 11250 21934 18902 2075 1382 6909 16232
13797 16232 22905 31605 27520 16096 -2399 -11138 -10352 -27389 -33512 -34534 -29059 -16159 -14678 -10389
13783 -10389 4100 8164 4552 -6522 -31166 -19032 8253 9035 -1255 13211 15965 4851 9851
13770 9851 4052 -2471 7520 6809 11863 14571 9258 9590 13679 22076 35097 50306 44689 37330 27051
13755 27051 23589 9801 -8285 -9761 -18238 -29880 -23427 -8643 2760 2452 2994 6046 2080 2499
$$ packed form
13855f75O668q822L000P99m718K879J3582l368r156K768p108j4508J2550R242
13841C133N373r14j6238r235q381K833J5500O055q307J3153J4817j2852l025L636
13827E548J941k299R639o749k033J766r127l84j761K504j375K0071M71J0027r474
13812A8765n737o346J676l50n694Q235M28l726L999J0684l032j6827o93N527R323
13797A6232O673Q700m085j1424j8495q739P86j7037o123j022N475J2900J481M289
13783a0389J4489M064l612j1074k4644J2134K7285P82j0290J4466K754j1114N000
13770I851n799o523R991p11N054K708n313L32M089Q397J3021J5209n617p359j0279
13755B7051l462j3788j8086j476q477j1642O453J4784J1403l08N42L052l966M19
$$ plain form
13741 2499 -3409 -3583 5743 15004 2888 2646 17800 14285 2840 -1622 12798 24068 2315 -3305
13727 -3305 502 663 9532 24420 25177 17804 13714 12208 32283 49044 49159 39093 44319 39178
13713 39178 26837 17437 4308 9570 15267 13319 16212 11072 21316 36660 34787 21745 16313
13700 16313 29666 25851 12906 9231 18710 12341 11108 22061 17890 7912 22828 33246 27325
13687 27325 4661 -12019 -24620 -24690 -26082 -22175 -18679 -13312 1471 16442 14375 15506 12120 12424
13673 12424 18656 12432 11016 17103 15472 19613 20795 19179 18939 30076 38111 25312 23159 24521
13659 24521 20052 14675 8801 13231 29945 23480 15264 12291 31008 31783 21587 25499 34773 34821
13645 34821 30243 23627 13189 4933 16233 26997 29552 20553 22487 32750 33138 38121 33181 36178
$$ packed form
13741B499n908j74R326R261j2116k42J5154l515j1445m462J4420J1270k1753n620
13727c305L807J61Q869J4888P57p373m090j506K0075J6761J15j0066N226n141
13713C9178j2341r400j3129N262N697j948K893n140J0244J5344j873j3042n432
13700A6313J3353l815j2945l675R479o369j233J0953m171r978J4916J0418n921
13687B7325k2664j6680j2601p0j392L907L496N367J4783J4971k067J131l386L04
13673A2424O232o224j416O087j631M141J182j616k40J1137Q035j2799k153J362
13659B4521m469n377n874M430J6714o465q216k973J8717P75j0196L912R274M8
13645C4821m578o616j0438q256J1300J0764K555q999J934J0263L88M983m940K997
$$ plain form
13631 36178 19619 5592 17312 25913 21427 10627 11498 17568 36137 36773 42084 52728 67700
13618 67700 78004 95105 102103 103441 97926 76197 54964 43877 36917 28548 27435 33485 41304
13605 41304 46898 39320 26886 32890 43172 35078 32794 34222 35817 17459 3090 8267 28158
13592 28158 33256 23310 32718 31000 28108 28241 24226 29061 18277 16955 11306 9100 21935 25273
13578 25273 36237 32485 26928 24584 33054 43546 69516 73672 56683 43212 34905 30799 22143
13565 22143 12586 5865 -3248 -5445 -6420 8338 33207 30243 32791 37214 36847 33264 34985 41115
13551 41115 61489 69182 65153 71075 106500 163423 212040 229994 216466 208088 200663 216175 204120
13538 204120 167962 124596 90022 55436 56233 52659 52008 61765 59045 41069 26878 30951 26685
$$ packed form
13631C6178j6559j4027J1720Q601m486j0800Q71O070J8569O36N311J0644J4972
13618F7700J0304J7101O998J338n515k1729k1233j1087o960q369j113O050P819
13605D1304N594p578j2434O004J0282q094k284J428J595j8358j4369N177J9891
13592B8158N098r946R408j718k892J33m015M835j0784j322n649k206J2835L338
13578B5273J0964l752n557k344Q470J0492K5970M156j6989j3471q307m106q656
13565B2143r557o721r113k197r75J4758K4869k964K548M423l67l583J721O130
13551D1115K0374P693m029N922L5425N6923M8617J7954j3528q378p425J5512j2055
13538B04120l6158m3366l4574l4586P97l574o51R757k720j7976j4191M073m266
$$ plain form
13525 26685 24756 24257 21798 16468 20438 13115 3835 -679 12141 12885 25434 19806 16915 19881
13511 19881 26418 19839 21220 34879 58213 77090 75021 74463 86907 89698 99192 130840 174568
13498 174568 217742 297419 435259 587533 608459 486209 327891 198715 124632 86193
$$ packed form
13525B6685j929m99k459n330L970p323r280m514J2820P44J2549n628k891K966
13511A9881O537o579J381J3659K3334J8877k069n58J2444K791R494L1648M3728
13498A74568M3174P9677J37840J52274K0926j22250j58318j29176p4083l8439
$$ [...]
##END NTUPLES=NMR SPECTRUM
##END=
