##TITLE=Analysis number 314508
Compound Code cc 03613
Book Reference 461/4
Project Code adrs
Chemist Name toml
##JCAMPDX= 6.0         $$ Bruker NMR JCAMP-DX V2.0
##DATA TYPE= NMR SPECTRUM
##DATA CLASS= NTUPLES
##ORIGIN= Bruker BioSpin GmbH
##OWNER= NMR
$$ XWIN-NMR		Version 3.5
$$ Wed Oct 19 11:10:40 2005 GMT Daylight Time (UT+1h)  MAYBRIDGE\NMR@NMR_250MHZ
##.OBSERVE FREQUENCY= 250.131544655141
##.OBSERVE NUCLEUS= ^1H
##.ACQUISITION MODE= SIMULTANEOUS (DQD)
##.ACQUISITION SCHEME= undefined
##.AVERAGES= 16
##.DIGITISER RES= 18
##SPECTROMETER/DATA SYSTEM= dpx250
##.PULSE SEQUENCE= zg30
##.SOLVENT NAME= CDCl3
##.SHIFT REFERENCE= (INTERNAL, CDCl3, 0, 16.522)
##AUDIT TRAIL= $$ (NUMBER, WHEN, WHO, WHERE, WHAT)
$$ ##TITLE= Audit trail, XWIN-NMR		Version 3.5
$$ ##JCAMPDX= 5.01
$$ ##ORIGIN= Bruker BioSpin GmbH
$$ ##OWNER= NMR
$$ C:\u/data/dgb/nmr/ADRS/11020/pdata/1/auditp.txt
$$ ##AUDIT TRAIL=  $$ (NUMBER, WHEN, WHO, WHERE, WHAT)
(   1,<2005-10-19 11:10:22.03 +100>,<MAYBRIDGE\NMR>,<NMR_250MHZ>,
      <created by zg, POWCHK disabled, PULCHK disabled
       configuration hash MD5:
       62 19 C7 07 E1 42 D1 B7 37 6C 3D D0 77 39 F9 E6
       data hash MD5: 64K
       28 8D E0 2A AE 27 A4 A9 64 60 B7 5F 9A D3 4E 89>)
(   2,<2005-10-19 11:10:32.89 +100>,<MAYBRIDGE\NMR>,<NMR_250MHZ>,
      <Start of raw data processing
       ef LB = 0.3 FT_mod = 6 PKNL = 1 SI = 32K 
       data hash MD5: 32K
       44 81 42 DC D9 1F 44 7D 00 3B DF 30 89 5B 7D 4D>)
(   3,<2005-10-19 11:10:34.96 +100>,<MAYBRIDGE\NMR>,<NMR_250MHZ>,
      <apk 
       data hash MD5: 32K
       1E F4 D3 E1 59 A8 73 83 CB 51 D2 3E 64 A5 FF C2>)
(   4,<2005-10-19 11:10:35.72 +100>,<MAYBRIDGE\NMR>,<NMR_250MHZ>,
      <abs ABSG = 5 
       data hash MD5: 32K
       D6 A9 48 B9 78 56 1C 8A 8E 92 15 0C 32 20 A6 AA>)
$$ ##END=
$$ 
$$ hash MD5
$$ 6F C2 48 71 B4 6A 95 5D B9 9A 87 33 48 63 3E B1
##$RELAX= 
##$RELAX= 
##$RELAX= 
##$RELAX= 
##$RELAX= 
##$RELAX= 
##$RELAX= 
$$ Bruker specific parameters
$$ --------------------------
##$DU= <C:\u>
##$EXPNO= 11020
##$NAME= <ADRS>
##$PROCNO= 1
##$TYPE= <nmr>
##$USER= <dgb>
##$AMP= (0..31)
100 100 100 100 100 100 100 100 100 100 100 100 100 100 100 100 100 100 
100 100 100 100 100 100 100 100 100 100 100 100 100 100 
##$AQSEQ= 0
##$AQ_mod= 3
##$AUNM= <au_zg>
##$AUTOPOS= <15 >
##$BF1= 250.13
##$BF2= 250.13
##$BF3= 250.13
##$BF4= 250.13
##$BF5= 500.13
##$BF6= 500.13
##$BF7= 500.13
##$BF8= 500.13
##$BYTORDA= 1
##$CFDGTYP= 0
##$CFRGTYP= 5
##$CHEMSTR= <none>
##$CNST= (0..31)
1 1 145 1 1 1 1 1 1 1 1 1 1 1 1 1 1 1 1 1 1 1 1 1 1 1 1 1 1 1 1 1 
##$CPDPRG= <>
##$CPDPRG1= <>
##$CPDPRG2= <>
##$CPDPRG3= <>
##$CPDPRG4= <mlev>
##$CPDPRG5= <mlev>
##$CPDPRG6= <mlev>
##$CPDPRG7= <mlev>
##$CPDPRG8= <mlev>
##$CPDPRGB= <>
##$CPDPRGT= <>
##$D= (0..31)
0 1 0 0 0 0 0 0 0 0.06 0 0 0 0 0 0 0.0002 0 0 0 0 0 0 0 0 0 0 0 0 0 0 
0 
##$DATE= 1129716621
##$DBL= (0..7)
120 120 120 120 120 120 120 120 
##$DBP= (0..7)
150 150 150 150 150 150 150 150 
##$DBP07= 0
##$DBPNAM0= <>
##$DBPNAM1= <>
$$ [...]
##$SUBNAM7= <"">
##$SUBNAM8= <"">
##$SUBNAM9= <"">
##$SW= 20.6930455092707
##$SWIBOX= (0..15)
0 0 3 0 0 0 0 0 0 0 0 0 0 0 0 0 
##$SW_h= 5175.983436853
##$TD= 65536
##$TD0= 1
##$TE= 295.16
##$TE2= 300
##$TE3= 300
##$TEG= 300
##$TL= (0..7)
0 120 120 120 120 120 120 120 
##$TP= (0..7)
150 150 150 150 150 150 150 150 
##$TP07= 0
##$TPNAME0= <>
##$TPNAME1= <>
##$TPNAME2= <>
##$TPNAME3= <>
##$TPNAME4= <>
##$TPNAME5= <>
##$TPNAME6= <>
##$TPNAME7= <>
##$TPOAL= (0..7)
0.5 0.5 0.5 0.5 0.5 0.5 0.5 0.5 
##$TPOFFS= (0..7)
0 0 0 0 0 0 0 0 
##$TUNHIN= 0
##$TUNHOUT= 0
##$TUNXOUT= 0
##$USERA1= <user>
##$USERA2= <user>
##$USERA3= <user>
##$USERA4= <user>
##$USERA5= <user>
##$V9= 5
##$VALIST= <valist>
##$VCLIST= <CCCCCCCCCCCCCCC>
##$VD= 0
##$VDLIST= <DDDDDDDDDDDDDDD>
##$VPLIST= <PPPPPPPPPPPPPPP>
##$VTLIST= <TTTTTTTTTTTTTTT>
##$WBST= 1024
##$WBSW= 4
##$XGAIN= (0..3)
0 0 0 0 
##$XL= 0
##$YL= 0
##$YMAX_a= 433729
##$YMIN_a= -445690
##$ZGOPTNS= <>
##$ZL1= 120
##$ZL2= 120
##$ZL3= 120
##$ZL4= 120
##$ABSF1= 16.522
##$ABSF2= -4.171173
##$ABSG= 5
##$ABSL= 3
##$ALPHA= 0
##$AQORDER= 0
##$ASSFAC= 0
##$ASSFACI= 0
##$ASSFACX= 0
##$ASSWID= 0
##$AUNMP= <proc_1d>
##$AZFE= 0.1
##$AZFW= 0.1
##$BCFW= 0
##$BC_mod= 0
##$BYTORDP= 0
##$COROFFS= 0
##$CY= 12.5
##$DATMOD= 1
##$DC= 0
##$DFILT= <>
##$DTYPP= 0
##$F1P= 14.0000005364418
##$F2P= -0.99999901652339
##$FCOR= 0.5
##$FTSIZE= 32768
##$FT_mod= 6
##$GAMMA= 0
##$GB= 0
##$INTBC= 1
##$INTSCL= 1
##$ISEN= 128
##$LB= 0.3
##$LEV0= 0
##$LPBIN= 0
##$MAXI= 10000
##$MC2= 0
##$MEAN= 0
##$ME_mod= 0
##$MI= 0
##$NCOEF= 0
##$NC_proc= -3
##$NLEV= 6
##$NOISF1= 0
##$NOISF2= 0
##$NSP= 0
##$NTH_PI= 0
##$NZP= 0
##$OFFSET= 16.522
##$PC= 1
##$PHC0= 136.6197
##$PHC1= 5.407996
##$PH_mod= 1
##$PKNL= yes
##$PPARMOD= 0
##$PSCAL= 4
##$PSIGN= 0
##$REVERSE= no
##$SF= 250.13
##$SI= 32768
##$SIGF1= 0
##$SIGF2= 0
##$SINO= 400
##$SIOLD= 32768
##$SREGLST= <1H.CDCl3>
##$SSB= 0
##$STSI= 32768
##$STSR= 0
##$SW_p= 5175.98343685301
##$SYMM= 0
##$S_DEV= 0
##$TDeff= 65536
##$TDoff= 0
##$TI= <Analysis number 999999
Compound Code 99
Book Reference 9
Project Code 9>
##$TILT= no
##$TM1= 0
##$TM2= 0
##$TOPLEV= 0
##$USERP1= <user>
##$USERP2= <user>
##$USERP3= <user>
##$USERP4= <user>
##$USERP5= <user>
##$WDW= 1
##$XDIM= 32768
##$YMAX_p= 416782991
##$YMIN_p= -21734
$$ End of Bruker specific parameters
$$ ---------------------------------
##NTUPLES= NMR SPECTRUM
##VAR_NAME=  FREQUENCY,     SPECTRUM/REAL,   SPECTRUM/IMAG
##SYMBOL=    X,             R,               I
##VAR_TYPE=  INDEPENDENT,   DEPENDENT,       DEPENDENT
##VAR_FORM=  AFFN,          ASDF,            ASDF
##VAR_DIM=   32768,         32768,           32768
##UNITS=     HZ,            ARBITRARY UNITS, ARBITRARY UNITS
##FACTOR=    0.157963299565203, 1,           1
##FIRST=     4132.6476996994, 0,             0
##LAST=      -1043.33573715361, 0,           0
##MIN=       -1043.33573715361, -21734,      0
##MAX=       4132.6476996994, 416782991,     0
$$ Real data points
##PAGE= N=1
##DATA TABLE= (X++(R..R)), XYDATA
$$ [...]
$$ plain form
18519 14268 12970 13467 13960 14843 17164 23521 27020 26866 27954 29622 30915 35153 38514 38909 37884 39602
18503 39602 39468 41188 43896 39523 37209 32657 28952 31791 31763 37609 39527 37449 37727 36823 35203 30466
18487 30466 27034 28183 34397 33022 27574 30805 31015 26405 26587 27060 27424 28351 23346 18388 19517 17502
18471 17502 16055 16253 14712 15409 16073 17204 18005 18526 12360 5333 5647 9820 10664 14681 16859 18845
18455 18845 19386 21583 21734 20028 18777 16317 17839 16782 19090 18359 18428 18802 21481 25101 27762 26343
18439 26343 27971 30506 31707 35481 36634 37940 41042 43724 41072 42222 42909 42824 46597 44700 42843
18424 42843 43603 41576 43580 43205 39117 42845 50483 54989 61638 66428 69153 71751 72637 76146 76923
18409 76923 78961 80966 85836 88061 90152 96209 103387 106207 115559 128362 136561 140728 141173 141055 136099
$$ packed form
18519A4268j298M97M93Q83K321O357L499j54J088J668J293M238L361L95j025J718
18503C9602j34J720K708m373k314m552l705K839k8N846J918k078K78r04j620m737
18487C0466l432J149O214j375n448L231K10m610J82M73L64R27n005m958J129k015
18471A7502j447J98j541O97O64J131Q01N21o166p027L14M173Q44M017K178J986
18455A8845N41K197J51j706j251k460J522j057K308p31O9L74K679L620K661j419
18439B6343J628K535J201L774J153J306L102K682k652J150O87q5L773j897j857
18424D2843P60k027K004l75m088L728P638M506O649M790K725K598Q86L509P77
18409G6923K038K005M870K225K091O057P178K820R352J2803Q199M167M45j18m956
$$ plain form
18394 136099 127513 115717 102953 94827 85450 78295 73747 71303 70932 66808 59700 56792 55399 56899
18380 56899 51433 48396 45992 45731 45396 44068 41542 41627 43548 44478 45252 45256 46541 47065 48574 50510 47855
18363 47855 47584 50499 53228 51729 49500 45400 45448 46879 47484 47142 46773 47692 46740 47437 48627 45689 40077
18346 40077 35887 34204 30416 29800 33828 33737 35408 37447 34631 31813 29559 30250 29538 31662 34901 34425
18330 34425 33000 27948 27463 29605 31863 33709 28714 30245 33166 33261 30172 29822 31082 34004 32083
18315 32083 36782 43234 42174 37730 38518 37347 35551 35097 37249 37297 33817 35131 38419 40055 39449 38071
18299 38071 35405 35978 37702 44739 45891 45855 44859 40921 40648 38844 38626 35770 36476 36771 38205 39365
18283 39365 36509 34676 32540 34648 36369 34876 32837 30873 27274 27648 25542 24482 24853 25443 23379
$$ packed form
18394A36099q586j1796j2764q126r377p155m548k444l71m124p108k908j393J500
18380E6899n466l037k404k61l35j328k526Q5J921R30P74MJ285N24J509J936k655
18363D7855k71K915K729j499k229m100M8J431O05l42l69R19r52O97J190k938n612
18346D0077m190j683l788o16M028r1J671K039k816k818k254O91p12K124L239m76
18330C4425j425n052m85K142K258J846m995J531K921R5l089l50J260K922j921
18315C2083M699O452j060m444P88j171j796m54K152M8l480J314L288J636o06j378
18299C8071k666N73J724P037J152l6r96l938k73j804k18k856P06K95J434J160
18283C9365k856j833k136K108J721j493k039j964l599L74k106j060L71N90k064
$$ plain form
18268 23379 21220 22271 25148 28962 28087 25756 22850 24471 26528 25621 24725 27067 26153 23275 20255
18253 20255 21079 21607 22059 26866 27363 23397 21661 20303 23283 24934 24847 25916 24689 26213 33387 35892
18237 35892 41143 47208 52396 50188 48701 50978 49886 47106 46852 48542 50570 51337 47328 44577 44951
18222 44951 48360 49630 47562 42483 46113 49962 47856 46345 47757 49457 52279 56185 57901 58063 56859
18207 56859 58805 61761 63784 69375 72278 76559 79979 82772 90363 99257 106545 108639 108465 111133 112187
18192 112187 109023 107949 110213 112377 113963 113476 112306 110588 109501 110461 109958 105249 99899 100654 96997
18177 96997 92109 86496 83935 84114 86699 87444 87962 81510 81158 79715 76046 74891 70979 69290 70383
18162 70383 75601 76344 74358 72533 70844 70242 71244 71357 67981 69667 72232 73210 74488 76347 75600 76870
$$ packed form
18268B3379k159J051K877L814q75k331k906J621K057r07q96K342r14k878l020
18253B0255Q24N28M52M807M97l966j736j358K980J651q7J069j227J524P174K505
18237C5892N251O065N188k208j487K277j092k780k54J690K028P67m009k751L74
18222D4951L409J270k068n079L630L849k106j511J412J700K822L906J716J62j204
18207E6859J946K956K023N591K903M281L420K793P591Q894P288K094j74K668J054
18192A12187l164j074K264K164J586m87j170j718j087R60n03m709n350P55l657
18177I6997m888n613k561J79K585P45N18o452l52j443l669j155l912j689J093
18162G0383N218P43j986j825j689o02J002J13l376J686K565R78J278J859p47J270
$$ plain form
18146 76870 78576 80840 82943 81646 84630 94351 100408 102922 110346 123690 134379 141137 147120 154043
18132 154043 163325 174015 188309 202725 218056 240322 263097 287883 314505 350752 399298 468985
18120 468985 570175 712412 904309 1191303 1692024 2701701 4499945 6179565 6392011
18111 6392011 4820076 3248436 2332989 1757510 1385829 1143370 979989 869005 795520
18102 795520 741753 707712 684275 661847 631992 584308 530588 485230 445278 412535 384039
18091 384039 362262 347362 331246 313203 294619 277948 267096 258857 252247 247548 243464 241592
18079 241592 240506 232106 225762 221567 213325 207444 206311 214068 225544 233615 243411 254577 262029 268978
18065 268978 274257 279278 284836 286946 293150 301493 308150 320112 329491 337779 351855 365061 374892
$$ packed form
18146G6870J706K264K103j297K984R721O057K514P424J3344J0689O758N983O923
18132A54043R282J0690J4294J4416J5331K2266K2775K4786K6622L6247M8546O9687
18120D68985J01190J42237J91897K86994N00721J009677J798244J679620K12446
18111F392011j571935j571640r15447n75479l71681k42459j63381j10984p3485
18102G95520n3767l4041k3437k2428k9855m7684n3720m5358l9952l2743k8496
18091C84039k1777j4900j6116j8043j8584j6671j0852q239o610m699m084j872
18079B41592j086q400o344m195q242n881j133P757J1476Q071R796J1166P452O949
18065B68978N279N021N558K110O204Q343O657J1962R379Q288J4076J3206R831
$$ plain form
18052 374892 387131 406575 426151 440082 457801 472854 477068 471226 462953 452578 442042 438708
18040 438708 438966 441758 450504 456940 465353 471027 473074 472374 476082 485124 488943 491080 495274 501022 506289
18025 506289 506677 504997 506597 506762 501748 498127 499219 501900 501785 507466 516658 524493 535834 546731
18011 546731 556163 566764 583973 602177 621104 640569 660130 679890 698529 721199 748078 773479
17999 773479 800130 824314 847446 870556 892680 918110 946343 979091 1009386 1042431 1085257
17988 1085257 1131188 1185958 1249819 1323256 1401806 1491655 1594790 1704523 1821730 1949669
17978 1949669 2085524 2223475 2369933 2523827 2685410 2862805 3059005 3274387 3513345
17969 3513345 3780508 4077997 4403967 4771585 5189573 5667028 6221749 6865915 7617888
$$ packed form
18052C74892J2239J9444J9576J3931J7719J5053M214n842q273j0375j0536l334
18040D38708K58K792Q746O436Q413N674K047p00L708R042L819K137M194N748N267
18025E06289L88j680J600J65n014l621J092K681j15N681R192P835J1341J0897
18011E46731R432J0601J7209J8204J8927J9465J9561J9760J8639K2670K6879K5401
17999G73479K6651K4184K3132K3110K2124K5430K8233L2748L0295L3045M2826
17988A085257M5931N4770O3861P3437P8550Q9849J03135J09733J17207J27939
17978A949669J35855J37951J46458J53894J61583J77395J96200K15382K38958
17969C513345K67163K97489L25970L67618M17988M77455N54721O44166P51973
$$ plain form
17960 7617888 8492382 9516476 10710734 12097908 13722577 15641794 17924360 20659221
17952 20659221 23917994 27768281 32239379 37276586 42716342 48288297 53642561 58422560
17944 58422560 62352188 65285145 67269133 68481338 69149595 69494097 69623504 69482210 68866070
17935 68866070 67506534 65193436 61857806 57598493 52653433 47371881 42123503 37230884
17927 37230884 32878121 29128972 25966704 23310162 21050781 19092729 17372207 15840739
17919 15840739 14472027 13247571 12156240 11179324 10302030 9507758 8785549 8125791 7516319
17910 7516319 6953719 6435348 5962823 5533210 5144449 4793133 4477767 4187281 3917636
17901 3917636 3664707 3422686 3191256 2974684 2771038 2579828 2406609 2246311 2099068
$$ packed form
17960G617888Q74494J024094J194258J387174J624669J919217K282566K734861
17952B0659221L258773L850287M471098N037207N439756N571955N354264M779999
17944E8422560L929628K932957J983988J212205O68257L44502J29407j41294o16140
17935F8866070j359536k313098l335630m259313m945060n281552n248378m892619
17927C7230884m352763l749149l162268k656542k259381j958052j720522j531468
17919A5840739j368712j224456j091331r76916q77294p94272p22209o59758o09472
17910G516319n62600n18371m72525m29613l88761l51316l15366k90486k69645
17901C917636k52929k42021k31430k16572k03646j91210j73219j60298j47243
$$ plain form
17892 2099068 1962309 1836199 1721109 1618369 1525573 1442473 1363677 1289664 1224802 1161582
17882 1161582 1103505 1052929 1007578 967387 926862 888139 852305 820276 785535 755657 730436
17871 730436 704792 681759 660249 642391 625169 603483 585547 568961 550729 532029 512756
17860 512756 497256 480067 464032 451019 438300 424917 413707 405979 401560 394236 385615 378537
17848 378537 368035 358099 351592 343212 338196 335761 333315 324992 314860 307705 307028 299878 289842 280674
17834 280674 272098 265918 260513 249045 238740 233269 229824 223313 218490 213277 208954 206238 202797 201343
17820 201343 199482 202017 208435 214227 227467 238708 245400 254684 261129 262256 259320 259695 256371 251803
17806 251803 248416 247674 251851 248780 246139 248106 250732 247648 247231 250243 253412 257282 262374 262838 257368
$$ packed form
17892B099068j36759j26110j15090j02740r2796q3100p8796p4013o4862o3220
17882A161582n8077n0576m5351m0191m0525l8723l5834l2029l4741k9878k5221
17871G30436k5644k3033k1510j7858j7222k1686j7936j6586j8232j8700j9273
17860E12756j5500j7189j6035j3013j2719j3383j1210p728m419p324q621p078
17848C78537j0502r936o507q380n016k435k446q323j0132p155o77p150j0036r168
17834B80674q576o180n405j1468j0305n471l445o511m823n213m323k716l441j454
17820B01343j861K535O418N792J3240J1241O692R284O445J127k936L75l324m568
17806B51803l387p42M177l071k641J967K626l084m17L012L169L870N092M64n470
$$ plain form
17791 257368 256703 257425 256959 257042 254442 247438 244550 246389 245528 247238 246172 245613 245217 240246 234084 228297
17775 228297 222920 209341 200662 196976 192466 189487 185961 176758 168538 163790 156503 151259 150688 150937
17761 150937 148883 152971 154511 154721 155947 157456 156401 155566 154330 149594 148341 148042 148013 147798 147654 145785
17745 145785 143224 145384 149886 152567 154402 149325 147437 148906 149902 152517 149417 141639 136225 136982 138214
17730 138214 141760 146076 147641 144717 144443 137044 131935 134541 138064 138945 138479 132529 130022 128329 127812
17715 127812 126961 129785 134176 133547 131114 127137 122715 122188 126139 130615 130260 133339 134921 140046 143474
17700 143474 141988 137179 136534 138828 139968 139427 139146 136169 129327 129912 131230 127553 126639 126431 125297 125031
17684 125031 122048 121844 118067 115365 118607 117922 118105 119198 117708 118261 121664 122206 116991 116298 118802 118776
$$ packed form
17791B57368o65P22m66Q3k600p004k888J839q61J710j066n59l96m971o162n787
17775B28297n377j3579q679l686m510k979l526r203q220m748p287n244n71K49
17761A50937k054M088J540K10J226J509j055q35j236m736j253k99k9k15j44j869
17745A45785k561K160M502K681J835n077j888J469R96K615l100p778n414P57J232
17730A38214L546M316J565k924k74p399n109K606L523Q81m66n950k507j693n17
17715A27812q51K824M391o29k433l977m422n27L951M476l55L079J582N125L428
17700A43474j486m809o45K294J140n41k81k977o842N85J318l677r14k08j134k66
17684A25031k983k04l777k702L242o85J83J093j490N53L403N42n215o93K504k6
$$ plain form
17668 118776 115479 113726 113217 110353 117343 117180 116416 119581 118654 122370 127793 134442 139389 141199 140197
17653 140197 140303 136276 133425 136626 140661 142897 143537 146562 149808 145893 139449 133230 129603 125713 124652
17638 124652 118357 115126 117460 114965 112675 111092 110701 111439 106953 104886 102360 101789 99178 98990 97216
17623 97216 97104 92789 94064 92933 89368 89814 92920 99663 103907 99260 96561 93012 92483 94516 97004
17608 97004 98306 97914 101407 106492 104574 104298 106253 107607 109471 108572 106446 100506 93476 88922 84924
17593 84924 82858 84341 83126 82382 84352 89864 96707 100598 103293 104119 109931 122459 136867 150888
17579 150888 168420 192483 219401 254284 290273 321725 353358 383995 414060 439020 458538
17568 458538 470855 479431 482497 484658 488191 482946 472218 453442 430927 399825 369681 336706
$$ packed form
17668A18776l297j753n09k864O990j63p64L165r27L716N423O649M947J810j002
17653A40197J06m027k851L201M035K236O40L025L246l915o444o219l627l890j061
17638A24652o295l231K334k495k290j583l91P38m486k067k526n71k611j88j774
17623I7216j12m315J275j131l565M46L106O743M244m647k699l549n29K033K488
17608I7004J302l92L493N085j918k76J955J354J864q99k126n940p030m554l998
17593H4924k066J483j215p44J970N512O843L891K695Q26N812J2528J4408J4021
17579A50888J7532K4063K6918L4883L5989L1452L1633L0637L0065K4960J9518
17568D58538J2317Q576L066K161L533n245j0728j8776k2515l1102l0144l2975
$$ plain form
17556 336706 304049 274706 245044 213096 181066 164928 150636 136847 124668 117844 112493 106962
17544 106962 99159 88846 82102 79817 76194 73571 69823 67035 65270 62746 60990 61058 54798 49484
17530 49484 44592 45266 46722 43895 43370 48394 51056 51731 46224 41910 36138 33495 35638 35337 36203 34662
17514 34662 34921 39406 39279 43532 43783 44398 51075 50657 48658 48882 53946 55686 56651 55274 51504 51791
17498 51791 56370 59868 62765 59902 56400 49895 47924 51551 50047 51378 50894 49192 50131 50972 50014
17483 50014 47794 46986 45069 45300 46202 45529 45716 43607 39110 32236 32304 32781 34801 32299 32021 30505 30814
17466 30814 31505 31280 31678 32985 34693 40278 36217 35852 34508 34508 34155 36133 39622 35916 35966 36907 37465
17449 37465 34496 34662 39291 40975 39931 44500 53637 61195 60730 52418 47141 39981 34267 32652 34170
$$ packed form
17556C36706l2657k9343k9662l1948l2030j6138j4292j3789j2179o824n351n531
17544A06962p803j0313o744k285l623k623l748k788j765k524j756O8o260n314
17530D9484m892O74J456k827n25N024K662O75n507m314n772k643K143l01Q66j541
17514C4662K59M485j27M253K51O15O677m18j999K24N064J740R65j377l770K87
17498E1791M579L498K897k863l502o505j971L627j504J331m84j702R39Q41r58
17483E0014k220q08j917K31R02o73J87k109m497o874O8M77K020k502k78j516L09
17466C0814O91k25L98J307J708N585m061l65j344%l53J978L489l706N0R41N58
17449C7465k969J66M629J684j044M569R137P558m65q312n277p160n714j615J518
$$ plain form
17434 34170 37792 33870 35222 34857 34982 35075 34070 34268 34291 33166 28535 27326 27995 31702 35261 32612
17418 32612 31206 31201 30336 29573 30568 32228 32722 31270 32756 36882 37382 33739 32025 34281 34410 35258 38459
17401 38459 42638 39133 36151 38907 42930 41134 39917 41156 39184 38259 37569 39068 42409 39665 40765
17386 40765 41408 41076 42168 41093 39504 39687 38434 40117 45966 49416 50276 51774 58197 64451 70034
17371 70034 74960 78140 86449 97477 111118 124730 145743 170155 199683 234643 271199 305610
17359 305610 341055 372091 386037 384801 378917 373156 354913 317064 278261 243739 215610 188295
17347 188295 161087 142871 127464 118829 111658 102225 93450 87101 84421 81447 76024 72083 66176
17334 66176 58691 51824 50073 51934 56362 55304 53377 52292 46699 46166 51019 51025 53789 53820 47512 46074
$$ packed form
17434C4170L622l922J352l65J25R3j005J98K3j125m631j209O69L707L559k649
17418C2612j406nq65p63R95J660M94j452J486M126N00l643j714K256J29Q48L201
17401C8459M179l505k982K756M023j796j217J239j972r25o90J499L341k744J100
17386D0765O43l32J092j075j589J83j253J683N849L450Q60J498O423O254N583
17371G0034M926L180Q309J1028J3641J3612K1013K4412K9528L4960L6556L4411
17359C05610L5445L1036J3946j236n884n761j8243l7849l8803l4522k8129k7315
17347A88295k7208j8216j5407q635p171r433q775o349k680k974n423l941n907
17334F6176p485o867j751J861M428j058j927j085n593n33M853OK764L1o308j438
$$ plain form
17318 46074 48403 48643 50633 53892 55648 58850 67528 74436 78950 81826 85859 87808 93273 94318 105796
17303 105796 119771 129999 142200 156032 170536 191446 213587 242035 271643 299676 316205
17292 316205 333947 354838 365471 371116 375896 381050 387188 389786 389477 385059 371862 357102 340127
17279 340127 319834 294474 264180 238552 213669 190097 174385 164237 154394 146915 134392 126755
17267 126755 118394 115508 108979 102450 98513 93738 91269 91779 88389 82116 74869 76319 77357 72100
17253 72100 71875 74521 67930 60656 54831 49578 52180 51666 50446 55494 60253 58205 60968 65379 65835
17238 65835 64669 66585 67747 74367 82097 86666 84450 82999 86804 93408 97138 98968 99974 101409
17224 101409 98681 94506 92664 90354 89839 87118 84983 81243 79882 82377 81161 79419 77819 75281
$$ packed form
17318D6074K329K40J990L259J756L202Q678O908M514K876M033J949N465J045J1478
17303A05796J3975J0228J2201J3832J4504K0910K2141K8448K9608K8033J6529
17292C16205J7742K0891J0633N645M780N154O138K598l09m418j3197j4760j6975
17279C40127k0293k5360l0294k5628k4883k3572j5712j0148r843p479j2523p637
17267A26755q361k886o529o529l937m775k469N10l390o273p247J450J038n257
17253G2100k25K646o591p274n825n253K602n14j220N048M759k048K763M411M56
17238F5835j166J916J162O620P730M569k216j451L805O604L730J830J006J435
17224A01409k728m175j842k310n15k721k135l740j361K495j216j742j600k538
$$ plain form
17210 75281 71370 66451 68514 72990 76442 75813 77012 77911 80121 80423 82151 82799 83520 84984 83931 84283
17194 84283 84430 82906 80343 76741 74954 73886 68855 67832 66596 63668 56677 51761 50936 51226 52274
17179 52274 50744 48838 44818 44277 43207 44633 51252 57022 61591 61685 58980 65375 68567 68420 68767 71892
17163 71892 76910 77826 76063 75259 77484 80860 81882 81335 76463 78078 78574 78499 80172 79083 80367 84313
17147 84313 88905 90083 92045 93238 93459 93226 95449 101074 102602 106857 111428 118615 123960 125797 128585
17132 128585 132633 139662 147063 153129 156520 148181 138148 133373 132097 133947 132129 126277 119739 114240
17118 114240 118714 124174 125205 126069 129690 136446 138619 143122 150592 160738 170466 180254 192614 209176
17104 209176 222441 232715 243734 264129 280591 297688 316877 335751 357079 378366 393488
$$ packed form
17210G5281l911m919K063M476L452o29J199Q99K210L02J728O48P21J464j053L52
17194H4283J47j524k563l602j787j068n031j023j236k928o991m916q25K90J048
17179E2274j530j906m020n41j070J426O619N770M569R4k705O395L192j47L47L125
17163G1892N018R16j763q04K225L376J022n47m872J615M96p5J673j089J284L946
17147H4313M592J178J962J193K21k33K223N625J528M255M571P187N345J837K788
17132A28585M048P029P401O066L391q339j0033m775j276J850j818n852o538n499
17118A14240M474N460J031Q64L621O756K173M503P470J0146R728R788J2360J6562
17104B09176J3265J0274J1019K0395J6462J7097J9189J8874K1328K1287J5122
$$ plain form
17093 393488 412584 426226 432782 439501 446473 451437 458841 463402 463903 462592 461975 463459 461575 456396
17079 456396 447017 432589 424266 418301 417413 420976 419537 415126 411274 411464 415597 424057 430693 436581
17065 436581 444564 454546 462387 460371 459518 459738 457473 457999 460218 461290 453787 443327 437674 435542 431836
17050 431836 429438 425525 422693 426306 436350 445903 454867 472126 490204 513244 535897 559880 588570
17037 588570 628348 675756 735334 805238 888933 980090 1072447 1163275 1261084 1361012 1450556
17026 1450556 1525391 1578517 1625144 1673565 1726101 1775655 1823428 1876893 1938164 1993533 2037833
17015 2037833 2078049 2133645 2205080 2293517 2406092 2541812 2697216 2870501 3075554 3321911
17005 3321911 3614972 3956064 4350645 4810034 5351410 5978939 6707064 7568661 8609534
$$ packed form
17093C93488J9096J3642O556O719O972M964P404M561N01j311o17J484j884n179
17079D56396r379j4428q323n965q88L563j439m411l852J90M133Q460O636N888
17065D36581P983R982P841k016q53K20k265N26K219J072p503j0460n653k132l706
17050D31836k398l913k832L613J0044R553Q964J7259J8078K3040K2653K3983K8690
17037E88570L9778M7408N9578O9904Q3695R1157R2357R0828R7809R9928Q9544
17026A450556P4835N3126M6627M8421N2536M9554M7773N3465O1271N5369M4300
17015B037833M0216N5596P1435Q8437J12575J35720J55404J73285K05053K46357
17005C321911K93061L41092L94581M59389N41376O27529P28125Q61597J040873
$$ plain form
16996 8609534 9879704 11426416 13348199 15800512 18982122 23056960 28018401 33645188
16988 33645188 39545121 45325888 50853839 56345837 61983832 67524979 72091951 74933051
16980 74933051 76278079 76949512 77534396 77766967 77236117 75959839 74072745 71196122 66834549
16971 66834549 61301727 55546247 50332720 45410608 40215037 34728709 29486125 25080813
16963 25080813 21650448 19003001 16885700 15119154 13609802 12307072 11166075 10148086
16955 10148086 9226837 8396947 7654968 6993713 6398322 5854891 5359144 4915972 4518651
16946 4518651 4159340 3831193 3528914 3258454 3001044 2758055 2533341 2329249 2145116
16937 2145116 1971942 1809357 1660094 1525267 1404683 1291881 1190295 1100004 1017948 941940
$$ packed form
16996H609534J270170J546712J921783K452313L181610M074838M961441N626787
16988C3645188N899933N780767N527951N491998N637995N541147M566972K841100
16980G4933051J345028O71433N84884K32571n30850j276278j887094k876623m361573
16971F6834549n532822n755480n213527m922112n195571n486328n242584m405312
16963B5080813l430365k647447k117301j766546j509352j302730j140997j017989
16955A0148086r21249q29890p41979o61255n95391n43431m95747m43172l97321
16946D518651l59311l28147l02279k70460k57410k42989k24714k04092j84133
16937B145116j73174j62585j49263j34827j20584j12802j01586r0291q2056p6008
$$ plain form
16927 941940 877338 816605 755751 700660 656204 615655 575900 538410 506093 477784 453884
16916 453884 432331 413581 395243 379674 367554 354568 344419 330746 320583 313682 302498 293241
16904 293241 281141 268127 258570 248997 244047 236181 227376 216627 202844 196195 192803 191118 190642
16891 190642 183844 176642 171098 169387 163128 154889 150867 148478 148022 150543 146354 143369 138376 132726
16877 132726 127504 119560 115377 107928 102250 100886 96269 86177 78371 77274 71581 71662 72196 67223 61886
16862 61886 58487 57358 62796 65164 64177 65859 69588 71844 75640 78898 81019 87332 96026 100436 105128
16847 105128 109855 109818 109937 112729 114704 117799 118800 114456 112940 115602 120458 117444 116725 119509 121455
16832 121455 122467 123240 124661 126033 124942 123230 122832 122947 120343 120717 123193 121275 123990 123580 119885
$$ packed form
16927I41940o4602o0733o0854n5091m4456m0549l9755l7490l2317k8309k3900
16916D53884k1553j8750j8338j5569j2120j2986j0149j3673j0163o901j1184r257
16904B93241j2100j3014r557r573m950p866q805j0749j3783o649l392j685m76
16891A90642o798p202n544j711o259q239m022k389m56K521m189k985m993n650
16877A32726n222p944m183p449n678j364m617j0092p806j097n693Q1N34m973n337
16862F1886l399j129N438K368r87J682L729K256L796L258K121O313Q694M410M692
16847A05128M727l7J19K792J975L095J001m344j516K662M856l014p19K784J946
16832A21455J012P73J421J372j091j712l98J15k604L74K476j918K715m10l695
$$ plain form
16817 119885 117733 117392 117017 111693 111724 110088 100353 92954 91193 88757 86475 82495 75024 69559 66967
16802 66967 65666 63320 59475 57703 57522 51404 50358 54512 56644 58564 55132 52947 55836 58359 62051
16787 62051 66112 69697 71222 70532 67791 65355 64216 65501 67011 65715 61847 62159 65217 60486 54544
16772 54544 54676 57374 58067 58455 56514 53605 47019 45687 46813 46046 42282 41961 44358 45191 42671 41635
16756 41635 41861 40221 41202 43517 42062 39059 34897 33234 33267 36548 39650 38343 34954 31024 27390
16741 27390 24430 24446 26191 32583 31837 32110 27572 22354 21045 22966 26023 27338 28571 28328 29763 29635
16725 29635 27244 27992 28939 32402 36422 34169 32914 32043 29334 27689 29018 27435 23676 27561 28539
16710 28539 26761 29218 28638 30330 29608 29811 27521 28221 23581 21609 22809 27104 28148 28073 25574 21346
$$ packed form
16817A19885k152l41l75n324L1j636r735p399j761k436k282l980p471n465k592
16802F6967j301k346l845j772j81o118j046M154K132J920l432k185K889K523L692
16787F2051M061L585J525o90k741k436j139J285J510j296l868L12L058m731n942
16772E4544J32K698O93L88j941k909o586j332J126p67l764l21K397Q33k520j036
16756D1635K26j640R81K315j455l003m162j663L3L281L102j307l389l930l634
16741B7390k960J6J745O392p46K73m538n218j309J921L057J315J233k43J435j28
16725B9635k391P48R47L463M020k253j255q71k709j645J329j583l759L885R78
16710B8539j778K457n80J692p22K03k290P00m640j972J200M295J044p5k499m228
$$ plain form
16694 21346 17678 16726 20983 21030 21207 17307 15035 11949 13196 17243 19151 22821 25834 25362 28613 30146
16678 30146 28324 31061 31364 31072 29422 31143 35171 36386 34157 30413 31182 31571 33152 33520 29763 20373
16662 20373 16571 19379 20721 19153 17069 14648 13377 13885 16066 17035 18348 19854 16915 13735 11477
16647 11477 10028 7457 7931 9999 9522 7545 5750 6140 5333 1380 4128 10497 11866 7229 4613
16632 4613 1900 395 2310 5932 6033 8949 7593 7714 5240 4544 2256 4010 9071 7593 2818
16617 2818 -1424 -1342 -1443 2625 5618 4699 912 132 -806 -1649 -601 4188 6831 8045 4045 3171 1263
16600 1263 2551 2648 2189 -679 -1822 -1348 -2975 -6788 -7879 -9248 -7922 -7449 -9033 -9768 -9035 -7129
16584 -7129 -4459 -4900 -5864 -5125 -4286 -5369 -6825 -9642 -6277 -3018 -1563 -920 -3866 -6333 -3836 -211
$$ packed form
16694B1346l668r52M257M7J77l900k272l086J247M047J908L670L013m72L251J533
16678C0146j822K737L03k92j650J721M028J215k229l744P69L89J581L68l757r390
16662B0373l802K808J342j568k084k421j271N08K181R69J313J506k939l180k258
16647A1477j449k571M74K068m77j977j795L90q07l953K748O369J369m637k616
16632D613k713j505J915L622J01K916j356J21k474o96k288J754N061j478m775
16617B818m242Q2j01M068K993r19l787p80r38q43J048M789K643J214m000q74j908
16600A263J288R7m59k868j143M74j627l813j091j369J326M73j584p35P33J906
16584g129K670m41r64P39Q39j083j456k817L365L259J455O43k946k467K497L625
$$ plain form
16568 -211 4734 4844 3625 1578 5006 2659 -1040 -2104 2379 2494 1240 -1065 -1534 -1245 -294 -482
16552 -482 608 4349 6373 5623 10464 12879 10447 6906 4487 6429 11275 11651 7106 5417 9478
16537 9478 8466 9907 8516 5198 7438 6518 7961 7587 10049 8528 6288 4535 6910 6345 4925
16522 4925 5390 5821 6548 7722 7357 7532 5962 3769 4066 8392 10222 5999 4582 5180 8916 9616 7192
16505 7192 -587 -1966 -2431 -752 1545 3837 4087 3537 1418 155 400 1835 3442 3809 3475 3014
16489 3014 1555 -1090 384 3596 7291 4993 3729 -472 -610 667 1882 3957 6375 4211 6451
16474 6451 3141 -1467 -2038 -1187 344 2915 6694 9503 7338 5914 8223 7277 5480 6395 4486 1581
16458 1581 1012 -498 33 -3970 -7622 -8504 -6330 -4867 -3642 -919 2691 3431 1025 942 -298 1221
$$ packed form
16568b11M945J10j219k047L428k347l699j064M483J15j254k305m69K89R51j88
16552d82J090L741K024p50M841K415k432l541k419J942M846L76m545j689M061
16537I478j012J441j391l318K240r20J443l74K462j521k240j753K375n65j420
16522D925M65M31P27J174l65J75j570k193K97M326J830m223j417N98L736P00k424
16505G192p779j379m65J679K297K292K50n50k119j263K45J435J607L67l34m61
16489C014j459k645J474L212L695k298j264m201j38J277J215K075K418k164K240
16474F451l310m608n71Q51J531K571L779K809k165j424K309r46j797R15j909k905
16458A581n69j510N31m003l652q82K174J463J225K723L610P40k406q3j240J519
$$ plain form
16442 1221 982 -316 2347 3928 1646 -470 -138 898 670 -1618 -1585 -946 -739 3913 2312 1933 6815
16425 6815 9124 7350 6920 6779 2955 2477 4540 6603 6906 5594 5377 4971 8616 10388 10756 10236 13180
16408 13180 13500 16643 20115 22580 28099 36015 40188 39843 45244 54622 69111 87437 110617 135670
16394 135670 165543 200654 233952 266539 297057 328493 362135 388275 404843 417522 425225 430394
16382 430394 432658 429491 422689 415464 400321 373485 340716 310315 279588 248855 221699 194995
16370 194995 163436 137250 118712 102795 91040 80507 72083 64968 56232 48462 45806 43245 37460
16357 37460 30317 31025 29620 23296 21831 22358 20832 16593 14785 13197 13749 9957 5465 2794 2009
16342 2009 1810 2764 1183 487 -2065 -4225 -1181 -1910 -5077 -7562 -5402 -3884 -2586 -1546 792 -2170
$$ packed form
16442A221k39j298K663J581k282k116L32J036k28k288L3O39K07M652j601l79M882
16425F815K309j774m30j41l824m78K063K063L03j312k17m06L645J772L68n20K944
16408A3180L20L143L472K465N519P916M173l45N401R378J4489J8326K3180K5053
16394A35670K9873L5111L3298L2587L0518L1436L3642K6140J6568J2679P703N169
16382D30394K264l167o802p225j5143k6836l2769l0401l0727l0733k7156k6704
16370A94995l1559k6186j8538j5917j1755j0533q424p115q736p770k656k561n785
16357C7460p143P08j405o324j465N27j526m239j808j588N52l792m492k671p85
16342B009j99R54j581o96k552k160L044p29l167k485K160J518J298J040K338k962
$$ plain form
16326 -2170 -5166 -8767 -6961 -4755 -2420 -1402 -5675 -8301 -8398 -3688 67 -2385 -8556 -9306 -9521 -8039
16310 -8039 -10101 -13778 -10883 -8437 -8332 -1905 -1045 -887 -2708 -5099 -6058 -5165 -4412 -5397 -6110 -5640 -3097
16293 -3097 -3062 -762 3379 1152 -3015 -4901 -6444 -4217 -4611 -4286 -2100 -2872 -3912 -4960 -3776 -4697
16277 -4697 -8228 -8635 -10553 -12271 -11025 -7146 -6148 -9532 -9429 -8944 -13379 -15159 -10745 -9462 -7249 -7076
16261 -7076 -5273 -4936 -8339 -8665 -8184 -7749 -10126 -12868 -12408 -8249 -9355 -14253 -12812 -13100 -13364 -10436
16245 -10436 -11006 -11496 -13528 -10343 -10798 -9466 -5465 -4115 -3540 -3187 -4206 -8863 -6764 -7632 -10398 -13050
16229 -13050 -12674 -13118 -13694 -11932 -14371 -11849 -10400 -12809 -12360 -13244 -17424 -18752 -14517 -6574 -5049 -9783
16213 -9783 -12501 -10943 -11486 -8222 -7099 -7932 -7270 -4603 -4505 -8249 -8756 -6662 -1262 136 -3985 -7615
$$ packed form
16326b170k996l601J806K206K335J018m273k626r7M710L755k452o171p50k15J482
16310h039k062l677K895K446J05O427Q60J58j821k391r59Q93P53r85p13M70K543
16293c097L5K300M141k227m167j886j543K227l94L25K186p72j040j048J184r21
16277d697l531m07j918j718J246L879R98l384J03M85m435j780M414J283K213J73
16261g076J803L37l403l26M81M35k377k742M60M159j106m898J441k88k64K928
16245a0436n70m90k032L185m55J332M001J350N75L53j019m657K099q68k766k652
16229a3050L76m44n76J762k439K522J449k409M49q84m180j328M235P943J525m734
16213i783k718J558n43L264J123q33O62K667R8l744n07K094N400J398m121l630
$$ plain form
16197 -7615 -9760 -8548 -7040 -5114 -4455 -3301 -6380 -6360 -3793 -4797 -6100 -9873 -8789 -10870 -9176
16182 -9176 -9319 -7864 -7854 -7983 -9134 -8826 -3755 -1867 577 2618 3275 -803 -5656 -6257 -6621 -6477 -5011
16165 -5011 -4020 -4740 -1870 -2668 -971 556 -843 -4886 -4920 -4675 359 -247 -4469 -9123 -6090 -5603 -9438
16148 -9438 -5199 -1284 -2837 -5602 -5070 -2280 -145 569 -133 -2710 -4991 -7893 -6729 -4691 -6649
16133 -6649 -3621 2212 1585 123 -2685 -4775 -2437 -4767 -5634 -5506 -5476 -1642 -2080 -3486 -3739 -5704
16117 -5704 -6034 -4084 -5102 -6021 -10011 -10780 -7587 -2565 -1602 -1594 -1255 -2168 -5525 -4356 -3620 -3931 -5533
16100 -5533 -6615 -2990 2055 318 -1396 -1081 723 1287 2572 1136 -1449 -3553 -2262 -5728 -7476
16085 -7476 -2453 -897 -1408 -1214 -967 -2174 -3384 -5380 -9685 -9099 -9819 -12626 -15210 -11572 -7849 -3582
$$ packed form
16197g615k145J212J508J926O59J154l079K0K567j004j303l773J084k081J694
16182i176j43J455J0j29j151L08N071J888K444K041O57m078m853o01l64J44J466
16165e011R91p20K870p98J697J527j399m043l4K45N034o06m222m654L033M87l835
16148i438M239L915j553k765N32K790K135P14p02k577k281k902J164K038j958
16133f649L028N833o27j462k808k090K338k330q67J28L0L834m38j406k53j965
16117e704l30J950j018r19l990p69L193N022R63QL39r13l357J169P36l11j602
16100e533j082L625N045j737j714L15J804N64J285j436k585k104J291l466j748
16085g476N023J556n11J94K47j207j210j996m305N86p20k807k584L638L723M267
$$ plain form
16069 -3582 -3428 -4116 -3516 -1477 -4840 -10527 -10599 -12156 -10628 -10722 -10115 -10431 -11356 -11815 -9729 -7098 -7701 -7431
16051 -7431 -8335 -6208 -1744 1749 3947 1494 -1079 -1008 -960 -86 -615 -3051 -2897 -2484 -257 1239 3635
16034 3635 -277 -6736 -8213 -5901 -5593 -6368 -8440 -9234 -7846 -5135 -3908 -3098 77 470 -561 255
16018 255 -4661 -6442 -6538 -5606 -2245 1409 208 -1308 -2419 -8286 -10667 -10226 -10808 -11727 -13596 -14347 -13638
16001 -13638 -11935 -8010 -4789 -5504 -8846 -8744 -7058 -8034 -11164 -10253 -6019 -2870 -4344 -5274 -5784 -2404
15985 -2404 -5601 -8238 -6654 -6042 -5729 -4183 -6387 -10525 -11551 -11293 -11933 -12969 -14197 -12659 -14338 -14821
15969 -14821 -13156 -11387 -10914 -9537 -11707 -12571 -8882 -7407 -4589 -7125 -9872 -7677 -6925 -6431 -8846
15954 -8846 -12380 -13151 -12881 -7617 -3714 -1300 -929 -4265 -4764 -829 586 -206 -431 523 -4671 -7045
$$ packed form
16069c582J54o88O00K039l363n687p2j557J528r4O07l16r25m59K086K631o03K70
16051g431r04K127M464L493K198k453k573P1M8Q74n29k436J54M13K227J496K396
16034C635l912o459j477K312L08p75k072p94J388K711J227Q10L175L93j031Q16
16018B55m916j781r6R32L361L654j201j516j111n867k381M41n82r19j869p51P09
16001a3638J703L925L221p15l342J02J686r76l130R11M234L149j474r30n10L380
15985b404l197k637J584O12L13J546k204m138j026K58o40j036j228J538j679m83
15969a4821J665J769M73J377k170q64L689J475K818k536k747K195P52M94k415
15954h846l534p71K70N264L903K414L71l336m99L935J415p92k25R54n194k374
$$ plain form
15938 -7045 -7500 -7105 -8271 -5888 -5475 -4276 -7939 -9857 -10967 -14117 -10458 -7135 -7875 -5742 -4326 -4955
15922 -4955 -5501 -7289 -7630 -4281 -3515 -6663 -5973 -5715 -6571 -6630 -5827 -6103 -6041 -5975 -4713 -5116 -7272 -11760
15904 -11760 -12321 -5564 -5357 -7946 -9977 -13351 -10643 -8532 -9393 -6748 -3356 -3208 -5541 -11562 -8856
15889 -8856 -749 3555 4465 238 -4678 -8020 -7977 -2766 -275 -1686 -4004 -1697 -3842 -3852 -1125 -7879
15873 -7879 -10190 -8762 -10829 -8623 -7351 -6944 -5703 -5280 -5334 -3248 -4744 -8112 -7714 -6159 -5766 -5951
15857 -5951 -5797 -5050 -249 2789 -2639 -6848 -9949 -12900 -11588 -8247 -2432 -1005 -5571 -3367 -1557
15842 -1557 -5483 -5042 -2532 1648 432 -2284 -256 -3040 -8764 -7393 -5722 -5920 -10585 -11892 -10035
15827 -10035 -7983 -5530 -3694 -3851 -4340 -9382 -10657 -8258 -5531 -4767 -4638 -2288 -2418 -2024 -2562 -3872
$$ packed form
15938g045m55L95j166K383M13J199l663j918j110l150L659L323p40K133J416o29
15922d955n46j788l41L349P66l148O90K58q56n9Q03k76O2O6J262m03k156m488
15904a1760n61O757K07k589k031l374K708K111q61K645L392J48k333o021K706
15889h856Q107M304R10m227m916l342M3N211K491j411k318K307k145j0K727o754
15873g879k311J428k067K206J272M07J241M23n4K086j496l368L98J555L93j85
15857e951J54P47M801L038n428m209l101k951J312L341N815J427m566K204J810
15842a557l926M41K510M180j216k716K028k784n724J371J671j98m665j307J857
15827a0035K052K453J836j57m89n042j275K399K727P64J29K350j30L94n38j310
$$ plain form
15811 -3872 -3788 -975 -1166 1610 3934 6814 13892 17940 21706 20534 22693 24996 31004 32434 30120
15796 30120 28959 26831 23711 23049 23799 22731 17580 15695 12078 11334 7180 7548 9727 4405 3812 8502
15780 8502 6377 2329 -567 2689 4761 1425 -420 -510 501 -1963 -2818 -2912 -201 622 1729 -81
15764 -81 133 -4632 -2826 -5846 -4364 -3311 -677 -1028 -6267 -9041 -6033 -3229 -4620 -7802 -6834 -3453
15748 -3453 -1229 -3518 -3956 -2715 -4418 -3677 -795 -2278 -4839 -7369 -7139 -1786 3063 1087 -73
15733 -73 -957 -33 -93 43 1450 -1171 -2668 -4309 -3575 -5016 -5742 -7820 -6675 -2763 -1864 -2474 -3629
15716 -3629 -5134 -9363 -5810 -3504 -2989 1386 5981 396 -2935 315 465 977 510 3114 294 643
15700 643 4392 3275 -1894 1818 3773 3697 -201 -4762 -3589 -3424 -2215 -2916 -4651 -6850 -5128 336
$$ packed form
15811c872Q4K813j91K776K324K880P078M048L766j172K159K303O008J430k314
15796C0120j161k128l120o62P50j068n151j885l617p44m154L68K179n322n93M690
15780H502k125m048k896L256K072l336j845r0J011k464q55r4K711Q23J107j810
15764h1K14m765J806l020J482J053K634l51n239k774L008K804j391l182R68L381
15748c453K224k289m38J241j703P41K882j483k561k530K30N353M849j976j160
15733g3q84R24o0J36J407k621j497j641P34j441p26k078J145L912Q99o10j155
15716c629j505m229L553K306N15M375M595n585l331L250J50N12m67K604k820L49
15700F43L749j117n169L712J955p6l898m561J173J65J209p01j735k199J722N464
$$ plain form
15684 336 7537 13337 11862 8066 6332 4322 6590 5789 4622 4085 4008 2082 354 845 -1568 387
15668 387 3743 3829 1351 1682 3611 2129 1084 -2351 -876 709 1771 6102 7433 4834 4533 5865
15652 5865 3506 1704 2686 4516 2408 2241 2835 6708 9706 7505 4183 4348 5060 6529 7164 9331
15636 9331 15485 14899 12930 13196 15574 16172 14906 14642 12684 10678 9815 10306 9329 9296 11438 12911 12232
15619 12232 9412 8509 10757 9189 7147 6277 8048 9715 11483 5639 2401 5397 882 -39 3751
15604 3751 6693 8311 8606 10667 13022 13120 12269 6651 5551 8064 7204 6380 5049 1693 3822 6404
15588 6404 11223 10252 6263 8411 8423 9986 10423 9146 9335 10915 6993 4343 6114 8861 11589 11829
15572 11829 13457 15642 18361 19936 11974 7550 10939 11137 8154 6915 5732 1544 3784 9459 10833
$$ packed form
15684C36P201N800j475l796j734k010K268q01j167n37p7j926j728M91k413J955
15668C87L356Q6k478L31J929j482j045l435J475J585J062M331J331k599l01J332
15652E865k359j802R82J830k108j67N94L873K998k201l322J65P12J469O35K167
15636I331O154n86j969K66K378N98j266k64j958k006q63M91r77l3K142J473o79
15619A2232k820r03K248j568k042q70J771J667J768n844l238K996m515r21L790
15604C751K942J618K95K061K355R8q51n618j100K513q60q24j331l356K129K582
15588F404M819r71l989K148J2J563M37j277J89J580l922k650J771K747K728K40
15572A1829J628K185K719J575p962m424L389J98k983j239j183m188K240N675J374
$$ plain form
15557 10833 6981 8912 11677 12789 12059 15592 13854 11044 9246 10761 15772 18533 16108 13226 9873
15542 9873 8746 6688 8838 10937 12158 9161 7465 7185 12909 16104 14559 14159 13566 11932 12481 11792
15526 11792 14543 15194 15417 14562 14951 16662 17529 16993 18404 17364 17443 17379 15645 18695 23590 25958 21895
15509 21895 21410 22257 23552 24524 25481 24419 23702 27104 25093 24107 21638 19977 19646 16850 18247 18720
15493 18720 17825 15590 14501 17762 19546 17921 16380 17543 16149 18252 21469 21155 21711 18804 19307
15478 19307 18862 17595 18194 20049 18337 18927 21080 20282 20066 19848 20419 18507 17295 14668 16316 14595
15462 14595 15531 19420 17847 11321 10685 15120 11248 8944 12780 14062 15168 14155 12661 10890 9990
15447 9990 8196 9201 7912 9724 7318 4105 6661 8166 8207 7120 4978 2120 2414 3195 726 3991
$$ packed form
15557A0833l852J931K765J112p30L533j738k810j798J515N011K761k425k882l353
15542I873j127k058K150K099J221k997j696k80N724L195j545m00n93j634N49o89
15526A1792K751O51K23q55L89J711Q67n36J411j040P9o4j734L050M895K368m063
15509B1895m85Q47J295R72R57j062p17L402k011r86k469j661l31k796J397M73
15493A8720q95k235j089L261J784j625j541J163j394K103L217l14N56k907N03
15478A9307m45j267N99J855j712N90K153p98k16k18N71j912j212k627J648j721
15462A4595R36L889j573o526o36M435l872k304L836J282J106j013j494j771r00
15447I990j794J005j289J812k406l213K556J505M1j087k142k858K94P81k469L265
$$ plain form
15431 3991 282 -121 2239 993 2291 3786 2494 3013 35 -509 -1756 -1136 158 -2845 -6924 -7939
15415 -7939 -6992 -2414 -173 -73 -951 -750 1196 365 -4073 -4307 -1418 -2029 -2559 -3762 -5275 -2329 535
15398 535 1423 3993 4768 3961 3064 5354 2936 -2719 -2670 -3098 -7435 -5046 -651 -1010 -3912 -4854 -5664
15381 -5664 -4902 -4367 -6442 -4529 -2291 -3619 -4697 -3198 -2995 -5585 -4423 -3339 -2746 -2122 -961 -846
15365 -846 -6259 -5275 -5595 -468 -614 -1016 -196 706 1126 -3521 -8113 -5820 -4085 -3436 -2904 -6501 -6476 -6684
15347 -6684 -7818 -8686 -6288 -1020 -3510 -4004 -6574 -7862 -8048 -9795 -9005 -8371 -8244 -6976 -7861 -10475
15331 -10475 -9397 -7884 -3152 -2185 -4655 -5450 -4836 -2994 1298 5081 1498 385 2489 -314 29
15316 29 1327 1627 263 -1318 -6288 -8150 -8257 -9470 -5773 -3325 2450 7125 6933 1255 -1618 -3705
$$ packed form
15431C991l709m03K360j246J298J495j292N19k978n44j247O20J294l003m079j015
15415g939R47M578K241J00q78K01J946q31m438k34K889o11n30j203j513K946K864
15398E35Q88K570P75q07q97K290k418n655M9m28m337K389M395l59k902r42q10
15381e664P62N35k075J913K238j328j078J499K03k590J162J084N93O24J161J15
15365h46n413R84l20N127j46m02Q20R02M20m647m592K293J735O49N32l597K5k08
15347f684j134q68K398N268k490m94k570j288j86j747P90O34J27J268q85k614
15331a0475J078J513M732R67k470p95O14J842M292L783l583j113K104k803L43
15316B9J298L00j364j581m970j862j07j213L697K448N775M675j92n678k873k087
$$ plain form
15300 -3705 -3033 -4022 -5549 -3680 1478 970 -704 -425 -1086 -1639 -5743 -6281 -5790 -3328 -2575 -4711 -3807
15283 -3807 1242 2416 2133 1471 4213 4502 3766 256 -536 900 3863 2297 -773 -1892 -5598 -5683
15267 -5683 -3439 -5665 -5361 -7799 -11498 -10147 -11060 -5689 -2405 -2627 -8430 -8782 -6804 -4374 -3797 -6670
15251 -6670 -8082 -5950 -5611 -5233 -2602 -3712 -6596 -12306 -10752 -5212 -8397 -9917 -10326 -14760 -20914
15236 -20914 -21357 -21117 -20240 -18415 -14929 -12711 -11240 -10735 -8630 -10352 -7708 -9956 -15546 -13873 -14588 -11813
15220 -11813 -11117 -11447 -9921 -8250 -7056 -6677 -8217 -12014 -12289 -10686 -13472 -13089 -10019 -8665 -6462 -7761
15204 -7761 -9366 -9259 -7381 -2409 -3065 -4964 -4013 -1472 667 254 -2356 -7791 -6704 -5630 -3766 -4355
15188 -4355 -5526 -12256 -10080 -7936 -5895 -8703 -9437 -7412 -6102 -6132 -6681 -9629 -5988 -5834 -6829 -6068
$$ packed form
15300c705O72r89j527J869N158n08j674K79o61n53m104n38M91K462P53k136R04
15283c807N049J174k83o62K742K89p36l510p92J436K963j566l070j119l706q5
15267e683K244k226L04k438l699J351r13N371L284k22n803l52J978K430N77k873
15251f670j412K132L39L78K631j110k884n710J554N540l185j520m09m434o154
15236b0914m43K40Q77J825L486K218J471N05K105j722K644k248n590J673p15K775
15220a1813O96l30J526J671J194L79j540l797k75J603k786L83L070J354K203j299
15204g761j605J07J878M972o56j899R51K541K139m13k610n435J087J074J864n89
15188d355j171o730K176K144K041k808p34K025J310l0n49k948L641J54r95P61
$$ plain form
15172 -6068 -9509 -14187 -16397 -17293 -15744 -16299 -16501 -15255 -14625 -15936 -16364 -16197 -15273 -12000 -13777 -13184 -9664
15155 -9664 -14458 -16427 -15281 -16069 -16701 -19867 -18596 -16221 -14607 -8637 -7155 -11552 -10127 -9542 -11854
15140 -11854 -11878 -11942 -14050 -13138 -10712 -6639 -3272 -6091 -6286 -3330 -3003 -7955 -10293 -9004 -7684 -7881
15124 -7881 -10622 -10163 -10527 -13149 -11558 -8108 -9841 -10857 -7797 -4826 -3628 -4089 -10529 -10686 -7069 -8671
15108 -8671 -8436 -11623 -14547 -18701 -13094 -12063 -13876 -13197 -11900 -10137 -7921 -7774 -12586 -9901 -8504
15093 -8504 -6196 -4178 -7646 -6624 -5808 -8057 -10866 -12240 -13411 -10197 -10755 -10311 -8566 -6927 -9970
15078 -9970 -10521 -9917 -9244 -8722 -9817 -6726 -4448 -5062 -3179 -2748 -3338 -3648 -4509 -8631 -11146 -7558 -7528
15061 -7528 -10273 -11695 -10463 -11646 -8978 -7922 -8970 -9017 -5782 -5418 -7314 -8649 -9848 -10922 -12648
$$ packed form
15172f068l441m678k210q96J549n55k02J246O30j311m28J67R24L273j777N93L520
15155i664m794j969J146p88o32l166J271K375J614N970J482m397J425N85k312
15140a1854k4o4k108R12K426M073L367k819j95K956L27m952k338J289J320j97
15124g881k741M59l64k622J591L450j733j016L060K971J198m61o440j57L617j602
15108h671K35l187k924m154N607J031j813O79J297J763K216J47m812K685J397
15093h504K308K018l468J022Q16k249k809j374j171L214n58M44J745J639l043
15078i970n51O04O73N22j095L091K278o14J883M31n90l10q61m122k515L588L0
15061g528k745j422J232j183K668J056j048m7L235L64j896j335j199j074j726
$$ plain form
15046 -12648 -11305 -8859 -8383 -10981 -13322 -11420 -4815 -4674 -4795 -3340 906 2168 2691 978 -2035
15031 -2035 -2961 -7741 -9143 -5468 -6953 -6727 -5122 -4750 -2685 -3953 -2974 -4182 -8577 -8964 -7008 -6795
15015 -6795 -8015 -7077 -6185 -12189 -17226 -17062 -16292 -18802 -15653 -13389 -12841 -14009 -14153 -13995 -13908 -12135 -9499
14998 -9499 -8710 -14619 -16913 -18026 -17323 -16077 -13960 -13591 -13938 -12804 -10970 -10511 -12536 -16586 -16205 -13150
14982 -13150 -7791 -10637 -11248 -6851 -5404 -8643 -6328 -6495 -7398 -5888 -3793 -2408 -3764 -6108 -2922
14967 -2922 -201 -3195 -5582 -7684 -8865 -11945 -11147 -9627 -10736 -6038 -6240 -5045 -4945 -4434 -2608 -6315
14951 -6315 -10630 -14522 -11976 -8637 -9272 -7321 -3636 -1678 -3186 -6956 -12337 -10780 -7398 -6833 -7549
14936 -7549 -8938 -10298 -10296 -8310 -7193 -4729 -2834 -4084 -7303 -9156 -9315 -10257 -10655 -9668 -12337 -13660
$$ packed form
15046a2648J343K446M76k598k341J902O605J41j21J455M246J262N23j713l013
15031b035r26m780j402L675j485K26J605L72K065j268R79j208m395l87J956K13
15015f795j220R38Q92o004n037J64P70k510L149K264N48j168j44J58Q7J773K636
14998i499P89n909k294j113P03J246K117L69l47J134J834M59k025m050L81L055
14982a3150N359k846o11M397J447l239K315j67r03J510K095J385j356k344L186
14967b922K721k994k387k102j181l080P98J520j109M698k02J195J00N11J826l707
14951f315m315l892K546L339o35J951L685J958j508l770n381J557L382N65p16
14936g549j389j360KJ986J117K464J895j250l219j853j59r42l98R87k669j323
$$ plain form
14920 -13660 -13288 -15656 -14041 -12697 -12460 -9694 -2946 -3528 -7435 -8179 -7632 -9955 -12731 -13822 -17164 -13359
14904 -13359 -14004 -12686 -9384 -9513 -10212 -9659 -8174 -10358 -12623 -10953 -10322 -10542 -8411 -7747 -4327 -2991
14888 -2991 -4324 -7614 -7932 -8223 -9030 -6287 -4256 -2791 -2745 -3931 -3670 -3036 -4615 -4121 -1576 -279 -5557
14871 -5557 -9230 -10244 -7618 -5037 -6603 -8801 -10300 -10307 -11468 -13210 -9456 -2776 -1711 1049 -1035
14856 -1035 -2279 -908 -4317 -8087 -8367 -8464 -12262 -15852 -12359 -9202 -8344 -9035 -10085 -10182 -11678 -12717
14840 -12717 -11526 -11020 -11056 -10918 -11917 -8376 -7216 -12772 -16308 -12870 -6626 -4631 -7103 -7990 -8717 -10627
14824 -10627 -9003 -4453 -3073 -4231 -5495 -2671 -1948 -4488 -3551 -820 -1281 -5773 -8052 -6381 -6287 -7330
14808 -7330 -10140 -9374 -6456 -4893 -2529 -1665 -3642 -12183 -14928 -14217 -11804 -8717 -7869 -8319 -10344 -8364
$$ packed form
14920a3660L72k368J615J344K37K766O748n82l907p44N47k323k776j091l342L805
14904a3359o45J318L302j29o99N53J485k184k265J670O31k20K131O64L420J336
14888b991j333l290l18k91q07K743K031J465M6j186K61O34j579M94K545J297n278
14871e557l673j014K626K581j566k198j499pj161j742L754O680J065K760k084
14856a035j244J371l409l770k80r7l798l590L493L157Q58o91j050r7j496j039
14840a2717J191N06l6J38r99L541J160n556l536L438O244J995k472q87p27j910
14824a0627J624M550J380j158j264K824P23k540R37K731m61m492k279J671R4j043
14808g330k810P66K918J563K364Q64j977q541k745P11K413L087Q48m50k025J980
$$ plain form
14792 -8364 -6826 -9733 -8224 -3822 -7091 -10779 -7706 -5121 -6614 -10910 -9072 -7230 -7176 -8200 -9210
14777 -9210 -5845 -5288 -7068 -5316 -4463 -7646 -12234 -16548 -14018 -10818 -10966 -8876 -10558 -9207 -9738 -7874
14761 -7874 -8746 -13079 -11798 -6964 -3835 -3028 -4608 -5852 -7739 -8479 -9592 -11428 -10976 -9715 -5691 -1704
14745 -1704 -2954 -4012 -2006 -2856 -4712 -5738 -6398 -7753 -10066 -8125 -6805 -6266 -4107 -2934 -6528
14730 -6528 -6258 -9027 -11742 -12431 -10972 -11198 -14423 -14195 -9704 -7108 -9417 -11443 -9177 -5822 -4722 -4754
14714 -4754 -5182 -3088 -3221 -3748 -5394 -5469 -709 -186 -2184 -3359 -2574 -5492 -7852 -10316 -11525 -9218
14698 -9218 -9823 -9135 -5843 -2472 -8630 -10294 -7350 -6513 -9048 -10047 -9701 -10870 -10598 -5289 -2509 -4773
14682 -4773 -8052 -7190 -7072 -8431 -9185 -8235 -7198 -5511 -6854 -7543 -8647 -9421 -6040 -7137 -5757 -2159
$$ packed form
14792h364J538k907J509M402l269l688L073K585j493m296J838J842N4j024j010
14777i210L365N57j780J752Q53l183m588m314K530L200j48K090j682J351n31J864
14761g874q72m333J281M834L129Q07j580j244j887p40j113j836M52J261M024L987
14745a704j250j058K006q50j856j026o60j355k313J941J320N39K159J173l594
14730f528K70k769k715o89J459k26l225K28M491K596k309k026K266L355J100l2
14714d754m28K094j33n27j646p5M760N23j998j175P85k918k360k464j209K307
14698i218o05O88L292L371o158j664K944Q37k535r99L46j169K72N309K780k264
14682d773l279Q62J18j359p54R50J037J687j343o89j104p74L381j097J380L598
$$ plain form
14666 -2159 -713 -1801 -3465 -3264 -3299 -481 -3943 -8813 -11736 -8052 -4896 -5029 -8690 -10202 -11914 -10395
14650 -10395 -10236 -8766 -4245 -838 727 182 -2360 -5248 -7148 -6400 -2809 -4678 -6251 -7519 -10081
14635 -10081 -6379 -5090 -5417 -4966 -5713 -4397 -2045 -4369 -6618 -4751 -6139 -9919 -9737 -6607 -5210
14620 -5210 -2533 -2854 -4515 -8583 -11184 -10481 -11300 -10172 -3526 -1958 -4935 -4124 -2452 -1529 -4252 -11101
14604 -11101 -12840 -10241 -6400 -7784 -10666 -15149 -10061 -11116 -11580 -9733 -6721 -5334 -3612 -4205 -8530
14589 -8530 -9879 -8806 -10406 -10610 -12543 -15523 -13073 -12055 -14705 -12396 -8851 -6318 -3146 -381 -3142
14574 -3142 -7209 -7044 -9210 -8730 -4587 -3772 -5046 -5030 -4254 -4308 -3371 -5427 -9252 -12186 -10762 -9202 -6238
14557 -6238 -7967 -8141 -12605 -11905 -10805 -6769 -1510 -2580 -6561 -12221 -12856 -11167 -4820 -3945 -2553 -1095
$$ packed form
14666b159J446j088j664K01l5K818l462m870k923L684L156j33l661j512j712J519
14650a0395J59J470M521L407J565n45k542k888j900P48L591j869j573j268k562
14635a0081L702J289l27M51p47J316K352k324k249J867j388l780J82L130J397
14620e210K677l21j661m068k601P03q19J128O646J568k977Q11J672R23k723o849
14604a1101j739K599L841j384k882m483N088j055m64J847L012J387J722n93m325
14589h530j349J073j600k04j933k980K450J018k650K309L545K533L172K765k761
14574c142m067J65k166M80M143Q15j274J6P76n4R37k056l825k934J424J560K964
14557f238j729j74m464P00J100M036N259j070l981n660o35J689O347Q75J392J458
$$ plain form
14541 -1095 710 653 -726 -885 1940 -1860 -2809 1756 3032 -1211 -5576 -5283 -6443 -7511 -9934 -8035
14525 -8035 -6993 -6049 -8090 -5039 -4938 -9611 -9374 -5160 -4544 -6804 -12744 -12159 -7206 -4467 -4459 -5048 -7540
14508 -7540 -8146 -9963 -8485 -8952 -6515 -5891 -10233 -11249 -9307 -9213 -9102 -10915 -15326 -12781 -9375 -7619
14492 -7619 -3842 -1959 -484 211 -3773 -6752 -8684 -5158 -4482 -4482 -4509 -2616 -3924 -4651 -2341 -2885 -6700
14475 -6700 -8662 -9905 -8274 -4255 -7457 -9059 -9562 -10018 -8848 -13927 -14232 -9272 -5937 -5600 -7025 -8217
14459 -8217 -9600 -9078 -10764 -9153 -12522 -9271 -4264 -7688 -13104 -20188 -21734 -19339 -16958 -10346 -2687
14444 -2687 -4257 -7056 -8739 -10621 -11183 -8502 -5236 -1687 -1239 -2446 -9320 -10455 -12262 -10369 -4870
14429 -4870 -4022 -10316 -7804 -3402 -3492 -3457 -2831 -2952 -7559 -8723 -4119 -4231 -3699 -2767 -7912 -11088 -11119 -9216
$$ packed form
14541a095J805n7j379j59K825l800r49M565J276m243m365K93j160j068k423J899
14525h035J042R44k041L051J01m673K37M214O16k260n940N85M953K739Qn89k492
14508g540o06j817J478m67K437O24m342j016J942R4J11j813m411K545L406J756
14492g619L777J883J475O95l984k979j932L526O76%k7J893j308p27K310n44l815
14475f700j962j243J631M019l202j602n03m56J170n079l05M960L335L37j425j192
14459h217j383N22j686J611l369L251N007l424n416p084j546K395K381O612P659
14444b687j570k799j683j882n62K681L266L549M48j207o874j135j807J893N499
14429d870Q48o294K512M402r0L5O26j21m607j164M604j12N32R32n145l176l1J903
$$ plain form
14411 -9216 -7847 -6934 -5187 -7149 -6138 -5952 -1346 -1149 -3269 -7013 -5357 -2030 -4967 -2714 -1919 -1516
14395 -1516 -4681 -7581 -6253 -5038 -7102 -8397 -4515 -2957 -3505 -3351 -4479 -5701 -5413 -2845 -3046 -3759
14379 -3759 -5682 -5003 -9224 -12694 -10684 -7062 -6172 -6195 -5052 -3625 -2111 -8547 -11661 -7481 -4826 -7738
14363 -7738 -10741 -10432 -9619 -7413 -6558 -6660 -5296 -2700 -87 -5319 -9148 -8078 -5317 -2243 -3245 -6203
14347 -6203 -9769 -14724 -14940 -15105 -12377 -9051 -8551 -7744 -8197 -9014 -11095 -9177 -3148 -4427 -3592 -3499 -2364
14330 -2364 1757 3786 2586 2251 -2764 -3261 -3218 -4979 -7788 -5866 -3063 -6205 -7256 -7169 -6683 -8993
14314 -8993 -7509 -4414 -3270 -1750 -1353 -907 -77 -316 -1797 -986 -855 1402 2309 4062 1753 -2001
14298 -2001 -4381 -2138 -2403 -3958 -6425 -5475 585 5965 4524 1145 1802 3194 1961 -64 -3353
$$ packed form
14411i216J369R13J747j962J011J86M606J97k120l744J656L327k937K253P95M03
14395a516l165k900J328J215k064j295L882J558n48J54j128j222K88K568k01p13
14379c759j923O79m221l470K010L622Q90k3J143J427J514o436l114M180K655k912
14363g738l003L09Q13K206Q55j02J364K596K613n232l829J070K761L074j002k958
14347f203l566m955k16j65K728L326N00Q07m53q17k081J918O029j279Q35R3J135
14330b364M121K029j200l35n015m97M3j761k809J922K803l142j051Q7M86k310
14314h993J484L095J144J520L97M46Q30k39j481Q11J31K257R07J753k309l754
14298b001k380K243k65j555k467R50O060N380j441l379O57J392j233k025l289
$$ plain form
14283 -3353 -2414 4999 4456 1796 2833 3808 1533 -325 -3384 -3337 -5701 -8687 -9214 -8180 -8257 -5606 -6082
14266 -6082 -7955 -5985 -3677 1200 -118 -1051 611 -632 -3140 -5560 -6564 -7366 -3877 -2607 -3831
14251 -3831 -1061 -1869 308 721 726 -1588 -3905 -4702 -667 1827 2170 4226 3642 4456 3513 1327 -317
14234 -317 1301 6271 7475 1725 -599 -391 -1249 -1033 -18 568 -1626 -1015 -2962 -5603 -9580 -7650
14218 -7650 -5555 -3537 -6461 -8325 -8977 -10499 -6456 -3592 -2843 -2199 1928 7734 8888 5153 3197
14203 3197 2889 651 -2290 -3904 -2232 464 3239 310 -2355 -2293 -4807 -5010 -3222 -502 -2516 -4737
14187 -4737 -5880 -4182 -2185 1404 -933 -2021 -4857 -5909 -4102 -1685 -2335 -4698 -4271 -2721 -1494
14172 -1494 -2805 -985 -1772 -5373 -4499 -3602 -3827 -2886 -1610 -4159 -4045 544 3564 5160 3791 3861 2034
$$ packed form
14283c353R39P413n43k660J037R75k275j858l059M7k364k986n27J034p7K651m76
14266f082j873J970K308M877j318r33J662j243k508k420j004q02L489J270j224
14251c831K770q08K177M13Nk314k317p97M035K494L43K056n84Q14r43k186j644
14234c17J618M970J204n750k324K08q58K16J015N86k194O11j947k641l977J930
14218g650K095K018k924j864o52j522M043K864P49O44M127N806J154l735j956
14203C197l08k238k941j614J672K696K775k929k665O2k514k03J788K720k014k221
14187d737j143J698J997L589k337j088k836j052J807K417o50k363M27J550J227
14172a494j311J820p87l601Q74Q97k25R41J276k549J14M589L020J596j369P0j827
$$ plain form
14155 2034 2589 4880 6860 6452 2772 4039 2240 -1865 -2967 -3500 -1590 -4558 -6860 -8287 -9473
14140 -9473 -4477 676 -1162 -1869 -4673 -1830 1348 3332 3338 1042 799 2128 -2931 -6112 -5234 -3464
14124 -3464 -4087 -692 1334 1710 2942 2266 1440 -4722 -10271 -11040 -6442 -2183 -949 138 1662 2747
14108 2747 5153 5510 5581 9000 9247 4344 103 -439 143 -119 -318 1437 1170 1526 1515 846 -337 -2672
14090 -2672 -2406 1772 6512 8067 7689 5359 4253 1873 -1454 -2219 -2618 -4038 -1888 -6332 -10496 -14487
14074 -14487 -9512 -3652 -2663 -1361 917 -407 -1796 2426 5233 316 -1211 -3323 -1142 946 970
14059 970 1890 7 -580 1708 4512 4059 1150 3639 4577 3524 -1329 -2957 -5495 -2585 -2520 -4746
14043 -4746 -3711 -1467 -7956 -8481 -2924 1955 -445 119 2566 4040 3370 7427 5580 1775 -72
$$ packed form
14155B034N55K291J980m08l680J267j799m105j102n33J910k968k302j427j186
14140i473M996N153j838p07k804K843L178J984Ok296k43J329n059l181Q78J770
14124c464o23L395K026L76J232o76q26o162n549p69M598M259J234J087J524J085
14108B747K406L57P1L419K47m903m241n42N82k62j99J755k67L56j1o69j183k335
14090b672K66M178M740J555l78k330j106k380l327p65l99j420K150m444m164l991
14074a4487M975N860R89J302K278j324j389M222K807m917j527k112K181K088K4
14059I70R20j883n87K288K804m53k909K489R38j053m853j628k538K910O5k226
14043d746J035K244o489n25N557M879k400N64K447J474o70M057j847l805j847
$$ plain form
14028 -72 1461 1066 -291 -1616 -3493 -1991 1344 1502 -406 1184 1275 2158 4867 5417 4784 2998 2284
14011 2284 3104 2726 2063 1462 10 3159 2713 3632 -798 451 1208 638 4889 7304 9258 6653 279
13994 279 -3269 -2011 -2356 -3134 892 4741 993 -275 2697 2050 2976 1706 836 -111 -2153 -4862
13978 -4862 -5277 -6980 -6641 -2571 1906 2605 2087 -1495 -1322 -1202 -3166 -1495 -670 -2603 -3554 -2380 -47
13961 -47 -1031 -4241 -7103 -5929 -3822 -6314 -7548 -5529 -4563 -3488 -6322 -11544 -9468 -7770 -4104 -3441
13945 -3441 -3291 -1771 -364 -3217 -6074 -7288 -4829 -2337 -953 -2700 -1676 -1604 -1147 -2308 -1874 -2223
13929 -2223 -5770 -6172 -8043 -7665 -4425 -2299 -1497 -6237 -4463 -4591 -4988 -2997 -3280 -3433 -3019 -1882 -3830
13912 -3830 -2686 -1788 740 -1626 -1242 -1455 -1152 -4608 -10966 -8891 -4523 -4539 -3720 109 3992 3837 5354
$$ packed form
14028g2J533l95j357j325j877J502L335J58j908J590R1Q83K709N50o33j786p14
14011B284Q20l78o63o01j452L149m46R19m430J249P57n70M251K415J954k605o374
13994B79l548J258l45p78M026L849l748j268K972o47R26j270q70r47k042k709
13978d862m15j703L39M070M477O99n18l582J73J20j964J671Q25j933r51J174K333
13961d7r84l210k862J174K107k492j234K019R66J075k834n222K076J698L666O63
13945c441J50J520J407k853k857j214K459K492J384j747J024P2M57j161M34l49
13929b223l547m02j871L78L240K126Q02m740J774j28l97J991k83j53M14J137j948
13912c830J144Q98K528k366L84k13L03l456o358K075M368j6Q19L829L883j55J517
$$ plain form
13895 5354 6937 1706 -3242 -218 7164 9454 7353 3019 2895 -1024 -5318 -7130 -8174 -7265 -24
13880 -24 3267 609 3220 4186 -410 -3999 459 627 -1212 -1647 -1233 -824 2091 4344 6183 3648
13864 3648 110 -177 3126 4840 1494 2571 5266 7307 6847 4366 2808 3649 892 -2016 -3925
13849 -3925 -1490 -527 1483 7126 10425 3082 -1978 262 3310 6508 9039 10332 12652 13825 14317
13834 14317 8397 3782 4136 4325 2190 414 2757 3483 3125 -513 -3885 -4097 -5415 -6525 -6756 -8417
13818 -8417 -8812 -7679 -3944 1029 177 -4994 -6695 -8977 -8957 -5789 -5101 -6401 -5577 -5812 -6336 -6474 -2038
13801 -2038 -3831 168 3368 596 -3363 -3373 -2604 -421 2085 4956 6561 3103 1969 6557 10929
13786 10929 6378 2982 3099 3155 7249 11929 15405 15596 14343 15215 18861 24971 29886 36432 37493 43443
$$ packed form
13895E354J583n231m948L024P382K290k101m334j24l919m294j812j044R09P241
13880b4L291k658K611R66m596l589M458J68j839m35M14M09K915K253J839k535
13864C648l538k87L303J714l346J077K695K041m60k481j558Q41k757k908j909
13849c925K435R63K010N643L299p343n060K240L048L198K531J293K320J173M92
13834A4317n920m615L54J89k135j776K343P26l58l638l372k12j318j110k31j661
13818h417l95J133L735M973q52n171j701k282K0L168O88j300Q24k35n24j38M436
13801b038j793L999L200k772l959j0P69K183K506K871J605l458j134M588M372
13786A0929m551l396J17N6M094M680L476J91j253Q72L646O110M915O546J061N950
$$ plain form
13770 43443 51180 59793 70686 91534 115545 135394 162370 189930 208365 214237 202970 181151
13758 181151 155370 124462 101910 87404 72120 60287 53875 52081 48665 40503 35622 32845 28179
13745 28179 28095 27014 23627 18623 12428 10540 9884 12171 12402 12816 18143 22840 25854 27323 25049 24568
13729 24568 22936 20612 23087 24402 28286 32793 34570 34133 31661 29312 25365 24790 23353 21185 22884
13714 22884 19997 16122 13831 13688 9712 5264 1519 1260 5110 10726 10659 12193 15020 7803 3973
13699 3973 3194 6705 6505 3870 6789 11401 10610 12625 15087 12662 12950 12959 14274 14956 14881 17345 20148
13682 20148 20751 20429 16792 12067 8612 7824 4525 2870 1382 4245 5374 3598 4865 3877 2826
13667 2826 326 1531 2318 4956 9172 7945 11021 11083 7751 6277 5426 4622 6135 1637 1949 7809
$$ packed form
13770D3443P737Q613J0893K0848K4011J9849K6976K7560J8435N872j1267k1819
13758A81151k5781l0908k2552j4506j5284j1833o412j794l416q162m881k777m666
13745B8179q4j081l387n004o195j888o56K287K31M14N327M697L014J469k274m81
13729B4568j632k324K475J315L884M507J777m37k472k349l947n75j437k168J699
13714B2884k887l875k291j43l976m448l745k59L850N616o7J534K827p217l830
13699C973p79L511k00k635K919M612p91K015K462k425K88RJ315O82p5K464K803
13682B0148O03l22l637m725l455p88l299j655j488K863J129j776J267r88j051
13667B826k500J205P87K638M216j227L076O2l332j474q51q04J513m498L12N860
$$ plain form
13651 7809 12675 12027 11552 12455 11297 10055 6826 4678 5234 5430 2359 4308 5660 5752 7502 8485 8061
13634 8061 8377 5798 4087 7661 6531 1492 -563 5731 8503 9008 6963 2987 6810 6145 7938
13619 7938 10060 9448 11342 12324 13520 17138 14263 14436 15395 16317 14366 11468 5464 7542 10438 9068
13603 9068 8959 14633 20555 20614 15896 11246 11038 9416 10606 14945 16351 12572 11458 16950 17271 13910
13587 13910 9759 10499 13023 15497 15516 15113 12987 19097 24356 29175 30442 27272 30347 39239 41147
13572 41147 38419 37784 43478 47590 44955 44502 48338 52653 59168 67558 74392 80983 87811 99738 102533
13557 102533 97534 93943 95256 93802 80951 64860 53617 48097 39101 32770 29507 26362 25502 28854
13543 28854 30537 30194 28767 28125 26356 23674 22014 22561 20971 14297 9579 11034 15685 18740 20831
$$ packed form
13651G809M866o48m75R03j158j242l229k148N56J96l071J949J352R2J750R83m24
13634H061L16k579j711L574j130n039k055O294K772N05k045l976L823o65J793
13619G938K122o12J894R82J196L618k875J73R59R22j951k898o004K078K896j370
13603I068j09N674N922N9m718m650k08j622J190M339J406l779j114N492L21l361
13587A3910m151P40K524K474J9m03k126O110N259M819J267l170L075Q892J908
13572D1147k728o35N694M112k635m53L836M315O515Q390O834O591O828J1927K795
13557A02533m999l591J313j454j2851j6091j1243n520q996o331l263l145q60L352
13543B8854J683l43j427o42j769k682j660N47j590o674m718J455M651L055K091
$$ plain form
13528 20831 21100 20339 16978 16592 17661 18362 17914 22055 22099 21483 20789 17017 18298 17631 19592 21405 18605
13511 18605 18492 20812 22355 22902 21071 21283 21264 19626 17317 16714 18194 18894 16348 12258 11963 12853 14319
13494 14319 14323 15705 15238 11782 7834 8463 8132 9523 11949 10191 7700 8366 10409 11810 10543 12127
13478 12127 13101 10654 11584 11290 11313 10820 8887 6916 9945 6606 4454 7219 6129 2331 1730 4644
13462 4644 8356 9181 13515 13692 12849 8647 7412 9675 9544 9814 6102 4307 7130 9595 11609 12330
13446 12330 8769 7551 11695 13115 9067 4248 6336 8357 7077 6199 7208 9505 5913 4176 6735
13431 6735 12028 13341 10650 3156 945 4265 10823 16108 16898 15105 12319 11995 10638 9177 6575
13416 6575 6034 10367 11420 12958 16019 17491 18924 16349 12938 8860 8504 10199 12855 14050 10730
$$ packed form
13528B0831K69p61l361l86J069P01m48M141M4o16o94l772J281o67J961J813k800
13511A8605j13K320J543N47j831K12j9j638k309o03J480P00k546m090k95Q90J466
13494A4319MJ382m67l456l948O29l31J391K426j758k491O66K043J401j267J584
13478A2127R74k447R30k94K3m93j933j971L029l339k152K765j090l798o01K914
13462D644L712Q25M334J77q43m202j235K263j31K70l712j795K823K465K014P21
13446A2330l561j218M144J420m048m819K088K021j280q78J009K297l592j737K559
13431F735N293J313k691p494k211L320O558N285P90j793k786l24j357j461k602
13416F575n41M333J053J538L061J472J433k575l411m078l56J695K656J195l320
$$ plain form
13401 10730 12955 15954 16586 15098 10372 13304 17420 15514 12874 10310 9496 8178 8749 11447 11702
13386 11702 11531 10959 11139 13026 13928 14722 17384 15843 11250 12894 15729 19207 17019 14572 11298 10345
13370 10345 13297 12706 15608 19105 17860 16205 13325 13550 16676 18337 16361 14323 12164 10888 12760
13355 12760 13531 14410 20451 24213 22951 20178 18139 18189 19330 17382 12302 12955 14648 15913 19669 22115
13339 22115 21926 21014 16867 13562 11686 17159 17792 17666 16674 14071 12416 9101 8040 12064 14796 20146
13323 20146 23701 20588 17814 16375 15453 14702 13072 14621 15634 16647 15198 15396 14357 13258 9669
13308 9669 12464 14546 10473 9187 11336 12228 14196 16661 14949 12213 12069 11792 13882 15488 14152
13293 14152 15248 17243 16653 13312 8042 11072 15483 18866 18095 17780 17997 17649 16791 13968 13577 10914
$$ packed form
13401A0730K225K999O32j488m726K932M116j906k640k564q14j318N71K698K55
13386A1702j71n72J80J887R02P94K662j541m593J644K835L478k188k447l274r53
13370A0345K952n91K902L497j245j655k880K25L126J661j976k038k159j276J872
13355A2760P71Q79O041L762j262k773k039N0J141j948n080O53J693J265L756K446
13339B2115j89r12m147l305j876N473O33j26r92k603j655l315j061M024K732N350
13323B0146L555l113k774j439r22p51j630J549J013J013j449J98j039j099l589
13308I669K795K082m073j286K149Q92J968K465j712k736j44k77K090J606j336
13293A4152J096J995n90l341n270L030M411L383p71l15K17l48q58k823l91k663
$$ plain form
13277 10914 13179 15956 19059 21742 24228 22291 18630 20608 23492 23581 19513 19866 20263 16548 17993
13262 17993 23819 25220 23831 26924 27815 29985 34366 35335 36557 40022 40293 41855 41446 41904 46790 50991
13246 50991 51304 54379 58156 61295 61997 66136 64517 63209 64168 62234 59952 62431 63877 60911 57604
13231 57604 54465 55434 58822 57338 59889 63406 64235 61178 60353 57909 55800 55069 56821 53800 50064
13216 50064 42033 38007 38111 37317 30226 27020 26872 29818 32745 37319 36973 39249 40298 39586 37944 45635
13200 45635 49095 52477 58978 59425 54134 55327 55521 58364 62835 68061 66825 65571 72250 81063 87905
13185 87905 92527 94165 98995 99588 105084 111738 117494 120639 128360 141661 152315 152600 156375 161921
13171 161921 153772 146005 139328 132120 124416 116046 106370 94906 87975 77512 69583 64323 60287 58744
$$ packed form
13277A0914K265K777L103K683K486j937l661J978K884Q9m068L53L97l715J445
13262A7993N826J401j389L093Q91K170M381R69J222L465K71J562m09M58M886M201
13246E0991L13L075L777L139P02M139j619j308R59j934k282K479J446k966l307
13231E7604l139R69L388j484K551L517Q29l057q25k444k109p31J752l021l736
13216E0064q031m026J04p94p091l206j48K946K927M574l46K276J049p12j642P691
13200D5635L460L382O501M47n291J193J94K843M471N226j236j254O679Q813O842
13185H7905M622J638M830N93N496O654N756L145P721J3301J0654K85L775N546
13171A61921q149p767o677p208p704q370r676j1464o931j0463p929n260m036j543
$$ plain form
13157 58744 53677 52965 56341 61256 60490 59045 56612 60239 65190 69432 78110 89187 99721 111808
13143 111808 130535 145571 164239 182217 193255 204011 206662 207232 206376 198244 184070 168441 153957
13130 153957 135403 116605 105392 99696 92440 82174 79241 77367 78959 80781 75615 71824 72228
13117 72228 69432 68056 73569 81074 86148 91234 99132 113998 130560 149133 166386 180618 192076
13104 192076 201585 208816 210818 204920 196457 177758 156783 136517 118011 104383 93572 85277 83597
13091 83597 79432 78257 71819 63952 61335 59894 58896 57373 59171 57658 57931 52381 51563 52466 55034
13076 55034 57051 54266 51458 51605 52377 51034 50099 46949 43885 42941 39286 40223 43221 43616 39256 34868
13060 34868 36291 38308 38727 39111 39578 36805 37943 41487 37342 35831 35941 33968 33663 35404 31733 29886
$$ packed form
13157E8744n067p12L376M915p66j445k433L627M951M242Q678J1077J0534J2087
13143A11808J8727J5036J8668J7978J1038J0756K651N70q56q132j4174j5629j4484
13130A53957j8554j8798j1213n696p256j0266k933j874J592J822n166l791M04
13117G2228k796j376N513P505N074N086P898J4866J6562J8573J7253J4232J1458
13104A92076R509P231K002n898q463j8699k0975k0266j8506j3628j0811q295j680
13091H3597m165j175o438p867k617j441r98j523J798j513K73n550q18R03K568
13076E5034K017k785k808J47P72j343r35l150l064r44l655R37K998L95m360m388
13060C4868J423K017M19L84M67k773J138L544m145j511J10j973l05J741l671j847
$$ plain form
13044 29886 31506 34033 37339 36523 31031 31831 36071 38246 36184 34434 34050 32946 30355 28475 27013
13029 27013 28150 33277 34252 30001 29664 27912 28220 30365 32108 33477 33734 33891 31602 30176 25393 22584
13013 22584 20130 20716 16900 12967 16105 21321 24162 26759 27442 29409 29132 30311 30404 28935 27630 29271
12997 29271 30084 31973 35366 41253 40045 37199 39565 39358 35638 33401 39141 38833 37399 36732 36731 39339
12981 39339 39381 39325 39081 39046 41557 43682 45872 47595 48454 50578 48055 48040 48211 47960 41857 38539 36530
12964 36530 39734 40885 41269 41519 45649 48904 47064 45270 43653 47231 44399 37587 38041 42267 43138
12949 43138 41440 45792 48168 48123 44979 46765 46671 44466 47331 46172 38789 38667 40775 43015 42355 40573
12933 40573 37438 37163 36447 35886 36289 38082 36988 36960 33149 34346 36910 33356 31166 30287 30533 34314
$$ packed form
13044B9886J620K527L306q16n492Q00M240K175k062j750l84j104k591j880j462
13029B7013J137N127R75m251l37j752L08K145J743J369K57J57k289j426m783k809
13013B2584k454N86l816l933L138N216K841K597O83J967k77J179R3j469j305J641
12997B9271Q13J889L393N887j208k846K366k07l720k237N740l08j434o67jK608
12981C9339M2n6k44l5K511K125K190J723Q59K124k523j5J71k51o103l318k009
12964C6530L204J151L84K50M130L255j840j794j617L578k832o812M54M226Q71
12949D3138j698M352K376m5l144J786r4k205K865j159p383j22K108K240o60j782
12933D0573l135k75p16n61M03J793j094k8l811J197K564l554k190q79K46L781
$$ plain form
12917 34314 35310 36921 37977 39432 39276 41917 44500 46956 47427 44776 40419 39538 41267 43223 42780 39505
12901 39505 40489 40751 44130 44747 47651 48172 52325 54911 55370 53133 55779 55039 51837 55337 58728 58160
12885 58160 57085 57339 55953 57778 57048 55220 58199 61596 61155 60386 54801 54073 59696 65474 69361 73519
12869 73519 78263 83858 83638 87276 93879 98642 104778 112846 115293 119906 124303 118384 114252 117741 117630
12854 117630 114399 112689 115820 118218 121341 122867 124972 124488 124846 120692 117400 117733 117309 112680 106917
12839 106917 100459 91763 84538 79289 72895 70185 68448 64788 61440 58488 56506 55119 54946 53479
12825 53479 52112 53107 56660 57166 56247 59117 58208 58123 59765 61918 60302 64348 65951 61886 61922 63957
12809 63957 66139 61863 60453 63436 67009 65599 63916 63224 62586 61886 63009 66017 70374 69984 69411 68374
$$ packed form
12917C4314R96J611J056J455j56K641K583K456M71k651m357q81J729J956m43l275
12901C9505R84K62L379O17K904N21M153K586M59k237K646p40l202L500L391n68
12885E8160j075K54j386J825p30j828K979L397m41p69n585p28N623N778L887M158
12869G3519M744N595k20L638O603M763O136Q068K447M613M397n919m132L489j11
12854A17630l231j710L131K398L123J526K105m84L58m154l292L33m24m629n763
12839A06917o458q696p225n249o394k710j737l660l348k952j982j387j73j467
12825E3479j367R95L553N06r19K870r09q5J642K153j616M046J603m065L6K035
12809F3957K182m276j410K983L573j410j683o92o38p00J123L008M357l90n73j037
$$ plain form
12793 68374 64802 65703 65997 70351 72376 72570 74674 77611 77024 72835 76649 84730 84528 90209 94621 95465
12777 95465 99969 104512 103987 104998 101224 101387 100091 97034 94858 93676 94847 96201 100092 106016 111979
12762 111979 112828 121306 128688 130945 133222 135639 135894 142028 153500 157397 155180 148674 141541 139378
12748 139378 140974 142640 142001 136991 127067 118596 110957 104004 94695 90641 89498 86458 86855 82722 81228
12733 81228 78902 78181 80088 80739 80145 79319 76368 79979 80079 81933 88545 92473 91629 92863 92525 90452
12717 90452 89551 94372 99230 97106 102064 111064 116663 117697 123104 129176 132658 136406 141641 148144 156649
12702 156649 170313 184564 202062 216783 242000 269422 293435 327105 365953 418259 487838
12691 487838 576530 692349 835247 996919 1156734 1281083 1351469 1372114 1361048 1344116
$$ packed form
12793F8374l572R01K94M354K025J94K104K937n87m189L814Q081k02N681M412Q44
12777I5465M504M543n25J011l774J63j296l057k176j182J171J354L891N924N963
12762A11979Q49Q478P382K257K277K417K55O134J1472L897k217o506p133k163
12748A39378J596J666o39n010r924q471p639o953r309m054j143l040L97m133j494
12733H1228k326p21J907O51n94q26k951L611J00J854O612L928q44J234l38k073
12717I0452r01M821M858k124M958R000N599J034N407O072L482L748N235O503Q505
12702A56649J3664J4251J7498J4721K5217K7422K4013L3670L8848N2306O9579
12691D87838Q8692J15819J42898J61672J59815J24349P0386K0645j1066j6932
$$ plain form
12681 1344116 1304973 1210734 1061235 891399 743808 637689 566155 510066 466833 431302
12671 431302 402912 373814 351304 332857 317264 300353 280164 263617 249295 239653 230048 222617
12659 222617 217001 218770 221758 225327 232550 243075 256075 268535 278351 283588 277649 268896 258343
12646 258343 246929 233676 222646 215421 204734 192396 183496 176919 168922 164452 161702 162186 159934
12633 159934 156727 157839 157609 158641 155907 155150 152740 152188 152937 149468 141930 137751 134667 133985 137706
12618 137706 140425 144439 147777 149816 152830 154497 156218 155373 149161 144171 138530 135340 131085 125888
12604 125888 123495 123589 125317 130303 133436 133611 137551 143437 142228 136979 134573 135513 136868 140253 142323
12589 142323 141742 142387 138670 136901 135308 134224 131906 130570 131532 129286 127278 128058 127629 123623 120351
$$ packed form
12681A344116l9143r4239j49499j69836j47591j06119p1534n6089m3233l5531
12671D31302k8390k9098k2510j8447j5593j6911k0189j6547j4322r642r605p431
12659B22617n616J769K988L569P223J0525J3000J2460R816N237n939q753j0553
12646B58343j1414j3253j1030p225j0687j2338q900o577p997m470k750M84k252
12633A59934l207J112k30J032k734p57k410n52P49l469p538m179l084o82L721
12618A37706K719M014L338K039L014J667J721q45o212m990n641l190m255n197
12604A25888k393R4J728M986L133J75L940N886j209n249k406R40J355L385K070
12589A42323n81O45l717j769j593j084k318j336R62k246k008P80m29m006l272
$$ plain form
12574 120351 120264 122981 126576 132915 133663 142109 160385 188247 215633 236621 248190 251542 252239 253527
12560 253527 254514 247680 242452 243748 245353 244447 240452 237987 233036 225500 219672 211017 206892 208173 206395
12545 206395 204041 205179 204188 207249 217082 223555 228338 234282 242660 239318 235939 235428 234373 238490 241449
12530 241449 247908 261884 283854 306543 332413 368245 404685 442256 484254 533176 576111 609286
12518 609286 641628 670078 691764 708084 715079 728091 755541 796845 848784 917119 1017045 1172167
12506 1172167 1393977 1681244 2015195 2343827 2583745 2650853 2538662 2300675 1966011 1593315
12496 1593315 1279742 1069379 937850 854366 804195 764819 731047 703170 675947 644570 617224
12485 617224 602348 587305 576175 565999 560238 559069 570137 597683 638055 690170 756510 827603
$$ packed form
12574A20351q7K717L595O339P48Q446J8276K7862K7386K0988J1569L352O97J288
12560B53527R87o834n228J296J605r06l995k465m951p536n828q655m125J281j778
12545B06395k354J138r91L061R833O473M783N944Q378l342l379n11j055M117K959
12530B41449O459J3976K1970K2689K5870L5832L6440L7571M1998M8922M2935L3175
12518F09286L2342K8450K1686J6320O995J3012K7450M1304N1939O8335R9926J55122
12506A172167K21810K87267L33951L28632K39918O7108j12191k37987l34664l72696
12496A593315l13573k10363j31529q3484n0171l9376l3772k7877k7223l1377k7346
12485F17224j4876j5043j1130j0176n761j169J1068K7546M0372N2115O6340P1093
$$ plain form
12473 827603 911125 1011560 1135635 1295012 1496221 1740346 1986792 2192690 2286084 2213225
12463 2213225 1971848 1660020 1386937 1184466 1040447 936227 862295 809266 766115 734363
12453 734363 710537 678452 641375 610443 586375 573002 560772 547693 523240 492186 466177
12442 466177 446777 432684 427122 424997 416745 410541 404943 401229 399465 401087 402085 400070 395438 386940
12428 386940 379394 376551 375756 378804 380556 384340 391758 401140 409488 413677 414821 412559 404598 397026
12414 397026 389672 382528 371728 362631 347157 340675 341016 347935 354506 361565 365524 373155 385096 393833
12400 393833 401942 404640 407951 412260 418124 426961 439351 449142 456015 467878 487028 521190 563883
12387 563883 604294 645551 688219 721946 748765 777850 812059 837250 844654 846596 851335 851783
$$ packed form
12473H27603Q3522J00435J24075J59377K01209K44125K46446K05898R3394p2859
12463B213225k41377l11828k73083k02471j44019j04220p3932n3029m3151l1752
12453G34363k3826l2085l7077l0932k4068j3373j2230j3079k4453l1054k6009
12442D66177j9400j4093n562k125q252o204n598l714j764J622R98k015m632q498
12428C86940p546k843p95L048J752L784P418R382Q348M189J144k262p961p572
12414C97026p354p144j0800r097j5474o482L41O919O571P059L959P631J1941Q737
12400C93833Q109K698L311M309N864Q837J2390R791O873J1863J9150L4162M2693
12387E63883M0411M1257M2668L3727K6819K9085L4209K5191P404J942M739M48
$$ plain form
12375 851783 847466 842414 834709 818244 802927 794984 792471 790249 785211 784272 791296 793748 790895 789686
12361 789686 789952 793699 800674 809259 814540 818068 817710 812728 806452 804062 797111 793644 797633 805822 817065
12346 817065 833168 848141 861432 871104 875369 876213 870355 856454 837552 828329 826742 820039 814730
12333 814730 818383 833156 856709 885361 918077 958660 999925 1039804 1078395 1121599 1169957 1221463
12321 1221463 1270743 1315335 1354765 1378281 1391323 1406164 1430331 1458344 1489158 1518021 1547238
12310 1547238 1576775 1611580 1651662 1699502 1745602 1802486 1883549 1981341 2086705 2198495 2317820
12299 2317820 2451312 2599232 2763168 2951497 3156272 3374271 3622841 3908269 4232885
12290 4232885 4603277 5030433 5529284 6106577 6778077 7570297 8503058 9608037 10919216
$$ packed form
12375H51783m317n052p705j6465j5317p943k513k222n038r39P024K452k853j209
12361G89686K66L747O975Q585N281L528l58m982o276k390o951l467L989Q189J1243
12346H17065J6103J4973J3291R672M265Q44n858j3901j8902r223j587o703n309
12333H14730L653J4773K3553K8652L2716M0583M1265L9879L8591M3204M8358N1506
12321A221463M9280M4592L9430K3516J3042J4841K4167K8013L0814K8863K9217
12310A547238K9537L4805M0082M7840M6100N6884Q1063R7792J05364J11790J19325
12299B317820J33492J47920J63936J88329K04775K17999K48570K85428L24616
12290D232885L70392M27156M98851N77293O71500P92220R32761J104979J311179
$$ plain form
12281 10919216 12478744 14325328 16479854 18958665 21757983 24878313 28340025 32204720
12273 32204720 36565272 41599201 47567035 54875878 64150701 76310112 92615156 114194051
12265 114194051 140652325 169124358 195432639 214730975 223491152 223301402 219169104
12258 219169104 215171085 208365752 192235207 165941024 135491857 109238982 90366080
12251 90366080 77123100 67295940 59550280 53283526 48196349 43923190 40041750 36258990
12243 36258990 32541902 29033932 25899916 23195065 20849229 18771457 16918596 15297236
12235 15297236 13913545 12756453 11800174 11013761 10346193 9733167 9123412 8480858 7797565
12226 7797565 7107958 6463377 5896461 5411233 4984778 4602945 4262149 3955760 3676669
$$ packed form
12281A0919216J559528J846584K154526K478811K799318L120330L461712L864695
12273C2204720M360552N033929N967834P308843R274823J2159411J6305044K1578895
12265A14194051K6458274K8472033K6308281J9298336Q760177j89750m132298
12258B19169104l998019o805333j6130545k6294183l0449167k6252875j8872902
12251I0366080j3242980r827160p745660o266754n087177m273159l881440l782760
12243C6258990l717088l507970l134016k704851k345836k077772j852861j621360
12235A5297236j383691j157092r56279p86413o67568o13026o09755o42554o83293
12226G797565o89607o44581n66916m85228m26455l81833l40796l06389k79091
$$ plain form
12217 3676669 3424974 3192242 2971065 2762050 2576474 2419615 2285360 2156817 2029212
12208 2029212 1906086 1794089 1700254 1622452 1556089 1497056 1443079 1397003 1363023 1339921 1326218
12197 1326218 1306728 1273131 1226204 1183976 1158741 1151404 1159606 1181217 1220722 1277932 1336106 1377743
12185 1377743 1395696 1402245 1399312 1387364 1368910 1350426 1339160 1336661 1344001 1351932 1353253 1348586 1328499
12172 1328499 1304872 1281241 1259524 1240050 1226403 1211956 1198952 1190669 1182278 1173911 1170710 1165906
12160 1165906 1157712 1148104 1136214 1133092 1134545 1140627 1151048 1165230 1181867 1199395 1211112 1227356
12148 1227356 1243478 1254997 1251284 1235774 1213083 1177762 1140338 1107403 1076570 1051369 1027103
12137 1027103 1015668 1033665 1082232 1147258 1214960 1280069 1340629 1393059 1431390 1452924 1465970
$$ packed form
12217C676669k51695k32732k21177k09015j85576j56859j34255j28543j27605
12208B029212j23126j11997r3835p7802o6363n9033n3977m6076l3980k3102j3703
12197A326218j9490l3597m6927m2228k5235p337Q202K1611L9505N7210N8174M1637
12185A377743J7953O549k933j1948j8454j8484j1266k499P340P931J321m667k0087
12172A328499k3627k3631k1717j9474j3647j4447j3004q283q391q367l201m804
12160A165906q194r608j1890l122J453O082J0421J4182J6637J7528J1717J6244
12148A227356J6122J1519l713j5510k2691l5321l7424l2935l0833k5201k4266
12137A027103j1435J7997M8567O5026O7702O5109O0560N2430L8331K1534J3046
$$ plain form
12126 1465970 1470972 1476180 1488909 1511777 1545493 1584986 1622716 1659930 1697863 1739566 1776181 1814289
12114 1814289 1862455 1918386 1977187 2048382 2134519 2239945 2380666 2558511 2775837 3017474
12104 3017474 3261371 3479859 3685601 3877567 4055233 4229265 4408756 4599084 4812115
12095 4812115 5085612 5445014 5899112 6442621 7052326 7732260 8504059 9374827 10378658
12086 10378658 11568709 12993075 14703135 16749761 19196273 22121277 25653422 29938814
12078 29938814 35075572 41133630 48197191 56338010 65636389 76333719 89099485 105174165
12070 105174165 126456838 155832551 196427211 248034737 304825740 359536694 401270241
12063 401270241 416782991 405269897 374093146 327671726 268990525 210731868 167363852
$$ packed form
12126A465970N002N208J2729K2868L3716L9493L7730L7214L7933M1703L6615L8108
12114A814289M8166N5931N8801P1195Q6137J05426J40721J77845K17326K41637
12104C017474K43897K18488K05742J91966J77666J74032J79491J90328K13031
12095D812115K73497L59402M54098N43509O09705O79934P71799Q70768J003831
12086A0378658J190051J424366J710060K046626K446512K925004L532145M285392
12078B9938814N136758O058058P063561Q140819R298379J0697330J2765766J6074680
12070A05174165K1282673K9375713M0594660N1607526N6791003N4710954M1733547
12063D01270241J5512750j1513094l1176751m6421420n8681201n8258657m3368016
$$ plain form
12056 167363852 138751322 119616635 106351207 96604467 88790276 81921168 75386123
12049 75386123 68825086 62198250 55731775 49711809 44279722 39411174 35049338 31199233
12041 31199233 27886621 25057027 22617049 20491480 18622657 16986556 15566675 14319872
12033 14319872 13197665 12182355 11261188 10416071 9618590 8875649 8200430 7592904 7048239
12024 7048239 6556834 6114508 5711800 5346268 5014557 4694767 4380168 4076424 3788040
12015 3788040 3528001 3291171 3072706 2884446 2724547 2574333 2433422 2302716 2184357
12006 2184357 2077141 1984254 1901878 1826705 1760947 1700441 1640801 1584523 1531820 1487606 1455574
11995 1455574 1428828 1407343 1394196 1387540 1378525 1362805 1330251 1284006 1228615 1173437 1112094 1051395
$$ packed form
12056A67363852k8612530j9134687j3265428r746740p814191o869108o535045
12049G5386123o561037o626836o466475o019966n432087m868548m361836l850105
12041C1199233l312612k829594k439978k125569j868823j636101j419881j246803
12033A4319872j122207j015310r21167q45117p97481p42941o75219o07526n44665
12024G048239m91405m42326m02708l65532l31711l19790l14599l03744k88384
12015C788040k60039k36830k18465j88260j59899j50214j40911j30706j18359
12006B184357j07216r2887q2376p5173o5758o0506n9640n6278n2703m4214l2032
11995A455574k6746k1485j3147o656r015j5720l2554m6245n5391n5178o1343o0699
$$ plain form
11983 1051395 993093 941254 898466 863159 835425 824775 832271 846574 864757 887155 905933
11972 905933 912107 910412 904063 889992 869895 851816 830732 815149 812656 811953 811365 815852 815308 802296
11958 802296 785151 766252 738931 712792 690878 675958 666229 653805 642465 633433 621195 607133
11946 607133 594155 590050 588730 589299 596115 597188 584645 576872 599781 643639 681303 721974 764417
11933 764417 784592 782786 775536 759522 731330 706426 693180 694565 701231 712424 723285 738438
11921 738438 759383 781317 802525 826337 844690 862673 874025 882096 881605 881906 877211 868369 860429
11908 860429 850980 843547 847453 854165 854218 844098 824025 801542 777171 751799 729142 713852 707913
11895 707913 714480 731402 754064 785392 813639 834504 842203 845297 849800 844669 828691 809505
$$ packed form
11983A051395n8302n1839m2788l5307k7734j0650P496J4303J8183K2398J8778
11972I05933O174j695o349j4071k0097j8079k1084j5583k493p03n88M487n44j3012
11958H02296j7145j8899k7321k6139k1914j4920r729j2424j1340r032j2238j4062
11946F07133j2978m105j320N69O816J073j2543p773K2909M3858L7664M0671M2443
11933G64417K0175j806p250j6014k8192k4904j3246J385O666J1193J0861J5153
11921G38438K0945K1934K1208K3812J8353J7983J1352Q071m91L01m695q842p940
11908H60429r449p433L906O712N3j0120k0073k2483k4371k5372k2657j5290n939
11895G07913O567J6922K2662L1328K8247K0865P699L094M503n131j5978j9186
$$ plain form
11883 809505 785125 757385 718626 678132 643600 627502 627809 640010 668298 711706 762016 818227
11871 818227 876054 939684 1003287 1063033 1119681 1153987 1137707 1074134 993765 924445 877697
11860 877697 853856 847166 851487 865156 882457 908337 935552 972208 1020670 1089522 1181069 1297553
11848 1297553 1417700 1528440 1601348 1625972 1618478 1587792 1547177 1502087 1468965 1471887 1502011
11837 1502011 1554632 1626927 1727938 1863188 2020746 2169106 2266783 2299401 2299119 2275091 2219445
11826 2219445 2103177 1910165 1678099 1475283 1327898 1229680 1159301 1108659 1072286 1039886
11816 1039886 1012057 1001247 1004012 1011302 1028914 1054624 1087848 1120457 1139222 1151958 1174959 1214746
11804 1214746 1265583 1307350 1327752 1311769 1268025 1223569 1189971 1155612 1114712 1086050 1075600
$$ packed form
11883H09505k4380k7740l8759m0494l4532j6098L07J2201K8288M3408N0310N6211
11871H18227N7827O3630O3603N9746N6648L4306j6280o3573q0369o9320m6748
11860H77697k3841o690M321J3669J7301K5880K7215L6656M8462O8852R1547J16484
11848A297553J20147J10740P2908K4624p494l0686m0615m5090l3122K922L0124
11837A502011N2621P2295J01011J35250J57558J48360R7677L2618k82k4028n5646
11826B219445j16268j93012k32066k02816j47385r8218p0379n0642l6373l2400
11816A039886k7829j0810K765P290J7612K5710L3224L2609J8765J2736K3001L9787
11804A214746N0837M1767K0402j5983m3744m4456l3598l4359m0900k8662j0450
$$ plain form
11793 1075600 1061454 1026780 970423 913638 871154 840317 806956 769945 735969 706356 681434
11782 681434 655215 632720 611100 594970 587119 579587 572038 563021 553326 545934 542776 546012 556457
11769 556457 574834 594388 617193 643492 667779 677964 672882 671318 682841 707087 732706 749454
11757 749454 756384 748392 727158 707017 683348 647843 613014 583799 563339 536292 504880 478086
11745 478086 458034 440571 427473 410706 394657 379066 359498 344623 334396 329492 328821 329461
11733 329461 333023 333961 333899 335220 336724 334777 334819 333554 328751 327614 328883 334969 340144 339252 336750 325191
11717 325191 312037 301678 290394 279535 273214 270474 260352 250555 242277 236355 237114 237014 233091
11704 233091 230107 227294 225675 223350 220046 215644 208878 204859 202630 201117 198355 195643 190595 184418
$$ packed form
11793A075600j4146l4674n6357n6785m2484l0837l3361l7011l3976k9613k4922
11782F81434k6219k2495k1620j6130p851p532p549r017r695p392l158L236J0445
11769E56457J8377J9554K2805K6299K4287J0185n082j564J1523K4246K5619J6748
11757G49454O930p992k1234k0141k3669l5505l4829k9215k0460k7047l1412k6794
11745D78086k0052j7463j3098j6767j6049j5591j9568j4875j0227m904o71O40
11733C29461L562R38o2J321J504j947M2j265m803j137J269O086N175q92k502j1559
11717C25191j3154j0359j1284j0859o321k740j0122r797q278n922P59j00l923
11704B33091k984k813j619k325l304m402o766m019k229j513k762k712n048o177
$$ plain form
11690 184418 186174 189308 191689 192952 194664 189729 185607 184756 183716 183246 181537 178980 175976 163907
11676 163907 151065 142560 136642 137650 142518 148208 152415 155946 155577 153907 158144 163146 168579 169901
11662 169901 168828 163925 159818 160289 155923 148238 146364 142951 138805 139673 140026 143990 142780 143344 143950
11647 143950 144662 148780 154805 155955 157264 160048 163298 166971 173332 181034 188890 198052 212108 232908
11633 232908 258800 290763 323778 360625 404528 459596 520106 594836 694151 833074 1037216
11622 1037216 1311196 1637305 1977574 2276074 2431537 2400136 2215893 1928424 1572513 1235649
11612 1235649 991957 835025 736215 671091 620955 580741 540539 502829 468853 427727 387238
11601 387238 353603 327852 306105 283953 262321 248432 234752 218878 199011 180232 167044
$$ packed form
11690A84418J756L134K381J263J712m935m122q51j040m70j709k557l004j2069
11676A63907j2842q505n918J008M868N690M207L531l69j670M237N002N433J322
11662A69901j073m903m107M71m366p685j874l413m146Q68L53L964j210N64O06
11647A43950P12M118O025J150J309K784L250L673O361P702P856R162J4056K0800
11633B32908K5892L1963L3015L6847M3903N5068O0510P4730R9315J38923K04142
11622A037216K73980L26109L40269K98500J55463l1401j84243k87469l55911l36864
11612A235649k43692j56932r8810o5124n0136m0214m0202l7710l3976m1126m0489
11601C87238l3635k5751k1747k2152k1632j3889j3680j5874j9867j8779j3188
$$ plain form
11590 167044 154843 147069 146519 146882 144850 145011 147317 149466 145528 147062 145321 140719 136825 130433 127893
11575 127893 134770 134064 128490 126424 127158 123298 121017 118510 112930 107641 105517 101357 99451 100071 99641
11560 99641 100962 102648 105877 108098 108399 106997 105202 104894 107631 111735 115617 116507 117476 118250 117315 118931
11544 118931 119910 122347 124114 121579 119489 117262 109044 104849 101229 97140 94145 95308 91566 86671
11530 86671 80261 75086 77423 84419 89738 90796 90815 90257 93821 91954 90904 88090 85745 83861 81093
11515 81093 74623 75222 75159 73834 70361 74736 77983 76659 71943 68451 69450 71526 69638 68902 69274 66316
11499 66316 65910 65197 61443 61354 61105 61533 61585 61442 61453 60547 56104 54276 54518 54145 53265 52827 50931 51355 51547
11480 51547 50765 58375 61535 63467 64073 68958 74039 77293 77184 76583 71552 68656 66427 67531 70123
$$ packed form
11590A67044j2201p774n50L63k032J61K306K149l938J534j741m602l894o392k540
11575A27893O877p06n574k066P34l860k281k507n580n289k124m160j906O20m30
11560I9641J321J686L229K221L01j402j795l08K737M104L882Q90R69P74r35J616
11544A18931R79K437J767k535k090k227q218m195l620m089k995J163l742m895
11530H6671o410n175K337O996N319J058J9n58L564j867j050k814k345j884k768
11515H1093o470N99o3j325l473M375L247j324m716l492R99K076j888p36L72k958
11499F6316m06p13l754q9k49M28N2j43J1r06m443j828K42l73q80m38j896M24J92
11480E1547p82P610L160J932O06M885N081L254j09o01n031k896k229J104K592
$$ plain form
11465 70123 72579 79827 86382 87584 86192 89393 95827 99633 98115 97756 95503 92570 88702 86887 82995
11450 82995 80208 84488 85181 82163 80246 79378 76565 80003 83228 88165 83211 77851 79099 78530 76441
11435 76441 76638 78720 85055 87679 89319 91910 90090 88196 90724 85497 87370 88375 82840 79658 73481
11420 73481 68418 64539 66340 69016 73016 69432 72847 78763 83813 87954 88855 89662 86855 80301 73076
11405 73076 72871 71340 76036 82833 82786 90417 100527 104243 112709 125025 135259 141599 140938 139121 138430
11390 138430 139878 137596 136718 131532 127777 124679 123033 129032 129733 129354 129471 132451 136136 139587 138523
11375 138523 139624 138692 134196 127231 118780 111504 103267 99926 96033 94177 93698 96491 95920 94691 92420
11360 92420 90032 88653 89404 84464 82929 85187 83857 81450 81256 87343 94927 98116 101938 106894 115572
$$ packed form
11465G0123K456P248O555J202j392L201O434L806j518l59k253k933l868j815l892
11450H2995k787M280O93l018j917q68k813L438L225M937m954n360J248n69k089
11435G6441J97K082O335K624J640K591j820j894K528n227J873J005n535l182o177
11420G3481n063l879J801K676M000l584L415N916N050M141R01Q07k807o554p225
11405G3076k05j531M696O797m7P631J0110L716Q466J2316J0234O340o61j817o91
11390A38430J448k282q78n186l755l098j646N999P01l79J17K980L685L451j064
11375A38523J101r32m496o965q451p276q237l341l893j856m79K793n71j229k271
11360I2420k388j379P51m940j535K258j330k407j94O087P584L189L822M956Q678
$$ plain form
11345 115572 124369 125538 123035 120543 117480 113142 105265 102051 100647 96750 93553 88151 88529 91075
11331 91075 89275 91051 91209 94132 98445 103678 109892 123484 140624 147272 153035 161549 167215 171616
11317 171616 168048 164750 160786 158313 160142 156599 156227 160063 160506 156673 152626 151435 152606 151042 149959
11302 149959 148908 145250 144650 147928 149197 149562 158620 169228 176132 179151 182192 179046 179960 183902 185746
11287 185746 186578 187341 188151 187552 186668 185568 181915 174040 168958 165778 165403 171069 174691 178753 184873 194380
11271 194380 208600 225193 251255 284353 309622 324590 325785 310055 274290 236685 204120 185791
11259 185791 179093 173328 166988 161804 160429 160537 157260 150469 142591 142548 139543 134984 130340 123973 123455
11244 123455 125246 129276 132861 134036 132748 136599 145836 156850 169850 180041 182313 181835 179098 177224
$$ packed form
11345A15572Q797J169k503k492l063m338p877l214j404l897l197n402L78K546
11331I1075j800J776J58K923M313N233O214J3592J7140O648N763Q514N666M401
11317A71616l568l298l964k473J829l543l72L836M43l833m047j191J171j564j083
11302A49959j051l658o00L278J269L65R058J0608O904L019L041l146R14L942J844
11287A85746Q32P63Q10n99q84j100l653p875n082l180l75N666L622M062O120R507
11271A94380J4220J6593K6062L3098K5269J4968J195j5730l5765l7605l2565j8329
11259A85791o698n765o340n184j375J08l277o791p878m3l005m559m644o367n18
11244A23455J791M030L585J175j288L851R237J1014J3000J0191K272m78k737j874
$$ plain form
11230 177224 174433 179834 183822 183168 181787 179409 176568 175311 173918 176665 180059 187035 202267 221498
11216 221498 245146 273194 293296 309081 309508 301037 280192 261260 246083 237227 232680 233387 233662
11203 233662 231698 237471 241859 240391 241301 242367 242980 246197 253474 267745 283671 289834 282108 261918
11189 261918 234401 209352 190020 179038 169904 164579 166433 169122 172853 173236 172372 172126 175891 184223
11175 184223 193170 203634 210320 225988 247238 266698 283100 301916 321591 341529 355323 365836
11163 365836 373950 370806 352098 331535 309671 292847 282367 274517 266963 259951 256212 255891 253899
11150 253899 247523 236018 235589 231523 230532 232856 235691 241644 242778 248440 260232 270869 278422 288634
11136 288634 301366 304397 296781 284816 270944 257551 249668 250539 252424 249904 242855 234241 230471
$$ packed form
11230A77224k791N401L988o54j381k378k841j257j393K747L394O976J5232J9231
11216B21498K3648K8048K0102J5785M27q471k0845j8932j5177q856m547P07K75
11203B33662j964N773M388j468R10J066O13L217P277J4271J5926O163p726k0190
11189B61918k7517k5049j9332j0982r134n325J854K689L731L83q64k46L765Q332
11175A84223Q947J0464O686J5668K1250J9460J6402J8816J9675J9938J3794J0513
11163C65836Q114l144j8708k0563k1864j6824j0480p850p554p012l739l21j992
11150B53899o376j1505m29m066r91K324K835N953J134N662J1792J0637P553J0212
11136B88634J2732L031p616j1965j3872j3393p883Q71J885k520p049q614l770
$$ plain form
11123 230471 227684 225727 224918 221980 225616 230363 229918 230870 232563 231866 237311 240653 242637 246611 250722
11108 250722 250650 246845 245015 246523 249069 248868 248003 248240 247025 245550 245079 243248 239423 234822 228219 227688
11092 227688 230501 238967 254053 274773 296753 314172 329215 339919 344015 342664 331921 324767
11080 324767 317037 306289 294087 280323 267834 258275 253311 248357 241470 234989 234567 237067 242822
11067 242822 245715 249194 248482 240533 236936 233423 229741 226278 223936 218715 216449 216064 212470 213781 215105
11052 215105 216363 213501 210530 208617 206757 206957 210185 216038 221352 226825 231898 237120 240238 246348
11038 246348 251708 258093 265110 273570 285889 293830 294059 286564 273367 262411 252860 243147 233303 227936
11024 227936 218948 208616 197357 188492 181999 175528 167227 161704 161747 160476 160691 165160 169037 172621
$$ packed form
11123B30471k787j957q09k938L636M747m45R52J693o97N445L342J984L974M111
11108B50722p2l805j830J508K546k01q65K37j215j475m71j831l825m601o603n31
11092B27688K813Q466J5086K0720K1980J7419J5043J0704M096j351j0743p154
11080C24767p730j0748j2202j3764j2489r559m964m954o887o481m22K500N755
11067B42822K893L479p12p949l597l513l682l463k342n221k266l85l594J311J324
11052B15105J258k862k971j913j860K00L228N853N314N473N073N222L118O110
11038B46348N360O385P017Q460J2319P941K29p495j3197j0956r551r713r844n367
11024B27936q988j0332j1259q865o493o471q301n523M3j271K15M469L877L584
$$ plain form
11010 172621 177543 176348 174565 170419 164364 161090 151981 140974 132862 126149 121666 118322 117292 119522
10996 119522 122424 124101 124516 124385 121526 119641 117074 114029 110775 104937 99101 96518 93258 94377 95022
10981 95022 92252 93106 98970 99730 103464 111684 117509 118068 120368 127148 126992 124915 129288 131819 134110
10966 134110 140569 154647 171642 188147 202569 203016 193956 179614 165326 158070 153823 155571 164082
10953 164082 173139 176580 177587 186898 197486 202006 207619 215478 225547 230221 233183 233769 232828 231711
10939 231711 229820 225636 219419 220598 223424 225365 229197 240776 257303 271159 274432 265560 246594
10926 246594 232950 223074 217185 216680 218737 222641 229026 238037 251870 258714 263963 269612 275046 272870
10912 272870 271111 261934 252960 245198 233906 220851 214636 208483 202174 196058 193103 193628 193652 187769
$$ packed form
11010A72621M922j195j783m146o055l274r109j1007q112o713m483l344j030K230
10996A19522K902J677M15j31k859j885k567l045l254n838n836k583l260J119O45
10981I5022k770Q54N864P60L734Q220N825N59K300O780j56k077M373K531K291
10966A34110O459J4078J6995J6505J4422M47r060j4342j4288p256m247J748Q511
10953A64082R057L441J007R311J0588M520N613P859J0069M674K962N86r41j117
10939B31711j891m184o217J179K826J941L832J1579J6527J3856L273q872j8966
10926B46594j3644r876n889n05K057L904O385R011J3833O844N249N649N434k176
10912B72870j759r177q974p762j1292j3055o215o153o309o116k955N25K4n883
$$ plain form
10898 187769 181394 180138 177924 179742 184113 190676 194198 199128 210958 216833 217696 221159 222814 221470
10884 221470 214998 204223 196084 191194 188097 184345 186125 188871 191738 198684 207621 215110 223403 227471
10870 227471 234239 233990 233123 225662 219907 215837 215201 215993 216664 221186 226507 227702 227686 228659 232203 236636
10854 236636 242221 244857 251477 257221 260932 260903 254988 253546 255503 259188 262552 270806 281258 288527
10840 288527 292967 299540 297482 289850 282704 281570 278707 276060 277504 278142 281806 286582 289272 292047
10826 292047 288730 279030 265526 259312 252984 247039 244656 247140 249984 256437 264157 273291 278900 289145
10812 289145 304509 314512 320050 317045 309371 300705 293796 290669 289699 290364 293118 298619 298792 296574
10798 296574 294998 294026 291240 288063 291393 296496 295721 298064 302420 311737 323833 339208 362170 398882
$$ packed form
10898A87769o375j256k214J818M371O563L522M930J1830N875Q63L463J655j344
10884B21470o472j0775q139m890l097l752J780K746K867O946Q937P489Q293M068
10870B27471O768k49q67p461n755m070o36P92O71M522N321J195j6R73L544M433
10854B36636N585K636O620N744L711k9n915j442J957L685L364Q254J0452P269
10840B88527M440O573k058p632p146j134k863k647J444O38L664M776K690K775
10826B92047l317r700j3504o214o328n945k383K484K844O453P720R134N609J0245
10812B89145J5364J0003N538l005p674q666o909l127r70O65K754N501J73k218
10798B96574j576r72k786l177L330N103p75K343M356R317J2096J5375K2962L6712
$$ plain form
10784 398882 451860 517570 595704 659418 687695 673343 616629 556328 512616 479426 451187
10773 451187 432691 416250 406809 398702 392739 385023 378290 370713 358838 344098 336182 329223 320611
10760 320611 321862 323989 328153 331528 334217 341292 349140 353208 358052 363893 371367 368974 364179 361990
10746 361990 366299 370489 364651 361821 359669 357093 364195 372355 378662 390891 404583 420131 432516
10733 432516 439442 436283 424114 413662 394534 374113 362046 359742 362561 365619 373576 385999 402145
10720 402145 435488 482288 544036 605285 649521 664589 619711 537462 468151 430967 404972
10709 404972 388200 376364 369474 371813 379257 391247 399883 406529 399528 385683 371917 350984 326535
10696 326535 309280 301547 297592 295935 299258 306548 316408 327841 323441 311939 299440 283842 266380
$$ packed form
10784C98882N2978O5710P8134O3714K8277j4352n6714o0301m3712l3190k8239
10773D51187j8496j6441r441q107n963p716o733p577j1875j4740p916o959q612
10760C20611J251K127M164L375K689P075P848M068M844N841P474k393m795k189
10746C61990M309M190n838k830k152k576P102Q160O307J2229J3692J5548J2385
10733D32516O926l159j2169j0452j9128k0421j2067k304K819L058P957J2423J6146
10720D02145L3343M6800O1748O1249M4236J5068m4878q2249o9311l7184k5995
10709D04972j6772j1836o890K339P444J1990Q636O646p001j3845j3766k0933k4449
10696C26535j7255p733l955j657L323P290R860J1433m400j1502j2499j5598j7462
$$ plain form
10683 266380 254045 242383 236555 231058 227963 221799 216255 214354 214622 215255 214989 218795 223142 223458 225068
10668 225068 229876 247319 268165 291076 321459 353513 387010 424021 468339 527090 608068 709819
10656 709819 832578 959392 1062888 1151418 1196412 1159811 1097682 1009091 882074 768015
10646 768015 672603 597095 540988 503467 473594 450770 430845 414996 400704 393647 385703 386191
10634 386191 396129 411062 431147 453768 488744 542135 614081 707260 819029 931791 1029410
10623 1029410 1114903 1163649 1134321 1072997 989494 859762 733412 629285 540600 474611 433613
10612 433613 408868 388634 376250 370056 367230 354221 338242 316713 293150 277271 263768 249842
10600 249842 239141 232325 228541 224340 221718 218252 215759 212649 209657 200696 198231 197039 199290 200352
$$ packed form
10683B66380j2335j1662n828n497l095o164n544j901K68O33k66L806M347L16J610
10668B25068M808J7443K0846K2911L0383L2054L3497L7011M4318N8751Q0978J01751
10656G09819J22759J26814J03496Q8530M4994l6601o2129q8591j27017j14059
10646G68015r5412p5508n6107l7521k9873k2824j9925j5849j4292p057p944M88
10634C86191R938J4933K0085K2621L4976N3391P1946R3179J11769J12762R7619
10623A029410Q5493M8746k9328o1324q3503j29732j26350j04127q8685o5989m0998
10612D33613k4745k0234j2384o194k826j3009j5979k1529k3563j5879j3503j3926
10600B49842j0701o816l784m201k622l466k493l110k992q961k465j192K251J062
$$ plain form
10586 200352 199477 198899 196635 194081 191049 186059 176728 168786 165002 160223 159237 163648 170604 177399 184120
10571 184120 186215 186548 186143 186354 186855 183575 180442 175865 175131 177066 176666 178805 187731 190611 195466 200484
10555 200484 201195 199991 200141 203153 204873 210989 215871 220249 226783 226577 228217 222682 215146 210791 210335
10540 210335 211958 217660 219379 222687 228395 234426 235511 235955 240887 246854 253465 264850 271218 274423
10526 274423 273060 269218 264838 259659 253790 248365 247773 249744 250950 247527 246667 249226 251498 254658 264871
10511 264871 272989 275305 279353 279064 277409 275639 272601 267200 257288 241165 236075 240244 239123 244313
10497 244313 248250 249022 249467 252064 254807 255532 252089 247239 243929 238641 238858 239659 238355 235241 231439
10482 231439 227169 221500 220450 218606 216346 216023 217231 224117 235104 239686 248878 263438 269678 274593
$$ packed form
10586B00352q75n78k264k554l032m990r331p942l784m779r86M411O956O795O721
10571A84120K095L33m05K11N01l280l133m577p34J935m00K139Q926K880M855N018
10555B00484P11j204J50L012J720O116M882M378O534k06J640n535p536m355m56
10540B10335J623N702J719L308N708O031J085M44M932N967O611J1385O368L205
10526B74423j363l842m380n179n869n425n92J971J206l423q60K559K272L160J0213
10511B64871Q118K316M048k89j655j770l038n401r912j6123n090M169j121N190
10497B44313L937P72M45K597K743P25l443m850l310n288K17Q01j304l114l802
10482B31439m270n669j050j844k260l23J208O886J0987M582R192J4560O240M915
$$ plain form
10468 274593 281774 289321 288124 283609 282593 276276 271727 268521 269377 270891 282625 292056 303402 317535
10454 317535 329481 335942 338311 339057 342224 345203 345820 346323 338209 326025 314297 305709 303971 303846
10440 303846 302815 300522 302412 302365 301425 303989 310053 316502 327681 341854 357334 373212 387779 400182
10426 400182 406203 406072 409066 412065 413598 419147 425768 440074 457602 478675 494861 505019 510467
10413 510467 508625 504653 497290 487377 467657 443314 416998 389725 368441 349510 341470 333571 321800
10400 321800 317774 317062 323926 330577 336178 339731 341086 341681 340990 332855 322621 313112 305088 296639 290523
10385 290523 282946 276248 274177 276237 280472 288004 292876 295441 296462 294567 290301 293768 300654 307714
10371 307714 314682 318556 317130 312813 303663 294214 288000 284770 284087 290702 299905 309894 324793 334034
$$ packed form
10468B74593P181P547j197m515j016o317m549l206Q56J514J1734R431J1346J4133
10454C17535J1946O461K369P46L167K979O17N03q114j2184j1728q588j738j25
10440C03846j031k293J890m7r40K564O064O449J1179J4173J5480J5878J4567J2403
10426D00182O021j31K994K999J533N549O621J4306J7528K1073J6186J0158N448
10413E10467j842l972p363r913j9720k4343k6316k7273k1284j8931q040p899j1771
10400C21800m026p12O864O651N601L553J355N95o91q135j0234r509q024q449o116
10385B90523p577o698k071K060M235P532M872K565J021j895m266L467O886P060
10371C07714O968L874j426m317r150r449o214l230o83O615R203R989J4899R241
$$ plain form
10357 334034 337016 340324 336723 328692 322443 314201 302969 286486 272700 261275 252220 251949 250512
10344 250512 255063 262238 272014 288989 307434 326828 350213 378128 406242 430915 447416 459527
10332 459527 468599 467484 458131 444933 428244 407577 389156 368508 350641 337830 324910 306292
10320 306292 288732 275667 264853 256055 252046 249154 242209 237841 240732 246232 250588 253714 261091
10307 261091 274321 287892 300295 316725 334908 352310 363557 369841 382207 399245 418684 430817
10295 430817 433649 428910 408894 379202 357950 339080 323620 313364 307162 304754 301731 299217 294810
10282 294810 288019 278907 271061 262723 253906 246666 240774 236451 229856 228080 225436 223116 218064 217127
10268 217127 221112 219808 220796 225592 229790 237253 246324 263568 277970 292885 308833 322708 337862
$$ packed form
10357C34034K982L308l601q031o249q242j1232j6483j3786j1425r055k71j437
10344B50512M551P175R776J6975J8445J9394K3385K7915K8114K4673J6501J2111
10332D59527R072j115r353j3198j6689k0667j8421k0648j7867j2811j2920j8618
10320C06292j7560j3065j0814q798m009k892o945m368K891N500M356L126P377
10307B61091J3230J3571J2403J6430J8183J7402J1247O284J2366J7038J9439J2133
10295D30817K832m739k0016k9692k1252j8870j5460j0256o202k408l023k514m407
10282B94810o791r112p846q338q817p240n892m323o595j776k644k320n052r37
10268B17127L985j304R88M796M198P463R071J7244J4402J4915J5948J3875J5154
$$ plain form
10255 337862 356081 366228 372962 385870 405982 428465 457383 492211 530308 578757 632883 685852
10243 685852 740172 793269 835921 881473 950116 1051450 1175857 1320249 1483386 1663698
10233 1663698 1854913 2078840 2386589 2799668 3240314 3586710 3745165 3515918 2911312
10224 2911312 2313032 1884500 1589586 1388036 1248715 1151858 1086437 1036641 991424 941846
10214 941846 877246 802833 731347 680057 645194 619819 597332 571325 544988 524795 501837
10203 501837 485799 476470 466570 460260 457855 457967 458816 460315 464845 463352 463098 466094 464074 461411 452169
10188 452169 438109 423522 416819 416620 423856 433306 438372 439093 441800 449041 466383 493356 518686
10175 518686 545434 578655 619722 676487 749335 848064 975823 1144264 1361004 1601356 1824876
$$ packed form
10255C37862J8219J0147O734J2908K0112K2483K8918L4828L8097M8449N4126N2969
10243F85852N4320N3097M2652M5552O8643J01334J24407J44392J63137J80312
10233A663698J91215K23927L07749M13079M40646L46396J58455k29247o04606
10224B911312n98280m28532k94914k01550j39321r6857o5421m9796m5217m9578
10214I41846o4600p4413p1486n1290l4863k5375k2487k6007k6337k0193k2958
10203E01837j6038r329r900o310k405J12Q49J499M530j493k54K996k020k663r242
10188D52169j4060j4587o703j99P236R450N066P21K707P241J7342K6973K5330
10175E18686K6748L3221M1067N6765P2848R8729J27759J68441K16740K40352K23520
$$ plain form
10164 1824876 1985389 2005366 1866522 1661024 1455532 1290801 1158958 1068394 1015578 979386
10154 979386 957192 931448 892659 839663 775479 717176 670642 635550 606438 579701 557629
10143 557629 539857 522501 513714 507883 507986 511967 525100 547913 567663 592619 617876 633719
10131 633719 634934 627517 626893 642677 655974 675223 703862 747365 802673 875118 970023 1088512
10119 1088512 1210201 1312404 1377367 1385488 1337380 1268001 1209766 1168432 1118697 1051711 976426
10108 976426 906177 841207 780927 734518 699302 676097 664423 661183 655966 646209 629287 608031
10096 608031 587458 572154 564896 558032 554255 557663 565966 583014 603111 627196 658194 691369
10084 691369 747076 837508 965649 1130042 1315625 1480929 1576689 1560699 1408072 1184452
$$ packed form
10164A824876J60513J9977j38844k05498k05492j64731j31843r0564n2816l6192
10154I79386k2194k5744l8789n2996o4184n8303m6534l5092k9112k6737k2072
10143E57629j7772j7356q787n831J03L981J3133K2813J9750K4956K5257J5843
10131F33719J215p417o24J5784J3297J9249K8639M3503N5308P2445R4905J18489
10119A088512J21689J02203O4963Q121m8108o9379n8235m1334m9735o6986p5285
10108I76426p0249o4970o0280m6409l5216k3205j1674l240n217r757j6922k1256
10096F08031k0573j5304p258o864l777L408Q303J7048K0097K4085L0998L3175
10084F91369N5707R0432J28141J64393J85583J65304R5760j5990j52627k23620
$$ plain form
10074 1184452 981186 829033 724745 655912 608165 577357 562745 558738 560083 562095 556128
10063 556128 538735 509507 473109 441807 418544 399148 385518 382468 387683 398022 410699 423044
10051 423044 435372 442763 446240 451461 451441 449567 447032 447927 444539 437895 418903 392502 371626 357005
10037 357005 350951 349132 348135 350497 350797 351272 351977 350758 352413 360456 368700 374321 371907 363549 355429
10022 355429 352326 352656 354814 359951 366963 373103 379645 386892 396675 408752 428318 452837 480578
10009 480578 512104 540536 561575 578997 589095 587937 577548 559779 538777 523225 512216 509360
9997 509360 512729 515027 515891 519626 524816 534996 546984 560513 584170 604227 622400 643966 671047
9984 671047 692303 698419 695917 683413 672571 655547 632752 607687 585390 577685 576434 582357 597130
$$ packed form
10074A184452k03266j52153j04288o8833m7747l0808j4612m007J345K012n967
10063E56128j7393k9228l6398l1302k3263j9396j3630l050N215J0339J2677J2345
10051D23044J2328P391L477N221k0j874k535Q95l388o644j8992k6401k0876j4621
10037C57005o054j819r97K362L00M75P05j219J655Q043Q244N621k414q358q120
10022C55429l103L30K158N137P012O140O542P247R783J2077J9566K4519K7741
10009D80578L1526K8432K1039J7422J0098j158j0389j7769k1002j5552j1009k856
9997E09360L369K298Q64L735N190J0180J1988J3529K3657K0057J8173K1566K7081
9984F71047K1256O116k502j2504j0842j7024k2795k5065k2297p705j251N923J4773
$$ plain form
9971 597130 609565 608033 601389 587908 575828 573397 579912 595882 622825 653360 682157 713361
9959 713361 744797 761258 762063 754149 742961 736749 736046 733678 730035 739276 763733 808541 874785
9946 874785 962343 1064584 1169361 1264298 1324837 1343108 1338130 1339348 1369238 1426577 1506446 1593263
9934 1593263 1656380 1672234 1631897 1553151 1465171 1387165 1328017 1278820 1222380 1148626 1063567
9923 1063567 967774 881315 813916 767511 735731 709921 694672 682199 680009 678931 680047 695457
9911 695457 720067 761123 825865 914147 1021867 1137632 1240879 1320118 1347358 1325267 1280397
9900 1280397 1240076 1211769 1192938 1186693 1185566 1159844 1102620 1034117 981395 931137 876376 823855
9888 823855 773874 729192 689580 656991 634437 612403 592431 574472 548202 512224 464492 423161
$$ packed form
9971E97130J2435j532o644j3481j2080k431O515J5970K6943L0535K8797L1204
9959G13361L1436J6461Q05p914j1188o212p03k368l643R241K4457M4808O6244
9946H74785Q7558J02241J04777R4937O0539J8271m978J218K9890N7339P9869Q6817
9934A593263O3117J5854m0337p8746q7980p8006n9148m9197n6440p3754q5059
9923A063567r5793q6459o7399m6405l1780k5810j5249j2473k190j078J116J5410
9911F95457K4610M1056O4742Q8282J07720J15765J03247P9239K7240k2091m4870
9900A280397m0321k8307j8831o245j127k5722n7224o8503n2722n0258n4761n2521
9888H23855m9981m4682l9612l2589k2554k2034j9972j7959k6270l5978m7732m1331
$$ plain form
9876 423161 389730 364167 349349 333685 321305 315568 307487 296135 287646 273208 257076 243962
9864 243962 240433 239323 235363 235434 236062 234726 235706 234460 238855 248486 262841 279210 297974 319763
9850 319763 340543 362434 376839 377900 362914 347156 331766 316613 303682 291498 279452 271531
9838 271531 265475 261354 259242 262818 264462 265477 264030 255954 251305 244820 237480 230022 222786 219260
9824 219260 218897 218948 223198 229609 236366 242647 247243 253832 258546 258638 252999 248212 243463 242969 243892 247879
9808 247879 254080 256277 255348 256062 255147 260702 266886 272551 275610 278724 284637 296854 314370 338890
9794 338890 368158 400246 433723 472497 510601 546212 572818 588836 577647 541103 496761 454983
9782 454983 423802 408240 401171 403205 410823 420944 437996 465636 502453 544632 601529 689514
$$ packed form
9876D23161l3431k5563j4818j5664j2380n737q081j1352q489j4438j6132j3114
9864B43962l529j110l960P1O28j336R80j246M395R631J4355J6369J8764K1789
9850C19763K0780K1891J4405J061j4986j5758j5390j5153j2931j2184j2046p921
9838B71531o056m121k112L576J644J015j447q076m649o485p340p458p236l526
9824B19260l63N1M250O411O757O281M596O589M714R2n639m787m749m94R23L987
9808B47879O201K197r29P14r15N555O184N665L059L114N913J2217J7516K4520
9794C38890K9268L2088L3477L8774L8104L5611K6606J6018j1189l6544m4342m1778
9782D54983l1181j5562p069K034P618J0121J7052K7640L6817M2179N6897Q7985
$$ plain form
9770 689514 813150 965796 1124714 1259597 1328531 1288506 1141308 968280 831687 736660
9760 736660 671646 625258 589189 551961 511988 468718 431029 403739 378561 354277 333360 318125
9748 318125 305907 292877 284065 278935 272479 272450 273215 272820 276489 289777 309260 324834 336917 355028
9734 355028 380636 413350 449632 490644 553916 637054 747797 896507 1097440 1347836 1617820
9723 1617820 1841504 1959013 1885283 1633366 1358683 1153803 1017320 927357 854350 787261
9713 787261 718270 651790 590983 540630 497387 459766 427157 401544 383361 370859 366045 367575
9701 367575 374569 386344 403038 430772 468359 497744 514804 498308 454454 413399 384998 369370
9689 369370 356303 341430 325554 313580 304088 297335 296260 297813 304146 309955 312754 314729 313589
$$ packed form
9770F89514J23636J52646J58918J34883O8934m0025j47198j73028j36593r5027
9760G36660o5014m6388l6069l7228l9973m3270l7689k7290k5178k4284k0917j5235
9748C18125j2218j3030q812n130o456k9P65l95L669J3288J9483J5574J2083J8111
9734C55028K5608L2714L6282M1012O3272Q3138J10743J48710K00933K50396K69984
9723A617820K23684J17509p3730k51917k74683k04880j36483q9963p3007o7089
9713G87261o8991o6480o0807n0353m3243l7621l2609k5613j8183j2502m814J530
9701C67575O994J1775J6694K7734L7587K9385J7060j6496m3854m1055k8401j5628
9689C69370j3067j4873j5876j1974r492o753j075J553O333N809K799J975j140
$$ plain form
9676 313589 314166 321283 329433 335754 344505 361184 387225 427221 479294 539048 610674 699351 795450
9663 795450 892803 969485 1023790 1044666 1022626 976855 937966 897202 840240 772866 714812 666425
9651 666425 620095 575934 527138 476961 434117 404124 380500 356898 333707 314050 299617 286345
9639 286345 277882 276805 279493 285875 298288 319594 342872 365373 376210 380161 375235 359340 341051
9626 341051 320234 298265 274625 250386 227231 206509 194869 186550 179969 172771 165881 158421 152112
9613 152112 150293 145553 142512 141996 139928 136451 132052 127260 125767 126104 127388 126835 124169 128748 128330
9598 128330 123642 119233 122894 125247 123785 121718 119674 120508 120728 120204 122429 126806 131533 132217 129023
9583 129023 125326 123804 122123 121125 122700 118780 115086 114039 112178 110018 113040 117391 117003 117406 117434 116620
$$ packed form
9676C13589N77P117Q150O321Q751J6679K6041L9996N2073N9754P1626Q8677R6099
9663G95450R7353P6682N4305K0876k2040m5771l8889m0764n6962o7374n8054m8387
9651F66425m6330m4161m8796n0177m2844k9993k3624k3602k3191j9657j4433j3272
9639B86345q463j077K688O382J2413K1306K3278K2501J0837L951m926j5895j8289
9626C41051k0817k1969k3640k4239k3155k0722j1640q319o581p198o890p460o309
9613A52112j819m740l041n16k068l477m399m792j493L37J284n53k666M579m18
9598A28330m688m409L661K353j462k067k044Q34K20n24K225M377M727O84l194
9583A29023l697j522j681r98J575l920l694j047j861k160L022M351l88M03K8q14
$$ plain form
9567 116620 114247 109480 113935 121600 120854 120533 122871 124069 127213 124669 121247 125490 127333 128034 133719
9552 133719 133094 136606 139881 146651 155582 162647 169918 170979 168425 166911 165484 164111 161898 157094 152466
9537 152466 148530 146968 147026 146117 148568 150369 150675 159452 161144 162105 164720 167460 173046 176570 178289 182296
9521 182296 183468 181378 180106 180391 179502 176166 172611 168096 167327 169919 169172 169500 168415 171163 176944 173238
9505 173238 168806 170886 170370 172457 172788 175173 181566 183612 183417 182958 180094 178672 177217 175694 173352
9490 173352 171419 170636 171228 169151 170635 175602 181337 185231 187891 192594 197156 201442 202774 206296 213610
9475 213610 218417 222175 226350 230321 226884 217184 216446 218387 216941 216389 217478 224642 235321 247337
9461 247337 262825 280744 304306 327223 358330 400814 454045 518808 595214 684803 782820 876268
$$ packed form
9567A16620k373m767M455P665p46l21K338J198L144k544l422M243J843P01N685
9552A33719o25L512L275O770Q931P065P271J061k554j514j427j373k213m804m628
9537A52466l936j562N8r09K451J801L06Q777J692R61K615K740N586L524J719M007
9521A82296J172k090j272K85q89l336l555m515p69K592p47L28j085K748N781l706
9505A73238m432K080n16K087L31K385O393K046j95m59k864j422j455j523k342
9490A73352j933p83N92k077J484M967N735L894K660M703M562M286J332L522P314
9475B13610M807L758M175L971l437r700p38J941j446n52J089P164J0679J2016
9461B47337J5488J7919K3562K2917L1107M2484N3231O4763P6406Q9589R8017R3448
$$ plain form
9449 876268 936810 948829 887193 774927 665991 580590 522331 487442 468723 461269 461766 469339
9437 469339 476778 484072 486575 482074 471313 454048 441527 441159 447541 455255 473651 500325 526125
9424 526125 555879 597774 649901 715332 801642 920534 1070975 1243323 1428783 1611457 1770531
9413 1770531 1907853 2046890 2190198 2316802 2393907 2401879 2323333 2172284 1983402 1765873
9403 1765873 1515415 1280077 1102035 971317 875472 806187 752399 705002 670039 640108 617809
9392 617809 596682 576281 560300 548173 536132 524618 511557 500758 496315 497233 503364 518500
9380 518500 538247 560949 591035 620192 658881 706365 771003 860031 977714 1140991 1351979
9369 1351979 1595873 1845896 2070975 2245174 2319249 2272643 2124730 1905707 1641703 1380243
$$ packed form
9449H76268O0542J2019o1636j12266j08936q5401n8259l4889j8719p454M97P573
9437D69339P439P294K503m501j0761j7265j2521l68O382P714J8396K6674K5800
9424E26125K9754M1895N2127O5431Q6310J18892J50441J72348J85460J82674J59074
9413A770531J37322J39037J43308J26604P7105P972p8546j51049j88882k17529
9403A765873k50458k35338j78042j30718r5845o9285n3788m7397l4963k9931k2299
9392F17809k1127k0401j5981j2127j2041j1514j3061j0799m443R18O131J5136
9380E18500J9747K2702L0086K9157L8689M7484O4638Q9028J17683J63277K10988
9369A351979K43894K50023K25079J74199P4075m6606j47913k19023k64004k61460
$$ plain form
9359 1380243 1162967 990905 862122 778200 720242 675747 639293 611394 585565 562927 549429
9348 549429 537809 532381 533950 539329 552749 566926 575527 580594 574996 557368 542672 537484 546986
9335 546986 563915 581486 585687 580488 567551 545051 515217 489173 469369 452110 432014 407505
9323 407505 388333 377806 370160 360400 345043 339823 339333 336222 339450 347986 360130 366574 364528 363340
9309 363340 364094 369974 381791 394349 406004 413655 408130 390602 367964 348426 331866 316818 309584
9296 309584 300799 287923 272532 247231 225661 206840 195400 187949 183726 178283 173603 169163 166184
9283 166184 161078 155522 158144 161513 164321 161001 158412 155806 153537 153572 149358 143274 141377 142788 144797
9268 144797 144831 141053 138864 137943 135158 135990 137413 136877 137576 138047 137401 135204 131290 126598 122561 123602
$$ packed form
9359A380243k17276j72062j28783q3922n7958m4495l6454k7899k5829k2638j3498
9348E49429j1620n428J569N379J3420J4177Q601N067n598j7628j4696n188R502
9335E46986J6929J7571M201n199j2937k2500k9834k6044j9804j7259k0096k4509
9323D07505j9172j0527p646r760j5357n220m90l111L228Q536J2144O444k046j188
9309C63340P54N880J1817J2558J1655P651n525j7528k2638j9538j6560j5048p234
9296C09584q785j2876j5391k5301k1570j8821j1440p451m223n443m680m440k979
9283A66184n106n556K622L369K808l320k589k606k269L5m214o084j897J411K009
9268A44797L4l778k189r21k785Q32J423n36O99M71o46k197l914m692m037J041
$$ plain form
9252 123602 124744 124961 124663 122570 122119 121035 121990 119835 119620 119418 119525 120448 122917 121901 128501 130245
9236 130245 132262 134095 139981 144298 147401 147660 145726 145284 135863 130169 134102 131508 129939 126912 123553
9221 123553 117337 116458 117656 118271 119468 119560 122283 122821 123803 124957 127038 129335 130665 128073 129915 133078
9205 133078 134013 131747 132318 132752 135810 142456 143820 143312 147213 148948 148757 146121 148497 146477 149698 151363
9189 151363 151579 150922 146925 145134 144858 145205 146847 151159 156074 158433 156072 155554 149927 148314 151306 153981
9173 153981 153071 153503 153478 157505 159155 160090 158986 156008 155504 157229 158953 156995 155870 157929 157814 154713
9157 154713 154072 150645 148481 147281 147786 149185 149011 153537 156533 154653 152489 150715 148742 147768 146941 145038
9141 145038 146387 153119 156505 157996 157177 155823 155564 159458 160218 156072 158055 162077 162790 162102 163413 164718
$$ packed form
9252A23602J142K17k98k093m51j084R55k155k15k02J07R23K469j016O600J744
9236A30245K017J833N886M317L103K59j934m42r421n694L933k594j569l027l359
9221A23553o216q79J198O15J197R2K723N38R82J154K081K297J330k592J842L163
9205A33078R35k266N71M34L058O646J364n08L901J735j91k636K376k020L221J665
9189A51363K16o57l997j791k76L47J642M312M915K359k361n18n627j613K992K675
9173A53981r10M32k5M027J650R35j104k978n04J725J724j958j125K059j15l101
9157A54713o41l427k164j200N05J399j74M526K996j880k164j774j973r74q27j903
9141A45038J349O732L386J491q19j354k59L894P60m146J983M022P13o88J311J305
$$ plain form
9125 164718 164332 161597 157164 158318 161662 160294 159402 160991 167188 170549 168838 168353 163117 161313 164265
9110 164265 167839 169217 169180 171511 175273 177396 177377 179284 181733 182269 180658 179420 179545 182067 183042 180577
9094 180577 184257 188192 189810 188284 191847 194033 195580 197593 197714 197906 199467 200552 200067 202367 203976
9079 203976 203698 201850 200935 200062 196056 197208 197989 199896 204163 209340 213024 211123 208819 211867 211476 210245
9063 210245 210032 211988 215797 219905 222618 224882 226107 226171 224605 223198 224274 226834 226968 231780 235528
9048 235528 237816 238288 239881 239861 240329 243099 245331 245026 244182 242686 242460 250437 253446 254070 254802 256065 257242
9031 257242 254737 248962 247069 246222 247888 250147 251469 251525 252469 250553 250129 251891 254778 256227 256876 259065
9015 259065 262207 254452 248329 248565 252123 256409 263397 268956 276801 283133 283928 285854 292380 300603 306939
$$ packed form
9125A64718l86k735m433J154L344j368q92J589O197L361j711m85n236j804K952
9110A64265L574J378l7K331L762K123j9J907K449N36j611j238J25K522R75k465
9094A80577L680L935J618j526L563K186J547K013J21J92J561J085m85K300J609
9079B03976k78j848r15q73m006J152P81J907M267N177L684j901k304L048l91j231
9063B10245k13J956L809M108K713K264J225O4j566j407J076K560J34M812L748
9048B35528K288M72J593k0M68K770K232l05q44j496k26P977L009O24P32J263J177
9031B57242k505n775j893q47J666K259J322N6R44j916m24J762K887J449O49K189
9015B59065L142p755o123K36L558M286O988N559P845O332P95J926O526Q223O336
$$ plain form
9000 306939 309203 310698 314283 314612 311850 313313 316090 322048 318996 319799 323357 327224 325139 323127 323072
8985 323072 323237 326877 330024 332916 335820 337304 338832 342567 345365 345008 347212 343902 343008 346821 350890
8970 350890 356534 362739 368285 375985 381771 384886 392426 400395 404749 410342 420264 429266 436649 439966
8956 439966 447023 454807 461364 463283 462930 463471 466147 466885 466961 469572 471825 478114 482927 485132 485203 490581
8940 490581 493829 492154 494063 491176 492009 494710 497135 499543 499145 496069 498907 501087 503299 502770 506760
8925 506760 505437 505621 506961 508970 515454 518645 520894 525421 529599 533328 532999 535022 542066 544434 550562
8910 550562 556323 561273 564888 564267 567318 565328 562785 567262 571438 573769 581247 588566 595267 597324 599103
8895 599103 608168 616054 624494 634476 641898 648106 649922 656324 663694 667326 668457 671642 678966 684028
$$ packed form
9000C06939K264J495L585L29k762J463K777N958l052Q03L558L867k085k012n5
8985C23072J65L640L147K892K904J484J528L735K798l57K204l310q94L813M069
8970C50890N644O205N546P700N786L115P540P969M354N593R922R002P383L317
8956D39966P057P784O557J919l53N41K676P38P6K611K253O289M813K205P1N378
8940D90581L248j675J909k887Q33K701K425K408l98l076K838K180K212n29L990
8925E06760j323J84J340K009O484L191K249M527M178L729l29K023P044K368O128
8910E50562N761M950L615o21L051j990k543M477M176K331P478P319O701K057J779
8895E99103R065P886Q440R982P422O208J816O402P370L632J131L185P324N062
$$ plain form
8881 684028 691931 703966 707666 715043 720787 721850 724130 733701 745398 754590 762795 768464 770731 774100
8867 774100 779764 784542 788830 794933 802331 810562 820537 828545 838435 847415 858315 875361 889172 899484
8853 899484 909811 921761 932218 943335 956497 968112 980317 990663 1004097 1019008 1032085 1044235
8841 1044235 1060444 1072271 1089501 1107262 1122745 1137681 1156983 1176563 1199526 1218242 1231352
8830 1231352 1244857 1267485 1289819 1311413 1332226 1355089 1375677 1400882 1432693 1460752 1486665
8819 1486665 1512349 1541765 1569829 1595542 1628794 1658805 1687777 1721039 1750963 1779827 1809910
8808 1809910 1841221 1869493 1900625 1935641 1969179 2004888 2037836 2072655 2108273 2144180 2176996
8797 2176996 2214786 2255094 2293421 2331142 2371865 2412448 2456802 2500075 2542804 2589676 2639636
$$ packed form
8881F84028P903J2035L700P377N744J063K280R571J1697R192Q205N669K267L369
8867G74100N664M778M288O103P398Q231R975Q008R890Q980J0900J7046J3811J0312
8853H99484J0327J1950J0457J1117J3162J1615J2205J0346J3434J4911J3077J2150
8841A044235J6209J1827J7230J7761J5483J4936J9302J9580K2963J8716J3110
8830A231352J3505K2628K2334K1594K0813K2863K0588K5205L1811K8059K5913
8819A486665K5684K9416K8064K5713L3252L0011K8972L3262K9924K8864L0083
8808A809910L1311K8272L1132L5016L3538L5709L2948L4819L5618L5907L2816
8797B176996L7790M0308L8327L7721M0723M0583M4354M3273M2729M6872M9960
$$ plain form
8786 2639636 2687630 2740436 2796464 2851962 2909688 2967979 3027001 3093177 3158493 3225659 3293216
8775 3293216 3364441 3437758 3516085 3598660 3686709 3773453 3858704 3953926 4050815 4151389 4261372
8764 4261372 4375357 4491383 4612619 4743417 4879998 5023718 5172851 5328766 5492108 5657650
8754 5657650 5837049 6021771 6216605 6423359 6642092 6868638 7108888 7362197 7626363 7909117
8744 7909117 8206700 8524993 8864049 9219300 9597167 10003911 10429095 10877850 11357114 11872530
8734 11872530 12423210 13009953 13635002 14300441 15013550 15778194 16595947 17466204 18400045
8725 18400045 19401702 20469615 21612213 22834466 24144228 25549431 27050873 28650791
8717 28650791 30360920 32181287 34122611 36185410 38373669 40688194 43127863 45696103
$$ packed form
8786B639636M7994N2806N6028N5498N7726N8291N9022O6176O5316O7166O7557
8775C293216P1225P3317P8327Q2575Q8049Q6744Q5251R5222R6889J00574J09983
8764D261372J13985J16026J21236J30798J36581J43720J49133J55915J63342J65542
8754E657650J79399J84722J94834K06754K18733K26546K40250K53309K64166K82754
8744G909117K97583L18293L39056L55251L77867M06744M25184M48755M79264N15416
8734A1872530N50680N86743O25049O65439P13109P64644Q17753Q70257R33841
8725A8400045J001657J067913J142598J222253J309762J405203J501442J599918
8717B8650791J710129J820367J941324K062799K188259K314525K439669K568240
$$ plain form
8709 45696103 48385750 51193679 54093705 57072952 60113854 63178021 66226557 69212730
8701 69212730 72075289 74750482 77171364 79273278 80975260 82217407 82953981 83166892
8693 83166892 82840680 81993441 80661485 78889027 76751415 74314841 71648869 68822330
8685 68822330 65898168 62928365 59958291 57024476 54153201 51361638 48672650 46092467
8677 46092467 43623997 41272924 39045074 36936851 34944787 33063123 31287840 29622929
8669 29622929 28060342 26589584 25207003 23906038 22691164 21549844 20477150 19466660
8661 19466660 18519925 17629170 16791286 16005750 15268417 14577279 13924368 13305441 12718117
8652 12718117 12171642 11653735 11164123 10702053 10263094 9850962 9458680 9083868 8729701
$$ packed form
8709D5696103K689647K807929K900026K979247L040902L064167L048536K986173
8701F9212730K862559K675193K420882K101914J701982J242147P36574K12911
8693H3166892l26212q47239j331956j772458k137612k436574k665972k826539
8685F8822330k924162k969803k970074k933815k871275k791563k688988k580183
8677D6092467k468470k351073k227850k108223j992064j881664j775283j664911
8669B9622929j562587j470758j382581j300965j214874j141320j072694j010490
8661A9466660r46735q90755q37884p85536p37333o91138o52911o18927n87324
8652A2718117n46475n17907m89612m62070m38959m12132l92282l74812l54167
$$ plain form
8643 8729701 8398829 8085417 7788041 7503172 7233101 6977748 6736688 6509158 6288000 6076322
8633 6076322 5879423 5689584 5508300 5338358 5177664 5019400 4874676 4733916 4596083 4468121
8623 4468121 4347938 4229261 4114064 4006780 3907489 3811526 3722437 3641871 3567415 3499981 3437868
8612 3437868 3376059 3305529 3220619 3120596 3024924 2941945 2862840 2789526 2720601 2656651 2598283
8601 2598283 2546048 2494600 2445519 2395868 2345774 2297175 2251744 2207524 2165287 2126878 2089310
8590 2089310 2055305 2024304 1986936 1951565 1919726 1894727 1872708 1853086 1836834 1815710 1799016
8579 1799016 1788446 1782307 1783850 1795991 1813558 1839933 1876879 1921319 1975833 2045605 2127521 2231240
8567 2231240 2353998 2493033 2656383 2849763 3089397 3440157 3961569 4619756 5245152 5663932
$$ packed form
8643H729701l30872l13412k97376k84869k70071k55353k41060k27530k21158k11678
8633F076322j96899j89839j81284j69942j60694j58264j44724j40760j37833j27962
8623D468121j20183j18677j15197j07284r9291r5963q9089q0566p4456o7434o2113
8612C437868o1809p0530q4910j00023r5672q2979p9105p3314o8925o3950n8368
8601B598283n2235n1448m9081m9651n0094m8599m5431m4220m2237l8409l7568
8590B089310l4005l1001l7368l5371l1839k4999k2019j9622j6252k1124j6694
8579A799016j0570o139J543J2141J7567K6375L6946M4440N4514O9772Q1916J03719
8567B231240J22758J39035J63350J93380K39634L50760N21412O58187O25396M18780
$$ plain form
8557 5663932 5704679 5173718 4316659 3577891 3056421 2694907 2442655 2257972 2120662 2023883
8547 2023883 1948185 1878414 1804747 1724057 1642784 1564523 1498408 1439375 1383125 1328471 1279843
8536 1279843 1237203 1200442 1166737 1135071 1108299 1081072 1054061 1035067 1017508 1000790 987617
8525 987617 972114 956514 945234 939491 940417 944705 944840 938007 916577 883653 852220 824526 805047
8512 805047 790479 774526 758634 740095 728567 715489 707680 700634 694834 684373 677277 668124 662519
8499 662519 657304 651066 643214 635073 631522 623938 615922 615657 613543 604680 596077 590631 586892 581615 572852
8484 572852 567885 566199 561474 552768 543654 539866 535137 529285 525595 522021 516185 513198 504505 499765
8470 499765 497779 493545 486208 480797 478084 472948 464573 460004 457699 456480 451574 449079 447410 442060
$$ packed form
8557E663932M0747n30961q57059p38768n21470l61514k52252j84683j37310r6779
8547B023883p5698o9771p3667q0690q1273p8261o6115n9033n6250n4654m8628
8536A279843m2640l6761l3705l1666k6772k7227k7011j8994j7559j6718j3173
8525I87617j5503j5600j1280n743R26M288J35o833k1430l2924l1433k7694j9479
8512H05047j4568j5953j5892j8539j1528j3078p809p046n800j0461p096r153n605
8499F62519n215o238p852q141l551p584q016k65k114q863q603n446l739n277q763
8484E72852m967j686m725q706r114l788m729n852l690l574n836k987q693m740
8470D99765j986m234p337n411k713n136q375m569k305j219m906k495j669n350
$$ plain form
8456 442060 438665 435689 430639 428796 424240 418529 416005 412937 408473 404398 403649 406943 408420 402576 399131
8441 399131 396164 393983 392286 395019 401042 398492 391467 388475 391884 387636 383154 386853 396693 407896
8427 407896 416461 420619 419686 412510 402849 395580 389024 382240 379916 375769 370534 366025 362482 360763 358802
8412 358802 355516 352219 350460 350775 353137 351633 353164 355879 360824 362424 367784 368134 366850 368371 376714
8397 376714 389292 404878 423853 444477 467270 484115 483743 463952 429958 403754 393429 390605
8385 390605 389711 390067 392022 397568 400737 393503 379563 368574 360869 354396 349855 348166 343198 337231
8371 337231 332338 329913 329155 325455 321960 321882 322323 317358 318748 322361 324978 325667 327071 329187 327617 332341
8355 332341 334760 343698 353837 361808 373115 395143 418355 434206 435318 417913 390783 367095
$$ packed form
8456D42060l395k976n050j843m556n711k524l068m464m075p49L294J477n844l445
8441C99131k967k181j697K733O023k550p025k992L409m248m482L699R840J1203
8427D07896Q565M158r33p176r661p269o556o784k324m147n235m509l543j719j961
8412C58802l286l297j759L15K362j504J531K715M945J600N360L50j284J521Q343
8397C76714J2578J5586J8975K0624K2793J6845l72j9791l3994k6204j0325k824
8385C90605q94L56J955N546L169p234j3940j0989p705o473m541j689m968n967
8371C37231m893k425p58l700l495p8M41m965J390L613K617O89J404K116j570M724
8355C32341K419Q938J0139P971J1307K2028K3212J5851J112j7405k7130k3688
$$ plain form
8343 367095 348525 335848 326785 318721 314669 316945 319333 316270 317061 317343 319818 326337 333095 338902
8329 338902 342502 346918 345351 334480 327546 318126 312683 312963 313514 314098 311554 311209 313412 319473 320815
8314 320815 322255 323972 330067 332085 333317 346256 360357 368432 375046 389091 405476 421229 441442
8301 441442 464216 491283 515405 541035 571643 605440 639185 676405 718643 765724 814222 853659
8289 853659 883196 900676 902432 882399 841380 781389 717282 657093 598866 547406 504342 467891
8277 467891 436787 414509 392247 375179 359603 342538 327678 312077 297351 288788 280115 269240
8265 269240 256782 252039 249071 244650 239800 235025 227554 224853 223829 223162 228368 231476 236881 245742
8251 245742 251184 259590 268048 279759 294744 315528 343156 370125 399951 442339 497014 565600
$$ packed form
8343C67095j8570j2677r063q064m052K276K388l063P91K82K475O519O758N807
8329C38902L600M416j567j0871o934r420n443K80N51N84k544l45K203O061J342
8314C20815J440J717O095K018J232J2939J4101Q075O614J4045J6385J5753K0213
8301D41442K2774K7067K4122K5630L0608L3797L3745L7220M2238M7081M8498L9437
8289H53659K9537J7480J756k0033m1019n9991o4107o0189n8227n1460m3064l6451
8277D67891l1104k2278k2262j7068j5576j7065j4860j5601j4726q563q673j0875
8265B69240j2458m743k968m421m850m775p471k701j024o67N206L108N405Q861
8251B45742N442Q406Q458J1711J4985K0784K7628K6969K9826M2388N4675O8586
$$ plain form
8239 565600 661706 788332 940549 1113452 1282738 1397031 1420439 1353330 1208619 1037407
8229 1037407 893789 791614 721299 671479 644097 631217 623266 607231 591768 564586 525514
8218 525514 483858 449773 425169 404621 384465 367138 353560 349318 353608 360197 372025 386766
8206 386766 407554 437181 474305 514664 557522 603624 650008 705982 769842 857329 978480
8195 978480 1147671 1375516 1664442 1995606 2339302 2603782 2697589 2623110 2357952 1998443
8185 1998443 1682630 1443327 1274836 1159080 1088178 1050390 1031306 1017744 992094 939317 858739
8174 858739 765149 685211 622497 574076 525043 482869 446569 419068 395141 376962 368616 362259
8162 362259 361235 365647 375124 381484 390987 399171 406977 422129 441978 472882 518020 581165 669837
$$ packed form
8239E65600R6106J26626J52217J72903J69286J14293K3408o7109j44711j71212
8229A037407j43618j02175p0315m9820k7382j2880p951j6035j5463k7182l9072
8218E25514m1656l4085k4604k0548k0156j7327j3578m242M290O589J1828J4741
8206C86766K0788K9627L7124M0359M2858M6102M6384N5974O3860Q7487J21151
8195I78480J69191K27845K88926L31164L43696K64480R3807p4479k65158l59509
8185A998443l15813k39303j68491j15756p0902l7788j9084j3562k5650n2777q0578
8174H58739r3590p9938o2714m8421m9033m2174l6300k7501k3927j8179q346o357
8162C62259j024M412R477O360R503Q184P806J5152J9849L0904M5138O3145Q8672
$$ plain form
8149 669837 792560 942160 1102779 1244241 1320476 1312736 1222104 1066992 908541 780316
8139 780316 682303 612469 565635 542020 530564 519717 510364 491423 458736 415735 371960 339280
8127 339280 310001 283178 260598 242665 223277 211243 199167 187149 178717 173996 169573 166635
8115 166635 163575 158705 153157 146650 140289 132998 121734 114236 112201 112859 109812 107147 104422 103244
8101 103244 103536 96363 92919 98395 98472 95205 90774 88408 92852 92439 95404 97460 95466 89743 89215 87341
8085 87341 86196 85920 85711 84973 83403 82796 82843 83147 80511 79874 79131 79213 78378 79215 76615 72911 71206 70656
8067 70656 69807 72575 73328 73674 74232 73386 75073 79083 80272 77071 79326 77739 80497 83471 85448 83091
8051 83091 82226 81910 83209 80878 76182 77502 80659 82705 80011 72709 68965 66663 66124 68865 70561
$$ packed form
8149F69837J22723J49600J60619J41462P6235p740r0632j55112j58451j28225
8139G80316r8013o9834m6834k3615j1456j0847r353j8941l2687m3001m3775l2680
8127C39280k9279k6823k2580j7933j9388j2034j2076j2018q432m721m423k938
8115A66635l060m870n548o507o361p291j1264p498k035O58l047k665k725j178
8101A03244K92p173l444N476P7l267m431k366M444m13K965K056j994n723n28j874
8085H7341j145k76k09p38j570o07M7L04k636o37p43Q2q35Q37k600l704j705n50
8067G0656q49K768P53L46N58q46J687M010J189l201K255j587K758K974J977k357
8051H3091q65l16J299k331m696J320L157K046k694p302l744k302n39K741J696
$$ plain form
8036 70561 75579 77463 75929 72247 71761 71966 70951 68891 66059 65736 61883 59666 59001 58436 59856 58924
8020 58924 57864 64822 65502 62519 58953 59748 59468 59549 57062 52989 53982 56160 58919 57962 55942 56194 60733
8003 60733 60696 59557 57932 59132 59825 61983 61970 55810 51478 56102 57027 54296 52428 48478 50059 53391
7987 53391 55451 52929 50367 50614 49303 47822 45865 44740 43527 41029 39427 42419 45246 47366 48453
7972 48453 51011 52173 49225 48228 49526 53469 55805 57207 52796 53912 55030 56104 58292 58433 57422
7957 57422 57297 56798 52401 47283 47817 49975 50974 51048 49028 46698 46981 48753 48701 48967 46664 46173 49297
7940 49297 49006 48327 46452 47699 45986 46515 43997 41919 44822 49758 49800 46687 48008 54061 60348 59989
7924 59989 58127 56479 52716 50735 49083 43566 41539 43879 42597 45764 49428 49122 47227 48733 51229
$$ packed form
8036G0561N018J884j534l682m86K05j015k060k832l23l853k217o65n65J420r32
8020E8924j060O958O80k983l566P95k80Q1k487m073R93K178K759r57k020K52M539
8003F0733l7j139j625J200O93K158j3o160m332M624R25k731j868l950J581L332
7987E3391K060k522k562K47j311j481j957j125j213k498j602K992K827K120J087
7972D8453K558J162k948r97J298L943K336J402m411J116J118J074K188J41j011
7957E7422j25m99m397n118N34K158R99P4k020k330K83J772n2K66k303m91L124
7940D9297k91o79j875J247j713N29k518k078K903M936M2l113J321O053O287l59
7924E9989j862j648l763j981j652n517k027K340j282L167L664l06j895J506K496
$$ plain form
7909 51229 47095 43256 42344 42415 43825 43725 38172 35683 38351 39207 37589 38093 36868 35963 36231 37271 39260
7892 39260 39005 38558 38691 35579 38647 42415 41171 38332 36843 37598 38119 39817 38455 37418 32519 30235
7876 30235 31112 30746 33483 39597 42123 37485 36230 32516 29776 32411 32743 31658 35489 35634 32094 30878
7860 30878 39328 39320 37073 37819 37046 35096 32864 32023 34431 34947 34628 34685 37801 39792 37235 35315 34546
7843 34546 35707 34084 35224 36977 36316 38075 42948 43319 42679 47292 46726 44183 42642 40278 43750 46930
7827 46930 43697 42213 39744 40902 39502 39142 36742 35280 39419 36880 36288 36187 37344 37481 38665 39355
7811 39355 41344 39760 45050 45823 41142 40732 43493 43680 41419 39966 36812 36808 38924 40499 44596 44226
7795 44226 42909 44263 46757 46682 47651 43719 44217 46761 50670 50414 51315 47276 42931 43439 42862 41842 44039
$$ packed form
7909E1229m134l839r12P1J410j00n553k489K668Q56j618N04j225r05K68J040J989
7892C9260k55m47J33l112L068L768j244k839j489P55N21J698j362j037m899k284
7876C0235Q77l66K737O114K526m638j255l714k740K635L32j085L831J45l540j216
7860C0878Q450qk247P46p73j950k232q41K408N16l19N7L116J991k557j920p69
7843C4546J161j623J140J753o61J759M873L71o40M613n66k543j541k364L472L180
7827D6930l233j484k469J158j400l60k400j462M139k539n92j01J157J37J184O90
7811C9355J989j584N290P73m681m10K761J87k261j453l154mK116J575M097l70
7795D4226j317J354K494p5R69l932M98K544L909k56R01m039m345N08n77j020K197
$$ plain form
7778 44039 47679 49337 46549 40710 38037 40866 41992 40652 43318 44200 43014 43403 40769 42650 46406
7763 46406 50572 53026 52882 50891 48054 49548 51288 50392 49848 49317 46887 45746 49613 51709 54760 56175
7747 56175 57258 61460 67148 67500 67790 65636 67870 68902 66102 67558 67963 68163 72843 79574 83396 86625
7731 86625 89431 86863 84216 81756 75500 75106 75750 79457 79364 74923 77274 77860 74262 72816 76122 74028
7715 74028 72008 73286 76163 76182 76432 76743 72907 79106 88522 89886 84600 79544 80538 82349 85331 87315
7699 87315 89299 92362 94020 99080 106319 110698 111396 114304 121105 125555 126755 124590 114952 104334 98461
7684 98461 91867 87747 82047 80645 79498 77779 73345 69136 70271 73679 70526 69128 66576 64449 64595
7669 64595 62234 61259 62572 63478 62268 61875 59885 55750 52201 49145 53976 54365 55315 58458 61314 65013
$$ packed form
7778D4039L640J658k788n839k673K829J126j340K666Q82j186L89k634J881L756
7763D6406M166K454j44j991k837J494J740q96n44n31k430j141L867K096L051J415
7747E6175J083M202N688L52K90k154K234J032k800J456M05K00M680O731L822L229
7731H6625K806k568k647k460o256l94O44L707r3m441K351N86l598j446L306k094
7715G4028k020J278K877J9K50L11l836O199R416J364n286n056R94J811K982J984
7699H7315J984L063J658N060P239M379O98K908O801M450J200k165r638j0618n873
7684I8461o594m120n700j402j147j719m434m209J135L408l153j398k552k127J46
7669F4595k361r75J313R06j210l93j990m135l549l056M831L89R50L143K856L699
$$ plain form
7653 65013 66214 66194 63145 58727 58771 64647 65748 65277 61243 61072 60723 62576 57387 52348 50540 49863 46562
7636 46562 43976 42128 41124 42992 42253 39141 33538 34274 33975 33486 35925 34004 30809 29248 31618 34072
7620 34072 33988 30817 29174 29896 28181 29451 26911 25644 25409 24494 23835 24550 25995 27151 24783 21184
7604 21184 21834 24795 22791 21674 20931 24043 26135 24797 22016 20407 15622 15837 20494 17044 15179
7589 15179 14362 17300 16997 16116 14839 13188 14712 16354 13345 11862 15545 15606 15445 14450 11743 11780 7933
7572 7933 9376 12768 16689 15831 11100 8905 7128 14882 18276 15835 13707 13886 14734 13503 13186 15148
7556 15148 18296 18856 14298 8577 8646 12213 17469 19921 15491 11474 8200 3802 4775 5615 5126 4222
7540 4222 6210 5299 5692 5431 6034 6779 6795 8022 8560 5818 5730 8068 13387 12866 12633 10684 8970 11851
$$ packed form
7653F5013J201k0l049m418M4N876J101m71m034j71l49J853n189n039j808o77l301
7636D6562k586j848j004J868p39l112n603P36k99m89K439j921l195j561K370K454
7620C4072q4l171j643P22j715J270k540j267k35r15o59P15J445J156k368l599
7604B1184O50K961k004j117p43L112K092j338k781j609m785K15M657l450j865
7589A5179q17K938l03q81j277j651J524J642l009j483L683O1j61r95k707L7l847
7572G933J443L392L921q58m731k195j777P754L394k441k128J79Q48j231l17J962
7556A5148L148N60m558n721O9L567N256K452m430m017l274m398R73Q40m89r04
7540D222J988r11L93k61O03P45J6J227N38k742q8K338N319n21k33j949j714K881
$$ plain form
7522 11851 14616 12661 6793 1869 2096 5748 7024 6419 5930 3562 4904 5095 4805 2391 -776 1364
7506 1364 2828 7171 9275 11076 10680 9328 5399 5769 5332 6565 10787 13214 10517 6196 6864 7967
7490 7967 10891 14358 11724 7550 6093 8693 7205 8032 8640 6527 5982 4525 3134 3990 3432 3598
7474 3598 6661 6348 7154 7273 5879 4834 4648 4149 2223 3964 157 2804 7500 8321 5353 3715
7458 3715 2061 1617 5472 6424 7033 5619 5927 5637 4467 1238 306 863 2565 876 5250 8911 8887
7441 8887 5124 -177 2827 3005 2592 1532 2068 4164 7097 6542 5215 4436 5128 8432 8168 2804 3039
7424 3039 7031 10846 10016 8895 9565 12108 9432 7688 4940 4118 5536 10639 9650 3808 2680 4709
7408 4709 7222 5610 6030 4726 2075 -1964 -2838 -904 2867 6260 6732 2199 271 -2189 -3812 2343
$$ packed form
7522A1851K765j955n868m924K27L652J276o05m89k368J342J91k90k414l167K140
7506A364J464M343K104J801l96j352l929L70m37J233M222K427k697m321O68J103
7490G967K924L467k634m174j457K600j488Q27O08k113n45j457j391Q56n58J66
7474C598L063l13Q06J19j394j045j86m99j926J741l807K647M696Q21k968j638
7458C715j654m44L855R52O09j414L08k90j170l229r32N57J702j689M374L661k4
7441H887l763n301L004J78m13j060N36K096K933n55j327p79O92L304k64n364K35
7424C039L992L815q30j121O70K543k676j744k748q22J418N103r89n842j128K029
7408D709K513j612M20j304k651m039q74J934L771L393M72m533j928k460j623O155
$$ plain form
7392 2343 2477 -2193 -1355 -796 -1797 -1352 1568 3677 2837 1914 3317 4207 3435 8353 10760 9056 8603
7375 8603 3862 -1381 -623 1677 -658 709 651 -1337 722 -674 2603 3518 320 -2849 -5292 -6017
7359 -6017 -5684 1297 3429 4028 6575 2618 5158 5062 9310 11266 5975 5773 5839 4458 5997 8715 14096
7342 14096 16480 9372 5227 8903 11441 10462 9496 7349 3354 1868 6914 6085 1464 -4106 -3236 -1730
7326 -1730 894 -1556 -4976 -5303 -3948 -2714 -4701 -4783 -6546 -7363 -4829 -2406 703 633 -837 -527 -1643
7309 -1643 900 2489 373 -1381 -147 1080 162 -28 -974 2196 858 -651 -1335 -2301 -1398 -3009
7293 -3009 -188 684 -949 -1531 -3911 -4685 -6949 -6313 -1607 957 3892 5907 6880 8081 5043 3711
7277 3711 1281 2532 5438 3068 633 4525 7355 8132 4184 2544 4294 1685 -20 1429 1583
$$ packed form
7392B343J34m670Q38N59j001M45K920K109q40r23J403Q90p72M918K407j704m53
7375H603m741n243P58K300k335J367n8j988K059j396L277R15l198l169k443p25
7359f017L33O981K132N99K547l957K540r6M248J956n291k02O6j381J539K718N381
7342A4096K384p108m145L676K538r79r66k147l995j486N046q29m621n570Q70J506
7326a730K624k450l420l27J355J234j987q2j763q17K534K423L109p0j470L10j116
7309a643K543J589k116j754J234J227r18j90r46L170j338j509o84r66R03j611
7293c009K821Q72j633n82k380p74k264O36M706K564K935K015R73J201l038j332
7277C711k430J251K906k370k435L892K830P77l948j640J750k609j705J449J54
$$ plain form
7262 1583 3035 5643 10870 9521 3745 486 -2326 -5230 -4387 -3120 -1986 -3985 -3152 -485 1879
7247 1879 4827 5033 4066 2681 640 746 693 3394 4518 3993 2341 -392 -1320 1391 1299 -355 1456
7230 1456 -1359 -1417 -766 -2745 698 5804 6918 6015 4938 5796 4191 3181 3783 5251 7789 4578
7214 4578 2309 4441 2633 1878 1724 919 -2095 -5135 -5935 -4950 -4842 -2366 1016 3468 4528 1634
7198 1634 2354 6214 2616 -1022 -44 1836 3190 1492 2445 2019 2921 666 -1744 -3292 -2494 -228
7182 -228 7 -4571 -3688 -6473 -5098 -4992 -5610 -6607 -3080 740 -2413 -5140 -5550 -5623 -1863 -1112 424
7165 424 -529 -4285 -5667 -5719 -7143 -4486 -2803 3088 10489 9970 10835 12574 11455 7712 5338 5746 10430
7148 10430 12545 11366 10940 7382 4900 6210 5068 5854 5058 1596 -267 713 -5926 -4696 -3371 -2725
$$ packed form
7262A583J452K608N227j349n776l259k812k904Q43J267J134j999Q33K667K364
7247A879K948K06r67j385k041J06n3K701J124n25j652k733r28K711r2j654J811
7230A456k815n8O51j979L443N106J114r03j077Q58j605j010O02J468K538l211
7214D578k269K132j808p55j54q05l014l040q00R85J08K476L382K452J060k894
7198A634P20L860l598l638R78J880J354j698R53m26R02k255k410j548P98K266
7182b28K35m578Q83k785J375J06o18r97L527L820l153k727m10p3L760P51J536
7165D24r53l756j382n2j424K657J683N891P401n19Q65J739j119l743k374M08M684
7148A0430K115j179m26l558k482J310j142P86p96l462j863R80o639J230J325O46
$$ plain form
7132 -2725 -1423 -1997 -5569 -3446 -3896 -1709 734 -2079 -2432 1213 3540 1567 -1987 -5101 -3183 -658
7116 -658 1171 -2338 -2921 -2395 2357 6249 3949 1046 768 -1288 -1387 2148 3673 0 -2283 -1251
7100 -1251 884 165 -1943 -2530 -3272 -4501 -1310 2746 2091 3151 5714 1655 -2878 -4682 -1060 -474
7084 -474 -5159 -7715 -4376 1117 5946 2689 2248 1910 1917 2567 4902 2177 -789 -205 -1407 1977 4557
7067 4557 3273 2346 6595 7100 2844 -3838 -2958 -2380 -5763 -2725 -484 -749 3879 3999 -1667 252
7051 252 1511 3282 1893 2343 5249 7878 4593 2227 -6347 -5440 -4487 -2983 -2132 -1738 -918 -1790 -5736
7034 -5736 -4993 -3041 -2300 -1270 506 5260 6939 2943 -1941 -4154 -2369 914 2443 6861 9580
7019 9580 8149 4653 3300 4029 5081 5464 3421 -951 -1453 -354 -4631 -6740 -1496 -2153 -1858 -2393
$$ packed form
7132b725J302n74l572K123m50K187K443k813l53L645K327j973l554l114J918K525
7116f58J829l509n83N26M752L892k300k903k78k056r9L535J525l673k283J032
7100a251K135p19k108n87p42j229L191M056o55J060K563m059m533j804L622N86
7084d74m685k556L339N493M829l257m41l38PO50K335k725k966N84j202L384K580
7067D557j284r27M249N05m256o682Q80N78l383L038K241k65M628J20n666J919
7051B52J259J771j389M50K906K629l285k366q574R07R53J504Q51L94Q20q72l946
7034e736P43J952P41J030J776M754J679l996m884k213J785L283J529M418K719
7019I580j431l496j353P29J052L83k043m372n02J099m277k109N244o57K95n35
$$ plain form
7003 -2393 -160 1061 1467 3445 5151 8066 8557 4278 517 -1982 639 3513 2452 -1984 -4355
6988 -4355 -5440 -6278 -7766 -6838 -8094 -8342 -4407 -3691 -68 950 977 -839 1370 2997 1149 -845
6972 -845 -1085 1068 2267 787 1540 -2327 383 3368 1914 -1242 -3972 -619 1180 -719 -6520 -8422
6956 -8422 -7836 -7408 -5732 -5282 -8087 -5605 -5535 -4187 -4855 -7870 -7436 -6411 -5438 552 1238 471 2708
6939 2708 9958 10120 8898 6290 458 163 910 -935 886 1148 -1599 -904 -3539 -6527 -8540 -3821
6923 -3821 -5432 -8208 -7007 -5944 -1984 -3278 -8691 -9303 -5676 -9017 -11308 -10140 -7011 -4543 -1060
6908 -1060 -3734 -5683 -6247 -1690 -3619 -4339 -6620 -5913 -3824 -3199 -6270 -2110 480 -187 -1845 3338
6892 3338 6012 6805 2791 3014 2802 1898 571 169 -1672 -2540 -2821 -1952 -3674 -5065 -6586 -5252 -5927
$$ packed form
7003b393K233J221M06J978J706K915M91m279l761k499K621K874j061m436k371
6988d355j085q38j488R28j256k48L935P16L623J018K7j816K209J627j848j994
6972h45k40K153J199j480P53l867K710K985j454l156k730L353J799j899n801j902
6956h422N86M28J676M50k805K482P0J348o68l015M34J025R73N990O86p67K237
6939B708P250J62j222k608n832k95P47j845J821K62k747O95k635k988k013M719
6923c821j611k776J201J063L960j294n413o12L627l341k291J168L129K468L483
6908a060k674j949n64M557j929p20k281P07K089O25l071M160K590o67j658N183
6892C338K674P93m014K23k12r04j327m02j841q68k81Q69j722j391j521J334o75
$$ plain form
6875 -5927 -775 -408 -5509 -6885 -5764 -993 -2481 -3351 -1396 -1450 -1400 -3883 -1877 -296 -658 1481 -5
6858 -5 -2607 -1118 2520 6665 5425 2800 854 -388 -1826 -5742 -7178 -6812 -3072 -2031 -3903 -2736
6842 -2736 -5206 -4317 -1511 2959 -956 -3977 -3383 1774 -1367 -3279 -4150 -2669 2234 805 1045 3123
6826 3123 3579 1195 -1133 -3572 -4200 -3059 -998 -2207 -4057 -380 3283 1068 -2038 -1472 -681 -2634
6810 -2634 -5079 -5400 -3634 1527 5702 3681 -336 -165 -259 -665 157 -2706 -2704 -81 -3112 -10992 -11735
6793 -11735 -8002 -215 134 -265 352 -3799 -3086 -1271 -859 1424 -1000 -1419 -791 1030 3551 2536
6777 2536 -793 -1958 -110 986 1415 -5306 -6832 -6718 -8596 -3605 -291 -1096 1069 4479 4881 3677
6761 3677 4342 3465 1162 -71 615 3114 791 1441 6331 3423 242 2382 3479 7346 7348 4647 500
$$ packed form
6875e927N152L67n101j376J121M771j488q70J955n4N0k483K006J581l62K139j486
6858ek602J489L638M145j240k625j946j242j438l916j436L66L740J041j872J167
6842b736k470Q89K806M470l915l021N94N157l141j912q71J481M903j429K40K078
6826C123M56k384k328k439o28J141K061j209j850L677L663k215l106N66P91j953
6810b634k445l21J766N161M175k021m017J71r4m06Q22k863KK623l031p880p43
6793a1735L733P787L49l99O17m151P13J815M12K283k424m19O28J821K521j015
6777B536l329j165J848J096M29o721j526J14j878M991L314q05K165L410M02j204
6761C677O65q77k303j233O86K499k323O50M890k908l181K140J097L867Kk701m147
$$ plain form
6744 500 -2696 -3343 -3132 -1678 674 1380 -2511 -2038 1775 4819 4104 2872 5213 2539 1449 -121
6728 -121 -3054 -6046 -5072 -6672 -5577 -6451 -6124 -5776 -3112 -3224 -5272 -3950 -4267 -2938 -3786 -5143 -4429
6711 -4429 -7064 -7455 -4652 -7452 -9237 -7316 -9646 -10334 -8013 -7220 -5312 -3962 -2339 -2926 -2995 -4553
6695 -4553 -7184 -7149 -8593 -7759 -9782 -7628 -4863 -5076 -6390 -8329 -6188 -2944 -901 -2188 -2638 -4003
6679 -4003 -4364 -4380 -4482 -1238 3091 1184 -6746 -11107 -6390 -3391 -1717 2106 3059 217 -596 -4222
6663 -4222 -6845 -5610 -2431 2441 2751 45 -1883 665 433 -791 -1343 -3271 -5441 -5342 -943 996
6647 996 -741 -1764 -4677 -7197 -5175 -526 729 -360 498 1154 1427 1385 -558 -5005 -4787 -974 -1514
6630 -1514 -2195 22 516 313 -62 760 -622 -1596 -2554 -4794 -6441 -6163 -7249 -6541 -3448 -3064 674
$$ packed form
6744E00l196o47K11J454K352P06l891M73L813L044p15j232K341k674j090j570
6728a21k933k992R74j600J095q74L27L48K664j12k048J322l17J329q48j357P14
6711d429k635l91K803k800j785J921k330o88K321P93J908J350J623n87o9j558
6695d553k631L5j444Q34k023K154K765k13j314j939K141L244K043j287m50j365
6679d003l61j6j02L244M329j907p930m361M717K999J674L823R53k842q13l626
6663d222k623J235L179M872L10k706j928K548k32j224n52j928k170R9M399J939
6647I96j737j023k913k520K022M649J255j089Q58O56K73m2j943m447K18L813n40
6630a514o81K217M94k03l75Q22j382r74r58k240j647K78j086P08L093L84L738
$$ plain form
6613 674 1209 -533 993 -218 -589 -66 -973 3236 1537 -696 2652 5774 3700 2020 92 -4366
6597 -4366 -4990 -5733 -6812 -6715 -5229 -6331 -7254 -5487 -4088 -1404 -3859 -4482 -3784 -6950 -11418 -13656 -10453
6580 -10453 -6455 -3235 -6704 -3925 702 478 -3668 216 1193 -2786 -3778 302 -60 -793 -2172 -1450
6564 -1450 3631 5073 5148 1025 -1042 -2117 -3749 -4628 -5671 -3744 -5217 -9340 -9999 -6835 -3306 -852
6548 -852 3261 3083 3664 5254 6411 6087 7182 7188 8706 6300 4930 2008 -2284 -2803 -97 303 -2821
6531 -2821 -3717 -4735 -3524 -1121 -3224 -4583 -2711 -1904 -4324 -4436 -6442 -3288 -5444 -5155 -455 2438
6515 2438 652 -435 -428 927 4348 3290 -41 -2036 -4864 -3880 -1648 -2419 -2652 295 1928 3001
6499 3001 -197 -4206 -3336 804 3572 2447 -751 -3368 -4540 -2224 2113 8489 12322 16704 20723
$$ packed form
6613F74N35j742J526j211l71N23r07M209j699k233L348L122k074j680j928m458
6597d366o24p43j079R7J486j102r23J767J399K684k455o23O98l166m468k238L203
6580a0453L998L220l469K779M627k24m146L884R77l979r92M080l62p33j379P22
6564a450N081J442P5m123k067j075j632q79j043J927j473m123o59L164L529K454
6548h52M113j78N81J590J157l24J095OJ518k406j370k922m292n19K706M00l124
6531b821q96j018J211K403k103j359J872Q07k420j12k006L154k156K89M700K893
6515B438j786j087PJ355L421j058l331j995k828R84K232p71k33K947J633J073
6499C001l198m009Q70M140K768j125l198k617j172K316M337O376L833M382M019
$$ plain form
6484 20723 24612 20055 19485 16061 12345 8868 4442 4327 4512 6081 4759 3557 5066 6131 3731
6469 3731 3881 8349 15210 17368 17624 15215 12230 10239 8010 8315 9749 13880 14302 15636 20625 22535
6453 22535 22547 21412 16370 11135 7106 7974 11893 11076 11366 12301 13207 14616 15255 13319 11397 10960 10450
6436 10450 10353 7774 6516 8002 10438 13715 9636 3650 974 -1372 -3902 -1545 -100 3204 7056
6421 7056 5076 1915 546 1132 3275 4396 2888 4621 5346 3592 4814 3938 3025 7067 5334 -1703
6405 -1703 -5053 -462 2643 1383 -2726 -6023 -6822 -1093 -680 -2030 -3240 -996 896 2611 3056 5785
6389 5785 8972 7226 5168 736 -1777 -322 3588 4142 4506 2462 3494 5387 4885 1866 -1495 -1415
6373 -1415 -5368 -9444 -9523 -9544 -6183 -4605 -2987 -2832 -1425 -2946 -8713 -11033 -8812 -8590 -7089 -3662
$$ packed form
6484B0723L889m557n70l424l716l477m426j15J85J569j322j202J509J065k400
6469C731J50M468O861K158K56k409k985j991k229L05J434M131M22J334M989J910
6453B2535J2j135n042n235m029Q68L919q17K90R35R06J409O39j936j922m37n10
6436A0450r7k579j258J486K436L277m079n986k676k346k530K357J445L304L852
6421G056j980l161j369N86K143J121j508J733P25j754J222q76r13M042j733p037
6405a703l350M591L105j260m109l297p99N729M13j350j210K244J892J715M45K729
6389E785L187j746k058m432k513J455L910N54L64k044J032J893n02l019l361Q0
6373a415l953m076p9k1L361J578J618J55J407j521n767k320K221K22J501L427
$$ plain form
6357 -3662 -825 -813 -7893 -9611 -8257 -8544 -6687 -1822 787 597 173 1143 1023 -589 -1324 -4888 -3026
6340 -3026 1796 2891 -535 2746 3321 1392 5673 7392 3207 1775 -2952 -6302 -8144 -7989 -9007
6325 -9007 -8259 -2515 353 262 -3681 -8071 -3887 -2306 894 -218 492 -1459 -3028 -3631 1482 2728
6309 2728 2143 -1511 -1357 1447 -55 2240 -3516 -5413 -6251 -4895 -5284 -2734 -320 -3592 -5718 -2697
6293 -2697 -7386 -6454 -5566 -5244 -6104 -1212 -3322 -6534 -4414 -1236 -1841 -665 -3086 -6086 -4394 -7007
6277 -7007 -6766 -8458 -5581 -2534 -1437 -280 -2278 -403 1211 2254 3945 3430 -1441 -6082 -10914
6262 -10914 -8282 -3488 -220 -3661 -5931 -5722 -4393 -3562 -2084 -3135 -7047 -10049 -10147 -10063 -6088 -4717
6246 -4717 -6707 -7361 -4765 -6157 -9259 -7444 -5083 -5907 -4892 -3358 -4261 -4572 -5481 -7459 -9009 -10428
$$ packed form
6357c662K837J2p080j718J354k87J857M865K609j90m24R70j20j612p35l564J862
6340c026M822J095l426L281N75j929M281J719m185j432m727l350j842J55j018
6325i007P48N744K868r1l943m390M184J581L200j112P10j951j569o03N113J246
6309B728n85l654J54K804j502K295n756j897q38J356l89K550K414l272k126L021
6293b697m689R32Q88L22q60M892k110l212K120L178o05J176k421l000J692k613
6277g007K41j692K877L047J097J157j998J875J614J043J691n15m871m641m832
6262a0914K632M794L268l441k270K09J329Q31J478j051l912l002r8Q4L975J371
6246d717j990o54K596j392l102J815K361q24J015J534r03l11r09j978j550j419
$$ plain form
6230 -10428 -7912 -7280 -8909 -7622 -9420 -5290 -2084 -2801 -7098 -7694 -7352 -7057 -6119 -1927 -1844 -3575 -4086
6213 -4086 -423 1085 -918 79 -1949 -3779 -4339 -4568 -3084 -1384 -963 -5637 -7769 -8143 -9564 -6552
6197 -6552 -5109 -953 960 3064 1425 -1401 -1776 1121 2780 6735 5385 2817 802 -2217 -797
6182 -797 2695 3851 7756 7906 6589 3870 -2965 -3843 -2850 -2805 -1347 -3792 -4114 -738 -1793 -2454 -4286
6165 -4286 -6541 -6930 -8712 -9054 -6920 -3233 -1392 -485 -3847 -4885 -5183 -6717 -6377 -6668 -7765 -10552
6149 -10552 -7154 -3617 -4367 -4172 -3668 -3700 -1405 -885 -409 -976 -1428 -235 -837 -1737 -5698 -4449 -4574 -4807
6131 -4807 -4441 -1467 -3816 -4648 -2383 -6285 -5130 -2849 -3728 -4660 -3026 -5186 -2966 -2634 -3674 -1913
6115 -1913 -192 -844 2533 2403 -3552 -7072 -5501 -5011 -6481 -4929 -719 2836 3637 3806 -1730 -478
$$ packed form
6230a0428K516O32j629J287j798M130L206p17m297n96L42K95R38M192Q3j731n11
6213d086L663J508k003R97k028j830n60k29J484J700M21m674k132l74j421L012
6197f552J443M156J913K104j639k826l75K897J659L955j350k568k015l019J420
6182g97L492J156L905J50j317k719o835q78R93M5J458k445l22L376j055o61j832
6165d286k255l89j782l42K134L687J841R07l362j038k98j534L40k91j097k787
6149a0552L398L537p50J95N04l2K295N20M76n67m52J193o02r00l961J249j25k33
6131d807L66K974k349q32K265l902J155K281q79r32J634k160K220L32j040J761
6115a913J721o52L377j30n955l520J571M90j470J552M210L555Q01J69n536J252
$$ plain form
6099 -478 2869 2982 4151 3489 2435 -1533 -3995 -5795 -657 -42 -3524 -6018 -4344 -3708 -1706 -5568
6083 -5568 -3021 1766 7740 8468 5568 5389 5867 7706 6280 2151 -1629 -3666 -5829 -3899 -2999 -3459
6067 -3459 -2201 -1371 -825 -2658 -4274 -4577 -629 -3583 -7733 -9551 -9207 -6535 -4256 -6929 -6974 -5310
6051 -5310 -2059 -2936 -4906 -3503 -1290 -1427 1827 6011 4728 722 -733 -3661 -5207 -7115 -7203 -10429
6035 -10429 -7916 -5054 -4053 -3458 -252 -922 -7790 -6175 -672 -736 -3576 -2132 -53 -4113 -4177 -2961
6019 -2961 -4736 -8948 -9977 -4702 -1269 -2424 -3606 -6151 -6359 -1755 -1550 -5203 -5901 -4988 -421 4514
6003 4514 5383 4254 2198 391 -1093 -2714 -6559 -6772 -7492 -7495 -5539 -5482 -4809 -6074 -8886 -9426 -6644
5986 -6644 -2901 -2943 -4138 -4755 -1837 -589 311 2105 4504 4004 5636 946 -1131 -3475 -4919 -1011
$$ packed form
6099d78L347J13J169o62j054l968k462j800N138O15l482k494J674O36K002l862
6083e568K547M787N974P28k900j79M78J839j426m129l780k037k163J930R00m60
6067c459J258Q30N46j833j616l03L948k954m150j818L44K672K279k673m5J664
6051e310L251q77j970J403K213j37L254M184j283m006j455k928j546j908q8l226
6035a0429K513K862J001N95L206o70o868J615N503o4k840J444K079m060o4J216
6019b961j775m212j029N275L433j155j182k545k08M604K05l653o98R13M567M935
6003D514Q69j129k056j807j484j621l845k13p20lJ956N7O73j265k812n40K782
5986f644L743m2j195o17K918J248R00J794K399n00J632m690k077k344j444L908
$$ plain form
5970 -1011 -492 -890 -4773 -3279 -3195 -4088 -2216 -3070 -5027 -1784 -1544 -1219 -968 -6822 -7573 -5992 -8044
5953 -8044 -5739 -7977 -7599 -7725 -6280 -6683 -2746 -289 1164 2413 -1515 -5199 -6299 -9771 -9074 -5141
5937 -5141 28 1561 -1924 -4699 -641 166 1205 -2151 -6228 -3025 -4463 -2353 -1204 -1770 249
5922 249 -496 43 -1226 -2890 -2557 -1616 -2456 -3374 -2413 -3539 -2265 5468 4620 666 -3152 -3034 -6390
5905 -6390 -8660 -11518 -8230 -6774 -5093 -9543 -10065 -7298 -8690 -8882 -9960 -7660 -8303 -8925 -10910 -9238
5889 -9238 -4968 -2534 -2270 -1967 -3915 -501 -1870 -5126 -4772 -4988 -6690 -8686 -8070 -5263 -4380 -4662 -5897
5872 -5897 -3731 -2763 -3001 -1799 -3332 -2146 -657 -2022 996 127 -4286 -7004 -4771 19 3059 2469
5856 2469 -259 -733 -1533 -1895 -55 4385 3127 -4813 -5617 -4566 -4978 -7804 -6564 -6113 -2174 1710
$$ packed form
5970a011N19l98l883J494Q4q93J872q54j957L243K40L25K51n854p51J581k052
5953h044K305k238L78j26J445m03L937K457J453J249l928l684j100l472O97L933
5937e141N169J533l485k775M058Q07J039l356m077L203j438K110J149n66K019
5922B49p45N39j269j664L33R41q40r18R61j126J274P733q48l954l818J18l356
5905f390k270k858L288J456J681m450n22K767j392j92j078K300o43o22j985J672
5889i238M270K434K64L03j948L414j369l256L54k16j702j996O16K807Q83k82j235
5872e897K166R68k38J202j533J186J489j365L018q69m413k718K233M790L040n90
5856B469k728m74q00l62J840M440j258p940q04J051m12k826J240M51L939L884
$$ [...]
##END NTUPLES=NMR SPECTRUM
##END=
