##TITLE=Analysis number 319047
Compound Code cc 03805
Project Code adrs
Chemist Name gavinr
##JCAMPDX= 6.0         $$ Bruker NMR JCAMP-DX V2.0
##DATA TYPE= NMR SPECTRUM
##DATA CLASS= NTUPLES
##ORIGIN= Bruker BioSpin GmbH
##OWNER= nmr
$$ XWIN-NMR		Version 3.5
$$ Fri Apr 28 10:00:46 2006 GMT Daylight Time (UT+1h)  MAYBRIDGE\nmr@NMR_250MHZ
##.OBSERVE FREQUENCY= 250.131544655141
##.OBSERVE NUCLEUS= ^1H
##.ACQUISITION MODE= SIMULTANEOUS (DQD)
##.ACQUISITION SCHEME= undefined
##.AVERAGES= 16
##.DIGITISER RES= 18
##SPECTROMETER/DATA SYSTEM= dpx250
##.PULSE SEQUENCE= zg30
##.SOLVENT NAME= CDCl3
##.SHIFT REFERENCE= (INTERNAL, CDCl3, 0, 16.4501)
##AUDIT TRAIL= $$ (NUMBER, WHEN, WHO, WHERE, WHAT)
$$ ##TITLE= Audit trail, XWIN-NMR		Version 3.5
$$ ##JCAMPDX= 5.01
$$ ##ORIGIN= Bruker BioSpin GmbH
$$ ##OWNER= nmr
$$ C:\u/data/dgb/nmr/ADRS/3290/pdata/1/auditp.txt
$$ ##AUDIT TRAIL=  $$ (NUMBER, WHEN, WHO, WHERE, WHAT)
(   1,<2006-04-28 10:00:24.67 +100>,<MAYBRIDGE\nmr>,<NMR_250MHZ>,
      <created by zg, POWCHK disabled, PULCHK disabled
       configuration hash MD5:
       84 BC 41 DB A1 6E 1D 46 DA 25 12 A5 C1 ED C5 3A
       data hash MD5: 64K
       89 D1 6C 41 F5 F1 BE F7 64 A1 39 CF 93 DE B9 CF>)
(   2,<2006-04-28 10:00:36.98 +100>,<MAYBRIDGE\nmr>,<NMR_250MHZ>,
      <Start of raw data processing
       ef LB = 0.3 FT_mod = 6 PKNL = 1 SI = 32K 
       data hash MD5: 32K
       86 6C 67 98 80 DB 6D 50 99 0D E2 7C 89 C3 A4 91>)
(   3,<2006-04-28 10:00:38.51 +100>,<MAYBRIDGE\nmr>,<NMR_250MHZ>,
      <apk 
       data hash MD5: 32K
       8D 44 C2 3E 44 3F DE F3 0A B5 28 F6 43 A8 2E 5A>)
(   4,<2006-04-28 10:00:39.38 +100>,<MAYBRIDGE\nmr>,<NMR_250MHZ>,
      <abs ABSG = 5 
       data hash MD5: 32K
       38 4E 8D ED 01 3B 07 20 DA C0 9A 1D B5 9C EE 73>)
$$ ##END=
$$ 
$$ hash MD5
$$ 7C 69 56 7F AD 79 6E 01 7A 27 EB 03 E0 DF D3 ED
##$RELAX= 
##$RELAX= 
##$RELAX= 
##$RELAX= 
##$RELAX= 
##$RELAX= 
##$RELAX= 
$$ Bruker specific parameters
$$ --------------------------
##$DU= <C:\u>
##$EXPNO= 3290
##$NAME= <ADRS>
##$PROCNO= 1
##$TYPE= <nmr>
##$USER= <dgb>
##$AMP= (0..31)
100 100 100 100 100 100 100 100 100 100 100 100 100 100 100 100 100 100 
100 100 100 100 100 100 100 100 100 100 100 100 100 100 
##$AQSEQ= 0
##$AQ_mod= 3
##$AUNM= <au_zg>
##$AUTOPOS= <10 >
##$BF1= 250.13
##$BF2= 250.13
##$BF3= 250.13
##$BF4= 250.13
##$BF5= 500.13
##$BF6= 500.13
##$BF7= 500.13
##$BF8= 500.13
##$BYTORDA= 1
##$CFDGTYP= 0
##$CFRGTYP= 5
##$CHEMSTR= <none>
##$CNST= (0..31)
1 1 145 1 1 1 1 1 1 1 1 1 1 1 1 1 1 1 1 1 1 1 1 1 1 1 1 1 1 1 1 1 
##$CPDPRG= <>
##$CPDPRG1= <>
##$CPDPRG2= <>
##$CPDPRG3= <>
##$CPDPRG4= <mlev>
##$CPDPRG5= <mlev>
##$CPDPRG6= <mlev>
##$CPDPRG7= <mlev>
##$CPDPRG8= <mlev>
##$CPDPRGB= <>
##$CPDPRGT= <>
##$D= (0..31)
0 1 0 0 0 0 0 0 0 0.06 0 0 0 0 0 0 0.0002 0 0 0 0 0 0 0 0 0 0 0 0 0 0 
0 
##$DATE= 1146214823
##$DBL= (0..7)
120 120 120 120 120 120 120 120 
##$DBP= (0..7)
150 150 150 150 150 150 150 150 
##$DBP07= 0
##$DBPNAM0= <>
##$DBPNAM1= <>
##$DBPNAM2= <>
$$ [...]
##$SUBNAM7= <"">
##$SUBNAM8= <"">
##$SUBNAM9= <"">
##$SW= 20.6930455092707
##$SWIBOX= (0..15)
0 0 3 0 0 0 0 0 0 0 0 0 0 0 0 0 
##$SW_h= 5175.983436853
##$TD= 65536
##$TD0= 1
##$TE= 295.16
##$TE2= 300
##$TE3= 300
##$TEG= 300
##$TL= (0..7)
0 120 120 120 120 120 120 120 
##$TP= (0..7)
150 150 150 150 150 150 150 150 
##$TP07= 0
##$TPNAME0= <>
##$TPNAME1= <>
##$TPNAME2= <>
##$TPNAME3= <>
##$TPNAME4= <>
##$TPNAME5= <>
##$TPNAME6= <>
##$TPNAME7= <>
##$TPOAL= (0..7)
0.5 0.5 0.5 0.5 0.5 0.5 0.5 0.5 
##$TPOFFS= (0..7)
0 0 0 0 0 0 0 0 
##$TUNHIN= 0
##$TUNHOUT= 0
##$TUNXOUT= 0
##$USERA1= <user>
##$USERA2= <user>
##$USERA3= <user>
##$USERA4= <user>
##$USERA5= <user>
##$V9= 5
##$VALIST= <valist>
##$VCLIST= <CCCCCCCCCCCCCCC>
##$VD= 0
##$VDLIST= <DDDDDDDDDDDDDDD>
##$VPLIST= <PPPPPPPPPPPPPPP>
##$VTLIST= <TTTTTTTTTTTTTTT>
##$WBST= 1024
##$WBSW= 4
##$XGAIN= (0..3)
0 0 0 0 
##$XL= 0
##$YL= 0
##$YMAX_a= 440658
##$YMIN_a= -533437
##$ZGOPTNS= <>
##$ZL1= 120
##$ZL2= 120
##$ZL3= 120
##$ZL4= 120
##$ABSF1= 16.45014
##$ABSF2= -4.243032
##$ABSG= 5
##$ABSL= 3
##$ALPHA= 0
##$AQORDER= 0
##$ASSFAC= 0
##$ASSFACI= 0
##$ASSFACX= 0
##$ASSWID= 0
##$AUNMP= <proc_1d>
##$AZFE= 0.1
##$AZFW= 0.1
##$BCFW= 0
##$BC_mod= 0
##$BYTORDP= 0
##$COROFFS= 0
##$CY= 12.5
##$DATMOD= 1
##$DC= 0
##$DFILT= <>
##$DTYPP= 0
##$F1P= 14.0000005364418
##$F2P= -0.99999901652339
##$FCOR= 0.5
##$FTSIZE= 32768
##$FT_mod= 6
##$GAMMA= 0
##$GB= 0
##$INTBC= 1
##$INTSCL= 1
##$ISEN= 128
##$LB= 0.3
##$LEV0= 0
##$LPBIN= 0
##$MAXI= 10000
##$MC2= 0
##$MEAN= 0
##$ME_mod= 0
##$MI= 0
##$NCOEF= 0
##$NC_proc= -3
##$NLEV= 6
##$NOISF1= 0
##$NOISF2= 0
##$NSP= 0
##$NTH_PI= 0
##$NZP= 0
##$OFFSET= 16.45014
##$PC= 1
##$PHC0= 172.6704
##$PHC1= 7.83548
##$PH_mod= 1
##$PKNL= yes
##$PPARMOD= 0
##$PSCAL= 4
##$PSIGN= 0
##$REVERSE= no
##$SF= 250.130017972137
##$SI= 32768
##$SIGF1= 0
##$SIGF2= 0
##$SINO= 400
##$SIOLD= 32768
##$SREGLST= <1H.CDCl3>
##$SSB= 0
##$STSI= 32768
##$STSR= 0
##$SW_p= 5175.98343685301
##$SYMM= 0
##$S_DEV= 0
##$TDeff= 65536
##$TDoff= 0
##$TI= <Analysis number 999999
Compound Code 99
Book Reference 9
Project Code 9>
##$TILT= no
##$TM1= 0
##$TM2= 0
##$TOPLEV= 0
##$USERP1= <user>
##$USERP2= <user>
##$USERP3= <user>
##$USERP4= <user>
##$USERP5= <user>
##$WDW= 1
##$XDIM= 32768
##$YMAX_p= 442917574
##$YMIN_p= -169083
$$ End of Bruker specific parameters
$$ ---------------------------------
##NTUPLES= NMR SPECTRUM
##VAR_NAME=  FREQUENCY,     SPECTRUM/REAL,   SPECTRUM/IMAG
##SYMBOL=    X,             R,               I
##VAR_TYPE=  INDEPENDENT,   DEPENDENT,       DEPENDENT
##VAR_FORM=  AFFN,          ASDF,            ASDF
##VAR_DIM=   32768,         32768,           32768
##UNITS=     HZ,            ARBITRARY UNITS, ARBITRARY UNITS
##FACTOR=    0.157963299565203, 1,           1
##FIRST=     4114.6738136915, 0,             0
##LAST=      -1061.30962316151, 0,           0
##MIN=       -1061.30962316151, -169083,     0
##MAX=       4114.6738136915, 442917574,     0
$$ Real data points
##PAGE= N=1
##DATA TABLE= (X++(R..R)), XYDATA
$$ [...]
18834B72535N0891L8446N4894K2803j5977K8711K3110k0803l1598k1411N024n044
18822D01581m0050k358j8319k407K561j0838L0047N8523Q773k6368j9251l3590
18810C48304p0250L0915O4924P56l1224l0852k3332r153J0368M2153N4914P212
18798C94735n7111j3035j828l3796m2509o130o283l581l4174m6825L6705p526
18786A78642p374M9401K2200m9776J1751K3624J5022J063J8763M1236J854l0959
18774B75447p034J5801j3058j9682k6430R455J7898K3892M927J04794J06168M9174
18762E41352M720P274m1738l9599m1629j1464M6977J9973K6978m2666k9711o045
18750D34422L3336O743K4398N9025N4552J1343K8059N5465K2321q562m0471l7538
$$ y = [272535, 323426, 361872, 416766, 439569, 423592, 452303, 475413, 454610, 423012, 401601, 406625, 401581, 361531, 359173, 340854, 338447, 341008, 330170, 360217, 418740, 427513, 401145, 381894, 348304, 278054, 308969, 373893, 374649, 343425, 312573, 289241, 280088, 290456, 332609, 387523, 394735, 337624, 324589, 322761, 288965, 246456, 240326, 234043, 230462, 196288, 149463, 186168, 178642, 171268, 220669, 242869, 193093, 204844, 228468, 243490, 244553, 263316, 304552, 306406, 275447, 268413, 284214, 271156, 251474, 225044, 234499, 252397, 276289, 281216, 386010, 492178, 541352, 546072, 553346, 511608, 472009, 430380, 418916, 465893, 485866, 512844, 470178, 440467, 434422, 467758, 474501, 498899, 557924, 612476, 623819, 651878, 707343, 729664, 721102, 680631, 643093]
18738F43093n2529q7175j02300j07201m0919N29L7613K9737J6304K6707L4541
18727C98400M8387k378j6160k8087j1073n0690j6842K340l171K1408o595o3806
18715B71733k4608k8191m0124K35J5274J6068L5721O006J447q004Q04r092P150
18702B44419K7287J4401L6942L0247P2173L9906J6703j3845l0811p2197o4937
18691C00288Q458L5335J558p530K2159k7163k0522j5767k8286k4560k209J1046
18679B52807K3128j754R628j7778J844J6285J6258o754k9788n3943m9387l7660
18667A22886m952M5237N3191n573l635n47J5482M369n746j2600r235j3936L6324
18654B21265q810J6636j2430J1816n4858j5327o147J6874N7787J2100m1365m742
$$ y = [643093, 590564, 503389, 401089, 293888, 252969, 253498, 291111, 320848, 337152, 363859, 398400, 446787, 444409, 428249, 400162, 389089, 338399, 321557, 323897, 320726, 342134, 335539, 271733, 247125, 218934, 178810, 179045, 194319, 210387, 246108, 252114, 253561, 245557, 246361, 237269, 244419, 271706, 286107, 323049, 353296, 425469, 465375, 482078, 468233, 437422, 365225, 300288, 308746, 344081, 345639, 338109, 360268, 333105, 312583, 296816, 268530, 243970, 241761, 252807, 275935, 274181, 283809, 266031, 267875, 284160, 300418, 293664, 263876, 209933, 160546, 122886, 117934, 163171, 216362, 210789, 207154, 206607, 222089, 226458, 220712, 208112, 198877, 184941, 221265, 212455, 229091, 216661, 228477, 173619, 158292, 152145, 169019, 226806, 238906, 197541, 192799]
18642A92799j1940p84j2507k869K5280m391n1254L8470M5179m3124J3014J8064
18630B05937m2711j7882j3383k1750m13P5497K1419O88l8025k2558N3884M4764
18618B45467j0563P047l0442k8388J0371j5050R430K3616M7165L5504J5350J1501
18606C21008L1116K3914N0244k574k4891l6740Q842j9567J3573K9309M7802K7838
18594D69874k742k8257L128j0629N1177j143n310K8118K7368o9253o3157j2042
18582C87132K0636P140r331k1947K3522k418L1037O1618K0340l4897R117N3710
18570E45659j60O765K7673K468J4293J1074K2818Q6011J00718Q1187Q0220R0688
18558A069414Q3957J02188R2432M9081L216j8056j7840K690j9114p9768n6306
$$ y = [192799, 180859, 180075, 167568, 164699, 189979, 185588, 134334, 172804, 217983, 174859, 187873, 205937, 163226, 145344, 131961, 110211, 109798, 185295, 206714, 207402, 169377, 146819, 200703, 245467, 234904, 241951, 211509, 183121, 193492, 178442, 187872, 211488, 258653, 294157, 309507, 321008, 352124, 376038, 426282, 423708, 398817, 362077, 370919, 351352, 364925, 394234, 442036, 469874, 467132, 438875, 442003, 431374, 482551, 481408, 476098, 504216, 531584, 462331, 399174, 387132, 407768, 414908, 405577, 383630, 407152, 404734, 435771, 497389, 517729, 482832, 491949, 545659, 545499, 552264, 579937, 582405, 596698, 607772, 630590, 716601, 817319, 898506, 978726, 1069414, 1153371, 1255559, 1347991, 1397072, 1400288, 1382232, 1364392, 1367082, 1347968, 1268200, 1211894]
18547A211894j25314j19779m4329k9934r2428o0179q665r162k9804l209J2228
18536G01319K8094K9941K4776N6986K9806m9969L0591J04517N2578M4596P8384
18525A131619R7802J76288L21667M78164N67839M93573K80465J37168M9582j85292
18515C548875j34835K25733K75391J31219L900j90065n46062p31816m32761k18326
18505A931253j18556p9421m6884j9438M8412L6161L6628M2125R8957J28740J25387
18494B183364Q1867N4163r538P0822J19916R1316J55491K09363J75699J43646
18484C276109R6620R6284P0197P453J00877J53003J60466K63065L25005M52825
18474E001904O41912J054204J689222K702746M024158M609921L560162K130934
$$ y = [1211894, 1086580, 966801, 922472, 892538, 800110, 739931, 731266, 722104, 692300, 689091, 701319, 729413, 759354, 784130, 841116, 870922, 820953, 851544, 956061, 1008639, 1053235, 1131619, 1229421, 1405709, 1727376, 2205540, 2773379, 3266952, 3547417, 3684585, 3734167, 3548875, 3414040, 3639773, 3915164, 4046383, 4050283, 3860218, 3314156, 2582340, 2149579, 1931253, 1812697, 1733276, 1686392, 1666954, 1715366, 1751527, 1788155, 1830280, 1929237, 2057977, 2183364, 2265231, 2319394, 2309856, 2380678, 2500594, 2591910, 2747401, 2956764, 3132463, 3276109, 3372729, 3469013, 3539210, 3546663, 3647540, 3800543, 3961009, 4224074, 4549079, 5001904, 5643816, 6698020, 8387242, 11089988, 15114146, 19724067, 23284229, 25415163]
18466B5415163J133924j62212j965689p04502K323524L576368K501254R30561
18458C3048391k78814k440356n013593l729754q57950J622184L612233M454317
18450C0416658L780279K629127J948516J147811L54852R36402J450356R11336
18442D3575337J20433j337246l460541l098054R9078M242791Q934834J2892761
18434F1969393J4234661J3639376J1432523O491419q4025j580782Q84597P29731
18426A07716893K98826j196554m537183j0461382j6290565j7431456j3474098
18419D4624481q371090n108376l342347k399853j810086j385944j138237r51744
18411B0116804q25660p35534n08714k00678J34082M55346N92521M08393J87107
$$ y = [25415163, 26549087, 26386875, 24421186, 23716684, 26040208, 29616576, 32117830, 33048391, 32769577, 30329221, 25315628, 21585874, 20727924, 22350108, 25962341, 30416658, 34196937, 36826064, 38774580, 39922391, 40277243, 41213645, 42664001, 43575337, 43695770, 42358524, 38897983, 35799929, 35899007, 40141798, 49076632, 61969393, 76204054, 89843430, 101275953, 107767372, 107683347, 106102565, 106987162, 107716893, 108015719, 106819165, 102281982, 91820600, 75530035, 58098579, 44624481, 36253391, 31145015, 27802668, 25402815, 23592729, 22206785, 21068548, 20116804, 19291144, 18555610, 18046896, 17846218, 17980300, 18435646, 19028167, 19436560, 19623667]
18402A9623667J33090J44783P4697L19274L06528L3937k26253o96117j221260
18393A8492346q21059k44186k58627m19956o43985j204472j696840j501302r45304
18384A0756615n66533l90030l14950k23851j42456k9100O5865K13196L97823O27944
18374A0394523R81770J642507K803938M488816N918465N358909K905529O79587
18366C5174044j153044m470193o996128n173092k937781j669937r80551n96543
18358A1196775l54795o9632L00351P75418J463262K048165K789868L282826K591009
18349B4023247Q82348n63025j487895l060131l861590k734433j541516q14371
18341A0842634l88027p1876K61505Q20410J702086K631153K579985J401131L33916
$$ y = [19623667, 19756757, 19901540, 19976237, 20295511, 20602039, 20635976, 20409723, 19713606, 18492346, 17671287, 17427101, 17168474, 16748518, 16104533, 14900061, 13203221, 11701919, 10756615, 10190082, 9800052, 9485102, 9261251, 9118795, 9089695, 9155560, 9368756, 9766579, 10394523, 11376293, 13018800, 15822738, 20311554, 26230019, 31588928, 34494457, 35174044, 34021000, 29550807, 22554679, 17381587, 14443806, 12773869, 11793318, 11196775, 10841980, 10772348, 11072699, 11848117, 13311379, 15359544, 18149412, 21432238, 24023247, 24905595, 24342570, 22854675, 19794544, 15932954, 13198521, 11657005, 10842634, 10454607, 10382731, 10644236, 11464646, 13166732, 15797885, 18377870, 19779001, 20112917]
18332B0112917m01468j835653l478077k646200j410720o39691j77960J10624L94812
18323A0028584P14024J253133K069629L476372N275761O230916N389369L257736
18315C7695524Q26162j937647n496324o549113n683253l649015k051628j199378
18307A1955328p67891m14542j73387O8745M29002J024337J914685K726750K713164
18298A9476191J645789M46283n41031j976625l525107l003790j776989r42863
18290I801858l97799O680L23074Q64971J796470K695802K365415J158882K32085
18281A8847438n16485k218983l539609k462578j393780r12601n94373k96311k19053
18272F693665j00543Q3962L17368N98659J015354J749430K311777J915166Q43477
$$ y = [20112917, 19711449, 17875796, 14397719, 11751519, 10340799, 9701108, 9523148, 9633772, 10028584, 10742608, 11995741, 14065370, 17541742, 22817503, 29048419, 34437788, 37695524, 38521686, 36584039, 31087715, 24538602, 18855349, 15206334, 13154706, 11955328, 11187437, 10772895, 10599508, 10668253, 11097255, 12121592, 14036277, 16763027, 19476191, 21121980, 21568263, 21027232, 19050607, 15525500, 12521710, 10744721, 9801858, 9404059, 9410739, 9733813, 10598784, 12395254, 15091056, 17456471, 18615353, 18847438, 18330953, 16111970, 12572361, 10109783, 8716003, 7803402, 7209029, 6912718, 6693665, 6593122, 6677084, 6994452, 7593111, 8608465, 10357895, 12669672, 14584838, 15428315]
18263A5428315j7321p70108k258484k939397j968454j164007p25646m95442l60042
18254D729414k64704k39181j98014j19492j33915j26573o1959O351m5890j03228
18244C442809r5719l5438p1506p0426r1704r8174n2975l6989o2404J8355J4491
18233B860320K5754O2384R5312Q2563j4386o8341r9890j84643k26989j86894o8917
18222B276273j07829q6452o5372p0806q0067k5640k2482j2606n2331n0442k8286
18211A673960j0376l0067m3974k3576n1422n8991m7861k0782l5109k8206J4427
18200A338023j4720j878r941j3798m397P06k1052K478N335L532K2847k2713k8950
18187A255472j6877j4214m3283n9704o0852o1668r3385m0853K843K9707K3559
$$ y = [15428315, 15410994, 14640886, 12382402, 9443005, 7474551, 6310544, 5584898, 5089456, 4729414, 4464710, 4225529, 4027515, 3908023, 3774108, 3647535, 3585576, 3591927, 3546037, 3442809, 3347090, 3311652, 3240146, 3169720, 3078016, 2979842, 2926867, 2889878, 2827474, 2845829, 2860320, 2886074, 2948458, 3043770, 3126333, 3111947, 3043606, 2943716, 2759073, 2532084, 2345190, 2276273, 2168444, 2081992, 2016620, 1945814, 1865747, 1840107, 1817625, 1805019, 1752688, 1702246, 1673960, 1663584, 1633517, 1589543, 1565967, 1514545, 1455554, 1407693, 1386911, 1351802, 1323596, 1338023, 1323303, 1321425, 1311484, 1297686, 1293289, 1293995, 1272943, 1275421, 1280756, 1284288, 1307135, 1284422, 1255472, 1238595, 1224381, 1181098, 1121394, 1060542, 998874, 905489, 864636, 867479, 897186, 920745]
18176I20745R281q830m0615n874J4639K018n68J3920k8038k1735m7866r315O78
18163G98440K2592k520l5725J5273J7692j389l2648j2820q238k6392n5027m4038
18151F35200m36j0651O079N1883J2811p3339p0536K9315O3275L4263k2208K888
18139F58544L7853O9556k34m9567K2639K447j3927K3513K7477L1551L2586L8416
18127H80854k2629q621N7888O7643N4780J9188Q6291R4921J06262J76530J89141
18116A702248K36639L69245M55833N42513Q71757J391747K182350L837853O996812
18107A8586997J0714437J0516043N624615J549714p42687o574464j3998181r520405
18099A6156069m661523k434150j454437j008043p50174n59364m62667m12288l62996
$$ y = [920745, 930026, 921196, 880581, 874707, 889346, 891364, 890796, 904716, 876678, 854943, 807077, 797762, 798440, 821032, 818512, 782787, 798060, 815752, 814363, 781715, 768895, 760657, 734265, 679238, 635200, 634764, 624113, 630192, 682075, 694886, 621547, 551011, 580326, 643601, 677864, 655656, 658544, 696397, 765953, 765719, 716152, 738791, 741238, 727311, 750824, 778301, 809852, 842438, 880854, 858225, 849604, 907492, 975135, 1029915, 1049103, 1135394, 1230315, 1336577, 1513107, 1702248, 1938887, 2308132, 2763965, 3306478, 4178235, 5569982, 7752332, 11590185, 18586997, 29301434, 39817477, 45442092, 46991806, 46249119, 39674655, 25676474, 16156069, 11494546, 9060396, 7605959, 6597916, 5847742, 5288378, 4825711, 4413423, 4050427]
18090D050427k76004j98965j55650j68780j42430j32730j46248j37614j20140
18081B571866j22302j40240r8759p5112m1914n2493n9056k1618o8805n4011n2849
18070A784707p5785o6311m7052m0499m2045r0252j7164m9825n8034m9388j4621
18059A233731j1203K5044K1948j6937o1835p6470n6845m0620k633n089l802k4673
18047I80616k7333j2576J1307j1216j2342q9121l6175p537L0729m0862n9828r078
18035G16584n7601o6102J3701J2420j1352M128J609k1713o0419J9460M1843j5524
18023E77034k5893o427J2990j0602k6888j5812j4964k1998l3921K5520J9665j4086
18011D64618n5729k8575k362j857o137p6960K5724P8331K328K1309k9033n4767
$$ y = [4050427, 3774423, 3575458, 3419808, 3251028, 3108598, 2975868, 2829620, 2692006, 2571866, 2449564, 2309324, 2210565, 2135453, 2093539, 2041046, 1981990, 1960372, 1891567, 1837556, 1784707, 1708922, 1642611, 1595559, 1555060, 1513015, 1422763, 1405599, 1355774, 1297740, 1248352, 1233731, 1222528, 1247572, 1269520, 1252583, 1190748, 1114278, 1057433, 1016813, 1014180, 1009091, 1005289, 980616, 953283, 940707, 952014, 940798, 928456, 839335, 803160, 795623, 826352, 785490, 725662, 716584, 658983, 592881, 606582, 619002, 607650, 611778, 613387, 591674, 531255, 550715, 592558, 577034, 551141, 544714, 557704, 547102, 520214, 504402, 489438, 467440, 433519, 459039, 478704, 464618, 408889, 380314, 377952, 376095, 369958, 292998, 318722, 397053, 399381, 420690, 391657, 336890]
17999C36890q862N9982n918L424k24J483j8635O2687O8250l4251K307M7068K5785
17986E39986m2033J1806J9955J1586J7178K6852K1132j3128j2865j9867j7940
17975E42662m4276l1771j9147m0747n7084j3418j6042j7158k367k5079L1809k3412
17963B83970m6170K41P998l8965j6560N0857j850m263l0092q462L7533K3218j8736
17950B38719j4887J7497K8638L2756K1729M662O633K1925N3008L3527J8502L114
17938D65823J7885L2166L2536r851n3547O588r439k5199q150l034k5085j3075
17926D07618l0326l2592n0514l8287L3674k5404m4385k6189k5836j1754M6146
17915B02151k3993l8556k5849L5872J9818n577K9291M2578j3520j7252J3321K67
$$ y = [336890, 328028, 388010, 382092, 385516, 385292, 386775, 368140, 430827, 499077, 464826, 467133, 514201, 539986, 497953, 509759, 529714, 541300, 558478, 585330, 606462, 593334, 580469, 560602, 542662, 498386, 466615, 447468, 406721, 349637, 336219, 320177, 303019, 300652, 275573, 307382, 283970, 237800, 238041, 246039, 207074, 190514, 241371, 239521, 235258, 205166, 196704, 234237, 257455, 238719, 223832, 241329, 269967, 302723, 324452, 329114, 335747, 357672, 410680, 444207, 462709, 465823, 483708, 515874, 548410, 538559, 485012, 491600, 482161, 456962, 448812, 445778, 420693, 407618, 377292, 344700, 294186, 255899, 289573, 264169, 219784, 193595, 167759, 156005, 202151, 178158, 139602, 113753, 149625, 169443, 163866, 193157, 235735, 222215, 204963, 218284, 218551]
17903B18551m5188j9955q314l0728N304K6677j4278J1927K8054K3741K8927M3028
17891B67746j3886r577j9326j6666r007J2760L8237J2018K064K5503l38p8176
17879B11352k7211K2049L4358J6603L1060j198l4275j8427M302j5145k7655l0945
17867A64868l3155l8314o281P5048o525j026J3979o063k4487J9614K1045m2147
17855A36556l328k1461j6707q606J6378L186K4164p121M915j0290K535n4891j6495
17842D8835J8689J7100J921k0137M8647K8879P215l5337o6720K6951J6252m3642
17830D8653j3316L3074K3365L8269P587K938k442R357k926l4610j8876J3307k5779
17817G8601l6428M1496j2180K863k0455J931L5895M7500J9636K8857O411L0472
$$ y = [218551, 173363, 153408, 145094, 114366, 119670, 146347, 132069, 143996, 172050, 195791, 224718, 267746, 253860, 244283, 224957, 208291, 199284, 212044, 250281, 262299, 264363, 289866, 289528, 211352, 184141, 206190, 240548, 257151, 288211, 287013, 252738, 234311, 238613, 223468, 195813, 164868, 131713, 93399, 87118, 162166, 155641, 154615, 168594, 162531, 138044, 157658, 178703, 136556, 133228, 111767, 95060, 86454, 102832, 106018, 130182, 123061, 127976, 117686, 120221, 65330, 48835, 67524, 84624, 86545, 66408, 115055, 143934, 151149, 115812, 49092, 76043, 92295, 48653, 35337, 68411, 91776, 130045, 137632, 140570, 138128, 147485, 144559, 109949, 91073, 104380, 78601, 42173, 83669, 71489, 74352, 53897, 55828, 91723, 139223, 158859, 187716, 194127, 224599]
17805B24599L5942n6226m4809K4864k1020J480j7700k7800n118J1423r489J9615
17793A35761j5201l8519n186K786l3571k9851M8450J2695j4027O593Q699l5391
17781D3238l1745J6694l31j2716K068K5995j210Q586K2439J5456N1201N250m0219
17768A04706k6415k567J9173j1256k4218k0987M6673k1676l62k3152j3342j5927
17756A0650K2164L5339J2185L956k0363J2166l1970M0818J5143m2339N257k2391
17744D0615J394k7983j220M5396J1827j8220j1297j2399K4369K7505j1647l5212
17732C3128m1751l3891K6765J1330l2939j3018O0007O4552J1106l8944m3701K2367
17720B5011j9431k4097o60j0835K7490k1511k8363n2367M127M3329p348K3580
$$ y = [224599, 260541, 204315, 159506, 184370, 163350, 164830, 147130, 119330, 114212, 125635, 116146, 135761, 120560, 82041, 76855, 79641, 46070, 16219, 64669, 77364, 63337, 69930, 78629, 43238, 11493, 28187, 27856, 15140, 17208, 43203, 41993, 50579, 73018, 88474, 139675, 144925, 104706, 78291, 75724, 94897, 83641, 59423, 38436, 85109, 63433, 63071, 39919, 26577, 10650, 32814, 68153, 80338, 84294, 63931, 76097, 44127, 84945, 100088, 57749, 63006, 40615, 42009, 14026, 12806, 58202, 70029, 51809, 40512, 28113, 52482, 79987, 68340, 33128, -8623, -42514, -15749, -4419, -37358, -50376, 9631, 74183, 85289, 46345, 2644, 25011, 5580, -18517, -19177, -30012, -2522, -24033, -52396, -104763, -100636, -57307, -64655, -41075]
17708d1075K6247k435k448k0209K8382K1761m2894j9813K134J5867l784J3682
17696b4585r28n1154J6272L6661J1493J8225m2362M099L7940M9094M3697q257
17684I0195l8436k9765l4651j917m5291j4799j4313j3895L203L7875j2709L9505
17672c4998L3860j1294L235j7799L3212j4200k0834J1063K6710j0470K1419k1914
17660b010J5551M750K436q986M203n1977l2467K0816K2853r578m413l149K2088
17647a9883J6166k8692j6629j2610L0049N443M3943N3839J3286k2787P17n702
17635E7140j6853l0267j5488j1665j7088J6642p0J1228J195k2184j3106J1485
17623b9031Q244O108R176j297L1891m5307l704O152j3320J3504J5363K210m8217
$$ y = [-41075, -14828, -17263, -19711, -39920, -11538, 10223, -32671, -52484, -50350, -34483, -38267, -24585, -25513, -76667, -60395, -23734, -12241, 5984, -36378, -32279, 5661, 54755, 98452, 90195, 51759, 21994, -12657, -14574, -59865, -74664, -88977, -102872, -99669, -61794, -74503, -34998, -1138, -12432, -9197, -26996, 6216, -7984, -28818, -17755, 8955, -1515, 19904, -2010, 13541, 18291, 20727, 11741, 15944, -36033, -68500, -47684, -24831, -34409, -38822, -41971, -19883, -3717, -32409, -49038, -61648, -31599, -26156, 17787, 71626, 84912, 62125, 62842, 57140, 40287, 10020, -5468, -17133, -34221, -17579, -17649, -6421, -5226, -27410, -40516, -29031, -20787, -14679, -5503, -6800, 25091, -20216, -23920, -17768, -31088, -17584, -2221, -11, -48228]
17610d8228j3952P0745J5052k4175k1209P057m9957m4966L1094K4339j0220J7936
17598d6484K0038p930J713K9108R537r524j4012J1324K0275J5501K149l302k0308
17585H085l3036P078j2729R43j5833j0770O910k5135j058N872L0566L1152O385
17572a570L2544P25n687j9155m7354l7678M311J8724Q685P836L717O563J1610
17559a6729j0102P111j5940r590k8736k0408j1689K1898M7519J9870J2153J0817
17547F174j403j8255P199j0596j4825N3862K104N749l833L534J1221m6941k1323
17534b7333J4449q786J8288k431j3445j265K8198k8091k0928K31J6704j2257L309
17521c3357N3031J0215k7597r215l2603m43j3209l5914k2954L3331M9438j0904
$$ y = [-48228, -62180, 8565, 23617, -558, -21767, -14710, -64667, -109633, -78539, -54200, -64420, -46484, -26446, -34376, -32663, -3555, 5982, -3542, -17554, -6230, 14045, 29546, 31695, 28393, 8085, -24951, -17873, -30602, -29659, -45492, -56262, -49352, -74487, -75545, -69673, -39107, -7955, -1570, 30974, 31699, 26012, 6857, -40497, -78175, -73864, -55140, -46455, -38619, -34902, -28339, -16729, -26831, -19720, -35660, -45250, -73986, -94394, -106083, -84185, -36666, -16796, -4643, 6174, 4771, -13484, -6285, -16881, -31706, 22156, 24260, 30009, 26176, 29710, 40931, -6010, -27333, -12884, -21670, -3382, -5813, -19258, -20523, 7675, -20416, -41344, -41113, -24409, -36666, -33357, 19674, 29889, 2292, -6923, -39526, -39969, -53178, -89092, -112046, -78715, -29277, -40181]
17509d0181l4089j3133K3987M9824M0318M1461k6276n5479J6061P928O8556O495
17497H5472l0887l0122n4610l2846q293J7280J4613K6483L7294J7864k2847l3690
17485a4289k5210L3274R339K470l3284k5943N308J6278k5746k35L3522K9845K0236
17472B5565l1044p365q112j490J840J5331j2747K1561m322k2062R954L1719Q785
17459B7613l893k4196j2932m340l1601K7938P973K0160J0659J0295K0965n138
17447D3503j0754q603l9683J921L2969L6056L2899N9686Q7187K5537p495l0406
17435B22817o3570o6517m8463l9149k7341j0414n884N1839L0125j4402n070M655
17423B8626k0889L7693M6215l359r111l7938J1597r333r594K274K1355q265J7847
$$ y = [-40181, -74270, -87403, -63416, -13592, 26726, 68187, 41911, -13568, 2493, 10421, 78977, 85472, 54585, 24463, -30147, -62993, -71286, -54006, -39393, -12910, 24384, 42248, 19401, -14289, -39499, -6225, 3114, 5584, -27700, -53643, -48335, -32057, -57803, -58038, -24516, 5329, 25565, -5479, -12844, -20956, -22446, -20606, -5275, -18022, 3539, -783, -22845, -12891, 18828, 27613, 23720, -476, -13408, -17748, -49349, -21411, -13438, 6722, 17381, 27676, 48641, 43503, 32749, 24146, -15537, -13616, 19353, 55409, 88308, 147994, 235181, 260718, 253223, 222817, 159247, 92730, 44267, 5118, -22223, -32637, -38521, 13318, 43443, 29041, 23971, 28626, 7737, 45430, 91645, 88286, 79175, 41237, 52834, 43501, 33907, 36181, 57536, 49271, 67118]
17410F7118L3648m1348m2280l3276k2390N215n764j1114j2797J7494K5767M5786
17398B6059L7868k8173l4669l7923J2122K9877m629n8121o7587k4103M9242N2339
17386d7698O8156k4472n392N7540L2611k0002l5056l7206p613L6016M5800k153
17374F0531l359l7834k312O330m4223j0544J3855l8112K4396j5587K6754r887
17362b9992L832l665l3291j5896R832J1503J4021L6428M0439j1210j5605l5103
17350b8707k300J0341k9861n779K4554j2144k9252K9972M3235m924P509J3882
17338A6526m226o240k4367m6163j4401M5825j799O0674M9733j9904l7510l7110
17326a8962Q277j2012O603K5769m994k1352k5592Q913L5050k9401j3160M0269
$$ y = [67118, 100766, 59418, 17138, -16138, -38528, -33313, -39077, -50191, -62988, -45494, -19727, 26059, 63927, 35754, 1085, -36838, -24716, 5161, 532, -57589, -125176, -149279, -100037, -47698, 20458, -4014, -9406, 48134, 80745, 60743, 25687, -11519, -19132, 16884, 62684, 60531, 57172, 19338, 17026, 23356, -20867, -31411, -17556, -55668, -31272, -46859, -20105, -29992, -26160, -29825, -63116, -79012, -69180, -57677, -43656, -7228, 33211, 22001, 6396, -28707, -31007, -20666, -50527, -56306, -31752, -43896, -73148, -43176, 59, -4865, 2644, 16526, 12300, 6060, -18307, -64470, -78871, -33046, -34845, 25829, 75562, 55658, 18148, -18962, -10685, -22697, -16094, 9675, 4681, -16671, -42263, -33350, 1700, -27701, -40861, -592]
17314e92N2460J7206k1618m1678m132R173r715J2943P815n748L6930J0792n4502
17301I334q744j970n05J3961k6336k6625j6499M3550K6609p179q876j0637J4361
17288D44k261k6760K0214j4637J8131N187m1779K8853J0579R816k9678m3162K1457
17275d3596M1295J4614k2766l862j5446N100R574N3797M3701k3106n2744L1349
17263C7910o451K656N038P592O99j441p882l0244j8888K818j2292R998J2876M6377
17249D8766J2634l2426k2649j4609j617J6694J1144r059P049M196k4868M504j6963
17236a7204j418L1671J0423J1915j3804l4507j6669o564k0033L5081J9480l3604
17224c5233l5230O795L8373K0574N060l7234k300L3253J3851l7123j6307k067
$$ y = [-592, 51868, 69074, 47456, 5778, 1646, 10819, 1104, 14047, 21862, 16114, 53044, 63836, 9334, 590, -1380, -1885, 12076, -14260, -40885, -57384, -13834, 12775, 5596, -3280, -13917, 444, -1817, -28577, -8363, -23000, -4869, 318, -41461, -12608, -2029, 7787, -21891, -65053, -43596, -2301, 12313, -10453, -14315, -29761, -24661, -15087, 38710, 82411, 59305, 6561, 37910, 31459, 34115, 39153, 46745, 47444, 46003, 38121, 7877, -11011, -8193, -20485, -10487, 2389, 48766, 61400, 28974, 6325, -8284, -9901, 6793, 17937, 8878, 15927, 20123, -4745, -241, -17204, -18622, 13049, 23472, 35387, 21583, -12924, -29593, -36157, -56190, -21109, -1629, -35233, -70463, -63668, -25295, -4721, 339, -36895, -39195, -5942, 7909, -29214, -45521, -47588]
17212d7588J197N215L9146M3701K3616L022j5333n5124R468k0078K4735M1416
17200E3393J0275l0247m0302J6009k882j2856L2157L1191j8113l7711n6694l8322
17188i4102J0663J8204L0396O7821K2447k5938j7498K2314q174n91R780N184J4273
17175E4779k1558L954j2056n7624k5319M7889j0347k7525J9554K1143N71k9359
17163c5898J5146M1242L150l6356j19r45J5123J9932K1121j8231j8666J9382K6714
17150E1595L2623K0313m1021p4284k7854o37r199k3917l2684L1275O6978j1976
17138a8788j2448m5282J9065M0845K2517o0402j3748M3298J3204J0023J7019j3198
17126B105P564L6822L0105j9148k6493L4524o424l6895k6060K1127L5333m0121
$$ y = [-47588, -46391, -41176, -2030, 41671, 65287, 68309, 52976, -2148, 7320, -12758, 11977, 53393, 63668, 33421, -6881, 9128, 6246, -6610, 25547, 56738, 38625, 914, -55780, -94102, -83439, -65235, -34839, 32982, 55429, 29491, 11993, 34307, 26133, 25542, 35322, 40506, 54779, 33221, 37175, 25119, -32505, -57824, -9935, -20282, -47807, -28253, -7110, -6539, -35898, -20752, 20490, 23640, -12716, -12835, -13780, 1343, 21275, 42396, 24165, 5499, 24881, 51595, 84218, 104531, 63510, -10774, -38628, -39265, -48464, -72381, -105065, -73790, -6812, -18788, -31236, -76518, -57453, -16608, 5909, -54493, -68241, -24943, -11739, -1716, 15303, 2105, 9669, 46491, 76596, 57448, 30955, 65479, 59055, 22160, -3900, 17227, 52560, 12439]
17114A2439k8632j8599k2666L4525K1505J8785N899K5277L8480J4702m233o2923
17102C4559o0259L3751K5353L0139m7690m1235L234K1406L6017J3961l141J0894
17090E6989K0058N3890K8240M3498N3746N4165K9414N8772J36385J75842J65702
17079H76701P6198J107O3847L5968q6360j61581j30662p1925j00636j22833j39158
17068B40666r2888j7761j5317N5067L0673m9800m7093k423l698Q833J7684Q450
17056A32393J2284Q326O135n863k5074j0644k7962j7045r162K4837m648m944J794
17043H0427l653J0884l1063q712j7165k9776o7745k3884M0563N281K5343L9577
17031B0077J5433n1660L2572L7522m0718J6054J9748p701k0698j1020j903J787
$$ y = [12439, -16193, -34792, -57458, -22933, -1428, 17357, 23256, 48533, 87013, 101715, 97482, 34559, -25700, 8051, 33404, 63543, 15853, -25382, -22148, -742, 35275, 49236, 46095, 56989, 77047, 130937, 159177, 202675, 256421, 310586, 340000, 398772, 535157, 710999, 876701, 952899, 954006, 1017853, 1053821, 967461, 805880, 675218, 603293, 502657, 379824, 240666, 147778, 130017, 114700, 169767, 200440, 150640, 103547, 101124, 97426, 106259, 123943, 132393, 144677, 153003, 159138, 153275, 128201, 117557, 89595, 72550, 63388, 88225, 83577, 78633, 80427, 76774, 87658, 56595, 47883, 30718, 942, -66803, -90687, -50124, -44843, -19500, 20077, 35510, -16150, 16422, 53944, 13226, 29280, 49028, 41327, 20629, 9609, 7706, 9493]
17019I493m6799K8073L9800o656K5135J6767m2656j6011L7026j3771k4102L048
17007I347j3058J5948n713Q955o5663l110J6444o245K4632M7567Q970n4143J6949
16994H80K3959J2482n363q528j64l0646j0337K2467k3497l0287K0918j9274l2434
16981g9824K2270N7078O065j7980l8413n157K9913L0289K1129K7606m0297l4578
16969b1899R282k5584J4162K2115k5146L311K5345L788k5166l9062J7374K7775
16957a3705k0679j4095l9757N1487L9236J2443J423J0477P947r926N3105K0401
16945I8357k4371l9113n1649o6851P707L3674L3831K6419K4059k4416k0781k1646
16933b4780k4920N228K9869J2585j7909K7595R881j9141j5981K287L5595o747
$$ y = [9493, -37306, -9233, 30567, 23911, 49046, 65813, 23157, 7146, 44172, 30401, 6299, 9347, -3711, 12237, 6524, 15479, -50184, -53294, -36850, -43095, -18463, 29104, 38074, -16069, 880, 24839, 37321, 31958, 23430, 23266, -7380, -17717, 4750, -18747, -49034, -28116, -47390, -79824, -57554, -476, 5589, -12391, -50804, -55961, -26048, 4241, 25370, 52976, 12679, -21899, -12617, -38201, -24039, -1924, -27070, -23759, 1586, 5374, -19792, -58854, -41480, -13705, -34384, -48479, -88236, -36749, 2487, 14930, 16353, 26830, 34777, 24851, 77956, 98357, 73986, 34873, -16776, -83627, -75920, -42246, -8415, 18004, 42063, 17647, -3134, -24780, -49700, -44472, -14603, -2018, -19927, 7668, 17549, -1592, -17573, -15286, 20309, 13562]
16921A3562r6858J9977L5424J3375J521J2925k7549k9713K8989Q605j3512m4694
16909g7948l3469L2218K0986J6813K6199j9280k551K7908m895j80R540j3073K0794
16896C062K0185l1379K7575K5047n0686l7861R104L4612k6711j1819O71N6850
16884A8650M7455p536l6592l569j1622m8883j5633K8242L601n1054L1432N0375
16872D866L6707J0540o8166n7876N7433J1176q415K7517K6468M2942K7744q7579
16860B3357n4515K2877M6922n290m2592j3680l0932M2502K635J5129n364j0242
16848i193p388l451J1316J7383j5300j0464Q388l581k4612L540K3693M480m5580
16835e0769l692L7194K9394K4184j5839Q222J489m0832k1235J4993k3263j2137
$$ y = [13562, -83296, -63319, -27895, -14520, -12999, -74, -27623, -57336, -28347, -19742, -33254, -77948, -111417, -79199, -58213, -41400, -15201, -34481, -37032, -9124, -14019, -14199, -4659, -17732, 3062, 23247, -8132, 19443, 44490, -6196, -44057, -34953, -341, -27052, -38871, -38200, 18650, 66105, 58569, 21977, 18408, 6786, -42097, -57730, -29488, -25887, -76941, -45509, 4866, 41573, 52113, -16053, -73929, -16496, -5320, -13735, 13782, 40250, 83192, 110936, 23357, -31158, -8281, 38641, 33351, -9241, -22921, -53853, -11351, -8716, 6413, 1049, -9193, -16581, -20032, -8716, 8667, -6633, -17097, -8709, -12290, -36902, -33362, -9669, -5189, -50769, -54461, -17267, 12127, 36311, 20472, 28694, 30183, -10649, -31884, -16891, -40154, -52291]
16823e2291Q62J2769j1041j9413j2280j1676J7059J3908P880o912J3888J5357
16811c1890p585K1082N7442K6162J0413m0609j7129j0487l0074k1694L3318M9924
16799C8873l1592p720M846L6442j8250L4233j5947j7629k0053j0433K452L1743
16787B6965l7414j9591k308k1786M0697o672j5186L3859J2797J414J2045J2540
16775C7360J0483k9540l1366K269j7843j7348J4478k1017n446K6848K5504j968
16763g586J6108l0365p2J1999k9822M296N3075j2310m3399o734R555N429J3353
16750a6473j429k5585k6888k6537O2183j6k8318l204J0007M7024k1284K0530j0557
16737b0547J322O031J6267r412m721j2705k4436m3892j0434J6936M1101j312J9344
$$ y = [-52291, -51429, -38660, -49701, -69114, -81394, -93070, -76011, -62103, -54223, -61135, -47247, -31890, -39475, -18393, 39049, 65211, 75624, 35015, 17886, 7399, -22675, -44369, -11051, 38873, 7281, -439, 4407, 40849, 22599, 56832, 40885, 23256, 3203, -7230, -4778, 26965, -10449, -30040, -32348, -54134, -13437, -20109, -35295, -1436, 11361, 12775, 24820, 37360, 47843, 18303, -13063, -10794, -28637, -45985, -31507, -52524, -57970, -31122, -5618, -7586, 8522, -21843, -21915, -9916, -39738, -35442, 17633, 5323, -38076, -44810, -35255, -29826, -16473, -17902, -43487, -70375, -96912, -34729, -34745, -63063, -66267, -56260, -9236, -30520, -9990, -20547, -19225, -13194, 3073, -6339, -11060, -23765, -48201, -92093, -102527, -85591, -44490, -45802, -26458]
16724b6458K369K9606R472o695K256q25L2127o5724r3699l553N855O9441O7379
16711B1551p560P424j3115k8150M4720O2042p065j0703o6466k213k3814j5754
16699c9103n117N459P57j7605M8506M6815j4047o6380m7480K414J3131M8975L1431
16686G756l9089Q067n595K787j9219k2091M3544N9283o4951l5348j5096K1130
16674e8822K9633K1730j6058K3749m0331m4560K7204K0393l0912M302O543j5331
16662g2460j6544M2505L2925j2163J0363n0177l9531O3016M3906P261J1748n5481
16650c4632J9112M5676K1979j7381l9006l5280O234M1827J2695l269j6070J1850
16638A3735K8166k8446J0324L302j0289J0399Q78M860o54k3398m7003L1786J188
$$ y = [-26458, -24089, 5517, 14989, 8294, 10550, 9725, 41852, -23872, -117571, -121124, -115269, -45828, 21551, 13991, 21415, 8300, -19850, 24870, 86912, 79847, 69144, 2678, 465, -23349, -39103, -44220, -38761, -38004, -55609, -7103, 39712, 25665, -40715, -88195, -85781, -72650, -23675, 7756, -31333, -23266, -28861, -26074, -45293, -67384, -23840, 35443, -29508, -64856, -79952, -58822, -29189, -7459, -23517, 232, -40099, -84659, -57455, -37062, -67974, -63672, -57129, -72460, -89004, -46499, -13574, -25737, -15374, -65551, -105082, -42066, 1840, 9101, 20849, -34632, -15520, 30156, 52135, 34754, -4252, -39532, -33298, 8529, 21224, 17955, 1885, 13735, 41901, 13455, 23779, 27081, 16792, 27191, 28069, 32929, 32275, 8877, -38126, -6340, -5152]
16625e152J0281l0086P77l201l4143j2230L2517J6222J5436K991j1420L8711J0559
16612C1262l2130j8607J9629J5999j0103j612k8293K1979m2943k3419L4658L6440
16600B860K3261j1073l8804k4908j1748j591L0733J2715j0837K7259K8224m1595
16588a5504K729K6926J4181j3538n0399o21k4947k8101J9917K8605M3280J4856
16576A7384k9964p91l951l0842J3491R239m4350J0194K2635L6416K3824R09j0654
16563A3540n3874l7499L6469N3378N74J1689J3385l1252p756k5955k2408j4433
16551f4142k619L7306O0051k5852p5246l4767J2976K3174l322L3398K0891k718
16539b0870m892k7981k216M216K1503K2470O206l9718k1082L8980L3447L0553
$$ y = [-5152, 5129, -24957, -24180, -27381, -61524, -73754, -41237, -25015, -9579, -6588, -18008, 20703, 31262, -868, -19475, 154, 16153, 6050, 4438, -23855, -1876, -44819, -68238, -33580, 2860, 26121, 15048, -23756, -48664, -60412, -62003, -31270, -18555, -29392, -2133, 26091, -15504, -12775, 14151, 28332, 14794, -35605, -36226, -61173, -89274, -69357, -40752, 2528, 17384, -12580, -13371, -17322, -48164, -34673, -25434, -69784, -59590, -36955, -539, 23285, 24194, 13540, -40334, -77833, -41364, 12014, 12588, 24277, 37662, 6410, -1346, -27301, -49709, -64142, -66761, -29455, 30596, 4744, -70502, -105269, -92293, -69119, -72441, -39043, -18152, -20870, -25762, -53743, -55959, -51743, -30240, -7770, -1564, -41282, -62364, -23384, 10063, 40616]
16527D0616p189k4384K9638J6779M266o3688m8753M4724J0558n483r547L8387
16515B5924j710k6000j5972p928J1901m970l967j9425k8163K0644m275L378M417
16502d6146p813L0519M1889J4587m1126l9816k4871j0140K2364L8149M0794m3030
16490b4640p250L4338j7727k5755K1058j483o637P7473k4n1400k4334p319n716
16477c9416j9776j1575K0634r18j5750Q382l6264R187N9800K332k4862R04N8415
16464A1093K4069m316m6108k0478J2912N402l0527j8863N8119N6100k1087l0950
16452d634J6298K1510j1388J7936M1801K5920k0022n8851m1038O681J9075M131
16440A7419k4119k2134l618K1920K9560j1097j8164J1057k4869j7883j7604Q790
$$ y = [40616, 33427, 9043, 38681, 55460, 59726, -3962, -52715, -7991, 2567, -2916, -12463, 25924, 24214, -1786, -17758, -25686, -13785, -18755, -22722, -42147, -70310, -49666, -53941, -50563, -46146, -53959, -23440, 18449, 33036, -8090, -47906, -72777, -82917, -60553, -22404, 18390, -24640, -31890, 2448, -15279, -41034, -19976, -21459, -28096, 49377, 49353, -2047, -26381, -33700, -39416, -59192, -70767, -50133, -51051, -66801, -58419, -94683, -85496, -25696, -23364, -48226, -47322, 11093, 35162, 30846, -15262, -35740, -22828, -17426, -47953, -66816, -8697, 47403, 26316, -4634, 11664, 33174, 21786, 39722, 81523, 107443, 87421, 28570, -12468, -5787, 13288, 17419, -6700, -28834, -32452, -10532, 19028, 7931, -10233, 824, -24045, -41928, -59532, -50742]
16428e0742K3898L2252K769j9819K4585K1818j718l7636l3289M324K5363J5746
16416G551q045k7796l3328j3049j1745M8048J7892k6091n837m975R287M3194Q00
16403d094m5142l900K8215K3891K1635k113l4477j1297l2508P223j1489q660L2788
16390c9928j1050L602j0226k0924k3720l61j6935K8778N7835j2429j7810j6148
16378g9316J5039J8170o42J6062j7475J222j38J4205j9624J1018K2246m0219J9108
16365d0344N7807K3678k733q2346l6081J9029K9671M0775R075K564j3819R66j953
16352F289n0778k012Q278L637J0491Q391k2818r917n987N1305p611M342J3455
16339G065P406M138n7473K387N964k0976j2528N5878j971j4259k3143K0314L9420
$$ y = [-50742, -26844, 5408, 8177, -11642, 12943, 34761, 33043, -4593, -37882, -33558, -8195, 7551, -494, -28290, -61618, -74667, -86412, -38364, -20472, -46563, -52400, -57375, -48088, -4894, -4094, -49236, -53136, -24921, -1030, 20605, 18492, -15985, -27282, -59790, -52567, -64056, -72716, -39928, -50978, -47376, -57602, -78526, -102246, -102607, -119542, -90764, -32929, -45358, -63168, -79316, -64277, -46107, -46749, -30687, -48162, -46940, -47078, -32873, -52497, -41479, -19233, -59452, -40344, 17463, 41141, 38408, -43938, -80019, -60990, -31319, 9456, 18531, 21095, 7276, 8242, 6289, -44489, -46501, -38223, -34586, -24095, -15704, -38522, -48439, -54426, -3121, -10732, -6390, 7065, 14471, 18609, -38864, -36477, -30513, -51489, -64017, -8139, -10110, -24369, -47512, -27198, 12222]
16326A2222L2322m9125l3860J8227J2367q915J880p139J9439o027o114Q366J0083
16313C726J6160p033L0715n1734p0575J1590L2726K1232J1973k2392j9036m2858
16301h5506k7381L291O6103K2317M277j1312M5J307l7811l242K5042M5216K378
16288D724K0586J0598l8254L721K2791j424j1803m7919o0863J3366L0354K5310
16276b8813J3284n780j1526O442K0583J9287k6351J5329m985N25k9447k8366j3462
16263g3280J7298K9143j7706l6729P379O5160L4907j7823m7225j1967j1331k8384
16251i0558L0653L4524J2907K0905k4685k8096O927J3701J0617l84j9083J7953
16239a4619J741O952l4480n235r822j3439M0527l4026j2002J7061R571L514O40
$$ y = [12222, 44544, -4581, -38441, -20214, -7847, -16762, -14882, -22021, -2582, -8609, -14723, -6357, 3726, 19886, 12853, 43568, -8166, -78741, -67151, -34425, -13193, -1220, -23612, -42648, -85506, -112887, -109596, -43493, -21176, -16899, -28211, -28166, -26859, -64670, -67912, -42870, 2346, 4724, 25310, 35908, -2346, 1375, 24166, 22742, 10939, -36980, -97843, -84477, -54123, -28813, -15529, -21309, -32835, -26393, -5810, 13477, -12874, 2455, -2530, -2005, -31452, -59818, -73280, -55982, -26839, -44545, -81274, -73895, -8735, 26172, 8349, -38876, -50843, -62174, -90558, -59905, -25381, -12474, 8431, -16254, -44350, -37423, -23722, -13105, -13489, -32572, -14619, -12878, -5926, -40406, -45641, -55463, -68902, -28375, -62401, -74403, -57342, -47771, -44257, -43617]
16226d3617l433P55q958l4117k352J619L8240M1079j2667j7053k4500J8252M0057
16213f695J5808J7510O896k7183J5711J8466j6635j3459P481K8369j8896J6441
16201D3814J4304k6773j6313K537j0481p866J8920K6578o767m047m0918O748R057
16188H793K0547k9081j944M1156n518k5706j368o2768o45L2324M2125k49l1530
16175a3864M853K7343n228n090j7866J1451K2213k8831l1766J3383j5896k852
16163d2150L229M4605J1798K8134N054l4516k3527k6043j9648M0201J3548j3467
16151a2782j8192L1343n299k8628l671l6321J3332K9230J1774q983J5691J0463
16139b043m3696j5303j2917l837j3222j4422K2772M0772N9592L0544j0674N475
$$ y = [-43617, -47050, -46295, -55253, -89370, -91722, -90103, -51863, -10784, -23451, -40504, -65004, -46752, -6695, 9113, 26623, 33519, 6336, 22047, 40513, 23878, 10419, 17900, 46269, 27373, 43814, 58118, 31345, 15032, 17569, 7088, -778, 18142, 44720, 37953, 33906, -7012, -264, 8793, 29340, 259, -1685, 39471, 33953, 8247, 6879, -55889, -56534, -24210, 17915, 17666, -13864, -9011, 18332, 13104, 8014, -9852, 1599, 23812, -5019, -36785, -23402, -39298, -42150, -38921, 5684, 17482, 45616, 50670, 16154, -7373, -33416, -53064, -12863, 685, -12782, -30974, 369, -4930, -33558, -37229, -73550, -60218, -30988, -19214, -28197, -12506, -2043, -45739, -61042, -73959, -77796, -91018, -105440, -82668, -41896, 17696, 48240, 37566, 43041]
16127D3041J7453P526P512k3767J8169J5487j9692j7166M8596j2911l7186M645
16115E1707l5706l2811k3672r382j4769J7284M3630M5757l3525k0201J3422k0950
16103a9216k9790n2815l0374M1350K6872L874O757j6326k3304O732L5245L0954
16091b0041N6946k8478j6249N5584J5956l6142j2720j112l8309J0414r42J0986
16079d107J4321k2584J7418K7602j8865m213k3911L3503P165j1889j0139l3905
16067b9604O205r560k4301j4596L5489j978O436Q750K1572r272k9817k3932j8423
16054h3031L2945K8234o367k2911J3417j2911l9712K0893N635M622J9139M2942
16042B895Q904m3242o777L9212L0140j6054j1030K1314j8441j7739O530k6402
$$ y = [43041, 60494, 68020, 75532, 51765, 69934, 85421, 65729, 48563, 97159, 84248, 47062, 51707, 16001, -16810, -40482, -49864, -64633, -47349, -3719, 42038, 8513, -11688, 1734, -19216, -49006, -101821, -132195, -90845, -63973, -60099, -53342, -69668, -92972, -86240, -50995, -20041, 36905, 8427, -7822, 47762, 63718, 27576, 14856, 13744, -24565, -14151, -15093, -4107, 10214, -12370, 5048, 32650, 13785, 9572, -14339, 19164, 26329, 14440, 4301, -29604, -23399, -32959, -57260, -71856, -36367, -38345, -31909, -23159, -1587, -10859, -40676, -64608, -83031, -50086, -21852, -28219, -51130, -37713, -50624, -90336, -69443, -63808, -59186, -40047, 2895, 11799, -31443, -38220, 992, 31132, 15078, 4048, 25362, 6921, -10818, -4288, -30690]
16030c0690M802l2176k5498L5941M3319N13l9666k1080M4093O1362k1951l7833
16018a8864m386K5054J559k060j0172L506l835j1086L0457L1755K2232k5419k4095
16005A4646o226k9324l3127J3941M7954n845m005P189m2656k6534k6999R808Q315
15992g2863K7594M2455L3518k757l0592j2802J4188o272J2191k2839l7357m199
15980e9735L4077j8825j846P1926L1704j373k472k176K5358l4536k2418r322j323
15967I039r890R966L995J9059n014l0586J221P74L4798q329l7148Q102Q670R236
15953A3893m0728j5487j4870J8281K7215K4501L4813l2425m9207l0672k3241K5193
15941f2734Q269K3353M7365L1939J936m7608j8705o895l705K9629M352J815j4617
$$ y = [-30690, -25888, -58064, -83562, -47621, -4302, -3789, -43455, -64535, -20442, 40920, 18969, -18864, -23250, 1804, 3363, 1303, -8869, -5363, -9198, -20284, 10173, 41928, 64160, 38741, 14646, 8420, -20904, -54031, -40090, 7864, 2019, -1986, 5203, -37453, -63987, -90986, -81178, -72863, -45269, -2814, 30704, 27947, -2645, -15447, -1259, -7531, 4660, -18179, -55536, -59735, -25658, -44483, -46329, 25597, 57301, 55928, 53456, 51280, 76638, 42102, 19684, 10362, 9039, -851, 9115, 13110, 32169, 27155, -3431, -2210, -1436, 33362, 25033, -12115, -4013, 4657, 13893, -26835, -42322, -57192, -38911, -11696, 12805, 47618, 15193, -34014, -64686, -87927, -62734, -54465, -31112, 16253, 48192, 50128, 2520, -16185, -23080, -26785, 2844, 7196, 9011, -5606]
15928e606j3687K6234j5805N3589R722k719j8787n2429l3568K972Q190N7997j4396
15915A707m4553J5441J0902M1878J0610j1772k4933m443K0455K5390M484K967
15903D8133l3880O421k2776j1468L0194M4621l983j1682K3311l2979k4432j1767
15891b87K2408K919N456q537k459O634J2311n1182j3810N8459R061l1872l6225
15878b7124j5298L0375M817q100L469n4349K157O6665O3477N276l6951o01K3899
15865E7712O290j8807n1836M778j1341O416M9413l0516o0342p5m916J7636P4419
15852C8831l7941j8332M0082j9365k4650j207j1052L4845M2856l6140l1691p923
15840c1687M2672M0401L5769J7237J9669j5775k5082l8596j3727p777O35q334
$$ y = [-5606, -19293, 6941, -8864, 44725, 54447, 51728, 32941, -19488, -53056, -50084, -41894, 16103, 1707, -42846, -27405, -16503, 25375, 35985, 24213, -720, -5163, 15292, 40682, 45166, 48133, 14253, 20674, -2102, -13570, 16624, 61245, 57262, 45580, 68891, 35912, 11480, -287, 22121, 25040, 30496, 21959, 19500, 26134, 38445, -12737, -26547, 31912, 40973, 9101, -27124, -42422, -12047, -7230, -15330, -11861, -66210, -64053, 2612, 66089, 71365, 34414, 33813, 57712, 64002, 45195, -6641, -1863, -13204, -6788, 42625, 12109, -48233, -48308, -53224, -35588, 38831, 890, -17442, 22640, 3275, -21375, -22582, -33634, 1211, 44067, 7927, -23764, -31687, 10985, 51386, 87155, 104392, 124061, 108286, 83204, 44608, 30881, 23104, 23739, 15405]
15828A5405L1142j587j4405m0680k7538q13K1103J678J3003L2648p076M8505Q729
15815H0114n4121l6984K6350L499K5911l6630m5421j7165r122l0607J9466M8860
15803b5850l5941q872Q482J2710K9689O0444N078m6284j1630l1104N374J5828
15791b2076M1748J0583j3890J0582k0338k7378K7911L1287J0041r49K4446j7058
15779E4909l3182j2273N3502N1363k986P090P4442K5924k0350j1854r420m6802
15767A30363n2148l7844k0953o900n724m413R909J5435O206k0128o313k9195K4524
15754B819J5089K1604q650k1251M971n734l2559n7644L1969K3300J9508J6686
15742A0108J0330k2616j0685n1327l6545M0301O0158M3599j3832l9462P954m425
$$ y = [15405, 46547, 44960, 30555, -10125, -37663, -38476, -17373, -15695, -2692, 29956, 22880, 71385, 80114, 25993, -10991, 15359, 18858, 44769, 8139, -37282, -54447, -63569, -94176, -74710, -25850, -61791, -70663, -62181, -49471, -19782, 40662, 45740, -544, -12174, -43278, -37904, -22076, 19672, 30255, 16365, 26947, 6609, -20769, 7142, 38429, 48470, 47521, 71967, 54909, 21727, 9454, 62956, 114319, 111333, 118423, 192865, 218789, 198439, 186585, 177165, 130363, 78215, 40371, 19418, 12518, 6794, 2381, 12290, 27725, 33931, 13803, 7490, -21705, 2819, 17908, 39512, 30862, 9611, 14582, 8848, -23711, -81355, -49386, -26086, -6578, 10108, 20438, -2178, -12863, -64190, -100735, -60434, -276, 43323, 29491, -9971, -2017, -6442]
15730f442K7620k3670K184m7128m4409r563K2964M8080M423J784J1954L7205j8357
15717F645l6093j244J816k3851r659J7453K4311L3618J7688j633J3610k0692j4239
15704G730j8006J5659r552J8784J0947k540J1958L6488J58m3794k3145j2151Q578
15691A114K6518q606j83L6804n9615j3372K3787L9561n548r431l1198J3779K5271
15678C8881n838k9433K8386n010n9057l8808n9822L0806N2994o208j965O7553
15666A2479k0405m429K2071m5488l4021K1260M5984l1243J8427R010k6985J9139
15654a4201k3309M737K9448N259J4640J0503J733l8815m377Q423J6561J6336l0887
15641c949M486O817p2672j638K9452k20J1220M1304R217j2972N974K3895K5871
$$ y = [-6442, 21178, -2492, -308, -47436, -91845, -101408, -78444, -30364, -25941, -24157, -12203, 25002, 6645, -29448, -30692, -28876, -52727, -62386, -44933, -20622, 12996, 30684, 29051, 42661, 21969, 7730, -10276, 5383, -4169, 14615, 25562, 23022, 34980, 71468, 71626, 27832, 4687, -7464, 1114, 27632, 19026, 18843, 55647, -3968, -17340, 6447, 46008, 40460, 31029, -169, 13610, 38881, 33043, 3610, 31996, 26986, -32071, -70879, -130701, -99895, -46901, -53109, -55074, 12479, -7926, -12355, 9716, -35772, -69793, -48533, -2549, -33792, -15365, -6355, -33340, -14201, -37510, -32773, -3325, 1934, 16574, 27077, 28810, -10005, -14382, -5959, 10602, 26938, -3949, 537, 7354, -65318, -66956, -37504, -37724, -26504, 14800, 24017, 11045, 17019, 40914, 66785]
15628F6785j6288n2813M17l04m120n380l497l6343j9592K50Q596M3307L2077q747
15614D348l6205L8393O325K4629K0349J0378R03j2694k1721j7604M586J6123K127
15601C9937L2144L1892o1736n3203J9246M3259J8297P921k8974j9029K3625L6160
15589H9539P435k2779J969K9558j8532o6763k867j016j3483J3610M6802j4118
15577D9355p228J3147K331m1146n2357j5344K0414J329k4902M3806J7933N93j7715
15564i784k3986J161O708O633K3309j3465J4007q595L662J5036J3265o00k4794
15551B557J5238j5709L8695P25m1813k5730J333M28J0299N9161K7215l3821n7044
15538a8466j7145K8830M1256o242J428m8396k4275K7537L4481L8164J1194m0211
$$ y = [66785, 50497, -2316, -1899, -2203, -6323, -11703, -15200, -51543, -71135, -70885, -62289, -18982, 13095, 4348, -31857, 6536, 12861, 37490, 57839, 68217, 69120, 56426, 34705, 17101, 21687, 37810, 39937, 72081, 103973, 42237, -10966, 8280, 51539, 69836, 77757, 48783, 29754, 53379, 89539, 96974, 74195, 76164, 105722, 87190, 20427, 17560, 16544, 3061, 16671, 63473, 49355, 42127, 55274, 57605, 16459, -35898, -51242, -30828, -29499, -54401, -10595, 7338, 7931, -9784, -33770, -32609, -25901, -19268, 4041, -9424, 4583, -4012, -350, 14686, 27951, 27351, 2557, 17795, 2086, 40781, 41506, -307, -26037, -24704, -24276, -13977, 45184, 72399, 38578, -18466, -35611, -6781, 34475, 28233, 29661, -18735, -43010, -15473, 19008, 57172, 68366, 28155]
15526B8155m2715L596L2318m905l6736l6308J6787M7516L3414k6735J679q432
15514G634q35j1296n2898K3896K8431k2815j598J7156K9698k4539o2327J6446
15502e3047K3501K0269k8580l7662j6288M0850L7706j6484l8606L009L4085l687
15490c4934o588R531k660k3512K6676L5966K5396J5951o311r301N288l1712o6045
15477f2255J8189P6903K1291l7527m966j5463J3886J5926j8182j9699k2513M2295
15465G885L4031k0844m2883r862k161k2931L456J1134K1046L5264K543j6595p624
15452g541M313J2392j8265k2653p256J2284L6654j8039O233J5899K0042J1743
15440D5806p761o660m295k8066L7497K2254j3637k7687l6229k2247N989M3065
$$ y = [28155, -14560, -10964, 21354, 16449, -20287, -56595, -39808, 7708, 41122, 14387, 16066, 7634, 6799, -4497, -57395, -33499, -5068, -27883, -29481, -12325, 17373, -7166, -69493, -53047, -29546, -9277, -37857, -75519, -91807, -50957, -13251, -29735, -68341, -65332, -31247, -34934, -41522, -31991, -34651, -58163, -31487, 4479, 29875, 45826, 39515, 30214, 35502, 3790, -62255, -44066, 32837, 54128, 16601, 11635, -3828, 10058, 25984, 7802, -11897, -34410, 7885, 41916, 21072, -21811, -31673, -33834, -56765, -53309, -42175, -21129, 14135, 16678, 83, -7541, -3228, 9164, -9101, -31754, -39010, -26726, 9928, -8111, -1878, 14021, 34063, 45806, 38045, 31385, 27090, -976, 36521, 58775, 45138, 17451, -18778, -41025, -35036, 8029]
15428H029R995j6789J9580j6312J2198K6252Q663R006J73j4079n8369J5105Q618
15415A2070L1290m3672l1651o849r510J1219K7203J3838l73N157K6348J3035m1724
15402F381k2149M953j8503k2299j8606M7198J9874M8843Q868k0406m0382k1671
15390b7899J1709N3741J1652n7829l340L7369K0N970J2177J3669r317j2363k6677
15377H882n201M175l2604O304k475q779M2112k9405k5200J6622N6037M5760j1684
15364F4544r049j4050j7213K2118l9773n1809J4322M6379k6996l3696K1182O288
15352a7753N7959L2992m9489j4346N178p579j1290o917J7702j1954J3884J4288
15340B2675K974j7906J502L619k6621L814l564k4390j486P788j2456J3274q414
$$ y = [8029, 18024, 1235, 20815, 4503, 16701, 42953, 51616, 60622, 60795, 46716, -11653, 3452, 12070, 43360, -312, -31963, -38812, -48322, -37103, -9900, 3938, 3565, 8722, 35070, 48105, 6381, -15768, -10815, -29318, -51617, -70223, -23025, -3151, 45692, 54560, 34154, -6228, -27899, -16190, 37551, 49203, -8626, -11966, 25403, 25423, 31393, 43570, 57239, 47922, 35559, 8882, 3681, 7856, -24748, -18444, -20919, -29698, 12414, -16991, -42191, -25569, 30468, 76228, 64544, 55495, 41445, 24232, 46350, 6577, -45232, -30910, 15469, -11527, -45223, -24041, -17753, 40206, 73198, 23709, 9363, 14541, 6962, -4328, -11245, 6457, -5497, 8387, 22675, 25649, 7743, 9245, 12864, -13757, -9943, -13507, -37897, -39383, -31595, -44051, -30777, -39191]
15327c9191Q464L1563k3833L8888R2105j7764O590m2204j093J8431l5060n5611
15315a8715k7231K358j2072M836r400j2946K2438k4906N410J7370m73J0677K5459
15302a7195J3902j7908n8747k2959L0780K6437K0449J7963j3795j6196n267P947
15290c4589J7269k3327j0589N858j9259K5514L8981r821k8643j87L392J9670K0898
15277E167j0595j1973J2734K51j8618O121J9496l1174j5323L445k183j4012J1589
15264d5075N1663J7182m8439L136N7517j9708m8430K1813R214O338j7535j1010
15252b3334M4507p447k8111l1397j7666k0289k4446n531K1289K9061M5647j1706
15240b9423Q577R2327J0136k5828l3672l0330M7037J0532m2337m3417L2954J2607
$$ y = [-39191, -30727, 836, -22997, 15891, 107996, 90232, 96822, 54618, 53525, 71956, 36896, -18715, -45946, -43588, -55660, -50824, -60224, -73170, -50732, -75638, -70228, -52858, -53331, -42654, -17195, -3293, -21201, -79948, -102907, -72127, -45690, -25241, -7278, -21073, -37269, -42536, -34589, -17320, -40647, -51236, -45378, -64637, -39123, -142, -9963, -38606, -38793, -35401, -15731, 5167, -5428, -17401, -4667, -4416, -23034, -16913, 2583, -28591, -43914, -40469, -42652, -56664, -45075, 6588, 23770, -24669, -21533, 35984, 16276, -32154, -10341, -1127, 5211, -12324, -23334, 21173, 13726, -14385, -45782, -63448, -83737, -108183, -113714, -92425, -63364, -17717, -29423, -20846, 71481, 81617, 55789, 22117, -8213, 38824, 49356, 7019, -36398, -3444, 9163]
15228I163k6481L4707P4043k0887k8397k2807m9014j1286L5256M5114K9513k1442
15216D7482j0534L5144k1903m1861j5819j1467l851m0999P15P936j9583j950J7773
15203e8917l530j964J4074P5894J1338p7390l8285J1424O4106j0089j9205M7658
15191A5114J5848m6593k5322K76R64j1947o170L0793K199K1533J3627o524k4337
15178b0539j8191l4207O12k1188o286P6294L5964k7251j6404j9370Q880J7735
15166b3951P450N261K3071j7917j1268L2739P008K1026O109j5139N019l5163j7064
15153a2819k2257K0060j9998J6667K0608j4331p407n795r034K2752J6194r045
15141d405o450J3309k9201R885J2245L823n3539M431J8730K2752L1019j6347l1503
$$ y = [9163, -17318, 17389, 91432, 70545, 42148, 19341, -29673, -40959, -5703, 39411, 68924, 47482, 36948, 72092, 50189, 8328, -7491, -18958, -22809, -63808, -63093, -55157, -74740, -76690, -58917, -62447, -64411, -50337, 25557, 36895, -40495, -78780, -67356, -3250, -13339, -32544, 15114, 30962, -15631, -40953, -40677, -39713, -51660, -57830, -27037, -24838, -3305, 10322, 3798, -20539, -38730, -72937, -72325, -93513, -99799, -23505, 12459, -14792, -31196, -50566, -41686, -23951, -16501, -11240, 11831, -6086, -17354, 15385, 22393, 43419, 49528, 34389, 39408, 4245, -12819, -35076, -15016, -35014, -18347, 2261, -12070, -19477, -25272, -34306, -11554, 4640, -4405, -10855, 2454, -26747, -16862, -4617, -794, -54333, -49902, -31172, -8420, 22599, 6252, -25251]
15128b5251M709K5260J1729j7865k3615M1228M3782L9470j8846l3170k0859r427
15116A7145k512K2145k801l9658j2175J1341j432K7340L4638k9129n4012N337
15104b3773J9623J94L803r577k2178l7503J6479M942P219j1715k104L6731l2260
15091e0119j2609L8803O816J8962k5012J1956J4317o7k0066R78P877j426L5854
15078B6264l1067k8134N0601L9877l3763n0800n0743K3511J9122R787J9006L2622
15066B6283J0938R036j6862j5699K2725Q802k3887k7819l7093L0268N3159K1047
15054F0898j4485o6096N630M1379k3377n6727M336J8519l683p8K512L3199L2248
15041C4275j25J1443p929j4751l376r890L3722m740k8136l089j3892l205L926
$$ y = [-25251, -20542, 4718, 16447, -1418, -25033, 16195, 59977, 99447, 80601, 47431, 26572, 17145, 14633, 36778, 33977, -5681, -17856, -6515, -7947, 19393, 54031, 24902, -29110, -23773, -4150, -3956, -153, -9730, -31908, -69411, -52932, -47990, -40771, -52486, -54590, -17859, -50119, -62728, -23925, -17109, 1853, -23159, -11203, 3114, 3047, -17019, -16041, -8164, -9590, 26264, -4803, -32937, 17664, 57541, 23778, -27022, -77765, -54254, -35132, -25345, -6339, 26283, 37221, 46257, 29395, 13696, 36421, 45223, 21336, -6483, -43576, -13308, 39851, 60898, 46413, -19683, -14053, 27326, 3949, -52778, -48442, -29923, -33606, -33684, -31172, 2027, 34275, 34150, 45593, 37664, 22913, 19537, 9647, 43369, 38629, 10493, 7404, -6488, -9693, -5767]
15028e767K842J5894J2160K2779k496L404k4227N09m9423o282J2200K144l904
15015b0167L7661l6516K7055j4892n6226j2920O2443j3013j001J1597j955K5894
15003G960O308l4885L0746m0002j1301K8858N6878j609J6182o816j8370l1619
14991B330m2586l104k4007j2227Q6802M0655r820m0756o223L4842J936K6780K417
14978E7039k6196j5383n269L781l7706J0449O679M3488K2661j2503r790Q85J313
14965C9448L004j2058j6503n617j4649j114L3835M306j7703m0896m2288K2048
14953d8187j8944j5184P0610O1092J1740k6459J7853K7612K4009j4571q0j7233
14941G2258K3568Q684k0234k397k0613j9043J9172K4060q48N663J772m335m9167
$$ y = [-5767, -2925, 12969, 25129, 47908, 45412, 48816, 24589, 25098, -24325, -30607, -18407, -16263, -20167, 17494, -19022, 8033, -6859, -63085, -76005, -13562, -26575, -27576, -15979, -17934, 7960, 14268, -20617, 10129, -29873, -41174, -12316, 44562, 42953, 59135, 52319, 33949, 2330, -40256, -43360, -67367, -79594, 7208, 47863, 38043, -2713, -8936, 25906, 27842, 54622, 57039, 30843, 15460, 10191, 13972, -23734, -13285, -6606, 36882, 59543, 47040, 37250, 38135, 39448, 42452, 30394, 13891, 8274, -6375, -7489, 26346, 30652, 12949, -27947, -70235, -48187, -67131, -82315, -11705, 49387, 61127, 34668, 52521, 80133, 104142, 89571, 89491, 72258, 95826, 104510, 84276, 81879, 61266, 42223, 61395, 85455, 84607, 90270, 92042, 87707, 38540]
14928C8540l1889k3079q19k4097l0059J3008K2682L4038J8944l5981l2333o935
14916e7980M829K2144L4580P548J759M8869j8436p2762n907K4016J20J3896L186
14903E862k269k6867k2609J4851L5993m764J1330J1401J061J2564k768N622K750
14890D2157K0244n520q602L7953L3419K7572k2867n5360l0558L120K4121O2234
14878A27913K3553K4696j2033l238L4939P2132J31212J84650L13795L92484L19996
14867A610099J41136J2517j65060m12226m48040k39933p7645k7968k6618m6425
14857C19837k3165o1239n086K352n3964Q465j3801k5543L3051k8641l5813k5345
14845I1108m3481L0245L7069j3107j3392l371M8405n871j8244n055j9474n0102
$$ y = [38540, 6651, -16428, -17247, -41344, -71403, -58395, -35713, -1675, 17269, -18712, -51045, -57980, -53151, -31007, 3573, 11121, 12880, 61749, 43313, -29449, -35356, -11340, -11220, 2676, 5862, 3593, -23274, -45883, -31032, 4961, 197, 11527, 22928, 23989, 36553, 33785, 39407, 42157, 62401, 56881, 48279, 86232, 119651, 147223, 124356, 68996, 38438, 41558, 65679, 127913, 151466, 176162, 164129, 160891, 195830, 267962, 399174, 583824, 897619, 1290103, 1610099, 1751235, 1763752, 1598692, 1186466, 738426, 498493, 420848, 392880, 366262, 319837, 296672, 235433, 230347, 232699, 178735, 187200, 173399, 147856, 180907, 152266, 116453, 91108, 47627, 77872, 114941, 101834, 88442, 85071, 133476, 127605, 109361, 104306, 84832, 34730]
14833C4730q368Q849J654K8156M4494K4116k706l0560k7028K6757K4875p864J5392
14820A32497O561p43j5384j329l283l1070m2021L2994l126k7084L0774P93k9280
14807E0299O412K7654l1792j5196j8523P106k6974J4263M1192M0050l3144j6297
14795D5050N6342M591l1634l898O758J7489K2211j9993k3243p716j793o982M3313
14782A00495N646q555l659l7899K6254O7991n919J1455K0632J7592L1744M2256
14770B68033K2385L9450J05817J87300K98305N03929P76471P31600L90676J04097
14760C428063p3527m14006q91724p14141l64272j92293j30702q5046p1082n5710
14750D35560m0182l4544l8024J956m2214j2381k2086N99J0078J075k3742N374
$$ y = [34730, 26362, 35211, 36865, 65021, 109515, 133631, 130925, 100365, 73337, 100094, 124969, 117105, 132497, 139058, 138315, 122931, 121602, 118319, 87249, 45228, 78222, 75096, 48012, 78786, 79579, 50299, 56711, 84365, 52573, 37377, 18854, 25960, -1014, 13249, 54441, 94491, 61347, 45050, 101392, 105983, 74349, 70451, 77209, 94698, 116909, 96916, 73673, 65957, 64164, 57182, 100495, 106141, 97586, 93927, 56028, 82282, 150273, 144354, 155809, 176441, 194033, 225777, 268033, 290418, 329868, 435685, 622985, 921290, 1425219, 2201690, 2933290, 3323966, 3428063, 3354536, 2940530, 2048806, 1334665, 970393, 778100, 647398, 562352, 491270, 435560, 395378, 360834, 322810, 324766, 282552, 270171, 248085, 248684, 258762, 259837, 236095, 241469]
14738B41469r610K957k9140L6768j2888k0780K9874k983k567K8152P3107P4344
14726D08703P9413J42242K21231J63171J05029L1018r7415k16598k11446k01648
14716D23700q6682j0440j1738j9184j7744j1060j5339m1162N542j6402L2153M2058
14704B73702l8531l5150j554j2900k271K6107M3576j9473l3991l1422k3056Q918
14692A53955Q239J4802K0264j6704m9918k1409L0279J2537o999l2397k8089j49
14680H4411K6246L911N405k980l0785K465j7397J1948P693m674j9115L2929J3544
14667A13601J8836O769m195R061j9563K6166j2360p4488J492K1875j368K3012
14655A08838K7252p851l5826K5168J4813j144R010n816o0445p6302o7054N3457
$$ y = [241469, 231859, 234816, 205676, 242444, 229556, 208776, 238650, 235667, 233100, 261252, 334359, 408703, 488116, 630358, 851589, 1014760, 1119789, 1150807, 1053392, 836794, 625348, 423700, 337018, 326578, 314840, 295656, 277912, 266852, 251513, 210351, 215893, 199491, 231644, 273702, 235171, 200021, 198467, 185567, 183296, 209403, 252979, 233506, 199515, 168093, 145037, 153955, 162194, 176996, 197260, 180556, 130638, 109229, 139508, 152045, 145046, 112649, 84560, 84411, 110657, 114568, 119973, 116993, 86208, 88673, 71276, 83224, 90917, 86243, 67128, 100057, 113601, 132437, 139206, 135011, 144072, 124509, 150675, 138315, 63827, 65319, 87194, 85826, 108838, 136090, 128239, 92413, 117581, 132394, 131250, 140260, 134444, 73999, -2303, -69357, -15900]
14643a5900P9331L7170J3188n106k7618O996k783J5532K4017K5499p198k7834
14631A15294o857P623J0706j3873O175k2730q307P699j5582j9225J2717k9313
14619D4327Q202K958k0551M7237l4945k3024N537L0316L4923j9899M3146J3354
14607A31581j9515O75k2354o0363j6655j222N8652K2933j9972n4275O178J0634
14595C6297K6231L2724l5587k0194M9380N6561m4515m4653p753p530j965K6281
14583F5277J2597n5749k4317J2931O132J2678j5907m2596q42J3886P615K1491
14571A3196K649M6674K3232k6206m338j4564M0873k1283k9331J5127M6932J1392
14559A04353m1737j2179j9162K1761n581P269R976Q146m7595l7868O4834N176
$$ y = [-15900, 63431, 100601, 113789, 108683, 81065, 88061, 85278, 100810, 124827, 150326, 143128, 115294, 108437, 116060, 126766, 112893, 119068, 96338, 88031, 95730, 80148, 60923, 73640, 44327, 52529, 55487, 34936, 82173, 47228, 24204, 29741, 60057, 94980, 75081, 118227, 131581, 112066, 112741, 90387, 30024, 13369, 12147, 70799, 93732, 73760, 19485, 25663, 36297, 62528, 95252, 59665, 39471, 88851, 145412, 100897, 56244, 48491, 40961, 38996, 65277, 77874, 22125, -2192, 10739, 16871, 29549, 13642, -28954, -29796, -15910, -8295, 13196, 15845, 62519, 85751, 59545, 55207, 40643, 81516, 60233, 30902, 46029, 92961, 104353, 62616, 50437, 31275, 53036, 47455, 54724, 64700, 72846, 25251, -12617, 52217, 57393]
14547E7393k6502L4560J1827J3980k2627m6669n1273Q081O5519m247r699m34J937
14534C1846J1578K0449J4181j3545L3681L2374J3761M0389k6568K0996K3600n36
14522B02206p88P1518R2296J20547J35990J29777K22156L08544L45769K51780
14512A879795J66141J58272k8883k42068l94704l47289k76479j94565j08344k8524
14502E83352m0479k1923j1637n9599l5874Q667J8934k9935p9004p5993r199j9809
14490B27501J8943j953M143k2281q317J8565l352K6720J6367L3041O593K014k1836
14477B96148O6132J02702K7761l1061M1591L187m5565n3114l3661n659O9252k5275
14465D12438o1040l0504r428L7417K3053k3853l7060k476K7314M8710J5143k58
$$ y = [57393, 30891, 65451, 77278, 91258, 68631, 21962, -29311, -21230, 44289, 40042, 30343, 29909, 31846, 43424, 63873, 78054, 64509, 98190, 130564, 144325, 184714, 158146, 179142, 202742, 202206, 201418, 272936, 365232, 485779, 621769, 751546, 973702, 1282246, 1628015, 1879795, 2045936, 2204208, 2175325, 1933257, 1538553, 1191264, 914785, 720220, 611876, 583352, 542873, 520950, 509313, 449714, 413840, 422507, 441441, 411506, 332502, 256509, 247310, 227501, 246444, 244491, 248634, 226353, 218036, 236601, 233249, 259969, 276336, 309377, 315970, 317984, 296148, 362280, 464982, 492743, 461682, 503273, 506460, 460895, 407781, 374120, 368461, 437713, 412438, 351398, 320894, 311466, 348883, 371936, 348083, 311023, 308547, 335861, 384571, 399714, 399456]
14453C99456M2710O573R126j0323o4196n6361K1964N8747R1641O8653k3367j8841
14441E25782m139M768J6411L6233L7276P0993R112j4855L6376J6688N0822R4568
14429H80035M9737L0199M5567O869K5030p509J9493O9823O9590Q7341J11183J16551
14417A503909J29188J67577J33823J31357J65831J52619J67427J65199K23908
14408B940838K49323K73650K50542K97229M29053N51293O57960R13357J192128
14399G755373J456865J491448J635804K026063K572659L297546M867904P830647
14391C2934309J2649535K1620475L8348174O1944445P1485402M7437996J8153130
14384C04573466N05248k3508359p8286462p5309004m0328542k0962160j1965712
$$ y = [399456, 442166, 448739, 457865, 447542, 383346, 326985, 348949, 407696, 499337, 567990, 544623, 525782, 521643, 526411, 542822, 579055, 616331, 687324, 696436, 681581, 717957, 734645, 785467, 880035, 929772, 959971, 1005538, 1012407, 1037437, 1029928, 1049421, 1119244, 1188834, 1276175, 1387358, 1503909, 1633097, 1800674, 1934497, 2065854, 2231685, 2384304, 2551731, 2716930, 2940838, 3190161, 3463811, 3714353, 4011582, 4440635, 4991928, 5649888, 6563245, 7755373, 9212238, 10703686, 12339490, 14365553, 16938212, 20235758, 25103662, 32934309, 45583844, 67204319, 105552493, 167496938, 238982340, 286420336, 304573466, 305078714, 281570355, 203283893, 127974889, 87646347, 66684187, 54718475]
14377E4718475p680379n553107m198284l096339k514958k271526k074824j811320
14369B5517738j806954j542971j250401j089988j006378r35338q43447q04820
14361A6237441p80132o94575o16882o42868n03908m48222l95412l27864k51142
14352A1576436k84095l26763l62598l54800l13230k50563k96174l35453l34239
14343H718521l27890k41105k61962k67470k70490j90577j78969j74090j21832
14334F684136j59249j55797j70323q8562j12839j79290j66643j25371j05341k10569
14324E210152j49790j24420j03564n8286p2699j46474j43353j26964m9181j4404
14314D221017n169l7518r1692p1100j67255k02737j02876j17843j45314j13644
$$ y = [54718475, 47038096, 41484989, 37286705, 34190366, 31675408, 29403882, 27329058, 25517738, 23710784, 22167813, 20917412, 19827424, 18821046, 17885708, 17042261, 16237441, 15457309, 14762734, 14145852, 13502984, 12999076, 12550854, 12155442, 11827578, 11576436, 11292341, 10965578, 10602980, 10248180, 9934950, 9684387, 9388213, 9052760, 8718521, 8390631, 8149526, 7887564, 7620094, 7349604, 7159027, 6980058, 6805968, 6684136, 6524887, 6369090, 6198767, 6110205, 5997366, 5818076, 5651433, 5526062, 5420721, 5210152, 5060362, 4935942, 4832378, 4774092, 4701393, 4554919, 4411566, 4284602, 4235421, 4221017, 4215848, 4178330, 4086638, 4015538, 3848283, 3645546, 3542670, 3424827, 3279513, 3165869]
14304C165869j60551j05630m7098m8999n6926p9814l6715l3032n4549p8541l9495
14293B424519o313J0314r671o2412j3506k2428l4687m5757n3826n9268m2669K55
14281B084551J1846L078J5482l4483o8263k1725l161o3701l4227O5604M2316j8129
14269A979188P713P7435J06140M2804N2584J45022J68026J63237K30351K74265
14259C246765J98339r7640j78770j16474l55478k68519k08736k23795j26614j25378
14249A743700j28545o6159m8616n9989o5779m5577l9374k8449j3220j6432q5025
14238A146535n3682K525J7864k2421p3564l5200j6733o091R870k9356l2099j2569
14226H95079l7996m9498k2359L7858L469m401l3275L197k4393m2832j4471m8542
$$ y = [3165869, 3005318, 2899688, 2852590, 2803591, 2746665, 2666851, 2630136, 2597104, 2542555, 2464014, 2424519, 2418206, 2428520, 2418849, 2356437, 2342931, 2320503, 2285816, 2240059, 2186233, 2126965, 2084296, 2084551, 2096397, 2099475, 2114957, 2080474, 2012211, 1990486, 1987325, 1923624, 1889397, 1955001, 1997317, 1979188, 1986901, 2064336, 2170476, 2213280, 2265864, 2410886, 2578912, 2742149, 2972500, 3246765, 3445104, 3347464, 3168694, 3052220, 2696742, 2428223, 2219487, 1995692, 1869078, 1743700, 1615155, 1548996, 1500380, 1440391, 1374612, 1329035, 1289661, 1261212, 1247992, 1231560, 1146535, 1092853, 1095378, 1113242, 1090821, 1017257, 982057, 965324, 959233, 969103, 939747, 907648, 895079, 857083, 807585, 785226, 823084, 826553, 822152, 788877, 792074, 767681, 724849, 710378, 661836]
14214F61836j0738J1273l618q090j2243O581q729J2918k8702j0086l135r993J1003
14201F08277J1043R467Kn0268l5311j476K947J1156L806N092l8472k8348J735
14188D99650O576l3081k7194M5N864k4798k6921j4624K2967K7600o90J0184o336
14175D39242k4488j8339j4813j5001m9772k8836K0935L3538L3207l000l2145j8371
14163C22157m871k9100N107J0267K1134J4140q971k6222k7512l0136O941J1654
14151B64588j1715l8727j9808p047L1143J6802j7353j0725R84J5437M4500j6682
14139B51397j1013j413J4029K8719k1863l9449k6286j4443K0666P1165K3055J6384
14127C10948m3026k4307K007j5981J4140J7316j0319k5198k0946J9071l8604o7549
$$ y = [661836, 651098, 662371, 658753, 650663, 638420, 645001, 636272, 649190, 620488, 610402, 607267, 597274, 608277, 619320, 628787, 628789, 578521, 543210, 541734, 544681, 555837, 559643, 564735, 526263, 497915, 499650, 506226, 473145, 445951, 445996, 451860, 427062, 400141, 385517, 408484, 436084, 435394, 445578, 439242, 414754, 396415, 381602, 366601, 316829, 287993, 308928, 342466, 375673, 372673, 340528, 322157, 317286, 288186, 293293, 303560, 324694, 338834, 329863, 303641, 276129, 245993, 252934, 264588, 252873, 214146, 194338, 187291, 218434, 235236, 217883, 207158, 208142, 223579, 268079, 251397, 240384, 238971, 253000, 281719, 259856, 220407, 194121, 179678, 200344, 271509, 294564, 310948, 267922, 243615, 245622, 229641, 243781, 261097, 250778, 225580, 204634, 223705, 185101, 117552]
14115A17552m2728J8596K9532J7365j4940J9202n291l0206k1294J6733j4494J670
14103I1697M0731j7386q936j2342K7200K5069j4282l7476n978j3999j240n299
14091F7759k696L885K2398j1651j0030l1062l3844L353L9443j0777J7090L7462
14079I1330j4828k0184L054O277N156K640J4529L7574m7801k5192M100j574M2672
14066I7753N741J024K2021k5234q865K1483O537k348N439l2521j5441J0753L6240
14053A22582L9206J4897l3664n2930k7108K5384r539p4245k0631K3291M0305Q195
14041E5743k5384O894J271K493J2340K8439M8381L8303l775k4836p602k3903k6736
14028H1628m1740K955L9717J1844j0237P527J0951O917k7280r109j2998M035O073
$$ y = [117552, 74824, 93420, 122952, 140317, 125377, 144579, 139288, 109082, 87788, 104521, 90027, 91697, 132428, 115042, 106106, 93764, 120964, 146033, 131751, 94275, 88297, 74298, 73058, 67759, 65063, 68948, 91346, 79695, 69665, 38603, 4759, 8112, 47555, 36778, 53868, 91330, 76502, 56318, 59372, 65649, 70805, 73445, 87974, 125548, 77747, 52555, 56655, 55081, 97753, 103494, 104518, 126539, 101305, 92440, 113923, 120460, 118112, 123551, 91030, 75589, 86342, 122582, 161788, 176685, 143021, 90091, 62983, 88367, 78828, 4583, -16048, 7243, 47548, 55743, 30359, 37253, 38524, 41017, 53357, 81796, 130177, 168480, 164705, 139869, 132267, 108364, 81628, 39888, 42843, 82560, 94404, 84167, 91694, 102645, 109562, 82282, 73173, 60175, 64210, 70283]
14015G0283O840j8814k5558N732j50K6745J1719l344j3974L4966J9441K19m7208
14002F6897o72k7025l5265J6057K2376j465K933j5113J1188M7724K7193k2528
13990I2300j557m8125n5426r452K5462O2995L1023n471J866n8303o455k1456P657
13977A5058J8149J4992J0193J4988k8444M048M5004J5785n1375m9103m673j143
13965C479L399O643k2490L0150n249Q376J593n784o667J697j0149O676J9725K0804
13951E2203j4714L485j3473J3851L0191J0320J2269j0337j5784m7831m1414K1073
13939a61K9533K2221J6315J2841q3l6432J1602k0693o407j807J6131K838P314
13926E3212J3850J5681L584j9556m2009l8155J2536K8475M8211J2610j1345k9657
$$ y = [70283, 77123, 58309, 32751, 38483, 38333, 65078, 76797, 73453, 59479, 94445, 113886, 114105, 66897, 66225, 39200, 3935, 19992, 42368, 40903, 43836, 28723, 39911, 87635, 114828, 92300, 90743, 42618, -12808, -22260, 3202, 66197, 97220, 91749, 93615, 35312, 28857, 7401, 15058, 33207, 48199, 58392, 73380, 44936, 48984, 93988, 109773, 58398, 9295, 4622, 3479, 6878, 13521, -8969, 21181, 15932, 24308, 25901, 20117, 13450, 15147, 4998, 11674, 31399, 52203, 37489, 40974, 27501, 41352, 71543, 81863, 94132, 83795, 68011, 20180, -21234, -161, 29372, 51593, 67908, 80749, 80666, 44234, 55836, 35143, 28736, 26929, 43060, 45898, 53212, 67062, 82743, 86327, 66771, 24762, -13393, -857, 27618, 75829, 88439, 77094, 47437]
13914D7437J4274k4095J7783Q859N1193K1683q96J0669Q937n10L1811O3823P3090
13901C24058J57847K37382L28621L68150K30297J01025j051j38988m27575l93594
13891G86172k20926j34287p6280O366p3385n1994N240Q773n13J5220k9833l9542
13879A95011m2224O511k116K949J4611l0349m3812O243J259J1005J2397L4883
13867A66368j1778o2203l8081J4645M2711J4707j9119j3256R483k2143k2853J4966
13855G3447L0038Q406l4119l3926L9808K6792J2877o2346m3919l146M6142O894
13843F6948m0113K5599Q872L626r136K4255j595J0706J9349J3049l0198j4336
13831G7026L9728q143j3186n9470n5135l6100J6314O5765L1600p628o0153l9270
$$ y = [47437, 61711, 37616, 55399, 64258, 115451, 137134, 136238, 146907, 155844, 155334, 187145, 250968, 324058, 481905, 719287, 1047908, 1416058, 1646355, 1747380, 1746329, 1607341, 1179766, 786172, 565246, 430959, 354679, 361045, 287660, 235666, 240906, 249679, 249166, 264386, 234553, 195011, 152787, 159298, 157182, 160131, 174742, 144393, 100581, 106824, 108083, 119088, 131485, 166368, 154590, 92387, 54306, 68951, 111662, 126369, 107250, 93994, 103477, 81334, 58481, 73447, 103485, 111891, 77772, 43846, 83654, 110446, 123323, 60977, 17058, 13912, 60054, 66948, 26835, 52434, 61306, 64932, 55796, 80051, 78456, 89162, 108511, 121560, 91362, 77026, 116754, 108611, 95425, 35955, -19180, -55280, -38966, 26799, 58399, 50771, -9382, -48652]
13819d8652j0801J7752N0733L5019l9557k6838k991J5870j1817K2330L6194K1508
13807E8750R617J5248R296k7326j8081l1164j6214k879J4174N7521j3671l1286
13795B3985o201R23R366k9082J5192O070K2599k2494J2086j82j067k648j5452
13782A3095j4964p844l890J5803j399L224J7840j5799k9277j3086K2982M3065
13770B9750m876r416J0326j6877L5439K3685J4586j4482j9669j7835p021M8712
13758G2322j7984l1178K8617j0434Q803N0505m8011k2895Q518j6824K0094J988
13746D3521k6871k3043k5836J007M9378M3767O426J2464J4109J2087L4471m6695
13734I4785k9843j5102k2677j0207k6461r400M8605K3233J9760j1444k8688j1084
$$ y = [-48652, -59453, -41701, 9032, 44051, 4494, -22344, -25335, -9465, -21282, 1048, 37242, 58750, 68367, 83615, 92911, 65585, 47504, 16340, 126, -2753, 11421, 68942, 55271, 23985, 17784, 18707, 28073, -1009, 14183, 20253, 42852, 20358, 32444, 32262, 31195, 28547, 13095, -1869, -9713, -13603, 2200, 801, 4025, 21865, 6066, -23211, -36297, -13315, 29750, 24874, 15458, 25784, 8907, 44346, 68031, 82617, 68135, 48466, 30631, 23610, 72322, 54338, 23160, 51777, 41343, 50146, 100651, 52640, 29745, 38263, 21439, 41533, 43521, 16650, -6393, -32229, -31222, 18156, 61923, 68349, 80813, 94922, 107009, 141480, 94785, 64942, 49840, 27163, 16956, -9505, -18905, 29700, 52933, 72693, 61249, 32561, 21477]
13722B1477M749m01l7596k8847J7226K756K5502L6813O547m4139m1857K5125K1982
13709I337j211K3528j4666k2380n6504p555J6322J9993K5000O7181K5234l2703
13697E1576k9996R68Q999k411L4367M4314Q468j8844p37j8504P978J1837l1187
13684F6828n349k9962j9112j6763K0580N7768j3934k0843J3945J1928J9855O855
13672I1796l0650n2277j0851r512M4161L54L6660P2754N6165j0174m4899j5284
13660A28243J9546K6236K5159l7862j3767k4340q650K7591L5388j2035k3506Q047
13648A50050J2130Q887K0071J2045P1124K06589L14930M19716M79843L60474J75164
13637B231023J4275j62969m86883n13389l30494k20509j15526n4880l0997k2115
$$ y = [21477, 26226, 25825, -11771, -40618, -23392, -20636, 4866, 41679, 48226, 4087, -37770, -12645, 9337, 8126, 31654, 16988, -5392, -61896, -69451, -53129, -33136, -8136, 59045, 84279, 51576, 21580, 22548, 31547, 29136, 63503, 107817, 116285, 97441, 96704, 78200, 86178, 98015, 66828, 61479, 31517, 12405, -4358, 16222, 73990, 60056, 39213, 53158, 65086, 84941, 91796, 61146, 8869, -1982, -11494, 32667, 33021, 69681, 142435, 198600, 188426, 143527, 128243, 147789, 174025, 199184, 161322, 147555, 123215, 114565, 142156, 177544, 165509, 142003, 150050, 162180, 171067, 191138, 203183, 274307, 480896, 795826, 1215542, 1695385, 2055859, 2231023, 2245298, 2082329, 1595446, 1082057, 751563, 531054, 415528, 360648, 329651, 307536]
13627C07536k0556r171m4818q202o719J8752l2253Q140P783j2973k5045L075o503
13614A79046L25K555k5563m8784K2681P7758j3003k6947l2221j7509r87K3053
13602A40404Q834j0038l1331j0690l20J9248J0881K1565R286R24k7176l2919m0760
13589E7908j8150J2473J7456J6673R062J9711J6335J7955k648j2985l6046l4895
13577F2849r51N1401q943k8714j626k1447o323r109O432k1904J4448n045K0694
13564E1762k2371k1425j345M1615J2576o775R047L8176p119J1651J5893m6462
13552G5223n25k4174l7554l344K51J3459J0848q507N889J3748k475K7692J3736
13539H4267P916j5628m8364l2664J9031L5831K8490j8234m5261j5909K5680K827
$$ y = [307536, 286980, 277809, 232991, 224789, 218070, 236822, 204569, 212709, 220492, 207519, 182474, 185549, 179046, 179371, 181926, 156363, 107579, 130260, 208018, 195015, 168068, 135847, 118338, 117351, 140404, 149238, 139200, 107869, 97179, 96859, 116107, 126988, 148553, 157839, 158763, 131587, 98668, 57908, 39758, 52231, 69687, 86360, 95422, 115133, 131468, 149423, 146775, 133790, 97744, 62849, 61898, 113299, 104356, 75642, 74016, 52569, 46246, 37137, 43569, 21665, 36113, 31068, 51762, 29391, 7966, 6621, 48236, 60812, 54037, 63084, 101260, 94141, 105792, 121685, 75223, 74698, 50524, 12970, 9626, 9877, 23336, 34184, 25677, 31566, 45314, 42839, 70531, 84267, 92183, 76555, 28191, -4473, 14558, 50389, 78879, 60645, 15384, -525, 25155, 27982]
13527B7982n98j3401k0863N0947M2432k9101j1k9158j5500K455M1320n628o946
13514D3930l8645l0132K8909O020k908q292J751p629N5393K8718J818R188J5327
13501A03448j1342o371l405K5636L4183J0705l0154m5562J6791M4191K128k8481
13489A11767L23n129j8822J5252m419j7919N27K8592K6060k6457k295R603L1388
13476A48471K4241j353l2464n6110n706O9492K9844K1223l2291k5078K0394N1888
13464B12551L3849J7503j7968L1125Q9339Q8474Q5090J46366K21819K55164K35369
13453A398681K42845J72111J33038l485j12587j65806k78618k60772j59927j14913
13443H50567j39833j22567o8464o9925m8626n1675o6896k104q726k0288k0355
$$ y = [27982, 27384, 13983, -6880, 44067, 86499, 57398, 57387, 28229, 12729, 15184, 56504, 50876, 43930, 5285, -24847, 4062, 10082, 7174, -1118, 633, -6996, 48397, 77115, 78933, 88121, 103448, 92106, 85735, 82330, 107966, 142149, 152854, 122700, 77138, 93929, 138120, 140248, 111767, 112090, 106961, 88139, 103391, 98972, 81053, 81580, 110172, 136232, 109775, 107480, 117083, 148471, 172712, 171359, 138895, 82785, 77079, 146571, 176415, 197638, 165347, 140269, 160663, 212551, 246400, 263903, 245935, 277060, 366399, 454873, 539963, 686329, 908148, 1163312, 1398681, 1641526, 1813637, 1946675, 1943190, 1830603, 1664797, 1386179, 1125407, 965480, 850567, 710734, 588167, 519703, 449778, 401152, 349477, 282581, 280477, 271751, 251463, 231108]
13432B31108k766j63k651r753M6000j5165m750p710l8386k9455P865K7679J2338
13419B14191J8554N069j09l8188l7822n438O905j595J8483J8984o3769K9746l7648
13406A27363j795j744j6188j1555j1079M3920L2712K0936k8282k2562N689j9158
13394A18257k5075k2556N872K1169K945O739k3945M384n152j1041J853J0989J8563
13381A03002J3068J0824j6610k615r56n0318k5358j2180N2046N1301n329Q229
13369A25104J9961k6738L2236r469n044j8672k3747K0238m9816N486M8600L2600
13357A50739n340j0828K8150J1628L0673k7083l7482k1723j6634m3785K8642O5792
13345A52749N491n015m4871q407P4543N7647j1550J9626J9882K0229J6069L656
$$ y = [231108, 228342, 228179, 225528, 215775, 261775, 246610, 241860, 234150, 195764, 166309, 174174, 201853, 214191, 232745, 237814, 237705, 199517, 161695, 156257, 163162, 161567, 180050, 199034, 135265, 165011, 127363, 125568, 123824, 107636, 96081, 85002, 128922, 161634, 182570, 154288, 131726, 137415, 118257, 93182, 70626, 76498, 97667, 100612, 107351, 83406, 87790, 82638, 71597, 73450, 84439, 103002, 116070, 126894, 110284, 107669, 106713, 56395, 31037, 18857, 70903, 122204, 116875, 125104, 145065, 118327, 150563, 141094, 136050, 117378, 93631, 113869, 64053, 69539, 118139, 150739, 145399, 134571, 162721, 174349, 205022, 177939, 140457, 118734, 102100, 58315, 86957, 152749, 158240, 153225, 108354, 99947, 174490, 232137, 220587, 240213, 260095, 280324, 296393, 300049]
13333C00049L0948N0305P4345R2083J02261J10786K02501J95070J73441L40214
13323A672003M33236M73647L59103K17317K01277r3946m16434n63753n40635l71401
13313A370414j95266j79504j18681m2589j9822n6943n0771l8084j8512k9048m8288
13302E72906l0260r143j819J4527j3858o64m644J4360k1062l5979K0468J1888
13290E16720l6342J5998L7878r342j823O0384J05471O3354N4922J6843p8498m1199
13278G04366m2539n3601k5926n060J4447n209j7518N666k8832j8071L0700R737
13266E68160J2292K9199L0305J1582L8164L6930N251m3912M6876L8910K3109J0855
13254H07721O4504L5930N7648L5349K2106K8404O2584M6755J9345N9587P4445
$$ y = [300049, 330997, 381302, 455647, 547730, 649991, 760777, 963278, 1158348, 1331789, 1672003, 2105239, 2578886, 2937989, 3155306, 3356583, 3262637, 2846203, 2282450, 1741815, 1370414, 1175148, 995644, 876963, 834374, 814552, 757609, 706838, 668754, 650242, 621194, 572906, 542646, 533503, 531684, 546211, 532353, 531689, 527045, 541405, 520343, 484364, 504832, 516720, 480378, 496376, 534254, 524912, 523089, 583473, 688944, 752298, 807220, 824063, 745565, 704366, 661827, 608226, 582300, 577240, 591687, 586478, 568960, 574626, 545794, 527723, 558423, 568160, 580452, 609651, 639956, 651538, 689702, 726632, 731883, 687971, 734847, 773757, 796866, 807721, 872225, 908155, 965803, 1001152, 1023258, 1051662, 1114246, 1161001, 1180346, 1239933, 1314378]
13243A314378N9730Q0382J06779O6537N1479J38765K05091J80411J46404L4893
13233B384849l7982j3044p6288j2961M3738Q9646J52435K38605K66205K24293
13223C259496K49286K69716K80063L93926M59964O43985R87168J381867J566282
13214I491753J309821R20004P01437M96406R2194K92074J141171J740280K290076
13205A8475216L060640L792342M580676O159773Q714630J2659946J9810314L3688862
13197A10942399N7866123Q8071728R6271858O4319259K5446207j485167m1616274
13190C99816133j04864875j00634721n7566202l0709553j7751866j1665396q981176
13183F7642344p532710o101816m989771m456762l751407l049668k411446j888936
$$ y = [1314378, 1374108, 1454490, 1561269, 1627806, 1679285, 1818050, 2023141, 2203552, 2349956, 2384849, 2346867, 2333823, 2257535, 2244574, 2288312, 2377958, 2530393, 2768998, 3035203, 3259496, 3508782, 3778498, 4058561, 4452487, 4912451, 5556436, 6543604, 7925471, 9491753, 10801574, 11721578, 12423015, 12919421, 13011615, 13303689, 14444860, 16185140, 18475216, 21535856, 25328198, 29908874, 36068647, 44783277, 57443223, 77253537, 110942399, 168808522, 256880250, 353152108, 417471367, 442917574, 441432407, 399816133, 294951258, 194316537, 136750335, 106040782, 88288916, 76623520, 67642344, 60109634, 54007818, 49018047, 44561285, 40809878, 37760210, 35348764, 33459828]
13175C3459828j604172j469915j381034j394509j370213j259601j172146j021528
13167B2786710r25660q52373p60317o30279n42074n33961n13478m68946m46373
13158A7113249m76998m95456m65361m24436m32733m86810m92140m79790l94440
13149A2965085l26321k48957j76366o2812J05184J47052O4136p0600j93908m54822
13139A1747671o76738o52533n03367m32566l50146l13099k81109k31953k30231
13130H075929j93701k21772j96377k06572k14182j53983j82233j36284r1811j35101
13120F343913j64982j69036j74362j61956j18159j73082j52792j00872j20348
13111E008324j55318j19305j33763j63284j72426j28720o0292p2011p0168m4943
$$ y = [33459828, 31855656, 30385741, 29004707, 27610198, 26239985, 24980384, 23808238, 22786710, 21861050, 21008677, 20248360, 19618081, 19076007, 18542046, 18028568, 17559622, 17113249, 16636251, 16140795, 15675434, 15250998, 14818265, 14331455, 13839315, 13359525, 12965085, 12638764, 12389807, 12213441, 12150629, 12255813, 12402865, 12467001, 12396401, 12202493, 11747671, 11070933, 10418400, 9915033, 9482467, 9132321, 8819222, 8538113, 8306160, 8075929, 7882228, 7660456, 7464079, 7257507, 7043325, 6889342, 6707109, 6570825, 6479014, 6343913, 6178931, 6009895, 5835533, 5673577, 5555418, 5382336, 5229544, 5128672, 5008324, 4853006, 4733701, 4599938, 4436654, 4264228, 4135508, 4075216, 4003205, 3933037, 3888094]
13101C888094n2602l0150n7470m7628l1030l5165q9724q6339o9372j3581P249
13090C382282l3728J5582K9786k9363j10043m9276j5459n4507k8959k0614j8814
13079C066887l5895L8630L6456N3250R4772P6672J08683K04047K48421K52877
13069D144800L73887L94549K70920l6321k50277l01039n39263m04128l00576k65702
13059C086850j74195j56659j19343j23284j59398r1534q6777m9650m4350n8137
13049B023523j11652m1820K1116j3149k8280j9053o9722m8538o1561o0992n1683
13038A538189j443j2399p3364m9552m8570m888j0630n6070k4442K4184k7902n3971
13026A199142j6239m2884j637K950q915j0551l6166l0846n855k4808J226J1620
$$ y = [3888094, 3835492, 3805342, 3747872, 3700244, 3669214, 3634049, 3544325, 3457986, 3388614, 3375033, 3382282, 3348554, 3364136, 3393922, 3364559, 3254516, 3205240, 3189781, 3135274, 3106315, 3085701, 3066887, 3030992, 3069622, 3106078, 3159328, 3254100, 3330772, 3439455, 3643502, 3891923, 4144800, 4518687, 4913236, 5184156, 5147835, 4897558, 4596519, 4057256, 3653128, 3352552, 3086850, 2912655, 2755996, 2636653, 2513369, 2353971, 2262437, 2175660, 2126010, 2081660, 2023523, 1911871, 1870051, 1891167, 1878018, 1849738, 1830685, 1760963, 1712425, 1650864, 1589872, 1538189, 1536746, 1524347, 1450983, 1401431, 1352861, 1347973, 1337343, 1281273, 1256831, 1281015, 1253113, 1199142, 1182903, 1140019, 1138382, 1141332, 1132417, 1121866, 1085700, 1054854, 1048999, 1024191, 1025417, 1037037]
13014A037037k0423K2771l429k8049m5757m2638r060K4722P237l5723j038j9396
13002H86254p533j78k782o259K9530j0492k4180k071k3774l4114k4291n4608j3378
12989G12124L5346l2804q479j3758m3418n4830J3249K6666o775l3090m4124J3538
12977E63645L9308p202n153k605k6681p381l0015m587L3632l0963l9288m1420
12965D41290M9369M2032p755k2834j9249Q57k5241k4654J6046j3537k7934J2763
12953D21153K9861l132j6272L3074J2223j4596j1873k1939J6112J3484k3151j7640
12941D17304p368p943J5927r905l8407J2706K2727n8697k7625J8910J8915J9937
12929C76481R362k6314m651k6671j0081p834J4799J702k7987n6277K933L3448
$$ y = [1037037, 1016614, 1039385, 1035956, 1007907, 962150, 919512, 910452, 935174, 942411, 906688, 905650, 886254, 878721, 878543, 875761, 869502, 899032, 888540, 864360, 862289, 838515, 804401, 780110, 725502, 712124, 747470, 714666, 706187, 692429, 649011, 594181, 607430, 634096, 627321, 594231, 550107, 563645, 602953, 595751, 590598, 587993, 561312, 553931, 523916, 519329, 552961, 521998, 482710, 441290, 490659, 532691, 524936, 502102, 482853, 483710, 458469, 433815, 449861, 436324, 408390, 421153, 451014, 447882, 431610, 464684, 476907, 462311, 450438, 428499, 444611, 458095, 434944, 417304, 409936, 401993, 417920, 408015, 369608, 382314, 405041, 346344, 318719, 337629, 356544, 376481, 385843, 359529, 354878, 328207, 318126, 310292, 325091, 326793, 298806, 242529, 245462, 278910]
12917B78910l4022j821k3937r048J4992O273M687m9585p35p452l258m849J3003
12904A83158K2943M0138l78n9187n0269Q96l652J7860j276N453o57K156k8647
12891A28538l2505L1326L9784p969j7828k1442J5443M844Q308K7078N269j4991
12879A65855m7863j8678J7704M1345l1018K0080J1313q872l9122m8364l107K8709
12867H7982J7367K5057n386j4345j7815l0832J2807K8462L6923Q078m5092j3183
12855I0023r169j563K6737J5420J0414k8489l6010k3900M499K2045J2292K831
12843H5130J2115l2900J0897L5111j8450J3844M3006j295q97j112L32j9030j4650
12830A12101m6147K2103k256l1655j3225n131P679L4780K3385j3746M870L712
$$ y = [278910, 244888, 243067, 219130, 210082, 225074, 231347, 236034, 186449, 185714, 178262, 175004, 170155, 183158, 206101, 246239, 245861, 186674, 136405, 137301, 133649, 151509, 150233, 155686, 155029, 157185, 128538, 96033, 127359, 167143, 159174, 141346, 119904, 135347, 140191, 148499, 175577, 180846, 165855, 117992, 99314, 117018, 158363, 127345, 147425, 158738, 149866, 110744, 62380, 59273, 87982, 105349, 130406, 125020, 110675, 92860, 62028, 74835, 103297, 140220, 148298, 103206, 90023, 80854, 79291, 106028, 121448, 131862, 103373, 67363, 43463, 47962, 70007, 82299, 85130, 97245, 64345, 75242, 110353, 91903, 105747, 148753, 147458, 146561, 145449, 145781, 126751, 112101, 65954, 88057, 85801, 54146, 40921, 35790, 43469, 78249, 101634, 87888, 92758, 96470]
12818I6470k917K7813J4497l8673j9476m1044J354L9456L2679q540j6665K3814
12806A08768J5594m6354l5976O509J0493L2608L4147r018j4044k6971r354l2302
12794C4100J2491j1064n1423N504J9044L5654J7419l4854l5531L3061L1066r944
12782D5523K9316k4424J098J3264k4753k8573J0130k1515K1144J9464J3685k6028
12770B8331o601J1836K2895K9393l8027n5459O406K2966K8796L5329J9858J2505
12758A18228l3162m076m410j6292L2627K6819J8878O0562P0415M9598M1405J27262
12746D87854K04091L10717M20709N00793L19476J02760o2486k18560m98450n02516
12736A064388k55566j26357q6963r1403l1869o7034j8510o7417n1208l5733q183
$$ y = [96470, 93553, 121366, 135863, 97190, 77714, 36670, 38024, 77480, 110159, 101619, 84954, 108768, 124362, 78008, 42032, 48541, 59034, 91642, 125789, 116771, 102727, 75756, 66402, 34100, 46591, 35527, -15896, -10392, 8652, 44306, 61725, 26871, -8660, 24401, 55467, 45523, 74839, 50415, 51513, 64777, 40024, 11451, 21581, 66, 21210, 40674, 54359, 28331, 21730, 33566, 56461, 85854, 47827, -7632, -1226, 21740, 50536, 85865, 105723, 118228, 85066, 80990, 76580, 60288, 92915, 119734, 138612, 199174, 269589, 319187, 360592, 487854, 691945, 1002662, 1423371, 1924164, 2243640, 2346400, 2283914, 2065354, 1566904, 1064388, 808822, 682465, 595502, 504099, 472230, 405196, 386686, 319269, 268061, 232328, 224145]
12725B24145k7898r10L4774o223k6211j1104K2139r990k6757L4924m539l2233
12713A70117j7936M7885M2621l3424o1242m0851j8966j4477l019j4229j1572j5834
12701B9073J6921J8388K8584j0970K807r487K7445K3194L9093m8062J5065L1099
12689A63150j2630l29o7533j1939J2502M0401j6175K309j3834R05r440K730R26
12676I1043J5395J5159J2240j2649n871J6055K1111k9629R350L0622m1138p0887
12664E0801j9459j0024M172j2501j9650q527J3755L8274L1117L6412j5535p10
12652H8125J0290m8696n758P742M988n008j2006J9319L5598K5367l2157l7264
12640E0540J9666k2370N6230j0911l8359J7756J7423l1132o5099J6975J3152K349
$$ y = [224145, 196247, 195337, 230111, 223888, 197677, 186573, 208712, 198722, 171965, 206889, 202350, 170117, 152181, 200066, 242687, 209263, 148021, 107170, 88204, 73727, 70708, 56479, 44907, 29073, 45994, 64382, 92966, 81996, 84803, 75316, 102761, 125955, 165048, 116986, 132051, 163150, 150520, 150191, 82658, 70719, 83221, 123622, 107447, 109756, 95922, 96827, 87387, 90117, 91043, 106438, 121597, 133837, 121188, 115317, 131372, 152483, 122854, 132204, 162826, 121688, 50801, 31342, 21318, 25490, 12989, -6661, -15188, -1433, 36841, 67958, 104370, 88835, 88125, 98415, 49719, 43961, 51703, 56691, 51683, 39677, 58996, 94594, 119961, 87804, 50540, 70206, 47836, 104066, 93155, 54796, 72552, 89975, 58843, -6256, 10719, 23871, 26220]
12628B6220o459J1986j7343L046K3470M0598K345j1782j5871r509r812N367m601
12615C7655L0602K3136L4443L7241j1971j6022k789l0937m4061k6937j8275j1131
12603I54L0189N7792k7824n277J3076L289k9975O2M0270L2839n077l1179p6718
12590B421q112k5817J077J7851N8691J4826j5681p949J38J3477J5692J810Q788
12577G7212l1737n0197j2386K9280K515J4728M6863N2947J5977K8858K4529K4566
12565B23155l9677j8204k1102K6019K4199K9054R774k9944l1858l7340l0618K9794
12553A33252K9083l064j1478q199l5172k9931l5477J7237N0990j8071o709j3659
12541F8802r070l6339o525K3510J2936J1815M0785n248J8378j5258J5662K2304
$$ y = [26220, 19761, 31747, 14404, 17450, 40920, 81518, 83863, 72081, 56210, 46701, 36889, 42256, 37655, 68257, 91393, 125836, 163077, 151106, 135084, 132295, 101358, 57297, 30360, 12085, 954, 31143, 88935, 61111, 55834, 68910, 72199, 42224, 42286, 82556, 115395, 110318, 79139, 2421, -5691, -31508, -30431, -12580, 46111, 60937, 45256, 37307, 37445, 50922, 66614, 68424, 77212, 45475, -4722, -17108, 12172, 14687, 29415, 76278, 129225, 145202, 174060, 198589, 223155, 183478, 165274, 144172, 170191, 194390, 223444, 233218, 203274, 171416, 134076, 103458, 133252, 162335, 159271, 147793, 139594, 104422, 74491, 39014, 56251, 107241, 89170, 82461, 68802, 59732, 23393, 16868, 40378, 53314, 65129, 105914, 100666, 119044, 103786, 119448, 141752]
12529A41752J7747N5074Q2574K2008L8742J7444l4177j8825l9204l3345J6302
12518B66092N5278N0681P9855p255r994p743p8467j27078o6736K427l0109q725
12506A18226J3463n005k0836k2007J0512L2989K7555j6991k7434K6622K2316j6782
12494A42628j5527j3185m214q351j0189J7085N0367N5872l3452r199O3180L8308
12482B73323m198J9063L423P2981N0341l4930k4110l6393j223Q3805O0083J3320
12470D75485l3337n6446q5177o7799r173l7603l5953o457k1857k2223J6782k7060
12458H9182k2246l0503k2081J1436j8013J5092K2257l360L7670j3896j1333j5592
12446C8613J8555P1009K5999k9794k1595L1818M143N400M3068j0876m2002Q322
$$ y = [141752, 159499, 214573, 297147, 319155, 357897, 375341, 341164, 322339, 283135, 249790, 266092, 321370, 372051, 451906, 444651, 434657, 426914, 348447, 221369, 154633, 157060, 126951, 118226, 131689, 126684, 105848, 83841, 94353, 127342, 154897, 137906, 110472, 137094, 159410, 142628, 127101, 113916, 109702, 101351, 91162, 108247, 158614, 214486, 181034, 171835, 235015, 273323, 269125, 288188, 291611, 364592, 414933, 380003, 355893, 319500, 318277, 402082, 462165, 475485, 442148, 385702, 300525, 232726, 223553, 185950, 149997, 143540, 121683, 99460, 116242, 89182, 66936, 36433, 14352, 25788, 7775, 22867, 45124, 41764, 79434, 65538, 54205, 38613, 57168, 128177, 154176, 124382, 102787, 134605, 138748, 144148, 187216, 176340, 134338, 142660]
12434A42660K2298k8090P493L2626p583J135M75j0893k5450n3371l1088M38j1286
12421C9364j9747k9538K8486L5868L9748r647j5313K9886j1673q9758k3346J5990
12409i680O912L0633J7345k2593K586K9606j315L8943j4218j0330j3071j875K7082
12396H0025J103n0085n0563Q730j118J8309J8961l0694l6934J3121l596L3922
12384A181N8636M1897j9641l2615K608J8043l9302j4763M8706J5758k9478L324
12372E4354l0587k1007L4240J7524l897j2511l6831L9429L6655P475N460m000
12360H6304m2163n1407l5004N1324K0301L2059K372j1176j5066j9531J4192o103
12348B6102L3292k14N425j8750j7674R83J1630k9636K3142L8812m615L5360K8151
$$ y = [142660, 164958, 136868, 144361, 176987, 169404, 170539, 171014, 160121, 134671, 81300, 50212, 50650, 39364, 19617, -9921, 18565, 54433, 94181, 84534, 69221, 99107, 87434, -2324, -25670, -9680, -2768, 27865, 45210, 22617, 25203, 54809, 53494, 92437, 78219, 67889, 54818, 52943, 80025, 81128, 31043, -19520, -10790, -11908, 6401, 25362, -5332, -42266, -29145, -32741, 1181, 59817, 101714, 82073, 49458, 52066, 70109, 30807, 16044, 64750, 80508, 51030, 54354, 23767, 2760, 37000, 54524, 50627, 38116, 1285, 40714, 77369, 84844, 90304, 86304, 44141, -7266, -42270, 9054, 29355, 61414, 63786, 52610, 37544, 18013, 32205, 26102, 59394, 59180, 64605, 45855, 28181, 29164, 40794, 11158, 34300, 73112, 68497, 103857, 132008]
12335A32008j5495j7352P295K458j7475l0361O036L2076n0696l4279j3543j4586
12323a3914J7297J3940m521L566k2688j5991P806L005K6905r725m035m724k60
12310c339j4528k54M4020J5824j2468m520N071o653j6641J7823M4685l2939L49
12297C6430j9712k5590J6070K5747j5770k0054K483J7221k653k3626r729k7875
12285d7058n1336L6842M0447K8030o58K9213J5888l8915j1643J9781l7814M934
12273a2289J3640J2212l3292K2577Q640n24M5802k7368j6986n6763J5858M5337
12261A6844J7653J3336M6425P1890P339n8596l3801n4557N866K0988k0026l5577
12249b216r608l114M1299N4804j2841k7536l3791o312M1073J0492l0657J908L0964
$$ y = [132008, 116513, 99161, 106456, 108914, 91439, 61078, 67114, 99190, 48494, 14215, 672, -13914, 3383, 17323, 12802, 16368, -6320, -22311, -14505, -11500, 15405, 5680, 1645, -3079, -3339, -17867, -18121, 25899, 41723, 29255, 24735, 29806, 23153, 6512, 24335, 69020, 36081, 36430, 16718, -8872, 7198, 32945, 17175, -2879, -396, 16825, 14172, -9454, -19183, -47058, -98394, -61552, -21105, 6925, 6267, 35480, 51368, 12453, 810, 20591, -17223, -12289, 1351, 13563, -19729, 2848, 11488, 10964, 56766, 29398, 12412, -44351, -28493, 16844, 34497, 47833, 94258, 166148, 173487, 114891, 81090, 26533, 32399, 53387, 33361, -2216, -11824, -14938, 26361, 81165, 68324, 40788, 6997, 685, 41758, 52250, 21593, 23501, 54465]
12236E4465L689j6005j3005K4344K2768L6612j2410l6199n3913j4242L1363m785
12224B2682l170k671j306l7058k1958m0798K3341M2173N0490K5372k258k8312
12212B6527j1604K506l2185j6267L6653K2878q138m078L7565j3736k7934o16L509
12199A5080m952j066N233k7957j3696L153L0463l61J6386k1188l524l1650l1458
12186f5537J2684K8575K872j8355j237N518K4666p480l8099R177L2167J9474K3410
12173B7835M0704j9845m7857m3860k3762n178O064N0135Q207k5949J9488o246
12161b0264j6075l9317L1515J4348j3384o150j847J2354K28p446L7808L1541j7605
12148E706j2004K0593K7378R187j5355m7543N9550J4484L241K9063k1158l9150
$$ y = [54465, 58154, 42149, 29144, 53488, 76256, 112868, 100458, 64259, 10346, -3896, 27467, 22682, 19512, 16841, 15535, -21523, -43481, -84279, -60938, -18765, 31725, 57097, 54839, 26527, 14923, 17429, -14756, -31023, 5630, 28508, 20370, 16292, 53857, 40121, 12187, 11571, 15080, 10128, 9062, 14295, -13662, -27358, -24205, 6258, 5897, 22283, 1095, -2429, -34079, -65537, -52853, -24278, -21406, -39761, -40998, -35480, -10814, -18294, -56393, -47216, -15049, 4425, 27835, 68539, 48694, 837, -43023, -66785, -71963, -65899, -15764, -7557, -33506, -14018, -20264, -36339, -75656, -44141, -29793, -43177, -49327, -51174, -38820, -38592, -46038, -8230, 23311, 5706, -6298, 14295, 41673, 50860, 35505, -12038, 47512, 61996, 65237, 94300, 73142, 33992]
12136C3992m882L6824O890J1816j6814j4736k4554K140n5109q328P524m2232m393
12123g1862O4956K9336Q1244J4915k9829l6821r894k8358k1568j3591j211M9768
12111B7085J6132k6826k6526K1547l0000J4672M1573J7914k1552k8294J07o214
12099c82J2561k2685J8588k4214j0406L0287q521N189M568k1685p577P667L5295
12086A8685M5213l4027l5144j3165j1923M8607M3168P258l4312r452k2202j1863
12074i157L3396r397j9006N402k708j0398k1267k3254K8233L7553P0063j1873
12062F7587j637j3049j8650l5295l8895J8575L7502J1840k9810k3747J4611J2726
12050A758K0398K2965K8949J6061n1134J1157J4450j2303m5073k4780O254J0669
$$ y = [33992, 29110, 65934, 72824, 84640, 67826, 53090, 28536, 30676, -24433, -32761, -25237, -67469, -71862, -6906, 22430, 103674, 118589, 88760, 51939, 42045, 13687, -7881, -21472, -22683, 27085, 43217, 16391, -10135, 11412, -18588, -3916, 37657, 55571, 34019, 5725, 5832, -382, 12179, -10506, 8082, -16132, -26538, 3749, -4772, 417, 4985, -16700, -24277, -16610, 18685, 63898, 29871, -5273, -18438, -30361, 18246, 61414, 68672, 34360, 24908, 2706, -9157, 24239, 14842, -4164, 1238, -1470, -11868, -33135, -56389, -28156, 9397, 79460, 67587, 65950, 52901, 34251, -1044, -39939, -21364, 16138, 27978, -1832, -25579, -10968, 1758, 22156, 45121, 74070, 90131, 38997, 50154, 64604, 52301, 7228, -17552, -11298, -629]
12038f29j9450M3821J8439k7117K4342K9836O68o577j7821n9352r73K0285J7414
12025B2886N3577k8282l3964J0128k7745O985L2759l2273j7009p385M771L3630
12013A8078j2397o462j4342K2756K4646J3206J3072l7465L954M1410J5997N620
12001H8073M5967r367o0724k0542p5180m0334K9109M3458L4010j9514n6221K5817
11989a5448M9117K574o7826J8904R3501M3490j2743n2106m2567l3310m3969k2275
11977h2658Q594L9912R0209L6258j270j6563j3521k1801k0927J426J405J9614
11965D0678k1828J8177O362j3193L453m698l0718k2544M785K0565J0168j5328
11953d121o190L2612J7152o532m619p943N309j3873L2482N0873m1134l7658N202
$$ y = [-629, -20079, 23742, 42181, 15064, 39406, 69242, 69910, 63333, 45512, -13840, -14813, 5472, 22886, 76463, 48181, 14217, 24345, -3400, 3585, 36344, 4071, -12938, -20323, -15552, 18078, 5681, -781, -15123, 7633, 32279, 45485, 58557, 21092, 25046, 66456, 82453, 88073, 134040, 124673, 63949, 43407, -31773, -72107, -42998, 460, 34470, 14956, -41265, -15448, 33669, 36243, -31583, -12679, 80822, 124312, 111569, 59463, 16896, -16414, -60383, -82658, -74064, -34152, 56057, 92315, 91045, 74482, 60961, 39160, 18233, 19659, 21064, 40678, 18850, 37027, 43389, 30196, 33649, 28951, -1767, -24311, -19526, 1039, 11207, -4121, -10311, 22301, 39453, 32921, 28302, 20359, 25668, 11795, 44277, 95150, 54016, 16358, 21560]
11940B1560l9989k6679L0012L5197N986j8819K6366j7625j4199L34K8065k1503
11928H706K6641N650l5113q158j9059M655L6196L0973l7760j0718L1294j1685
11916B1622q676j9897L0714j2802j4926K201k7558Q379K7500J4028l0706j7543
11904b7664l2646Q591J8065J4247j6280J7306m3882L8439N1999P754m0190n1610
11892e5871k0030J72l565J1632M7058R962j748o687p513L2959L228j7050k6776
11879c4229J4348L3586J1786j1080k8033p678J1883l078J3749l3261k1842P512
11867d6337J8840K8743p316k9211l563L18K0410L1537j4842j5934N950j5660q162
11854c5227j4233P996M6906J8674j8389R39m0948m6161J2894J2564J207n2958
$$ y = [21560, -18429, -45108, -15096, 20101, 26087, 7268, 33634, 16009, 1810, 2144, 30209, 8706, 35347, 40997, 5884, -2274, -21333, -16678, 19518, 50491, 12731, 2013, 33307, 21622, 12946, -6951, 23763, 10961, -3965, -1764, -29322, -20943, 6557, 20585, -10121, -27664, -60310, -51719, -33654, -19407, -35687, -18381, -62263, -23824, 28175, 35929, -4261, -55871, -75901, -75729, -79294, -67662, -20604, -10642, -12390, -19077, -26590, 6369, 9597, -7453, -34229, -19881, 13705, 25491, 14411, -13622, -21300, -9417, -12495, 1254, -32007, -53849, -46337, -27497, 1246, -6070, -35281, -38844, -38526, -18116, 13421, -1421, -17355, -11405, -27065, -35227, -49460, -41464, 5442, 24116, 5727, 6666, -34282, -80443, -67549, -54985, -53778, -106736]
11842a06736k3188M0927L4538K8823L2535m0121J6245M0777k0202j3477L4292
11831B4413K3939Q137P110k9650j9909O77j3381Q824m4014l7979Q358K7759M5966
11818A0250p137q2931l7871Q1876N0940J0544r355q844M10J5225o989l216p523
11805E379J512L2364J0367j9158n863M2799M0090M668n3774l952j45j2535Q115
11792D9867k2759l9394j760k0946p703l0188j4682L1879N4895O743q138J5182
11780A2996o41m0629K2239L2265j0383K1278L7549J662m3154n3725k2256J7744
11768b5055k8058J8494M4747n23Q252J528P488R430n012J9961l571k718J0339
11755E5302k0454k4645K0709R628p995p8188j0800J4428L8223L2715j2833q264
$$ y = [-106736, -129924, -88997, -54459, -25636, 6899, -33222, -16977, 23800, 3598, -9879, 24413, 48352, 56489, 63599, 33949, 14040, 14717, 1336, 10160, -33854, -71833, -63475, -35716, 10250, 3113, -79818, -117689, -35813, 15127, 25671, 16316, 7472, 7882, 23107, 16118, 12902, 5379, 6891, 39255, 49622, 30464, 24601, 67400, 107490, 112158, 58384, 54432, 54287, 41752, 49867, 27108, -12286, -14046, -34992, -42695, -72883, -87565, -55686, -791, 5952, -2186, 12996, 12355, -28274, -6035, 26230, 15847, 37125, 74674, 76336, 33182, -20543, -42799, -25055, -53113, -34619, 10128, 9605, 17857, 19385, 26873, 36303, 31291, 51252, 47681, 44963, 55302, 34848, 10203, 30912, 40540, 32545, -45643, -56443, -42015, -3792, 28923, 16090, 7826]
11743G826n471K0055k2789m707j561J4196m2504m1128J0099N6834L2521k2123
11731A248q771J4376P279k999P111r539K2705M524k1495j4458l3085k3818J8044
11718c8878N0123J1898m2573j6138R643n87L493J0292J5575l1730o6295j1568
11706a06745K6334K8304N557L1484N2727J8812q8336k4670O1147J1133l2867k8213
11694d5333N510L9282J3087j4376r124r470l153K0848m866k1889N167N472j4550
11681c3395k2648J7297J8521j0496L3833L5581J9936M0L620j7115k3151N724j4339
11668A3408l2741m854p76J5453k17R816o565J1770O033R137q959J9423J1481n2810
11654a0401n8289k3162R392P1952N4935p407p160k3090j1193J3591k6080j697
$$ y = [7826, 2355, 22410, -379, -5086, -6647, 7549, -34955, -76083, -65984, -9150, 23371, 1248, -7523, 6853, 14132, 11133, 18244, 8705, 31410, 35934, 14439, -19, -33104, -56922, -38878, 11245, 23143, -19430, -35568, -25925, -26512, -23019, -12727, 2848, -28882, -95177, -106745, -80411, -52107, -46550, -15066, 37661, 56473, -31863, -56533, 4614, 15747, -17120, -45333, -39823, -541, 12546, -1830, -10954, -20424, -23577, -2729, -7595, -29484, -24317, -18845, -33395, -56043, -38746, -20225, -30721, 3112, 38693, 58629, 58669, 62289, 45174, 22023, 27747, 13408, -19333, -24187, -24963, -9510, -9727, 89, -6476, 5294, 11327, 20464, 11505, 30928, 42409, -10401, -68690, -91852, -82460, -10508, 44427, 37020, 29860, 6770, -4423, 9168, -16912, -18609]
11642a8609K2388J9070j2058j9449k8699r543P894R048J0414N1985N354n1675
11630a3880j6728J7751K2988K6118J401k7690M0980j7461m5472l850L0024K7908
11618D2089p3097m1656N1756o002J2318k449K627K2062K276K3413L7509n3433
11606A7413q6304o2824O0174L0554O199L435K1209N0488k6960m5281J6863j1566
11594b6600M360M1784M2421k2556l0722R319J4256j2931j9018J021l9357k8501
11582f6524k4547K1620M7465O1213J2199o0621n6696L5473M6928J1364L444j5477
11570A5841o452K5654J8027k4522l5737l318o274l992l4300k2398j5611J7557
11558g5525N1570K8573J1335k702L739l2351j7636o430k3445M6404J6389o0893
$$ y = [-18609, 3779, 22849, 10791, -8658, -37357, -46900, -39006, -29958, -19544, 32441, 37795, -13880, -30608, -12857, 10131, 36249, 37650, 9960, 50940, 33479, -11993, -15843, 14181, 42089, -31008, -72664, -20908, -26910, -14592, -17041, -14414, 7648, 9924, 33337, 70846, 17413, -68891, -131715, -71541, -40987, -34788, -31353, -10144, 40344, 13384, -31897, -15034, -26600, -22240, 19544, 61965, 39409, 8687, 18006, 32262, 19331, 313, 1334, -38023, -66524, -91071, -69451, -21986, 39227, 51426, -9195, -65891, -30418, 16510, 27874, 31318, 15841, 9389, 35043, 53070, 28548, -7189, -10507, -16781, -20773, -55073, -77471, -93082, -75525, -23955, 4618, 15953, 13251, 16990, -15361, -32997, -39427, -62872, -16468, -79, -60972]
11546f0972j6671M999J8831K9523K5672Q055n8613J1834K9321J0214J0979j6938
11534c766j0656l091J1833J1956K5679K729k8017o040J288j823l0474L0418Q2364
11521H2400J0546n316l2147k7492k50j4158n8026P785M020M4077K2753L1747L4681
11508A00620P671l9938n1327m0936L0713N4812L6081m1019m2194l1438N3430L6448
11496G2923O951l6392k9654J9241L6821k9811k2594K6451N340l1663m3545K883
11484b3049r088M340o181m25J8518N040L1448O124n3148J5525j3583M164k6966
11471d7281m797Q475M2770J0151J3143l261J0733J7371o9215J00L3151N5218r554
11458E7004o3253L139J1276j7151q712r692l0937j7224M3260R8432N371n2996
$$ y = [-60972, -77643, -72644, -53813, -24290, 1382, 9437, -49176, -37342, -8021, 2193, 13172, -3766, -14422, -17513, -5680, 6276, 31955, 34684, 6667, 627, 1915, 92, -30382, 36, 82400, 92946, 87630, 55483, 27991, 27741, 13583, -44443, -36658, -32638, 11439, 34192, 65939, 100620, 108291, 68353, 17026, -23910, 6803, 61615, 97696, 56677, 14483, -16955, 36475, 72923, 79874, 43482, 13828, 33069, 69890, 40079, 17485, 43936, 49276, 17613, -25932, -23049, -32137, -27797, -33978, -34403, -15885, -10845, 20603, 26727, -26421, -10896, -24479, -20315, -47281, -52078, -43603, -833, 9318, 22461, 19200, 29933, 47304, -21911, -21811, 11340, 66558, 57004, -6249, -3110, 8166, -8985, -17697, -27389, -58326, -75550, -32290, 66142, 71513, 18517]
11446A8517m4359K1648l9312J9650K2558o4355J1494O9334K2336k5461k7246j6233
11434c1429l596M1216k0931r126j0194J2469J7537L3798J8019k3626o745j2035
11422E357j783J7264r917o277j1516N112l3299J871M8540m685k3186J499n523
11409a6543K9418J0759j1774k7110Q368m803K1272j7939q906M4392J2938r314
11397C0758k9986k0483J5221j0903o2842L9451J6006p389P72M0647r53k1420M4698
11384C3577q344l6249q760M4670J6791J0959J0232L6949k9647l7248j0492l7916
11372a5478o6515k4818N4449M6548K6581n901l9376J2393K5302j0291R903j695
11360A1102J4507J2839m963p72M3852j5517k8591L9721l9429k6093m065L685J840
$$ y = [18517, -25842, -4194, -43506, -23856, -1298, -65653, -54159, 15175, 37511, 12050, -15196, -31429, -35025, 6191, -14740, -23866, -34060, -21591, -4054, 29744, 47763, 24137, 17392, 5357, 3574, 20838, 10921, 4644, -6872, -1760, -35059, -33188, 15352, 10667, -12519, -11020, -16543, 12875, 23634, 11860, -15250, -6882, -11685, 9587, -8352, -17258, 27134, 40072, 30758, 772, -19711, -4490, -15393, -78235, -38784, -22778, -30167, -29395, 11252, 10299, -11121, 33577, 25233, -11016, -19776, 24894, 41685, 52644, 62876, 99825, 70178, 32930, 22438, -15478, -81993, -106811, -52362, -5814, 20767, 14866, -24510, -12117, 13185, 2894, 12797, 11102, 25609, 38448, 33485, 32713, 76565, 61048, 32457, 72178, 32749, 6656, 2591, 6276, 8116]
11347H116n875J0329J0462K4904p377r906j0936k5270k1811M0500N1584j2402
11335E2318k9648j8295M0522l8928n5184K3025N39j7506K4513M979O346K2757
11323A5438N9420R906j8482k6287o0866j688o422K1960M0670j9123j2196J9288
11311B1618j995q117k1355j7933Q561M2959K1460l6638l1806L1482O575j74K0785
11298C5422n6739k0571J9590j602j6578N2593M2211j6524k0048k8964J0747J766
11286A303o472k9907p552J5677k072k523m1244k8404N179L6823L136M4951K434
11273h671J4824j0324K6410J0489n1896l4815N0189J5464j0230j8142J1569Q52
11261d281L8723l2952l3646l2190L2158L4363k705r043l7851n041k3753J3884
$$ y = [8116, 2241, 12570, 23032, 47936, 40559, 30653, 19717, -5553, -27364, 13136, 64720, 52318, 22670, 4375, 44897, 5969, -49215, -26190, -25651, -43157, -18644, -13665, -7319, 15438, 74858, 84764, 66282, 39995, -20871, -22559, -28981, -7021, 33649, 14526, 2330, 21618, 19623, 11506, -9849, -27782, -19221, 23738, 45198, 8560, -23246, 8236, 14811, 14637, 35422, -21317, -41888, -22298, -23900, -40478, 12115, 54326, 37802, 17754, -11210, -463, 1303, -5169, -35076, -42628, -26951, -29023, -31546, -72790, -101194, -96015, -59192, -56056, -11105, -8671, 6153, -4171, 22239, 32728, -19168, -53983, -3794, 11670, 1440, -16702, -5133, -4281, 34442, 1490, -32156, -64346, -32188, 2175, -530, -9573, -47424, -52465, -76218, -62334]
11249f2334L6834J1542J5388M488k0652j84M9235K9515J828j02899l8168O4298
11237a1109r36J7567K8580j7093o054O460j9874K0494m0035p325K6060M8892J8433
11224F4060J7147J1733k4756J0312O007J7560o050R49L038p0756J022J799k9425
11211B640P148M2606l7417p414k1430m3854K648J9511j1886l3443L4846K1766
11199b4279j2144K6644K4424o809r850n483J2449j5117P149j6152P09j8776j7574
11186e4809J0185k47N6219J6246l1060J0607R735j1626r537j6017L7167J0839
11174B7702p115l2479J9328K5256m3413n5543r424j4547N0325M3302l2271j0835
11162c9714K4334R929j5295j6320o491J8913L0097J2548j942m1775Q068K909J993
$$ y = [-62334, -25500, -13958, 1430, 5918, -14734, -14918, 34317, 63832, 65660, -37239, -75407, -11109, -12045, 5522, 34102, 17009, 10955, 17415, -2459, 18035, -22000, -29325, -3265, 45627, 64060, 81207, 92940, 68184, 78496, 84503, 102063, 96013, 96962, 100000, 29244, 30266, 32065, 2640, 9788, 52394, 14977, 7563, -13867, -57721, -55073, -35562, -47448, -80891, -46045, -24279, -36423, -9779, 14645, 7836, -2014, -7497, 4952, -10165, -3016, -19168, -18459, -37235, -54809, -44624, -44871, 11348, 27594, -3466, 7141, 16876, 5250, -4287, -20304, 16863, 27702, 20587, -11892, 7436, 32692, -10721, -66264, -75688, -90235, -39910, 3392, -28879, -39714, -15380, -5451, -20746, -37066, -43557, -24644, 5453, 18001, 16059, -25716, -17648, -14739, -12746]
11149a2746J0644K5937k9544k008L905J2117J0755j9474l6768K0929O5266r0k5143
11136B3780j9000j3488L0792K3380j8045m4818K5655K2701K7525P220l6851j4762
11124A4089K384J3560P3167j5189l82j8504K6364J3370o683l2856m1600m2328
11112a4608j7468J4366L0318P352J2005Q897r49K2814L516o5826l8887j6893J2254
11099d3109M2356j4739l15K977L4663K143j7988J3118L8582J8041K0452P890k8416
11086G5655j5614J189J4691L364m2989k7806j9071n214J4270k5866k9807K4030
11074c3168N5820k42n3203k3207Q398J4033J1034J8376L4220m0284k076L2702
11062B2403j467j9293j3627k2403r089j7810j0778L0240j1958j9534j0740k7469
$$ y = [-12746, -2102, 23835, -5709, -7717, -3812, 8305, 19060, -414, -37182, -16253, 49013, 48923, 23780, 4780, -8708, 22084, 45464, 27419, -17399, 8256, 30957, 58482, 65702, 28851, 14089, 16473, 30033, 103200, 88011, 87629, 69125, 95489, 108859, 102176, 69320, 27720, -14608, -32076, -17710, 12608, 19960, 31965, 40862, 39913, 62727, 66243, 417, -38470, -55363, -43109, -753, -15492, -15807, -12830, 21833, 23976, 5988, 19106, 57688, 75729, 96181, 104071, 75655, 60041, 61230, 75921, 79285, 36296, 8490, -10581, -15795, -1525, -27391, -57198, -33168, 22652, 22410, -30793, -54000, -45602, -31569, -20535, -2159, 32061, -8223, -10299, 22403, 20936, 1643, -11984, -34387, -43476, -61286, -72064, -41824, -53782, -73316, -84056, -111525]
11050a11525K5766J8565K7239J6430K9439K1624k0549k6920j6823n169J6901l997
11038b9019j6151J0385J4181r204k1759K0131K1403K9921o177j2670J7310m214
11026A4137j7131K8285K1365k0611q66j6320j5337N3495p206m4034l4074q52j762
11013d0911J6260L9746L981n0530n2207J2075K5345K4494j7459l6858k1287k2379
11001a19730n801O6897O0353J2956k6567j5686K8279N35J8343O389l5295l4966
10989d4293P062K4862k1274k926N670O137n081L493L927j6815Q924L9655m452
10976D889N122j8645j3872M526P850j601M8486o14m0006m2390J5792J7915L7429
10963B4881p273O552l401J6590K3818j108l460q188P001k1838j3847n961j18l8123
$$ y = [-111525, -85759, -67194, -39955, -23525, 5914, 27538, 6989, -19931, -36754, -41923, -25022, -29019, -45170, -34785, -20604, -29808, -51567, -31436, -10033, 19888, 13711, 1041, 18351, 14137, -2994, 25291, 46656, 26045, 25179, 8859, -6478, 47017, 39811, -4223, -38297, -39149, -40911, -24651, 15095, 19076, -31454, -83661, -71586, -46241, -21747, -39206, -76064, -97351, -119730, -125531, -58634, 1719, 14675, -11892, -27578, 701, 1236, 19579, 25968, -9327, -44293, -37231, -12369, -33643, -36569, -30899, -24762, -29843, -26350, -22423, -39238, -30314, 9341, 4889, 10011, -8634, -22506, -17980, -10130, -11731, 36755, 36141, -3865, -46255, -30463, -12548, 24881, 17608, 24160, 20759, 37349, 61167, 60059, 56599, 48411, 55412, 33574, 19727, 13766, 13648, -24475]
10949b4475l4376J7281k21L0400M6847J2017P39j44J1117l3243J788K417m959
10936B5188J6785k0679j3281K0837j1856m8891Q985N2771J5915j3194l2590j3345
10924a3355k1924k218K6958M1192L9638l914l1338l126J669Q223j2752l1341l8218
10911d0506j3090k3983M8979K1525n659J1080k1472o2M737l1468Q481M477j1622
10898d8583K2238O40J2645m305j3042K5046j6729j0548j5955j9306K1211M4076
10886b612l7802k0458l7911N1494O139J2272l7067j5377N3643M1821q033K8078
10874C4187J413J9986Q421j7141l5728j9290O739N0300K8902k3055o4309o292
10862a5867J8529M070Q746J5769L6434j3251j6988r654L6115O730m3070j0177
$$ y = [-24475, -58851, -41570, -41791, -11391, 35456, 47473, 48212, 48068, 59185, 25942, 27730, 30147, 25188, 41973, 21294, 8013, 28850, 16994, -31897, -22912, 29859, 45774, 32580, -10, -13355, -35279, -37497, -10539, 30653, 70291, 66377, 35039, 31913, 33582, 41805, 29053, -2288, -40506, -53596, -77579, -28600, -7075, -12734, -1654, -23126, -23188, -18451, -49919, -41438, -36961, -48583, -26345, -25705, -13060, -17365, -30407, -5361, -22090, -32638, -48593, -67899, -46688, -2612, -40414, -60872, -98783, -47289, -41150, -28878, -65945, -81322, -27679, 14142, 6109, 34187, 35600, 55586, 64007, 46866, 11138, -8152, -1413, 48887, 77789, 54734, -9575, -15867, 2662, 6732, 15478, 31247, 67681, 54430, 37442, 27788, 63903, 70633, 27563, 17386]
10850A7386j905k4718J9431K8321O602J6101k344k5373j3097j6916r510k9992
10838c6014m6022j2922r12J5782j0440L1972L7218M326j4300n6409k1633J9960
10826h9394M0663O3810O04k6085l4923L9847J8603J3466o605J1158J0951q285
10814C3810R035m9377m8926r863j5029J9605K1722J4573M163L6028M5108j996
10802E8853m0513k3687J421k40R448j5905j6534j434J6929L9400n001l847q418
10789A0472l9393n555N108L0011l4734m2400k7498O8438N062P98O212m206Q177
10776a9508k1730J321k4228m2022M5239L7396j2743N0485K9988k0693j5196K0677
10764B8986O081l4694j4001Q858K8395p109N993K9439l3538l6641r512O366k5040
$$ y = [17386, 15481, -9237, 10194, 38515, 45117, 61218, 58874, 33501, 20404, 3488, -6022, -36014, -82036, -94958, -95870, -80088, -90528, -58556, -21338, -17012, -31312, -87721, -109354, -89394, -48731, 15079, 15683, -10402, -45325, -5478, 13125, 26591, 19986, 31144, 42095, 33810, 42845, -6532, -55458, -65321, -80350, -60745, -39023, -24450, -20287, 15741, 60849, 58853, 18340, -5347, -3926, -4166, 5282, -10623, -27157, -28591, -11662, 27738, 22737, 18890, 10472, -28921, -34476, -29368, 643, -34091, -76491, -103989, -35551, -30489, -29691, -23479, -27685, -19508, -41238, -39917, -64145, -106167, -60928, -23532, -36275, 14210, 44198, 23505, 8309, 28986, 35067, 373, -13628, -4770, 23625, 16516, 22509, 51948, 18410, -18231, -27743, -21377, -46417]
10751d6417l3021J8782L5980K0583j606m5563K0926K4307K1473N4259K2154K9205
10739A21062j9529m3960j5935p237j3907n1776J355N595k8670J4121j3337j4559
10727f6777J5775Q485m50L0425J5928R188M2161l2786m6265J6081P669m0354k2772
10714f3692O6178K7859O455M139J2351k5386r118L7712L548l1266k1574K45l128
10701D323L5378L843n5892m8603o564N132J6859J5669j0315K9191O2163K4708
10689G5892k6833l0603o4j2882k5444n2617k3944J752L0061N4655K6401M283J3378
10676C4035K0638r948k1954J0200n2960m2817L1647N6569k9790n2558R455p183
10664e4666N29j185j7232K1011L9740l138M1808j3488J7689j4353j0041J1642
$$ y = [-46417, -79438, -60656, -24676, -4093, -5699, -51262, -30336, -6029, 15444, 69703, 91857, 121062, 101533, 57573, 41638, 34401, 20494, -31282, -29927, -24332, -53002, -38881, -52218, -66777, -51002, -42517, -42967, -12542, 3386, 12574, 54735, 21949, -24316, -8235, -566, -40920, -63692, 2486, 30345, 36800, 40939, 53290, 27904, 18786, 56498, 60046, 28780, 7206, 7451, 4323, 39701, 43544, -12348, -60951, -67515, -62383, -45524, -29855, -40170, -10979, 51184, 75892, 49059, 18456, 18392, 5510, -19934, -72551, -96495, -94743, -64682, -10027, 16374, 20657, 34035, 54673, 44725, 22771, 32971, -19989, -62806, -31159, 25410, -4380, -56938, -47483, -54666, -54137, -55322, -72554, -51543, -11803, -14941, 26867, 13379, 31068, 16715, 6674, 18316]
10652A8316n048n5177J4883L8800k3909j1061O165k0792r821j0649R851j4295
10640f2737K289L7762L9574j7608m4523J6316K2851k9374k6069L741J1551R952
10628c6275K1348j391l065J5728N1304J7082n3420k7184J9996q222k4235L1751
10616C417N3851l398m3728l0979j1765K9827m4296k1749L4339J3384Q070J5388
10604B361K0368o556j0530j384M272l2156J8171J7746L1028J7807k8034l5081
10592a988M7824J1376k5876k2480k5859j0567K530R495p687J8916k3058k2770
10580e0144r828L1043J8866l3776P356L6823J7760j014j1353k6589k3403k235
10568d6494K9643K5822L5515K9057o636m4488l2599L875L4621l0478m8019o731
$$ y = [18316, 13268, -41909, -27026, 11774, -12135, -23196, -17031, -37823, -47644, -58293, -48442, -62737, -60448, -22686, 16888, -720, -45243, -28927, -6076, -35450, -61519, -57778, -46227, -36275, -14927, -16318, -19383, -3655, 47649, 64731, 11311, -15873, 4123, -4099, -28334, 3417, 57268, 53870, 10142, -20837, -32602, -2775, -47071, -68820, -34481, -21097, -13027, 2361, 22729, 16173, 5643, 4259, 8531, -23625, -5454, 12292, 43320, 61127, 33093, -1988, 45836, 57212, 31336, 8856, -17003, -27570, -25040, -15545, -23232, -4316, -27374, -50144, -59972, -28929, -10063, -43839, -36483, 340, 18100, 17086, 5733, -20856, -44259, -46494, -16851, 8971, 44486, 73543, 66907, 22419, -10180, -6305, 28316, -2162, -50181, -56912]
10556e6912L877j2429j2310N3274L4886p434m0433Q704R391j6295o456k9284R135
10543f2286L8569J3620k1015m073K6901M662K3405q822j7077R168O218P442O620
10530B3332l9743k6166j6149j374K7216L475k1718m92N1345m6548Q939k0705J2705
10517d5883M1556J7348L8957K8922k9905m8558J6859M5746J1409k0966J8177j1931
10505F1731l6898k9153j2860P857K7387R688j2060l9235J6552L4388J0996m944
10493C3449k9094j0337K2754k1055k1187L5554M6134r597N760J493m1892L051
10481A5033k2187L560j3908k1504q581J6895k231k3240J4832M3316M4807J2557
10469E9349l6569j7872l3642n846R964N878J553J696l685j3512j8226R480J921
$$ y = [-56912, -53035, -65464, -77774, -24500, 10386, 2952, -37481, -28777, -19386, -35681, -42137, -71421, -62286, -23717, -10097, -31112, -35185, -8284, -3622, 19783, 10961, -6116, 3052, 9270, 16712, 23332, -16411, -42577, -58726, -60100, -32884, -29409, -51127, -51619, -274, -46822, -37883, -58588, -45883, -4327, 13021, 51978, 80900, 50995, 2437, 19296, 65042, 76451, 55485, 73662, 61731, 24833, -4320, -17180, -9323, 18064, 27752, 15692, -23543, -6991, 27397, 38393, 33449, 4355, -5982, 16772, -4283, -25470, 10084, 56218, 46621, 52381, 53874, 11982, 15033, -7154, -3594, -17502, -39006, -47587, -30692, -32923, -56163, -41331, 1985, 46792, 59349, 22780, 4908, -28734, -34580, -24616, -18738, -17185, -15489, -19174, -32686, -50912, -41432, -39511]
10456c9511K199K803o249k1490n323K6103K9298J9869k0008J1722l755k8625J3172
10443a9795J9125r70K6748k0608l1593J3872J8184K2682m4527k3590O232L3352
10431h88l763k0825P657l7J5649n6380q6431J2949K4258M0483N0333N510k5025
10418c6510k429K8432K3300m9004j1441M0850K127k0341p710K1599m719n3515
10406f9361J1286J5213L1059j6191J6649K9900n622l1915j3310j1896k4904J6358
10394e2734j2998N39K7198L2346L239m1762J4100L0393j7883j2756L659r880j3875
10381e0414J5305Q723q353L6193J6942n1012j0009K5696M4860l1089k1284J1271
10369a3171L4417J8259K2873n0589j5427q698M4149m4567j9264P494O6094P5274
$$ y = [-39511, -37312, -34509, -40758, -62248, -67571, -41468, -12170, 7699, -12309, -587, -4342, -32967, -19795, -670, -1640, 25108, 4500, -27093, -13221, 4963, 27645, -16882, -40472, -34240, -888, -4651, -25476, -17819, -17856, -2207, -58587, -145018, -132069, -107811, -67328, -16995, -11485, -36510, -38939, -10507, 12793, -36211, -47652, -6802, -4675, -25016, -32726, -11127, -15846, -69361, -58075, -42862, -11803, -27994, -11345, 18555, 12933, -18982, -32292, -44188, -69092, -52734, -65732, -65193, -37995, -5649, -2410, -44172, -30072, 321, -17562, -30318, -26659, -36539, -50414, -35109, -26386, -34739, 1454, 18396, -32616, -42625, -16929, 27931, -3158, -24442, -13171, 21246, 39505, 62378, 11789, -3638, -12336, 31813, -12754, -32018, -24524, 41570, 116844]
10357A16844m862n4016o8818l7668q072N8213N181l3859Q089o456j9755K4624
10345b0555m325k164L0528K0414l884M6224j1817o210J0311k9897l3426j9686
10333b4487K3848P35j4511k7594r851J7596K6010J6954m0577L885K845l9882p8
10320f5107N7664M1075m71K8415n225n735R417j1103m3050l9697L0561J1910l3046
10307b4392J759J4601N57J4554l5867j9653O192l4001Q479L2755o925L0817L8537
10294B7413m091m2239O588n284J2669K0761q793q869K7624K1794l326o898K1514
10281E8863j551k3844l3337k1334m469m731K7341M1385K8754l9079o3916l5136
10269g1054M5021p90L124P3722K4951O230l1565l8569o0887q223M9366K2349m2494
$$ y = [116844, 111982, 57966, -10852, -48520, -56592, 1621, 6802, -27057, -18968, -25424, -45179, -20555, -24880, -27044, 3484, 23898, 20014, 66238, 54421, 48211, 58522, 28625, -4801, -24487, -639, 96, -14415, -42009, -51860, -34264, -8254, 8700, -31877, -27992, -25147, -65029, -65107, -7443, 33632, 33161, 61576, 56351, 50616, 60033, 48930, 5880, -33817, -3256, 8654, -24392, -22633, -8032, -7475, 7079, -28788, -48441, -42249, -76250, -67771, -35016, -41941, -11124, 27413, 23322, -18917, -12329, -17613, -4944, 15817, 7024, -1845, 25779, 47573, 44247, 37349, 58863, 57312, 33468, 131, -21203, -25672, -30403, -3062, 38323, 67077, 27998, -35918, -71054, -26033, -26823, -23699, 50023, 74974, 81204, 49639, 11070, -49817, -58040, -8674, 13675, -28819]
10256b8819o327L3637k2923J0455J3274J4173k6354K722n445J065n668J4545P7610
10243G1945M192l7189l1306J1048k8051m194p84j2972J9400K0947k0762K4670
10231A6944K5737o404Q08q011j6310J3420l909l2285m4888J055N6565r705j9528
10218b6511K6272N4212Q320k2041l3962r148j5368N5017j788l4720k2319K3752
10206A716L2389k2604l6056j6810K5885N26m3134l7915j605o857N5618K7688J4496
10193f663K7346J2997q587O441l7073j4966J3106O567J2806M6M3385n43l131q785
10179D2946k6891o77J216M783k1379q940k6484l8083J3912N2618K5540l5861j460
10166a8760M630J8087J1187j0321J0458K0127J1321k7585k2222K6549J5310k6364
$$ y = [-28819, -35146, -1509, -24432, -13977, -703, 13470, -12884, -10162, -15607, -14542, -20210, -5665, 71945, 76137, 38948, 7642, 18690, -9361, -13555, -14339, -27311, -7911, 13036, -7726, 16944, 42681, 36277, 37085, 29074, 12764, 26184, 22275, -10010, -54898, -53843, 2722, -6983, -26511, -239, 53973, 62293, 40252, 6290, -2858, -18226, 36791, 35003, 283, -22036, 1716, 34105, 11501, -24555, -41365, -15480, -14954, -58088, -96003, -97608, -104465, -48847, -21159, -6663, 20683, 33680, 25093, 31534, -5539, -20505, -7399, -832, 11974, 12020, 55405, 54862, 51731, 42946, 16055, 15378, 16594, 21377, -2, -8942, -35426, -73509, -59597, -6979, 18561, -17300, -18760, -14130, 3957, 15144, 4823, 15281, 35408, 46729, 19144, -3078, 23471, 38781, 12417]
10154A2417k3311Q67l4900l575L6509q025k035k0339m3281k5351O2350M2696k1633
10141b7611K055K1511L699K66K3941K3163j0744J6010n6627j3881J1315L5565
10129B8662L9170M371m7879l0949L4422M3989l8767k5687L8194J5686k1824J7053
10117E6441k0833j6224l235J042J2592O682L1615m7343k1656q77P514J6782l7851
10104a5351n9423L9897J8623N614j8959r929K0022K3619j5947j731q902l0942
10092e3409J1792N4386l0191k4105p920k59K7704M2087m338J3274n8641k8319
10080e7939r995R79L0237j4246m7217K0639j3433J0168P208O960P609N322r988
10067f3696L7380j8455K76J2782j3673J3646J5498l92Q623J9779K4694k8081r307
$$ y = [12417, -10894, -10027, -44927, -48502, -11993, -20018, -22053, -42392, -85673, -111024, -48674, -5978, -27611, -25556, -4045, -346, -80, 23861, 47024, 36280, 52290, -4337, -18218, -6903, 28662, 67832, 72203, 24324, -6625, 27797, 71786, 33019, 7332, 45526, 61212, 39388, 56441, 35608, 19384, 16149, 17191, 29783, 36465, 68080, 20737, -919, -1796, 5718, 22500, -15351, -74774, -34877, -16254, -10640, -29599, -39528, -19506, 4113, -11834, -13565, -22467, -53409, -41617, 12769, -17422, -41527, -49447, -49706, -22002, 20085, 15747, 29021, -29620, -57939, -67934, -66955, -36718, -50964, -98181, -77542, -90975, -80807, -73599, -66639, -59030, -53708, -63696, -26316, -44771, -44495, -31713, -45386, -31740, -16242, -16634, -8011, 11768, 36462, 8381, -926]
10054i26n448k2987J8308L0015n676j9897k1974j5073j3897j1919n7470j3882
10042a40826K6758M6551L8854k111r34J8443k5137J403k2290l6930J2512M9814
10030c3893O831K1397L1885l3208l667j4763n4143J5105O6046M4980l4453l6180
10018b4063l4438m414L0230L0705J5285J3711K2775k726r166n368J8634l5489
10006A5676r81L3660j277J241j1692l0836M951k6174j9368L1271P8846L7199k3242
9993H9274n7481l4238M268k0563K7471J897J5238j991J6145m579K3485J3975L4903
9980A07804k5957q610p7478K2070K3349l9908n710J3404K5763j8354j9471J6070
9968A2972k0910j1749N654K7262R854j3092K9741L7522k3307k9416l6277L0090
$$ y = [-926, -6374, -29361, -11053, 18962, 13286, -6611, -28585, -43658, -57555, -69474, -126944, -140826, -114068, -67517, -28663, -30774, -31708, -13265, -38402, -36999, -59289, -96219, -83707, -33893, -27062, -5665, 26220, -6988, -10655, -25418, -79561, -64456, 1590, 46570, 12117, -24063, -58501, -62915, -32685, -1980, 13305, 27016, 49791, 47065, 37899, 32531, 51165, 15676, 14695, 48355, 47078, 48319, 36627, 5791, 10742, -15432, -34800, -3529, 75317, 112516, 89274, 31793, -2445, 1823, -18740, 8731, 10628, 25866, 23875, 40020, 35441, 58926, 72901, 107804, 81847, 73237, -4241, 17829, 41178, 1270, -4440, 8964, 34727, 16373, -3098, 12972, -7938, -19687, -14033, 13229, 23083, 9991, 39732, 77254, 53947, 24531, -11746, 18344]
9956A8344k498j3060Q605n984k1707K2077M1536k6833K5518l7901M511j5512r121
9943a2025k4300J5374J6132p929k5896M6659N8282L8179k3670j932M6177l2471
9931I2580m6901k3969J9884n7732n4896k0701L0210M8280l9078k6914M451K9184
9919d5602k3474L3766O2687L7099k3863l5444N272p880j623j1791r478K8934j1748
9906c145m7031j5750j6982k6710k3360P3251J9913j0438k0433N2871Q427K0397
9894A1010J5342L9679p3174p4983k886k5954J5164K2466O765j8643L1255K1106
9882c2853J7353J212j4363M679k107J2866m2334L7296L7426M4773o0002k9910
9870b5964j9590M5858K0137j9364M135M42k621n3202k2051J5368J5601L0657l274
$$ y = [18344, 15846, 2786, 11391, 5407, -16300, 5777, 47313, 20480, 45998, 8097, 12608, -2904, -12025, -36325, -20951, -4819, -12748, -38644, 8015, 66297, 104476, 80806, 78874, 125051, 92580, 45679, 21710, 41594, -16138, -71034, -91735, -61525, -13245, -52323, -79237, -74786, -45602, -69076, -35310, 27377, 64476, 40613, 5169, 10441, 2561, 938, -10853, -20331, 8603, -3145, -50176, -65926, -82908, -109618, -132978, -59727, -39814, -50252, -70685, -17814, -9387, 11010, 26352, 66031, -7143, -82126, -85012, -110966, -95802, -73336, -66571, -85214, -53959, -32853, -15500, -14288, -28651, -23972, -26079, -13213, -55547, -18251, 19175, 63948, 3946, -25964, -45554, 304, 20441, 1077, 5212, 5654, 3033, -50169, -72220, -56852, -41251, -10594, -13868]
9857a3868J032l2859k4717K456L9167Q105Q317L4736K5813q666J7198k1664l2660
9844B390K5467j459j7643J4131q143n577L5773m135m5980m0962l0428K8498J0882
9831c7186J5078M122l2811L1109J4583p838q677j2096J5813K697L1939R383J7870
9818D3986l0724J7169K7258j8898n005j7372k4430j8000j6773K3575K8395o025
9806C156J5124J1844l5313j8633R794j0871j584J5354N116M5322J2725k1735J858
9793C2157M1953j5779p855J8174k2201m0879J7071L4031j1323k0585J5341J592
9781D1697n246l0613m5133k5467k1964m0485J2966L1974K6798M2231K1487J2966
9769B1211J6980K1884J4711n1137m6799l0560L3481K5061k7996M0100L4750q104
$$ y = [-13868, -12836, -45695, -70412, -67956, -28789, -20684, -12367, 22369, 48182, 39516, 56714, 35050, 2390, 27857, 26398, 8755, 22886, 14743, 9166, 44939, 40804, -5176, -46138, -76566, -48068, -37186, -22108, -17986, -50797, -19688, -5105, -12943, -21620, -33716, -17903, -15206, 16733, 26116, 43986, 13262, 30431, 57689, 38791, 33786, 16414, -8016, -26016, -42789, -19214, 9181, 3156, 18280, 30124, -5189, -23822, -14028, -24899, -26483, -11129, -6013, 39309, 52034, 30299, 32157, 74110, 58331, 50476, 68650, 46449, 5570, 22641, 56672, 45349, 24764, 40105, 41697, 36451, 5838, -39295, -64762, -86726, -127211, -114245, -82271, -55473, -13242, 8245, 21211, 38191, 60075, 74786, 23649, -23150, -53710, -20229, 4832, -23164, 16936, 51686, 43582]
9757D3582j2440l0397j8259j0451M592L2934o031o186K8602K122k5394l1461j5180
9744d3967j1242J6090J2617j6907k0201K6448k729J837R120K8144j2039n0835
9732f3664J6546L4941M7726J697o60J2436K8780j7533k8267p852K1225K7428k9083
9719D3720n7699J792k5068Q429k1554K6198Q4190L9446l5913l4175J5804J481
9707D6651J1265M175n695l3044m2697K3677K669K3783L3165m8005n5173k5774
9695f5003j4822l781M7168J0278J6313L1329M549m364m3876k0520k9510L3368
9683c8871K1716j163J2073L5282J0457l0482j7649L4780j1438P225L6949k8113
9671C0766m2605k3853J0444J5680j3958K5394j0297J383P434K4804J4354Q4k3465
$$ y = [43582, 31142, 745, -17514, -27965, -23373, 9561, 3530, -2656, 25946, 28068, 2674, -28787, -43967, -55209, -39119, -26502, -43409, -63610, -37162, -39891, -38054, -28934, -790, -12829, -63664, -47118, -12177, 35549, 37246, 36586, 49022, 77802, 60269, 32002, 24150, 45375, 72803, 43720, -13979, -12187, -37255, -28826, -50380, -24182, 60008, 99454, 63541, 29366, 45170, 46651, 57916, 62091, 56396, 23352, -19345, 4332, 7001, 30784, 63949, 15944, -39229, -65003, -79825, -83606, -36438, -26160, -9847, 21482, 26031, 21667, -22209, -42729, -72239, -38871, -17155, -18318, -6245, 29037, 39494, 9012, -8637, 26143, 14705, 21930, 58879, 30766, -11839, -35692, -25248, -9568, -23526, 1868, -8429, -7046, 388, 25192, 39546, 39630, 16165]
9658A6165m0368P975L4347L2323O69j6687l1984j1558l6619Q906K3764P86L2685
9645B0404L4733m0892p093P037j7986j0974K5910L3436N138n8739L3265j83k7147
9632c091J202J6456L3840K9808J9626K5957l5735n3764q337j1748q160l8163K0820
9619a1289L5331Q489k8605K307k2916k3997M3825L8431k7999j3293K1706l561
9607A8429K081q141n365K428m600j322J0783J2311l6942J2026L2951M4681J8196
9594I7516k6165l3535J9675k797m4925K5411L0368K3499j8207p738J2848k5057
9582E0893j4059k2870k1661j4375M4475M6142K6132l4558m3794J3560p091R460
9570C2254J8784j1069J2593j0980k3957J2602M6504J7071j702m1511l7461P434
$$ y = [16165, -24203, -16228, 18119, 50442, 51111, 34424, 2440, -9118, -45737, -36831, -13067, -12281, 20404, 55137, 14245, 7152, 14189, -3797, -14771, 11139, 44575, 49713, -9026, 24239, 24056, -3091, -1889, 14567, 48407, 78215, 97841, 123798, 88063, 34299, 25962, 14214, 6054, -32109, -11289, 24042, 32531, 3926, 6233, -16683, -40680, 3145, 41576, 13577, 284, 21990, 18429, 20510, 12369, 7004, 9432, 4832, 3510, 14293, 26604, -10338, 1688, 34639, 79320, 97516, 71351, 37816, 57491, 54694, 9769, 35180, 65548, 89047, 70840, 63102, 75950, 50893, 36834, 13964, -7697, -22072, 22403, 68545, 94677, 60119, 16325, 29885, 22794, 32254, 51038, 39969, 52562, 41582, 17625, 30227, 76731, 93802, 92100, 50589, 13128, 20562]
9558B0562M2782M155k4536K1029k8445q768k205J0966J0669k677K0990j8059q0800
9545c4337o9117M8556Q675N1284N5595k2143J2285m28K604j6803k2717J4048j145
9532B6357m685K7189J6083N611m7754m3424j618O5456L0570R61j9787j8665l811
9519C2483J7439l2921J368K3096O3452m2070n7170K2616K0347j7770M524n695
9507B9699N687j3782j5476N5862K7673j733p099k667K1422K7185J3933r656p7631
9494E3417l2457K1107L0683p487j0677K7906L5443j5966R494O17m1312m522M0228
9481A06474J7370J196j8718j2266R36k2374j3737K5852K1838k0530k860j0432
9469G2749R681k997Q817l480j9296M2113J1654m1785N636M5319O2465J5686l4801
$$ y = [20562, 63344, 67499, 42963, 63992, 35547, 26779, 24574, 35540, 46209, 43532, 64522, 46463, -34337, -103454, -54898, -46223, 5061, 60656, 38513, 50798, 50370, 52974, 36171, 13454, 27502, 26357, 21672, 48861, 64944, 70555, 22801, -20623, -22241, 43215, 73785, 74746, 54959, 36294, 32483, 49922, 17001, 18369, 41465, 104917, 62847, 5677, 28293, 48640, 30870, 35394, 29699, 35386, 21604, 6128, 61990, 89663, 87930, 80831, 78164, 99586, 126771, 140704, 131048, 53417, 20960, 42067, 72750, 65263, 54586, 82492, 117935, 101969, 111463, 112080, 70768, 66246, 106474, 123844, 125040, 106322, 94056, 94992, 72618, 58881, 84733, 106571, 86041, 83181, 72749, 82430, 79433, 88250, 84770, 65474, 107587, 119241, 77456, 83092, 128411, 190876, 206562, 171761]
9456A71761k2529m0820j3544n1679r978L5298K3689K2290J114j5807J673P931
9444A09399K1817R410J6926K9938J7889k8841n5062l4208k3011P0479J6163L097
9432A53996j9678j7126k1581Q320k511p243k190J8606O429J2821K5989j0139n3597
9419I2096L6509l011J3582J2297j1164K0053M6727L1943Q70J1936O146J0839K0642
9406B89465j7240J1916o215o895K5363M0144k0085k4762j5031k588R480p396J5870
9393B92026K9870p440l3460j4243M4820L0690k274n2069j4962M486J1575N6999
9381C46018m981j9149O1155K5606L0519l58J1525j3009m0351p6299q305P0190
9369C82561N1285O9104m731k8029L5379L7603J6608n1894p0747L1239K9917J4441
$$ y = [171761, 149232, 108412, 94868, 43189, 33211, 68509, 92198, 114488, 115602, 99795, 101468, 109399, 131216, 140626, 157552, 187490, 205379, 176538, 121476, 87268, 64257, 134736, 150899, 153996, 134318, 117192, 95611, 103931, 101420, 94177, 91987, 110593, 117022, 129843, 155832, 145693, 92096, 128605, 125594, 139176, 151473, 140309, 160362, 207089, 239032, 239902, 251838, 257984, 268823, 289465, 272225, 284141, 277926, 271031, 296394, 336538, 316453, 291691, 276660, 274072, 283552, 276156, 292026, 321896, 314456, 280996, 266753, 311573, 342263, 339989, 287920, 272958, 277444, 289019, 346018, 341037, 321888, 383043, 408649, 439168, 438810, 450335, 437326, 396975, 320676, 312371, 382561, 433846, 502950, 498219, 470190, 505569, 543172, 559780, 507886, 437139, 468378, 498295, 512736]
9357E12736J5112L9788J5330L2936j0803o119Q14K5237l2371j8547L2417L0242
9345F36772j946J6925L2473R357K9516O766j9985k817L3000M4930L8639o012K9047
9332H46665N4704j0324J7081L2143Q03K9906J8762J1159r123M2236L2775J2634
9320A079421J9634P526J1864J6178K0909l64L1311K3253M3378n806l5459k2613
9308A189232L6196K9330M8606J910l6468l8943j8500j0597K7756J261L5214L8605
9296A303602O353k83k2918P724m8458l3697j3226j5924k3047q74N0727K7144R2
9283A237215k1782k486l0772l4375O864L583j261m3842m0901m8883k8185l990
9271I91185k229j2908k2305J1719P377k4098J860j6050L120k9397j8501k2250
$$ y = [512736, 527848, 567636, 582966, 615902, 605099, 598980, 599794, 625031, 592660, 574113, 606530, 636772, 634826, 651751, 684224, 693581, 723097, 729863, 709878, 707061, 740061, 784991, 823630, 817618, 846665, 901369, 891045, 908126, 940269, 941072, 970978, 989740, 1000899, 991776, 1034012, 1066787, 1079421, 1099055, 1106581, 1118445, 1134623, 1155532, 1155168, 1186479, 1209732, 1253110, 1247304, 1211845, 1189232, 1225428, 1254758, 1303364, 1305274, 1268806, 1229863, 1211363, 1200766, 1228522, 1229783, 1264997, 1303602, 1309955, 1309672, 1286754, 1294478, 1246020, 1212323, 1199097, 1183173, 1160126, 1159252, 1209979, 1237123, 1237215, 1215433, 1212947, 1182175, 1147800, 1154664, 1158247, 1156986, 1113144, 1072243, 1023360, 995175, 991185, 988956, 976048, 953743, 965462, 972839, 948741, 950601, 934551, 937671, 908274, 889773, 867523]
9259H67523l2808l6735n568M9725P322l4030k3950P861j3288m8230j3326j7198
9247G07298l5232j2941Q87k618r842O125k7918k1887N125K8355J6812Q432N101
9234F67697m9459m4981j1109k2351k5680m547J0649p197k2191l3333J0088M3893
9222E11479L3924j2888k5738n714m3020n273R796K1705l4926J9651j4600l7057
9210D17339l114j8000q937M829m499j3987J3458r690k0232J1857j5670l7662m7709
9197B67983K193N9165N2283j6280j7208L950k8314j0812K2876L0593k5178j4251
9185C27000L1034j2001k3575l2811j4827m561m6907L2191k929n518K8241q840
9173B66497m3938M669K4891p317j3883j7399m0228j2933K2437K5979K1105n555
$$ y = [867523, 834715, 797980, 792412, 842137, 849459, 815429, 791479, 799340, 786052, 737822, 724496, 707298, 672066, 659125, 660012, 657394, 647552, 653677, 625759, 603872, 608997, 637352, 654164, 662596, 667697, 618238, 573257, 562148, 539797, 514117, 509570, 520219, 513022, 490831, 457498, 467586, 511479, 545403, 532515, 506777, 501063, 458043, 452770, 462566, 484271, 449345, 468996, 454396, 417339, 414225, 396225, 387288, 392117, 387618, 373631, 387089, 377399, 357167, 369024, 353354, 315692, 267983, 270176, 329341, 381624, 365344, 348136, 352086, 323772, 312960, 335836, 366429, 341251, 327000, 358034, 346033, 322458, 289647, 274820, 270259, 223352, 255543, 252614, 247096, 275337, 266497, 222559, 227228, 252119, 244802, 230919, 213520, 173292, 160359, 182796, 208775, 229880, 224325]
9161B24325J0092j0474M239m077r467l7949J477K9183O610j6233m978k3087K0660
9148A90321K2186J3393q952k2212M764M4805O692k3247N638O08j9086n2682J6387
9135A78615L6769J40k6024k8194j7086K1158l057K4116j9371l9884l4376k7915
9123F4891L6372L3975l1L1463q757k7300R027J109j6418j463L499M1253J541j3723
9109A55438J3548M067j6430j7210j6165K2977K0165J6661o452K401k2807J3631
9097A69824J9140m2211l3158m977r820j2239k1941j3301L517J6323K7216Q556
9085A06929l4509m2395N0122Q140L543J2131K27J5986J0967k8710p093J329q376
9072H8291P609R367L0939o278m9363n1747N4666m824m0439L2675J1650p447O6493
$$ y = [224325, 234417, 223943, 228182, 224105, 214638, 176689, 178166, 207349, 213959, 197726, 192748, 169661, 190321, 212507, 225900, 216948, 194736, 199500, 244305, 250997, 227750, 233388, 233996, 214910, 162228, 178615, 215384, 215524, 189500, 161306, 144220, 165378, 162321, 186437, 167066, 127182, 92806, 64891, 101263, 135238, 135207, 166670, 157913, 130613, 139640, 140749, 124331, 122868, 126367, 167620, 169161, 155438, 168986, 173053, 156623, 139413, 123248, 146225, 166390, 183051, 176599, 179000, 156193, 169824, 188964, 146753, 113595, 108618, 98798, 86559, 64618, 51317, 54834, 71157, 98373, 106929, 72420, 30025, 80147, 88287, 91830, 103961, 104188, 120174, 131141, 102431, 95338, 96667, 88291, 95900, 105267, 136206, 129928, 80565, 28818, 83484, 78660, 38221, 70896, 82546, 75099, 141592]
9059A41592J0630m1560l8406J7027N591l3P553l4633K9037J1893K2285j5872m6062
9046F9042L0359K1936J4312o047l2803K4554q89l4440j8799k8010k0178p854J2162
9033B3345K5175K1633R90j7770j6136L5296K0929K0839k6904k3527K5286j214
9021H7942l2252K4752n903m041J8158Q763J1654r93l9520m3630K0844M0982j7984
9008F8772l677r06k7402J3846L0942R776k735J1881k8143L196Q415j4888M033
8995G3110O731n1468m4946n074L8989K4051K8047o801m5539m3983o2185N9753
8983b9315M2431R491k2888k3980K5886N5716K0143p44m5235J7879J2180j6591
8971D4973K3790L6708O244l2368r8683n717K303l8823M6711L3930p577L8910j5586
$$ y = [141592, 152222, 110662, 72256, 89283, 94874, 94841, 102394, 67761, 96798, 108691, 130976, 115104, 69042, 99401, 121337, 135649, 129602, 96799, 121353, 120464, 86024, 67225, 39215, 19037, 11183, 23345, 48520, 70153, 71143, 53373, 37237, 72533, 93462, 114301, 87397, 63870, 89156, 87942, 55690, 80442, 74539, 70498, 88656, 97419, 109073, 108080, 68560, 24930, 45774, 86756, 68772, 65095, 64189, 36787, 50633, 81575, 91351, 88616, 100497, 72354, 75550, 83965, 69077, 73110, 79841, 28373, -16573, -21647, 17342, 41393, 69440, 62639, 17100, -26883, -89068, -29315, 13116, 22607, -281, -24261, 1625, 57341, 77484, 76740, 31505, 49384, 61564, 44973, 68763, 105471, 111715, 79347, -19336, -25053, -22750, -61573, -14862, 19068, 11491, 50401, 34815]
8958C4815P970L1985r988j149M8932j7295n4610l6045o8876P889K1596K0900k3810
8945c7686j4160O482L5600K1175P749K645j4456m2767j7735k5968L0548L7811
8933a0762k1771l6717R569P046N9220K9246N865p266O117m6848J2155l51l0494
8920b4991L241J1709p93j4940n439J2304j3593k732j5813o620N092M795j199j4697
8906f3676L183K0263J2892K8884J7676K906j4076K5697M7694M95r401l4317k649
8893C5571P855r19j1984j3769l6909p226N310K955J7214J7952P982j183L7126
8880E9975J3825k4609k6375k8565M304O845K5152k7538j2266j5436K7995K6890
8868C0197K2020r093k350j421k8783l5608k3290J9147k777R369M9413P3243n810
$$ y = [34815, 42785, 74770, 64782, 63633, 112565, 95270, 40660, 4615, -64261, -56372, -34776, -13876, -37686, -51846, -45364, -9764, 11411, 19160, 21805, 7349, -35418, -53153, -79121, -48573, -10762, -32533, -69250, -59681, -52635, 6585, 35831, 41696, 34430, 40547, -6301, 5854, 5503, -24991, -21750, -10041, -10834, -25774, -31213, -18909, -32502, -35234, -51047, -57667, -52575, -47780, -48979, -63676, -60493, -40230, -27338, 1546, 19222, 22128, 8052, 33749, 81443, 81938, 72537, 38220, 35571, 43426, 42507, 30523, 16754, -20155, -27381, -22071, -19116, -1902, 16050, 24032, 22849, 59975, 73800, 49191, 22816, -5749, -1445, 5400, 30552, 3014, -9252, -24688, 3307, 30197, 52217, 43124, 40774, 39353, 10570, -25038, -48328, -29181, -31958, -22589, 26824, 100067, 94257]
8855I4257n3936l3754j4982N64O2275L1260o738j4960l1933J921j2862j8256O801
8842I657J628r968N917J8871k9346l2152Q362K0412K7283L285R894K7402P786
8829F9031j9538l3673j3994q130r742L1079j2004j3712M4705j5807m1517j9262
8817d2564k1605J3826J7756K3519J2899L1664l3511l2310j3935j4800M897K8433
8805b5731K7118J9666j2727k2273R085l713j4658K5079N0486k801J7794O0567
8793A27892k589n5554P714l281j2498J965M7140j2492l9829j7003r705m2813m867
8780a5920q661N767q182n45O4648O1819Q4570J15264Q7430M0971K1138q102r6602
8767C43595q9443o2312p1315k6191k9646j7639o693j2368N360m73O886j3837k5196
$$ y = [94257, 40321, 6567, -8415, -7851, 54424, 85684, 78946, 63986, 32053, 33974, 21112, 2856, 9657, 11285, 1317, 7234, 26105, -3241, -35393, -27031, -6619, 20664, 23949, 33843, 61245, 69031, 49493, 15820, 1826, -6304, -16046, 15033, 3029, -10683, 34022, 18215, -23302, -42564, -64169, -50343, -32587, -9068, 3831, 35495, 1984, -30326, -44261, -59061, -54164, -25731, 1387, 21053, 8326, -13947, -4862, -8575, -23233, 1846, 52332, 49531, 67325, 127892, 125303, 69749, 77463, 74182, 61684, 63649, 110789, 98297, 58468, 41465, 31760, -11053, -15920, -24581, -18814, -26996, -27541, 37107, 98926, 183496, 298760, 386190, 427161, 448299, 440197, 343595, 254152, 191840, 120525, 94334, 64688, 47049, 40356, 27988, 33348, 32875, 39761, 25924, 728]
8754G28J5217M6793K8498p087N730R282m26k359n30l2243L061k1562N885M0607
8740I1594M1366o2l6090k3391L1321M6038K2760o034L9420J4411J6591J03395
8728C41319J90985J50093O2470K0130o9142j68402j67005q4406l4190m2177j0726
8717A88949j9136l0673l4890J1137K973p2247l6808L1884J0217K7753j2208K342
8705F9293L6818N7292Q985n9324j8116J6978K7984j0347j3226J3396j9198K6374
8693A36909Q896j0795k837r749M0856L845l0331L1010N0892P7970P1131o85k9221
8680C37891q007o6883p6330m5665l7220l3183o151J5320L2757M5712l470K2168
8668A76939l240k3366p0003k2657K5570K948K6183n028m2149j8539K9597q916
$$ y = [728, 15945, 62738, 91236, 84149, 89879, 99161, 98735, 96376, 95846, 63603, 66664, 45102, 50987, 91594, 132960, 132898, 96808, 73417, 104738, 150776, 173536, 167502, 206922, 221333, 237924, 341319, 532304, 682397, 744867, 764997, 695855, 527453, 360448, 276042, 241852, 199675, 188949, 169813, 139140, 104250, 115387, 118360, 46113, 9305, 41189, 51406, 79159, 66951, 69293, 106111, 163403, 172388, 113064, 94948, 111926, 139910, 129563, 116337, 129733, 110535, 136909, 145805, 135010, 132173, 122424, 163280, 167125, 136794, 167804, 218696, 296666, 367797, 367112, 337891, 329884, 263001, 186671, 141006, 103786, 70603, 64452, 79772, 112529, 158241, 154771, 176939, 173699, 150333, 80330, 57673, 83243, 86191, 112374, 107346, 65197, 46658, 76255, 67339]
8656F7339j8553o397k0515j1756K6260K0877K3607K1764j6930l0526j4278J2585
8644E3477L9152O479j3951n126K8095J6447n432k9463m3552K8392N900K449K4769
8631A07636L0507q2474n6347J988M0039N6706K5582M600L9233M7730O1951J03576
8619C80727N3246L2122K3479m8171j86105j31329l0569k0233k1697M6713K7369
8608A25552O572j993m2370J9516Q094n8662p512p871N5822N7668m5259p272j4406
8595H7879K1546J9647J7717j2184l6903k4852l2448k437K2667N1811R309j250
8583A20502K5286O5169R52j4585J6316Q9982J50282J90248J63512M0026n4704
8572G92986o8108j84572j92713n7647k5959k2500n5649o1136j5031J2850J3121
$$ y = [67339, 48786, 42389, 21874, 10118, 36378, 57255, 80862, 102626, 85696, 55170, 40892, 53477, 92629, 99108, 85157, 80031, 108126, 124573, 119141, 89678, 46126, 74518, 80418, 82867, 107636, 138143, 55669, -678, 1310, 41349, 98055, 123637, 128237, 167470, 215200, 277151, 380727, 433973, 466095, 489574, 441403, 255298, 123969, 93400, 73167, 51470, 98183, 125552, 132124, 130131, 87761, 107277, 115371, 56709, 49197, 41326, 97148, 154816, 109557, 102285, 87879, 109425, 129072, 146789, 134605, 97702, 72850, 40402, 37965, 60632, 112443, 121752, 120502, 145788, 210957, 211909, 197324, 213640, 303622, 453904, 644152, 807664, 847690, 792986, 724878, 540306, 347593, 289946, 263987, 241487, 185838, 124702, 109671, 122521, 135642]
8561A35642m213L7728k185m8713M67K68p932n6250k9534N10m306l0818J1429l456
8547a363N0245K4627k9344k5765L6543k476j2541k2529k6701j5531K5648M9889
8535E0702J2371R048N1107R1601O2827N8800N3269j7189o5882j08906n1083N266
8523A51931j4728k7499J8412L427K6315J854k2868k0999m1941J3310n392k8609
8511E3213q929M101J1910j4108P837j5224L2212J4902p674K8300k499j3273R671
8498A00439j6510j4219J7340M3646J2594o268m2578l4894m905l9999p402j6422
8486i178O734K7699j7676q215K6214L0343l555n140K4532r476j0342l4934k4450
8473g444k582l653J3357L9937k515M0835J1401K241j5672p201K6146l5284m0772
$$ y = [135642, 131429, 169157, 166972, 118259, 118726, 118994, 111062, 54812, 25278, 25788, 21482, -9336, 2093, -1363, 48882, 73509, 44165, 18400, 54943, 52467, 39926, 17397, -9304, -24835, 813, 50702, 63073, 72121, 123228, 214829, 277656, 336456, 389725, 372536, 306654, 197748, 146665, 151931, 137203, 109704, 128116, 131543, 157858, 159712, 136844, 115845, 73904, 87214, 81822, 53213, 44284, 48385, 60295, 46187, 54024, 38800, 71012, 85914, 78240, 106540, 104041, 90768, 100439, 83929, 69710, 87050, 130696, 143290, 137022, 94444, 59550, 54645, 14646, 7244, -9178, -2444, 25255, 7579, -636, 25578, 55921, 52366, 47226, 71758, 62282, 51940, 17006, -7444, -10026, -13679, -322, 39615, 37100, 77935, 89336, 91577, 75905, 68704, 94850, 59566, 18794]
8460A8794l4499j6696n673J9603M7145j9250j5217o508k4904j2567r49K6397N21
8447b3803L5717M1917J9855r464K0460L0443l4599j6101O541k3444m0543j1378
8435d399J1971l0134k2094M1081L4255M225j7132l4225N270O581n641n831k2660
8422c8733j1616K3148M6917J5392k8895N585m2841k0092K0251n422L179m252J8458
8409a8921R809O550j9332K092J3203q03j2272k4404K1366Q323r854J6075J4202
8396F034O720J2811k6911l2953j4826k090K2075j7849M3154N0936n376K06l193
8383C8738m0181o885J6943K1337k9085Q594j0100j2543J2498k9413m630J1587
8371b3140k968K5050K5737J7197j6050o1064m4952L2530J7484O66R242J3496Q215
$$ y = [18794, -15705, -32401, -38074, -18471, 28674, 9424, -5793, -12301, -37205, -49772, -50721, -24324, -23803, 11914, 53831, 73686, 64222, 84682, 115125, 80526, 64425, 70966, 47522, 6979, -4399, 7572, -22562, -44656, -3575, 30680, 34905, 17773, -16452, -11182, -4601, -10242, -16073, -38733, -50349, -27201, 19716, 35108, 6213, 11798, -31043, -51135, -30884, -36306, -33127, -37379, -18921, -9112, -2562, -21894, -19802, -6599, -7402, -19674, -44078, -22712, -14389, -24243, -8168, 6034, 12754, 25565, -1346, -34299, -49125, -51215, -29140, -46989, -3835, 47101, 41725, 41931, 38738, -1443, -8328, 8615, 29952, 867, 9461, -639, -13182, -684, -30097, -34727, -23140, -26108, -1058, 24679, 41876, 25826, -35238, -80190, -47660, -30176, -29510, -20268, -6772, 1443]
8358A443p705K3072L785m2654l7542M0581L5529m5528m1818K2916L7586K461j4866
8345b2740o61K2457K2691k0401n037K184j1184j6439N665J0664l0654M625J8954
8332a9876l298k8388j2528K0659L2863n329k3766j949M6986O152m2226o244L7004
8319F0N1969J638K8581P566k6683l7943j7888P500m2514r327K8811K7617m2547
8306b3160J1156M3806q819l5034j8382O823O3527M174k4609j5385Q807m5326k5770
8293e8192N794L3400J5447k472J964J0034K5354K4521J0446k5954m1211J2532
8281A1663Q513J8064j5114k155M7316J9488n3598p0406m8654J4179L0654J299
8269c8751Q668L9075O7425L6392J5158l7829l9422k3516j2212K3537l9314j2249
$$ y = [1443, -6262, 16810, 20595, -22059, -59601, -19020, 16509, -29019, -70837, -47921, -10335, -7874, -22740, -23401, -944, 21747, 1346, -3691, -1507, -12691, -29130, -23465, -12801, -43455, -38830, -19876, -23174, -51562, -64090, -43431, -10568, -15897, -39663, -41612, 5374, 11526, -30700, -36944, 60, 52029, 53667, 82248, 89814, 63131, 25188, 7300, 14800, -27714, -37041, -8230, 19387, -23160, -12004, 31802, 22983, -12051, -30433, -23610, 39917, 44091, 19482, 4097, 12904, -32422, -58192, -52398, -18998, -3551, -6023, -4059, 5975, 31329, 55850, 66296, 40342, -869, 11663, 20176, 38240, 23126, 20971, 68287, 87775, 34177, -36229, -84883, -70704, -40050, -38751, -30083, 8992, 76417, 112809, 127967, 90138, 50716, 27200, 14988, 38525, -789, -13038]
8257a3038J2927o195J9808k1615j3871K8338L5271k5155m444K484o1031j3903
8245f0424K7981J3311J8250l193L6212n6691k9503j44J5335j1569L5895L8301
8233B3761m6368k3898J5105L6145O024J670k6939J1052L503M9595K336L871L513
8220E9370R33k5240k3464m772J9498j6354k6956j0767M1978n063l5020J1570J0328
8207c959k8260k058L0219j4567j1277M2170J0656J2546K0092K094l824j9918K1762
8194E5676k5090m8163m816K9019k7378q56r302l1111j1163J8139K9014N3816j3271
8181A4514j2644l8627K0932k5265L636L5705k6155K0892k6424P839l3804l9808
8169i9209m305K7114N8556M0947J8073J3986J8809r790l5823l5227k0021J7662
$$ y = [-13038, -111, -6306, 13502, -8113, -21984, 6354, 41625, 16470, 12026, 14510, -46521, -60424, -32443, -19132, -882, -4075, 32137, -24554, -54057, -54201, -38866, -50435, -14540, 23761, -22607, -46505, -31400, 4745, 10769, 12439, -14500, -3448, 55, 49650, 51986, 55857, 59370, 60303, 35063, 11599, 6827, 26325, 9971, -16985, -27752, 14226, 9163, -25857, -14287, -3959, -32219, -34277, -4058, -18625, -29902, 12268, 22924, 35470, 55562, 57656, 53832, 33914, 55676, 30586, -17577, -22393, 6626, -20752, -21608, -30910, -62021, -73184, -55045, -26031, 27785, 14514, 1870, -36757, -15825, -41090, -37454, -1749, -27904, -7012, -33436, -25597, -59401, -99209, -103514, -76400, -17844, 23103, 41176, 55162, 73971, 64181, 28358, -6869, -26890, -9228]
8157i228L0921M741j9814o660K4884j2086K6330L3330j9651n3055m3212l091L4026
8144a2565J0774n1898k1873M1595k3842j9905M397N9342K6994k2042j861K4401
8132A3517K9845j3784M201k1668k239n524j1419k956j4749Q811K1502K1056K7645
8119E4238k7926k9806R251M964k8012L6889L4783k2130J2519J8606J2284j2596
8107F3064l4289l6864J5514j442r434j6832j5581N5295N6061r957k5670l092l9979
8094c206r945j5897J5670L687L9314J8670k6093o355O874l4068J6711o442j6695
8081a7775k7482O3063o700p3389m2732N0340N6494J1037N393j868j082J9576k5322
8068I553j0245j129n2312k219M619N1906p494j1041q469j8937l84j2481O2800
$$ y = [-9228, 21693, 26434, 6620, -40, 24844, 12758, 39088, 72418, 52767, -288, -43500, -46591, -12565, -1791, -53689, -75562, -33967, -57809, -77714, -73317, -13975, 13019, -9023, -10884, 13517, 43362, 29578, 33779, 12111, 9872, 4348, -7071, -10027, -24776, -15965, 5537, 26593, 54238, 26312, -3494, 5757, 10721, -17291, 19598, 54381, 32251, 44770, 63376, 75660, 63064, 28775, -8089, 7425, 5983, -3451, -20283, -35864, 19431, 75492, 65535, 39865, 36773, -3206, -13151, -29048, -13378, -9691, 29623, 48293, 22200, 15845, 22719, -11349, 5362, -1080, -17775, -45257, 17806, 11106, -62283, -105015, -54675, 1819, 12856, 18249, 16381, 15299, 34875, 9553, -692, -1821, -54133, -56352, -51733, 173, -7321, -18362, -26831, -45768, -46152, -58633, 4167]
8055D167J2919k6406K0344K1809k4655j392m731q094J8690m5891J2491n429m8360
8042g4538j2906j655L7810J2732J6256p429q207P971j0559K6094N352K1686R090
8029B1697O224K3435p165k3253j907k6162J5458K157j3597J6264k6343j2165K872
8016b2485R142m2995J6082L6200K6582j672K8293J0178J3338k3550l5069P710
8004B1754L981L217J6121k484M7711O658m2009m8455J3303K8636l5663m9922j8751
7991e5903K038O434Q24K2252N3676o279n3034n4240M6992L8977j3479L3913l3331
7978a1160j9456L3411L2850k5652k5030O430R707q518L2914K7640J8198k8113
7966D3221o797N9295j1106l9788l8967n4572j749p4j628L6043j245J3855K3872
$$ y = [4167, 17086, -9320, 11024, 32833, 8178, 6786, 2055, -6039, 12651, -33240, -20749, -26178, -74538, -87444, -89099, -51289, -38557, -22301, -29730, -37937, -29966, -40525, -14431, -9079, 12607, 21697, 27921, 51356, 44191, 20938, 19031, -7131, 8327, 10484, -3113, 13151, -13192, -25357, -22485, -13343, -56338, -40256, -4056, 22526, 20854, 49147, 59325, 72663, 49113, 14044, 21754, 25735, 28952, 45073, 42589, 90300, 96958, 54949, 6494, 19797, 48433, 12770, -37152, -55903, -53865, -47431, -46607, -24355, 29321, 23042, -29992, -84232, -37240, 1737, -11742, 22171, -11160, -30616, 2795, 35645, 9993, -15037, -8607, 1100, -7418, 25496, 53136, 71334, 43221, 36424, 95719, 84613, 44825, 5858, -48714, -50463, -50537, -52165, -16122, -17367, -3512, 20360]
7953B0360j8694j8994K202k4909j8199J0337n103J0930M0333L7354j1745k8808
7941d936J0068K1559L8053O2635k8763j5631j4769L5004j3147k0037k5498j1773
7929C2765Q003k941J1117k1004r343k259k1697P257K9746m1494p373J7879k0469
7916a9813J6594m929K9058J4124k8959k2016K9356r201K1974L2747l0003n2973
7904b4041O513p828j2305P212K0612J1830p5k966l9330q211L9833k22K2987R01
7890A4910j6962k682L4816n793J0308L8520J0242k6372n4056P368O9195J4072
7878I3566j6797K2513R914k9291m1034R29J4951l3378K5175p552n0284K425P753
7865a110K3746k9073k6854j3291L0203N8514N897n3441l4102k3716k7422L0388
$$ y = [20360, 1666, -17328, -15126, -40035, -58234, -47897, -53000, -42070, -1737, 35617, 23872, -4936, 5132, 26691, 64744, 127379, 98616, 82985, 68216, 103220, 90073, 70036, 44538, 32765, 40768, 37827, 48944, 27940, 18597, 16338, -5359, 1898, 31644, -9850, -17223, 656, -19813, -3219, -8148, 20910, 35034, 6075, -15941, 13415, 4214, 26188, 58935, 28932, -24041, -17528, -25356, -37661, -30449, -9837, 1993, 1918, -1048, -40378, -48589, -8756, -8978, 14009, 14910, -2052, -4734, 30082, 24289, 34597, 73117, 83359, 56987, 2931, 10299, 79494, 93566, 76769, 99282, 109196, 79905, 38871, 39800, 54751, 21373, 46548, 38996, -11288, -8863, -1110, 22636, -6437, -33291, -46582, -16379, 42135, 48032, -5409, -39511, -63227, -90649, -60261]
7853f0261L6836j5610J849K6682k387K1742L0585N794l4152L612o389m1883k912
7840c6494N5893J1009J9948M244J9626l8727n7427m4599L3043J4534j7950Q844
7828b8056K6437j8690j0575L645J263l1566J7147Q433J2637K1714Q524m7497L238
7815c3346N7470K6781o0989l942j1084K1433L0246k4012J4893J6687r936k9816
7803e615l269l3109m3540O279M0412L5166j6062J8896J3473k9624J1377n351N342
7790e625O2974j8555o1200k9031J4536J2279N867k8953j5590J2486K2381k755
7778c1186j0401P19M3952k3108l403L9315L3504k6700n4332m355L1860L7912J0387
7765D4164j9087J9030r322j3518L385l3203L308j9885r386p886M597l2851j3097
$$ y = [-60261, -23425, -39035, -37186, -10504, -12891, 8851, 39436, 45230, 11078, 14690, 8301, -33582, -36494, 19399, 30408, 50356, 54600, 74226, 35499, -21928, -66527, -33484, -18950, -36900, -28056, -1619, -20309, -30884, -27239, -25976, -57542, -40395, -31962, -19325, 2389, 10913, -36584, -33346, 24124, 50905, -10084, -14026, -25110, -3677, 26569, 2557, 17450, 34137, 24201, -5615, -8884, -41993, -85533, -79254, -38842, -3676, -19738, -842, 12631, -16993, -5616, -10967, -5625, 57349, 38794, -22406, -51437, -36901, -24622, -18755, -47708, -63298, -50812, -28431, -31186, -41587, -40868, 3084, -20024, -23427, 15888, 49392, 22692, -31640, -35995, -4135, 33777, 44164, 25077, 44107, 34785, 21267, 24652, -8551, -5243, -25128, -34514, -42400, -37803, -70654, -83751]
7752h3751O6181N4377L6285l9184L1570J6798m4355l4674o835j124j0954K8383
7740A2717M5137j0958m0309n2128J1027O8089K4891k4317o6292j6643M3760K9918
7728B4892m2599n8437r2939M1297Q8978K3924k0399L4832J3665k9626l1632L3004
7716a5040j0796l3916j2248l260J5555K2693J5052r579J5956O322J2972j4398
7704a0687n747q677O965N4151j5226j6663M964k2348J5677K9329L4915j2920J890
7691E5623k5638k2098K5730J5321k3552R998J0156k9259k4871j3048j4392J574
7679c4456j0918j5964l8835J1783L3272K2188L8536K4973r470l0649O400L3480
7667C0340L439j4236l7379M140J2123J8659K8891L0283j7749l3337n2149j21J7288
$$ y = [-83751, -17570, 36807, 73092, 33908, 65478, 82276, 37921, 3247, -3588, -4712, -15666, 12717, 57854, 46896, 6587, -45541, -34514, 33575, 58466, 34149, -32143, -48786, -5026, 24892, -17707, -76144, -169083, -127786, -38808, -14884, -35283, -451, 13214, -16412, -48044, -15040, -25836, -59752, -72000, -75260, -59705, -37012, -21960, -31539, -15583, -9261, 3711, -10687, -16434, -25111, -18146, 36005, 20779, 4116, 9080, -13268, 2409, 31738, 66653, 53733, 55623, 29985, 7887, 33617, 48938, 25386, 35384, 45540, 16281, -8590, -21638, -36030, -34456, -45374, -61338, -100173, -88390, -55118, -32930, 5606, 30579, 21109, -9540, -3140, 30340, 33779, 19543, -17836, -13696, -1573, 17086, 45977, 76260, 58511, 25174, -26975, -27096, -9808]
7654i808j4697O172o663j8755k2815Q894m843r15M8702L4170j8888p074N509O085
7640E074k926j3599K0353l3895k6169j1469L2940J7016k3890j155M7461K2736
7628C2477j2873r3J2332o138k310q836l25L063k4489m3338J2806J5163K0641J6836
7614A4916P526N075p215K5891L4574m824K808L2996p598j4606K1808l913n0529
7601E6909k2467k112m9461k1370L6540K8741J195n375q017l4648J2677L0138j2499
7588A0251m3111O254O885j9273k1970L9049j3589p4194j6215N7228M1346j6395
7576d3734k4799k174l800K0027K1313J9449O334n641j574k4813L9485M1574n844
7563C5803n366K6963j4019l689k4239O260k4887J7769J0754k1016j7553j1921
$$ y = [-9808, -24505, -18333, -24996, -43751, -66566, -57672, -62515, -63430, -14728, 19442, 554, -6520, -1011, 5074, 2148, -11451, 8902, -24993, -51162, -62631, -29691, -12675, -36565, -37720, 9741, 32477, 19604, 19511, 31843, 25705, 23395, 14559, 14234, 17297, -7192, -50530, -37724, -22561, -1920, 14916, 22442, 27517, 20302, 46193, 80767, 75943, 78751, 111747, 104149, 89543, 111351, 107438, 56909, 34442, 32330, -17131, -38501, -1961, 26780, 27975, 22600, 14583, -20065, -7388, 22750, 10251, -32860, -26606, -19721, -38994, -60964, -21915, -35504, -109698, -125913, -68685, -27339, -43734, -68533, -70707, -74507, -54480, -33167, -13718, -7384, -13025, -14599, -39412, 73, 41647, 35803, 30437, 57400, 43381, 39692, 15453, 21713, -3174, 14595, 25349, 4333, -13220, -25141]
7551b5141R868L1696J0261L3439N927j1958k4159j5886m265J9372j7477K172n12
7538A3337k239L2807K0772o0717k1216k622o442R787J4066l6178K5046K4111k5588
7525a5076j2168K1898K9064l9494k5071L7116R357j8082j343K4139n907J7596
7513B2029L1323j355m3124k7755j2107J8288O210J1101M7864J0424l5686o1548
7501c4336k4544J5975L7850n019J522M8011K8996p128j8190j614j8138k1628P888
7488I645k8865J0397L7820k7061j9159j382q205k552M2787k702L958n1745K7540
7475i524L2491l4294q355K3262K343l0611j1304j4254l422M7970N5118j3111o0565
7462b4256k4514M2303L0078L7468k121O107o332l4095q418j4327J3562o924l7497
$$ y = [-25141, -15273, 16423, 26684, 60123, 66050, 54092, 29933, 14047, 9782, 29154, 11677, 13849, 13337, 11098, 43905, 64677, 3960, -17256, -19878, -26320, -16533, -2467, -38645, -13599, 10512, -15076, -27244, -5346, 23718, -15776, -40847, -3731, 5626, -12456, -13799, 10340, 4433, 22029, 53352, 51997, 8873, -18882, -30989, -12701, -6491, 4610, 52474, 62898, 27212, -34336, -58880, -42905, -5055, -10074, -8552, 39459, 68455, 61327, 43137, 41523, 23385, 1757, 9645, -19220, -8823, 28997, 1936, -17223, -18605, -26810, -29362, 13425, 10723, 14681, -37064, -9524, 22967, -11327, -19682, 3580, 5923, -24688, -35992, -50246, -53668, -5698, 49420, 36309, -24256, -48770, -6467, 23611, 61079, 58958, 65065, 58733, 24638, 16220, 1893, 15455, 8531, -28966]
7449b8966R401J4685N560q871K0201j7476q546J3554k2711j0873L3467K933l251
7436h93j6688j2309k1441K503j5449K3626M0711K6871j7332J0462j3061k8850
7424b1850L030K3849m581k8932J927j6349l4618k698Q859N2775j335M628K9519
7411A4224L9230m2016k2892p83J8105j2078J5957k8949j6525n073J5229K6564
7399I93N476j0275j3967q525N1008j3084k2313M4690L5583m8719l5192J4277Q093
7386H045M2985k6936k7974p925J9965l4692R789M3043M4846Q818k4932k4202n622
7373B5208M0292J9876j2675l08o6134k3275K5770l5244j2128R720M6587J5358
7361C3047l5921l603r351j3978K9016R784m235k7394m8479j8255K1421o075j4425
$$ y = [-28966, -19565, -4880, 680, -8191, 12010, -5466, -14012, -458, -23169, -34042, -575, 2358, -893, -17581, -29890, -51331, -48828, -64277, -40651, 60, 26931, 9599, 20061, 7000, -21850, -18820, 5029, 448, -28484, -26557, -42906, -77524, -80222, -71363, -18588, -19923, -15295, 14224, 53454, 11438, -11454, -12237, 5868, -6210, 9747, -19202, -35727, -40800, -25571, 993, 6469, -3806, -17773, -26298, 24710, 11626, -10687, 34003, 69586, 20867, -14325, -48, 8045, 51030, 24094, -3880, -11805, 8160, -26532, -16743, 26300, 71146, 79964, 55032, 30830, 25208, 65500, 85376, 72701, 72393, 6259, -17016, 8754, -26490, -38618, -28898, 17689, 33047, -2874, -6477, -15828, -29806, -790, 8994, 4759, -22635, -71114, -89369, -67948, -74023, -88448]
7348h8448l664M5068L9175n908M2681L89l7820j8605J0330L1409k0996Q753M7842
7335E0206K1934n640j7774j6975m6435q880j2228K922K2105N218l5273M330K0320
7322a6170j6138m302l3329k4537L331K9147J2040K6145K8831k351n2276N3997
7310D388L8294n4967n0218p758L5788O1778J4097O105j082N397k6336m756q249
7297A2481M1607O866m9697m3122L5862J2077J9027M0645J4512p038j3393k7422
$$ y = [-88448, -92112, -47044, -7869, -13777, 28904, 29293, -8527, -27132, -16802, 14607, -6389, 2364, 50206, 72140, 66500, 48726, 31751, -14684, -23564, -35792, -32870, -10765, -5547, -40820, -36490, -16170, -32308, -36610, -69939, -94476, -91145, -61998, -49958, -23813, 5018, 2667, -49609, 4388, 42682, -12285, -62503, -70261, -34473, 27305, 41402, 47507, 46425, 51822, 25486, 20730, 12481, 54088, 60954, 11257, -31865, 3997, 16074, 35101, 75746, 90258, 83220, 69827, 42405]
$$ [...]
##END NTUPLES=NMR SPECTRUM
##END=
