##TITLE=Analysis number 316939
Compound Code cc 04204
Book Reference c
Project Code adrs
Chemist Name stores
##JCAMPDX= 6.0         $$ Bruker NMR JCAMP-DX V2.0
##DATA TYPE= NMR SPECTRUM
##DATA CLASS= NTUPLES
##ORIGIN= Bruker BioSpin GmbH
##OWNER= nmr
$$ XWIN-NMR		Version 3.5
$$ Wed Feb  1 16:38:11 2006 GMT Standard Time (UT+0h)  MAYBRIDGE\nmr@NMR_250MHZ
##.OBSERVE FREQUENCY= 250.131544655141
##.OBSERVE NUCLEUS= ^1H
##.ACQUISITION MODE= SIMULTANEOUS (DQD)
##.ACQUISITION SCHEME= undefined
##.AVERAGES= 16
##.DIGITISER RES= 18
##SPECTROMETER/DATA SYSTEM= dpx250
##.PULSE SEQUENCE= zg30
##.SOLVENT NAME= CDCl3
##.SHIFT REFERENCE= (INTERNAL, CDCl3, 0, 16.522)
##AUDIT TRAIL= $$ (NUMBER, WHEN, WHO, WHERE, WHAT)
$$ ##TITLE= Audit trail, XWIN-NMR		Version 3.5
$$ ##JCAMPDX= 5.01
$$ ##ORIGIN= Bruker BioSpin GmbH
$$ ##OWNER= nmr
$$ C:\u/data/dgb/nmr/ADRS/15530/pdata/1/auditp.txt
$$ ##AUDIT TRAIL=  $$ (NUMBER, WHEN, WHO, WHERE, WHAT)
(   1,<2006-02-01 16:37:47.14 +000>,<MAYBRIDGE\nmr>,<NMR_250MHZ>,
      <created by zg, POWCHK disabled, PULCHK disabled
       configuration hash MD5:
       84 BC 41 DB A1 6E 1D 46 DA 25 12 A5 C1 ED C5 3A
       data hash MD5: 64K
       D6 FE 09 AF 5A 8D 6D 68 DA 7F 18 6D 74 88 AE 74>)
(   2,<2006-02-01 16:38:02.11 +000>,<MAYBRIDGE\nmr>,<NMR_250MHZ>,
      <Start of raw data processing
       ef LB = 0.3 FT_mod = 6 PKNL = 1 SI = 32K 
       data hash MD5: 32K
       FD D5 86 B0 26 12 03 88 10 AF 6D 6C 23 C9 6D 31>)
(   3,<2006-02-01 16:38:04.27 +000>,<MAYBRIDGE\nmr>,<NMR_250MHZ>,
      <apk 
       data hash MD5: 32K
       D4 DD EF 5E FD FF 2F 9A BB 59 0D A5 B3 79 F5 D2>)
(   4,<2006-02-01 16:38:04.98 +000>,<MAYBRIDGE\nmr>,<NMR_250MHZ>,
      <abs ABSG = 5 
       data hash MD5: 32K
       EF 49 7F 94 67 71 FE 12 F3 05 8C 79 CF 43 81 37>)
$$ ##END=
$$ 
$$ hash MD5
$$ 75 C8 82 25 87 21 F9 80 83 86 DE E4 73 8B 46 0A
##$RELAX= 
##$RELAX= 
##$RELAX= 
##$RELAX= 
##$RELAX= 
##$RELAX= 
##$RELAX= 
$$ Bruker specific parameters
$$ --------------------------
##$DU= <C:\u>
##$EXPNO= 15530
##$NAME= <ADRS>
##$PROCNO= 1
##$TYPE= <nmr>
##$USER= <dgb>
##$AMP= (0..31)
100 100 100 100 100 100 100 100 100 100 100 100 100 100 100 100 100 100 
100 100 100 100 100 100 100 100 100 100 100 100 100 100 
##$AQSEQ= 0
##$AQ_mod= 3
##$AUNM= <au_zg>
##$AUTOPOS= <44 >
##$BF1= 250.13
##$BF2= 250.13
##$BF3= 250.13
##$BF4= 250.13
##$BF5= 500.13
##$BF6= 500.13
##$BF7= 500.13
##$BF8= 500.13
##$BYTORDA= 1
##$CFDGTYP= 0
##$CFRGTYP= 5
##$CHEMSTR= <none>
##$CNST= (0..31)
1 1 145 1 1 1 1 1 1 1 1 1 1 1 1 1 1 1 1 1 1 1 1 1 1 1 1 1 1 1 1 1 
##$CPDPRG= <>
##$CPDPRG1= <>
##$CPDPRG2= <>
##$CPDPRG3= <>
##$CPDPRG4= <mlev>
##$CPDPRG5= <mlev>
##$CPDPRG6= <mlev>
##$CPDPRG7= <mlev>
##$CPDPRG8= <mlev>
##$CPDPRGB= <>
##$CPDPRGT= <>
##$D= (0..31)
0 1 0 0 0 0 0 0 0 0.06 0 0 0 0 0 0 0.0002 0 0 0 0 0 0 0 0 0 0 0 0 0 0 
0 
##$DATE= 1138811864
##$DBL= (0..7)
120 120 120 120 120 120 120 120 
##$DBP= (0..7)
150 150 150 150 150 150 150 150 
##$DBP07= 0
##$DBPNAM0= <>
##$DBPNAM1= <>
$$ [...]
##$SUBNAM7= <"">
##$SUBNAM8= <"">
##$SUBNAM9= <"">
##$SW= 20.6930455092707
##$SWIBOX= (0..15)
0 0 3 0 0 0 0 0 0 0 0 0 0 0 0 0 
##$SW_h= 5175.983436853
##$TD= 65536
##$TD0= 1
##$TE= 293.16
##$TE2= 300
##$TE3= 300
##$TEG= 300
##$TL= (0..7)
0 120 120 120 120 120 120 120 
##$TP= (0..7)
150 150 150 150 150 150 150 150 
##$TP07= 0
##$TPNAME0= <>
##$TPNAME1= <>
##$TPNAME2= <>
##$TPNAME3= <>
##$TPNAME4= <>
##$TPNAME5= <>
##$TPNAME6= <>
##$TPNAME7= <>
##$TPOAL= (0..7)
0.5 0.5 0.5 0.5 0.5 0.5 0.5 0.5 
##$TPOFFS= (0..7)
0 0 0 0 0 0 0 0 
##$TUNHIN= 0
##$TUNHOUT= 0
##$TUNXOUT= 0
##$USERA1= <user>
##$USERA2= <user>
##$USERA3= <user>
##$USERA4= <user>
##$USERA5= <user>
##$V9= 5
##$VALIST= <valist>
##$VCLIST= <CCCCCCCCCCCCCCC>
##$VD= 0
##$VDLIST= <DDDDDDDDDDDDDDD>
##$VPLIST= <PPPPPPPPPPPPPPP>
##$VTLIST= <TTTTTTTTTTTTTTT>
##$WBST= 1024
##$WBSW= 4
##$XGAIN= (0..3)
0 0 0 0 
##$XL= 0
##$YL= 0
##$YMAX_a= 742458
##$YMIN_a= -871323
##$ZGOPTNS= <>
##$ZL1= 120
##$ZL2= 120
##$ZL3= 120
##$ZL4= 120
##$ABSF1= 16.522
##$ABSF2= -4.171173
##$ABSG= 5
##$ABSL= 3
##$ALPHA= 0
##$AQORDER= 0
##$ASSFAC= 0
##$ASSFACI= 0
##$ASSFACX= 0
##$ASSWID= 0
##$AUNMP= <proc_1d>
##$AZFE= 0.1
##$AZFW= 0.1
##$BCFW= 0
##$BC_mod= 0
##$BYTORDP= 0
##$COROFFS= 0
##$CY= 12.5
##$DATMOD= 1
##$DC= 0
##$DFILT= <>
##$DTYPP= 0
##$F1P= 14.0000005364418
##$F2P= -0.99999901652339
##$FCOR= 0.5
##$FTSIZE= 32768
##$FT_mod= 6
##$GAMMA= 0
##$GB= 0
##$INTBC= 1
##$INTSCL= 1
##$ISEN= 128
##$LB= 0.3
##$LEV0= 0
##$LPBIN= 0
##$MAXI= 10000
##$MC2= 0
##$MEAN= 0
##$ME_mod= 0
##$MI= 0
##$NCOEF= 0
##$NC_proc= -2
##$NLEV= 6
##$NOISF1= 0
##$NOISF2= 0
##$NSP= 0
##$NTH_PI= 0
##$NZP= 0
##$OFFSET= 16.522
##$PC= 1
##$PHC0= 98.55951
##$PHC1= 8.416115
##$PH_mod= 1
##$PKNL= yes
##$PPARMOD= 0
##$PSCAL= 4
##$PSIGN= 0
##$REVERSE= no
##$SF= 250.13
##$SI= 32768
##$SIGF1= 0
##$SIGF2= 0
##$SINO= 400
##$SIOLD= 32768
##$SREGLST= <1H.CDCl3>
##$SSB= 0
##$STSI= 32768
##$STSR= 0
##$SW_p= 5175.98343685301
##$SYMM= 0
##$S_DEV= 0
##$TDeff= 65536
##$TDoff= 0
##$TI= <Analysis number 999999
Compound Code 99
Book Reference 9
Project Code 9>
##$TILT= no
##$TM1= 0
##$TM2= 0
##$TOPLEV= 0
##$USERP1= <user>
##$USERP2= <user>
##$USERP3= <user>
##$USERP4= <user>
##$USERP5= <user>
##$WDW= 1
##$XDIM= 32768
##$YMAX_p= 276529643
##$YMIN_p= -143297
$$ End of Bruker specific parameters
$$ ---------------------------------
##NTUPLES= NMR SPECTRUM
##VAR_NAME=  FREQUENCY,     SPECTRUM/REAL,   SPECTRUM/IMAG
##SYMBOL=    X,             R,               I
##VAR_TYPE=  INDEPENDENT,   DEPENDENT,       DEPENDENT
##VAR_FORM=  AFFN,          ASDF,            ASDF
##VAR_DIM=   32768,         32768,           32768
##UNITS=     HZ,            ARBITRARY UNITS, ARBITRARY UNITS
##FACTOR=    0.157963299565203, 1,           1
##FIRST=     4132.6476996994, 0,             0
##LAST=      -1043.33573715361, 0,           0
##MIN=       -1043.33573715361, -143297,     0
##MAX=       4132.6476996994, 276529643,     0
$$ Real data points
##PAGE= N=1
##DATA TABLE= (X++(R..R)), XYDATA
$$ [...]
$$ plain form
24848 -4337 -2802 -3630 -6427 -6255 2658 -1730 -355 6692 11789 15916 17644 11251 3145 572 -10067
24833 -10067 -19627 -14739 -8662 31 5550 6860 4126 -3039 -9612 -3609 -1573 2408 4323 7614
24819 7614 579 -956 4955 3530 4889 9538 14874 12882 4027 -1022 -5548 -2342 4769 2056 2940
24804 2940 2395 -3329 -6103 -106 10224 15674 20321 23698 22014 17799 11570 10316 12694 7131 7734
24789 7734 905 506 -106 -3305 1277 2044 -7650 -9996 -11932 -9297 -10116 -16627 -14332 -14305 -11945 -1697
24773 -1697 4501 2315 6636 5343 1404 4983 6255 6227 2420 -2167 -227 2982 824 2643 7873
24758 7873 6015 1593 -1716 -897 1039 1666 -1445 -1322 -3845 -1695 6334 13797 16050 13316 10887
24743 10887 3213 -1322 -11136 -13708 -9802 -4400 -2801 2969 285 5427 9237 7679 1940 1877 1922
$$ packed form
24848d337J535q28k797J72Q913m388J375P047N097M127J728o393q106k573j0639
24833a0067r560M888O077Q693N519J310k734p165o573O003K036L981J915L291
24819G614p035j535N911j425J359M649N336j992q855n049m526L206P111k713Q84
24804B940n45n724k774N997J0330N450M647L377j684m215o229j254K378n563O03
24789G734o829l99o12l199M582P67r694k346j936K635q19o511K295K7K360J0248
24773a697O198k186M321j293l939L579J272k8l807m587J940L209k158J819N230
24758G873j858m422l309Q19J936O27l111J23k523K150Q029P463K253k734k429
24743A0887p674m535r814k572L906N402J599N770k684N142L810j558n739o3M5
$$ plain form
24728 1922 3741 12146 5755 6003 5816 9331 5558 9898 15971 21861 10223 -6046 -5421 882 -1627
24713 -1627 259 872 1486 6112 8102 2240 -1582 9976 15950 8257 2327 4224 9232 7479 1020
24698 1020 -2510 -3769 -413 -2299 -3984 -2352 274 5269 6760 -529 485 2558 3787 3650 1317
24683 1317 -402 2159 10223 12083 6558 5147 6362 2875 571 3108 -3955 -12639 -17012 -15589 -9139
24668 -9139 3246 11521 7431 3811 1421 -6868 -5601 -4504 3880 8125 5532 6400 -4826 -11425
24654 -11425 -9236 -3988 1329 1136 1769 5875 777 1126 2762 4065 7557 6014 -625 -715 -4393 -5376
24638 -5376 -4036 -4709 2715 914 6232 7731 221 -4769 494 2765 -458 -5931 -3679 -7489 -5644
24623 -5644 1233 -2740 1024 5381 2369 -3325 635 -1569 -2593 -5974 -5431 116 5497 8755 2831
$$ packed form
24728A922J819Q405o391K48j87L515l773M340O073N890j1638j6269O25O303k509
24713a627J886O13O14M626J990n862l822J1558N974p693n930J897N008j753o459
24698A020l530j259L356j886j685J632K626M995J491p289J014K073J229j37k333
24683A317j719K561Q064J860n525j411J215l487k304K537p063q684m373J423O450
24668i139J2385Q275m090l620k390q289J267J097Q384M245k593Q68j1226o599
24654a1425K189N248N317j93O33M106n098L49J636J303L492j543o639r0l678r83
24638e376J340o73P424j801N318J499p510m990N263K271l223n473K252l810J845
24623e644O877l973L764M357l012n694L960k204j024l381N43N547N381L258n924
$$ plain form
24608 2831 -4187 -4566 1761 -2542 2736 2723 5427 7218 3456 1179 331 -1150 -4821 1793 1088 484
24592 484 2397 7034 -1196 345 2958 6065 -1161 37 2310 10649 13488 8369 -416 -3887 -7305
24577 -7305 -1960 2760 -375 190 -2551 -5864 2233 4159 6032 6950 5319 -1082 3986 4595 5479 4353
24561 4353 -3328 -5378 1613 2287 1042 51 719 2611 5210 -941 -4330 -4112 918 8576 6695 3222
24545 3222 2768 7562 13713 8532 5836 7950 9788 8050 6366 3431 -911 544 -1311 -211 6252
24530 6252 10640 7045 3277 1986 -3849 -5797 -589 343 -3009 2939 5526 5616 7864 10407 17062
24515 17062 16649 13031 10596 11816 18356 16947 4832 -3818 -5370 -1520 -76 1973 7951 8895 3876
24500 3876 5955 1859 -11977 -14409 -7144 646 628 5637 257 -9344 -5329 5293 10626 10533 6603
$$ packed form
24608B831p018l79O327m303N278j3K704J791l762k277q48j481l671O614p05o04
24592D84J913M637q230J541K613L107p226J198K273Q339K839n119q785l471l418
24577g305N345M720l135N65k741l313Q097J926J873R18j631o401N068O09Q84j126
24561D353p681k050O991O74j245r91O68J892K599o151l389K18N030P658j881l473
24545C222m54M794O151n181k696K114J838j738j684k935m342J455j855J100O463
24530F252M388l595l768j291n835j948N208R32l352N948K587R0K248K543O655
24515A7062m13l618k435J220O540j409j2115q650j552L850J444K049N978R44n019
24500C876K079m096j3836k432P265P790j8N009n380r601M015J0622N333r3l930
$$ plain form
24485 6603 4342 4380 927 -4015 -1049 1914 8385 14091 14249 4611 7000 11386 12979 16679 14899
24470 14899 6818 -7107 -7139 -5792 -12945 -7465 -4998 -6798 -4247 -1772 2148 -3891 -6739 -4708 2288
24455 2288 8374 11535 707 -10072 -6118 -5941 -2792 4118 8318 9681 5656 -1912 -5369 -4940 -864
24440 -864 -1045 -10173 -8762 160 5592 8332 7976 7851 9747 8999 5973 1074 -1973 -1442 1870 7518
24424 7518 6464 6517 5741 12559 12625 10831 13345 10629 19921 19809 13196 7426 5891 1029 -260 -904
24408 -904 3309 2226 -1037 -523 5342 6063 10679 12216 13647 14418 17298 5729 -1910 -1172 -1619 -2059
24392 -2059 -3992 2832 13940 14700 11951 8293 10867 9315 6979 10557 7789 12264 12161 7140 10292
24377 10292 14871 14059 10116 12046 15682 13950 2732 -2819 -1283 696 672 3291 1639 3828 11444
$$ packed form
24485F603k261L8l453m942K966K963O471N706J58r638K389M386J593L700j780
24470A4899q081j3925l2J347p153N480K467j800K551K475L920o039k848K031O996
24455B288O086L161j0828j0779L954J77L149O910M200J363m025p568l457M29M076
24440h64j81r128J411Q922N432K740l56j25J896p48l026m899l047N31L312N648
24424G518j054N3p76O818O6j794K514k716R292j12o613n770j535m862j289o44
24408i04M213j083l263N14N865P21M616J537J431P71K880j1569p639P38m47m40
24392b059j933O824J1108P60k749l658K574j552k336L578k768M475j03n021L152
24377A0292M579q12l943J930L636j732j1218n551J536J979k4K619j652K189P616
$$ plain form
24362 11444 14138 10630 15761 23156 20191 10169 8199 6093 3881 -1967 -3062 -5832 -7380 -7982
24348 -7982 -3236 1160 8944 13816 17891 13881 9383 8812 1844 -384 -994 612 5470 10756 18524
24333 18524 22211 24965 16807 13279 11716 9412 7279 3884 1040 2190 843 -5165 -3497 4459
24319 4459 7530 14991 20358 20666 17389 10169 2276 3447 4172 4591 -3248 -9410 -14199 -16226 -6642
24304 -6642 4632 9786 5847 1021 -1214 -6691 -8399 1607 12254 12005 7818 3626 -634 -4384
24290 -4384 -3495 3975 11059 11319 8579 11482 14040 10743 5238 4483 12507 14122 9306 5422 4086
24275 4086 7473 9041 3383 4269 4395 7666 12680 21426 18805 20444 15911 12358 17339 18439 19089
24260 19089 23416 18565 10551 10992 9102 9638 5779 513 665 4946 6803 5972 -3071 -8207 -2795
$$ packed form
24362A1444K694l508N131P395k965j0022j970k106k212n848j095k770j548o02
24348g982M746M396P784M872M075m010m498n71o968k228o10J606M858N286P768
24333A8524L687K754q158l528j563k304k133l395k844J150j347o008J668P956
24319D459L071P461N367L08l277p220p893J171P25M19p839o162m789k027R584
24304f642J1274N154l939m826k235n477j708J0006J0647k49m187m192m260l750
24290d384Q89P470P084K60k740K903K558l297n505p55Q024J615m816l884j336
24275D086L387J568n658Q86J26L271N014Q746k621J639m533l553M981J100O50
24260A9089M327m851q014M41j890N36l859n266J52M281J857q31r043n136N412
$$ plain form
24245 -2795 1297 -1426 -315 -1815 4149 7176 2631 4661 7404 2855 -371 -3918 -5780 2302 11066
24230 11066 9776 6746 6077 6976 8346 10688 8397 5758 6929 9282 13024 11046 9358 8090 6037
24215 6037 5204 6918 11886 16110 24338 29327 23838 17487 14349 12324 3718 -3747 -10607 -8676 -882
24200 -882 4040 8240 2216 177 414 -1804 -1552 -3098 -1538 4291 6296 3426 3320 2821 -2216 -4096
24184 -4096 -6303 1143 -2220 1216 5526 10785 19972 18691 14971 6973 1682 3078 2289 4087 2207
24169 2207 825 -7276 -10850 -8204 -7794 -2308 -4646 -7522 -439 2179 6098 10256 4203 -1723 -4917
24154 -4917 3410 3149 -197 5883 7894 1016 2182 7762 5222 8292 14940 6221 1932 882 1177
24139 1177 1152 -2514 -78 4724 10394 17230 17508 15299 9632 8292 8252 8558 12138 4424 2365 1097
$$ packed form
24245b795M092k723J111j500N964L027m545K030K743m549l226l547j862Q082Q764
24230A1066j290l030o69Q99J370K342k291k639J171K353L742j978j688j268k053
24215F037q33J714M968M224Q228M989n489o351l138k025q606p465o860J931P794
24200h82M922M200o024k039K37k218K52j546J560N829K005k870j06m99n037j880
24184d096k207P446l363L436M310N259R187j281l720p998n291J396p89J798j880
24169B207j382q101l574K646M10N486k338k876P083K618L919M158o053n926l194
24154d917Q327k61l346O080K011o878J166N580k540L070O648q719m289j050K95
24139A177k5l666K436M802N670O836K78k209n667j340m0L06L580p714k059j268
$$ plain form
24123 1097 -836 8820 14311 18964 24688 20305 18291 15893 10108 5802 8187 7954 7443 2038 -6227
24108 -6227 660 11600 13455 11531 11913 9425 2750 2744 894 -167 -4417 -2816 2517 10624 16295
24093 16295 15462 18047 19202 19928 16681 14164 11389 6112 4864 9084 12378 9482 3224 10571 12915
24078 12915 9774 9284 10763 6636 7817 11258 8342 7496 3863 1031 1914 9129 10491 11263 10152
24063 10152 14532 21162 24333 10423 6012 2582 9492 9748 3919 8030 12181 11006 5833 2150
24049 2150 2832 11790 15609 17393 10144 5744 8430 3749 1610 3005 12600 13880 9016 584 1655
24034 1655 6112 6989 778 -1459 9883 14035 13417 10984 6445 5687 4175 4857 10848 18766 25907
24019 25907 28655 26398 20889 17412 18173 12916 8976 7988 13059 13419 9553 2905 -2157 -1087 -3017
$$ packed form
24123A097j933R656N491M653N724m383k014k398n785m306K385k33n11n405q265
24108f227O887J0940J855j924L82k488o675oj850j061m250J601N333Q107N671
24093A6295q33K585J155P26l247k517k775n277j248M220L294k896o258P347K344
24078A2915l141m90J479m127J181L441k916q46l633k832Q83P215J362P72j111
24063A0152M380O630L171j3910m411l430O910K56n829M111M151j175n173l683
24049B150O82Q958L819J784p249m400K686m681k139J395R595J280m864q432J071
24034A655M457Q77o211k237J1342M152o18k433m539p58j512O82N991P918P141
24019B5907K748k257n509l477P61n257l940r88N071L60l866o648n062J070j930
$$ plain form
24004 -3017 -557 4343 10237 16788 16104 12113 7164 9050 6533 1099 6978 10321 14755 19726 17555
23989 17555 16935 10260 8034 1695 4153 3035 1706 7010 11547 10524 8581 5324 3369 9964 14912
23974 14912 9873 13079 14775 11796 12128 8278 6021 12488 14400 12768 10202 7247 8205 6437 6779
23959 6779 13631 13885 9938 2526 6385 11013 14394 17431 9509 6018 -615 1040 4226 5324 5099
23944 5099 5952 4286 3802 -26 5282 10851 8639 6318 4662 4921 9252 10293 12165 3233 5715
23929 5715 12130 10097 6087 6995 9568 15625 12936 8702 6744 10013 9016 15663 15547 15878 13941 12799
23913 12799 15546 13420 10413 11433 4193 3772 1874 16 4847 9351 6394 10728 18790 17217 16448
23898 16448 14442 14044 12062 11169 13170 14300 14395 10047 8263 12050 8855 5059 5621 10321 14676 11381
$$ packed form
24004c017K460M900N894O551o84l991m949J886k517n434N879L343M434M971k171
23989A7555o20o675k226o339K458j118j329N304M537j023j943l257j955O595M948
23974A4912n039L206J696k979L32l850k257O467J912j632k566k955R58j768L42
23959F779O852K54l947p412L859M628L381L037p922l491o633J655L186J098k25
23944E099Q53j666m84l828N308N569k212k321j656K59M331J041J872q932K482
23929E715O415k033m010R08K573O057k689m234j958L269r97O647j16L31j937j142
23913A2799K747k126l007J020p240m21j898j858M831M504k957M334Q062j573p69
23898A6448k006l98j982q93K001J130R5m348j784L787l195l796N62M700M355l295
$$ plain form
23882 11381 10363 9535 5101 5558 5648 6107 3763 789 3480 7581 14640 11766 12748 14945 20094 17812
23866 17812 10168 4870 8040 12410 12240 14651 9999 10741 8727 5876 5641 10083 18344 16794 13303
23851 13303 5570 5969 8242 5102 1985 2113 6090 9096 11947 5094 -3652 -1447 251 3537 4735
23836 4735 4199 1060 1061 2229 366 -181 -2903 -3481 3970 12610 16871 11517 5118 6837 7340 5729
23820 5729 2791 3469 6220 12064 17594 17968 18399 18098 11507 14267 17386 17230 16414 5557 6559 17017
23804 17017 13175 -4231 -2540 8615 3614 6785 5734 2923 9430 19809 13581 13872 15510 15133
23790 15133 15691 19234 13309 4855 1178 5419 6024 6951 9072 7519 10688 7117 10595 15084 16594
23775 16594 14424 15537 17533 16441 16710 14101 16119 22955 24779 27952 32824 27749 21310 23013 17209
$$ packed form
23882A1381j018q28m434M57R0M59k344k974K691M101P059k874R82K197N149k282
23866A7812p644n298L170M370j70K411m652P42k014k851k35M442Q261j550l491
23851A3303p733L99K273l140l117J28L977L006K851o853q746K205J698L286J198
23836D735n36l139JJ168j863n47k722n78P451Q640M261n354o399J719N03j611
23820E729k938O78K751N844N530L74M31l01o591K760L119j56q16j0857J002J0458
23804A7017l842j7406J691J1155n001L171j051k811O507J0379o228K91J638l77
23790A5133N58L543n925q454l677M241O05R27K121j553L169l571L478M489J510
23775A6594k170J113J996j092K69k609K018O836J824L173M872n075o439J703n804
$$ plain form
23760 17209 17455 18697 21386 19470 12910 8576 8120 10170 10721 8494 3236 1562 -1350 288 3842
23745 3842 7714 9580 10619 13837 11829 1617 739 1121 2176 8314 14456 19855 15992 9631 9646
23730 9646 14331 16260 13185 14607 17742 17679 16482 16666 17369 11741 6391 12598 13405 14177 21598 27996
23714 27996 22603 15576 15051 15779 8870 10942 13094 13155 10828 10890 11954 12850 12121 12520 16880 23436 21609
23697 21609 17662 18259 16042 24093 28005 20680 15398 6537 1366 8422 10620 10276 12599 13518 17726
23682 17726 20384 16666 9643 6588 8379 10508 16121 19715 13745 10036 7467 5616 6234 6465 12502
23667 12502 20384 23584 16961 13386 14626 12763 19034 16643 8246 7233 3946 10351 8388 4412
23653 4412 7424 8971 12955 11395 12027 12970 12413 13334 12206 11746 12918 12809 14294 15109 17464 17674 12940
$$ packed form
23760A7209K46J242K689j916o560m334m56K050N51k227n258j674k912J638L554
23745C842L872J866J039L218k008j0212q78L82J055O138O142N399l863o361J5
23730I646M685J929l075J422L135o3j197J84P03n628n350O207Q07P72P421O398
23714B7996n393p027n25P28o909K072K152O1k327O2J064Q96p29L99M360O556j827
23697B1609l947N97k217Q051L912p325n282q861n171P056K198l44K323R19M208
23682A7726K658l718p023l055J791K129N613L594n970l709k569j851O18K31O037
23667A2502P882L200o623l575J240j863O271k391q397j013l287O405j963l976
23653D412L012J547L984j560O32R43n57R21j128m60J172j09J485Q15K355K10m734
$$ plain form
23636 12940 13975 12482 8858 8524 10564 10532 11442 12734 2165 -25 10161 21085 21374 16556 18973
23621 18973 12815 7104 -556 -70 -2720 -4427 -1076 5807 7243 6038 -376 6014 9515 8242 6608
23606 6608 13480 21102 17991 12980 15165 18537 13820 2474 3347 9159 8541 9596 14790 14799 16417 15329
23590 15329 16710 18846 25120 25216 21204 18292 13939 10396 10423 6151 2275 9051 17788 16800 16384 14523
23574 14523 15015 19164 22243 20122 17448 13376 14985 17396 13903 11182 11709 14490 17728 19034 21628
23559 21628 20069 23109 27249 24345 18533 10502 6917 3112 7348 19151 15863 7746 12226 16504
23545 16504 18227 19495 17094 14862 15515 13745 8884 6241 13064 17360 17648 20812 22355 10807 11919
23530 11919 25913 28292 27424 24179 17670 15105 13935 21478 24206 17105 14090 17961 17045 16933 25290
$$ packed form
23636A2940J035j493l624l34K040l2R10J292j0569k190J0186J0924K89m818K417
23621A8973o158n711p660M86k650j707L351O883J436j205o414O390L501j273j634
23606F608O872P622l111n011K185L372m717j1346Q73N812o18J055N194RJ618j088
23590A5329J381K136O274R6m012k912m353l543K7m272l876O776Q737r88m16j861
23574A4523M92M149L079k121k674m072J609K411l493k721N27K781L238J306K594
23559B1628j559L040M140k904n812q031l585l805M236J1803l288q117M480M278
23545A6504J723J268k401k232O53j770m861k643O823M296K88L164J543j1548J112
23530A1919J3994K379q68l245o509k565j170P543K728p101l015L871r16j12Q357
$$ plain form
23515 25290 19324 19070 22626 21000 19607 28640 25310 23152 19092 11124 15829 14619 15738 14496 8371
23500 8371 11348 15453 13847 16139 20448 21673 19094 23765 31517 28311 20946 26089 32470 31422 27616
23485 27616 26504 29068 25657 17839 18346 19894 21410 24503 28174 22807 21915 25232 21912 19742 21036
23470 21036 14933 11742 11374 15039 16677 16669 13007 12006 12859 14301 14677 16155 17210 14225 16752 22717
23454 22717 28011 31410 29390 24467 25686 27141 17430 11307 16162 12961 11915 9881 14428 18342
23440 18342 18564 21755 23159 25112 22112 13273 8221 11639 13177 9653 9260 13464 15447 14606 12776
23425 12776 17155 20209 16632 9290 12364 11571 6360 2336 7706 11901 15870 20138 26237 28538 23675
23410 23675 25960 28427 24244 23217 29379 23476 19127 18224 22492 26536 26335 26910 17729 10631 10833
$$ packed form
23515B5290n966k54L556j626j393R033l330k158m060p968M705j210J119j242o125
23500H371K977M105j606K292M309J225k579M671P752l206p365N143O381j048l806
23485B7616j112K564l411p818N07J548J516L093L671n367q92L317l320k170J294
23470B1036o103l191l68L665J638ql662j001Q53J442L76J478J055k985K527N965
23454B2717N294L399k020m923J219J455r711o123M855l201j046k034M547L914
23440A8342K22L191J404J953l000q839n052L418J538l524l93M204J983q41j830
23425A2776M379L054l577p342L074p93n211m024N370M195L969M268O099K301m863
23410B3675K285K467m183j027O162n903m349r03M268M044k01N75r181p098K02
$$ plain form
23395 10833 20397 23648 16579 5335 3970 10832 10248 8899 17509 26444 32038 26379 19181 17095
23381 17095 21967 22761 23061 32505 28698 21351 21818 19446 23394 30366 34030 37938 35969 32916 31910
23366 31910 27296 23345 21521 27366 25015 18364 14485 20352 30620 37547 37153 33847 30397 27772
23352 27772 27555 35330 39386 30906 21594 19546 22696 21322 21015 21390 18941 17700 23746 23147 24172
23337 24172 20236 20713 25382 28606 25172 26614 26653 20936 20639 16699 17333 27727 24109 20403 30293
23322 30293 37069 33595 36080 36922 26503 23290 21129 15826 14273 16713 18670 24018 25394 28958
23308 28958 34087 38758 38046 31062 23825 24198 25640 28563 23324 19845 18713 20539 22781 21554 23972
23293 23972 28677 27178 23742 22108 24263 27198 31285 31389 29883 26225 28968 33744 37388 36799 34757
$$ packed form
23395A0833R564L251p069j1244j365O862n84j349Q610Q935N594n659p198k086
23381A7095M872P94L00R444l807p347M67k372L948O972L664L908j969l053j006
23366C1910m614l951j824N845k351o651l879N867J0268O927l94l306l450k625
23352B7772k17P775M056q480r312k048L150j374l07L75k449j241O046n99J025
23337B4172l936M77M669L224l434J442L9n717k97l940O34J0394l618l706R890
23322C0293O776l474K485Q42j0419l213k161n303j553K440J957N348J376L564
23308B8958N129M671p12o984p237L73J442K923n239l479j132J826K242j227K418
23293B3972M705j499l436j634K155K935M087J04j506l658K743M776L644n89k042
$$ plain form
23278 34757 29829 28885 32530 28741 28739 31854 29679 27545 25663 21573 23639 32364 34663 31539 30154
23263 30154 31651 33890 35034 34528 33788 32553 32371 43265 41682 31998 20574 23591 28653 27451 26741
23248 26741 25959 22693 21556 17825 25241 34662 33879 28724 27322 23017 21502 26020 26901 23468 19017
23233 19017 13517 5534 1753 5029 4766 7548 12277 21572 30205 29421 32151 37488 39099 34553 32617
23218 32617 31401 28293 20162 19870 24237 34623 39172 43883 42525 39175 38971 35156 36258 39190 30443
23203 30443 32616 29181 28779 26728 27598 29968 29318 31582 32871 29700 24753 26530 26136 24354 23278
23188 23278 25754 22090 25858 30038 30228 28860 31254 30968 27793 26948 28172 27237 21363 20208 17441
23173 17441 16872 14755 12877 14523 19947 24939 25117 25045 22596 25382 27727 29849 28607 22737 21102
$$ packed form
23278C4757m928r44L645l789kL115k175k134j882m090K066Q725K299l124j385
23263C0154J497K239J144n06p40j235j82J0894j583r684j1424L017N062j202p10
23248B6741p82l266j137l731P416R421p83n155j402m305j515M518Q81l433m451
23233A9017n500p983l781L276k63K782M729R295Q633p84K730N337J611m546j936
23218C2617j216l108q131k92M367J0386M549M711j358l350k04l815J102K932q747
23203C0443K173l435m02k051Q70K370o50K264J289l171m947J777l94j782j076
23188B3278K476l664L768M180J90j368K394k86l175q45J224r35n874j155k767
23173A7441n69k117j878J646N424M992J78p2k449K786K345K122j242n870j635
$$ plain form
23158 21102 24697 27898 26115 26185 20098 17653 19561 20094 19197 20968 22641 24442 25435 26766 23915 26021
23142 26021 32240 34201 33157 28611 37677 40041 34128 36003 30781 28318 31324 39493 42572 37755
23128 37755 34518 33976 34413 37738 32573 24472 25407 28952 37234 36481 29657 20000 20240 31848 31212 37101
23112 37101 47729 46586 47693 49420 47218 43499 37999 34589 32831 39979 42855 39143 41492 36177
23098 36177 30864 25109 28057 27965 29339 32227 29019 31830 36494 40912 50346 55251 51606 52161 50589
23083 50589 51363 48620 48990 57517 60676 58620 59282 59486 62442 71584 84436 98072 109631 110878 113455
23068 113455 137260 174683 213497 284259 420126 639318 927869 1237986 1509786 1606407
23058 1606407 1553478 1331313 1027842 741408 492734 335271 251256 193656 160739 137876
$$ packed form
23158B1102L595L201j783P0o087k445J908N33q97J771J673J801R93J331k851K106
23142B6021O219J961j044m546R066K364n913J875n222k463L006Q169L079m817
23128C7755l237n42M37L325n165q101R35L545Q282p53o824r657K40J1608o36N889
23112C7101J0628j143J107J727k202l719n500l410j758P148K876l712K349n315
23098C6177n313n755K948r2J374K888l208K811M664M418R434M905l645N55j572
23083E0589P74k743L70Q527L159k056O62K04K956R142J2852J3636J1559J247K577
23068A13455K3805L7423L8814P0762J35867K19192K88551L10117K71800R6621
23058A606407n2929k22165l03471k86434k48674j57463q4015n7600l2917k2863
$$ plain form
23048 137876 119533 106210 98696 84378 68135 67144 62969 60593 61682 70165 67899 66617 73718
23035 73718 76052 66520 56831 51079 46298 45485 50388 51735 51802 50458 43134 43055 51606 55620 53854 49703
23019 49703 57741 55689 46823 47180 44320 46350 52045 51147 49517 48817 42111 42796 48508 48607 42782 40849
23003 40849 44516 52619 51453 51975 53174 47062 40530 42159 45571 51064 52966 55220 54756 60229 66022
22988 66022 61582 55744 59543 57736 63784 61623 66259 68593 62007 60439 58394 57321 58503 64311
22974 64311 74217 77762 66265 60787 60684 61882 61423 58604 63726 59614 43876 41880 44555 42634
22960 42634 40430 45571 52570 57788 58852 54759 53123 52694 59002 69959 79374 74214 56286 50403
22946 50403 55729 58366 52342 55329 53912 54140 60535 57914 56658 58754 58700 59246 70931 70539 58771
$$ packed form
23048A37876j8343j3323p514j4318j6243r91m175k376J089Q483k266j282P101
23035G3718K334r532r689n752m781q13M903J347O7j344p324p9Q551M014j766m151
23019D9703Q038k052q866L57k860K030N695q98j630p00o706O85N712R9n825j933
23003D0849L667Q103j166N22J199o112o532J629L412N493J902K254m64N473N793
22988F6022m440n838L799j807O048k161M636K334o586j568k045j073J182N808
22974F4311R906L545j1497n478j03J198m59k819N122m112j5738j996K675j921
22960D2634k204N141O999N218J064m093j636m29O308J0957R415n160j7928n883
22946E0403N326K637o024K987j417K28O395k621j256K096n4N46J1685l92j1768
$$ plain form
22931 58771 50292 50520 52217 50770 54419 57780 56044 62671 76060 77572 80747 82611 76813 77182 78109
22916 78109 73771 71067 67843 67016 68049 66618 63606 62317 61105 63757 57578 56207 59490 63492 65686
22901 65686 65217 61094 62003 66506 70146 68509 69167 63970 57716 55119 58027 55473 62492 66944 74266
22886 74266 80643 76870 71538 74314 74020 71754 67696 65212 62508 63645 72838 74461 70529 71428 67201
22871 67201 63982 66412 73554 74221 70851 69752 74759 79209 81603 79336 81317 83497 78615 73724 63269
22856 63269 60268 65263 65216 59772 58958 57114 56528 59532 66768 72233 75238 70345 67366 67769 67535 64776
22840 64776 61920 64981 67941 68577 64896 70445 72890 78721 80005 72992 60180 65114 71082 70081
22826 70081 71572 70221 69482 75128 81729 81225 84881 90397 96312 94572 88036 80874 77386 80101 81463
$$ packed form
22931E8771q479K28J697j447L649L361j736O627J3389J512L175J864n798L69R27
22916G8109m338k704l224q27J033j431l012j289j212K652o179j371L283M002K194
22901F5686m69m123R09M503L640j637O58n197o254k597K908k554P019M452P322
22886G4266O377l773n332K776k94k266m058k484k704J137R193J623l932Q99m227
22871F7201l219K430P142O67l370j099N007M450K394k267J981K180m882m891j0455
22856F3269l001M995m7n444q14j844n86L004P236N465L005m893k979M03k34k759
22840F4776k856L061K960O36l681N549K445N831J284p013j2812M934N968j001
22826G0081J491j351p39N646O601n04L656N516N915j740o536p162l488K715J362
$$ plain form
22811 81463 73189 66902 59950 53413 52976 67849 73883 70898 81065 89292 92495 94214 100229 103643
22797 103643 96467 91651 86728 81199 81086 80115 76904 72846 77917 82634 84569 86739 87571 87865 86861
22782 86861 85989 88536 85740 82804 86326 90998 97257 99202 98777 99853 102788 104635 98440 96085 99858
22767 99858 107627 115217 116223 113752 107180 108501 115775 123619 133708 144403 146602 143583 152471 167761
22753 167761 179387 199631 219715 225467 221907 220198 217658 214773 215052 210871 202293 190019 168975
22740 168975 147939 131141 112061 105602 98286 90319 81746 81717 87095 86987 86639 83763 82908 81176 89408
22725 89408 96372 97359 101562 108545 106161 100110 99955 104311 99143 96924 107335 112180 109439 110785 109036
22710 109036 113434 116241 119253 123125 127459 123933 131420 145232 141355 132851 125609 123652 126384 120535
$$ packed form
22811H1463q274o287o952o537m37J4873O034k985J0167Q227L203J719O015L414
22797A03643p176m816m923n529j13r71l211m058N071M717J935K170Q32K94j004
22782H6861q72K547k796k936L522M672O259J945m25J076K935J847o195k355L773
22767I9858P769P590J006k471o572J321P274P844J0089J0695K199l019Q888J5290
22753A67761J1626K0244K0084N752l560j709k540k885K79m181q578j2274k1044
22740A68975k1036j6798j9080o459p316p967q573k9N378j08l48k876q55j732Q232
22725H9408O964R87M203O983k384o051j55M356n168k219J0411M845k741J346j749
22710A09036M398K807L012L872M334l526P487J3812l877q504p242j957K732n849
$$ plain form
22696 120535 116365 121496 127876 129091 123079 123814 118109 107592 95836 94662 96237 93512 92836 108347
22682 108347 122895 133112 147640 158442 161626 160164 154375 153685 155070 157083 161252 172381 178521
22669 178521 177227 180414 186751 196630 199287 197008 197951 200289 204470 203240 201318 195820 194341 203261
22655 203261 222231 222827 204801 189354 166372 135330 129221 129200 141592 157894 165285 180050 197062
22642 197062 205517 201516 197486 199397 204244 205390 219517 234185 252719 273609 296117 319588 325663
22629 325663 345338 380592 401330 427275 451363 443291 434008 409019 366319 332752 295399 256166
22617 256166 225000 197078 171146 140736 120682 117684 122243 121894 127786 136021 146511 157896 161564
22604 161564 169613 171962 180412 192676 204114 216034 218190 214104 219330 227896 235406 248321 260385
$$ packed form
22696A20535m170N131O380J215o012P35n705j0517j1756j174J575k725o76J5511
22682A08347J4548J0217J4528J0802L184j462n789o90J385K013M169J1129O140
22669A78521j294L187O337R879K657k279R43K338M181j230j922n498j479Q920
22655B03261J8970N96j8026j5447k2982l1042o109k1J2392J6302P391J4765J7012
22642A97062Q455m001m030J911M847J146J4127J4668J8534K0890K2508K3471O075
22629C25663J9675L5254K0738K5945K4088q072r283k4989m2700l3567l7353l9233
22617B56166l1166k7922k5932l0410k0054k998M559l49N892Q235J0490J1385L668
22604A61564Q049K349Q450J2264J1438J1920K156m086N226Q566P510J2915J2064
$$ plain form
22591 260385 272204 282549 296232 310899 321100 342609 377546 406830 449157 518636 639768
22580 639768 857094 1150159 1473974 1742291 1839093 1786981 1541659 1230410 937412 697352
22570 697352 555372 477667 436638 425893 440423 455776 465356 472672 475467 479292 479990 482398 493564
22557 493564 512810 526791 566244 646078 772127 916900 1032167 1112776 1160834 1172634 1129685
22546 1129685 1036853 931361 863520 841564 827752 811325 806278 800551 807154 835382 891165 974264
22534 974264 1056927 1140875 1228218 1290536 1337692 1375065 1409447 1455158 1512773 1584818 1682327
22523 1682327 1796184 1918666 2053035 2197981 2369062 2572072 2814814 3100893 3457471
22514 3457471 3901968 4460815 5172766 6034760 7111238 8504555 10287016 12697120 15980909
$$ packed form
22591B60385J1819J0345J3683J4667J0201K1509L4937K9284M2327O9479J21132
22580F39768K17326K93065L23815K68317R6802n2112k45322l11249k92998k40060
22570F97352j41980p7705m1029j0745J4530J5353R580P316K795L825O98K408J1166
22557D93564J9246J3981L9453P9834J26049J44773J15267Q0609M8058J1800m2949
22546A129685r2832j05492o7841k1956j3812j6427n047n727O603K8228N5783Q3099
22534I74264Q2663Q3948Q7343O2318M7156L7373L4382M5711N7615P2045R7509
22523A682327J13857J22482J34369J44946J71081K03010K42742K86079L56578
22514C457471M44497N58847P11951Q61994J076478J393317J782461K410104L283789
$$ plain form
22505 15980909 20387672 26725547 36552322 53664375 84890521 131416461 183241921
22498 183241921 236809100 271243810 276529643 257819185 210148025 157887728 108854052
22491 108854052 70093108 47424356 34633151 26507782 20891153 16830216 13859504
22484 13859504 11670490 10050906 8821836 7851313 7096233 6436991 5832786 5272865 4775581
22475 4775581 4374514 4007254 3642167 3288713 2982499 2737252 2523444 2344532 2168191
22466 2168191 1986256 1810082 1662664 1545064 1458123 1412899 1391444 1386044 1369825 1331416 1247189
22455 1247189 1156091 1059335 938835 808796 678587 579103 509984 460503 423360 397284 387119
22444 387119 379647 376988 379765 363740 350723 333856 313458 293480 271290 233854 198842 172541
$$ packed form
22505A5980909M406763O337875R826775J7112053L1226146M6525940N1825460
22498A83241921N3567179L4434710N285833j8710458m7671160n2260297m9033676
22491A08854052l8760944k2668752j2791205q125369n616629m060937k970712
22484A3859504k189014j619584j229070r70523p55080o59242o04205n59921m97284
22475D775581m01067l67260l65087l53454l06214k45247k13808j78912j76341
22466B168191j81935j76174j47418j17600q6941m5224k1455n400j6219l8409q4227
22455A247189r1098r6756j20500j30039j30209r9484o9119m9481l7143k6076j0165
22444C87119p472k659K777j6025j3017j6867k0398j9978k2190l7436l5012k6301
$$ plain form
22432 172541 154209 147549 153772 173934 203610 238211 268854 291669 311874 334718 361962 408115
22420 408115 512885 712193 976810 1273377 1556639 1684573 1688401 1539527 1338042 1235100
22410 1235100 1327471 1620936 1916875 2120108 2153253 2118331 1904920 1514715 1045797 656856
22400 656856 443736 336912 269456 230863 212835 185349 154359 135131 128238 119123 114735 123782
22388 123782 126905 132830 131933 143529 158452 167643 169461 162046 141236 121772 95435 72393 56352
22375 56352 43981 27022 9562 -16864 -54373 -91182 -113635 -133966 -143297 -140082 -135665 -129746
22363 -129746 -124813 -112786 -101809 -85559 -66954 -51484 -36509 -30187 -33483 -33867 -37341 -43733 -46263
22350 -46263 -42329 -39348 -36875 -23986 -8356 -689 554 -1473 -15813 -38110 -58570 -71250 -80588
$$ packed form
22432A72541j8332o660O223K0162K9676L4601L0643K2815K0205K2844K7244M6153
22420D08115J04770J99308K64617K96567K83262J27934L828j48874k01485j02942
22410A235100R2371K93465K95939K03233L3145l4922k13411l90205m68918l88941
22400F56856k13120j06824o7456l8593j8028k7486l0990j9228o893r115m388R047
22388A23782L123N925q97J1596J4923R191J818p415k0810j9464k6337k3042j6041
22375E6352j2371j6959j7460k6426l7509l6809k2453k0331r331L215M417N919
22363a29746M933J2027J0977J6250J8605J5470J4975O322l296l84l474o392k530
22350d6263L934K981K473J2889J5630P667J243k027j4340k2297k0460j2680r338
$$ plain form
22337 -80588 -71508 -61621 -51625 -48163 -50433 -54758 -65340 -78746 -73993 -69711 -70248 -73566 -68276 -69026
22323 -69026 -65773 -59754 -57316 -51290 -52220 -54587 -49732 -47881 -41690 -39208 -40196 -38072 -26191 -17632 -4991
22308 -4991 -3237 -742 3353 1810 -12557 -18301 -26008 -23178 -17845 -12342 112 15776 33472 38112
22294 38112 42054 36950 21373 -1724 -23419 -37142 -42179 -40362 -40980 -49007 -51744 -48476 -43203 -42152
22280 -42152 -35433 -33173 -33091 -28515 -18180 -20249 -19455 -20541 -20079 -26656 -31925 -22934 -20001 -19661 -18953 -15953
22264 -15953 -13683 -15757 -6539 -296 10171 18360 17210 16580 13639 5348 9323 3551 -9489 -13611
22250 -13611 -18895 -22300 -18729 -18075 -27345 -30319 -36062 -44772 -43369 -38244 -31539 -29311 -31543 -31499 -28145
22235 -28145 -33347 -41357 -37782 -26248 -27403 -30010 -31736 -25313 -21372 -22568 -28328 -31660 -35046 -38867
$$ packed form
22337h0588R080R887R996L462k270m325j0582j3406M753M282n37l318N290p50
22323f9026L253O019K438O026r30k367M855J851O191K482r88K124J1881Q559J2641
22308d991J754K495M095j543j4367n744p707K830N333N503J2454J5664J7696M640
22294C8112L942n104j5577k3097k1695j3723n037J817o18q027k737L268N273J051
22280d2152O719K260Q2M576J0335k069P94j086M62o577n269Q991K933L40P08L000
22264a5953K270k074R218O243J0467Q189j150o30k941q291L975n772j3040m122
22250a3611n284l405L571O54r270k974n743q710J403N125O705K228k232M4L354
22235b8145n202q010L575J1534j155k607j726O423L941j196n760l332l386l821
$$ plain form
22221 -38867 -33317 -33445 -37448 -40390 -40021 -38493 -32751 -33535 -31357 -34376 -32544 -32988 -31186 -26868 -21257
22206 -21257 -26846 -36835 -38931 -36353 -28152 -17323 -22936 -32806 -40964 -42151 -34821 -38623 -42538 -35601
22192 -35601 -25389 -23877 -17770 -12586 -9644 -8748 -15107 -19713 -13741 -9331 -7306 -6702 -6728 -6623 -10538
22177 -10538 -23449 -28023 -29479 -35184 -34815 -32498 -31142 -30024 -21245 -22621 -24505 -25534 -24849 -29390 -35363
22162 -35363 -35338 -27942 -19619 -22626 -24707 -24187 -23855 -26497 -33105 -35118 -37831 -36423 -30885 -31113 -29039 -25840
22146 -25840 -25570 -16547 -8725 -11241 -11050 -11450 -9886 -4570 -4130 -15384 -22349 -21620 -19480 -24731 -31175
22131 -31175 -29380 -23112 -20334 -21314 -20735 -23673 -26027 -25180 -27269 -19890 -15361 -18607 -19559 -21611 -22388 -23896
22115 -23896 -18755 -11102 -4106 -4420 -15456 -18080 -25256 -32583 -37139 -30426 -27237 -25598 -15517 -10725
$$ packed form
22221c8867N550j28m003k942L69J528N742p84K178l019J832m44J802M318N611
22206b1257n589r989k096K578Q201J0829n613r870q158j187P330l802l915O937
22192c5601J0212J512O107N184K942Q96o359m606N972M410K025O04k6J05l915
22177a0538j2911m574j456n705L69K317J356J118Q779j376j884j029O85m541n973
22162c5363K5P396Q323l007k081N20L32k642o608k013k713J408N538k28K074L199
22146b5840K70R023P822k516J91m00J564N316M40j1254o965P29K140n251o444
22131c1175J795O268K778r80N79k938k354Q47k089P379M529l246r52k052p77j508
22115b3896N141P653O996l14j1036k624p176p327m556O713L189J639J0081M792
$$ plain form
22101 -10725 -7401 -9469 -12886 -11762 -10970 -14199 -14990 -18688 -21199 -17943 -20537 -20897 -23894 -16958 -18659
22086 -18659 -21110 -18752 -23615 -28013 -24421 -21139 -21299 -21230 -19808 -21919 -31019 -22098 -24083 -30065 -26710
22071 -26710 -23641 -26047 -26278 -20988 -18463 -14510 -7410 -1999 4628 3376 -5828 -17880 -17184 -22294 -31481
22056 -31481 -29777 -29156 -25826 -27286 -24602 -9822 -6710 -9937 -12975 -18177 -19347 -15569 -17397 -17071 -17506
22041 -17506 -15114 -15310 -10549 -5133 -7884 -7938 -13772 -16290 -17857 -17090 -13957 -17704 -19541 -21593 -24424
22026 -24424 -27225 -22311 -22461 -30918 -31764 -30009 -24536 -18978 -20449 -16529 -12204 -9670 -14874 -16845 -22338
22011 -22338 -23483 -17290 -18405 -14558 -3997 -1868 -1153 -985 -9739 -25589 -33382 -26410 -23776 -23969 -19447
21996 -19447 -10166 -7211 -13053 -7434 -6683 -5486 -10065 -14201 -16722 -12658 -13862 -17869 -18208 -18818 -16695
$$ packed form
22101a0725L324k068l417J124P92l229p91l698k511L256k594l60k997O936j701
22086a8659k451K358m863m398L592L282j60O9J422k111r100Q921j985n982L355
22071b6710L069k406k31N290K525L953P100N411O627j252r204j2052O96n110r187
22056c1481J704O21L330j460K684J4780L112l227l038n202j170L778j828L26m35
22041a7506K392j96M761N416k751n4n834k518j567P67L133l747j837k052k831
22026b4424k801M914j50q457q46J755N473N558j471L920M325K534n204j971n493
22011b2338j145O193j115L847J0561K129P15J68q754j5850p793O972K634j93M522
21996a9447R281K955n842N619P51J197m579m136k521M064j204m007l39o10K123
$$ plain form
21981 -16695 -17491 -10942 -9693 -11721 -6207 -10006 -13972 -3619 -2586 -4693 -8392 -10335 -13892 -17439
21967 -17439 -17381 -15878 -16173 -16149 -10351 -11144 -9254 -2428 -2334 -3402 -1693 -9069 -10993 -14086 -15149 -11581
21951 -11581 -4837 1869 3542 4636 6166 11638 11531 9661 13690 14700 11504 13471 17777 20893 25584
21936 25584 35001 54983 79556 100417 128985 177234 259091 411726 654963 937736 1243474
21925 1243474 1474571 1546591 1472517 1213134 910886 633112 400285 259092 184985 146672
21915 146672 121267 95427 70190 52885 43054 37631 28621 22011 21317 19744 10337 8916 8570 8573
21901 8573 15013 11357 6136 11907 12708 12097 14255 20941 18044 16951 12945 7153 5068 4005 9180
21886 9180 14498 17293 12891 2987 -1802 -5657 -10897 -12530 -11177 -6675 -2790 442 -2006 -820 -4560
$$ packed form
21981a6695p96O549J249k028N514l799l966J0353J033k107l699j943l557l547
21967a7439N8J503k95K4N798p93J890O826R4j068J709p376j924l093j063L568
21951a1581O744O706J673J094J530N472j07j870M029J010l196J967M306L116M691
21936B5584R417J9982K4573K0861K8568M8249Q1857J52635K43237K82773L05738
21925A243474K31097P2020p4074k59383l02248k77774k32827j41193p4107l8313
21915A46672k5405k5840k5237j7305r831n423r010o610o94j573r407j421l46L
21901H573O440l656n221N771Q01o11K158O686k897j093m006n792k085j063N175
21886I180N318K795m402r904m789l855n240j633J353M502L885L232k448J186l740
$$ plain form
21871 -4560 -8765 -7015 -3757 1326 1942 -2001 -7965 -4905 -458 -922 -8087 -6275 -4437 -1418 3353
21856 3353 11702 10803 5522 8150 13432 12665 11141 6493 5626 9505 1577 -4453 -1826 4813 9142
21841 9142 3855 -268 8 -1137 -7668 -14478 -9630 -2314 3414 8421 12103 13908 11089 4647 1919
21826 1919 2845 4372 4721 -282 -5506 -693 2684 -3041 -4622 1800 -969 -4897 1403 -1604 -2839
21811 -2839 981 2799 -2730 -2772 -2012 -2030 -3676 2739 10543 10834 6720 6455 -2061 -10877 -6289 -1457
21795 -1457 -20 -1183 -95 595 1855 7400 8544 3080 -3543 -8231 -13704 -11851 -2109 -1094 -3810
21780 -3810 -4018 4532 9753 5091 2 1340 -5468 -7229 -5147 -7999 -5256 -2273 -2767 -1170 -1108 -841
21764 -841 -5635 -7360 -2656 -2625 -6678 -9228 -6946 1966 3811 1190 -1476 -3214 -2073 3375 3542 440
$$ packed form
21871d560m205J750L258N083O16l943n964L060M447m64p165J812J838L019M771
21856C353Q349q99n281K628N282p67j524m648q67L879p928o030K627O639M329
21841I142n287m123K76j145o531o810M848P316N728N007L682J805k819o442k728
21826A919R26J527L49n003n224M813L377n725j581O422k769l928O300l007j235
21811b839L820J818n529m2P60j8j646O415P804K91m114k65q516q816M588M832
21795a457J437j163J088O90J260N545J144n464o623m688n473J853R742J015k716
21780c810k08Q550N221m662n089J338o808j761K082k852K743K983m94J597O2K67
21764h41m794j725M704L1m053k550K282Q912J845k621k666j738J141N448J67l102
$$ plain form
21748 440 98 3970 7885 7532 10929 10275 10332 12962 8184 7455 4698 -275 -403 2131 3143 -3866 -4088
21731 -4088 290 1634 -438 -5442 -3597 -5155 -3856 -1916 -2407 -3164 133 4065 9592 16935 21190
21716 21190 20262 20943 17255 8870 8241 9222 6356 4835 3889 1630 3145 8901 14538 9684 12177 12708
21700 12708 6825 -2010 -9335 4202 8137 8205 6839 10892 8423 10284 8631 3975 1838 1721 5813
21685 5813 3780 6736 6248 8061 8646 10305 10489 12218 6786 3261 3832 5714 11509 6626 5097 238
21669 238 -601 -5128 -4794 -1109 -1541 -5990 -6279 -6700 -7988 -3795 2386 7984 10341 12986 11938 11152
21653 11152 8694 5660 1143 -96 882 5243 6439 3048 4826 3884 9243 18589 14647 13769 15408
21638 15408 11690 12082 13621 7662 6405 10819 10299 11130 10078 9142 9975 9370 7924 4763 7277 6496
$$ packed form
21748D40l42L872L915l53L397o54N7K630m778p29k757m973j28K534J012p009k22
21731d088M378J344k072n004J845j558J299J940m91p57L297L932N527P343M255
21716B1190r28O81l688q385o29R81k866j521r46k259J515N756N637m854K493N31
21700A2708n883q835p325J3537L935O8j366M053k469J861j653m656k137j17M092
21685E813k033K956m88J813N85J659J84J729n432l525N71J882N795m883j529m859
21669B38q39m527L34L685m32m449k89m21j288M193O181N598K357K645j048p86
21653A1152k458l034m517j239R78M361J196l391J778r42N359R346l942q78J639
21638A5408l718L92J539n959j257M414n20Q31j052r36Q33o05j446l161K514p81
$$ plain form
21622 6496 5801 5877 3701 -1792 -2734 -3465 1283 10895 17329 20450 18581 15250 12158 8295 4093 4037
21606 4037 -3244 737 5032 5418 11880 11333 4250 7786 5667 6366 10113 13198 14534 14836 11651 2547
21590 2547 392 1156 -2518 448 3446 8640 11948 11988 6594 4818 4489 2492 1832 3015 10940 15580
21574 15580 12231 12955 5846 1282 6671 13485 13124 15008 20878 17672 8593 4918 6310 8648 10565
21559 10565 11387 17697 14928 11156 6117 3755 4871 4874 -1333 130 2043 4019 7195 4232 4941 11449
21543 11449 14130 15530 13419 10325 9350 10004 16205 20511 13170 14112 19579 18989 11062 6665 5795 5926
21527 5926 10798 11831 8133 10655 17769 18251 13353 14834 15684 12271 8811 8457 14397 9964 5217
21512 5217 1213 8616 18016 22922 19138 11376 8270 11131 11047 16613 20895 17262 16152 14456 10560
$$ packed form
21622F496o95P6k176n493r42p31M748R612O434L121j869l331l092l863m202n6
21606D037p281L981M295L86O462n47p083L536k119O99L747L085J336L02l185r104
21590B547k155P64l674K966K998N194L308M0n394j776l29j997o60J183P925M640
21574A5580l349P24p109m564N389O814l61J884N870l206r079l675J392K338J917
21559A0565Q22O310k769l772n039k362J116Lo207J463J913J976L176k963P09O508
21543A1449K681J400k111l094r75O54O201M306p341R42N467n90p927m397q70J31
21527E926M872J033l698K522P114M82m898J481Q50l413l460l54N940m433m747
21512E217m004P403R400M906l784p762l106K861q4N566M282l633j110j696l896
$$ plain form
21497 10560 4536 6131 17041 26174 21678 14580 15194 12649 10249 4288 6344 10448 15306 17810
21483 17810 13196 9014 14869 24982 19760 11063 13071 22473 28135 31600 31777 30033 30725 25092 22449
21468 22449 28273 34119 29370 25844 23193 21107 18928 21209 19219 19504 20437 22391 24565 21272 12589
21453 12589 11196 17551 16672 16491 21404 30650 28388 18658 15411 18726 22518 25746 25269 37868 43166
21438 43166 41952 34721 24489 20888 23146 17794 15558 15779 16733 21173 24351 21543 23351 20804 15804
21423 15804 24323 25759 26856 21669 19597 20846 19624 21534 23970 25016 24802 23121 19824 17831 16805
21408 16805 14925 9670 15372 20415 26064 32003 25406 22808 22963 23131 20440 21350 16785 13260 14356
21393 14356 17275 18641 16485 19469 14982 18631 27541 28320 24195 24975 32774 36940 38624 39845 38986
$$ packed form
21497A0560o024J595J0910R133m496p098O14k545k400n961K056M104M858K504
21483A7810m614m182N855J0113n222q697K008R402N662L465J77j744O92n633k643
21468B2449N824N846m749l526k651k086k179K281j990K85R33J954K174l293q683
21453A2589j393O355q79j81M913R246k262r730l247L315L792L228m77J2599N298
21438D3166j214p231j0232l601K258n352k236K21R54M440L178k808J808k547n000
21423A5804Q519J436J097n187k072J249j222J910K436J046k14j681l297j993j026
21408A6805j880n255N702N043N649N939o597k598J55J68k691R10m565l525J096
21393A4356K919J366k156K984m487L649Q910P79m125P80P799M166J684J221q59
$$ plain form
21378 38986 34208 34716 33177 27579 27789 32144 25357 18352 13272 20015 30749 35250 28193 24913 23340
21363 23340 27470 27221 25597 24582 25235 23433 22973 27526 35094 38304 33688 28459 23844 27663 30486
21348 30486 32319 33308 29774 30360 30868 32290 31878 30778 30884 30962 35644 34610 38014 37427 38025 37868 33987
21331 33987 34149 37593 38499 38558 34813 35863 26781 19787 22023 33215 38256 30577 22654 17988 16249
21316 16249 19753 30094 28387 23457 28800 39907 41325 38198 47073 45547 48982 45957 43589 47126
21302 47126 49696 39960 34852 40414 37002 37975 37262 36607 34230 38692 37318 38359 46702 52820 50919
21287 50919 44593 41909 41503 40777 42183 42934 33382 25756 29618 34329 35291 42460 42343 41783 38767 36881
21271 36881 40547 44090 44841 42290 39819 41492 42478 36161 27121 28713 39298 46223 47625 43494 44015
$$ packed form
21378C8986m778N08j539n598K10M355o787p005n080O743J0734M501p057l280j573
21363B3340M130k49j624j015O53j802m60M553P568L210m616n229m615L819K823
21348C0486J833R89l534N86N08J422m12j100J06P8M682j034L404n87N98j57l881
21331C3987J62L444R06N9l745J050r082o994K236J1192N041p679p923m666j739
21316A6249L504J0341j707m930N343J1107J418l127Q875j526L435l025k368L537
21302D7126K570r736n108N562l412R73p13o55k377M462j374J041Q343O118j901
21287E0919o326k684m06p26J406P51r552p626L862M711R62P169j17n60l016j886
21271C6881L666L543P51k551k471J673R86o317r040J592J0585O925J402m131N21
$$ plain form
21256 44015 41014 32867 29837 35355 32784 28188 39382 38560 36445 33170 36380 38955 35582 34431
21242 34431 37189 41160 49182 52371 47793 43583 51479 52972 50819 54917 55519 52379 48406 44170 33698
21227 33698 29193 34529 38362 38212 48321 51625 47566 37939 39575 39925 42648 41331 39962 49595 62823
21212 62823 72481 76947 74953 77530 79114 72193 67220 69515 70941 80962 86270 82337 83708 82557
21198 82557 87317 95128 100328 104373 123947 136105 159419 190274 222616 274155 354760 476264
21186 476264 626652 779552 903702 967033 953484 878387 784414 709973 661322 620695 565633
21175 565633 490151 412355 355132 307794 287255 289918 312452 333041 339350 336458 334773 329035
21163 329035 328569 341380 356811 366507 373221 396623 441990 489832 535953 555865 543663 531598
$$ packed form
21256D4015l001q147l030N518k571m596J1194q22k115l275L210K575l373j151
21242C4431K758L971Q022L189m578m210P896J493k153M098O02l140l973m236j0472
21227C3698m505N336L833j50J0109L304m059r627J636L50K723j317j369R633J3228
21212F2823R658M466j994K577J584o921m973K295J426J0021N308l933J371j151
21198H2557M760P811N200M045J9574J2158K3314L0855L2342N1539Q0605J21504
21186D76264J50388J52900J24150O3331j3549p5097r3973p4441m8651m0627n5062
21175E65633p5482p7796n7223m7338k0539K663K2534K0589O309k892j685n738
21163C29035m66J2811J5431R696O714K3402M5367M7842M6121J9912j2202j2065
$$ plain form
21151 531598 553761 628555 753510 897322 1006799 1030220 959210 813977 642126 490602
21141 490602 373614 294885 243149 203781 168176 150236 134677 123567 116108 115968 117888 114619
21129 114619 114036 108671 106956 102634 95412 90606 88512 90139 93428 90035 86834 85673 87662 81965
21115 81965 79618 78080 84218 90680 90123 88976 83895 84556 79662 74493 68860 72054 73584 71365 70555
21100 70555 67052 70719 73722 76379 72065 72696 74017 76979 81891 82053 85685 89315 93652 98711 98630
21085 98630 96769 92378 82294 76536 67724 65487 77293 80710 75057 78563 81776 81027 73992 73570
21071 73570 79671 78259 85477 89786 80440 72722 69676 67655 71820 75278 75457 74810 78819 78661 79109
21056 79109 83327 79011 75208 68811 73594 73915 78665 81481 85736 82698 80602 80142 86843 87990 97350
$$ packed form
21151E31598K2163P4794J24955J43812J09477K3421p1010j45233j71851j51524
21141D90602j16988p8729n1736l9368l5605j7940j5559j1110p459j40J920l269
21129A14619n83n365j715m322p222m806k094J627L289l393l201j161J989n697
21115H1965k347j538O138O462n57j147n081O61m894n169n633L194J530k219q10
21100G0555l503L667L003K657m314O31J321K962M912J62L632L630M337N059q1
21085I8630j861m391j0084n758q812k237J1806L417n653L506L213p49p035m22
21071G3570O101j412P218M309r346p718l046k021M165L458J79o47M009j58M48
21056G9109M218m316l803o397M783L21M750K816M255l038k096m60O701J147R360
$$ plain form
21041 97350 98868 93155 90810 91496 93705 90591 94898 95747 95113 90643 94408 106393 107511 109759 110717
21026 110717 107445 101010 101876 108077 111167 110845 110228 107967 104728 110344 113075 110946 118198 117856 110225
21011 110225 105390 104589 101243 98204 99681 104009 105928 106708 104433 95815 96396 101298 105274 108842 112247
20996 112247 110825 111989 115056 115789 112675 112105 110225 105790 103513 107336 112526 115162 117324 120550 125893
20981 125893 130450 124945 119151 115721 115807 108417 105033 104377 104905 107729 107174 113937 118914 117337 122185
20966 122185 121195 124580 123242 122070 115517 112649 117922 127661 125817 133552 131566 127459 120013 118378
20952 118378 117461 118110 125560 132417 132272 132084 130608 126611 128539 122809 122586 127700 132497 132235 132721 139775
20936 139775 145407 148434 148919 144919 142629 138469 143411 146029 142866 134288 133800 139333 136370 137762 135425
$$ packed form
21041I7350J518n713k345O86K209l114M307Q49o34m470L765J1985J118K248R58
21026A10717l272o435Q66O201L090l22o17k261l239N616K731k129P252l42p631
21011A10225m835q01l346l039J477M328J919P80k275q618N81M902L976L568L405
20996A12247j422J164L067P33l114n70j880m435k277L823N190K636K162L226N343
20981A25893M557n505n794l430Q6p390l384o56N28K824n55O763M977j577M848
20966A22185r90L385j338j172o553k868N273R739j844P735j986m107p446j635
20952A18378r17O49P450O857j45j88j476l997J928n730k23N114M797k62M86P054
20936A39775N632L027M85m000k290m160M942K618l163q578m88N533k963J392k337
$$ plain form
20921 135425 134308 146975 159151 165925 173756 181730 198312 216738 250105 295221 323927 339056
20909 339056 338191 337579 341806 346985 358090 353921 334752 308249 295891 300132 320288 342066 364252
20896 364252 370551 357639 347369 353610 361691 364098 349009 313702 271368 240003 210933 194838
20884 194838 194152 187554 187019 186274 188961 189618 200635 204988 211833 220161 217559 213060 217475 221649 224762
20869 224762 231939 242955 248326 250636 257300 260791 259476 259674 268320 271562 269075 264835 252551 245934
20855 245934 234335 222426 217804 213539 215494 214712 213237 211422 214075 210983 203032 200404 196908 205121
20841 205121 211603 220654 229916 234170 245289 252336 252039 253339 259916 272270 282562 286717 293069 296542
20827 296542 289251 283906 279826 265200 256294 257914 256595 251842 249078 240785 235689 217117 207073
$$ packed form
20921A35425j117J2667J2176O774P831P974J6582J8426L3367M5116K8706J5129
20909C39056q65o12M227N179J1105m169j9169k6503j2358M241K0156K1778K2186
20896C64252O299j2912j0270O241Q081K407j5089l5307m2334l1365k9070j6095
20884A94838o86o598n35p45K687O57J1017M353O845Q328k602m499M415M174L113
20869B24762P177J1016N371K310O664L491j315J98Q646L242k487m240j2284o617
20855B45934j1599j1909m622m265J955p82j475j815K653l092p951k628l496Q213
20841B05121O482R051R262M254J1119P047k97J300O577J2354J0292M155O352L473
20827B96542p291n345m080j4626q906J620j319m753k764q293n096j8572j0044
$$ plain form
20814 207073 198793 193487 187892 188095 193962 209059 216593 219807 220544 215564 210605 210730 211872 214298 223110
20799 223110 232810 235791 242145 248858 250171 251644 257695 258003 256221 260228 260058 261541 261481 273176 281753
20784 281753 286913 292549 294140 298164 308030 305112 304722 305021 296705 292190 303204 318590 328865 329979
20770 329979 339040 341568 330469 307563 288711 281488 285906 290592 302981 328544 343165 352802 356066
20757 356066 349482 343360 336056 333531 345919 369329 386781 390542 402379 419732 441201 465180
20745 465180 482647 497400 523135 546354 561509 568373 555438 542481 527978 511739 505310 499052
20733 499052 495750 484302 461159 433742 409932 386509 375042 372899 371642 378989 391741 403321
20721 403321 407154 411987 418744 425488 437481 458077 471467 490234 510219 527289 533142 547544
$$ packed form
20814B07073q280n306n595K03N867J5097P534L214P37m980m959J25J142K426Q812
20799B23110R700K981O354O713J313J473O051L08j782M007j70J483o0J1695Q577
20784B81753N160N636J591M024R866k918l90K99q316m515J1014J5386J0275J114
20770C29979R061K528j1099k2906j8852p223M418M686J2389K5563J4621R637L264
20757C56066o584o122p304k525J2388K3410J7452L761J1837J7353K1469K3979
20745D65180J7467J4753K5735K3219J5155O864j2935j2957j4503j6239o429o258
20733D99052l302j1448k3143k7417k3810k3423j1467k143j257P347J2752J1580
20721D03321L833M833O757O744J1993K0596J3390J8767J9985J7070N853J4402
$$ plain form
20709 547544 557050 567885 575290 586412 596844 603806 612126 620822 612253 596629 575285 553767 534865
20696 534865 518618 508763 506345 509455 516575 514152 514649 514921 511709 509633 513947 526173 545171 569966
20682 569966 607237 642798 670217 692912 710363 708392 707326 716562 732992 752406 772331 790405
20670 790405 804052 819189 841187 884266 929310 978703 1029390 1069362 1087020 1108234 1143269
20659 1143269 1181440 1218222 1271870 1337662 1410492 1498874 1620576 1785622 1996577 2258572
20649 2258572 2551762 2838873 3053976 3161244 3185057 3149351 3166687 3290662 3509819 3780365
20639 3780365 4042202 4270860 4491012 4759377 5104892 5499360 5834356 6056020 6173606
20630 6173606 6287309 6498602 6901021 7546403 8430065 9566495 11034840 12913008 15345398
$$ packed form
20709E47544R506J0835P405J1122J0432O962Q320Q696q569j5624k1344k1518j8902
20696E34865j6247r855k418L110P120k423M97K72l212k076M314J2226J8998K4795
20682E69966L7271L5561K7419K2695J7451j971j066R236J6430J9414J9925J8074
20670G90405J3647J5137K1998M3079M5044M9393N0687L9972J7658K1214L5035
20659A143269L8171L6782N3648O5792P2830Q8382J21702J65046K10955K61995
20649B258572K93190K87111K15103J07268K3813l5706J7336J23975K19157K70546
20639C780365K61837K28658K20152K68365L45515L94468L34996K21664J17586
20630F173606J13703K11293M02419O45382Q83662J136430J468345J878168K432390
$$ plain form
20621 15345398 18603324 23115325 29649772 39692636 55826928 81234101 115203355
20614 115203355 147954791 170761247 176797544 162492486 136779269 106333953 82560149
20607 82560149 71185298 70711861 78753796 90769587 100884218 104662575 99015141 85580755
20599 85580755 68457129 52032390 40356373 33454708 29696524 27917690 27629584 28862102
20591 28862102 32136269 38596783 49929402 66542341 84540077 99108925 106192089
20584 106192089 103186301 93344538 80849211 71885842 71794646 83132092 107465502 139563353
20576 139563353 167554083 184117696 180128308 158232262 125705696 90742124 63876100
20569 63876100 46399374 35290631 27901930 22733191 18963774 16102733 13875544 12142863
$$ packed form
20621A5345398L257926M512001O534447J0042864J6134292K5407173L3969254
20614A15203355L2751436K2806456O036297j4305058k5713217l0445316k3773804
20607H2560149j1374851m73437Q041935J2015791J0114631L778357n647434j3434386
20599H5580755j7123626j6424739j1676017o901665l758184j778834k88106J232518
20591B8862102L274167O460514J1332619J6612939J7997736J4568848P083164
20584A06192089l005788r841763j2495327q963369r1196J1337446K4333410L2097851
20576A39563353K7990730J6563613l989388k1896046l2526566l4963572k6866024
20569F3876100j7476726j1108743p388701n168739l769417k861041k227189j732681
$$ plain form
20561 12142863 10812284 9809238 9079806 8556801 8143194 7766702 7391251 6971350 6529965
20552 6529965 6088908 5691870 5366518 5122267 4944681 4774363 4543611 4259754 3961667
20543 3961667 3720889 3587430 3539443 3506370 3393594 3173525 2876588 2541908 2242669 1999694
20533 1999694 1798799 1638596 1502598 1380717 1263622 1162075 1065220 983287 923806 880664
20523 880664 857299 838400 835349 847598 888154 946875 1001381 1002464 948739 845558 755939 687373
20511 687373 643182 617778 611731 639159 696025 766403 808500 822995 827947 848706 870230 852970
20499 852970 788555 691067 602762 546562 519510 521702 537990 562588 593719 629188 636444 602194
20487 602194 539896 488633 441418 401971 378471 387465 434532 513483 623617 745812 879347
$$ packed form
20561A2142863j330579j003046p29432n23005m13607l76492l75451m19901m41385
20552F529965m41057l97038l25352k44251j77586j70318k30752k83857k98087
20543C961667k40778j33459m7987l3073j12776k20069k96937l34680k99239k42975
20533A999694k00895j60203j35998j21881j17095j01547r6855q1933n9481m3142
20523H80664k3365j8899l051J2249M0556N8721N4506J083n3725j03181q9619o8566
20511F87373m4191k5404o047K7428N6866P0378M2097J4495M952K0759K1524j7260
20499H52970o4415r7488q8305n6200k7052K192J6288K4598L1131L5469P256l4250
20487F02194o2298n1263m7215l9447k3500Q994M7067P8951J10134J22195J33535
$$ plain form
20476 879347 1004747 1076738 1067011 981568 860355 752090 672371 621682 599144 621668 690233
20465 690233 772391 849956 902446 894177 824869 720297 619158 548353 514971 509054 540168
20454 540168 588226 611542 589432 553569 542501 588294 651319 682599 663671 607464 562778
20443 562778 544977 535152 532779 566902 670580 824310 974438 1067907 1104845 1120270 1163700
20432 1163700 1223557 1230534 1164427 1045538 915164 832288 791718 780517 793631 817823 852992
20421 852992 884806 884642 846566 806293 788027 776819 755874 727766 687924 644035 607108 568784
20409 568784 540246 523239 527952 570866 647371 728332 773387 776994 745216 691449 650103 642547
20397 642547 681038 765687 898671 1049860 1143468 1131879 1024914 883372 750631 647640
$$ packed form
20476H79347J25400P1991r727q5443j21213j08265p9719n0689k2538K2524O8565
20465F90233Q2158P7565N2490q269o9308j04572j01139p0805l3382n917L1114
20454E40168M8058K3316k2110l5863j1068M5793O3025L1280j8928n6207m4686
20443E62778j7801r825k373L4123J03678J53730J50128R3469L6938J5425M3430
20432A163700N9857O977o6107j18889j30374q2876m0570j1201J3114K4192L5169
20421H52992L1814j64l8076m0273j8266j1208k0945k8108l9842m3889l6927l8324
20409E68784k8538j7007M713M2914P6505Q0961M5055L607l1778n3767m1346p556
20397F42547L8491Q4649J32984J51189R3608j1589j06965j41542j32741j02991
$$ plain form
20387 647640 570442 522812 495806 484544 480256 480716 493660 511166 534049 541171 519322 485701
20375 485701 464067 465640 475042 463112 431949 397324 364906 342620 319810 303221 287840 277245
20363 277245 276990 275980 260648 247433 231047 218415 212138 209372 211181 222225 236095 248994 274150
20350 274150 292175 285413 276760 271355 282289 321870 381613 473068 610121 764666 861421 853005
20338 853005 737417 578014 449275 364556 322356 311541 322818 361871 411628 429021 409653
20327 409653 356889 298210 261272 230459 195028 162836 149761 153355 167897 197407 241077 287015
20315 287015 335085 382325 423318 450302 455331 429844 374179 330645 318826 338718 380554 448526
20303 448526 543485 664891 759036 775717 712161 612634 520055 427087 343131 273544 227924
$$ packed form
20387F47640p7198m7630k7006j1262m288M60J2944J7506K2883P122k1849l3621
20375D85701k1634J573R402j1930l1163l4625l2418k2286k2810j6589j5381j0595
20363B77245k55j010j5332j3215j6386j2632o277k766J809J1044J3870J2899K5156
20350B74150J8025o762q653n405J0934L9581N9743R1455J37053J54545R6755q416
20338H53005j15588j59403j28739q4719m2200j0815J1277L9053M9757J7393j9368
20327D09653n2764n8679l6938l0813l5431l2192j3075L594J4542K9510M3670M5938
20315B87015M8070M7240M0993K6984N029k5487n5665m3534j1819J9892M1836O7972
20303D48526R4959J21406R4145J6681o3556r9527r2579r2968q3956o9587m5620
$$ plain form
20292 227924 212169 210009 216967 238580 271030 294784 288546 256499 223011 200396 190127 180859
20280 180859 183831 205987 242435 278459 294230 285729 267201 263898 271359 285475 287888 274787
20268 274787 245295 223717 210073 208356 217128 228481 245803 283051 316633 331594 323398 287959
20256 287959 246395 217406 195855 193602 205993 231493 279900 333201 378184 405551 422003 424671
20244 424671 411224 401106 401748 391650 380914 369179 371604 398266 425416 448783 478227 513573
20232 513573 582962 707686 856343 943578 927391 815520 689532 621066 582980 554363 535355
20221 535355 563728 642351 719190 749928 728974 683355 662227 676601 692395 715649 740372
20210 740372 760362 754099 731575 690493 651486 645372 684573 761788 840339 870140 843783 774503
$$ packed form
20292B27924j5755k160O958K1613L2450K3754o238l2047l3488k2615j0269r268
20280A80859K972K2156L6448L6024J5771q501j8528l303P461J4116K413j3101
20268B74787k9492k1578j3644j717Q772J1353J7322L7248L3582J4961q196l5439
20256B87959m1564k8989k1551k253J2391K5500M8407N3301M4983K7367J6452K668
20244D24671j3447j0118O42j0098j0736j1735K425K6662K7150K3367K9444L5346
20232E13573O9389J24724J48657Q7235j6187j11871j25988o8466l8086k8617j9008
20221E35355K8373P8623P6839L0738k0954m5619k1128J4374J5794K3254K4723
20210G40372J9990o263k2524m1082l9007o114L9201P7215P8551K9801k6357o9280
$$ plain form
20198 774503 703974 657798 645145 661775 697574 769740 900377 1035023 1086610 1026106 906869
20187 906869 844322 845885 874212 922140 1010030 1190820 1521318 2036885 2666200 3182990 3312641
20176 3312641 3001595 2429135 1899587 1571853 1423119 1390540 1476870 1684174 1934144 2062190
20166 2062190 1956004 1637558 1264121 980200 797901 683259 612991 581521 587738 629867
20156 629867 670431 708029 755966 863211 1076599 1393024 1738498 1958990 1933745 1701615
20146 1701615 1427379 1243375 1202025 1309367 1598646 2095836 2749296 3279437 3396108 3020931
20136 3020931 2364687 1726683 1264712 964010 778580 651461 577287 527269 500245 483171
20126 483171 482871 502848 547125 625760 720813 806371 842507 815711 738111 637470 551831 508288
$$ packed form
20198G74503p0529m6176j2653J6630L5799P2166J30637J34646N1587o0504j19237
20187I06869o2547J563K8327M7928Q7890J80790L30498N15567O29315N16790J29651
20176C312641l11046n72460n29548l27734j48734l2579Q6330K07304K49970J28046
20166B062190j06186l18446l73437k83921j82299j14642p0268l1470O217M2129
20156F29867M0564L7598M7937J07245K13388L16425L45474K20492k5245k32130
20146A701615k74236j84004m1350J07342K89279M97190O53460N30141J16671l75177
20136C020931o56244o38004m61971l00702j85430j27119p4174n0018k7024j7074
20126D83171l00J9977M4277P8635R5053Q5558L6136k6796p7600j00641q5639m3543
$$ plain form
20114 508288 499072 507732 524834 550022 559657 548736 515390 462803 424933 426608 446303 459868
20102 459868 447240 412312 372429 349996 336733 331013 342996 364202 412943 475161 528930 557375
20090 557375 540604 503321 456599 433627 424300 440689 489576 574219 674885 747130 737576 658624
20078 658624 541380 436832 367485 327688 295199 268788 245050 226046 209565 195799 199649
20067 199649 220241 248782 290268 340311 360736 360354 335760 297579 257296 232745 216483 216213
20055 216213 224120 230938 232686 240610 249163 249813 239088 223714 213074 205671 212180 223917 247411
20042 247411 284403 333932 393035 469488 575841 714438 874384 1020180 1108811 1114748 1042204
20031 1042204 929509 824349 759778 735735 737337 739247 705488 646624 567646 497037 449623
$$ packed form
20114E08288r216Q660J7102K5188R635j0921l3346n2587l7870J675J9695J3565
20102D59868j2628l4928l9883k2433j3263n720J1983K1206M8741O2218N3769K8445
20090E57375j6771l7283m6722k2972r327J6389M8887Q4643J00666P2245r554p8952
20078F58624j17244j04548o9347l9797l2489k6411k3738j9004j6481j3766L850
20067A99649K0592K8541M1486N0043K0425l82k4594l8181m0283k4551j6262k70
20055B16213P907O818J748P924Q553O50j0725j5374j0640p403O509J1737K3494
20042B47411L6992M9529N9103P6453J06353J38597J59946J45796Q8631N937p2544
20031A042204j12695j05160o4571k4043J602J910l3759n8864p8978p0609m7414
$$ plain form
20020 449623 428376 436793 474532 513560 537615 529848 499903 459009 415222 386621 368672 366551
20008 366551 381627 427174 505244 601156 707372 810149 896047 967968 1034223 1100435 1146622
19997 1146622 1152593 1092180 972138 815283 657243 516657 424029 361359 320827 302176 299064
19986 299064 309579 326607 364754 429229 523611 654930 761589 781014 710854 598058 495129
19975 495129 432733 401682 400675 421460 475949 528432 549988 541828 516781 477963 449996 428236
19963 428236 413107 405218 411632 447051 481692 491906 483298 474323 495287 549899 612332 658210
19951 658210 660145 632658 579504 537329 516357 522126 549849 616996 725061 834885 878182
19940 878182 826240 706276 584818 493607 435327 399822 370347 356962 353692 361241 366587 362930
$$ packed form
20020D49623k1247Q417L7739L9028K4055p767k9945m0894m3787k8601j7949k121
20008C66551J5076M5547P8070R5912J06216J02777Q5898P1921O6255O6212M6187
19997A146622N971o0413j20042j56855j58040j40586r2628o2670m0532j8651l112
19986B99064J0515J7028L8147O4475R4382J31319J06659J9425p0160j12796j02929
19975D95129o2396l1051j007K0785N4489N2483K1556q160k5047l8818k7967k1760
19963D28236j5129p889O414L5419L4641J0214q608q975K0964N4612O2433M5878
19951F58210J935k7487n3154m2175k0972N769K7723O7147J08065J09824M3297
19940H78182n1942j19964j21458r1211n8280l5505k9475j3385l270P549N346l657
$$ plain form
19928 362930 366753 375645 381481 384031 380087 388611 395948 400659 402507 381094 357204 332282 311301
19915 311301 300473 295541 283709 258721 237024 224112 225270 223178 226319 228565 217852 204645
19903 204645 185171 173082 178210 203065 239206 274113 288490 294645 293740 281206 265097 246579
19891 246579 222794 211507 210922 213263 216603 223517 222905 211196 213661 223507 230032 237805 250850 251675
19877 251675 240534 225955 217151 212896 213648 223643 242601 261711 286915 304331 308827 307157 295618
19864 295618 284845 276751 274317 293830 319256 344563 360384 378380 390884 388371 367227 334767
19852 334767 307176 287422 268022 245981 227648 222447 224640 235046 243322 245922 256414 273927
19840 273927 274946 259591 241849 223794 206806 199127 202040 211696 221033 227183 228416 231355 240746
$$ packed form
19928C62930L823Q892N836K550l944Q524P337M711J848k1413k3890k4922k0981
19915C11301j0828m932j1832k4988k1697j2912J158k092L141K246j0713j3207
19903B04645j9474j2089N128K4855L6141L4907J4377O155r05j2534j6109j8518
19891B46579k3785j1287n85K341L340O914o12j1709K465R846O525P773J3045Q25
19877B51675j1141j4579q804m255P52R995J8958J9110K5204J7416M496j670j1539
19864B95618j0773q094k434J9513K5426K5307J5821J7996J2504k513k1144l2460
19852C34767k7591j9754j9400k2041j8333n201K193J0406Q276K600J0492J7513
19840B73927J019j5355j7742j8055j6988p679K913R656R337O150J233K939R391
$$ plain form
19827 240746 249503 251773 250469 248053 242438 236056 235736 238012 248059 255533 270088 287981 304844
19814 304844 323921 344652 357022 369411 388248 412550 448728 509487 584683 644821 661665
19803 661665 643330 586621 522088 475410 455291 457165 477468 527628 586687 633639 657277 642220
19791 642220 605664 549924 499132 461392 457886 476669 490548 499558 505681 497760 488245 478070
19779 478070 471678 487366 512625 526241 528027 526680 522242 518050 514671 524419 551306 610426 679552
19766 679552 731633 719907 659711 577443 501637 438449 401056 390979 391576 408529 437759 456051
19754 456051 462553 454423 423038 385037 350036 325155 302057 278771 259812 242181 224222 215581
19742 215581 209618 194013 177343 177864 177069 175987 178968 190823 213680 245567 299237 377178 457138
$$ packed form
19827B40746Q757K270j304k416n615o382l20K276J0047P474J4555J7893J6863
19814C04844J9077K0731J2370J2389J8837K4302L6178O0759P5196O0138J6844
19803F61665j8335n6709o4533m6678k0119J874K0303N0160N9059M6952K3638j5057
19791F42220l6556n5740n0792l7740l506J8783J3879R010O123p921r515j0175
19779D78070o392J5688K5259J3616J786j347m438m192l379R748K6887N9120O9126
19766F79552N2081j1726o0196q2268p5806o3188l7393j0077N97J6953K9230J8292
19754D56051O502q130l1385l8001l5001k4881k3098k3286j8959j7631j7959q641
19742B15581n963j5605j6670N21p95j082K981J1855K2857L1887N3670P7941P9960
$$ plain form
19729 457138 514073 522165 467930 387750 319887 283810 274719 273400 292226 324036 347757 356411
19717 356411 337047 294756 254182 222252 204067 190773 185011 178571 178597 175326 181608 192620 204679
19704 204679 231011 272632 317284 361615 381857 371070 345433 324706 316639 322718 347356 402536
19692 402536 483351 575972 617627 592944 514919 413264 337113 282979 246913 230023 221509
19681 221509 210968 200662 199120 194123 181279 166628 158173 154968 157429 157578 158657 163438 176790
19668 176790 184331 196382 203622 207733 211036 213247 210991 211752 210506 204832 204170 204120 205638 212833 204393
19653 204393 191696 189342 191645 186804 179033 168361 157124 146681 136688 140690 151203 158144 162724
19640 162724 161627 172220 179766 169648 163980 164423 169057 165553 162012 161792 154298 149950 152520 150583
$$ packed form
19729D57138N6935Q092n4235q0180o7863l6077r091j319J8826L1810K3721Q654
19717C56411j9364m2291m0574l1930j8185j3294n762o440K6l271O282J1012J2059
19704B04679K6332M1621M4652M4331K0242j0787k5637k0727q067O079K4638N5180
19692D02536Q0815R2621M1655k4683p8025j01655p6151n4134l6066j6890q514
19681B21509j0541j0306j542m997j2844j4651q455l205K461J49J079M781J3352
19668A76790P541J2051P240M111L303K211k256P61j246n674o62n0J518P195q440
19653B04393j2697k354K303m841p771j0672j1237j0443r993M002J0513O941M580
19640A62724j097J0593P546j0118n668M43M634l504l541k20p494m348K570j937
$$ plain form
19626 150583 157206 165233 166265 179478 191122 194020 183609 175075 165452 152068 148395 148405 166278
19613 166278 175775 194173 219807 249638 266605 267890 251270 221450 202210 201128 208821 213768
19601 213768 225222 230944 223563 213596 192815 179767 169382 154788 148345 145011 139724 133693 129087
19588 129087 125270 126750 133359 134013 139924 137053 149672 156799 157335 160105 160921 156339 152966 152274 156478
19573 156478 174491 198080 222610 231835 215276 191069 158750 130774 115368 107245 102620 94387
19561 94387 92444 87768 78175 72059 73084 80294 85582 89018 86712 83161 75692 61634 55123 45477
19547 45477 38009 31474 33362 34363 35068 30684 34444 35417 28199 22323 22703 22235 20654 15521 16029 18970
19531 18970 27268 33176 34869 31627 30330 31825 34986 30013 24881 26747 42697 48036 39394 38288
$$ packed form
19626A50583O623Q027J032J3213J1644K898j0411q534r623j3384l673J0J7873
19613A66278R497J8398K5634K9831J6967J285j6620k9820j9240j082P693M947
19601B13768J1454N722p381r967k0781j3048j0385j4594o443l334n287o031m606
19588A29087l817J480O609O54N911k871J2619P127N36K770Q16m582l373o92M204
19573A56478J8013K3589K4530R225j6559k4207l2319k7976j5406q123m625q233
19561I4387j943m676r593o116J025P210N288L436k306l551p469j4058o511r646
19547D5477p468o535J888J001P05m384L760R73p218n876L80m68j581n133N08K941
19531A8970Q298N908J693l242j297J495L161m973n132J866J5950N339q642j106
$$ plain form
19517 38288 43568 39892 52186 68336 81480 96868 113145 116948 125414 145873 166473 163921 150653
19504 150653 122946 112920 109069 105174 106768 108322 114397 137867 179699 219653 244042 247752 232282
19491 232282 214007 194638 171337 145986 122827 113735 122532 139784 167787 209584 242100 243921
19479 243921 228188 207281 195294 205223 205416 204419 200868 191400 174920 145786 125070 111679 102842
19466 102842 94437 92054 91403 98251 103846 114295 128077 152450 176941 196276 199079 188538 170295
19453 170295 157724 163749 172869 173837 164957 163003 184508 215943 243014 262757 243013 208390 167483
19440 167483 133076 106276 89169 76810 82653 90133 108525 138381 162083 169472 155946 122503
19428 122503 102507 92637 87173 83787 80015 81305 78089 65104 60519 58063 53421 56455 63977 64254
$$ packed form
19517C8288N280l676J2294J6150J3144J5388J6277L803Q466K0459K0600k552j3268
19504A50653k7707j0026l851l895J594J554O075K3470M1832L9954K4389L710j5470
19491B32282j8275j9369k3301k5351k3159r092Q797J7252K8003M1797L2516J821
19479B43921j5733k0907j1987R929J93r97l551r468j6480k9134k0716j3391q837
19466A02842q405k383o51O848N595J0449J3782K4373K4491J9335K803j0541j8243
19453A70295j2571O025R120R68q880j954K1505L1435K7071J9743j9744l4623m0907
19440A67483l4407k6800j7107j2359N843P480J8392K9856K3702P389j3526l3443
19428A22503j9996r870n464l386l772J290l216j2985m585k456m642L034P522K77
$$ plain form
19414 64254 67819 60297 57376 65241 76718 84215 97487 112074 121802 131927 127837 109139 96404
19401 96404 88293 78411 77793 83094 81627 80686 96913 99520 89151 82088 77358 71103 64465 61311
19387 61311 55855 54149 52501 64055 70645 67574 54527 55497 58439 69996 81784 91885 89474
19374 89474 87627 83832 78433 70931 72855 72856 85060 108973 125626 132680 128260 110658 87904 72086
19360 72086 63057 57756 52793 45757 42520 39662 39410 30907 22729 29909 29157 25088 23002 25865 31583
19345 31583 33183 29614 31323 33976 25838 23562 27781 24496 21981 24827 32671 34296 37437 32305
19331 32305 28867 39430 42145 38283 32260 31106 31597 30967 41449 43646 39663 38494 31064 26443
19317 26443 32679 33822 31813 24896 29037 32792 31652 37287 36079 42878 42691 36378 32331 35889 37560
$$ packed form
19414F4254L565p522k921P865J1477P497J3272J4587R728J0125m090j8698j2735
19401I6404q111r882o18N301j467r41J6227K607j0369p063m730o255o638l154
19387F1311n456j706j648J1554O590l071j3047R70K942J1557J1788J0101k411
19374H9474j847l795n399p502J924JJ2204K3913J6653P054m420j7602k2754j5818
19360G2086r029n301m963p036l237k858k52q503q178P180p52m069k086K863N718
19345C1583J600l569J709K653q138k276M219l285k515K846P844J625L141n132
19331C2305l438J0563K715l862o023j154M91o30J0482K197l983j169p430m621
19317B6443O236J143k009o917M141L755j140N635j208O799j87o313m047L558J671
$$ plain form
19302 37560 33889 35321 43350 41494 40427 33505 39834 47662 48108 50503 49803 53782 59513 65207 70619
19287 70619 75783 81978 86213 86967 82566 91584 103480 125704 160206 224692 345605 505336 595814
19274 595814 598534 519048 451948 482483 590069 678167 698647 666565 668573 731237 747599 685112
19262 685112 576094 520658 563018 658784 676987 595411 455348 331832 261409 222480 200887
19251 200887 193865 191685 193268 211576 253586 333752 455445 579138 620014 577805 496935 487973
19239 487973 563464 659526 699467 683145 654547 678739 715876 686485 596460 502832 497904 573207
19227 573207 642594 620953 505916 355967 260431 204098 168986 149905 139488 137611 130770
19216 130770 117214 104757 98356 98566 103949 103950 100138 102278 99726 88232 82467 82544 83702 78992 78094
$$ packed form
19302C7560l671J432Q029j856j067o922O329P828M46K395p00L979N731N694N412
19287G0619N164O195M235P54m401R018J1896K2224L4502O4486J20913J59731R0478
19274E95814K720p9486o7100L0535J07586Q8098K0480l2082K008O2664J6362o2487
19262F85112j09018n5436M2360R5766J8203q1576j40063j23516p0423l8929k1593
19251B00887p022k180J583J8308M2010Q0166J21693J23693M0876m2209q0870q962
19239D87973P5491R6062L9941j6322k8598K4192L7137k9391r0025r3628m928P5303
19227E73207O9387k1641j15037j49949r5536n6333l5112j9081j0417j877o841
19216A30770j3556j2457o401K10N383Jl812K140k552j1494n765P7J158m710q98
$$ plain form
19201 78094 76273 75179 82699 88624 86843 77382 72482 70566 80995 77872 67256 62134 60134 60526
19187 60526 61931 60873 69787 70788 65253 66138 70280 69380 66287 65380 72531 72294 65720 63822 71533
19172 71533 78388 82459 84090 82176 90966 106744 113115 113300 104492 97956 96283 96814 104450 108064 104808
19157 104808 102178 103300 103591 99334 100593 102963 106931 100947 95068 90772 93992 88179 86444 94420
19143 94420 98331 101333 102914 103120 106280 105831 97814 90963 93514 97772 107172 116232 118360 117505 111876
19128 111876 108547 110958 115336 117547 118977 122889 132629 138556 142365 157773 183932 200809 228516
19115 228516 264356 299291 325404 329302 309607 280340 252169 236987 236479 242982 251901 258362 271621
19102 271621 274899 262588 236965 209930 182256 177695 170301 155441 157332 158261 169929 180839 183401
$$ packed form
19201G8094j821j094P520N925j781r461m900j916J0429l123j0616n122k000L92
19187F0526J405j058Q914J001n535Q85M142r00l093r07P151k37o574j898P711
19172G1533O855M071J631j914Q790J5778O371J85q808o536j673N31P636L614l256
19157A04808k630J122K91m257J259K370L968n984n879m296L220n813j735P976
19143I4420L911L002J581K06L160m49q017o851K551M258R400R060K128q55n629
19128A11876l329K411M378K211J430L912R740N927L809J5408K6159J6877K7707
19115B28516L5840L4935K6113L898j9695k9267k8171j5182n08O503Q919O461J3259
19102B71621L278j2311k5623k7035k7674m561p394j4860J891R29J1668J0910K562
$$ plain form
19089 183401 198748 226031 254290 285285 310730 314168 313899 317336 341282 383592 453478 573525
19077 573525 745650 960039 1148218 1214599 1133264 957021 778576 650842 580862 553656
19067 553656 560808 603123 655468 684115 661361 587935 511217 451593 399943 356686 329432 318065
19055 318065 330137 351460 364841 381237 411918 473422 558229 666628 784489 864831 855986
19044 855986 783729 689141 622720 619115 658090 748758 894383 1056516 1156161 1129095 978317
19033 978317 778557 606160 481721 407848 354228 313082 287239 262048 239163 232569 229830
19022 229830 231667 233733 246689 270119 311949 338353 325836 298217 283453 276044 282145 289961
19010 289961 304336 349439 417969 465909 472763 448676 398999 369132 351322 334565 317091 311819
$$ packed form
19089A83401J5347K7283K8259L0995K5445L438k69L437K3946M2310O9886J20047
19077E73525J72125K14389J88179O6381q1335j76243j78445j27734o9980k7206
19067E53656P152M2315N2345K8647k2754p3426p6718n9624n1650m3257k7254j1367
19055C18065J2072K1323J3381J6396L0681O1504Q4807J08399J17861Q0342q845
19044H55986p2257r4588o6421l605L8975R0668J45625J62133R9645k7066j50778
19033I78317j99760j72397j24439p3873n3620m1146k5843k5191k2885o594k739
19022B29830J837K066J2956K3430M1830K6404j2517k7619j4764p409O101P816
19010B89961J4375M5103O8530M7940O854k4087m9677k9867j7810j6757j7474n272
$$ plain form
18998 311819 307278 306743 304493 300817 289160 273035 261855 249434 240442 238741 226615 218826 212770
18985 212770 211664 205250 197794 189556 188182 193734 201075 208644 215231 220838 222993 222380 223639 223739 228857
18970 228857 252241 282417 312474 324118 322814 319458 307233 287358 273714 274363 287708 305941
18958 305941 329750 344322 351454 351687 343489 327499 306242 285208 267412 257263 251406 245171 245778
18945 245778 234634 225158 225430 233659 243815 243941 241460 234032 227915 226565 226835 230062 227423 236250
18931 236250 233623 245016 264725 269959 263310 250927 247725 250392 258116 271967 284444 288015 286000
18918 286000 288772 306754 315002 307875 290112 281494 287118 300702 319508 349558 365883 355537
18906 355537 320494 269029 212294 193559 210403 235249 256885 280291 296842 313934 324932
$$ packed form
18998C11819m541n35k250l676j1657j6125j1180j2421q992j701j2126p789o056
18985B12770j106o414p456q238j374N552P341P569O587N607K155o13J259J00N118
18970B28857K3384L0176L0057J1644j304l356j2225j9875j3644O49J3345J8233
18958C05941K3809J4572P132K33q198j5990k1257k1034j7796j0149n857o235O07
18945B45778j1144r476K72Q229J0156J26k481p428o117j350K70L227k639Q827
18931B36250k627J1393J9709N234o649j2383l202K667P724J3851J2477L571k015
18918B86000K772J7982Q248p127j7763q618N624J3584J8806L0050J6325j0346
18906C55537l5043n1465n6735j8735J6844K4846K1636K3406J6551J7092J0998
$$ plain form
18895 324932 317903 293484 283279 291804 316525 334085 338558 350880 369539 393934 427194 452176
18883 452176 473938 506954 519729 537384 564979 556004 523346 501074 473843 453770 429863 423709
18871 423709 440171 443886 421858 373375 325083 300549 297399 305263 308818 310500 331464 364193
18859 364193 389679 397623 405371 413826 436191 448145 456627 463285 469872 480831 498913 507695 524269
18846 524269 530091 560167 595008 622305 648903 647492 636708 662596 695750 708973 717674 772301
18834 772301 937683 1284567 1720181 2097089 2382391 2437263 2256838 1876999 1402317 1028302
18824 1028302 803993 693995 644605 632249 649743 676755 703227 726355 740661 743683 757813
18813 757813 796980 872750 989101 1135323 1304550 1453838 1564945 1596593 1556474 1491936
$$ packed form
18895C24932p029k4419j0205Q525K4721J7560M473J2322J8659K4395L3260K4982
18883D52176K1762L3016J2775J7655K7595q975l2658k2272k7231k0073k3907o154
18871D23709J6462L715k2028m8483m8292k4534l150P864L555J682K0964L2729
18859C64193K5486P944P748Q455K2365J1954Q482O658O587J0959J8082Q782J6574
18846E24269N822L0076L4841K7297K6598j411j0784K5888L3154J3223Q701N4627
18834G72301J65382L46884M35614L76908K85302N4872j80425l79839m74682l74015
18824A028302k24309j09998m9390j2356J7494K7012K6472K3128J4306L022J4130
18813G57813L9167P5770J16351J46222J69227J49288J11107L1648m0119o4538
$$ plain form
18803 1491936 1419943 1373256 1412841 1537387 1687663 1763222 1776097 1765883 1770733 1730995 1605131
18792 1605131 1432861 1319582 1298403 1319446 1353496 1377306 1409955 1464467 1529866 1583475 1624197
18781 1624197 1651427 1716737 1847039 2026257 2225358 2428662 2677398 2961817 3201256 3384845
18771 3384845 3554580 3859726 4430857 5269923 6119669 6738142 7142343 7544476 8246298
18762 8246298 9252159 10624848 12489881 15054395 18679133 23929386 31741816 44575307
18754 44575307 68069800 111429457 177096124 233071409 242480945 206292222 140090665
18747 140090665 90116097 65712008 56350297 56987540 68518995 93954002 124396811
18740 124396811 137775524 126588629 94810076 62747087 43830279 34050554 28685721
$$ packed form
18803A491936p1993m6687L9585J24546J50276P5559J2875j0214M850l9738j25864
18792A605131j72270j13279k1179K1043L4050K3810L2649N4512O5399N3609M0722
18781A624197K7230O5310J30302J79218J99101K03304K48736K84419K39439J83589
18771C384845J69735L05146N71131Q39066Q49746O18473M04201M02133P01822
18762H246298J005861J372689J865033K564514L624738N250253P812430J2833491
18754D4575307K3494493M3359657O5666667N5975285R409536l6188723o6201557
18747A40090665m9974568k4404089r361711O37243J1531455K5435007L0442809
18740A24396811J3378713j1186895l1778553l2062989j8916808r779725n364833
$$ plain form
18733 28685721 25540970 24040479 23984466 25156286 27543022 31971017 40840511 58795827
18725 58795827 89175510 120415213 133594295 122777469 94294330 68299021 55254557
18718 55254557 53153094 60788241 82570666 128704552 193891583 234435800 230500133
18711 230500133 180182266 115496601 72374412 49212049 36438739 28303508 22591523
18704 22591523 18557962 15773499 13784334 12145929 10803063 9953291 9488171 9009068
18696 9009068 8277497 7277622 6330114 5616237 5126655 4747825 4362684 3936647 3493886
18687 3493886 3145919 2899758 2718066 2563730 2402255 2232214 2057912 1892615 1750224
18678 1750224 1643466 1551546 1470203 1396873 1329223 1256438 1188232 1115949 1050902 992163 935495
$$ packed form
18733B8685721l144751j500491n6013J171820K386736M427995Q869494J7955316
18725E8795827L0379683L1239703J3179082j0816826k8483139k5995309j3044464
18718E5254557k101463P635147K1782425M6133886O5187031M0544217l935667
18711B30500133n0317867o4685665m3122189k3162363j2773310q135231n711985
18704B2591523m033561k784463j989165j638405j342866q49772m65120m79103
18696I009068p31571r99875r47508p13877m89582l78830l85141m26037m42761
18687C493886l47967k46161j81692j54336j61475j70041j74302j65297j42391
18678A750224j06758r1920q1343p3330o7650p2785o8206p2283o5047n8739n6668
$$ plain form
18667 935495 880253 813242 734152 660304 610078 589424 580180 565051 554249 549321 542925 534783
18655 534783 523763 499376 474105 449992 428290 413957 392221 356014 323467 311330 321596
18644 321596 338741 351764 367336 385724 398108 389403 361856 332790 320631 317216 310660 295640
18632 295640 287928 288059 303147 319045 297593 252071 216270 193845 176675 169382 168695 172820 193679
18619 193679 211114 224805 230069 219981 209222 192396 175163 163802 152351 158534 170712 182985
18607 182985 188736 187144 173285 168525 172990 182641 187351 193071 208488 223116 224241 192563 134658
18594 134658 84122 76821 107216 132568 141535 149084 163943 157504 128887 88353 57603 64646
18582 64646 85583 98665 122379 124405 116906 115305 118302 113622 106669 107943 114801 129775 133752
$$ packed form
18667I35495n5242o7011p9090p3848n0226k0654r244j5129j0802m928o396q142
18655E34783j1020k4387k5271k4113k1702j4333k1736l6207l2547j2137J0266
18644C21596J7145J3023J5572J8388J2384q705k7547k9066j2159l415o556j5020
18632B95640p712J31J5088J5898k1452m5522l5801k2425j7170p293o87M125K0859
18619A93679J7435J3691N264j0088j0759j6826j7233j1361j1451O183J2178J2273
18607A82985N751j592j3859m760M465R651M710N720J5417J4628J125l1678n7905
18594A34658n0536p301L0395K5352Q967P549J4859o439k8617m0534l0750P043
18582F4646K0937J3082K3714K026p499j601K997m680o953J274O858J4974L977
$$ plain form
18569 133752 128358 108672 104968 108037 121276 145001 169645 194376 229994 266653 274606 233842
18557 233842 176509 143160 121305 117818 131963 149196 166106 181750 183510 180360 167953 153819
18545 153819 142678 135180 135023 129442 119492 114880 125050 142999 161666 179260 191305 223104 272284
18532 272284 338902 432455 561971 712847 855637 981992 1085118 1138274 1119896 1045972
18522 1045972 948589 847737 761031 703425 666051 657028 659819 665918 658941 619949 561670 504462
18510 504462 456950 421036 404652 417531 450751 495919 548536 604536 658193 699090 722295
18499 722295 736999 760911 787177 800519 790718 791359 827530 917852 1054054 1219951 1338302
18488 1338302 1373822 1316357 1200173 1082029 972614 878170 785456 718683 692340 677053 647439
$$ packed form
18569A33752n394j9686l704L069J3239K3725K4644K4731L5618L6659P953m0764
18557B33842n7333l3349k1855l487J4145J7233J6910J5644J760l150j2407j4134
18545A53819j1141p498j57n581r950m612J0170J7949J8667J7594J2045L1799M9180
18532B72284O6618R3553J29516J50876J42790J26355J03126N3156j8378p3924
18522A045972r7383j00852q6706n7606l7374r023K791O099o977l8992n8279n7208
18510E04462m7512l5914j6384J2879L3220M5168N2617N6000N3657M0897K3205
18499G22295J4704K3912K6266J3342r801O41L6171R0322J36202J65897J18351
18488A338302L5520n7465j16184j18144j09415r4444r2714o6773k6343j5287k9614
$$ plain form
18477 647439 592217 510656 434976 386789 346096 316676 304783 321540 358179 397640 428224
18466 428224 437215 444107 450180 453465 455805 428308 368384 295142 237573 205333 191996 199502 237795
18453 237795 317060 437577 514284 504746 409130 290219 211322 178890 165852 169235 180527
18442 180527 191720 200127 194219 176319 156713 134412 126773 137562 149418 152494 154074 149016 156764
18429 156764 164030 160233 154508 144224 132618 125221 118813 113146 101135 92170 86012 82457 85433
18416 85433 92143 97979 107151 112240 121697 124270 109992 98068 85143 87681 85850 98447 120779
18403 120779 135618 147260 161788 174944 180517 182651 182483 185452 173531 161776 140057 112859
18391 112859 102331 97342 94841 97993 114329 146568 183983 230934 299507 396945 523949 673409
$$ packed form
18477F47439n5222q1561p5680m8187m0693k9420j1893J6757L6639L9461L0584
18466D28224Q991O892O073L285K340k7497n9924p3242n7569l2240j3337P506L8293
18453B37795P9265J20517P6707r538r5616j18911p8897l2432j3038L383J1292
18442A80527J1193Q407n908j7900j9606k2301p639J0789J1856L076J580n058P748
18429A56764P266l797n725j0284j1606p397o408n667j2011q965o158l555K976
18416H5433O710N836R172N089R457K573j4278j1924j2925K538j831J2597K2332
18403A20779J4839J1642J4528J3156N573K134j68K969j1921j1755k1719k7198
18391A12859j0528m989k501L152J6336L2239L7415M6951O8573R7438J27004J49460
$$ plain form
18379 673409 800888 844346 793940 683649 570138 485953 424635 384308 378199 396397 442688
18368 442688 482448 474094 422251 348642 290863 245111 207057 183691 175599 168139 157571 163590
18356 163590 183474 215087 260073 321420 392085 471386 525969 533077 491327 438729 403598 394610
18344 394610 399997 429380 492644 601233 714128 761428 713135 599958 480338 379691 298058
18333 298058 238898 189542 150928 128799 119690 108987 99008 91461 94798 95143 93656 86536 84550
18320 84550 87576 87542 83433 80479 86049 86407 74205 64086 60025 63772 63923 68624 68538 73289 69705
18305 69705 68819 65546 57607 50429 45053 44236 44553 43992 52130 62523 69130 81656 93106 103427
18291 103427 112117 122969 128411 144065 170781 206290 240460 267367 291979 321700 351372 393630
$$ packed form
18379F73409J27479M3458n0406j10291j13511q4185o1318m0327o109J8198M6291
18368D42688L9760q354n1843p3609n7779m5752l8054k3366q092p460j0568O019
18356A63590J9884L1613M4986O1347P0665P9301N4583P108m1750n2598l5131q988
18344C94610N387K9383O3264J08589J12895M7300m8293j13177j19620j00647q1633
18333B98058n9160m9356l8614k2129r109j0703r979p547L337L45j487p120j986
18320H4550L026l4m109k954N570L58j2202j0119m061L747J51M701q6M751l584
18305F9705q86l273p939p178n376q17L17n61Q138J0393O607J2526J1450J0321
18291A03427Q690J0852N442J5654K6716L5509L4170K6907K4612K9721K9672M2258
$$ plain form
18279 393630 439536 474752 519127 593730 730057 914433 1019862 996416 864140 703548
18269 703548 613442 570288 563013 584469 641544 751214 899218 1051990 1225278 1469047 1854975
18258 1854975 2399203 2971635 3359064 3362133 3011971 2504571 2074526 1834229 1791085 1901920
18248 1901920 2131270 2462065 2768941 2868440 2681619 2259148 1812713 1463913 1230870 1108843
18238 1108843 1056626 1099127 1250849 1418926 1521029 1565674 1623416 1804502 2063789 2342296
18228 2342296 2550096 2642142 2632768 2520258 2374524 2262465 2227362 2363914 2708133 3183362
18218 3183362 3676279 4025112 4105441 3868621 3376266 2736782 2110933 1575734 1196845 957247
18208 957247 802316 704617 640330 592212 564152 559213 588576 668397 806686 948818 1013463
$$ packed form
18279C93630M5906L5216M4375P4603J36327J84376J05429k3446j32276j60592
18269G03548r0106m3154p275K1456N7075J09670J48004J52772J73288K43769L85928
18258A854975N44228N72432L87429L069l50162n07400m30045k40297m3144J10835
18248A901920K29350L30795L06876R9499j86821m22471m46435l48800k33043j22027
18238A108843n2217M2501J51722J68077J02103M4645N7742J81086K59287K78507
18228B342296K07800R2046r374j12510j45734j12059l5103J36552L44219M75229
18218C183362M92917L48833Q0329k36820m92355o39484o25849n35199l78889k39598
18208I57247j54931r7699o4287m8118k8060m939K9363P9821J38289J42132O4645
$$ plain form
18197 1013463 1001612 943807 961005 1091682 1245664 1324541 1308386 1237335 1224397 1198626 1083958
18186 1083958 909018 748553 692129 744792 798218 780411 670225 519169 404595 332311
18176 332311 294143 267928 247314 243843 240178 238694 237245 235235 230873 230886 237114 248727 257769 263872
18162 263872 266966 265766 251067 233056 211712 189404 158599 132077 122701 122215 119108 110926 102878
18149 102878 101881 101083 95842 100613 103346 102390 109368 116638 118126 120663 118353 105701 104224 108196 119880
18134 119880 127211 137979 148363 160619 157258 146260 147396 149206 158408 180814 204696 225035
18122 225035 251196 291533 332203 375678 446227 528012 642887 821757 1087688 1530267 2345091
18111 2345091 4016290 7557817 12367860 14263873 13149329 8685295 4763727 2880972
$$ packed form
18197A013463j1851n7805J7198J30677J53982P8877j6155p1051j2938k5771j14668
18186A083958j74940j60465n6424N2663N3426j7807j10186j51056j14574p2284
18176C32311l8168k6215k0614l471l665j484j449k010m362J3O228J1613R042O103
18162B63872L094j200j4699j8011k1344k2308l0805k6522r376m86l107q182q048
18149A02878r97p98n241M771K733r56O978P270J488K537k310j2652j477L972J1684
18134A19880P331J0768J0384J2256l361j0998J136J810R202K2406K3882K0339
18122B25035K6161M0337M0670M3475P0549Q1785J14875J78870K65931M42579Q14824
18111B345091J671199L541527M810043J896013j114544m464034l921568j882755
$$ plain form
18103 2880972 1963306 1449586 1116882 892595 731536 622255 545127 478701 428423 398783
18093 398783 384213 377006 364673 349360 340432 332698 319965 312296 303991 293726 279029 256037
18081 256037 240281 241930 245966 246133 244720 242436 241486 235162 227801 214175 199552 194631 189989 193228
18067 193228 191938 189904 191151 194426 206582 220454 230584 239765 249505 259937 278978 306159 324277
18054 324277 328098 324610 316739 312543 311312 319529 332745 349579 372559 388347 387406 369740 336300
18041 336300 304115 269951 238377 218317 212136 215340 224422 227828 229460 231942 237681 258611 283804
18028 283804 292538 301207 307578 308523 300542 296265 295569 299182 315729 345149 398447 444449 458351
18015 458351 444702 415726 375203 337082 303531 282082 277131 292930 306117 314364 311188 310937
$$ packed form
18103B880972r17666n13720l32704k24287j61059j09281p7128o6426n0278k9640
18093C98783j4570p207j2333j5313q928p734j2733p669q305j0265j4697k2992
18081B56037j5756J649M036J67j413k284r50o324p361j3626j4623m921m642L239
18067A93228j290k034J247L275J2156J3872J0130R181R740J0432J9041K7181J8118
18054C24277L821l488p871m196j231Q217J3216J6834K2980J5788r41j7666l3440
18041C36300l2185l4164l1574k0060o181L204R082L406J632K482N739K0930K5193
18028B83804Q734Q669O371R45p981m277o96L613J6547K9420N3298M6002J3902
18015D58351j3649k8976m0523l8121l3551k1449m951J5799J3187Q247l176k51
$$ plain form
18003 310937 306275 306625 316756 320622 331744 343633 350947 348371 342965 333828 335291 360724 396407
17990 396407 412198 416085 412783 406526 386635 358310 339927 331065 325157 327572 332452 332079 333733
17977 333733 330830 324545 317601 325810 337405 359409 382103 397250 420196 448829 479292 518072
17965 518072 569583 659234 779831 945954 1169218 1504786 2011156 2689283 3447257 4088328
17955 4088328 4399685 4264537 3729678 2987874 2260833 1679422 1269707 993220 814459
17946 814459 688915 609971 553788 507776 472374 451992 426295 396669 379799 382154 396779
17935 396779 414840 421625 433493 427190 420330 399324 370643 345659 340085 336969 352078 375304
17923 375304 382683 381249 377097 354756 330068 310384 296011 281682 272774 260086 250520 237884
$$ packed form
18003C10937m662L50J0131L866J1122J1889P314k576n406r137J463K5433L5683
17990C96407J5791L887l302o257j9891k8325j8383q862n908K415M880l73J654
17977C33733k903o285o944Q209J1595K2004K2694J5147K2946K8633L0463L8780
17965E18072N1511Q9651J20597J66123K23264L35568N06370O78127P57974O41071
17955D088328L11357j35148n34859p41804p27041n81411m09715k76487j78761
17946H14459j25544p8944n6183m6012l5402k0382k5697k9626j6870K355J4625
17935C96779J8061O785J1868o303o860k1006k8681k4984n574l116J5109K3226
17923C75304P379j434m152k2341k4688j9684j4373j4329q908j2688r566j2636
$$ plain form
17911 237884 228452 222733 227327 242751 252098 261814 269769 271594 261608 254367 258491 277135 298737
17898 298737 328720 367640 396167 413116 414297 404655 397693 378627 369580 381324 400408 409308
17886 409308 399050 375987 351252 317561 284921 258211 244781 239943 245905 257053 257867 243191
17874 243191 224486 213867 210315 210227 206555 205071 213198 225710 233157 246580 260157 280307 309764
17861 309764 348763 396771 447220 503965 574448 660064 755521 840133 901089 928410 929831 937212
17849 937212 966694 1021967 1086498 1162693 1227823 1268075 1255077 1184111 1074193 931137 773316
17838 773316 619789 501856 430896 383511 346064 334505 328950 325209 327192 338264 361321 393670
17826 393670 427720 458625 466536 452077 420342 395413 384783 401178 448449 523635 615220 694774
$$ packed form
17911B37884r432n719M594J5424R347R716P955J825r986p241M124J8644K1602
17898B98737K9983L8920K8527J6949J181r642o962j9066r047J1744J9084Q900
17886D09308j0258k3063k4735l3691l2640k6710j3430m838N962J1148Q14j4676
17874B43191j8705j0619l552q8l672j484Q127J2512P447J3423J3577K0150K9457
17861C09764L8999M8008N0449N6745P0483Q5616R5457Q4612O0956K7321J421P381
17849I37212K9482N5273O4531P6195O5130M0252j2998p0966j09918j43056j57821
17838G73316j53527j17933p0960m7385l7447j1559n555l741J983J1072K3057L2349
17826C93670L4050L0905P911j4459l1735k4929j0630J6395M7271P5186R1585P9554
$$ plain form
17814 694774 723260 693040 615882 513740 420521 336309 285462 263033 263855 265972 265515 259206
17802 259206 259234 259613 249579 236049 219835 210244 211378 223945 243117 260464 273382 286033 286962
17789 286962 276627 263763 251104 238170 222032 213767 216302 211735 206844 211820 217560 217853 221465
17776 221465 223226 225076 223824 217775 207116 196688 181993 175098 164574 163889 175585 196289 216392
17763 216392 234490 247013 258159 266129 279107 290743 290658 291922 293658 298744 321141 352128 377531
17750 377531 395678 399858 391931 381429 357521 325770 304266 288721 276067 266091 257975 249198
17738 249198 239772 226382 218909 212272 205569 203046 201070 201159 201732 200813 198220 190081 186967 190200 200013
17723 200013 213814 223111 246591 266289 272913 267082 251005 239269 237190 232841 231556 233732 236092
$$ packed form
17814F94774K8486l0220p7158j02142r3219q4212n0847k2429Q22K117m57o309
17802B59206K8L79j0034j3530j6214r591J134J2567J9172J7347J2918J2651R29
17789B86962j0335j2864j2659j2934j6138q265K535m567m891M976N740K93L612
17776B21465J761J850j252o049j0659j0428j4695o895j0524o85J1696K0704K0103
17763B16392J8098J2523J1146P970J2978J1636q5J264J736N086K2397L0987K5403
17750C77531J8147M180p927j0502k3908l1751k1504j5545j2654r976q116q777
17738B49198r426j3390p473o637o703k523j976Q9N73r19k593q139l114L233R813
17723B00013J3801R297K3480J9698O624n831j6077j1736k079m349j285K176K360
$$ plain form
17710 236092 237250 233135 225185 215125 196740 170379 153642 136058 119072 107520 104452 102041
17698 102041 93536 86917 80576 76765 74075 77523 77842 75269 68151 55552 50357 54827 58140 72925
17684 72925 72516 73896 75400 71269 73555 76000 75144 68378 57414 57139 52075 50064 47553 42651 37369
17669 37369 38196 45216 56801 60690 58577 53812 47376 50195 49416 49694 50440 52623 55466 52568 57721
17654 57721 63151 64351 73350 79836 83537 81620 90880 110162 119617 128961 143082 153959 160264 164029
17640 164029 163803 162418 152694 135297 125222 122170 121785 116304 115869 123685 119728 116168 96338 82853
17626 82853 78389 73546 71706 68076 69192 72558 69091 70092 73912 81382 92103 94110 98436 102792
17612 102792 111475 110762 109737 121789 129485 145769 165243 187639 220144 252294 288453 317417
$$ packed form
17710B36092J158m115p950j0060j8385k6361j6737j7584j6986j1552l068k411
17698A02041q505o619o341l811k690L448L19k573p118j2599n195M470L313J4785
17684G2925m09J380J504m131K286K445q56o766j0964k75n064k011k511m902n282
17669C7369Q27P020J1585L889k113m765o436K819p79K78P46K183K843k898N153
17654E7721N430J200Q999O486L701j917R260J9282R455R344J4121J0877O305L765
17640A64029k26j385r724j7397j0075l052l85n481m35P816l957l560j9830j3485
17626H2853m464m843j840l630J116L366l467J001L820P470J0721K007M326M356
17612A02792Q683p13j025J2052P696J6284J9474K2396L2505L2150L6159K8964
$$ plain form
17600 317417 327599 314264 285076 252605 216935 194123 182884 165125 148953 145495 143017 143588
17588 143588 128257 104603 92670 84236 80278 74052 74674 77206 66726 51722 47361 45009 48838
17575 48838 54107 60364 67684 72443 78049 82997 80677 71244 70571 70728 79809 96100 109048 127219
17561 127219 141863 153158 144952 137649 117481 96567 85417 76175 71756 69320 69701 72252 67693
17548 67693 64535 55099 54131 46919 40470 36875 31522 29552 31900 32869 32879 37205 42999 51520 60156
17533 60156 64385 63659 68202 83784 113626 150405 190577 225633 262491 288949 295968 285011 263953
17520 263953 226703 185102 161360 159016 169145 185926 190154 192300 189870 181218 163611 149779
17508 149779 130872 118225 112130 109648 109429 109697 123641 140654 152863 165757 183060 201037 218822
$$ packed form
17600C17417J0182j3335k9188l2471l5670k2812j1239j7759j6172l458k478N71
17588A43588j5331k3654j1933q434l958o226O22K532j0480j5004m361k352L829
17575D8838N269O257P320M759N606M948k320r433o73J57R081J6291J2948J8171
17561A27219J4644J1295q206p303k0168k0914j1150r242m419k436L81K551m559
17548F7693l158r436r68p212o449l595n353j970K348R69J0M326N794Q521Q636
17533F0156M229p26M543J5582K9842L6779M0172L5056L6858K6458P019j0957k1058
17520B63953l7250m1601k3742k344J0129J6781M228K146k430q652j7607j3832
17508A49779j8907j2647o095k482k19K68J3944J7013J2209J2894J7303J7977J7785
$$ plain form
17495 218822 237940 245855 247433 258240 274049 302826 364475 442037 521540 574075 575876 534596
17483 534596 468113 390896 313654 261200 231838 231292 237301 237522 227279 212618 182417 153996
17471 153996 137886 125188 111555 106256 108459 107215 118387 133062 152543 180147 222906 276560
17459 276560 332593 365317 369219 361861 352872 337615 333947 349848 384044 437267 490964 527588
17447 527588 532291 493674 422011 344088 290259 259625 245620 229366 199185 147043 109990 94578
17435 94578 92266 85387 83387 91569 101854 102208 105653 104264 96021 94208 97611 102955 107192 119482
17421 119482 132745 138760 147826 152945 145199 136435 126089 111654 98269 78264 64865 52306
17409 52306 45364 46334 39139 38900 46287 51033 47420 41507 39197 31434 26795 21166 21260 23249 18719
$$ packed form
17495B18822J9118P915J578J0807J5809K8777O1649P7562P9503N2535J801m1280
17483E34596o6483p7217p7242n2454k9362n46O009K21j0243j4661l0201k8421
17471A53996j6110j2698j3633n299K203j244J1172J4675J9481K7604M2759N3654
17459B76560N6033L2724L902p358q989j5257l668J5901L4196N3223N3697L6624
17447E27588M703l8617p1663p7923n3829l0634j4005j6254l0181n2142l7053j5412
17435I4578k312o879k000Q182J0285L54L445j389q243j813L403N344M237J2290
17421A19482J3263O015R066N119p746q764j0346j4435j3385k0005j3399j2559
17409E2306o942R70p195k39P387M746l613n913k310p763m639n629R4J989m530
$$ plain form
17394 18719 19511 17193 14889 14915 12174 6961 1760 5581 4314 -771 -5293 -4349 2251 1111 3698
17379 3698 5041 7986 10988 8962 11466 4889 3120 6349 9746 11664 15786 17436 13862 25508
17365 25508 33493 32610 37021 35600 32949 38493 52934 64475 78275 95736 118983 137703 152278
17352 152278 155978 152103 135253 111537 92303 77847 70157 65440 64616 65908 64977 71687 72173 65703
17338 65703 57757 56126 49765 39970 33448 30546 30699 25282 19331 17444 22585 34340 39186 41536
17324 41536 41205 44155 42211 38439 35113 30811 22901 21261 21230 29747 47448 64734 82583 90196
17310 90196 84350 71438 56764 41318 30316 24175 16231 10147 -490 1312 3259 7058 10867
17297 10867 5419 -5114 -8427 -714 482 -1733 3065 11890 8514 532 1388 1496 -114 -453 -597
$$ packed form
17394A8719P92k318k304K6k741n213n201L821j267n085m522R44O600j140K587
17379C698J343K945L002k026K504o577j769L229L397J918M122J650l574J1646
17365B5508P985q83M411j421k651N544J4441J1541J3800J7461K3247J8720J4575
17352A52278L700l875j6850k3716j9234j4456p690m717q24J292r31O710M86o470
17338F5703p946j631o361r795o522k902J53n417n951j887N141J1755M846K350
17324D1536l31K950j944l772l326m302p910j640l1Q517J7701J7286J7849P613
17310I0196n846j2912j4674j5446j1002o141p944o084j0637J802J947L799L809
17297A0867n448j0533l313P713J196k215M798Q825l376p982Q56J08j610l39j44
$$ plain form
17282 -597 -4088 -5049 -4038 -1806 -363 -2989 3585 -762 -7081 -7670 -11060 -15723 -12732 -11435 -3230
17267 -3230 6536 14876 15017 4265 787 -887 -2147 2887 3078 -2543 -8290 -13045 -10000 -1738 -4383
17252 -4383 1560 12906 20534 23345 28285 38275 43779 46664 43169 35883 30865 23037 17324 7664
17238 7664 -1186 -4679 -4663 -2432 -12937 -12409 -9345 -9460 -9576 -12112 -12877 -10109 -5614 -3191 4063 9162
17222 9162 1653 -11475 -10199 -7010 -2817 2804 -83 -2201 10156 11771 11206 1262 -6627 -4810
17208 -4810 -4242 -3588 -4947 -6910 -4680 -13909 -16616 -9084 -14536 -7943 493 1939 621 2364 3425
17193 3425 -6660 -9014 -7225 -8247 -12880 -15093 -11080 -14633 -11766 -10132 -13082 -16092 -18345 -18696 -10211
17178 -10211 -9730 -7904 -5884 -12862 -20764 -19812 -23605 -28340 -28510 -35465 -37459 -28811 -22831 -25241 -25242 -26948
$$ packed form
17282e97l491r61J011K232J443k626O574m347o319n89l390m663K991J297Q205
17267c230R766Q340J41j0752l478j674j260N034J91n621n747m755L045Q262k645
17252d383N943J1346P628K811M940R990N504K885l495p286n018p828n713r660
17238G664q850l493J6K231j0505N28L064j15j16k536p65K768M495K423P254N099
17222I162p509j3128J276L189M193N621k887k118J2357J615n65r944p889J817
17208d810N68O54j359j963K230r229k707P532n452O593Q436J446j318J743J061
17193C425j0085k354J789j022m633k213M013l553K867J634k950l010k253l51Q485
17178a0211M81J826K020o978p902R52l793m735j70o955j994Q648N980k410jj706
$$ plain form
17162 -26948 -23899 -22743 -26196 -26612 -14067 -8795 -7977 -6740 -4073 -5432 -8021 -11293 -11727 -8392 -6877
17147 -6877 -8460 -12921 -12345 -10018 -13146 -14952 -17768 -14516 -13346 -8008 -8236 -11525 -11223 -3697 245
17132 245 -5305 -12200 -6701 -4579 -2996 -12708 -21212 -22288 -18779 -19818 -17337 -17672 -14957 -13610 -24454
17117 -24454 -22390 -8252 -468 -7319 -15034 -15584 -13483 -9924 -12481 -15832 -28420 -36668 -30654 -30839
17103 -30839 -27834 -25646 -20828 -21334 -20221 -20029 -18580 -17076 -14007 -7285 -9934 -14575 -17029 -25423 -26128
17088 -26128 -20748 -21529 -22233 -20856 -19801 -23170 -24326 -18675 -13678 -9342 -15208 -24420 -22048 -22351 -17254
17073 -17254 -16198 -12220 -16501 -22784 -23551 -26113 -23405 -22765 -28181 -34725 -38064 -32555 -25950 -26558 -20883
17058 -20883 -15817 -19817 -25764 -33214 -36354 -34036 -33626 -31467 -31102 -25921 -17316 -14796 -19333 -18013 -20381
$$ packed form
17162b6948L049J156l453m16J2545N272Q18J237K667j359k589l272m34L335J515
17147f877j583m461N76K327l128j806k816L252J170N338k28l289L02P526L942
17132B45n550o895N499K122J583r712q504j076L509j039K481l35K715J347j0844
17117b4454K064J4138P784o851p715n50K101L559k557l351j2588q248O014j85
17103c0839L005K188M818n06J113J92J449J504L069O722k649m641k454q394p05
17088b6128N380p81p04J377J055l369j156N651M997M336n866r212K372l03N097
17073a7254J056L978m281o283p67k562K708O40n416o544l339N509O605o08N675
17058b0883N066m000n947p450l140K318M10K159L65N181Q605K520m537J320k368
$$ plain form
17043 -20381 -17597 -16522 -18249 -21825 -31409 -30962 -24622 -16721 -15159 -12958 -13573 -11890 -13063 -16966 -19105
17028 -19105 -15120 -13558 -18857 -26484 -32238 -24352 -21944 -20975 -24450 -25264 -17830 -11596 -11392 -17855 -25556
17013 -25556 -19862 -15605 -13292 -10309 -11809 -14979 -22289 -28625 -20055 -17425 -10339 -11424 -14422 -14299 -23572
16998 -23572 -22198 -17805 -22748 -24515 -21516 -17058 -19664 -23771 -18444 -10941 -15408 -26127 -29975 -36828
16984 -36828 -39841 -29462 -21649 -20656 -11560 -10707 -15481 -15440 -14021 -13966 -13720 -22572 -26415 -28432 -34256 -30641
16968 -30641 -24389 -22996 -23570 -23854 -22777 -21541 -15896 -14931 -18003 -21739 -14813 -20125 -26566 -26084 -20308
16953 -20308 -12597 -13612 -16227 -17324 -10753 -2917 -2036 -6482 -12052 -17641 -22671 -21475 -21916 -23003 -19312
16938 -19312 -16766 -22396 -27714 -31189 -24436 -13727 -4785 -5173 -2809 -7850 -10379 -11086 -18215 -25251 -26916
$$ packed form
17043b0381K784J075j727l576r584M47O340P901J562K201o15J683j173l903k139
17028a9105L985J562n299p627n754P886K408R69l475q14P434O234K04o463p701
17013b5556N694M257K313K983j500l170p310o336Q570K630P086j085k998J23r273
16998b3572J374M393m943j767K999M458k606m107N327P503m467j0719l848o853
16984c6828l013J0379P813R93R096Q53m774M1J419N5K46q852l843k017n824L615
16968c0641O252J393n74k84J077J236N645R65l072l736O926n312o441M82N776
16953b0308P711j015k615j097O571P836Q81m446n570n589n030J196m41j087L691
16938a9312K546n630n318l475O753J0709Q942l88K364n041k529p07p129p036j665
$$ plain form
16923 -26916 -26647 -20317 -16575 -15343 -13936 -11232 -15498 -19417 -26551 -19358 -13826 -16751 -17140 -11078 -14581
16908 -14581 -29756 -31502 -30422 -27445 -19769 -13092 -5829 -2735 -5635 -9355 -10140 -6115 -9826 -21902
16894 -21902 -34280 -34783 -25634 -14808 -8154 -3247 -4563 -10375 -17180 -26775 -29318 -35098 -36465 -31772
16880 -31772 -28797 -29513 -25240 -17388 -16325 -21802 -31780 -32304 -24789 -23234 -20724 -14102 -12789 -8125 -5617
16865 -5617 -11275 -15070 -16809 -19070 -17952 -16123 -19401 -32050 -32460 -30626 -26423 -24103 -25468 -16811 -13102
16850 -13102 -14673 -24744 -29951 -37287 -45407 -42063 -32229 -28733 -37843 -39346 -29170 -14773 -10257 -11871
16836 -11871 -21134 -26948 -28296 -33582 -30138 -15295 175 9320 6488 5082 9439 1477 -7737 -17477
16822 -17477 -21127 -19230 -17755 -27719 -28353 -28099 -25201 -18813 -16944 -18616 -14512 -18755 -22538 -21840 -16898
$$ packed form
16923b6916K69O330L742J232J407K704m266l919p134P193N532k925l89O062l503
16908a4581j5175j746J080K977P676O677P263L094k900l720p85M025l711j2076
16894b1902j2378n03R149J0826O654M907j316n812o805r595k543n780j367M693
16880c1772K975p16M273P852J063n477r978n24P515J555K510O622J313M664K508
16865e617n658l795j739k261J118J829l278j2649m10J834M203K320j365Q657L709
16850a3102j571j0071n207p336q120L344R834L496r110j503J0176J4397M516j614
16836a1871r263n814j348n286L444J4843J5470R145k832j406M357p962r214r740
16822a7477l650J897J475r964o34K54K898O388J869j672M104m243l783O98M942
$$ plain form
16807 -16898 -16480 -20919 -18659 -18090 -18548 -20879 -15554 -12728 -16205 -20355 -27496 -25701 -17670 -16948 -14693
16792 -14693 -13388 -15022 -16862 -11680 -9130 -7876 -3279 -9246 -6792 -5409 -3727 -4478 -7470 -12237 -13782
16777 -13782 -9162 -4261 -2299 3268 11310 17430 14337 4217 -3050 -4727 -4554 -7150 -9752 -12275
16763 -12275 -9993 -9497 -7037 -5547 -11075 -10131 -10461 -7390 -5605 -5079 -2032 6242 10551 14851 13565
16748 13565 17263 30225 48606 74101 102587 149587 215489 293289 375533 458471 539885 591134
16736 591134 599096 574409 518957 440202 353481 259202 183717 137952 104966 80169 59503 45829
16724 45829 34324 26379 27069 23537 23231 20371 19942 11881 11115 10019 -1107 -5779 -10977 -12458 -13599
16709 -13599 -22336 -20213 -18679 -17167 -16992 -16231 -17663 -18188 -16158 -11052 -9245 -19177 -16158 -17610 -16585
$$ packed form
16807a6898M18m439K260N69m58k331N325K826l477m150p141J795Q031P22K255
16792a4693J305j634j840N182K550J254M597n967K454J383J682p51k992m767j545
16777a3782M620M901J962N567Q042O120l093j0120p267j677J73k596k602k523
16763a2275K282M96K460J490n528R44l30L071J785N26L047Q274M309M300j286
16748A3565L698J2962J8381K5495K8486M7000O5902P7800Q2244Q2938Q1414N1249
16736E91134P962k4687n5452p8755q6721r4279p5485m5765l2986k4797k0666j3674
16724D5829j1505p945O90l532l06k860m29q061p66j096j1126m672n198j481j141
16709a3599q737K123J534J512J75P61j432n25K030N106J807r932L019j452J025
$$ plain form
16694 -16585 -14245 -14155 -15506 -19029 -15079 -11942 -11270 3025 11647 28356 49664 67798 94664 129723
16680 129723 152639 169596 169881 156990 149876 132123 107495 80416 56009 37209 24678 15759
16668 15759 8320 4829 -7507 -15112 -14842 -13185 -11339 -12494 -11223 -7417 -10926 -10855 -10070 -13690 -8750
16653 -8750 -10741 -9313 -6086 -9433 -14152 -22017 -20801 -13947 -12523 -16507 -21639 -21329 -16311 -16729 -28025
16638 -28025 -30528 -24982 -20413 -18278 -18187 -16425 -20357 -26929 -29989 -27833 -18120 -14311 -10071 -8447 -6362
16623 -6362 -1732 14290 32578 49720 67548 76212 85955 80759 75843 74483 67218 45828 32760
16610 32760 17275 -369 -10164 -12833 -16606 -18506 -18811 -20179 -16674 -11949 -10001 -12276 -11165 -15910
16596 -15910 -22609 -24002 -26188 -18849 -13445 -12632 -17562 -18258 -10592 -4272 -6649 -9028 -11628 -12571 -14111
$$ packed form
16694a6585K340R0j351l523L950L137O72J4295Q622J6709K1308J8134K6866L5059
16680A29723K2916J6957K85j2891p114j7753k4628k7079k4407j8800j2531q919
16668A5759p439l491j2336p605K70J657J846j155J271L806l509P1P85l620M940
16653h750j991J428L227l347m719p865J216O854J424l984n132L10N018m18j1296
16638b8025k503N546M569K135R1J762l932o572l060K156R713L809M240J624K085
16623f362M630J6022J8288J7142J7828Q664R743n196m916j360p265k1390j3068
16610C2760j5485j7644r795k669l773j900l05j368L505M725J948k275J111m745
16596a5910o699j393k186P339N404Q13m930o96P666O320k377k379k600r43j540
$$ plain form
16581 -14111 -18084 -14934 -6454 -7313 -14436 -16378 -13494 -18974 -18555 -16718 -19140 -23877 -23037 -19736 -15382
16566 -15382 -8516 -12756 -18213 -19032 -16714 -19457 -24603 -24898 -20406 -24504 -27740 -25631 -24151 -25294 -31771
16551 -31771 -32488 -30918 -26653 -25132 -24734 -21730 -19929 -23494 -19863 -15397 -12402 -18435 -24483 -27538 -24242
16536 -24242 -24640 -20689 -26776 -26729 -20195 -12177 -6512 -1790 -14215 -23291 -18701 -14201 -9249 -12610 -16390
16521 -16390 -18023 -19519 -20348 -23725 -24407 -27244 -27708 -30961 -27102 -25147 -30638 -28201 -22395 -17898 -19335
16506 -19335 -20942 -21666 -21704 -27441 -22948 -22606 -21316 -18326 -16200 -16838 -16478 -15876 -18954 -15007 -15544 -25195
16490 -25195 -33978 -26487 -25665 -30480 -28961 -26818 -27944 -26258 -20560 -23985 -24725 -22270 -23668 -28004 -35316
16475 -35316 -43760 -40069 -35165 -29074 -23704 -22054 -23614 -22888 -25328 -23876 -14477 -11915 -17962 -22033 -19896
$$ packed form
16581a4111l973L150Q480q59p123j942K884n480M19J837k422m737Q40L301M354
16566a5382O866m240n457q19K318k743n146k95M492m098l236K109J480j143o477
16551c1771p17J570M265J521L98L004J801l565L631M466K995o033o048l055L296
16536b4242l98L951o087M7O534Q018N665M722j2425r076M590M500M952l361l780
16521a6390j633j496q29l377o82k837m64l253L859J955n491K437N806M497j437
16506a9335j607p24l8n737M493L42J290K990K126o38L60O02l078L947n37r651
16490b5195q783P491Q22m815J519K143j126J686N698l425p40K455j398m336p312
16475c5316q444L691M904O091N370J650j560P26k440J452R399K562o047m071K137
$$ plain form
16460 -19896 -23716 -21972 -21079 -26382 -21909 -24068 -27682 -29978 -29779 -21575 -12686 -12880 -21966 -23278 -25510
16445 -25510 -24918 -28903 -30915 -23991 -13631 -6652 -5238 -620 5355 11684 17395 22362 39887 60372
16431 60372 77781 95998 109749 122677 130548 131838 124043 115642 104143 93081 85433 69592 44240
16418 44240 23611 14103 871 -9763 -1687 5292 2673 1061 750 883 6198 5666 5499 3906 10063
16403 10063 19065 20295 21536 30529 41088 42818 37727 34945 33438 24778 15918 10101 1054 -4995
16389 -4995 -5644 -6297 -6365 -8323 -11134 -14303 -16203 -17966 -16265 -10382 -1528 -3979 -9236 -7935 -118 6848
16373 6848 16704 39609 60671 81750 94791 117329 138673 144957 142818 131990 104124 80736
16361 80736 65311 49757 24210 119 -8085 -14080 -13824 -14108 -13976 -18115 -15611 -6426 5832 5384
$$ packed form
16460a9896l820J744Q93n303M473k159l614k296J99Q204Q889j94r086j312k232
16445b5510N92l985k012O924J0360O979J414M618N975O329N711M967J7525K0485
16431F0372J7409J8217J3751J2928P871J290p795q401j1499j1062p648j5841k5352
16418D4240k0629r508j3232j0634Q076O979k619j612l11J33N315n32j67j593O157
16403A0063R002J230J241Q993J0559J730n091k782j507q660q860n817r047o049
16389d995o49o53o8j958k811l169j900j763J701N883Q854k451n257J301P817O966
16373F848R856K2905K1062K1079J3041K2538K1344O284k139j0828k7866k3388
16361H0736j5425j5554k5547k4091q204n995K56k84J32m139K504R185J2258m48
$$ plain form
16347 5384 5880 6166 -4190 -12792 -16655 -22932 -20142 -14468 -14683 -21863 -22211 -18317 -21804 -27360 -22460
16332 -22460 -19604 -13969 -14099 -14535 -17571 -18585 -23483 -19949 -13060 -9663 -9937 -18325 -18785 -13842 -14671 -17325
16316 -17325 -17709 -14351 -10012 -8850 -13478 -17930 -22586 -27416 -24899 -20454 -22609 -22660 -22748 -20919 -23997 -28377
16300 -28377 -17303 -10223 -10477 -12282 -14143 -14043 -11182 -7680 -11854 -17200 -14840 -2724 5709 2145
16286 2145 -38 11438 26358 33985 33767 38695 52685 58942 61738 52362 59873 57995 46056 46305
16272 46305 53432 54727 55092 53351 46359 35247 28748 16560 6508 7218 14275 6149 -2720 -9433
16258 -9433 -8699 -8814 -13290 -13077 -17903 -23213 -27194 -20845 -13953 -11757 -8298 -5106 -7656 -3504 1432
16243 1432 11616 24745 30513 40326 55138 54883 61909 65082 60558 56783 54475 42348 29185 27285
$$ packed form
16347E384M96K86j0356q602l863o277K790N674k15p180l48L894l487n556M900
16332b2460K856N635j30m36l036j014m898L534O889L397k74q388m60M943q29k654
16316a7325l84L358M339J162m628m452m656m830K517M445k155n1q8J829l078m380
16300b8377J1074P080k54j805j861J00K861L502m174n346K360J2116Q433l564
16286B145k183J1476J4920P627k18M928J3990O257K796r376P511j878j1939K49
16272D6305P127J295L65j741o992j1112o499j2188j0052P10P057q126q869o713
16258i433P34j15m476K13m826n310l981O349O892K196L459L192k550M152M936
16243A432J0184J3129N768R813J4812k55P026L173m524l775k308j2127j3163j900
$$ plain form
16229 27285 26023 7760 -2500 37 -4550 -12143 -18350 -22581 -17004 -9262 -10697 -13415 -15423 -21508
16215 -21508 -25043 -29575 -29600 -25892 -24514 -20689 -18722 -19946 -15949 -12560 -16223 -14374 -14126 -9409 -11954
16200 -11954 -8969 -13485 -12792 -19839 -27598 -32192 -35208 -32178 -28509 -25763 -24668 -25475 -22519 -13880 -10543
16185 -10543 -11224 -8453 -10044 -10290 -4328 -9860 -17757 -20025 -13810 -14759 -20065 -17156 -14522 -10462 -13639
16170 -13639 -17805 -15755 -7930 295 2446 567 -942 5404 14903 28914 47449 60408 63400 75293
16156 75293 80004 73905 60064 49816 41524 24236 15443 5312 -5259 -6598 -6206 -2297 -7333
16143 -7333 -14144 -21861 -20761 -15896 -15430 -16958 -20002 -21266 -17293 -15033 -14844 -18194 -15061 -3430 2474
16128 2474 -854 1396 -1220 -306 -77 1227 -3346 -9923 -24774 -31731 -29986 -29961 -27660 -25175 -25746 -21130
$$ packed form
16229B7285j262j8263j0260K537m587p593o207m231N577P742j435k718k008o085
16215b1508l535m532k5L708J378L825J967j224L997L389l663J849K48M717k545
16200a1954K985m516O93p047p759m594l016L030L669K746J095q07K956Q639L337
16185a0543o81K771j591k46N962n532p897k268O215r49n306K909K634M060l177
16170a3639m166K050P825Q225K151j879j509O346R499J4011J8535J2959K992J1893
16156G5293M711o099j3841j0248q292j7288q793j0131j0571j339L92L909n036
16143g333o811p717J100M865M66j528l044j264L973K260J89l350L133J1631N904
16128B474l328K250k616R14K29J304m573o577j4851o957J745K5K301K485n71M616
$$ plain form
16112 -21130 -14139 -7379 -8329 -11639 -17545 -23584 -23408 -28901 -32497 -29595 -29186 -24374 -24202 -25468 -26717
16097 -26717 -25842 -29340 -26762 -26097 -20952 -24362 -16708 -10884 -13367 -15191 -15094 -14793 -11001 -8316 -3659 -3718
16081 -3718 -1402 254 1244 265 1602 -374 -8398 -15602 -11643 -4845 -3415 713 5439 -187 -4814
16066 -4814 -5468 -3120 3138 6699 -1382 -10929 -2220 -315 -2032 3165 2295 -7870 -14437 -10341 -7282
16051 -7282 -222 -2676 -6964 -4326 -7790 -4695 -7794 -23059 -21081 -15938 -15292 -12788 -15384 -17152 -12878
16036 -12878 -13077 -15754 -16714 -16357 -14342 -17154 -10413 -6483 -12005 -14138 -16703 -20009 -20559 -13964 -12101
16021 -12101 -15763 -20548 -17832 -11776 -18445 -17277 -11988 -14809 -12627 -9245 -11760 -9534 -2650 -3799
16007 -3799 -9272 -11468 -13868 -14251 -18001 -14889 -13657 -11153 -12482 -14497 -12398 -12699 -9303 -17180 -25662
$$ packed form
16112b1130O991O760r50l310n906o039J76n493l596K902M09M812J72j266j249
16097b6717Q75l498K578O65N145l410P654N824k483j824R7L01L792K685M657n9
16081c718K316J656R90r79J337j976q024p204L959O798J430M128M726n626m627
16066d814o54K348O258L561q081r547Q709J905j717N197q70j0165o567M096L059
16051g282P060k454m288K638l464L095l099j5265J978N143O46K504k596j768M274
16036a2878j99k677r60L57K015k812O741L930n522k133k565l306n50O595J863
16021a2101l662m785K716O056o669J168N289k821K182L382k515K226O884j149
16007c799n473k196k400l83l750L112J232K504j329k015K099l01L396p877q482
$$ plain form
15992 -25662 -23238 -18638 -10359 -3746 -5118 -7695 -4627 2195 3131 3092 1016 2888 1154 443 -734
15977 -734 -8235 -7703 524 8389 6509 5283 1144 -4657 -9142 1490 2581 -4269 -1400 -280 -2557
15962 -2557 -10835 -21610 -24863 -27187 -25668 -20356 -18087 -9615 -9060 -8195 -3817 -8659 -11454 -12325 -15115
15947 -15115 -10404 -5021 199 -5454 -9920 -13559 -18283 -16390 -15821 -19566 -13859 -14115 -17499 -15043 -13183
15932 -13183 -18973 -17399 -16801 -19023 -13468 -11911 -13449 -14330 -11523 -10020 -10329 -1755 -1261 -6626 -1973
15917 -1973 1817 7030 11092 16616 18216 9757 9018 11270 14151 13843 13401 9184 5602 18767 21264
15902 21264 13112 8822 14064 11344 8617 4204 2699 453 -6833 -8313 -866 3216 -629 -284 -1290
15887 -1290 -5540 -10242 -9954 -8582 -5020 -2660 6343 15080 16976 25902 35801 42715 60564 76477
$$ packed form
15992b5662K424M600Q279O613j372k577L068O822R36l9k076J872j734p11j177
15977g34p501N32Q227P865j880j226m139n801m485J0632J091o850K869J120k277
15962b557q278j0775l253k324J519N312K269Q472N55Q65M378m842k795q71k790
15947a5115M711N383N220n653m466l639m724J893N69l745N707k56l384K456J860
15932a3183n790J574N98k222N555J557j538q81K807J503l09Q574M94n365M653
15917a973L790N213M062N524J600q459p39K252K881l08m42m217l582J3165K497
15902B1264q152m290N242k720k727m413j505k246p286j480P447M082l845L45j006
15887a290m250m702K88J372L562K360R003Q737J896Q926R899O914J7849J5913
$$ plain form
15873 76477 79032 82912 83493 80378 77291 69583 52098 40435 34334 21314 13552 6000 6208 5865
15859 5865 1505 -1480 -4789 -7723 -9132 -11986 -11535 -10856 -9777 -7398 -1033 -2710 -8307 -11230 -10287
15844 -10287 -4271 -8463 -7485 -8325 -7977 -5945 -6970 -9473 -7067 -3657 887 799 -1832 -3452 -7324 -1296
15828 -1296 5498 3199 -1166 -8009 -11356 -11847 -12256 -9767 -10007 -7735 -7066 -2730 -2389 -5990 -12896 -11872
15812 -11872 -5083 -4102 -7305 -3686 -1648 -6086 -7855 -11132 -12365 -9710 -8366 -7695 -6005 -11781 -13699
15797 -13699 -11464 -15360 -21189 -17790 -14105 -13767 -16985 -27175 -26181 -13473 -13155 -13706 -20401 -20679 -21280
15782 -21280 -14635 -7607 -6926 -4094 -12371 -17652 -18442 -20122 -22105 -20017 -18397 -18962 -12421 -7945 -4464
15767 -4464 -3323 -2357 -5425 -2865 -3473 -11333 -7641 -6247 -10249 -14254 -15054 -14245 -11693 -11160 -8493 -11432
$$ packed form
15873G6477K555L880N81l115l087p708j7485j1663o101j3020p762p552K08l43
15859E865m360k985l309k934j409k854M51O79J079K379O365j677n597k923R43
15844a0287O016m192R78q40L48K032j025k503K406L410M544q8k631j620l872O028
15828a296O794k299m365o843l347m91m09K489k40K272O69M336L41l601o906J024
15812a1872O789R81l203L619K038m438j769l277j233K655J344O71J690n776j918
15797a3699K235l896n829L399L685L38l218j0190R94J2708L18n51o695k78o01
15782b1280O645P028O81K832q277n281p90j680j983K088J620n65O541M476L481
15767d464J141R66l068K560o08p860L692J394m002m005q00Q09K552N33K667k939
$$ plain form
15751 -11432 -16556 -14066 -21121 -23807 -22961 -22563 -21307 -23236 -17379 -17187 -13418 -10374 -11810 -15555 -17251
15736 -17251 -5268 -782 200 -8145 -6685 -5608 -3331 -652 7245 6996 9709 4602 2424 4289 3700
15721 3700 3969 -2357 -7661 -9412 -7475 -7615 -5634 -2538 -5984 -6938 -7251 -10096 -11340 -9229 -5976 -6209
15705 -6209 -6264 -2389 -4612 -9922 -12619 -7400 -12751 -15833 -15058 -8063 -7984 -6222 -4310 -4943 -7338 -10765
15689 -10765 -4624 1892 8521 1102 -6197 -5848 -3243 -4741 -4052 -6875 -11664 -15208 -8662 -2508 3729
15674 3729 3292 -282 855 -6038 -8696 -3492 -4146 -6129 -9932 -8234 -2876 -2438 421 6263 8082
15659 8082 10040 9023 -336 -2604 -6656 -2055 -618 5471 9090 11449 6198 4670 -2117 -5697 -888
15644 -888 2981 5045 934 -3034 -5798 -9031 -10429 -6405 -2217 2457 4003 7633 15899 23001 28669
$$ packed form
15751a1432n124K490p055k686Q46L98J256j929N857J92L769L044j436l745j696
15736a7251J1983M486R82q345J460J077K277K679P897k49K713n107k178J865n89
15721C700K69o326n304j751J937j40J981L096l446r54l13k845j244K111L253k33
15705f209n5L875k223n310k697N219n351l082P75O995P9J762J912o33k395l427
15689a0765O141O516O629p419p299L49K605j498O89k823m789l544O546O154O237
15674C729m37l574J137o893k658N204o54j983l803J698N358M38K859N842J819
15659H082J958j017r359k268m052M601J437O089L619K359n251j528o787l580M809
15644h88L869K064m111l968k764l233j398M024M188M674J546L630Q266P102N668
$$ plain form
15629 28669 36534 40198 45919 41853 36920 32903 30676 36218 38310 37845 40489 38796 44388 57986
15615 57986 75029 95773 107951 121298 137157 144959 147551 143108 134673 119413 103022 84183
15603 84183 71585 56715 43991 41138 38231 33267 28432 33644 33210 31073 28517 27143 27371 25828
15589 25828 19686 13693 11192 9833 8678 13973 16219 20319 23272 23082 21906 17808 23015 34380
15575 34380 43125 46642 46456 50117 53489 50634 47169 49617 51516 53190 57917 58823 71783 79598 93469
15560 93469 108613 129503 141970 147993 151848 153297 150406 132222 112031 97913 83516 61018
15548 61018 49659 42689 36187 37007 35931 31458 24607 18202 13924 11597 12739 11294 5501 14081
15534 14081 18728 18176 20948 13118 14964 21459 29376 34614 38005 33346 37578 44690 48974 48897 48433
$$ packed form
15629B8669P865L664N721m066m933m017k227N542K092m65K644j693N592J3598
15615E7986J7043K0744J2178J3347J5859P802K592m443q435j5260j6391j8839
15603H4183j2598j4870j2724k853k907m964m835N212m34k137k556j374K28j543
15589B5828o142n993k501j359j155N295K246M100K953j90j176m098N207J1365
15575C4380Q745L517j86L661L372k855l465K448J899J674M727R06J2960P815J3871
15560I3469J5144K0890J2467O023L855J449k891j8184k0191j4118j4397k2498
15548F1018j1359o970o502Q20j076m473o851o405m278k327J142j445n793Q580
15534A4081M647n52K772p830J846O495P917N238L391m659M232P112M284p7m64
$$ plain form
15519 48433 41284 41067 41296 33469 20241 18330 14483 11628 9947 7215 1893 3821 3820 -622 27 1986
15503 1986 -3323 -11162 -3470 4520 2039 3804 2628 1443 522 -2322 -1205 -1385 2820 9671 7935
15488 7935 7607 1906 835 3954 4678 1394 -3112 880 9021 12638 11258 15631 14821 10602 9540
15473 9540 9005 7359 1415 -1562 3924 12735 18109 15914 17652 20487 14520 10623 6261 5169 -109
15458 -109 1929 2700 6305 8591 17358 18660 8537 -4562 -12973 -17220 -14693 -12969 -6760 -5932 -1784
15443 -1784 880 -286 1930 28 -3012 -10065 -10526 -15867 -18325 -14444 -7446 -3535 -4264 -7324 -4239
15428 -4239 -6492 -7005 343 530 4168 4865 7900 10139 11417 9476 8940 684 -490 6436 13354 18375
15412 18375 10835 362 -167 -792 -9975 -16079 -11083 -8048 -6039 -12979 -11997 -6748 -2771 611 -1341
$$ packed form
15519D8433p149k17K29p827j3228j911l847k855j681k732n322J928jm442O49J959
15503A986n309p839P692P990k481J765j176j185r21k844J117j80M205O851j736
15488G935l28n701j071L119P24l284m506L992Q141L617j380M373q10m219j062
15473I540n35j646n944k977N486Q811N374k195J738K835n967l897m362j092n278
15458a09K038P71L605K286Q767J302j0123j3099q411m247K527J724O209Q28M148
15443a784K664j166K216j902l040p053m61n341k458L881O998L911p29l060L085
15428d239k253n13P348J87L638O97L035K239J278j941n36q256j174O926O918N021
15412A8375p540j0473n29o25r183o104M996L035K009o940R82N249L977L382j952
$$ plain form
15397 -1341 -8302 -8800 -2028 2566 2740 -1329 2380 4912 2883 5517 7789 9606 2426 -4915 1688
15382 1688 9400 10748 10287 10474 10293 5347 794 1569 8425 10275 5266 -259 1141 4574 4778 9538
15366 9538 12769 25965 37273 50884 75483 104191 154788 216567 276722 328786 356665 341240
15354 341240 294095 237983 177824 126352 86498 71556 58878 53277 51417 46945 32307 16875
15342 16875 14051 21841 19639 17198 17259 10869 8899 1218 -457 2942 3315 2243 -3322 -7360 -9668
15327 -9668 -8512 -4956 -3615 1280 -6095 -6456 -1390 1028 6267 7664 5201 7500 11128 5570 1241
15312 1241 -2411 -3018 8050 9339 3473 2116 2041 11522 23342 25660 22857 24264 20434 18277 22403
15297 22403 16690 18027 13490 11304 15309 20473 20898 24075 26064 22392 22687 24894 25313 29930 30676
$$ packed form
15397a341o961m98O772M594J74m069L709K532k029K634K272J817p180p341O603
15382A688P712J348m61J87j81m946m553P75O856J850n009n525J400L433K04M760
15366I538L231J3196J1308J3611K4599K8708N0597O1779O0155N2064K7879j5425
15354C41240m7145n6112o0159n1472l9854j4942j2678n601j860m472j4638j5432
15342A6875k824P790k202k441O1o390j970p681j675L399L73j072n565m038k308
15327i668J156L556J341M895p375l61N066K418N239J397k463K299L628n558m329
15312A241l652o07J1068J289n866j357p5R481J1820K318k803J407l830k157M126
15297B2403n713J337m537k186M005N164M25L177J989l672K95K207M19M617P46
$$ plain form
15282 30676 32024 40112 49346 62348 87600 114508 144245 175175 205208 233009 252586 272392
15270 272392 276035 268768 253087 227673 202228 172364 143595 119891 102719 91928 87015 80009
15258 80009 65541 61131 58975 56366 51476 50420 58484 65746 81423 88552 96205 101434 102447 113819
15244 113819 117022 114029 111412 106573 97557 81655 71271 73447 72630 69883 53911 44106 40089 33569
15230 33569 26109 18751 18557 8070 5163 8442 13021 9272 7981 4787 6917 12985 15823 14936 5074
15215 5074 717 2679 5583 9890 6603 -633 831 2867 -6058 -14022 -14345 -6317 -3754 3868 3540
15200 3540 47 287 1062 6725 14635 8239 3176 1490 -929 -807 -2272 8247 11373 12207 15013
15185 15013 12690 12447 3948 -3381 -1408 4231 10352 11783 6717 5188 7072 6358 12164 16329 17795
$$ packed form
15282C0676J348Q088R234J3002K5252K6908K9737L0930L0033K7801J9577J9806
15270B72392L643p267j5681k5414k5445k9864k8769k3704j7172j0791m913p006
15258H0009j4468m410k156k609m890j056Q064P262J5677P129P653N229J013J1372
15244A13819L203k993k617m839r016j5902j0384K176q17k747j5972r805m017o520
15230C3569p460p358j94j0487k907L279M579l749j291l194K130O068K838q87r862
15215E074m357J962K904M307l287p236J464K036q925p964l23Q028K563P622l28
15200C540l493K40P75N663P910o396n063j686k419J22j465J0519L126Q34K806
15185A5013k323k43q499p329J973N639O121J431n066j529J884p14N806M165J466
$$ plain form
15170 17795 16421 11760 8219 12310 11905 9125 6769 2918 954 -2724 3278 9042 5257 1235 4869
15155 4869 8274 11623 5643 2506 -373 1139 -3599 -414 2721 -142 -4386 -596 -1203 -2055 -4087
15140 -4087 -815 6871 -5284 -9201 -3460 570 1318 7308 3552 3967 5298 -2375 -5000 -2900 931
15125 931 4192 6502 1361 632 -5016 -3668 3518 7423 7362 9208 16858 18710 23888 24625 17526 8495
15109 8495 8435 16247 19549 25518 32567 32442 36416 32557 28718 23724 18951 15959 20594 25697 29634
15094 29634 36329 43526 44321 37545 40415 38921 34984 28026 24613 20591 28556 32562 20406 13774
15080 13774 9664 8691 7468 10341 13716 15169 16753 13832 15178 14682 10515 8475 5628 4291 3681
15065 3681 5813 6323 5648 998 426 7982 13945 17111 17167 16755 19453 18391 5109 -8622 -15091 -5235
$$ packed form
15170A7795j374m661l541M091m05k780k356l851j964l678O002N764l785m022L634
15155D869L405L349n980l137k879J512m738L185L135k863m244L790o07q52k032
15140d087L272P686j2155l917N741M030P48N990l756M15J331p673k625K100L831
15125I31L261K310n141p29n648J348P186L905o1J846P650J852N178P37p099r031
15109H495o0P812L302N969P049j25L974l859l839m994m773k992M635N103L937
15094B9634O695P197P95o776K870j494l937o958l413m022P965M006j2156o632
15080A3774m110r73j223K873L375J453J584k921J346m96m167k040k847j337o10
15065C681K132N10o75m650n72P556N963L166N6m12K698j062j3282j3731o469R856
$$ plain form
15049 -5235 6432 11210 15935 16994 9467 3353 596 -4786 -1727 -198 5241 7275 -1802 -6693
15035 -6693 -7973 -5127 2449 1943 8996 5343 -3028 -9970 -9163 -4125 3948 8602 12878 24761 27219
15020 27219 27757 25157 21812 26519 27411 32389 29764 24255 18856 6751 1455 7559 10102 952 -615
15005 -615 3184 3820 -460 -336 -686 1479 -927 -844 -3493 -4911 -861 5688 4065 4868 1941 2114 7392
14988 7392 811 -4231 -7811 -4372 519 4257 9083 3369 -12695 -19284 -13477 -1736 9316 8715
14974 8715 10788 1272 -3620 -3173 4975 12938 20075 23166 22430 13359 1102 -3843 -1535 -3164 11106
14959 11106 10202 10583 17145 15244 12772 15646 18131 17972 21894 21071 21983 18539 16167 13094 8886 7328
14943 7328 2924 -5316 -13343 -11465 -7525 -4982 -1621 3706 -2513 -287 11982 8754 11554 14547
$$ packed form
15049e235J1667M778M725J059p527o114k757n382L059J529N439K034r077m891
15035f693j280K846P576n06P053l653q371o942Q07N038Q073M654M276J1883K458
15020B7219N38k600l345M707Q92M978k625n509n399j2105n296O104K543r150j567
15005f15L799O36m280J24l50K165k406Q3k649j418M050O549j623Q03k927J73N278
14988G392o581n042l580L439M891L738M826n714j6064o589N807J1741J1052o01
14974H715K073r516m892M47Q148P963P137L091p36r071j2257m945K308j629J4270
14959A1106r04L81O562j901k472K874K485j59L922q23R12l444k372l073m208j558
14943G328m404q240q027J878L940K543L361N327o219K226J2269l228K800K993
$$ plain form
14929 14547 18832 17082 18407 17671 23720 23549 23715 27425 24146 27070 34126 36656 35213 33413 27909
14914 27909 23872 23206 28749 36612 51090 63026 69229 80313 89653 96589 96747 92246 91213 86415
14900 86415 84151 85505 82456 75300 68003 66631 65103 61750 49826 46215 44072 39251 32866 24227
14886 24227 24998 23797 22989 22573 19831 20464 20922 19657 25396 31869 33482 33725 28346 30297 29483 28016
14870 28016 21346 21064 28323 27913 20852 17331 15081 16168 15341 17286 18844 19196 23219 22397 17569 5680
14854 5680 -2357 -6185 -956 6574 7547 4378 6275 8881 12946 7634 7226 10108 9758 10192 9205 3974
14838 3974 -3055 -3250 -1362 3134 2196 2599 -504 -9035 -12172 -3976 -209 5747 7211 5779 4631
14823 4631 281 503 4496 -595 -8335 -7651 -3753 710 -1478 -4412 -1876 -1718 6014 12235 11798 10939
$$ packed form
14929A4547M285j750J325p36O049j71J66L710l279K924P056K530j443j800n504
14914B7909m037o66N543P863J4478J1936O203J1084R340O936J58m501j033m798
14900H6415k264J354l049p156p297j372j528l353j1924l611k143m821o385q639
14886B4227P71j201q08m16k742O33M58j265N739O473J613K43n379J951q14j467
14870B8016o670k82P259m10p061l521k250J087q27J945J558L52M023q22m828j1889
14854E680q037l828N229P530R73l169J897K606M065n312m08K882l50M34r87n231
14838C974p029j95J888M496r38M03l103q531l137Q196L767N956J464j432j148
14823D631m350K22L993n091p740O84L898M463k188k934K536J58P732O221m37q59
$$ plain form
14807 10939 4207 1017 7059 6515 4916 1492 2047 8475 5333 4789 4355 2634 3034 10261 10756 9417
14791 9417 11204 9388 9026 10505 6574 4980 6129 10162 8512 3570 -1178 -4643 968 -3001 -7311
14776 -7311 -6601 -6072 -11049 -9706 -5171 5849 17252 22534 17998 15351 20600 15275 5753 9058 18859
14761 18859 17962 15601 13141 10956 7822 -2843 -2457 -804 -2050 -5272 -4024 -1544 -2066 -2840 -4807
14746 -4807 1296 4318 -405 1163 14701 17460 21144 23953 25669 23903 22935 17971 18005 21082 25037
14731 25037 26110 26353 24180 13685 10346 14074 17734 13433 11900 14568 8240 3563 3278 3588 2699
14716 2699 5968 6656 11262 9181 5459 3139 4524 11508 13663 7117 308 -5691 1432 4310 597
14701 597 955 -874 2001 1604 -1322 -5222 -3674 5323 10679 11051 11471 4778 2232 3931 1914 845
$$ packed form
14807A0939o732l190O042n44j599l424N55O428l142n44m34j721M00P227M95j339
14791I417J787j816l62J479l931j594J149M033j650m942m748l465N611l969m310
14776g311P10N29m977J343M535J1020J1403N282m536k647N249n325r522L305R801
14761A8859q97k361k460k185l134j0665L86J653j246l222J248K480n22p74j967
14746d807O103L022m723J568J3538K759L684K809J716j766r68m964L4L077L955
14731B5037J073K43k173j0495l339L728L660m301j533K668o328m677k85L10q89
14716B699L269O88M606k081l722k320J385O984K155o546o809n999P123K878l713
14701E97L58j829K875l97k926l900J548Q997N356L72M20o693k546J699k017j069
$$ plain form
14685 845 9761 14536 12806 5132 3622 13180 11737 8028 10009 11770 5504 2696 -1904 -4516 -337
14670 -337 3694 5341 4791 5789 11201 9094 10922 14320 7603 4024 8204 3427 781 4416 7381
14655 7381 11795 5609 5853 6097 -355 -5103 -2733 -252 -1193 -575 815 3036 641 8167 10571 4864
14639 4864 5291 -1185 -2395 -4013 -1794 -2275 -5027 1152 5054 7728 9127 9459 1924 356 3658
14624 3658 6510 8817 10426 9518 8984 9039 5139 2424 5892 4564 4057 -1173 -4159 -1011 -613 6946
14608 6946 9243 3548 87 -3517 -5052 -1723 -2077 -5742 -12773 -13260 -5890 -4445 -6901 1454 7336
14593 7336 9914 6642 6039 5237 14898 15407 14479 12971 11226 7364 8460 10343 8820 1719 2744 1994
14577 1994 2774 2095 5322 6452 4680 1231 5265 5794 355 -6906 -3160 3690 2425 -668 -10638
$$ packed form
14685H45Q916M775j730p674j510R558j443l709J981J761o266k808m600k612M179
14670c37M031J647n50R98N412k107J828L398o717l579M180m777k646L635K965
14655G381M414o186K44K44o452m748K370K481r41O18J390K221k395P526K404n707
14639D864M27o476j210j618K219m81k752O179L902K674J399L32p535j568L302
14624C658K852K307J609r08n34N5l900k715L468j328n07n230k986L148L98P559
14608F946K297n695l461l604j535L329l54l665p031m87P370J445k456Q355N882
14593G336K578l272o03q02R661N09r28j508j745l862J096J883j523p101J025p50
14577A994P80o79L227J130j772l449M034N29n439p261L746O850j265l093r970
$$ plain form
14562 -10638 -13741 -9945 -1379 7387 8903 4111 1646 3025 -2760 443 3564 3707 -5010 -7681 -2196
14547 -2196 -209 5854 5718 7291 6177 3114 -2444 133 3533 7028 3904 6035 10662 11790 9306
14532 9306 11746 14942 16123 14461 11756 10337 14241 24363 25659 26260 31656 44941 51776 51967 55004
14517 55004 59291 66479 69770 71963 77874 77155 73352 67927 63530 65700 65034 57177 51135 46048 38083
14502 38083 31646 17793 17957 24519 27699 29626 25764 20094 15977 16463 14657 20561 20677 9732 6360
14487 6360 9088 15405 20026 18102 16886 15316 12649 15180 23351 27900 25679 34795 41402 41039 37082
14472 37082 44063 43639 43940 43457 39077 39121 40976 49339 52810 62247 65682 57851 55981 52188 42625 39065
14456 39065 41554 41698 41117 35780 32878 32829 23346 15119 16489 15928 19180 16464 19494 31058 38489
$$ packed form
14562a0638l103L796Q566Q766J516m792k465J379n785L203L121J43q717k671N485
14547b196J987O063j36J573j114l063n558K577L400L495l124K131M627J128k484
14532I306K440L196J181j662k705j419L904J0122J296O01N396J3285O835J91L037
14517E5004M287P188L291K193N911p19l803n425m397K170o66p857o042n087p965
14502C8083o437j3853J64O562L180J927l862n670m117M86j806N904J16j0945l372
14487F360K728O317M621j924j216j570k667K531Q171M549k221R116O607l63l957
14472C7082O981m24L01m83m380M4J855Q363L471R437L435p831j870l793r563l560
14456C9065K489J44n81n337k902m9r483q227J370n61L252k716L030J1564P431
$$ plain form
14441 38489 39410 44588 43909 41262 46506 52243 54841 48697 47627 48604 50932 50708 57104 73435 97959
14426 97959 112084 116361 119079 123362 116475 119898 124121 125242 122350 106988 97157 90997 73676 56461
14412 56461 45956 33917 26732 26467 20431 17061 18307 17296 21341 23062 24556 26101 30980 35273
14398 35273 43368 57291 71800 76890 80343 80423 81878 74457 61126 47888 38655 31748 33032 33028 27413
14383 27413 26023 22263 18416 23309 25960 21832 18811 19295 25693 27260 17398 14799 26613 45305
14369 45305 65436 83980 108301 141164 170520 204514 242346 281185 311532 330692 338126 333936
14357 333936 317381 279609 228870 183926 146046 123400 100895 76416 62359 48831 42460 36469
14345 36469 34214 38209 42648 52354 59049 73270 79379 89247 95054 95521 86739 83015 86290 77432
$$ packed form
14441C8489R21N178o79k647N244N737K598o144j070R77K328k24O396J6331K4524
14426I7959J4125M277K718M283o887L423M223J121k892j5362r831o160j7321j7215
14412E6461j0505j2039p185k65o036l370J246j011M045J721J494J545M879M293
14398C5273Q095J3923J4509N090L453Q0J455p421j3331j3238r233o907J284mn615
14383B7413j390l760l847M893K651m128l021M84O398J567r862k599J1814J8692
14369D5305K0131J8544K4321L2863K9356L3994L7832L8839L0347J9160P434m190
14357C33936j6555l7772n0739m4944l7880k2646k2505k4479j4057j3528o371n991
14345C6469k255L995M439R706O695J4221O109R868N807M67q782l724L275q858
$$ plain form
14331 77432 68265 63168 59802 63483 75444 86842 95923 104151 104009 101206 94184 85613 73064 65632
14317 65632 62744 51733 37061 31561 33616 29335 26178 26529 21454 17383 15209 18238 18417 19409 22714
14302 22714 22424 25896 26882 25165 23071 28310 33215 41651 54588 58947 67219 87981 101308 112138
14288 112138 127820 136849 127357 117335 109435 102078 82228 59667 44221 34618 26028 14066 6139
14275 6139 7888 9432 15925 15273 14534 9129 6463 10197 10460 4481 9905 18401 18856 13375 7091 5653
14259 5653 7770 15166 11405 13319 11997 12992 9139 8838 8235 8358 11776 15273 12204 13354 10223 3053
14243 3053 1145 -714 -998 828 -2226 -3135 -3535 -9069 -4348 1101 -176 39 -3349 -4380 -3387 -6147
14227 -6147 -2401 5415 10815 13213 5133 -4087 -7670 -3779 -2482 1934 3359 5370 378 -680 -1397
$$ packed form
14331G7432r167n097l366L681J1961J1398R081Q228j42k803p022q571j2549p432
14317F5632k888j1011j4672n500K055m281l157L51n075m071k174L029J79R92L305
14302B2714k90L472R86j717k094N239M905Q436J2937M359Q272K0762J3327J0830
14288A12138J5682R029r492j0022p900p357j9850k2561j5446r603q590j1962p927
14275F139J749J544O493o52p39n405k666L734K63n979N424Q496M55n481o284j438
14259E653K117P396l761J914j322R95l853l01o03J23L418L497l069J150l131p170
14243C053j908j859k84J826l054r09m00n534M721N449j277K15l388j031R93k760
14227f147L746P816N400K398q080r220l583L891J297M416J425K011m992j058p17
$$ plain form
14212 -1397 -1252 -1634 1973 4416 -285 -10611 -6994 11355 9521 9967 7047 12199 17449 17185 10284
14197 10284 8010 11839 9709 14300 16961 9169 2506 3144 10077 5965 214 -2121 3369 8971 10858
14182 10858 13243 12290 10167 9472 13488 23011 29359 43016 57130 68939 83275 97330 106231 108985
14168 108985 113435 103730 94039 84849 67660 52539 36170 22784 19006 10619 8160 14563 14822
14155 14822 11766 5084 7890 9653 11416 7148 6305 4852 216 -1606 4512 5101 3910 6290 6128
14140 6128 6197 7147 -3873 -5527 3585 3079 -2137 -2509 -2305 -1824 -2402 3154 5169 7051 15086 20590
14124 20590 32551 41397 48739 60667 73193 71081 64548 52049 44906 40543 34710 27175 14936
14111 14936 7091 9803 10533 12452 14679 16367 11182 621 -8923 -4228 -3731 1319 -208 -290 6135
$$ packed form
14212a397J45l82L607K443m701j0326L617J8349j834M46k920N152N250k64o901
14197A0284k274L829k130M591K661p792o663O38O933m112n751k335N490N602J887
14182A0858K385r53k123o95M016R523O348J3657J4114J1809J4336J4055Q901K754
14168A08985M450r705r691r190j7189j5121j6369j3386l778q387k459O403K59
14155A4822l056o682K806J763J763m268q43j453m636j822O118N89j191K380j62
14140F128O9R50j1020j654R112n06n216l72K04M81n78N556K015J882Q035N504
14124B0590J1961Q846P342J1928J2526k112o533j2499p143m363n833p535j2239
14111A4936p845K712P30J919K227J688n185j0561r544M695M97N050j527q2O425
$$ plain form
14096 6135 12968 7303 2823 4913 9610 10801 14979 12169 4986 3273 6257 2718 -4940 -1211 6123
14081 6123 3426 -4042 -916 2422 3809 1855 1172 9829 17270 17334 22125 26651 30105 27749 22109
14066 22109 22569 18807 12887 14480 20521 18394 19746 25045 27640 33034 34065 35239 41624 58825
14052 58825 75407 85897 102451 139380 193755 265269 358275 462722 563084 639911 679946
14041 679946 670143 614894 524078 420648 328047 258445 209181 167500 133070 100289 83050
14030 83050 71800 59422 51559 44323 37688 30937 28434 32749 22492 23247 24324 19219 20018 18618
14016 18618 11759 7739 6621 10390 12798 17663 14443 8497 3058 1454 1439 7921 10006 2852 917
14001 917 4806 7937 3242 4885 7877 1795 -5194 827 -3770 -13210 -14880 -8840 -2680 -3995 -4694
$$ packed form
14096F135O833n665m480K090M697J191M178k810p183j713K984l539p658L729P334
14081F123k697p468L126L338J387j954o83Q657P441O4M791M526L454k356n640
14066B2109M60l762n920J593O041k127J352N299K595N394J031J174O385J7201
14052E8825J6582J0490J6554L6929N4375P1514R3006J04447J00362P6827M0035
14041F79946r803n5249r0816j03430r2601o9602m9264m1681l4430l2781j7239
14030H3050j1250j2378p863p236o635o751k503M315j0257P55J077n105P99j400
14016A8618o859m020j118L769K408M865l220n946n439j604j5O482K085p154j935
14001I17L889L131m695J643K992o082o989O021m597r440j670O040O160j315o99
$$ plain form
13986 -4694 -3125 -1115 -2069 928 -3778 -5040 -7319 -5952 -10773 -10612 -12205 -20319 -18576 -21935 -22683
13971 -22683 -16788 -9233 -9241 -6634 -7003 -5639 -4788 -10090 -9336 1093 3388 -2776 -7808 -5006 -2089 2756
13955 2756 -819 -2546 -2086 -3726 -7299 -3255 7848 7328 5130 2989 2020 -187 -4763 -2074 -438
13940 -438 -4915 -12235 -11799 -10050 -9648 -5996 -972 -2023 -6242 -4476 -5748 -7274 -9823 -7017 -8177
13925 -8177 -14235 -14913 -12559 -10310 -8467 -3637 -4688 -8209 -8161 -1542 -2771 -3133 -2386 666 -784 -8929
13909 -8929 -6754 -4541 -1940 -90 2665 3113 4940 3213 1911 947 1474 5485 12769 15874 9004
13894 9004 11234 6964 5849 -1088 -9460 -9580 -9213 -10170 -4279 7671 2683 -8526 1935 4354 -2028
13879 -2028 -12861 -16185 -15235 -19063 -10510 -2199 -634 -3949 -7215 -3364 -2886 -2763 679 10265 12274
$$ packed form
13986d694J569K010r54K997m706j262k279J367m821J61j593q114J743l359p48
13971b2683N895P555qK607l69J364Q51n302P54J0429K295o164n032K802K917M845
13955B756l575j727M60j640l573M044J1103n20k198k141r69k207m576K689J636
13940d38m477p320M36J749M02L652N024j051m219J766j272j526k549K806j160
13925h177o058o78K354K249J843M830j051l521M8O619j229l62P47L052j450q145
13909h929K175K213K601J850K755M48J827j727j302r64N27M011P284L105o870
13894I004K230m270j115o937q372j20L67r57N891J1950m988j1209J0461K419o382
13879b028j0833l324R50l828Q553Q311J565l315l266L851M78J23L442R586K009
$$ plain form
13864 12274 5939 493 -139 4332 7299 4185 694 -1985 -4632 -1026 4869 7005 9268 10425 13020
13849 13020 4506 -2295 -1720 1728 -1903 -8641 549 1037 968 4205 591 -4816 -8933 -3581 1717
13834 1717 -1826 -5360 -3816 -1377 8763 13651 10209 -4107 -6672 -5034 -4209 532 741 4380 6478
13819 6478 4918 1847 3178 3121 2165 3243 2696 7433 10601 8191 4453 -3848 -3770 -8869 -14437 -8372
13803 -8372 -3643 -1717 -3410 -4447 -10244 -10400 -7781 -11193 -12143 -5851 -8263 -9388 -11435 -17357 -17582
13788 -17582 -15170 -14825 -7793 174 -5281 -11953 -7820 -10942 -9979 -10936 -7388 -11354 -11407 -9285 -10749 -6489
13772 -6489 -9266 -11992 -12338 -13996 -8565 -6103 -4733 -3132 -10122 -10499 -7389 -13159 -13721 -12146 -11551 -9755
13756 -9755 -9952 -13008 -13346 -3355 2454 -1839 -2070 431 -949 -8672 -3411 -4466 -11166 -12569 -12398 -13529
$$ packed form
13864A2274o335n446o32M471K967l114l491k679k647L606N895K136K263J157K595
13849A3020q514o801N75L448l631o738R190M88o9L237l614n407m117N352N298
13834A717l543l534J544K439J0140M888l442j4316k565J638Q25M741K09L639K098
13819F478j560l071J331n7r56J078n47M737L168k410l738q301P8n099n568O065
13803h372M729J926j693j037n797j56K619l412r50O292k412j125k047n922k25
13788a7582K412L45P032P967n455o672M133l122R63r57L548l966n3K122j464M260
13772f489k777k726l46j658N431K462J370J601o990l77L110n770n62J575N95J796
13756i755j97l056l38R991N809m293k31K501j380p723N261j055o700j403J71j131
$$ plain form
13740 -13529 -9194 -3948 4364 7386 3971 1694 -1337 -3759 -4152 2422 3517 -1802 -2859 -9098 -12131
13725 -12131 -13312 -3398 562 -6369 -11765 -5830 -313 898 -1302 -3016 2253 5762 2807 -3771
13711 -3771 -2664 -3107 -3796 -5528 -13108 -12155 -697 1547 -1722 425 -1995 -2006 -335 3562 8144 6728
13695 6728 -2645 5669 -1246 -8534 -12859 -16214 -18518 -16381 -10806 -5278 -8543 -7835 -1863 -6059 -10743
13680 -10743 -11027 -10136 -8619 -758 -1399 -2047 3787 389 -1425 -3268 -8321 -6196 -11505 -12093 -12139 -10721
13664 -10721 -8050 -9478 -13635 -16325 -16827 -18548 -11742 -4732 -5259 -7167 -6852 -12992 -14200 -9208 -7935
13649 -7935 -3947 -4010 -5395 -7972 -8725 -5298 -6373 -7341 -5744 -7813 -8822 -10405 -9555 -8424 -8102 -3094
13633 -3094 -992 -129 -3655 -10352 -14242 -8682 -3041 3259 1354 -3668 -10740 -7530 398 123 -2234
$$ packed form
13740a3529M335N246Q312L022l415k277l031k422l93O574J095n319j057o239l033
13725a2131j181R914L960o931n396N935N517J211k200j714N269L509k955o578
13711c771J107m43o89j732p580R53J1458K244l269K147k420j1J671L897M582j416
13695F728r373Q314o915p288m325l355k304K137N575N528l265P08N972m196m684
13680a0743k84Q91J517P861o41o48N834l398j814j843n053K125n309n88m6J418
13664a0721K671j428m157k690n02j721O806P010n27j908L15o140j208M992J273
13649g935L988o3j385k577p53L427j075r68J597k069j009j583Q50J131L22N008
13633c094K102Q63l526o697l890N560N641O300j905n022p072L210P928k75k357
$$ plain form
13618 -2234 -3790 -9723 -6347 1553 4523 125 -2662 -3422 192 -416 -755 1752 819 -3932 -1676 2447
13602 2447 7028 9921 13117 13623 6932 5793 -5474 -9349 -9100 -14786 -14999 -14497 -4939 -6289 -7596
13587 -7596 -2226 -7672 -1517 -1132 -3037 -1750 3884 7012 3172 5221 4229 -584 -4770 -5655 -3155
13572 -3155 -10075 -13564 -12347 -12280 -13408 -14589 -14476 -10858 -7201 -2849 -2926 -5389 -4711 -7409 -6133 -1460
13556 -1460 -5143 -8211 -10972 -4872 -2896 1698 5642 6087 6905 2932 -1735 4861 1063 2401 1072
13541 1072 -4328 -2980 7204 -586 -12499 -16296 -9776 -7683 -5673 -5975 -2235 2141 -3340 -5158
13527 -5158 -2634 -5229 -5480 -7915 -7419 -10074 -8801 -6980 -1699 5624 2492 -4485 -3677 -5521 -8173
13512 -8173 -592 6118 8583 4824 -2119 -7399 -8187 -7992 -6613 -6434 -5590 -2716 334 -569 1944 6481
$$ packed form
13618b234j556n933L376P900K970m398k787p60L614o08l39K507r33m751K256M123
13602B447M581K893L196N06o691j139j1267l875K49n686k13N02R558j350j307
13587g596N370n446O155L85j905J287N634L128l840K049r92m813m186q85K500
13572c155o920l489J217O7j128j181J13L618L657M352p7k463O78k698J276M673
13556a460l683l068k761O100J976M594L944M45Q18l973m667O596l798J338j329
13541A072n400J348J0184p790j1913l797O520K093K010l02L740M376n481j818
13527e158K524k595k51k435M96k655J273J821N281P323l132o977Q08j844k652
13512h173P581O710K465l759o943n280p88J95J379J79Q44K874L050r03K513M537
$$ plain form
13496 6481 6441 -1680 -11363 -15507 -10097 -7313 -1459 8714 10902 7921 8867 7493 2805 4546 1797
13481 1797 -5148 -4137 -6335 -11410 -8453 -3517 -6419 -9217 -12665 -8585 -2573 2435 4364 5511 3052
13466 3052 -1837 -2577 -6395 -10543 -14180 -8350 -2706 1729 421 -6094 -7660 -4192 -4510 -7387 -3077
13451 -3077 2408 2687 -231 4385 8386 3389 566 3361 2360 6351 4885 -3495 -7907 -10916 -8854
13436 -8854 -9701 -6048 2326 -244 -404 -5013 -5444 -8168 -7376 -3767 336 -1165 -5354 -6264 -3598 -7298
13420 -7298 -4963 527 471 -4419 -2084 -5409 -6099 -1289 -3137 -5434 -5988 -10681 -7322 -3821 1884 2183
13404 2183 7205 3487 -1915 -464 -10358 -13853 -12831 -14135 -11329 -4008 -5528 -3712 -2720 4633 8182
13389 8182 1311 -3669 -8894 -6478 -2080 5572 6744 2018 -490 -391 -541 2408 896 -3235 -8321
$$ packed form
13496F481m0q121r683m144N410K784N854J0173K188k981R46j374m688J741k749
13481A797o945J011k198n075K957M936k902k798l448M080O012N008J929J147k459
13466C052m889p40l818m148l637N830N644M435j308o515j566L468l18k877M310
13451c077N485K79k918M616M001m997k823K795j001L991j466q380m412l009K062
13436h854q47L653Q374k570j60m609m31k724P92L609M103j501m189r10K666l700
13420g298K335N490n6m890K335l325o90M810j848k297n54m693L359L501N705K99
13404B183N022l718n402J451r894l495J022j304K806P321j520J816R92P353L549
13389H182o871m980n225K416M398P652J172m726k508R9j50K949j512m131n086
$$ plain form
13374 -8321 -10058 -2055 4411 5447 2287 2328 2913 3926 3167 -2267 3403 5536 -2526 -3149 -6929 -8442
13358 -8442 -4331 4010 5532 7402 10645 11465 7784 -1893 -4558 -4279 5782 10184 6806 8946 5843
13343 5843 11842 11599 3973 1122 -2989 3010 4070 8169 10265 5831 3907 5487 2497 -3751 -5086
13328 -5086 895 -147 -1858 -5272 -6489 -4491 -634 491 5289 3839 -422 435 2050 3378 6941
13313 6941 9841 16183 15961 8660 5455 4626 3218 -1415 -6622 -6578 -7971 -2846 -4003 -998 634 -2717
13297 -2717 -2590 -6465 1434 3751 8094 13218 9049 3724 4905 8795 1839 -3563 -5625 -9186 -1950
13282 -1950 5734 183 -3649 -685 2775 5697 8978 7153 3618 5800 5592 2697 -3703 700 -3697
13267 -3697 -10833 -6551 -8512 -11976 -4521 -1830 1170 -1609 265 300 -5372 -1840 6392 4265 4099
$$ packed form
13374h321j737Q003O466J036l160M1N85J013p59n434N670K133q062o23l780j513
13358h442M111Q341J522J870L243Q20l681r677k665K79J0061M402l378K140l103
13343E843N999k43p626k851m111N999J060M099K096m434j924J580k990o248j335
13328e086N981j042j711l414j217J998L857J125M798j450m261Q57J615J328L563
13313F941K900O342k22p301l205q29j408m633n207M4j393N125j157L005J632l351
13297b717J27l875P899K317M343N124m169n325J181L890o956n402k062l561P236
13282a950P684n551l832K964L460K922L281j825l535K182k08k895o400M403m397
13267c697p136M282j961l464P455K691L000k779J874L5n672L532Q232k127j66
$$ plain form
13252 4099 2661 876 -2900 987 4783 -1939 -5162 -3147 1042 2874 -868 -7314 -7206 -377 3042
13237 3042 988 -2378 -2057 -2884 -1392 -4612 -2935 -2241 -4405 -1481 -1445 9022 9071 8496 6263 -934
13221 -934 -11051 -12970 -14219 -15755 -14284 -11720 -3842 -8165 -11329 -9603 -10899 -16929 -14406 -15012 -7008
13206 -7008 1128 3717 9213 3058 1205 1850 3626 4616 8412 5669 782 1706 5613 942 2041
13191 2041 -498 2817 2932 7471 8024 7904 1517 -338 -3131 -2825 -4007 794 -2272 -1375 3567 5113
13175 5113 2371 8637 13878 8191 2959 1697 2286 -7323 -6049 -3483 -6843 -9753 -11465 -3909 -1409
13160 -1409 -10882 -13519 -11907 -5116 -2543 -4951 -197 4438 6510 7403 1610 -2302 -2008 5816 13854
13145 13854 13981 7560 3450 1101 -3278 -4129 2448 4675 9062 7245 5514 6399 5936 1515 -1698
$$ packed form
13252D099j438j785l776L887L796o722l223K015M189J832l742o446J08O829L419
13237C042k054l366L21q27J492l220J677O94k164K924L6J0467M9n75k233p197
13221i34j0117j919j249j536J471K564P878m323l164J726j296o030K523o06Q004
13206g008Q136K589N496o155j853O45J776R90L796k743m887R24L907m671J099
13191B041k539L315J15M539N53j20o387j855k793L06j182M801l066Q97M942J546
13175E113k742O266N241n687n232j262N89r609J274K566l360k910j712P556K500
13160a409r473k637J612O791K573k408M754M635K072Q93n793l912K94P824Q038
13145A3854J27o421m110k349m379q51O577K227M387j817j731Q85m63m421l213
$$ plain form
13130 -1698 -742 2298 1111 -3178 2883 7252 12341 7951 8355 9856 11812 8515 804 -4279 -8091
13115 -8091 -8054 -3243 1203 -149 3591 10590 16753 17204 12611 2457 -2134 -7942 -6176 -1057 7947
13100 7947 12567 12464 6709 3186 4539 2410 3186 6258 10652 8460 -3251 -11937 -9030 -2592 -2943
13085 -2943 -5911 -8270 -6796 -2241 8241 16005 11502 6701 6922 7585 7630 6138 6373 9545 10141 3379
13069 3379 -467 -1898 1286 4404 3437 -3827 4723 9345 4693 86 -809 133 190 8475 3810 -2552
13053 -2552 1110 11026 13587 8759 8327 5649 5292 4027 3646 5599 13592 17295 19981 16433 14028
13038 14028 11267 2145 1576 3568 10859 9169 7781 6706 7105 1984 -1361 -2799 304 2300 4608
13023 4608 6341 6822 8502 12756 17101 10887 2779 3067 9637 14406 18982 18261 4254 692 3267
$$ packed form
13130a698R56L040j187m289O061M369N089m390M04J501J956l297p711n083l812
13115h091L7M811M446j352L740O999O163M51m593j0154m591n808J766N119R004
13100G947M620j03n755l523J353k129P76L072M394k192j1711q686K907O438l51
13085b943k968k359J474M555J0482P764m503m801K21O63M5j492K35L172N96o762
13069C379l846j431L184L118r67p264Q550M622m652m607q95R42N7Q285m665o362
13053b552L662R916K561m828m32k678l57j265l81J953P993L703K686l548k405
13038A4028k761r122n69J992P291j690j388j075L99n121l345j438L103J996K308
13023D608J733M81J680M254M345o214q108K88O570M769M576p21j4007l562K575
$$ plain form
13008 3267 6014 9833 8269 -1334 -695 3572 6674 6830 8390 7630 13000 13220 4032 -4054 -3487 -2573
12992 -2573 -1314 7080 8081 4205 10337 18952 13307 11513 13310 10516 10039 11671 15570 25124 25481
12977 25481 25081 22219 16301 19989 18046 17566 17093 14793 21170 23635 20262 12443 5637 4719 2131
12962 2131 5706 9673 3866 3667 10927 14103 13690 15030 17928 18477 21683 24991 21779 12844 8860
12947 8860 8199 11418 11523 10481 12757 11805 9375 14332 27232 32285 33152 32895 41975 37168 33332 29501
12931 29501 29576 37118 37497 27399 20637 20681 28098 34785 32541 29526 28966 36854 42887 40893 36802 37518
12915 37518 31247 31985 29006 22783 25190 28981 23807 15286 6893 12925 20329 21683 27676 28290 28759
12900 28759 31507 35246 37420 37396 35346 33363 37573 41009 38481 34663 36933 44139 45075 42822 47739
$$ packed form
13008C267K747L819j564r603O39M267L102J56J560p60N370K20r188q086N67R14
12992b573J259Q394J001l876O132Q615n645j794J797k794m77J632L899R554L57
12977B5481m00k862n918L688j943m80m73k300O377K465l373p819o806r18k588
12962B131L575L967n807j99P260L176m13J340K898N49L206L308l212q935l984
12947H860o61L219J05j042K276r52k430M957J2900N053Q67k57R080m807l836l831
12931B9501P5P542L79j0098o762M4P417O687k244l015n60P888O033j994m091P16
12915C7518o271P38k979o223K407L791n174q521q393O032P404J354N993O14M69
12900B8759K748L739K174k4k050j983M210L436k528l818K270P206R36k253M917
$$ plain form
12885 47739 48021 42521 38415 43367 47269 47518 43970 40499 40144 47863 52082 45087 41393 37880 33447
12870 33447 37353 42745 43295 36364 37288 42618 41554 38407 34539 34263 37741 35702 34827 37154 30147
12855 30147 22456 25802 31565 47322 43549 36119 31273 33697 40534 37858 34962 39739 42460 42529 36814
12840 36814 31488 33633 38582 37122 36655 25042 25339 32277 38681 41266 34964 30412 29676 32662 34863
12825 34863 36854 40498 38409 31737 29689 30183 34696 36258 40317 44751 40656 31418 32227 36328 31418
12810 31418 25695 22546 19317 10910 13358 18938 29526 27550 22171 20177 23573 26153 26834 27355 26865
12795 26865 20731 20565 26274 26090 22384 17140 17610 23254 26357 32591 44610 59172 60862 57834 48552
12780 48552 34663 27726 27788 35177 35907 32630 24786 26428 21466 17259 12482 12229 11662 7595 3481
$$ packed form
12885D7739K82n500m106M952L902K49l548l471l55P719M219o995l694l513m433
12870C3447L906N392N50o931R24N330j064l147l868k76L478k039q75K327p007
12855C0147p691L346N763J5757l773p430m846K424O837k676k896M777K721O9n715
12840C6814n326K145M949j460m67j1613K97O938O404K585o302m552p36K986K201
12825C4863J991L644k089o672k048M94M513J562M059M434m095r238Q09M101m910
12810C1418n723l149l229q407K448N580J0588j976n379j994L396K580O81N21m90
12795B6865o134j66N709j84l706n244M70N644L103O234J2019J4562J690l028r282
12780D8552j3889o937O2P389P30l277p844J642m962m207m777k53n67m067m114
$$ plain form
12765 3481 6332 2927 4604 13446 23237 22114 14649 21936 20744 11956 6278 8229 13651 13511 12420
12750 12420 4230 629 5585 15219 15757 18191 22060 17548 9822 7376 6654 11336 12839 11711 10185
12735 10185 15764 14601 11022 8643 11197 15542 18723 16151 11454 15637 14532 7718 9103 20084
12721 20084 19461 21039 22016 18072 13394 2900 3790 10629 9123 7108 3117 3535 4742 9542 11302
12706 11302 11141 15826 12079 11731 10789 9045 5119 5461 3865 -3429 -4694 4000 11708 9929 5770
12691 5770 1607 4916 6413 356 -344 -3256 -5269 2953 5096 3741 4672 853 -2740 -4512 1739
12676 1739 10463 10190 9754 12365 9487 10797 12888 5864 4098 6659 10546 9842 10218 6782 6617 185
12660 185 -9512 -7979 -2022 -5907 -8018 -2113 -960 -551 2280 -2200 -3364 -2487 -881 3334 3634 8868
$$ packed form
12765C481K851l405J677Q842R791j123p465P287j192q788n678J951N422j40j091
12750A2420q190l601M956R634N38K434L869m512p726k446p22M682J503j128j526
12735A0185N579j163l579k379K554M345L181k572m697M183j105o814J385J0981
12721B0084o23J578R77l944m678j0494Q90O839j506k015l991M18J207M800J760
12706A1302j61M685l747l48r42j744l926L42j596p294j265Q694P708j779m159
12691E770m163L309J497o057p00k912k013Q222K143j355R31l819l593j772O251
12676A739Q724k73m36K611k878J310K091p024j766K561L887p04L76l436j65o432
12660A85r697J533N957l885k111N905J153M09K831m480j164Q77J606M215L00N234
$$ plain form
12644 8868 13916 16500 14725 14011 17504 19353 24467 21630 27903 46371 74393 107642 141734 168299
12630 168299 179896 160082 125436 95539 70100 56653 48100 37565 33972 34544 26046 14455
12618 14455 5842 -281 5068 10680 16691 13599 11556 10802 14553 20781 22816 10138 6786 8919
12604 8919 11764 10145 2517 -3190 4417 9740 7438 2102 518 5741 5754 9102 10366 7416 2966
12589 2966 7080 8731 3789 -645 4757 -882 788 4139 9121 8053 1820 2032 3789 4742 9287
12574 9287 13089 14947 8921 6674 166 -1453 -3022 -1907 1476 6022 4371 3921 4252 963 -220
12559 -220 1810 -5690 -7693 -2555 -604 -3761 -850 1298 -2107 -9704 -7193 -4463 -8582 -8260 -4748
12544 -4748 1287 3575 3242 -342 -4992 -10672 -13009 -4488 -948 -2006 3569 7793 46 -4627 -861
$$ packed form
12644H868N048K584j775p14L493J849N114k837O273J8468K8022L3249L4092K6565
12630A68299J1597j9814l4646k9897k5439j3447q553j0535l593N72q498j1591
12618A4455q613o123N349N612O011l092k043p54L751O228K035j2678l352K133
12604H919K845j619p628n707P607N323k302n336j584N223J3L348J264k950m450
12589B966M114J651m942m434N402n639J670L351M982j068o233K12J757R53M545
12574I287L802J858o026k247o508j619j569J115L383M546j651m50L31l289j183
12559b20K030p500k003N138J951l157K911K148l405p597K511K730m119L22L512
12544d748O035K288l33l584m650n680k337Q521L540j058N575M224p747m673L766
$$ plain form
12529 -861 -3705 -7009 -10372 -1868 6097 8837 4766 1310 6802 10094 4267 472 1274 -329 -347 940
12513 940 1671 -894 2832 7822 7330 -699 -2837 -5364 -3196 5470 10134 3829 2397 8375 8570 12497
12497 12497 8881 8561 10914 17878 17047 7651 4054 9825 12184 13022 9744 6752 6660 11013 14822 17025
12481 17025 12120 9607 8213 6956 12524 15617 15758 8574 3449 5702 5106 2578 -2907 -3735 1136
12466 1136 887 6382 7511 9247 5760 5505 334 -6424 -7892 -9162 -3354 5249 -1817 -5211 -2007
12451 -2007 -10483 -11081 -8766 -8535 -8455 -989 4816 4989 889 4202 9026 5856 6636 2654 -9898 -12788
12435 -12788 -8439 1335 5521 514 -6261 -6033 -460 4079 7114 8545 1451 1817 -1785 -2609 2489
12420 2489 4659 8843 6941 6466 1056 -526 2456 5920 6759 2202 700 -3931 -9571 -2915 317
$$ packed form
12529h61k844l304l363Q504P965K740m071l456N492L292n827l795Q02j603j8J287
12513I40P31k565L726M990m92q029k138k527K168Q666M664o305j432N978J95L927
12497A2497l616l20K353O964q31r396l597N771K359Q38l278k992r2M353L809K203
12481A7025m905k513j394j257N568L093J41p184n125K253n96k528n485q28M871
12466A136k49N495J129J736l487k55n171o758j468j270N808Q603p066l394L204
12451b007q476n98K315K31Q0P466N805J73m100L313M824l170P80l982j2552k890
12435a2788M349R774M186n007o775K28N573M539L035J431p094L66l602q24N098
12420B489K170M184j902m75n410j582K982L464Q39m557j502m631n640O656L232
$$ plain form
12405 317 -731 942 674 -227 12131 14037 7817 -4201 -3958 52 1981 3403 3493 3509 5036 6323
12389 6323 3018 991 5298 250 -3461 -2345 1121 6124 5508 2504 7776 8026 6294 365 -1549
12374 -1549 5946 9399 8630 3196 8208 14914 5086 6696 7690 2530 6210 243 -3885 -5743 -2643
12359 -2643 3285 2830 -2394 -6083 236 6550 7449 8249 9690 9229 7390 3841 2083 3796 1914 -1841
12343 -1841 -2479 4013 2006 2448 4534 7298 11431 10016 14174 15457 21116 16719 11713 9107 9948
12328 9948 8713 7175 11346 11922 11421 11941 7589 11586 16406 12340 9160 6591 3337 1639 1114 1782
12312 1782 2476 3483 2158 163 3387 5540 10332 8120 5494 7009 8058 7617 12092 11812 5829
12297 5829 12269 23865 24323 26072 28420 21174 21158 16425 17787 20681 15263 17485 20218 16287 9041
$$ packed form
12405C17j048J673k68r01J2358J906o220j2018K43M010J929J422R0J6J527J287
12389F323l305k027M307n048l711J116L466N003o16l004N272K50j732n929j914
12374a549P495L453p69n434N012O706r828J610R94n160L680n967m128j858L100
12359b643N928m55n224l689O319O314Q99Q00J441m61j839l549j758J713j882l755
12343a841o38O492k007M42K086K764M133j415M158J283N659m397n006k606Q41
12328I948j235j538M171N76n01N20m352L997M820m066l180k569l254j698n25O68
12312A782O94J007j325j995L224K153M792k212k626J515J049m41M475k80n983
12297E829O440J1596M58J749K348p246j6m733J362K894n418K222K733l931p246
$$ plain form
12282 9041 7636 6891 3365 1146 496 3605 321 -5267 -6050 2142 3823 10287 1986 -1851 1372
12267 1372 2560 4408 9605 15212 7150 -2677 -5816 -2435 3649 4963 4793 7668 7441 6783 7919
12252 7919 3967 7151 5484 802 -3578 -9090 -4464 -2092 -2629 -3740 -11021 -11744 -782 7785 6307
12237 6307 6327 2196 -5236 1637 3026 -440 -1527 116 -2738 -883 -1484 3139 9687 11176 13143
12222 13143 9574 346 1889 3233 6174 10119 7939 1762 -1020 -5066 -3965 1075 4814 7980
12208 7980 13001 7648 4359 2347 6797 4588 2751 3087 8643 8631 400 69 4322 4378 6907 4550
12192 4550 1477 -439 112 3889 3945 1420 3887 428 -2971 -2333 -6335 -1755 2698 12566 18359 9486
12176 9486 6774 8293 9038 2603 -5239 -6385 -3033 -10818 -15195 -13486 -12254 -6274 -467 1213 -3605
$$ packed form
12282I041j405p45l526k219o50L109l284n588p83Q192J681O464q301l837L223
12267A372J188J848N197N607q062r827l139L381O084J314j70K875k27o58J136
12252G919l952L184j667m682m380n512M626K372n37j111p281p23J0962Q567j478
12237F307K0m131p432O873J389l466j087J643k854J855o01M623O548J489J967
12222A3143l569r228J543J344K941L945k180o177k782m046J101N040L739L166
12208G980N021n353l289k012M450k209j837L36N556j2q231l31M253N6K529k357
12192D550l073j916N51L777N6k525K467l459l399O38m002M580M453R868N793q873
12176I486k712J519P45o435p842j146L352p785m377J709J232N980N807J680m818
$$ [...]
##END NTUPLES=NMR SPECTRUM
##END=
