##TITLE=Analysis number 316841
Compound Code cc 04510
Project Code adrs
Chemist Name molekula
##JCAMPDX= 6.0         $$ Bruker NMR JCAMP-DX V2.0
##DATA TYPE= NMR SPECTRUM
##DATA CLASS= NTUPLES
##ORIGIN= Bruker BioSpin GmbH
##OWNER= nmr
$$ XWIN-NMR		Version 3.5
$$ Fri Jan 27 13:55:37 2006 GMT Standard Time (UT+0h)  MAYBRIDGE\nmr@NMR_250MHZ
##.OBSERVE FREQUENCY= 250.131544655141
##.OBSERVE NUCLEUS= ^1H
##.ACQUISITION MODE= SIMULTANEOUS (DQD)
##.ACQUISITION SCHEME= undefined
##.AVERAGES= 16
##.DIGITISER RES= 18
##SPECTROMETER/DATA SYSTEM= dpx250
##.PULSE SEQUENCE= zg30
##.SOLVENT NAME= CDCl3
##.SHIFT REFERENCE= (INTERNAL, CDCl3, 0, 16.522)
##AUDIT TRAIL= $$ (NUMBER, WHEN, WHO, WHERE, WHAT)
$$ ##TITLE= Audit trail, XWIN-NMR		Version 3.5
$$ ##JCAMPDX= 5.01
$$ ##ORIGIN= Bruker BioSpin GmbH
$$ ##OWNER= nmr
$$ C:\u/data/dgb/nmr/ADRS/15300/pdata/1/auditp.txt
$$ ##AUDIT TRAIL=  $$ (NUMBER, WHEN, WHO, WHERE, WHAT)
(   1,<2006-01-27 13:54:53.18 +000>,<MAYBRIDGE\nmr>,<NMR_250MHZ>,
      <created by zg, POWCHK disabled, PULCHK disabled
       configuration hash MD5:
       62 19 C7 07 E1 42 D1 B7 37 6C 3D D0 77 39 F9 E6
       data hash MD5: 64K
       E7 8A 6B 34 C9 CA AE 62 B4 70 95 95 CC 5B 3C 1D>)
(   2,<2006-01-27 13:55:11.68 +000>,<MAYBRIDGE\nmr>,<NMR_250MHZ>,
      <Start of raw data processing
       ef LB = 0.3 FT_mod = 6 PKNL = 1 SI = 32K 
       data hash MD5: 32K
       B6 99 B4 07 57 D7 28 B4 00 88 4F 2D 93 85 D1 89>)
(   3,<2006-01-27 13:55:17.45 +000>,<MAYBRIDGE\nmr>,<NMR_250MHZ>,
      <apk 
       data hash MD5: 32K
       12 70 DA E3 D5 E5 41 16 20 EA C3 DE B5 5F 36 71>)
(   4,<2006-01-27 13:55:18.96 +000>,<MAYBRIDGE\nmr>,<NMR_250MHZ>,
      <abs ABSG = 5 
       data hash MD5: 32K
       DA 65 65 97 70 E8 32 77 94 57 C3 66 7D 3B 66 6C>)
$$ ##END=
$$ 
$$ hash MD5
$$ F5 65 8E D7 B1 FE A2 A2 59 2C 97 16 DD 14 C6 1C
##$RELAX= 
##$RELAX= 
##$RELAX= 
##$RELAX= 
##$RELAX= 
##$RELAX= 
##$RELAX= 
$$ Bruker specific parameters
$$ --------------------------
##$DU= <C:\u>
##$EXPNO= 15300
##$NAME= <ADRS>
##$PROCNO= 1
##$TYPE= <nmr>
##$USER= <dgb>
##$AMP= (0..31)
100 100 100 100 100 100 100 100 100 100 100 100 100 100 100 100 100 100 
100 100 100 100 100 100 100 100 100 100 100 100 100 100 
##$AQSEQ= 0
##$AQ_mod= 3
##$AUNM= <au_zg>
##$AUTOPOS= <7 >
##$BF1= 250.13
##$BF2= 250.13
##$BF3= 250.13
##$BF4= 250.13
##$BF5= 500.13
##$BF6= 500.13
##$BF7= 500.13
##$BF8= 500.13
##$BYTORDA= 1
##$CFDGTYP= 0
##$CFRGTYP= 5
##$CHEMSTR= <none>
##$CNST= (0..31)
1 1 145 1 1 1 1 1 1 1 1 1 1 1 1 1 1 1 1 1 1 1 1 1 1 1 1 1 1 1 1 1 
##$CPDPRG= <>
##$CPDPRG1= <>
##$CPDPRG2= <>
##$CPDPRG3= <>
##$CPDPRG4= <mlev>
##$CPDPRG5= <mlev>
##$CPDPRG6= <mlev>
##$CPDPRG7= <mlev>
##$CPDPRG8= <mlev>
##$CPDPRGB= <>
##$CPDPRGT= <>
##$D= (0..31)
0 1 0 0 0 0 0 0 0 0.06 0 0 0 0 0 0 0.0002 0 0 0 0 0 0 0 0 0 0 0 0 0 0 
0 
##$DATE= 1138370091
##$DBL= (0..7)
120 120 120 120 120 120 120 120 
##$DBP= (0..7)
150 150 150 150 150 150 150 150 
##$DBP07= 0
##$DBPNAM0= <>
##$DBPNAM1= <>
##$DBPNAM2= <>
$$ [...]
##$SUBNAM7= <"">
##$SUBNAM8= <"">
##$SUBNAM9= <"">
##$SW= 20.6930455092707
##$SWIBOX= (0..15)
0 0 3 0 0 0 0 0 0 0 0 0 0 0 0 0 
##$SW_h= 5175.983436853
##$TD= 65536
##$TD0= 1
##$TE= 293.16
##$TE2= 300
##$TE3= 300
##$TEG= 300
##$TL= (0..7)
0 120 120 120 120 120 120 120 
##$TP= (0..7)
150 150 150 150 150 150 150 150 
##$TP07= 0
##$TPNAME0= <>
##$TPNAME1= <>
##$TPNAME2= <>
##$TPNAME3= <>
##$TPNAME4= <>
##$TPNAME5= <>
##$TPNAME6= <>
##$TPNAME7= <>
##$TPOAL= (0..7)
0.5 0.5 0.5 0.5 0.5 0.5 0.5 0.5 
##$TPOFFS= (0..7)
0 0 0 0 0 0 0 0 
##$TUNHIN= 0
##$TUNHOUT= 0
##$TUNXOUT= 0
##$USERA1= <user>
##$USERA2= <user>
##$USERA3= <user>
##$USERA4= <user>
##$USERA5= <user>
##$V9= 5
##$VALIST= <valist>
##$VCLIST= <CCCCCCCCCCCCCCC>
##$VD= 0
##$VDLIST= <DDDDDDDDDDDDDDD>
##$VPLIST= <PPPPPPPPPPPPPPP>
##$VTLIST= <TTTTTTTTTTTTTTT>
##$WBST= 1024
##$WBSW= 4
##$XGAIN= (0..3)
0 0 0 0 
##$XL= 0
##$YL= 0
##$YMAX_a= 555154
##$YMIN_a= -587902
##$ZGOPTNS= <>
##$ZL1= 120
##$ZL2= 120
##$ZL3= 120
##$ZL4= 120
##$ABSF1= 16.522
##$ABSF2= -4.171173
##$ABSG= 5
##$ABSL= 3
##$ALPHA= 0
##$AQORDER= 0
##$ASSFAC= 0
##$ASSFACI= 0
##$ASSFACX= 0
##$ASSWID= 0
##$AUNMP= <proc_1d>
##$AZFE= 0.1
##$AZFW= 0.1
##$BCFW= 0
##$BC_mod= 0
##$BYTORDP= 0
##$COROFFS= 0
##$CY= 12.5
##$DATMOD= 1
##$DC= 0
##$DFILT= <>
##$DTYPP= 0
##$F1P= 14.0000005364418
##$F2P= -0.99999901652339
##$FCOR= 0.5
##$FTSIZE= 32768
##$FT_mod= 6
##$GAMMA= 0
##$GB= 0
##$INTBC= 1
##$INTSCL= 1
##$ISEN= 128
##$LB= 0.3
##$LEV0= 0
##$LPBIN= 0
##$MAXI= 10000
##$MC2= 0
##$MEAN= 0
##$ME_mod= 0
##$MI= 0
##$NCOEF= 0
##$NC_proc= -4
##$NLEV= 6
##$NOISF1= 0
##$NOISF2= 0
##$NSP= 0
##$NTH_PI= 0
##$NZP= 0
##$OFFSET= 16.522
##$PC= 1
##$PHC0= 237.6554
##$PHC1= 21.49223
##$PH_mod= 1
##$PKNL= yes
##$PPARMOD= 0
##$PSCAL= 4
##$PSIGN= 0
##$REVERSE= no
##$SF= 250.13
##$SI= 32768
##$SIGF1= 0
##$SIGF2= 0
##$SINO= 400
##$SIOLD= 32768
##$SREGLST= <1H.CDCl3>
##$SSB= 0
##$STSI= 32768
##$STSR= 0
##$SW_p= 5175.98343685301
##$SYMM= 0
##$S_DEV= 0
##$TDeff= 65536
##$TDoff= 0
##$TI= <Analysis number 999999
Compound Code 99
Book Reference 9
Project Code 9>
##$TILT= no
##$TM1= 0
##$TM2= 0
##$TOPLEV= 0
##$USERP1= <user>
##$USERP2= <user>
##$USERP3= <user>
##$USERP4= <user>
##$USERP5= <user>
##$WDW= 1
##$XDIM= 32768
##$YMAX_p= 314237847
##$YMIN_p= -179700
$$ End of Bruker specific parameters
$$ ---------------------------------
##NTUPLES= NMR SPECTRUM
##VAR_NAME=  FREQUENCY,     SPECTRUM/REAL,   SPECTRUM/IMAG
##SYMBOL=    X,             R,               I
##VAR_TYPE=  INDEPENDENT,   DEPENDENT,       DEPENDENT
##VAR_FORM=  AFFN,          ASDF,            ASDF
##VAR_DIM=   32768,         32768,           32768
##UNITS=     HZ,            ARBITRARY UNITS, ARBITRARY UNITS
##FACTOR=    0.157963299565203, 1,           1
##FIRST=     4132.6476996994, 0,             0
##LAST=      -1043.33573715361, 0,           0
##MIN=       -1043.33573715361, -179700,     0
##MAX=       4132.6476996994, 314237847,     0
$$ Real data points
##PAGE= N=1
##DATA TABLE= (X++(R..R)), XYDATA
$$ [...]
24891D7409n843n0091n3271l9612L4039K2378J3365Q787K558m936j2220j0722
24879d8159L4520M120l2244j6264j722j2426K9215J9170o3538n5190L9340J9226
24867h3952M3190O925j5225j2368K9339O9018L3826k2190k000k7153M227m7772
24855b4135j4295K2541K0983o1671L587k1648n885L654K6457r869n239J2245l2326
24842h5601L000J6688o490j125N385L4438N2372k0843o158p322j1478j991P2639
24829D3514M3366l3916o8455k6659J7614k9514Q177P198l183M33o665N4024R960
24816A5894j8053o628R365m7532n3154r678J9741K5298M7594M4764m412L540j7990
24803H749j9070J2810j602k7157j5194l7172R057O3425j5068m1571K6990K073
$$ plain form
24891 47409 41566 -8525 -61796 -101408 -67369 -44991 -31626 -22839 -20281 -25217 -37437 -48159
24879 -48159 -13639 -9519 -41763 -58027 -59749 -72175 -42960 -23790 -87328 -142518 -103178 -83952
24867 -83952 -40762 -33837 -49062 -61430 -32091 36927 70753 48563 46563 19410 23637 -24135
24855 -24135 -38430 -15889 5094 -56577 -52990 -74638 -80523 -76869 -50412 -60281 -65520 -53275 -85601
24842 -85601 -82601 -65913 -72403 -73528 -68143 -33705 18667 -2176 -8334 -15656 -27134 -29125 43514
24829 43514 86880 52964 -15491 -42150 -24536 -54050 -45873 -38675 -41858 -41425 -48090 5934 15894
24816 15894 -2159 -8787 578 -46954 -100108 -109786 -90045 -64747 -17153 27611 23199 26739 8749
24803 8749 -10321 2489 887 -26270 -41464 -78636 -69579 -6154 -21222 -62793 -35803 -33730
24791c3730J8575k9179J1678K8046J1985k471q564j2916j4127K9275j7535m3936
24779f2899O3646L4797K1979o919l8869k2415l272L9023O3429p657j6013l698
24767F1132l1742k5424n5897K3158L5849L2540l4809l925K0517k4446j0795n9128
24755g2970j0901L6251P8859K5201Q007L0853o319l6503p2782J0453Q604J2432
24743A1185Q947l418J0106k1481K1757J8570l2169r1438l8464N4932P0423j9965
24731a1015L618J0147k8833O135k5194K5368J4390n0854L2761M9336j6760m0762
24719c1663l435L6397L5102n1075J6899Q160j4311l0758L1560P943P845l462l6974
24706b7772m5837l6299M1339P815n334M1799Q246m1531J6909K1697K1576J1445
$$ plain form
24791 -33730 -15155 -44334 -32656 -4610 7375 4904 -3660 -16576 -30703 -1428 -18963 -62899
24779 -62899 747 35544 57523 50604 11735 -10680 -13952 25071 88500 80843 64830 61132
24767 61132 29390 3966 -51931 -28773 7076 39616 4807 882 21399 -3047 -13842 -72970
24755 -72970 -83871 -47620 31239 56440 64447 95300 88981 52478 -20304 -9851 -1247 11185
24743 11185 20132 16714 26820 5339 27096 45666 13497 -77941 -116405 -61473 8950 -11015
24731 -11015 -7397 2750 -26083 -19948 -45142 -19774 -5384 -56238 -23477 25859 9099 -31663
24719 -31663 -35098 1299 36401 -14674 2225 10385 -3926 -34684 -3124 4819 12664 9202 -27772
24706 -27772 -73609 -109908 -68569 -60754 -66088 -24289 -16043 -57574 -40665 -18968 2608 14053
24694A4053j600j6248k4650K748j7820p354M4930k607K1737n191k1100K312k2216
24681c3006K8589j1781L5637J2862l2152j7794N1094J2010k1480K9900j2006j9922
24669B1951K6529o104l1928n957l1148k6664l0817J5401L0692K1495J1833J6220
24657A1503k1284R865K1722J784K948Q083R154J5421K8001l387j6784k2512p700
24644C6814j2517m5992m5306j1144N4653R760J8304O0646k4271K248J1690m65
24632E4420j6664L915O095p2750k6511J4213L006k825j331K1635k9093m3325K1797
24619f7418J4825M0688j939m793J8067J6907j858m0260K7266k2252l2013k798
24607e5578n558J8155j9450l7328Q0150N4168k3455n006j2474n159k3586p621
$$ plain form
24694 14053 12453 -3795 -28445 -25697 -43517 -50871 -5941 -8548 13189 7998 -13102 -10790 -33006
24681 -33006 -4417 -16198 19439 32301 149 -17645 33449 45459 23979 53879 41873 21951
24669 21951 48480 42376 10448 4491 -26657 -53321 -84138 -68737 -38045 -16550 -4717 11503
24657 11503 -9781 84 21806 23590 26538 34621 43775 59196 87197 83810 67026 44514 36814
24644 36814 24297 -21695 -67001 -78145 -23492 -13732 4572 65218 40947 43195 54885 54420
24632 54420 37756 41671 47766 -24984 -51495 -37282 -34276 -37101 -38432 -16797 -45890 -89215 -67418
24619 -67418 -52593 -11905 -13844 -18637 -570 16337 14479 -25781 1485 -20767 -52780 -55578
24607 -55578 -61136 -42981 -62431 -99759 -19609 34559 11104 6098 -6376 -11535 -35121 -42742
24595d2742k412K570j0547N9526q11j886N22M7822K3272l3231n1817l0649M367
24582c6016l896J5228L5289j0029k4141l1610q898n3358j2450m12j2851N9481
24570h3663O2315K3568j3678L1133K531l745K3552K5222L3381l3161m9870j8948
24558a363k0490m65J7435m3770O882J4987L124j7268k2491l7078p195j6470J4915
24545a09247L9118r10j7767m3843J0771P6262J9193j858j8806l7923j6438L641
24533i7807N3788m701P158k3721k467M5050J4077K5835m7527r403N8534j6109
24521B707P705Q643m911J043j2663k1972l7349N654L6098j8496n5042m6519L6563
24508i8539N3376j4478l0256L3230L3976K9675n3874k3868m186N0785M851k7730
$$ plain form
24595 -42742 -45154 -42584 -53131 6395 5584 3698 4220 52042 75314 42083 -9734 -40383 -36016
24582 -36016 -39912 -24684 10605 576 -23565 -55175 -64073 -117431 -129881 -130293 -143144 -83663
24570 -83663 -21348 2220 -11458 19675 22206 18461 42013 67235 100616 67455 17585 -1363
24558 -1363 -21853 -22318 -4883 -48653 -41771 -26784 -23660 -40928 -63419 -100497 -107692 -124162 -109247
24545 -109247 -70129 -71039 -88806 -132649 -121878 -45616 -26423 -28281 -47087 -85010 -101448 -97807
24533 -97807 -44019 -48720 -41562 -65283 -67750 -22700 -8623 17212 -30315 -39718 18816 2707
24521 2707 10412 19055 14144 15187 2524 -19448 -56797 -51143 -15045 -33541 -88583 -135102 -98539
24508 -98539 -45163 -59641 -89897 -56667 -22691 6984 -46890 -70758 -74944 -24159 -19308 -47038
24496d7038r420k014N843M2043J6602j0617K6844M8503j4986p8327J6766M4116
24484C8315m1767m088Q316k8677J0577l3517l7129l551L0488J2587l8350M01R176
24471g7219J0233O601L9783P3061k0307k0312J1075L0892k0256l2851p583j9756
24459b6639K3133m925M896J0968j5238R405K8983j5979m1328q639Q207n813L7549
24446D580k1259l7134L8312J1671r712O7515L1187k6759m2743J7014J7671l2806
24434A7537m6280k6870O108K8817j5897j2604K8569m1130k1447L8108L205k4901
24422f6785J5840L2625M2842j4164o5487k7097Q805M3265N3279K2731l1455k1866
24410g467J0799o622j237K3081n107k1352k0036j6710m9837j605L0871J5210l3976
$$ plain form
24496 -47038 -56458 -58472 -52629 -10586 6016 -4601 22243 70746 55760 -22567 -5801 38315
24484 38315 -3452 -7540 776 -27901 -17324 -50841 -87970 -91521 -61033 -48446 -86796 -86395 -77219
24471 -77219 -66986 -60385 -20602 52459 32152 11840 22915 53807 33551 700 -6883 -26639
24459 -26639 -3506 -8431 -3535 7433 -7805 1600 30583 14604 -26724 -35363 -27156 -32969 4580
24446 4580 -16679 -53813 -15501 -3830 -13542 53973 85160 58401 15658 32672 50343 17537
24434 17537 -28743 -55613 -49505 -20688 -36585 -49189 -20620 -61750 -83197 -45089 -41884 -66785
24422 -66785 -50945 -18320 24522 10358 -55129 -82226 -73421 -30156 23123 45854 14399 -7467
24410 -7467 3332 -3290 -4527 18554 13447 -7905 -27941 -44651 -94488 -96093 -65222 -50012 -83988
24397h3988L934j0570n845K3394N7695N3983J3886j5540p0568n1017J3579L5213
24385c5844J3220N5076L5640l9953o6844k171O528J7244l2876j7396J5918N7042
24373E584k1860R11K4365J5399J0146L6404j5382n8346j2909j0374k203K9262
24361I97J9939l3672n4501O555L5136L7767K2700P253k4389l7492N15M4961K0012
24348D5781j06R875L6000N543l3271l2231J567j203j5467q016k3720j4823L4772
24335D701L4180L4192P218l1502J300J2334p5652j6973J2170J1968L186l8158
24323d1036k8460K6556K0954L2776L2034L5184j4329l9324q36J884M2867m738
24311F3532k6955l2310j3747L3959j2883K697p561J8440n6042n0896K2233J4195
$$ plain form
24397 -83988 -80054 -90624 -96469 -73075 -15380 38603 52489 36949 -33619 -84636 -71057 -35844
24385 -35844 -22624 32452 68092 28139 -38705 -40876 -34348 -17104 -49980 -67376 -51458 5584
24373 5584 -16276 -15365 9000 24399 34545 70949 55567 -2779 -15688 -26062 -28265 997
24361 997 20936 -12736 -67237 -60682 -25546 12221 34921 42174 17785 -19707 -19192 25769 45781
24348 45781 45675 55550 91550 97093 63822 31591 33158 31955 16488 8472 -15248 -30071 4701
24335 4701 38881 73073 80291 48789 50089 62423 -13229 -30202 -18032 -6064 -2878 -41036
24323 -41036 -69496 -42940 -21986 10790 42824 78008 63679 24355 23519 25403 68270 63532
24311 63532 36577 4267 -9480 24479 11596 14293 6732 25172 -30870 -81766 -59533 -45338
24299d5338J6130O562q613n731j0972P42K5155M5975J0058p994J435J0161K577
24286D0147j1502L3144M6874j2445k6394L8315N4051Q685l4732o0547j2671L808
24274F6733l6236l7783M1864L9812p223j1207j5137q852k4008m2096j0011q807
24262e2951n1344L1054N3329j0330q532J4331j9024l7644N2346R0264n036j0758
24250D5705o3956J8768L9382J3873m667j108N6125n3271p4378R52M2520R179J5564
24237D4688q270q929m1359k0061J3274m1696k3496P417K6789L4807j837j9208
24225c7881j1919Q431J6212K5366Q0865K7900o2732K10k3573J4170L7093J1808
24213H5950j5780q4492j3063J325k162M2550P976L1737O753q024L293m6392k1592
$$ plain form
24299 -45338 -29208 -22646 -31259 -36990 -47962 -47220 -22065 23910 33968 25974 27409 37570 40147
24286 40147 28645 61789 108663 96218 69824 108139 162190 170875 136143 75596 62925 66733
24274 66733 30497 -7286 34578 74390 67167 55960 40823 31971 7963 -34133 -44144 -52951
24262 -52951 -104295 -73241 -19912 -30242 -38774 -24443 -43467 -81111 -28765 61499 56463 45705
24250 45705 -18251 517 39899 53772 49105 47997 104122 50851 -23527 -22575 19945 29124 44688
24237 44688 36418 27489 -13870 -33931 -20657 -62353 -85849 -78432 -51643 -16836 -18673 -37881
24225 -37881 -49800 -41369 -25157 209 81074 108974 46242 46452 22879 37049 74142 85950
24213 85950 70170 -14322 -27385 -26060 -28222 14328 22304 54041 60794 52770 56063 9671 -11921
24200a1921k108O25J2319L5065M5631j2242o5498Q568K1664L5436m4491q553j2740
24187A755K2816J3873o514q22J8654l2676l7459m9297M3852k4252k4403N9330
24175a5143q900K24q083L8906K9039j647K8861J466j0126N104l8292Q407k7927
24162A889j8099Q836M2076Q267P265L1461l4027m2920l2413j3788j3630J1468
24150d3615J0038k623J1664l1275J9104M7513K774M4368K7790l4381n4010k498
24138e151j8756J5843p486J9898L6099k7350n9083P023M632P315K369k5851K1134
24125b9364j8828j8374L7342L6133K1583L8043J014m2642l4439L478l6438k0480
24113f2972J4095M4702J6337l4699n9l631N0669J3086j8743p5422j2879r330K1410
$$ plain form
24200 -11921 -14029 -13404 -1085 33980 79611 67369 1871 10439 32103 67539 23048 14495 1755
24187 1755 24571 38444 31930 31108 49762 17086 -20373 -69670 -25818 -50070 -74473 -15143
24175 -15143 -24043 -23819 -31902 7004 36043 34396 63257 64723 54597 59701 21409 29816 1889
24162 1889 -16210 -7374 34702 42969 50234 81695 47668 4748 -27665 -41453 -55083 -43615
24150 -43615 -33577 -36200 -24536 -55811 -36707 10806 13580 57948 85738 51357 -2653 -5151
24138 -5151 -23907 -8064 -15550 4348 40447 13097 -45986 -38963 -34331 -27016 -24647 -50498 -29364
24125 -29364 -48192 -66566 -29224 6909 28492 66535 67549 24907 -9532 -6054 -42492 -62972
24113 -62972 -48877 -4175 12162 -22537 -22596 -26227 24442 37528 18785 -56637 -69516 -78846 -57436
24100e7436l3686m7630j0741n909P1766M501n4291J9785P5402L3009L9101o2562
24088b8691k4504n864L0486L46k6727K2854Q43P341l2820k7531o838L3060n2020
24075a10065L555K3073J6177J4890k6817n3982J8131O3624L68l4481j4438L8597
24063f1368j625n546m177q218J1593L1681Q315M8883L9825k6160k3683j1283j1983
24050a3746J5390n4715j2960p148J488K9527K723j239k719L7734J1814p728J8675
24037A7096L9429R518l2143L9354K934j5465l824n5586q723l9083l8176O20l9339
24024a23388o477N0415P3545N6836k5220l6259K8504k4159k1871m478m630L7183
24012AM0941r772k0716j8222j6895j5669J373R838m6945J0747N7516J598k7086
$$ plain form
24100 -57436 -91122 -138752 -149493 -155402 -83636 -79135 -133426 -113641 -38239 -5230 33871 -28691
24088 -28691 -53195 -59059 -28573 -28227 -54954 -32100 -31257 -23916 -56736 -84267 -91105 -58045 -110065
24075 -110065 -106510 -83437 -67260 -52370 -79187 -133169 -115038 -51414 -51046 -85527 -99965 -61368
24063 -61368 -62993 -68539 -72716 -80934 -69341 -37660 -29345 19538 59363 33203 9520 -1763 -13746
24050 -13746 1644 -53071 -66031 -73179 -71691 -42164 -39441 -40680 -43399 -5665 6149 -1579 17096
24037 17096 56525 66043 33900 73254 76188 60723 56899 1313 -7410 -46493 -84669 -84049 -123388
24024 -123388 -129865 -79450 -5905 50931 25711 -10548 17956 -6203 -28074 -32552 -37182 1
24012 1 40942 31170 10454 -7768 -24663 -40332 -38959 -29121 -76066 -65319 -7803 -6205 -33291
23999c3291l297l7333k9815M7261L8019m25o4663R425L2427j165O193K9530P3304
23986F6170j7454k623K8461j615J232k7047l2061P564L2414j0687j1974l4816
23974b436R701k0554M2190j2594m3946J7531J1669j6594k9606J67K3844J0580
23962a0048K2893J388l0855J7252K1303j2806K129K3250M3982l8500j8862O6M870
23949B6062l7815k9357n204J5105J4607M0497k1630n109j6824l2062K3825q802
23937c6707J1953L4543l3591L9142K716j7212j9234m1995j1441M3510L8822L8566
23925D9072J5613N310l6235k5268l313q879p181m532k7502k111J3437o4190R07
23912i4872K4899K7466k8415N903q871L8087N0630j5431K0728m5356k0445r051
$$ plain form
23999 -33291 -36588 -73921 -103736 -56475 -18456 -18881 -83544 -74119 -41692 -42857 -36664 -7134 66170
23986 66170 48716 46093 74554 72939 74171 47124 15063 22627 55041 44354 32380 -2436
23974 -2436 7265 -13289 28901 16307 -27639 -10108 1561 -15033 -44639 -44472 -20628 -10048
23962 -10048 12845 14233 -16622 630 21933 9127 11256 34506 78488 39988 21126 21192 26062
23949 26062 -11753 -41110 -46314 -31209 -16602 23895 2265 -2844 -19668 -51730 -27905 -36707
23937 -36707 -24754 9789 -23802 15340 18056 844 -18390 -60385 -71826 -28316 10506 49072
23925 49072 64685 69995 33760 8492 5179 -3700 -10881 -15413 -42915 -45026 -31589 -95779 -94872
23912 -94872 -69973 -42507 -70922 -65019 -73890 -35803 14827 -604 20124 -25232 -45677 -54728
23900e4728j2722M5734P143L3744J0841p626j7959j5657L8985m629j5402m7560
23888c9836N880L126L6974j5016k2945m4789J4520N1162J8742j2943k1008o157
23876c2290j3147J8421k766J8545R328k428L3393k0063k5186k358J4638k0959
23864b4872O4732O810l114j4674p618J2962K2539n187K50k6468o3897K5066L090
23851a0381j0906k7850J9949L5308j1677m8380N849L0176L8315j8431m0637M0043
23839A378L0250L3163L6888l3407l4642p5003m2803P307M5812k568k3616n2041
23827a09282K048O0081J3340L881N3956Q190K1187L5363K4785o3503k5460K2479
23815D7065P245m7544o2991K6297N5453r913k294J9074k8617n2487P71j2993K1458
$$ plain form
23900 -54728 -67450 -21716 -14573 19171 30012 22386 4427 -11230 27755 23126 7724 -39836
23888 -39836 -33956 -30830 6144 -8872 -31817 -76606 -62086 -10924 7818 -5125 -26133 -32290
23876 -32290 -45437 -27016 -29782 -11237 -1909 -4337 29056 8993 -16193 -18551 -3913 -24872
23864 -24872 39860 46670 43556 28882 21264 34226 56765 51578 51828 25360 -38537 -13471 -10381
23851 -10381 -21287 -49137 -29188 6120 -5557 -53937 -48088 -17912 20403 1972 -38665 1378
23839 1378 31628 64791 101679 68272 33630 -41373 -84176 -76869 -31057 -33625 -57241 -109282
23827 -109282 -107234 -47153 -33813 -29932 24024 32214 53401 88764 113549 50046 24586 47065
23815 47065 54310 6766 -56225 -29928 25525 15612 13318 32392 3775 -48712 -47941 -60934 -39476
23802c9476L4681J9648J1509n8574p706j8443J2388p934L4702L6229p5648l9326
23790i7950J7210L8250j2874j828M5743L6645m891k2243n3568J5635M6856K6623
23778C3608j6624N608j1135j7926N5438J2393o5800m3429K356M8009n7616l5063
23766i0181k1786n409N8838P390J1759O953K6988J7962J0456R69l8571l9420k6590
23753h0642K6429L986O237K4884L3501j19O750n7920k1277m108j2689j144K4944
23740e1168J008j4865m4416K3496O4013L8190r589J8801m688j593n911m7252O674
23727b7300k0407J322M7419M5926J3631k756n0177q212j4883j6778Q531M9853
23715B6169J6916q043M834k0003l7525o5814j3423O6568K7827K8156J9881J4777
$$ plain form
23802 -39476 -4795 14853 26362 -32212 -39918 -58361 -45973 -53907 -19205 17024 -58624 -97950
23790 -97950 -80740 -42490 -55364 -57192 -11449 25196 20305 -1938 -55506 -39871 6985 33608
23778 33608 16984 22592 11457 -6469 48969 61362 -4438 -47867 -45511 2498 -55118 -90181
23766 -90181 -111967 -117376 -58538 -51148 -39389 -32436 -5448 12514 22970 23939 -14632 -54052 -80642
23753 -80642 -54213 -50227 -43990 -19106 14395 14276 21026 -36894 -58171 -62279 -74968 -76112 -51168
23740 -51168 -50160 -65025 -109441 -85945 -21932 16258 6669 25470 20782 19189 13278 -33974 -27300
23727 -27300 -47707 -46385 1034 46960 60591 57835 7658 -554 -15437 -32215 -23684 26169
23715 26169 43085 35042 39876 19873 -17652 -83466 -96889 -30321 -2494 25662 45543 60320
23703F0320n5251l7427J8140k881L5699l8195L6979J9672Q171K5392N0305j6672
23691A04252m0972j7896o1710J2272N5800L9730j7194j7108l7260p643j2556k4524
23679b4809l8801M0752L9963L6775l473l4215l5386J0065r25J2342J6554J1714
23667C0556j8357R050J0096P262q987j5933l2106K7338N6179M4168n7325m4694
23655G247j9449k9326L9360M8155l1324m5050J594j0994k5159l2938J8900M0264
23643c8720l947n7021j7921M8058J5489M8391j69Q677J3785M2049L8432n665l4782
23630E6656j8946J3149K0127k5551j957N276j3320n084j8441l6105j3102M0480
23618C182O53O28j9047l68j0538K7578P9359m843l257k355k3123m1100n348j700
$$ plain form
23703 60320 5069 -32358 -14218 -17099 18600 -19595 17384 37056 45227 70619 120924 104252
23691 104252 63280 45384 -16326 -4054 51746 91476 74282 57174 19914 12271 -285 -24809
23679 -24809 -63610 -22858 17105 53880 50407 16192 -19194 -9129 -10054 2288 18842 30556
23667 30556 12199 21249 31345 38607 29620 13687 -18419 8919 65098 109266 51941 7247
23655 7247 -12202 -41528 -2168 45987 14663 -30387 -28793 -39787 -64946 -97884 -78984 -38720
23643 -38720 -42667 -99688 -117609 -69551 -54062 -5671 -5840 2837 16622 58671 97103 91438 56656
23630 56656 37710 50859 70986 45435 43478 48754 35434 30350 11909 -24196 -37298 3182
23618 3182 3835 4463 -14584 -14952 -25490 2088 81447 76604 73347 70992 47869 6769 1421 -279
23604b79l8746Q434O0291L3195m3512n4856P241R252K698M7643m1516o5881J6549
23591e9487K5301L1086j14m2607k9462L575l3183k2003K0191O3942J7460Q0863
23579E5562L1364l7195l9036m0900j7002K4520J1394K0833O836J88j8510m0117
23567d2063J8304N2940P6053n470j8168m7869N530m5015k8885j6953L6031j4370
23555b9935j0333L5270q362K63P441K405J2745K2374m2844J9895l6078j7427J9821
23542b4765J4695J7671K1229n176k9097n2244l0279L0029K0450p3342j7499N2559
23530g5769M8747K202J6680K984K595j8281n999j0345J8904J3133L5550N1278
23518H1679l6689m1403J2126P165k8464l7824l5898K8043N8095L7461K3715R547
$$ plain form
23604 -279 -39025 -30591 29700 62895 19383 -35473 -28232 -18980 -16282 31361 -10155 -76036 -59487
23591 -59487 -34186 -3100 -3214 -45821 -75283 -71708 -104891 -126894 -106703 -42761 -25301 55562
23579 55562 86926 49731 10695 -30205 -47207 -22687 -11293 9540 16376 16564 -1946 -42063
23567 -42063 -23759 29181 105234 99764 81596 33727 39257 -5758 -34643 -51596 -15565 -29935
23555 -29935 -40268 -4998 -13360 -13097 -5656 -3251 9494 31868 -10976 8919 -27159 -44586 -24765
23542 -24765 -10070 7601 28830 23654 -5443 -57687 -87966 -57937 -37487 -110829 -128328 -75769
23530 -75769 -27022 -24820 -8140 -5156 -2561 -20842 -26841 -37186 -18282 -5149 30401 81679
23518 81679 44990 3587 15713 22878 -5586 -43410 -79308 -51265 6830 44291 68006 77553
23506G7553k2649j4425M60O897j6546n9224m801J3955J4694J2652j6811o518K7835
23493A3072l3051K3167K9679j3801k8859M888k2840n670J2040M599l7909l3761
23481h8446K766K6969N8483M1174j0297k0698N90J1839Q65J1824L2477o7097l2641
23468c2192k9773J3401L7146l2484J3884N890J6229N9085M838l4163k6229P6129
23456G1761N210k3003j0944J2891O649j3285j074k6299K267k4403J1189q492P799
23443A0266K5873k0438p055n8720k7220J8026L0749j5006l9924N3155j880J8060
23431a4114P5772K439j8171j7735j6785l289M3167k568k7342j8010q497k8595
23419c3728l2140J6446O4002l598n9454J5014O5821L4830l3247K067L1244L2895
$$ plain form
23506 77553 54904 40479 40939 47836 31290 -27934 -32735 -18780 -4086 8566 -8245 -14763 13072
23493 13072 -19979 3188 32867 19066 -9793 -4905 -27745 -33415 -21375 -16776 -54685 -88446
23481 -88446 -85680 -58711 -228 40946 30649 9951 10541 22380 23245 35069 67546 449 -32192
23468 -32192 -61965 -48564 -11418 -43902 -30018 -24128 -7899 51186 56024 21861 -4368 71761
23456 71761 76971 53968 43024 55915 62564 49279 48205 21906 24173 -230 10959 2467 10266
23443 10266 36139 15701 8646 -50074 -77294 -59268 -28519 -43525 -83449 -30294 -32174 -14114
23431 -14114 61658 64097 45926 28191 11406 8117 51284 48716 21374 3364 -5133 -33728
23419 -33728 -65868 -49422 14580 10982 -48472 -33458 32363 67193 33946 36013 67257 100152
23407A00152l7774p8767j4964M655j562j2500J5604K6762K4427j143m34k0583
23395C873k3799j8109o5423J910J8288O137K7028J2560N763J2052K625m8280K3042
23382d2333K7292n102J4820n255l1880j7493K4225m624J201J505j833k1051J5861
23369d4667J9234K0892L598J6507M570j976n4803l9557J7300O5677j2258j7709
23357b3192M6911K1544J5911l4961l1417L188l0104M581K4178r853L1320J4927
23345C3033l50n7842K1579M4018k880j6986R189l4257j1131K3022L8127k8863
23333A6659j8010o480K1156l7612J3315K9633L624J1138l2275l1777m3449m987
23321g9065J9170J3676L7700k5759l8573K3923L0828K3408K5548Rp7780n0357
$$ plain form
23407 100152 62378 -16389 -31353 -26698 -28260 -40760 -25156 1606 26033 24890 24456 3873
23395 3873 -19926 -38035 -103458 -101548 -83260 -77123 -50095 -37535 -31772 -19720 -17095 -65375 -42333
23382 -42333 -15041 -20143 -5323 -10578 -42458 -59951 -35726 -40350 -39149 -37644 -39477 -60528 -44667
23369 -44667 -25433 -4541 -943 15564 20134 18158 -36645 -76202 -58902 6775 -5483 -23192
23357 -23192 23719 45263 61174 26213 -5204 -2016 -32120 -27539 -3361 -13214 18106 33033
23345 33033 32683 -25159 -3580 40438 37558 20572 29761 -4496 -15627 7395 45522 16659
23333 16659 -1351 -7831 13325 -24287 -10972 18661 22285 33423 1148 -30629 -74078 -79065
23321 -79065 -59895 -46219 -8519 -34278 -72851 -48928 -18100 5308 30856 30865 -46915 -97272
23309i7272N200O9226n5212l0973P2428K7746J9528l0297l3113P16m6514l4393
23297a32930K7705O9217J7621o9881l388N4111J6948M1520M929Q233o803j5531
23285A1751l3045L7882J6064L4470P393j7316j4903K586Q136J6542n8672n3744
23273d2856l1911N3044J7922j3429P581J7186j1903J6445J382m592J0167K8859
23261D7895J7065j1671n1328R631j6514m3244j4857k3969L1789O6766R776P853
23249B9192j9054J5328L0359m5330k9903k0290l743K9593p027j595M4084J1169
23237C2783k8069M372m9403J7750L4174n1l706j600m7026J5028J8466l695o151
23224a7128L3552j7917m4198L439N797L3779j1599j7271J0111K0525J39k2787
$$ plain form
23309 -97272 -92072 -22846 -78058 -109031 -36603 -8857 10671 -19626 -52739 -52023 -98537 -132930
23297 -132930 -105225 -36008 -18387 -88268 -91656 -37545 -20597 20923 25852 34085 27282 11751
23285 11751 -21294 16588 32652 67122 74515 57199 42296 44882 53018 69560 10888 -42856
23273 -42856 -74767 -21723 -3801 -17230 -9649 7537 -4366 12079 13461 8869 19036 47895
23261 47895 64960 53289 1961 11592 -4922 -48166 -63023 -86992 -55203 11563 21339 29192
23249 29192 10138 25466 55825 10495 -19408 -39698 -43441 -13848 -20875 -22470 21614 32783
23237 32783 4714 9086 -40317 -22567 11607 11556 7850 6250 -40776 -25748 -7282 -10977 -17128
23224 -17128 16424 -1493 -45691 -42252 -36455 -2676 -14275 -31546 -21435 -910 -771 -23558
23212b3558m5304K1971N4997L3399l9685o0991K855K4380M5463L2100L9764l9956
23200D5435j3671K5821l6254R614L3082P7584n3950r754j5251k6891K3404Q000
23188F7169m1588m7444O094j1395j5909L4705K979k4250n571L0161M3477k5114
23176A3314l5386R320J1200j0500M2442K1830M4642l6204l6045j1121j1078j1112
23164h698r768N056j3038J6951j9046K7004L1032N723K9173N6612k0635j8218
23152H2148l544l0008k5053j646m9283o7868L9883P7557J7869j5205p1385j4478
23140f1013n739l1354K0948L0231Q916m397J1986n0971j7323K9538J5895J5020
23128c8263k8349j129M948j0617j5144J7371Q316N3194K4094o2736o2999J2144
$$ plain form
23212 -23558 -68862 -46891 8106 41505 1820 -59171 -56316 -31936 13527 45627 85391 45435
23200 45435 31764 57585 21331 30945 64027 141611 87661 77907 62656 35765 59169 67169
23188 67169 25581 -21863 -15769 -27164 -43073 -8368 -5389 -29639 -35210 -5049 38428 13314
23176 13314 -22072 -12752 -1552 -12052 30390 52220 96862 60658 24613 13492 2414 -8698
23164 -8698 -18466 -13410 -26448 -9497 -28543 -1539 29493 35216 64389 121001 100366 82148
23152 82148 78604 48596 23543 21897 -27386 -95254 -55371 22186 40055 24850 -46535 -61013
23140 -61013 -66752 -98106 -77158 -46927 -38011 -42408 -30422 -81393 -98716 -69178 -53283 -38263
23128 -38263 -66612 -67741 -62793 -73410 -88554 -71183 -62867 -9673 14421 -48315 -111314 -99170
23116i9170M9456J576K7719j2247l235j2530J9257q471r143n3281J1946J7276
23104g0847L4609j8032j8548P581J5159l0997m493M0861J5721P276M3090j4703
23092F677o3996j5987p37J403L8247J8025J4428J4912R700L3151L6865k8478m3921
23079B0289K4875k7706m1083k9901o99J375K2968J5136M6739Q345n4117M0740
23067B6961k2792N6j0980l9480n987N9293l7943L2959M0904j0458l5128m5663
23055d8258o4826K4329K1458K4307J1605O434L2373j141K573o766k0435r542M8106
23042B0217M4610j4687j0102j1928o34j0543J4301l5594m2289L1586K6343r874
23030A406j0656q552K6736J2755j365l7065P987N904k2003n9792k3568M4905O1369
$$ plain form
23116 -99170 -49714 -48138 -20419 -32666 -35901 -48431 -29174 -37645 -46788 -100069 -88123 -70847
23104 -70847 -36238 -54270 -72818 -65237 -50078 -81075 -85568 -44707 -28986 -21710 21380 6677
23092 6677 -57319 -73306 -74043 -72640 -34393 -16368 -1940 12972 22672 55823 92688 64210 20289
23079 20289 45164 17458 -23625 -53526 -54225 -52850 -29882 -14746 31993 40338 -13779 26961
23067 26961 4169 4225 -6755 -46235 -52222 7071 -30872 2087 42991 32533 -2595 -48258
23055 -48258 -113084 -88755 -67297 -42990 -31385 -24951 7422 6281 8854 2088 -18347 -27889 20217
23042 20217 64827 50140 40038 28110 27476 16933 31234 -4360 -46649 -15063 11280 1406
23030 1406 -9250 -17802 8934 21689 20324 -16741 -8754 -2850 -24853 -84645 -108213 -63308 -1939
23017a939K0701k4102n485L1505k4645j1332j0025N2932J5512j6936J5924j2844
23005B9266j6062O3656N515j8696r108k5284J3340j0786J5321K9295m4665p9205
22993d7413m7458N9440O5263J2276k8274J1172K1122J4146l0612n5243l8665K4259
22981c9987j2833N494K4007M0589N312J485R585j4274j5478Q121P5633L9920O075
22968A33649j01483n2881K7085j0557k702K0363Q270j1251J970L243O002m3358
22956b1650k2987j7718L0989P7973O4542l9480p1255k8352j246J1023j9561k4355
22944f2077J7817L4108J293l658K7005K6701N036L1427j0008k0773j9103k6789
22932I79J5268N666k6301m0405j9149M0083M8002o782J727m9811o3j838j6146
$$ plain form
23017 -1939 18762 -5340 -10825 20680 -3965 -15297 -25322 27610 43122 26186 42110 29266
23005 29266 13204 76860 82375 63679 54571 29287 42627 31841 47162 76457 31792 -47413
22993 -47413 -94871 -35431 29832 42108 13834 25006 46128 60274 29662 -25581 -64246 -39987
22981 -39987 -52820 -47326 -23319 17270 22582 24067 33652 19378 3900 12021 87654 127574 133649
22968 133649 32166 -20715 6370 -4187 -6889 13474 21744 10493 12463 15706 21708 -21650
22956 -21650 -44637 -62355 -31366 46607 111149 71669 414 -27938 -29184 -18161 -37722 -62077
22944 -62077 -44260 -10152 -8859 -12517 14488 41189 46225 77652 67644 46871 27768 979
22932 979 16247 21913 -4388 -44793 -63942 -23859 24143 17361 19088 -30723 -30786 -32624 -48770
22919d8770L3378K3765m3276l3145q34J090K3363j7684O599N2430k55m1665J3802
22906c1202j0629J9015J8561j516Q142K1797L1282n3420j0797O387K4861r704
22894A2777k6486K3576N0371L5722K2836p0871q3617o459O089k6808K2800K2922
22882a7148p676q891j6322J1274M5574q526L4756R948o1485l0545j1092j6904
22870g7037J2806L7816N5093P1908l0380Q818m7213j4129K419p320k086j0634
22858F1O125j7216J3807L3024M1835l1599l4605j7038K7712O007K2248m43m0651
22845I267K866r400j5503M7757J7550L5479K682j3974m4365m6376l7865M0565
22833a1317J9217m4822j6683L206j9141O6402O92K2657M6509J9458l6278j9625
$$ plain form
22919 -48770 -15392 8373 -34903 -68048 -68882 -67792 -44429 -62113 -55514 -3084 -3339 -45004 -31202
22906 -31202 -41831 -22816 -4255 -5771 2371 24168 55450 2030 -8767 -2380 22481 12777
22894 12777 -13709 9867 60238 95960 118796 47925 -35692 -42151 -36062 -62870 -40070 -17148
22882 -17148 -24824 -33715 -50037 -38763 6811 -1715 33041 42989 -18496 -49041 -60133 -77037
22870 -77037 -64231 -26415 28678 100586 70206 79024 31811 17682 20101 12781 10695 61
22858 61 6186 -11030 2777 35801 77636 46037 11432 -5606 22106 28113 50361 49918 9267
22845 9267 12133 2733 -12770 34987 52537 88016 90698 76724 32359 -14017 -51882 -11317
22833 -11317 7900 -36922 -53605 -50399 -69540 -3138 -2446 20211 66720 86178 49900 30275
22821C0275n4047k7K546j3344K7771j5972j9106M2045r431J0423j775k2628N475
22808a7795J3100K6676m4457m8713K6297Q096M709L7450j8266o692K3305K0524
22796B4234l844L7594l9450m1069M0401M3799J9825j7819m8155l1981j8085l058
22784c7608j9650K1026j8507p58M7839r710n2181N9696N8046J5887q322O400k8091
22771C4067n1307l5715j1916M1253P6102O7119P088K640k4114m4175k7446m7882
22759a4286K668j0281r433j8108m41N2465J4409j0419j1911m0303k3136j8096
22747h6872k7632l76M0718J2853k1518J9668N4823R909M0413j130j2335j319j9685
22734G517o108J499O0637N6058j3074L4554l5370k0494J4374J7745l9236j2185
$$ plain form
22821 30275 -23772 -23799 -21253 -34597 -6826 -22798 -41904 141 -9290 1133 -642 -23270 -17795
22808 -17795 -4695 21981 -22476 -71189 -44892 -36796 -32087 5363 -12903 -19595 3710 24234
22796 24234 20390 57984 18534 -22535 17866 61665 81490 63671 15516 -16465 -34550 -37608
22784 -37608 -57258 -36232 -54739 -55497 -7658 -17368 -69549 -9853 48193 64080 55758 62158 34067
22771 34067 -17240 -52955 -64871 -23618 52484 119603 126691 129331 105217 61042 33596 -14286
22759 -14286 -11618 -21899 -31332 -49440 -49881 2584 16993 6574 -5337 -45640 -68776 -86872
22747 -86872 -114504 -114880 -74162 -61309 -82827 -63159 -8336 1573 41986 40856 28521 27202 7517
22734 7517 1409 2908 63545 119603 106529 141083 105713 85219 99593 117338 78102 65917
22722F5917p573J4168L1636n115j712p0721m5346L6262n1542j8390q960J5785
22710d5591M736j5958M6786N7977j1780Q111K7707k0252r171J1216n0184l7035
22698c3438L334O4011M0950q064o8215J4825J9799p245j5404n4859O086K6009
22686a2211o134M3059M3808O585m8686n9081J9666J0761M178l078l2996k4001
22674e8130L6339M5162K4439k5100k6993R402J0340m2297p8245K922N4370K4988
22662b2803p712J4637O3365J3136q936Q81j8322r0834n7686K9910L2594j9654
22650g1424o38O454o265k572j9216r81K2664N1066K436K3209r948n6421o513M0568
22636b7581L0614n287J5164M979J7892K4257k3029j9024j0092K2327O9772k7836
$$ plain form
22722 65917 58344 72512 104148 99033 97321 26600 -18746 17516 -34026 -52416 -61376 -45591
22710 -45591 -40855 -56813 -10027 47950 36170 44281 71988 51736 42565 53781 3597 -33438
22698 -33438 -30104 33907 74857 66793 -1422 13403 33202 25957 10553 -44306 -38220 -12211
22686 -12211 -18345 24714 68522 75107 26421 -32660 -12994 -2233 1945 -1133 -34129 -58130
22674 -58130 -21791 23371 47810 22710 -4283 5119 15459 -26838 -105083 -102161 -47791 -22803
22662 -22803 -30515 -15878 47487 60623 51687 52568 34246 -56588 -114274 -84364 -51770 -71424
22650 -71424 -72062 -65608 -71873 -74445 -93661 -94642 -71978 -20912 -18476 4733 -5215 -61636 -68149 -27581
22636 -27581 3033 -2254 12910 17889 35781 60038 37009 17985 7893 30220 99992 72156
22624G2156m8953n39N3851M0822j1516l8355l2543j3936r539l2257k465p751R7232
22611F6207J155o8059k5900L0797J1852j8501Q388l230o130o1347L3289N8391
22599B6912L0798k9814o3654l942K5638K9487O112n8051m9519j3783l159N7775
22587d5200J7791l9091O7085N0999l772k7032r976J0579K7727q727k283l3851
22575D249M6542K9725m0465k327K755o620r125J9734j8030j0707K367L3836m7554
22562D380m8338j1073L1429O133j8936L2608j8586n944r688J2633p569j6820R687
22549d0084J5503L4718M2247l7184q6581l7168L2382J6504J2666Q720j2650P597
22537d3330j3508k3499J1436K8168K3869K2067J6945k8448l8170L3468M2029l2120
$$ plain form
22624 72156 23203 22664 76515 117337 105821 67466 34923 20987 11448 -20809 -23274 -31025 66207
22611 66207 67362 -697 -26597 4200 16052 -2449 5939 2709 -3421 -64768 -31479 26912
22599 26912 57710 27896 -35758 -39700 -14062 15425 21537 -36514 -86033 -99816 -102975 -45200
22587 -45200 -27409 -66500 585 51584 47812 20780 10804 21383 49110 40383 38100 4249
22575 4249 50791 80516 40051 37724 40479 33859 24734 44468 26438 15731 18098 51934 4380
22562 4380 -43958 -55031 -23602 -17469 -36405 -3797 -22383 -28327 -38015 -25382 -32951 -49771 -40084
22549 -40084 -24581 10137 52384 15200 -71381 -108549 -76167 -59663 -46997 -38277 -50927 -43330
22537 -43330 -56838 -80337 -68901 -40733 -16864 5203 22148 -6300 -44470 -11002 31027 -1093
22525a093k21k2569k5789M331K1262l0179j0196J026M8471p066m6503J4758O1596
22512G828q10O450l854l2537J112K273m4233K1936J4314k8437K3973M0647O132
22499A4794q201j0118q36K4098j1936l6766L4321M9699m6698k0234J8712J3837
22487B0672J2624n415l3968j6867j4222J5053K0750N0568J4952j7650m2342j929
22475B226J2885o347k4914J2321J5120P610j1045K0653Q63n1743m2666Q568J7235
22462c9234p220N7754M227J8529l237k5526l2814j0457k2042J79M3901J242L1994
22449A7296l169k7481l5741N394N287M7391K1677j2444K1339j634j4850k3585
22437e20l4141M711N6655L4745k539j8839P35n983J1840q594P947m665o7978L000
$$ plain form
22525 -1093 -1314 -23883 -49672 -45341 -24079 -54258 -64454 -63428 -14957 -22023 -68526 -53768 7828
22512 7828 7018 13468 9614 -22923 -21811 -19538 -63771 -41835 -27521 -55958 -31985 8662 14794
22499 14794 6593 -3525 -4361 19737 7801 -28965 5356 55055 8357 -11877 6835 20672
22487 20672 33296 27881 -6087 -22954 -37176 -22123 -1373 49195 64147 46497 4155 2226
22475 2226 15111 8764 -16150 -3829 11291 18901 7856 28509 29372 -22371 -65037 -56469 -39234
22462 -39234 -46454 11300 15527 34056 30819 5293 -27521 -37978 -60020 -59841 -15940 -14698 17296
22449 17296 14127 -13354 -49095 -43701 -38414 8977 30654 18210 39549 37915 23065 -520
22437 -520 -34661 -29950 26705 61450 58911 40072 40807 34824 46664 38070 46017 41352 -26626 -23626
22423b3626K7466k4400J05k7433K6986L4103k2842j9374m4274k9132J5635M4996
22411d1790L5841L6096M5731k452q2315j2956m8026k0644J3347K2967J5874L4647
22399c680L781j2926k6774J7060K3230r99K8217o140m0520l0350N796N0729j807
22386E617j5645J612Q378k7359K3127L9927k5663n3974L2247L8810K9050o486
22374D9641K318N913J7718k8681l3889p465J8187L2454L2577o8224j7630k7145
22362b4226l9600K132M0551O3130N180m099k2870M805j4300K852J0776L4348n236
22349E3443p2411J7126K4751m3930j9349P184N0130L8948k4884j5222J0426o318
22337A9894J4800J0342k6563l154J4800R249K1906j0852k2466m5376o1928K7158
$$ plain form
22423 -23626 3840 -20560 -20455 -47888 -20902 13201 -9641 -29015 -73289 -102421 -86786 -41790
22411 -41790 -5949 30147 75878 73426 -8889 -21845 -69871 -90515 -77168 -54201 -38327 -3680
22399 -3680 101 -12825 -39599 -22539 691 -308 27909 21769 -18751 -49101 -43305 7424 5617
22386 5617 -10028 -8416 -38 -27397 -4270 35657 9994 -43980 -11733 27077 56127 49641
22374 49641 51959 57872 75590 46909 13020 5555 23742 56196 88773 20549 2919 -24226
22362 -24226 -63826 -61694 -21143 41987 47167 43068 20198 25003 10703 13555 24331 58679 53443
22349 53443 -18968 -1842 22909 -21021 -40370 -33186 16944 55892 31008 15786 26212 19894
22337 19894 34694 45036 18473 15319 30119 39368 61274 50422 27956 -17420 -79348 -52190
22325e2190L0303L0484l2545m9278k1426p389k186M3666N5361j3202L4509Q510
22313B4617j9799o667l1392k1724M9171K6420k5597M77l07J4310l270Q2015m172
22300H4082l6356j2265p162j0813M61o961Q411L373R572k296J3549L6969l6995
22287D3569K2667j8579j6505L2260Q529l3074N804J6450n8693k2833N6938M9179
22275H5712m0885l5691m7796r928M331m9075J0939J0677J6182K833j5638L4321
22263c4018K0207N970l0647k5403j4475J3139N8999K1057k1634N204J259j8183
22251a8525j2292n877j465J0731n719L089L2760L4955L1298J8607k8452m5965
22239A3145q3971J0145K0806J5068n359k9786Q196j0696l3771j0733L7113J04604
$$ plain form
22325 -52190 -21887 8597 -23948 -73226 -94652 -102041 -104227 -60561 -5200 -18402 16107 24617
22313 24617 4818 -1849 -33241 -54965 -5794 20626 -4971 -4494 -4801 9509 6239 88254 84082
22300 84082 47726 35461 28299 17486 17947 10986 19397 22770 32342 30046 43595 80564 43569
22287 43569 66236 47657 31152 63412 71941 38867 44671 61121 2428 -20405 36533 85712
22275 85712 44827 9136 -38660 -48588 -44257 -93332 -82393 -71716 -55534 -52701 -68339 -34018
22263 -34018 -13811 -7841 -38488 -63891 -78366 -65227 -6228 14829 -6805 -1601 -342 -18525
22251 -18525 -30817 -36694 -38159 -27428 -33147 -30058 2702 37657 68955 87562 59110 13145
22239 13145 -70826 -60681 -39875 -24807 -30166 -59952 -51756 -62452 -96223 -106956 -69843 34761
22227C4761Q343n5390r949L5565j8256p033m2983k2702N5340M0308L112o7718
22215d6602K561N8787l7425J5725M1290n759k4586L2609j9511L1179J7430M42
22203F6140N646k0309K1292m8949q307k2109l1228l7584j9984L9176K1399n113
22191c9930M525J0669M6193Q069l317M5364L5428j0280l8406o1952k1277r029
22179c3943Q995N8146M113n5805J5285j3731o218K6517J7249m0444p692j2914
22167d0442j0072N8978j6188k518L8197M5682n1412m0970K4636l7794o361J3192
22155b5072k6258j9992L7789L8899N974L2540P569k1289l2547J1191j1535n6415
22143e9146j8319M6998L9098j4480l0927k1470K7548N4764j5251l2973L126L041
$$ plain form
22227 34761 43104 -12286 -22235 13330 -4926 -11959 -54942 -77644 -22304 18004 21116 -46602
22215 -46602 -44041 14746 -22679 -6954 34336 28577 3991 36600 17089 48268 65698 66140
22203 66140 71786 51477 72769 23820 15513 -6596 -37824 -75408 -95392 -56216 -34817 -39930
22191 -39930 -35405 -24736 21457 29526 26209 71573 107001 96721 58315 -3637 -24914 -33943
22179 -33943 -24948 33198 37311 -18494 -3209 -16940 -23158 3359 20608 -19836 -27528 -40442
22167 -40442 -50514 8464 -7724 -10242 27955 73637 22225 -18745 5891 -31903 -38264 -25072
22155 -25072 -51330 -71322 -33533 5366 11340 43880 51449 30160 -2387 8804 -2731 -59146
22143 -59146 -77465 -30467 8631 -5849 -36776 -58246 -30698 24066 8815 -24158 -21032 -17991
22131a7991J7171N3716k863k5021l6433j6527N1899J6076m1091p512l2137K7627
22119a3086J4314q47j8425M9885M3792J3618j8885k2292l3088J77p136j5080L6281
22106B9228K3556J4970M1661M2331J3407r4193p1917R628M7719J575p8883m1068
22094f1986l9541R494N1308N8913K1137p613k3165j16512m146P5605K7357N415
22082c734k3279k8606j914N121K2330J0773L880j9614J2475M2648j4252j1865
22070f037j6852R652k0799L7975J2171k5077q546j6019R538l029l6111M8739M5971
22057C1576m054L7380J3957n875j2534k403j7936l1828L0369K8711L1902j3858
22045H5407m0617Q404K3850r339o1574n9011j7947K027L2240N1192n672K1798
$$ plain form
22131 -17991 -820 52896 50033 25012 -11421 -27948 23951 40027 -1064 -8576 -40713 -13086
22119 -13086 1228 381 -18044 31841 75633 89251 70366 48074 14986 15163 8027 -7053 29228
22106 29228 52784 67754 109415 151746 165153 70960 -957 8671 56390 57965 -20918 -61986
22094 -61986 -101527 -92033 -40725 18188 39325 31712 8547 -107965 -112111 -36506 -9149 -3734
22082 -3734 -27013 -55619 -57533 -52412 -30082 -19309 -15429 -35043 -22568 20080 5828 -6037
22070 -6037 -22889 -13237 -34036 3939 16110 -8967 -17513 -33532 -23994 -27023 -63134 -14395 31576
22057 31576 27522 64902 78859 72984 60450 58047 40111 8283 38652 67363 99265 85407
22045 85407 44790 53194 77044 67705 6131 -52880 -70827 -68800 -36560 14632 8960 30758
22033C0758L2433p12j2305j2819l4678J694o982j8845N576l8728p451O3488K3224
22020B4653K9047J2597l7208j6389p803m8352j0843K7704K3430L4924K0837k0598
22008C1999l1030p82L9193J6863m0914j5591N674J8408L8225j0377n922j2491
21996C3255J8571M559J0325n5493j5034R63J7858k9655j249j4755l4345K0532
21984d4468L1835O0349J6170j9040K9045K3729K2989j8377k3384L5877L8002j8457
21972A34270l9023o4466l7849l8726K1088k732m426K1692N4786K7797m3717J3640
21960D2334J0664q928j3578k3643k4953k4710n501R080K3995N7142L1075o5538
21948G439r2903p988M509K0591k5726J5777L8471M7867J012l1808M463J7827k7347
$$ plain form
22033 30758 63191 62479 50174 37355 2677 4371 -2611 -21456 -15880 -54608 -62059 1429 24653
22020 24653 53700 66297 29089 12700 4897 -43455 -54298 -26594 -3164 31760 52597 31999
22008 31999 969 187 39380 56243 15329 -262 5412 23820 62045 51668 45746 33255
21996 33255 51826 56385 66710 11217 -3817 -2854 15004 -14651 -15900 -30655 -65000 -44468
21984 -44468 -12633 47716 63886 44846 73891 97620 120609 102232 78848 114725 152727 134270
21972 134270 95247 30781 -7068 -45794 -24706 -27438 -31864 -10172 44614 72411 28694 42334
21960 42334 52998 44070 30492 6849 -18104 -42814 -48315 -39235 -15240 41902 72977 7439
21948 7439 -85464 -93452 -88943 -68352 -94078 -78301 -39830 8037 9049 -22759 -18296 -469 -27816
21935b7816j7450K6875j0952l3985p246K9759P9508J5700r226k2992l1014K062
21923f777K0030j9236L0069j8430j0884n402K3575j4656J909K4084j5798l4827
21911b6343J931K022o975J6860L3412l956p309j6077J5742j051m0913J5865P118
21898i674j2202J8071l928K940K8246L0795m3152l8018K0070K0792p237r373L2446
21885B9776l524n3402K1390J9886r413K7990r704m2308p961J2914J5827k8009
21873b6538l5170k5756K0572N0281J2973J8346l3534m4174j5563k6305p544M1727
21861g0685M3265L4530K6147K5026k2782k7714J490L6929J769o036l1349l4675
21849b4085l2409K4812J6796j0383K1106K0355j7793J6119P879l7012K8845P373
$$ plain form
21935 -27816 -45266 -18391 -29343 -63328 -70574 -40815 38693 54393 45167 22175 -8839 -6777
21923 -6777 13253 -5983 24086 5656 -5228 -10630 12945 -1711 198 24282 8484 -26343
21911 -26343 -24412 -22390 -29365 -12505 20907 16951 9642 -6435 9307 8256 -32657 -16792 -9674
21898 -9674 -21876 -3805 -7733 -4793 23453 54248 11096 -26922 -6852 13940 6703 -2670 29776
21885 29776 26252 -27150 -5760 14126 4713 32703 22999 -19309 -27270 -14356 1471 -26538
21873 -26538 -61708 -87464 -66892 -16611 -3638 14708 -18826 -63000 -78563 -104868 -112412 -70685
21861 -70685 -27420 7110 33257 58283 35501 7787 9277 46206 47975 41939 10590 -24085
21849 -24085 -56494 -31682 -14886 -25269 -4163 16192 -1601 14518 22397 -14615 14230 21603
21837B1603k2265n8196l7932Q1268M8977J8169J0937l9554n1822J7655J1676j048
21825e32P562j4421q072P101n701J4408K5141k9721j7261J0358J1820l6105l5312
21812g0735O1773K2223K8350J4022J1929L8262j303j01340l6179K1718l923L5440
21800B0237K6194q384L0865j6205j3123q550j8216m5328j4280J2774M4604j4214
21788c626J078L897k106L054n282j1578q628N1352N5254j1278n5408J601L3091
21775E1421J6340K4663L756q4731o2887q641K1221O3140O7567l1540l9260l850
21763A7199q927j5280J2790M8446m4568l9591j5222L390J2868L6533M4475N497
21751E7610k8346n8844j790O9310r498M962l577L0272j6112j4218J9399O183J7238
$$ plain form
21837 21603 -662 -58858 -96790 -15522 33455 51624 62561 23007 -28815 -11160 516 -532
21825 -532 7030 -7391 -15463 -8362 -14063 345 25486 -4235 -21496 -11138 682 -35423 -70735
21812 -70735 -8962 13261 41611 55633 67562 105824 104521 3181 -32998 -11280 -15203 20237
21800 20237 46431 38047 68912 52707 39584 31034 12818 -32510 -46790 -34016 10588 -3626
21788 -3626 -2548 1349 -757 2297 -2985 -14563 -23191 28161 83415 72137 16729 18330 51421
21775 51421 67761 92424 96180 11449 -51438 -60079 -38858 24282 91849 60309 21049 17199
21763 17199 8272 -7008 5782 54228 9660 -29931 -45153 -41763 -28895 7638 52113 57610
21751 57610 29264 -29580 -31370 37940 28442 33404 29827 60099 43987 29769 49168 55351 72589
21738G2589j4329P546j7828j8626L077R603l2273l4844j1542j1713P47J492O6732
21725B0631M6879p788r642n3180k2702j1445Q972J4103p156k2669J732j7086J7790
21712d1561N0915k220n7429o692j9668L2308J4422m4823l913mN1107O9769O6602
21699A08813M0846K215k9543J5192j8056o9777j07880J774O0006Q5312j4035j06985
21687c2118O165L6907P967Q306J2944J0629m7155l9443n8050K3463M9770L4795
21675A4180k8919o460J355j799K497K0042L2227j0037q841J2650K7799r341k391
21662D2962l2997k3223M141j8936k2068q56L1189N3682M1619p842m3626J4619
21650C8664K3111l6052m9718K3890r170K507P338j0042K4916n519p08J8593K5988
$$ plain form
21738 72589 58260 65806 47978 29352 32429 42032 9759 -25085 -36627 -48340 -47593 -46101 20631
21725 20631 67510 59722 50080 -3100 -25802 -37247 -28275 -14172 -21328 -43997 -42265 -59351 -41561
21712 -41561 9354 7134 -50295 -56987 -76655 -44347 -29925 -74748 -78661 -78665 -27558 42211 108813
21699 108813 149659 151874 122331 137523 119467 49690 -58190 -56416 3590 88902 74867 -32118
21687 -32118 -25953 10954 18921 27227 40171 50800 3645 -35798 -93848 -70385 -20615 14180
21675 14180 -14739 -21199 -19844 -21643 -19146 896 33123 23086 14245 26895 54694 45353 42962
21662 42962 9965 -13258 -9117 -28053 -50121 -50977 -19788 33894 75513 67671 24045 38664
21650 38664 61775 25723 -23995 -105 -9275 -6768 570 -9472 15444 9925 9217 27810 53798
21637E3798O241k6905q950M4612L9825j5304m715J2650j3498l4554k2349J350
21625C2201n269n86K27K9989j929p1803j8354M6009K7826p422j675L5970L0507
21612I5691m7379o6189L2548K0386L585M298J362j2510n582k0063p128P935l0112
21599b3158l0788L2558P6547j1908o91j5805M715k1710m0755o418j6633p829J3061
21586d8814n5075k728K6638L4684L6982K3258L8226j7191j1931q533Q375N9842
21574H3733Q450n4058J5629L6127k6651J1759m5506k0712L5116K7954p100J5390
21562H0131L8752q9790o4085K6662l8596K8395K3731K444J8883l2718k8340N2029
21550A7498L5031j0679o8715p452N3373P0152j4366l8429n0285r808L6773J0834
$$ plain form
21637 53798 60039 33134 24184 68796 108621 93317 88602 101252 87754 53200 30851 32201
21625 32201 26932 26346 26573 56562 54633 -17170 -35524 10485 38311 30889 29214 65184 95691
21612 95691 48312 -17877 14671 35057 38642 42940 44302 31792 26210 6147 -981 6954 -23158
21599 -23158 -53946 -21388 55159 43251 42560 26755 31470 9760 -30995 -37413 -54046 -61875 -48814
21586 -48814 -103889 -106617 -79979 -45295 -8313 14945 53171 35980 24049 15516 23891 83733
21574 83733 92183 38125 53754 89881 63230 74989 29483 8771 43887 71841 64741 80131
21562 80131 118883 29093 -34992 -8330 -46926 -18531 5200 7644 26527 -6191 -34531 17498
21550 17498 52529 41850 -26865 -34317 19056 89208 74842 36413 -13872 -23680 13093 23927
21538B3927j3842J8880K4668p709m368k1070m3037K9803J4686O519J232K5769
21526E5458M3041j3577r111l5432m0456n8487m4502K069L5560M4231Q665P411
21514e130O5011L7039m3543n8118K5079M885J5586l0193r091j9896j8600L869
21502c3102L242j116j2494J6233L9088N0617L8860l3588l0022j5424k3148k098
21490b952n53N061J5436r669p034l8294j3906L4548J9771M2730k7265k5466K0316
21477A2723k6880j5324K9336J9726L3736k4966K5397J2464J760Q568j65J2738
21465H9113r262k2381j1836m4237k8569M4842m7515J1356J0855J7661R3328m3080
21453F0275j6589K6222m4470k3408k6264J8055K9399K4429Q039Q732m0775k2607
$$ plain form
21538 23927 10085 28965 53633 45924 41556 20486 -22551 7252 21938 28457 29689 55458
21526 55458 98499 84922 75811 40379 -77 -58564 -103066 -100997 -65437 -21206 -12541 -5130
21514 -5130 59881 96920 53377 -4741 20338 25223 40809 10616 1525 -18371 -36971 -33102
21502 -33102 -29860 -30976 -43470 -27237 11851 62468 101328 67740 37718 22294 -854 -2952
21490 -2952 -3505 1556 16992 7323 289 -38005 -51911 -17363 2408 45138 17873 -7593 12723
21477 12723 -14157 -29481 -145 19581 53317 28351 53748 66212 67972 76540 76375 89113
21465 89113 79851 57470 45634 1397 -27172 17670 -29845 -18489 -7634 10027 103355 60275
21453 60275 43686 69908 25438 2030 -24234 -6179 23220 47649 55688 64420 23645 1038
21441A038M2566L6049L775n4015j5054j2419L816J8902k3614j9980J5262o670
21429a0344O2660K0623l9890j85m3879l6222M1570O1053o123p0038J6652p773
21417a1896l236J7820k1587K0235q426j7539J7005J5661j0020L9254K7770O328
21405G1369k7770j5090M4030K4341Q708m7680m4611j3654l4368J755k4491j5301
21393g2762P071J5277L682J6126N0378O304l267P106L4572N253j8065p1123K9163
21380I715M0541L4701l53j6534K2241k8287p268J4371L2192K3919j3116o1321
21368E0801l4151K1596N7189r444J6087l109m3680m4095j8632j3457K2850j8084
21356a6129j8078O1782N5384j9409n2959N2028P801k4563j5882q382L046J0086
$$ plain form
21441 1038 43604 79653 83428 29413 14359 1940 5756 24658 1044 -18936 -3674 -10344
21429 -10344 52316 72939 33049 32864 -11015 -47237 -5667 55386 49263 -20775 -4123 -11896
21417 -11896 -15132 2688 -18899 1336 -7090 -24629 -7624 8037 -1983 37271 65041 71369
21405 71369 43599 28509 72539 96880 105588 57908 13297 -357 -34725 -32970 -57461 -72762
21393 -72762 -65691 -50414 -46732 -30606 19772 26076 22809 29915 64487 69740 51675 -19448 9715
21380 9715 50256 84957 84604 68070 90311 62024 54756 69127 101319 125238 112122 50801
21368 50801 16650 38246 95435 85991 102078 98969 55289 11194 -7438 -20895 1955 -16129
21356 -16129 -34207 27575 82959 63550 10591 62619 70420 45857 29975 21593 24639 34725
21344C4725L7389l3585L653o115j9180J7890K972k0703j3986k880N2230L7447
21332H9857j2771l3256k1922L1522M1985j1990K6185j3671L077J3306K3214m5559
21320H9977j9953K9837k9622j9866m047J6321l2282J9319L9599J6742o031J8291
21308A18285k2937J2083J4384O6677J34790J52140R8536J14975J28561Q6408l0462
21297H73440j43525j41577k618m1585R799M4609R1782M0520Q3128Q9006m018q9210
21285H09751j14640j27106j22156r9952l0529j7790L7269L1875N6555P0104J21978
21274F15359J68879J36261K0187p8765j14090j02721q5069m3077J6879M4302Q8790
21263F66935R6266J44242N3503j10255j76061j45205r9735q8092o1715m6502L25
$$ plain form
21344 34725 72114 38529 42182 36067 16887 34777 37749 17046 3060 180 52410 89857
21332 89857 77086 43830 21908 53430 95415 83425 109610 95939 99016 112322 135536 89977
21320 89977 70024 99861 70239 50373 46326 62647 30365 49684 89283 106025 99994 118285
21308 118285 95348 107431 121815 188492 323282 475422 573958 688933 817494 903902 873440
21297 873440 729915 588338 585720 544135 553934 598543 690325 730845 813973 902979 898961 809751
21285 809751 695111 568005 445849 345897 315368 297578 334847 366722 423277 493381 615359
21274 615359 784238 920499 940686 861921 747831 645110 560041 516964 533843 578145 666935
21263 666935 763201 907443 960946 850691 674630 529425 429690 341598 279883 233381 233706
21252B33706j4809j7065l4215r606j1665L6161J6728l4427l697l8825l0281K4277
21240A16282k1724l4482R654k3156J6368P2353M3293j0475m4060J7919m1151o5608
21228C5213N053J9207m326J5549K6867K6979j0761K750k534q577K0671J0202o6251
21215G0042q8024o2813K6311L0797K6197P20M7534L1781J4445j6513j7626j223
21203F1628m8834r764K3785M61R642K6136J9747p414p633K1972L1585j4832l302
21190A03177j0970j1873L014R580J8030k233j0404l2974m1536o714M7335m21K7958
21177I1969l065J1144J7833J9541J0219l2252m8637n5079J2367M0997j2252r158
21165D3627O095M0798k8190k0146k1115P461J4520J0097J5297l2498p222Q0583
$$ plain form
21252 233706 218897 201832 167617 158011 146346 182507 199235 164808 161111 122286 92005 116282
21240 116282 94558 60076 69730 46574 62942 135295 178588 168113 124053 141972 100821 35213
21228 35213 40266 59473 55147 70696 97563 124542 113781 116531 113997 105420 126091 136293 70042
21215 70042 -17982 -80795 -54484 -23687 2510 3230 50764 82545 96990 80477 62851 61628
21203 61628 12794 3030 26815 27276 36918 63054 82801 75387 67754 89726 121311 106479 103177
21190 103177 92207 80334 83348 92928 110958 108725 98321 65347 23811 17097 64432 64011 91969
21177 91969 88904 100048 117881 137422 147641 115389 66752 11673 24040 65037 52785 43627
21165 43627 49722 90520 62330 42184 21069 28530 43050 53147 68444 35946 28724 109307
21153A09307J7458p1641k6315p991l1644l668K4657M2122m402j6281J3991N0065
21141I5658r524l7588m606J7803j7805j0668J6936k8100L5807K2584j4719o383
21129E9395j9311L1671K2094j9664o043K4682L0594j1672l249J2367O9316k3291
21117A66889k036l6299m0843n4815L129J6520J7327l3828J545Q963m4383j7624
21105a5455m2814l1032J0826L5889O7316J5212J5926L9130J6384P774r016k6365
21093H3775J6038J9981O7847j3766l8557K0787K7857M582n9716l4087J0862r048
21081I6555o2510L5146J803R162J865n136L8443K5548K5586l264p6571k275K1984
21068A06336L9976J895L440j2303j0714J1658J9353o164K9125n57r182R922j7699
$$ plain form
21153 109307 126765 55124 28809 20818 -10826 -14494 10163 52285 47883 31602 45593 95658
21141 95658 86134 48546 43940 61743 43938 33270 50206 22106 57913 80497 65778 59395
21129 59395 40084 71755 93849 74185 68142 92824 123418 111746 108497 120864 190180 166889
21117 166889 164853 128554 87711 32896 36025 52545 69872 36044 37589 46552 2169 -15455
21105 -15455 -58269 -89301 -78475 -42586 24730 39942 55868 94998 111382 119156 110140 83775
21093 83775 99813 119794 187641 173875 135318 156105 183962 188544 128828 94741 105603 96555
21081 96555 34045 69191 70994 80156 82021 76885 115328 140876 166462 163198 86627 84352 106336
21068 106336 146312 148207 151647 139344 128630 140288 159641 153477 182602 182045 172863 182785 165086
21055A65086L854k0698k8577K7845p126J015L1635O0158J2599k0126l8983l6643
21043A50039Q184J8931K8516j9741o6335n2057K194L0146N5595K3464J3642j9496
21031A73082k2582K3895J6796m4376l6315j4091N1223K9728m0796j661K6079k4807
21019A36175J1626L1656M9750k1417m4960J8089j4735K6229k1271l9675L5739
21008A67206J9808j8799q957k6226m2402o0650O107N3022K1293Q353J8540K780
20996A40075j31m5259o059N3531L8872k2030j9002p848K3491K2450p853j0931
20984A59306p813j2480M3388J8358N1205k5500J3658L6463r1551l7235k7284m9051
20972G1464r197J5900j4631O0237P9943q901p151N6348P457L5271J5248l1286
$$ plain form
21055 165086 168940 148242 119665 147510 140384 141399 173034 233192 245791 225665 186682 150039
21043 150039 158223 177154 205670 185929 119594 67537 69731 99877 155472 178936 192578 173082
21031 173082 150500 174395 191191 146815 110500 96409 147632 177360 136564 134903 160982 136175
21019 136175 147801 179457 229207 207790 162830 180919 166184 192413 171142 131467 167206
21008 167206 187014 168215 159258 133032 90630 29980 36087 89109 110402 118755 137295 140075
20996 140075 139944 94685 88626 142157 181029 158999 139997 132149 155640 178090 170237 159306
20984 159306 151493 139013 182401 200759 251964 226464 240122 276585 185034 147799 120515 71464
20972 71464 62267 78167 63536 123773 203716 194815 187664 244012 251469 286740 301988 270702
20960B70702j5637M0196j2830n9930k663n294J2544P0993K203m0142J6602K642
20948B79386l353k9466j3392j4209L4752J3611r270l7016K553O2396K4852k2836
20936B88008j8985j1931L8953m357N128K4760m1504n870L3119L7415p845o6000
20924B70891J911k1470M968J2345l9080n7149M6852M9494O4804N0425m3138n4591
20912B86262m9797m8485j9229r157p190L9486K088L55k4306P2780J03514k9301
20900C17020j5841l456k0746j7806m744J709J9127l7752k6533R2991N4101k523
20888C55547n4859l7889p194K7373n3069k6965K4856N4923N064M52K9830n637
20876C12432N125O6594j4199k6862n1182r708L634k3597L3386P0473J4294L9336
$$ plain form
20960 270702 255065 295261 282431 222501 219838 214544 227088 298081 300284 260142 276744 279386
20948 279386 276033 246567 233175 218966 253718 267329 258059 221043 223596 285992 310844 288008
20936 288008 269023 257092 296045 291688 296816 321576 280072 274202 307321 344736 336891 270891
20924 270891 272802 251332 256300 268645 229565 172416 219268 268762 333566 383991 340853 286262
20912 286262 236465 187980 168751 159594 152404 191890 193978 194333 170027 242807 346321 317020
20900 317020 301179 297723 276977 259171 254427 256136 275263 237511 210978 303969 358070 355547
20888 355547 300688 262799 255605 282978 229909 202944 227800 282723 287787 288239 318069 312432
20876 312432 317557 384151 369952 343090 291908 282200 285834 262237 295623 366096 380390 419726
20864D19726K3064J8066l0066m1785k7818m418K5212J3226K8822o632Q568J2983
20852D38948o793J7737K4401O605K0706L5533n7989l6318L1307J6705P771Q055
20840E06668R045j4707L9844N4814J5160O465L8266j6537K2301J9638k4894o460
20828F49603L7530M1156M9510Q031j8968n8479l1608K1530J1511l2206l5793m3853
20816E97964K7985O3577N2952n520j635j2839K2008J7095K1287L6251m5150n6538
20804G17437O8927P5171J2655J4569K1249l8721K1116O9631L5469N1612M7089
20793A096204k7170j8740J9166O0242J4454R289O0230O5708K8520M9837Q2701
20782A440441O7292Q8783J31859J62140K38253K44572J92592Q5090K2398P0370
$$ plain form
20864 419726 442790 460856 430790 389005 361187 356769 381981 395207 424029 417397 425965 438948
20852 438948 432155 449892 474293 480898 501604 537137 479148 442830 474137 490842 498613 506668
20840 506668 515713 501006 540850 595664 610824 617289 655555 639018 661319 680957 656063 649603
20828 649603 687133 728289 777799 785830 766862 708383 676775 698305 709816 677610 641817 597964
20816 597964 625949 689526 742478 736958 735323 722484 744492 761587 782874 819125 773975 717437
20804 717437 786364 861535 874190 888759 910008 871287 892403 962034 997503 1049115 1096204
20793 1096204 1069034 1050294 1069460 1129702 1144156 1153445 1213675 1279383 1307903 1357740 1440441
20782 1440441 1507733 1596516 1728375 1890515 2128768 2373340 2565932 2651022 2673420 2743790
20772B743790O5587J26327J66653J34046K08329L08339L78998L47731J89954O8162
20762D737916N3193K8595J10272K34166L96176M78449M52941N36172N89269O54788
20752H271937P08633P54339R43932J188415J431682J869857K451172L204395M323551
20743B5147913O071286R073019J4117948K1809904K9983419L1930035K2407410
20736A60540934K805684j6581552k5577676k3076986j3984220m190511N264440
20729H5200113J5676652K5509405K8347758J8927075j067669k1238350l0660483
20722A20694501k8549659k0209800j2275296o762093l099812k19544K757149O698475
20714E9033921J2638441K1065834K9606471L0822060J9977510n83775j9712046
$$ plain form
20772 2743790 2809377 2935704 3102357 3236403 3444732 3753071 4132069 4479800 4669754 4737916
20762 4737916 4791109 4819704 4929976 5164142 5560318 6038767 6491708 7027880 7617149 8271937
20752 8271937 8980570 9734909 10678841 11867256 13298938 15168795 17619967 20824362 25147913
20743 25147913 31219199 40292218 54410166 76220070 106203489 138133524 160540934
20736 160540934 163346618 146765066 121187390 98110404 84126184 79935673 85200113
20729 85200113 100876765 126386170 154733928 173661003 172593334 151354984 120694501
20722 120694501 92144842 71935042 59659746 52897653 49797841 49578297 52335446 59033921
20714 59033921 71672362 92738196 122344667 153166727 173144237 172560462 152848416
20707A52848416k7588030k3848280j4073149m072374N678817J6396335K5867363
20700A31209098K7297188J6322030m584884k4199293l2613126k9765393k1535959
20693F2129661j4133998r336987o450324m676446l600096k904135k506028k201594
20685A6320053j891648j548490j177239q25768o16086o66081q60302q70762p65265
20676G098412o04075l76820j98405j07320l3014m1298j98965l88799m80161n28595
20666D140960m06535k59491j12280j17386o3990p3737l6320j15826k85182l24346
20656B345867l19973k47399j59957j00336n9610j14245j25480j03035j24747j34108
20646H56977m5564j7254o9687J1760L9082n3037r2391n1421j4338o1496n6833
$$ plain form
20707 152848416 125260386 101412106 87338957 83266583 88945400 105341735 131209098
20700 131209098 158506286 174828316 170243432 146044139 113431013 83665620 62129661
20693 62129661 47995663 38658676 32208352 27531906 23931810 21027675 18521647 16320053
20685 16320053 14428405 12879915 11702676 10876908 10260822 9594741 8734439 7863677 7098412
20676 7098412 6494337 6117517 5919112 5811792 5778778 5737480 5538515 5149716 4669555 4140960
20666 4140960 3734425 3474934 3362654 3245268 3181278 3107541 3071221 2955395 2670213 2345867
20656 2345867 2025894 1778495 1618538 1518202 1458592 1344347 1218867 1115832 991085 856977
20646 856977 811413 794159 724472 736232 775314 722277 629886 578465 564127 502631 445798
20635D45798n982J646N832K6465l3007l2118p890p0873j7354j2890j4306j9645
20623B65676j6109L3268J3077o5083j7265Q050k3301m0121k256N892K448j4055
20611A50221N837L3164L877J6510j2922k1307j2847m2524J9610j9230m7983M401
20599G6807O0558K703j8054k400k235P724J429J2771K0463q4742r951L4336M221
20586A03630m549m2929l8271r986K8305o561K908J2454J016J8947O682j5376J1947
20573F8217M7663J619L3283P354J6320k4256l0831k7817j8393k8860j1986K0779
20561E3092j2225O159k4168J1311J9024j7250N9497M4396P603m131j6803p1442
20549E5063Q375j6906o5182k5462O0827j997n711J4116K7971L2168l7358n3658
$$ plain form
20635 445798 439816 441462 447294 473759 440752 408634 400744 329871 312517 299627 285321 265676
20623 265676 249567 282835 295912 230829 213564 221614 198313 158192 155936 161828 164276 150221
20611 150221 156058 189222 193099 209609 196687 175380 162533 120009 139619 120389 72406 76807
20599 76807 137365 140068 122014 119614 117379 125103 126532 139303 159766 75024 65073 99409 103630
20586 103630 99081 56152 17881 7895 36200 29639 32547 45001 46017 64964 71646 56270 68217
20573 68217 115880 117499 150782 158136 174456 150200 119369 91552 73159 44299 32313 53092
20561 53092 40867 47026 22858 34169 53193 35943 95440 139836 147439 143308 126505 55063
20549 55063 63438 46532 -18650 -44112 16715 14718 9007 23123 51094 83262 45904 -7754
20537g754n5380J5397M0216r656j5825p77k2342m1445j9654Q34J2548P2743L5219
20524D124n3606k3081j2408k242r443K6991L438n706q126n119N0745K4423N542
20511d468J6049n954j3577L0376r232k7721k4482k1990L6835M0817J3226m7288
20499a7409J9595p873n7009Q185K5303J6858k3291l6156q877K6335M712O5839
20487A6212J5118j397P298l4156m3037M373j3900j8683J7743J950J983j7758k0308
20474h4562K5302J9313Q783R746J891M399J8120L6964n026o7578j8366L5532M9258
20461C3776O472o586j8204J3025k2207j9619j5857K9339N159K2946k1203L598
20449A0639K6232L1859K1457n0136l808l5229j2003J1881l909R662q320N932j1478
$$ plain form
20537 -7754 -63134 -47737 -7521 -17177 -33002 -33779 -56121 -97566 -117220 -116386 -103838 -31095 4124
20524 4124 -49482 -72563 -84971 -87213 -96656 -69665 -66227 -71933 -80059 -85178 -34433 -10010 -4468
20511 -4468 11581 5627 -7950 22426 13194 -14527 -39009 -60999 -24164 16653 29879 -17409
20499 -17409 2186 -5687 -62696 -54511 -29208 -12350 -35641 -71797 -80674 -54339 -49627 16212
20487 16212 31330 29933 37231 3075 -39962 -35589 -49489 -68172 -50429 -48479 -46496 -64254 -84562
20474 -84562 -59260 -39947 -31164 -21418 -19527 -15128 2992 39956 34930 -32648 -51014 -15482 33776
20461 33776 40248 33662 15458 28483 6276 -13343 -29200 139 5298 28244 7041 10639
20449 10639 36871 68730 90187 40051 36243 1014 -10989 892 -3017 6645 -1675 4257 -7221
20436g221K2818L1376K8847l7947m7255m6192R281J5084L3201j8840j5353P39
20424c1462J3995L2989L3853L0968n8956p4018J8812j1020k4372M7157M9597m1256
20412a3713o003J0944j9794j8321J206j0716n2650q705M5091O969l2308l411M3022
20399e8389l0712j7175p12j8082k6794K4225M4079Q699R944k1288L2027m7009
20387a01187l3968J2268J6820J4329K6835n2882q465L2966K2580J4055n0574j4774
20375a21997J8535m813k9492M7838k5400q760N5616N2680K2847n79o1760j8105
20363g3390L0767k7610l8259j7876l7945j5387N3979M2502J0219J7143J2191n2991
20351i6657j9481K3734K4658k3186k793j720j075M0438Q3835j5734J6740J754
$$ plain form
20436 -7221 15597 46973 75820 37873 -9382 -55574 -46293 -31209 1992 -16848 -32201 -31462
20424 -31462 -17467 15522 49375 80343 21387 -52631 -33819 -44839 -69211 -22054 27543 -13713
20412 -13713 -19716 -8772 -28566 -46887 -45681 -56397 -109047 -117752 -72661 -65692 -98000 -101411 -58389
20399 -58389 -89101 -106276 -106988 -125070 -151864 -127639 -83560 -74861 -64917 -86205 -54178 -101187
20387 -101187 -135155 -122887 -106067 -91738 -64903 -117785 -126250 -93284 -70704 -56649 -107223 -121997
20375 -121997 -103462 -108275 -137767 -89929 -115329 -124089 -68473 -15793 7054 6475 -55285 -73390
20363 -73390 -42623 -70233 -108492 -126368 -164313 -179700 -125721 -83219 -73000 -55857 -43666 -96657
20351 -96657 -116138 -92404 -67746 -90932 -93725 -95445 -96520 -56082 27753 12019 28759 30513
20339C0513m2675J0799L612j5238k0028Q122J4884k1857L5720r015P276K7038
20327B9151l4535p2401l6582j1427J7237P3390L3855r334k783Q439n3624l0796
20315h9410L8210M0653J2788n3849k764O2758j0728k2704K2672l2846l8107J7000
20303e6327N4476m451j6868k3543p461Q376K7412K0141J5261j136n8956l3657
20291g6733K0005l7097M253Q770l996R585M0117M0877J1453k256l5957m1814J3831
20278d8962P7078K2532m5595m0314m3633L5621K4617L3097l1507o2230L5023J8187
20266b6086k3893J291N0800M1655O56n1456M374M1151L945m0199m7598k0260o858
20253g2478L0062L2895o053k4805K4563J6862k4363K0343p702m0133M060L9860
$$ plain form
20339 30513 -12162 -1363 2249 -12989 -33017 -24895 -10011 -31868 3852 -5163 2113 29151
20327 29151 -5384 -77785 -114367 -125794 -108557 -35167 -1312 -10646 -13429 -4990 -58614 -89410
20315 -89410 -51200 -10547 2241 -51608 -54372 8386 -2342 -25046 -2374 -35220 -73327 -56327
20303 -56327 -1851 -6302 -23170 -46713 -54174 -45798 -18386 1755 17016 15880 -43076 -76733
20291 -76733 -56728 -93825 -89572 -80802 -84798 -75213 -35096 5781 17234 14978 -20979 -62793 -48962
20278 -48962 28116 50648 5053 -35261 -78894 -43273 -18656 14441 -17066 -79296 -44273 -26086
20266 -26086 -49979 -48688 2112 43767 44423 -7033 -2659 38492 42437 2238 -45360 -65620 -72478
20253 -72478 -42416 -9521 -15574 -40379 -15816 1046 -23317 -2974 -10676 -50809 -46749 -6889
20241f889j1575J1518l5985j8206K131k9716l0082j5069L677p995J229K7064K0767
20228h9131K4706N4093j1319n4398O29J3027K7090r360n5619j2968j0538l397
20216a27185J0709j7905M2998L8034k0852l9187L5710J2052N747K4474K7832Q176
20204F03k3854k6397M8486m820k6051k5936k15J8158k244l0758O041J2139r260
20191f4108m302K6709N552K0278J0075K8290m1736k1855O9155K9407O399j4831
20179D9033j4637K8964J6652N730J8818r636J5028P9038J31647J41004J80263
20168F41904J52246Q2712m330q5734j48748n7985m6400o9631M7758N9814J42574
20157G14180J32854M4250r7513j45135j13759r6028o1578l9177l1842K1755K2386
$$ plain form
20241 -6889 -18464 -6946 -42931 -61137 -59006 -88722 -118804 -133873 -130196 -138191 -136962 -109898 -89131
20228 -89131 -64425 -10332 -21651 -76049 -75420 -62393 -35303 -44663 -100282 -113250 -123788 -127185
20216 -127185 -116476 -134381 -91383 -53349 -74201 -113388 -77678 -65626 -59879 -35405 -7573 603
20204 603 -23251 -49648 -1162 -5982 -32033 -57969 -58184 -40026 -42270 -73028 -66987 -54848 -64108
20191 -64108 -68410 -41701 -36149 -15871 -5796 22494 -19242 -41097 28058 57465 63864 49033
20179 49033 34396 63360 80012 85742 104560 94924 109952 188990 320637 461641 641904
20168 641904 794150 876862 872532 786798 638050 580065 533665 464034 511792 571606 714180
20157 714180 847034 891284 793771 648636 534877 438849 377271 338094 306252 328007 350393
20146C50393M9840L325N8005J28456J30633J27629K6377p9456j12744o3395j58918
20135D60145p7776J8683R5319J20005J21969J06080L2824p9589j27904j81039
20125D88717j06708q8569o9379k2292j8546l8090q575j6525M687j6887k9895o974
20113G0964K0690l7155q2883k5114j6393N8390N9703J80l5156o115m0549j8643
20101e2081M858L0506R972R925L3446K4111j1690k5078m770L3610k3606k9845
20089f42o438j4993j2972J4829K7378L747K3324M96O707m9131n9021K0184N2371
20076E839J7918P057J8534m0321m9739P528m5300J7660j2229J0139N2023R767
20064a124k0709k676L8912p2217Q066k4303k2264q438K524L0046K3764O8252K0768
$$ plain form
20146 350393 400233 403558 461563 590019 720652 848281 874658 795202 682458 619063 460145
20135 460145 382369 401052 496371 616376 738345 844425 877249 797660 669756 488717
20125 488717 382009 293440 224061 201769 183223 145133 136558 120033 124720 107833 77938 70964
20113 70964 91654 54499 -28384 -53498 -69891 -11501 48202 48382 13226 7111 -33438 -52081
20101 -52081 -47223 -16717 -6745 3180 36626 60737 49047 23969 19199 52809 29203 -642
20089 -642 -7080 -22073 -35045 -20216 7162 10909 34233 34729 41436 -7695 -66716 -46532 5839
20076 5839 23757 30814 49348 9027 -40712 -33184 -78484 -60824 -73053 -62914 -10891 -1124
20064 -1124 -21833 -24509 14403 -57814 -49748 -74051 -96315 -104753 -102229 -72183 -48419 19833 40601
20051D0601J2341k9335m1312L232O947l5186k2448L2117J8677k8205k3241q726
20039g4538M947j6949K0490L2968N292K4446N900j1033j0332L3M78P162k8436
20026c9572L3043K8561K5410l654l4071o803j7267K088K4793j5916J4003K6038
20014C6653J2007j2876P405j9627K2123r717J0426l9309l6501K6450K1780J7261
20002C6075n570k3484K7917M0467O465n9662k4993M549k2492j6378j5764J888
19990e0982J7813K9499j6629j3175J689k40N5095L3849j4957j6795m1542K533
19978a3842N6635L4269j07027k6445K6590k2929R12M42j4821O194L6350M8685
19966B5013L9298K5437o8910o4912k5782m7041O189J8727Q540O4043O1102k9785
$$ plain form
20051 40601 52942 23607 -17705 -14473 -7526 -42712 -65160 -33043 -14366 -42571 -65812 -74538
20039 -74538 -69591 -86540 -66050 -33082 -27790 -3344 2556 -8477 -18809 -18776 -18298 -11136 -39572
20026 -39572 -6529 22032 47442 43788 9717 2914 -14353 -12265 12528 -3388 10615 36653
20014 36653 48660 35784 43189 23562 45685 35968 46394 7085 -29416 -2966 18814 36075
20002 36075 30505 7021 34938 75405 81870 22208 -2785 1764 -20728 -37106 -52870 -50982
19990 -50982 -33169 -3670 -20299 -33474 -31785 -32025 23070 56919 41962 25167 -16375 -13842
19978 -13842 42793 77062 -29965 -56410 -29820 -52749 -51837 -51395 -66216 -60022 -23672 25013
19966 25013 64311 89748 20838 -44074 -69856 -116897 -110708 -91981 -83441 -19398 41704 11919
19954A1919J1696M8746l7684j8113M8963k0470p0122M173J5421o213j9996J4700
19942a6980k1119j4079M2720J9684k9408l8713J5845K0171K8415O754o327j0469
19930c506M4629J2052K1404k0398k2223k5832K9231r776j9443K6044J2488m6545
19918a875R891l989l5876k093K6189L5783K7855J242l3855K7933K3279N2119j673
19905A24930l1508J9770J01874J01726R6793Q0732O9147J6994M7842K2723J5946
19894F66969q280k4465j7372l9557L3664O4377k9558m6591l8871j5984j5610m7378
19882D81344k2561o4329o3511j00457k9884k2618n9989l2392N028N4068k1316
19871A23383o66j2651K1971J2437l7778m0595k4441n3911m8289K8784k5072Q2229
$$ plain form
19954 11919 23615 72361 34677 16564 65527 45057 -25065 -20892 -5471 -11684 -31680 -16980
19942 -16980 -38099 -52178 -9458 10226 -19182 -57895 -42050 -21879 6536 13290 6963 -3506
19930 -3506 41123 53175 74579 54181 31958 6126 35357 25581 6138 32182 44670 -1875
19918 -1875 8016 4027 -31849 -33942 -7753 28030 55885 57127 23272 51205 74484 126603 124930
19905 124930 93422 113192 215066 316792 413585 494317 563464 580458 628300 651023 666969
19894 666969 658689 634224 616852 577295 610959 675336 645778 599187 560316 544332 528722 481344
19882 481344 458783 394454 330943 230486 200602 177984 117995 85603 90631 144699 123383
19871 123383 122717 110066 132037 144474 106696 66101 41660 -12251 -60540 -31756 -56828 25401
19859B5401K8302k619L6391l0480K5879N3550M6187Q9548J8237O7658O3844O9995
19847D91893J20617P5671N4148J7787m5033L548L5008l8658l1126K0771K0908
19836G25534O0562j2978m5360K5622p449l8155p3577j09714n5267p8127j25545
19825B65546p9052l0820K2545j3551o5541q773O796j1443N4744l6546j7162J8227
19813A04970K9526r735k6078k7405j6154j1612k9480j6236L7848N3571k601l4001
19801E2613j3269j1766J730j3370K37J8939K0098J0367J063j7488k5140k3128
19789H86O274P937J166K7259K1287l714J650O9669K9636j3488p936j054J1423
19776A50995P819L4125Q093L7339R3588R0545J50070J75763J61618J08328L5641
$$ plain form
19859 25401 53703 51084 87475 56995 82874 136424 182611 272159 290396 358054 421898 491893
19847 491893 612510 688181 742329 760116 715083 718631 753639 714981 683855 704626 725534
19836 725534 786096 773118 727758 753380 745931 707776 634199 524485 469218 391091 265546
19825 265546 186494 155674 178219 164668 99127 90354 97150 85707 140451 103905 86743 104970
19813 104970 134496 124761 98683 71278 55124 43512 14032 -2204 35644 89215 86614 52613
19801 52613 39344 27578 29308 15938 16175 35114 55212 65579 66642 49154 24014 886
19789 886 7160 15097 16263 43522 64809 61095 62745 132414 162050 148562 140626 139572 150995
19776 150995 158814 192939 201032 238371 331959 422504 572574 748337 909955 1018283 1053924
19765A053924N7023M8918j824k6829p2944j00388j25608o7611o3036j8436N716
19754F88905O1357J50562K12029K73688K22527Q6918j0809j23331j88909k48251
19744A124686k09906j07714j08424K8681N4765J50695K77109K94716J90667K6773
19734A722048m0102j36060j98046k84590k43829j70750j19878o5414p3654j00881
19724B88844k8527K4285p160o1879n735N6889N5523J5927N3363L6601P4329J59355
19712F61815J56564J82872K09510J66866N6907J8886m3886r1305q2388j12086
19702A123755j01958j54922j94481j53653o8162n3827p9088n3455l4426j4300
19692B15483j5013k8312m2137k75j6241m9481q907P1305K2336m7594M2085L5059
$$ plain form
19765 1053924 1110947 1159865 1158041 1131212 1058268 957880 832272 764661 701625 683189 688905
19754 688905 750262 900824 1112853 1386541 1609068 1695986 1685177 1561846 1372937 1124686
19744 1124686 914780 807066 698642 727323 782088 932783 1209892 1504608 1695275 1722048
19734 1722048 1681946 1545886 1347840 1063250 819421 648671 528793 463379 389725 288844
19724 288844 260317 284602 277442 215563 209828 266717 322240 338167 391530 428131 502460 661815
19712 661815 818379 1001251 1210761 1377627 1434534 1453420 1409534 1318229 1235841 1123755
19702 1123755 1021797 866875 672394 518741 450579 396752 317664 264209 229783 215483
19692 215483 200470 172158 130021 129746 113505 64024 55117 126422 148758 101164 143249 178308
19680A78308j4263k2053l4428n5513L867L5455r380L1750L1688p9669O074N986
19668G7822l8135K4665P2982N0108j682j4694m3011k3124l6656j919n656q568
19656E2132N8567k2410n8289K153r77L1370L2425K9603N386N613J5823l752K4111
19643A71755N280J6579J0636o737o9339j7478o169M2079N5094K8083J9138j1326
19631B37595j08334m4595L3736L5832k7995j2609M9951k9607J838q261K173m1195
19619H8529n3663R929K5860N1295N2897p162K406J4180j9783l6935L4981L538
19607A66072L8607k941k5334j8936j4632n251K1366O64M686m5285J0565J9807
19595A49388P4683L7747K9243J7106Q123j5531n1990l2034K8025Q364K0983J7652
$$ plain form
19680 178308 164045 141992 107564 52051 55918 91373 81993 113743 145431 65762 71836 77822
19668 77822 39687 64352 137334 187442 185760 171066 128055 104931 68275 66356 60700 52132
19656 52132 110699 88289 30000 32153 31176 62546 94971 124574 129960 135573 151396 147644 171755
19643 171755 177035 193614 204250 197513 128174 110696 104527 146606 201700 229783 248921 237595
19631 237595 129261 84666 118402 154234 126239 113630 163581 133974 135812 127551 129724 88529
19619 88529 34866 44795 70655 121950 174847 167685 170091 184271 164488 127553 162534 166072
19607 166072 204679 201738 176404 157468 142836 137585 158951 159615 164301 119016 129581 149388
19595 149388 224071 261818 291061 308167 316290 300759 248769 216735 244760 253124 274107 291759
19583B91759j3012J4556M6039K8304l5058n2236o7483L546J5447p60K6750L1284
19571B89136k6682j6857n0077k2040q926l1366K5347M3586Q416m1255R178M8686
19559B27146K9992m5591P458M2334M1573L2036k07L034k7471O917N9494P0856
19547D47571R9824J51543Q4647O5643N1495j6870J9797O3959J2102j1923q1389
19536H86399m4600N9678M3095m0382j7891l4209o4301J9121O5522n5614l6605
19525G80213p2048o4896o4077n0270n0179m3786k1408j4187j7318J0140K4694
19514D16878K3748k578J6437j9455L706j2396j886L8722Q900j0133P2910M0589
19502E75442l4508M1989J5752L2589M2429J4001J5348Q0770P4825N6783M0587
$$ plain form
19583 291759 278747 293303 339342 367646 332588 280352 212869 216415 231862 231102 257852 289136
19571 289136 262454 245597 195520 173480 164554 133188 158535 202121 210537 169282 178460 227146
19559 227146 257138 211547 219005 261339 302912 334948 334741 337775 310304 317221 376715 447571
19547 447571 547395 698938 783585 849228 900723 883853 903650 967609 979711 967788 886399
19536 886399 841799 901477 944572 904190 886299 852090 787789 806910 872432 816818 780213
19525 780213 708165 643269 579192 528922 478743 434957 413549 399362 382044 392184 416878
19514 416878 440626 438048 454485 435030 438736 426340 424454 463176 472076 461943 534853 575442
19502 575442 540934 582923 598675 631264 673693 687694 703042 783812 858637 915420 956007
19491I56007K0625N1499M977L8002M9155J7010n543Q423q326Q498Q2772J16899
19479A339998J05134J51950K03216J39291J00595P3822Q5074P4571L841p1583
19469B205909j11548j41020j05094j17598p5250o8802o4451o9132J4910M1476
19459A509400L8565J1686k5070n9720q7702j06759j00960r9114m9722r212m7662
19448I73730j8769n0080J512O6101N3652n4531k9525J3943j562p687l6396Q672
19436I19060r542P02O1206L095J9226J7576Q386N7219N9005O7636R0601K22479
19424A516649J89749R3773Q5526J52450K63284M11755L64157L00252K48812J51310
19414C777717J63416R0533N1018J8727k5139M8755J40308K60710L03504M19145
$$ plain form
19491 956007 976632 1028131 1033108 1071110 1120265 1137275 1131732 1140155 1131829 1140327 1223099 1339998
19479 1339998 1445132 1597082 1800298 1939589 2040184 2114006 2199080 2273651 2277492 2205909
19469 2205909 2094361 1953341 1848247 1730649 1655399 1586597 1522146 1453014 1467924 1509400
19459 1509400 1547965 1559651 1534581 1474861 1387159 1280400 1179440 1080326 1030604 1021392 973730
19448 973730 954961 904881 906393 972494 1026146 971615 942090 956033 954471 946784 910388 919060
19436 919060 909518 910220 971426 974521 993747 1011323 1019709 1076928 1135933 1203569 1294170 1516649
19424 1516649 1706398 1800171 1885697 2038147 2301431 2713186 3077343 3377595 3626407 3777717
19414 3777717 3941133 4031666 4082684 4101411 4076272 4125027 4265335 4526045 4829549 5248694
19404E248694M73894N47682P45748P13693O64038N24178N67248Q67830J307465
19395A1660470K068612L238262N253684Q870549J4759677J9668850J8415007J4475868
19387I8410979Q206410M580574M587418K800720J938266j337243n260718l822492
19379A10103914L30269L618377M748655J600176l78466M70740j258347k765611
19371A16469707p607844j4904112j8926331j9448464j4627972r023600n740384
19364B6191000l904695k769263k017847j513710j237684j047592q81519p63531
19356A2055159o11468m19682k23544p6083l9481k7598P5981J61281K40311L12233
19346A1447109N04151P16629J048478J502202K290984L735705O057555J0463517
$$ plain form
19404 5248694 5722588 6270270 7016018 7729711 8393749 8917927 9485175 10353005 11660470
19395 11660470 13729082 16967344 22221028 31091577 45851254 65520104 83935111 98410979
19387 98410979 106617389 111197963 115785381 118586101 120524367 119187124 113926406 110103914
19379 110103914 110434183 114052560 118801215 120401391 120022925 120493665 119235318 116469707
19371 116469707 108861863 93957751 75031420 55582956 40954984 31931384 26191000
19364 26191000 22286305 19517042 17499195 15985485 14747801 13700209 12818690 12055159
19356 12055159 11443691 11024009 10800465 10724382 10684901 10657303 10733284 10894565 11134876 11447109
19346 11447109 11951260 12667889 13716367 15218569 17509553 21245258 27302813 37766330
19338C7766330J7131550K1609803J9725134J5582199Q503190N419752M917372
19331A30655330K963336K538562k135990o585035n029740o30857L577645N213410
19323A30566661J556403J73173M20020j432111k753122r219109j7466012k1891420
19315G9954483k1569160j5356746r494402o159830m306654l135732k279530j780899
19307A5871530j515783j331724j219787j070470r15015q07815p06222o22532n57432
19298G124750m85970m40573l45512k30876k08511j56016j51960j40366j55328
19289D809638j63041q7776o7038q8036j28117j19604j03395j35469q0516n2470
19279C784176j11612q8448n6785m5333N1943O4460J00847J86719K83221L38300
$$ plain form
19338 37766330 54897880 76507683 96232817 111815016 120318206 125737958 130655330
19331 130655330 133618666 136157228 134021238 127436203 122406463 121775606 125353251 130566661
19323 130566661 132123064 132296237 132716257 131284146 128531024 119311915 101845903 79954483
19315 79954483 58385323 43028577 33534175 27374345 23067691 19931959 17652429 15871530
19307 15871530 14355747 13024023 11804236 10733766 9818751 9010936 8304714 7682182 7124750
19298 7124750 6638780 6198207 5852695 5621819 5413308 5257292 5105332 4964966 4809638
19289 4809638 4646597 4558821 4491783 4403747 4275630 4156026 4052631 3917162 3836646 3784176
19279 3784176 3672564 3584116 3527331 3481998 3533941 3598401 3699248 3885967 4169188 4507488
19269D507488L83682M16520M57668N18291N24643O34413Q10909J013860J279584
19260A0547058J615728K240002L209348M903574P843198J3190440K0692151K5891320
19252I0132819K6408598K3066506J9603434J7170928J1606831J640045o777997
19245A82851164j0983498j1590851j4949754k1634718k5307036k3039285j6250572
19238E9095450r491981n261424k574799l42313J878843M809035R376336J7164107
19230G4653254K8852219L9259478M4688419M3036491L3255908J7939827j952733
19223B79732863k0640395l2794167l8751942l6638133k7720282j3802045L428164
19216A12814063K0076042L2513828M0471728M2208007L6988841K4329917M835421
$$ plain form
19269 4507488 4891170 5307690 5765358 6283649 6808292 7442705 8253614 9267474 10547058
19260 10547058 12162786 14402788 17612136 22515710 30358908 43549348 64241499 90132819
19252 90132819 116541417 139607923 159211357 176382285 187989116 189629161 182851164
19245 182851164 171867666 160276815 145327061 123692343 98385307 75346022 59095450
19238 59095450 49603469 44342045 41767246 41424933 43303776 48112811 57489147 74653254
19230 74653254 103505473 142764951 187453370 230489861 263745769 281685596 279732863
19223 279732863 259092468 226298301 187546359 150908226 123187944 109385899 112814063
19216 112814063 132890105 165403933 205875661 248083668 285072509 309402426 314237847
19209C14237847j7317060l5578562m8840449m9614432m1431648k7721652j5878321
19202G7855723q553660l514010J195243P157911J6420662K9623574L9520504L8762030
19194A98467977K7988203J6958952J4683407J4167447N527560r110196k2759636
19187B45923714k7821073k9726167l2743967l4007766l0425186k2668896j4721482
19180E3809177r763469o926934n241614m079245l302714k734569k199305j852181
19172A7709146j642552j444464j267236j127075j062648r27971q81776q04552
19164H550872p01256n98682n10250m53036l69365k65077j38796n5575k2183m8441
19154E388211q2695n9148q1171n2914k82915l67209l50852l26122l27237k97877
$$ plain form
19209 314237847 296920787 261342225 212501776 162887344 121455696 93734044 77855723
19202 77855723 69302063 65788053 66983296 74141207 90561869 120185443 159705947 198467977
19194 198467977 226456180 243415132 258098539 272265986 277793546 268683350 245923714
19187 245923714 218102641 188376474 155632507 121624741 91199555 68530659 53809177
19180 53809177 44045708 37118774 31877160 27797915 24495201 21760632 19561327 17709146
19172 17709146 16066594 14622130 13354894 12227819 11165171 10237200 9355424 8550872
19164 8550872 7849616 7250934 6740684 6287648 5918283 5653206 5514410 5458835 5436652 5388211
19154 5388211 5305516 5246368 5165197 5112283 4829368 4462159 4111307 3785185 3457948 3160071
19144C160071l24743k47984j91548j08244j21412j12657j10536o9219n3382k8862
19134A791484j4360p3521p3396n9465m3298k2476q4547p6629q7494n9665q6508
19123A110125L0724K2403q721l9972l7132L3536o257k9094p242j5844k6003n9314
19111I67209j04621o8557k1157J533O013j147n8654k8721J7696p557l9796l5025
19099F27216k4630J4397K8416j3161L1513j4628n5222k4681j557P385M2400j9254
19087E98194Q471j6491k3282j9481J5436K5179k7811k590R970K523K4543N48L972
19074E99181r377J8631j1096R296L0625J5630r629L6257M9934n930j9326O444
19062G10640o006k2551l0698m7136j5680k5991l0440O154N1832J1683J7549K6503
$$ plain form
19144 3160071 2835328 2587344 2395796 2287552 2166140 2053483 1942947 1873728 1820346 1791484
19134 1791484 1777124 1703603 1630207 1570742 1527444 1504968 1420421 1343792 1256298 1196633 1110125
19123 1110125 1140849 1163252 1154531 1114559 1077427 1110963 1104706 1075612 1068370 1052526 1026523 967209
19111 967209 862588 794031 772874 774407 780420 779273 720619 691898 709594 702037 662241 627216
19099 627216 602586 616983 645399 632238 663751 649123 593901 569220 567663 575048 617448 598194
19087 598194 606665 590174 566892 547411 562847 588026 560215 557625 567595 570118 594661 595209 599181
19074 599181 589804 608435 597339 606635 637260 652890 643261 679518 729452 723522 704196 710640
19062 710640 704634 682083 651385 604249 588569 562578 532138 538292 590124 601807 619356 645859
19050F45859Q523k2843l0779m2051k8344l690J4815P357L0923m6400m9560J9291
19038E03101j6800M914J6007l0185p304m7341p594K8844J2379j5800N488l0264
19026D15445j8369o117l2900l6307l8203L5801J7290K350L9389L7409m077K825
19014D14536R651K1011Q6930M6924J04742Q3778O8274J45159J22876M1034J1967
19003A156882j0257n2865j7068K184m5537K2046M8770R3740N8362J3110m1106
18992A228261p2914r6577q4116m7475p0711q1931j0482K2263M0557o368k7552
18981G92955K8379L2972K4659J1378P6917Q4243O4703O7025R4568J27131J47583
18970A552513J69900K93084L52131K81743J71575p5571j86948j33637L9911J27351
$$ plain form
19050 645859 654382 631539 600760 558709 530365 526675 541490 548847 579770 533370 483810 503101
19038 503101 486301 491215 507222 477037 469733 422392 414798 443642 456021 440221 445709 415445
19026 415445 397076 390959 358059 321752 283549 319350 336640 338990 378379 415788 411711 414536
19014 414536 424187 445198 532128 579052 683794 767572 835846 981005 1103881 1144915 1156882
19003 1156882 1146625 1093760 1076692 1078876 1033339 1055385 1104155 1197895 1256257 1269367 1228261
18992 1228261 1155347 1058770 974654 927179 856468 774537 764055 786318 826875 820507 792955
18981 792955 821334 854306 878965 890343 967260 1051503 1116206 1183231 1277799 1404930 1552513
18970 1552513 1722413 2015497 2367628 2649371 2820946 2745375 2558427 2424790 2464701 2592052
18960B592052K43283L52904N46438P54464Q26203Q95419Q10374O28880M58863
18951H108880L11996M84718Q14605J439974K259282L045429M171457N929240R343541
18942C5909122J5673688K7744513M5910360N6193759M4601721R969278l1173905
18935B04828536n0297084m7179827k9966583j5529255o968702j036771M855383
18928E8705697J2801925K5992891M2369292M6408247K9778077o449357l8614178
18921A70992594m8924240m0219254k4377731j4058735q601675n571318l794189
18914B5445452k759488k210888j803373j258773o78432l30693l89472o82975r65643
18905A4365715j055540r55200o89564m00623p9859P1675K39989K23435J00691
$$ plain form
18960 2592052 2835335 3188239 3734677 4489141 5315344 6210763 7021137 7650017 8108880
18951 8108880 8420876 8905594 9720199 11160173 13419455 16464884 20636341 26565581 35909122
18942 35909122 51582810 79327323 125237683 181431442 226033163 236002441 204828536
18935 204828536 154531452 107351625 77385042 61855787 54887085 53850314 58705697
18928 58705697 71507622 97500513 139869805 186278052 216056129 209606772 170992594
18921 170992594 122068354 81849100 57471369 43412634 34810959 29239641 25445452
18914 25445452 22685964 20475076 18671703 17412930 16734498 16403805 16014333 15331358 14365715
18905 14365715 13310175 12354975 11665411 11264788 11184929 11256604 11496593 11720028 11820719
18896A1820719n8137j88636j90039j33458R3607M57912J021960J584808K254653
18887A6663389L361470N510692R350908J6762760K8807156L7730906L2553565
18880A50740846J1536977j7200396l3021802l3208330k2197255j1595019n236785
18873C9818236j068044K827345Q065589J6877341K9057429L4629047K5295695
18866A55502638Q02141k4912180l5142009l1204589j9835854j1489631o998666
18859B6721850m448205l118669k328451j929604j618911j401353j231016r53519
18851I692122q25684p74398q27154q15728o79827n15563m38591l60000k95472
18842D159705j63702l0194P8326J70692J04181r5733l08636l77176k42144k13775
$$ plain form
18896 11820719 11762582 11573946 11383907 11250449 11344056 11801968 12823928 14408736 16663389
18887 16663389 20024859 25535551 34886459 51649219 80456375 118187281 150740846
18880 150740846 162277823 145077427 112055625 78847295 56650040 45055021 39818236
18873 39818236 38750192 41577537 49643126 66520467 95577896 130206943 155502638
18866 155502638 156304779 131392599 96250590 65046001 45210147 33720516 26721850
18859 26721850 22273645 19154976 16826525 14896921 13278010 11876657 10645641 9692122
18851 9692122 8866438 8092040 7264886 6449158 5769331 5253768 4815177 4455177 4159705
18842 4159705 3996003 3965809 4044135 4214827 4319008 4223275 3914639 3537463 3295319 3081544
18832C081544j09199q9546j74723j73267k44856j94821q5488L6183R1394J41088
18822B278309R3526M2468j34922j79148j09464r176N0647J8051J00361J88797
18812B339449K29152Q9749k7079j44415k02604j99003j92740j49687j42146q3594
18802A517082o5594n2590r7429j17047r0659j09281n1954q6222r9823m2792o957
18791F96734m4662n2999k7682L432m0735P133M0098J2162K6032O3887P7504O7935
18779H28839J20702J09914l35j32385j30487j24397n6826J9999J2378M8245J20542
18768H16189J48557N67j4214J3425K7056J5962r0735k25480j51664j11209q7734
18757C40720k8969l4388k0383K559K6832J7726J1371j2761m3484q8641l1728J5225
$$ plain form
18832 3081544 2972345 2882799 2708076 2534809 2289953 2095132 2009644 2045827 2137221 2278309
18822 2278309 2371835 2414303 2279381 2100233 1990769 1981593 2032240 2050291 2150652 2339449
18812 2339449 2568601 2658350 2631271 2486856 2284252 2085249 1892509 1742822 1600676 1517082
18802 1517082 1451488 1398898 1301469 1184422 1093763 984482 932528 846306 746483 703691 696734
18791 696734 652072 599073 571391 574823 534088 541221 581319 593481 619513 683400 760904 828839
18779 828839 949541 1059455 1059120 926735 796248 671851 615025 635024 647402 695647 816189
18768 816189 964746 965313 951099 964524 991580 1007542 916807 691327 539663 428454 340720
18757 340720 311751 277363 256980 259539 286371 304097 315468 302707 259223 170582 138854 154079
18745A54079R608N1046q333N691K687p624O067N6618n058k498M9910j254o1413
18732B49526k6694k6175N7223J03052O4621p459R263J06646K14905K21582J41491
18721A107981J18457J40730J76034J47425M0578r2675j62777j23610j45151j39124
18711A067868j89043j72713j37051o0292o6239M057J9891j271K8536M3448J37622
18700F74813J69611J78744K56962K13893J60572J08460R342j06019j78830j84004
18690A303544j93481j87048j27079j6399J15286J94867K20444J61463R5027J04498
18680A671122J452j39061k05949k23633j91984j57084j27097j07224p3791M403
18670D51154L2818k971M8759M8228R4585M1898R3717L4537J32236J56410J8851
$$ plain form
18745 154079 163687 214733 206400 212091 214778 207154 213221 269839 264781 262283 312193 310939 249526
18732 249526 222832 196657 253880 356932 421553 414094 423357 530003 744908 966490 1107981
18721 1107981 1226438 1367168 1543202 1690627 1731205 1638530 1475753 1352143 1206992 1067868
18711 1067868 878825 706112 569061 508769 442530 446587 466478 465207 493743 537191 674813
18700 674813 844424 1023168 1280130 1494023 1654595 1763055 1772397 1666378 1487548 1303544
18690 1303544 1110063 923015 795936 779537 894823 1089690 1310134 1471597 1566624 1671122
18680 1671122 1672574 1533513 1327564 1103931 911947 754863 627766 520542 446751 451154
18670 451154 483972 481001 529760 577988 672573 714471 808188 842725 974961 1131371 1150222
18659A150222j20336q9794n6259n6244j02905j30197j17985m7204n2820p2484
18649C03994l1230j7259N336k690p506k4947p785p0730j2271j4387l4549M2247
18637A28223N7039K9885m810j5857o583j1023L1571j7326k0927j2307M5052J6809
18625B19746k4915J2647l2355k1896j119K7375j5304m9891l808k4699J9646K218
18613A07645J7894L2085l176m0458j3956R180k333J7172L9167O0605K6631o481
18601B43975L2219J2742J7836L9972J26957J52628J45170L7289o8502q8687l1071
18590F20528j5897k1328R8877Q1135l8716j54065j22046q5346q9086o4571j4767
18579A94718N668O9319l2708n2679l3210K3952K3701Q250o7570m1404J5803Q2950
$$ plain form
18659 1150222 1029886 940092 883833 827589 724684 594487 476502 429298 376478 303994
18649 303994 272764 255505 260841 258151 250645 225698 217913 147183 134912 120525 85976 128223
18637 128223 185262 215147 210337 194480 187897 176874 208445 191119 170192 157885 202937 219746
18625 219746 194831 207478 175123 153227 152108 179483 164179 114288 110480 85781 105427 107645
18613 107645 125539 157624 154448 113990 100034 109214 106881 124053 163220 223825 250456 243975
18601 243975 276194 288936 306772 346744 473701 626329 771499 808788 740286 651599 620528
18590 620528 604631 583303 682180 763315 724599 570534 448488 363142 274056 209485 194718
18579 194718 200386 269705 236997 184318 151108 175060 198761 207011 139441 98037 113840 196790
18567A96790Q2479M3335n5474m855N557m517n5544l848m758k3826j8694K1871
18555A78516L1323Q7851Q5203J23274J27098P4282Q353m8979k4581P6299J43692
18544H62331J83372J32596k6721j26767j27472j33618l9759J4671K624m5708m6570
18533F48979r3767p5543j54542q8871p0102J011M7993M1042l8388m8530K4632
18522A93914M4142k0726m5445K4483J5077k5476j4163q439K379O6498O7067l8035
18510B61276n2141n244K660n7428l5041j3727m667K9143J55059J39307J16944
18499E36141Q5551J4210q9583q3732o7291L2903R2180J8901P313n9326r4695q0705
18487C11867m4215m34n0485m8941O35n940P1339M8230n2547m6147J0347L0514
$$ plain form
18567 196790 279269 322604 267130 262275 267832 263315 207771 203923 199165 175339 156645 178516
18555 178516 209839 297690 382893 506167 633265 707547 715900 666921 642340 718639 862331
18544 862331 1045703 1178299 1151578 1024811 897339 763721 723962 738633 741257 695549 648979
18533 648979 555212 479669 325127 236256 166154 167165 215158 256200 217812 169282 193914
18522 193914 238056 217330 171885 196368 211445 185969 171806 163367 165746 232244 299311 261276
18510 261276 209135 203891 206551 149123 114082 100355 95688 124831 279890 419197 536141
18499 536141 621692 635902 546319 462587 395296 428199 520379 539280 546593 487267 392572 311867
18487 311867 267652 267218 216733 167792 168427 162487 233826 282056 229509 183362 193709 224223
18475B24223o417O875R727n4755k6943l9909j8375k7000k3240r009K8214K3453
18463H6844N7181M7729K0097r234J6601K8724k263l9923n7860n9795J4064K188
18451A04353j2553n641o881M8491K9681K2445J30P754k7188m627M6947K8912K9974
18438B61797j4730n7170K5119L0949L8316K4810n1391j9683l3135l2077M2337
18427B15142R8626L4837L7327K9198k9602J3352M4774J0991O791K296J6120j3790
18415D66062l9401J4575R6145M6116J52402K73640L43359K49706J89761L8501
18405A830866j18996j66773j11680l3391K6808J39043K63091L77115L67309L34490
18395B907882J93601L3885K6376k9109O3511J66238K41693L50929M56673O81445
$$ plain form
18475 224223 217806 224681 234408 179653 152710 112801 94426 67426 44186 35177 63391 86844
18463 86844 144025 191754 211851 202617 219218 247942 245679 205756 147896 88101 102165 104353
18451 104353 91800 86159 79278 127769 157450 179895 180025 187779 160591 155964 202911 231823 261797
18438 261797 247067 189897 215016 245965 284281 309091 257700 238017 204882 172805 215142
18427 215142 313768 348605 385932 415130 385528 398880 443654 454645 461436 463732 479852 466062
18415 466062 426661 441236 537381 583497 735899 1009539 1352898 1602604 1792365 1830866
18405 1830866 1711870 1545097 1433417 1400026 1426834 1565877 1828968 2206083 2573392 2907882
18395 2907882 3101483 3135368 3161744 3132635 3196146 3362384 3604077 3955006 4411679 5093124
18385E093124Q46691J060696J333366J746997K319183L297731N086158Q264336
18377B9048282J4095763K3917806L5279570M1265121L3990580J1092104j5972373
18370A72716853l5410224l8248389l0339225j9638056j1872934p373264m680198
18363B5154563l078726k083955j524953j210313r10343n68671j18215M00038J080572
18354A7139997J907179L197830N288449Q838769J5064945K4740689L5051218L9416319
18346A50645395L0010243O613260j9373690l6343582l7164020k8673832j8157455
18339D7556319j0846485o645778m149491k722639j966361j605761j333574j010002
18331A7276228o30946o3914N87730J389134K588211M496215P925617J4051097
$$ plain form
18385 5093124 5939815 7000511 8333877 10080874 12400057 15697788 20783946 29048282
18377 29048282 43144045 67061851 102341421 143606542 177597122 188689226 172716853
18370 172716853 137306629 99058240 68719015 49080959 37208025 29834761 25154563
18363 25154563 22075837 19991882 18466929 17256616 16346273 15777602 15659387 16059425 17139997
18354 17139997 19047176 22245006 27533455 36372224 51437169 76177858 111229076 150645395
18346 150645395 180655638 187268898 167895208 131551626 94387606 65713774 47556319
18339 47556319 36709834 30064056 25914565 23191926 21225565 19619804 18286230 17276228
18331 17276228 16645282 16581368 17169098 18558232 21146443 25642658 33568275 47619372
18323D7619372K3760673L3453406L6815447K6796287M513113j9054949l3620291
18316A20283058l3702659k5875889j6511993j0082246o345924m094714k701727
18309B0967906j907864j356132j078133q52946n98200k53315K65632R09076J763560
18300A7859584K933177M943265Q425811J4657626K4355044L3368254L5394548
18293A41937309K3610933R84054k1651928l4114375l2539555k4155966j5089822
18286C8980650r168830n839052l922928k762082k089199j719030j585363j484269
18278A0409897j296722j087421q58365o34782l81712k67279j73197n3824p0808
18269E585787k16134m36870m78524n26762m82492l72043l13486k40150k04121
$$ plain form
18323 47619372 71380045 104833451 141648898 168445185 172958298 153903349 120283058
18316 120283058 86580399 60704510 44192517 34110271 27764347 23669633 20967906
18309 20967906 19060042 17703910 16625777 15772831 15174631 14921316 15186948 16096024 17859584
18300 17859584 20792761 25736026 34161837 48819463 73174507 106542761 141937309
18293 141937309 165548242 166532296 144880368 110765993 78226438 54070472 38980650
18286 38980650 29811820 23972768 20049840 17287758 15198559 13479529 11894166 10409897
18278 10409897 9113175 8025754 7167389 6532607 6150895 5883616 5710419 5656595 5585787
18269 5585787 5369653 4932783 4454259 3927497 3445005 3072962 2759476 2519326 2315205
18260B315205j37628j05101r3322j02089j05148l7809m6176p1692m9883p5692
18250A490665j19803p2700n2745r4810n5842m5814j0303j5745j20918p5968n5620
18239G70397J3322J4516K3899j9224j2039K1853o017l5179m4648n1236k8640J837
18227F48841m6697j6854p731J1962K6345l877k8984K6150K8583J7718l6619j2837
18215F06000r416j5967n0048k8206m4269o9135j365J1380k1232J5162L0894j6693
18203D07105j8035N527J166j0293M097m8639n6361R665P87n894J4019N3387N9256
18190D15787J3806m0982K0451R279m3076J5452K8399j8785j5637m5494l1993J6304
18178C23511p603n65l2241K9744k0960N568L644K8604l5237r1754K1843O4237
$$ plain form
18260 2315205 2177577 2072476 1979154 1877065 1771917 1734108 1687932 1616240 1566357 1490665
18250 1490665 1370862 1298162 1245417 1150607 1094765 1048951 1038648 1022903 901985 826017 770397
18239 770397 783719 798235 822134 802910 790871 812724 806707 771528 726880 675644 647004 648841
18227 648841 602144 585290 577559 589521 615866 611989 583005 609155 637738 655456 618837 606000
18215 606000 596584 580617 530569 502363 458094 388959 387594 398974 377742 392904 423798 407105
18203 407105 389070 394597 395763 385470 389567 340928 284567 294232 295019 289125 303144 356531 415787
18190 415787 429593 388611 409062 418341 375265 390717 419116 400331 384694 339200 307207 323511
18178 323511 315908 315343 283102 312846 291886 297454 301098 329702 294465 202711 224554 288791
18166B88791K2803j4206M3182J6538j9516k0385k5757l8074p887j808p5766l1848
18154A36067P7089M6640j5528J4401K8442L5376J9634q563K372n4587q522K5870
18142B98691M0790M4390K7824J9579J7865R800J851L1659k3299k3622n0203k9158
18130C66167J0939P5230O7058K0128M4771J13809Q2966P7396J25794J93013K04803
18119A382074J33795J18995K19867K66932L65091N74915P62889J049721J599878
18110F474157K578318M480675Q640886J7872122L1332391K4494004q51032k3819347
18102G1202174k9326848j6074855p973729m499044k772790j820815j289788r70841
18094F473464p75507p58310p21327n72541m68064l61515k74787k21354j69388
$$ plain form
18166 288791 311594 297388 340570 357108 337592 317207 291450 253376 245489 243681 167915 136067
18154 136067 213156 259796 244268 258669 287111 322487 342121 333558 335930 281343 272821 298691
18142 298691 339481 383871 411695 431274 449139 458939 460790 492449 469150 445528 395325 366167
18130 366167 377106 452336 519394 539522 584293 698102 781068 858464 984258 1177271 1382074
18119 1382074 1515869 1634864 1854731 2121663 2486754 3061669 3824558 4874279 6474157
18110 6474157 9052475 13533150 22174036 40046158 71378549 95872553 95021521 71202174
18102 71202174 41875326 25800471 17826742 13327698 10554908 8734093 7444305 6473464
18094 6473464 5697957 4939647 4218320 3645779 3177715 2816200 2541413 2320059 2150671
18085B150671O554J9368m1424r9474j33205j13955q5450K9290N9381N7613O5142
18074A914511J09032J51562J84966R5744m3869j18491k4092J01850M35756R26841
18064C733810J490507J201365J41399p41943j001638o34744l97096k34085J32296
18055C689871Q21254J020960L35724l73910o96490l73442k84430n60950p33722
18046B844865o28243m19026k25524l5654J41327K74522J96531n8669k34210l75968
18036A479951k79163j43399q004K473p7854m5576M4430M4599P1082K8249O041
18025A122829P3092P5277J78828L74598N62181M62645N3308k25524k66690K1486
18015B432030K67008K92302L10598K67336L15137L20012L31366P55448J189565
$$ plain form
18085 2150671 2157225 2176593 2135169 2035695 1902490 1788535 1703085 1732375 1791756 1849369 1914511
18074 1914511 2023543 2175105 2360071 2455815 2411946 2293455 2269363 2371213 2806969 3733810
18064 3733810 5224317 6425682 6567081 5825138 4823500 4188756 3791660 3557575 3689871
18055 3689871 4511125 5532085 5867809 5493899 4797409 4423967 4139537 3578587 2844865
18046 2844865 2216622 1797596 1572072 1536418 1677745 1952267 2148798 2090129 1855919 1479951
18036 1479951 1200788 1057389 1049385 1051858 974004 928428 972858 1017457 1088539 1116788 1122829
18025 1122829 1195921 1271198 1450026 1824624 2386805 2849450 2902758 2677234 2410544 2432030
18015 2432030 2699038 2991340 3301938 3569274 3884411 4204423 4535789 5291237 6480802
18006F480802O56591m91160j329782j158297m06302L0332L52468Q35808Q25436
17997E795896n5276r10078j401275r84635n47999l51641k67596j57821m5615K8408
17987A102368J12043q300j10796j80379j67985j57075k5828P8484J74582P5424
17977H92538q2796j45878j10468p0962r873j0160o4344j93l5590k7432l8780k3594
17965B72468j2778m3272k43n275J5436L05J2183K2251n157m9144j4523j8037n4694
17952A19520j8308L5562O631J0876K1680L9367N850m118k0765J9274K6723j6461
17940B25831j0563j0445q2448l6899K1765o5317j4604P5839Q0574k8437m4773
17929A10523n6568N4922O0160l2985L84N1654K808J9283j2835k4878l8148j6552
$$ plain form
18006 6480802 7137393 6646233 5316451 4158154 3751852 3782184 4134652 4970460 5795896
17997 5795896 5740620 4830542 3429267 2444632 1896633 1544992 1277396 1119575 1073960 1102368
17987 1102368 1214411 1206111 1095315 914936 746951 589876 564048 642532 817114 892538
17977 892538 809742 663864 553396 482434 472561 462401 398057 397864 362274 334842 296062 272468
17965 272468 259690 216418 216175 210900 226336 226641 238824 261075 255918 206774 192251 174214 119520
17952 119520 101212 136774 143405 154281 175961 215328 221178 217060 196295 215569 242292 225831
17940 225831 215268 204823 122375 85476 107241 41924 27320 103159 183733 155296 110523
17929 110523 53955 108877 169037 136052 136436 188090 190898 210181 197346 172468 134320 117768
17917A17768J3797N923k9413j7823N2993l9861l0030q986Q823M8078M6101k6709
17905A40661l5421k5317M88m2944L188P438M5739Q4330M6740m1565p5033l6578
17893G1726M434N669k3981j1861J6143Q524R800J4164R934k5006P888Q162m1730
17880E3866k7048J0954K2102N579K1664j5126j2945M0145K7229J0092n8555m9147
17868B8810n391j2024J5140k101j1772J4346N0657l7024K3808J4513M2383Q2662
17856B04007O3892K2733j4196K9144O1189J99763K31941K01513R5869o7873j77926
17845H50056j85024j64980q3569m7740m9687o6880k4169L014K2634p65j6701l267
17833B32922l781J0414J5650R823J4764m2376K1126K9950J04156J90090K34971
$$ plain form
17917 117768 131565 137488 108075 90252 143245 103384 73354 64368 73191 121269 167370 140661
17905 140661 105240 79923 80411 37467 40655 48093 93832 178162 224902 183337 108304 71726
17893 71726 76160 81829 57848 45987 62130 70654 80454 94618 104552 79546 87434 95596 53866
17880 53866 26818 37772 59874 65453 87117 71991 59046 99191 126420 136512 77957 28810
17868 28810 23419 11395 26535 24434 12662 27008 77665 40641 64449 78962 121345 204007
17856 204007 267899 290632 276436 305580 366769 566532 798473 999986 1095855 1027982 850056
17845 850056 665032 500052 416483 368743 319056 252176 228007 231021 253655 252890 236189 232922
17833 232922 229141 239555 255205 265028 279792 237416 258542 288492 392648 582738 817709
17822H17709J89575L4004q9495j65600j84893j66191j24333q4047k3488Q910J8974
17811B31125o5339M476k571J195N837q312k3521M3266J8416j0237N6478P1692
17799C22505J48443J44204J71701J60734N0575j48017j63714j27392j51185r7532
17789C10322p7050J0173j0399l544k6525L5353l4808k2364N6410L842k6934j7452
17777A97024K5989O6594J8013M3116N0194R3763J30281J79700J59828L2825p8328
17766I18999j51274j56587j75075j19628m0569m5320p1879p495l7301m6389m6263
17755B1219j6840J6948M2105O1690r997M71M8062k3498j160K0102l9984r700N327
17742A14745n035Q403L3578J504N6975K3203r452O875N1246L0154L5343J9750
$$ plain form
17822 817709 1007284 1041288 951793 786193 601300 435109 310776 226729 203241 212151 231125
17811 231125 165786 170262 167691 168886 174723 166411 142890 186156 204572 194335 250813 322505
17799 322505 470948 615152 786853 947587 998162 850145 686431 559039 407854 310322
17789 310322 233272 243445 233046 229502 202977 238330 203522 181158 237568 241410 214476 197024
17777 197024 223013 289607 307620 350736 400930 494693 624974 804674 964502 997327 918999
17766 918999 767725 611138 436063 316435 275866 230546 158667 151172 113871 67482 21219
17755 21219 4379 21327 63432 125122 115125 115596 163658 140160 139000 159102 119118 109418 114745
17742 114745 109710 118113 151691 153195 210170 233373 223921 230796 282042 312196 347539 367289
17730C67289L1004N2107R5824L9340k3795m3502j5736j4228k6116o3572o0058
17719C38557m0156m4912k4358r918j1589l4425p490K4697j126K303L873r654m9509
17706A36293N170k1790l9914l3331L6963O4923O460m4364j9111M4253L5735J2034
17694A83321J9219j5928l7908J1616K299j7160r117L2139O632l111R446j0236
17682A71212n02j1094J3490L9218J5297L4389o1117p0843p845o97m4804k1300
17670E5404N8456N5031J1989q537l360J9760k8129k9156m978k6272l1476R412
17658G8144R044L2565j6681m5777k3416k9851m1482L0216O5349K2680k3136L113
17646F0768L241l4563l0156n539J2510L0169j1997q143K4814p319J6550l2465
$$ plain form
17730 367289 398293 450400 546224 585564 561769 518267 502531 488303 462187 398615 338557
17719 338557 298401 253489 229131 219213 207624 173199 165709 190406 189280 191583 195456 185802 136293
17706 136293 141463 119673 79759 46428 83391 148314 154774 110410 91299 135552 171287 183321
17694 183321 202540 186612 148704 160320 162619 145459 136342 168481 175113 172002 181448 171212
17682 171212 170710 159616 173106 212324 227621 262010 200893 130050 122205 121508 76704 55404
17670 55404 113860 168891 180880 172343 168983 188743 160614 131458 126480 100208 68732 78144
17658 78144 87188 119753 103072 57295 33879 4028 -37454 -7238 58111 80791 57655 60768
17646 60768 64009 29446 -710 -6249 6261 36430 24433 16290 41104 33785 50335 17870
17634A7870o8028Q422J8416L2153M0052O310l1123l4522j8908J5109N023M363
17622d863n5691L4549K9055K731N7l1035K002M9124K8683L9887K2488j8578m3286
17609E5123l6147l450M1037K164j2861J3958Q836j3938O155J102J7194k0625l2260
17596B6288o84n2520j3569J075J4618R7463J8763j3926p2930K0395K4842N0841
17584A00656n794K411j0466j2339o1790p4676L2012M7294j6158J2056J3523N172
17572C1901J3829K4861N7191L031k6483J1458l8121O870K5268K4306k9116o0069
17560D4926K208M087l6084J8404M6689M095o4206o38n9855L8311K5896j1911M7622
17547E9544K8577j158k1802N50k8970L5070P148k4365K047P644M4129M3299m177
$$ plain form
17634 17870 -50158 -41736 -23320 8833 48885 55195 24072 -10450 -29358 -14249 -9226 -4863
17622 -4863 -60554 -26005 3050 5781 5838 -25197 -23195 25929 54612 94499 116987 98409 55123
17609 55123 18976 15526 56563 58727 45866 59824 68660 54722 60877 61979 79173 58548 26288
17596 26288 25604 -26916 -40485 -39410 -24792 72671 91434 77508 4578 24973 49815 100656
17584 100656 94862 97273 86807 74468 12678 -61998 -29986 17308 1150 13206 26729 31901
17572 31901 45730 70591 127782 130813 104330 115788 77667 84537 109805 134111 104995 44926
17560 44926 47134 51221 15137 33541 80230 84325 20119 19481 -40374 -2063 23833 11922 59544
17547 59544 88121 86963 65161 65711 36741 71811 78959 54594 56641 64285 108414 151713 147536
17534A47536l0581L3164k218o7571J4581Q320m2287J203j9736k1288L0812K3113
17522G5048k0719j7545K2700J6391J7962J94o1063p0082l4876M0881L9034O2867
17510G0792L2615j9325o5507k8087j2910n8k9320o166K793k67J8090M2121J1371
17497A6142M7771r776l7418M0810k2574j4231M5717P1103m5044j8014j4150m572
17485E5764j6733j6124j1379J4608K4449O0475j2470n3358n7452K9211L9857M5405
17473A02253m9172j5083N099j1942M513L2541K4728m3915o7495m995O049O9644
17461E2225P539J7602o569k4080M1512N574k0757j0500L2146M5790l63n705R739
17448A44153K3144k5515k0596J2845k0389m2073O1975J38752R5167J47653O1796
$$ plain form
17534 147536 116955 150119 147901 80330 94911 103231 60944 62147 42411 21123 51935 75048
17522 75048 54329 36784 59484 75875 93837 94031 32968 -37114 -71990 -31109 7925 70792
17510 70792 103407 84082 18575 -9512 -22422 -22480 -51800 -57966 -55173 -55440 -37350 4771 16142
17497 16142 63913 54137 16719 57529 34955 20724 66441 137544 92500 74486 60336 55764
17485 55764 39031 22907 11528 26136 50585 111060 98590 45232 -12220 16991 56848 102253
17473 102253 53081 37998 43097 31155 35668 68209 92937 49022 -18473 -23468 -17419 52225
17461 52225 59764 77366 70797 46717 88229 93803 73046 62546 94692 140482 140119 134414 144153
17448 144153 167297 141782 121186 134031 113642 71569 133544 272296 367463 515116 576912
17437E76912m8398j56627r1227q2143n4043p1577k8494j7395N563j8512l0914
17426a6855R828O9806J1829J9943j5534j7877K4100P1k4382K2642J6786J1089
17414A11446K1913m8466q4708j1103M0897J4722Q671L6311m1347n3220L6547O1519
17402I3182M5529m3128p4416k0264j8818J1583L399Q165K8969R529k0136k7346
17390c752j0457J7396j8714M377K2930m8832m8798J8951L9270J5283J5218l004
17378a32K9873M9932J1318m0334r537L8118J5817J266l9313k3159M2318k3061
17366E3106k3153N6830L6896j8488J8670K866o472j332J4113N075O5256R3294
17354B96661K061j0200P5495J18950J13660J59178J68085K56013K65236K60802
$$ plain form
17437 576912 528514 371887 280660 198517 144474 72897 44403 27008 32571 14059 -16855
17426 -16855 -7027 62779 74608 94551 79017 61140 85240 85311 60929 83571 100357 111446
17414 111446 133359 84893 185 -10918 29979 44701 53372 89683 48336 -4884 31663 93182
17402 93182 138711 95583 21167 903 -17915 -6332 -2933 5232 34201 43730 23594 -3752
17390 -3752 -14209 3187 -15527 -11150 11780 -37052 -85850 -66899 -27629 -12346 2872 -132
17378 -132 29741 79673 90991 50657 41120 79238 95055 96321 57008 33849 76167 53106
17366 53106 29953 86783 123679 105191 123861 126727 120255 118923 133036 138111 203367 296661
17354 296661 298722 288522 364017 482967 596627 755805 923890 1179903 1445139 1705941
17344A705941J67978J43760K03207J78967J13797Q9112m7356j09498j70644j59709
17334B115555j42904j45929j99595k35474j89808j93704j52260p2704p7195j39393
17324E66589j49752o4024j9530l4481J5247j2686j6461m2869j4087L2782J1472
17313B72200J0159m2558p241K8812J8830L0737J03799P4843Q5280J52865J46368
17302H74094K09644K76019K93031L11521K50457J81471J07594J94559K83285K10672
17292C192347O7926j54925k53787k13830j17948j17158k14502k98087k86522k31979
17282A371535k30141j57400j33869j65174j60150q7872q3735l8972q6873n3728
17272A73621j2833O0686L0649j4544m8259m9679l444r872m583n5766o734K8345
$$ plain form
17344 1705941 1873919 2017679 2220886 2399853 2513650 2602762 2555406 2445908 2275264 2115555
17334 2115555 1972651 1826722 1627127 1391653 1201845 1008141 855881 783177 705982 566589
17324 566589 416837 352813 333283 298802 314049 301363 284902 242033 227946 260728 272200
17313 272200 282359 239801 232560 261372 280202 310939 414738 489581 574861 727726 874094
17302 874094 1083738 1359757 1652788 1964309 2214766 2396237 2503831 2698390 2981675 3192347
17292 3192347 3260273 3105348 2851561 2637731 2519783 2402625 2188123 1890036 1603514 1371535
17282 1371535 1141394 983994 850125 684951 524801 436929 353194 314222 227349 173621
17272 173621 160788 221474 252123 237579 189320 139641 136197 126325 121742 65976 59242 87587
17260H7587P2880k5021k7543l5205J0503k1940J6518M6246J3274l1197j4196L8195
17248A30101K464m6453m3076o0249J9330L3966p36n0064k4574L0197k304k8134
17236c9532j6950j1940M3490M5357k170M006R201J6299j0751K2576l420J9621
17224G5787L3211L6088m4664l2207l66J6968Q567n1089n0365R857L6135L3262
17212G1184l4138k4657K5547j0894j0488k962O053j1076j1451J259K3281j2388
17200I270k00j764L9760l1717J0212Q09l206K2871J9142N631N964m5050l7611
17187e889J6292j0591l5704N914J4872L1604N9023J3944K0717j1714l7681j7237
17175D3550O312n9294p295q13j1873m235N2729P6391j2321o2625j6465L795K7299
$$ plain form
17260 87587 160467 135446 107903 72698 83201 61261 77779 124025 137299 106102 91906 130101
17248 130101 132565 86112 43036 -17213 2117 36083 35347 -14717 -39291 -9094 -11398 -39532
17236 -39532 -56482 -68422 -24932 20425 18255 22261 31462 47761 37010 59586 56166 75787
17224 75787 108998 145086 100422 68215 67849 84817 93384 42295 -8070 1787 37922 71184
17212 71184 37046 12389 37936 27042 16554 13592 19645 8569 -2882 -1623 21658 9270
17200 9270 9070 7306 47066 15349 25561 26370 23164 46035 65177 70808 76772 31722 -5889
17187 -5889 10403 -188 -35892 -29978 -15106 16498 75521 89465 110182 98468 60787 43550
17175 43550 49862 -9432 -16727 -17540 -29413 -33648 19081 95472 83151 20526 4061 7856 35155
17162C5155M495k198m3207k2052r772j5523L981J6957R334M6666r071o838L3119
17149D1046o166n5823J7985N0299L4966l6830P602L094j0202P572K1582j87n2097
17136B2841l0459j6368J8091l1154n171L5176k4785K2397L1325L8028O4713J1987
17124A36621k4452l1314l3980K361M5576M875k0315l7242n6696k6300M7457K1351
17112B7942K8025J9002j5437m5151k3949L0686K6873N121n2735j0704Q773L9702
17100C8148M7750J9807J7828l9818m0398M0375M9371l3831m4793q4078n091M7182
17088A2452M2756k8787n6285K5831N5809K1146K0211K276q0895j3498K1595m4256
17076b1645M2815l614m3487K3531M4827J9702m6597L4324N8368M8052M989J223
$$ plain form
17162 35155 39650 37452 -5755 -27807 -37579 -53102 -49121 -32164 -22830 23836 14765 7927 41046
17149 41046 34880 -20943 -2958 47341 82307 45477 53079 56173 45971 53543 75125 74938 22841
17136 22841 -7618 -23986 -5895 -37049 -42220 -7044 -31829 -9432 21893 59921 124634 136621
17124 136621 112169 80855 46875 49236 94812 99687 79372 42130 -14566 -40866 6591 27942
17112 27942 55967 74969 59532 14381 -9568 21118 47991 53112 377 -10327 -1554 38148
17100 38148 85898 105705 123533 83715 43317 83692 133063 99232 54439 -29639 -34730 12452
17088 12452 55208 26421 -29864 -4033 51776 72922 93133 95409 14514 1016 22611 -21645
17076 -21645 21170 17556 -25931 -2400 42427 62129 15532 49856 108224 156276 161265 162488
17064A62488L2221j5744o712K8827M6888L3581M3540k4745j8655P874K6593r217
17052C06939k4648j3223l1632N24R012O220m5550k9760k5224p7788n5154J4067
17040C3783J3018J3444Q311j0505p99R980J2711P856L793k8302K10k0645k519
17027D0336J5204P242l615l2290m9954k5317M3119L7510K1258O3540J32491P8195
17015C27719J00915M6739m2299j31029j25228n7266k8459N3268N5273J0250j353
17004B08530K5405m4206J5031J10739K11460K86058N38118R82106J462727J039672
16994D835640R4682q14591j017687o87613m71843m39218l26135j21052j02166
16985I50017n6766J25983K19544K92179J69520p7773l53383l81837k49222j05536
$$ plain form
17064 162488 194709 178965 172253 201080 247968 281549 325089 300344 281689 289563 316156 306939
17052 306939 282291 269068 237436 237960 246972 253192 207642 177882 152658 74870 19716 33783
17040 33783 46801 60245 68556 58051 57252 67232 79943 87799 91592 63290 63500 42855 40336
17027 40336 55540 62782 59167 26877 -23077 -48394 -5275 32235 53493 117033 249524 327719
17015 327719 428634 475373 433074 302045 176817 119551 91092 144360 199633 209883 208530
17004 208530 233935 189729 204760 315499 526959 813017 1351135 2333241 3795968 4835640
16994 4835640 4930322 4115731 3098044 2410431 1938588 1499370 1173235 1052183 950017
16985 950017 893251 1019234 1238778 1530957 1700477 1622704 1269321 887484 638262 532726
16975E32726p5179k3181n3978l8819M0079l3165p3191o4824j095p149k2920n4604
16963A24700L413n235J1843M3359N2032J1327O4446J34547J92991L39276L10844
16952A283543L9882j91673k60014j65298n5072Q434P3753J68233L17127M79595
16942A698510N27611P39398R84196O24887l26730j052519j111611o29461k72983
16933A181298j60017j78774j65241j05303m7965l4158m1035R020k9876o6520p5808
16922B85621P3719J30808Q4382K1461m1520j11276q0360R255M6310J08571J87975
16911G14946K05908L03278K41847Q9223k2317j75858k60778k06862j94141j59726
16901E35520j12148o1504q6387l7854l2073m3043l0511J1824L0084k4725k1164
$$ plain form
16975 532726 457547 434366 380388 341569 381648 348483 275292 210468 209373 202224 179304 124700
16963 124700 128113 122878 134721 178080 230112 241439 305885 440432 633423 972699 1283543
16952 1283543 1323425 1131752 871738 706440 651368 659802 733555 901788 1218915 1698510
16942 1698510 2226121 2965519 3949715 4574602 4247872 3195353 2083742 1454281 1181298
16933 1181298 1021281 842507 677266 571963 523998 489840 448805 457825 427949 361429 285621
16922 285621 359340 490148 574530 595991 554471 443195 362835 372090 418400 526971 714946
16911 714946 920854 1224132 1465979 1555202 1532885 1357027 1096249 889387 695246 535520
16901 535520 423372 361868 275481 237627 205554 162511 132000 143824 173908 149183 128019
16890A28019P8686P9559P6895Q8114R2272P1796j7306p6515l4307q3618j15166
16879B88429o7640L2484L8399M4719O0016P2927Q3785J96152K21123J36036N1742
16868A158172J7104J08840J95644J90722J89914K32997J36130p97l1813n0314
16858B146599o6499n6087m1049P8482L70241Q26461J235378J355923Q72479k5642
16848F696286q13291j104937r96366q05989o04072m19922k60036j52982l5673
16839A503018J46306K25674K92719J32946j36517l29119l50397k48074j46692
16830A089864m4076k1676q071j33026j57880j05533j12993m4718j671R7546M2055
16819E99821O5553J30032J71099J95034J26399P9623J5659m8410K4633R9154K26593
$$ plain form
16890 128019 206705 286264 363159 451273 543545 615341 598035 521520 487213 403595 288429
16879 288429 220789 253273 291672 336391 396407 469334 553119 749271 970394 1106430 1158172
16868 1158172 1175276 1284116 1479760 1670482 1860396 2093393 2229523 2228726 2196913 2146599
16858 2146599 2080100 2024013 1982964 2061446 2431687 3258148 4493526 5849449 6721928 6696286
16848 6696286 5882995 4778058 3781692 2975703 2371631 1951709 1691673 1538691 1503018
16839 1503018 1649324 1874998 2167717 2300663 2164146 1835027 1484630 1236556 1089864
16830 1089864 1045788 1024112 1016041 883015 725135 619602 506609 461891 460220 557766 599821
16819 599821 665374 795406 966505 1161539 1287938 1367561 1383220 1334810 1359443 1458597 1685190
16808A685190K82390J63624m4652k79219l17139k09787m7197L8150K04161L15026
16798A790547N29058P61803R52944J022168Q30297J57706o09083j169547j171904
16789C093989q85295n20837l03710k36510j66848j42191j10877l2345o908m8526
16779F39942j42130M292O4913M4472P9273J13493n302m9606r9927j54661j21033
16768C73726o2508j1791J4325k1764p4956l1050j8679l7724p085J1491k5187L0251
16756A39049L7399q6061o0229K7338j8059J6912P0535m7068n6105o646M2297J6087
16744G5449L7054K9666k5989J0874M5215l7160m9574k9104l4316m7193j1345L0844
16732e579J0533l5678K1270L833J8527K5010k6749j5094L4461N0292M3188j506
$$ plain form
16808 1685190 1967580 2131204 2086552 1807333 1490194 1280407 1233210 1271360 1475521 1790547
16798 1790547 2319605 3081408 4034352 5056520 5886817 6044523 5435440 4265893 3093989
16789 3093989 2208694 1687857 1384147 1147637 980789 838598 727721 695376 688468 639942
16779 639942 497812 502104 567017 611489 690762 804255 798953 749347 649420 494759 373726
16768 373726 311218 299427 313752 291988 217032 185982 167303 129579 122494 133985 108798 139049
16756 139049 176448 90387 30158 57496 39437 56349 126884 79816 23711 17065 59362 75449
16744 75449 112503 142169 116180 127054 172269 135109 85535 56431 22115 -25078 -36423 -5579
16732 -5579 4954 -30724 -9454 -5621 12906 37916 11167 -3927 30534 80826 124014 122508
16720A22508n5063k8459k1837n814J1139k5608m4942K6538L3284M5871k276j7131
16708C8210n2232J5189r363l919L0674j6314l2140K2139M7001J9532m1203m6536
16696b8962Q200p848M4455o806k0783J7125P598K6054j068n8529J6636P1013J1499
16683G8584N6388j8209m6219p355l369j8783R124j6724p0708k4260L9176j2895
16671c5250M8404L1872k3372N456l8706j3778K0771N0337L7706R848o599j2407
16659G4282k9349J3526o985k7525K9547J0859J7031K7186J5637r2602m6889K0900
16647E618l3050k505l250J7059N5544O4023M8745l2430m4122j4449j2710m4189
16635D284K0091R8079O4661J9167n6447q059k2704m5655n32k5210O1561j0340
$$ plain form
16720 122508 67445 38986 17149 11335 22474 -3134 -48076 -21538 11746 57617 55341 38210
16708 38210 -14022 1167 -8196 -12115 18559 2245 -29895 -7756 39245 58777 17574 -28962
16696 -28962 -20762 -28610 15845 9039 -11744 5381 12979 39033 37965 -20564 -3928 67085 78584
16683 78584 134972 116763 70544 63189 59820 41037 50161 33437 -37271 -61531 -22355 -35250
16671 -35250 13154 45026 21654 27110 -11596 -25374 -4603 45734 83440 93288 86689 74282
16659 74282 44933 58459 51474 23949 53496 64355 81386 108572 124209 31607 -15282 5618
16647 5618 -27432 -29937 -33187 -16128 39416 103439 152184 119754 75632 61183 48473 4284
16635 4284 24375 122454 187115 206282 149835 141776 119072 73417 72885 47675 109236 98896
16623I8896k2846p371J069J8232m816o5634m9091J8929N8885r007O362m8036M61
16610c967J2988k6214N551K8062J2167J0750r697j1619m4473P012N7960K5665
16598F4185n6282o935K2897K1260L2701M0209k6971j9267M532j8395L6964K1415
16586A16313j4262j3650J2319j1433N315K2615L7289q820L895j4529m6689L6821
16574A25184k9269o4633m1572k4267M2880K1908k1473n4375K9742j8838R948J7370
16562g395L5514L4088l2700k4634J9743J8576J6829p947K341m157n5897J5818
16550A0179K4013j9873k0401N0163K7180J4421k0820l6058k1871Q641l9279O280
16538a7425M6242k6970k7127M0238L5754J6324L8607l3420m8965n828k9612j8921
$$ plain form
16623 98896 76050 68679 69748 87980 83164 17530 -31561 -12632 46253 37246 43608 -4428 -3967
16610 -3967 9021 -17193 -11642 16420 28587 39337 29640 18021 -26452 -19440 38520 64185
16598 64185 7903 968 23865 45125 77826 118035 91064 71797 76329 57934 94898 116313
16586 116313 102051 88401 100720 89287 94602 117217 154506 145686 149581 135052 88363 125184
16574 125184 95915 31282 -10290 -34557 8323 30231 8758 -45617 -15875 -34713 -24765 -7395
16562 -7395 28119 62207 29507 4873 24616 43192 60021 52074 54415 50258 -5639 10179
16550 10179 34192 14319 -6082 44081 71261 85682 64862 28804 6933 15574 -23705 -17425
16538 -17425 28817 1847 -25280 14958 50712 67036 105643 72223 23258 17430 -12182 -31103
16526c1103k3549K326R2517J1654k838J2410j4006J853K5142m3659l4222R689
16514F214L42j4196p894O629J4320m121o46K2076L588J277q996m0450J8504j9051
16500b2404k684M444j4826n4793k6708M5598P715N4382M8175j1702q990m3401
16488b5194K3368Q770J432j1113J0711j523J5077O3653K496k8412l0055k4722
16476D488k0446N4828k4911k1854j5302L4405N8553J3715L4155J4802m1667p1892
16464A8874R317j1372l3259N696j4555q984K9090K0958k3159k659m0953M7490
16452c516K7635m9026k6900p1499L9452M0321N686M0800m550K9547n701m2114
16440a9865M852L5205L445K5108K2092o2515n447M1338R955k4434K6220L2870
$$ plain form
16526 -31103 -54652 -52326 40191 51845 49007 61417 47411 49264 74406 30747 -3475 6214
16514 6214 6556 -7640 -15534 -8905 5415 1294 648 22724 26312 27589 18593 -21857 -3353 -22404
16500 -22404 -25088 -20644 -35470 -90263 -116971 -71373 -63658 -9276 38899 27197 18207 -25194
16488 -25194 -1826 6944 8376 -2737 7974 6451 21528 85181 87677 59265 29210 4488
16476 4488 -15958 38870 13959 -7895 -23197 11208 69761 83476 117631 132433 90766 18874
16464 18874 28191 16819 -16440 -10744 -25299 -34283 -5193 15765 -7394 -10053 -51006 -3516
16452 -3516 24119 -24907 -51807 -123306 -83854 -43533 -37847 2953 -1597 27950 22249 -19865
16440 -19865 -15013 20192 23637 48745 70837 8322 2875 44213 54168 29734 55954 88824
16428H8824L0192o235q6308l5676N141M1491l4693o051N9429n824l9939l1613
16416b1262J5966j7781J223K5335Q1592R999o0673p710n8335m2309q226L0319
16404e1862N0879N5592j7818m2262m1192J889l0229R695L3956j5127J9225r507
16392c6761j3364l2202j8834K3866L9035K8410j028k6737j5087j3979K9672l9702
16380g6711j2982M9481L2409N007j7602j4442L7609J7699r458l3145m159n4896
16368h1190N5631j923k7865r611J8562r960J5659L0961k045K1258L2414L8339
16356H0230j2243j8135M4493L2637j2851n1248j4740j3865q5275m0902j3715L4813
16344g0801J6184l5397P003M6749J77j5179R935J3996k5915p900j7493J5236O688
$$ plain form
16428 88824 119016 112781 26473 -9203 -4062 37429 2736 -3315 56114 50290 10351 -21262
16416 -21262 -5296 -23077 -21854 3481 85073 95072 34399 26689 -31646 -73955 -82181 -51862
16404 -51862 -983 54609 36791 -5471 -46663 -44774 -75003 -65308 -31352 -46479 -27254 -36761
16392 -36761 -50125 -82327 -101161 -77295 -38260 -9850 -10878 -37615 -52702 -66681 -37009 -76711
16380 -76711 -89693 -40212 -7803 -2796 -20398 -34840 2769 20468 11010 -22135 -26294 -81190
16368 -81190 -25559 -27482 -55347 -64958 -46396 -56356 -40697 -9736 -11781 9477 41891 80230
16356 80230 67987 49852 94345 126982 114131 62883 48143 34278 -50997 -91899 -105614 -70801
16344 -70801 -54617 -90014 -83011 -36262 -36085 -51264 -41329 -27333 -53248 -61148 -78641 -63405 -56717
16331e6717k6995P290K7534R397J3278J3234m1490K2897R740L5228M0541K5620
16319G9557j0244k753k2641m8616M936K5483j6912J7898o162m1366l0630K0356
16307c1094K9788l702K3546j4548n3724j248J1714k7581K7026n104K4506O129
16295a4292J3974m1036m64L7847N3872P948j4587J8163O98j3894K257R362n4968
16282D880k23O655R110N0073k9502p783K639J137k0699k1668M391j1553J2785
16269B42M404k0245j0742m1609K0470K1847j529M5170k0760J6671K2970j9181
16257A7708j0728m1838r9419m0931N2772L4142M983M531J2614J2828L549J3835
16245c5954K1978O091M5385j3661P830p034j8936j3476L2732L1475k1531J6620
$$ plain form
16331 -56717 -83712 -76422 -48888 -39491 -26213 -12979 -54469 -31572 -21832 13396 53937 79557
16319 79557 69313 66560 43919 -4697 239 25722 8810 26708 20546 -20820 -51450 -31094
16307 -31094 -1306 -5008 18538 3990 -49734 -50982 -39268 -66849 -39823 -44927 -20421 -14292
16295 -14292 -318 -41354 -41818 -3971 49901 57849 43262 61425 62123 48229 50486 59848 4880
16282 4880 4657 11312 20422 70495 40993 33210 35849 36986 16287 -5381 -990 -12543 242
16269 242 4646 -15599 -26341 -67950 -47480 -25633 -27162 18008 -2752 13919 36889 17708
16257 17708 6980 -34858 -134277 -175208 -122436 -88294 -83311 -78780 -66166 -53338 -49789 -35954
16245 -35954 -13976 -7885 37500 23839 31669 24635 5699 -7777 24955 56430 34899 51519
16233E1519J9787K7387m1670m1529l2071N2833M2506p1081l5155j2799N0695K5108
16221C5530j2582m9019m3789J251j9822k6392L241K096O8153L8651n199K715j8305
16208b3471N8457M3731l1510j2082m5806N145l4580n078N7366q740O23k6790n2254
16195g4989K1814j0573m375n357O1583M613j0525j0321J9953P1198M0930J4900
16183A18851k7963m5335j3820j687k6410k1868j8242J7980Q549q950k7988l6754
16171h3637N585J0525L0803J0207k2397m076N846K9925l206k8492J3109P059P622
16158b1127K2710K6398O68m7892J1973K6834l1851k2572M6310O6716l2003j6691
16146B9473j60j4133l4586n0979J1056L6482J3766L6576J5410K6163K8240k5498
$$ plain form
16233 51519 71306 98693 57023 15494 -16577 36256 78762 7681 -27474 -40273 10422 35530
16221 35530 22948 -26071 -69860 -68609 -88431 -114823 -111582 -109486 -41333 -2682 -7881 -5166 -23471
16208 -23471 34986 78717 47207 35125 -10681 -5536 -40116 -45194 12172 3432 4055 -22735 -74989
16195 -74989 -53175 -63748 -68123 -73480 -11897 -7284 -17809 -28130 -8177 63021 103951 118851
16183 118851 90888 45553 31733 30046 3636 -18232 -36474 -18494 -9945 -18895 -46883 -83637
16171 -83637 -78052 -67527 -36724 -26517 -48914 -52990 -47144 -17219 -20425 -48917 -35808 -28749 -21127
16158 -21127 1583 27981 28649 -19243 -7270 19564 -12287 -34859 11451 78167 46164 29473
16146 29473 29313 15180 -19406 -70385 -59329 -22847 -9081 27495 42905 69068 97308 71810
16134G1810n9733l0258J0690l712m9374l1059M7671L8699M9623J1904K7472k2937
16122F0796q1439n9629O207J8285k4268k3022k313n20K1834N3267J1689j764k3426
16109d4303K0932K218l1389l6391N7164K7130k917K5818R262j3548k5143L5553
16097B4386P520K7026K9434K8885k8897m7151o5077l8829O01K7991m316K9077
16085i350L3976J0900m4603M986N3442r103j5775N677J0538n1382j3487J6511
16073g670M5203K4558l9097m4043k0635K2227R885o916k2995k8417J2703k1902
16061g7099K0743M8454K7393K2592K3368n769Q392M1800K090m7808j12276n3747
16049a01867K5826k769o013M5603o074j9788L800K6351K1088J1870k2949j6365
$$ plain form
16134 71810 12077 -18181 -7491 -11203 -60577 -91636 -43965 -5266 44357 56261 83733 60796
16122 60796 -20643 -80272 -74065 -55780 -80048 -103070 -105383 -105903 -84069 -30802 -19113 -20877 -44303
16109 -44303 -23371 -21153 -52542 -88933 -31769 -4639 -7556 18262 27524 13976 -11167 24386
16097 24386 31906 58932 88366 117251 88354 41203 -23874 -62703 -62102 -34111 -38427 -9350
16085 -9350 24626 35526 -9077 -4091 49351 40248 24473 30150 40688 -10694 -24181 -7670
16073 -7670 37533 62091 22994 -21049 -41684 -19457 -9572 -16488 -39483 -67900 -55197 -77099
16061 -77099 -56356 -7902 19491 42083 65451 59682 68074 109874 111964 64156 -48120 -101867
16049 -101867 -76041 -78810 -84823 -39220 -45294 -65082 -61282 -34931 -13843 -1973 -24922 -41287
16037d1287L0217L2504k1467J8604J0380K1905K3796k7126o9637l7910J1808L504
16025d4709K4379O328n7466k091M0036L108q029N5892O331j5247M7721m600n7388
16012e735J5667n757n318n893K5764L5258K3239j4204j8439k2706l8246J6860
16000D90J1902p165q747j1902o8854m1681M4103O0063J0761K7972M401m3580P345
15987a4892R365J4486M253q719k8277N3485L7880J0900k0243k7854L3371l5008
15975B8747L9857q559Q610R965n6165L1671k0042n5085m1585j5972O0980N2119
15963C4541j2981J9819R244k9551j1428k363l6620K720M7434j8297k4401K8250
15951F367l933k8399J2422K8223m102n386J3617J9726l9690l20J6237K167k2495
$$ plain form
16037 -41287 -11070 21434 -33 18571 28951 50856 74652 47526 -22111 -60021 -48213 -44709
16025 -44709 -20330 -14002 -71468 -73559 -33523 -30415 -38444 17448 23779 8532 56253 51653 -5735
16012 -5735 9932 4175 -1143 -7036 18728 53986 77225 63021 44582 21876 -16370 490
16000 490 12392 5227 -3520 -15422 -84276 -125957 -81854 -21791 -11030 16942 21343 -22237 -14892
15987 -14892 -5527 8959 13212 4493 -23784 29701 67581 78481 58238 30384 63755 28747
15975 28747 68604 60045 68655 78620 22455 54126 34084 -21001 -62586 -78558 -17578 34541
15963 34541 21560 41379 50623 21072 9644 7281 -29339 -26619 20815 2518 -21883 6367
15951 6367 2434 -25965 -13543 14680 10578 5192 18809 38535 -1155 -1475 14762 16929 -5566
15938e566M4464K9543n805o3647m8485N3501O6036j5114L0304Q972J9604k139
15926A11668j14686o0343M366L7571l8710k3801j4621l8720L9720L5871L1431
15915c0254Q7957l087n066J6714o620m4976l9064l4406P983K6300L4897L4940
15903D5318J9807k7008l4186l9101L5465Q1022J8324p7326l7822l205m7800q032
15891g4544K9721k1424J997P685Q5051K2193k8999o5627m2148n0611K3517J1666
15879a01523R835O972N6254l650r898n2815o024N0726M056k1077J6226J6665R0414
15866E6161M3478j7820m2276k0556J2271p398L6409m3667j9681k425J6524j4251
15854c231J2271P058M3178L4467L00l4672m8108r470M7821o951p0955L5103N8578
$$ plain form
15938 -5566 38898 68441 62636 -1011 -49496 4005 70041 54927 85231 94203 113807 111668
15926 111668 -3018 -63361 -58995 -21424 -60134 -83935 -98556 -137276 -97556 -61685 -30254
15915 -30254 57703 54616 49550 66264 59644 14668 -24396 -58802 -50819 -24519 10378 45318
15903 45318 65125 38117 3931 -35170 295 81317 99641 22315 -15507 -18712 -66512 -74544
15891 -74544 -44823 -66247 -64250 -56565 28486 50679 21680 -43947 -86095 -136706 -113189 -101523
15879 -101523 -91688 -84716 -28462 -32112 -42010 -94825 -100849 -50123 -46067 -67144 -50918 -34253 56161
15866 56161 99639 81819 39543 18987 31258 23860 60269 16602 -3079 -5504 11020 -3231
15854 -3231 9040 16098 59276 93743 94043 59371 11263 1793 49614 42663 -28292 6811 65389
15841F5389j4928m8967j2183l5371M3226P0092k3155k3166Q683L4758K008n9514
15829F872j8682N378J0241j847P582O621K831p812j7033K5085o487L3824M9356
15816I5929k7152k6681J2622j5044n9832j2512M3343l081M619o0085l1194L4782
15804d4286O5319J9762l3711l621R005j4604j9901j736J9756k2246J5431k1890
15792c2722K2275K3295M0891j5147j964L3686j77q5613j2189P535m5292J3004
15780e2418O9420n8979n075J7140j8128J2751m014o479O7073j244j0950n0311
15768d1214K0541P222n2000n459R846n1723j949N0099J8656R686Q111L2241n908
15755a851l8835k297M1481P597k6434J2212K3295j8552Q784m294m0540J1067J9941
$$ plain form
15841 65389 50461 1494 -10689 -46060 -2834 67258 44103 20937 29620 64378 66386 6872
15829 6872 -11810 -6432 3809 1962 9544 16165 18996 11184 -5849 19236 12749 46573 95929
15816 95929 68777 42096 54718 39674 -20158 -32670 10673 7592 12211 -47874 -79068 -44286
15804 -44286 21033 40795 7084 3463 12468 -2136 -22037 -23773 -4017 -26263 -10832 -32722
15792 -32722 -10447 12848 53739 38592 36628 70314 70137 -15476 -27665 -20130 -65422 -52418
15780 -52418 17002 -41977 -47052 -29912 -48040 -35289 -39303 -45782 21291 20047 9097 -41214
15768 -41214 -20673 -13451 -65451 -70910 -61064 -112787 -114736 -64637 -45981 -36295 -28184 4057 -1851
15755 -1851 -40686 -42983 -1502 6095 -20339 -8127 15168 -3384 5400 1106 -39434 -28367 -8426
15742h426J2325p1155R308N1087j0634L0676O8110L4873P083p3607m5755j8561
15730a4676m7692J5022J4271J4077N7528J8877n4998k5523k637k0236K1883K9755
15718E651j760N7890k2467l8471n743L7582k2309j3455O135J579l9600j2281L7436
15705i813K275k6924p261M159k1981J978J3417L8098n1259p853M5501j2828j1829
15692d4320j9120n273J4731M5400K1489j8386K748Q941m9103M7655J4636K3414
15680D2812K1139o8464j7842o719k8437m301k0145Q22j0389J5129l65N8448L1478
15667A3166P885J9201k3730m8983q321J5664k7693o2621M594M5797L2036L9062
15655F057m251p760M085k1869k6635p097k325M2364J0754J1658J5433M2410P825
$$ plain form
15742 -8426 3899 -67256 -57948 -6861 -17495 13181 81291 116164 123247 49640 3885 -14676
15730 -14676 -62368 -47346 -33075 -18998 38530 57407 2409 -23114 -25751 -45987 -24104 5651
15718 5651 3891 61781 39314 843 -4900 32682 10373 -3082 3053 4632 -34968 -47249 -9813
15705 -9813 -7538 -34462 -41723 -37564 -59545 -57567 -44150 -6052 -57311 -65164 -19663 -32491 -44320
15692 -44320 -63440 -68713 -53982 -8582 12907 -5479 -2731 6210 -42893 4762 19398 42812
15680 42812 63951 -4513 -22355 -29074 -57511 -61812 -81957 -81135 -91524 -76395 -76760 -18312 13166
15667 13166 21051 40252 16522 -32461 -40782 -25118 -52811 -115432 -110838 -65041 -33005 6057
15655 6057 1806 -5954 -1869 -23738 -50373 -57470 -59795 -17431 -6677 4981 20414 62824 70649
15642G0649o6823p5123K9635M3442J2874j6287R087m0597m6111N8738L1526j868
15630I142J8240q609n446j415l0778n0760L545L9642K5013l0466j4252k086k1819
15617g0049M9507M9286L308l0822q464k1729m0600m2489n722N25O613J4183K7049
15604f9404J2958Q597L1731M0674n7274J9826j5661m3502N8620K5365r0894o6809
15592a45773M2010N1204Q4336M0313J4058K3935o2571n2340J0054Q956n1179k9461
15580f6458l0535J3935N195k5624O032n96R122m668k6285N103N3284N789j4858
15567g0564m6368j7412J2834P04L2774K7998j7611k3210k4545J6706j7323K6751
15555i9266M2094P2252J7089l8753k0105k061j5748J6603M2976M8943k8212l3574
$$ plain form
15642 70649 3826 -71297 -41662 1780 14654 -1633 7454 -33143 -79254 -20516 11010 9142
15630 9142 27382 18773 13327 11912 -18866 -69626 -66081 -26439 -1426 -31892 -46144 -48230 -70049
15617 -70049 -20542 28744 32052 1230 -7234 -28963 -69563 -112052 -117774 -117249 -110636 -96453 -69404
15604 -69404 -56446 -47849 -16118 24556 -32718 -12892 -28553 -72055 -13435 11930 -78964 -145773
15592 -145773 -103763 -52559 31777 72090 86148 110083 47512 -4828 5226 14182 -36997 -66458
15580 -66458 -96993 -83058 -77863 -103487 -97455 -98051 -88929 -93597 -119882 -114779 -61495 -55706 -70564
15567 -70564 -116932 -134344 -121510 -120806 -88032 -60034 -77645 -100855 -125400 -108694 -126017 -99266
15555 -99266 -57172 15080 32169 -6584 -26689 -28750 -44498 -27895 15081 64024 35812 2238
15543B238r11J9815j1408k1775J5452p233N763j4230k7149J1722j583J014j8902
15530d7187J163K3489L8726P819l9550n4649l8879M8909J7560k4827K713R097
15518e5616L8920L165J1896M7196n2829m8704M3464L4882L72m020j9958m2786
15506d4018L3557k164L137N2127j230n374j0213m6539m0072j7532K9165K6013
15494b3143J7790n31m5681m410J232P557m2223m0515Q2231N8683m5193k0595o098
15481f0896l2982L1853J9513J9891j4024r458K0941M1184n3236k4207K7479J3707
15469b0235M1552J4505l6993m1323K8166O8304J5938k3235n1746j2662k2526j673
15457d1928K5385Q118j2289K0183J3679O2980m343M5778n5328k8176M7192J5177
$$ plain form
15543 2238 1327 21142 9734 -12041 3411 -3822 1941 -12289 -39438 -27716 -29299 -28285 -47187
15530 -47187 -46024 -22535 16191 24010 -15540 -70189 -109068 -60159 -42599 -67426 -64713 -55616
15518 -55616 -16696 -13531 -1635 45561 -7268 -55972 -12508 22374 22746 18726 -1232 -44018
15506 -44018 -10461 -12625 -9488 42639 41409 36035 25822 -20717 -60789 -78321 -49156 -23143
15494 -23143 -5353 -5884 -51565 -55975 -54743 -47186 -89409 -129924 -47693 10990 -34203 -54798 -60896
15481 -60896 -93878 -62025 -42512 -22621 -36645 -46103 -25162 16022 -37214 -61421 -33942 -20235
15469 -20235 21317 35822 -1171 -42494 -14328 53976 69914 46679 -5067 -17729 -40255 -41928
15457 -41928 -16543 -8425 -20714 -531 13148 76128 71785 117563 62235 34059 81251 96428
15445I6428p5737l8662k6809k9646K5934k1827N6163K9984M0046m112l4278m2312
15433b4828M7776M0377l0136q744J4263J5338k4371j1078K379K6955M2807L8558
15421A29296k9774l7863q186M7734K5968m7006p1330j6063N336J6238L5282j762
15409D7870l2962n4974k066j7631K6112j6619M8109M7968n1394m127M5910N2564
15397H8760K1095o3827l4849j5200j53j521m9280J8768J1444M3268N531k4799
15385g63k2695L6647N89j4400m3045K2825O6498J9817M2229j1495k3824o6682
15373E701j6765M5569J4054l0466m8516n838L8167R844m870J5003l8152m3589
15361e9858K3823K7175N8277J1244p2037j1329r025K842K9556k1827J2123J37
$$ plain form
15445 96428 20691 -17971 -44780 -74426 -48492 -70319 -14156 15828 55874 51762 17484 -24828
15433 -24828 22948 63325 33189 24445 38708 54046 29675 18597 20976 47931 90738 129296
15421 129296 99522 61659 53473 101207 127175 80169 8839 -7224 -1888 14350 49632 47870
15409 47870 14908 -40066 -42132 -59763 -33651 -50270 -2161 45807 -5587 -9714 36196 88760
15397 88760 109855 46028 11179 -4021 -4174 -5695 -54975 -36207 -24763 18505 24036 -763
15385 -763 -23458 13189 13778 -622 -43667 -20842 45656 65473 107702 96207 72383 5701
15373 5701 -11064 34505 48559 18093 -30423 -36261 1906 11750 6880 21883 -16269 -59858
15361 -59858 -36035 -8860 49417 60661 -11376 -22705 -31730 -28888 668 -21159 -9036 -8899
15349h899J1890L9900n872N311n3822m2595J1755J0483L4851N579j9691M2267
15337C1157k8834k2688k0426l1793l5320K856m072L6704j6487O029L6599J5590
15325c0685k5892p249q963L2308M9688N0905m1703n7140j1318L5488L4358j3576
15313F221j565l7331J2043J3221r910p839m237K0394P047j2928k8582J3358N8962
15300B8854j8173m5667Q105N2968q608p3596k5099O0630K1726L3398K2245o1393
15288d610J0455j0029o2685j6216J3083L3451K0277M0661j857k1010r4971l9301
15276a32752M2992M6246Q9596j361j6955Q737j0513K9854m9578n9960k4567l3541
15264a11802j7362M5703j4094o151M5522K519k6387p741J2218K6839P6824Q10
$$ plain form
15349 -8899 2991 42891 37019 42330 -11492 -54087 -42332 -31849 3002 8581 -11110 31157
15337 31157 2323 -20365 -40791 -72584 -107904 -105048 -109120 -72416 -88903 -82874 -46275 -30685
15325 -30685 -56577 -63826 -72789 -40481 9207 60112 18409 -38731 -50049 -14561 19797 6221
15313 6221 4656 -32675 -20632 -7411 -17321 -25160 -29397 -9003 -1956 -14884 -43466 -30108 28854
15300 28854 10681 -34986 -26881 26087 17479 -56117 -81216 -20586 1140 34538 56783 -4610
15288 -4610 5845 -4184 -66869 -83085 -70002 -36551 -16274 24387 22530 1520 -93451 -132752
15276 -132752 -89760 -43514 46082 44721 27766 36503 25990 55844 6266 -53694 -78261 -111802
15264 -111802 -129164 -83461 -97555 -103706 -58184 -55665 -82052 -89793 -77575 -50736 26088 26898
15252B6898r150M2211O020o6819J1033m530j0186J8565j9086l3804P341j5347
15240d6854K8145N0587l1946j3137K1438P303j0719l2816o341k7962j5408O7452
15228a0258k268l5359k2335j306O562K035k4160K7670M8766J8594p124K4686K1914
15215D7417k2366j8804k9282l6320k9072L2068o965o8310L1313Q4246N1348K9066
15203F4339l9285J2195l7731l6654o76L0002J1833q812k7861l9286n941L4908
15191d2969O0113O0617p343q8301m0654O387L1752l3516P302p0023r95N8210m925
15178f4345r699K079K6457M0009K0927J2455k7191l2316M3082N5025J3468l0668
15166D9283p8527Q702j1850L0444J6986L3010m5751p5326K8695Q186R770J9079
$$ plain form
15252 26898 17748 59959 65979 -840 10193 5663 -4523 14042 -5044 -38848 -31507 -46854
15240 -46854 -18709 31878 -68 -13205 8233 15536 4817 -27999 -34340 -62302 -77710 -10258
15228 -10258 -12526 -47885 -70220 -71526 -64964 -62929 -87089 -59419 -10653 7941 817 25503 47417
15215 47417 25051 6247 -23035 -59355 -88427 -56359 -63324 -131634 -100321 -16075 35273 64339
15203 64339 25054 37249 -482 -37136 -37812 -7810 4023 -4789 -32650 -71936 -77877 -42969
15191 -42969 17144 77761 70418 -17883 -58537 -52150 -20398 -53914 -46612 -116635 -117630 -59420 -64345
15178 -64345 -74044 -71965 -45508 -5499 15428 27883 692 -31624 11458 66483 79951 49283
15166 49283 -29244 -20542 -32392 -1948 15038 48048 2297 -73029 -44334 -36148 -26378 -7299
15154g299j5780l9311j0595l254K5791L4066k3477J2787n57J0543K6771m573n7249
15141e2137j0332L1759j0670K8165q4205L3886Q4426L0849J5594l6964p0085m3507
15129h3221K2668j685L5843k817L8245m0445r482L4251J0994J906K600l487O259
15116A1629j8036k6721M9640J5384j376k4409q535M9047j1852m7422n7258k822
15104g2731J5383K4512k4335q148Q149J7603j647N585j2087k5395J942N4335m148
15091b0982k5948j4809n143M1004j271L3954j6076p233l1499r45K2407m217K0502
15078a0256L5242K331p233L2649q230j4749J7096j9348J0103J1022j6154L2166
15066F4639L1362l2337k7716O119l2202r1508n0116K7149O0168L8032L2415p291
$$ plain form
15154 -7299 -23079 -62390 -72985 -76239 -50448 -16382 -39859 -27072 -27629 -17086 9685 5112 -52137
15141 -52137 -62469 -30710 -41380 -13215 -97420 -63534 20892 51741 67335 30371 -39714 -83221
15129 -83221 -60553 -62238 -26395 -29212 9033 -31412 -40894 -6643 4351 6257 8857 5370 11629
15116 11629 -6407 -33128 16512 31896 30520 6111 -2424 46623 34771 -12651 -69909 -72731
15104 -72731 -57348 -32836 -57171 -65319 -57170 -39567 -41214 -35629 -47716 -73111 -71169 -16834 -20982
15091 -20982 -46930 -61739 -66882 -25878 -27149 6805 -9271 -16504 -48003 -48948 -26541 -30758 -10256
15078 -10256 24986 27317 20084 52733 44503 29754 46850 27502 37605 48627 32473 64639
15066 64639 96001 63664 35948 42067 9865 -81643 -131759 -104610 -44442 -6410 26005 18714
15054A8714l3774k0789m8871L3540M8007q19l819n439K8352K297l6367L8422j3765
15041E689m0677J008K7529l2272K2737J4992m710K1374L3826N638l6525k4893
15029f284k0704M318k0639l3514K3684Q2171L5642k5655j8342M798n6129n183
15017c5837j755l915j3488k544p735J295J6946P1997M9213n705j4734j9189m9001
15004a4452l8577j6736K2029L2111j8028m8508j9628K9788P053J2173N2676N520
14992E421m8945m774R125M5741p679j5270j7024l1347M1127K2204L9527M9179
14980H7285l2086o6133j2220M8171N6070P3478M703k4526n5345l9342k4953k7346
14968a2244l1248j2223k0904M3154N8971J3114k0621k0512N6544Q730m3079M053
$$ plain form
15054 18714 -15060 -35849 -84720 -51180 -3173 -3992 -7811 -13250 15102 17399 -18968 19454 5689
15041 5689 -34988 -33980 -6451 -38723 -15986 -994 -5704 15670 49496 55134 18609 -6284
15029 -6284 -26988 -22670 -43309 -76823 -53139 29032 64674 39019 20677 25475 -30654 -35837
15017 -35837 -37592 -41507 -54995 -57539 -65274 -63979 -47033 24964 74177 68472 53738 34549 -14452
15004 -14452 -53029 -69765 -47736 -15625 -33653 -82161 -101789 -72001 -64948 -52775 -99 5421
14992 5421 -43524 -48298 -39173 6568 -1111 -16381 -33405 -64752 -23625 -1421 38106 87285
14980 87285 55199 -10934 -23154 25017 81087 154565 159268 134742 79397 40055 15102 -12244
14968 -12244 -43492 -55715 -76619 -33465 25506 38620 17999 -2513 54031 62761 19682 23735
14956B3735J6432K2760J116l1175J6010n187n1134k3597L8569M3968o1797p5469
14944h5769K3437N8316M491j87l311K4923k8537p20K4858k965j6697k8967j6594
14931d7722J9332K9895N386O710p425r515J0053K5089k0921m2335K3835M1251
14919C3633P404q009j1453l5617q46K7290K226K1489M64K630O814j474k4933q8362
14905f8744o4884l5820M5655K8016K7443K5938n846K1738k6789l9605P278K6458
14893e9162J1751L1262J479j7127l7961j1291N0596M4469j6860n6598k7214J418
14881h5238O6675K2591k2400q615j7392K128J9818l032k7897k4525l0661J9761
14869h8787K9086K5811N6155N4338J7377J9644m489m8312J1270j8690k8924M4166
$$ plain form
14956 23735 40167 62927 64043 32868 48878 43691 -7443 -31040 7529 51497 -10300 -85769
14944 -85769 -62332 -4016 475 288 -3023 21900 -6637 -7357 17501 14536 -2161 -31128 -47722
14931 -47722 -28390 1505 6891 13601 6176 -3339 6714 31803 10882 -31453 -7618 33633
14919 33633 41037 33028 21575 -14042 -14888 12402 14628 36117 36581 39211 46025 44551 19618 -68744
14905 -68744 -133628 -169448 -123793 -95777 -68334 -42396 -48242 -26504 -53293 -92898 -85620 -59162
14893 -59162 -47411 -16149 -14670 -31797 -69758 -81049 -30453 14016 -2844 -59442 -86656 -85238
14881 -85238 -18563 4028 -18372 -26987 -44379 -42251 -22433 -25465 -53362 -77887 -108548 -88787
14869 -88787 -59701 -33890 22265 76603 93980 113624 109135 60823 72093 53403 24479 68645
14857F8645J8958K61J9268J0969J460j9844p2841p6549k6456Q252j8796K1717
14845f4956L9792j1151O3177L2325o262j6471j9686k7238P427j8663M8834m0075
14833a2947n9130o728p501J4044J8J2605L5589L573J1182J7635P710J1368m9544
14820b2126l4219j4715j10O8192N9467r739l8601o7296L0622L9904J5453K7277
14808E4109K2634l3867k0381L3406O0099j128j0112l8197M694J5326m1685k2106
14796B2792O8763K9865q943R553J1432m5207n7251k6708L2302K2062l4389j8691
14784E580N4815P421l4020j8062q46K4959m33j9626P035m410L7439L0482r732
14771H0602j5537m2841L3972n0970n4684R852K9779n882j5641O0431J5882K5616
$$ plain form
14857 68645 87603 87864 107132 118101 119561 99717 26876 -49673 -76129 -67877 -86673 -64956
14845 -64956 -25164 -36315 26862 59187 52925 36454 16768 -10470 -3043 -21706 27128 -12947
14833 -12947 -72077 -78805 -86306 -72262 -72244 -59639 -24050 -20477 -9295 8340 16050 27418 -22126
14820 -22126 -56345 -71060 -71170 -2978 56489 46750 8149 -59147 -28525 11379 26832 54109
14808 54109 76743 42876 22495 55901 116000 114872 104760 66563 71257 86583 44898 22792
14796 22792 91555 121420 112477 122030 133462 88255 31004 4296 36598 58660 24271 5580
14784 5580 60395 67816 33796 15734 14888 39847 39414 19788 26823 22413 59852 90334 80602
14771 80602 65065 22224 56196 5226 -49458 -39606 -9827 -15709 -31350 29081 44963 70579
14759G0579m0797q4264k5523J3332N2517O3006j4416J2316N237m3436K0418Q3354
14747A12323L8085k0146n0172n4345o5243p554L664O0678J9745N240J7529j8127
14735D1677J4733q68j6040L7541j9652k4966k657L9804k6589J2946N1385l9655
14723F7659m810J606m2237Q371J00814j9924p8617l3366j2507l5692p036j85K5611
14710c0313K6323J1621o125O612k0164J9966K8782l2665k3110J4941M6814n679
14698C7003j8205m8515n2881p023J7319J9204l4045l4074J0031L0689K4571J100
14686e4826P192N3483k371J1021r366o7991l7779l1941P0417N6188k1812K0781
14674g004J2987k2333o171l1514o449J5498K3236Q632L5953k8802m1952p689K9137
$$ plain form
14759 70579 29782 -54482 -80005 -66673 -14156 48850 34434 46750 51987 8551 28969 112323
14747 112323 150408 130262 80090 25745 -39498 -47052 -43388 17290 37035 42275 59804 41677
14735 41677 56410 55542 39502 77043 57391 32425 29768 69572 42983 55929 107314 67659
14723 67659 62849 64455 22218 30589 131403 111479 32862 -504 -13011 -48703 -55739 -55924 -30313
14710 -30313 -3990 7631 1506 8118 -12046 7920 36702 4037 -19073 -4132 42682 37003
14698 37003 18798 -29717 -82598 -89621 -72302 -53098 -87143 -121217 -111186 -80497 -55926 -54826
14686 -54826 -47634 5849 3478 14499 5133 -62858 -100637 -132578 -62161 -5973 -27785 -7004
14674 -7004 5983 -16350 -22521 -54035 -60484 -44986 -21750 -13118 22835 -5967 -47919 -55608 -26471
14661b6471O4029K8220j2837q858m4936l3130k3480O0172M580k8608k5737M4429
14649b627L4m778j5487k641m350K0855m75l0987k5203J4084j382k2399K9251N4565
14635H460k2319p831p64r18P044L2168O2202J7169o5906n0452j0627k061K9505
14622d330j1790k2800r443K7682J2994K0222L0004L7973k6556m3547m1256K2016
14610h831M395j7107M0756J5295q853J7631o0020j6572J2995K8170N121l5172
14598b2192j5181K3629K6398L419j092l5661l4345J2720j2365N337K5837K4662
14586A166j5120M2470l3402n5557J5286N7872J9713n4762l2267K6933K3333N1630
14574D7295r746j4146M7941j1290n3706n0499j5555L0123J0521k973L2478j6827
$$ plain form
14661 -26471 37558 65778 52941 44083 -853 -33983 -57463 2709 7289 -21319 -47056 -2627
14649 -2627 -2593 -7371 -22858 -25499 -29849 -8994 -9469 -40456 -65659 -51575 -52957 -75356 -46105 8460
14635 8460 -13859 -21690 -22454 -23372 -16328 15840 78042 95211 29305 -21147 -31774 -33835 -4330
14622 -4330 -16120 -38920 -48363 -20681 -7687 12535 42539 80512 53956 10409 -30847 -8831
14610 -8831 -4436 -21543 19213 34508 25655 43286 -16734 -33306 -20311 7859 12980 -22192
14598 -22192 -37373 -13744 12654 16073 14981 -20680 -55025 -42305 -54670 -49333 -23496 1166
14586 1166 -13954 28516 -4886 -60443 -45157 12715 32428 -22334 -54601 -27668 -4335 47295
14574 47295 37549 23403 71344 60054 6348 -44151 -59706 -29583 -19062 -22035 10443 -6384
14562f384m5861L5086j0593J6149R286n13O182L1806Q796J3012j4387o4444o383
14549b8248K5326K9124M770Q605j753p0968O16K5395J6455N31l4951k9335l5741
14536i0174q121P1864O4379k5421n6660m411K180k9711k3255k2704N8449N0037
14524a3548N019k0704k078k75L4572L7481j4243k1157j3869k2815k4746K5468
14512c0895J3032j6452O598L0215M6048l3884k6247n1115l4113P278N3935k18
14500c5818m161k6314j0179L3055K1826J5366j9698j5143L383K5737l673Q11q518
14487b3326j8003J0524l039l4758L0512M7159l688j2120l3830m0160n2693L7749
14475i5673O0188J3180K4678m833m5628n853L0609K6676l5573l8855j5401P825
$$ plain form
14562 -6384 -52245 -17159 -27752 -11603 -2317 -2830 3352 35158 43954 56966 42579 -21865 -28248
14549 -28248 -2922 26202 30972 39577 37824 -33144 -32528 -7133 9322 9853 -25098 -54433 -90174
14536 -90174 -98295 -26431 37948 12527 -44133 -48544 -46364 -76075 -99330 -122034 -63585 -13548
14524 -13548 -8529 -29233 -31311 -31586 2986 40467 26224 5067 -8802 -31617 -56363 -30895
14512 -30895 -17863 -34315 -27717 2498 48546 14662 -11585 -62700 -96813 -89535 -35600 -35818
14500 -35818 -39979 -66293 -76472 -43417 -21591 -6225 -25923 -41066 -37683 -11946 -15619 -14808 -23326
14487 -23326 -41329 -30805 -33844 -68602 -38090 9069 5381 -6739 -40569 -80729 -133422 -95673
14475 -95673 -35485 -22305 2373 -2460 -48088 -53941 -23332 3344 -32229 -71084 -86485 -78660
14463g8660J3634o782j2105J0261N3872R674J2682M1914j2538l6099n5152k7178
14451h6477Q1387M8481j1374m5990j1951M006j1420J1617J2925j4352J7989J1224
14439F065L325P64N3271K3660o696r982J6124J7344l5525J053k9643m5822k5868
14426c1930K3382M7653j5694l068K8820j8721m6023k9077N880K0849L597L0014
14414A5682J4545n441J0645j503m0707J8844L8709J4589j7720k786K6041Q659
14402G9557k7811l7022k6426m950K5151J7556m567K1812N6480n2997j02240l8917
14390i4374j8634K6715O452l1218n2870N4534L8303K7287n884q085l0164n4154
14378a42092M9529M2524j8697J7517P0401O48j9589o953k0716j6359M9998K0157
$$ plain form
14463 -78660 -65026 -71808 -83913 -73652 -19780 -10106 2576 44490 31952 -4147 -59299 -86477
14451 -86477 -5090 43391 32017 -13973 -25924 -21918 -33338 -21721 -8796 -23148 -5159 6065
14439 6065 9390 10154 63425 87085 80389 70407 86531 103875 68350 69403 39760 -6062 -31930
14426 -31930 -8548 39105 23411 20343 49163 30442 -15581 -44658 -38778 -17929 -14332 15682
14414 15682 30227 24786 35431 33928 -6779 12065 50774 65363 47643 44857 70898 79557
14402 79557 51746 14724 -11702 -16652 8499 26055 21488 43300 99780 46783 -55457 -94374
14390 -94374 -113008 -86293 -79841 -111059 -163929 -109395 -71092 -43805 -49689 -57774 -87938 -142092
14378 -142092 -92563 -50039 -68736 -51219 19182 19830 241 -6712 -27428 -43787 6211 26368
14366B6368k0512r71j5014L5053M2120R57o1372m0132K2988K3303Q331k4814j8172
14353b1867L1094q740j4660k1414k0587l487r969K9488J029N158J4465l1103k3058
14340g3651q892j1609K3122J1862L1062K5144J02j0134l103j0617J4578Q3965
14328G1829p318n1095n3306J2299K8716k960j791K730Q843m919k6581j2809J8099
14315a8263K4437K5672o7736R455Q3365J4606l0889j0184K8849q249j6349k5104
14303I610o7654K5604O092r972K9349K736j8670j9130j3048L8253J1225N4905
14291D9300k4630l0257M1253j0841m6829j227K184J4133M1979l4230l4523j0514
14279d4202K5261K9876K7684M4346k2162l0356k6717k156j232k3105j2904J6725
$$ plain form
14366 26368 5856 4885 -10129 24924 67044 68001 6629 -33503 -10515 12788 21119 -3695 -21867
14353 -21867 9227 487 -14173 -35587 -56174 -59661 -69630 -40142 -39113 -33955 -19490 -50593 -73651
14340 -73651 -82543 -94152 -71030 -59168 -28106 -2962 -2860 -12994 -16097 -26714 -12136 71829
14328 71829 64511 13416 -39890 -27591 1125 -1835 -3626 -896 7947 3028 -23553 -36362 -18263
14315 -18263 6174 31846 -35890 -26435 56930 71536 40647 30463 59312 51063 34714 9610
14303 9610 -58044 -32440 -26348 -36320 -6971 -4235 -22905 -42035 -55083 -16830 -5605 49300
14291 49300 24670 -5587 35666 24825 -22004 -23231 -21047 -6914 35065 835 -33688 -44202
14279 -44202 -18941 10935 38619 82965 60803 30447 3730 1574 342 -22763 -35667 -18942
14267a8942L3790j8137l6729J6887k2451J3737r91J9542K3829K1637p3792J995
14255c9625K5063J3495m990l0314k4177J4408j4759k0350O30L2437K1783M9243
14243B2844N971l9488k3769R66j5129J0711j5780J0200k3568j7000Q623M6406
14231b9013J4539J7141l4261J4776J7370J3883m658m8961k6017N3414K0092m0784
14219c2479m4875O024N6374L6648K4520o938L607m5691k4565k8142J8595M1519
14207D597j4715k3471o0574k6952k4617L7476j1425L4868M7672K567N1131P53
14195A7310l9147Q063J7351m3220R985O048M4072Q329K6561M8181P98p2248m9638
14182a7555j9664M6287K0659l0586r7496k4225K5599L8078K9656n2l509j4533
$$ plain form
14267 -18942 14848 -3289 -40018 -23131 -45582 -31845 -32836 -13294 10535 32172 -41620 -39625
14255 -39625 -14562 -1067 -6057 -36371 -60548 -46140 -60899 -81249 -80619 -48182 -26399 22844
14243 22844 28815 -10673 -34442 -33476 -48605 -37894 -53674 -43474 -67042 -84042 -75419 -29013
14231 -29013 -14474 2667 -31594 -16818 552 14435 9777 -39184 -65201 -11787 8305 -32479
14219 -32479 -77354 -71330 -14956 21692 46212 39274 42881 -2810 -27375 -55517 -36922 4597
14207 4597 -10118 -33589 -94163 -121115 -145732 -108256 -119681 -84813 -37141 -34574 16557 17310
14195 17310 -21837 -13774 3577 -39643 -29658 -23610 20462 28791 55352 103533 104331 32083 -17555
14182 -17555 -37219 9068 29727 -859 -98355 -122580 -96981 -58903 -29247 -29299 -32808 -47341
14170d7341L8514j2675J9868M318L024k7110j6288L2138J5044K1520j9747k169
14158I096p764k3650j6426K7624L6826o7485q9960K232N9848J018P428J9136N0998
14145H921J5522o6775K8787J5557j5679m4780n096J2842K6932o467m374K0235
14133a4375N8319J1109l7514o5546j5401k646M4089L6302J8710l408J172k9613
14121A198o527m9493R940J6014R610l2428q066L7704K6352m1662J5867k2188L1495
14108a2184j8466l0425K9411L9329K4150j2264J4075O761n7330k4959O290L9161
14096C549K9637N041l2275k5332j649j3270k3487k5114K7898j245N6076N3937
14084E3766Q720N537n4646o1342k6269L198N79j8351L742J3011k6326J0054J9489
$$ plain form
14170 -47341 -8827 -21502 -1634 2684 5708 -21402 -37690 -5552 9492 31012 11265 9096
14158 9096 1332 -22318 -38744 -11120 25706 -41779 -131739 -129507 -69659 -68641 -61213 -42077 8921
14145 8921 24443 -42332 -13545 2012 -13667 -58447 -63543 -50701 -23769 -30236 -34610 -14375
14133 -14375 43944 55053 17539 -48007 -63408 -66054 -21965 14337 33047 29639 30811 1198
14121 1198 -5329 -54822 -44882 -28868 -19258 -51686 -59752 -22048 4304 -37358 -21491 -43679 -12184
14108 -12184 -30650 -61075 -31664 7665 31815 19551 33626 40387 -16943 -41902 -35612 3549
14096 3549 33186 38227 5952 -19380 -21029 -34299 -57786 -82900 -55002 -56247 -171 53766
14084 53766 62486 68023 13377 -47965 -74234 -71036 -70457 -88808 -85066 -72055 -98381 -88327 -68838
14071f8838L5815N6216p975l7143N358N165j1136m4783p336K0754L5745J3318
14059d840k0985j3169K2588K1251K6138j2279j0127o706k2145k1128k5635n125
14047g2162J6692k372n324j6761J4406j528K0521J7748j1392q460j7696Q779K7101
14034c0448j2853k1064O785q222r625L3584K1572P48q3187N3493P0390j0604k2225
14021a1656K2086n3568j5517L3410L2292R606n0845k2938J5471P8108K0490M606
14009F1545j0034O587l3231o412j1735K9438j052K2704k4145K7927J9994j5294
13997F6292n6412m6708P449k0803j6541J8337K5099j8049M2626j5988m2875O747
13985e0826M4999K8328J2050n1691n0427M2716M129l0005M2977J5785J1298R009
$$ plain form
14071 -68838 -33023 23193 15218 -21925 -16567 -11402 -22538 -67321 -74657 -53903 -18158 -4840
14059 -4840 -25825 -38994 -16406 4845 30983 18704 8577 1871 -20274 -41402 -67037 -72162
14047 -72162 -55470 -57842 -63166 -79927 -65521 -67049 -46528 -28780 -40172 -48632 -66328 -57549 -30448
14034 -30448 -43301 -64365 -57580 -65802 -75427 -41843 -20271 -19523 -102710 -49217 21173 10569 -11656
14021 -11656 10430 -43138 -58655 -25245 7047 16653 -34192 -57130 -41659 36449 56939 61545
14009 61545 51511 58098 24867 18455 6720 36158 35106 57810 33665 61592 81586 66292
13997 66292 9880 -36828 -29379 -50182 -66723 -48386 -23287 -41336 1290 -14698 -57573 -50826
13985 -50826 -5827 22501 34551 -17140 -67567 -24851 -20722 -50727 -7750 8035 19333 28342
13973B8342M1671j4109n2656r337j9063r906K9379k6180k8092j5852M548K7515
13961d3740J6203q226K8815m8145k0670L5928Q9556L7779l4660l1524m4896k1954
13949d5534K9819L9077K2995k0337N2672j5616k0999j8104p6879m599Q2129k2900
13937A724l1371j1143K8918R603J1315k3345J563P5097K4917m7816Q21q807l9266
13924g790q1580O780O7570J6582L5801J3098k6641m2238m6269O154o052K8127
13912c6458m5343L3516L2663j757k5724q691l3257J2375O1643j7819o5817K1990
13900g2679K7777l7791K4207K7242M179j8035P52P435K8017Q724m3201k3940L5662
13887c1651j945J3600M0625m137M6349K5131m6942o1115n098q73K1547N357j9348
$$ plain form
13973 28342 70013 55904 3248 -6089 -25152 -35058 -5679 -31859 -59951 -75803 -71255 -43740
13961 -43740 -27537 -35763 -6948 -55093 -75763 -39835 49721 87500 52840 21316 -23580 -45534
13949 -45534 -15715 23362 46357 26020 78692 63076 42077 23973 -52906 -57505 24624 1724
13937 1724 -29647 -40790 -11872 -2269 9046 -14299 -12736 62361 87278 39462 40283 31476 -7790
13924 -7790 -89370 -82590 -15020 1562 37363 50461 23820 -18418 -64687 -58533 -64585 -36458
13912 -36458 -81801 -48285 -15622 -17379 -43103 -51794 -85051 -72676 -11033 -28852 -94669 -72679
13900 -72679 -44902 -82693 -58486 -31244 -27065 -45100 -44348 -36913 -8896 -172 -43373 -67313 -31651
13887 -31651 -33596 -19996 20629 16492 62841 87972 41030 -20085 -25183 -26056 -4509 848 -18500
13874a8500K1323q709n545L357J8212N0516Q644j1274l2204p639J1545o411j6212
13861G103K1211L7379p033k6643m3621j6119J3337L400p585L0006m9169j4249
13849e1983j6724m4868m1247K9734N3943m368l3147k597M1190J1186j0604m5516
13837a15001P842J466N3644K8179J9221K484m084l833p6984l6810L6644j3481
13825a00713l7006M3194m659m2922l2416M0199N3243M9933K9637o0802m0370N2333
13813e0349L9243k5165j9480j4044l2513m849L9664K5481L2763K327K4473j8570
13801a019K111p027l4146K5076J7837L0809j9716l4469k6515j0106L357J7486
13789c6322J6135J5563J4313j1677J0284K7834J1566m1167Q9P2925K8842o9513
$$ plain form
13874 -18500 2823 -5886 -11431 -8074 10138 60654 69298 58024 25820 18181 29726 23315 7103
13861 7103 28314 65693 58660 32017 -11604 -27723 -14386 -10986 -18571 11435 -37734 -51983
13849 -51983 -68707 -113575 -154822 -125088 -71145 -75513 -108660 -111257 -70067 -58881 -69485 -115001
13837 -115001 -107159 -105693 -52049 -23870 -4649 -2165 -6249 -10082 -87066 -123876 -87232 -100713
13825 -100713 -137719 -94525 -99184 -142106 -174522 -134323 -81080 -31147 -1510 -62312 -102682 -50349
13813 -50349 -11106 -36271 -55751 -69795 -102308 -107157 -67493 -42012 -9249 -6922 17551 -1019
13801 -1019 1092 -5935 -40081 -15005 2832 33641 13925 -20544 -47059 -57165 -53808 -36322
13789 -36322 -20187 -4624 9689 -1988 8296 36130 47696 6529 6618 79543 108385 38872
13777C8872n7895J9870P231l6547J8424J6722l9576j0912l961j8484k2100j2477
13765a00833N131q791O784k1277L0342L1878J7230l8J9224O426l4547L0059P0828
13752E2416J0969p360n1150m8024k6723k2576l4694k3742O4438l104j0333K5867
13740g4016K217R184n351J1479L2605r048j9824L2465K1459l0128n9358J5241
13728g3075J2944j4868J8153K8638N7737O1958k4169j1470r886k9080m3397n066
13716c1581q747J0703j837O736k6369K4996J3827O532o2992j9954J9439L5455
13704c3792l3697m0975J6282N7239J1329j9955n731J2971L2906k4120l319J2127
13692a8735l0578j7218n5004M6247K3038j9350L0786K7516K5496J218k879m2328
$$ plain form
13777 38872 -19023 847 8078 -28469 -10045 6677 -32899 -43811 -47772 -66256 -88356 -100833
13765 -100833 -95702 -104493 -97709 -118986 -88644 -56766 -39536 -39574 -20350 -13924 -48471 -18412 52416
13752 52416 63385 56025 4875 -43149 -69872 -92448 -127142 -150884 -86446 -89550 -99883 -74016
13740 -74016 -71799 -62615 -67966 -56487 -23882 -32930 -52754 -20289 1170 -28958 -88316 -73075
13728 -73075 -60131 -74999 -56846 -28208 29529 91487 67318 55848 45962 16882 -26515 -31581
13716 -31581 -40328 -29625 -31462 -24726 -51095 -26099 -12272 -5740 -68732 -88686 -69247 -33792
13704 -33792 -67489 -108464 -92182 -34943 -23614 -43569 -49300 -36329 -3423 -27543 -30862 -18735
13692 -18735 -49313 -66531 -121535 -75288 -52250 -71600 -40814 -13298 12198 13416 10537 -31791
13680c1791n3109n6722K9622J1285K446J1742j929O268K0667l2250m0225J5989
$$ plain form
13680 -31791 -84900 -141622 -112000 -100715 -98269 -86527 -88456 -82188 -61521 -93771 -133996 -118007
$$ [...]
##END NTUPLES=NMR SPECTRUM
##END=
