##TITLE=Analysis number 318347
Compound Code cc 05108
Project Code adrs
Chemist Name molekula
+1d D2O
##JCAMPDX= 6.0         $$ Bruker NMR JCAMP-DX V2.0
##DATA TYPE= NMR SPECTRUM
##DATA CLASS= NTUPLES
##ORIGIN= Bruker BioSpin GmbH
##OWNER= nmr
$$ XWIN-NMR		Version 3.5
$$ Fri Mar 24 09:30:03 2006 GMT Standard Time (UT+0h)  MAYBRIDGE\nmr@NMR_250MHZ
##.OBSERVE FREQUENCY= 250.131544655141
##.OBSERVE NUCLEUS= ^1H
##.ACQUISITION MODE= SIMULTANEOUS (DQD)
##.ACQUISITION SCHEME= undefined
##.AVERAGES= 16
##.DIGITISER RES= 18
##SPECTROMETER/DATA SYSTEM= dpx250
##.PULSE SEQUENCE= zg30
##.SOLVENT NAME= CDCl3
##.SHIFT REFERENCE= (INTERNAL, CDCl3, 0, 16.522)
##AUDIT TRAIL= $$ (NUMBER, WHEN, WHO, WHERE, WHAT)
$$ ##TITLE= Audit trail, XWIN-NMR		Version 3.5
$$ ##JCAMPDX= 5.01
$$ ##ORIGIN= Bruker BioSpin GmbH
$$ ##OWNER= nmr
$$ C:\u/data/dgb/nmr/ADRS/1390/pdata/1/auditp.txt
$$ ##AUDIT TRAIL=  $$ (NUMBER, WHEN, WHO, WHERE, WHAT)
(   1,<2006-03-24 09:28:58.86 +000>,<MAYBRIDGE\nmr>,<NMR_250MHZ>,
      <created by zg, POWCHK disabled, PULCHK disabled
       configuration hash MD5:
       84 BC 41 DB A1 6E 1D 46 DA 25 12 A5 C1 ED C5 3A
       data hash MD5: 64K
       AA 4A 47 3E B7 2D B8 43 65 08 63 5F D5 A8 2B ED>)
(   2,<2006-03-24 09:29:22.66 +000>,<MAYBRIDGE\nmr>,<NMR_250MHZ>,
      <Start of raw data processing
       ef LB = 0.3 FT_mod = 6 PKNL = 1 SI = 32K 
       data hash MD5: 32K
       B7 75 7D D8 C7 A7 01 CB 48 8C BD 4B B1 A0 5B D9>)
(   3,<2006-03-24 09:29:32.66 +000>,<MAYBRIDGE\nmr>,<NMR_250MHZ>,
      <apk 
       data hash MD5: 32K
       BD 4F 6A 1B 94 28 47 6D 9A 34 CC 26 91 16 DB 6B>)
(   4,<2006-03-24 09:29:36.52 +000>,<MAYBRIDGE\nmr>,<NMR_250MHZ>,
      <abs ABSG = 5 
       data hash MD5: 32K
       1D FA AF 17 92 55 9A 76 E6 B4 5E A9 B5 B6 31 E4>)
$$ ##END=
$$ 
$$ hash MD5
$$ A7 22 6A 12 67 61 AB 4B A5 61 0D B7 34 FA 0A EB
##$RELAX= 
##$RELAX= 
##$RELAX= 
##$RELAX= 
##$RELAX= 
##$RELAX= 
##$RELAX= 
$$ Bruker specific parameters
$$ --------------------------
##$DU= <C:\u>
##$EXPNO= 1390
##$NAME= <ADRS>
##$PROCNO= 1
##$TYPE= <nmr>
##$USER= <dgb>
##$AMP= (0..31)
100 100 100 100 100 100 100 100 100 100 100 100 100 100 100 100 100 100 
100 100 100 100 100 100 100 100 100 100 100 100 100 100 
##$AQSEQ= 0
##$AQ_mod= 3
##$AUNM= <au_zg>
##$AUTOPOS= <2 >
##$BF1= 250.13
##$BF2= 250.13
##$BF3= 250.13
##$BF4= 250.13
##$BF5= 500.13
##$BF6= 500.13
##$BF7= 500.13
##$BF8= 500.13
##$BYTORDA= 1
##$CFDGTYP= 0
##$CFRGTYP= 5
##$CHEMSTR= <none>
##$CNST= (0..31)
1 1 145 1 1 1 1 1 1 1 1 1 1 1 1 1 1 1 1 1 1 1 1 1 1 1 1 1 1 1 1 1 
##$CPDPRG= <>
##$CPDPRG1= <>
##$CPDPRG2= <>
##$CPDPRG3= <>
##$CPDPRG4= <mlev>
##$CPDPRG5= <mlev>
##$CPDPRG6= <mlev>
##$CPDPRG7= <mlev>
##$CPDPRG8= <mlev>
##$CPDPRGB= <>
##$CPDPRGT= <>
##$D= (0..31)
0 1 0 0 0 0 0 0 0 0.06 0 0 0 0 0 0 0.0002 0 0 0 0 0 0 0 0 0 0 0 0 0 0 
0 
##$DATE= 1143192536
##$DBL= (0..7)
120 120 120 120 120 120 120 120 
##$DBP= (0..7)
150 150 150 150 150 150 150 150 
##$DBP07= 0
##$DBPNAM0= <>
##$DBPNAM1= <>
##$DBPNAM2= <>
$$ [...]
##$SUBNAM7= <"">
##$SUBNAM8= <"">
##$SUBNAM9= <"">
##$SW= 20.6930455092707
##$SWIBOX= (0..15)
0 0 3 0 0 0 0 0 0 0 0 0 0 0 0 0 
##$SW_h= 5175.983436853
##$TD= 65536
##$TD0= 1
##$TE= 294.16
##$TE2= 300
##$TE3= 300
##$TEG= 300
##$TL= (0..7)
0 120 120 120 120 120 120 120 
##$TP= (0..7)
150 150 150 150 150 150 150 150 
##$TP07= 0
##$TPNAME0= <>
##$TPNAME1= <>
##$TPNAME2= <>
##$TPNAME3= <>
##$TPNAME4= <>
##$TPNAME5= <>
##$TPNAME6= <>
##$TPNAME7= <>
##$TPOAL= (0..7)
0.5 0.5 0.5 0.5 0.5 0.5 0.5 0.5 
##$TPOFFS= (0..7)
0 0 0 0 0 0 0 0 
##$TUNHIN= 0
##$TUNHOUT= 0
##$TUNXOUT= 0
##$USERA1= <user>
##$USERA2= <user>
##$USERA3= <user>
##$USERA4= <user>
##$USERA5= <user>
##$V9= 5
##$VALIST= <valist>
##$VCLIST= <CCCCCCCCCCCCCCC>
##$VD= 0
##$VDLIST= <DDDDDDDDDDDDDDD>
##$VPLIST= <PPPPPPPPPPPPPPP>
##$VTLIST= <TTTTTTTTTTTTTTT>
##$WBST= 1024
##$WBSW= 4
##$XGAIN= (0..3)
0 0 0 0 
##$XL= 0
##$YL= 0
##$YMAX_a= 185728
##$YMIN_a= -244450
##$ZGOPTNS= <>
##$ZL1= 120
##$ZL2= 120
##$ZL3= 120
##$ZL4= 120
##$ABSF1= 16.522
##$ABSF2= -4.171173
##$ABSG= 5
##$ABSL= 3
##$ALPHA= 0
##$AQORDER= 0
##$ASSFAC= 0
##$ASSFACI= 0
##$ASSFACX= 0
##$ASSWID= 0
##$AUNMP= <proc_1d>
##$AZFE= 0.1
##$AZFW= 0.1
##$BCFW= 0
##$BC_mod= 0
##$BYTORDP= 0
##$COROFFS= 0
##$CY= 12.5
##$DATMOD= 1
##$DC= 0
##$DFILT= <>
##$DTYPP= 0
##$F1P= 14.0000005364418
##$F2P= -0.99999901652339
##$FCOR= 0.5
##$FTSIZE= 32768
##$FT_mod= 6
##$GAMMA= 0
##$GB= 0
##$INTBC= 1
##$INTSCL= 1
##$ISEN= 128
##$LB= 0.3
##$LEV0= 0
##$LPBIN= 0
##$MAXI= 10000
##$MC2= 0
##$MEAN= 0
##$ME_mod= 0
##$MI= 0
##$NCOEF= 0
##$NC_proc= -4
##$NLEV= 6
##$NOISF1= 0
##$NOISF2= 0
##$NSP= 0
##$NTH_PI= 0
##$NZP= 0
##$OFFSET= 16.522
##$PC= 1
##$PHC0= 175.8444
##$PHC1= 7.246814
##$PH_mod= 1
##$PKNL= yes
##$PPARMOD= 0
##$PSCAL= 4
##$PSIGN= 0
##$REVERSE= no
##$SF= 250.13
##$SI= 32768
##$SIGF1= 0
##$SIGF2= 0
##$SINO= 400
##$SIOLD= 32768
##$SREGLST= <1H.CDCl3>
##$SSB= 0
##$STSI= 32768
##$STSR= 0
##$SW_p= 5175.98343685301
##$SYMM= 0
##$S_DEV= 0
##$TDeff= 65536
##$TDoff= 0
##$TI= <Analysis number 999999
Compound Code 99
Book Reference 9
Project Code 9>
##$TILT= no
##$TM1= 0
##$TM2= 0
##$TOPLEV= 0
##$USERP1= <user>
##$USERP2= <user>
##$USERP3= <user>
##$USERP4= <user>
##$USERP5= <user>
##$WDW= 1
##$XDIM= 32768
##$YMAX_p= 406841711
##$YMIN_p= -702201
$$ End of Bruker specific parameters
$$ ---------------------------------
##NTUPLES= NMR SPECTRUM
##VAR_NAME=  FREQUENCY,     SPECTRUM/REAL,   SPECTRUM/IMAG
##SYMBOL=    X,             R,               I
##VAR_TYPE=  INDEPENDENT,   DEPENDENT,       DEPENDENT
##VAR_FORM=  AFFN,          ASDF,            ASDF
##VAR_DIM=   32768,         32768,           32768
##UNITS=     HZ,            ARBITRARY UNITS, ARBITRARY UNITS
##FACTOR=    0.157963299565203, 1,           1
##FIRST=     4132.6476996994, 0,             0
##LAST=      -1043.33573715361, 0,           0
##MIN=       -1043.33573715361, -702201,     0
##MAX=       4132.6476996994, 406841711,     0
$$ Real data points
##PAGE= N=1
##DATA TABLE= (X++(R..R)), XYDATA
$$ [...]
23243B53708N1977J779m5423p1682j53248q2560l6202J09459n0020l4245j43489
$$ 253708 305685 307464 262041 190359 37111 -45449 -81651 27808 -22212 -56457 -199946
23232a99946M4877O8071J21136M8661j5734L6209j60644n0216O902K39268m7792
$$ -199946 -155069 -86998 34138 82799 67065 103274 -57370 -107586 -100684 138584 90792
23221I0792p8335j51902Q8937L3484j05708J12131J32282l4423o5174l6481L09824
$$ 90792 12457 -139445 -50508 -17024 -122732 -10601 121681 87258 22084 -14397 295427
23210B95427J39872k09694k73321j43523J41856K09391q1314n5263j70405j1868
$$ 295427 435299 225605 -47716 -191239 -49383 160008 78694 23431 -146974 -158842
23200a58842J29654m8798n383J80603j59096l7695o5163r3441j91592J56740q1391
$$ -158842 -29188 -77986 -83369 97234 -61862 -99557 -164720 -258161 -449753 -293013 -374404
23189c74404j29952Q8087N5247J39884J21843M5662P8741N8193J26559k9246L1413
$$ -374404 -504356 -416269 -361022 -221138 -99295 -53633 25108 83301 209860 180614 212027
23178B12027n1322l7668k3910R1111J88233j42343p5368q4108j46658j21874L6182
$$ 212027 160705 123037 99127 190238 378471 236128 160760 76652 -70006 -191880 -155698
23167a55698O3973M8058N3751K5908r4385o0670P8698P8722r8585Q736p101P4863
$$ -155698 -91725 -43667 10084 35992 -58393 -119063 -40365 38357 -60228 -51492 -58593 16270
23155A6270k9417r7802J2108J36942L9814l09137j02911J00113q81Q1451J37029
$$ 16270 -13147 -110949 -98841 38101 77915 -231222 -334133 -234020 -234901 -153450 -16421
23144a6421J99714j31673j92832j8619R8014L8018k3545j559R7939l2335j01926
$$ -16421 183293 51620 -141212 -159831 -61817 -23799 -47344 -48903 49036 16701 -85225
23133h5225n5543o979J31751J07358J21466j7593p0008j4096r4871l0190J77919
$$ -85225 -140768 -147747 -15996 91362 212828 195235 125227 111131 16260 -13930 163989
23122A63989p7152p238Q2591M5257k51478j92430J42426J6800j07326r0140J3431
$$ 163989 86837 79599 162190 207447 -44031 -236461 -94035 -77235 -184561 -274701 -261270
23111b61270M416K688q6056R6258L7703R1932L8285L5272K2526o1424m121k8856
$$ -261270 -256854 -254166 -340222 -243964 -206261 -114329 -76044 -40772 -18246 -79670 -83791 -112647
23099a12647k5556N7594q925J1144O9394J09526J18617j57559q7560q746k2281
$$ -112647 -138203 -80609 -89534 -78390 -8996 100530 219147 61588 -25972 -34718 -56999
23088e6999m9644m8690j9065j32365p4564K38200m9522j27454J14633J28705r9310
$$ -56999 -106643 -155333 -174398 -306763 -381327 -143127 -192649 -320103 -205470 -76765 -176075
23077a76075j27470l4643j3741J53959K80289n831n1003L18350N8238m9847P039
$$ -176075 -303545 -338188 -351929 -197970 82319 76488 25485 343835 402073 352226 359265
23066C59265m314m8895q2942j94598K4303k5739M6614r689n8908j40800k25573
$$ 359265 354951 306056 223114 28516 52819 27080 73694 64005 5097 -135703 -361276
23055c61276k7735K70911K10446K6219j0319M9558j5047k6129o2514M2133J55414
$$ -361276 -389011 -118100 92346 118565 108246 157804 142757 116628 54114 96247 251661
23044B51661L9908q6070N3774J50643k30643j14303n6418J18371m6772j27505
$$ 251661 291569 205499 259273 409916 179273 64970 8552 126923 80151 -47354
23034d7354O0892r4565j00604j44451n6134J11290K07582J74477M7469j29580
$$ -47354 13538 -81027 -181631 -326082 -382216 -270926 -63344 111133 158602 29022
23024B9022K3153P8659J27882J6855m6263q5017l8379M1735l5039L3318L861j61765
$$ 29022 52175 130834 258716 275571 229308 144291 105912 147647 112608 145926 149787 -11978
23012a1978n4933J31354q8219L4287L1713P8373Q5839J01201j20080r8836J29836
$$ -11978 -66911 64443 -23776 10511 42224 120597 206436 307637 187557 88721 218557
23001B18557J04091p3233o0100O033k14862P705N6674M6834J61456n1172r44P7415
$$ 218557 322648 249415 189315 195348 -19514 -11809 44865 91699 253155 201983 201039 278454
22989B78454K5267j69514O0616K5112j99286k01161Q2857k6684j26981J52573
$$ 278454 303721 134207 194823 219935 20649 -180512 -97655 -124339 -251320 -98747
22979i8747k7299p0086n3463l29520r4985R6821K33830R1727J13621J04820K04712
$$ -98747 -126046 -196132 -249595 -579115 -674100 -577279 -343449 -251722 -138101 -33281 171431
22968A71431J97314j16829l30638j35664J04660K14296J40808j71631k1842j32002
$$ 171431 368745 251916 -78722 -214386 -109726 104570 245378 73747 51905 -80097
22958h0097k79868K4787K42160O8246R7568J57663j90129k42243o806k1371q41
$$ -80097 -359965 -335178 -93018 -24772 72796 230459 40330 -201913 -208719 -230090 -230931
22947b30931L6379j8665N9337R4730j4699K06637O000k71773j44679P5201J16872
$$ -230931 -194552 -213217 -153880 -59150 -73849 132788 138788 -132985 -277664 -202463 -85591
22936h5591K4507j07152l2066L17938M2622j86986j05151P8100l8936J7005M2789
$$ -85591 -61084 -168236 -200302 117636 160258 -26728 -131879 -53779 -92715 -75710 -32921
22925c2921r6851O8977N9856j62604j08931O3773P2517N0367j4993O1359r0006
$$ -32921 -129772 -60795 -939 -163543 -272474 -208701 -136184 -85817 -100810 -39451 -129457
22914a29457k1964J58793O3465N4517j95632k75841r4338J38983J93371O9371
$$ -129457 -151421 7372 70837 125354 -70278 -346119 -440457 -301474 -108103 -38732
22904c8732O9519M8564J3951M5931J12570R9901k27891l6604L7681j2505r2072
$$ -38732 30787 79351 93302 139233 251803 351704 123813 87209 124890 112385 20313
22893B0313j05129P8929R1164K2865O8312m1183k38697r6981j33173J37142J77028
$$ 20313 -84816 -5887 85277 108142 176454 135271 -103426 -200407 -333580 -196438 -19410
22882a9410J6150m8740j37904M6450J20084n5126R4928j6212k2090j0907K336
$$ -19410 -3260 -52000 -189904 -143454 -23370 -78496 16432 220 -21870 -32777 -30441
22871c0441J54967k397M0992n8943r3748j20259n8407J13689O8994O2481J32230
$$ -30441 124526 122129 163121 104178 10430 -109829 -168236 -54547 14447 76928 209158
22860B09158J2342j28958r1732M6331J05192r1678j87584L872k2004q6243R7386
$$ 209158 221500 92542 810 47141 152333 60655 -126929 -123057 -145061 -231304 -133918
22849a33918p2779P8128j2620N3524J81738p5425o7659J83506M9025j36205l1965
$$ -133918 -206697 -128569 -141189 -87665 94073 18648 -49011 134495 183520 47315 15350
22838A5350J2959R9327L6453k6746n549m4527R5649k9443q4186N1098J16483M6812
$$ 15350 28309 127636 164089 137343 131794 87267 182916 153473 69287 120385 236868 283680
22826B83680M5811k13740K0580K0308k24616q3493l3306P7612j15508n7129J97738
$$ 283680 329491 115751 136331 156639 -67977 -151470 -184776 -107164 -222672 -279801 -82063
22815h2063J52897q4261k1134o708K9048J06810J31311j25882q0234J29945J2427
$$ -82063 70834 -13427 -34561 -41269 -12221 94589 225900 100018 19784 149729 162156
22804A62156P1224o9411k03781q6060j15323m4805R7546J18961j6492k2181M8902
$$ 162156 233380 163969 -39812 -125872 -241195 -286000 -188454 -69493 -85985 -108166 -59264
22793e9264P8314M4747j44494j1022L2582K7410J78140J6403k02821n9875K5642
$$ -59264 19050 63797 -80697 -91719 -59137 -31727 146413 162816 -40005 -99880 -74238
22782g4238R632J81730O8037L4661p4259R1152j4434J04943l7267P5395l0717
$$ -74238 -64606 117124 185161 219822 145563 236715 222281 327224 289957 365352 334635
22771C34635k56687n2809r8971j14763Q8699p7345Q8919Q2513N3965j01733p6634
$$ 334635 77948 25139 -73832 -188595 -99896 -177241 -88322 -5809 48156 -53577 -130211
22760a30211J02229J28183K0104p0613k4546o6269J35486n4963Q2105J25594n4256
$$ -130211 -27982 100201 120305 49692 25146 -41123 94363 39400 121505 247099 192843
22749A92843j01113j18670j45380J87780K25425p4383j88653j45413Q7180Q9150
$$ 192843 91730 -26940 -172320 15460 240885 166502 -22151 -167564 -80384 8766
22739H766P493q0721L0130J54350j30084L4016o3123J08106l507K4013p4481j55771
$$ 8766 16259 -64462 -34332 120018 -10066 23950 -39173 68933 65426 89439 14958 -140813
22727a40813p3415N233J2714K12202O4988O6522O8397J52992j75370q8064j11046
$$ -140813 -214228 -208995 -196281 15921 80909 147431 215828 368820 193450 105386 -5660
22716e660j39849j9689K799J10667M6313J69804K7873j23635J60354j46195J02691
$$ -5660 -145509 -165198 -162399 -51732 -5419 164385 192258 68623 228977 82782 185473
22705A85473j1212L1465K3381j30019J21163m3956j07460r7163p9115J724M0379
$$ 185473 174261 205726 229107 99088 220251 176295 68835 -28328 -107443 -105719 -65340
22694f5340N9712m8576j58983Q5247L8133m734L069R854L885o3074O3382Q347
$$ -65340 -5628 -54204 -213187 -127940 -89807 -94541 -91472 -81618 -77733 -140807 -77425 -69078
22682f9078O4041J03761q0256k49341J9224L3831J56004n9144J16694J35834k2215
$$ -69078 -5037 98724 18468 -230873 -211649 -177818 -21814 -80958 35736 171570 149355
22671A49355J43236J71071k632j66448j75158K7394N9927k02155N8884O3389n7842
$$ 149355 292591 463662 461030 294582 119424 146818 206745 4590 63474 126863 69021
22660F9021L0067M9333J18277n6059j9178n6216p427L3836L3293k06048j31268
$$ 69021 99088 148421 266698 210639 191461 135245 127818 161654 194947 -11101 -142369
22649a42369J9071K17518L396m0793O1857n1270j06007J4800L11071K214j20945
$$ -142369 -123298 94220 97616 56823 118680 67410 -38597 -23797 287274 289488 168543
22638A68543j95844j25986R56n4970j01734P1195J80686J27626Q7443n4476j81030
$$ 168543 -27301 -153287 -152331 -207301 -309035 -237840 -57154 70472 157915 103439 -77591
22627g7591M141L142k3946O1046m7796J43344k6069p0135j87995n7924M5445J58750
$$ -77591 -73450 -70308 -94254 -33208 -81004 62340 36271 -33864 -221859 -279783 -234338 -75588
22615g5588j45912J0640J65306q3874J11162J19739m1480j1494q2506N9936k4854
$$ -75588 -221500 -210860 -45554 -129428 -18266 101473 59993 48499 -34007 25929 1075
22604A075m3416j1608l3062M2414o596K0523j1941L6494p6906j94915O1662J39919
$$ 1075 -42341 -53949 -87011 -44597 -51193 -30670 -42611 -6117 -83023 -277938 -216276 -76357
22592g6357J38382q3662o059j37307o6645Q5880l153j47308n5673J09879O0833
$$ -76357 62025 -21637 -27696 -165003 -231648 -145768 -148921 -296229 -351902 -242023 -181190
22581a81190J02299N6508K72376K40833m4593j34721l76576n4250K20758k2944
$$ -181190 -78891 -22383 249993 490826 446233 311512 -65064 -119314 101444 78500
22571G8500r3328P1184m8558j8357L1495O1059r3023Q457k14854j4022K6481P376
$$ 78500 -14828 56356 7798 -10559 20936 81995 -11028 -2571 -217425 -231447 -204966 -197590
22559a97590j6422m0457J9027K00021Q0933o7502k5130q6710p8744k69571M9573
$$ -197590 -214012 -254469 -235442 -35421 45512 -21990 -47120 -133830 -212574 -482145 -432572
22548d32572K25787M7424N0912Q6331l8700j1556J28753N7232j0065j03701o1766
$$ -432572 -206785 -159361 -108449 -22118 -60818 -72374 56379 113611 103546 -155 -61921
22537f1921q9039J4275R4088m745j86011J43889L28685j1546l06592j03828J14861
$$ -61921 -150960 -136685 -42597 -47342 -233353 -89464 239221 227675 -78917 -182745 -67884
22526f7884K65566P3404r890m9785j76241j75480j47675R6220J09515J101K9317
$$ -67884 197682 271086 261196 211411 35170 -140310 -287985 -191765 -82250 -81149 -51832
22515e1832J08669q1158O011n0112j45472J12492J36943J14455o0959Q3934N9420
$$ -51832 56837 -24321 -18310 -68422 -213894 -101402 35541 149996 89037 172971 232391
22504B32391k00469j23313l0294r6354J64939J78984j19510q3395L5097J16937
$$ 232391 31922 -91391 -121685 -218039 -53100 125884 6374 -77021 -41924 75013
22494G5013M203k51061n8416K16851K09076m1808j65271L5460O5863q7229m3870
$$ 75013 79216 -171845 -230261 -13410 195666 153858 -11413 24047 89910 2681 -41189
22483d1189L7884K78107r4624j90129j4996O4645n7912p4208P9325j44713k08314
$$ -41189 -3305 274802 180178 -9951 -24947 39698 -18214 -92422 -13097 -157810 -366124
22472c66124J53503J1538K545K7949q1427J11134p3520J51470R5000j82706j61958
$$ -366124 -212621 -201083 -198538 -170589 -252016 -140882 -214402 -62932 32068 -150638 -312596
22461c12596J26153L0861J11665J08597j99774n6453K1464J23807o15q1926J0003
$$ -312596 -186443 -155582 -43917 64680 -135094 -191547 -170083 -46276 -46891 -128817 -118814
22450a18814J56648R982N1776m8293r6302J46181L7863N169j56646j04072N0654
$$ -118814 37834 47816 99592 51299 -45003 101178 139041 144210 -12436 -116508 -65854
22439f5854M0443M4186j42693j66562J51030J07306L1648K3351o0300j58748j02256
$$ -65854 -25411 18775 -123918 -290480 -139450 -32144 -496 22855 -37445 -196193 -298449
22428b98449J30505j39079Q9276K30253j51446j10765J22583K28616q1018k24543
$$ -298449 -167944 -307023 -217747 12506 -138940 -249705 -127122 101494 20476 -204067
22418b04067O5547j02072J31381J12423p7463j03770J39807J25213j55699o5225
$$ -204067 -138520 -240592 -109211 3212 -74251 -178021 -38214 86999 -68700 -133925
22408a33925O3184k0893J36037K17713m740o6786k32288k68967R3369J28654J36571
$$ -133925 -70741 -91634 44403 262116 257376 190590 -41698 -310665 -217296 -88642 47929
22397D7929l4722j70499Q3309m5789k2300J38786L4079R2410k934L0848O8315
$$ 47929 13207 -157292 -73983 -119772 -142072 -3286 30793 123203 120269 151117 219432
22386B19432k5657j20722m9224Q3040o5611k43093j23673R3019N3092J01949K82423
$$ 219432 193775 73053 23829 106869 41258 -201835 -325508 -232489 -179397 -77448 204975
22375B04975j16196o5371J98021j16989o6283p1267J35778J9931j15317r9618
$$ 204975 88779 23408 221429 104440 38157 -33110 102668 122599 7282 -92336
22365i2336j32263q6906K7634P7781K02668J98522j55880m1291J54131j84956
$$ -92336 -224599 -311505 -283871 -206090 -3422 195100 39220 -2071 152060 -32896
22355c2896p1312J82682J88835m8096r1060k33105j05798O2789J92713Q0304j030
$$ -32896 -104208 78474 267309 219213 128153 -104952 -210750 -147961 44752 125056 124026
22344A24026J6814L0992j4375j97396k06553J2596N6701J56170l9423j05965J13138
$$ 124026 140840 171832 157457 -39939 -246492 -233896 -177195 -21025 -60448 -166413 -53275
22333e3275l9136L8182p4533p3127J607K33374J4340q3790p457M1154Q5168L4235
$$ -53275 -92411 -54229 -128762 -201889 -200282 33092 47432 -36358 -43815 -2661 82507 116742
22321A16742j0482p7876M4819J63392o8516l0913K9768k3623P8250J812k95283
$$ 116742 106260 28384 73203 236595 168079 137166 166934 143311 221561 223373 -71910
22310g1910O5413K15220P465k09431j45727j59576p2803R3440M6912j32369J33503
$$ -71910 -6497 208723 216188 6757 -138970 -298546 -371349 -277909 -230997 -363366 -229863
22299b29863J098n0587K11552L8824J14907o2868M4387O5479M1389M1384J44860
$$ -229863 -228765 -279352 -67800 -28976 85931 23063 67450 132929 174318 215702 360562
22288C60562O8205o3411q6778J00622j6622j99939j57913n5831L898p282k15602
$$ 360562 428767 365356 278578 379200 362578 162639 4726 -51105 -47207 -54489 -270091
22277b70091R156N1494L8334K16429m9655n4830j16070o7746N2120j3694j05858
$$ -270091 -260935 -209441 -171107 45322 -4333 -59163 -175233 -242979 -190859 -204553 -310411
22266c10411O3517Q2280j08024r3683P4585o23Q9395o5840O3929P2617J02806
$$ -310411 -246894 -164614 -272638 -366321 -291736 -292359 -202964 -268804 -204875 -132258 -29452
22255b9452P3218j96212k28157J30295R3915M6901k428l6818Q3038M0283j8839
$$ -29452 43766 -152446 -380603 -250308 -156393 -109492 -111920 -148738 -65700 -25417 -44256
22244d4256j30462N6383J63068Q7781l8929n919o4034k6498R5260l263k0311L5733
$$ -44256 -174718 -118335 44733 132514 93585 87666 23632 -2866 92394 89131 68820 104553
22232A04553j10116J8112n6039r6894j5646N7911P0906o9122l34796m2666J90219
$$ 104553 -5563 12549 -43490 -140384 -156030 -98119 -27213 -96335 -431131 -473797 -283578
22221b83578K49662N0499r8346n4312Q0634N3494o5200o2279J52069n5243q7502
$$ -283578 -33916 16583 -81763 -136075 -55441 -1947 -67147 -129426 22643 -32600 -120102
22210a20102q9269k308k6542q9553j17941L06811K73502J2587K9546j04730p1392
$$ -120102 -209371 -211679 -238221 -327774 -445715 -138904 134598 147185 176731 72001 609
22199F09l9027J62375J22212j06297L879J03370j39849o9341N7415r2509j43255
$$ 609 -38418 123957 246169 139872 143751 247121 107272 37931 95346 2837 -140418
22188a40418J04182J50092p0127L5125n1170n7960l4952k9302M3356n5687L2766
$$ -140418 -36236 113856 43729 78854 27684 -30276 -65228 -94530 -51174 -106861 -74095
22177g4095j9148j12536K8411J0781J0824J01448J63124o4881o1082Q4633j61820
$$ -74095 -93243 -205779 -177368 -166587 -155763 -54315 108809 43928 -17154 67479 -94341
22166i4341j20852j09423J3292k0300r2817P1084J92054J47775p9722j38864j29771
$$ -94341 -215193 -324616 -311324 -331624 -424441 -353357 -161303 -13528 -93250 -232114 -361885
22155c61885J33970o3109j44711J0938O6592J73726K55811K89853L9947j07145
$$ -361885 -227915 -291024 -435735 -424797 -358205 -184479 71332 361185 401132 293987
22145B93987j78151r409j5766k12505q4333L5040J25316j07490k7298M0809L6568
$$ 293987 115836 106427 90661 -121844 -206177 -171137 -45821 -153311 -180609 -139800 -103232
22134a03232J17148J00409K33159o7570l4880n9633j6890K8601L594k34394k0043
$$ -103232 13916 114325 347484 279914 245034 185401 168511 197112 200706 -33688 -53731
22123e3731J09570m9845m7749j22399q4125r2030M725K31485M9650m4430N7040
$$ -53731 55839 5994 -41755 -164154 -248279 -340309 -335584 -104099 -54449 -98879 -41839
22112d1839j41215J5373K93305L6629r1247j65630k6463j15120n0116L5375J53952
$$ -41839 -183054 -167681 125624 162253 71006 -94624 -121087 -236207 -286323 -250948 -96996
22101i6996j8781L1483M9077O8474r2991L16k5232n9320K08286J05371j01563
$$ -96996 -115777 -84294 -35217 33257 -59734 -59418 -84650 -143970 64316 169687 68124
22090F8124j09514K3228M1226K4604o433L3813l4117J49300O0380j29131o2442
$$ 68124 -41390 -18162 23064 47668 41235 75048 40931 190231 250611 121480 59038
22079E9038p9941p7167M10k22388L6068J24908N8008j65018r6619J48129J38554
$$ 59038 -20903 -98070 -97660 -320048 -283980 -159072 -101064 -266082 -362701 -214572 -76018
22068g6018O272o9102J31358P4084o5767J08907j41492j99230K13754j9486k4088
$$ -76018 -69746 -138848 -7490 66594 827 109734 -31758 -230988 -17234 -36720 -60808
22057f0808O3334l6886k6320P9088J6730n1952j25226Q0225Q7181L6815K1927
$$ -60808 2526 -34360 -60680 18408 35138 -16814 -142040 -61815 25366 62181 84108
22046H4108n6509Q0558P8982p0255k5462P9869J33700Q4910J3790r8746O4950
$$ 84108 27599 108157 187139 116884 91422 171291 304991 389901 403691 304945 369895
22035C69895j3146k32379j0224J34287l2928J44037K1069j44514l5705J5972N6036
$$ 369895 356749 124370 114146 248433 215505 359542 380611 236097 200392 216364 272400
22024B72400j03487l5358P8865j47163k00727P8673q1701k37913r853J26733K6961
$$ 272400 168913 133555 212420 65257 -135470 -56797 -138498 -376411 -386264 -259531 -232570
22013b32570R9790J50845l6448k887j9872J50529J33319k0871o2478q1249Q6077
$$ -232570 -132780 18065 -18383 -21270 -41142 109387 242706 221835 159357 78108 164185
22002A64185J02456o50q1455J8783O960l24485o5296p4275L8317J32618K3134
$$ 164185 266641 265991 184536 203319 210279 -114206 -179502 -253777 -215460 -82842 -59708
21991e9708q9426J25616K2014j91362j65738J65341J19011J38459J71156J46551
$$ -59708 -149134 -23518 -1504 -192866 -358604 -193263 -74252 64207 235363 381914
21981C81914O3659N520N7688q0852n2116j49223k2478k1156R252j57516j14591
$$ 381914 445573 451093 508781 427929 375813 226590 204112 182956 192208 34692 -79899
21970g9899j17692J84764J21409j79478L8577n9065j00492P8009L9428l37101
$$ -79899 -197591 -12827 108582 -70896 -32319 -91384 -191876 -113867 -74439 -411540
21960d11540J45489J58398J5257o8828k5575P426l4057j31919J45283P9348K3364
$$ -411540 -266051 -107653 -92396 -161224 -186799 -179373 -213430 -345349 -200066 -120718 -97354
21949i7354p754M9423L0678l6591p4745O0755q1151J29128J43669m6970j49145
$$ -97354 -105108 -55685 -25007 -61598 -136343 -75588 -156739 -27611 116058 69088 -80057
21938h0057p6400P0441J81917M5071p9985J78624K9660M0829M5084p8168k46284
$$ -80057 -156457 -86016 95901 140972 60987 239611 269271 310100 355184 277016 30732
21927C0732q5066K5977Q1436M1869q932N8278j10983K34855J71862j79539k20255
$$ 30732 -54334 -28357 53079 94948 86016 144294 33311 268166 440028 260489 40234
21916D0234j08666r4467m4681P121o0528O5814K8996J54666Q8629k1448L4988
$$ 40234 -68432 -162899 -207580 -200459 -260987 -195173 -166177 -11511 77118 55670 90658
21905I0658J0461J18537J29161j57673j80694k95156J10992Q9762n0854k8867
$$ 90658 101119 219656 348817 191144 10450 -284706 -173714 -83952 -134806 -163673
21895a63673n0073n2442J6136j28166O4129J56558P9444k51739j64219J79808
$$ -163673 -213746 -266188 -250052 -378218 -314089 -157531 -78087 -329826 -494045 -314237
21885c14237N9498L14739N4365k76565j7541J44883j1594R6485j29078j95188
$$ -314237 -254739 60000 114365 -162200 -179741 -34858 -46452 50033 -79045 -274233
21875b74233p2515k601M6124R7689m5097P1671J77957j10230j24887l6513P3417
$$ -274233 -346748 -349349 -303225 -205536 -250633 -178962 -1005 -111235 -236122 -272635 -199218
21864a99218J49754J96372l8036r4401j15303J33348K42678k15059j69575M0766
$$ -199218 -49464 146908 108872 14471 -100832 32516 275194 60135 -109440 -68674
21854f8674n3918j07716n4588m6627J44272l5745L9349R4940J5506j73062j5829
$$ -68674 -122592 -230308 -284896 -331523 -187251 -222996 -183647 -88707 -73201 -246263 -262092
21843b62092J02727K1784l9533j09648o8503L1997J37792L7055K6690K85707J22585
$$ -262092 -159365 -137581 -177114 -286762 -355265 -323268 -185476 -148421 -121731 163976 286561
21832B86561o6543M2032j36489j70921r0903R1910J24158J0209N3049N0502K3660
$$ 286561 220018 262050 125561 -45360 -136263 -44353 79805 90014 143063 193565 217225
21821B17225p7022j86692L5541J33630J5756p4641r8824N835O0551j22195j13893
$$ 217225 140203 -46489 -10948 122682 138438 63797 -35027 -29192 31359 -90836 -204729
21810b04729p652M2747J78317K18575P5223n7124k68933j64994p5006j96849j30999
$$ -204729 -212381 -169634 8683 227258 302481 245357 -23576 -188570 -263576 -460425 -591424
21799e91424Q2958K04682K46634j4487l608n3910Q820J40769m5053k9007j28815
$$ -591424 -508466 -303784 -57150 -71637 -75245 -129155 -120335 20434 -24619 -53626 -182441
21788a82441j41088K8615L18982P1680o4184j06462J1181P4645J17171k2457j7578
$$ -182441 -323529 -294914 24068 95748 31564 -74898 -63717 10928 128099 105642 88064
21777H8064K6215j51946j35604P0533Q8303o0679O165l9208L1387L7191o8349
$$ 88064 114279 -37667 -173271 -102738 -14435 -75114 -68949 -108157 -76770 -39579 -107928
21766a07928k4679J0299q9787r808L5177j6438N8374n1375j9564j68756j01321
$$ -107928 -132607 -122308 -212095 -221903 -186726 -203164 -144790 -196165 -215729 -384485 -485806
21755d85806J8189J20091J83224M7985J30243N7595k6337J2436j23839M5677k5970
$$ -485806 -467617 -347526 -164302 -116317 13926 71521 45184 57620 -66219 -20542 -46512
21744d6512J1297j07812j58551K84045K01283k28518k00159k2424L6558J22183
$$ -46512 -35215 -143027 -301578 -17533 183750 -44768 -244927 -267351 -230793 -108610
21734a08610r5537l9438n4973J36295J71160J33764J49214p4184j18138j81087
$$ -108610 -204147 -243585 -298558 -162263 8897 142661 291875 217691 99553 -81534
21724h1534J3562M5829M0599J15341P6603j6863J9990q0591j48944r581L8161
$$ -81534 -67972 -22143 18456 133797 210400 193537 213527 132936 -16008 -25589 12572
21713A2572J28097j11852j43482o0399R8822J40279P8337r4612j71706j10435
$$ 12572 140669 28817 -114665 -175064 -76242 64037 142374 47762 -123944 -234379
21703b34379R288P4598K02395q3561Q5323j0581p6835k7182Q6540J99L033O4173
$$ -234379 -225091 -150493 51902 -31659 53664 43083 -33752 -60934 25606 25805 28838 93011
21691I3011P5396j90213n7965J68216l2517r8796m2200K244O1518j67640J28166
$$ 93011 168407 -21806 -79771 88445 55928 -42868 -85068 -82824 -21306 -188946 -60780
21680f0780J40597j19152k11303k129J22384N5994J09297j136j45530O9883P0220
$$ -60780 79817 -39335 -250638 -252767 -130383 -74389 34908 33772 -111758 -41875 28345
21669B8345k37896P1253O7366j27446j01642J56900J50595q3570n7558J0040J93595
$$ 28345 -209551 -138298 -70932 -198378 -300020 -143120 7475 -76095 -133653 -123613 69982
21658F9982p337j37523P4006K9887p1596o388k316P1277q4056L850l2846o7683
$$ 69982 62645 -74878 -872 29015 -42581 -48969 -51285 19992 -64064 -60214 -93060 -160743
21646a60743M9121J08807Q4544M0311j18985J06877N479o1754r4246j2050N1395
$$ -160743 -111622 -2815 81729 122040 3055 109932 115411 53657 -40589 -52639 -1244
21635a244L4091j8865K1382M4573J99386m74j866Q133M3386j39927O37k2356L7996
$$ -1244 32847 13982 35364 79937 279323 278849 276983 285116 328502 188575 189212 166856 204852
21622B04852N9090M1134j18032P0576K02354r8710j47997j5510j81844l9015L6785
$$ 204852 263942 305076 187044 257620 459974 361264 213267 197757 15913 -23102 13683
21611A3683j62054m2135J0547K13159J02898k406n0308n2519k52321m2264L747
$$ 13683 -148371 -190506 -179959 33200 136098 133692 83384 30865 -221456 -263720 -259973
21600b59973p9329K0768K5460N4571r5707m2045q069M2192J08499O0786J08194
$$ -259973 -339302 -318534 -293074 -238503 -334210 -376255 -384324 -342132 -233633 -172847 -64653
21589f4653K2133j45364K0162L2123L2408k34329n9722J8345J10772Q2262J53501
$$ -64653 -42520 -187884 -167722 -135599 -103191 -337520 -397242 -378897 -268125 -185863 -32362
21578c2362J71308N6403J7488q7336n4947J24866P6942j21177k20813o3196J92999
$$ -32362 138946 195349 212837 125501 70554 195420 272362 151185 -69628 -132824 60175
21567F0175j74131n933O1182r0449o5204P8806m086Q5841Q0074q5139r8307n4968
$$ 60175 -113956 -119889 -58707 -149156 -214360 -135554 -139640 -53799 26275 -58864 -157171 -212139
21555b12139N9735J00689l4852M8182J27050r7923m6775m5180K27797P2334j78095
$$ -212139 -152404 -51715 -86567 -38385 88665 -9258 -56033 -101213 126584 198918 20823
21544B0823k2554J08159L1414k24215r6830R1439n209j22525P9231J77372j20766
$$ 20823 -1731 106428 137842 -86373 -183203 -91764 -96973 -219498 -140267 37105 -83661
21533h3661L4521o8869o8616p255Q8433Q8473j6120M2905p9196j78056J9330J18762
$$ -83661 -49140 -118009 -186625 -193880 -105447 -16974 -33094 9811 -69385 -247441 -228111 -109349
21521a09349M8350j81533J14191J47198J97259R3486J7217J8917k7761r8980k26162
$$ -109349 -60999 -242532 -128341 18857 216116 309602 326819 345736 317975 218995 -7167
21510g167j62207j78203j25310K6894J08132J02229J31841j50864r9331J15630
$$ -7167 -169374 -347577 -472887 -445993 -337861 -235632 -103791 -254655 -353986 -238356
21500b38356M0690r0978K5183J17181J30821l6125k8463J79422O2174j47622l5907
$$ -238356 -197666 -288644 -263461 -146280 -15459 -51584 -80047 99375 161549 13927 -21980
21489b1980l5577J44309p6196p9167M6933j1203q5897o3334J1773J55358K40835
$$ -21980 -57557 86752 10556 -68611 -21678 -32881 -118778 -182112 -170339 -14981 225854
21478B25854j60606R002k6417k7581j7233j8725O630j34099R8855j8977k00167
$$ 225854 65248 74250 47833 20252 3019 -15706 -9076 -143175 -44320 -63297 -263464
21467b63464J2482N3578J28614J03209M430j79829n3430Q7099m9725r9095j034
$$ -263464 -250982 -197404 -68790 34419 38849 -140980 -194410 -107311 -157036 -256131 -257165
21456b57165J20861R0658J65252J1101J1848R708r7729J13862j1938j6805r8039
$$ -257165 -136304 -45646 119606 130707 142555 152263 54534 168396 156458 139653 41614
21445D1614l6334n3405r4912n7599J23616Q2687j05168O3490J1697Q136J10465
$$ 41614 5280 -48125 -143037 -200636 -77020 5667 -99501 -36011 -24314 -16178 94287
21434I4287J62258j285j20776M759J57298L1576j85674l0176j33164j510m0703
$$ 94287 256545 255260 134484 139243 296541 328117 142443 112267 -20897 -22407 -63110
21423f3110J65290Q7197j65363j36830K05333J27439j24975N5100K8815j19431
$$ -63110 102180 189377 24014 -112816 92517 219956 94981 150081 178896 59465
21413E9465n8085k3523K2616k3525J63275N1594Q649k03710j11595L3721n4034
$$ 59465 1380 -22143 473 -23052 140223 191817 200466 -3244 -114839 -81118 -135152
21402a35152j6331J44109k13572l5152J17521J38312J13570l5480J25419J9497
$$ -135152 -151483 -7374 -220946 -256098 -138577 -265 113305 77825 203244 222741
21392B22741O45L9069j32955p6905j23897K6063R1308O5700j1413P9201R7942
$$ 222741 223386 262455 129500 52595 -71302 -45239 46069 111769 100356 179557 277499
21381B77499L896n8414o0973M9992J03960j19309M376o1482q7982k9596O884M1305
$$ 277499 281395 222981 162008 212000 315960 196651 201027 139545 51563 21967 28851 70156
21369G0156j08449j0126j038N2377j10914m5898K07971J14962k4722m9326o9729
$$ 70156 -38293 -48419 -49457 2920 -107994 -153892 54079 169041 144319 94993 25264
21358B5264j79456j55896J53107K19387N0392j30713r4602J30019o5500k33618
$$ 25264 -154192 -310088 -156981 62406 112798 -17915 -112517 17502 -47998 -281616
21348b81616J487O1778J18202j10723J33715J10349p5718q4582J2158J14624J4741
$$ -281616 -280129 -218351 -100149 -210872 -77157 33192 -42526 -127108 -114950 -326 14415
21337A4415K5804J07774Q2950k58885p6456p6535n305J18656J35593j3364j32077
$$ 14415 40219 147993 230943 -27942 -104398 -180933 -186238 -67582 68011 54647 -77430
21326g7430N2774M2934j13902J55592L7625r3787j8580P410k57985l8176O3741
$$ -77430 -24656 18278 -95624 59968 97593 3806 -14774 -7364 -265349 -303525 -239784
21315b39784r504K34775J57175L6129L2653q7182j18750j28593k1106J7514j69478
$$ -239784 -249288 -14513 142662 178791 211444 124262 5512 -123081 -144187 -126673 -296151
21304b96151R1403O4367j00190O3265J59465N8105l3153K6238o7440q2387Q3769
$$ -296151 -204748 -140381 -240571 -177306 -17841 40264 7111 33349 -34091 -116478 -32709
21293c2709N0074J60869r9276p6881L08771J24500j89676k45555m8517J01761
$$ -32709 17365 178234 78958 2077 310848 435348 245672 117 -48400 53361
21283E3361n3441j58364J20333O7814K50285O1699k35725j23598J24310M5627
$$ 53361 -80 -158444 -38111 29703 279988 341687 105962 -17636 106674 152301
21273A52301k00790r6740n513K4067P5903k1635r5803N7043k03915K9680L6752
$$ 152301 -48489 -145229 -150742 -126675 -50772 -72407 -168210 -111167 -315082 -285402 -248650
21262b48650M7002J70613L802p8277J8805J17496J80888l9385k27815j75905J07696
$$ -248650 -201648 -31035 -27233 -105510 -86705 30791 211679 172294 -55521 -231426 -123730
21251a23730K00126m7859K2650j72768j56231O0561j6437M9820Q6120P7455M5662
$$ -123730 76396 28537 51187 -121581 -277812 -217251 -233688 -183868 -97748 -20293 25369
21240B5369j82830P5124J98649p176p6571M1541J29379j03225N6602j7952K0576
$$ 25369 -157461 -82337 116312 109136 32565 74106 203485 100260 156862 138910 159486
21229A59486n7879j5983J082j41686P019J1761P6446n8920j75855N303J26955
$$ 159486 101607 85624 86706 -54980 -47961 -36200 40246 -18674 -194529 -189226 -62271
21218f2271J04611O2319l0692j55688k8056J63810j4615j25033K1216l742K0941
$$ -62271 42340 104659 73967 -81721 -109777 54033 39418 -85615 -64399 -68141 -47200
21207d7200O4121N9182j57838j28414J48463J28695K751j69154J00582R0489j44946
$$ -47200 16921 76103 -81735 -210149 -61686 67009 69760 -99394 1188 91677 -53269
21196e3269O0041J8993k28274j41826J25920O2509R270J4443m5790P0054j04145
$$ -53269 6772 25765 -202509 -344335 -218415 -155906 -146636 -132193 -177983 -107929 -212074
21185b12074l1326K50788M7848J51722o7171k51805P8419j02951j8143J0171N069
$$ -212074 -243400 7388 55236 206958 139787 -112018 -33599 -136550 -154693 -144522 -139453
21174a39453J40553O8245l4754K7699j33135j31206j10920n871J02770J3395J54929
$$ -139453 1100 69345 34591 62290 -70845 -202051 -312971 -318842 -216072 -202677 -47748
21163d7748M9780O2709m2764m9173r8185N0803O3654J07710o0550j19182o5161
$$ -47748 2032 64741 21977 -27196 -125381 -74578 -10924 96786 36236 -82946 -148107
21152a48107K0330N3539n4340k11208j3287J56129N2334r1535P7886q575R6652
$$ -148107 -127777 -74238 -128578 -339786 -353073 -196944 -144610 -236145 -158259 -166834 -70182
21141g0182o2801J20538J11764l2525j04423k6954j08793n4725J62781L3119l9701
$$ -70182 -132983 -12445 99319 66794 -37629 -64583 -173376 -228101 -65320 -32201 -71902
21130g1902m3717q1719L8481J21314J01968l0488o7340N0590p9401J17865M691
$$ -71902 -115619 -197338 -158857 -37543 64425 33937 -33403 17187 -62214 55651 60342
21119F0342J2038P7766k03j59183n5248K7211J5916j73072M7014J24194L2187
$$ 60342 72380 150146 149943 -9240 -64488 -37277 -21361 -194433 -147419 -23225 8962
21108H962J3135j04002L8539J30761J35551r8060j83268O4949J05125j37820j36346
$$ 8962 22097 -81905 -43366 87395 222946 124886 -58382 6567 111692 -26128 -162474
21097a62474j92872r7872Q1316J70841K64814J88706l4255O1550m3162q2976o9530
$$ -162474 -355346 -453218 -371902 -201061 63753 252459 218204 279754 236592 153616 84086
21086H4086j03159j67261K9955M9052J3470N9673R5257R4856k0746l5251o8608
$$ 84086 -19073 -186334 -156379 -107327 -93857 -34184 61073 155929 135183 99932 31324
21075C1324k9521K23565J29845j21520j48993N625m9475Q2791R2341j04172K2883
$$ 31324 1803 225368 355213 233693 84700 90325 40850 123641 215982 111810 134693
21064A34693j05755Q5471N7459M8926j11749j51911o69J44965J49049Q8881L056
$$ 134693 28938 114409 171868 220794 109045 -42866 -43535 101430 250479 339360 342416
21053C42416k96616k63359m2331J54251J66273J16759j00789m5518j60524l5871
$$ 342416 45800 -217559 -259890 -105639 60634 177393 76604 31086 -129438 -165309
21043a65309J18390L06492P842m0423N4692j80810j88077p2615J03516R5920L501
$$ -165309 -46919 259573 267415 226992 281684 100874 -87203 -159818 -56302 39618 43119
21032D3119r7006r802k2611J64035n1812j97379j03561m77L945j17033j6422J14699
$$ 43119 -53887 -63689 -86300 77735 25923 -171456 -275017 -275494 -271549 -388582 -405004 -290305
21020b90305Q8487P7906J54715n7060j24777o0403J8056P1603o675R52K5791k1362
$$ -290305 -201818 -123912 30803 -26257 -151034 -211437 -193381 -121778 -128453 -127501 -101710 -123072
21008a23072l3741M5310J01850O7325J0472M215j27598n5566L3049j3436P0545
$$ -123072 -156813 -111503 -9653 57672 68144 72359 -55239 -110805 -77756 -91192 -20647
20997b0647J58181n6455r3707k53993p5870p1531n742J93020J33769L6844j02401
$$ -20647 137534 81079 -12628 -266621 -342491 -414022 -419764 -226744 -92975 -56131 -158532
20986a58532L9707Q5147q7743j5305m9226J46363K67810K20843J5270k4531k80904
$$ -158532 -118825 -33678 -121421 -136726 -185952 -39589 228221 449064 464334 439803 158899
20975A58899r9822m4423j3590q600K7992j17741j94431p8912J40768K27993k9876
$$ 158899 59077 14654 1064 -7536 20456 -97285 -291716 -370628 -229860 -1867 -31743
20964c1743J2508m965n645Q3953M5312q5892j02141K0298R1287q6366O1573J14637
$$ -31743 -19235 -24200 -29845 54108 99420 13528 -88613 -68315 22972 -63394 -1821 112816
20952A12816m9760N8812P8933j47533j65419N6392J81697J5509p4717N7333N5615
$$ 112816 63056 121868 200801 53268 -112151 -55759 125938 141447 66730 124063 179678
20941A79678j61680P7942J51057J0721L0075j21246j47481J99963K15519J24152
$$ 179678 17998 95940 246997 257718 287793 166547 19066 219029 434548 558700
20931E58700q4961j69402j4559p7051p9693n3761Q8754j07066o1408P1838J91962
$$ 558700 473739 304337 289778 212727 133034 79273 168027 60961 -447 71391 263353
20920B63353K37498j23975p6814j2092j38595Q6739L0856k9200r4949J0859j63217
$$ 263353 500851 376876 300062 287970 149375 236114 266970 237770 142821 153680 -9537
20909i537k3261L3267P3825k11559Q4813J42907k04909J18761K46845j6871j85653
$$ -9537 -32798 469 74294 -137265 -52452 90455 -114454 4307 251152 234281 48628
20898D8628m838K3941q5673p2671p5337L1518J46739r3402J19542P9787j1362
$$ 48628 43790 67731 -17942 -90613 -165950 -134432 12307 -81095 38447 118234 106872
20887A06872J4217P4281j53177j90776m7058L7013N6114K07453n3996n1678k5809
$$ 106872 121089 195370 42193 -148583 -195641 -158628 -102514 104939 50943 -735 -26544
20876b6544m4639j7833j62910m7878Q1324q3921o3839M0523N8384K12804J56260
$$ -26544 -71183 -89016 -251926 -299804 -218480 -302401 -366240 -325717 -267333 -54529 101731
20865A01731l2930j09596J77538L7510k7469R699k1649l9596l3254j31157K5258
$$ 101731 68801 -40795 136743 174253 146784 156483 134834 95238 61984 -69173 -43915
20854d3915r3826M377J10056L8575M5569J07411O6487j45925m5106L2377L383
$$ -43915 -137741 -133364 -23308 15267 60836 168247 234734 88809 43703 76080 79463
20843G9463r771P1878Q9030j88249m0437r1490j36861q772M0157R3829J52425
$$ 79463 69692 141570 230600 42351 1914 -89576 -226437 -235209 -195052 -101223 51202
20832E1202M9744l0486j50460k16145Q4829K12804j24583l0496J50322M8176j3476
$$ 51202 100946 70460 -80000 -296145 -211316 1488 -123095 -153591 -3269 44907 31431
20821C1431j46352L7100k14644j49962N3501K01138J96262L3181m2504R5300J11883
$$ 31431 -114921 -77821 -292465 -442427 -388926 -187788 8474 41655 -849 94451 206334
20810B06334o4839k7212j20853J59412n6256j66981k0332P2919L5559j47352j7190
$$ 206334 141495 114283 -6570 152842 96586 -70395 -90727 -17808 17751 -129601 -146791
20799a46791R4974J27481J42098L56j87822m6442O3181r3978j89269O8569L5116
$$ -146791 -51817 75664 217762 218118 30296 -16146 47035 -46943 -236212 -167643 -132527
20788a32527P4148m3792K7611q4576k2926r7761Q0875P5602K7761J16566O1595
$$ -132527 -58379 -102171 -74560 -159136 -182062 -279823 -198948 -123346 -95585 20981 82576
20777H2576r8926L1842L4132o1177k1338k8957J15514J90930p5317r3920K6787
$$ 82576 -16350 15492 49624 -11553 -32891 -61848 53666 244596 169279 75359 102146
20766A02146r0479j9862J59582j19566j43911O758K63644L8896k10204m9243K26717
$$ 102146 11667 -8195 151387 31821 -112090 -105332 158312 197208 -12996 -62239 164478
20755A64478M5048k83733j32403K86721O8774n4157Q2583J7735k52675r582J94559
$$ 164478 209526 -74207 -206610 80111 148885 94728 177311 195046 -57629 -67211 127348
20744A27348K17697p3035j27012j08824R28N1133P4767L3870p4011k01704n7176
$$ 127348 345045 272010 144998 36174 37102 88235 163002 196872 122861 -78843 -136019
20733a36019J03623N0835J15035j97018q5571M7877K4475m4195j35992j41097
$$ -136019 -32396 18439 133474 -63544 -149115 -101238 -76763 -120958 -256950 -398047
20723c98047j10249J39555J90849R7418J29216M0136o3468Q463Q8206j31458k11031
$$ -398047 -508296 -368741 -177892 -80474 48742 88878 25410 33873 122079 -9379 -220410
20712b20410K7739M1685j08860O2452J67393n9394j81209r517l1386P7295J21341
$$ -220410 -192671 -150986 -259846 -197394 -30001 -89395 -270604 -280121 -311507 -234212 -112871
20701a12871J05213M9343m1779j38933R9355p974O2889l0507L1905j3413P1656
$$ -112871 -7658 41685 -94 -139027 -39672 -47646 15243 -15264 16641 3228 74884
20690G4884J07949p7967m9004o5695m2195M1579j747J17871P0110J7959j01386
$$ 74884 182833 104866 55862 -9833 -52028 -10449 -12196 105675 175785 193744 92358
20679I2358J19824Q6938k4500p9783p3438j62977q3302J36128k4941J1504Q1856
$$ 92358 212182 299120 274620 194837 121399 -41578 -124880 11248 -13693 -2189 79667
20668G9667l1094J69222n0453j06716J6175M5273Q6959K6240n3253j35069l0185
$$ 79667 48573 217795 167342 60626 76801 122074 209033 235273 182020 46951 16766
20657A6766o2016k04410J69823m8358m8846L4229p727n6174l3692O4663O7184
$$ 16766 -45250 -249660 -79837 -128195 -177041 -142812 -150539 -206713 -240405 -175742 -108558
20646a08558P1667L3896P2560N4466m0663o5050j25021P5597N9394L5880k2721
$$ -108558 -36891 -2995 69565 124031 83368 18318 -106703 -31106 28288 64168 41447
20635D1447L3473o8386r9476K12668J38157R2576j08440K4738p3658m1722J59070
$$ 41447 74920 6534 -92942 119726 257883 350459 242019 266757 193099 151377 310447
20624C10447J18356K4450p678j32205j47106j39869l9990k9105q257p1292J58893
$$ 310447 428803 453253 445575 313370 166264 26395 -13595 -42700 -50957 -122249 36644
20613C6644m779k6538J67567J37621n9435j93909k69169Q9656J31861m3907j21739
$$ 36644 31865 5327 172894 310515 251080 57171 -211998 -122342 9519 -34388 -156127
20602a56127j05408J51071J55565O508j004K2076M3706J6579Q011R3160J2012
$$ -156127 -261535 -110464 45101 51609 50605 72681 116387 132966 140977 234137 246149
20591B46149P7998J23881R1201R2212J53868n7117l14099j48747j06380r5159
$$ 246149 324147 448028 539229 631441 785309 728192 414093 265346 158966 63807
20581F3807j06590k61188J9618K8020O2629J20715N8820O4445L4067j91550L184
$$ 63807 -42783 -303971 -284353 -256333 -193704 -72989 -14169 50276 84343 -107207 -104023
20570a04023r7770p5319R4551J31850N3363L9333m9302Q2310R812m2754j66284
$$ -104023 -201793 -277112 -182561 -50711 2652 41985 -7317 74993 84805 42051 -124233
20559a24233l762J53983j21401J931P6436L2319o64j24659J41233K78575P6933
$$ -124233 -127995 25988 -95413 -93482 -17046 15273 14609 -110050 31183 309758 386691
20548C86691L4964L2093k05296j99626q4118K7967K50414P6464o5438j187l4850
$$ 386691 421655 453748 248452 48826 -35292 -7325 243089 319553 254115 252928 218078
20537B18078n3847k39183j62765N4056K37782J29954N5276k5447R279k2458r1278
$$ 218078 164231 -74952 -237717 -183661 54121 184075 239351 213904 223183 200725 109447
20526A09447j22478p0742J1140Q6631R4233n3447j1969O1797l0763O7821j0571
$$ 109447 -13031 -83773 -72633 13998 108231 54784 42815 104612 73849 141670 131099
20515A31099K655j8808p9798j04560K3824q9442P4329J73935r019j09479l7989
$$ 131099 133754 114946 35148 -69412 -45588 -135030 -60701 113234 104215 -5264 -43253
20504d3253J84608R3139j37438r3502j22722J05948N549k0013j59693N9727J15696
$$ -43253 141355 234494 97056 3554 -119168 -13220 -7671 -27684 -187377 -127650 -11954
20493a1954J30509J10948j15415j14975L18j2215j8447J17956j21458q9320J38482
$$ -11954 118555 229503 114088 -887 -569 -12784 -31231 86725 -34733 -124053 14429
20482A4429J68485n7128j21753K1402n9754K7953q817j04139Q5626l4891n2736
$$ 14429 182914 125786 4033 25435 -34319 -6366 -15183 -119322 -33696 -68587 -121323
20471a21323k0208k21954l0233J8030K1219O1500R1852K02414R7768p8696j31166
$$ -121323 -141531 -363485 -393718 -375688 -354469 -292969 -201117 1297 99065 20369 -110797
20460a10797L9170J06753K7221j18933l0391J28719m2866j0133k0840l7713j9006
$$ -110797 -71627 35126 62347 -56586 -86977 41742 -1124 -11257 -32097 -69810 -88816
20449h8816l22Q5168J7735j50200k8431p5979j43573l8650n073l7821O9911K448
$$ -88816 -89138 -3970 13765 -136435 -164866 -240845 -384418 -423068 -428141 -465962 -396051 -393603
20437c93603J55179L07839P8171j53344k8413Q1580o0447k36406Q9134J43471
$$ -393603 -238424 69415 147586 -5758 -34171 47409 -13038 -249444 -160310 -16839
20427a6839j32300N1259J36449J18702l566p0967r906k13859n0693Q6232Q5939
$$ -16839 -149139 -97880 38569 157271 153705 82738 72832 -141027 -191720 -105488 -19549
20416a9549R9990J10249L343m2210n8830j13485Q2458j4669o6317M2024k4255
$$ -19549 80441 190690 194033 151823 92993 -20492 61966 47297 -19020 23004 -1251
20405a251M4490n0271K06040r013K9074k7022Q7j41953Q4111k1816k9762q5750
$$ -1251 43239 -7032 199008 189995 219069 192047 192134 50181 134292 112476 82714 -3036
20393c036K46091M7134j39505m5895k21837j61849r1506J85457R7336o5810Q3617
$$ -3036 243055 290189 150684 104789 -117048 -278897 -370403 -184946 -87610 -153420 -69803
20382f9803N1760m5536J23929J1047K39006N90j07674J8805J24058R2884o1238
$$ -69803 -18043 -63579 60350 71397 310403 310993 203319 222124 346182 439066 377828
20371C77828K6465M986L3461j01372j24723j95000q7397j27546N2152R2181R0735
$$ 377828 404293 409279 442740 341368 216645 21645 -65752 -193298 -141146 -48965 41770
20360D1770N6423j58799K2846J17380j32304o1849J63218R2109M3871P775l591
$$ 41770 98193 -60606 -37760 79620 -52684 -114533 48685 140794 184665 192440 188849
20349A88849j26155j80768j49168p982J94052J96735J66554J03489n3254j46986
$$ 188849 62694 -118074 -267242 -275224 -81172 115563 282117 385606 332352 185366
20339A85366J27320J04052k09824k58403q1739R0528J49154M2494k6070r1306
$$ 185366 312686 416738 206914 -51489 -133228 -42700 106454 148948 122878 31572
20329C1572J45912j15672r0279K54935J45309j78685k29158j32373K20971K9407
$$ 31572 177484 61812 -28467 226468 371777 193092 -36066 -168439 52532 81939
20319H1939j94633L0565L4313m7337Q9008K43789R3323o3009k30346J6143K06884
$$ 81939 -112694 -82129 -47816 -95153 -6145 237644 330967 267958 37612 53755 260639
20308B60639J20109p6730K3802k3070k10038R9557R5073m5579j37605p0678J343
$$ 260639 380748 304018 327820 304750 94712 194269 289342 243763 106158 35480 36823
20297C6823R159J67161J81696J11375k42884k98820p5796J47010K92141J3140
$$ 36823 45982 213143 394839 506214 263330 -35490 -111286 35724 327865 341005
20287C41005q656j01511k1150j22006j63778J06241J16944r365p0297q6487K9015
$$ 341005 332349 230838 209688 87682 -76096 30145 147089 137724 67427 -19060 9955
20276I955j17110j18621R5540J47130J61743N1290k1444Q9629J63204j52458j95824
$$ 9955 -107155 -225776 -130236 16894 178637 229927 208483 298112 461316 308858 113034
20265A13034n5413P4645P2876J11279R0129L2382J79223O2979j86167l5214Q4385
$$ 113034 57621 132266 205142 316421 406550 438932 618155 681134 494967 459753 544138
20254E44138l1273N1303k3211k0035n397k05146m6464L9496J82474j12096j62707
$$ 544138 512865 564168 540957 520922 515525 310379 263915 303411 485885 373789 211082
20243B11082j13807j10670k2083P0100J0409L0142P3910J7846j26878j49770N1904
$$ 211082 97275 -13395 -35478 34622 45031 75173 149083 166929 40051 -109719 -57815
20232e7815J03957m086m475q312J30394p3806j6987k8974l7102j52156R9482J62628
$$ -57815 46142 42056 37581 29269 159663 85857 68870 39896 2794 -149362 -49880 112748
20220A12748J64639J24433m2239k59340k0782r8991o2148n6203j010k81455L285
$$ 112748 277387 401820 359581 100241 79459 -19532 -81680 -137883 -138893 -420348 -417063
20209d17063L17046P7912n3386j93877J09144J50821L0584o0015J00883p6082
$$ -417063 -100017 -22105 -75491 -269368 -160224 -9403 21181 -38834 62049 -14033
20199a4033j27133R2525K00911o8103J25471o8443m3385j30446l4833J91496J92781
$$ -14033 -141166 -48641 152270 84167 209638 141195 97810 -32636 -67469 124027 316808
20188C16808J34066o7418j38056k05644J0927n6809j41903J50537J94043j5743
$$ 316808 450874 383456 245400 39756 50683 -6126 -148029 2508 196551 180808
20178A80808n8401j02264k83948j55943K10625N5410R9655n0788j17569m2446
$$ 180808 122407 20143 -263805 -419748 -209123 -153713 -54058 -104846 -222415 -264861
20168b64861J94345K07501J04663p7992J17558j79257k06483m9943m149o1867
$$ -264861 -70516 136985 241648 163656 281214 101957 -104526 -154469 -158618 -220485
20158b20485N0792J31788K7545j47606K10872J1851j7330R6506L018j36990k7461
$$ -220485 -169693 -37905 -10360 -157966 52906 64757 47427 143933 146951 9961 -17500
20147a7500j16570l4975O7835J47470Q8308P9987n2712n6435j07537j5234n836
$$ -17500 -134070 -169045 -101210 46260 134568 214555 161843 105408 -2129 -17363 -23199
20136b3199J97915q1597o2905k255L6825k6834k7857o0403l5860p9747R9728P2266
$$ -23199 174716 93119 30214 27959 64784 37950 10093 -50310 -86170 -165917 -66189 6077
20124F077J84445K43332j08602j51621j50570p317J5488J30494J15355J13592
$$ 6077 190522 433854 325252 173631 23061 15744 31232 161726 277081 390673
20114C90673J7077K0261j3960m2445o9436j37728l8358o357r2923J66563J01707
$$ 390673 407750 428011 414051 371606 302170 164442 126084 119727 26804 193367 295074
20103B95074M8936O6131P3697o8631q3431k56967M1632Q9993K23856K6575j15468
$$ 295074 344010 410141 483838 415207 331776 74809 116441 206434 430290 456865 341397
20092C41397P7233J66876J24288q7536J4921J8695q1103j9717K60650L45817R9532
$$ 341397 418630 585506 709794 622258 637179 655874 574771 555054 815704 1161521 1261053
20081A261053J62754k6301k4495k33035L1669K42336J62830R0660J75757K24304
$$ 1261053 1423807 1397506 1373011 1139976 1171645 1413981 1576811 1667471 1843228 2067532
20071B067532J41143k9941J03204K25284J38627J07786J70305L19250L55627O58991
$$ 2067532 2208675 2178734 2281938 2507222 2645849 2753635 2923940 3243190 3598817 4257808
20061D257808R29664J325337J700788K442809L918201O350239R847252J5004777
$$ 4257808 5187472 6512809 8213597 10656406 14574607 20924846 30772098 45776875
20053D5776875J8326931J6636191Q490586l654413j3955995j7820988j5938640
$$ 45776875 64103806 80739997 89230583 85576170 71620175 53799187 37860547
20046C7860547j1395359p061970m439165k830604k109587j555426r84099p48098
$$ 37860547 26465188 19403218 14964053 12133449 10023862 8468436 7484337 6736239
20038F736239l56866m78235l31487l09313j63199l64286k01501K58199L55536
$$ 6736239 6379373 5901138 5569651 5260338 5097139 4732853 4531352 4789551 5145087
20029E145087K69528J57277J30335k3157K11264R58084J425357J639423K193282
$$ 5145087 5414615 5571892 5702227 5679070 5890334 6848418 8273775 9913198 12106480
20020A2106480L524187N578444R135482J4061508J8461951J8962055J2390597
$$ 12106480 15630667 21209111 30344593 44406101 62868052 81830107 94220704
20013I4220704K4844j2356505j8848786j8311946j3995127r232521n790880l672058
$$ 94220704 94245548 81889043 63040257 44728311 30733184 21500663 15709783 12037725
20005A2037725k550075j707608j206355r53635p39861o97589m43941l58881k57151
$$ 12037725 9487650 7780042 6573687 5620052 4880191 4182602 3738661 3379780 3122629
19996C122629k01907K2281n1939n7571P1756j85620k22355k92365j59411j84931
$$ 3122629 2920722 2943003 2891064 2833493 2905249 2719629 2497274 2204909 2045498 1860567
19986A860567j17589J84746j12503n7955j05835k11434l06409j70354r2163j67941
$$ 1860567 1742978 1927724 1815221 1757266 1651431 1439997 1133588 963234 871071 703130
19976G03130j8833o3211K711R7519j61707M6140K5137j00115j21343J09380j2760
$$ 703130 684297 621086 623797 721316 559609 605749 630886 530771 409428 518808 506048
19965E06048j18619p3916j1982J40213L6200q9609O4835J12190k9792j3635j39363
$$ 506048 387429 313513 301531 441744 477944 388335 453170 565360 535568 521933 382570
19954C82570m9450o3792J2425k13412K4879J37252R2275k8117n8854M0315N0424
$$ 382570 333120 269328 281753 68341 93220 230472 322747 294630 235776 276091 326515
19943C26515J75561p136k02014j06212n1039J36559j48980j09791J64775J11562
$$ 326515 502076 494940 292926 186714 135675 272234 123254 13463 178238 289800
19933B89800J66739L5643j80225j64366N851j77053j33291l1949R6677J74260
$$ 289800 456539 492182 311957 147591 153442 -23611 -156902 -188851 -92174 82086
19923H2086M938J93608n0680j38079k3885m6257o3912R4919J74903p9993k7658
$$ 82086 87024 280632 229952 91873 67988 21731 -42181 52738 227641 147648 119990
19912A19990K21243J12183l5795L8192J439j69764o5766O9874m4199q1338N7445
$$ 119990 341233 453416 417621 455813 457252 287488 221722 291596 247397 166059 223504
19901B23504J13198K51375j66445l25944j36251J47050l8339K5424K87529J27281
$$ 223504 336702 588077 421632 95688 -40563 106487 68148 93572 381101 508382
19891E08382k08119j75800p5956J16986l7574q484N0989j63074r5328M9262K04858
$$ 508382 300263 124463 48507 165493 127919 119435 170424 7350 -87978 -38716 166142
19880A66142l314J0827J55192J77649K5254j58987k25345l4967O2764J15936L1625
$$ 166142 162828 173655 328847 506496 531750 372763 147418 112451 175215 291151 322776
19869C22776j30771p2448j8387N5709J21634K30818O029k35581j57426R6436P2626
$$ 322776 192005 119557 101170 156879 278513 509331 515360 279779 122353 218789 291415
19858B91415m4735J88021O2122j0764r587J1813L3753j13380j37361j46028Q6595
$$ 291415 246680 434701 496823 486059 476472 488285 522038 408658 271297 125269 211864
19847B11864P9943K65003J86175K03951L79018O4385l9221r6184j79651j57520
$$ 211864 291807 556810 742985 946936 1325954 1390339 1351118 1254934 1075283 917763
19837I17763J83657J81443P9440j17038j4155L7396r9022l7633J32254J93072
$$ 917763 1101420 1282863 1362303 1245265 1231110 1268506 1169484 1131851 1264105 1457177
19827A457177J23103L5392L9358K74959J77018J59541O0845K58309L16085M05531
$$ 1457177 1580280 1615672 1655030 1929989 2107007 2266548 2327393 2585702 2901787 3307318
19817C307318P96434R73001J654676K597016L497730L603820K267973Q56878J491480
$$ 3307318 4103752 5076753 6731429 9328445 12826175 16429995 18697968 19554846 21046326
19808B1046326L719498M764515L496670M69486r72108L0533J684102O06513k549242
$$ 21046326 24765824 29530339 33027009 33496495 32524387 32554920 34239022 34845535 32296293
19799C2296293m229360l336861q55817J170476Q77049k3095p13505k554326l761325
$$ 32296293 28066933 24730072 23874255 25044731 25921780 25898685 25185180 22630854 18869529
19790A8869529l168085j320191N38810J418555L79554j899162l209200k907234
$$ 18869529 15701444 14381253 14920063 16338618 16718172 14819010 11609810 8702576
19782H702576k066833j164647o57900l29505k79207l36815k22286J0322P3913
$$ 8702576 6635743 5471096 4813196 4483691 4204484 3867669 3645383 3655705 3729618
19773C729618P1571J79807J00248M5949J09909Q2602M13831P97089J113947J931143
$$ 3729618 3801189 3980996 4081244 4127193 4237102 4319704 4733535 5530624 6644571 8575714
19763H575714L095824M897024O675106O505242L021476j099738k291098K24416
$$ 8575714 11671538 16568562 23243668 29748910 32770386 31670648 29379550 29603966
19755B9603966L793040M564336J286395k002821k556924k089572k349584j720897
$$ 29603966 33397006 37961342 39247737 37244916 34687992 32598420 30248836 28527939
19747B8527939P80617L547367L639585L4366m064962n165038l227588r95812r17058
$$ 28527939 29308556 32855923 36495508 36529874 32464912 27299874 24072286 23076474 22159416
19738B2159416k596643m189548m203932l165711j873872j244308p62260n54321
$$ 22159416 19562773 15373225 11169293 8003582 6129710 4885402 4123142 3568821
19730C568821l95390k39447n1381j51020k34178j47357j13265l4058j63853k50117
$$ 3568821 3173431 2933984 2882603 2731583 2497405 2350048 2236783 2202725 2038872 1788755
19720A788755j64530j49968n696o198r7161p93J74738J31260j07585J84252J28898
$$ 1788755 1624225 1474257 1468561 1462363 1365202 1364409 1539147 1670407 1562822 1747074 1875972
19709A875972k01232j17608L28305K64937k14438l36589m34829m10267j81051
$$ 1875972 1674740 1557132 1885437 2150374 1935936 1599347 1164518 754251 573200
19700E73200o9348p3642N6195m3737m3603k1177j8984K5458j77316k00977J99989
$$ 573200 503852 430210 486405 442668 399065 377888 358904 384362 207046 6069 206058
19689B06058J79302j0554k03436J66176P8624j05831j0791K42503K5529J17331
$$ 206058 385360 374806 171370 337546 416170 310339 299548 542051 567580 684911
19679F84911j97540k2791J50505O6321N5241j34108j54468Q32j08787j26708M0093
$$ 684911 487371 464580 615085 681406 736647 602539 448071 448903 340116 213408 253501
19668B53501K11320j64284p8402K0529m0211j3198O7731O4837j19198j06386R3247
$$ 253501 464821 300537 222135 242664 202453 189255 256986 321823 202625 96239 189486
19657A89486L4145j08375o1067j55341Q1593l8516n9003j08189O6027N4193j09647
$$ 189486 223631 115256 54189 -101152 -19559 -58075 -117078 -225267 -159240 -105047 -214694
19646b14694J8701R8706O8378n2854O6691M7396J63941K4431k65079j56689J41214
$$ -214694 -195993 -97287 -28909 -81763 -15072 32324 196265 220696 -44383 -201072 -59858
19635e9858J24147R2710j68222j06466J73277Q3588Q3867j5353j56902P2290N1876
$$ -59858 64289 156999 -11223 -117689 55588 139176 223043 207690 50788 123078 174954
19624A74954K5836J43111L4866k05971k29144M3233M0745M1122Q1120k9052M7375
$$ 174954 200790 343901 378767 172796 -56348 -13115 27630 68752 149872 120820 168195
19613A68195m5804m5160j32620l2881J50514o1002j11341J16085P3791k10620
$$ 168195 122391 77231 -55389 -88270 62244 1242 -110099 5986 79777 -130843
19603a30843J46553J02172M714o8947K2585P3691j15142r6342J52824N2447P5071
$$ -130843 15710 117882 122596 53649 76234 149925 34783 -61559 91265 143712 218783
19592B18783j7642j17145L5567J21565P4025k16136r6065k80472J81388K46312
$$ 218783 201141 83996 119563 241128 315153 99017 2952 -277520 -96132 150180
19582A50180K01229k20163j20737l2595J37305q2097l3794O0057N9580J31999
$$ 150180 351409 131246 10509 -22086 115219 33122 -672 59385 118965 250964
19572B50964l9576k01243j84072J23796N0208O642P538M0689R3715Q457j07238
$$ 250964 211388 10145 -173927 -50131 77 6719 14257 54946 148661 157118 49880
19561D9880l1912j8867L443O6056L5895J49440o4538j14968O9529L0810n3526
$$ 49880 17968 -899 2544 68600 104495 253935 189397 74429 143958 174768 121242
19550A21242j9897Q007j30415M0716o9013r0814n9231j3497N6474J01213K44710
$$ 121242 101345 109352 -21063 19653 -49360 -140174 -199405 -212902 -156428 -55215 189495
19539A89495q1373j3465k43188p2383L30254M9012k46204q6168J16371P7889Q9129
$$ 189495 108122 94657 -148531 -220914 109340 158352 -87852 -174020 -57649 20240 109369
19528A09369M5231O2035Q3610J17780N5810r5808j42482q9875l00476K18093K38101
$$ 109369 154600 216635 300245 418025 473835 378027 235545 145670 -154806 63287 301388
19517C01388o5124L9128J22612l1357l2123k684N664J03121K85660K6266n9635
$$ 301388 236264 275392 398004 366647 334524 331840 337504 440625 726285 752551 692916
19506F92916l3697k50482j89604P6249j09274j18521l60J23988K61900j26796
$$ 692916 659219 408737 219133 295382 186108 67587 67227 191215 453115 326319
19496C26319k81746j02800p6465O3314J54522O7210K6522M0238j541J05097P8565
$$ 326319 44573 -58227 -134692 -71378 83144 150354 176876 217114 215573 320670 399235
19485C99235Q9445Q838J642q0193R928r7956j06817O3144N5143p0786L8716L1086
$$ 399235 488680 497518 499160 418967 428895 330939 224122 287266 342409 271623 310339 341425
19473C41425K20040N3169j09119R8747J1569j62517J41390O4339j29747n926j3773
$$ 341425 561465 614634 505515 604262 615831 453314 594704 659043 529296 523370 509597
19462E09597R4433n2467o8326J1750P3190J47648m4296p1505K2998q4597r2680
$$ 509597 604030 551563 483237 494987 568177 715825 671529 600024 623022 538425 445745
19451D45745J03719j9864n3167q3298J5706K4323k0198n2449q9421j20163J99095
$$ 445745 549464 529600 476433 393135 408841 433164 412966 360517 271096 150933 350028
19440C50028J8668o4793L2450K8472K95056K98095m6653k20851j33949n3218k80168
$$ 350028 368696 303903 336353 364825 659881 957976 911323 690472 556523 503305 223137
19429B23137j13879Q1444J06154R9015Q4825q6645k7672P3476J01028q5056j8232
$$ 223137 109258 190702 296856 395871 480696 394051 366379 439855 540883 455827 437595
19418D37595O2261q3250P8443P8410k7730j57625j95889m3363M9044J1176M6076
$$ 437595 499856 416606 495049 573459 545729 388104 192215 148852 197896 209072 255148
19407B55148q3830j92136r147l6312l459L5999K50472J89817j72218p5624q2233
$$ 255148 171318 -20818 -29965 -66277 -69736 -33737 216735 406552 234334 158710 76477
19396G6477r2603M015P7522M3367n0996N2473R3070o3447J7602O1867o2447R2663
$$ 76477 -16126 -12111 65411 108778 57782 110255 203325 139878 157480 219347 156900 249563
19384B49563m2676K2213J78036M7619k35572o1759J35640j7709k8483j09108j9654
$$ 249563 206887 229100 407136 454755 219183 157424 293064 275355 246872 137764 118110
19373A18110j72292K9719l5884k5136N817m389l8838l5626R8711N7892m9262o8782
$$ 118110 -54182 -24463 -60347 -85483 -79666 -84055 -122893 -158519 -59808 -1916 -51178 -119960
19361a19960l8018J17062J24532j16135J612K0299J73476o369p6249p8056j02973
$$ -119960 -157978 -40916 83616 -32519 -30907 -10608 162868 156499 80250 2194 -100779
19350a00779q7966K51017J45058r6313J06817j31268j9265r0532j57500O7710
$$ -100779 -188745 62272 207330 111017 217834 86566 67301 -23231 -180731 -113021
19340a13021J68022K7250J39581J35772k5926l1375l5094j77123l7618J72152
$$ -113021 55001 82251 221832 357604 331678 300303 265209 88086 50468 222620
19330B22620k4468j23871K2132N6299N9859k3211p8932P3259n1643j17315j8463
$$ 222620 198152 74281 96413 152712 212571 189360 110428 183687 132044 14729 -3734
19319c734Q9802o4070O8605P1195j59365N4211J01118j23565k668J05798J1713
$$ -3734 86068 21998 90603 161798 2433 56644 157762 34197 31529 137327 149040
19308A49040o0020M2469o9168J7004J69303J29336k3899j09565q8170K7464L3781
$$ 149040 89020 131489 62321 79325 248628 377964 354065 244500 156330 183794 217575
19297B17575m548l9145J41123K33347K39012M4309j60634n7108l1532j17838M4139
$$ 217575 213027 173882 315005 548352 787364 831673 671039 613931 582399 464561 508700
19286E08700j51974k30101j82823j25927K9686q4756N8865K53016J93172J02665
$$ 508700 356726 126625 -56198 -182125 -152439 -237195 -178330 74686 267858 370523
19276C70523J7353k00487J840L8957O8544L2787M1541j22537n4335M8060Q5980
$$ 370523 387876 187389 189229 228186 296730 329517 371058 248521 194186 242246 328226
19265C28226K62190Q7638k4306j0507R0469M49851K95184k692k24774k00234k98606
$$ 328226 590416 678054 653748 643241 733710 1183561 1478745 1476053 1251279 1051045 752439
19254G52439l0940k4169j12607r6844L4453J6949J00433k1336J62044Q876J99706
$$ 752439 721499 697330 584723 487879 522332 539281 639714 618378 780422 789298 989004
19243I89004K26338K20440l7116j20575k8564J47331J28720J39246K72834K39762
$$ 989004 1215342 1435782 1398666 1278091 1249527 1396858 1525578 1664824 1937658 2177420
19233B177420K94521P55634Q16198J379890K208888L226711M094222L962012K903984
$$ 2177420 2471941 3227575 4043773 5423663 7632551 10859262 14953484 18915496 21819480
19224B1819480J795523J014055N42066J44167q90251j868649k644455k984094
$$ 21819480 23615003 24629058 25171124 25315291 24425040 22556391 19911936 16927842
19216A6927842j920326M9932K927204N796952P466488O150195J970504k787108
$$ 16927842 15007516 15057448 17984652 23781604 31248092 37398287 39368791 36581683
19208C6581683o530445p790898o729842m727098k820992j583917r18340o26793
$$ 36581683 30051238 22260340 15530498 10803400 7982408 6398491 5480151 4853358
19200D853358n90291m05744j88572n188j87248M5390J24900J77163o7841P2437
$$ 4853358 4263067 3857323 3668751 3663563 3476315 3521705 3646605 3823768 3755927 3828364
19190C828364O920J29088R3035K89486O70340J120076J681796K484913L886833
$$ 3828364 3835284 3964372 4057407 4346893 5017233 6137309 7819105 10304018 14190851
19181A4190851M931926M405220L073416J150346n63879k452056l076341j770544
$$ 14190851 19122777 23527997 26601413 27751759 27187880 24735824 21659483 19888939
19173A9888939J356724M489084N344528M965665L164702J873188J308541J301182
$$ 19888939 21245663 25734747 31079275 36044940 39209642 41082830 42391371 43692553
19165D3692553J486873J502750N57129l64088j286386j968942k978879m450284
$$ 43692553 45179426 46682176 47239305 46875217 45588831 43619889 40641010 36190726
19157C6190726o160543p141373o292551m364126k788929j855552j305043r75557
$$ 36190726 30030183 22888810 16596259 12232133 9443204 7587652 6282609 5307052
19149E307052p30566m19725k65689l14500l69789k96379j98704k11925k08937
$$ 5307052 4576486 4156761 3891072 3576572 3206783 2910404 2711700 2499775 2290838
19140B290838n0767q4845j03556j60314J84989K90160K65603J88127K45132r43
$$ 2290838 2240071 2155226 2051670 1891356 2076345 2366505 2632108 2820235 3065367 3064424
19130C064424q7869n5806k038k34439l27285n58039m69928n38091l00661M4174
$$ 3064424 2976555 2920749 2918711 2684272 2356987 1798948 1329020 790929 490268 534442
19120E34442N8221K351O2886M8086L2386N2775j38555j10644o3470K0717j09149
$$ 534442 592663 595014 657900 705986 738372 791147 652592 541948 478478 499195 390046
19109C90046J32156M2151p4094j40135j83162O3877J40339M3827J3795O7971n8773
$$ 390046 522202 564353 490259 350124 166962 230839 371178 415005 428800 496771 437998
19098D37998j97405m1320J16402K69538J44714m7164k8292r8805m5212J18611
$$ 437998 240593 199273 315675 585213 729927 682763 654471 555666 510454 629065
19088F29065L9798L0451l6387l3203k0654n4139l1550O7357P9088j65991j42163
$$ 629065 668863 699314 662927 629724 609070 554931 523381 590738 669826 503835 361672
19077C61672R2235J86622O8777J45437l8396l29670L9690J78498J28327J17452
$$ 361672 453907 640529 709306 854743 816347 486677 526367 704865 833192 950644
19067I50644N7134J50903k3801J13928J27580N2328M2260K33818J34370J75254
$$ 950644 1007778 1158681 1134880 1248808 1376388 1428716 1470976 1704794 1839164 2014418
19057B014418L44101O54755J032813J510127K438194L933023M480934K341011
$$ 2014418 2358519 3013274 4046087 5556214 7994408 11927431 16408365 18749376
19049A8749376j317238l457508l293166j606237J5096J354623L092294N088556
$$ 18749376 17432138 13974630 10681464 9075227 9090323 10444946 13537240 18625796
19041A8625796N371429J941196l233884n742173n273223l562391k063210j132851
$$ 18625796 23997225 25938421 22704537 16962364 11689141 8126750 6063540 4930689
19033D930689p62976m41958j53585j12469j04860k34085j78954j40500o9391Q2540
$$ 4930689 4167713 3725755 3572170 3459701 3354841 3120756 2941802 2801302 2731911 2814451
19023B814451R002O8491K20286K77757L00237K27457L40324O56246Q50237R75063
$$ 2814451 2823453 2891944 3112230 3389987 3690224 3917681 4258005 4914251 5764488 6739551
19013F739551J306243K238479L468457N742233R317358J2965416J1440317K187830
$$ 6739551 8045794 10284273 13752730 19494963 28812321 41777737 53218054 55405884
19005E5405884p810774j1419844q574306m367216n29166L018477O852789R341554
$$ 55405884 47595110 36175266 27600960 23233744 22704578 25723055 32575844 41917398
18997D1917398O519807j324772q530603j0189703p304613l240912q46954N0207
$$ 41917398 48437205 47112433 38581830 28392127 21087514 17846602 16999648 17049855
18989A7049855q40733k274915k721849k238484j208718o48282n69060k97390o6264
$$ 17049855 16209122 13934207 11212358 8973874 7765156 7116874 6547814 6250424 6184160
18980F184160J83788N90272O15633O96412J376229K214508L721922O150490R107671
$$ 6184160 6367948 6958220 7573853 8270265 9646494 11861002 15582924 21733414 30841085
18971C0841085J0895268Q156775J172896o152030r130637p609512l498390P93675
$$ 30841085 41736353 49893128 51066024 44913994 35783357 28173845 24675455 25469130
18963B5469130N237470R895512J1817107P385750l40913l306333N45881M135149
$$ 25469130 30706600 40602112 52419219 59804969 59464056 56157723 56703604 60838753
18955F0838753J316616o198150j0966048j0163970o136905j773450K337460N957728
$$ 60838753 62155369 55957219 44991171 34827201 28690296 26916846 29254306 35212034
18947C5212034P823411N005842j079438m417908k105626K943200O758211P257359
$$ 35212034 43035445 48041287 46961849 42543941 40438315 43381515 50139726 57397085
18939E7397085M998149J777282o65786j200751l8612K32577p19607l462432o226009
$$ 57397085 62395234 64172516 63506730 62305979 62267367 62499944 61780337 58317905 52091896
18930E2091896p743197o956382m360289k052524j519799k339658k719408j765238
$$ 52091896 44348699 37392317 33032028 30979504 29459705 27120047 24400639 22635401
18922B2635401N83009L691383O533890O972599L733485j938607n950017o526708
$$ 22635401 23218410 26909793 33443683 40416282 44149767 42211160 36261143 29734435
18914B9734435l960655p94407J880202L986732O109334P286119N017402J074059
$$ 29734435 25773780 24979373 26859575 30846307 36955641 44241760 49259162 50333221
18906E0333221k191898j619337K188836M990067M617726J953559o14945j499626
$$ 50333221 48141323 46521986 48710822 53700889 58318615 60272174 59657229 58157603
18898E8157603q60263j55994p52598l046969n826894q157499q757290p864471
$$ 58157603 57297340 57141346 56388748 53341779 47514885 39357386 30600096 22735625
18890B2735625n772088l714630k311561j698268r77752p31142o46285l77316j25669
$$ 22735625 16963537 13248907 10937346 9239078 8261326 7530184 6883899 6506583 6380914
18881F380914p7943J91436R49323J794484K379885L059123K680747M95898k100908
$$ 6380914 6302971 6494407 7443730 9238214 11618099 14677222 17357969 17853867 15752959
18872A5752959l429892k965327j597966n30085K49581J491421K522819J917859
$$ 15752959 12323067 9357740 7759774 7229689 7479270 8970691 11493510 13411369
18864A3411369K75107j524341k766655k792395j895857j209572o70680m54921
$$ 13411369 13686476 12162135 9395480 6603085 4707228 3497656 2826976 2372055
18856B372055l73912j12210j00023j18127j11342k19541l07027K9492o7121l2437
$$ 2372055 1998143 1885933 1785910 1667783 1556441 1336900 1029873 1059365 992244 959807
18846I59807j6327P1966M5512m7668j35881j40242j29017k72716q06P4398j9327
$$ 959807 943480 1015446 1060958 1013290 877409 737167 608150 335434 334628 409026 389699
18835C89699L6135m0047j6623j17705R490Q8626P5991R9874j51357m4215j9638
$$ 389699 425834 385787 369164 251459 260949 349575 425566 525440 374083 329868 310230
18824C10230j69328J46835R3292j39545L1828p5843P9753J10631j36548j94802
$$ 310230 140902 287737 381029 241484 273312 197469 277222 387853 251305 56503
18814E6503J88641P9069J89362L9930j16052j66944k26745m790J2274K31119L1933
$$ 56503 245144 324213 513575 553505 437453 270509 43764 38974 51248 282367 314300
18803C14300k04988q4249J6233q1418k6166R9889K35517R4395j01638j33032p7134
$$ 314300 109312 25063 41296 -40122 -66288 33601 269118 363513 261875 128843 51709
18792E1709j5796N5953J36053j3080l0940J0470j82822k025J1230O2386k022J65906
$$ 51709 35913 91866 227919 214839 183899 194369 11547 9522 20752 83138 81116 247022
18780B47022m7017q9120P0642k4369n5468M1928J94310j07923j70192P1448J86646
$$ 247022 200005 110885 181527 157158 101690 143618 337928 230005 59813 131261 317907
18769C17907J73133K82185k0043N2601N01124O17925L94425k66913q40237o30447
$$ 317907 491040 773225 753182 805783 1306907 1924832 2319257 2052344 1212107 581660
18759E81660j68778K3584P4602o7024L1716L4773j07900j07359j29139o8488L0842
$$ 581660 412882 436466 511068 444044 475760 510533 402633 295274 166135 97647 128489
18748A28489n1480n768R4161M3972L62J4956J09171J27531J78408o6082j11350
$$ 128489 77009 71241 165402 209374 209736 224692 333863 461394 639802 573720 462370
18737D62370k41202j6880P3066N0735o4063j05478l5928j49729M7357J85594O1592
$$ 462370 221168 204288 277354 328089 264026 158548 122620 -27109 20248 205842 267434
18726B67434p6042j4731k47370p0880J4766J26013l323p7822J58738P5560K05000
$$ 267434 191392 176661 -70709 -141589 -126823 -810 -4133 -81955 76783 152343 357343
18715C57343J02268j02246j32404j61058j38229M8216P7145m1988n8729J36260
$$ 357343 459611 357365 224961 63903 -74326 -26110 51035 9047 -49682 86578
18705H6578Q1902J58766n6029J06772K34688m4478j94132l0331j2699K8489q8760
$$ 86578 168480 327246 271217 377989 612677 568199 374067 343736 331037 359526 270766
18694B70766o5259k17404l2329J62829K02208J37296k3435j67839r0880j37584
$$ 270766 205507 -11897 -44226 118603 320811 458107 434672 266833 175953 38369
18684C8369n3824K6389l0817o8977K1376o5805N4080R7356J649j99489r2757K45637
$$ 38369 -15455 10934 -19883 -88860 -67484 -133289 -79209 18147 19796 -179693 -272450 -26813
18672b6813Q1319o4252j8082J00543N1045k57097j27847j6818P0497K27982J66232
$$ -26813 54506 -9746 -27828 72715 123760 -133337 -261184 -278002 -207505 20477 186709
18661A86709r8970o142J93124N5445M0695j49962j67500L9853Q9079q3417L8486
$$ 186709 87739 81597 274721 330166 370861 220899 53399 93252 182331 98914 137400
18650A37400M4213Q7588o9074J5109k2636N1499j05538K73198J24063l406k77249
$$ 137400 181613 269201 200127 215236 192600 244099 138561 411759 535822 532416 255167
18639B55167k65122J16095Q5373l2845k23928k04295K28373J31387j6379j2910
$$ 255167 -9955 106140 191513 158668 -65260 -269555 -41182 90205 73826 60916
18629F0916J11381P1080m4711k62562k0628J852M0748J38817j89413o1621M8527
$$ 60916 172297 243377 198666 -63896 -84524 -82672 -41924 96893 -92520 -154141 -105614
18618a05614M3673j499q5392o4816J7285J26094J62520l3270l3867l2055J86066
$$ -105614 -61941 -63440 -148832 -213648 -196363 -70269 92251 58981 25114 -6941 179125
18607A79125O2198l09007q2657R4238J19741k64714k46658L2306k2019N0889J14883
$$ 179125 241323 -67684 -150341 -56103 63638 -201076 -447734 -415428 -437447 -386558 -271675
18596b71675J9783N3871O5129K18009K3602l1652p5159K0162O1564O7639j65501
$$ -271675 -251892 -198021 -132892 85117 108719 77067 1908 22070 83634 151273 -14228
18585a4228j00610q9525J09635Q158J27110P224k01546J99268Q1779p8566j10809
$$ -14228 -114838 -204363 -94728 -86570 40540 47764 -153782 45486 127265 48699 -62110
18574f2110p5322P3977j27244j64530J5641Q1017J76250J46612j2990m1167R979
$$ -62110 -137432 -63455 -190699 -355229 -339588 -258571 -82321 64291 51301 10134 20113
18563B0113O3372J42571j25868j10680m9760K6676J23377m2539J05184q1654j57653
$$ 20113 83485 226056 100188 -10492 -60252 -33576 89801 47262 152446 70792 -86861
18552h6861o3232J63002j08202m8126Q819J4556r929n0460j02116Q0251k6019
$$ -86861 -150093 12909 -95293 -143419 -134600 -120044 -129973 -180433 -282549 -202298 -228317
18541b28317J04396J8159l2772Q5436p6967q9293L1742J94821r3367o0145K35790
$$ -228317 -123921 -105762 -138534 -53098 -130065 -219358 -187616 7205 -86162 -146307 89483
18530H9483J80002J34358p4938q5763j1265j28785j21588K6039n8275o3821P1255
$$ 89483 269485 403843 328905 243142 231877 103092 -18496 7543 -50732 -114553 -43298
18519d3298J52769l9404j36271n7725J48900r0490R018J01880o8642j67926O3317
$$ -43298 109471 70067 -66204 -123929 24971 -65519 -56501 45379 -23263 -191189 -127872
18508a27872k3509Q1788K23122n6723j83042p9616m2848J41841J03244p5152j43144
$$ -127872 -151381 -69593 153529 96806 -86236 -165852 -208700 -66859 36385 -38767 -181911
18497a81911J40853N7355M1703j56897O4866K940p2654p5844J916N2235K51715
$$ -181911 -41058 16297 58000 -98897 -34031 -31091 -103745 -179589 -177673 -125438 126277
18486A26277l4979n8642J35251J28993M7463K2409k16693j59199M0041k3740K41146
$$ 126277 91298 32656 167907 296900 344363 366772 150079 -9120 30921 7181 248327
18475B48327Q7884p9190o5403R7064N2390N2881k4477r316j97518q8019J6417
$$ 248327 336211 257021 191618 288682 341072 393953 369476 360160 162642 74623 91040
18464I1040j17016m262J33582Q2879O2915J60096l5553k06400k4440q3627k4461
$$ 91040 -25976 -30238 103344 186223 249138 409234 373681 167281 142841 59214 34753
18453C4753K8741r1966j20687L9106R1302L9791O9516k8539o3712p4733j83774
$$ 34753 63494 -28472 -149159 -110053 -18751 21040 90556 62017 -1695 -76428 -260202
18442b60202J09673J71903J2851p81l6694k4545N4299K8518N4428K11485k8845
$$ -260202 -150529 21374 34225 33444 -3250 -27795 26504 55022 109450 320935 292090
18431B92090q7517n7202k08123Q6166K5623Q4786p0415m4547m3954n4754K7329
$$ 292090 204573 147371 -60752 25414 51037 135823 65408 20861 -23093 -77847 -50518
18420e0518K51681K40726M945j95254o5340J49667J33609J8148J64494q5992k62485
$$ -50518 201163 441889 446834 251580 186240 335907 469516 487664 652158 566166 303681
18409C03681K9488J99484j4647K11853J86619J8089l11213l03923k98629j29900
$$ 303681 333169 532653 518006 729859 916478 934567 623354 319431 20802 -109098
18399a09098j05189J6304j849R7357J01767K9631p0378n5773J09661L3346j02093
$$ -109098 -214287 -197983 -199832 -102475 -708 28923 -41455 -97228 12433 45779 -56314
18388e6314n9226J1399j13873O7907J16148M695K7556o4552j21623j3257J83472
$$ -56314 -115540 -104141 -218014 -150107 -33959 -29264 -1708 -66260 -187883 -201140 -17668
18377a7668K5041K3592J25003M4493o4140l3958J3975P56O2590K2055q5692R9341
$$ -17668 7373 30965 155968 200461 136321 102363 116338 117094 179684 201739 116047 215388
18365B15388N0360j02745o0323J65137R3487R6646p3423j18491N913j24378q5573
$$ 215388 265748 163003 102680 267817 361304 457950 384527 266036 271949 147571 61998
18354F1998O0569q029J30171P0986l8483j19195R0029N6401K34905M7215k15357
$$ 61998 122567 114538 244709 315695 277212 158017 248046 304447 539352 586567 371210
18343C71210k30910r7129K4412Q0042m8098j47495j82547J5314R8254j4994J33085
$$ 371210 140300 43171 67583 147625 99527 -47968 -230515 -215201 -116947 -131941 1144
18332A144k3023j52909K0151K79648Q2456n0958j78385p9043K8038K4674j25007
$$ 1144 -21879 -174788 -154637 125011 207467 156509 -21876 -100919 -72881 -48207 -173214
18321a73214j2445N5256m5069o41O706J26144j14903j01402l2994J15847J95262
$$ -173214 -185659 -130403 -175472 -176113 -169407 -43263 -158166 -259568 -292562 -176715 18547
18310A8547J4339m3918j40927n9144K16831J9907r0212j55720j8382k01545p0347
$$ 18547 32886 -11032 -151959 -211103 5728 25635 -64577 -220297 -238679 -440224 -510571
18299e10571K20211K02445r0342j04220P4277J6388j6931L2391R2556L00798O8281
$$ -510571 -290360 -87915 -178257 -282477 -208200 -191812 -208743 -176352 -83796 217002 285283
18288B85283j89923j49170r7612j2880J54757J20284j59579j28818M8111L8447
$$ 285283 95360 -53810 -151422 -164302 -9545 110739 -48840 -177658 -129547 -91100
18278i1100K1927L9303j01310n3221R5279l264O9738P5049k5354J20500j4917
$$ -91100 -69173 -29870 -131180 -184401 -89122 -92386 -22648 52401 27047 147547 132630
18267A32630p6346n4824l2024j76237L6359M0593J25559R0384j0523j45312p4985
$$ 132630 56284 1460 -30564 -206801 -170442 -129849 -4290 86094 75571 -69741 -144726
18256a44726L2166n1739r821N6746P4889K8111P2773L5328k5383l0168r594n9299
$$ -144726 -112560 -164299 -174120 -117374 -42485 -14374 58399 93727 68344 38176 28582 -30717
18244c0717j94296L6224J23159o1860J06869R516N7456l327l4831j1620J37207
$$ -30717 -225013 -188789 -65630 -127490 -20621 -11105 46351 43024 8193 -3427 133780
18233A33780J18919j72357j06398N4913J02133L1686n4889j46447r1059k86384
$$ 133780 252699 80342 -26056 28857 130990 162676 107787 -38660 -129719 -416103
18223d16103o7789K69222J36542K71661J29351k7680n6497r7631j76664k43825
$$ -416103 -483892 -214670 -78128 193533 322884 295204 238707 141076 -35588 -279413
18213b79413J60802J3365j5889N2768K56124O0556j71784j46873J14074M6985
$$ -279413 -118611 -105246 -121135 -68367 187757 248313 76529 -70344 43730 90715
18203I0715N8376Q53j66109j41637N9726K34384P7491j25370j10031k5979R095
$$ 90715 149091 149944 -16165 -157802 -98076 136308 213799 88429 -21602 -47581 -38486
18192c8486L3655j8860j0399J78842J3370O4469o800K7876r5377k08962m0195
$$ -38486 -4831 -23691 -34090 144752 158122 222591 215791 243667 148290 -60672 -100867
18181a00867p266p6844J24109K64196Q0741k06911K8716J11280J15017N472j95259
$$ -100867 -108133 -184977 -60868 203328 284069 77158 105874 217154 332171 337643 142384
18170A42384j45288J01873j6717q8826N3020M0905J14134J78706l9584o0421p4585
$$ 142384 -2904 98969 82252 -6574 46446 87351 201485 380191 340607 280186 205601
18159B05601r9882N3759K23455l7485J68223J40115j7506j24475j16054j17099
$$ 205601 105719 159478 382933 345448 513671 653786 636280 511805 395751 278652
18149B78652j02769K25179J20230k6353k5171l820M3740Q4714J42276M2853J384
$$ 278652 175883 401062 521292 494939 469768 465948 509688 594402 736678 779531 780915
18138G80915J21150o1384J17784R6226K01119J98298P7845k9854J28154J07508
$$ 780915 902065 840681 958465 1054691 1255810 1454108 1531953 1502099 1630253 1737761
18128A737761J35373J64963L50209M79184L23065L05172J36883L00365N16111
$$ 1737761 1873134 2038097 2388306 2867490 3190555 3495727 3632610 3932975 4449086
18119D449086O48522P64359Q59712J174417J660814K542185L268983M477345O177637
$$ 4449086 5097608 5861967 6721679 7896096 9556910 12099095 15368078 19845423 26023060
18110B6023060R493823J5898727L1165356O6074301J24778544J07972017k9542204
$$ 26023060 35516883 51415610 82580966 148655267 273433811 381405828 351863624
18103C51863624j20627853j03330852n1900701k5043375j3927836q706325n790463
$$ 351863624 231235771 127904919 76004218 50960843 37033007 28326682 22536219
18096B2536219l989713l031721k458201k059596j557319j166400p41632p80066
$$ 22536219 18546506 15514785 13056584 10996988 9439669 8273269 7531637 6751571
18088F751571q31306p37344p04618l06822l79704k09962l73240l07575k81654
$$ 6751571 5920265 5182921 4478303 4171481 3791777 3581815 3208575 2901000 2619346
18079B619346k46846j69469k05188j57043j6363n6546q6197m7333o3396j41912
$$ 2619346 2372500 2203031 1997843 1840800 1824437 1767891 1681694 1634361 1570965 1429053
18069A429053l589j00729k17649P6593j47036j62545j70262k29149M677p4854
$$ 1429053 1425464 1324735 1107086 1183679 1036643 874098 703836 474687 479364 404510
18059D04510j00680r0024j08713J2217K30151O4950O4220l1563r5810J5061J4398
$$ 404510 303830 213806 105093 117310 347461 412411 476631 445068 349258 364319 378717
18048C78717j24327j12942L1940k2178k4461n1068N6051o7581J96539J54565k7987
$$ 378717 254390 141448 173388 151210 126749 75681 131732 64151 260690 415255 387268
18037C87268p2953l6886N718j24455j99756k2874o8830N7469J11030J47226O9956
$$ 387268 314315 277429 283147 158692 -41064 -63938 -132768 -75299 35731 182957 252913
18026B52913o9560p2596R7207j6632j15846k9365n2730J21057J50091j1888k34302
$$ 252913 183353 110757 207964 191332 75486 46121 -6609 114448 264539 252651 18349
18015A8349J65612K43876j17251k8598k1649p753j48625J5365k2722j73834L4737
$$ 18349 183961 427837 310586 281988 260339 252586 103961 119326 96604 -77230 -42493
18004d2493J9927j10394p7971j0058J28607J69133P3070p3649l866L3268p5185
$$ -42493 -22566 -132960 -210931 -220989 -92382 76751 149821 76172 72306 105574 30389
17993C0389j00352K98991J25318m0422P1655L1149j75462N9489J17164j6673j36285
$$ 30389 -69963 229028 354346 313924 385579 416728 241266 300755 417919 401246 264961
17982B64961j09590q2937o949k9628L6686J8536n4273k765J73980m8086j25818
$$ 264961 155371 72434 65485 35857 72543 91079 36806 34041 208021 159935 34117
17971C4117j35533o8153K4476J4009L8092L54830j32236k21968k9700K12979j3960
$$ 34117 -101416 -169569 -145093 -131084 -92992 261838 129602 -92366 -122066 90913 76953
17960G6953j58639n9594J00733J68514n0121j32261Q1774P697n096J45507J96423
$$ 76953 -81686 -141280 -40547 127967 77846 -54415 27359 35056 29960 175467 371890
17949C71890j19821k8487o8038j09486K1427k08307n6816q0603K0631J90066O2856
$$ 371890 252069 223582 155544 46058 67485 -140822 -197638 -278241 -257610 -67544 -4688
17938d688m4790O9648K486L96R3455Q9743j85754j04506n1218K4815j34153J5832
$$ -4688 -49478 20170 22656 23052 116507 206250 20496 -84010 -135228 -110413 -244566 -228734
17926b28734M4682J27473n6532n8204k8259O6327J02953J84804K52407Q2040k22468
$$ -228734 -184052 -56579 -113111 -171315 -199574 -133247 -30294 154510 406917 488957 266489
17915B66489r2761J99210J60193k33632j98442q2208q1069j08122m5986r4717
$$ 266489 173728 372938 533131 299499 101057 18849 -62220 -170342 -216328 -311045
17905c11045J46442J94368J04j61269R8814L9366j00037l1278L7649j8683l6505
$$ -311045 -164603 29765 29869 -131400 -32586 6780 -93257 -124535 -86886 -105569 -142074
17894a42074j11763m4915L9997J3868Q4355O1080P1570j2659L4019j12057M8413
$$ -142074 -253837 -298752 -258755 -244887 -160532 -99452 -27882 -40541 -6522 -118579 -70166
17883g0166M7501P5535q9942K0742M6413m2555l9818m6259R2941P2465M6342l1461
$$ -70166 -22665 52870 -37072 -16330 30083 -12472 -52290 -98549 -5608 66857 113199 81738
17871H1738Q2410p0056j52322j14155K192M3153k0196J79909K6774r0562o1172
$$ 81738 164148 94092 -58230 -172385 -170193 -127040 -147236 32673 59447 -31115 -92287
17860i2287O7309J3323j22513j81814k5964K53608k6788j08120Q791J01011J72629
$$ -92287 -24978 -11655 -134168 -315982 -341946 -88338 -115126 -223246 -214455 -113444 59185
17849E9185Q834l2697O9955j10774k02883j39388p5451L2867j2315J85920J48664
$$ 59185 68019 35322 105277 -5497 -208380 -347768 -423219 -390352 -402667 -216747 -68083
17838f8083K5252j73167j03866N4128J31917j55161j8354J61845m8799j35801
$$ -68083 -42831 -215998 -319864 -265736 -133819 -288980 -307334 -145489 -194288 -330089
17828c30089L7808J70578O6277k02032k6698M4962Q871l2285j7535m6308M6572
$$ -330089 -292281 -121703 -55426 -257458 -284156 -239194 -230323 -262608 -280143 -326451 -279879
17817b79879N9670J2468J12942Q7633n7185L7142N5183R1206O618r9359j50821
$$ -279879 -220209 -207741 -94799 -7166 -64351 -27209 27974 119180 125798 26439 -124382
17806a24382p9043j6507L7247J00264L1255p5371J5419k2253j4644K8264J23925
$$ -124382 -203425 -219932 -182685 -82421 -51166 -126537 -111118 -133371 -148015 -119751 4174
17795D174M8986k6474o6823N0529R7459o2222j32660Q987Q2112N6084l2250L5096
$$ 4174 53160 26686 -40137 10392 107851 45629 -87031 -78044 4068 60152 27902 62998
17783F2998J01747J92642j64549j82148j48546m4574N8523n3476l8227J76959
$$ 62998 164745 357387 192838 10690 -137856 -182430 -123907 -177383 -215610 -38651
17773c8651J60465j57703L4885p5024l559k10436O4200o4635M3908O7381J18230
$$ -38651 121814 -35889 -1004 -76028 -79587 -290023 -225823 -290458 -246550 -179169 -60939
17762f0939J88197Q401j49452O6527l2922L6480j4061j98501j70000K52112J57491
$$ -60939 127258 135659 -13793 52734 19812 56292 42231 -156270 -326270 -74158 83333
17751H3333l1833k64889K6122K17093Q6009J8975r7073o2319J89214N3338N4277
$$ 83333 51500 -213389 -187267 29826 115835 134810 37737 -24582 164632 217970 272247
17740B72247q9056k75915j86460L5659P6202J44945j04663k20264r075M7118p0539
$$ 272247 183191 -92724 -279184 -243525 -167323 -22378 -127041 -347305 -356380 -309262 -379801
17729c79801l7154K22974M5922J0171L8113J55943J673m2172Q4543N2863j76285
$$ -379801 -416955 -193981 -148059 -137888 -99775 56168 57841 15669 100212 153075 -23210
17718b3210P568K14601N6577o4700n0299j11894j93431J64254J56921L5963j36150
$$ -23210 -15642 198959 255536 190836 140537 28643 -164788 -534 156387 192350 56200
17707E6200o1004j6475L4427m0290m5270L2997q5418n0279j29855J86904j48688
$$ 56200 -4804 -21279 13148 -27142 -72412 -39415 -124833 -175112 -304967 -118063 -266751
17696b66751l9489P0295m1751q352j37085K4844J85083J27595j04087p7964Q8037
$$ -266751 -306240 -235945 -277696 -286048 -423133 -398289 -213206 -85611 -189698 -267662 -179625
17685a79625L9714k459o7908O9835L5629o5706J56746J40330j6653l9175Q7114
$$ -179625 -139911 -142370 -210278 -140443 -104814 -170520 -13774 126556 109903 70728 157842
17674A57842J15799j94210j30556J24223J85710j03329o4982P8393j14974P7627
$$ 157842 273641 79431 -51125 73098 258808 155479 90497 168890 53916 131543
17664A31543k0094j57377k15908M398n0711r858j0428j4165J59429J9584R1126
$$ 131543 111449 -45928 -261836 -257438 -308149 -318007 -328435 -342600 -183171 -163587 -72461
17653g2461M8460J3241K28924K74649j66455l03609k49521K0024J52346J12296
$$ -72461 -24001 -10760 218164 492813 326358 22749 -226772 -206748 -54402 57894
17643E7894K6311k7771L1718j2490o0857n4874J24315k1410j37087J63097p4714
$$ 57894 84205 56434 88152 75662 14805 -40069 84246 62836 -74251 88846 14132
17632A4132k76885j11387N875p1853R4616O1936n7453J90498J17752j0434j120
$$ 14132 -262753 -374140 -368265 -440118 -345502 -283566 -341019 -150521 -32769 -43203 -44323
17621d4323j49127k0823N1303Q6594R8033M2379P3895j6616N3913p2833R276j06755
$$ -44323 -193450 -214273 -162970 -76376 21657 64036 137931 121315 175228 102395 111671 4916
17609D916j69704K631K8030j7643Q7359O1042j77252k0076M4351J39978k8475
$$ 4916 -164788 -162157 -134127 -151770 -64411 -3369 -180621 -200697 -156346 -16368 -44843
17598d4843P4568q8730k5658J1111k6619n7942j89125q9185J82921K87280K46669
$$ -44843 29725 -59005 -84663 -73552 -100171 -158113 -347238 -436423 -253502 33778 280447
17587B80447j7389k09288J0823P9700j9978q5235j12783j2757K49557R608P29
$$ 280447 263058 53770 64593 144293 124315 39080 -73703 -86460 163097 172705 173434
17576A73434p7655j09082L6086q9629j70188M6137J6954J57859l985p9265N4696
$$ 173434 95779 -13303 22783 -66846 -237034 -190897 -173943 -16084 -20069 -99334 -44638
17565d4638j17911O9797J44550J66033n9675j31942J72082J43056j43148p9701
$$ -44638 -162549 -92752 51798 217831 158156 26214 198296 341352 198204 118503
17555A18503n8204P3854r2479m2058j0111j08013J12551J25502j04553n3029Q2287
$$ 118503 60299 134153 41674 -384 -10495 -118508 -5957 119545 14992 -38037 44250
17544D4250o5020N6792j2550j22150K21499m0892m1414n6434P3214r0657m941
$$ 44250 -20770 36022 23472 -98678 122821 81929 40515 -15919 57295 -33362 -38303
17533c8303N6805L8692P8065m790k60939o2206l3307m7084K8636j7197n3029J39884
$$ -38303 18502 57194 135259 130469 -130470 -192676 -225983 -273067 -244431 -261628 -314657 -174773
17521a74773K7972j16130o0821j4442J37881M8274L3851J03785M4708O855J6024
$$ -174773 -146801 -262931 -323752 -338194 -200313 -152039 -118188 -14403 30305 37160 53184
17510E3184k6933p3308J25543K9901k3158M2089o9909n7474j2498k01425m3622
$$ 53184 26251 -47057 78486 108387 85229 127318 57409 -65 -12563 -213988 -257610
17499b57610M4834K11209L6915m8535J71364j9348J07867Q2858j27149k68848
$$ -257610 -212776 -1567 35348 -13187 158177 138829 246696 329554 202405 -66443
17489f6443j05154m7698J05803R1255j00208n7134P4680M395n418J44448n6668
$$ -66443 -171597 -219295 -113492 -22237 -122445 -179579 -104899 -100504 -105922 38526 -18142
17478a8142j15947r1096l6148J42639J50046k4762j38891k37914m0889J24734
$$ -18142 -134089 -225185 -261333 -118694 31352 6590 -132301 -370215 -411104 -286370
17468b86370m94J98389O4779R7260K21794n3008K4188m7984p9227N5293l6870
$$ -286370 -286864 -88475 -23696 73564 295358 242350 266538 218554 139327 194620 157750
17457A57750n4132j22502j16705L3621J96531j67315j4784K31281J91610O6324
$$ 157750 103618 -18884 -135589 -101968 94563 -72752 -87536 143745 335355 401679
17447D01679j55501l719J16036j28483n8165K52520K59182O31045P95744K5000
$$ 401679 246178 242459 358495 230012 171847 424367 683549 1314594 2110338 2135338
17437B135338p65413n14330l98220k35934j45613q1514P2767r6474k37480l0963
$$ 2135338 1369925 855595 457375 221441 75828 -5686 67081 -29393 -266873 -297836
17427b97836K17145R7573k0617m6615q29J3406K5711j61146O5089R5238P1402
$$ -297836 -80691 16882 -3735 -50350 -51179 -37773 -12062 -173208 -108119 -12881 58521
17416E8521J44344O9773l7227j00117P133j8040n2940p0363n6665q4623L3676
$$ 58521 202865 272638 235411 135294 142427 124387 71447 1084 -55581 -140204 -106528
17405a06528J61462J2610j09758J68131J50701q6383q4715J9741P3886p8192R845
$$ -106528 54934 67544 -42214 125917 276618 190235 105520 125261 199147 120955 130800
17394A30800N5725l6569r0728K4842r8886r6196L9597J51711J34765K5795k15937
$$ 130800 186525 149956 59228 84070 -14816 -111012 -71415 80296 215061 240856 24919
17383B4919k70479P0415P2666j6597j568J83013n7139O0203J25408k3091J1893
$$ 24919 -245560 -175145 -102479 -119076 -120644 62369 5230 65433 190841 167750 179643
17372A79643o1581n2673j77942O3137J8162j85609r463q9948j7780K2826J64581
$$ 179643 118062 65389 -112553 -49416 -31254 -216863 -226326 -316274 -334054 -311228 -146647
17361a46647K18500j71776q9972j09812J90281N9k2725R7454P4234k1688R8720
$$ -146647 71853 -99923 -189895 -299707 -109426 -109367 -132092 -34638 39596 17908 116628
17350A16628J84590r0724j93027p8554o1640L7699j55918J07417P0317j45972
$$ 116628 301218 210494 17467 -61087 -122727 -85028 -240946 -133529 -63212 -209184
17340b09184o7326r263K67203J10295m466J53441l0977k17033o0735O6011k1503
$$ -209184 -276510 -285773 -18570 91725 87259 240700 209723 -7310 -68045 -2034 -23537
17329b3537j48495L0590j08665o8499R3098j6612k3996J43601q1963m1195J04578
$$ -23537 -172032 -141442 -250107 -318606 -225508 -242120 -266116 -122515 -204478 -245673 -141095
17318a41095K49669m7374m6729q8860N6502j56492j45014j8259R9788Q0412J05021
$$ -141095 108574 61200 14471 -74389 -17887 -174379 -319393 -337652 -237864 -157452 -52431
17307e2431Q4608j8320k0192M0276K1314j0563J17664j68106n2250l5280K2863
$$ -52431 32177 13857 -6335 33941 55255 44692 162356 -5750 -58000 -93280 -70417
17296g0417O6909J9000J4398j65841M8407O5989j66619m1665J4747l8868q3460
$$ -70417 -3508 15492 29890 -135951 -87544 -21555 -188174 -229839 -215092 -253960 -337420
17285c37420l3268m6562K64212J63340j476k8501M151R0698M4054Q7683N3278
$$ -337420 -370688 -417250 -153038 10302 8826 -19675 -15524 75174 119228 206911 260189
17274B60189j85961q6174J77536n1726o6072j47253J8406J01374J14787k9671
$$ 260189 74228 -11946 165590 113864 47792 -99461 -81055 20319 135106 105435
17264A05435k23894M5386J24807J25961j8229j33039P5011J20752j1559j4235
$$ 105435 -118459 -73073 51734 177695 159466 26427 101438 222190 210631 196396
17254A96396n2090j08566m2251n1959p7371n6980n7388N7775K62578O3471l23103
$$ 196396 144306 35740 -6511 -58470 -135841 -192821 -250209 -192434 70144 133615 -189488
17243a89488k43909P4708J69520m8477j62398n752L6810K51264K18022N2312p5420
$$ -189488 -433397 -358689 -189169 -237646 -400044 -405796 -368986 -117722 100300 152612 77192
17232G7192n1431P4430J48677r8546p3699O631j24609j04715P3089J23432J8465
$$ 77192 25761 100191 248868 150322 76623 83254 -41355 -146070 -72981 50451 68916
17221F8916k28713K15340Q9500j17894j67468j76083M2739J66172P1516l782R5529
$$ 68916 -159797 55543 145043 27149 -140319 -316402 -273663 -107491 -35975 -39757 55772
17210E5772M984k21631J29069P8628j38911N4607j9653j75723m0454L101J27516
$$ 55772 60756 -160875 -31806 46822 -92089 -37482 -57135 -232858 -273312 -270211 -142695
17199a42695J39225Q2337K7827Q3573p584m7876M0473j3917o4281O3199L8314
$$ -142695 -3470 78867 106694 190267 182683 134807 175280 161363 97082 160281 198595
17188A98595k11641j55178M518o719j14295p55P9659j06380J3156J4519J18630
$$ 198595 -13046 -168224 -163706 -170425 -284720 -285475 -205816 -312196 -299040 -284521 -165891
17177a65891n3475o0653J98743J02357k39517p1579M0140j28083N6932R2903n2087
$$ -165891 -219366 -280019 -81276 21081 -218436 -290015 -249875 -377958 -321026 -228123 -280210
17166b80210p7873M9947L3425J23434K72741j79854Q4534j9036l557j01128q5463
$$ -280210 -358083 -308136 -274711 -151277 121464 -58390 26144 7108 3551 -97577 -183040
17155a83040M9395K1393m5831j1728J28370P4245N6147j59467R772O2651Q7075
$$ -183040 -133645 -112252 -158083 -169811 -41441 32804 88951 -70516 -60744 1907 88982
17144H8982J23901L6921j0697r7021M357K611m5414k8102j67820j0380K11239
$$ 88982 212883 249804 239107 142086 146443 149054 103640 75538 -92282 -102662 108577
17133A08577m4771N1242K095r3137J32040j2181p1453r4140J03004j01283m9373
$$ 108577 63806 115048 117143 24006 156046 143865 72412 -21728 81276 -20007 -69380
17122f9380J66572m9431j2900J67066q242j47389j40162O9088j0643o0099j8657
$$ -69380 97192 47761 34861 201927 193685 46296 -93866 -24778 -35421 -95520 -114177
17111a14177J20475R0716J31053j35777j04971J6548k3401o0075q8090j0402J42681
$$ -114177 6298 97014 228067 92290 -12681 3867 -19534 -79609 -167699 -178101 -35420
17100c5420K89262J9201l62000K1047Q6591N111J4367P0482Q3685r9832r4644
$$ -35420 253842 273043 -88957 -67910 18681 23792 38159 108641 192326 92494 -2150
17089b150j63150j10750k84311J21407M04108N1061j44009J10109K6752j44726
$$ -2150 -165300 -276050 -560361 -438954 -34846 16215 -127794 -17685 9067 -135659
17079a35659L7702r3481j86269O9870o5752k3928J04432K07411K95666J09563
$$ -135659 -97957 -191438 -377707 -307837 -373589 -397517 -293085 -85674 209992 319555
17069C19555j72450M2569r4833J03655O4064o5101n4748O699q7588L2007j16238
$$ 319555 147105 189674 94841 198496 262560 197459 142711 149410 61822 93829 -22409
17058b2409j90831K1558J69747J40490J4922j06886j05627K7100O1060m4436o0569
$$ -22409 -213240 -191682 -21935 118555 133477 26591 -79036 -51936 9124 -35312 -95881
17047i5881O7209J18082p3307J46795K44861M530j61720j6781o2000n2819j7108
$$ -95881 -28672 89410 16103 162898 407759 412289 250569 233788 171788 118969 101861
17036A01861j18342n7838J98421o4041q7869R8040n1908K327m3849L3176O7876
$$ 101861 -16481 -74319 124102 60061 -27808 70232 18324 20651 -23198 9978 77854
17025G7854k4536j28433j03261J07716Q8974M1530J3353M8817K4471L4554N712
$$ 77854 53318 -75115 -178376 -70660 18314 59844 73197 122014 146485 181039 186751
17014A86751m2623j91586r9068P8656J11278Q1214M6669q9509r6177J06683j52287
$$ 186751 144128 -47458 -146526 -67870 43408 124622 171291 81782 -14395 92288 -59999
17003e9999q1098m5200J43136P6714j09345n6831m9514j3683K64708j8795p6571
$$ -59999 -141097 -186297 -43161 33553 -75792 -132623 -182137 -195820 68888 50093 -26478
16992b6478m7249r3079R935M6458j32403K54646Q8439J25133K2630j65303k41767
$$ -26478 -73727 -166806 -156871 -110413 -242816 11830 100269 225402 248032 82729 -159038
16981a59038j26447L606J31416R621k5550L4365J60161k1432j96842k661J47852
$$ -159038 -285485 -281879 -150463 -140842 -166392 -132027 28134 6702 -190140 -192801 -44949
16970d4949J12887J3214j9479J73618m2907q2201k0601j92853o1047M0682K716
$$ -44949 67938 81152 61673 235291 192384 110183 89582 -103271 -164318 -123636 -120920
16959a20920k2775Q7782m0100J02043K9273M8374Q6255n4337R3871k3245J71924
$$ -120920 -143695 -55913 -96013 6030 35303 83677 169932 115595 209466 186221 358145
16948C58145L717m6881j03866p7597k25525N5699o5960m529K2183Q3822R3758
$$ 358145 361862 314981 211115 133518 -92007 -36308 -102268 -106797 -84614 -792 92966
16937I2966o6675j70446j27957J13449K55156M6099o9409r016k8377j833J09597
$$ 92966 26291 -144155 -272112 -158663 96493 142592 73183 64167 35790 33957 143554
16926A43554J61435R1068j16127j39846k10683p5793R8175J92998k4492j09688
$$ 143554 304989 396057 279930 140084 -70599 -146392 -48217 144781 120289 10601
16916A0601j32663j22150j33335p3583O5427J84832J89431o4008j74074K4418
$$ 10601 -122062 -244212 -377547 -451130 -385703 -200871 -11440 -75448 -249522 -225104
16906b25104n0856l6141Q9576L6189m6800r6604m901J29126p575k68595J24162
$$ -225104 -275960 -312101 -222525 -186336 -233136 -329740 -334641 -205515 -213090 -481685 -357523
16895c57523O5924j0727L7261k4347N8462Q08m4102m2267J96196P3901k2219K43067
$$ -357523 -291599 -302326 -265065 -289412 -230950 -230142 -274244 -316511 -120315 -46414 -68633 174434
16883A74434K23572l075m5648m0739j88478k33121L398n9675K6655N0344j68432
$$ 174434 398006 394931 349283 308544 120066 -113055 -109657 -169332 -142677 -92333 -260765
16872b60765N4062m0055j6301K0882P2118J1460L4802o8500j61504k8375J15598
$$ -260765 -206703 -246758 -263059 -242177 -170059 -158599 -123797 -192297 -353801 -382176 -266578
16861b66578M7744M5479K6233J16416L4815j25808O0705j49170J12869J77255
$$ -266578 -218834 -173355 -147122 -30706 4109 -121699 -60994 -210164 -97295 79960
16851G9960k9056j40073J17311j26866j28189J03494k9637j6260j40596n4460
$$ 79960 50904 -89169 28142 -98724 -226913 -123419 -153056 -169316 -309912 -364372
16841c64372M3879J23019j18902o1216K25734J24777p4751k6385j98q7082J06844
$$ -364372 -320493 -197474 -316376 -377592 -151858 -27081 -101832 -128217 -128415 -215497 -108653
16830a08653J27590q0694J26971J68569j24948q7590K9596o6440k22992k2441
$$ -108653 18937 -61757 65214 233783 108835 21245 50841 -15599 -238591 -261032
16820b61032N4737P6351R6389P5705m1651j1024J0792L3462M319l3037O214R836
$$ -261032 -206295 -129944 -33555 42150 499 -10525 267 33729 38048 5011 11225 21061
16808B1061O910k4335K7044N2458m8072o0892j06861P1603J42416J42876N6452
$$ 21061 27971 3636 30680 83138 35066 -25826 -132687 -61084 81332 224208 280660
16797B80660j13616j42684l1929j28613L7612J30887J42240j01311K0126Q1562
$$ 280660 167044 24360 -7569 -136182 -98570 32317 174557 73246 93372 174934
16787A74934J31750r2236q851q6477n1815l1939J2962J31189k5505m7800j12577
$$ 174934 306684 214448 205597 119120 67305 35366 48328 179517 154012 106212 -6365
16776f365j565J32871L3164J18959O9630j73378l8793j18021k09967J0818P8431
$$ -6365 -7930 124941 158105 277064 346694 173316 134523 16502 -193465 -182647 -104216
16765a04216k2886N6572N5392M6574J3129O696K00362J57787k20568j46692M3161
$$ -104216 -127102 -70530 -15138 31436 44565 51261 251623 409410 188842 42150 85311
16754H5311O4333q8606Q5822M9735P9013L3333k09817o0033j6603j38649o9695
$$ 85311 149644 61038 146860 196595 275608 308941 99124 39091 22488 -116161 -185856
16743a85856k8495L2240K53956P3223j03575r1534O4878o2035O4008o1294O5984
$$ -185856 -214351 -182111 71845 145068 41493 -50041 14837 -47198 16810 -44484 21500
16732B1500l8516l9232K33394N2269j07562J485j03470J1556J00166M3677m4697
$$ 21500 -17016 -56248 177146 229415 121853 123338 19868 31424 131590 175267 130570
16721A30570K5789r4420l8706q6327J31490R932k9267M9684O3800N7921N0881
$$ 130570 156359 61939 23233 -63094 68396 78328 49061 98745 162545 220466 271347
16710B71347o1956j49934M2731R9969q831K1756k7321o5693j80474r3817J13753
$$ 271347 209391 59457 102188 202157 193326 215082 187761 122068 -58406 -152223 -38470
16699c8470R8481j14297m5049l9614l301L0883j06742j22635k3883J5200J22039
$$ -38470 60011 -54286 -99335 -138949 -142250 -111367 -218109 -340744 -364627 -349427 -227388
16688b27388K18213J13818M768m3992r2833n7435K7454j35397j05976J01444k4390
$$ -227388 -9175 104643 109411 65419 -27414 -84849 -57395 -192792 -298768 -197324 -221714
16677b21714J39363J76754q6100N3984P1989R5970j24700j47564j17350K2289
$$ -221714 -82351 94403 8303 62287 134276 230246 105546 -42018 -159368 -137079
16667a37079J57293K05350K7403l02640l19288j0317Q2767Q1440J50937J37537
$$ -137079 20214 225564 252967 -49673 -368961 -379278 -296511 -215071 -64134 73403
16657G3403j9882J383q6559k3468P5005j0329o724j90842j87282p7742L3789K65790
$$ 73403 53521 54904 -31655 -55123 19882 9553 2829 -188013 -375295 -453037 -419248 -153458
16645a53458P6739n8228n433j4172J91634L3278j72265n2330r097K4783p166J05351
$$ -153458 -76719 -134947 -140380 -154552 37082 70360 -101905 -154235 -163332 -138549 -145715 -40364
16633d0364N2526j5960p1163P6860j27701Q4422K32788j31707K4226o1620n9705
$$ -40364 12162 -3798 -74961 1899 -125802 -41380 191408 59701 83927 22307 -37398
16622c7398J51529J6415p3221K2194J2906R6031j89853q1687k5238r160J17675
$$ -37398 114131 130546 57325 79519 92425 188456 -1397 -83084 -108322 -117482 193
16611A93o5415Q407N14J47478N6150L1215j2656j64305O0953J70040M8894k10427
$$ 193 -65222 -56815 -56301 91177 147327 178542 165886 1581 62534 232574 281468 71041
16599G1041l41009k9793L15545l8522k43354K57486J46067l41439q9235R7730
$$ 71041 -269968 -299761 15784 -22738 -266092 -8606 137461 -203978 -293213 -195483
16589a95483O6315q4029N0598m9624k9451j0759O7302J37728J1176j04777K0061
$$ -195483 -129168 -213197 -162599 -212223 -241674 -252433 -185131 -47403 -36227 -141004 -120943
16578a20943j00721l01415q831N2919J25401N4101N3307J8548N0154l8624J1867
$$ -120943 -221664 -523079 -531910 -478991 -353590 -299489 -246182 -227634 -177480 -216104 -204237
16567b04237k6173J05321J73339j28893q8520P9891q8109p6882j03121k5259K33225
$$ -204237 -230410 -125089 48250 -80643 -169163 -89272 -177381 -254263 -357384 -382643 -149418
16556a49418O6556l184J40509p844j19287P4509K3384R7546j5264j29087L0223
$$ -149418 -82862 -86046 54463 46619 -72668 1841 25225 122771 107507 -21580 8643
16545H643j8859m1929j2650J52706j154j6532L7999j12726J15043K3119j73667
$$ 8643 -10216 -52145 -64795 87911 86757 70225 108224 -4502 110541 133660 -40007
16534d0007N012j12756p5977J41338J90531j09274j05910M0444J20985K8167k53687
$$ -40007 -34995 -147751 -223728 -82390 108141 -1133 -107043 -66599 54386 82553 -171134
16523a71134j48702l559J88777N9682Q7931K0132j12334j31836J07885J59036
$$ -171134 -319836 -323395 -134618 -74936 12995 33127 -79207 -211043 -103158 55878
16513E5878p8407j59134L927l4326q4659Q8309K8644j14397n938J73057p3688
$$ 55878 -22529 -181663 -177736 -212062 -296721 -208412 -179768 -294165 -300103 -127046 -200734
16502b00734J7999M9238P7565p4999L6437k673L8932N7980L2099Q5304j09167
$$ -200734 -182735 -133497 -55932 -130931 -94494 -97167 -58235 -255 31844 117148 7981
16491G981j09715J84591N846k7316L2480n8559k01292j5840O7674k9779k5422
$$ 7981 -101734 82857 88703 61387 93867 35308 -165984 -181824 -114150 -143929 -169351
16480a69351k1110j3953L4391l4241o120K48704J97366j11765j35765N9044r0218
$$ -169351 -190461 -204414 -170023 -204264 -210384 38320 235686 123921 -11844 47200 -43018
16469d3018j94153P4896O1099j56310N4341K25302o7013o3536l5053k5986J67375
$$ -43018 -237171 -162275 -101176 -257486 -203145 22157 -44856 -108392 -143445 -169431 -2056
16458b056l4284j5121k4032J24954O6899n2851j9370n4174n3796j39338j45098
$$ -2056 -36340 -51461 -75493 49461 116360 63509 44139 -10035 -63831 -203169 -348267
16447c48267K03976J18906J9990j44274j25703J4721K29680J41571R0100j07916
$$ -348267 -144291 -25385 -5395 -149669 -275372 -260651 -30971 110600 200700 92784
16437I2784j29310N9974j5863l0040r1885J34936j562j5310Q0877o187K78N5629
$$ 92784 -36526 23448 7585 -22455 -114340 20596 19034 3724 84601 78414 78692 134321
16425A34321K9628j84610p8369L4727j63983K7571Q5714n3653J01344O5912p4012
$$ 134321 163949 -20661 -99030 -64303 -228286 -200715 -115001 -168654 -67310 -1398 -75410
16414g5410L8752l6731J03680K19828L7188M7497J4081j97186j74385l6514o5531
$$ -75410 -36658 -73389 30291 250119 287307 334804 348885 151699 -22686 -59200 -124731
16403a24731j43950j34115q5054J15460J61030j0688J12383M0190j21831J71728
$$ -124731 -268681 -402796 -487850 -372390 -211360 -222048 -109665 -69475 -191306 -19578
16393a9578J67198j38071k59703j97668J28836K92636K8883r5685j5646J14838
$$ -19578 147620 9549 -250154 -447822 -318986 -26350 2533 -93152 -108798 6040
16383F040p4058L7659j22170r4029J53785L7596K1457j10153J39056K00489n8981
$$ 6040 -68018 -30359 -152529 -246558 -92773 -55177 -33720 -143873 -4817 195672 136691
16372A36691J24905m0310j53193M8634j57676Q9310o0854l4841J19944J9078p1196
$$ 136691 261596 221286 68093 116727 -40949 48361 -12493 -47334 72610 91688 20492
16361B0492K3294N680o7653J30398J67406j11248k93908o7523J07325r2235Q5371
$$ 20492 43786 49466 -18187 112211 279617 168369 -125539 -193062 -85737 -177972 -92601
16350i2601J66790K7704q4257J11936J77263o0095j14669j83397j41631K0064
$$ -92601 74189 101893 17636 129572 306835 246740 132071 -51326 -192957 -172893
16340a72893m164k8896k08502r4401N9404k8492O2092K06405J18944j7281L7139
$$ -172893 -177057 -205953 -414455 -508856 -449452 -477944 -415852 -209447 -90503 -107784 -70645
16329g0645k0213K5632J53110J65080r5362p8227l3297k7005p775m601O9608p0334
$$ -70645 -90858 -65226 87884 252964 157602 79375 46078 19073 11298 6697 76305 5971
16317E971k66964p2525O150J25425J53207J26308J04284p5755P4710J05778l6598
$$ 5971 -260993 -333518 -327368 -201943 -48736 77572 181856 106101 180811 286589 249991
16306B49991l5839j33856o5081J1499n6640M3470j73238K8265N1753M0571L3653
$$ 249991 214152 80296 15215 26714 -29926 13544 -159694 -131429 -79676 -39105 -5452
16295e452M3336n3134p591Q4098j66291N4398J49645L7974j67069r3529R7305
$$ -5452 37884 -15250 -22841 61257 -105034 -50636 99009 136983 -30086 -123615 -26310
16284b6310R2529k18779j85408j04765J42898J76120j28242j43122k119M8730
$$ -26310 66219 -152560 -337968 -442733 -299835 -123715 -251957 -395079 -397198 -348468
16274c48468Q0121q9677p7449Q0681R2035L2815J03299N4525J60244L8787J60783
$$ -348468 -268347 -358024 -435473 -354792 -262757 -229942 -126643 -72118 88126 126913 287696
16263B87696j97722j77101o854L9080k0032J06276m1042P7445O5583m8681p9644
$$ 287696 89974 -87127 -93981 -54901 -74933 31343 -9699 67746 133329 84648 5004
16252E004j06834q0801J7420J11170J12467o8847o7458n7404K13598J78289j5689
$$ 5004 -101830 -182631 -165211 -54041 58426 -10421 -77879 -135283 78315 256604 240915
16241B40915r6049o0531o0481J33822R5038l5441q9692j82636k71303j55985J01869
$$ 240915 144866 84335 23854 157676 252714 217273 127581 -55055 -326358 -482343 -380474
16230c80474J48261K16314j53734M6200J45124o8670j35314k7733P9646J7453
$$ -380474 -232213 -15899 -169633 -123433 21691 -46979 -182293 -210026 -130380 -112927
16220a12927k4373j6047j16793j00500m2220K08410l282l1484n8944Q7084O1571
$$ -112927 -137300 -153347 -270140 -370640 -412860 -204450 -207732 -239216 -298160 -211076 -149505
16209a49505j07915R4480J66119Q2505j1187l7939m3362L9589J37511J34432K2153
$$ -149505 -257420 -162940 3179 85684 74497 36558 -6804 32785 170296 304728 326881
16198C26881m1266k9035r397l55853p1422k2974L3690J8484q2906N6005J13927
$$ 326881 285615 256580 247183 -108670 -180092 -203066 -169376 -150892 -233798 -177793 -63866
16187f3866n4816r4796O5393l221K6050q353p2268n7886o5585j31547o3245J31206
$$ -63866 -118682 -213478 -148085 -151306 -125256 -133609 -205877 -263763 -329348 -460895 -524140 -392934
16175c92934K89239J07199K3134m3694O5488J29503M860q6361r9411L5284J6352
$$ -392934 -103695 3504 26638 -17056 48432 177935 182795 96434 -2977 32307 48659
16164D8659J00835J52039j35729j17577j79685J6022k6788r9932j89146J02907
$$ 48659 149494 301533 165804 48227 -131458 -115436 -142224 -242156 -431302 -328395
16154c28395K04225J64860j61939k6882J28226O1583j96573k49212K0323J21897
$$ -328395 -124170 40690 -121249 -148131 -19905 41678 -154895 -404107 -383784 -261887
16144b61887K12576r3690K3670J36933o5663p2338J77399l7775L4602R6457l9223
$$ -261887 -49311 -143001 -119331 17602 -48061 -120399 57000 19225 53827 150284 111061
16133A11061o853q1064M3092r8124l9464j21974m1293O2625J78501J61615j0744
$$ 111061 104208 23144 66236 -31888 -71352 -193326 -234619 -171994 6507 168122 157378
16122A57378j42150j59142j8151Q16M2378J40565M4142o7252O06J9590Q3819J48055
$$ 157378 15228 -143914 -162065 -161249 -118871 21694 65836 -1416 -810 18780 102599 250654
16110B50654j48154j8755J44882o7686j19729r4413J001J92042J49839j13802
$$ 250654 102500 83745 228627 160941 41212 -53201 -52200 139842 289681 175879
16100A75879j37029k2190j72276P0566M7009j2414M4824Q4487M6720j17436j21077
$$ 175879 38850 16660 -155616 -85050 -38041 -50455 -5631 78856 125576 8140 -112937
16089a12937j31751O777J15729J26016J30382j39612j24626O5188n6718L5118
$$ -112937 -244688 -237911 -122182 3834 134216 -5396 -130022 -64834 -121552 -86434
16079h6434J63235j58535n4579J08350L724l3640o5831J03125R0691j5637R8555
$$ -86434 76801 -81734 -136313 -27963 -24239 -57879 -123710 -20585 70106 54469 153024
16068A53024m9705J3351j39782j46788J50945Q2322O8641J0442o2777j48584K18067
$$ 153024 103319 116670 -23112 -169900 -18955 63367 132008 142450 79673 -68911 149156
16057A49156J20260j80528P0014N6029O2917k1378k11000j18488j09266Q3533
$$ 149156 269416 88888 158902 214931 277848 256470 45470 -73018 -182284 -98751
16047i8751K71299j9868Q2886j24037Q134j7790n6665K8185k8846J3878j70453
$$ -98751 172548 152680 235566 111529 119663 101873 45208 73393 44547 58425 -112028
16036a12028J08135P0225L870L4124j05845q1734J13038O185J18297L4217j79857
$$ -112028 -3893 66332 70202 104326 -1519 -83253 29785 35970 154267 188484 8627
16025H627n7241M0138K6141m3414j10041J15222Q2073n4681O1234R2425p5289
$$ 8627 -48614 -8476 17665 -25749 -135790 -20568 61505 6824 68058 160483 85194
16014H5194l1340q6155N6225J83686O4265j5455r4613o6017J11695j8308j14886
$$ 85194 53854 -32301 23924 207610 271875 256420 161807 95790 207485 189177 74291
16003G4291J29405k2273p8588p6194q9873k9642O965k4308R5569J40269p2815
$$ 74291 203696 181423 102835 26641 -63232 -92874 -85909 -110217 -14648 125621 52806
15992E2806j31391q1614j06939o7402J62799N4852j15978P6172K27530m9758M3021
$$ 52806 -78585 -160199 -267138 -334540 -171741 -116889 -232867 -156695 70835 21077 64098
15981F4098J52088J04512j24741p9599j98231j88057n5420J29533r4611R4336
$$ 64098 216186 320698 195957 116358 -81873 -269930 -325350 -195817 -290428 -196092
15971a96092k4226P3417J99747O0250j6910K8552j30171j17909J08188J9501p7049
$$ -196092 -220318 -146901 52846 113096 96186 124738 -5433 -123342 -15154 4347 -72702
15960g2702K309j2272O2597K1840j54276l8005J0477k161P2165Q1210j17740o7354
$$ -72702 -70393 -82665 -20068 1772 -152504 -190509 -180032 -182193 -110028 -28818 -146558 -213912
15948b13912j56090p5466J47630K78398J89944m4447n5837p6977j29645n9831
$$ -213912 -370002 -445468 -297838 -19440 170504 126057 70220 -6757 -136402 -196233
15938a96233m4225j46283J18840J47029M4841J12487l4135K5225O202L9331k01684
$$ -196233 -240458 -386741 -267901 -120872 -76031 36456 2321 27546 33748 73079 -128605
15927a28605j9596M4767J07557J06325j52951l5388J58012n1960p0351j12660
$$ -128605 -148201 -103434 4123 110448 -42503 -77891 80121 28161 -42190 -154850
15917a54850N5383J23041J6581j08657j2730k2047j237O4342R5621l6875j88951
$$ -154850 -99467 23574 40155 -68502 -81232 -103279 -104516 -40174 55447 18572 -170379
15906a70379k8365J68546Q0458K3533n8144N2900q7831q4657P9352J99090J70126
$$ -170379 -198744 -30198 50260 73793 15649 68549 -19282 -103939 -24587 174503 344629
15895C44629K2014j58485q9280j59252J0714J97843J55221j42133j46094p360
$$ 344629 366643 208158 118878 -40374 -29660 168183 323404 181271 35177 27817
15885B7817p4037o4762J29126M9711j21824m413l0115J4275N6562J1794J10948
$$ 27817 -46220 -110982 18144 67855 -53969 -58382 -88497 -74222 -17660 -5866 105082
15874A05082K6471l9148K2653j44598r8781N2688j01606n9381n4149m5909J06043
$$ 105082 131553 92405 115058 -29540 -128321 -75633 -177239 -236620 -290769 -336678 -230635
15863b30635J01985j02574j40343j71377K16807J7715K0383Q4620J53706J29181
$$ -230635 -128650 -231224 -371567 -542944 -326137 -308422 -288039 -203419 -49713 79468
15853G9468M6136p8583j34486L6966j1251Q3877K1921R4127Q2638j2865Q0764
$$ 79468 125604 47021 -87465 -50499 -61750 22127 44048 138175 220813 207948 288712
15842B88712q346j2970J666j10843p3196j11854j76409J76859L175j67904R9469
$$ 288712 280366 267396 269062 158219 85023 -26831 -203240 -26381 -23206 -191110 -91641
15831i1641j73086P6446J3148j0658q4328Q0006P5752R9042J1477o8500p1536
$$ -91641 -264727 -188281 -175133 -185791 -270119 -190113 -114361 -15319 -3842 -72342 -143878
15820a43878L7933n6610M2722p085L1791l586M3305O1550j33329m5276Q9111N8181
$$ -143878 -105945 -162555 -119833 -126918 -95127 -98713 -55408 6142 -127187 -172463 -83352 -25171
15808b5171L3879j89297J96292K85102R2971Q730J03071j75726r7234j78307Q931
$$ -25171 8708 -180589 15703 300805 393776 402506 505577 329851 232617 54310 63241
15797F3241o435J3903k7939N5029N9499r2765p687L7817M6754j02528l12285k12577
$$ 63241 56806 70709 42770 97799 157298 64533 56846 94663 141417 38889 -273396 -485973
15785d85973p2138O0855l6475J11999R9990j15680J76795J34654J97486O2348
$$ -485973 -558111 -497256 -533731 -421732 -321742 -437422 -260627 -125973 71513 133861
15775A33861J580j96327p5312j68626p5418J52921J57018M7963j4329q4279j09077
$$ 133861 135441 -60886 -136198 -304824 -380242 -227321 -70303 -22340 -36669 -120948 -230025
15764b30025k5150L59793J73811l80697k54294J9380j8465J0960R3591R5529j26875
$$ -230025 -255175 104618 278429 -102268 -356562 -337182 -355647 -344687 -251096 -155567 -282442
15753b82442J49337o6618j80365R4997N7568n6063j12405m9543J41706J96000
$$ -282442 -133105 -199723 -380088 -285091 -227523 -283586 -395991 -445534 -303828 -107828
15743a07828J41261K12230l6346k26456r2480j18399o9288P8100Q9191O1619J02328
$$ -107828 33433 245663 209317 -17139 -109619 -228018 -297306 -219206 -130015 -68396 33932
15732C3932K4413k37141m1278J48015j53302J14247J11955J53678n0650j15386
$$ 33932 58345 -178796 -220074 -72059 -225361 -111114 841 154519 103869 -11517
15722a1517J58849m0656o370k04696j49873N6858J15247O3935k35364j80194J70241
$$ -11517 147332 106676 100306 -104390 -254263 -197405 -82158 -18223 -253587 -433781 -263540
15711b63540J53149N9254l1817J7599k6453j6962J4875L3388p2669M2342q9135
$$ -263540 -110391 -51137 -82954 -65355 -91808 -108770 -93895 -60507 -133176 -90834 -179969
15700a79969j28797j54892K01336J82202R0371M2428J41648N4204j34109J7741
$$ -179969 -308766 -463658 -262322 -80120 10251 52679 194327 248531 114422 132163
15690A32163K4577r4674j19244J44589K1794J2754p6969j41609n6258r3271K19249
$$ 132163 156740 62066 -57178 87411 109205 121959 44990 -96619 -152877 -246148 -26899
15679b6899K31010r3803N7938j24544j6798J2962k59596l0976K56948M7990O7599
$$ -26899 204111 110308 168246 43702 26904 39866 -219730 -250706 6242 54232 121831
15668A21831m4316k13365p127p9955L1873Q1039J29873K8895j78477J53774K23126
$$ 121831 77515 -135850 -142977 -222932 -191059 -110020 19853 48748 -129729 24045 247171
15657B47171Q6047q3668l5697j68114k7837J00766m4340j43826m3763L6704J75943
$$ 247171 333218 249550 213853 45739 17902 118668 74328 -69498 -113261 -76557 99386
15646I9386O1128j4227O9019Q0130r2154m1226j12545r5244p9789l4613L9989
$$ 99386 160514 146287 215306 295436 203282 162056 49511 -45733 -125522 -160135 -120146
15635a20146J17687J75635p8123j67936L2070M5759M5318r4696j13088r0147k1643
$$ -120146 -2459 173176 95053 -72883 -40813 4946 50264 -44432 -157520 -247667 -269310
15624b69310J14982K5220J61158O0037n3026n5700o6472M1773P3033l40L1450
$$ -269310 -154328 -129108 32050 92087 39061 -16639 -83111 -41338 31695 31355 62805
15613F2805j06170j34536k55454Q4983J11569Q8072J23941K19689K55378j760
$$ 62805 -43365 -177901 -433355 -348372 -236803 -148731 -24790 194899 450277 448517
15603D48517j46104l34976R90J38399K3028J17218k2129j77348p8537K16806J63662
$$ 448517 302413 -32563 -31573 106826 129854 247072 224943 47595 -30942 185864 349526
15592C49526p3929K0940l5832j44482j3384Q5652j66961k2048J14058n7457l31335
$$ 349526 275597 296537 260705 116223 102839 188491 21530 -518 113540 56083 -275252
15581b75252r2315J70981J64406K55254L0048l7163n0033l0578l1670Q1866J0228
$$ -275252 -367567 -196586 -32180 223074 253122 215959 165926 135348 103678 185544 195772
15570A95772k15474Q654L0624k1138L4110j12428n9032m1221k4470M1543l4437
$$ 195772 -19702 -11048 19576 -1562 32548 -79880 -138912 -180133 -204603 -163060 -197497
15559a97497J44666R3269o3039k6398q1616R5388l2114m9798J49979O2761L7696
$$ -197497 -52831 40438 -22601 -48999 -130615 -35227 -67341 -117139 32840 95601 133297
15548A33297l1230K9771J51085r0048k13082j74709L28k1213J67999J93266M6331
$$ 133297 102067 131838 282923 192875 -20207 -194916 -194588 -215801 -47802 145464 191795
15537A91795n4312P1550j61605j47812l7262P2876j11935j49001k6256Q8062k916
$$ 191795 137483 209033 47428 -100384 -137646 -64770 -176705 -325706 -351962 -263900 -266816
15526b66816p2473m4324Q4349O95J32026N5261K9741J67991P6955m0091Q4653
$$ -266816 -339289 -383613 -299264 -298569 -166543 -111282 -81541 86450 163405 123314 207967
15515B07967o7194j19870p8695O8123J01568l4924k4609p4309r5658K608N8186
$$ 207967 140773 20903 -57792 10331 111899 76975 52366 -21943 -117601 -114993 -56807
15504e6807L057L157J15545J19768K50957J19167k2416j41466j09210P344L694
$$ -56807 -53750 -50593 64952 184720 435677 554844 532428 390962 281752 289096 292790
15493B92790q0335q8659j19185O8027J37299j2266P2364j23831L0961J38025o0403
$$ 292790 212455 123796 4611 72638 209937 197671 270035 146204 177165 315190 254787
15482B54787k52869j10590Q529o9675J20388K32231N5090q3557M8596O3845r8993
$$ 254787 1918 -108672 -100143 -169818 -49430 182801 237891 154334 202930 266775 167782
15471A67782m7924o7771n2837k29037j15327J0821J68455J06775N9877j30244
$$ 167782 119858 52087 -750 -229787 -345114 -334293 -165838 -59063 814 -129430
15461a29430J39290K36448J4893k37878k48452j06513J72486J87715l4642l1540
$$ -129430 9860 246308 261201 23323 -225129 -331642 -159156 28559 -6083 -37623
15451c7623j77376O5975Q1292P8293M8357j42087j16909J51562p6303L9986n4128
$$ -37623 -214999 -149024 -67732 10561 58918 -83169 -200078 -48516 -124819 -84833 -138961
15440a38961N6868M0712P8975K23085p4219q0772k6505q4553J15527J59208j9313
$$ -138961 -82093 -41381 37594 260679 186460 105688 79183 -5370 110157 269365 250052
15429B50052j53040K5739o2981j6330N9990J12975l5005j06809L7847j2000k49816
$$ 250052 97012 122751 59770 43440 103430 216405 181400 74591 112438 100438 -149378
15418a49378o0670P8964j7881J07164M4152J0777P8448K1785o3348j339o7219
$$ -149378 -210048 -131084 -148965 -41801 2351 13128 91576 113361 50013 48674 -18545
15407a8545J01516J57221n0721N5714j5630k43616J8450R0562j22514j73355M2142
$$ -18545 82971 240192 189471 245185 229555 -14061 4389 94951 -27563 -200918 -158776
15396a58776R3690J53928K2459J1779k593l4807l1380j52599p5364L7449J34685
$$ -158776 -65086 88842 111301 123080 120487 85680 54300 -98299 -173663 -136214 -1529
15385a529J589j96423P0881J96942J14348J0323n2953j32801q1655J8233j65795
$$ -1529 60 -196363 -125482 71460 185808 196131 143178 10377 -71278 -53045 -218840
15374b18840j37212m296R7047M2449p611l6611J25677j07546R9900J34304j19874
$$ -218840 -356052 -360348 -263301 -220852 -228463 -265074 -139397 -246943 -147043 -12739 -132613
15363a32613q8954P2796k1103m5393K7686n1550L2154j3538R0941r4154p1377
$$ -132613 -221567 -148771 -169874 -215267 -187581 -239131 -206977 -220515 -129574 -223728 -295105
15352b95105J27049J93183p6587o6357L4666J38112j3652K7865Q7588J12866j9922
$$ -295105 -168056 25127 -51460 -117817 -83151 54961 41309 69174 156762 269628 249706
15341B49706j31559j08440j62294l9267K08554L2827J04001m1943j02207k3758
$$ 249706 118147 9707 -152587 -191854 16700 49527 153528 111585 9378 -14380
15331a4380k03284J34985J39378j29871J39572J39247j24593j9810l1822p4105
$$ -14380 -217664 -82679 56699 -73172 66400 205647 81054 61244 29422 -44683
15321d4683j991J10832p5924O2887M4439N027m2198J18202l7609p5867m0977j9944
$$ -44683 -46674 64158 -11766 51121 95560 100587 58389 176591 138982 63115 22138 2194
15309B194J08124K5808L0154R0464J7304m4190O2261j40517j32479J40397j1584
$$ 2194 110318 136126 166280 256744 274048 229858 292119 151602 19123 159520 147936
15298A47936p0202n3320q3690J03984J89338r7891q4915R561n8415m3759J36756
$$ 147936 77734 24414 -59276 44708 234046 136155 51240 60801 2386 -41373 95383
15287I5383l2669k8004Q9244J64076P43q8700R0390M6330m3763R1180J43467K67399
$$ 95383 62714 34710 123954 288030 288773 200073 290463 336793 293030 384210 527677 795076
15275G95076K84231J67393K30227K68497J88052j90440l89684l32239j02482j15655
$$ 795076 1079307 1246700 1476927 1745424 1933476 1743036 1353352 1021113 918631 802976
15265H02976l86201k13171j98324j51304m9825J6461J27488J29232j13274r1384
$$ 802976 416775 203604 5280 -146024 -195849 -179388 -51900 77332 -35942 -127326
15255a27326j13957J19344J46500N7470P3839N2697p0454j00449p3926K8944p074
$$ -127326 -241283 -121939 24561 82031 155870 208567 138113 37664 -36262 -7318 -14392
15244a4392j7454k9993R0816q3426J81668l9360k46297L8688N1864n048m3939
$$ -14392 -31846 -61839 28977 -54449 127219 87859 -158438 -119750 -67886 -72934 -116873
15233a16873J34841K0510j2989j9014j7233J02202j8452j45645q668O0927j06517
$$ -116873 17968 38478 25489 6475 -10758 91444 72992 -72653 -81321 -20394 -126911
15222a26911J3853J49153J67410p5314o4447j3546J3729M260j07534K01276l2048
$$ -126911 -113058 36095 203505 128191 63744 50198 63927 68187 -39347 161929 129881
15211A29881r6427O1674k8294k21731o1816j4417o0995K25145o5636p6441k2032
$$ 129881 33454 95128 66834 -154897 -216713 -231130 -292125 -66980 -132616 -209057 -231089
15200b31089J47385J69860J05967p4041r4231o4152K5443K9358m8805J32314o513
$$ -231089 -83704 86156 192123 118082 23851 -40301 -14858 14500 -34305 98009 91496
15189I1496k11970j34794j14063J30816J70066J05556n4106Q9312k0405l2740
$$ 91496 -120474 -255268 -369331 -238515 -68449 37107 -16999 72313 51908 19168
15179A9168P6429J89727J0100j05349j08104m1362p5340j28090R7260J9252r5005
$$ 19168 95597 285324 295424 190075 81971 40609 -34731 -162821 -65561 -46309 -141314
15168a41314q6398P4119N5410J68610L0998k05262j56341K2033M5577M6765K03053
$$ -141314 -227712 -153593 -98183 70427 101425 -103837 -260178 -238145 -192568 -145803 57250
15157E7250J73070m1647K5183m569l5452j20938p5962P3285J56656m1799q4582
$$ 57250 230320 188673 213856 209287 173835 52897 -23065 50220 206876 165077 80495
15146H0495j79897r9131K8153K9523m7856r393J79558j0276m6504N9717N9030
$$ 80495 -99402 -198533 -170380 -140857 -188713 -198106 -18548 -28824 -75328 -15611 43419
15135D3419o4422l09575o3949J24079N0182N9356O1256O8745J4782J48372M7908
$$ 43419 -21003 -330578 -394527 -270448 -220266 -160910 -99654 -30909 -16127 132245 180153
15124A80153R879J4727j28836k8999J47267L1981p6594p9773j07881r297Q4708
$$ 180153 190032 204759 75923 46924 194191 226172 149578 69805 -38076 -47373 37335
15113C7335j7147j50674R2063J82746J05677l2125p1631O7327O2495m0358j50170
$$ 37335 20188 -130486 -38423 144323 250000 217875 146244 213571 276066 235708 85538
15102H5538j17282J58040n9887j04617M3805J16360q960O1404J9342j2456q2921
$$ 85538 -31744 126296 66409 -38208 5597 121957 112997 174401 193743 181287 98366
15091I8366j18289K9026j0639n0956O1393k6153K8139o2899L4089K34852P2426
$$ 98366 -19923 9103 -1536 -52492 8901 -17252 10887 -52012 -17923 216929 289355
15080B89355p0505o9883K23108K57938j89344k97329j34429j66439L9364J24644
$$ 289355 218850 148967 372075 630013 440669 143340 8911 -157528 -118164 6480
15070F480L3565K4261L9670j6567k0331q7278j27193l956Q2946R2388K45399O5977
$$ 6480 40045 64306 103976 87409 67078 -20200 -147393 -151349 -68403 23985 269384 335361
15058C35361J698j56066l5381j28576m205J00840K4018O661K7836j21479n648
$$ 335361 337059 180993 145612 17036 12831 113671 137689 144350 172186 50707 45059
15047D5059J11381J2944J15541l0016n1666R9604k281o5817p0305j75635K4085
$$ 45059 156440 169384 284925 254909 203243 302847 300566 234749 164444 -11191 12894
15036A2894K2466o6048n3212J66058R6498R2441Q2601r6521j88754R0743j0370
$$ 12894 35360 -30688 -83900 82158 178656 271097 353698 257177 68423 159166 148796
15025A48796q633L5501j4512j01411L0744j0448j7720O2165K01909j8958j97723
$$ 148796 140163 175664 161152 59741 90485 80037 62317 124482 326391 307433 109710
15014A09710j30351K5998n8057K20224l6816j15023J5538L9052J45739K4948k08655
$$ 109710 -20641 5357 -52700 167524 130708 15685 31223 70275 216014 240962 32307
15003C2307o915L6631M6019k938K09578K63481L9821J1005l507k80026J7248J15233
$$ 32307 25392 62023 108042 105104 314682 578163 617984 628989 625482 345456 362704 477937
14991D77937N400j33060j25636j69923l685R9861j23853q1971q3596m3182j0968
$$ 477937 483337 350277 224641 54718 51033 150894 27041 -54930 -138526 -181708 -192676
14980a92676J50938R5197J6460M5245L7189K761l6921r3105O8675J02605k11724
$$ -192676 -41738 53459 69919 115164 152353 155114 118193 25088 93763 196368 -15356
14969a5356k65347K46553N9693m1609M8039R1153j12291K9134Q8147j22541j91029
$$ -15356 -280703 -34150 25543 -16066 31973 123126 10835 39969 128116 5575 -185454
14958a85454K50691P9770j43040R2950N4692J50156q0268m3164j31228K2928P3951
$$ -185454 65237 145007 1967 94917 149609 299765 219497 176333 45105 68033 141984
14947A41984r3490O4535j09034j30505R0318J70979P7537J41101J0264j33931
$$ 141984 48494 113029 3995 -126510 -36192 134787 212324 353425 363689 229758
14937B29758j89686l9024J66164K9742m2368j24779k3187K8959K0924l2199K7905
$$ 229758 40072 1048 167212 196954 154586 29807 6620 35579 56503 24304 52209
14926E2209R8406r5344q4358J02809R2655m912Q7561l751m2758p4156m3220r0809
$$ 52209 150615 55271 -29087 73722 166377 161465 249026 245275 202517 128361 85141 -5668
14914e668J03614l5068R0775J90243J46414J6906o8379j72366r9203p5829J46943
$$ -5668 97946 62878 153653 343896 490310 507216 438837 266471 167268 91439 238382
14903B38382O8259j51205l8265k33303q2017M3027j3500K41556J14323o0204J09744
$$ 238382 306641 155436 117171 -116132 -198149 -155122 -168622 72934 187257 127053 236797
14892B36797R5010N8559m2098p0248N5204L8115P149k03620l08491j08480J06317
$$ 236797 331807 390366 348268 278020 333224 371339 378488 174868 -133623 -242103 -135786
14881a35786J66318Q8263K1343q3911L9975Q4671J73616J7511M438j56368k00228
$$ -135786 30532 118795 140138 56227 96202 180873 354489 372000 376438 220070 19842
14870A9842J8458L9301J7323j2213P0358J57629L6093M2879j45710j02457j59748
$$ 19842 38300 77601 94924 82711 153069 310698 346791 389670 243960 141503 -18245
14859a8245N821J62312M5905K22767J97048N2204j36556P9887J85200j15939j17596
$$ -18245 -12424 149888 195793 418560 615608 667812 531256 611143 796343 680404 562808
14848E62808k8737j66844p5493J63778Q4308K29257p3701j18354N6571N7141l250
$$ 562808 534071 367227 291734 455512 539820 769077 695376 577022 633593 690734 687484
14837F87484j3820p8420J34888J93474K59912L9684M5743J54916k4867m2327J18344
$$ 687484 673664 595244 730132 923606 1183518 1223202 1268945 1423861 1398994 1356667 1475011
14826A475011J46391K77123j53839M1934P5855J53311J51560n2734K24918J63167
$$ 1475011 1621402 1898525 1744686 1786620 1862475 2015786 2167346 2114612 2339530 2502697
14816B502697Q9673K45322M09948J64378J09222L46419M41035N35770N02512N38302
$$ 2502697 2592370 2837692 3247640 3412018 3521240 3867659 4308694 4844464 5346976 5885278
14806E885278P56669Q54783J129801J168467J417844J923404K275647K654398
$$ 5885278 6641947 7496730 8626531 9794998 11212842 13136246 15411893 18066291
14798A8066291K855577L117685L832198N213089P502023J1293897J7974715K9567693
$$ 18066291 20921868 24039553 27871751 33084840 40586863 51880760 69855475 99423168
14790I9423168M8598327P4174226R1524135P5438504J7683351n1245434q8945260
$$ 99423168 148021495 222195721 313719856 389158360 406841711 355596277 266651017
14783B66651017q4500276n9109063l5998624k1513730j3617961q942654o447942
$$ 266651017 182150741 123041678 87043054 65529324 51911363 42968709 36520767
14776C6520767n197030m316120l882594l606763k821656k239835j801225j485440
$$ 36520767 31323737 27007617 23125023 19518260 16696604 14456769 12655544 11170104
14768A1170104j436431j056378p36434p29902n67509n41128k09212k49049m20315
$$ 11170104 9733673 8677295 7940861 7210959 6643450 6102322 5893110 5644061 5223746
14759E223746m91631n20422k61152k36985l37707k74559j89254j60549j16970
$$ 5223746 4732115 4211693 3950541 3713556 3375849 3101290 2912036 2751487 2634517
14750B634517j87247k45783j51620p9275r8797k28013N2827p8630q9723N3463
$$ 2634517 2447270 2201487 2049867 1970592 1871795 1643782 1696609 1617979 1528256 1581719
14740A581719J7754k88863l04257k06744n1118o1421J14888j54129j36244n3391
$$ 1581719 1599473 1310610 1006353 799609 748491 687070 801958 647829 511585 458194
14730D58194J02276J85434J11665o2724n5342n9846L3192k6314p8275q3124n3927
$$ 458194 560470 745904 857569 794845 739503 679657 712849 686535 608260 525136 471209
14719D71209N8736Q7998n5662k413m7230l5868o0550p4356K22388L9297j57703
$$ 471209 529945 617943 562281 559868 512638 476770 416220 341864 564252 603549 445846
14708D45846q8834P2125L9125l1697p4558K2222J86275j5999k27299P9086M1365
$$ 445846 357012 429137 468262 436565 362007 384229 570504 554505 327206 406292 447657
14697D47657k07749l0670J38908J76654K1450k50524k33061l7976j59372M9447
$$ 447657 239908 209238 348146 524800 546250 295726 62665 24689 -134683 -85236
14687h5236J16981p3840j7094Q6436J09114O2549m7158l3490J3816J10956K3413
$$ -85236 31745 -42095 -59189 27247 136361 198910 151752 118262 132078 243034 266447
14676B66447q6657j41720m084M4991J75167R9359m9585o01o450P9693j03276j21564
$$ 266447 179790 38070 33986 78977 254144 353503 303918 303317 296867 376560 273284 151720
14664A51720N2733J0226N2030p6691k8154O8778N0356j30067K9515o2j14221J67250
$$ 151720 204453 214679 266709 190018 161864 230642 280998 150931 180446 180384 66163 233413
14652B33413L3650k3161K35507N0277o7624k04149p1509Q5492J54195k2211k74836
$$ 233413 267063 243902 479409 529686 462062 257913 186404 271896 426091 403880 129044
14641A29044m0443J39193J38593j08662O2920k5441n8806p8911R0615K03369m1752
$$ 129044 88601 227794 366387 257725 320645 295204 236398 157487 248102 451471 409719
14630D09719O9069p8524j53753p9928m9380o2462l6475L3254L7175J11212k8048
$$ 409719 478788 400264 246511 166583 117203 54741 18266 51520 88695 199907 171859
14619A71859r5063J33151J19497j078J18900j2678P4996J6304k31035j90550j40324
$$ 171859 76796 209947 329444 328366 447266 434588 509584 525888 294853 104303 -36021
14608c6021K4513J54271p266l9015N9099j13638r7956Q8421J68148K10478J81913
$$ -36021 -11508 142763 135497 96482 155581 41943 -56013 32408 200556 411034 592947
14597E92947j70691j52623N2020n6572J507J78048K1490n9838R788P534l5523
$$ 592947 422256 269633 321653 265081 266588 444636 466126 406288 416076 423610 388087
14586C88087j39129N0680o4656j79321m0145J27535J43054j43569K2547R5968
$$ 388087 248958 299638 234982 55661 15516 143051 286105 142536 165083 261051
14576B61051J8869p8747j00965L7458R5968L4774p9911r7138l0994N6193R3546
$$ 261051 279920 201173 100208 137666 233634 268408 188497 91359 60365 116558 210104
14565B10104L3753Q8357n3857J71020Q9836j72152l8572n0946j41341l07299P9264
$$ 210104 243857 332214 278357 449377 539213 367061 328489 277543 136202 -171097 -91833
14554i1833J02140r4471o013K85970n5296j04181L506j55784L2375O935J19179
$$ -91833 10307 -84164 -90177 195793 140497 36316 39822 -115962 -83587 -76652 42527
14543D2527J83156K8021n5413N7874p3279J6165j85424O960o9351j39791O2793
$$ 42527 225683 253704 198291 256165 182886 199051 13627 20587 -48764 -188555 -125762
14532a25762J10656J41157O3952r4481n513J03723J09073n8740j05124q802J33691
$$ -125762 -15106 126051 190003 95522 90009 193732 302805 244065 138941 130139 263830
14521B63830j45277M8866O9827j5793J21790N9670j8466j25409r8702p5688K7280
$$ 263830 118553 167419 237246 221453 343243 402913 384447 259038 160336 84648 111928
14510A11928q5713O7255L3472n6626K2031l0715j7702p9848n426j12594J01885
$$ 111928 26215 93470 126942 70316 92347 61632 43930 -35918 -41344 -153938 -52053
14499e2053J12873p6215k698O3903K10779k5849q689J2150o795O2332M1057k8262
$$ -52053 60820 -15395 -18093 45810 256589 230740 222051 234201 227406 289738 330795 302533
14487C02533j59658j28529o1712M2768J61736J22002k14436j56120O3097J13325
$$ 302533 142875 14346 -47366 -4598 157138 279140 64704 -91416 -28319 85006
14477H5006p581o3256J08878r6443j41791l61M2765q2733K5271K34336R6461J29938
$$ 85006 77425 14169 123047 26604 -115187 -115548 -72783 -155516 -130245 104091 200552 330490
14465C30490j72103j57462Q8728J28970j3041O0855P726M5838P0748j65942j0492
$$ 330490 158387 925 89653 218623 205582 266437 274163 320001 390749 224807 214315
14454B14315K0230j21070J5449J41906K7224M0037q8511k2220j08555j83136O7247
$$ 214315 234545 113475 128924 270830 298054 338091 249580 227360 118805 -64331 2916
14443B916r1629j29516J12094J10971J11858O1391n8311J0632P395K9552O2067
$$ 2916 -88713 -218229 -106135 4836 116694 178085 119774 130406 137801 167353 229420
14432B29420M5763r3522p2392o9029j14984L9939J46682l2322o8771J19389L4586
$$ 229420 275183 181661 109269 40240 -74744 -34805 111877 79555 10784 130173 164759
14421A64759n5498J29128J00104J26787j30300m0262j10502J19310l8143J41058
$$ 164759 109261 238389 338493 465280 334980 294718 184216 303526 265383 406441
14411D06441P9963r7705j01240P2637M4663k62025j80536J04511Q8051K5860O8956
$$ 406441 486404 388699 287459 360096 404759 142734 -37802 66709 154760 180620 249576
14400B49576K50640R702j54382p6108q1606Q4858N7883k26627j42962R625R5618
$$ 249576 500216 509918 355536 279428 197822 282680 340563 113936 -29026 -19401 76217
14389G6217N3642L7157r4944K00143J47882J6509L9170l0823K3903Q3375k1991
$$ 76217 129859 167016 72072 272215 420097 436606 475776 444953 468856 552231 530240
14378E30240K7302k481N1053Q541j18016J06167J23050J6301K34270J96505q9321
$$ 530240 557542 555061 606114 614655 496639 602806 725856 742157 976427 1172932 1083611
14367A083611l5362J2563J0915P877J7132J09513J48514O9246N0142J43040J58996
$$ 1083611 1048249 1060812 1071727 1079604 1096736 1206249 1354763 1424009 1474151 1617191 1776187
14356A776187M00988K99886J09989J63849J73746J91627L07419N30700M37301
$$ 1776187 2177175 2477061 2587050 2750899 2924645 3116272 3423691 3954391 4391692
14347D391692L86666N19577L93503N47182Q77369J148200J088486P54574R23523
$$ 4391692 4778358 5297935 5691438 6238620 7115989 8264189 9352675 10107249 11030772
14338A1030772Q82088P47019K72396n23846j291177j725308j904782j406797j072835
$$ 11030772 11912860 12659879 12932275 12408429 11117252 9391944 7487162 6080365 5007530
14329E007530p23803m10012n47507k03894k67211m15998m51265j79305Q7784k50404
$$ 5007530 4283727 3873715 3326208 3122314 2855103 2439105 1987840 1808535 1896319 1645915
14319A645915j54578j25290l9881R0942r5828N1229k5537J26085M8239j88176
$$ 1645915 1491337 1366047 1326166 1417108 1321280 1372509 1346972 1473057 1521296 1333120
14309A333120j81911n1836q7064L833K87119N1437j09899P5050M6133J09620K83623
$$ 1333120 1151209 1099373 1012309 1016142 1303261 1354698 1244799 1319849 1365982 1475602 1759225
14298A759225K68446J98918K90462J01417n5131l67503n68454n19389l52227k2323
$$ 1759225 2027671 2226589 2517051 2618468 2563337 2195834 1627380 1107991 755764 733441
14288G33441p1612j5438j6618j05620n3595j9988q8110j31797j1348l8761O1645
$$ 733441 661829 646391 629773 524153 470558 450570 362460 230663 219315 180554 242199
14277B42199J16489L4590k65679J11303K64911J35308l9344j75072j43100r9358
$$ 242199 358688 393278 127599 238902 503813 639121 599777 424705 281605 182247
14267A82247o3687k0921j13372l4661j9901P2711j63695J5668J56200L4909L2695
$$ 182247 118560 97639 -15733 -50394 -70295 2416 -161279 -145611 10589 45498 78193
14256G8193J50556J02874r8665j13752k703Q662J31721l4749p7601j66577p5993
$$ 78193 228749 331623 232958 119206 116503 125165 256886 222137 144536 -22041 -98034
14245i8034J31817o9669k1981K36907J53117j05327L6396k094J3782n0773k44307
$$ -98034 33783 -35886 -57867 179040 332157 226830 263226 261132 274914 224141 -20166
14234b0166j7442J25013o4262N1886M3165k8764O061K1513k0564K6749r7606K4721
$$ -20166 -37608 87405 23143 75029 118194 89430 95491 117004 96440 123189 25583 50304
14222E0304N0421r5915m02J43830K38771K0501j31781l8771l4784r7498j58464
$$ 50304 100725 4810 4408 148238 387009 407510 275729 236958 202174 104676 -53788
14211e3788l6328M9998J33427J15539J215p0478k6208j1258N7648k08052l3147
$$ -53788 -90116 -40118 93309 208848 210063 139585 113377 102119 159767 -48285 -81432
14200h1432R8172J24220J30836k9733N4352P0663j2590q1743j71421o1728m2817
$$ -81432 16740 140960 271796 242063 296415 367078 354488 272745 101324 39596 -3221
14189c221j12771n8499J58963N3606R1370k6225n9623P7393l0331q2590Q900J51740
$$ -3221 -115992 -174491 -15528 38078 129448 103223 43600 120993 90662 8072 16972 168712
14177A68712J71360m4331j35555j43076N9572N2970K11742j0465j06933j00207
$$ 168712 340072 295741 160186 17110 76682 129652 341394 330929 223996 123789
14167A23789n2554O9780J6684k26129k00376J45220Q7143L0114J03167J78357
$$ 123789 71235 141015 157699 -68430 -268806 -123586 -36443 -6329 96838 275195
14157B75195N9160l3946r1358R9306J29430n8540j18531k2927P0391j60295m8251
$$ 275195 334355 300409 209051 308357 437787 379247 260716 237789 308180 147885 99634
14146I9634k1704k90278j70016J43872O2580j43321l1933k2599J0386K97928N1123
$$ 99634 77930 -212348 -382364 -238492 -175912 -319233 -351166 -373765 -363379 -65451 -14328
14135a4328N681k2592M3841j28164j33394j16891L61640J15817p8815K2725j39667
$$ -14328 -8647 -31239 12602 -115562 -248956 -365847 -4207 111610 32795 55520 -84147
14124h4147k8945o0954o1755N8636J55410M203k17827Q4154k285L4987K2991J65148
$$ -84147 -113092 -174046 -235801 -177165 -21755 -17552 -235379 -151225 -153510 -118523 -95532 69616
14112F9616R4895j34942j39690K65379J03693j83140k851O6774K9912n5320N8035
$$ 69616 164511 29569 -110121 155258 258951 75811 72960 139734 169646 114326 172361
14101A72361K1443o2453J16060j7053j83421J36282j9734j25843n2016L3748Q3348
$$ 172361 193804 131351 247411 230358 46937 183219 163485 37642 -14374 19374 102722
14090A02722K591j52997j5616L9185o7809p633n5161O8637J06437J26088P6862
$$ 102722 105313 -47684 -63300 -24115 -91924 -99557 -154718 -86081 20356 146444 223306
14079B23306L394n716R162j34870r9763K8117k1758m4518j60625l6758J92927
$$ 223306 226700 220984 230146 95276 -4487 23630 1872 -42646 -203271 -240029 -47102
14068d7102K12439J28034J99248j31017j70957j45013m3776k099j37128r824L7218
$$ -47102 165337 293371 492619 361602 190645 45632 1856 -243 -137371 -147195 -109977
14057a09977J61316j33650J61322J62366Q1994n3840p5060l5258J22101J03913
$$ -109977 51339 -82311 79011 241377 323371 269531 194471 159213 281314 385227
14047C85227k45066k27551Q8096Q6484j38247q1289K38679m4183o6641J78255
$$ 385227 140161 -87390 706 87190 -51057 -132346 106333 62150 -4491 173764
14037A73764J10754j30251j49669K14544n0674j29422J9243J80303J6822j03510
$$ 173764 284518 154267 4598 219142 168468 39046 58289 238592 255414 151904
14027A51904n3160J4444R4903k11553j08429R0635n441j83355j46753J56824O5112
$$ 151904 98744 113188 208091 -3462 -111891 -21256 -26697 -210052 -356805 -199981 -134869
14016a34869M7606J14720l0645J3966J91837N9535l3527j29950J53442j52782
$$ -134869 -87263 27457 -3188 10778 202615 262150 228623 98673 252115 99333
14006I9333k23137O133P9733J10723m7430j68810L6742m260J73340J32669k5716
$$ 99333 -123804 -117671 -37938 72785 25355 -143455 -106713 -110973 62367 195036 169320
13995A69320L3234M1531R7108j47341j70706k39710k8681J76541k050n2007j09499
$$ 169320 202554 244085 341193 193852 23146 -216564 -245245 -68704 -70754 -122761 -232260
13984b32260n5026K20099K8834L7333m4009O8549o3373j93411N9190K59777Q7070
$$ -232260 -287286 -67187 -38353 -1020 -45029 23520 -39853 -233264 -174074 85703 172773
13973A72773k3529m8136j23766j59607J1945O3257J92118p7112j33715L2980k1018
$$ 172773 149244 101108 -22658 -182265 -170320 -107063 85055 7943 -125772 -92792 -113810
13962a13810K42018L4562P0894J16222M5134j24913j65260L7044k2881j43664
$$ -113810 128208 162770 233664 349886 395020 270107 104847 141891 119010 -24654
13952b4654o4368O7633O2011k2462q902o5534j6972J54541J24474O0384j63324
$$ -24654 -89022 -21389 40622 18160 9258 -56276 -73248 81293 205767 266151 102827
13941A02827k28379k14118j8343K41478L67499R099j04115O3104L0805k00656
$$ 102827 -125552 -339670 -358013 -116535 250964 260063 155948 219052 249857 49201
13931D9201j95339K03125p4845j80074L9345J42693K10951R2019r5927N4795j08033
$$ 49201 -146138 56987 -17858 -197932 -158587 -15894 195057 287076 191149 245944 137911
13920A37911j15441p2042M7493o8221p6950Q5162K6595N5823o6706J9275Q1408
$$ 137911 22470 -49572 -2079 -70300 -147250 -62088 -35493 20330 -46376 -27101 54307
13909E4307L029J20044J71359P3576j14978L952j7679r5738j31888k26111n6888
$$ 54307 57336 177380 348739 422315 307337 311289 293610 197872 65984 -160127 -217015
13898b17015K53485P3035j3657r0547k1909N2514k1781l1848o7227p4597j17269
$$ -217015 36470 109505 95848 5301 -16608 35906 14125 -17723 -84950 -159547 -276816
13887b76816L3279J14885J26442j9614L1470K8678j6856j37875j16929J40576
$$ -276816 -243537 -128652 -2210 -21824 9646 38324 21468 -116407 -233336 -92760
13877i2760P1538J03669J47318N1537L879o1724j9559J1018P266Q8525j47670
$$ -92760 -21222 82447 229765 281302 285181 223457 203898 214916 222182 310707 163037
13866A63037j52463K1576J16549M673j57724q8329Q5093k8140J6855K10915Q1972
$$ 163037 10574 32150 148699 153372 -4352 -92681 -7588 -35728 -18873 192042 274014
13855B74014J4079k73306o7768m7343O6112J55691J68354j95535p2562J1674O3954
$$ 274014 288093 14787 -52981 -100324 -34212 121479 289833 94298 21736 33410 97364
13844I7364J0301Q5012O7783o9252M9365o5180k09873m550j35612L7323J71375
$$ 97364 107665 192677 260460 191208 240573 175393 -34480 -39030 -174642 -137319 34056
13833C4056J14872j79645j70423K1323R7250O342J36397r5327R9577K0846o5321
$$ 34056 148928 -30717 -201140 -179817 -82567 -76225 60172 -35155 64422 85268 19947
13822A9947O168r6738j43410n608J67108J16963j8762r4582l625P1110O5599R2304
$$ 19947 26115 -70623 -214033 -219641 -52533 64430 45668 -48914 -52539 18571 84170 176474
13810A76474P360r022L55552M9979m32241j05332O9854J05182j61995K3618M2108
$$ 176474 183834 174812 530364 580343 148102 42770 112624 217806 55811 79429 121537
13799A21537j12225o2349n1983o977M1920J16083K52549m2195j61631M2724p675
$$ 121537 9312 -53037 -105020 -111997 -70077 46006 298555 256360 94729 137453 129778
13788A29778l2530j10098j4636P0547K03826O4038p7577n3810q1365K47887j01859
$$ 129778 97248 -12850 -27486 43061 246887 310925 233348 179538 98173 346060 244201
13777B44201r2397j21885j01273R8224K7871p3270m5927J25342k0849J60519J24026
$$ 244201 151804 29919 -71354 26870 54741 -18529 -64456 60886 40037 200556 324582
13766C24582L4054j56876n8537J65467J84243j01121l30021j60073L8660R9077
$$ 324582 358636 201760 143223 308690 492933 391812 61791 -98282 -59622 39455
13756C9455N621L090N9195o3862j01620r0152J85318J37947j93673p3533J85281
$$ 39455 45076 48166 107361 43499 -58121 -148273 37045 174992 -18681 -92214 93067
13745I3067l4477j55373k15816l7125R4465J33151P7120J24693J80387j3899p7106
$$ 93067 58590 -96783 -312599 -349724 -255259 -122108 -44988 79705 260092 246193 169087
13734A69087m1548K4419k9174j43306J27208J09415J00418K4890j52430j06235
$$ 169087 127539 151958 122784 -20522 106686 216101 316519 341409 188979 82744
13724H2744q2795n4793J7713l430k9226L1339m5513n4567J55K47786o8444P395
$$ 82744 -51 -54844 -37131 -40561 -69787 -38448 -83961 -138528 -138373 109413 40969 48364
13712D8364K0601Q209q8300J38415q6942l8550J56352j01120j40134k5816N3372
$$ 48364 68965 77174 -11126 127289 40347 1797 158149 57029 -83105 -108921 -55549
13701e5549k1010j16582R4303K4524P965J40130J74609N3354o3842j32788j9398
$$ -55549 -76559 -193141 -98838 -74314 -66349 73781 248390 301744 237902 105114 85716
13690H5716j08404N4238R7852P257j30779P4243P6470l2991O0931P5941m1949
$$ 85716 -22688 31550 129402 136659 5880 80123 156593 123602 184533 260474 218525
13679B18525j07699m49J0271q8816J0256m9851j94421p4394j16770l3608P9091
$$ 218525 110826 110377 120648 31832 42088 -7763 -202184 -276578 -393348 -426956 -347865
13668c47865Q9436K99301M0450M878k22121k04204K94608J57669j55284j07900
$$ -347865 -258429 40872 81322 86200 -135921 -340125 -45517 112152 -43132 -151032
13658a51032J38356M536N4303p7498j39942P5450M0200j34994q7244J48179O9521
$$ -151032 -12676 -8140 46163 -31335 -171277 -95827 -55627 -190621 -277865 -129686 -60165
13647f0165J9205R4636J13043r9524j67386l0268o7874M1446J06421R9843N2112
$$ -60165 -40960 53676 166719 67195 -100191 -130459 -198333 -156887 -50466 49377 101489
13636A01489O6734j4053k55356L3089R3507N8445j54743m7603J01908N8957L3954
$$ 101489 168223 154170 -101186 -68097 25410 83855 -70888 -118491 -16583 42374 76328
13625G6328j1035K8044P7712K445m4524j26067j54222l7566j11924J75608P4629
$$ 76328 65293 93337 171049 173494 128970 2903 -151319 -188885 -300809 -125201 -50572
13614e0572p6756j20441r8874J86297P7331j8533n3053J92072J82614p2277k55
$$ -50572 -127328 -247769 -346643 -160346 -83015 -101548 -154601 37471 220085 147808 147553
13603A47553p0349K0357K7977j28387k24577k829q9022J02866K41044J35016R6999
$$ 147553 77204 97561 125538 -2849 -227426 -230255 -319277 -216411 24633 159649 256648
13592B56648p4919j7121k5650Q6562j35341j61057j04376j05366L6329m3564j2758
$$ 256648 181729 164608 138958 225520 90179 -70878 -175254 -280620 -244291 -287855 -300613
13581c00613J24212J58719M2937n3267p0255J66927O1449j7915J2135L2598m8635
$$ -300613 -176401 -17682 25255 -28012 -98267 68660 130109 112194 124329 156927 108292
13570A08292p7455p0979j88471l5714j20723N5965K039J97906J21975j15736l8985
$$ 108292 30837 -40142 -228613 -264327 -385050 -329085 -327046 -129140 -7165 -122901 -161886
13559a61886P5388r0488J03891k9874P7495p4159p8463Q8614k3921j12612k5581
$$ -161886 -86498 -176986 -73095 -102969 -25474 -99633 -178096 -89482 -113403 -226015 -251596
13548b51596j83831j1372Q9840M7579J64701o149j89447m6904J62150Q2810N3764
$$ -251596 -435427 -446799 -356959 -309380 -144679 -150828 -340275 -387179 -225029 -142219 -88455
13537h8455J47627j2149n7487J48419k1749j54530q8705m934j3353J21856j29455
$$ -88455 59172 47023 -10464 137955 116206 -38324 -127029 -131963 -145316 -23460 -152915
13526a52915N8082K2270j9291J6772O9351R7395J06103J76987K097J50523J02056
$$ -152915 -94833 -72563 -91854 -75082 -5731 91664 197767 374754 376851 527374 629430
13515F29430j88618K1270o2987k21727M3013n2850p4731J66798o7921J1876j02725
$$ 629430 440812 462082 399095 177368 220381 167531 92800 259598 191677 203553 100828
13504A00828l2711j15578j3723m8856r7009J7171L22862L51062j48822k29379
$$ 100828 68117 -47461 -61184 -110040 -207049 -189878 132984 484046 335224 105845
13494A05845k45497N5604J45031l8591M7987J43626N1354m0467q2390k4647j09984
$$ 105845 -139652 -84048 60983 22392 70379 214005 265359 224892 142502 117855 7871
13483G871J3101O7616j94744m2016P326J90230P6529J1387p3081k06717N638J12223
$$ 7871 20972 88588 -106156 -148172 -140846 49384 125913 137300 64219 -142498 -136860 -24637
13471b4637K64626O9226q1565q432M3249K854M2900J30821q7618n7515k21107
$$ -24637 239989 309215 227650 219218 262467 265321 308221 439042 351424 293909 72802
13460G2802j54109j01462o422J344K7810J00342m6671J18054J00507k0496O395
$$ 72802 -81307 -182769 -189191 -187847 -160037 -59695 -106366 11688 112195 91699 98094
13449I8094q1729N7008Q7220j23090j67k61889J28598r283R9134O1834j21367
$$ 98094 16365 73373 160593 37503 37336 -224553 -95955 -105238 -6104 55730 -65637
13438f5637J39618J40298L748p3667p7534q891j47701N3911p8322q1256J16994
$$ -65637 73981 214279 218027 144360 66826 57935 -89766 -35855 -114177 -195433 -78439
13427g8439O7722l1805r2828P1333K6707j10039M2224K00384K6669j51685j52013
$$ -78439 -10717 -42522 -135350 -64017 -37310 -147349 -105125 95259 121928 -29757 -181770
13416a81770L3979K2549K22426J35745p6516q2789l4518j7485L9563j59002k4085
$$ -181770 -147791 -125242 97184 232929 156413 73624 39106 21621 61184 -97818 -121903
13405a21903J35336J24045m8367m5339k9224L0192M5245j29630k29561J42581
$$ -121903 13433 137478 89111 43772 14548 44740 89985 -39645 -269206 -126625
13395a26625K49446J25327k2211O021m2670J3696m6476q0997l8739l4335R3089
$$ -126625 122821 248148 225937 231958 189288 202984 156508 75511 36772 2437 95526
13384I5526Q870J03392o2990l7028j74897k8913J33834J15935l7180L1865Q7174
$$ 95526 104396 207788 144798 107770 -67127 -96040 37794 153729 116549 148414 235588
13373B35588r8689j48773n5859j85985k0018O7072J07895J47803P6113l8924j0292
$$ 235588 136899 -11874 -67733 -253718 -273736 -206664 -98769 49034 125147 86223 75931
13362G5931j38811j3985N0891N7228N7634o6426p8458m575O5978Q1973j58613
$$ 75931 -62880 -76865 -25974 31254 88888 22462 -55996 -60571 5407 87380 -71233
13351g1233m6294j71388n783o7744J07435K97614N2530k86906o8530J63283J39587
$$ -71233 -117527 -288915 -294698 -362442 -255007 42607 95137 -191769 -260299 -97016 42571
13340D2571j20038q7165L6402J6658l3288o1306Q5080L34107J24782j11290l29320
$$ 42571 -77467 -164632 -128230 -111572 -144860 -206166 -121086 213021 337803 226513 -102807
13329a02807j42647l4784J982R0039J45221j0754Q5187o9418q7133R995Q1988
$$ -102807 -245454 -280238 -278256 -188217 -42996 -53750 31437 -37981 -125114 -115119 -33131
13318c3131J99026q9877m2960R7690m5150j4173j24423O7863J78923p9820l1351
$$ -33131 165895 76018 33058 130748 85598 71425 -52998 14865 193788 113968 82617
13307H2617Q0458Q8882q6301r0386p8205K0883j54522j41781M4031J82618L3684
$$ 82617 163075 251957 165656 75270 -2935 17948 -136574 -278355 -234324 -51706 -18022
13296a8022j20174j13305J00666p639m9810K3720k46926N7354J38732k6194m2482
$$ -18022 -138196 -251501 -150835 -158474 -208284 -184564 -431490 -374136 -235404 -261598 -304080
13285c04080j34165O9778L9442r7984k14827K4916q5281J97323J65438Q5681k3406
$$ -304080 -438245 -368467 -329025 -427009 -641836 -616920 -702201 -504878 -339440 -253759 -277165
13274b77165J93547N7295j14489p4808K1799J43294o4797J9524j485O663o23J04954
$$ -277165 -83618 -26323 -140812 -215620 -193821 -50527 -115324 -95800 -97285 -90622 -91245 13709
13262A3709r5623r1251M4701M1620l8462P5943j0528m8451p0787O3784K6550q8168
$$ 13709 -81914 -173165 -128464 -86844 -125306 -49363 -59891 -108342 -179129 -115345 -88795 -176963
13250a76963j10420j50932K15840K13360M2440l8302J13258J1493j68936j50403
$$ -176963 -287383 -438315 -222475 -9115 33325 -4977 108281 119774 -49162 -199565
13240a99565j4258r3922O337K78453R4604k9363J6393M7777J27530j02357j67139
$$ -199565 -213823 -307745 -301408 -22955 71649 42286 58679 106456 233986 131629 -35510
13229c5510q7257m1889L4259K5494N8188j0050j0467j61175k6110M9745P448r6
$$ -35510 -122767 -164656 -130397 -104903 -46715 -56765 -67232 -228407 -254517 -204772 -197324 -197420
13217a97420N6291l2076J02869J97356n6040k01743j03171J26473j2606p3113
$$ -197420 -141129 -173205 -70336 127020 70980 -130763 -233934 -107461 -120067 -193180
13207a93180j34581N6190N7448l688j15078j35895M7497J10974J15426L00172
$$ -193180 -327761 -271571 -214123 -217811 -332889 -468784 -421287 -310313 -194887 105285
13197A05285L5749l7034J9969j69157l6974J25146q9847j03425j83905m5587J35143
$$ 105285 141034 104000 123969 -45188 -82162 42984 -46863 -150288 -334193 -379780 -244637
13186b44637J34065J09989N5234j7429j63473j16389J13891k33423m7544L56220
$$ -244637 -110572 -583 54651 37222 -126251 -242640 -128749 -362172 -409716 -53496
13176e3496L3106j00088J12249o9663j15804P713n359N1400J44498r3827j17018
$$ -53496 -20390 -120478 -8229 -77892 -193696 -185983 -191342 -139942 4556 -89271 -206289
13165b06289K3877Q3714R1770J24413M0564L8844R0334j90217k49710R9814L5542
$$ -206289 -182412 -98698 -6928 117485 158049 196893 287227 97010 -152700 -52886 -17344
13154a7344m4249J8601k8116o4645J37649N853N7732r0652j34336M0354O2446
$$ -17344 -61593 -42992 -71108 -135753 1896 7749 65481 -25171 -159507 -119153 -56707
13143e6707n9117J47016J00969P4880o0823q9307k2529R7576J5276O9145P9536
$$ -56707 -115824 31192 132161 207041 146218 56911 34382 131958 147234 216379 295915
13132B95915j66937m0594o3765J6634o5551n8835J85327J21351r7330N4946o0204
$$ 295915 128978 88384 24619 41253 -24298 -83133 102194 223545 126215 181161 120957
13121A20957j16759j103j11138L4537k3341Q1496j02476J57126K63076r9842p5680
$$ 120957 4198 3095 -108043 -73506 -96847 -15351 -117827 39299 302375 202533 126853
13110A26853J43543K3973o0235r3356n3930p2640n7833N3120P1033j81936O5828
$$ 126853 270396 294369 234134 140778 86848 14208 -43625 9495 80528 -101408 -35580
13099c5580m8410o6819P132J17378R4672J52502M3022l7375j88185j21092L9903
$$ -35580 -83990 -150809 -143677 -26299 68373 220875 263897 226522 38337 -82755 -42852
13088d2852L6645R7897P0152l8110p8788q4867K8903J25590J7555n6861j20631
$$ -42852 -6207 91690 161842 123732 44944 -39923 -11020 114570 132125 75264 -45367
13077d5367p359O3380o2606J13023l6052j11546k9188P9846K51135N817p9017
$$ -45367 -52726 10654 -51952 61071 25019 -86527 -115715 -35869 215266 221083 142066
13066A42066k9065O719o744n9630m2681Q9340j11522j51751p8921P2412K4534
$$ 142066 113001 119720 112976 53346 10665 100005 -11517 -163268 -242189 -169777 -145243
13055a45243l1396m88j33385M0437K27128J5818L8003l3113k95382j06164K57715
$$ -145243 -176639 -177127 -310512 -270075 -42947 -27129 10874 -22239 -317621 -423785 -166070
13044a66070l9713p914K19794P565l2814L7036n5266r4989M7289o1649j20752
$$ -166070 -205783 -213697 6097 13662 -19152 17884 -37382 -132371 -85082 -146731 -267483
13033b67483N013O5986K07621j2545j62587J61277J04491O804K6548l7222J95756
$$ -267483 -262470 -196484 11137 -1408 -163995 -2718 101773 108577 135125 97903 293659
13022B93659O4994j76667k25450k09900L8830R0205J29635n0971K56812o4743
$$ 293659 358653 181986 -43464 -253364 -214534 -124329 5306 -45665 211147 146404
13012A46404j20953J03694p4601j61235j1381M6419k02438J10343K57707j7340
$$ 146404 25451 129145 54544 -106691 -118072 -71653 -274091 -163748 93959 76619
13002G6619P7505J9234J92486j78525j65117O4372J88918K6753j64228j67806
$$ 76619 154124 173358 365844 187319 22202 86574 275492 302245 138017 -29789
12992b9789k04506o1390J00966J31368J02971J65915N1885m5799k07632k23707
$$ -29789 -234295 -295685 -194719 -63351 39620 205535 257420 211621 3989 -219718
12982b19718N9423N373l2928j74349p0903J00185J68963K3222J37853J80979l1940
$$ -219718 -160295 -154922 -187850 -362199 -433102 -332917 -163954 -140732 -2879 178100 146160
12971A46160k41311j90571m7423J40395J97368o9535p0884k3306K23053j6276
$$ 146160 -95151 -285722 -333145 -192750 4618 -64917 -135801 -159107 63946 47670
12961D7670n4588m7695j43633l6484M248J18295k8373P3764Q9979K96070K5506
$$ 47670 -6918 -54613 -198246 -234730 -230482 -112187 -140560 -66796 23183 319253 344759
12950C44759k80442j89760J35113k26769R185L3307J3513k1160O0780Q5875J20827
$$ 344759 64317 -125443 9670 -217099 -207914 -174607 -161094 -182254 -121474 -35599 85228
12939H5228O0249J6838j06105o4321q5128j766q4868K4347J56730J382K6108j08749
$$ 85228 145477 162315 56210 -8111 -93239 -95005 -179873 -155526 1204 2586 28694 -80055
12927h0055M607r6244k4298J21437K10129R6527j53312j17227J44176n0587j00386
$$ -80055 -75448 -171692 -195990 -74553 135576 232103 78791 -38436 105740 55153 -45233
12916d5233Q5526N8734j53436O4867m5548j5236J64051J21954l4997m1509J16664
$$ -45233 40293 99027 -54409 10458 -35090 -50326 113725 235679 200682 159173 275837
12905B75837j08840L6751n7566r0961M8695r1812J0297q3950P345O3654M4320
$$ 275837 166997 203748 146182 55221 103916 12104 22401 -61549 -54204 9450 53770
12894E3770o370n2150j45675o056q6706r392J18682J77568k1629j1017j4347P5280
$$ 53770 47400 -4750 -150425 -156481 -243187 -252579 -133897 43671 22042 11025 -3322 71958
12882G1958k11092q1467R1868J47626q0166J44243L495R1104M6220k52640p7206
$$ 71958 -139134 -220601 -128733 18893 -61273 82970 86465 177569 223789 -28851 -106057
12871a06057j21139r9193m3822L8309Q9749K54646Q6794j0409L3649j02058j57010
$$ -106057 -227196 -326389 -370211 -331902 -242153 12493 99287 88878 122527 20469 -136541
12860a36541K4258J59138Q815J00598K7914k42978r0103n3726k70659P5179J76207
$$ -136541 -112283 46855 55670 156268 184182 -58796 -148899 -202625 -473284 -398105 -221898
$$ [...]
##END NTUPLES=NMR SPECTRUM
##END=
