##TITLE=Analysis number 320264
Compound Code ac 10430
Book Reference b
Project Code adrs
Chemist Name acros
+D2O
##JCAMPDX= 6.0         $$ Bruker NMR JCAMP-DX V2.0
##DATA TYPE= NMR SPECTRUM
##DATA CLASS= NTUPLES
##ORIGIN= Bruker BioSpin GmbH
##OWNER= nmr
$$ XWIN-NMR		Version 3.5
$$ Tue Jun 20 09:39:52 2006 GMT Daylight Time (UT+1h)  MAYBRIDGE\nmr@NMR_250MHZ
##.OBSERVE FREQUENCY= 250.131544655141
##.OBSERVE NUCLEUS= ^1H
##.ACQUISITION MODE= SIMULTANEOUS (DQD)
##.ACQUISITION SCHEME= undefined
##.AVERAGES= 16
##.DIGITISER RES= 18
##SPECTROMETER/DATA SYSTEM= dpx250
##.PULSE SEQUENCE= zg30
##.SOLVENT NAME= DMSO
##.SHIFT REFERENCE= (INTERNAL, DMSO, 0, 16.522)
##AUDIT TRAIL= $$ (NUMBER, WHEN, WHO, WHERE, WHAT)
$$ ##TITLE= Audit trail, XWIN-NMR		Version 3.5
$$ ##JCAMPDX= 5.01
$$ ##ORIGIN= Bruker BioSpin GmbH
$$ ##OWNER= nmr
$$ C:\u/data/dgb/nmr/ADRS/1081/pdata/1/auditp.txt
$$ ##AUDIT TRAIL=  $$ (NUMBER, WHEN, WHO, WHERE, WHAT)
(   1,<2006-06-20 09:39:16.76 +100>,<MAYBRIDGE\nmr>,<NMR_250MHZ>,
      <created by zg, POWCHK disabled, PULCHK disabled
       configuration hash MD5:
       E2 DF 36 D8 04 B2 41 60 5A D7 A3 38 5A 4B D0 FE
       data hash MD5: 64K
       D4 9A 31 C3 E3 A4 C2 70 14 C0 83 3C 86 E4 7D 02>)
(   2,<2006-06-20 09:39:32.31 +100>,<MAYBRIDGE\nmr>,<NMR_250MHZ>,
      <Start of raw data processing
       ef LB = 0.3 FT_mod = 6 PKNL = 1 SI = 32K 
       data hash MD5: 32K
       8E 96 AA 32 3D 10 C8 D6 01 FC 7A 82 71 68 39 0A>)
(   3,<2006-06-20 09:39:36.96 +100>,<MAYBRIDGE\nmr>,<NMR_250MHZ>,
      <apk 
       data hash MD5: 32K
       F4 29 8F EB 42 39 24 34 F3 8C E3 24 91 65 B7 55>)
(   4,<2006-06-20 09:39:38.71 +100>,<MAYBRIDGE\nmr>,<NMR_250MHZ>,
      <abs ABSG = 5 
       data hash MD5: 32K
       3D 84 74 04 F0 F7 8D 1F 23 17 60 50 AE 69 8E 48>)
$$ ##END=
$$ 
$$ hash MD5
$$ 84 D9 25 2B D0 D8 45 1D 8D D4 95 79 FB 86 F8 41
##$RELAX= 
##$RELAX= 
##$RELAX= 
##$RELAX= 
##$RELAX= 
##$RELAX= 
##$RELAX= 
$$ Bruker specific parameters
$$ --------------------------
##$DU= <C:\u>
##$EXPNO= 1081
##$NAME= <ADRS>
##$PROCNO= 1
##$TYPE= <nmr>
##$USER= <dgb>
##$AMP= (0..31)
100 100 100 100 100 100 100 100 100 100 100 100 100 100 100 100 100 100 
100 100 100 100 100 100 100 100 100 100 100 100 100 100 
##$AQSEQ= 0
##$AQ_mod= 3
##$AUNM= <au_zg>
##$AUTOPOS= <5 >
##$BF1= 250.13
##$BF2= 250.13
##$BF3= 250.13
##$BF4= 250.13
##$BF5= 500.13
##$BF6= 500.13
##$BF7= 500.13
##$BF8= 500.13
##$BYTORDA= 1
##$CFDGTYP= 0
##$CFRGTYP= 5
##$CHEMSTR= <none>
##$CNST= (0..31)
1 1 145 1 1 1 1 1 1 1 1 1 1 1 1 1 1 1 1 1 1 1 1 1 1 1 1 1 1 1 1 1 
##$CPDPRG= <>
##$CPDPRG1= <>
##$CPDPRG2= <>
##$CPDPRG3= <>
##$CPDPRG4= <mlev>
##$CPDPRG5= <mlev>
##$CPDPRG6= <mlev>
##$CPDPRG7= <mlev>
##$CPDPRG8= <mlev>
##$CPDPRGB= <>
##$CPDPRGT= <>
##$D= (0..31)
0 1 0 0 0 0 0 0 0 0.06 0 0 0 0 0 0 0.0002 0 0 0 0 0 0 0 0 0 0 0 0 0 0 
0 
##$DATE= 1150792755
##$DBL= (0..7)
120 120 120 120 120 120 120 120 
##$DBP= (0..7)
150 150 150 150 150 150 150 150 
##$DBP07= 0
##$DBPNAM0= <>
##$DBPNAM1= <>
$$ [...]
##$SUBNAM6= <"">
##$SUBNAM7= <"">
##$SUBNAM8= <"">
##$SUBNAM9= <"">
##$SW= 20.6930455092707
##$SWIBOX= (0..15)
0 0 3 0 0 0 0 0 0 0 0 0 0 0 0 0 
##$SW_h= 5175.983436853
##$TD= 65536
##$TD0= 1
##$TE= 294.16
##$TE2= 300
##$TE3= 300
##$TEG= 300
##$TL= (0..7)
0 120 120 120 120 120 120 120 
##$TP= (0..7)
150 150 150 150 150 150 150 150 
##$TP07= 0
##$TPNAME0= <>
##$TPNAME1= <>
##$TPNAME2= <>
##$TPNAME3= <>
##$TPNAME4= <>
##$TPNAME5= <>
##$TPNAME6= <>
##$TPNAME7= <>
##$TPOAL= (0..7)
0.5 0.5 0.5 0.5 0.5 0.5 0.5 0.5 
##$TPOFFS= (0..7)
0 0 0 0 0 0 0 0 
##$TUNHIN= 0
##$TUNHOUT= 0
##$TUNXOUT= 0
##$USERA1= <user>
##$USERA2= <user>
##$USERA3= <user>
##$USERA4= <user>
##$USERA5= <user>
##$V9= 5
##$VALIST= <valist>
##$VCLIST= <CCCCCCCCCCCCCCC>
##$VD= 0
##$VDLIST= <DDDDDDDDDDDDDDD>
##$VPLIST= <PPPPPPPPPPPPPPP>
##$VTLIST= <TTTTTTTTTTTTTTT>
##$WBST= 1024
##$WBSW= 4
##$XGAIN= (0..3)
0 0 0 0 
##$XL= 0
##$YL= 0
##$YMAX_a= 407461
##$YMIN_a= -549424
##$ZGOPTNS= <>
##$ZL1= 120
##$ZL2= 120
##$ZL3= 120
##$ZL4= 120
##$ABSF1= 16.522
##$ABSF2= -4.171173
##$ABSG= 5
##$ABSL= 3
##$ALPHA= 0
##$AQORDER= 0
##$ASSFAC= 0
##$ASSFACI= 0
##$ASSFACX= 0
##$ASSWID= 0
##$AUNMP= <proc_1d>
##$AZFE= 0.1
##$AZFW= 0.1
##$BCFW= 0
##$BC_mod= 0
##$BYTORDP= 0
##$COROFFS= 0
##$CY= 12.5
##$DATMOD= 1
##$DC= 0
##$DFILT= <>
##$DTYPP= 0
##$F1P= 14.0000005364418
##$F2P= -0.99999901652339
##$FCOR= 0.5
##$FTSIZE= 32768
##$FT_mod= 6
##$GAMMA= 0
##$GB= 0
##$INTBC= 1
##$INTSCL= 1
##$ISEN= 128
##$LB= 0.3
##$LEV0= 0
##$LPBIN= 0
##$MAXI= 10000
##$MC2= 0
##$MEAN= 0
##$ME_mod= 0
##$MI= 0
##$NCOEF= 0
##$NC_proc= -5
##$NLEV= 6
##$NOISF1= 0
##$NOISF2= 0
##$NSP= 0
##$NTH_PI= 0
##$NZP= 0
##$OFFSET= 16.522
##$PC= 1
##$PHC0= 162.71
##$PHC1= 4.724499
##$PH_mod= 1
##$PKNL= yes
##$PPARMOD= 0
##$PSCAL= 4
##$PSIGN= 0
##$REVERSE= no
##$SF= 250.13
##$SI= 32768
##$SIGF1= 0
##$SIGF2= 0
##$SINO= 400
##$SIOLD= 32768
##$SREGLST= <1H.DMSO>
##$SSB= 0
##$STSI= 32768
##$STSR= 0
##$SW_p= 5175.98343685301
##$SYMM= 0
##$S_DEV= 0
##$TDeff= 65536
##$TDoff= 0
##$TI= <Analysis number 999999
Compound Code 99
Book Reference 9
Project Code 9>
##$TILT= no
##$TM1= 0
##$TM2= 0
##$TOPLEV= 0
##$USERP1= <user>
##$USERP2= <user>
##$USERP3= <user>
##$USERP4= <user>
##$USERP5= <user>
##$WDW= 1
##$XDIM= 32768
##$YMAX_p= 405026724
##$YMIN_p= -507988
$$ End of Bruker specific parameters
$$ ---------------------------------
##NTUPLES= NMR SPECTRUM
##VAR_NAME=  FREQUENCY,     SPECTRUM/REAL,   SPECTRUM/IMAG
##SYMBOL=    X,             R,               I
##VAR_TYPE=  INDEPENDENT,   DEPENDENT,       DEPENDENT
##VAR_FORM=  AFFN,          ASDF,            ASDF
##VAR_DIM=   32768,         32768,           32768
##UNITS=     HZ,            ARBITRARY UNITS, ARBITRARY UNITS
##FACTOR=    0.157963299565203, 1,           1
##FIRST=     4132.6476996994, 0,             0
##LAST=      -1043.33573715361, 0,           0
##MIN=       -1043.33573715361, -507988,     0
##MAX=       4132.6476996994, 405026724,     0
$$ Real data points
##PAGE= N=1
##DATA TABLE= (X++(R..R)), XYDATA
$$ [...]
18051A7371306j362260j153533r75734p92014p33041l81201m17057l16805m04928
18042A0834733n07104l23428k56203l25817j22940m3317j66524j97075q8492p1859
18032H731974j52984k34087k26279k9323L7224j90738j53310K17876O61142J268759
18022I930254J726049J952726J832410J288038N84476L53200N62847P01740N76189
18013A9507929j34075r41547j430665j803221j260163q44287r84441j324275j090970
18004I694285o73475l01038P114q0604m85952o10788n55374k94134j05851k49932
17994F344251l08119p4560R6116j2749l07468l07698j8153J38748K98409N65133
17984F413910J026862J275732J253173J172961P55485M37039M15940Q10890J297222
$$ plain form
18051 17371306 16009046 14855513 13879779 13087765 12354724 11973523 11556466 11239661 10834733
18042 10834733 10327629 10004201 9747998 9422181 9299241 9255924 9089400 8892325 8803833 8731974
18032 8731974 8578990 8344903 8118624 8089301 8126525 7935787 7782477 8000353 8661495 9930254
18022 9930254 11656303 13609029 15441439 16729477 17313953 17667153 18230000 18931740 19507929
18013 19507929 19373854 18432307 17001642 15198421 13938258 13093971 12109530 10785255 9694285
18004 9694285 9020810 8719772 8726886 8646282 8160330 7549542 6994168 6700034 6594183 6344251
17994 6344251 6036132 5961572 6057688 6044939 5737471 5429773 5411620 5550368 5848777 6413910
17984 6413910 7440772 8716504 9969677 11142638 11898123 12335162 12751102 13561992 14859214
17975A4859214K101559K647314K859496K204474J240819P83503P65069J117885
17967B8579333J396016J981365J942349J21931k100922k981565k326527j877732
17959B4734248j405487n95334r74973j984816j825591j232421j636186j684780
17951A3394660q54718p15238j062438r69702n92264n50290o03083l13510j97568
17942G535849Q860J58782M7403l4941l1735j26427P2166J06092n9896j63113l30810
17931G182230k50925J05811L78346O82612J026352J157125J142099J230958J426015
17922A4080623K052002K866375K992543K141444P60604m20009j127067j042093
17914B2304422m95806q4930q35485k318072l593628l375098k066220j098345m96911
$$ plain form
17975 14859214 16960773 19608087 22467583 24672057 25912876 26696379 27461448 28579333
17967 28579333 29975349 31956714 33899063 34020994 31920072 28938507 26611980 24734248
17959 24734248 23328761 22733427 21758454 19773638 17948047 16715626 15079440 13394660
17951 13394660 12539942 11824704 10762266 9792564 9200300 8650010 8046927 7733417 7535849
17942 7535849 7544709 7703491 7750894 7715953 7684218 7557791 7629957 7736049 7676153 7513040 7182230
17931 7182230 6931305 7037116 7415462 8098074 9124426 10281551 11423650 12654608 14080623
17922 14080623 16132625 18999000 21991543 24132987 24893591 24473582 23346515 22304422
17914 22304422 21808616 21723686 20888201 18570129 14976501 11601403 9535183 8436838 7939927
17905G939927m03645m69516l95760m03495k97075k51830j23082r7914m92319n03975
17895D501316k69658l28811k26016o4439j20252j90048k82963k0800L6549J7491
17885C052369n4909r17j6424j22107j75059j07137m9172J13709J29384p6964q4526
17874B608247m0761p7615j69409J893Q4675K2323r639l4183r507p8187l8345K0960
17862B280452m9366j8880o2040j72124j57245j26471L840P9573j0535j15865j44783
17851A506556j4043K4092K9118K3133r6655j59776O9738P4884J1768Q4763M51
17840A554029q8157o2400k7387L7298l5121j1398L7292J5149P8722J28424L6014
17829A662465k2561r257R3903J01330J27761Q9965J69979M5297J3161M703M6221
$$ plain form
17905 7939927 7536282 7066766 6671006 6267511 5970436 5718606 5595524 5497610 5005291 4501316
17895 4501316 4231658 3902847 3676831 3612392 3492140 3302092 3019129 2998329 3034878 3052369
17885 3052369 2997460 2996543 2980119 2858012 2682953 2575816 2526644 2640353 2769737 2692773 2608247
17874 2608247 2567486 2489871 2320462 2322355 2407030 2429353 2419714 2385531 2376024 2297837 2259492 2280452
17862 2280452 2231086 2212206 2150166 1978042 1820797 1694326 1698166 1777739 1767204 1651339 1506556
17851 1506556 1492513 1516605 1545723 1568856 1472201 1312425 1382163 1457047 1468815 1553578 1554029
17840 1554029 1465872 1403472 1376085 1413383 1378262 1366864 1404156 1419305 1498027 1626451 1662465
17829 1662465 1639904 1630647 1724550 1825880 1953641 2043606 2213585 2258882 2272043 2276746 2322967
17818B322967J21178Q8456J92766L0327L3013J15990L0852J91421K74743L00320
17808C702033K33837R3927L30193L41690L42089N10073N22909N87769O59495R20082
17798H244097J225739J460024J855754K633089L726050N314223O970778Q448572
17790C9878326Q149681N944316M007789L634728M490435O438315Q888583R209907
17782I0642080M251307k869142n128258l101561l62117K833777N859486N395672
17774I7521244q64264o331056n829518k691745O87534L758792N569978L513682
17766I5334647k626281p009374o985861n431022l742383k160495j727933m738286
17758F0913012r106775r320292o646244m419899k966714j971370j453375j049188
$$ plain form
17818 2322967 2444145 2532601 2725367 2755694 2788707 2904697 2935549 3126970 3401713 3702033
17808 3702033 3935870 4029797 4359990 4701680 5043769 5553842 6076751 6664520 7324015 8244097
17798 8244097 9469836 10929860 12785614 15418703 19144753 24458976 31429754 39878326
17790 39878326 48028007 53972323 57980112 61614840 66105275 72543590 81432173 90642080
17782 90642080 94893387 92024245 86895987 83794426 83432309 86266086 92125572 97521244
17774 97521244 96656980 90325924 84496406 81804661 82492195 86250987 91820965 95334647
17766 95334647 92708366 85698992 78713131 73282109 69539726 67379231 65651298 60913012
17758 60913012 51806237 42485945 35839701 31419802 28453088 26481718 25028343 23979155
17750B3979155q60730o28395k01683J97617P63792J406592K193278L591653N169510
17741C5610789O395751N950436M086253K659581K341134K908430M366111O088556
17733G0407041O229663K169068l433534m777780k847070k92748K429237M735083
17725G4618960M185500l39888m238107m179646k086672K03263K641254M376371
17717G5181035K509083l559705p115838o387690m667828l149725j916007j526274
17709D9367051l956805p063261o989836n053679l613946k605016j893003j454289
17701A6737216j157785j118149q17361p88052p23145o53841n65394m17445m10657
17692A0085387m45308l67063m51640l14863l82735l65460l20808k67678j87704
$$ plain form
17750 23979155 23118425 22490030 22288347 22485964 23249756 24656348 26849626 30441279 35610789
17741 35610789 42006540 47956976 52043229 54702810 57043944 59952374 64318485 70407041
17733 70407041 76636704 78805772 75372238 70594458 67747388 67454640 69883877 74618960
17725 74618960 78804460 78464572 74226465 70046819 67960147 68163410 70804664 75181035
17717 75181035 77690118 74130413 67014575 60626885 55959057 52809332 50893325 49367051
17709 49367051 45410246 38346985 31357149 26303470 22689524 20084508 18191505 16737216
17701 16737216 15579431 14461282 13643921 12855869 12132724 11478883 10913489 10496044 10085387
17692 10085387 9640079 9273016 8821376 8506513 8123778 7758318 7437510 7169832 6982128
17683F982128k34988k83352j87892n9845j93598k60672j59338k16810k83149k19218
17673D883266j35875k31296k33775m8106q4519j67701j45641j55127q1959K7309
17663C626576n1461J5358N0406p9133j42532o6928K8337j9298j24803l7152o0061
17652C139309j91928l3814M4226Q8075m9377q1772j44030j30475k7662o5366j07680
17641B439506j82879m477r0386k6606n8155j05041q4315n8870o877P0321P7002
17630A969223m2841j14599J9835k21308k50540o6390N2041P6689k0620l4921K213
17619A368782o9130m6734m3238K7810J02306J947p5373m9515J16944R8711J02695
17608A535205L5097J8155j09049p2538N960J44437k4507L9384M1837o6890n2871
$$ plain form
17683 6982128 6747140 6463788 6275896 6216051 6022453 5761781 5602443 5385633 5102484 4883266
17673 4883266 4747391 4516095 4282320 4234214 4149695 3981994 3836353 3681226 3599267 3626576
17663 3626576 3575115 3590473 3640879 3561746 3419214 3352286 3380623 3361325 3236522 3199370 3139309
17652 3139309 2947381 2913567 2957793 3045868 2996491 2914719 2770689 2640214 2612552 2547186 2439506
17641 2439506 2256627 2252150 2161764 2135158 2077003 1971962 1887647 1828777 1821900 1892221 1969223
17630 1969223 1926382 1811783 1831618 1610310 1359770 1293380 1345421 1422110 1401490 1366569 1368782
17619 1368782 1299652 1252918 1209680 1237490 1339796 1341743 1266370 1216855 1333799 1432510 1535205
17608 1535205 1570302 1588457 1479408 1406870 1412830 1557267 1532760 1572144 1613981 1547091 1494220
17597A494220n0564Q2j61255l0772L5572n6002M2005J4617p5367j80794j52721
17586H79021l0770p8409J27729O3275p0520r3018J1117O888K4131J4108J5744
17575H69296n9065N659N3340j5922L2061J1836p6397j53710Q9841J12746M0600
17564I10285j8927j88n7548R8019l5253k8252j23207r086J40894L2363m229n0635
17552H54236k3275N9190l5195p1716O9856J19305M004j25407r1367j94664J17787
17541F82754J98929j6349j12582J8554q8897k70846K0698P3222J01576R8305L7655
17530G43019j62234j21632M8442O8991N7019Q5884n5982q0321m4298Q978K0519
17519E68385m3125j24340o6410N4742N735M4233P0451J56263L0167M1950p6760
$$ plain form
17597 1494220 1443656 1443738 1282483 1251711 1287283 1231281 1273286 1287903 1212536 1031742 879021
17586 879021 848251 769842 897571 960846 890326 797308 808425 815313 839444 853552 869296
17575 869296 810231 815890 869230 853308 885369 897205 820808 667098 756939 869685 910285
17564 910285 891358 891170 833622 931641 896388 868136 744929 735843 876737 909100 904871 854236
17552 854236 830961 890151 854956 783240 853096 972401 976405 850998 759631 564967 682754
17541 682754 881683 865334 752752 771306 682409 411563 432261 505483 607059 705364 743019
17530 743019 580785 459153 507595 576586 633605 719489 663507 583186 538888 547866 568385
17519 568385 525260 400920 334510 389252 394987 439220 509671 665934 696101 738051 661291
17508F61291l5169Q8364M8696j0386m7075m1232j33684P3301K0227k6321K1618
17497F19630k4954j12571r4100O8125l5889l9114N5874R0495O732J24470R751
17486F68449j21952r3065o793q181P3990l3494J72715k5709l8864L556N3085N5849
17474F99586m2997m1141k0022N9978J79413J19045J6888L1765J69095K09749N6054
17463A437413K8260n0158L69J45157K36779L10676J99437K62715L94251L35280
17453C300179M01617O63504O75156O28451O69993P81215J020664J364887J870624
17444A1376290K316258K386199K464536K382505K176104K404910L441095M345847
17436C3293744L792641K016687J230634P49009m92664p41113J12373R65051o91107
$$ plain form
17508 661291 626122 714486 763182 752796 705721 664489 530805 604106 624333 598012 619630
17497 619630 594676 482105 388005 456130 420241 381127 437001 527496 534228 658698 668449
17486 668449 546497 453432 446639 438458 512448 478954 651669 625960 587096 590652 643737 699586
17474 699586 656589 615448 595426 655404 834817 953862 970750 1002515 1171610 1381359 1437413
17463 1437413 1465673 1415515 1415884 1561041 1797820 2108496 2307933 2570648 2964899 3300179
17453 3300179 3701796 4365300 5040456 5668907 6338900 7120115 8140779 9505666 11376290
17444 11376290 13692548 16078747 18543283 20925788 23101892 25506802 28947897 33293744
17436 33293744 37086385 39103072 40333706 41082715 40590051 39848938 39961311 40926362 40235255
17427D0235255l010989l613769k826088k479481k566779j823838j411081r01821
17419B1601409p59490j482828j881383j505108j085629p04703m13701j2763J99768
17410A3955572m98981j252004r00577j69888P4121J34824K54757M50892P39691
17401A2788407J219930K131984L025239K985704K459803J680585J200423J208621
17393B8700696J170870J492019K014544J514188q86093k103146j394799q51902
17385B9656377M18749R12235K14760n44696q09199l00164O24310J778769K053648
17376C4004789r5406k603816k876335k163999j680769q63216k45601j459882l645424
17367A8370341l473149k055611j284347j127598q38270l72899q4878J59543L29474
$$ plain form
17427 40235255 37224266 33610497 30784409 28304928 25738149 23914311 22503230 21601409
17419 21601409 20841919 19359091 17477708 15972600 14886971 14182268 13768567 13755804 13955572
17410 13955572 13456591 12204587 11304010 11134122 11208243 11343067 11597824 12048716 12788407
17401 12788407 14008337 16140321 19165560 22151264 24611067 26291652 27492075 28700696
17393 28700696 29871566 31363585 33378129 34892317 34006224 31903078 30508279 29656377
17385 29656377 30075126 30987361 31202121 30657425 29848226 29548062 30172372 31951141 34004789
17376 34004789 33909383 31305567 28429232 26265233 24584464 23721248 23475647 22015765 18370341
17367 18370341 14897192 12841581 11557234 10429636 9591366 9218467 9133589 9293132 9622606
17358I622606L63328K59486K9266J0190l4362J64533N79030R90599J45342q96233
17348A1233785r91649n94405j82072p1038K38727L6416r56463j169561r24139
17339F619601n69823l86937l64013l25955l86052n04347l74125k81968k60387
17330C165994k32769o1063j87542j49342j10036m8540j74516m8084j9019r5225
17320B039858j58385p679K3040j8031K2653p2836j16010n8521k5185r2609q8088
17309A448207o1488N953n6458k0950R3904r0883j4844j27586K2463P5829L1627
17298A305774q2881r8506k4620J7534J24059k7471j5276J0754Q2292j16657k12843
17287I62159j58575L2925K3223J19266p594K5752J13553R0884j2612r9405j49890
$$ plain form
17358 9622606 9985934 10245420 10274686 10284876 10250514 10415047 10994077 11984676 12130018 11233785
17348 11233785 10242136 9647731 9465659 9394621 9633348 9669764 8713301 7543740 6619601
17339 6619601 6049778 5662841 5298828 4972873 4586821 4082474 3708349 3426381 3165994
17330 3165994 2933225 2872162 2684620 2535278 2425242 2376702 2202186 2154102 2135083 2039858
17320 2039858 1881473 1873794 1896834 1878803 1901456 1828620 1712610 1654089 1628904 1536295 1448207
17309 1448207 1386719 1392672 1336214 1315264 1409168 1318285 1303441 1175855 1198318 1274147 1305774
17298 1305774 1222893 1124387 1099767 1117301 1241360 1213889 1198613 1209367 1291659 1175002 962159
17287 962159 803584 836509 859732 978998 971404 997156 1110709 1201593 1188981 1089576 939686
17276I39686j0853O5897k3944m595O5961J9471J3517j6888k3592K1111j09255
17265I36516Q620O6460l9358j09570L7225J68413N5737j8376q3303j33832j64188
17254G24344j23857m5143n0624q3428k0420J32310R3626j20712o9010J61624J06586
17243G05296M510N126p7746j0827P5468K2936j23758j104K9125o2649J4280j8564
17231E62093N4336K5285O3041K10836n3765j72902N1860J00405m9297l4478n6958
17220G00456q1340K9994P6143q1863l1402n032N084R3753N8226M3781M021m3234
17208G68587j09363j18186Q798J01546l586j06467j64759q7171n3547K1177L2466
17197B89495N1177L4722j5567j72432q3325J09962L2569l9819N5206J0323J18549
$$ plain form
17276 939686 928833 994730 970786 966191 1032152 1051623 1065140 1048252 1024660 1045771 936516
17265 936516 945136 1011596 972238 862668 899893 1068306 1124043 1105667 1022364 888532 724344
17254 724344 600487 555344 504720 421292 400872 533182 626808 506096 437086 598710 705296
17243 705296 709806 714932 637186 626359 701827 724763 601005 599901 629026 566377 580657 562093
17231 562093 616429 641714 704755 915591 861826 688924 740784 841189 791892 757414 700456
17220 700456 619116 649110 725253 643390 611988 606956 612040 705793 764019 807800 811821 768587
17208 768587 659224 541038 549836 651382 647796 541329 376570 289399 235852 257029 289495
17197 289495 340672 375394 359827 187395 104070 214032 246601 206782 261988 272311 390860
17186C90860P7795o9021j6221J1488l196l3620m0166J32049O0038J59194N200
17175F74400o5381k28903j32824O0531P6855r2143j8269K7207Q9953Q658m7607
17164C52477m8260j44230r5760R5554k6875N9906R1785m6009n7837J23472n3054
17153B51169q8740M8439J29957N6060K0516R73j26434k778N0422j18223k2818
17142A98543O5897n2682o0287q8273j29146J35541N7633m2425N8436J16916J05918
17131C66071p976j98458q4650J29874O6059j00619o5261L9713J34169K0117j8755
17120B80284j35936n7621n4400J09385J22681k5924l2876k5883j2443m9363R2810
17109B10714N3191J825N9926j09523o8631o2663K1164O0030k5559m2664j0117
$$ plain form
17186 390860 468655 399634 383413 394901 391705 358085 317919 449968 510006 669200 674400
17175 674400 609019 380116 247292 307823 384678 292535 274266 301473 391426 400084 352477
17164 352477 304217 159987 64227 159781 132906 192812 284597 238588 180751 304223 251169
17153 251169 162429 210868 340825 396885 417401 418374 291940 289162 339584 221361 198543
17142 198543 264440 211758 151471 63198 -65948 69593 127226 84801 143237 260153 366071
17131 366071 358095 159637 74987 204861 270920 170301 105040 144753 278922 299039 280284
17120 280284 144348 86727 32327 141712 264393 238469 205593 179710 167267 117904 210714
17109 210714 263905 265730 325656 216133 147502 84839 106003 166033 140474 97810 87693
17098H7693j8953O0869N4509M6603N4782n9155j41149o978p368J44975J47372
17087C63200j24964l1412M0928o2433p565J60898j9980j54809M9405R2146m4045
17076B61369J1447l6739L6947n0407r6596L9380n6837j1066L5838l5075l2069
17065F6192K0571l9444L1414O6575j7492J3566M8088L3010O3296n9881L3195r2023
17053A67067l1660k5548J05410m7195j34550m2728K521J34388l0418r2933j57819
17042a53465j17835R1114R9581N9496J47223P2304q4165l1937M2301N0996P7327
17031B52940J36270j10026n7348P9241L9067o1379o9700L209K064n2579J41882
17020C03641J301k18464q4024K5618O534j03341R1007J12986O4056M3712j3765
$$ plain form
17098 87693 68740 129609 184118 230721 285503 226348 85199 78221 70853 215828 363200
17087 363200 238236 206824 247752 185319 177754 338652 318672 163863 213268 305414 261369
17076 261369 272816 236077 273024 222617 126021 165401 108564 97498 133336 98261 66192
17065 66192 86763 47319 78733 145308 127816 141382 189470 222480 285776 225895 259090 167067
17053 167067 135407 109859 215269 168074 33524 -9204 -6683 127705 97287 4354 -153465
17042 -153465 -271300 -180186 -80605 -21109 126114 198418 114253 82316 124617 175613 252940
17031 252940 389210 279184 221836 301077 340144 278765 209065 212274 214338 161759 303641
17020 303641 304942 86478 2454 28072 34606 -68735 22272 135258 199314 243026 229261
17009B29261j54150j84222m6702J29250P7717L9771K6114m0756j00780M880Q5438
16998F5821J38125j28156m3117L8993K1296J52905K1764j17843l649M6855J9603
16987B12597m7159m1506P0956j1112l6298L6704l3015k70551j31459j10776M3032
16976c18587J46227P7441o9078l6378K34228O92N4608J27770j40292p3473L8392
16965D1550p989k2812K2782Q9654n5119R8225p140L4097q9423l6223K1112n7542
16953C1172j95661J48575J19221j4667j19033n3138J30434J55311K7883j5981
16943B14116j3207J03912K9050J10974N0910k3029P27j02943m8313l2496m3994
16932B45707J1093n8827q6313r3192N7678J31602J70425l518l8399P5517K2550
$$ plain form
17009 229261 75111 -109111 -155813 -26563 51154 90925 117039 76283 -24497 -19617 65821
16998 65821 203946 75790 32673 71666 92962 245867 267631 149788 146139 192994 212597
16987 212597 165438 123932 194888 183776 147478 184182 151167 -119384 -250843 -361619 -318587
16976 -318587 -172360 -94919 -163997 -200375 33853 34545 89153 216923 76631 3158 41550
16965 41550 33561 10749 33531 123185 68066 166291 159151 193248 103825 67602 88714 31172
16953 31172 -164489 -15914 103307 88640 -30393 -83531 46903 202214 230097 214116
16943 214116 200909 304821 333871 444845 495755 472726 473453 370510 322197 289701 245707
16932 245707 256800 197973 111660 18468 76146 207748 378173 374655 336256 411773 434323
16921D34323r9784q0384n291j16478K9588O0006k7986J756o5422Q224P507j03670
16909D2389J30194j2070n834j34580o5114J01124o7212p9261J14911J37056n6722
16898A04881j280J17832m4143j55292J1485J12138R6865k6594j6428J34016K8495
16887C61975n5777l7317R7501L3861o2833k1774l9128q0396k2932J10869R2642
16876C76691j06914j70593n2231L5915P8316O7130p8354m4104N9134o833l3630
16865A24527J88635J04345M2339q9153l8717M9433O7267K9753o4583Q338q5195
16854C36989l9227N1832j85403j24824J0456j7893P3585P2288K3409n9923q2200
16843E9089j9310K4404j125J6493m5946m5407N2393P6871M4446K6060k6548m9030
$$ plain form
16921 434323 334539 254155 248864 132386 161974 221980 193994 195750 130328 138552 146059 42389
16909 42389 172583 160513 154679 20099 -45015 56109 -11103 -90364 24547 161603 104881
16898 104881 103601 221433 177290 21998 33483 145621 242486 215892 199464 333480 361975
16887 361975 306198 268881 366382 400243 337410 315636 276508 196112 173180 284049 376691
16876 376691 269777 99184 46953 82868 161184 228314 149960 105856 164990 158157 124527
16865 124527 313162 417507 459846 370693 331976 381409 448676 478429 413846 422184 336989
16854 336989 297762 349594 164191 39367 49823 31930 105515 177803 201212 141289 59089
16843 59089 39779 64183 63058 79551 33605 -11802 40591 117462 161908 187968 161420 112390
16831A12390q9180N0594J6901N6798o7641L0670N8488j2779n3929K5330L8521
16820A66163K8810j49814K4824J07437j75332k81969O2168J35784J15472R9107
16810A32650j84825Q6737Q9156J89382K7158l313l9634K1890J2668l2712l3845
16799B65312j965P306o9168j07482J5110J17938J1563j1504P1767j12794j15172
16788G0911q2486K2903l5600L0735M8447J92759Q1714m25r6635j05689k1295R1276
16776A96615J27007j8430p6693j04625N3743J8326K2578K2680q1593k1511q4310
16765E3787j08229L519n2057N5175J00210Q3590l1215K2453M695K4446m2739m0166
16753G3469m0381J03246L3600j3580n5211J0239J16484N8426M9430j9319m8064
$$ plain form
16831 112390 23210 73804 90705 147503 79862 110532 169020 156241 102312 127642 166163
16820 166163 194973 45159 69983 177420 2088 -279881 -217713 -81929 33543 132650
16810 132650 -52175 34562 123718 313100 340258 336945 297311 319201 331869 299157 265312
16799 265312 263347 270653 201485 94003 109113 227051 238614 227110 298877 186083 70911
16788 70911 -11575 11328 -24272 6463 54910 247669 329383 328958 232323 126634 105339 196615
16776 196615 323622 305192 228499 123874 177617 195943 218521 241201 159608 138097 53787
16765 53787 -54442 -50923 -102980 -47805 52405 135995 104780 127233 131928 156374 113635 73469
16753 73469 33088 136334 169934 156354 101143 111382 227866 286292 335722 316403 268339
16742B68339k7420n3656r3098j23279M3236J04555J20302J1485p4509K3743q5545
16731A14153m9723j9869j6233J02118n7765m2513M1290M0276J9981k6360j6860
16720H8495m5491o1452k7890j5581n595j23375p9646J12695K3690P87J38189M9228
16708E4054O7019K35453k1639j29579j74349r5919N3572J00522L959p3191j52685
16697a32783Q200p1975O421Q0635J08980j45825K2842N815R8381K0727r7858l1131
16685a27571Q6507r198l8363J21066j4573r7304M1559l0419R68J20114j6989N5412
16673I1209N0181q542P563n3212r2267p7880j3511J26425M9323o0257l9499o2407
16661h2874N7496J45339l3296k0947j87519j39678N5384N8805J19439J13046p5869
$$ plain form
16742 268339 240919 187263 94165 -29114 14122 118677 238979 250464 175955 199698 114153
16731 114153 64430 44561 28328 130446 72681 30168 71458 111734 131715 105355 88495
16720 88495 43004 -18448 -46338 -61919 -67514 -190889 -270535 -157840 -134150 -133363 4826 54054
16708 54054 121073 356526 334887 205308 30959 -64960 -11388 89134 93093 19902 -132783
16697 -132783 -124583 -196558 -190137 -109502 -522 -146347 -123505 -117690 -19309 1418 -96440 -127571
16685 -127571 -41064 -50262 -88625 32441 17868 -79436 -37877 -68296 -67328 52786 35797 91209
16673 91209 141390 132848 140411 87199 -5068 -82948 -96459 29966 79289 19032 -20467 -82874
16661 -82874 -25378 119961 86665 65718 -121801 -261479 -206095 -147290 -27851 85195 9326
16650I326q1953L1122Q0335o0813p4241N8861J8387p2474k2151J17653N3210j501
16638E5761P6793k7251j6475J74811j116l8561l5562r9729j6107L2795l39L836
16626A08856l4548j33433m9150L4714O2137J13040p9461j49650O855j9719o316
16615a46675J49301J6799j05143j4029J38640P8108j49795p0219O3542o4114P0475
16604c3110J14209K11961K18650q7082j52091N2003m1542k33309j50265j3792
16594a14368J34708N7654n557j05387j06681R490R7579P5431l5000k8169O8116
16583D7816j30662l7128j855J10935N8230J31663O86q9174o4248j3755P2341K4194
16571A09043l833M2009k8245j37874k6961J06887Q1400O9816l3000q5080k1298
$$ plain form
16650 9326 -72627 -41505 38830 -21983 -96224 -37363 -18976 -91450 -113601 4052 57262 55761
16638 55761 132554 105303 88828 263639 262523 223962 188400 88671 72564 105359 105020 108856
16626 108856 74308 -59125 -108275 -73561 -11424 101616 22155 -127495 -120640 -140359 -146675
16615 -146675 2626 19425 -85718 -99747 38893 117001 -32794 -103013 -39471 -103585 -33110
16604 -33110 81099 293060 511710 424628 272537 324540 282998 49689 -100576 -114368
16594 -114368 20340 77994 72437 -32950 -139631 -130141 -32562 42869 7869 -20300 47816
16583 47816 -82846 -119974 -121829 -10894 47336 178999 179685 90511 26263 12508 84849 109043
16571 109043 105210 147219 118974 -18900 -45861 61026 142426 212242 179242 94162 72864
16560G2864o9339r4954l5031j22958r8428J21895N7467O3523P3965P9107m9715
16549a604p4913J06061K13610l5466k0812J2341j09023j87105l2950j8150L9559
16538a08452K7251L9048j13423m0429J25089J19062K2148O93l4881r0147J5998
16527c8043m5511K1907l1M2579j1247j27624N5815O441L3113M8021N559R0757
16515H1736k8929l5888n9473p0390J9215m7194L0139P6989k144K4905N4205m769
16503C8402k5333o197m7861p840L6901J11072o02k4191l7847j34707K2157R8549
16491B2503R5255j24478j40275J26486L9839k8262j6318M584K0327N5923J9395
16480G4979Q417p8767O6897J7702j9138O2395j20412l5169L1488O1703P3071j42695
$$ plain form
16560 72864 3525 -91429 -126460 -249418 -347846 -225951 -168484 -104961 -30996 48111 -1604
16549 -1604 -76517 29544 243154 207688 186876 199217 90194 -96911 -129861 -148011 -108452
16538 -108452 -81201 -42153 -155576 -196005 -70916 48146 70294 70987 36106 -54041 -38043
16527 -38043 -83554 -61647 -61678 -19099 -30346 -157970 -102155 -95714 -62601 -14580 -9021 81736
16515 81736 52807 16919 -42554 -112944 -93729 -140923 -110784 -33795 -35939 -11034 43171 38402
16503 38402 13069 6872 -40989 -48829 -11928 99144 98542 74351 36504 -98203 -76046 22503
16491 22503 117758 -6720 -146995 -20509 19330 -8932 -25250 -20666 -339 55584 74979
16480 74979 83396 4629 71526 89228 70090 132485 12073 -23096 8392 70095 143166 471
16468D71k174M748k6320J3407k1386K1805l3571m6046K05012J15040Q7731r8026
16456B20691k30942j30999M6880M5938o0670Q3090P4762J9737o8484M1146J00599
16445A41748L7471O5659m484R8751M628p8620j48018o8823J5245k0189P7050p0826
16433D9592r6002Q0005N4895m2757j45360Q0753K8014K3976Q1968m6552k55126
16422a86594m407J18443Q4048J9443k7004l8522j37858J07255J70502L2205j9847
16411A17664o8554j58146n9205M6752P5143m3289j1186k7938j01679O1806J33867
16400c4765k910p5782N4585L155p3329k6580O0425P2305O2654m3708m2368L1974
16388a4344q577o5041L9840O4718j65240m8181O8052J29424M1386j45034j29495
$$ plain form
16468 471 -1703 3045 -23275 -9868 -31254 -9449 -43020 -89066 115946 230986 318717 220691
16456 220691 -10251 -141250 -94370 -48432 -109102 -26012 48750 68487 3 41149 141748
16445 141748 179219 244878 240394 339145 343773 265153 117135 48312 63557 43368 120418 49592
16433 49592 -46410 33595 88490 45733 -99627 -18874 9140 33116 115084 68532 -186594
16422 -186594 -191001 -72558 11490 30933 3929 -34593 -172451 -65196 105306 137511 117664
16411 117664 49110 -109036 -168241 -121489 -46346 -89635 -100821 -128759 -230438 -168632 -34765
16400 -34765 -37675 -113457 -58872 -55717 -129046 -155626 -95201 -22896 39758 -3950 -46318 -14344
16388 -14344 -22921 -87962 -48122 16596 -148644 -196825 -128773 651 42037 -102997 -232492
16377b32492Q9305O5449O0067Q5959R5976P5227j6798K6538q4078l6444k4609
16366A04100l761p5868Q5282j09694l343O1268L5717l1391m1563K2469m8835j06481
16354a12100n5637Q1282N004r50r4527m0554R6694l3190M7427J1922o9899P574
16342a56954r410k4483O2789o0820j8605L1472o6530r835P5910P8851M8272J09687
16330F0344L3813j05723L0057J43933n6184j23997k8328k8236o6658N8932L2099
16319d9948j346o1591N8500J39398M5568m8672L1p5025r4071L9539P8096J1574
16307D2053j4598n9205K8917r0786J6524M7615n45r3926M4064N3996P0934P6167
16295A21210m250M4692j97663n4719L6988k499o7979M4852l2291j0870m9914O3316
$$ plain form
16377 -232492 -143187 -77738 -17671 68288 164264 239491 222693 249231 165153 128709 104100
16366 104100 100339 24471 109753 59 -3284 57984 93701 62310 20747 43216 -5619 -112100
16354 -112100 -167737 -86455 -81451 -82401 -176928 -217482 -120788 -153978 -106551 -94629 -164528 -156954
16342 -156954 -166364 -190847 -128058 -188878 -207483 -176011 -242541 -252376 -176466 -97615 -49343 60344
16330 60344 94157 -11566 18491 162424 106240 -17757 -46085 -74321 -140979 -82047 -49948
16319 -49948 -51294 -112885 -54385 85013 130581 81909 81940 6915 -87156 -47617 30479 42053
16307 42053 27455 -31750 -2833 -93619 -77095 -29480 -30025 -123951 -79887 -25891 45043 121210
16295 121210 116960 161652 -36011 -90730 -53742 -56241 -124220 -79368 -111659 -122529 -172443 -109127
16283a09127P1718P3988m6812m6644K3875m3634o5864J10267M6937o4276p2073
16272a21645J04748K4483k5429K6734J09434m9975L539J58136l4287n1784r987
16261A33967o2169m3988M7598K7228l4485N711j0426l8564n6722j42904l7230
16250b11984J18691K8541K2576R5j07267o4200J31177Q2171j1444m4077m1170
16239i6891K2990l6801N2354L9960J528n6686j35415J3949m3785k1343J7536K4652
16227b17952O6690J04385Q9981j9198M533m8653K8769L1275K3359P0842M8537
16216A82568k5221J1649n0360p2455n723Q3218R9208r9932J2697K2615j96403
16205c8139p7668J21118P155j54315J6055P7043j8725M7350M4892J4412k0508
$$ plain form
16283 -109127 -37409 36579 -10233 -56877 -33002 -76636 -142500 -32233 14704 -49572 -121645
16272 -121645 -16897 7586 -17843 8891 118325 68350 71889 230025 195738 143954 133967
16261 133967 71798 27810 75408 102636 68151 73862 63436 24872 -31850 -174754 -211984
16250 -211984 -93293 -64752 -42176 -42081 -149348 -213548 -82371 -200 -11644 -55721 -96891
16239 -96891 -73901 -110702 -58348 -18388 -16860 -73546 -208961 -195012 -238797 -260140 -242604 -217952
16227 -217952 -151262 -46877 43104 23906 28439 -20214 8555 39830 63189 134031 182568
16216 182568 157347 168996 118636 46181 40458 123676 222884 122952 135649 158264 -38139
16205 -38139 -115807 5311 12466 -141849 -125794 -48751 -67476 -20126 24766 39178 18670
16194A8670N7750P1151r6506n7389n5856J12417R6647j9175j22473j33290l721
16183a31775j04187J6885M143J67574P1958N1464j06319l7971m0765N02L3617
16172g4874O3294J37856L5011j20722j39414L0712J7230j46149J9212J62007P4380
16161E8543J13461L0474j98740q4009M306J0009J6754M4771J3811J6925P6357
16150A02662p0441q3268r6794j621K37580M4563j22478o8085n391k4139P9569
16139g843L8586M3211L7053r6468o0740m397m2144P6841k6875N5420N0531j16537
16127e3362r0746L0954M5976o7088Q9796J21608P131k2446r4403j4275P8722M8520
16115H0387Q807r581j34035j6429m0597n0142q6079N3645J46585J38626J2278
$$ plain form
16194 18670 76420 147571 51065 -6324 -62180 50237 146884 127709 5236 -128054 -131775
16183 -131775 -235962 -219077 -214934 -47360 24598 76062 -30257 -68228 -108993 -108491 -74874
16172 -74874 -11580 126276 161287 40565 -98849 -68137 -50907 -197056 -177844 -15837 58543
16161 58543 172004 202478 3738 -80271 -75965 -65956 -49202 -4431 9380 26305 102662
16150 102662 32221 -51047 -147841 -149462 88118 132681 10203 -57882 -63273 -87412 -7843
16139 -7843 30743 73954 111007 14539 -46201 -50598 -92742 -15901 -42776 12644 63175 -53362
16127 -53362 -144108 -113154 -67178 -134266 -44470 77138 84269 61823 -32580 -46855 31867 80387
16115 80387 89194 79613 -54422 -70851 -111448 -161590 -247669 -194024 -47439 91187 103465
16104A03465j14788m2380j6403p192Q8249R5059m7589j8218p2459j18698l2562
16093a83516O4342R8308J07038P6599n9117n9895l7994k4755Q2141N4799L6458
16082A54408M5675n3532j10759k701M4268K3154Q6965o6012m3549K0079R0934
16071A88930O7079o3470n831P9275O0903q9215j00347q9571k4652P8109m6007
16060E5203k9440o7749j75535k0922M5879Q598P6369K3978j10758m7888o1721
16049c03986k7630N6113J15180N8894J49j5737N2156L018O1858m7404p0261Q6542
16037c1108R5571O5570Q3812J0803j1231j98503j9453p1491P5521J65535l1975
16026A33051n6761O2684K5605q0871r3333j14799K880J4797N0602L2880J60259
$$ plain form
16104 103465 -11323 -53703 -70106 -77298 10951 106010 58421 40203 -32256 -150954 -183516
16093 -183516 -119174 -20866 86172 162771 103654 43759 5765 -18990 63151 117950 154408
16082 154408 200083 146551 35792 33091 77359 100513 187478 121466 77917 97996 188930
16071 188930 256009 192539 186708 265983 326886 237671 137324 47753 23101 101210 55203
16060 55203 25763 -41986 -217521 -238443 -192564 -183966 -107597 -83619 -194377 -242265 -303986
16049 -303986 -331616 -275503 -160323 -101429 -101280 -117017 -64861 -61843 15 -47389 -117650 -31108
16037 -31108 64463 130033 213845 224648 213417 14914 -4539 -76030 -509 165026 133051
16026 133051 76290 138974 164579 83708 -9625 -124424 -121544 -106747 -56145 -23265 136994
16015A36994o9962p5572l7040q6730r1980O2658q3564j9514q0986L9525P8340
16004b27831O8038P2565L0372p5950K9845J9210O3266O8553m0160m0424j08226
15993a40742k0496J44454Q892m5523P249N6479M7110N594J4784n9857M9570J21924
15981A89438k4052j32847n9516j1498n9051p1259J23602m161q353L2445l1310
15970e6562J05802N6050j04616m2456j23526R882O3677J8950K262k949j07163
15959a80649l7877j6545J897J55197O6565k31797k702J59130M3569o2502m8080
15948a53794M6394N7691O0492P3151o9047J2563m803P7744r3401r074j7322l9834
15936e9240J27694L5432o07K389p8120p1782q3333J1372k910j509J48981J75345
$$ plain form
16015 136994 67032 -8540 -45580 -132310 -224290 -161632 -245196 -264710 -345696 -306171 -227831
16004 -227831 -159793 -87228 -56856 -132806 -102961 -83751 -20485 48068 7908 -32516 -140742
15993 -140742 -161238 -16784 -7892 -53415 -46166 10313 57423 63017 77801 17944 67514 189438
15981 189438 165386 32539 -26977 -38475 -97526 -168785 -45183 -49344 -57697 -25252 -56562
15970 -56562 49240 105290 674 -41782 -165308 -155426 -91749 -72799 -70537 -73486 -180649
15959 -180649 -218526 -235071 -233174 -77977 -11412 -243209 -245911 -86781 -43212 -105714 -153794
15948 -153794 -107400 -49709 10783 83934 14887 27450 22647 100391 6990 -2084 -19406 -59240
15936 -59240 68454 103886 103279 105668 27548 -44234 -127567 -116195 -119105 -120614 28367 203712
15924B03712K7197j39919p0290o776p1804L277K8949P7799n1154p2239j42580
15913b13828k0293L7803J20346l4822l5178n3970q9529J2562M1723k8959J37201
15902a26944l0870P0187R0605J27345r6901r1217o0224J07867L0569K1558p8741
15891c6766k0096o4657m1749m1357N2268Q2141n0812L7684O3675M7405N5527p0093
15879A3170j27453q327J24128J04440o9619j72945R970J79750O2626n908o1514
15868D8318m34M1847O3576r5211j41669J7396K8370m8085n2529l1732L4530Q7967
15856d7656R584K6325J07482J37337l6707r1555j4409p5212R020j6176p5428j1197
15844g8592Q5085J14787r1174N84Q8409k7695j3764m6342q2187J1376K8318O3616
$$ plain form
15924 203712 230909 90990 20700 13924 -57880 -54603 -25654 52145 991 -71248 -213828
15913 -213828 -234121 -196318 -75972 -110794 -145972 -199942 -289471 -276909 -235186 -264145 -126944
15902 -126944 -157814 -87627 2978 130323 33422 -57795 -118019 -10152 20417 41975 -36766
15891 -36766 -56862 -121519 -163268 -204625 -152357 -70216 -121028 -83344 -19669 27736 83263 13170
15879 13170 -114283 -122610 1518 105958 36339 -136606 -126636 53114 115740 109832 48318
15868 48318 47884 89731 153307 58096 -83573 -66177 -37807 -85892 -138421 -170153 -135623 -47656
15856 -47656 -38072 -11747 95735 233072 196365 104810 90401 15189 24209 8033 -67395 -78592
15844 -78592 6493 121280 30106 30690 119099 91404 77640 31298 -50889 -39513 -11195 52421
15832E2421K4403p7720L8801m8567O15n8269K8946O6216n2933o5398m7248L8742
15820i9991J48206R3109J4660j05822j95139k07424J79810P4936P1684K4651J07259
15809A05939J2945k4335o5293p4316p3936J329J16996J6671j44876p8342N1795
15798a55423J23286l6382r9067J26L227m072K7212q2009o2409R8751j8746j6251
15786b21757m7544J62182O6831K6491N9445n4142k4588j6695j2392M536R5761
15775C8128L6997M0035J13203R2420K3052q7279r1862j14720j06784j3728m1845
15764a12383P7429M6304n1849r4232j5751o7516Q1150P6801O6812N804J0213k6820
15752d038r0940J6477j8102J53515N9636k9749M0934k21478n3509N6004J03693
$$ plain form
15832 52421 76824 -896 37905 -10662 -10047 -68316 -39370 26846 -26087 -91485 -138733 -99991
15820 -99991 48215 141324 155984 50162 -144977 -352401 -172591 -97655 -25971 -1320 105939
15809 105939 118884 94549 29256 -45060 -118996 -117667 -671 16000 -128876 -207218 -155423
15798 -155423 -32137 -68519 -167586 -167460 -164233 -168305 -141093 -223102 -285511 -186760 -205506 -221757
15786 -221757 -269301 -107119 -40288 -13797 45648 -8494 -33082 -49777 -62169 -57633 38128
15775 38128 75125 115160 228363 320783 343835 256556 164694 49974 -56810 -70538 -112383
15764 -112383 -34954 11350 -40499 -134731 -150482 -217998 -136848 -60047 6765 12569 22782 -4038
15752 -4038 -94978 -78501 -96603 56912 116548 86799 127733 -93745 -147254 -91250 12443
15741A2443R0845n1901M1284J3088p5897q1061l2346J13987K9541K0503p4823
15730E663j89216O175J02503J31563l0783l4503L0737M2609m8900j73457j7956
15719a75565J66953Q6675n6063j36227L6695O0635q4706j50955L600P8353J0809
15708a59796J88979M3490k1706q8075J0398l8910l0353M01m1372K906O5761k9312
15696i7589j3018N492j6623K6611O290l1207o09k5588k5271J09614q26p7238J21160
15683a8802N1964j6222J8316j35180k5700P3793P1617J72209r6663j91381L0562
15672f5487J65032J3011R555M8250m4358K5413J9486m6586j79791m8372m86j4365
15660a18698j7962N6063R4706M4505K8786p9063l4032J28227K9133m8790j18213
$$ plain form
15741 12443 103288 51387 92671 105759 29862 -51199 -83545 30442 59983 80486 5663
15730 5663 -183553 -177378 -74875 56688 25905 -8598 22139 64748 15848 -157609 -175565
15719 -175565 -8612 78063 22000 -114227 -77532 -16897 -101603 -252558 -248958 -170605 -159796
15708 -159796 29183 72673 50967 -37108 -26710 -65620 -95973 -95572 -136944 -134038 -68277 -97589
15696 -97589 -110607 -105115 -121738 -95127 -88837 -120044 -120653 -146241 -171512 -61898 -62724 -139962 -18802
15683 -18802 33162 16940 35256 -99924 -125624 -51831 19786 191995 95332 -96049 -65487
15672 -65487 99545 112556 122111 170361 126003 151416 170902 124316 -55475 -103847 -104333 -118698
15660 -118698 -136660 -80597 14109 58614 87400 8337 -25695 102532 131665 82875 -35338
15649c5338k7178L4925l8097j0432k9048j8764L619O036l9971M5760L9791j0466
15637g9163N6529M8922l5783m4028m3326l1821j22193P690m5957R3682N8006J7171
15625a20271q323l6395J52775J8570L3869J5614K8466r7413j4304j8612M4494
15614a530K5711M4990l9788m4213M0174l092K6799J27488P9597J4186n4369j87838
15602B8115j17488N2201k0870q7068k4030J40936K3810n5606L6729L6017p1918
15591e9172m1235r817o1946k6682O1386K8909P8072Q148N1775N710L8594l0599
15579D3143k8605n8809n0207O0412M4764M8768r1558p0144o3646N791j6849j00904
15567b77844L058J11295J10054Q9152p0854Q677j5842o6529n6248J9152L087O1088
$$ plain form
15649 -35338 -62516 -27591 -65688 -76120 -105168 -123932 -120313 -114277 -154248 -108488 -68697 -79163
15637 -79163 -22634 26288 -9495 -53523 -96849 -128670 -250863 -243173 -289130 -195448 -137442 -120271
15625 -120271 -128594 -164989 -12214 6356 40225 55839 84305 -13108 -27412 -46024 -1530
15614 -1530 24181 69171 29383 -14830 25344 22252 49051 176539 256136 270322 215953 28115
15602 28115 -89373 -37172 -58042 -145110 -169140 -28204 -4394 -60000 -23271 12746 -59172
15591 -59172 -100407 -110224 -172170 -198852 -137466 -108557 -30485 -22337 29438 35148 73742 43143
15579 43143 14538 -44271 -94478 -34066 10698 59466 -32092 -102236 -165882 -160091 -176940 -277844
15567 -277844 -274786 -163491 -53437 35715 -35139 -26462 -42304 -108833 -165081 -145929 -142842 -81754
15555h1754O2285n2198m2088l5628J6732n8910M3721M1698N85j2041O681m1136
15543a52053J4839J65618P9860J4284K509j10178j04804O9801N5543j03104k2048
15532h9733J10408Q256m8237J0978j28570K4603Q9992j16394K2866Q8976M8904
15521B2049r320l3254J0387q557R6488n4161j00315O147R441M2195P1951j8663
15509C4388R4911N0302o6496n8942n7714q6597J4389l9901j997L7313M6059L8423
15497D138R110j23521p1649J09675Q1014K4318O4192Q1037k435j87624L7692M4252
15485G0199o6569j53n1584L9030J3062q1737j24663Q1040O3174k9859l2154j6797
15473a37011k6238K6173J32085Q8857p0832j19851M3605J05097K5748k1187l074
$$ plain form
15555 -81754 -19469 -71667 -113755 -149383 -132651 -191561 -147840 -106142 -105557 -117598 -110917 -152053
15543 -152053 -137214 28404 108264 122548 125057 14879 -89925 -20124 35419 -67685 -89733
15532 -89733 20675 28931 -19306 -8328 -136898 -112295 -22303 -138697 -115831 -26855 22049
15521 22049 12729 -20525 -10138 -18695 77793 23632 -76683 -70536 -61095 -18900 53051 34388
15509 34388 129299 179601 113105 54163 -3551 -90148 -75759 -115660 -117657 -80344 -34285 4138
15497 4138 13248 -110273 -181922 -72247 8767 33085 97277 178314 175879 -11745 25947 70199
15485 70199 3630 3477 -48107 -9077 3985 -77752 -202415 -121375 -58201 -88060 -120214 -137011
15473 -137011 -163249 -137076 -4991 83866 13034 -106817 -63212 41885 67633 46446 43372
15462D3372R0401Q0874k8966n3619r7954j3360L5796n4994q8295j21989K7270
15451a81464m1404q5423P3069J56721R6538j56777j2932j3583o7107m082M6383
15440a90061M7753J45211o6030q4201J5004K8414l0876k4563p1828J49980J27018
15429D5821J9303k3079r3257n7059J5026m1688N2395Q2394P3936K449r741r8954
15417c2454L7907k4218j3452l3805n1091J3415M2223J7034p3944N0519J02439
15406C4573L5521m7496J3273l0304q8790j811N0008q5700J7338J03091J45801
15395A45504L1349r4753l9721P6186o7293j6089q2741R582p8481j14164O7239
15384a63382Q9170j9806j4756Q42N8016Q8482L4454n1681n2274N414k0163j6331
$$ plain form
15462 43372 133773 214647 185681 132062 34108 20748 56544 1550 -86745 -208734 -181464
15451 -181464 -222868 -308291 -235222 -78501 18037 -138740 -151672 -165255 -232362 -236444 -190061
15440 -190061 -142308 2903 -63127 -147328 -132324 -103910 -134786 -159349 -231177 -81197 45821
15429 45821 65124 42045 -51212 -108271 -93245 -134933 -82538 -144 73792 76241 66500 -32454
15417 -32454 5453 -18765 -32217 -66022 -117113 -103698 -61475 -44441 -118385 -67866 34573
15406 34573 70094 22598 35871 5567 -83223 -85034 -35026 -120726 -103388 -297 145504
15395 145504 176853 82100 42379 118565 51272 35183 -47558 -37976 -116457 -230621 -163382
15384 -163382 -74212 -94018 -108774 -107932 -49916 38566 73020 21339 -30935 -25521 -45684 -62015
15372f2015L9434J31343M8661j30290m8469j3667k066N8370k3186P5683o2610
15361A1188r9174q1584j46976R5019J28292N8331l2412L8258R7013j21833L7483
15350a6395J19r1615j24787K7544J30035J32637o4044r3343J06250O6863R876
15339H3140O2476R6394J6623j24538r9036k2044j422Q193o6028k9580N2782O5847
15327D2807K1548o9224j04284n4146L3508J5770n767J9219P5621j63901j8142
15316b06991J1893q0486n0347L3365J97529N3381q412N8754n094l9619j28481
15305a64508P1419J01948O9062R118j0266j09445m9689K2055J03979k1774j31039
15294a09140Q923J4706r721l9984n9810r659M2311O9041N3956P85k1546j93862
$$ plain form
15372 -62015 -22581 108762 157423 27133 -21336 -35003 -37069 21301 -1885 73798 11188
15361 11188 -87986 -169570 -316546 -221527 -93235 -34904 -67316 -29058 67955 -53878 -16395
15350 -16395 -16276 -107891 -232678 -205134 -75099 57538 -6506 -99849 6401 73264 83140
15339 83140 145616 242010 258633 134095 35059 13015 11593 19786 -46242 -75822 -23040 42807
15327 42807 64355 -4869 -109153 -163299 -129791 -114021 -119788 -100569 -24948 -188849 -206991
15316 -206991 -195098 -275584 -325931 -292566 -95037 -41656 -50068 8686 3592 -36027 -164508
15305 -164508 -93089 8859 77921 87039 76773 -32672 -82361 -60306 43673 21899 -109140
15294 -109140 -100217 -85511 -95232 -135216 -195026 -204685 -162374 -93333 -39377 -38592 -60138 -254000
15282b54000Q8473O5787N8121J267j7977N268J04207L3511l9820O3090o626q0107
15270B1194J7963K7499j17907o215q4213l7274Q4R1221l260o0378O3602J74270
15258H6586l8461j24473L4119J28348O8319k8820J17474p6770n0256l6993M5840
15247A24913j5117o2825N6140q5739J3872J80663j06509k12687N5900J02877n5022
15236c534j38593O8465L7456J3658j22937j72279N9944J57671O7707j4493M2238
15225d697J00517J6741p2324j5556j21368l2033j6052R577J20943J03178m5998
15214D2928q6020j01247J40262r5253k96789J20530J21967k1812k0078J5556L398
15203a76558m2151J10078K8044J8569N6254j14380j1818P3494r9090q5593R5082
$$ plain form
15282 -254000 -165527 -99740 -41619 -40352 -58329 -53061 51146 84657 44837 107927 101301 21194
15270 21194 39157 66656 -51251 -57466 -141679 -178953 -178869 -87648 -90908 -151286 -87684 86586
15258 86586 48125 -76348 -42229 86119 154438 125618 243092 166322 116066 79073 124913
15247 124913 109796 46971 103111 17372 31244 211907 105398 -107289 -51389 51488 -3534
15236 -3534 -142127 -73662 -36206 -22548 -145485 -317764 -257820 -100149 -32442 -46935 -4697
15225 -4697 95820 112561 40237 24681 -96687 -128720 -144772 -135195 -14252 88926 42928
15214 42928 -43092 -144339 -4077 -99330 -396119 -275589 -153622 -175434 -195512 -179956 -176558
15203 -176558 -218709 -108631 -80587 -62018 -5764 -120144 -131962 -58468 -157558 -243151 -148069
15192a48069N5607j06540j7501L1726Q3394J17965N9087j2221j2883m5232J51
15181E484N0526p0833K7504M1087M6635N2097m9555j5201J4889J7758O8420o1182
15169A27629j03531K5001L1612Q5716J0078j8431R829O5038J05261j99317j63389
15158b4504R3635l6112m1309l1059k5252q9850m1531R6016K13735K9168m4277
15147I8660j05374j03989N7259j71n6662o9827J2965M599J61629J50262J6159
15136A65510r9419p6522N684q9420o5596J10635m1957r5590J0088l7244Q7514
15125a26317J58494l9801j7326j0055j2509J88421m5403l2358p7727K4048P5435
15114H4902Q7967l1539j08507p9372n2506j203j71275l867N2189P7364l2211n3665
$$ plain form
15192 -148069 -92462 -199002 -216503 -184777 -101383 16582 75669 63448 50565 5333 5484
15181 5484 56010 -14823 12681 53768 100403 152500 102945 87744 102633 120391 188811 127629
15169 127629 24098 49099 80711 166427 176505 158074 167903 232941 338202 138885 -24504
15158 -24504 69131 33019 -8290 -39349 -64601 -154451 -195982 -99966 113769 142937 98660
15147 98660 -6714 -110703 -53444 -53615 -110277 -180104 -167139 -162540 -911 149351 165510
15136 165510 66091 -10431 -4747 -94167 -159763 -49128 -91085 -186675 -176587 -213831 -126317
15125 -126317 32177 -7624 -24950 -35005 -47514 140907 95504 63146 -14581 9467 84902
15114 84902 172869 141330 32823 -46549 -99055 -100258 -271533 -275400 -223211 -145847 -178058 -231723
15102b31723J3958r30L7774j4347J63752J73652n515j67177l8442J5359k9659
15091h3298q4552j39341O2266J57301P8655P0312L8829J385J298j7004r7524o6973
15079g8646r1226p5217J54943R5257L6559n0381j10250l9239j29915J50983M5919
15068i1213q9713J03206K63436N3887j05102j49013k19421l2700N8331K8034m1401
15057b21669Q4001k976J814n6368L5038R9041J13629K2611r5513K9918Q6017n5197
15045D0346O5276J62743K5376p6107j34508K0863O5553p664l805m5321l4465K364
15033H0651o7439j28195L0279R0238r4317m6665j3446M3507J9907j4244m1198
15022a40922n818m1149R782O10L8253k3711K670J12391n5522o9334o9344j01153
$$ plain form
15102 -231723 -217765 -218695 -180921 -195268 -31516 142136 136621 -30556 -68998 -53639 -83298
15091 -83298 -167850 -307191 -244925 -87624 -8969 61343 100172 101557 102855 85851 -11673 -78646
15079 -78646 -169872 -245089 -90146 5111 41670 -8711 -118961 -158200 -288115 -137132 -91213
15068 -91213 -180926 -77720 185716 239603 134501 -14512 -233933 -266633 -208302 -180268 -221669
15057 -221669 -137668 -140644 -138830 -195198 -160160 -61119 52510 75121 -20392 9526 95543 40346
15045 40346 105622 268365 293741 217634 83126 103989 169542 161878 158073 112752 78287 80651
15033 80651 13212 -114983 -84704 5534 -88783 -135448 -148894 -105387 -85480 -99724 -140922
15022 -140922 -146740 -187889 -178107 -177497 -139244 -162955 -160285 -47894 -103416 -172750 -242094 -343247
15010c43247j9764N8941M2224J48060K9534p8292j3938M9646Q2855M5578L9711
14999D1308j4022J9830j59825n7450l8560k8441N7309R4635Q1466L438R1944J7896
14987A09528j96024j37379O2752M3362J7482p4931K2495J32023K140j53045K5289
14976a46308Q991o0042Q556J2893J6883J08551O2646j15592L5603J79312l2504
14965G8989n3393j69799q6091J56326J79089N5300j12700j05525m6750J36008
14955C1454J2033n9759q846q4837k439J14560J94016j4687n4098k4999J2293m4800
14943F9891j17862P480N9384M2151K0582R167k3810r9327m7140J39581O474k8598
14931C7973m1602j88681m3531Q8508J52738j5299n072L6164P4223P4652q2307
$$ plain form
15010 -343247 -363011 -304070 -261846 -113786 -84252 -162544 -176482 -126836 -43981 1597 41308
14999 41308 27286 47116 -112709 -170159 -208719 -237160 -179851 -85216 -3750 -312 91632 109528
14987 109528 -86496 -223875 -161123 -117761 -100279 -175210 -152715 -20692 -18552 -171597 -146308
14976 -146308 -137317 -197359 -188803 -175910 -159027 -50476 12170 -103422 -67819 111493 78989
14965 78989 25596 -144203 -230294 -73968 105121 160421 47721 -57804 -104554 31454
14955 31454 43487 -16272 -25118 -109955 -112394 2166 196182 181495 127397 102398 114691 69891
14943 69891 -47971 -40491 18893 61044 81626 90793 66983 -32344 -79484 60097 66571 37973
14931 37973 -3629 -192310 -235841 -147333 5405 -9894 -14966 21198 95421 170073 87766
14920H7766M7118J04877j8088R982R51k0185m1006p7237L3523j3253J2110j44933
14908a8375j01093P5002k7167n7509O529O3404N0933P4992P4082l793j98684j19398
14896a81077R9886M8384L0621q051J3344j63142r335l6531R1148p967J8477K2227
14884h2016K3632o397l6125M4830K4990j36148j5932M2295J1984l850O3863n717
14872g4591j07232l1559K2692o9498L8680K1184L9311K04453N3863p9579J6252
14861C3976j3653n3776j372p4525J843n1235P070k6178l7846N7733J27150R8643
14849F7830L9497l8285m8996j25713L0797K4551j1934p4653M7886J57071n3977
14838A4074j3684J2273J53712P565k09554l9284Q819R3464J53660N2496j01519
$$ plain form
14920 87766 134884 239761 221673 231655 232606 212421 171415 94178 127701 114448 126558 -18375
14908 -18375 -119468 -44466 -71633 -129142 -122613 -59209 -8276 66716 140798 137005 -61679 -181077
14896 -181077 -81191 -32807 -2186 -10237 3107 -160035 -169370 -205901 -114753 -122720 -104243 -82016
14884 -82016 -58384 -64781 -100906 -56076 -31086 -167234 -183166 -140871 -128887 -132737 -68874 -74591
14872 -74591 -181823 -213382 -190690 -260188 -221508 -200324 -161013 43440 97303 17724 33976
14861 33976 20323 -33453 -34825 -109350 -107507 -158742 -151672 -177850 -215696 -157963 -30813 67830
14849 67830 107327 69042 20046 -105667 -74870 -50319 -62253 -136906 -89020 68051 14074
14838 14074 390 12663 166375 173940 -35614 -74898 -66079 27385 181045 233541 132022
14827A32022m5376l1726M8925q2441O2499k0175J0035j18264j35135l099J6452
14816a66283Q3142O1297J0086o7186m1620R8019K6723j40506J8762l3611K4471
14805a26706P6759j25013k9375O1677O3947m311R4847P3161J1831k992o7759m9752
14793b3686M8581p9495r6916j5315J31299P4851j74264l1552j0223j23689J17409
14782a83000N0456N5746R7967J21573q2813n5956N635q940r7560o1910O4977N9921
14770c3904N3501n5595m6780j02761K3886k7302j9809J91401O1584K7195m5752
14759B5664j00269l0452R9142L5647p9452n7249J51354o2108n2218l1214J06447
14748E292J28313J1361k6578N159M9988n3599K9585R6104j40594l3522j988q3906
$$ plain form
14827 132022 86646 54920 103845 21404 83903 63728 73763 -44501 -179636 -182735 -166283
14816 -166283 -83141 -21844 -11758 -78944 -120564 -22545 4178 -136328 -117566 -151177 -126706
14805 -126706 -49947 -174960 -204335 -142658 -78711 -83022 11825 84986 96817 93825 26066 -23686
14793 -23686 24895 -54600 -151516 -166831 -35532 39319 -134945 -166497 -176720 -300409 -183000
14782 -183000 -132544 -76798 21169 142742 59929 3973 9608 668 -96892 -158802 -93825 -33904
14770 -33904 19597 -35998 -82778 -185539 -161653 -188955 -208764 -17363 44221 71416 25664
14759 25664 -74605 -105057 -5915 29732 -49720 -106969 44385 -17723 -69941 -101155 5292
14748 5292 133605 144966 118388 123547 173535 119936 149521 245625 105031 71509 69521 -14385
14736a4385q1264O2582M6444r5766r0657K3110P2429J10512o4414m2347n8905
14725a32661L3510M0900L372J3595J26757m0250n8651q1666n5412L0123Q386q4991
14713a96988r7671k5809J15684J41304n2314Q6845R2124j76011K5061M3825Q21
14702d3129J8181P0976L5556j4530n6684l8926j9744p6473O6378R621L1619J09082
14690I1927J6559q0441o2836o164K7794n180J653p57O8236M954j29287L677q750
14677g8615k9360K7867K4397P3514j222p2083R054m912m7101m62O7281o3759m1041
14664a36442J0445J0214Q1026J654r5664p0334M4109J546j2097K6325N8791k4650
14652a05077K5323L1337M8418N4280m5964o4530O1122n0022J21636k248j18133
$$ plain form
14736 -14385 -95649 -33067 13377 -82389 -173046 -149936 -77507 33005 -31409 -73756 -132661
14725 -132661 -99151 -58251 -54879 -41284 85473 45223 -13428 -95094 -150506 -120383 -111997 -196988
14713 -196988 -294659 -320468 -204784 -63480 -115794 -28949 63175 -112836 -87775 -43950 -43129
14702 -43129 -24948 46028 81584 67054 10370 -28556 -48300 -124773 -58395 -48774 -17155 91927
14690 91927 108486 28045 -34791 -40955 -13161 -18341 -16688 -17445 50791 55745 -73542 -69865 -78615
14677 -78615 -107975 -80108 -55711 17803 16581 -55502 -46448 -51360 -98461 -98923 -31642 -95401 -136442
14664 -136442 -125997 -115783 -34757 -33103 -128767 -199101 -154992 -153446 -165543 -139218 -80427 -105077
14652 -105077 -79754 -48417 1 54281 8317 -56213 4909 -45113 76523 74275 -43858
14641d3858k5216k7864Q654M5516M029J42162o536n112n9395k1744K79l1133l9567
14628e9785j07624N898l2179P1311J71796l4172j02242j11333M7198O7033L5852
14617d8247K7314J18066N1059q8358k910p9611o9010M8412J02037l7760k8389
14606g397q5817p3551q049K06122R132P9174q763m9209J982P1799M7756r4396
14594H8783j2763j3793j45494J5973J25680N6721R908N1688j0924M9702j19547
14583I5934j42525P2343j07685M5668M7030M9467k5238j19482R4702J59547q3952
14572H5809j12790j3468K656m2778R3100M3802r3804J1955r676k8182Q3430L3486
14560E3540K3872n985p9240k2271q297J7195L7526p7901O8123J51722J9168J8344
$$ plain form
14641 -43858 -69074 -96938 -88284 -42768 -38739 103423 96887 91775 32380 10636 10915 -20218 -59785
14628 -59785 -167409 -161511 -193690 -122379 49417 15245 -86997 -198330 -151132 -84099 -48247
14617 -48247 -20933 97133 148192 59834 56924 -22687 -91697 -43285 58752 20992 -7397
14606 -7397 -93214 -166765 -174814 31308 40440 119614 110851 61642 63624 135423 183179 88783
14594 88783 76020 62227 -83267 -67294 58386 115107 125015 176703 165779 215481 95934
14583 95934 -46591 25752 -81933 -36265 10765 60232 34994 -84488 10214 169761 85809
14572 85809 -26981 -40449 -37793 -80571 12529 56331 -37473 -25518 -35194 -63376 20054 53540
14560 53540 77412 71427 -7813 -30084 -38381 -21186 16340 -61561 6562 158284 177452 195796
14548A95796M72j75934j28456J2513M1574K1217j5606r7813o347j1624n9088J11174
14536a12122O6965L4986k9711J38329R2033j5665j85156j6531O592K2319J9111
14525B1150O4697l268l7387o2015J00331n5552J11789R0957m7894j24180k04607
14514a45979j2069J18272J40947j0216M7808j1607j37544j13415J17457j6402
14504b2748L7550N4424p2025O5951Q6624k9291q3993n48m4361o4973J18809O8336
14492A13755k9457q4770k9650L3117l0047n511M9083l4953j31024M7005J42812
14481D0360L5187j19932q8218J6260J44737O3153m5864J5350k7596J37592Q0136
14470B51165m1806m4179j29454m9017J12005M9774r8179j68534Q8710J09169K2116
$$ plain form
14548 195796 196268 20334 -108122 -95609 -54035 -32818 -48424 -146237 -152584 -164208 -223296 -112122
14536 -112122 -45157 -10171 -39882 98447 190480 174815 -10341 -26872 -20280 2039 21150
14525 21150 85847 82579 45192 -16823 83508 27956 139745 230702 182808 58628 -145979
14514 -145979 -158048 -39776 101171 90955 138763 127156 -10388 -123803 -6346 -22748
14504 -22748 14802 69226 -2799 63152 149776 120485 36492 35944 -8417 -73390 45419 113755
14492 113755 84298 -472 -30122 2995 -27052 -32563 16520 -18433 -149457 -102452 40360
14481 40360 75547 -44385 -132603 -116343 28394 91547 45683 61033 33437 171029 251165
14470 251165 209359 165180 35726 -13291 98714 148488 50309 -118225 -29515 79654 101770
14459A01770l031K642N4663r4799k8241J20139p2464n5919K8735m613K0970j529
14447F8323k7708n1543J1353m3247n997L0385J26569P42j78815j60724Q5834R4262
14435e0566J54086j2701L6995k11712L6958R8627j3732q9500m1718j0107J10137
14424F767o158N8953O1402J40995n2233m6488l5718r417J10302J02936j43421
14413A87920j09474p8726j65228j6349Q4003j00424J26562L7312L8533L6556j00489
14402e9804l7315O0755Q5903J9873p1881J943J14230J57495k2704j17426j03009
14391B8060n1862k4256O7499M1027M0534j00091r7950M2533k3988j8357l3336
14380a30187k9225j1022J1470j6018l0783M2828l0754l3981J04158J38215q0590
$$ plain form
14459 101770 98739 101381 156044 61245 33004 153143 80679 24760 53495 48882 69852 68323
14447 68323 40615 -10928 425 -42822 -48819 -18434 108135 108877 -69938 -230662 -144828 -50566
14435 -50566 103520 90819 127814 -83898 -46940 51687 37955 -51545 -93263 -103370 6767
14424 6767 609 59562 120964 261959 209726 163238 127520 118103 228405 331341 187920
14413 187920 78446 -280 -165508 -181857 -97854 -198278 -71716 -34404 4129 40685 -59804
14402 -59804 -97119 -36364 49539 69412 -2469 -526 113704 271199 248495 131069 28060
14391 28060 -23802 -48058 19441 60468 101002 911 -97039 -54506 -78494 -96851 -130187
14380 -130187 -159412 -170434 -158964 -174982 -205765 -162937 -193691 -227672 -123514 14701 -65889
14369f5889n3011J05408J09481l060j05176j27506K9561j14627l1245J46647Q6723
14358b2694K5361p9063j35552m329P8833M1471J5025J9894J81133Q7276j73765
14347C3590O8805o3277P9392J5448q3733Q4755N2612m1811j68647j37875M2406
14336a18335n3382k1593M5429o4452Q085K1790n531q3055m03Q8613Q5995M6396
14324e0443Q6613o4336j99247q064R8391J71901O1081r7297Q602l5654j1243j31178
14312a70874P7886M8188P544r3107q8408Q2243J7234J26416L8657j15011P9670
14301A0438Q2249J7407L7604n3737j5373L3602J1m5352j85311m0777J00934M9567
14289h738J31274j4420j84298J8692r628N1364O2850r3713p9808J05267M3606
$$ plain form
14369 -65889 -118900 -13492 95989 92929 -12247 -139753 -110192 -224819 -256064 -109417 -22694
14358 -22694 2667 -76396 -211948 -216277 -137444 -95973 -80948 -61054 120079 207355 33590
14347 33590 102395 39118 118510 133958 50225 134980 187592 145781 -22866 -160741 -118335
14336 -118335 -171717 -193310 -147881 -212333 -204248 -182458 -187989 -271044 -271447 -182834 -96839 -50443
14324 -50443 36170 -28166 -227413 -235477 -137086 34815 95896 -1401 7201 -28453 -39696 -170874
14312 -170874 -92988 -44800 -37256 -130363 -218771 -136528 -119294 7122 45779 -69232 10438
14301 10438 92687 110094 147698 93961 78588 112190 112201 66849 -118462 -159239 -58305 -8738
14289 -8738 122536 108116 -76182 -57490 -67118 -15754 47096 -46617 -126425 -21158 22448
14278B2448Q1397J0921r4749n7862n518n1318m9948k0216o5730m3940o5334k8954
14266c68803J92401J38815L4962L6453r9308l7295j11308P2130J30666J6204r8412
14255i3495R1623J9277K2295k6169K1886Q3758j3528M770l7531o3854P9903N5773
14243A44708p5498j18147P354k0027m9667K2366N8997m197R7573J07084l4722
14232A35824k302l8810p8657K4263P2770L421r1579k244P940m1700j57204r2882
14220b61160J10040K26814k5072m9097p5950j5615N5766P4018j1226J20636J34456
14209B83610q7060o0011R17n3025m2849M5358J7531K6963n1455n0508L4270m5994
14197A7747j24004j2054N3534J2822n0637N9912j9654O6552j4095J09703o0494
$$ plain form
14278 22448 103845 114766 20017 -37845 -43363 -94681 -144629 -164845 -230575 -274515 -339849 -368803
14266 -368803 -176402 -37587 -2625 33828 -65480 -102775 -214083 -141953 -11287 4917 -93495
14255 -93495 -1872 17405 39700 13531 35417 119175 105647 110417 72886 9032 88935 144708
14243 144708 69210 -48937 -41583 -61610 -111277 -88911 -29914 -34111 63462 170546 135824
14232 135824 133522 94712 16055 40318 113088 116509 24930 22686 30626 -11074 -168278 -261160
14220 -261160 -151120 75694 50622 1525 -74425 -90040 -34274 39744 28518 149154 283610
14209 283610 196550 136539 137456 84431 41582 86940 104471 131434 79979 29471 63741 17747
14197 17747 -106257 -118311 -64777 -51955 -102592 -42680 -62334 4218 -9877 99826 39332
14186C9332j96730p8941R5345K58248R8790q6707j0960J04913J5954o5088o7541
14175A06615q1679J1623l3958J07818j61555r6569J30911R9457J786N2344J31694
14164B68487j00137j02611J5272Q0122r7792M8480m7691j64076j16723k1197J0522
14153b27344P0398J6581O8962J31619n4393q272K634K779l5912j13273O0979J4199
14141g1043l242O6474P8740Q6110j31438j60160q5745M2172Q4292L2484R5057
14130C3701r7817n8751N099Q2662P4215L0323R0829Q2531M3826p2608O9512j37049
14118A46473q5579Q149l9286m966k6833j01963O1313J14509j05522N4546n892
14107A4949N1969N0355j21430j60250l199R3955K0365J52934N7767j92730p1068
$$ plain form
14186 39332 -157398 -236339 -140994 117254 216044 129337 118377 223290 239244 174156 106615
14175 106615 24936 36559 2601 110419 -51136 -147705 -16794 82663 84449 136793 268487
14164 268487 168350 65739 81011 161133 63341 111821 64130 -99946 -216669 -237866 -227344
14153 -227344 -156946 -140365 -71403 60216 5823 -2449 185 2964 -32948 -146221 -85242 -71043
14141 -71043 -74285 -7811 70929 157039 25601 -134559 -220304 -178132 -93840 -61356 33701
14130 33701 -64116 -122867 -117768 -35106 39109 69432 160261 242792 286618 214010 283522 146473
14118 146473 60894 69043 29757 24791 -2042 -104005 -42692 71817 -33705 20841 14949
14107 14949 66918 117273 -4157 -164407 -167606 -73651 -53286 99648 157415 -35315 -106383
14096a06383p5698j2844O2710L5725P5398M4592M6027K1598Q786l8457o2926M7758
14084D6286R1472N7354j62452j16826j50409n0691Q4573P9840N8529J29219Q6543
14073A53438K4705l1287P633j25400r8667Q5594R7572n9803P2008k7249k12722
14062a14178m0340N4454j3601J50642P8964o9770j6354J4900K5326o1958m2375
14051c4290K2671J03474K9149q1648M4252O4401n5255j38996O044L8363N0824
14040D8989R7769k0617n7089M353n7525j00609L808R4006M6549m266J5394o5691
14028E071q2640J8119Q2055L8034q9776p1770J23748q8271o028N0366P3497K6817
14016G9222L2763j18628j3508j2701n1457R0339R5891J6808n3350o3478K2544
$$ plain form
14096 -106383 -182081 -194925 -132215 -96490 -21092 23500 69527 91125 99911 61454 -1472 46286
14084 46286 137758 195112 32660 -84166 -234575 -285266 -200693 -120853 -62324 66895 153438
14073 153438 178143 146856 154489 29089 -69578 16016 113588 53785 125793 98544 -114178
14062 -114178 -154518 -100064 -113665 36977 115941 46171 29817 44717 70043 8085 -34290
14051 -34290 -11619 91855 121004 39356 83608 148009 92754 -46242 -40198 -1835 48989
14040 48989 146758 126141 69052 73405 15880 -84729 -80921 13085 59634 55368 70762 5071
14028 5071 -77569 -59450 22605 60639 -29137 -100907 22841 -65430 -71458 -21092 52405 79222
14016 79222 111985 -6643 -20151 -32852 -84309 6030 101921 118729 65379 1901 24445
14005B4445K8145k899j0188J3220M4269P5248p1808N489O5212J3934r9611o6726
13993A8730P3847n5320P3644J5976r3543p0946M4610K7363Q7259L2531M8393l5025
13981A67519m560l5260L7367J18197k8384n1487p9533L1728q9747M4099l7012
13970G2927M58R4275M342m1054m397n0627M4509R0724M8148p2449l579j36051
13958D7226J9443O2746j1774m9145o9988R391N0256k5352M7610K7416p2097J137
13946C6869K5680O2358q4126J658M3046J2781q1838Q8997J12918j7895q7201K1472
13934A34719J806J9532k1664k6090j02880j0948P6300O5895J7320K4704M6632
13923B25326r4738k8996M1663j5400m5694K7153P2613J0896l1519q0910m3349
$$ plain form
14005 24445 52590 49691 39503 52723 96992 172240 100432 105921 171133 185067 85456 18730
13993 18730 92577 37257 110901 126877 33334 -37612 6998 34361 121620 154151 202544 167519
13981 167519 162959 127699 165066 283263 254879 203392 123859 155587 65840 109939 72927
13970 72927 73385 167660 172002 130948 126551 75924 120433 211157 259305 186856 183277 47226
13958 47226 66669 129415 117641 68496 -1492 7899 58155 32803 80413 107829 35732 36869
13946 36869 62549 124907 40781 42439 85485 98266 16428 105425 218343 200448 113247 134719
13934 134719 136525 156057 134393 108303 5423 -5525 70775 136670 153990 178694 225326
13923 225326 130588 101592 143255 127855 82161 109314 181927 192823 161304 80394 37045
13912C7045o1479J3640R3495M5187K6464k8605j8087O2889J15470o6331r149K68
13900B10807j31632L417N2899J34142j65555q7977K0323J04516n8746J4708p1607
13889B5295k9161Q9853J14577R1228m6583n9052n3468p6882K5227P5569P5414
13878B32017R4229O5999q1421K8232k6563J8814o2624j39873m3578q7511P2253
13867F9974N3257K2757m2658n875J7232Q839M3800k3136p8764n4367l163J0183
13855A8079m8725L0074J63342j41421n4595N6324J37650j286j5279K0440M1560
13844B06163J2972J388j6840M0030K6024n098p6983L5257M9725J0857j542p1214
13832B10739L1906P7259p8776o7691r720J2765k112m8891J06899r431j76026q7864
$$ plain form
13912 37045 -24434 -10794 82701 127888 154352 125747 107660 170549 286019 219688 210539 210807
13900 210807 79175 82592 135491 269633 104078 16101 36424 140940 82194 96902 25295
13889 25295 -3866 85987 200564 291792 245209 186157 132689 55807 81034 156603 232017
13878 232017 326246 392245 310824 339056 312493 331307 268683 128810 85232 -2279 69974
13867 69974 123231 145988 103330 97455 114687 123526 167326 144190 65426 11059 7896 18079
13855 18079 -30646 -572 162770 21349 -33246 23078 160728 159442 144163 164603 206163
13844 206163 219135 220523 203683 243713 269737 264639 187656 222913 272638 283495 281953 210739
13832 210739 242645 319904 241128 173437 163717 176482 174370 125479 232378 222947 46921 -40943
13820d0943J15669M6039J8912J2098k553k0887N2466L7966l1883M8614l9640N4407
13808B50265N6409o8352n9996M3249Q1939k8868O3134j32735j06907l403P8064
13797A72799K9274l4839n1958J6851l6774k4347P4660m7169P7594M9466L0075
13786B55632J2595L8059N9985k8390Q530l3987K7025k3424L192o3917p9906n7049
13774A18345O6247J06935M5444p8357j22495j7841O650k3298J10221J25160k5196
13763C11815p970Q662m0766q3421j18512p3452Q6455R4014j05045j0277K7531
13752H9034J33123j1162Q5860J13164m6003j51662k4009L3788j05936n0726j1715
13741E3756k6190L3998J39293J12690q2670N924j3386R1298m5727n2696L3481
$$ plain form
13820 -40943 74726 120765 139677 151775 149222 128335 180801 218767 186884 235498 195858 250265
13808 250265 306674 238322 178326 221575 303514 274646 337780 205045 98138 94735 172799
13797 172799 202073 167234 115276 132127 95353 71006 145666 98497 176091 225557 255632
13786 255632 268227 306286 366271 337881 346411 312424 339449 316025 319217 255300 175394 118345
13774 118345 184592 291527 336971 258614 136119 118278 124928 101630 211851 337011 311815
13763 311815 303845 312507 271741 188320 69808 -3644 82811 176825 71780 61503 89034
13752 89034 222157 210995 296855 410019 364016 212354 188345 222133 116197 65471 53756
13741 53756 27566 61564 200857 313547 230877 236801 223415 314713 268986 216290 249771
13730B49771K9947l9622q6879l2963N5115m941O8341O1397O6744j3723q4039o3076
13718B06072N3331O4998q2703o1301o339p8045L4764R6728L9615J1763o5446p869
13706B05568N6079K6844q6488n0060j00288j05611K7447Q6037J36171J27357j2405
13695C10651N6771L867j3049j11321n3960P6887P4049o35n1542m5043J8210M7363
13683C12248J23075m6920j09013l4475k7805j50215j8284N1574p1401n3222J21382
13672I6944J66459m8165O5519n547J3262p7871m9638L9203Q6186j315J4587N3102
13660C52726R357n3337N8012J87362p1219j44088N2966Q952K1416l3004l8259
13649C50884n1474L0068P0193J2047j43966p475P350O6049P8186M7298k8673j1949
$$ plain form
13730 249771 279718 240096 153217 120254 175369 170428 238769 300166 366910 353187 269148 206072
13718 206072 259403 324401 241698 180397 174058 96013 130777 227505 267120 278883 213437 205568
13706 205568 261647 288491 202003 151943 51655 -53956 -26509 59528 195699 323056 310651
13695 310651 367422 371289 358240 246919 192959 269846 343895 343260 291718 246675 264885 312248
13683 312248 435323 388403 279390 244915 217110 66895 48611 100185 28784 -24438 96944
13672 96944 263403 215238 280757 275210 288472 210601 160963 200166 286352 285037 299624 352726
13660 352726 362083 308746 366758 554120 482901 338813 391779 400731 422147 389143 350884
13649 350884 299410 329478 399671 411718 267752 260277 267627 333676 411862 459160 430487 418538
13637D18538J5796N9762L3110r5252j34793j2764p6922j7421L9094j5906P8223
13626B91465J32553k1169l7052L2454j0222m0355p5285N6143n2399n9134R6395
13615C13394Q427l2630j23092J2177J46352J42572J1055O4203k9469j42153j73374
13604A97462j4206J13502J74027J52096J5354j15883J6872n4230j38857j10748
13594B35389K5534R2038k462j15881R9464N9815J6635N6012J08399l4577l2997
13583E07369O3892n0025n5596p9055N6137J7074J1557J00232L4218j45304o3034
13572C97465J37920J6766n1914j4783j4003Q4149n578N0123P4599j26356j77307
13561C71081K2756L596p1744n3802J09319J31656l9706j6754j14234P5818N2369
$$ plain form
13637 418538 434334 494096 527206 431954 297161 284397 207475 190054 229148 213242 291465
13626 291465 424018 402849 365797 398251 388029 347674 272389 328532 276133 216999 313394
13615 313394 321821 289191 166099 178276 324628 467200 478255 542458 512989 370836 197462
13604 197462 183256 296758 470785 622881 638235 522352 539224 484994 346137 235389
13594 235389 260923 352961 350499 234618 334082 393897 410532 466544 574943 540366 507369
13583 507369 571261 521236 465640 386585 442722 459796 471353 571585 605803 460499 397465
13572 397465 535385 552151 500237 485454 471451 555600 550022 600145 674744 548388 371081
13561 371081 393837 397433 325689 271887 381206 512862 473156 456402 342168 417986 470355
13550D70355k4652J49515l024j7252l7128o7819n8036M856P9458Q0390R6888m6807
13538F26744p2674R850r4690J4687Q8687r8681q2076r363k1613Q3615M6946R4456
13526E85888P3038J1958k8296m4837l190R0853n0365j41532J12616K25384J0987
13515H42504j11067j16581p9918R7540k6861P0673R4939M3298r6093o4143J7475
13504F71766L1386M6782j18038n5535O6284R7925j07849q6509l3845R0379L9058
13493F41804m2964j0359M9434M001R1359m1200j41537l3659O2872P4372j10308
13482E43815o1732j12234M1197K30080r711o0175M9728P885m4346l8604K9098
13471E75001m9429o8523M4212N1995O5903j6590K0343Q035j34413M1749J15470
$$ plain form
13550 470355 445703 595218 592194 574942 537814 469995 411959 416815 496273 576663 673551 626744
13538 626744 554070 563920 469230 483917 572604 473923 391847 382484 360871 444486 491432 585888
13526 585888 658926 670884 642588 597751 594561 685414 635049 493517 606133 831517 842504
13515 842504 731437 614856 534938 632478 605617 676290 771229 814527 718434 654291 671766
13504 671766 703152 749934 631896 576361 642645 740570 632721 546212 512367 602746 641804
13493 641804 598840 588481 637915 641916 733275 692075 550538 516879 579751 654123 543815
13482 543815 482083 369849 411046 641126 631415 571240 620968 628853 584507 545903 575001
13471 575001 525572 457049 501261 553256 619159 602569 622912 630947 496534 538283 653753
13460F53753m9444J13204J3211o1089M0387O9447J1923Q4513k9801n9420q7376
13449F99308O9884N1273M5149r9522q8092O562O6538N8805J6771o2960j08489
13438F55227l4240L0283L1804j13149K7315Q8477P5259K0327K3736P8056O7209
13427I50304p8166j09325j10272p1558M9572J38117l3327j6526n3685r629O5732
13416G21237R1738l3808K0392N2303j3563j12594J11949J23068m386J0280j89115
13405G77501n2423R7669M1151q2187J18381O7389k5659j12733j04544p3230K020
13394F53335M7017J5627J56520N1441K5748p8330j2674J16413Q3994m4164L6554
13383A051481m669n2136K7344o6228j12871K1125M1317n9367K6105j6471P9817
$$ plain form
13460 653753 604309 717513 730724 669635 710022 779469 791392 875905 846104 786684 699308
13449 699308 769192 820465 865614 766092 678000 684562 751100 809905 826676 763716 655227
13438 655227 620987 651270 683074 569925 597240 685717 760976 781303 805039 883095 950304
13427 950304 872138 762813 652541 580983 630555 768672 735345 718819 665134 655505 721237
13416 721237 812975 779167 799559 851862 838299 725705 837654 960722 956336 966616 777501
13405 777501 725078 822747 863898 781711 900092 967481 941822 829089 724545 651315 653335
13394 653335 700352 715979 872499 923940 949688 871358 858684 975097 1059091 1014927 1051481
13383 1051481 1046812 994676 1022020 955792 842921 864046 905363 845996 872101 855630 935447
13372I35447m7577m406L4811J32415R5834j23329l824k6806L2663j10534M6993
13361I61687N3516j25372N680Q2388j9433j29405P142o9333o6029O4966o852l0248
13349G28707J24155J82866L4234l8749R207N2846j44867Q580J20703m636K7303
13338A100349j2332p6015J7729Q3203L5662k557J043N2250k0056o2133k2687j3381
13326A081075p0688q1076K5304l0219P668L5373K5313K6536P4267J51662N2345
13315A297560o042L0063j26875j46136l8876P3204K29993P8393j11941J739O9234
13304A350316k4330R2654q29j26477J0154k5864p8269l4106K298L3011J0902P8620
13292A288080M8919j34937k0061M7079q832j4109J496Q2161J64229L7357J837
$$ plain form
13372 935447 887870 883464 918275 1050690 1146524 1023195 1019371 992565 1025228 914694 961687
13361 961687 1015203 889831 895511 977899 958466 829061 836203 766870 700841 765807 758955 728707
13349 728707 852862 1035728 1069962 1031213 1040420 1093266 948399 956979 1077682 1073046 1100349
13338 1100349 1088017 1012002 1029731 1112934 1148596 1146039 1147082 1199332 1179276 1117143 1094456 1081075
13326 1081075 1010387 929311 954615 924396 932064 967437 992750 1019286 1093553 1245215 1297560
13315 1297560 1291518 1321581 1194706 1048570 1009694 1082898 1312891 1391284 1279343 1281082 1350316
13304 1350316 1325986 1418640 1417811 1291334 1301488 1275624 1197355 1163249 1165547 1198558 1209460 1288080
13292 1288080 1336999 1202062 1182001 1229080 1220248 1206139 1207635 1289796 1454025 1491382 1493219
13281A493219m6691n1468l1620j20294J01435K9587j2364Q075l6567J5976J1122
13270A360410n137Q0943j09540j2791J70090R7485Q93J9231j01856j48899m7440
13259A303389P774l1982R1297P8766m433j6094M5603K0449j6890R8800j11531
13248A465148k2996J46028n4366j44777k3922M7208O5577l2240J02065J23937
13238A671662R1900Q815n4978r5045n7457o0716L3008N4799J50815j1165N9378
13227A791016j0863n2124N988j9491Q2866P7194j90056k0872O5376P4713r1798
13216A711949n7122M8199J16579R0970l8755q0108N3827J27176L2865p8618P246
13205A934208L7482p490J68292R3738j22408j64072j2812K4030L74N9703l9884
$$ plain form
13281 1493219 1446528 1395060 1363440 1243146 1344581 1374168 1361804 1369879 1333312 1349288 1360410
13270 1360410 1355273 1436216 1326676 1313885 1483975 1581460 1582353 1601584 1499728 1350829 1303389
13259 1303389 1311163 1279181 1370478 1449244 1444811 1428717 1474320 1494769 1477879 1576679 1465148
13248 1465148 1442152 1588180 1533814 1389037 1365115 1412323 1477900 1445660 1547725 1671662
13238 1671662 1763562 1772377 1717399 1622354 1564897 1504181 1537189 1591988 1742803 1731638 1791016
13227 1791016 1780153 1728029 1734017 1714526 1797392 1874586 1684530 1663658 1729034 1803747 1711949
13216 1711949 1654827 1703026 1819605 1910575 1871820 1791712 1845539 1972715 2005580 1926962 1934208
13205 1934208 1971690 1964200 2132492 2226230 2103822 1939750 1926938 1950968 1951342 2011045 1971161
13194A971161P3768P3928n7054J35727j6129j20731j3577Q8488K7245j3041N5500
13183B205285J8278o6745l19P9515k9605R5261Q6196j8277l3789L8089Q6241J7599
13171B477729j74277j42114m6387j054M9804R7382O2506J85146K16446p2693Q416
13160B660904M1121j7365K7931l3996L1060J28792K0785r7315Q1637l7270j77646
13149B628638O7719p2844L7523J78062L2063j4480j18798n0295N6392p312n4197
13138B682471O73K6041N2471Q2148L9244J26886Q6947K3447L3837M4442J0424
13127C209031l6741K0306O131r8017j17405l0111K51691J20437J08322J77556
13117C611200Q7123R6891l5712m8085P0268l1409n4649k2963N8423J06020K0111
$$ plain form
13194 1971161 2044929 2118857 2061803 2197530 2181401 2060670 2047093 2135581 2162826 2149785 2205285
13183 2205285 2223563 2156818 2156499 2236014 2206409 2301670 2387866 2369589 2335800 2373889 2460130 2477729
13171 2477729 2303452 2161338 2114951 2113897 2163701 2261083 2323589 2508735 2725181 2652488 2660904
13160 2660904 2702025 2684660 2712591 2678595 2709655 2838447 2859232 2761917 2843554 2806284 2628638
13149 2628638 2696357 2623513 2661036 2839098 2871161 2856681 2737883 2687588 2743980 2736668 2682471
13138 2682471 2683144 2709185 2761656 2843804 2883048 3009934 3096881 3120328 3154165 3198607 3209031
13127 3209031 3172290 3192596 3198727 3100710 2983305 2953194 3204885 3325322 3433644 3611200
13117 3611200 3698323 3795214 3759502 3711417 3781685 3750276 3695627 3672664 3731087 3837107 3857218
13106C857218R2543p398p1765J72622J16347j2951q0733n4871j1902J621j33321
13095C867410O4273J39416J11658m9886P1174L0500l5094K9418j01692P695Q4606
13084D219478Q4818O7240j7746P7255K35792Q6725m3675l0558L965J14238J37832
13073D935364N4148M236l255M7125J0406l2062K09967L3165L0327R1280N82q2243
13061E299040J9603J07987O836j8590J51723K00231J2457j14536P0891J33484
13051E869126L5645j8130r823O6161R6532N5862m6671K0706J04652J56781J19646
13040F450487J04416K2395r2006N2030J93377L9985j4286M9470p17O7816J05911
13029F978878j1059J19338J08188O9118m2596R5641L8434Q8666J38026J13133
$$ plain form
13106 3857218 3949761 3942363 3870598 4043220 4159567 4146616 4065883 4011012 3999110 4000731 3867410
13095 3867410 3931683 4071099 4182757 4132871 4204045 4234545 4199451 4228869 4127177 4134872 4219478
13084 4219478 4304296 4371536 4353790 4431045 4666837 4753562 4709887 4679329 4683294 4797532 4935364
13073 4935364 4989512 4993748 4990493 5037618 5048024 5015962 5225929 5259094 5289421 5380701 5381283 5299040
13061 5299040 5318643 5426630 5433466 5414876 5566599 5766830 5779287 5664751 5735642 5869126
13051 5869126 5904771 5886641 5876818 5942979 6039511 6095373 6048702 6069408 6174060 6330841 6450487
13040 6450487 6554903 6577298 6485292 6537322 6730699 6770684 6756398 6805868 6805151 6872967 6978878
13029 6978878 6967819 7087157 7195345 7264463 7221867 7317508 7355942 7444608 7582634 7695767
13019G695767L8070J9022q596J17127M7840L4455K32329J60634J12701K34071
13009H683420J02709N8678N8241K21464J70486J06640N4524j2117Q0858K68775
12999I793678K42092K46312N696j9070J63343J22566J19395P2563R4260K79524
12989A1120359K03667J43845J54669J86197J26353J44368J88001K02309K21570
12980A2691338K05743J71827J71522K75464K74897J19573O9843J56708M28295
12971A4565210L02170J50240K86136K69573J56332J83404K29982J18472J33258
12962A6394777L87647M07403L42407K78461K02670J98774K98296K58659K35090
12953A9004184K47284L84232L80910L09752L42472M51379L01283K77890L42909
$$ plain form
13019 7695767 7733837 7752859 7744263 7861390 7909230 7943685 8176014 8336648 8449349 8683420
13009 8683420 8786129 8844807 8903048 9124512 9294998 9401638 9456162 9444045 9524903 9793678
12999 9793678 10035770 10282082 10287778 10268708 10432051 10554617 10674012 10746575 10840835 11120359
12989 11120359 11324026 11467871 11622540 11808737 11935090 12079458 12267459 12469768 12691338
12980 12691338 12897081 13068908 13240430 13515894 13790791 13910364 13980207 14136915 14565210
12971 14565210 14867380 15017620 15303756 15573329 15729661 15913065 16143047 16261519 16394777
12962 16394777 16782424 17189827 17532234 17810695 18013365 18212139 18510435 18769094 19004184
12953 19004184 19251468 19635700 20016610 20326362 20668834 21120213 21421496 21699386 22042295
12944B2042295L79021M29161N39869M08514K68344L28669M09065M33983L57232
12935B5596153N78570N79802N16965N32259M30381M18028M94817O12073O65931
12926C0424979N38469N79125P16079P12468N75834O72600P08431O65914Q00989
12917C6394888Q06847Q14040R14053J033245R35594Q57860R97256J016630R67930
12908D4738343J016468J266715J204157J166899J243926J332308J242393J469628
12900E4680837J502665J545666J610809J650186J682616J874956J844113J988937
12892F8380785K112043K125859K316438K246969K233093K445388K551946K747653
12884H7160174K888914K947265L049846L159551L363816L577093L771435M014793
$$ plain form
12944 22042295 22421316 22850477 23390346 23798860 24067204 24395873 24804938 25238921 25596153
12935 25596153 26174723 26754525 27271490 27803749 28234130 28652158 29146975 29759048 30424979
12926 30424979 30963448 31542573 32258652 32971120 33546954 34219554 34927985 35593899 36394888
12917 36394888 37201735 38015775 38929828 39963073 40898667 41756527 42753783 43770413 44738343
12908 44738343 45754811 47021526 48225683 49392582 50636508 51968816 53211209 54680837
12900 54680837 56183502 57729168 59339977 60990163 62672779 64547735 66391848 68380785
12892 68380785 70492828 72618687 74935125 77182094 79415187 81860575 84412521 87160174
12884 87160174 90049088 92996353 96046199 99205750 102569566 106146659 109918094 113932887
12876A13932887M065090M276607M483285M705718M947258N176030N348765N449283
12868A52384923N830550O060813O339208O711307O984108P311479P542265P980676
12860B07145329Q082652Q339735Q656460Q937684R216608R469686R719410R839375
12852B79406939R892444R979039R960633R782949R632240R489645R222535Q721000
12844C56087424Q334423P786542P110247O549814N558397M693567L891954K833390
12836D02845758J594689N86277m95847j451060k430198l371436m271858n058972
12828C87947353n799815o526131p135366p708882q190793q325266q487451q671812
12820C27101837q691988q737143q870732q809394q827545q646772q403781q273184
$$ plain form
12876 113932887 117997977 122274584 126757869 131463587 136410845 141586875 146935640 152384923
12868 152384923 158215473 164276286 170615494 177326801 184310909 191622388 199164653 207145329
12860 207145329 215227981 223567716 232224176 241161860 250378468 259848154 269567564 279406939
12852 279406939 289299383 299278422 309239055 319022004 328654244 338143889 347366424 356087424
12844 356087424 364421847 372208389 379318636 385868450 391426847 396120414 400012368 402845758
12836 402845758 404440447 405026724 404530877 403079817 400649619 397278183 393006325 387947353
12828 387947353 382147538 375621407 368486041 360777159 352586366 344261100 335773649 327101837
12820 327101837 318409849 309672706 300801974 291992580 283165035 274518263 266114482 257841298
12812B57841298q080722p912779p678313p442754p249951o905572o663886o584450
12804A99322871o370011o078047n825224n551471n319393n178481n049882m881041
12796A55069321m697217m382719m146239m215009m043062l857403l601977l561273
12788A22564422l473693l199854l175451l196794k930521k862060k822838k686012
12780I8217199k588763k396327k298771k336868k176000k069329k077116k079930
12772H0194095j923849j763550j843810j868037j818743j736046j565601j585391
12764F6089068j460701j459404j539440j436893j266598j298475j231362j222328
12756E5173867j250280j182355j086453r87369j047129j119493j029848r63732
$$ plain form
12812 257841298 249760576 241847797 234169484 226726730 219476779 212571207 205907321 199322871
12804 199322871 192952860 186874813 181049589 175498118 170178725 165000244 159950362 155069321
12796 155069321 150372104 145989385 141843146 137628137 133585075 129727672 126125695 122564422
12788 122564422 119090729 115890875 112715424 109518630 106588109 103726049 100903211 98217199
12780 98217199 95628436 93232109 90933338 88596470 86420470 84351141 82274025 80194095
12772 80194095 78270246 76506696 74662886 72794849 70976106 69240060 67674459 66089068
12764 66089068 64628367 63168963 61629523 60192630 58926032 57627557 56396195 55173867
12756 55173867 53923587 52741232 51654779 50667410 49620281 48500788 47470940 46507208
12748D6507208r85846r93921j024223r89213p26892o30777p28903q63773q38848
12739C8724812p17174p20098o53685o90768p00504p64599o58878o88327o85447
12730C2445332o13792m76581m50959o42546o21507o42277n54449n30653m87240
12721B7425328m64156n62066l97440l37236m40940m61815m43741l44736l51710
12712B3621488m49534l59519l27885m16089l04098k27632n02504m32365k83988
12703B0317874j95535l03471k16073m69172l70267k56969l00017j75002k08618
12694A7822750l44835k05904j50483j96515l18613r3177j12200m02250l87722
12685A5611051j80076j56973k20495j19098j24975j78086j58516l05402k66772
$$ plain form
12748 46507208 45521362 44527441 43503218 42514005 41787113 41156336 40427433 39563660 38724812
12739 38724812 38007638 37287540 36633855 35943087 35242583 34477984 33819106 33130779 32445332
12730 32445332 31831540 31354959 30904000 30261454 29639947 28997670 28443221 27912568 27425328
12721 27425328 26961172 26399106 26001666 25664430 25223490 24761675 24317934 23973198 23621488
12712 23621488 23171954 22812435 22484550 22068461 21764363 21536731 21034227 20601862 20317874
12703 20317874 20122339 19818868 19602795 19133623 18763356 18506387 18206370 18031368 17822750
12694 17822750 17477915 17272011 17121528 16925013 16606400 16513223 16401023 15998773 15611051
12685 15611051 15430975 15274002 15053507 14934409 14809434 14631348 14472832 14167430 13900658
12676A3900658o9884m6166j79035l10645j66575k7637p9771j12291q8328l2085
12666A2788241j90230k27497o9522j20698j47775k32331j86987j60440j19873
12657A1332888j06135p243j20827j26528r0501o6066j07318r7676j45938o3145
12647A0401511j57162l7038k1550j83283j14457k05049j64546l7770l7087r6010
12637I347559q8841r6632o4568n8092j55601j17034m1069j12754p850K6112n5506
12626H575724q016J47943J83455J50139j1534j05878n277r3014p6365k7078j25553
12615H604546k88146l21871k98605j97777j39093j22966j18895r0824j34420j33852
12605F758097O07k9367o8165p7515k6655P6915j08254o1563j52198j59986r7122
$$ plain form
12676 13900658 13830774 13784608 13605573 13294928 13128353 13100716 13020945 12908654 12820326 12788241
12666 12788241 12598011 12370514 12300992 12180294 12032519 11800188 11613201 11452761 11332888
12657 11332888 11226753 11219510 11098683 10972155 10881654 10815588 10708270 10610594 10464656 10401511
12647 10401511 10244349 10207311 10185761 10002478 9888021 9682972 9518426 9480656 9443569 9347559
12637 9347559 9258718 9162086 9097518 9039426 8883825 8766791 8725722 8612968 8605118 8631230 8575724
12626 8575724 8567708 8715651 8899106 9049245 9037711 8931833 8926556 8833542 8757177 8730099 8604546
12615 8604546 8316400 7994529 7695924 7498147 7359054 7236088 7117193 7026369 6891949 6758097
12605 6758097 6758704 6729337 6661172 6583657 6557002 6633917 6525663 6464100 6311902 6151916 6054794
12594F054794m1759J04975j7045r1885J6670O2587p256r3893k55346M4184Q7724
12583E863750j47123J9559P9597Q9606K66039J34682p0487l0258R4096l4085j83418
12572F081958J02500K2869l24872m49382j74081j87248r4699l1097J8261p5761
12562D888448j39211j27488J2195j7917l389j25837o1173P1737L2443L8148P40
12551D568696L0326p2279j14317j56633j7960J27681k234j14115j89229j27756
12541C932180j7969r633k7690j02311n0729m3605L6643J06752L8575j06135L0657
12530C786735J20605m8308O911k8184j3620J2270j51982j19889o4061k2809j7946
12519C459722K120M149n2340m8037J4360r6260J3990p5257N1791J6594o3609r6696
$$ plain form
12594 6054794 6013035 6118010 6100965 6009080 6025750 6088337 6081081 5987188 5731842 5776026 5863750
12583 5863750 5716627 5736186 5815783 5905389 6171428 6306110 6235623 6205365 6299461 6265376 6081958
12572 6081958 6184458 6207327 5882455 5433073 5258992 5071744 4977045 4945948 4964209 4888448
12562 4888448 4749237 4621749 4633944 4616027 4612638 4486801 4425628 4497365 4529808 4567956 4568696
12551 4568696 4599022 4526743 4412426 4255793 4237833 4365514 4363280 4249165 4059936 3932180
12541 3932180 3914211 3904578 3876888 3774577 3723848 3680243 3716886 3823638 3862213 3756078 3786735
12530 3786735 3907340 3859032 3865943 3837759 3824139 3836409 3684427 3564538 3500477 3477668 3459722
12519 3459722 3461842 3465991 3413651 3365614 3379974 3283714 3297704 3222447 3274238 3290832 3227223 3130527
12507C130527j70272L1292Q3200Q0484j5147K5249o0572n0776K7402m2261j9848
12496C019278o2823k9043o2678j05570r0458N868j9815j5739M7633k1571l4063
12485B631019R2194j3051k5914J1448p8593O57n1873n3829k5725O9162M1227j36965
12473B459757j49999J0862K66292J50056j14510k25507O728K6735k888M0519J2313
12462B480358L7687m2486q805q3624k34978n630J08093M2666M2867j38008k0409
12451B177731M0531o7687N4003J3545j67155m245P314p4861k4619K9866J78013
12440B162436j0770p2929j12195n8518L3963Q5309M8664r1953P945O6509k4871
12429B033590m1579M3651O8757K1897Q0867j05066j74805k7910q1350O565O9102
$$ plain form
12507 3130527 2960255 2991547 3074747 3155231 3140084 3165333 3104761 3053985 3081387 3039126 3019278
12496 3019278 2956455 2927412 2864734 2759164 2668706 2674574 2654759 2639020 2686653 2665082 2631019
12485 2631019 2723213 2710162 2684248 2695696 2617103 2617760 2565887 2512058 2486333 2555495 2596722 2459757
12473 2459757 2309758 2320620 2586912 2736968 2622458 2396951 2403679 2430414 2427526 2468045 2480358
12462 2480358 2518045 2475559 2466754 2383130 2148152 2142522 2250615 2293281 2336148 2198140 2177731
12451 2177731 2218262 2150575 2204578 2218123 2050968 2046723 2054037 1979176 1954557 1984423 2162436
12440 2162436 2151666 2078737 1966542 1908024 1941987 2027296 2075960 1984007 1991952 2058461 2033590
12429 2033590 1992011 2035662 2104419 2126316 2207183 2102117 1927312 1899402 1818052 1824617 1893719
12418A893719j6719P6506j39310k6744Q3075L5567k3090j53425R5914m3410j01644
12407A680439o7093L1257K5934J12637m0062n224N5950k1172l5348p6026l3891
12396A627401k371n3329j15515P4019N4064J01896j80759j8402J27070K6966L2462
12385A673502n5765j22519L8884O6454m8528j4995N8876J6518l3268m40N1905
12374A630624M8854J8561j41215j36062J16618M751r055K8545Q3023J8483m3197
12363A619930Q144q4847j66890o0909K3609J30670N491L3342Q4559p5387k9400
12352A488312j5006j25222M2150K6823o4426n4218O9677m5113q9521L4656q9830
12341A178282J1281J34389M0115o2185j56290N2039J1625m5035K0898K5706o8825
$$ plain form
12418 1893719 1877000 1953506 1814196 1787452 1870527 1906094 1883004 1729579 1825493 1782083 1680439
12407 1680439 1613346 1644603 1670537 1783174 1743112 1737888 1793838 1772666 1737318 1661292 1627401
12396 1627401 1625030 1571701 1456186 1530205 1584269 1686165 1505406 1487004 1614074 1641040 1673502
12385 1673502 1617737 1495218 1534102 1600556 1552028 1537033 1595909 1612427 1579159 1578719 1630624
12374 1630624 1679478 1698039 1556824 1420762 1537380 1542131 1533076 1561621 1644644 1663127 1619930
12363 1619930 1628074 1543227 1376337 1315428 1339037 1469707 1475198 1508540 1593099 1517712 1488312
12352 1488312 1473306 1348084 1390234 1417057 1352631 1298413 1368090 1322977 1233456 1268112 1178282
12341 1178282 1189563 1323952 1364067 1301882 1145592 1197631 1209256 1164221 1185119 1210825 1142000
12330A142000M6765Q4998o0867l5493N1549N8488J1196J4745m5263l267K2283
12319A287134J0423q2221j78998P1118J50896R7601l1309r4471j05367j21545
12309A003261l5550P0980P5786L6403p9852Q1613q542m3081p2323n1569q3366
12298H93760k9249P0811J19367r5111q3291J93122J31182j9021K7978k4112m6015
12287A139421Q962Q423j31988r0069J8909L4747l5118K0558N7647q880j26535
12276H96077j19354R2910o056o3958k4934J88377K6624n4836j072J26362J8133
12265A078273k6622j3077M4941o6117j33519j11224l70J36410o8248o9002J5187
12254G86632J09427J39368J4742o2586p1844j34760k4672N1262l5916l4294j7987
$$ plain form
12330 1142000 1188765 1273763 1212896 1177403 1228952 1287440 1298636 1313381 1268118 1264851 1287134
12319 1287134 1297557 1215336 1036338 1107456 1258352 1355953 1324644 1230173 1124806 1003261
12309 1003261 967711 1038691 1114477 1150880 1071028 1152641 1144099 1101018 1028695 977126 893760
12298 893760 864511 935322 1054689 959578 876287 1069409 1200591 1181570 1209548 1185436 1139421
12287 1139421 1148383 1156806 1024818 934749 953658 988405 953287 973845 1031492 1022612 896077
12276 896077 776723 869633 863577 799619 774685 963062 989686 934850 933778 1060140 1078273
12265 1078273 1051651 1038574 1083515 1017398 883879 772655 772285 908695 840447 771445 786632
12254 786632 896059 1035427 1050169 987583 915739 780979 756307 807569 771653 737359 719372
12243G19372n6022N7174J34935l7183J5557P4410j30458M6042N3992N2536o4672
12232H65683j79571k8555Q8830K3419P4648R7164o8287O372m1921j1770l7211
12221G88801p4312O1116L7183Q0824l1270r8650P482J01939p9168k5283P8016
12210H46678j2492K5204Q9333J2967O9227R377l9243j28914j8873N4792Q9520
12199I97576O908j71567j27172n3811J08497L7173O0255j4514J3068o0177j68342
12188F27894l3822N1673R1197J63850R3099m328j04319j09508o0621j9530n1675
12177F43910L819N9276M5437Q898j45188r6549J28652N6746j6025J3673R6493
12166G99142q1322l344N968l1672M826q0219j42023L9395j126J09978Q9715Q8455
$$ plain form
12243 719372 663350 720524 855459 818276 833833 908243 777785 823827 877819 930355 865683
12232 865683 686112 657557 746387 769806 844454 941618 873331 879703 837782 826012 788801
12221 788801 714489 775605 812788 893612 862342 763692 771174 873113 793945 768662 846678
12210 846678 834186 859390 948723 961690 1030917 1040294 1001051 872137 853264 908056 997576
12199 997576 1004484 832917 705745 651934 760431 797604 857859 843345 856413 796236 627894
12188 627894 594072 645745 736942 900792 993891 989563 885244 775736 715115 695585 643910
12177 643910 647729 707005 752442 761340 616152 519603 648255 705001 688976 702649 799142
12166 799142 717820 714476 720444 688772 693598 613379 471356 510751 509625 619603 709318 797773
12154G97773Q1326n4108M2272n4194j58392j12551j3970N6989M9662J79277o2876
12143G51208m939o7767l7112P0451J65562M4711o8892k7353O1975N6112p436P5423
12131A011943N4569K0742j6697k1398J30103J17016J06261J90213L13511M89202
12121B395465O81336Q66767P73527L35764J24400m0541O410R2884K01554K01307
12111E638873l45192j069134j217986o62077k95696j55156j16074j11548p3664
12102A592346r5317k58350k1716j24807j06318J45259J80537m4922j19867P525
12092A154370P0102K5902N7291k107o4982K1516P2726J23860J65439L94699L27643
12081B346459K73878M86993Q29667J122883J763439K703528K891520J833034N79565
$$ plain form
12154 797773 879099 824991 867263 813069 654677 542126 528156 585145 634807 814084 751208
12143 751208 746269 678502 641390 711841 877403 922114 853222 825869 887844 943956 936520 1011943
12131 1011943 1066512 1087254 1070557 1049159 1179262 1296278 1402539 1592752 1906263 2395465
12121 2395465 3076801 3943568 4717095 5052859 5177259 5136718 5143128 5236012 5437566 5638873
12111 5638873 5293681 4224547 3006561 2344484 2048788 1893632 1777558 1666010 1592346
12102 1592346 1497029 1238679 1216963 1092156 985838 1131097 1311634 1266712 1146845 1154370
12092 1154370 1224472 1250374 1307665 1305558 1240576 1262092 1334818 1458678 1624117 2018816 2346459
12081 2346459 2620337 3107330 3936997 5059880 6823319 9526847 12418367 14251401 14830966
12072A4830966l5785n2291j65434R4137P53604K06309k476251l700839k687705
12063F766711j457166q86807n68840m45278l55120k15679j94033j75477j77733
12054B290578o7985n9573r1990n6041P757M1660O608j8411N6136P4209o0808k3552
12042B098588j8104j834P2184J04838J94256M13954L92358O24305Q67492J579402
12032F327439K455931L086272K549991J039562J11797k29010k08852L5527M13770
12023A5582427P00412j249746l724104l342732k023106j116663o54188n68262
12015C604038l18737k24351k34523j81751k46675p7979o2924o4601m171j83576
12005B004750k51919m2634l7264J3912J9407M4106K4391N3907L6743o4331Q8537
$$ plain form
12072 14830966 14795181 14742890 14577456 14671593 15425197 15631506 13155255 9454416 6766711
12063 6766711 5309545 4422738 3853898 3408620 3053500 2837821 2643788 2468311 2290578
12054 2290578 2222593 2163020 2071030 2014989 2022746 2064406 2071014 2052603 2108739 2182948 2122140 2098588
12042 2098588 2080484 2078650 2150834 2255672 2449928 2863882 3256240 3880545 4748037 6327439
12032 6327439 8783370 11869642 14419633 15459195 15570992 15341982 15133130 15168657 15582427
12023 15582427 16282839 15033093 11308989 7966257 5943151 4826488 4172300 3604038
12015 3604038 3285301 3060950 2826427 2644676 2398001 2320022 2257098 2192497 2188326 2004750
12005 2004750 1752831 1710197 1672933 1686845 1706252 1750358 1774749 1828656 1865399 1801068 1889605
11994A889605R4431N8235K10144L7114J95942L08058O47323R60551R81302N59119
11984E941824J58223q5631l3034Q8933Q5560J31206m14091j128134j181736p99072
11974B764048m82162l29791k23283j05103o3004k04059r3926J8980K47O0682k7060
11963A315569j43846j17276j54167j3869L9281q1160j4747m4655r2746m8145l8361
11952F05878P4783Q2661n8342m8351J50775J70020K0268o9781n8690n1526j34574
11941F83121q9115o226L3369l9121j5431N4621n7927q4540m5328J33797J25028
11930F92248n2096l9621P1263M515N5814L0773n7721r4754j16233m4940Q5033
11919E34281n3102M829J1912J00178p7215o8785o2908K34597J445j59813Q4247
$$ plain form
11994 1889605 1984036 2042271 2252415 2289529 2485471 2793529 3440852 4401403 5382705 5941824
11984 5941824 6100047 6014416 5981382 6070315 6155875 6287081 5872990 4744856 3563120 2764048
11974 2764048 2281886 1952095 1728812 1623709 1560705 1356646 1262720 1281700 1281947 1342629 1315569
11963 1315569 1171723 1054447 900280 886411 925692 844532 829785 785130 692384 644239 605878
11952 605878 680661 763322 704980 656629 807404 977424 997692 927911 869221 817695 683121
11941 683121 594006 587780 621149 582028 566597 621218 563291 478751 433423 567220 692248
11930 692248 640152 600531 671794 676309 732123 762896 705175 610421 494188 449248 534281
11919 534281 481179 486008 497920 598098 520883 452098 389190 623787 625232 465419 549666
11908E49666P114l9406N2054l5971n7250j38805j0457M2955j14712K6937J03395
11897C85520O3793l2671l1263m2330L8201k7436q4377J0449L4056Q7246K5346
11886D26534m8346k0721l9541J09273m1360p8617J8572p98k2489N4608M8569J26771
11874E32455o5546j23844L9545N8560l2250k0258j14478k3483J37338P2615M2230
11863E02884j16421j26313Q2874J46017N1762P2222Q5873j11262j54821l3846
11853C98969j74985L4352K08700j1035N1803n1852k00342J8416N0297J1950k1734
11842C14539K2749J5254P5100N0948Q9984j1527q1870j09285l5571o2655J8888
11831B86554L9277k3587m6793M1188M4714r1553K7638J0433m1041r0743K2025
$$ plain form
11908 549666 556780 517374 569428 533457 476207 337402 326945 369900 255188 282125 385520
11897 385520 449313 416642 385379 343049 381250 353814 269437 279886 313942 401188 426534
11886 426534 378188 357467 317926 427199 385839 307222 325794 324996 302507 357115 405684 532455
11874 532455 466909 343065 382610 441170 408920 388662 274184 250701 388039 460654 502884
11863 502884 386463 260150 343024 489041 540803 613025 698898 587636 432815 398969
11853 398969 223984 258336 467036 456001 507804 455952 255610 274026 324323 336273 314539
11842 314539 337288 352542 427642 478590 568574 557047 475177 365892 330321 267666 286554
11831 286554 325831 302244 255451 296639 341353 249800 277438 287871 246830 156087 178112
11820A78112K3705R7671n082M9763J2444m7446q8127j8789K23827k9108j52265
11809B44705P286M498O5551k1188l3602J5694J12993o79j08609K5550j880j0074
11797C00245j5613o0692K1043P5848J4833j852q6257L9407M8219P5961l5566o9241
11785C06335k599k7569P3973J2263j46067l7272K4583m9428O5010M1431j8795
11774B41865K31J01622P0199J5731l6305j36967p5246k5971L4820j1733n4267
11763A23979K4993J46803p9023N5526p69n6309P0585N6172o4617M5787L0113j69694
11751A83546n1965L6332J52847K8082j671m1480j0352m2893p8211O4678Q7114
11740C26027o6565l3811J62391J45593L1838j12354k39726j45510P430N7134K6045
$$ plain form
11820 178112 201817 299488 294406 344169 356613 309167 221040 202251 426078 396970 244705
11809 244705 251991 256489 322040 300852 267250 282944 395937 395258 286649 312199 310319 300245
11797 300245 284632 223940 244983 320831 335664 333812 247555 286962 335181 411142 375576 306335
11785 306335 303736 276167 350140 362403 216336 179064 203647 154219 219229 260660 241865
11774 241865 242096 343718 413917 429648 393343 256376 181130 155159 189979 178246 123979
11763 123979 148972 295775 216752 272278 271509 215200 285785 341957 277340 323127 353240 183546
11751 183546 131581 167913 320760 348842 347171 305691 295339 252446 174235 238913 326027
11740 326027 259462 225651 388042 533635 565473 453119 213393 67883 75313 132447 158492
11729A58492n9689J1739J36840N7525p8995j20285L4831k8618K1516Q2916M8598
11718B64870P4980m7343L477M4201Q7982p3767o1667k5900O1185l9002r4303J09868
11706C04581R6785l0667j65982K483J57695j9407j93372m0647J78373L9935P6087
11695D05864j735l8321n5026J6883l5130k05019j3863J78618Q9077k0615k21374
11684I9359j76357K4285J14835J09854L1944j8170l4085M7140L3933j0970M024
11673B25792m7421J15946J21267p1671o8920j9206O6892m198j6651J6867r0884
11662B27813J2494l7624j15592j24752k4868K6895N8174j2595J18775J03020O3389
11651B95129n2017j8674N3566l8423m6889p8570J03711P1983j6848J3110n7725
$$ plain form
11729 158492 98803 110542 247382 304907 225912 105627 140458 111840 133356 216272 264870
11718 264870 339850 292507 295984 340185 428167 354400 292733 266833 328018 289016 194713 304581
11706 304581 401366 370699 204717 207200 364895 345488 152116 111469 289842 329777 405864
11695 405864 404129 365808 310782 327665 292535 87516 73653 252271 341348 320733 99359
11684 99359 -76998 -52713 62122 171976 203920 185750 151665 198805 232738 221768 225792
11673 225792 178371 294317 415584 343913 274993 255787 322679 318481 301830 318697 227813
11662 227813 240307 202683 87091 -37661 -62529 -35634 22540 9945 128720 231740 295129
11651 295129 243112 224438 278004 239581 192692 114122 217833 289816 272968 286078 228353
11640B28353J4911r8378Q0397Q6834J04274n2793j65869N318J21331N5673j7983
11629C62068J8978M6609k0686J4248J14126l797k5880k260k4685O6125j36490
11618D08356k36521j09005l5882J29115J06506o9866n3784Q1422M1626L0894O8238
11607C61099q8292l2135l1688j227k9394r4479L4518J5997J31281R1870l2481
11596C25069m8432j07848n6844l4197q7763j0805R6570J0581N8442Q1506N4074
11585B80353Q216O3451O4584j06404K0023O8875j137m5249j15120n3742M4405
11574B28255J87376J14376o6135j33236l6379M3056Q4542n2946j68698L0161O3303
11563B93675k821m2709j1537k3387k6532J7954J7885m5757q8928P10J218j0718
$$ plain form
11640 228353 243264 144886 225283 312117 416391 363598 197729 203047 324378 380051 362068
11629 362068 381046 427655 406969 421217 535343 531546 505666 503406 478721 544846 408356
11618 408356 171835 62830 26948 156063 262569 192703 138919 220341 261967 292861 361099
11607 361099 272807 240672 208984 207757 178363 83884 118402 134399 265680 357550 325069
11596 325069 276637 168789 111945 77748 -10015 -20820 75750 86331 144773 226279 280353
11585 280353 288569 352020 416604 310200 330223 399098 397961 352712 237592 183850 228255
11574 228255 415631 530007 463872 330636 294257 337313 421855 368909 200211 230372 293675
11563 293675 290854 248145 236608 213221 186689 204643 222528 176771 87843 88553 89771 79053
11551G9053J2494R5031O3315J0098j41383l3213m4173M1722M124P9013N1832K4707
11539B42620k4668J9440r661n6779M4748K06862k4383k2398m1528K0841n1015
11528C04079j50856l7854L0541J71759J88782n1840k27692q0193k2301L0515k8109
11517A26831j7376R662o724R8794Q7765L1800j16730j27947j7682p9730J4904
11506C567P6771J26813J7449r4367p2199J0448p9509l3378J15259Q9702o9561
11495I0995K148n0626l0187J5558N3083N823R7560l7837j37497J09346P3490l7853
11483A54003j4733l2448j0911L3875M9882l4690o739m929K3494k8660M570m573
11471A28141O3854K2052m5820J24339L6107L9912N6303m5564j57624n6922j0575
$$ plain form
11551 79053 91547 186578 249893 259991 118608 85395 41222 82944 87068 166081 217913 242620
11539 242620 217952 237392 227731 170952 215700 422562 398179 375781 334253 355094 304079
11528 304079 153223 115369 145910 317669 506451 454611 226919 146726 124425 154940 126831
11517 126831 109455 119117 112393 211187 298952 330752 214022 86075 68393 -11337 3567
11506 3567 80338 207151 224600 130233 58034 68482 -11027 -44405 70854 160556 90995
11495 90995 93143 42517 12330 27888 80971 86794 184354 146517 9020 118366 191856 154003
11483 154003 139270 106822 95911 129786 179668 144978 138239 133310 156804 128144 132714 128141
11471 128141 191995 214047 168227 292566 328673 368585 424888 379324 221700 164778 154203
11460A54203M8478n0088J43118p490J275K3837k3698M5262O826q9505O1354N2078
11448C65650j07156p9576o2102k8843L3759J8594m1277p8909O4237M8063Q2487
11437B14927n3051l7103K5571l7976P6692O4056n8347j04957l186l3953J2787
11426F5460L899j9763p4051K094J52954J77222P3002r6277N9395j9510j25554
11415A98871p2929J5128N0679Q6583p0466l5854M1989j035P1070m2350n4611o0323
11403A26752j44406r9575K8774P968L9973k8952Q9560J73237L7615K4533J3789
11392B69268k06142j51957j24759J8338L3129M9943M9697J86740O310m9319O1880
11381A43128J4394K5604L8559l7168p8204q0475J1832J04150J23780q6712j38352
$$ plain form
11460 154203 202681 152593 295711 288221 289496 313333 289635 334897 341723 252218 313572 365650
11448 365650 258494 178918 116816 87973 121732 140326 99049 20140 84377 132440 214927
11437 214927 161876 124773 150344 112368 189060 253116 194769 89812 86626 52673 65460
11426 65460 69359 49596 -24455 -22361 130593 307815 380817 284540 343935 324425 198871
11415 198871 125942 141070 191749 278332 207866 172012 214001 212966 284036 241686 187075 126752
11403 126752 -17654 -117229 -88455 -80487 -40514 -69466 20094 193331 230946 255479 269268
11392 269268 63126 -88831 -213590 -195252 -162123 -112180 -62483 124257 130567 81248 143128
11381 143128 157522 183126 221685 184517 106313 25838 37670 141820 265600 178888 40536
11370D0536J02890J07582j08703j25402m4658k1692k6921O6699J53069k440k9013
11359A11947j47806o7183N9648K0876O0107k9478Q2125M5050j9326n5992Q6598
11348A46566N1882J3896Q3493j0046k1893M207l3456j6118L4312M135l5800j37973
11336H3205J9774N0219j4369n5618m8228P8258M9552j64547j3320Q2332L3408
11325A00666o1105o7319p3270P3933J46343J97877O540n2172o012k5590n6488
11314A83403j12363r105Q5969k0090J5919m6958j47387q1696M8653R9874R2729
11303A08948o0609m8494o7777N9166Q2383L7685R2149N2258j26684N0804J06083
11292B85912m7405l447o5886p0024j48082n4426R042K0433K06740J06586j03049
$$ plain form
11370 40536 143426 251008 142305 16903 -27755 -49447 -76368 -9669 143400 140960 111947
11359 111947 -35859 -103042 -43394 -22518 37589 8111 90236 135286 115960 59968 146566
11348 146566 198448 212344 295837 285791 263898 268105 234649 218531 252843 256978 221178 83205
11336 83205 102979 153198 138829 83211 34983 113241 162793 -1754 -15074 67258 100666
11325 100666 39561 -27758 -101028 -27095 119248 317125 323665 271493 265481 239891 183403
11314 183403 71040 61935 147904 127814 143733 96775 -50612 -132308 -83655 16219 108948
11303 108948 48339 -155 -67932 -8766 73617 111302 203451 255709 129025 179829 285912
11292 285912 238507 235060 169174 99150 -48932 -103358 -94316 -73883 132857 239443 136394
11281A36394o4904P7570q6395j51317P009O2559O6955M4215K598j24513j27976
11270a57805j28491J25295R8629l395J06153P6718J3913n0669l6060J1085O0798
11259A16171j9286k5012p2015m9608L1601N6668j5269l5972O8186M793p6771j1744
11247b8258M5078l0281O9263J64456J4279j45647r5636j3671N6362k2091M9649
11236F3503P4879M3349J05864o7272J8593p2318P3045L8767k3857n6107k3433
11225A75013j6390l0559l3905j06798j37370Q6303N0687J5559Q6553J990m2037
11214D9046m3559k0181J26369L4378R1573j5132q3630q8376l417k8117r5390j07167
11202a83603P428J36374J56748L0713p354j3969P2881j18706m3996K2929J8022
$$ plain form
11281 136394 71490 149060 62665 -88652 -81643 -19084 47871 92086 94684 -29829 -157805
11270 -157805 -286296 -161001 -62372 -65767 40386 117104 131017 80348 44288 55373 116171
11259 116171 96885 71873 -142 -49750 -18149 38519 23250 -12722 55464 60257 -16514 -28258
11247 -28258 16820 -13461 55802 220258 234537 88890 -6746 -20417 35945 13854 63503
11236 63503 138382 181731 287595 220323 238916 166598 239643 278410 254553 198446 175013
11225 175013 158623 128064 94159 -12639 -150009 -63706 -13019 2540 89093 91083 49046
11214 49046 5487 -14694 111675 146053 237626 222494 138864 50488 47071 18954 -76436 -183603
11202 -183603 -176175 -39801 116947 147660 140306 126337 199218 80512 36516 59445 77467
11191G7467R457J38887M4482K6858q3557n1424j01418l500J6614n7704k5984j0006
11179a9828O9008o2040k4674J68515P7729n5199m4360L4035M4738J07720q5626
11168B10018p4470j8059o4239l0857M4061L1866n7701j04337M793Q7702M5497
11157G4274M2027L6214M1909K7451j66778K851N7398q7979o7851l319J46870K23834
11145C26901k6300j2744k9692k1199O0413j08904k36007L9239J66654n0205m8521
11134E9635o7279M8016J06476K2315j08963q0446j43682K0180J46450K60756M831
11123B68289p3808j6648K3334M8175j12415m5850N329K2392J6416o2487r8934
11112b6207j4543j0951q8075J12771L5049p4413q7089J52186J31942j12623q4086
$$ plain form
11191 77467 86924 225811 270293 297151 213594 162170 60752 57252 73866 16162 -9822 -19828
11179 -19828 49180 -12860 -37534 130981 208710 153511 109151 143186 187924 295644 210018
11168 210018 135548 117489 53250 22393 66454 98320 40619 -63718 -58925 28777 74274
11157 74274 116301 152515 194424 221875 55097 57948 115346 27367 -40484 -43803 103067 326901
11145 326901 300601 287857 258165 236966 297379 188475 -47532 -8293 158361 108156 59635
11134 59635 -7644 40372 146848 169163 60200 -20246 -163928 -143748 2702 263458 268289
11123 268289 194481 177833 201167 249342 136927 91077 96406 118798 135214 72727 -26207
11112 -26207 -40750 -51701 -139776 -27005 8044 -66369 -153458 -1272 130670 18047 -66039
11101f6039k3237K3045K8059k2964M3517J15354J2455j35926p3227J63093k901
11090F1229k2259N236j9594O284K0542L3378J9219Q7892J0803j07620n9364K4897
11078F0643L6986J82975J32049L7202n2805m2046N341J35341N3117R6113K00022
11067H44938R9846J65174R0706l5331n0679m9952L1912j69377j86563q5448P7154
11056G32380p7341m6799q427j44403J42345L8668j21412N157j8578N0663J6674
11045E68927l6933J02365L9640J2939J00494l4367o6877m5229q4961R6096j4408
11034F37686L6839r382j4555J24581m831j71670j16497k2177J19142J81510M7505
11023H08151l2656r2933J2617k0847n177m3388j2290j595O0945N4311j13692m0126
$$ plain form
11101 -66039 -89276 -66231 -38172 -61136 -17619 97735 110190 -25736 -98963 64130 61229
11090 61229 38970 44206 24612 30896 51438 84816 104035 191927 202730 95110 35746 60643
11078 60643 97629 280604 412653 449855 397050 355004 360345 495686 548803 644916 844938
11067 844938 944784 1109958 1200664 1165333 1114654 1064702 1096614 927237 740674 655226 732380
11056 732380 655039 608240 599813 455410 597755 636423 515011 520168 501590 552253 568927
11045 568927 531994 634359 673999 686938 787432 753065 686188 640959 555998 652094 637686
11034 637686 674525 665143 650588 775169 770338 598668 482171 459994 579136 760646 808151
11023 808151 775495 682562 695179 674332 669155 625767 613477 611882 672827 727138 613446 573320
11011E73320j7455M7329j4465k6004o0470o380j30623O458j30779k2476J4398
11000B32853j52752O934q1169q0244j2782J37449J72595Q5621m4168r3543q5278
10989H5516k0161q0558K5707J4308k0216L7747K3695K0219N2601n103l0714n2444
10977E0597l8404R6446M1493L4900m7006m4923K5934k9284N2280q2476j23617
10966f4060J17389L9555q6826j57710J9056N5682J1219O526J6464J54146M1671
10955A53112J3992j4098l7908j01477N360J7480J21765J15464j85285k23960j11906
10944b47461J08782J59111J32187l8286k2272l3560P5862p1697r8470l1901j5355
10933h3060K2955O4087J9144J0127m1535n9539M3785M9329k0267O4251J00304
$$ plain form
11011 573320 555865 603194 588729 562725 502255 495875 365252 371710 240931 218455 232853
11000 232853 80101 87035 5866 -74378 -87160 50289 222884 308505 264337 170794 85516
10989 85516 65355 -15203 10504 24812 4596 42343 66038 86257 138858 133755 103041 50597
10977 50597 12193 108639 150132 185032 138026 93103 119037 89753 142033 59557 -64060
10966 -64060 53329 92884 6058 -151652 -132596 -76914 -65695 -59169 -42705 111441 153112
10955 153112 167104 153006 115098 13621 18981 36461 158226 273690 88405 -135555 -247461
10944 -247461 -138679 20432 152619 114333 92061 58501 134363 62666 -35804 -67705 -83060
10933 -83060 -60105 3982 23126 33253 -8282 -67821 -24036 25293 5026 69277 169581
10922A69581j60384j13972K0577L4796J18605J83612J1812j49139m0792m3232
10912C1464P554k1877P7938l5073O551L7302J24387R4541n8129k38923r0746J60979
10900I5968R4142j2580m3722j05087J3587M0107P2680L5665j72088K7374l200
10889D2846N4132P1709J1040o9550q2322k9170M813J35553n7686j45298q5804
10878a49737L7347K4042k9458P1940J67140L2055j19271Q7226K86093M8634l5652
10867D20359j60324j57428K6059J766q5726o2517J8685m7489K8823j5622l6499
10856f9913L912j5408j8225J53143K56750r622j52046j19547M1394n2936j95464
10845a77962J1582J13597J91402J09568j9533o5029l4880j14719q2941N3695L3015
$$ plain form
10922 169581 9197 -104775 -84198 -49402 69203 252815 264627 115488 74696 31464
10912 31464 39018 17141 95079 60006 66557 103859 228246 322787 264658 25735 -65011 95968
10900 95968 190110 177530 133808 28721 42308 82415 155095 190760 18672 46046 42846
10889 42846 96978 168687 179727 110177 27855 -1315 3498 139051 81365 -63933 -149737
10878 -149737 -112390 -88348 -117806 -45866 121274 153329 34058 121284 407377 456011 420359
10867 420359 260035 102607 128666 130432 44706 -17811 874 -46615 -17792 -33414 -69913
10856 -69913 -66001 -81409 -99634 53509 310259 300637 148591 29044 70438 17502 -177962
10845 -177962 -166380 -52783 138619 248187 228654 163625 128745 14026 -68915 -15220 17795
10834A7795L1107P1936m3515j56352J01421J55922n1031r9599N649M2182p4378
10823A137r3991K2473K9238R6780L7695q6993j7240O1797j02663K6009J86056
10812A60298O1062j5711j8567j11681N4614j9291P0009o1578p5713J4656K6206
10801H4304q876j7901j20891k4434O2538P1695j23072n5536O3077P2686J22831
10790A26421j1166J566j289N6160K3726K0948K1774n3163l5967M2608J1770Q891
10778B12279j64699j74874j02058O1672P8193N9079L5700P5490R3737O7359N8747
10767C00625J2078j25944j72658m0511o0738P9867O5853L8818K565p9808j0190
10756I957M7598J78941K4757o7901l2381q2163J5012R6370J03092j1720j5659
$$ plain form
10834 17795 48902 120838 77323 -79029 22392 178314 127283 27684 33333 75515 1137
10823 1137 -92854 -70381 -41143 55637 93332 6339 -10901 50896 -51767 -25758 160298
10812 160298 221360 205649 187082 75401 130015 110724 180733 119155 43442 58098 84304
10801 84304 75428 57527 -63364 -87798 -25260 46435 -76637 -132173 -69096 3590 126421
10790 126421 115255 116821 115532 171692 195418 216366 238140 184977 149010 191618 203388 212279
10778 212279 47580 -127294 -229352 -167680 -89487 -30408 5292 80782 174519 241878 300625
10767 300625 312703 186759 14101 -26410 -87148 -7281 58572 97390 99955 20147 9957
10756 9957 57555 236496 261253 193352 160971 78808 93820 190190 293282 281562 265903
10745B65903j18920j471l8672k3360J7789m2930O0311r6318l8797Q7844O9688
10734A41067K2182k8505Q6164j15046q2601j19238j11062J31195K00976J11097
10724B36229K9074j5544k7708K9730K2553n5732j46516j6810R5878J18604J52997
10713D22755j4549Q727n1816K7454P2981l6601p2909k5491m3793j01440J595m5175
10701A41738m8971l2519M2103M7743m5624J3489J63783J1891l3849J43255R6214
10690D99253o6967k000K0078J5893R9569J54916m6470j48988j32435j51073j09044
10679A32732M3815O1096k8187k6233N6185m0386J950K5293l2596R2097J15170
10668D00936l4490l6934m4081q8397M1780J88510K19403L927N4154N2714P4594
$$ plain form
10745 265903 146983 145512 106840 83480 101269 58339 118650 22332 -16465 71379 141067
10734 141067 163249 134744 220908 105862 23261 -95977 -207039 -75844 125132 236229
10724 236229 265303 249759 222051 251781 274334 218602 72086 55276 151154 269758 422755
10713 422755 408206 416933 365117 392571 465552 428951 356042 330551 286758 185318 186913 141738
10701 141738 92767 60248 102351 150094 104470 117959 281742 293633 259784 403039 499253
10690 499253 432286 430286 450364 466257 565826 720742 674272 525284 392849 241776 132732
10679 132732 176547 237643 209456 183223 239408 199022 200972 226265 193669 285766 400936
10668 400936 366446 329512 285431 197034 238814 427324 646727 650654 704808 757522 832116
10657H32116J82316J93344Q5509K1778P8463j1N5309J18165J20267q4068m8467
10646A554721J40593l9177j76785Q1338K21052J83762K30867K93362M00493L91640
10636C281866K23766M11411M56169L81857O39533Q46465Q90238J005949J174137
10627I311391J599950K106390K742891L299218L658083L826446L751828L310271
10619C3606468L167680K986016K937824L234771L519719L793801M303213N003214
10611F2552706N618083N799566N339258M426226L500807L092603L264696L758638
10603I7352583L784361L350269K713366K888706L763860M321619L712101K342808
10595A24229673J162563M81776M58671L58580q7551j555073l556165m315380l673778
$$ plain form
10657 832116 1014432 1207776 1293285 1315063 1393526 1393515 1448824 1566989 1687256 1603188 1554721
10646 1554721 1695314 1656137 1479352 1560690 1781742 1965504 2196371 2489733 2890226 3281866
10636 3281866 3505632 3917043 4373212 4755069 5394602 6241067 7131305 8137254 9311391
10627 9311391 10911341 13017731 15760622 19059840 22717923 26544369 30296197 33606468
10619 33606468 36774148 39760164 42697988 45932759 49452478 53246279 57549492 62552706
10611 62552706 68170789 73970355 79309613 83735839 87236646 90329249 93593945 97352583
10603 97352583 101136944 104487213 107200579 110089285 113853145 118174764 121886865 124229673
10595 124229673 125392236 125874012 126332683 126691263 126603712 125048639 121492474 117177094 113503316
10586A13503316k752332k309139k477821k799554k803172k654191k469707k816572
10578I2420828m168692n629060o211448n492064m589093l747568l350209l244579
10570E5988115l040245k980485k955173l197016l568188m104111m165365l838038
10562B8139494l322348k549629j948816j652945j440151j242036j066101q89129
10554A4028339p25693p28647n57784n88311n10135m60534m15055m25881m39082
10545I177217k62208l21603l77814l77330k57310l02500j26732k71331k20328
10536F660061k73572k36217k30404k05371k54100k49740j67680L0423L5377m122
10526E104655j63321k15007j84618r5198j85571k33813k21922k290o4552j50882
$$ plain form
10586 113503316 110750984 108441845 105964024 103164470 100361298 97707107 95237400 92420828
10578 92420828 88252136 82623076 76411628 70919564 66330471 62582903 59232694 55988115
10570 55988115 52947870 49967385 47012212 43815196 40247008 36142897 31977532 28139494
10562 28139494 24817146 22267517 20318701 18665756 17225605 15983569 14917468 14028339
10554 14028339 13302646 12573999 12016215 11427904 10917769 10457235 10042180 9616299 9177217
10545 9177217 8915009 8593406 8215592 7838262 7580952 7278452 7151720 6880389 6660061
10536 6660061 6386489 6150272 5919868 5714497 5460397 5210657 5042977 5073400 5108777 5104655
10526 5104655 4941334 4726327 4541709 4446511 4260940 4027127 3805205 3802915 3738363 3587481
10516C587481k53052j8580N9354j84168j25649n6635m6391j48485o8007p2893
10506B672975j62657m7357P7066j03604j48154q670l2537L3280j40780q7421m6863
10495B005278l8436J4726j68132j88880l8655k1960l9267M4986k5034k0743p8125
10484A445758j45342J03028P681j05007l0897O6575L2844R568j22536p9394L3114
10473A215392r2629p9616j13537o2561N4439O551N0683Q9924p32j22460j09499
10462H35955j02285p1940p2404P4044J6530l3806M8104R9665l1113M2765k6312
10451G79203n4042P261O4992k0265j23371j18706J26114J46120j4698k48092j58508
10440C86008J10405M0664J5998k2569l3819O2887j9375J0703N0709N0143J3118
$$ plain form
10516 3587481 3334429 3315849 3375203 3191035 3065386 3008751 2962360 2813875 2745868 2672975
10506 2672975 2510318 2462961 2540027 2436423 2288269 2279599 2247062 2280342 2139562 2052141 2005278
10495 2005278 1966842 1981568 1813436 1624556 1585901 1563941 1524674 1569660 1544626 1523883 1445758
10484 1445758 1300416 1403444 1411125 1306118 1275221 1341796 1374640 1384208 1261672 1182278 1215392
10473 1215392 1122763 1043147 929610 867049 921488 928039 978722 1068646 1067914 945454 835955
10462 835955 733670 661730 589326 663370 679900 646094 694198 793863 762750 805515 779203
10451 779203 725161 732422 797414 777149 653778 535072 661186 807306 792608 544516 386008
10440 386008 496413 537077 553075 530506 496687 559574 540199 550902 601611 651754 664872
10429F64872q1560q7717j36805Q1J27073r024j6375O7586p7597K095J24469O4925
10417F42023J3828k00403j14536M7012k2449k3814q4241r7423l2003M4732j7836
10406A54890P9719M3817l3935J25619K84249M5519k19337j62701O8559j1958k8647
10395C45794O8889L1115R2452n9448j59092p4158j3154L0232J12850M9759n9741
10384C65498J17306M0763j34598j13026j7264o5122L6617J00117R1169N7644K9921
10373E09025P680K2q9368n0847p9788m4579K411N9601P7856J7819j12568l5744
10361B61520K247k9165l5860m9146J1976J0001P3568n8763j03568l7941K8411
10350G3280R0571j7564j23163J7931K7204J26861m5863r5503k6488n8001j2515
$$ plain form
10429 664872 583312 495595 358790 358871 485944 476920 460545 528131 450534 452629 577098 642023
10417 642023 655851 455448 340912 387924 365475 341661 257420 159997 127994 172726 154890
10406 154890 234609 278426 244491 370110 654359 699878 480541 317840 386399 374441 345794
10395 345794 414683 445798 538250 478802 319710 245552 232398 262630 375480 425239 365498
10384 365498 482804 523567 388969 275943 258679 193557 230174 330291 421460 479104 509025
10373 509025 516705 516727 427359 376512 296724 252145 254556 314157 392013 409832 297264 261520
10361 261520 263767 234602 198742 149596 161572 171573 245141 186378 82810 44869 73280
10350 73280 163851 146287 23124 41055 68259 195120 149257 53754 27266 -30735 -43250
10339d3250O3992L244n4408l4518N1437N4599N9873R336k1937J5636O3216o1687
10327A05533l3985M1054m7650L6592M9115N137j54820j37059j2147J26051J05467
10316H3288J418k0724j05582L6594J9874R4132k5639N9830K6782p8798M9847Q3089
10304B24111O769K810o341j52562k7681n8428j8692l2892q6860N8324J72789P7100
10292A58447M9187j42587j25892j35602R1521J2037R7851M2621p8769K5533O8703
10281F3050N7908K3266L9938p336l8130j07106m8339o286L7045l6616O5372K2821
10269F5587J1805j18219q6694J11805M3491M8383J3085m4217K6193p8158o5418
10258g2357J27518o4040k8087M0195K4019jp5411k01250N6032J12352K5286R857
$$ plain form
10339 -43250 20742 23986 -30422 -64940 -13503 41096 100969 110305 88368 104004 167220 105533
10327 105533 71548 112602 64952 101544 150659 155796 976 -136083 -148230 -22179 83288
10316 83288 84706 63982 -41600 -5006 14868 109000 83361 143191 169973 91175 141022 224111
10304 224111 230880 233690 227349 74787 47106 -11322 -30014 -62906 -149766 -91442 81347 158447
10292 158447 207634 65047 -60845 -196447 -104926 -92889 4962 47583 -31186 -5653 63050
10281 63050 120958 144224 184162 176826 138696 31590 -16749 -23035 14010 -22606 42766 65587
10269 65587 77392 -40827 -127521 -15716 27775 76158 89243 45026 71219 -6939 -72357
10258 -72357 55161 -8879 -36966 3229 27248 27247 -48164 -249414 -193382 -81030 -55744 -45887
10246d5887k0870L0612J38417J52127q4774j17569R876O2080p2752l2663n3316
10235c4719j51917k26J08955J13702k46885j610J60282l6804J4549L9109N6891
10224B1327M8754J34869M1696l8597J5316J19226M6616j27767o8706l4417n795
10213A52522o7936r2592l6057o1184L1786L8983q349n4628j75891O5775L5671
10202a71900R061k5086J5425J88644J25967O0041k0619r4218K2095O0990l326
10191A67074m1536n8032j49798M3451J8381J91514K01082P3788J1368J7978l8408
10180D36862j19999j03015J18618L8971j27369o2149j8091R361J03319J44102
10170D20610R0998l1580M0280J58385L0720j13382j44030L9687Q8905Q6676r156
$$ plain form
10246 -45887 -66757 -36145 102272 254399 169625 52056 61932 124012 51260 18597 -34719
10235 -34719 -186636 -186862 -77907 35795 -211090 -212700 -52418 -89222 -74673 -35564 21327
10224 21327 70081 204950 246646 208049 223365 342591 389207 261440 192734 158317 152522
10213 152522 84586 -8006 -44063 -105247 -73461 -34478 -42827 -97455 -273346 -207571 -171900
10202 -171900 -162839 -187925 -172500 16144 142111 202152 181533 87315 109410 170400 167074
10191 167074 125538 67506 -82292 -38841 -20460 171054 372136 445924 457292 475270 436862
10180 436862 316863 213848 332466 371437 244068 181919 163828 173189 276508 420610
10170 420610 511608 480028 520308 678693 709413 596031 452001 491688 580593 667269 658113
10159F58113j5634j0119K2913l6572k6475M8095J00211M8903j13323j43420l0566
10148E02126O7192k912M9549j23567r9970l2336O6209J89642j3015p570m2311
10137E53037j04124j38865J11199Q6405l3868n2576o4718q9438K1782j4207l5123
10126B39504o4400N2002m0816k0031j04590N7985J6391q0379j35311N9854P858
10115a1933K4827M6797o9631J3809M8767Q5309J14134m022n4849k6933m5341j6249
10103A04685o296o0020k2393o625o5848N981J60909J1360M3869P1717J5854r9218
10091A53975p7724o1079K007K7261N0199k6755P2070m6891J438j6973Q0074l7129
10079A20473l4926m635p0055j1547J17996l9917K7302n3451k106o7226J7972N2335
$$ plain form
10159 658113 642479 632360 655273 618701 592226 640321 740532 789435 676112 532692 502126
10148 502126 569318 566406 615955 492388 392418 360082 426291 615933 602918 595348 553037
10137 553037 448913 310048 421247 507652 473784 421208 356490 267052 288834 274627 239504
10126 239504 175104 227106 186290 166259 61669 119654 136045 55666 -79645 -19791 -11933
10115 -11933 12894 59691 -9940 3869 52636 137945 252079 248057 193208 166275 120934 104685
10103 104685 98389 38369 15976 9351 -56497 -50516 110393 121753 165622 237339 253193 153975
10091 153975 76251 15172 17179 44440 94639 67884 139954 93063 94501 77528 157602 120473
10079 120473 85547 80912 10857 -690 117306 77389 104691 51240 49134 -18092 -120 52215
10067E2215j7818L1189J04484j26492m0282k1670k4755J698J19328O4272j10686
10056C1483n5122K592J00910q5931j16844K0147j2316j06750P0226P6257n614
10045h0962O7196J84832l4017m8491m262j35677M8387K7107K6935j198j36556
10034h6706o2555Q4270L8958j07061o490k2454l245N4790J1300M6860N6401K9343
10022C3411J18255r4461m5345l6095L1060k5122q7606L4684J18463N1372m4023
10011E4593l5789l7952n7704R9844j0980N906J0205J2084j7306l2830n4313r9285
9999a63527P6421j4385L3807N6894l530o9670P2340J2103j20554n1962L3454O2887
9987g5722R6022k0414R1079N4097L2329L0713J4836j81611m4464J13360M2386
$$ plain form
10067 52215 34397 65586 170070 43578 3296 -18374 -43129 -41431 77897 142169 31483
10056 31483 -23639 -21047 79863 -6068 -122912 -102765 -115081 -221831 -151605 -75348 -80962
10045 -80962 -13766 171066 137049 88558 84296 -51381 -2994 24113 51048 49850 -86706
10034 -86706 -149261 -64991 -26033 -133094 -139584 -162038 -165283 -110493 -99193 -52333 4068 33411
10022 33411 151666 57205 11860 -24235 6825 -18297 -105903 -71219 47244 98616 54593
10011 54593 18804 -19148 -76852 22992 12012 17918 28123 40207 22901 -9929 -64242 -163527
9999 -163527 -87106 -101491 -67684 -10790 -14320 -83990 -11650 453 -120101 -172063 -138609 -75722
9987 -75722 20300 -114 90965 145062 177391 208104 222940 41329 -3135 110225 152611
9976A52611m5738q9297j8709R0663R3694n5900K6254J1118L5995l69j62975k7884
9964I463O3472L4136q4892j18930l3117O5473L8557n0827Q972K3255M2612J04444
9952A02618R418q2363k4265k6190O2329J04065l093j28005r5038K5163k1256k3255
9940i9872Q6452J40431k426j5676k6649K2376K7321q980o3495n0691m3988J3536
9928b1661J7026N123M2248M9931j41142p0572M1349k7632L5809J68923J16561
9917B15963k2648m5648j3546j08052j5546K4802O8264J72124J4692O6631K33222
9906E90258K75060N89795P37248M91902R6748k3160j15225j11862J27480K76786
9896B935030K32363n80683r83490m24439k68886j39177j23233o9938k9048q7702
$$ plain form
9976 152611 106873 17576 -1133 89530 183224 127324 153578 164696 200691 200322 37347 9463
9964 9463 72935 107071 22179 -96751 -129868 -64395 -25838 -76665 -67693 -44438 -1826 102618
9952 102618 112036 29673 5408 -20782 41547 145612 142519 14514 -80524 -55361 -76617 -99872
9940 -99872 -13420 127011 124585 108909 82260 104636 131957 122977 59482 8791 -35197 -21661
9928 -21661 -4635 488 42736 92667 -48475 -119047 -77698 -105330 -69521 99402 215963
9917 215963 193315 147667 134121 26069 10523 35325 103589 275713 290405 357036 590258
9906 590258 865318 1455113 2192361 2684263 2781011 2757851 2642626 2530764 2658244 2935030
9896 2935030 3167393 2586710 1603220 1178781 909895 770718 647485 577547 548499 460797
9886D60797j05429n257J3088J28963N2533j17535j69809j00023K7551k0308m1965
9875A22606K4611n2029l5595R21N2168R8956n7443o1312J12121O6044J31808O0626
9863D63482p368m2235k19631k12300m0390P939K1585N3582l945n0118j12786L9950
9851a02235J57456P6450m7039J7625O8786R9268N8405k7192k04772l2965r0944
9840b7157j12569p4872j3368k0342l7825Q8047K0611R2761O4617k0901k658M1077
9828b579M9691N3427J7295M9182n5525l4992R2957K182l2799j4039n6639O855
9816G5016K0537k1399j4968K3766j61558k1250J57534J15691m2386p6691K7278
9805H1570J34878l0254o4083p5364n1330j248J5887J00324J02168k2938j19610
$$ plain form
9886 460797 355368 350111 363199 492162 544695 427160 257351 157328 184879 164571 122606
9875 122606 147217 95188 59593 60514 112682 211638 154195 92883 205004 271048 402856 463482
9863 463482 456114 413879 194248 -18052 -58442 -50503 -28918 24664 20719 -29399 -142185 -102235
9851 -102235 55221 131671 84632 102257 171043 270311 328716 301524 96752 63787 -27157
9840 -27157 -139726 -214598 -227966 -248308 -286133 -198086 -177475 -84714 -20097 -40998 -43656 -2579
9828 -2579 47112 100539 117834 167016 111491 76499 169456 171638 138839 124800 68161 75016
9816 75016 95553 74154 59186 82952 -78606 -99856 57678 173369 130983 54292 81570
9805 81570 216448 186194 122111 46747 -4583 -5831 10056 110380 212548 189610 70000
9794G0000o063p0638m8574q151L3561l4091j13818J3705J09534N0065J4978j2829
9782b321K8664q7949n7108o1138J39926J35221L3968J31685l0656L1816j20539
9771A41569j26107m1832P0160N6996k7202p2715j83739J9280R6731J44092n6492
9760B0741j45023q7455k4523q7284o1549J7832J64606J12373J62234p7530k7808
9749c3386m6698n204n2405j230K6800L1629n0924L8396j90225O9762J72982J61142
9737A20639k8397j59656j7631N9355r4103l2394L7324K5645M3679K7178m9174
9726f7535J5918N4566N9527K5164k599n3270n2967p6997J1313m4529K3548l965
9714a11826J41657J03689j1632r4209l8064N7876k5250j01132Q580J31024M5466
$$ plain form
9794 70000 63937 -6701 -55275 -63426 -29865 -63956 -177774 -164069 -54535 -4470 10508 -2321
9782 -2321 26343 -61606 -118714 -179852 -39926 95295 129263 260948 230292 262108 141569
9771 141569 15462 -26370 43790 100786 73584 869 -182870 -163590 -66859 77233 20741
9760 20741 -124282 -211737 -236260 -323544 -385093 -367261 -202655 -90282 71952 -5578 -33386
9749 -33386 -80084 -85288 -137693 -138923 -112123 -80494 -131418 -93022 -283247 -213485 -40503 120639
9737 120639 92242 -67414 -85045 -25690 -119793 -152187 -114863 -89218 -45539 -18361 -67535
9726 -67535 -51617 2949 62476 87640 85041 31771 -21196 -98193 -86880 -131409 -107861 -111826
9714 -111826 29831 133520 121888 27679 -10385 47491 22241 -78891 -70311 60713 106179
9703A06179j4874O3090r5564q8736k20032K2117R3545J36367k4146l0420l2031
9692h4505j54460K5892J35267k9767j6308L7479J00250j3601O127k2984n5176
9681g1786M8951p7242j4511J01773n5441N5426j16160o3012N477O8701j0727j6230
9669a44781J00423P4913n5362j37461m6828j5615j08950P6806J01040L1935Q9876
9658c4004k2859j20150j18306r450O419p929Q2051O9518O3440J05210J34040J5110
9646A63090j4904J50731N5085J1404O2334m2638o2854Q3186k234P2503P9814j11839
9634D43678p6666j48169j72060j85297K9442Q6785J7363K5766J29424Q1482j8819
9623B12929p5460P6664j5756m3773k0811p3783l2559n9704p5245q189M7795k202
$$ plain form
9703 106179 91305 154395 58831 -29905 -249937 -227820 -134275 2092 -22054 -52474 -84505
9692 -84505 -238965 -213073 -77806 -107573 -123881 -86402 13848 247 6374 -16610 -71786
9681 -71786 -22835 -100077 -114588 -12815 -68256 -12830 -128990 -192002 -186525 -117824 -128551 -144781
9669 -144781 -44358 30555 -24807 -162268 -209096 -224711 -333661 -256855 -155815 -123880 -34004
9658 -34004 -56863 -177013 -295319 -304769 -298350 -306279 -224228 -154710 -91270 13940 147980 163090
9646 163090 148186 298917 354002 365406 427740 385102 322248 405434 403200 475703 555517 443678
9634 443678 367012 218843 46783 -138514 -109072 -22287 -4924 20842 150266 231748 212929
9623 212929 137469 214133 198377 154604 133793 60010 27451 -32253 -107498 -115687 -67892 -70094
9611g0094k3537R8607P8863j4535K0155M943J4691m4168n9211l3312l5653O7603
9599D352J28402Q4971O135J02297K3356k38228p3185J20435O9926p9021k23620
9588g4180j8195J38467P0876n9865j3666m8419j41157M8376K03920n630l9145
9577F1382k8390o0633j16986N8445J54830Q5896k277j37697l518P6487j3960j09625
9565c6046j497q4773oK8557J13630M3793r7791Q29K6727N8414M6683J69168k815
9552B64873k4644q4896l4260r6381o8896O2172k6712J7192k3548n1613r2403J9641
9540a39475J95645J22259J7637J3033l3096o3945J4661R7666j3055M7833r830
9529B49333j22140j78871O5072J30350m0227K8095j01534N2049Q0876L5494r7950
$$ plain form
9611 -70094 -93631 4976 83839 69304 89459 94402 109093 64925 5714 -27598 -63251 4352
9599 4352 132754 217725 223860 326157 349513 111285 38100 158535 228461 149440 -74180
9588 -74180 -92375 46092 116968 57103 43437 -4982 -146139 -97763 106157 100527 61382
9577 61382 32992 -27641 -144627 -86182 68648 154544 152267 14570 11052 87539 73579 -36046
9565 -36046 -37543 -122316 -122322 -93765 19865 63658 -34133 -33304 -6577 51837 98520 267688 264873
9552 264873 240229 155333 121073 24692 -44204 17968 -8744 8448 -15100 -66713 -159116 -139475
9540 -139475 56170 178429 196066 209099 176003 112058 126719 224385 211330 259163 249333
9529 249333 127193 -51678 13394 143744 103517 131612 30078 82127 163003 198497 100547
9518A00547j20917L1742p4532P4093M7685j56975O8984J38009j13794o2679l7400
9507a05237J4082K234M1275P9200L2282M3355R319l6083m521J6758Q8612K7673
9495B08949r2016j27331k6100O4234K8668p359j22618M9806R5249K106L9068J5018
9483A27674o0513M3160L1229o5478j91699j35040J66932J81403K194m0710j08227
9472d9075J921N3385O0097M4620m6248j51886j30349n0114P8808J56304L9084
9461F547J25013j401m831n8653K2075k513j80242N845J83039J7408Q0423j2780
9449A79930k7803o513k8792r3137j00519j5792L9620P2323n420N236l5977j57664
9437a74508k2058M5539l933K07365J0629n6445L1329K1332j8705l3880m8079J561
$$ plain form
9518 100547 -20370 11372 -63160 10933 58618 -98357 -29373 108636 -5158 -67837 -105237
9507 -105237 -91155 -88921 -47646 31554 63836 107191 116510 80427 75906 92664 181276 208949
9495 208949 116933 -10398 -36498 27736 56404 49045 -73573 -23767 71482 73588 112656 127674
9483 127674 67161 110321 141550 76072 -115627 -250667 -83735 97668 99862 59152 -49075
9472 -49075 -47154 6231 66328 110948 64700 -87186 -217535 -267649 -188841 -32537 6547
9461 6547 131560 130159 125328 66675 88750 86237 -94005 -88160 94879 112287 192710 179930
9449 179930 152127 145614 116822 23685 -76834 -92626 -53006 19317 13897 19133 -16844 -174508
9437 -174508 -196566 -151027 -154960 52405 63034 6589 37918 59250 40545 6665 -41414 -39853
9425c9853k7712N6562J96631j8708r8869o8254o0645l8250j4429J5305k2952J01096
9413b0078M3107j9120J27031j37294r1035o9953P329L3559R6191P2121j23907
9402h2049l6393Q6552R4819j18755k4103J0708Q1134P1967j3687l8138n4101j6997
9390c9043L3316o291M8510M9927k4295m395O7634J50049R0516K1534k70541j40139
9378b3218l7934k7667n3490J55870O6315L0685r7627q7852J3009J36736R5823
9367A70650j7943q1808k2414j73570j04308L7735Q4942M5469N5843j4608p4783
9356i4795l391Q9440n7435r3537N9831J41125m5317K8083q8532o2360J04240Q5580
9344F2932K095l4361k3418J7754k390k3959N6215j4082K0937Q1676j6838j9531
$$ plain form
9425 -39853 -67565 -11003 185628 166920 68051 -203 -60848 -99098 -113527 -98222 -121174 -20078
9413 -20078 23029 3909 130940 -6354 -97389 -167342 -160013 -126454 -30263 41858 -82049
9402 -82049 -118442 -31890 62929 -55826 -79929 -69221 11913 83880 70193 32055 -22046 -39043
9390 -39043 -5727 -12018 36492 86419 62124 57729 125363 275412 365928 387462 116921 -23218
9378 -23218 -61152 -88819 -142309 13561 79876 110561 12934 -74918 -61909 74827 170650
9367 170650 152707 70899 48485 -125085 -229393 -191658 -106716 -61247 -5404 -20012 -94795
9356 -94795 -98186 -8746 -66181 -159718 -99887 41238 -4079 24004 -64528 -126888 -22648 62932
9344 62932 65027 30666 7248 25002 22612 -1347 54868 40786 61723 143399 126561 107030
9332A07030p4718j01553j1737K6983j6255m3832l3599M2249J32428j26j6688M3995
9320E4177P1697l8167J490K705l6751j10046j61604M2859K1544O1669L5818L8722
9308a5887j11221L901j6266K4367n9868p7362J32027J14044k1911m1888K352o6598
9296a34310o0299n3074r2188L2064J29792K4248O9277j13578o3318R4078R8673
9285f8635L9088k8380o2784m4543M1054N0851L1852n5091n5032K4803o3943P1777
9273a18983R8256k1097Q8488p64N17J4161k3737j25335o1647M5688J15592O097
9261A7236m1431L907l0672q00q557l9688J1524P6896j5585l5135K3445m1105L0443
9248d9522J7600j05449r6210M4549N5267L1207J19990R5078R9511N3401o9554
$$ plain form
9332 107030 32312 -69241 -80978 -53995 -70250 -114082 -147681 -105432 26996 26870 10182 54177
9320 54177 125874 87707 89197 91902 55151 -54895 -216499 -173640 -152096 -90427 -54609 -15887
9308 -15887 -127108 -123207 -139473 -115106 -174974 -252336 -120309 -6265 -28176 -70064 -67712 -134310
9296 -134310 -194609 -247683 -339871 -307807 -178015 -153767 -84490 -198068 -261386 -167308 -68635
9285 -68635 -29547 -57927 -120711 -165254 -124200 -73349 -41497 -96588 -151620 -126817 -190760 -118983
9273 -118983 -20727 -41824 46664 45900 46417 60578 36841 -88494 -150141 -104453 11139 17236
9261 17236 -24195 -20288 -50960 -51760 -60317 -100005 -88481 -11585 -27170 -62305 -38860 -79965 -49522
9248 -49522 -31922 -137371 -233581 -189032 -133765 -102558 17432 112510 212021 265422 195868
9237A95868m8047j05638n8370k2597L5878J59858P4382q4649p0526L005J04330
9226A83494k0827j28645j2480m6028O6766P8319n9365j3757o7333j54381L2442
9215a41795J14904q060J22613r2029j96003r2718J40869J55692J09415J9870o2887
9204F9871J25066L0646k7634j855j7291j49687j42760l9904m9496O1108m068J0839
9192a35165J37075K1452p1175r4938O8561J53768j124P0610j233J9600J2714q1974
9180I8171k9541m7626p9753j73264o8472J06208J83580j0817n1128m8955Q809
9169a12788j0055J41578O7210M7276r3835p4243M9728l0040j57973r8155j113
9158b72410K3830J42825R7181J9699P0075K718L2419P76m293J3988M4829M4529
$$ plain form
9237 195868 147821 42183 -16187 -38784 -2906 156952 231334 146685 76159 79164 183494
9226 183494 162667 34022 21542 -24486 42280 120599 61234 47477 -19856 -174237 -141795
9215 -141795 -26891 -34951 87662 -4367 -200370 -293088 -152219 3473 112888 132758 69871
9204 69871 194937 225583 197949 196094 178803 29116 -113644 -153548 -203044 -141936 -146004 -135165
9192 -135165 1910 23362 -47813 -142751 -74190 79578 78454 149064 147831 167431 180145 98171
9180 98171 68630 21004 -58749 -232013 -300485 -194277 -10697 -21514 -72642 -121597 -112788
9169 -112788 -122843 18735 85945 133221 39386 -34857 14871 -15169 -173142 -271297 -272410
9158 -272410 -248580 -105755 -8574 11125 81200 83918 116337 117113 112820 126808 171637 216166
9146B16166k1632j0201r9338n252k8644j39604q3214p7625J10925J08242L8541
9135H364m8249l3171n4532m4733L3880O8878j1112j00567j44221k3521K30785
9124a18199J83479K3154j01470m484m3174K084O8514P372j75308J4339Q0940R4230
9112C1477m2546n8527o2534J06071N0591j39004m9916K5647r444J37966R8280
9101H8061J28836r357N494K6459p0452n0015n4950k2912p1204M802r3152n1201
9089a69591J28035R7745o5249q5607j6551O6326R660N9535o8440j29883o981k5985
9077b06986Q6897L1699N0541K8430R197K1419m6293L8534J09477l9811o9156j6691
9065b743O259m4745o7025q354P3034J12926p096l690N9077n1815j64108J8215
$$ plain form
9146 216166 194534 184333 84995 79743 51099 -88505 -171719 -249344 -138419 -30177 8364
9135 8364 -39885 -73056 -127588 -172321 -138441 -69563 -80675 -181242 -325463 -348984 -118199
9124 -118199 65280 88434 -13036 -17520 -60694 -58610 9904 17276 -158032 -143693 -62753 31477
9112 31477 -11069 -69596 -132130 -26059 24532 -114472 -164388 -138741 -148185 -10219 88061
9101 88061 216897 207540 213034 239493 169041 119026 64076 41164 -30040 -25238 -118390 -169591
9089 -169591 -41556 56189 -9060 -94667 -111218 -44892 -35232 24303 -44137 -174020 -181001 -206986
9077 -206986 -120089 -88390 -37849 -9419 -222 21197 -25096 13438 122915 83104 13948 -2743
9065 -2743 3516 -41229 -108254 -116608 -43574 69352 62256 58566 117643 65828 -98280 -80065
9053h0065k923N7245O2004P0131p1828o2948J259J10580j8496r176j5233k8779
9041A1771j53829Q4195L7404j801O6711o271o8555n2978n2888P2837j7170j9602
9029a00176k7702P2181N312M039K5287K5459L9281n3903k8429j0457k1713o4785
9017a35606j14571M8585J01624k2451n7407M6829m6655L0395L7382j6946Q9171
9006c9650P1896m2324N9830N6934k4004P9634N9572p2257M9502R5103j49410j06055
8994C8771p2078k5639o6891N0235R3927L8080m5306O2977J13941m7749l7604j82818
8982h0154n367M6285J3348j5442N0058J25644o7796l1434r5174j53614j20111
8971c33757J6851J51040J24383L0801Q5866r2275j0985K7722k6410L395j2723
$$ plain form
9053 -80065 -82988 -25743 36261 106392 34564 -28384 -27125 83455 64959 55783 40550 11771
9041 11771 -142058 -57863 -20459 -22260 44451 38180 -30375 -83353 -136241 -63404 -80574 -100176
9029 -100176 -127878 -55697 -50385 -46346 -21059 4400 43681 -10222 -38651 -49108 -70821 -135606
9017 -135606 -250177 -201592 -99968 -122419 -179826 -132997 -179652 -149257 -111875 -128821 -39650
9006 -39650 32246 -10078 49752 106686 82682 162316 221888 149631 199133 294236 144826 38771
8994 38771 -33307 -58946 -125837 -75602 18325 56405 11099 74076 188017 140268 102664 -80154
8982 -80154 -85521 -39236 -25888 -41330 8728 134372 66576 35142 -60032 -213646 -333757
8971 -333757 -316906 -165866 -41483 -10682 75184 -17091 -28076 -354 -26764 -23369 -36092
8960c6092o2130j2782K1283J37034M0432P1491j11227J8885K2607K2855M9025
8949A61381K1409q0741j10914j9927L9729m5254Q132J5766Q0053J8430N3527j4643
8937A26948K938P0738M4176n8056m5357j869J4252j901j13618P4922L2522j43964
8925A731l9851J77147k9372n8653M4754p2522q0262l5570J40153N368P112O6896
8913A26931r2728P1348j04743j61734N6329N437j01503n6975l4820J6223P9251
8902a96984M3401r6989L5186O8408k97j66111J21297R2883O9228j4919j01108
8891a46005n4649L2214Q6048J64303J06507n5116j26844o1041L0219Q839o661
8880b2186k7818j41025k3662Q7656K2459k7182J11009R5772k2941j3721q0533
$$ plain form
8960 -36092 -98222 -111004 -89721 47313 87745 159236 48009 66894 89501 112356 161381
8949 161381 182790 102049 -8865 -28792 10937 -34317 -26185 -10419 69634 88064 141591 126948
8937 126948 129886 200624 244800 186744 141387 139518 153770 151869 38251 113173 145695 1731
8925 1731 -38120 139027 109655 51002 95756 23234 -57028 -92598 47555 52923 60035 126931
8913 126931 34203 105551 808 -160926 -104597 -99160 -200663 -257638 -292458 -276235 -196984
8902 -196984 -153583 -250572 -215386 -146978 -147275 -313386 -192089 -99206 -29978 -44897 -146005
8891 -146005 -200654 -168440 -82392 81911 188418 133302 6458 -54583 -24364 -15525 -22186
8880 -22186 -50004 -191029 -214691 -127035 -104576 -131758 -20749 75023 52082 38361 -42172
8869d2172n5246k2891K4665O086O5714M9219L76k0177R997N3416j11017l6104
8857g8134r3204j42511m1816J20140J7826J31958O7635N5690k72q0303p5586J22900
8845D323Q115l3932n6610j21624j57385R3121O2389o672L1334L5466j0265k5648
8833a77388J06154K5633k677n5850J09139k0776k0486m3783O5095n8943r4544
8822a68426L9010Q747k0778l5401l967l606R1950k8505M3293L2825K3342N9293
8810C7777O3983m7240m8048L763n6376k9027p927M421R6981J04499r989P5180
8798A87997j7654j8440m1495p5668n6661M0990M7269J20057J7314p9848m6935
8787G6926o6630J3378J7727O7102K97j88576j89487J10802R1639J468N197Q9858
$$ plain form
8869 -42172 -97418 -120309 -95644 -89558 -23844 25375 25751 5574 15571 68987 -42030 -78134
8857 -78134 -171338 -313849 -355665 -235525 -217699 -85741 -18106 37584 37312 -42991 -118577 4323
8845 4323 12438 -21494 -78104 -199728 -357113 -263992 -201603 -208275 -176941 -141475 -151740 -177388
8833 -177388 -71234 -45601 -48278 -104128 5011 -15765 -36251 -80034 -14939 -73882 -168426
8822 -168426 -129416 -120669 -141447 -176848 -180815 -184421 -92471 -120976 -77683 -44858 -21516 37777
8810 37777 101760 54520 6472 10235 -46141 -75168 -83095 -78674 18307 122806 112817 187997
8798 187997 170343 151903 110408 34740 -21921 19069 66338 186395 203709 123861 76926
8787 76926 10296 23674 41401 108503 108800 -79776 -269263 -158461 -66822 -65354 -60157 29701
8775B9701n4342Q102P0556j02476n9235N3333n1153r468P1306M8568j3672j44207
8763a52987N6055L477q9090k2566k2572n906k0923o507R4235m8035j4599k3219
8751b52637O8863N2460r1444J70525O2318l2263j9912L8893L4289K0485o7207
8740a5630j9911P4681j39203J617J47142j8911o6689J13611N6148k2879K4336
8729A34312p6217n3765j81217n4076L7736j4387J03153P5370k04557m804J85112
8718e3340J07831l3536P519N1078m2491k0154o1092J22695k0081q4424J08563
8707H2568K3584K0631q9974K3112r644j01461k3860M5679r5053j07869k446N8616
8695a76117L8843J96405J5282j20434J9368L8838k8486M624M8527K6455P5572
$$ plain form
8775 29701 -24641 -16539 54017 -48459 -107694 -54361 -105514 -114982 -43676 4892 -8780 -152987
8763 -152987 -96932 -93455 -182545 -205111 -227683 -233589 -254512 -261019 -166784 -214819 -229418 -252637
8751 -252637 -183774 -131314 -222758 -52233 10085 -22178 -42090 -3197 31092 51577 -15630
8740 -15630 -35541 39140 -100063 -98446 48696 29785 -36904 76707 132855 109976 134312
8729 134312 58095 4330 -176887 -230963 -193227 -207614 -104461 -29091 -233648 -238452 -53340
8718 -53340 54491 20955 28474 79552 37061 16907 -44185 78510 58429 -25995 82568
8707 82568 106152 126783 36809 59921 50277 -51184 -75044 -29365 -124418 -232287 -234733 -176117
8695 -176117 -137274 59131 74413 -46021 -26653 12185 -16301 -11677 36850 63305 138877
8684A38877O317J6900J360j9234j6932j11741L6611J26228J4100o4239j82749
8673e4502m2598R6589k1486L3246M1186K4583k7657l4289L6598K1746P457k4364
8661E6509j5280l2112l5821M0620K4350L2396o8102M9112J6885K5444o104j0344
8649G7553P6463m4292p0093R4033N962j40345n759M6831n1201r3971j21243m0279
8637b66341J24220P0797m4062Q8577J0697Q399K9546Q812o7693k110p1615l5473
8625a46246P5698Q7786L636J04071Q682j1114q6886r3313M26J3677J14026o46
8613F9797j06365J09597J08153k012n202r7574n1627r8411P1548O1075r4224q4739
8601a19984O3878o8226L3415p8438m0191J05723J04956K1015n5098j03555o7909
$$ plain form
8684 138877 145194 162094 163454 144220 127288 15547 52158 178386 192486 128247 -54502
8673 -54502 -97100 -511 -21997 11249 52435 77018 49361 15072 51670 73416 80873 56509
8661 56509 41229 9117 -26704 13916 38266 70662 2560 51672 68557 94001 87897 77553
8649 77553 154016 109724 39631 133664 139626 -719 -6478 40353 -10848 -104819 -226062 -266341
8637 -266341 -142121 -71324 -115386 -26809 -16112 -7713 21833 30645 -37048 -39158 -110773 -146246
8625 -146246 -70548 17238 20874 124945 133627 122513 35627 -57686 -57260 -43583 70443 69797
8613 69797 -36568 73029 181182 179170 173968 76394 24767 -73644 -2096 58979 -35245 -119984
8601 -119984 -56106 -124332 -90917 -169355 -209546 -103823 1133 22148 -32950 -136505 -204414
8590b04414n8769K9966J21804Q7239K5871k2889M7529K5510K1667L7936o9772
8579D1678q6790O1841p0474r1967N0963O9544q4394j6370J26348o4056n4502O0045
8567e8134O1190O9604N2006J9320K7049O531j68451l9126j73729j28151K9388
8556c02503J61794Q4747j2171Q3496N3562j49153p0390r390P0533J28080k8512
8545A0093P592J23332k9631o2515k9977p2422J23470R6574l1153k1509m2561o3789
8533G504j5857L1836k9531J9230j3012Q3601J53507j36823k3006L6686M9313O4887
8521B28335k8786N067n3108r6182p200p8589J27756P5573p8433j45192O170K4555
8509b0034o0314L9953n3658O1547k2558o681o6516Q9724J15941J34705j2529n1822
$$ plain form
8590 -204414 -263183 -233217 -111413 -24174 1697 -21192 26337 51847 73514 111450 41678
8579 41678 -45112 16729 -53745 -145712 -94749 -25205 -109599 -125969 379 -63677 -118179 -58134
8567 -58134 3056 72660 124666 143986 171035 177566 9115 -30011 -203740 -331891 -302503
8556 -302503 -140709 -55962 -68133 15363 68925 -80228 -150618 -160008 -89475 38605 10093
8545 10093 17685 141017 111386 48871 18894 -53528 69942 166516 135363 113854 71293 7504
8533 7504 -8353 23483 -6048 13182 170 83771 237278 100455 77449 114135 163448 228335
8521 228335 199549 204616 151508 55326 48126 -30463 97293 172866 94433 -50759 -44589 -20034
8509 -20034 -80348 -40395 -94053 -32506 -55064 -61745 -128261 -38537 77404 212109 199580 147758
8497A47758j10003N5918M6030K4009N0058J2756M7256Q6977m2070K3618Q948q0809
8485B70446k354p8938m8638q5431R5986J3306l6889m0172l5337P6381o6111j06547
8473d4298O2066J08452r9906j6561L4753O2916K3807m8701L3800N9126N1058N5350
8461B81862k5037M3926o8679j8455L2775j33369r8609J41782m8686l824R2894
8450A96580Q332m7199N1661L2683J22454Q1985m0646j38642m3291Q0628r718k6206
8438B68621L702K6192J0175K0302O6595N751m8727p1493J1678Q5763J29651J34679
8426F42889K20786L31600K28293n0539j15143P2839M0392m8108K9946O3960J8231
8415A435146k41431l52648k91093j09931K3535l2410L8847j03450j62554J38358
$$ plain form
8497 147758 37755 93673 139703 163712 213770 226526 273782 360759 318689 342307 351255 270446
8485 270446 268092 189154 140516 55085 151071 164377 127488 87316 51979 128360 62249 -44298
8473 -44298 17768 126220 26314 9753 44506 107422 131229 82528 116328 175454 226512 281862
8461 281862 256825 300751 232072 213617 246392 113023 14414 156196 107510 103686 196580
8450 196580 204912 157713 209374 242057 364511 446496 405850 267208 223917 304545 294827 268621
8438 268621 272323 298515 308690 328992 395587 401338 352611 281118 292796 378559 508210 642889
8426 642889 863675 1195275 1423568 1373029 1257886 1330725 1371117 1323009 1352955 1416915 1435146
8415 1435146 1193715 841067 549974 440043 463578 431168 470015 366565 204011 342369
8405C42369O0069J2460N6341m4784m9297j3841n401j20525j08786O0991J59310
8394C48906O8327p1869l4688K768n4343j23176n955J51551K05453N5739p3272
8383D69441M6527K19381L63108N04017L36263J89929P4754p6913j46154k8030
8373A952323J49635K65993k28220n27148m51196j56970j99858k16405q3547r8658
8363D05949L484m7931j72543l8602R2314J64503p933n6396o364J5923N0142M4862
8351D47408P5158Q1616J2450j25217m6921j2203j6132N2586K06932J43719p519
8340H11877q610J3446P1849J81179M3494K39401L28322K26065R4378J16791J8648
8329B136840J36289L95514M44680N06084O74709J186811K107968K973395K865727
$$ plain form
8405 342369 402438 414898 471239 426455 377158 363317 357916 237391 128605 189596 348906
8394 348906 417233 345364 310676 313444 259101 135925 129970 281521 486974 542713 469441
8383 469441 515968 735349 1098457 1602474 1938737 2128666 2203420 2126507 1980353 1952323
8373 1952323 2101958 2367951 2139731 1612583 1161387 1004417 804559 588154 504607 405949
8363 405949 409433 361502 188959 150357 242671 407174 399241 342845 336481 352404 402546 447408
8351 447408 522566 604182 616632 491415 444494 432291 416159 468745 675677 819396 811877
8340 811877 803267 816713 888562 1069741 1113235 1352636 1680958 1907023 2001401 2118192 2136840
8329 2136840 2273129 2668643 3113323 3619407 4294116 5480927 7588895 10562290 13428017
8320A3428017J417466K78972j14802k53884q4159M90778R38184p28440l669554
8311A1702578l752223k308086j280314o42080m72838k58870k28948k53822j71308
8302B334089k9534r6974j44356j70195m4623k0497m2395K4898k9039q7112R998
8291A704260N1041K63758J46393M9211J97587L72921L13136M67179P25745P75451
8281E066682J429067K310400L677301N604197O312057M158437R98920k46223l30154
8272B8980684k81589L05832J845262P90936n455137p939963n611761l119056j864715
8263G650493j136984o93147n89833l85670k72360k86809l78386l98577l99853
8254C108874j74115j67184j59693m3997q3549n4373J00114j2598j2874M7066j54880
$$ plain form
8320 13428017 14845483 15124455 15009653 14755769 14671610 15162388 16100572 15372132 11702578
8311 11702578 7950355 5642269 4361955 3719875 3247037 2988167 2759219 2505397 2334089
8302 2334089 2304555 2207581 2063225 1893030 1848407 1827910 1785515 1810413 1781374 1694262 1704260
8291 1704260 1755301 2019059 2165452 2214663 2412250 2785171 3098307 3565486 4291231 5066682
8281 5066682 6495749 8806149 12483450 18087647 24399704 28558141 29557061 29310838 28980684
8272 28980684 28699095 29004927 30850189 31641125 26185988 18246025 12634264 9515208 7650493
8263 7650493 6513509 5820362 5230529 4844859 4572499 4285690 3907304 3508727 3108874
8254 3108874 2934759 2767575 2607882 2563885 2480336 2425963 2526077 2513479 2500605 2547671 2392791
8243B392791j1347l6474K62841K16049K94647L09288N56539Q22924J425003K251768
8233H484029K911529K450102J056015M0969r963j38656M250M99090O32810j376560
8223A4553615l573562l214359j994757j212872o81903m77049k97112k90602l45965
8214B465434l03759p2833j25825k00952k4344r4332j85728j20697q7084n6776
8204A193104m7829K4132N6998p9365j55760N6957Q5751j69436q4929k2224k013
8193H55386n6930p0828J5953j27635r6874p844j1216n4402n6205O5171M008j2053
8181D46531k222N6099Q9295k3458K2281N8390n2171j26102J7913J33591M2269
8170F62416j60490l7243j11944J3551k4207k0719K7250L6778j8479L8347p1095
$$ plain form
8243 2392791 2381444 2344970 2607811 2823860 3118507 3427795 3984334 4807258 6232261 8484029
8233 8484029 11395558 13845660 14901675 14942644 14932681 14794025 14798275 15297365 15930175 14553615
8223 14553615 10980053 7765694 5770937 4558065 3876162 3399113 3102001 2811399 2465434
8214 2465434 2161675 2088842 1963017 1762065 1737721 1643389 1457661 1336964 1249880 1193104
8204 1193104 1145275 1169407 1226405 1147040 991280 1048237 1133988 964552 879623 857399 855386
8193 855386 798456 727628 743581 615946 519072 511228 500012 445610 389405 454576 458584 446531
8181 446531 444309 500408 589703 566245 588526 646916 594745 468643 486556 620147 662416
8170 662416 501926 464683 352739 366290 342083 321364 348614 385392 366913 405260 334165
8159C34165j00824K7247p7160j18227j4419J6578m8841O6877R9642Q3093Q2153
8148C50284o8611k40050o8456L4296J43794O057n1200l8121j05795J17737J79775
8137B59710m2811l7287J8291M3713n6224J5692P0759J32939q4620j10462o8162
8126A41538o7478j78998j27080j1689N8008k3037Q9030Q5774q4692J6194j0876
8115a13306O0627N5742j2913J8351J0500o7031J17045M1353m5277o7290j22745
8104a24944K196J67734R2452N1412O8689l9325M2431j60615j19838l6310R0404
8093C4286J43582L5555r0174P3136M5952j01449o1375K7555P6271M1310p4129
8082A50520j80731l0923J8133Q1069J32533j4775q3784L4010K8686q3060k2059
$$ plain form
8159 334165 233341 260588 183428 65201 50782 67360 18519 85396 185038 268131 350284
8148 350284 281673 41623 -26833 7463 151257 157314 106114 67993 -37802 79935 259710
8137 259710 216899 179612 197903 241616 185392 201084 271843 404782 320162 209700 141538
8126 141538 74060 -104938 -232018 -243707 -185699 -208736 -119706 -33932 -118624 -102430 -113306
8115 -113306 -52679 3063 -9850 8501 19001 -48030 69015 110368 65091 -2199 -124944
8104 -124944 -122748 44986 137438 188850 257539 218214 260645 100030 -19808 -56118 34286
8093 34286 177868 213423 123249 196385 242337 140888 79513 107068 183339 224649 150520
8082 150520 -30211 -61134 -43001 38068 170601 155826 72042 106052 134738 51678 29619
8071B9619K8890n732n0569n3269j6948M8441n7321m0881O5628M0741j20651J10092
8059b1960r1535j13683J41444N6453p051n4487K2933K1085J34438K8306q5081
8048C0862j90709Q564J57623j7391j22643m852k7230P373M1486R6460P473L5927
8036B2943P5179N645M3856j563j68535K9216j6356p8242J08632J22381o285J27302
8024B64173O6674j19791j04678Q073p9366j38710P4373M1564p57J9016m1992m4624
8012e6045M5839K3829r9969l8572Q1548N6050o5950k0903j1309Q2083R1960J0386
8000I8947n0810O6356J5977j23281J0105P8295j03748P7857K9405j52052j38363
7989a91312J6164L0519J21170J34968L6383o7573p7340j2447m5542J14678J9023
$$ plain form
8071 29619 58509 52777 2208 -51061 -68009 -19568 -76889 -117770 -52142 -11401 -132052 -21960
8059 -21960 -113495 -227178 -85734 -29281 -36332 -90819 -67886 -46801 87637 115943 30862
8048 30862 -159847 -151283 6340 -11051 -133694 -138546 -165776 -158403 -116917 -20457 -12984 22943
8036 22943 98122 103767 147623 146060 -22475 6741 -9615 -87857 20775 143156 136871 264173
8024 264173 330847 211056 106378 114451 35085 -103625 -29252 12312 11555 30571 -11421 -56045
8012 -56045 -10206 13623 -86346 -124918 -43370 12680 -53270 -74173 -85482 -3399 88561 98947
8000 98947 48137 114493 130470 7189 17294 95589 -8159 69698 99103 -52949 -191312
7989 -191312 -175148 -144629 -23459 111509 147892 80319 2979 -9468 -55010 59668 78691
7978G8691l2652r3379l2311m1284L5958L0473j8499J04066M5673j17651o1734
7967a02649k8586R5041J5714j15823q8300K1592J07622J8333n8483J6338j3483
7956a32684k3242M7768N3998L7697J21179N9031K8297l620o5955n7560m673p3356
7944a3120n4642j3155Q0290q4514L3028k1147Q914L618N7663J24314R8288j6273
7932B03264p3695N6610J91834O9454j87736j70245j9234M1603N0991J11085N9870
7921C33801j10882N5278k6636j10070j58563n0288O8165N8148j45008j52560k2494
7910b61109R7600J29495R9056N3393l9278J1689j4238j33893N4178P9178L5939
7899A12010o172o2441N3579o4650l7543L3217L0787n8868p1163j38375J45053
$$ plain form
7978 78691 46039 -47340 -79651 -120935 -84977 -54504 -73003 31063 76736 -40915 -102649
7967 -102649 -131235 -36194 -20480 -136303 -224603 -203011 -95389 -77056 -135539 -119201 -132684
7956 -132684 -155926 -108158 -54160 -16463 104716 163747 192044 188424 122469 64909 60236 -13120
7944 -13120 -67762 -80917 -627 -85141 -52113 -73260 -64346 -60728 -3065 121249 219537 203264
7932 203264 129569 186179 378013 447467 259731 89486 70252 111855 162846 273931 333801
7921 333801 222919 278197 251561 141491 -17072 -67360 805 58953 -86055 -238615 -261109
7910 -261109 -163509 -34014 65042 118435 79157 90846 76608 -57285 -3107 76071 112010
7899 112010 105838 43397 96976 32326 -5217 28000 58787 -81 -71244 -209619 -64566
7888f4566Q0953l6928q329n7100r2581l1733P2231K1211O2719J06434L991J2652
7876F8954M3653Q7292p1628j06209J8056J17067J1001j1848l4498N1078p7416
7865I5502p1346K4569j10085l1120M1361j3433L5592j8339o0172o946l4386P0092
7853g8711J7588l4967L1237N7695j0519L0925J9837K9360J38857l3912j14416
7842E2974N2359K7137Q383j60875j01652N6880Q73J40053o3768r7014M9746L9173
7830D269K6902R1144l0629L5250l0044k04724m4387J35064k6298Q836L2353N480
7818C216j9408J06396L3091J7475m1283r3240j06537O2158M0662J2108o8581j2846
7806f6789O4112k6318m5165L4130m3537k6405j8860P979M9229J1198Q012n1772
$$ plain form
7888 -64566 16387 -20541 -28870 -85970 -178551 -210284 -138053 -116842 -54123 52311 56302 68954
7876 68954 112607 199899 128271 22062 40118 157185 168186 156338 121840 172918 95502
7865 95502 24156 48725 -61360 -92480 -51119 -64552 -28960 -47299 -107471 -114417 -148803 -78711
7853 -78711 -61123 -96090 -64853 -7158 -17677 13248 33085 62445 201302 167390 52974
7842 52974 105333 132470 140853 -20022 -121674 -64794 -63921 76132 12364 -84650 -34904 4269
7830 4269 31171 122315 91686 126936 96892 -107832 -152219 -17155 -43453 -34617 -2264 3216
7818 3216 -16192 90204 123295 140770 99487 6247 -100290 -38132 2530 14638 -53943 -66789
7806 -66789 -2677 -28995 -74160 -40030 -83567 -109972 -128832 -120853 -71624 -60426 -52414 -104186
7794a04186l0224k7463J8952J5422o1524o2027J1613O8786l8133k7822O4501M805
7782a67300o5114m2674L717J00827P5474M3955o9323j3247Q3534M9434N3136Q5553
7770A37972O8521j01185j54421r637J40232n7699j47259O0510j8914p9139K1036
7759a39983J5680m2379R214J3775j04996R3102R3133j42450n2525J5134K60369
7748A8074J5407J5891m0465r4157o0684r0903Q1J16078J22766R6751N3410J478
7736A53727j51520j6004O4184o6297k4320n6540k5826O4712j6478J220O762J10180
7724D3800N9462q5645m1131R791J37430J33403p3295q3260P6054j4085n7474l7995
7712F7055r1877m2156p2270N1205M5964J35273J6781k39602q8264R2884R5866
$$ plain form
7794 -104186 -134410 -161873 -142921 -127499 -189023 -251050 -239437 -170651 -208784 -236606 -172105 -167300
7782 -167300 -232414 -275088 -271371 -170544 -95070 -51115 -120438 -133685 -50151 -717 52419 137972
7770 137972 206493 105308 -49113 -58750 81482 23783 -123476 -62966 -81880 -161019 -139983
7759 -139983 -124303 -166682 -157468 -143693 -248689 -155587 -62454 -204904 -257429 -242295 18074
7748 18074 33481 49372 8907 -85250 -145934 -236837 -236756 -120678 2088 98839 152249 153727
7736 153727 2207 -13797 50387 -15910 -40230 -96770 -122596 -57884 -74362 -73142 -66380 43800
7724 43800 103262 17617 -23514 -13723 123707 257110 183815 100555 176609 162524 105050 67055
7712 67055 -24822 -66978 -139248 -88043 -42079 93194 109975 -129627 -217891 -125007 -29141
7701b9141n3277j4670k6877m7601N393Q4941J37575p6749r2480n5661L1814J23807
7689a2926m0817o8857M3462J06961r5622n6670J10763M4055n3289k6513L0947
7678a8506J2075P4019J1111k7707J6660J4012o8273n8739q2019L0575O0994l3716
7666f9514j15275q3659J05112q351N1978N1286Q0759L8415o0850p2140r644n3384
7654a45267N8537M3657K1260N2273R3599m2090j19975n5838O834j53711q0330
7643c21051J5512J18454J15582R6346P5774o3765J22133J00976k06002q0471M2049
7632A5537K8907N6346L4931n0714L195j62660j09489J00991J70051Q4528o5611
7621A06012o0076m6808J6830K9249m9211K8453J04154K8560r0362O52P5004j51355
$$ plain form
7701 -29141 -82418 -97088 -123965 -171566 -166173 -81232 56343 -20406 -112886 -168547 -136733 -12926
7689 -12926 -53743 -122600 -79138 27823 -67799 -124469 -13706 30349 -22940 -49453 -18506
7678 -18506 -6431 67588 78699 50992 67652 81664 13391 -45348 -127367 -96792 -35798 -69514
7666 -69514 -184789 -268448 -163336 -171687 -119709 -68423 12336 50751 -10099 -82239 -91883 -145267
7654 -145267 -86730 -43073 -21813 30460 124059 81969 -38006 -93844 -87010 -240721 -321051
7643 -321051 -305539 -187085 -71503 24843 100617 36852 158985 259961 53959 -26512 15537
7632 15537 44444 100790 135721 85007 88202 -74458 -183947 -82956 87095 171623 106012
7621 106012 45936 -872 15958 45207 -4004 24449 128603 157163 66801 67453 142457 -8898
7609h898j50619k2090N6815J24537l4657O394p4768p6755j4700J15274J70785
7598I1318l0069j19676l0033j1593k8922J07683J28940R6125J480k00423j82460
7587a77630M5636M3371l1556r073j3400P4815p4000M0554J07693K6007j04776
7576g2359l2156j2015J6796K6787p0909q257K5597q0987o5835M0837N6212j3237
$$ plain form
7609 -8898 -159517 -181607 -124792 -255 -34912 -28518 -103286 -180041 -194741 -79467 91318
7598 91318 61249 -58427 -88460 -100053 -128975 -21292 107648 203773 205253 4830 -177630
7587 -177630 -131994 -88623 -120179 -129252 -142652 -67837 -141837 -101283 6410 32417 -72359
7576 -72359 -104515 -116530 -99734 -72947 -143856 -152113 -126516 -207503 -273338 -232501 -176289 -189526
$$ [...]
##END NTUPLES=NMR SPECTRUM
##END=
