##TITLE=Analysis number 320272
Compound Code ac 14623
Project Code adrs
Chemist Name acros
##JCAMPDX= 6.0         $$ Bruker NMR JCAMP-DX V2.0
##DATA TYPE= NMR SPECTRUM
##DATA CLASS= NTUPLES
##ORIGIN= Bruker BioSpin GmbH
##OWNER= nmr
$$ XWIN-NMR		Version 3.5
$$ Tue Jun 20 11:24:52 2006 GMT Daylight Time (UT+1h)  MAYBRIDGE\nmr@NMR_250MHZ
##.OBSERVE FREQUENCY= 250.131544655141
##.OBSERVE NUCLEUS= ^1H
##.ACQUISITION MODE= SIMULTANEOUS (DQD)
##.ACQUISITION SCHEME= undefined
##.AVERAGES= 16
##.DIGITISER RES= 18
##SPECTROMETER/DATA SYSTEM= dpx250
##.PULSE SEQUENCE= zg30
##.SOLVENT NAME= DMSO
##.SHIFT REFERENCE= (INTERNAL, DMSO, 0, 16.522)
##AUDIT TRAIL= $$ (NUMBER, WHEN, WHO, WHERE, WHAT)
$$ ##TITLE= Audit trail, XWIN-NMR		Version 3.5
$$ ##JCAMPDX= 5.01
$$ ##ORIGIN= Bruker BioSpin GmbH
$$ ##OWNER= nmr
$$ C:\u/data/dgb/nmr/ADRS/1120/pdata/1/auditp.txt
$$ ##AUDIT TRAIL=  $$ (NUMBER, WHEN, WHO, WHERE, WHAT)
(   1,<2006-06-20 11:24:18.53 +100>,<MAYBRIDGE\nmr>,<NMR_250MHZ>,
      <created by zg, POWCHK disabled, PULCHK disabled
       configuration hash MD5:
       E2 DF 36 D8 04 B2 41 60 5A D7 A3 38 5A 4B D0 FE
       data hash MD5: 64K
       F7 5C 04 4C 92 1A E3 51 42 61 94 06 25 53 11 F3>)
(   2,<2006-06-20 11:24:33.87 +100>,<MAYBRIDGE\nmr>,<NMR_250MHZ>,
      <Start of raw data processing
       ef LB = 0.3 FT_mod = 6 PKNL = 1 SI = 32K 
       data hash MD5: 32K
       C1 A9 E0 9E 4B 59 08 A7 2E A8 06 12 8E 0D C5 E9>)
(   3,<2006-06-20 11:24:37.53 +100>,<MAYBRIDGE\nmr>,<NMR_250MHZ>,
      <apk 
       data hash MD5: 32K
       50 B1 F9 03 4A 13 6D DC D9 40 22 60 0B F7 FE F9>)
(   4,<2006-06-20 11:24:38.71 +100>,<MAYBRIDGE\nmr>,<NMR_250MHZ>,
      <abs ABSG = 5 
       data hash MD5: 32K
       A1 74 0D 04 D8 3F E1 1C 97 66 06 F5 17 94 FB 49>)
$$ ##END=
$$ 
$$ hash MD5
$$ 12 EF 0E 85 68 D6 9C 62 7F 72 AE 98 66 62 1E D5
##$RELAX= 
##$RELAX= 
##$RELAX= 
##$RELAX= 
##$RELAX= 
##$RELAX= 
##$RELAX= 
$$ Bruker specific parameters
$$ --------------------------
##$DU= <C:\u>
##$EXPNO= 1120
##$NAME= <ADRS>
##$PROCNO= 1
##$TYPE= <nmr>
##$USER= <dgb>
##$AMP= (0..31)
100 100 100 100 100 100 100 100 100 100 100 100 100 100 100 100 100 100 
100 100 100 100 100 100 100 100 100 100 100 100 100 100 
##$AQSEQ= 0
##$AQ_mod= 3
##$AUNM= <au_zg>
##$AUTOPOS= <19 >
##$BF1= 250.13
##$BF2= 250.13
##$BF3= 250.13
##$BF4= 250.13
##$BF5= 500.13
##$BF6= 500.13
##$BF7= 500.13
##$BF8= 500.13
##$BYTORDA= 1
##$CFDGTYP= 0
##$CFRGTYP= 5
##$CHEMSTR= <none>
##$CNST= (0..31)
1 1 145 1 1 1 1 1 1 1 1 1 1 1 1 1 1 1 1 1 1 1 1 1 1 1 1 1 1 1 1 1 
##$CPDPRG= <>
##$CPDPRG1= <>
##$CPDPRG2= <>
##$CPDPRG3= <>
##$CPDPRG4= <mlev>
##$CPDPRG5= <mlev>
##$CPDPRG6= <mlev>
##$CPDPRG7= <mlev>
##$CPDPRG8= <mlev>
##$CPDPRGB= <>
##$CPDPRGT= <>
##$D= (0..31)
0 1 0 0 0 0 0 0 0 0.06 0 0 0 0 0 0 0.0002 0 0 0 0 0 0 0 0 0 0 0 0 0 0 
0 
##$DATE= 1150799057
##$DBL= (0..7)
120 120 120 120 120 120 120 120 
##$DBP= (0..7)
150 150 150 150 150 150 150 150 
##$DBP07= 0
##$DBPNAM0= <>
##$DBPNAM1= <>
##$DBPNAM2= <>
##$DBPNAM3= <>
$$ [...]
##$SUBNAM7= <"">
##$SUBNAM8= <"">
##$SUBNAM9= <"">
##$SW= 20.6930455092707
##$SWIBOX= (0..15)
0 0 3 0 0 0 0 0 0 0 0 0 0 0 0 0 
##$SW_h= 5175.983436853
##$TD= 65536
##$TD0= 1
##$TE= 294.16
##$TE2= 300
##$TE3= 300
##$TEG= 300
##$TL= (0..7)
0 120 120 120 120 120 120 120 
##$TP= (0..7)
150 150 150 150 150 150 150 150 
##$TP07= 0
##$TPNAME0= <>
##$TPNAME1= <>
##$TPNAME2= <>
##$TPNAME3= <>
##$TPNAME4= <>
##$TPNAME5= <>
##$TPNAME6= <>
##$TPNAME7= <>
##$TPOAL= (0..7)
0.5 0.5 0.5 0.5 0.5 0.5 0.5 0.5 
##$TPOFFS= (0..7)
0 0 0 0 0 0 0 0 
##$TUNHIN= 0
##$TUNHOUT= 0
##$TUNXOUT= 0
##$USERA1= <user>
##$USERA2= <user>
##$USERA3= <user>
##$USERA4= <user>
##$USERA5= <user>
##$V9= 5
##$VALIST= <valist>
##$VCLIST= <CCCCCCCCCCCCCCC>
##$VD= 0
##$VDLIST= <DDDDDDDDDDDDDDD>
##$VPLIST= <PPPPPPPPPPPPPPP>
##$VTLIST= <TTTTTTTTTTTTTTT>
##$WBST= 1024
##$WBSW= 4
##$XGAIN= (0..3)
0 0 0 0 
##$XL= 0
##$YL= 0
##$YMAX_a= 327910
##$YMIN_a= -476500
##$ZGOPTNS= <>
##$ZL1= 120
##$ZL2= 120
##$ZL3= 120
##$ZL4= 120
##$ABSF1= 16.522
##$ABSF2= -4.171173
##$ABSG= 5
##$ABSL= 3
##$ALPHA= 0
##$AQORDER= 0
##$ASSFAC= 0
##$ASSFACI= 0
##$ASSFACX= 0
##$ASSWID= 0
##$AUNMP= <proc_1d>
##$AZFE= 0.1
##$AZFW= 0.1
##$BCFW= 0
##$BC_mod= 0
##$BYTORDP= 0
##$COROFFS= 0
##$CY= 12.5
##$DATMOD= 1
##$DC= 0
##$DFILT= <>
##$DTYPP= 0
##$F1P= 14.0000005364418
##$F2P= -0.99999901652339
##$FCOR= 0.5
##$FTSIZE= 32768
##$FT_mod= 6
##$GAMMA= 0
##$GB= 0
##$INTBC= 1
##$INTSCL= 1
##$ISEN= 128
##$LB= 0.3
##$LEV0= 0
##$LPBIN= 0
##$MAXI= 10000
##$MC2= 0
##$MEAN= 0
##$ME_mod= 0
##$MI= 0
##$NCOEF= 0
##$NC_proc= -5
##$NLEV= 6
##$NOISF1= 0
##$NOISF2= 0
##$NSP= 0
##$NTH_PI= 0
##$NZP= 0
##$OFFSET= 16.522
##$PC= 1
##$PHC0= 165.6511
##$PHC1= 10.80838
##$PH_mod= 1
##$PKNL= yes
##$PPARMOD= 0
##$PSCAL= 4
##$PSIGN= 0
##$REVERSE= no
##$SF= 250.13
##$SI= 32768
##$SIGF1= 0
##$SIGF2= 0
##$SINO= 400
##$SIOLD= 32768
##$SREGLST= <1H.DMSO>
##$SSB= 0
##$STSI= 32768
##$STSR= 0
##$SW_p= 5175.98343685301
##$SYMM= 0
##$S_DEV= 0
##$TDeff= 65536
##$TDoff= 0
##$TI= <Analysis number 999999
Compound Code 99
Book Reference 9
Project Code 9>
##$TILT= no
##$TM1= 0
##$TM2= 0
##$TOPLEV= 0
##$USERP1= <user>
##$USERP2= <user>
##$USERP3= <user>
##$USERP4= <user>
##$USERP5= <user>
##$WDW= 1
##$XDIM= 32768
##$YMAX_p= 468303776
##$YMIN_p= -848281
$$ End of Bruker specific parameters
$$ ---------------------------------
##NTUPLES= NMR SPECTRUM
##VAR_NAME=  FREQUENCY,     SPECTRUM/REAL,   SPECTRUM/IMAG
##SYMBOL=    X,             R,               I
##VAR_TYPE=  INDEPENDENT,   DEPENDENT,       DEPENDENT
##VAR_FORM=  AFFN,          ASDF,            ASDF
##VAR_DIM=   32768,         32768,           32768
##UNITS=     HZ,            ARBITRARY UNITS, ARBITRARY UNITS
##FACTOR=    0.157963299565203, 1,           1
##FIRST=     4132.6476996994, 0,             0
##LAST=      -1043.33573715361, 0,           0
##MIN=       -1043.33573715361, -848281,     0
##MAX=       4132.6476996994, 468303776,     0
$$ Real data points
##PAGE= N=1
##DATA TABLE= (X++(R..R)), XYDATA
$$ [...]
25317e5507n8704j04409P8988K03956L601P860j36027k41643L3857J66223K7489
$$ -55507 -114211 -218620 -139632 64324 67925 75785 -60242 -301885 -268028 -101805 -74316
25306g4316J04143M6171J06040k8236k04462P9742J56468q5220p6654K03221J92767
$$ -74316 29827 75998 182038 153802 -50660 29082 185550 100330 23676 226897 419664
25295D19664J15668j9889k22101j71703k21506J28J92447R2620J76076q4370K1377
$$ 419664 535332 515443 293342 121639 -99867 -99739 92708 185328 361404 277034 298411
25284B98411p1887R3606J71728K4985j93204k26948o4443k6032j3333J18974R3172
$$ 298411 226524 320130 491858 516843 323639 96691 32248 6216 -7117 111857 205029
25273B05029m9441j85621k0176l7938j67393L8810O7490j8908R4681J44879o0747
$$ 205029 155588 -30033 -50209 -88147 -255540 -216730 -149240 -168148 -73467 71412 10665
25262A0665j07821O5447k1472j33353J32948K74340J2785q8736r6781j7096K44364
$$ 10665 -97156 -31709 -53181 -186534 -53586 220754 233539 144803 48022 30926 275290
25251B75290m7250j81134m1678M434L5532n4597l2843R7182J22040k1606p5059
$$ 275290 228040 46906 5228 9662 45194 -9403 -42246 54936 176976 155370 80311
25240H0311j02462P966j4829K05272P144m6769O3961J18814J34941P0342k00858
$$ 80311 -22151 -14185 -29014 176258 183402 136633 200594 319408 454349 524691 323833
25229C23833k12868k21060l858J20223J02583N1030l09429j68055N3346K35983
$$ 323833 110965 -110095 -113953 6270 108853 159883 -149546 -317601 -264255 -28272
25219b8272K89704j86664p2379J5288Q1529k6986J18087J16095o8507J14602M4076
$$ -28272 261432 74768 2389 17677 99206 72220 190307 306402 237895 352497 396573
25208C96573j36830j37604q3135O4942m9558k18698m8652m048n5011O2958Q5633
$$ 396573 259743 122139 39004 103946 54388 -164310 -212962 -217010 -272021 -209063 -123430
25197a23430p2987j66602M8723P9969M4623n3126p8785J49595J81263J97267L9119
$$ -123430 -196417 -363019 -314296 -234327 -189704 -242830 -321615 -172020 9243 206510 245629
25186B45629k90129m32454K5311R0847r1507J19652J31014L7105k7895l8229J50686
$$ 245629 -44500 -476954 -451643 -360796 -452303 -332651 -201637 -164532 -192427 -230656 -79970
25175g9970M7328J23726J34627n936K3975J04072j30504l51235j80235K41410
$$ -79970 -32642 91084 225711 219775 243750 347822 217318 -133917 -314152 -72742
25165g2742K68141M6904k6377J69463l7019k38217q9694o9070J10133n3249j69295
$$ -72742 195399 242303 215926 385389 348370 110153 20459 -48611 61522 8273 -161022
25154a61022K9645M7950j3495J4090k17721j13584K55067J22122J69990j45373
$$ -161022 -131377 -83427 -96922 -82832 -300553 -414137 -159070 -36948 133042 -12331
25144a2331p6505k0532O4376p2212j9095J58265j16425j69301k4305J098J72095
$$ -12331 -88836 -109368 -44992 -117204 -136299 21966 -94459 -263760 -288065 -286967 -114872
25133a14872J50871n5861J57264K58069k8400J3542r5488o1433k08007K86023
$$ -114872 35999 -19862 137402 395471 367071 380613 285125 223692 15685 301708
25123C01708Q910j33805k2300J45795l495k27007j94605j76542k12533R3905O7170
$$ 301708 310618 176813 154513 300308 296813 69806 -124799 -301341 -513874 -419969 -352799
25112c52799j7352K19632k9333o2835n32K6241M0684J66150j63995k51696k2735
$$ -352799 -370151 -150519 -179852 -242687 -243219 -216978 -176294 -10144 -174139 -425835 -448570
25101d48570N1710m3004M8722M7653J54569J48963l1663J55323J04166j14726
$$ -448570 -396860 -439864 -391142 -343489 -188920 -39957 -71620 83703 187869 73143
25091G3143j75281j19136n3546Q9830Q7515j3473L4792q2412J32887L8254l8232
$$ 73143 -102138 -221274 -274820 -184990 -97475 -110948 -76156 -158568 -25681 12573 -25659
25080b5659O079j78127j34930K63210L82752L9255l6858j24628m0578p1712l9293
$$ -25659 -19580 -197707 -332637 -69427 313325 352580 315722 191094 150516 78804 39511
25069C9511J40621j40414K1970K25697n7841n0728k21839r7207j74170j22204
$$ 39511 180132 39718 61688 287385 229544 178816 -43023 -140230 -314400 -436604
25059d36604K2350J29528O1711Q8241K5313J18323Q4568Q5320J41927j38036j41776
$$ -436604 -414254 -284726 -223015 -134774 -109461 8862 93430 178750 320677 182641 40865
25048D0865O865L1741k6859j10225q448q1780J593J53703J08523P7307j2414J01246
$$ 40865 47730 79471 52612 -57613 -66061 -147841 -146248 7455 115978 193285 180871 282117
25036B82117j5974p7064N4493l5963q4653j91687L0820J5587j3292j16950J09811
$$ 282117 266143 189079 243572 207609 122956 -68731 -37911 -22324 -35616 -152566 -42755
25025d2755j20409r566r2474N0995r0699p0125J65407K46599o1840j84116k87726
$$ -42755 -163164 -172730 -265204 -214209 -304908 -375033 -209626 36973 -24867 -208983 -496709
25014d96709J04648K85711M1227k1051J28058J9747k85650n5792J35307k3679
$$ -496709 -392061 -106350 -65123 -86174 41884 61631 -224019 -279811 -144504 -168183
25004a68183J6584K1476P3864k9316j44676J19082J346l3256o5944j98397r2973
$$ -168183 -151599 -130123 -56259 -85575 -230251 -111169 -109823 -143079 -209023 -407420 -500393
24993e00393P9606K64975J37810L7723r2245J90009O0168K050l8628p7724j6275
$$ -500393 -420787 -155812 -18002 19721 -72524 117485 177653 179703 141075 63351 47076
24982D7076m2163J85117J19071j0825J4151N4578j30581j7950p8715p5313O0152
$$ 47076 4913 190030 309101 298276 312427 367005 236424 218474 139759 64446 124598
24971A24598r7690k00964J01391K52917n2844n020o5997L3064M2600p2765R8727
$$ 124598 26908 -174056 -72665 180252 127408 122388 56391 89455 132055 59290 158017
24960A58017K0880O5959j3773r10l1646j2990k28973k9093Q9932J99004k6854
$$ 158017 178897 244856 231083 230173 198527 185537 -43436 -72529 17403 216407 189553
24949A89553k6310j23269q5109R134O128q9482j3042J27712K7384K0406j85119
$$ 189553 163243 39974 -45135 -36001 -29873 -119355 -132397 -4685 22699 43105 -142014
24938a42014O9510r8925j0011J34670p3541j66306L8539R0821k66852N2491K82735
$$ -142014 -72504 -171429 -181440 -46770 -120311 -286617 -248078 -157257 -424109 -371618 -88883
24927h8883J38475m9119o3276O5836J4731p296j7257k41325L3313K02799K8024
$$ -88883 49592 473 -62803 3033 17764 10468 -6789 -248114 -214801 -12002 16022
24916A6022o2852J6198M646J8089J62936L14169O8050j91458j65562O5954J33957
$$ 16022 -46830 -30632 -25986 -7897 155039 469208 537258 345800 180238 246192 380149
24905C80149j1450n2714j37993j89560q2056J58021o1709J20914L9624r563k24645
$$ 380149 368699 315985 177992 -11568 -93624 64397 2688 123602 163226 153663 -70982
24894g0982J39107k8143j38544l2920j08480K21504L5731r2539j76787N9862j61447
$$ -70982 68125 39982 -98562 -131482 -239962 -18458 17273 -75266 -252053 -192191 -353638
24883c53638j3124M3255K41115R5991q1515j75913l3681p2463R5894J17551J98923
$$ -353638 -366762 -323507 -82392 13599 -67916 -243829 -277510 -349973 -254079 -136528 62395
24872F2395j53460O0305J09823p1223k2220R7395N8936m06691j21906L7783K5292
$$ 62395 -91065 -30760 79063 7840 -14380 83015 141951 -264740 -386646 -348863 -323571
24861c23571J15034J29187N9883K9961J70023J79242p44p905j60011l6663o622
$$ -323571 -208537 -79350 -19467 10494 180517 359759 359015 351110 191099 154436 147814
24850A47814p9369l07770J67240K88229J44633k44448l05526j15620K71344J23384
$$ 147814 68445 -239325 -72085 216144 360777 116329 -189197 -304817 -33473 89911
24840H9911p7246j05276N0200l5181l6687M2082N8273K97544J3724j22809j12198
$$ 89911 12665 -92611 -42411 -77592 -114279 -72197 -13924 283620 297344 174535 62337
24829F2337Q2187n5831r2904Q5617m1432m8680j7568p2034j64364K9315m1882
$$ 62337 144524 88693 -4211 81406 39974 -8706 -26274 -98308 -262672 -233357 -275239
24818b75239j37711j66139J42110K24109K7037j8546J56769J61973j53447m5007
$$ -275239 -412950 -579089 -436979 -212870 -185833 -204379 -47610 114363 -39084 -84091
24808h4091J74271J67750J05678j61119l50339L8610K38885P546J10064p5090
$$ -84091 90180 257930 363608 202489 -147850 -109240 129645 137191 247255 172165
24798A72165L7795m5705n5935J65466q6849m073k12293p9790l1074p8910n0888
$$ 172165 209960 164255 108320 273786 186937 182864 -29429 -109219 -140293 -219203 -270091
24787b70091l1076J82242j3749k26234P3384K05345R1029j41023n9090R410o398
$$ -270091 -301167 -118925 -132674 -358908 -285524 -80179 10850 -130173 -189263 -179853 -186251
24776a86251L15169J67741k10695J87671N0078o5910k37347j02931K15113m7329
$$ -186251 128918 296659 85964 273635 323713 257803 20456 -82475 132638 85309
24766H5309j62212k2683l7825n773P4448K05858j1692j12311J20710j5495k40200
$$ 85309 -76903 -99586 -137411 -143184 -68736 137122 125430 13119 133829 118334 -121866
24755a21866L666J69392K38440K29802j49511j65179M7042j06193j35817j1265
$$ -121866 -118200 51192 289632 519434 369923 204744 251786 145593 9776 -1489
24745a489k1995M9682j7893K7480J26800M9154j71854j06199j1299m7378m4979
$$ -1489 -23484 26198 8305 35785 162585 211739 39885 -66314 -77613 -124991 -169970
24734a69970J84614K27569N0334j49718q6484j65196o560n0239J0249R2255r2994
$$ -169970 14644 242213 292547 142829 56345 -108851 -115411 -165650 -155401 -63146 -156140
24723a56140J2927k3027o934N2406J06289K4524J10383K93699L6769l79114k58061
$$ -156140 -143213 -166240 -173174 -120768 -14479 10045 120428 414127 450896 71782 -186279
24712a86279J51184K11009r4529j77562j38348J34476K27702J08550j04936j65774
$$ -186279 -35095 175914 81385 -96177 -234525 -100049 127653 236203 131267 -34507
24702c4507o2523j39581O921J19990K2474N3222j60357j47616J83531Q9270k825
$$ -34507 -97030 -236611 -229690 -109700 -87226 -34004 -194361 -341977 -158446 -69176 -72001
24691g2001p6766K74265K44189j08371l06150r949M0798K48924K3062j83850n171
$$ -72001 -148767 125498 369687 261316 -44834 -54783 -13985 234939 258001 74151 68980
24680F8980j24674J60120o5894k05367n2836K4958j64528L5009J35335L728J08464
$$ 68980 -55694 104426 38532 -166835 -219671 -194713 -359241 -324232 -188897 -185169 -76705
24669g6705j49192m8642Q8111K246j08802p0606J66902K70563R251j6627l6873
$$ -76705 -225897 -274539 -186428 -184182 -292984 -363590 -196688 73875 83126 66499 29626
24658B9626k17K4824p723J11678J66613N0246J29958j07825k61815k54465M2896
$$ 29626 29409 54233 46510 158188 324801 375047 505005 397180 135365 -119100 -76204
24647g6204L3922p207N865o8554j0947J08143J89910q968L1458j90712j65052
$$ -76204 -42282 -49489 -43624 -112178 -123125 -14982 174928 165960 197418 6706 -158346
24636a58346l1514j19531j93060J25572j3083J8490Q9595J32920M9002O3489j23467
$$ -158346 -189860 -309391 -502451 -376879 -389962 -371472 -281877 -148957 -99955 -36466 -159933
24625a59933J15482L5062k38223Q3620K54696O2710k01267j00042Q2443K5398
$$ -159933 -44451 -9389 -247612 -163992 90704 153414 -47853 -147895 -65452 -40054
24615d0054J35500Q3354r8701n9712p3338J8352k1429L1234M6926p2414O6984
$$ -40054 95446 178800 80099 20387 -52951 -34599 -56028 -24794 22132 -50282 16702
24604A6702l6157k43993p3281J86347K99694J91598k18697j87372o0434q3273
$$ 16702 -19455 -263448 -336729 -150382 149312 340910 122213 -65159 -125593 -208866
24594b08866r5048K2342J90279O2802J35568m7073p9275j7682K26292K02532j53852
$$ -208866 -303914 -281572 -91293 -28491 107077 60004 -19271 -36953 189339 391871 238019
24583B38019R3946l4850q6650R6110k73207j08901L6046j58294L6947J51285l4120
$$ 238019 331965 297115 210465 306575 33368 -75533 -39487 -197781 -160834 -9549 -43669
24572d3669p310j13156R0410J9012K9729Q2025p2556r2999j600r9550J17277J26187
$$ -43669 -50979 -164135 -73725 -54713 -24984 57041 -15515 -108514 -110114 -209664 -92387 33800
24560C3800k54190j68549J7964K94060K39972r1911J776J01116N8508r3467j25651
$$ 33800 -220390 -388939 -370975 -76915 163057 71146 72922 174038 232546 139079 13428
24549A3428P2706K9101O6582j34917j64069j1370L0895J03406j83021J65982l5469
$$ 13428 86134 115235 181817 46900 -117169 -128539 -97644 5762 -177259 -11277 -46746
24538d6746l484j20785p7671p7187J14730m0875j8826M5364L1408M050N7720M0186
$$ -46746 -50230 -171015 -248686 -325873 -211143 -252018 -270844 -225480 -194072 -190022 -132302 -92116
24526i2116j64733R8031J90799Q423q9548q784l2572P434J59191l4305J88702
$$ -92116 -256849 -158818 31981 40404 -49144 -57928 -90500 -83066 76125 41820 230522
24515B30522l886j65433J59849N7068k0391q3726j13542J4614M4294P7944j44049
$$ 230522 226636 61203 221052 278120 257729 174003 60461 75075 119369 197313 53264
24504E3264l7689j8567n2745j22756J44394K02937J53457j03799k86920o5925
$$ 53264 15575 -2992 -55737 -178493 -34099 168838 322295 218496 -68424 -134349
24494a34349K66507N6086j83633j13568R1793P2360k4388K9768N3483k45103j23783
$$ -134349 132158 188244 4611 -108957 -17164 55196 30808 60576 114059 -131044 -254827
24483b54827K71422K61063j43552L4493J3923k34454P7889J14674j18925j06775
$$ -254827 16595 277658 134106 168599 182522 -51932 25957 140631 21706 -85069
24473h5069o85N9098N3359k03009j79422N6747J78187K92468K9244k05588j0415
$$ -85069 -85754 -26656 26703 -176306 -355728 -298981 -120794 171674 200918 -4670 -15085
24462a5085j96550K5638K46315J73069N8829j80244M4660j3879o6118J2766q1829
$$ -15085 -211635 -185997 60318 233387 292216 111972 156632 142753 76635 89401 7572
24451G572r6317j26857O0765J77478J82538n7489k9642l2525n158J05530m3062
$$ 7572 -88745 -215602 -154837 22641 205179 147690 118048 85523 80365 185895 142833
24440A42833j6079P956j65934l5191R6148K1271P2249J33956J20732m2111q0324
$$ 142833 126754 134710 -31224 -66415 29733 51004 123253 257209 377941 335830 255506
24429B55506M7322m7060j73097p9181J97807j45054J0129j2535k42176j21032
$$ 255506 302828 255768 82671 3490 201297 56243 66372 53837 -188339 -309371
24419c09371l098J94891R3445j9911r6924n0491P1420M3928J99939J43016Q1236
$$ -309371 -312469 -117578 -24133 -44044 -140968 -191459 -120039 -76111 123828 266844 348080
24408C48080j17671K1348N3243j51831p4390q7829j3477J60802J1065j22790k22073
$$ 348080 230409 251757 305000 153169 78779 -9050 -22527 138275 149340 26550 -195523
24397a95523q298l9498J92991j46510j25055R3710J10423J55806r408l7143N1365
$$ -195523 -203821 -243319 -50328 -196838 -321893 -228183 -117760 38046 28638 -8505 42860
24386D2860J5701p4546j01279J240J74888q4573j13829j44380K29835M1379l3508
$$ 42860 58561 -15985 -117264 -116024 58864 -25709 -139538 -283918 -54083 -12704 -46212
24375d6212M2887k1254j44974K1696J93469O874j27232o6518J20346O4345P1781
$$ -46212 -3325 -24579 -169553 -147857 45612 52486 -74746 -141264 -20918 43427 115208
24364A15208j30758j26906j1224N91P8850J23514p3674j85316j8111J93043J0428
$$ 115208 -15550 -142456 -153680 -153089 -74239 49275 -24399 -209715 -227826 -34783 -24355
24353b4355L4017J25120p58r7312L8617l5299r1201r5033J40382L2504J6499J15616
$$ -24355 9662 134782 134024 36712 75329 40030 -51171 -146204 -5822 26682 43181 158797
24341A58797j138k8552k5674j65816M8148J80698L2344j43932k23984R9085K37572
$$ 158797 157659 129107 103433 -62383 -14235 166463 198807 54875 -169109 -70024 167548
24330A67548N9187q9518p9282j01807J47082m3578N4195L9110j70990j89850m0557
$$ 167548 226735 137217 57935 -43872 103210 59632 113827 152937 -18053 -207903 -248460
24319b48460J14933j40265n7756L9527K53682J06787J1439j30001k26824L6928
$$ -248460 -133527 -273792 -331548 -292021 -38339 68448 79887 -50114 -276938 -240010
24309b40010P2776n0141j7115L9003N6222L1344J32947M801J60850q7907P2623
$$ -240010 -167234 -217375 -234490 -195487 -139265 -107921 25026 29827 190677 102770 175393
24298A75393k1979J05399k24349l1759J40783J12675q1517j13894p122p2741l28238
$$ 175393 153414 258813 34464 2705 143488 256163 174646 60752 53630 -19111 -347349
24287c47349j17371L7503K52005K29737J36590M1784k18601k32734m4867j06752
$$ -347349 -464720 -427217 -175212 54525 191115 232899 14298 -218436 -263303 -370055
24277c70055J20215r0478j70473J32247K29850J83785l8042j68688Q6414o6318
$$ -370055 -249840 -340318 -510791 -378544 -148694 35091 -2951 -171639 -85225 -151543
24267a51543L8314M0891n7265R9350J83413K6543k7987j27553n1915j20143j36115
$$ -151543 -113229 -72338 -129603 -30253 153160 179703 151716 24163 -27752 -147895 -284010
24256b84010k42230L3290J43540R4960O8817K1542j51306P5820J78766R9873r6036
$$ -284010 -526240 -492950 -349410 -254450 -185633 -164091 -315397 -239577 -60811 39062 -56974
24245e6974j55151j84818M2983K68788R0465K15767P9266l48161k16526r8928
$$ -56974 -212125 -396943 -353960 -85172 5293 221060 300326 -47835 -264361 -363289
24235c63289N4229K34949J6237j49162P5485k9995J49167R5533r6564N7364r0509
$$ -363289 -309060 -74111 -57874 -207036 -131551 -161546 -12379 83154 -13410 43954 -46555
24224d6555j53953n3147K24491J04123o879q7645j87538Q4874N3944R9509O1323
$$ -46555 -200508 -253655 -29164 74959 68080 -19565 -207103 -122229 -68285 31224 92547
24213I2547k20611m7062K42667K29692O2671k8972j57540p8194N2213J4152m5782
$$ 92547 -128064 -175126 67541 297233 359904 330932 173392 95198 147411 161563 115781
24202A15781k6430o6525J382O788j53267L3584K41865Q5733o7153K1404k12679
$$ 115781 89351 22826 24208 30996 -122271 -88687 153178 238911 171758 193162 -19517
24191a9517M0908P454J1603j4005Q1990K07366j17628j12139J19031K5259n302
$$ -19517 21391 28845 40448 26443 108433 315799 198171 86032 205063 230322 225020
24180B25020j53198p3710J78251q8856O5472J8515R3694K75528j66022l26567
$$ 225020 71822 -1888 176363 87507 152979 171494 265188 540716 374694 48127
24170D8127M681R7707n1874j72341k9573Q1109o125N4099J2511l8360O2898J4967
$$ 48127 52808 150515 98641 -73700 -103273 -22164 -28289 25810 38321 -39 62859 77826
24158G7826Q5191K2944K6884L5384l05015j09281O7752j47281M6286J68081K1100
$$ 77826 163017 185961 212845 248229 -56786 -166067 -98315 -245596 -199310 -31229 -10129
24147a0129P9026l5625J6774l0757p7492P0902M6893n0142q5200J72903J37158
$$ -10129 68897 33272 50046 19289 -58203 12699 59592 9450 -75750 97153 234311
24136B34311q7893Q821j14322j3687P0285J94915r3010j40149J25942j06949j12579
$$ 234311 146418 155239 40917 27230 97515 292430 199420 59271 185213 78264 -34315
24125c4315k64507j8948J98410J85380N8510k34134l17139J0072J52124R2474
$$ -34315 -298822 -317770 -119360 66020 124530 -109604 -426743 -416671 -264547 -172073
24115a72073j0857Q5845J43163o5148j43376l5694K5634j7373J28220L3921p3084
$$ -172073 -182930 -97085 46078 -19070 -162446 -198140 -172506 -189879 -61659 -27738 -100822
24104a00822j38113K03335R4947k8735J66235K12310j76458j20392O6424j84262
$$ -100822 -238935 -35600 59347 30612 196847 409157 232699 112307 178731 -5531
24094e531k32125k3654J57052l30K04701M4029p0328N9225J25098J41184k69674
$$ -5531 -237656 -261310 -104258 -104588 100113 144142 73814 133039 258137 399321 129647
24083A29647m31476q4587J06356J95951K77720J46697J56648q6631k49572k21167
$$ 129647 -301829 -386416 -280060 -84109 193611 340308 496956 410325 160753 -60414
24073f0414N9048k00480k17114P6709K86656K38893p9197r8632l284p3325j84703
$$ -60414 -1366 -201846 -418960 -342251 -55595 183298 104101 5469 2185 -71140 -255843
24062b55843J9534m6594P6305P0838j25695O219K63790J01846J26181J58035N4770
$$ -255843 -236309 -282903 -206598 -135760 -261455 -255236 8554 110400 236581 394616 449386
24051D49386l22096k08452J50825n4869j9090k0430l974j19953J14377o7760J96215
$$ 449386 127290 -81162 69663 14794 -4296 -24726 -28700 -148653 -34276 -102036 94179
24040I4179J97330M8922Q0818r8713r6166j95115k34040J8050R8822Q596k1805
$$ 94179 291509 340431 421249 322536 226370 31255 -202785 -184735 -85913 -77317 -99122
24029i9122k377R5058P5968J35492k06820j28048Q8l8877j5122j91510J65163
$$ -99122 -101499 -6441 69527 205019 -1801 -129849 -129761 -168638 -183760 -375270 -210107
24018b10107R4438j57201R7490J15400k8467Q7268N0581K4863j04794j20624K12447
$$ -210107 -115669 -272870 -175380 -59980 -88447 -1179 49402 74265 -30529 -151153 61294
24007F1294O1003j59241R137J06289J64125j64795j66869m9172O2696K69877J50247
$$ 61294 122297 -36944 -27807 78482 242607 77812 -89057 -138229 -75533 194344 344591
23996C44591l4189j78218j51699j24949r699L8650K5518K39026J69965J73865
$$ 344591 310402 132184 -19515 -144464 -154163 -115513 -89995 149031 318996 492861
23986D92861J26117k08412l98117l15569L2671j8572o8936o4216J40036J40857
$$ 492861 618978 410566 12449 -303120 -270449 -289021 -357957 -422173 -282137 -141280
23976a41280J25118K99338J29675K5068k08629k30546k18975R1039K12825j7975
$$ -141280 -16162 283176 412851 437919 229290 -1256 -220231 -129192 83633 65658
23966F5658r4753r2157j01397p2014J94929K08483P4900J5166L7008k56854l52210
$$ 65658 -29095 -121252 -222649 -294663 -99734 108749 183649 198815 235823 -21031 -373241
23955c73241K35130J26784j27205j14565J32051K7017n0987n6864l4215J18990
$$ -373241 -138111 -11327 -138532 -253097 -121046 -94029 -145016 -201880 -236095 -117105
23945a17105L4435r5806p3287Q874Q7649r849Q8402j7330L8015n8526K8259N8097
$$ -117105 -82670 -178476 -251763 -242889 -155240 -165089 -76687 -94017 -56002 -114528 -86269 -28172
23933b8172q0244O5320J4852k54371k8987L33202Q5086j20552j19919m8905J77670
$$ -28172 -108416 -43096 -28244 -282615 -311602 21600 106686 -13866 -133785 -182690 -5020
23922e020M3940l3133N3011j6804Q9249J26151n1695k95991k34931k2994o0765
$$ -5020 38920 5787 58798 41994 131243 257394 205699 -90292 -325223 -348217 -408982
23911d08982r9474J28944K50597M2728m1169q294O6273l8408j40510R0880R6510
$$ -408982 -508456 -379512 -128915 -86187 -127356 -135650 -69377 -107785 -248295 -157415 -60905
23900f0905J8696q8359j29132k35053J14032K78843L993j11229j75844p0256J60840
$$ -60905 -42209 -130568 -259700 -494753 -380721 -101878 -97885 -209114 -384958 -455214 -294374
23889b94374J27319l4212k5986J3347J37208K87357N6436L2647M1416N041j6007
$$ -294374 -167055 -201267 -227253 -213906 -76698 210659 267095 299742 341158 346199 330192
23878C30192o1190j36550k6950J3375K2988K1335o2563k94622q8786J01250r048
$$ 330192 269002 132452 105502 118877 141865 163200 100637 -193985 -282771 -181521 -190569
23867a90569n3529J73852J07481o3523m4477J53187q2825r9929J26332l969j34161
$$ -190569 -244098 -70246 37235 -26288 -70765 82422 -403 -100332 26000 22031 -112130
23856a12130L5323m854J8741J01716K7811q8776j93139O0389q2320N2247K55745
$$ -112130 -76807 -81661 -62920 38796 66607 -22169 -215308 -154919 -237239 -184992 70753
23845G0753J10476o4144q6139r6775Q6688J64922O8501p9557j42019q3876r5126
$$ 70753 181229 117085 30946 -65829 20859 185781 254282 174725 32706 -51170 -146296
23834a46296j82498k04672J35232K95866K53974M5520r240k5622n6246j46040
$$ -146296 -328794 -533466 -398234 -102368 151606 197126 187886 162264 106018 -40022
23824d0022j56972m1076J85776P6825j29184k7292P6225J17592O0676m552j02229
$$ -40022 -196994 -238070 -52294 24531 -104653 -131945 -55720 61872 122548 117996 15767
23813A5767l8357J21025j65504j12060j1884J45796P9420M8693M8624o8897l4809
$$ 15767 -22590 98435 -67069 -179129 -191013 -45217 34203 82896 131520 62623 27814
23802B7814N0633J05691R4728j12098p5924J0628k24066n8098Q3225R7154L915
$$ 27814 78447 184138 278866 166768 90844 101472 -122594 -180692 -97467 -313 3602
23791C602j58128j62848N2939J61773J69767r4073r4836P4291n8421m3044m8063
$$ 3602 -154526 -317374 -264435 -102662 67105 -26968 -121804 -47513 -105934 -148978 -197041
23780a97041Q2859o7755N2157k3055O1092l46p3481J59209J37564J8433j69690
$$ -197041 -114182 -181937 -129780 -152835 -91743 -92089 -165570 -6361 131203 149636 -20054
23769b0054k61399p5327o1208J73264J33634J4814L7143J4219R7869L9449k37596
$$ -20054 -281453 -356780 -417988 -244724 -111090 -96276 -59133 -44914 52955 92404 -145192
23758a45192j03358J03774Q7666q2606L227m6144j34597r0206o2872Q3434k1537
$$ -145192 -248550 -144776 -57110 -139716 -136489 -182633 -317230 -407436 -470308 -386874 -408411
23747d08411J31752N9915o525J43203j34141j03861K5050J0922K15817J07751
$$ -408411 -276659 -216744 -223269 -80066 -214207 -318068 -293018 -282096 -66279 41472
23737D1472q8441p701j5831N7865L3453l9919q3090o5348K33977J59061j24329
$$ 41472 -46969 -54670 -70501 -12636 20817 -19102 -102192 -167540 66437 225498 101169
23726A01169j29060k6137J58800r0278j50072O4411J11237L2241J59968j15729
$$ 101169 -27891 -54028 104772 14494 -135578 -71167 40070 72311 232279 116550
23716A16550l38268m4415O5606k3003l6298N4498N0412R3401L1015j57875q8638
$$ 116550 -221718 -266133 -200527 -223530 -259828 -205330 -154918 -61517 -30502 -188377 -277015
23705b77015j15544o8023j24262r1748J76970K59127J76966n2265M612J55308
$$ -277015 -392559 -460582 -584844 -676592 -499622 -240495 -63529 -115794 -111182 44126
23695D4126j53852k21868J52264J60039j8817J337M1775J04161m8077K2171j20269
$$ 44126 -109726 -331594 -179330 -19291 -38108 -36771 5004 109165 61088 83259 -37010
23684c7010j16642k84406n3801N6669N4678K5963j26193M7903o6311R6739K6142
$$ -37010 -153652 -438058 -491859 -435190 -380512 -354549 -480742 -432839 -499150 -402411 -376269
23673c76269m6886Q6792K74551P7268q8681p140Q2761M7602j6179k9594k93568
$$ -376269 -423155 -336363 -61812 15456 -73225 -80365 2396 49998 33819 4225 -289343
23662b89343j47962j09782J37387K50599K43425p6774q1855k04390N5583Q9092
$$ -289343 -437305 -547087 -409700 -159101 84324 7550 -74305 -278695 -223112 -134020
23652a34020l04J17070j5384p3422N4201j81161r30l7322J73778J22935l6569
$$ -134020 -134324 -17254 -32638 -106060 -51859 -233020 -233950 -271272 -97494 25441 -11128
23641a1128j72646j6483J5573J50698K27070K935r3163q3278j21344Q8472o150
$$ -11128 -183774 -200257 -184684 -33986 193084 196019 102856 19578 -101766 -13294 -19444
23630a9444j42934K4450q6675n0711P0754J57228Q8806l82784J3205L39668N2206
$$ -19444 -162378 -137928 -224603 -275314 -204560 -47332 41474 -341310 -328105 11563 63769
23619F3769J6205k1788k5155o5685R3702j14805j92739q6352q5290J11032j13837
$$ 63769 79974 58186 33031 -32654 61048 -53757 -246496 -332848 -418138 -307106 -420943
23608d20943M8699J87098J89942j12362j74115Q8371n1749k82282p662m252Q290
$$ -420943 -372244 -185146 4796 -107566 -281681 -193310 -245059 -527341 -535003 -539255 -530965
23597e30965K48965L11542L3292Q195J38631K7813j76605K43358R6386k7197l68931
$$ -530965 -282000 29542 62834 71029 209660 237473 60868 304226 400612 373415 4484
23586D484j15004J78849j25824O8486O2517Q7159J45541k2399o725j47285N3348
$$ 4484 -110520 68329 -57495 10991 73508 160667 306208 283809 277084 129799 183147
23575A83147k1061J8337j54147l8449J59152n2286l29480k9915k4609J92787m9385
$$ 183147 162086 180423 26276 -12173 146979 94693 -234787 -264702 -289311 -96524 -145909
23564a45909N8670q2957k5559j39426R656j12953K23042K09324J7535N7181k93916
$$ -145909 -87239 -170196 -195755 -335181 -325525 -438478 -215436 -6112 11423 68604 -225312
23553b25312j28282J08070J48534J6194j69213J08007J65455J3033K7528j63943
$$ -225312 -353594 -245524 -96990 -80796 -250009 -142002 23453 36486 64014 -99929
23543i9929p2315m8224J17299J77120o7105o5783K32476j52105j46275j48471
$$ -99929 -172244 -220468 -103169 73951 6846 -58937 173539 21434 -124841 -273312
23533b73312K2584j7899m4918M5485N8422o5146R164K9299J47321K33494J08436
$$ -273312 -250728 -268627 -313545 -268060 -209638 -274784 -265620 -236321 -89000 144494 252930
23522B52930k0157k1191j84421m9025L0813k04278j88104j41758N7436J49467
$$ 252930 232773 211582 27161 -21864 8949 -195329 -383433 -525191 -467755 -318288
23512c18288K01189O588J77744J09674M395j19314j39835p3704r02J06980p4519
$$ -318288 -117099 -110511 67233 176907 181302 61988 -77847 -151551 -152453 -45473 -119992
23501a19992k08524J10719K25976L32949k31085j38254k2651j45534r6236K04766
$$ -119992 -328516 -217797 8179 341128 110043 -28211 -50862 -196396 -292632 -87866
23491h7866J92507P0762M6805k5244j05401j32986r2439j8550J77253j37978l6671
$$ -87866 104641 175403 222208 196964 91563 -41423 -133862 -152412 24841 -113137 -149808
23480a49808J75048M6354M9690K0295J87104j11287k14831q2234J13361K3825
$$ -149808 25240 71594 121284 141579 328683 217396 2565 -79669 33692 57517
23470E7517J3144m3658o5243k00909j2442K11469K18355k2346K4696J30774k05548
$$ 57517 70661 27003 -38240 -239149 -251591 -40122 178233 155887 180583 311357 105809
23459A05809l93006j33885L2445J97386J76301Q7222k6788l4820Q0252J75851
$$ 105809 -287197 -421082 -388637 -191251 -14950 72272 45484 10664 90916 266767
23449B66767L3190k36668j0350Q6025J03315j3549k38530M1380Q5476j41105N8901
$$ 266767 299957 63289 52939 138964 242279 228730 -9800 31580 117056 -24049 34852
23438C4852k8050L1039J24976L6252J63239J87344j45827k68577k78334R6634
$$ 34852 6802 37841 162817 199069 362308 549652 403825 135248 -143086 -46452
23428d6452Q4548R424J4892J1487l27106k45230J65631J05286j08144J20546J38643
$$ -46452 38096 47520 62412 73899 -253207 -498437 -332806 -227520 -335664 -215118 -76475
23417g6475M5381P4113j39830j38425K9723O6125p0780J23244R8906K550j61027
$$ -76475 -31094 43019 -96811 -235236 -205513 -139388 -210168 -86924 11982 14532 -146495
23406a46495k04330k5321k1501J29001J13231m1249P8127O5167M2479K9619j84417
$$ -146495 -350825 -376146 -397647 -268646 -155415 -196664 -118537 -53370 -10891 18728 -165689
23395a65689M3244P4559J10946j07310o5089j22308l2020J21397K89775o9891
$$ -165689 -122445 -47886 63060 -44250 -109339 -231647 -263667 -142270 147505 77614
23385G7614J84401J47743p8959j17568l16885L8409J79066j54978n5793o5767
$$ 77614 262015 409758 330799 213231 -103654 -65245 113821 -41157 -96950 -162717
23375a62717q0394O7144J00517J45661j03332k57315L4496K67195j11569J0888
$$ -162717 -243111 -175967 -75450 70211 -33121 -290436 -255940 11255 -100314 -89426
23365h9426J94564J14625j39858j75690m3732J24068m2262j28476j6815m7596
$$ -89426 105138 219763 79905 -95785 -139517 -15449 -57711 -186187 -203002 -250598
23355b50598K0226J68965L13995J78214j04533j81153j31197r307m3583k45001
$$ -250598 -230372 -61407 252588 430802 326269 145116 13919 4612 -38971 -283972
23345b83972j39580l5865K45227J66451j64918M32J01540Q0492l9611k59466Q9162
$$ -283972 -423552 -459417 -214190 -47739 -212657 -212225 -110685 -30193 -69804 -329270 -240108
23334b40108k6518K5922L2654J07891P0848O7839n5068j05996l891J39360m1130
$$ -240108 -266626 -240704 -208050 -100159 -29311 38528 -16540 -122536 -126427 12933 -28197
23323b8197j03565O4397J55594N7795k4200r5637O2637K74629J11295j92145j196
$$ -28197 -131762 -67365 88229 146024 121824 26187 88824 363453 474748 282603 281407
23312B81407p4283j10025k19589K9623J09885j21805J02840n6433n4018J2496
$$ 281407 207124 97099 -122490 -92867 17018 -104787 -1947 -58380 -112398 -99902
23302i9902r644m807K83787j4160j635J39426J1832j89357m0877j72027j21147
$$ -99902 -109546 -114353 169434 155274 153639 293065 304897 115540 74663 -97364 -218511
23291b18511J58110J12567p9113m3590J27508O8732j12793n3614q0012p1159K05028
$$ -218511 -60401 52166 -26947 -70537 56971 125703 12910 -40704 -120716 -191875 13153
23280A3153M434Q0523q8273J8059J22904J93103O9147j18490k41278k63806p0299
$$ 13153 17587 98110 9837 27896 150800 343903 413050 294560 53282 -210524 -280823
23269b80823Q2826J79270O7148k8698L836K2297L1636J05467m1662r1601l481
$$ -280823 -197997 -18727 48421 19723 23559 45856 77492 182959 141297 49696 46215
23258D6215L4898O7862q3690n9907P9626n9478j88484o5225j56981j26312j9990
$$ 46215 81113 148975 65285 5378 85004 25526 -162958 -228183 -385164 -511476 -531466
23247e31466L20738J92532P2314O307J0352l3741P2057K9912q9826m2506J43511
$$ -531466 -210728 -18196 54118 60425 70777 37036 109093 139005 49179 6673 150184
23236A50184P8970k46676n2308M1665q8770P4494J44929l058O8891J11922R9699
$$ 150184 229154 -17522 -69830 -28165 -116935 -42441 102488 99430 168321 280243 379942
23225C79942j19565r3197j22190r3342j35715j27392j5053N1817k999k15977o3812
$$ 379942 260377 167180 44990 -48352 -184067 -311459 -326512 -274695 -277694 -493671 -557483
23214e57483J03438J34307j26743o0595P730N5235N5305K32483J64533L8564r4631
$$ -557483 -454045 -319738 -446481 -507076 -499346 -444111 -388806 -156323 8210 46774 -47857
23203d7857n181j6938L3408J6709J1510m3601j39592m6733r9406P0452P6130J76116
$$ -47857 -53038 -69976 -36568 -19859 -8349 -51950 -191542 -238275 -337681 -267229 -191099 -14983
23191a4983j41446j62961J78454J42742n203J27308K16247Q216k30244k28210
$$ -14983 -156429 -319390 -140936 1806 -3397 123911 340158 348374 118130 -110080
23181a10080r1775J92460J45104j40432O6225o2978l3896o737p292j01463J18205
$$ -110080 -201855 -9395 135709 -4723 61502 -1476 -35372 -42109 -49401 -150864 -32659
23170c2659K98695N4294o0648k16726o9017m0447l8343Q3611J54600O0832j95734
$$ -32659 266036 320330 259682 42956 -26061 -66508 -104851 -21240 133360 194192 -1542
23159a542n2485j47207j31989j1617N2517K07540J15422M1287j03527N4030j0078
$$ -1542 -54027 -201234 -333223 -344840 -292323 -84783 30639 71926 -31601 22429 12351
23148A2351R757K5088P8685j10683M2450J2013k63783n1636J3577R6257K00777
$$ 12351 22108 47196 125881 15198 57648 69661 -194122 -245758 -232181 -135924 64853
23137F4853L722j665j95349j5093R3033K7796j02182k3426j17601J62302N3221
$$ 64853 68575 66910 -128439 -143532 -50499 -22703 -124885 -148311 -265912 -103610 -50389
23126e0389j38642J18610j1864j56004J47743K0235j3870K2091J27749J214l05568
$$ -50389 -189031 -70421 -82285 -238289 -90546 -70311 -84181 -62090 65659 66873 -238695
23115b38695K558J46034M0777p1105K1772m5998k43964J4411J8012j13485m035
$$ -238695 -236137 -90103 -49326 -120431 -98659 -144657 -388621 -374210 -356198 -469683 -473718
23104d73718J32041J22097j3943J33211O6409P1300m698l40116k78150o2021Q0018
$$ -473718 -341677 -219580 -233523 -100312 -33903 37397 32699 -307417 -585567 -647588 -567570
23093e67570J55722R8952J56227n8266j46505J2330J34942J31149J2415l4654
$$ -567570 -411848 -312896 -156669 -214935 -361440 -349110 -214168 -83019 -70604 -105258
23083a05258L03659J95553j85851k05319J3723j09980k9077N0676K78748J62068
$$ -105258 198401 393954 208103 2784 16507 -93473 -122550 -71874 206874 368942
23073C68942k05612j62719L7066j26172j23241j9272P8718J07925Q4305n4498
$$ 368942 163330 611 37677 -88495 -211736 -231008 -152290 -44365 39940 -14558
23063a4558O0849J66700k5173p2318l21071n72K35352o4504n5856m5799j73078
$$ -14558 46291 212991 187818 115500 -205571 -206143 29209 -35295 -91151 -136950 -310028
23052c10028R5842O5094J06223j1519j47587j13110N0433N7455J01395J56298
$$ -310028 -214186 -149092 -42869 -54388 -201975 -315085 -264652 -207197 -105802 50496
23042E0496J24623o4778q9777l5254J18028l2503j02205N0579K2974n2652j13843
$$ 50496 175119 110341 20564 -14690 103338 70835 -31370 19209 42183 -10469 -124312
23031a24312J48358K15019l4910J19028J21697l0236O018R9211O131k62871p6194
$$ -124312 24046 239065 204155 323183 444880 414644 420662 519873 526004 263133 186939
23020A86939r1085M270q9128q2524q4439j1385j33260L2362J4748l2858J52005
$$ 186939 95854 100124 10996 -71528 -155967 -167352 -300612 -268250 -253502 -286360 -134355
23009a34355J55333M2070j03708j07649O8947R3810J04384r0406j96775J95036
$$ -134355 20978 63048 -40660 -148309 -79362 14448 118832 28426 -168349 26687
22999B6687j16425j13208Q4060J31718N9763q3504m6621p8548m8735K21254m1407
$$ 26687 -89738 -202946 -118886 12832 72595 -10909 -57530 -136078 -184813 36441 -4966
22988d966q8880L4028l1185K3079J97406Q5164j11862j69227k41957l7357O8718
$$ -4966 -93846 -59818 -91003 -67924 129482 214646 102784 -66443 -308400 -345757 -277039
22977b77039J52751J81510j251j3267N6213j618k64480j41469K2071K35443J47464
$$ -277039 -124288 57222 55971 42704 98917 97299 -167181 -308650 -286579 -51136 96328
22966I6328R9792J60079k7602k27567j08898J53292q8756l8161P0903o0167p6747
$$ 96328 196120 356199 328597 101030 -7868 145424 56668 18507 89410 29243 -47504
22955d7504J09258l640o2708k53002r802J44715O4515J63693N9593J3448j11204
$$ -47504 61754 58114 -4594 -257596 -267398 -122683 -58168 105525 165118 178566 67362
22944F7362r8510p8027j2189r055o4454j52069M1955j05471r3627j90L66721J45055
$$ 67362 -31148 -109175 -121364 -130419 -194873 -346942 -304987 -410458 -504085 -504275 -137554 7501
22932G501M7943J68987l2608k17305j99488J34749J73429K7591J79067l6151j27026
$$ 7501 55444 224431 191823 -25482 -224970 -90221 83208 110799 289866 253715 126689
22921A26689L1185k59995j34365n9484j93951J34514Q9396O0356p9148j03402
$$ 126689 157874 -102121 -236486 -295970 -489921 -355407 -266011 -205655 -284803 -388205
22911c88205K28719N2697r4964Q9732L8696j5270p9395j59626r4092K33290N4530
$$ -388205 -159486 -106789 -201753 -112021 -73325 -88595 -167990 -327616 -421708 -188418 -133888
22900a33888J34523J68860n2101k08977j39918R7360J894m993l8502R6416q587
$$ -133888 635 169495 117394 -91583 -231501 -134141 -132247 -137240 -175742 -79326 -87913
22889h7913l7814n7443n2202N5883J77967j04142m6044R2438j49777R9183N7708
$$ -87913 -125727 -183170 -235372 -179489 -1522 -105664 -151708 -59270 -209047 -109864 -52156
22878e2156K45045Q6402r9512p0553m6037j04059p1072q9609k696j5538O1777
$$ -52156 192889 279291 179779 109226 63189 -40870 -111942 -201551 -204247 -219785 -158008
22867a58008o2139k6996K13081J09607N3751O6247j26101N1921R505K140Q1938
$$ -158008 -220147 -247143 -34062 75545 129296 195543 69442 121363 130868 133008 214946
22856B14946j18094L0958J32500J7566P916o7390j49033l981J2212o5167J6830
$$ 214946 96852 127810 260310 277876 285792 218402 69369 65388 77600 12433 29263
22845B9263Q1509N7199j79146N989j76555Q417l4103N2693K92859K26368K2382
$$ 29263 110772 167971 -11175 -5186 -181741 -173324 -207427 -154734 138125 364493 386875
22834C86875j39777k33248Q4002k2348k94618J96837P3210j01421J38921o6022
$$ 386875 247098 13850 97852 75504 -219114 -22277 50933 -50488 88433 22411
22824B2411k57951N9466J86230j8226J63585J64346j83367j14006J71141P6692
$$ 22411 -235540 -176074 10156 -8070 155515 319861 136494 22488 193629 270321
22814B70321O6718q370j15770M3475K04682j4574l14550l18641k7024Q304j003
$$ 270321 337039 328669 212899 256374 461056 446482 131932 -186709 -213733 -205429 -206432
22803b06432J25876J11788O4541j46386K6096J08435M0275j47872J2721K02470
$$ -206432 -80556 31232 95773 -50613 -24517 83918 124193 -23679 -10958 191512
22793A91512J17824j01714J5292m7725j01740j32974j00822N9939J31285K9437
$$ 191512 309336 207622 222914 175189 73449 -59525 -160347 -100408 30877 60314
22783F0314q5284Q676J4258K6315J9998j91931N351J09842k4830r1632J46635
$$ 60314 -24970 -16294 -2036 24279 44277 -147654 -142303 -32461 -57291 -148923 -2288
22772b288J17032J04853M1120l67004j53984J22700K284K0865J73276K3580O3296
$$ -2288 114744 219597 260717 -106287 -260271 -137571 -135287 -114422 58854 82434 145730
22761A45730K7564J6745k12729j21952j50622R1764J61108j24917K6430M462j9502
$$ 145730 173294 190039 -22690 -144642 -295264 -203500 -42392 -167309 -140879 -136417 -155919
22750a55919J77280r2511l1187M0133n458L0483p6558N8037K77338J86928j01225
$$ -155919 21361 -71150 -102337 -62204 -67662 -37179 -113737 -55700 221638 408566 307341
22739C07341k47647K157j59908j90598j7266J1544p9267j47194J05580r7227m4989
$$ 307341 59694 61851 -98057 -288655 -305921 -294377 -373644 -520838 -415258 -512485 -557474
22728e57474L53275Q9488j26479o866J30178O7650M4224r4177j11539J94938M4017
$$ -557474 -204199 -114711 -241190 -248056 -117878 -50228 -6004 -100181 -211720 -16782 27235
22717B7235j32089m5574K6066k803O8189k6595M8472q1181Q7064K12893J18814
$$ 27235 -104854 -150428 -124362 -127165 -58976 -85571 -37099 -118280 -31216 181677 300491
22706C00491j3531l27762L9703r469k47954k1746J35693o6876O2981k1070n2220
$$ 300491 286960 -40802 -1099 -10568 -258522 -280268 -144575 -211451 -148470 -169540 -221760
22695b21760K30699P5103m2486J4856R9366l2941J3257k57761j46618M6858O0404
$$ -221760 8939 84042 41556 56412 155778 122837 136094 -121667 -268285 -221427 -161023
22684a61023O2300N5446j17312N4418M7514R1589n9474n1396o4991R1967M7704
$$ -161023 -98723 -43277 -160589 -106171 -58657 32932 -26542 -77938 -142929 -50962 -3258
22673c258K6404j05869o7269J15354l1280q5489j92098N5646J2252k6860K7490
$$ -3258 23146 -82723 -149992 -34638 -65918 -151407 -343505 -287859 -275607 -302467 -274977
22662b74977J27331M0553p8828j21176j67931K32030K17026K93227P0883k66581
$$ -274977 -147646 -107093 -185921 -307097 -475028 -242998 -25972 267255 338138 71557
22652G1557J8711k10405J13129J98607j71814r8468j52501r151J50403N8234j86512
$$ 71557 90268 -120137 -7008 191599 19785 -78683 -231184 -240335 -89932 -31698 -218210
22641b18210M0399q3737P0352L5251N6145q733M3384j78419j63745K23897J54521
$$ -218210 -177811 -261548 -191196 -155945 -99800 -108533 -65149 -243568 -407313 -183416 -28895
22630b8895m1149l6496P4644r8671n5297K9142K2771q4503K22342j80745K3643
$$ -28895 -70044 -106540 -31896 -130567 -185864 -156722 -133951 -218454 3888 -176857 -153214
22619a53214P4900J93079J570J4041J79489N2353j16455o1885q6208o5685j13512
$$ -153214 -78314 114765 116335 130376 309865 362218 245763 183878 97670 31985 -81527
22608h1527j02396j19175K05273J09144J7875K7875J06245j80268k47782j79304
$$ -81527 -183923 -303098 -97825 11319 29194 57069 163314 -16954 -264736 -444040
22598d44040k223O5544K62985J79185j8443J03753j62336k31644q9090j08119
$$ -444040 -446263 -380719 -117734 61451 43008 146761 -15575 -247219 -336309 -444428
22588d44428J4118J75398L38861j23627j90874o7039j18691M2655K75187P0338
$$ -444428 -430310 -254912 83949 -39678 -230552 -297591 -416282 -373627 -98440 -28102
22578b8102m5368J68794N5750n3297j78185l2063J7592R2576J30688o1514Q4038
$$ -28102 -73470 95324 151074 97777 -80408 -112471 -94879 -2303 128385 66871 150909
22567A50909j11600L6896N665J0230N9443l712l2874j72494Q1112J1939l34877
$$ 150909 39309 76205 81870 92100 151543 147831 114957 -57537 23575 35514 -299363
22556b99363J5742r9408O1990K84564M8851n5006q0586m0074J01042J30739O3807
$$ -299363 -283621 -383029 -321039 -36475 12376 -42630 -123216 -163290 -62248 68491 132298
22545A32298k06178n1377K0610l2906n0223Q8490R1478J25661J64206J1965n2858
$$ 132298 -73880 -125257 -104647 -137553 -187776 -99286 -7808 117853 282059 294024 241166
22534B41166j41804N2903k1080L7716J1837m1097k32338j82498p2743k8060r5569
$$ 241166 99362 152265 131185 168901 180738 139641 -92697 -275195 -347938 -375998 -471567
22523d71567P5775R2290K9817K111n0060j546K24169J31250q2903n3078J15998
$$ -471567 -395792 -303502 -273685 -271574 -321634 -323180 -99011 32239 -50664 -103742 12256
22512A2256R5727m4892k27545k94298l8991L05407K08395N2056r6174L15808m7302
$$ 12256 107983 63091 -164454 -458752 -497743 -192336 16059 68115 -28059 287749 240447
22501B40447j60655j79914N2763k3790O5427k13151Q0788P5808j83609l6616K64208
$$ 240447 79792 -100122 -47359 -71149 -5722 -218873 -138085 -62277 -245886 -282502 -18294
22490a8294R7751n947n565J11489m8268j11403j0097n2423j92823j11981O5466
$$ -18294 79457 73510 67945 179434 131166 19763 9666 -42757 -235580 -347561 -282095
22479b82095K31335O9810J34999j0796P6260k47108j33196J02106p2281o2874
$$ -282095 -50760 19050 154049 143253 219513 -27595 -160791 -58685 -130966 -193840
22469a93840p1259m8904K59498L21452K28274M8679j6930k51065j82732k35884
$$ -193840 -265099 -314003 -54505 266947 495221 543900 526970 275905 93173 -142711
22459a42711n1716O8341O3011j2019j20034m9372J54921k20775k16292R6356Q9875
$$ -142711 -194427 -126086 -63075 -75094 -195128 -244500 -89579 -310354 -526646 -430290 -340415
22448c40415K2565K7902p5284J47413r0993K49817J99800J89023n7731j94965
$$ -340415 -317850 -289948 -365232 -217819 -308812 -58995 140805 329828 272097 77132
22438G7132j10724Q147M2487K13659j07727n6378j8631J328k9572M2188J65213
$$ 77132 -33592 -25445 17042 230701 122974 66596 47965 49293 19721 61909 227122
22427B27122l7375k46761j46518K6251l3986K3911j41238r8553k19468r3968K96222
$$ 227122 189747 -57014 -203532 -177281 -211267 -187356 -328594 -427147 -646615 -740583 -444361
22416d44361j6810M7985L39634K42048N9013j26617k58524k69481p2393j07767
$$ -444361 -461171 -413186 -73552 168496 227509 100892 -157632 -427113 -499506 -607273
22406f07273M7339n9379L30984K59634J18496M4824r7821r2362r290n695j89352
$$ -607273 -559934 -619313 -288329 -28695 89801 134625 36804 -55558 -64848 -70543 -259895
22395b59895M1556Q7812J03591J14937L7079j3415r3663j77872j05472j33078
$$ -259895 -218339 -130527 -26936 88001 125080 111665 18002 -159870 -265342 -398420
22385c98420l6771J59613J32047L5645O7393N1680L43535L8944k31842k8066Q448
$$ -398420 -435191 -275578 -143531 -107886 -40493 11187 354722 393666 161824 133758 142206
22374A42206l227k16613k05929k0152j1824J7296n8948J91793R8806p4766L9872
$$ 142206 138979 -77634 -283563 -303715 -315539 -298243 -357191 -165398 -66592 -141358 -101486
22363a01486K00852j7603q6156J13097J52439L8840j85646k67535L7347J63421
$$ -101486 99366 81763 -4393 108704 261143 299983 114337 -153198 -115851 47570
22353D7570l4795j12129l1418O652J19969K10288j27840j53550P9215N5949k84636
$$ 47570 12775 -99354 -130772 -124120 -4151 206137 78297 -75253 3962 59911 -224725
22342b24725j29073J81110J41437K6348J23569m8021j7216j2897l2765L8935J33660
$$ -224725 -353798 -172688 -31251 -4903 118666 70645 53429 40532 7767 46702 180362
22331A80362j76884j2993P3566O9720K4720m0618k3117j97170k03532Q4987K65997
$$ 180362 3478 -9515 64051 133771 158491 117873 94756 -102414 -305946 -220959 45038
22320D5038r4145M0348j41852k00999l166J78260j9832r5022J04299Q0912L3080
$$ 45038 -49107 -8759 -150611 -351610 -354776 -176516 -196348 -291370 -187071 -106159 -73079
22309g3079j40931n4411J13983j07026K472K62464K7476n8718j09949L9525M9461
$$ -73079 -214010 -268421 -154438 -261464 -258992 3472 30948 -27770 -137719 -98194 -48733
22298d8733q0822j78322J11435R8448j5076J94142J50888j09737j19303M2444
$$ -48733 -129555 -307877 -196442 -97994 -113070 81072 231960 122223 2920 45364
22288D5364n2931j28336K2639J06141j83354J1843N838N7344K03077M1997j61137
$$ 45364 -7567 -135903 -113264 -7123 -190477 -178634 -172796 -115452 87625 129622 -31515
22277c1515K1627J27098J42559k0093n1114R5512K1470j44720k28587j70629j03682
$$ -31515 -9888 117210 259769 239676 188562 284074 305544 160824 -67763 -238392 -342074
22266c42074k8040N9978J02540P4079l9487l9511n4157Q4551r9621P9400J39824
$$ -342074 -370114 -310136 -207596 -133517 -173004 -212515 -266672 -182121 -281742 -202342 -62518
22255f2518j28049j02969Q2353J89726j70618L0197J04052L9442L03547J32344
$$ -62518 -190567 -293536 -211183 -21457 -192075 -161878 -57826 -18384 285163 417507
22245D17507j73102p8133J3842k4902j17451R77j00674J16831J33732J6205j15010
$$ 417507 244405 166272 180114 155212 37761 38738 -61936 54895 188627 204832 89822
22234H9822k28193j24968J02731J08886N8566L9968r9481o7800n942K48738Q7148
$$ 89822 -138371 -263339 -160608 -51722 6844 46812 -52669 -120469 -126411 122327 209475
22223B09475O6582j19907j62377o3329J14145J96832j76134m0703j03649J16152
$$ 209475 276057 156150 -6227 -69556 44589 241421 65287 24584 -79065 37087
22213C7087j26676j44072m7111K30485J19676n1891K04455k1557r9286J17387
$$ 37087 -89589 -233661 -280772 -50287 69389 17498 221953 200396 101110 218497
22203B18497k01525j63477j2403j64195J38026p5647M5174J14950J8783j78426
$$ 218497 16972 -146505 -158908 -323103 -185077 -260724 -215550 -100600 -81817 -260243
22193b60243k08692Q3875K24401m643L767M8533j83383j0922J74396k7188q9939
$$ -260243 -468935 -385060 -160659 -165302 -161535 -113002 -296385 -307307 -132911 -160099 -250038
22182b50038L0447k2473j0801J97790J14447o2849j65895o4780j34264m7670J78197
$$ -250038 -219591 -242064 -252865 -55075 59372 -3477 -169372 -234152 -368416 -416086 -237889
22171b37889K41756J62713N0795r8002k30077q5758J23175L6530j15461N5652
$$ -237889 3867 166580 217375 119373 -110704 -196462 -73287 -36757 -152218 -96566
22161i6566J66384j53243J3214J64588J7874k39851l32686o7975O5426K68556
$$ -96566 69818 -83425 -70211 94377 112251 -127600 -460286 -528261 -462835 -194279
22151a94279J48801j07784k3192J61969N0786j74186l982J45479J40001R6341
$$ -194279 -45478 -153262 -176454 -14485 36301 -137885 -141867 3612 143613 239954
22141B39954q6445j20082n0033J34153K23185m6299J7659J76723k61021n7173
$$ 239954 153509 33427 -16606 117547 340732 294433 312092 488815 227794 170621
22131A70621P6573p1563j79161l3373l0664N3062m2248l2557Q0303j66285P5354
$$ 170621 247194 175631 -3530 -36903 -67567 -14505 -56753 -89310 -9007 -175292 -99938
22120i9938K43151J77159j13191j40593O5817q7819j87906j0206K25295R468J27090
$$ -99938 143213 320372 207181 66588 132405 44586 -143320 -153526 71769 81237 208327
22109B08327R781k56312j86778Q3308K26096k5337J29570p4471Q0895j9429j94119
$$ 208327 218108 -38204 -224982 -141674 84422 59085 188655 114184 195079 175650 -18469
22098a8469L9421p92j09798N7099K9847k33069L4411J64260R5173j9763r8809
$$ -18469 20952 20160 -89638 -32539 -2692 -235761 -201350 -37090 58083 38320 -60489
22087f0489p0920P8964J78068J9852m0129k6942J54420J22670j51576j61519L9811
$$ -60489 -131409 -52445 125623 145475 105346 78404 232824 355494 203918 42399 82210
22076H2210R7120Q6154p3767k05778O5935J07423m5286o8749j64806j46744J5150
$$ 82210 179330 265484 191717 -14061 51874 159297 114011 45262 -119544 -266288 -251138
22065b51138Q5608n2949J30544Q8042L4973J0062R864J64477p7529j31245r1279
$$ -251138 -165530 -218479 -87935 107 35080 45142 55006 219483 141954 10709 -80570
22054h0570r811J16365k42746m8111J02203j74357N4041R2291l1275m4017K07246
$$ -80570 -90381 25984 -216762 -264873 -162670 -337027 -282986 -190695 -221970 -265987 -58741
22043e8741J6137m3794j6261r2239M8872q635J5126L2545J15101J9528K5632j00943
$$ -58741 -42604 -86398 -102659 -194898 -146026 -154661 -139535 -106990 8111 27639 53271 -47672
22031d7672j18906N014r9343k21124M7135L0296K30540J79506L1119Q0436l1908
$$ -47672 -166578 -161564 -260907 -482031 -434896 -404600 -174060 5446 36565 117001 85093
22020H5093j58445Q389Q0244l9095r5344O6248N4997j6004O9432l5247j2904r6505
$$ 85093 -73352 -64963 15281 -23814 -119158 -52910 2087 -13917 55515 20268 7364 -89141
22008h9141j8170J25645L5045q3430r4848N6683j7157J39329Q860r5479L3330
$$ -89141 -107311 18334 53379 -30051 -124899 -68216 -85373 53956 62816 -32663 667
21997F67J62488l3566R0974n405k14436m6275r4496o683N0196m8819o0935k21887
$$ 667 163155 129589 220563 215158 722 -45553 -140049 -146732 -96536 -145355 -206290 -428177
21985d28177r2728R8635N527J26057J08693J95392O3901P725j45324R881k5744
$$ -428177 -520905 -422270 -416743 -290686 -181993 13399 77300 85025 -60299 -50418 -76162
21974g6162R2165l5543n5174Q4919K63408M2076j09158k90729m0008J96453J29706
$$ -76162 16003 -19540 -74714 10205 273613 315689 206531 -84198 -124206 72247 201953
21963B01953K0577j18494j90721m7079J23112O8649k09802j98816N621M1989K16192
$$ 201953 222530 104036 -86685 -133764 -10652 57997 -151805 -350621 -345000 -303011 -86819
21952h6819j5550j82274k18718K35872R2678O6595j12331r8091n9898j05798o5084
$$ -86819 -102369 -284643 -503361 -267489 -174811 -108216 -220547 -318638 -378536 -484334 -549418
21941e49418M2509J3857K42082J57300l1513r3953j46767k896r2646J5499P2202
$$ -549418 -506909 -493052 -250970 -93670 -125183 -219136 -365903 -368799 -461445 -445946 -373744
21930c73744Q0581J93800K17374J0284k47554j22090l2169K15424J30849k52828
$$ -373744 -293163 -99363 118011 128295 -119259 -241349 -273518 -58094 72755 -180073
21920a80073j41260j07457J09993N5525J9866r5451K02719p5807l1725J01324
$$ -180073 -321333 -428790 -318797 -263272 -243406 -338857 -136138 -211945 -243670 -142346
21910a42346j63228l4128J5933K09064J97930l7039P0717j08596j03990J16913
$$ -142346 -305574 -339702 -323769 -114705 83225 46186 116903 8307 -95683 21230
21900B1230n7394l80254l02610K05974L08362J15026K13081J61733m2749k69891
$$ 21230 -36164 -416418 -719028 -513054 -204692 -89666 123415 285148 242399 -27492
21890b7492M1088J23154k22373j02371n6672R4641J56787L5153j16195P8489K02136
$$ -27492 13596 136750 -85623 -187994 -244666 -150025 6762 41915 -74280 4209 206345
21879B06345k00598M4579m3465j94919j22231R5585K36935Q5188N5329j60884
$$ 206345 5747 50326 6861 -188058 -310289 -214704 22231 107419 162748 1864
21869A864k52890J62534K47628m8272k51221l9858L57283N8271o3647M6148J43773
$$ 1864 -251026 -88492 159136 110864 -140357 -180215 177068 235339 171692 217840 361613
21858C61613K05451J35996k48759m5458k07328j26039M9933K41553N8097k90716
$$ 361613 567064 703060 454301 408843 201515 75476 125409 366962 425059 134343
21848A34343l22672j36871K23724K68454k55346j38709n7534J7314P2278Q4866
$$ 134343 -188329 -325200 -101476 166978 -88368 -227077 -284611 -267297 -195019 -110153
21838a10153o5378J06184J11795Q6066j7684k2671P4774P7546j33698J57331J94857
$$ -110153 -175531 -69347 42448 128514 110830 88159 162933 240479 106781 264112 458969
21827D58969j78197k57092k69450R164J64132M2517j74094N2847N5222K2134K2993
$$ 458969 280772 23680 -245770 -236606 -72474 -29957 -204051 -151204 -95982 -73848 -50855
21816e0855j01805j01761R887J56789K8511o301k0641J12479k810j13015j82779
$$ -50855 -152660 -254421 -244534 -87745 -59234 -65535 -86176 26303 23493 -89522 -272301
21805b72301j73726o1667R41K04068R0544R9557q0847o7627n9426k795J08500
$$ -272301 -446027 -507694 -506753 -302685 -212141 -112584 -193431 -261058 -320484 -323279 -214779
21794b14779L3727N6950m568P3409N9338P6495j95560j68976N2832r4409K15553
$$ -214779 -181052 -124102 -128670 -55261 4077 80572 -114988 -283964 -231132 -325541 -109988
21783a09988M18M9830K20990j35744M1699L4122q9920k75138j96257p749J16700
$$ -109988 -109570 -59740 161250 25506 67205 101327 11407 -263731 -459988 -467737 -351037
21772c51037K95949J27150j52584r3579o1245M6042K78478k3124k55138M7187
$$ -351037 -55088 72062 -80522 -174101 -235346 -189304 89174 66050 -189088 -141901
21762a41901L7619j16272k1502o7806j19540J60499N7421J44726k26807L9039
$$ -141901 -104282 -220554 -242056 -309862 -429402 -268903 -211482 -66756 -293563 -254524
21752b54524L34714K4755j45007j11257J36128J83296n0485j29355m6146K0508
$$ -254524 80190 104945 -40062 -151319 -15191 168105 117620 -11735 -57881 -37373
21742c7373j40995j58624J02257J13524J88847o8112o2954M0986M7765K8329M1976
$$ -37373 -178368 -336992 -234735 -121211 67636 -476 -63430 -22444 25321 53650 95626
21731I5626J0145J31657j52202j81427J33917K77970J46758j51995k28130l21178
$$ 95626 105771 237428 85226 -96201 37716 315686 462444 310449 82319 -238859
21721b38859k02421L7683K59546N818j27373m7177j77797j21789J58267L59451
$$ -238859 -441280 -403597 -144051 -138233 -265606 -312783 -490580 -612369 -454102 -94651
21711i4651q4624k2850L3323J50152j54010L2299L72989j50856l2773R9410o7753
$$ -94651 -179275 -202125 -168802 -18650 -172660 -140361 232628 81772 48999 148409 80656
21700H0656r8891p2600j36731K28096Q1524k94386M6059n0537R8052P9866l04656
$$ 80656 -18235 -90835 -227566 530 82054 -212332 -166273 -216810 -118758 -38892 -343548
21689c43548J23087l7256J05492j08014J12432N9281J34384n8549j63970J35409
$$ -343548 -220461 -257717 -152225 -260239 -147807 -88526 45858 -12691 -176661 -41252
21679d1252J85945j97145j55330M2700P9916K37290K00818j62296k09347J03098
$$ -41252 144693 -52452 -207782 -165082 -85166 152124 352942 190646 -18701 84397
21669H4397l6838j29091k15744J03377L7148r3375j82158r5125m8998J13993K34160
$$ 84397 47559 -81532 -297276 -193899 -156751 -250126 -432284 -527409 -576407 -462414 -228254
21658b28254J58306M2289p6810j55533j37093J35504L15991k3409j08576K8554
$$ -228254 -69948 -27659 -104469 -260002 -397095 -261591 54400 30991 -77585 -49031
21648d9031q2904J22928l2593k17165j45279R3300L37082P9332k36566q726Q1883
$$ -49031 -131935 -9007 -41600 -258765 -404044 -310744 26338 105670 -130896 -139622 -57739
21637e7739j0244J00290J05709o768O3215j6336k69538j65413L4688j15171Q1492
$$ -57739 -67983 32307 138016 131248 194463 178127 -91411 -256824 -222136 -337307 -255815
21626b55815q1498J52888R2953l065N6932r2271q8408l762M4573m0552J73100
$$ -255815 -337313 -184425 -91472 -94537 -37605 -129876 -218284 -222046 -177473 -218025 -44925
21615d4925N5356k0885j68272M916K7851k06000r9462O550K09757K11729J5480
$$ -44925 10431 -10454 -178726 -173810 -145959 -351959 -451421 -444871 -235114 -23385 -7905
21604g905M8305r1468J03901N8489k03494r220P9082J64927K42474N8993j62101
$$ -7905 40400 -51068 52833 111322 -92172 -101392 -22310 142617 385091 444084 281983
21593B81983k11211p5634q6912L0125k0336o0391r854j94472J9063J85849l4295
$$ 281983 70772 -4862 -91774 -61649 -81985 -142376 -152230 -346702 -327639 -141790 -176085
21582a76085J5609J95867m5535K5058J03911r0994o0445J28233k7878M7516r3465
$$ -176085 -160476 35391 -10144 14914 118825 27831 -32614 95619 67741 115257 21792
21571B1792j21109k1282N3104m1020k08293P7637L54388J5319n8527j08629Q833
$$ 21792 -99317 -120599 -67495 -108515 -316808 -239171 115217 130536 72009 -36620 -27787
21560b7787L7856q811j01694Q165O4221q7352R367J04013m9762l427J0793k51496
$$ -27787 10069 1258 -100436 -92271 -28050 -115402 -106035 -2022 -51784 -55211 -44418 -295914
21548b95914q7065K09693J97877R7097J07052P3623k1095j03209k52214J34173
$$ -295914 -382979 -173286 24591 121688 228740 302363 281268 178059 -74155 60018
21538F0018L3330J36329j15225l3562J90990q3883o7098j46531o8285M4380j25281
$$ 60018 93348 229677 114452 80890 271880 187997 120899 -25632 -93917 -49537 -174818
21527a74818q6979J04596P0932J76382j13327j87398j50487n0167J32997J05499
$$ -174818 -261797 -157201 -86269 90113 -23214 -210612 -361099 -411266 -278269 -172770
21517a72770j44357j41441K12480J55974j3630o4288j04065o2525j27105L3748
$$ -172770 -317127 -458568 -246088 -90114 -103744 -168032 -272097 -334622 -461727 -427979
21507d27979J96878J94798J71869M8800P5247K74098j49558k29098p5270o7402
$$ -427979 -231101 -36303 135566 184366 259613 533711 384153 155055 79785 12383
21497A2383o6955j69893J31232K5395J20638R8005o3610l8356j40061L6844J93600
$$ 12383 -54572 -224465 -93233 -67838 52800 150805 87195 48839 -91222 -54378 139222
21486A39222l35128k77994k8008M2906k1198J02760L5376J9570j829M779J02673
$$ 139222 -195906 -473900 -501908 -459002 -480200 -377440 -342064 -322494 -324323 -319544 -216871
21475b16871K84261r8830j73033j70476k6279Q5261J49043o3811K12122K40598
$$ -216871 67390 -31440 -204473 -374949 -401228 -315967 -166924 -230735 -18613 221985
21465B21985k4774j89973k9307J71181Q3465j33179l27444j2205J85128K68040
$$ 221985 197211 7238 -22069 149112 232577 99398 -228046 -240251 -55123 212917
21455B12917Q375R4178j3419k9894o4500K965r3289L5492O982Q9633L3713l9304
$$ 212917 221292 315470 302051 272157 207657 210622 117333 152825 159807 249440 283153 243849
21443B43849j15902j46988P7810r0554N5035Q4147l6334N4013K1960q4323m0609
$$ 243849 127947 -19041 58769 -31785 23250 107397 71063 125076 147036 62713 22104
21432B2104n3612m063J48947K5827J34423q2685j55327n4905k958J03516J0519
$$ 22104 -31508 -35571 113376 139203 273626 190941 35614 -19291 -22249 81267 91786
21421I1786J00109j32035J8611M2655j55820Q9779P1871J02491p2374k23064p9373
$$ 91786 191895 59860 78471 121126 -34694 55085 126956 229447 157073 -65991 -145364
21410a45364p971j0987L8762Q1701K17457J6548p8684o3966Q1667J7766J01062
$$ -145364 -153335 -164322 -125560 -43859 173598 190146 111462 47496 129163 146929 247991
21399B47991l0894r0161m8867P9386L735Q7355l8732j35603j44964R8227K20849
$$ 247991 217097 126936 78069 157455 161190 248545 209813 74210 -70754 27473 248322
21388B48322P4249L7742k41221q7646q3790O0371P99J25154K1180J56902J37967
$$ 248322 322571 360313 119092 31446 -52344 8027 8826 133980 155160 312062 450029
21377D50029j42508l29197r0320R1973K23788l8875o3026j02564q3609j2764l6801
$$ 450029 307521 -21676 -111996 -20023 203765 164890 101864 -700 -84309 -97073 -133874
21366a33874n4939R8902L44144j96462j68263O3797J05992O7825n033j36846j23746
$$ -133874 -188813 -89911 254233 57771 -110492 -46695 59297 127122 122089 -14757 -138503
21355a38503k1862k18123J72644P4353N624J5004J25744j1541j7589O3231o9899
$$ -138503 -160365 -378488 -205844 -131491 -125867 -110863 14881 3340 -14249 48982 -20917
21344b0917L3655J39579n8841J10036Q1715J63326j44593k61900j71075n3427
$$ -20917 12738 152317 93476 203512 285227 448553 303960 42060 -129015 -182442
21334a82442K7224J4883J79123K56239R4733j49262j56916p1242P3110k5077j54354
$$ -182442 -155218 -140335 38788 295027 389760 240498 83582 12340 85450 60373 -93981
21323i3981J37224p3085j4849K77933K24729j10553k4492j86445k55029j44450
$$ -93981 43243 -29842 -44691 233242 457971 347418 322926 136481 -118548 -262998
21313b62998m4678N4415J23383K8836j22188L8648m2577j3576J73080l4315j02571
$$ -262998 -307676 -253261 -129878 -101042 -223230 -184582 -227159 -240735 -67655 -101970 -204541
21302b04541J52779R2640N2776k0988P5149o5552J38255J66023K0307q6199N1271
$$ -204541 -51762 40878 93654 72666 147815 82263 220518 386541 406848 320649 371920
21291C71920L4022r1035j7110k36735k37678K43399J53188l788K00359k9179j27533
$$ 371920 405942 314907 297797 61062 -176616 66783 219971 216183 416542 387363 259830
21280B59830q4297l04045p4030N566m5646Q5112J02897J38213J92343r7447j87304
$$ 259830 175533 -128512 -202542 -196976 -242622 -157510 -54613 83600 275943 178496 -8808
21269h808k36033j30886K4462M3701j41499j26799K64023K99783J70209l05126
$$ -8808 -244841 -375727 -351265 -307564 -449063 -575862 -311839 -12056 158153 -146973
21259a46973m652M5702j29359J21620J69665j09480J57770r6116p7176K08848
$$ -146973 -151625 -105923 -235282 -113662 56003 -53477 104293 8177 -68999 139849
21249A39849k5950m970J26504M9348o8324o7328k03712j93246K00511l7371o4074
$$ 139849 113899 108929 235433 284781 216457 149129 -54583 -247829 -47318 -84689 -148763
21238a48763K91586P5808L04219J05313M3969p2000J61382K09403j44334j25919
$$ -148763 142823 218631 522850 628163 672132 600132 761514 970917 826583 700664
21228G00664j01976l01067J1341J46234k58234k51326J03525N1315j12178O5091
$$ 700664 598688 297621 308962 455196 196962 -54364 49161 100476 -11702 53389
21218E3389K6534o7283k18690k29577J34164k2201J78332K45492P4699j29269
$$ 53389 79923 12640 -206050 -435627 -301463 -323664 -145332 100160 174859 45590
21208D5590k58289k79387j34075P2714J9969K04426J18542K51N1555J6829J36489
$$ 45590 -212699 -492086 -626161 -553447 -533478 -329052 -210510 -210259 -158704 -141875 -5386
21197e386n0507j85247M302P9081n4800J21172K08757o0618j12887K2701J20133
$$ -5386 -55893 -241140 -236838 -157757 -212557 -91385 117372 56754 -56133 -33432 86701
21186H6701O3915P279j9669k23751j47764K3835J64334J33736j33624j81997J07824
$$ 86701 150616 157895 138226 -85525 -233289 -209454 -45120 88616 -45008 -227005 -119181
21175a19181M5275J86373l4908j02030j2285J11344O9298j06236j99358j15131
$$ -119181 -73906 112467 77559 -24471 -36756 74588 143886 37650 -161708 -276839
21165b76839J77193M2855J12379l678R6498l4707o8314J1393n3057j22207R6120
$$ -276839 -99646 -56791 55588 51910 148408 113701 45387 56780 3723 -118484 -22364
21154b2364K87097p873r6093j18671p9570J2856p2025l04272k0530K08648L8031
$$ -22364 264733 256860 160767 42096 -37474 -24618 -96643 -400915 -421445 -212797 -174766
21143a74766M6449P858j03947p6438j7560K17598N5504n4992o684j09770n5818
$$ -174766 -128317 -120459 -224406 -300844 -318404 -100806 -45302 -100294 -106978 -216748 -272566
21132b72566J95289Q3425K7263N0160J490j1165R4452p0041p9432j31586J9437
$$ -272566 -77277 6148 33411 83571 85061 73896 168348 98307 18875 -112711 -93274
21121i3274J45831l952p6968j46674N8084j04194R746J24722P478J14942j11461
$$ -93274 52557 48605 -28363 -175037 -116953 -221147 -211401 -86679 -79201 35741 -75720
21110g5720j18243o2222o4199J58325K03066p0774J4682N9861p350K9447K6731
$$ -75720 -193963 -256185 -320384 -162059 41007 -29767 -15085 44776 37426 66873 93604
21099I3604J60481M707n0966Q3528r9787j3414j37244j7811Q8661j02355l3107
$$ 93604 254085 258792 207826 291354 191567 178153 40909 23098 111759 9404 -23703
21088b3703J58685o0850n6372P6699R7003k0161p9765J3961N7664K1337k22043
$$ -23703 134982 74132 17760 94459 191462 171301 91536 105497 163161 184498 -37545
21077c7545j34363P6622r8085O9472J10309q0596O7071Q8973n8800j27217J22429
$$ -37545 -171908 -95286 -193371 -123899 -13590 -94186 -27115 61858 3058 -124159 -1730
21066a730J6521L2859J39539L46081k68364l61064j77390J89404K9069J5060R08
$$ -1730 14791 47650 187189 533270 264906 -96158 -273548 -84144 -55075 -40015 -39107
21055c9107P1556j69861q0282L8812k08343m9692O9677m4916J09214J22789j49052
$$ -39107 32449 -137412 -217694 -178882 -387225 -436917 -367240 -412156 -302942 -180153 -329205
21044c29205j54918N4991J90256Q5923K17910J20894K7130O6365J03867j47223
$$ -329205 -484123 -429132 -238876 -152953 64957 185851 212981 279346 383213 235990
21034B35990l07575j04063K80464o114k00898J96369k1154j88334O5390L4836
$$ 235990 -71585 -175648 104816 98702 -102196 94173 73019 -115315 -49925 -15089
21024a5089K5925K7515j12252J31358J33917m6330k6228R5859o9947n8859N870
$$ -15089 10836 38351 -73901 57457 191374 145044 118816 214675 144728 85869 91739
21013I1739j13048J11539j05844P9301J71213j70878k20402N4921J58035N4994
$$ 91739 -21309 90230 -15614 63687 234900 64022 -156380 -101459 56576 111570
21003A11570o3447l1302Q2480j5644J7241j87569j6551J09934Q9676K70k44066
$$ 111570 48123 16821 99301 83657 100898 -86671 -103222 6712 96388 96658 -147408
20992a47408J88953K00657K12003k07299j43464J93137L99967J28360j90400r7656
$$ -147408 41545 242202 454205 246906 103442 296579 696546 824906 634506 536850
20982E36850l2552p0040j94534j68817O3876o3836K5022O150J54712j29020M6724
$$ 536850 504298 434258 239724 70907 134783 70947 95969 102119 256831 127811 174535
20971A74535p8225O0476J3769j07515j74788l7548r179j44655J89873K41005K4002
$$ 174535 96310 156786 170555 63040 -111748 -149296 -158475 -303130 -113257 127748 151750
20960A51750J00147j95187k54355k38945J24029J00711N3719j79806J0107K14553
$$ 151750 251897 56710 -197645 -436590 -312561 -211850 -158131 -337937 -327830 -113277
20950a13277J10000J4084j9343k2104J75505l3479R4990J54871j16694n472J60574
$$ -113277 -3277 10807 -8536 -30640 144865 111386 206376 361247 244553 239081 399655
20939C99655K0669l15068m0802j5416k04582M5414J58666l5368j19293m7071K70119
$$ 399655 420324 105256 64454 49038 -155544 -110130 48536 13168 -106125 -153196 116923
20928A16923K0632M0646Q2590j38526p7403p2642j04779j1660O0473R7974j9358
$$ 116923 137555 178201 260791 122265 44862 -27780 -132559 -144219 -83746 14228 -5130
20917e130P6962j11710j11143j16725J12576j434Q5651n1886q4212k1842L1563
$$ -5130 71832 -39878 -151021 -267746 -155170 -156604 -70953 -122839 -207051 -228893 -197330
20906a97330J02253L8245l8295O6573L8887p7114n3957J17526J6568j10092J363
$$ -197330 -95077 -56832 -95127 -28554 10333 -66781 -120738 -3212 13356 -96736 -95373
20895i5373j7263j31291j01917J85633J15274J04216J14680J24302J31089j30910
$$ -95373 -112636 -243927 -345844 -160211 -44937 59279 173959 298261 429350 298440
20885B98440j82691k4379J99451j20854l26098j21466L29105J95463N5962Q3177
$$ 298440 115749 91370 290821 169967 -156131 -277597 51508 246971 302933 386110
20875C86110l3619R9155j08068m4138N7106K29961R247l20495R4122J43416M1055
$$ 386110 352491 451646 343578 299440 356546 586507 595754 275259 369381 512797 553852
20864E53852j7230j83632Q8850j08634k73753k99033n8597R5493j0048K5720K71527
$$ 553852 536622 352990 441840 333206 59453 -239580 -298177 -202684 -212732 -187012 84515
20853H4515K73075j70353j46034J59832K71735n9892k50869j83988j4022R3949
$$ 84515 357590 187237 41203 201035 472770 412878 162009 -21979 -36001 57948
20843E7948L515o5768p4260L20445J47714j69248l4544j1507j37388n7958Q877
$$ 57948 61463 -4305 -78565 241880 389594 220346 185802 174295 36907 -21051 -12174
20832a2174L02979l7442l20738J10153Q9015J57687j5260k9314o3067o9435n0365
$$ -12174 290805 253363 -67375 42778 131793 289480 274220 244906 181839 112404 62039
20821F2039P999N6845J42574P5738j20073j45479m9781k09502P3544N8713R0690
$$ 62039 70038 126883 269457 345195 225122 79643 29862 -179640 -106096 -47383 43307
20810D3307j7426q4722n0271k23675j16145J43268J56275K13788J1863j26544
$$ 43307 25881 -58841 -109112 -332787 -448932 -305664 -149389 64399 76262 -50282
20800e0282Q8381q0582o5027L466j5347K1144J55175J93761K11048L37446k6284
$$ -50282 38099 -42483 -107510 -104044 -119391 -98247 56928 250689 461737 799183 772899
20789G72899j17613j18204j91610k06273k10948q321K31037m5097j26695J11401
$$ 772899 655286 537082 345472 139199 -71749 -80070 150967 105870 -20825 90576
20779I0576P0926R4668M0996j13930J73365j93501j01012K14495J90977o6981
$$ 90576 161502 256170 297166 183236 356601 163100 62088 276583 467560 400579
20769D00579j35972J76169O1793J55120j77351J28544K28763J72810J10213K33154
$$ 400579 264607 440776 502569 657689 480338 608882 837645 1010455 1120668 1353822
20759A353822M43326K5741o4745J88828J66401L20822j36057q3102l29774l63422
$$ 1353822 1797148 1822889 1758144 1946972 2113373 2434195 2298138 2215036 1885262 1521840
20749A521840k07271j70336p8995K90417O84885L23870j01927P3752l6933J01646
$$ 1521840 1314569 1144233 1065238 1355655 2040540 2364410 2262483 2336235 2299302 2400948
20739B400948K3036n4859l02691m39068l34882p6371j77676P8678N0196j75928
$$ 2400948 2423984 2369125 2066434 1627366 1292484 1216113 1038437 1117115 1167311 991383
20729I91383j58521o074l6080k2906L6122j93944l7971J15969j3286k81974N7270
$$ 991383 832862 826788 790708 767802 803924 609980 572009 687978 674692 392718 449988
20718D49988J55544j73297k08660L2027K4316k691Q9789L6991k00160R7892J34545
$$ 449988 605532 432235 223575 255602 279918 277227 367016 404007 203847 301739 436284
20707D36284L6462J106L933O1202j11082P887J0107q2369J35950M7339R5054k36483
$$ 436284 472746 473852 477785 538987 427905 435792 445899 363530 499480 546819 641873 405390
20695D05390J65535L42047R3333k24237n9401l8033j22643m0n2623l1912q6306
$$ 405390 570925 912972 1006305 782068 722667 684634 561991 561951 509328 477416 391110
20684C91110j14148q3803o5031L6528J86012J43968r3367K5184j11685q9169m5355
$$ 391110 276962 193159 128128 164656 350668 494636 401269 426453 314768 225599 180244
20673A80244j98774j26703Q7836m0912k6077J47878K78836K30987k2108l7605
$$ 180244 -18530 -145233 -57397 -98309 -124386 23492 302328 533315 511207 473602
20663D73602N132j53178r9067J47813Q4944j8169J9606m6504j20485J1653o887
$$ 473602 478734 325556 226489 374302 459246 441077 460683 414179 293694 305347 298460
20652B98460p5966o9268r319l4969p0129L610J7406j361j66670j6231N7272l402
$$ 298460 222494 153226 143907 108938 38809 42419 59825 58464 -108206 -124437 -67165 -70567
20640g0567Q7887J73581l8184n5638j23543M4217o0156j62160J72145J66507K38335
$$ -70567 17320 190901 152717 97079 -26464 17753 -42403 -204563 -32418 134089 372424
20629C72424N6375k44859k47750j3704q6198j293J12286P3197J43970j1506j66650
$$ 372424 428799 183940 -63810 -77514 -163712 -165005 -52719 20478 164448 152942 -13708
20618a3708j72480P8895M9390K5676J06461J26655n9813O0942L9988r3681m6679
$$ -13708 -186188 -107293 -57903 -32227 74234 200889 141076 202018 242006 148325 101646
20607A01646L011o557M319j71108k35439K24349K24304j2088k66789J1383J83500
$$ 101646 104657 98100 102419 -68689 -304128 -79779 144525 132437 -134352 -122969 60531
20596F0531J71653J18742J559k38981j48267O6292J90448J27991O1733k6126j42308
$$ 60531 232184 350926 352485 113504 -34763 31529 221977 349968 411701 385575 243267
20585B43267Q623q4072j30460j51100J07029K49246r9017j87578j39183k3123
$$ 243267 251890 167818 37358 -113742 -6713 242533 143516 -44062 -183245 -206368
20575b06368J25925m4651M735J26966o487J83867J15275k3504m7354K770K03417
$$ -206368 -80443 -125094 -120359 6607 120 183987 299262 275758 228404 231174 434591
20564D34591J71324k40397k02012k39833j77822p2115P0066J70096J16242K19414
$$ 434591 605915 365518 163506 -76327 -254149 -326264 -256198 -86102 30140 249554
20554B49554L4774j98249K4688l0737k15265J12027M973M3981J71414O0501J14022
$$ 249554 284328 86079 110767 80030 -135235 -23208 -18235 25746 197160 257661 371683
20543C71683k34673j73362J44024P2189P4940k14661o1907K15884J41308j02p4735
$$ 371683 137010 -36352 107672 179861 254801 40140 -21767 194117 335425 335323 260588
20532B60588M5545l4835j20962r0745j2644p836J16960O8954J70646J3689j19273
$$ 260588 306133 271298 150336 59591 46947 39111 156071 225025 395671 409360 290087
20521B90087j02785j26526N8025M2406j16990J42070L30143r9675j32748Q8136
$$ 290087 187302 60776 118801 161207 44217 186287 516430 416755 284007 372143
20511C72143r0625j10052N8780q0246q9988j0414p846q3379j80348o3503Q2833
$$ 372143 281518 171466 230246 150000 60012 49598 41752 -41627 -221975 -285478 -202645
20500b02645L19792J85027O8339j4241J17367n4283J55288K5030j37133j72888
$$ -202645 117147 302174 370513 356272 473639 419356 574644 599674 462541 289653
20490B89653j03649j17403j34073m981l6063J51509J71616J1439M8528J01822
$$ 289653 186004 68601 -65472 -70453 -106516 44993 216609 228048 276576 378398
20480C78398J30492j26450k71671L1189J88205k7389j9611J10027J85164l9996
$$ 378398 508890 382440 110769 141958 330163 302774 283163 393190 578354 538358
20470E38358m8130j52766j7710Q9299L74584J6901k20405M9742K7640j62613j0210
$$ 538358 490228 337462 319752 409051 783635 800536 580131 629873 657513 494900 484690
20459D84690r8215n5218J95000j53230j93255J36521J52914L2758p1577q9391
$$ 484690 386475 331257 526257 373027 179772 316293 469207 501965 430388 340997
20449C40997J44077r4570k31365M7597R8131r037l31972m6064K07599J42084L08056
$$ 340997 485074 390504 159139 206736 304867 295830 -36142 -82206 125393 267477 575533
20438E75533J6370j31729l177j35631j10065j2988J02145K97475O2043j97172
$$ 575533 591903 460174 456997 321366 211301 198313 300458 597933 659976 462804
20428D62804k23876j0757k2966j65933M0034J65082J44490K5580n7578J5894J14721
$$ 462804 238928 228171 205205 39272 79306 244388 388878 414458 356880 372774 487495
20417D87495j78900j45999j7028l9779O9091L07285L8753j13698J2485m4967j66807
$$ 487495 308595 162596 145568 105789 174880 482165 520918 407220 419705 374738 207931
20406B07931k3144n7286J34599L14958K24020p8455L934j2593O1122p2414k48616
$$ 207931 184787 127501 262100 577058 801078 722623 726557 713964 775086 702672 454056
20395D54056k14750J46086J53051m960m9444r0470m0454j41669J39818K05452
$$ 454056 239306 385392 538443 533483 484039 393569 353115 211446 351264 556716
20385E56716j9066O2286O4728J3116J83055j20479r8056J73256J02056r5663j62833
$$ 556716 537650 599936 664664 677780 860835 740356 642300 815556 917612 821949 659116
20374F59116J10858M6399q7461j45792n9782l144o2365J3960l8718N8942M9038
$$ 659116 769974 816373 728912 583120 523338 520194 457829 471789 433071 492013 541051
20363E41051k20719J06280k6012K3050J00476j00727J62010O8258J23754P3659
$$ 541051 320332 426612 400600 423650 524126 423399 585409 653667 777421 851080
20353H51080q9523l39171N7833r0748j63215K16075M7181M5639o4939j67664k2764
$$ 851080 761557 422386 480219 389471 226256 442331 489512 535151 470212 302548 279784
20342B79784P6758J22477K1205k04480l2525Q831J45711m7115l16558j15466P3864
$$ 279784 356542 479019 500224 295744 263219 272050 417761 370646 54088 -61378 12486
20331A2486O1761o321J51292J56828P0095k7707K22836j69887j23737L191k15500
$$ 12486 74247 67926 219218 376046 446141 418434 641270 471383 347646 350837 135337
20320A35337k57551R6177K46289K23652L7129j79298m1963j8362J10561P9265
$$ 135337 -122214 -26037 220252 443904 481033 301735 259772 241410 351971 431236
20310D31236n7996L7839l574j42142o389P3059J97484J04953J18960J30015P0442
$$ 431236 373240 411079 407505 265363 258974 332033 529517 634470 753430 883445 953887
20299I53887M5758O846J9414J06952J04219j71295l5075p4J9604R9688J09241
$$ 953887 999645 1006491 1025905 1132857 1237076 1065781 1030706 1030632 1050236 1149924 1259165
20288A259165J7894k3679M755p0218K3102Q9078N7610q1429P0964J345l3380M7339
$$ 1259165 1277059 1253380 1258135 1187917 1211019 1300097 1357707 1276278 1347242 1348587 1315207 1362546
20276A362546K35582M6870O8209j1576k02064k72770J05923P2381J89812J10605
$$ 1362546 1598128 1644998 1713207 1701631 1499567 1226797 1332720 1405101 1594913 1705518
20266A705518m0898r376n3363k3299O7808P9473J53502o1174r8720k78416K1064
$$ 1705518 1664620 1655244 1601881 1578582 1646390 1725863 1879365 1818191 1719471 1441055 1462119
20255A462119K31536M3452j35589m328m3905J00158K58849Q1899l26573R601J35667
$$ 1462119 1693655 1737107 1601518 1597190 1553285 1653443 1912292 1994191 1667618 1677219 1812886
20244A812886J05966j52605J29237k6062m9362L24283R0035J28492q259k10188
$$ 1812886 1918852 1766247 1895484 1869422 1820060 2144343 2234378 2362870 2354611 2144423
20234B144423J01162j45777m819K34815J24213j30069q7462J06757Q1374J76428
$$ 2144423 2245585 2099808 2094989 2329804 2454017 2323948 2236486 2343243 2424617 2601045
20224B601045m3096J34535K05366K11339J9339K80719K64096J20366j59171N4870
$$ 2601045 2557949 2692484 2897850 3109189 3128528 3409247 3673343 3793709 3634538 3689408
20214C689408N9166r6323K20934J31462J73558M08880L10957J63500J73469M73959
$$ 3689408 3748574 3652251 3873185 4004647 4178205 4587085 4898042 5061542 5235011 5708970
20204E708970P73753R31510P58089J76662L76688N60321M69436N81993M63377
$$ 5708970 6482723 7414233 8172322 8348984 8725672 9285993 9755429 10337422 10800799
20195A0800799J56604R4728l486K77344N28989O01036M21144J28860J43768J60458
$$ 10800799 10957403 11052131 11048645 11325989 11854978 12456014 12877158 13006018 13149786 13310244
20185A3310244K22388N51037J083489J548869J393549J603519J808805K029101
$$ 13310244 13532632 14083669 15167158 16716027 18109576 19713095 21521900 23551001
20177B3551001K737958L538143M275470N294535P261719R746059J4214592K1970841
$$ 23551001 26288959 29827102 34102572 39397107 46658826 56404885 70619477 92590318
20169I2590318L4824684N5720019P7957993P5801205L8018440J2962849J5681442
$$ 92590318 127415002 183135021 261093014 336894219 374912659 387875508 403556950
20162D03556950J9060168J3754863k5836484q4392839q1490875m6592440j8067433
$$ 403556950 422617118 436371981 410535497 326142658 244651783 198059343 179991910
20155A79991910L820209K6084027N3530596P6852326O6679491K5060797O677802
$$ 179991910 183812119 209896146 263426742 340279068 406958559 432019356 438697158
20148D38697158J2067258J4229173L310187m9911046j03364991q9306376n5843761
$$ 438697158 450764416 464993589 468303776 418392730 315027739 225721363 169877602
20141A69877602l3296954k1028999j4224899j0265670p944433o235177n020637
$$ 169877602 136580648 115551649 101326750 91061080 83116647 76881470 71860833
20134G1860833m084273l697725l143392k828853k519957k242853j915062j835811
$$ 71860833 67776560 64078835 60935443 58106590 55586633 53343780 51428718 49592907
20126D9592907j876313j899170k081843j899575j695525j602034j618929j472350
$$ 49592907 47716594 45817424 43735581 41836006 40140481 38538447 36919518 35447168
20118C5447168j374022j362506j228479j274460j062057q48768p05777q14215
$$ 35447168 34073146 32710640 31482161 30207701 29145644 28296876 27591099 26776884
20110B6776884r76229q23980q34898r10370r52730q65547j228852j189211r32057
$$ 26776884 25800655 24976675 24141777 23231407 22278677 21413130 20184278 18995067 18063010
20101A8063010p95360m69697m32120n97265n26058m97684l73189l33625n83179
$$ 18063010 17267650 16797953 16365833 15768568 15242510 14744826 14371637 14038012 13454833
20092A3454833m33149l01549m40889m06558j43531k82963n4841k52788n47449
$$ 13454833 13021684 12720135 12279246 11872688 11729157 11446194 11391353 11138565 10591116
20083A0591116l99910j71706k06750l98249l73999m03495l21801k18282k55170
$$ 10591116 10191206 10019500 9812750 9414501 9040502 8637007 8315206 8096924 7841754
20074G841754j26375q8906m23746k99968k35250k1771m7501n3965k37543l53288
$$ 7841754 7715379 7626473 7202727 6902759 6667509 6645738 6598237 6544272 6306729 5953441
20064E953441k43155k3823j90420k47044j40830l00077j55126P4941L7178n8381
$$ 5953441 5710286 5686463 5496043 5248999 5108169 4808092 4652966 4727907 4765085 4706704
20054D706704l76504k00022K9255l5582J6384R3268L2081k9883j70328j76289
$$ 4706704 4330200 4130178 4159433 4123851 4140235 4233503 4265584 4235701 4065373 3889084
20044C889084M6508k22034k05087O7436q7086j06465J26796p8891k16906J14584
$$ 3889084 3935592 3713558 3508471 3575907 3488821 3382356 3509152 3430261 3213355 3327939
20034C327939R0294l7128l18888k85798m6526o6309j10254k9530J2250p0938l75960
$$ 3327939 3418233 3381105 3062217 2776419 2729893 2663584 2553330 2523800 2536050 2465112 2089152
20023B089152j44802l744j39871M8613L0340j1146l95575m22406R3829L185r4505
$$ 2089152 1944350 1940606 1800735 1849348 1879688 1868542 1472967 1050561 1144390 1147575 1053070
20012A053070N9412K1857o5956J06873r8553q9451L3039P403L12518R0066k85616
$$ 1053070 1112482 1134339 1068383 1175256 1076703 987252 1020291 1027694 1340212 1430278 1144662
20001A144662q1789R9084J3019j45353p7148k2969p832J67352o6261r4097L410
$$ 1144662 1062873 1161957 1174976 1029623 952475 929506 921674 1089026 1022765 928668 932078
19990I32078M33K7763o503j89631l9821j17129p6842K03242J11639k94064j17574
$$ 932078 932511 960274 953771 764140 724319 607190 530348 733590 845229 551165 433591
19979D33591K18087M39047Q3643j20373j32477n9784n9676m6762p3308j36459
$$ 433591 651678 1090725 1174368 1053995 921518 861734 802058 755296 681988 545529
19969E45529J52030J22840N6776R6877j43265J42621l6376j39509k6998L7117
$$ 545529 697559 820399 877175 974052 830787 973408 937032 797523 770525 807642
19959H07642q2914M4698j00632k09940r489J04945K66401K32770p1346m6576p4194
$$ 807642 724728 769426 668794 458854 449365 554310 820711 1053481 982135 935559 861365
19948H61365q9883k2149r9001j80869J3694J12988m1315n9363L7245J69908R4063
$$ 861365 771482 749333 650332 469463 483157 596145 554830 495467 532712 702620 796683
19937G96683k37953q2510M560n7960J78769K09265M3731l43461j76732j45569
$$ 796683 558730 476220 480780 422820 601589 810854 854585 511124 334392 188823
19927A88823N3057K54699J73417J64753J27876J1672m2636j61679k4883m0282
$$ 188823 241880 496579 669996 834749 962625 974297 931661 769982 745099 704817
19917G04817k7247O9741L3961J20497k42205k11476q8748J98941J80768k5468
$$ 704817 677570 747311 781272 901769 659564 448088 359340 558281 739049 713581
19907G13581L560j11643j83276j22258K05111J36255j06117q0728j25813o8343
$$ 713581 717141 605498 422222 299964 505075 641330 535213 454485 328672 260329
19897B60329K88236P887m11l1668K35655Q972j27370l7820N5076J60475j24960
$$ 260329 548565 556452 556041 524373 760028 769000 641630 603810 658886 819361 694401
19886F94401k7371j15567n939m7064Q573k3215K11710n0409l6911j94224J09357
$$ 694401 667030 551463 545524 498460 507033 483818 695528 645119 608208 413984 523341
19875E23341J54364N0383J15262k61631j08707J49961q24k12502j07104o0819
$$ 523341 677705 728088 843350 581719 473012 622973 622149 409647 302543 241724
19865B41724r1875l1548J25469J23390j56495m1884R2115J37692Q6996q3819r9491
$$ 241724 149849 118301 243770 367160 210665 168781 260896 398588 485584 401765 302274
19854C02274j00261p5907K16680R1117R488q2296O3864K4006j47988j56189J61175
$$ 302274 202013 126106 342786 433903 443391 361095 424959 448965 300977 144788 305963
19843C05963K98516j1854j39021K5262k34039K78531J60797k44171R0861K46138
$$ 305963 604479 592625 453604 478866 244827 523358 684155 439984 530845 776983
19833G76983k45985k22166L4262K0719M1504L8241Q7418J77455n2788q7403M1260
$$ 776983 530998 308832 343094 363813 405317 443558 530976 708431 655643 568240 609500
19822F09500n5364l9917o8197N3148m5670K63207J72682j51871k31292j40513
$$ 609500 554136 514219 446022 499170 453500 716707 889389 737518 506226 365713
19812C65713L3460O1464Q4332J3129n6654o1634P2003o6130J7766n943j72419
$$ 365713 399173 460637 544969 558098 501444 439810 511813 445683 463449 457506 285087
19801B85087K9301L9382K27849j15444r0217J86975J77968K31631r6737r0778
$$ 285087 314388 353770 581619 466175 375958 562933 740901 972532 875795 785017
19791G85017j03509n3235J3325j8110L4395Q0538N8694J09470k4821J533j21271
$$ 785017 681508 628273 641598 623488 657883 738421 797115 906585 881764 883297 762026
19780G62026N2649j49908J0905l3352J4636K34716J96804j93278l5792j21230
$$ 762026 814675 664767 675672 642320 656956 891672 1088476 895198 859406 738176
19770G38176n3365J37720K3227m2720J19344K38283J72194J34435m3464l80135
$$ 738176 684811 822531 845758 803038 922382 1160665 1332859 1467294 1423830 1043695
19760A043695j579K02327J44118K5258j45142j27001O6296J09559n9082K283K5632
$$ 1043695 1042116 1244443 1388561 1413819 1268677 1141676 1207972 1317531 1258449 1260732 1286364
19749A286364N7770l5200N5003p4765j76640P5234L26523J16760p5543o2929P0024
$$ 1286364 1344134 1308934 1363937 1289172 1112532 1187766 1514289 1631049 1555506 1492577 1562601
19738A562601j9857r7518j30552R0342K8354m9552n6659J30135O7396K8520o2989
$$ 1562601 1542744 1445226 1314674 1405016 1433370 1383818 1327159 1457294 1524690 1553210 1490221
19727A490221j46731K05724Q2794q3208J19751M1056j64546J37755J38878p1926
$$ 1490221 1343490 1549214 1632008 1548800 1668551 1709607 1545061 1682816 1821694 1749768
19717A749768r0840R5119K01008m3273L6356M08930k5252j15j52961l33235j74105
$$ 1749768 1658928 1754047 1955055 1911782 1948138 2357068 2331816 2331701 2178740 1845505 1671400
19706A671400J19259R7396n36k4778n1980L8322J40398Q7084N5253j03287l0444
$$ 1671400 1790659 1888055 1887519 1862741 1810761 1849083 1989481 2076565 2131818 2028531 1998087
19695A998087m678L1096K30085R5001O7164J3060R8047p0940L7935L14973K46262
$$ 1998087 1993409 2024505 2254590 2349591 2416755 2429815 2527862 2456922 2494857 2809830 3056092
19684C056092K51044J43419n2994J10261o0849P1857J43091J60081L78269J64041
$$ 3056092 3307136 3450555 3397561 3507822 3446973 3518830 3661921 3822002 4200271 4364312
19674D364312L04942J75267M83494O50745Q24558P36708P18164P69411P26760
$$ 4364312 4669254 4844521 5328015 5978760 6803318 7540026 8258190 9027601 9754361
19665I754361O73934N29669N62121R6172r6310r578N8208M76735L01958P72293
$$ 9754361 10428295 10957964 11520085 11616257 11519947 11510369 11568577 12045312 12347270 13119563
19655A3119563P84383P67379J204457J740712K016938K348180K453831K167757
$$ 13119563 13903946 14671325 15875782 17616494 19633432 21981612 24435443 26603200
19647B6603200K246544K808110L564837M799838O398199Q858602J3340497K0572491
$$ 26603200 28849744 31657854 35222691 40022529 46420728 55279330 68619827 89192318
19639H9192318L1633042M7809857O4916668P0824227N5291420L1412515J9530961
$$ 89192318 120825360 168635217 233551885 304376112 359667532 391080047 410611008
19632D10611008J6463066R154335j3549736n1515982p2372731o0935517l5716898
$$ 410611008 427074074 436228409 422678673 371162691 298789960 237854443 202137545
19625B02137545j0670508J2076169L4504469N2886861N6794909M0251564J9940829
$$ 202137545 191467037 203543206 238047675 290934536 347729445 387981009 407921838
19618D07921838J1970109R182634k8301k6071000o2703182p7037802o3992865
$$ 407921838 419891947 429074581 429046280 402975280 340272098 263234296 199241431
19611A99241431m3975416k8139431j8397754j2554193r124848o993019n424237
$$ 199241431 155266015 127126584 108728830 96174637 87049789 80056770 74632533
19604G4632533l985756l581918l260994k943433k659594k595796k544945k221311
$$ 74632533 70646777 67064859 63803865 60860432 58200838 55605042 53060097 50838786
19596E0838786k086001j897551j708237j518944j405178j520992j278805j067655
$$ 50838786 48752785 46855234 45146997 43628053 42222875 40701883 39423078 38355423
19588C8355423j193764j225878j267641j378962j200688j559844j675898j448021
$$ 38355423 37161659 35935781 34668140 33289178 32088490 30528646 28852748 27404727
19580B7404727j339177j257949r09745q18712r88923q75627p70884q63164n61012
$$ 27404727 26065550 24807601 23897856 23079144 22090221 21214594 20443710 19580546 19019534
19571A9019534o91259n42948o37964m83280k37546j74189j39754r6277q3424p1176
$$ 19019534 18328275 17785327 17147363 16664083 16426537 16252348 16112594 16016317 15932893 15861717
19561A5861717k09081l75096l34999l65058n65717o09031q84552q28181m18282
$$ 15861717 15652636 15277540 14942541 14577483 14011766 13402735 12518183 11690002 11271720
19552A1271720j65600j33998j01230j88174k66232j84227k72286l43557m21873
$$ 11271720 11106120 10972122 10870892 10682718 10416486 10232259 9959973 9616416 9194543
19543I194543k65999j70773n15694l50008l31139n39575k86191N052q9490o9536
$$ 9194543 8928544 8757771 8242077 7892069 7560930 7021355 6735164 6740216 6650726 6581190
19533F581190k29462l00062k74599o8377j75408l73687l27516j34816J53604J06871
$$ 6581190 6351728 6051666 5777067 5708690 5533282 5159595 4832079 4697263 4850867 4957738
19523D957738j14788k19268k50973j60099j3157K61338j3272j18595j79287j25883
$$ 4957738 4842950 4623682 4372709 4212610 4199453 4460791 4447519 4328924 4149637 4023754
19513D023754J09941L7183J57729k02987m37424m2314K4564j98466l45121j93328
$$ 4023754 4133695 4170878 4328607 4125620 3688196 3645882 3670446 3471980 3126859 2933531
19503B933531L076R4258j56826Q388K25630j46177k31890k05521j27480M8295
$$ 2933531 2936607 3030865 2874039 2882427 3108057 2961880 2729990 2524469 2396989 2445284
19493B445284j80326j77206j45118k30648j30648k8730m4711j21684O3085P0240
$$ 2445284 2264958 2087752 1942634 1711986 1581338 1552608 1507897 1386213 1449298 1519538
19483A519538j89926j37895j70053L2901J16160J05394p2977k15715j72881Q898
$$ 1519538 1329612 1191717 1021664 1054565 1170725 1276119 1203142 987427 814546 823444
19473H23444J28522l971j26506j52974M33981O4670k02159k26933k1987j00310
$$ 823444 951966 947995 821489 668515 1102496 1167166 965007 738074 716087 615777
19463F15777k17J33496P0577j73165r253J44815K31747J16389k09243J1350O2605
$$ 615777 615560 749056 819633 646468 637215 782030 1013777 1130166 920923 932273 994878
19452I94878J63343j64169l14750k00807N743J33264j1882N3258O2177P1132j571
$$ 994878 1158221 994052 679302 478495 484238 617502 605620 658878 721055 792187 790616
19441G90616j4980j26015j8391L3055l3077K27763j0171r9247l165j76164j87783
$$ 790616 775636 649621 631230 664285 631208 858971 848800 749553 746388 570224 382441
19430C82441j04055j04596J59836K50961J57328J26973k4181l4588k30345l3251
$$ 382441 278386 173790 333626 584587 741915 868888 844707 810119 579774 546523
19420E46523j06459j25455O7694L5400J22827R7562j55666Q1226k53277j03563
$$ 546523 440064 314609 382303 417703 540530 638092 482426 563652 310375 206812
19410B06812P50j5151o8841j18228K04539J12985J69746J7913j84149p8822P6975
$$ 206812 207562 192411 123570 5342 209881 322866 492612 510525 326376 247554 324529
19399C24529n0681J13824J27353Q3534J6095k68770j40951j00976k7111R2376
$$ 324529 273848 387672 515025 598559 614654 345884 204933 103957 76846 169222
19389A69222K50002J00410o8354M1083Q9194J35388p0061K5143q9437p7119O3419
$$ 169222 419224 519634 451280 492363 581557 716945 646884 672027 582590 505471 568890
19378E68890K7855L4705L024q1870j91401j0819Q8479J1325P22L4426j62358j29009
$$ 568890 596745 631450 634474 552604 361203 350384 438863 450188 450910 485336 322978 193969
19366A93969J47901J14798j9308j57414r3443M0764k17764J01918J54183J22036
$$ 193969 341870 456668 437360 279946 186503 227267 9503 111421 265604 387640
19356C87640J79984j12901L2448j72152n6761K2777J3810J8189r6541q3381L5975
$$ 387640 567624 454723 487171 315019 258258 281035 294845 313034 216493 133112 169087
19345A69087J91803l7051j55950j15096p5715m3811R1896O0873K7272J60540l3380
$$ 169087 360890 323839 167889 52793 -22922 -66733 25163 86036 113308 273848 240468
19334B40468q2439L7223M5808r6662j3921O048M8878j02759K5162J32097j37050
$$ 240468 158029 195252 241060 144398 130477 136525 185403 82644 107806 239903 102853
19323A02853k89954p4446J37225J05200N1355Q2123m9823J31586l8510k58537
$$ 102853 -187101 -261547 -124322 -19122 32233 114356 64533 196119 157609 -100928
19313a00928k4660J73511J1198j27581L4030j20415o1694J10528K29846J32125
$$ -100928 -125588 47923 59121 -68460 -34430 -154845 -216539 -106011 123835 255960
19303B55960O7122j05540j68630R8027N1982m3989n4092j6003k3731r0346j40200
$$ 255960 323082 217542 48912 146939 198921 154932 100840 84837 61106 -29240 -169440
19292a69440N9604K82988o1628L8776l2400l9806J0949m2107q3868Q8841Q4490
$$ -169440 -109836 173152 111524 150300 117900 78094 89043 46936 -36932 51909 136399
19281A36399N3122r2596Q7580o0003J25669O8219j90415j84215J69724J98017
$$ 136399 189521 96925 184505 124502 250171 318390 127975 -56240 113484 311501
19271C11501l5279j54994j71022l8830o5327K2608K9313J7971J19195Q2686q9921
$$ 311501 276222 121228 -49794 -88624 -153951 -131343 -102030 -84059 35136 117822 27901
19260B7901n8533j6999o4407Q2537J93514K21410j5799L4767J69805n4421q8056
$$ 27901 -30632 -47631 -112038 -29501 164013 385423 369624 404391 574196 519775 431719
19249D31719j33908m659k05523J97103L4227j7813N1284R9594k47129j49219P9039
$$ 431719 297811 293152 87629 284732 318959 301146 352430 452024 204895 55676 134715
19238A34715J0685o1959K5468J80296J2690l6938J04061k9544k27797O0564J13586
$$ 134715 145400 83441 108909 289205 301895 264957 369018 339474 111677 172241 285827
19227B85827Q5076n9063j65636j14882p0196j63845O5986J48975p6856J08366
$$ 285827 370903 311840 146204 31322 -38874 -202719 -136733 12242 -64614 43752
19217D3752J60752Q7201k5057K3284j08851q1311Q6656o0312j02623Q7563O9905
$$ 43752 204504 291705 266648 289932 181081 99770 186426 126114 23491 111054 180959
19206A80959J35944j08812M0441q9784R2789M4337q9718J60171K3199M953L1327
$$ 180959 316903 208091 248532 158748 251537 295874 206156 366327 389526 394479 425806
19195D25806k28179J30794K92935K757k09478k34355P0878J2689k36760j14887
$$ 425806 197627 328421 621356 624113 414635 180280 251158 263847 27087 -87800
19185h7800j2063P0177J10622J92005K7149O8555N8599j07481j45819O026O93
$$ -87800 -99863 -29686 80936 272941 300090 368645 427244 319763 173944 179970 180663
19174A80663q5323q9172L1143Q194p5744j02148l2300M1099K89649J39502j17164
$$ 180663 95340 6168 37311 45505 -30239 -132387 -164687 -123588 166061 305563 188399
19163A88399j69337N8400J22837k2932O0180o3124P323j6624r3101n9651J49298
$$ 188399 19062 77462 200299 177367 237547 174423 181746 165122 72021 12370 161668
19152A61668N8098O7451j11595j59666L17743M2667J1392M4261p480j10864q6643
$$ 161668 219766 287217 175622 15956 333699 376366 387758 432019 424539 313675 227032
19141B27032p2783k6169j99114r1471K00789O4717r765P2920N1218o0139Q8185
$$ 227032 154249 128080 -71034 -162505 38284 103001 93236 166156 217374 157235 245420
19130B45420J00142j00232k9070O3508l4118j19729J8865k0618l5046J14300J71383
$$ 245420 345562 245330 216260 279768 245650 125921 144786 124168 89122 203422 374805
19119C74805q0527K0961k9861O6129J09724K5517M4215j39121o8886o9182M3676
$$ 374805 294278 315239 285378 351507 461231 486748 530963 391842 322956 253774 297450
19108B97450j41504r9780K0157Q2029J06737L07776n2459r8629N8627J94280j5427
$$ 297450 155946 56166 76323 158352 265089 572865 520406 421777 480404 674684 659257
19097F59257r0494r1034k01526j76169P6258J74425j25838k8890j0573J35922
$$ 659257 568763 477729 276203 100034 176292 350717 224879 195989 185416 321338
19087C21338M47O142n9969K8153M3067J68778j64718l13837J9862J34198K10710
$$ 321338 321785 327927 267958 296111 339178 507956 343238 29401 49263 183461 394171
19076C94171M7262j29873N959r5491j92755j69200L20449K78584J0107k03528
$$ 394171 441433 311560 317519 222028 29273 -139927 180522 459106 469213 265685
19066B65685Q8727J35472n8813k38515j45435r6414J82588m1135n4472j5518R9828
$$ 265685 354412 489884 431071 192556 47121 -49293 133295 92160 37688 22170 121998
19055A21998K998L7493m0767J78136L88787K70484J86124J49930K73145J85183
$$ 121998 124996 162489 121722 299858 688645 959129 1145253 1295183 1568328 1753511
19045A753511M29704J15007N5097l05990k38035j27150k4751j31732j81015O1340
$$ 1753511 2183215 2298222 2353319 2047329 1809294 1682144 1657393 1525661 1344646 1405986
19035A405986K63185J50829K96195J28805K5214J03549K7358k4290l29454l90782
$$ 1405986 1669171 1820000 2116195 2245000 2270214 2373763 2401121 2376831 2047377 1656595
19025A656595m57578j82559l08703j01899N449j85351j9095J35840O7858l5617
$$ 1656595 1199017 1016458 707755 605856 611305 425954 406859 542699 610557 574940
19015E74940k00566O3939M2000J32046q2541j35452J3822o0159K0063K0187k22657
$$ 574940 374374 438313 480313 612359 529818 394366 408188 348029 368092 388279 165622
19004A65622L5338P2934K9512K06492m0164m8798K2147J28020j7070N9582m2334
$$ 165622 200960 273894 303406 509898 469734 420936 443083 571103 554033 613615 571281
18993E71281j53371j74713L38614k021j2798j3601k524J60623M1357k93720j21223
$$ 571281 417910 243197 581811 579790 566992 553391 550867 711490 752847 459127 337904
18982C37904j85937N8521J22573J8098j99415O2310J30067j46059O9760K8111
$$ 337904 151967 210488 333061 351159 151744 214054 344121 198062 267822 295933
18972B95933j69234O6293k8720O728L5448r3629j04480K00678r8408J282p7057
$$ 295933 126699 192992 164272 171000 206448 112819 8339 209017 110609 111891 34834
18961C4834Q5682k718r2343K116K41795K31183N8518J3726j33284M1304R5623
$$ 34834 120516 117798 25455 27571 269366 500549 559067 572793 439509 480813 576436
18950E76436k8514m2813r5101n1793L5610j8714j46816M5009M2990q7346m2460
$$ 576436 547922 505109 410008 358215 393825 375111 228295 273304 316294 228948 186488
18939A86488r7026q5470M6278j1838J06480L2395j4093J08147N9755j03307J06161
$$ 186488 89462 3992 50270 38432 144912 177307 163214 271361 331116 227809 333970
18928C33970J18170r319p5108N2296l13495P7293O8438o047Q2467J35824N3269
$$ 333970 452140 442821 367713 420009 106514 183807 252245 246198 328665 464489 517758
18917E17758j11456j56024j25822J70233J60742j14654P2057j07184j88138O4880
$$ 517758 406302 250278 124456 294689 455431 340777 412834 305650 117512 182392
18907A82392K9668M2209L3122k4339k7405O7102J44421J14148p3440k02507j19877
$$ 182392 212060 254269 287391 263052 235647 302749 447170 561318 487878 285371 165494
18896A65494j09496J16393J07121K78309J53485j17298j93276K2460j3727O737
$$ 165494 55998 172391 279512 557821 711306 594008 400732 423192 409465 416202
18886D16202j40246k0360J3348m4913J11935J41387j33545k38985o7133J46310
$$ 416202 275956 255596 268944 224031 335966 477353 343808 104823 37690 184000
18876A84000K57449r2307L1345J68123M1533o1279j25173J20611J82725k6964
$$ 184000 441449 349142 380487 548610 590143 528864 403691 524302 707027 680063
18866F80063n3282J81237r0062K5572J40897L7969j3539k63500k40177j41113
$$ 680063 626781 808018 717956 743528 884425 922394 908855 645355 405178 264065
18856B64065M2501L9309j57473l5302P8830K26899J31719k47466k45339l8319
$$ 264065 306566 345875 188402 153100 231930 458829 590548 343082 97743 59424
18846E9424k6677K16077J66455m5197n068l2050J97831l6459j19710J2392J43887
$$ 59424 32747 248824 415279 370082 365014 332964 530795 494336 374626 387018 530905
18835E30905o638r6051N4257K99861J25314j86242j29081J26087K62108J78157
$$ 530905 524267 428216 482473 782334 907648 721406 592325 718412 980520 1158677
18825A158677K36090K36643K9527k15719M5974M34189j48137l28410l33106o063
$$ 1158677 1394767 1631410 1660937 1445218 1491192 1925381 1777244 1448834 1115728 1109665
18815A109665r3015j98731j61764k0413J11322Q7118J02628k75809k22726M8370
$$ 1109665 1016650 817919 656155 635742 747064 834182 936810 661001 438275 486645
18805D86645R0772j44282r252J71989M9651K11166R8371k38201q5535K07680o6733
$$ 486645 577417 433135 423883 595872 645523 856689 955060 716859 631324 839004 772271
18794G72271j517J49355n2350o5301O7976k1066j47684j53073N7370j67418L422
$$ 772271 770754 920109 867759 802458 870434 849368 701684 548611 605981 438563 441985
18783D41985J25417j36033j72367l9433j71062J14971J532j69777J2280L09975
$$ 441985 567402 431369 259002 219569 48507 163478 165010 -4767 7513 317488
18773C17488L4077P7141J70855J21569j40646p0516J86393J03670J3940p6494
$$ 317488 351565 428706 599561 721130 580484 509968 696361 800031 813971 737477
18763G37477j86114j68563j13656P7945K55333j23463J4291k1798j45447o4041
$$ 737477 551363 382800 269144 347089 602422 478959 493250 471452 326005 261964
18753B61964j33858l7505k849J60684J46161j2369j0644J3962J54330j9864J5278
$$ 261964 128106 90601 87752 248436 394597 382228 371584 385546 539876 520012 535290
18742E35290J19344j13876k7944m1052J99653k07735M0967O5477m6165N0262m3675
$$ 535290 654634 540758 512814 471762 671415 463680 504647 570124 523959 574221 530546
18731E30546j53376k45037J89244K64853l0665m8030J14092J53852J11068K06115
$$ 530546 377170 132133 321377 586230 555565 507535 621627 775479 886547 1092662
18721A092662p1747r981J54261P4751l2811m9818j78787k9234j177j15122J4056
$$ 1092662 1020915 1010934 1165195 1239946 1207135 1157317 978530 949296 948119 832997 847053
18710H47053n2600j30651l029J86828R1050M1906r3473k01736o3250j1048M6623
$$ 847053 794453 663802 660773 847601 938651 980557 887084 685348 622098 611050 657673
18699F57673R4247J28762J74380k4017m9122j7955j26959k7675L6403J135N1300
$$ 657673 751920 880682 1055062 1031045 981923 963968 837009 809334 845737 846872 898172
18688H98172j60209k36215Q184J12845L9411M6325K34520J73850l8471k26469
$$ 898172 737963 501748 509932 622777 662188 708513 943033 1116883 1078412 851943
18678H51943n4990q4584j67159J19519O699j56151P930J16935q8936K2513l9330
$$ 851943 796953 712369 545210 664729 671428 515277 523207 640142 551206 573719 534389
18667E34389J81067J26653j86242r9863J48635J21839J22102j24795k23210O69
$$ 534389 715456 842109 655867 556004 704639 826478 948580 823785 600575 601244
18657F01244N2214J50665n2984L2246N3677l02930k1418J5085N941J48464N0140
$$ 601244 653458 804123 751139 783385 837062 534132 512714 527799 533740 682204 732344
18646G32344P6055j45746r0906j30380l1536J49425K99368r0379j25613l8174
$$ 732344 808399 662653 571747 441367 409831 559256 858624 768245 642632 604458
18636F04458J05430j3155N2831K16486K03740n5086n6441J0885n0013j80521j23829
$$ 604458 709888 696733 749564 966050 1169790 1114704 1058263 1069148 1019135 838614 714785
18625G14785P2410R5428K1047J49638j32866l4666Q5113J13857Q3798k67871l42032
$$ 714785 787195 882623 903670 1053308 920442 885776 970889 1084746 1168544 900673 558641
18614E58641p2064J98609o6962q279N7358r0050l0171J49987p4584J05139P7674
$$ 558641 486577 685186 618224 609945 667303 577253 547082 697069 622485 727624 805298
18603H05298Q3609k0340j26537k92651O6633O7356M2944J70576K02420J93938
$$ 805298 888907 868567 742030 449379 516012 583368 626312 796888 999308 1193246
18593A193246r4375m1391k17628n6820r6123j17750O4106N2793J44445Q2513J25980
$$ 1193246 1098871 1057480 839852 783032 686909 569159 633265 686058 830503 913016 1038996
18582A038996j91550M4556o0351o0180Q6787J19054j94326J91837L06385j69624
$$ 1038996 847446 892002 831651 771471 858258 977312 782986 974823 1281208 1111584
18572A111584j06608j0211m0555R0054O1485m5372p3797j6069J42843P234q9037
$$ 1111584 1004976 994765 954210 1044264 1105749 1060377 986580 970511 1113354 1120588 1031551
18561A031551R5196k8699K5718j04090o3876Q9467j44824k35611j36509j3872
$$ 1031551 1126747 1098048 1123766 1019676 955800 1045267 900443 664832 528323 514451
18551E14451j1440Q5204L15393J03885j52982j58455K04215K54356M9018l8822
$$ 514451 503011 588215 903608 1007493 854511 696056 900271 1154627 1203645 1164823
18541A164823j06297k32823J95984j16033q9537P6873r6403k9870J78680J35143
$$ 1164823 1058526 825703 1021687 905654 816117 892990 796587 766717 945397 1080540
18531A080540p2719J69044o073O7695j89504r2039K1925j6587j12327p590l4839
$$ 1080540 1007821 1176865 1170792 1238487 1048983 956944 978869 962282 849955 842365 807526
18520H07526j0638l8845J804R6115M6169J52979o5701j43044J30770P1092N6236
$$ 807526 796888 758043 759847 855962 902131 1055110 989409 846365 977135 1048227 1104463
18509A104463Q8784j7342J87990N1528K5519k7691j52268j16760j12230Q8973
$$ 1104463 1193247 1175905 1363895 1415423 1440942 1413251 1260983 1144223 1031993 1120966
18499A120966L5141J40902n5945j50190j22137O9498m6085k2542L4509K05004
$$ 1120966 1156107 1297009 1241064 1090874 968737 1038235 992150 969608 1004117 1209121
18489A209121k632j2578N3405N7167q936n2272L0376m8509J0274Q1823j55528
$$ 1209121 1206489 1193911 1247316 1304483 1295547 1243275 1273651 1225142 1235416 1317239 1161711
18478A161711l18000j5854J4762K74534M64881J48327J2405k21319k24456r7080
$$ 1161711 843711 827857 842619 1117153 1582034 1730361 1742766 1521447 1296991 1199911
18468A199911j56600l0947J4020O2820L25110J82657M791j77888l49132P9391
$$ 1199911 1043311 1012364 1026384 1089204 1414314 1596971 1601762 1423874 1074742 1154133
18458A154133J5848J32411J41060Q0127P2007n7983k86584k06705J37931R8126
$$ 1154133 1169981 1302392 1443452 1523579 1595586 1537603 1251019 1044314 1182245 1280371
18448A280371P5440K02939M4581p7003q5791Q697r6253J07079j2310j31332q9776
$$ 1280371 1355811 1558750 1603331 1526328 1440537 1449234 1352981 1460060 1447750 1316418 1226642
18437A226642J55232j54090P5683P2865J86370m8069q2003P5632J65547j02008
$$ 1226642 1381874 1227784 1303467 1376332 1562702 1514633 1432630 1508262 1673809 1571801
18427A571801n9939l4759J4608N666p0728R1272K0564l1092J00555j03665K45927
$$ 1571801 1511862 1477103 1491711 1497377 1426649 1517921 1538485 1507393 1607948 1504283 1750210
18416A750210O2450l4160J02248j23740k80543q5211J29885J93298J37414m1133
$$ 1750210 1812660 1778500 1880748 1757008 1476465 1391254 1521139 1714437 1851851 1810718
18406A810718m0017P7697o7861p3757J37452P8365j28026k12004J35810J92716
$$ 1810718 1770701 1848398 1780537 1706780 1844232 1922597 1794571 1582567 1718377 1911093
18396A911093J03497Q5406o9431l69841l9183J51003J38225k3819R8017j40279
$$ 1911093 2014590 2099996 2030565 1660724 1621541 1772544 1910769 1886950 1984967 1844688
18386A844688j24922J34546Q8014j6524r6404j71056j8401K50313J16730J01496
$$ 1844688 1719766 1854312 1942326 1925802 1829398 1658342 1639941 1890254 2006984 2108480
18376B108480o927l44907N0147J58845j26069Q2045J37093J03608O0297J2634
$$ 2108480 2101553 1756646 1806793 1965638 1839569 1921614 2058707 2162315 2222612 2235246
18366B235246r8621j43066r9376j14071M4648K31532J73428q7503p0203k306J79535
$$ 2235246 2136625 1993559 1894183 1780112 1824760 2056292 2229720 2142217 2072014 2069708 2249243
18355B249243O6069J46426J22359J6958J8244k67728j00413J69563q046m0076
$$ 2249243 2315312 2461738 2584097 2601055 2619299 2351571 2251158 2420721 2412675 2372599
18345B372599L0892J32148p74q2083J08026p810J7569K17661n7585K00671J52003
$$ 2372599 2403491 2535639 2534865 2452782 2560808 2552998 2570567 2788228 2730643 2931314 3083317
18334C083317K363p0077p7335j82205K13588J54633j49085l7730J24225L46957
$$ 3083317 3085680 3015603 2938268 2756063 2969651 3124284 2975199 2937469 3061694 3408651
18324C408651l6785k37383N3805J21270K27130k9061O4488J64989L46980K26275
$$ 3408651 3371866 3134483 3188288 3309558 3536688 3507627 3572115 3737104 4084084 4310359
18314D310359k0660o2397L1474l2736N9038K9390K23425J8313k9071k3015M0606
$$ 4310359 4289699 4227302 4258776 4226040 4285078 4314468 4537893 4556206 4527135 4504120 4544726
18303D544726j04091j62326k6721J65594M8978n7043l8709k02488Q9091o6536
$$ 4544726 4440635 4278309 4251588 4417182 4466160 4409117 4370408 4167920 4257011 4190475
18293D190475m4089J49107M9209j71829o7889k1271p8775R8741K0766J42331J69788
$$ 4190475 4146386 4295493 4344702 4172873 4104984 4083713 4004938 4103679 4124445 4266776 4436564
18282D436564L1282k5144N4720j26179q5361J16082r9023J86331J8258Q3672l4375
$$ 4436564 4467846 4442702 4497422 4371243 4285882 4401964 4302941 4489272 4507530 4591202 4556827
18271D556827j0832J33277R9492J06840O2999j61581j16790R151Q3611P17N3612
$$ 4556827 4545995 4679272 4778764 4885604 4948603 4787022 4670232 4679383 4762994 4763711 4817323
18260D817323j3870R0938m14L25986m2912j38868j52616N9469P9529J59412N439
$$ 4817323 4803453 4894391 4893977 5219963 5177051 5038183 4885567 4945036 5024565 5183977 5189416
18249E189416K4505J01343M5201N4775J32576N3563n087J26254K0152n5023r9187
$$ 5189416 5213921 5315264 5360465 5415240 5547816 5601379 5596292 5722546 5742698 5687675 5588488
18238E588488J09393K33401J34472P7914j05664j18832L7495O9591Q1843P1960
$$ 5588488 5697881 5931282 6065754 6143668 6038004 5919172 5956667 6026258 6108101 6180061
18228F180061j79945J2348J35062J52119J37972K22057p782n067L29729J81369
$$ 6180061 6000116 6012464 6147526 6299645 6437617 6659674 6651892 6646825 6976554 7157923
18218G157923p0268R0052l8851o8271K21735M1411j29330k9226K02435p7687k35014
$$ 7157923 7087655 7177707 7138856 7070585 7292320 7333731 7204401 7175175 7377610 7299923 7064909
18207G064909J19050O3798K41979K34275J43913n6511o6757K26581L18677o0097
$$ 7064909 7183959 7247757 7489736 7724011 7867924 7811413 7744656 7971237 8289914 8229817
18197H229817L7342K27964J87243j83775J3034J58810m4250K6996K81697M88955
$$ 8229817 8267159 8495123 8682366 8498591 8511625 8670435 8626185 8653181 8934878 9423833
18187I423833R2861J79813J89071N7524j16790O1011J21985J44239K3060l0045
$$ 9423833 9516694 9696507 9885578 9943102 9826312 9887323 10009308 10153547 10176607 10146562
18177A0146562L4437L97647L05473K35560O5840J45816M6699J63304K50050l2391
$$ 10146562 10180999 10578646 10884119 11119679 11185519 11331335 11378034 11541338 11791388 11758997
18167A1758997K40693L41482J81073K54391L39592Q5786J30997K49725j3023K78799
$$ 11758997 11999690 12341172 12522245 12776636 13116228 13202014 13333011 13582736 13569713 13848512
18157A3848512L32562J44559R5650K40794J68821P2789L11825K85828K94951L42197
$$ 13848512 14181074 14325633 14421283 14662077 14830898 14903687 15215512 15501340 15796291 16138488
18147A6138488J76808L67450M09576N8970r7319J42236L39237L75164L78767K99935
$$ 16138488 16315296 16682746 17092322 17151292 17053973 17196209 17535446 17910610 18289377 18589312
18137A8589312K82352K92009M23945L17019K68798J35988L51479L66278M88292
$$ 18589312 18871664 19163673 19587618 19904637 20173435 20309423 20660902 21027180 21515472
18128B1515472K35040N49880N00126J73321K60601M99281O12997N95614M01542
$$ 21515472 21750512 22300392 22800518 22973839 23234440 23733721 24346718 24942332 25343874
18119B5343874L75875K58595M78271P17898M94030N16056N11387M56508M43971
$$ 25343874 25719749 25978344 26456615 27174513 27668543 28184599 28695986 29152494 29596465
18110B9596465N61294O77277Q16263J097329O92738M54194N68948Q00880R12271
$$ 29596465 30157759 30835036 31651299 32748628 33441366 33895560 34464508 35265388 36177659
18101C6177659O03399P06436R15904P57197P59927P89481Q15032Q85773J216001
$$ 36177659 36781058 37487494 38403398 39160595 39920522 40710003 41525035 42410808 43626809
18092D3626809J291336J080839J117409J197097J224186J185186J444235J452007
$$ 43626809 44918145 45998984 47116393 48313490 49537676 50722862 52167097 53619104
18084E3619104J173408J361618J653602J610953J553456J408739J706869K004254
$$ 53619104 54792512 56154130 57807732 59418685 60972141 62380880 64087749 66092003
18076F6092003J773253J984632J936309K112000K322425K164611K309003K525638
$$ 66092003 67865256 69849888 71786197 73898197 76220622 78385233 80694236 83219874
18068H3219874K548749K423278K587928K925049K975183L101082L253725L364095
$$ 83219874 85768623 88191901 90779829 93704878 96680061 99781143 103034868 106398963
18060A06398963L193415L352807L376753L800383M021810L979361M094204M167301
$$ 106398963 109592378 112945185 116321938 120122321 124144131 128123492 132217696 136384997
18052A36384997M543264M721181M406278M525144M841180M746150M694148M999245
$$ 136384997 140928261 145649442 150055720 154580864 159422044 164168194 168862342 173861587
18044A73861587N232727M947415M716765N070823M957400M787777M441345M228349
$$ 173861587 179094314 184041729 188758494 193829317 198786717 203574494 208015839 212244188
18036B12244188M139076M007415L833161L590942L330494K878436K558745K264383
$$ 212244188 216383264 220390679 224223840 227814782 231145276 234023712 236582457 238846840
18028B38846840K098007J545507P90148L61775M8192l73352o31634r40662j440622
$$ 238846840 240944847 242490354 243280502 243642277 243690469 243317117 242685483 241744821 240304199
18019B40304199k069311k546071k623289k738319k985062l313186l699873l924291
$$ 240304199 238234888 235688817 233065528 230327209 227342147 224028961 220329088 216404797
18011B16404797l918477l901705m216599m348162m165807m138138m333636m334360
$$ 216404797 212486320 208584615 204368016 200019854 195854047 191715909 187382273 183047913
18003A83047913m265666m168608m169017m086577m098149m085604l983426l846878
$$ 183047913 178782247 174613639 170444622 166358045 162259896 158174292 154190866 150343988
17995A50343988l847278l495820l590141l644389l544714l386657l370769l280128
$$ 150343988 146496710 143000890 139410749 135766360 132221646 128834989 125464220 122184092
17987A22184092l069070k959793k798110k774619k560556k775931k815746k538088
$$ 122184092 119115022 116155229 113357119 110582500 108021944 105246013 102430267 99892179
17979I9892179k358281k480332k200262k194724k282125k133397k231934k024903
$$ 99892179 97533898 95053566 92853304 90658580 88376455 86243058 84011124 81986221
17971H1986221j740361j865913j990426j795424j617995j630334j681059j316089
$$ 81986221 80245860 78379947 76389521 74594097 72976102 71345768 69664709 68348620
17963F8348620j418388j470636j504022j571653j333397j102460j513306j465970
$$ 68348620 66930232 65459596 63955574 62383921 61050524 59948064 58434758 56968788
17955E6968788j135175j220381j038055j110645j245121j116281q00336j056575
$$ 56968788 55833613 54613232 53575177 52464532 51219411 50103130 49302794 48246219
17947D8246219j046280r31050p81024p59903r34819r63320r18668p94130o53808
$$ 48246219 47199939 46268889 45487865 44727962 43793143 42829823 41911155 41117025 40463217
17938D0463217q83179q95674p92554o33790o51767p62996n81812n56938r24277
$$ 40463217 39580038 38684364 37891810 37258020 36606253 35843257 35261445 34704507 33780230
17929C3780230q04363n54541n26706n53889n52265p40377n49985l95178m17123
$$ 33780230 32975867 32421326 31894620 31340731 30788466 30048089 29498104 29102926 28685803
17920B8685803m90416m78459k21683l55085o21378o87989n22216l53680l76953
$$ 28685803 28195387 27716928 27495245 27140160 26518782 25830793 25308577 24954897 24577944
17911B4577944l02958l79712n83413l01425j89177k84476n84191n08641l98957
$$ 24577944 24274986 23895274 23311861 23010436 22821259 22536783 21952592 21443951 21044994
17902B1044994j98945k60041k34761l14132j49573k52362j43961k84898l35535
$$ 21044994 20846049 20586008 20351247 20037115 19887542 19635180 19491219 19206321 18870786
17893A8870786n76845n59678l32801l31606l46627k06624j55659q1187j66036
$$ 18870786 18293941 17734263 17401462 17069856 16723229 16516605 16360946 16279759 16113723
17884A6113723k94065l60330m60946m1859r1344j10595j16692k35791k27658k02407
$$ 16113723 15819658 15459328 14998382 14956523 14865179 14754584 14637892 14402101 14174443 13972036
17874A3972036m4341q673k84049n06493l05381j10887l94458m5934p5231k31965
$$ 13972036 13927695 13919022 13634973 13128480 12823099 12712212 12317754 12271820 12196589 11964624
17864A1964624l54088m6112p5068j17918j01125k64203k15323M1635j87355k35390
$$ 11964624 11610536 11564424 11489356 11371438 11270313 11006110 10790787 10832422 10645067 10409677
17854A0409677M5042j38231j91531K298j4133k20105j29643j93493P037j94865
$$ 10409677 10454719 10316488 10124957 10127255 10113122 9893017 9763374 9569881 9576918 9382053
17844I382053j43835O8670k8375k25294j04204o0768k0870j39772k40837j59438
$$ 9382053 9238218 9306888 9278513 9053219 8949015 8888247 8867377 8727605 8486768 8327330
17834H327330l35423j81672J81302J89855j11336k37289j54578n5440j7139j32674
$$ 8327330 7991907 7810235 7991537 8181392 8070056 7832767 7678189 7622749 7605610 7472936
17824G472936O0786o7540j63388j06907r4529j19184R0181j04739N6058m694L1841
$$ 7472936 7533722 7466182 7302794 7195887 7101358 6982174 7072355 6967616 7023674 7018980 7050821
17813G050821k02j44210j35937n1618l8440J43846j29052j74907M0938k46532
$$ 7050821 7050619 6906409 6770472 6718854 6680414 6824260 6695208 6520301 6561239 6314707
17803F314707K4376q9697k03071M5393R3701k9107k02407j60400P3181p9506L0652
$$ 6314707 6339083 6249386 6046315 6091708 6185409 6156302 5953895 5793495 5866676 5787170 5817822
17792E817822n3714Q0848R172j31540p5710L6231m3477j09619k18358l8368K1853
$$ 5817822 5764108 5844956 5854128 5722588 5646878 5683109 5639632 5530013 5311655 5273287 5295140
17781E295140M3186n2894J20850j40263l5085R6143m4264j10507j85812j36764
$$ 5295140 5338326 5285432 5406282 5266019 5230934 5327077 5282813 5172306 4986494 4849730
17771D849730J0919M0107M0299k18080j65181J24443k6046j20877J85429O9587
$$ 4849730 4860649 4900756 4941055 4722975 4557794 4682237 4656191 4535314 4720743 4790330
17761D790330k06972k6266n8287p7468j87453o9590J80209K37455J09148J16996
$$ 4790330 4583358 4557092 4498805 4421337 4233884 4164294 4344503 4581958 4691106 4808102
17751D808102R3686j64124j42547K15983L6244j02955L9305j07398j341j2909
$$ 4808102 4901788 4737664 4595117 4811100 4847344 4744389 4783694 4676296 4674955 4662046
17741D662046J6691R8748J30917j15843j15876k10448p1072j26147K2950K1361
$$ 4662046 4678737 4777485 4908402 4792559 4676683 4466235 4395163 4269016 4291966 4313327
17731D313327j79388j51824P3835J4289j68031k83022j98179k6640J62898L9706
$$ 4313327 4133939 3982115 4055950 4070239 3902208 3619186 3421007 3394367 3557265 3596971
17721C596971k25068l9817J38843j27196p9679M2997N0340O9784J0102j8214j3610
$$ 3596971 3371903 3332086 3470929 3343733 3264054 3307051 3357391 3427175 3437277 3419063 3405453
17710C405453j93635j54864j74357m6816j11338K6388j7618r7641m6834J52677
$$ 3405453 3211818 3056954 2882597 2835781 2724443 2750831 2733213 2635572 2588738 2741415
17700B741415m6287q2827Q6655L6846q2563k561j44174J4748q2344N871l497n7503
$$ 2741415 2695128 2612301 2698956 2735802 2653239 2650678 2506504 2521252 2438908 2444779 2441282 2383779
17688B383779j15902J19579m4099m3687J10792j4051J0007l3582R9613K06700
$$ 2383779 2267877 2387456 2343357 2299670 2410462 2396411 2406418 2372836 2472449 2679149
17678B679149j0442m832j32045j44700k02508k64391P6042M1363J7658o9901k04716
$$ 2679149 2668707 2663875 2531830 2387130 2184622 1920231 1996273 2037636 2055294 1985393 1780677
17667A780677P1531J99246R4776j2012O4983M2871p9421m8078L5035J67877j12510
$$ 1780677 1852208 2051454 2146230 2134218 2199201 2242072 2162651 2114573 2149608 2317485 2204975
17656B204975k26779Q0998J33699r0312j36056R3765o3179m5911L0745J70529
$$ 2204975 1978196 2059194 2192893 2102581 1966525 2060290 1997111 1951200 1981945 2152474
17646B152474l2290j63716K6709m1193J1568K19299K21542j55119j87370j13307
$$ 2152474 2120184 1956468 1983177 1941984 1953552 2172851 2394393 2239274 2051904 1938597
17636A938597j50012J08672J00417O5294j66037k24596j90616k25294R0388K23469
$$ 1938597 1788585 1897257 1997674 2062968 1896931 1672335 1481719 1256425 1346813 1570282
17626A570282K73180J990J0530j59113j27357J52098K9246P622K1784k17293o1345
$$ 1570282 1843462 1845452 1855982 1696869 1569512 1721610 1750856 1758478 1780262 1562969 1501624
17615A501624R9795K38383J44853l4131n9412o5608j56557l6232r069J4348L1899
$$ 1501624 1601419 1839802 1984655 1950524 1891112 1825504 1668947 1632715 1623646 1637994 1669893
17604A669893J37099L433k31878j86124j0327P6287J73500J79903J07856j05595
$$ 1669893 1806992 1810425 1578547 1392423 1382096 1458383 1631883 1811786 1919642 1814047
17594A814047j39461q5075J01004K2543j92023k1005J71393m9825o6891j82587
$$ 1814047 1674586 1589511 1690515 1713058 1521035 1500030 1671423 1621598 1554707 1372120
17584A372120L2092J40167j66335k45548K255J21201J08427l4606q7389n6796
$$ 1372120 1404212 1544379 1378044 1132496 1134751 1255952 1364379 1329773 1242384 1185588
17574A185588o1286j52952K2942K77097n09k9744J8015J85677K4717p9820j93704
$$ 1185588 1124302 971350 994292 1271389 1270880 1241136 1259151 1444828 1469545 1389725 1196021
17563A196021j41553J40894J03169r2235n3333P9139j8265j95616Q4246K5135
$$ 1196021 1054468 1195362 1298531 1206296 1152963 1232102 1213837 1018221 1102467 1127602
17553A127602R6290N6418o5596J43627J07945l26076j47449O948l4814J35824
$$ 1127602 1223892 1280310 1214714 1358341 1466286 1140210 992761 999709 964895 1100719
17543A100719p1481M2980N7593j04601j4020J78804j21657j97140R4068K49175
$$ 1100719 1029238 1072218 1129811 1025210 1011190 1189994 1068337 871197 965265 1214440
17533A214440m9542N246m4403K0852L4000L0529j38253m2874M8332p8862j10202
$$ 1214440 1164898 1170144 1125741 1146593 1180593 1211122 1072869 1029995 1078327 999465 889263
17522H89263k80097O682K00104J13117J17987J94903j01102k9009m4603m2776
$$ 889263 609166 615848 815952 929069 1047056 1241959 1140857 1111848 1067245 1024469
17512A024469j86739M7994L2470K07505J88465J74597j58046j87213q4607Q8188
$$ 1024469 837730 885724 918194 1125699 1314164 1488761 1330715 1143502 1058895 1147083
17502A147083J10873q5342l3251P7467j85990k41517q2129J98697k6391k32007
$$ 1147083 1257956 1172614 1139363 1216830 1030840 789323 707194 905891 879500 647493
17492F47493L8912m2571J15620J91084m6718N0183J93755J16273q8680l82054
$$ 647493 686405 643834 759454 950538 903820 954003 1147758 1264031 1175351 793297
17482G93297l1584K01587J19812q7926o9485j97515j49256J16813J04501q8806
$$ 793297 761713 963300 1083112 995186 925701 728186 578930 695743 800244 711438
17472G11438j5042K6440J00909J10395J4493j1879r8898r835P6952O5385j06819
$$ 711438 696396 722836 823745 934140 948633 936754 837856 828021 904973 970358 863539
17461H63539j44852j9001J71326J80531P9097n8496l03992q8079j32447l6524
$$ 863539 718687 699686 871012 1051543 1130640 1072144 768152 680073 547626 511102
17451E11102J72762K488o3113P5573N0210P6882L1823n8905q2249P6449o6285
$$ 511102 683864 686352 623239 698812 749022 825904 857727 798822 716573 793022 726737
17440G26737K9235n6756K0617j47909O426L2751O4040M684j89088m6660K64046
$$ 726737 755972 699216 719833 571924 578350 611101 675141 679825 490737 444077 708123
17429G08123K06038r0491k17811j03467R2570J78397J70344j83538k30043r8315
$$ 708123 914161 823670 605859 502392 594962 773359 943703 760165 530122 431807
17419D31807J82426J51081L8745J07298q1654l0852J7771j5578n9377M0441n2573
$$ 431807 614233 765314 804059 911357 829703 798851 816622 801044 741667 782108 729535
17408G29535j04633K60483M7759M9520j40366n1942J1647L4980k78896j71337
$$ 729535 624902 885385 933144 982664 842298 790356 802003 836983 558087 386750
17398C86750J62917P7493m3809j59724J6616K13560n3224l3923p968O6355J59044
$$ 386750 549667 627160 583351 423627 440243 653803 600579 566656 558688 625043 784087
17387G84087J463K17k02044j21671j26679Q1341o8184l95597J16330K78782R9776
$$ 784087 785550 785767 583723 462052 335373 416714 348530 -47067 69263 348045 447821
17376D47821M5464J52649j00328m6282j13431n5251J23137J57756m0157j7514
$$ 447821 493285 645934 545606 499324 385893 330642 453779 611535 571378 553864
17366E53864n5863p5099K26720M7878m7959j05770p7894j7969J25061j32793j79645
$$ 553864 498001 422902 649622 697500 649541 543771 465877 447908 572969 440176 260531
17355B60531k4344m6142P2475P5372Q8269J70150J35168m4585k20200k21719J39704
$$ 260531 236187 190045 262520 337892 426161 596311 731479 686894 466694 244975 384679
17344C84679L4549k94931j38410J56732J48103J57184R2510l1477n2067l1354
$$ 384679 419228 124297 -14113 142619 290722 447906 540416 508939 456872 425518
17334D25518P388j16061l4365J8187K4415K08603J89572R3796m5813k28259j64459
$$ 425518 432906 316845 282480 300667 325082 533685 723257 817053 771240 542981 378522
17323C78522r7316j53764k1215J39348O2432J21903j36034j16082L0146J59389
$$ 378522 281206 127442 106227 245575 308007 429910 293876 177794 207940 367329
17313C67329L8114J3465J35704J48789k06028m2560n5232J58198J43944j49733
$$ 367329 405443 418908 554612 703401 497373 454813 399581 557779 701723 551990
17303E51990m2297J4124k523r3830L9012J34874j10462k31435L8235K9901M4113
$$ 551990 509693 523817 521294 427464 466476 601350 490888 259453 297688 327589 371702
17292C71702l5542j31805O2459J20256J81318j01485j33116l3571R6365J97874
$$ 371702 336160 204355 266814 387070 568388 466903 333787 300216 396581 594455
17282E94455R4278R4947j85551j23919r0343L3714Q9684Q3685j03736j32002j29022
$$ 594455 688733 783680 598129 474210 383867 417581 507265 590950 487214 355212 226190
17271B26190m3991k3720J15349K68696K0853J30529j7457l8181j0002M9496k3063
$$ 226190 182199 158479 273828 542524 563377 693906 676449 638268 628266 677762 654699
17260F54699k00542j1021m3446n6327n9106N7829l3779O8804R9972L0877o4410
$$ 654699 454157 443136 399690 343363 284257 342086 308307 377111 477083 507960 443550
17249D43550J35244J15704r1012o4889k62273j19655o2877J34948K73809P854
$$ 443550 578794 694498 603486 538597 276324 156669 93792 228740 502549 510403
17239E10403j12822l0083K64339j53129j13741R8394k98195j02293n6376p1391
$$ 510403 397581 367498 631837 478708 364967 463361 165166 62873 6497 -64894
17229f4894k61954n3523M52957L79422J57233m2557j2862J03305j17009j65367
$$ -64894 -326848 -380371 72586 452008 609241 566684 553822 657127 540118 374751
17219C74751q9539p6671J13599j27222k28184j7998N9599K18817j5220N0870N3846
$$ 374751 285212 208541 322140 194918 -33266 -51264 8335 227152 211932 262802 316648
17208C16648o6263o7792r4744k2574K79533j656k14424k4338J76654m4940N2452
$$ 316648 250385 182593 87849 65275 344808 343152 128728 104390 281044 236104 288556
17197B88556L9839p1460n5357K03083J02855l5074J84359J25667j44628J46488
$$ 288556 328395 256935 201578 404661 507516 472442 656801 782468 637840 784328
17187G84328O850j62046j89918R0514M9265j00836M1499J5159j30749j37821j23921
$$ 784328 791178 629132 439214 529728 578993 478157 519656 534815 404066 266245 142324
17176A42324Q2789j442J18714K19552n6785k26910p9684K0530K8179O0190j54876
$$ 142324 225113 223671 342385 561937 505152 278242 198558 219088 247267 307457 152581
17165A52581M0008K3324r5453M0579K6000r6259N5561J92717j95881m4550J3674
$$ 152581 192589 215913 120460 161039 187039 90780 146341 339058 143177 98627 112301
17154A12301K7256L09886m5350j05324K35201j42961j72042p2616j78112J1979
$$ 112301 139557 449443 404093 298769 533970 391009 218967 146351 -31761 -19782
17144a9782r1488K04775R6663Q0749l2450Q0366o5140P8559O2324K1813p4119
$$ -19782 -111270 93505 190168 270917 238467 318833 253693 332252 394576 416389 342270
17133C42270P4631q9300j26440J31645j37757q2649p2421O9472N9245N607m5431
$$ 342270 416901 327601 201161 332806 195049 112400 39979 109451 168696 174303 128872
17122A28872k1806K3429R2582k0915p3574M0626L0080j7485k1169R886j17593
$$ 128872 107066 130495 223077 202162 128588 169214 199294 181809 160640 170526 52933
17111E2933K7511q2958n4246j12094P6892j8677K1764K09930j14296q9440N7791
$$ 52933 80444 -2514 -56760 -168854 -91962 -110639 -88875 121055 6759 -82681 -24890
17100b4890K3858K67702K03139N0806K8097j93752j13197r6032p4243p1171j87032
$$ -24890 -1032 266670 469809 520615 548712 354960 241763 145731 71488 317 -186715
17089a86715M0210J85953j7621O2405J38451j3975j85313p3384J88873M2615q4982
$$ -186715 -146505 39448 21827 84232 222683 208708 23395 -49989 138884 181499 96517
17078I6517k29510j48890Q1245j2421o7916n3980N9219K65300J89215N3901J11569
$$ 96517 -132993 -281883 -200638 -213059 -280975 -334955 -275736 -10436 178779 232680 344249
17067C44249j53580k02987q3758R2867P088M8J33520K2459K4047J01927L3685
$$ 344249 190669 -12318 -96076 -3209 3879 3927 137447 159906 183953 285880 319565
17056C19565j25670j37925M1902J03570K46175j10214j51043j34043m728n1865
$$ 319565 193895 55970 97872 201442 447617 337403 186360 52317 47589 -4276
17046d276J60800N1166P2403m3812O2123K47794M3036j94162j62470L24403m350
$$ -4276 156524 207690 280093 236281 298404 546198 589234 395072 232602 557005 552655
17035E52655P3805j60457m2319k09807o3765p5465L7252q2453p068k2979j14296
$$ 552655 626460 466003 423684 213877 150112 74647 111899 29446 22378 -601 -114897
17024a14897J03103K51694m8592j56670Q9699O3173k1098N8836O1293j02373r3227
$$ -114897 -11794 239900 191308 34638 124337 187510 166412 225248 286541 184168 90941
17013I0941k4855Q8123J56023j75835k15322j84321l5222M2754J1127J96505K4298
$$ 90941 66086 154209 310232 134397 -80925 -265246 -300468 -257714 -246587 -50082 -25784
17002b5784J17691M7253J33622J53120r3102q1052m7590j72537J05772j74574
$$ -25784 91907 139160 272782 425902 332800 251748 204158 31621 137393 -37181
16992c7181j87149P8687J13050n3520J48601R9307m4088m3843J24600J07785r2773
$$ -37181 -224330 -145643 -32593 -86113 62488 161795 117707 73864 198464 306249 213476
16981B13476k34068k2147J09623j4139j08295J32019J7011j22517L3741K23941
$$ 213476 -20592 -42739 66884 52745 -55550 76469 93480 -29037 4704 228645
16971B28645m9584k82119p685J14433l5029Q8313N4547N1239l3300m9233l2144
$$ 228645 179061 -103058 -110743 3690 -31339 56974 111521 162760 129460 80227 48083
16960D8083m5779j21491j9763K71086K19169j69639k70171R878K9143n8019j34827
$$ 48083 2304 -119187 -138950 132136 351305 181666 -88505 -78627 -49484 -107503 -242330
16949b42330n500J31027J08221j55096o2486J44383M9480J17230K7642k0113j27024
$$ -242330 -247830 -116803 -8582 -163678 -226164 -81781 -32301 84929 112571 92458 -34566
16938c4566m8256Q0834Q3115m8010j02225o4455n6354M6178O8216L7364j3J49209
$$ -34566 -82822 -1988 81127 33117 -69108 -133563 -189917 -143739 -75523 -38159 -38172 111037
16926A11037M2040q6326l6482K16067J514q6165J21237k18552j08553K00576J56937
$$ 111037 153077 66751 30269 246336 247850 161685 282922 64370 -44183 156393 313330
16915C13330q9835k0960k12120k04402J48341R3815L3918k86745J1618J25641
$$ 313330 223495 202535 -9585 -213987 -65646 28169 62087 -224658 -213040 -87399
16905h7399J28880J02280m3182K58252Q0644k32881l30654M3600J14742J55929
$$ -87399 41481 143761 100579 358831 439475 206594 -124060 -80460 34282 190211
16895A90211o1711j26119M4906m1209j4984m9078r8170J64362j933J4456o4164
$$ 190211 128500 2381 47287 6078 -8906 -57984 -156154 8208 6275 20731 -43433
16884d3433N5439J21472j63854J5337J97025j26983L1931m0906R4438J21376J02750
$$ -43433 12006 133478 -30376 -15039 181986 55003 86934 46028 140466 261842 364592
16873C64592O1044k33144k97717M1391J18195J71485J20514k63641j32796M7528
$$ 364592 425636 192492 -105225 -63834 54361 225846 346360 82719 -50077 -2549
16863b549J15681k0751P776J27088o3331p9134j3340q7021R1590r5683k19967
$$ -2549 113132 92381 100157 227245 163914 84780 71440 -15581 76009 -19674 -239641
16852b39641j45049R086R9386J5524k3948j4054o1990J11837O3930p4021K3001
$$ -239641 -384690 -375604 -276218 -260694 -284642 -298696 -360686 -248849 -184919 -258940 -235939
16841b35939J16707n5285P0216L32469q8129j28273J0507N8381o1002k15063P722
$$ -235939 -119232 -174517 -104301 228168 140039 11766 22273 80654 19652 -195411 -187689
16830a87689K07437j02165J8623o7734Q9463J21405N6542m8953k1587M0444J5139
$$ -187689 19748 -82417 -63794 -131528 -42065 79340 135882 86929 65342 105786 120925
16819A20925O9530o7137k9568J18127K4960l62658k1367J82244m1107p0962j42369
$$ 120925 190455 123318 93750 211877 236837 -125821 -147188 35056 -6051 -77013 -219382
16808b19382J39048J10970J85655j32360q5947Q4424k6650Q1899k2040j11675
$$ -219382 -80334 30636 216291 83931 -2016 82408 55758 137657 115617 3942
16798C942J21805K37552L5034o7852j476J32666n6786j21858j97897j38236j11849
$$ 3942 125747 363299 398333 330481 329005 461671 404885 283027 85130 -53106 -164955
16787a64955J85558J72665m3801M6663n4666k02164n8709R3709K36790J5547k24876
$$ -164955 20603 193268 149467 196130 141464 -60700 -119409 -25700 211090 226637 1761
16776A761j21777j28631J91J37885R3490J1339r4086q3326j69131o9767J14163
$$ 1761 -120016 -248647 -248456 -110571 -17081 -5742 -99828 -183154 -352285 -422052 -307889
16765c07889J50303m6458J21518J95704j62851j11701M8410j5255J23316R7543
$$ -307889 -157586 -204044 -82526 113178 -49673 -161374 -112964 -128219 -4903 92640
16755I2640l14202o0763J08522J05754j09333P65m4532J07739K20511J90995R063
$$ 92640 -221562 -282325 -173803 -68049 -177382 -176617 -221149 -113410 107101 298096 307159
16744C07159r2114j57342r6859M8965L59141J61188k09565j68179k01619j45548
$$ 307159 215045 57703 -39156 9809 368950 530138 320573 152394 -49225 -194773
16734a94773j13189m6390J40660K0806P1355n3276r5067q3923n856J73607J68438
$$ -194773 -307962 -354352 -213692 -192886 -121531 -174807 -269874 -353797 -359653 -186046 -17608
16723a7608J72389P1553q6823n5770m233N6962k02215k7591K21668K5721J15495
$$ -17608 154781 226334 139511 83741 79508 136470 -65745 -93336 128332 154053 269548
16712B69548P1726j83963l84437m5372J02258K38982Q9995q24k05197j08652R4635
$$ 269548 341274 157311 -227126 -272498 -170240 68742 158737 157913 -47284 -155936 -61301
16701f1301K4881j76888J31836J36625J84862j33680l08956Q2318K32883J95271
$$ -61301 -36420 -213308 -81472 55153 240015 106335 -202621 -120303 112580 307851
16691C07851j81737k12904j12361P1090J99218o5031j26290q7215l0275J43425
$$ 307851 126114 -86790 -199151 -128061 71157 6126 -120164 -207379 -237654 -94229
16681i4229R4485L4497K23314J8239j13047m5586j05024M9896P2041M6106j29549
$$ -94229 256 34753 258067 276306 163259 117673 12649 62545 134586 180692 51143
16670E1143M2937o1759j33646M5435Q9980J24323P4574Q1229p7093k90067k8133
$$ 51143 94080 32321 -101325 -55890 34090 158413 232987 314216 237123 -52944 -81077
16659h1077j09292j43775J13509J40832j46103R9332L72408M1203k11003j17289
$$ -81077 -190369 -334144 -220635 -79803 -225906 -126574 245834 287037 76034 -41255
16649d1255l6681M4023J79446j04872j70653j14594j22185p3749R1452K29398
$$ -41255 -77936 -33913 145533 40661 -129992 -244586 -366771 -440520 -349068 -119670
16639a19670K15241P1817M0893n2715m5389j14845Q1588O9420J28687r4530k44505
$$ -119670 95571 167388 208281 155566 110177 -4668 76920 146340 275027 180497 -64008
16628f4008k27590p7048J45009Q0428J64681Q1376J63512j44083o1690m9225j49989
$$ -64008 -291598 -368646 -223637 -143209 21472 102848 266360 122277 60587 11362 -138627
16617a38627j24719M0533J0899l8898O3222j27996j06815j02108j50228J73092
$$ -138627 -263346 -222813 -211914 -250812 -187590 -315586 -422401 -524509 -674737 -501645
16607e01645J16256J50290N0079Q3306J76516L7711j6083J30911K31851k5567
$$ -501645 -385389 -235099 -185020 -101714 74802 112513 96430 227341 459192 433625
16597D33625j79804j65347m6392J23450K04795J14151l7678j01086j1121k4877
$$ 433625 253821 88474 42082 165532 370327 484478 446800 345714 334593 309716
16587C09716j90584m01016k81946J95974K13490O1774K33850K11733l0446n7210
$$ 309716 119132 -281884 -563830 -367856 -154366 -92592 141258 352991 322545 265335
16577B65335p0508Q3585j70752k5106J25773l8229j77559k1750K2049J32990K1018
$$ 265335 194827 278412 107660 82554 208327 170098 -7461 -29211 -7162 125828 146846
16566A46846m5696r0980j18860m4002N3952J74932J15009m5001o8392N1352j87647
$$ 146846 101150 10170 -108690 -152692 -98740 76192 191201 146200 77808 129160 -58487
16555e8487k26795m3648J66006N7618j8104P1036N9625m3636k9129j6189R9274
$$ -58487 -285282 -328930 -162924 -105306 -123410 -52374 7251 -36385 -65514 -81703 17571
16544A7571J78474l581j48177o2835M2224k920J01509m6978l8449j02522O4593
$$ 17571 196045 192464 44287 -18548 23676 20756 122265 75287 36838 -65684 -1091
16533a091p2605r0413J27680j26125K02770N7976j16501k0601K22223N2093J1564
$$ -1091 -73696 -164109 -36429 -162554 40216 98192 -18309 -38910 183313 235406 246970
16522B46970l5139m8810n2038r0378J28080K40654M1166M6510k7773k71623K6895
$$ 246970 211831 163021 110983 20605 148685 389339 430505 477015 449242 177619 204514
16511B04514p0301o2490j36639l7837k0466O2639J34525O6495k07117N4246L9915
$$ 204514 134213 71723 -64916 -102753 -123219 -60580 73945 140440 -66677 -12431 27484
16500B7484m5533J10036J54330j5761j730j43437K2258K39429p0752j3643M6117
$$ 27484 -18049 91987 246317 230556 228826 85389 107647 347076 276324 262681 308798
16489C08798l6690J38118o6394l1687j67075K4559o4261n5197k6319r6553J96713
$$ 308798 272108 410226 343832 312145 145070 169629 105368 50171 23852 -72701 124012
16478A24012N5924j96498j70764J62001L5634q3721M9654j30608R9112J26932
$$ 124012 179936 -16562 -187326 -25325 10309 -73412 -23758 -154366 -55254 71678
16468G1678r1256L3212n0217M5106p9605q461J3094l2336R4280P0934K7348p6278
$$ 71678 -19578 13634 -36583 8523 -71082 -79543 -66449 -98785 -4505 66429 93777 17499
16456A7499L7265J02143J6782N9821O4674q5038k59541q563n2927n0221J94131
$$ 17499 54764 156907 173689 233510 298184 213146 -46395 -54958 -107885 -158106 36025
16445C6025L7925p3729L2976O4521R5971K3187o4857j4503l5798k95197K9972
$$ 36025 73950 221 33197 97718 193689 216876 152019 137516 101718 -193479 -163507
16434a63507K44982r5001k7436K56901N4144k37746P6507J71996p043k00329m26808
$$ -163507 81475 -13526 -40962 215939 270083 32337 108844 280840 273797 73468 -353340
16423c53340J97762K79965R6733l26859k39998r5297l1758K31525L6487O9375
$$ -353340 -155578 124387 221120 -105739 -345737 -441034 -472792 -241267 -204780 -135405
16413a35405m5454k2624L02643j6523M1780O703N7144j49576R3536J10784r6928
$$ -135405 -180859 -203483 99160 82637 124417 131120 188264 38688 132224 243008 146080
16402A46080j55275k74408k17313l2241K19856K25274J53152R5242j64717j48348
$$ 146080 -9195 -283603 -500916 -533157 -313301 -88027 65125 160367 -4350 -152698
16392a52698J11090J64890M6433Q3141n7562p6660k19748p8456k05962J9441O5433
$$ -152698 -41608 123282 169715 252856 195294 118634 -101114 -179570 -385532 -366091 -300658
16381c00658r8620K45181j4359k85844M8748R2213P0844K86791P9704j13352N7903
$$ -300658 -399278 -154097 -168456 -454300 -405552 -313339 -242495 44296 124000 10648 68551
16370F8551j0090j28366m2143P6005Q5386K5563o4966j57796K6447J28902J54353
$$ 68551 58461 -69905 -112048 -36043 49343 74906 9940 -147856 -121409 7493 161846
16359A61846Q57j88795R5880J13397K0845J3545k66434k58991p4515K04117K76988
$$ 161846 162703 -26092 69788 183185 204030 217575 -48859 -307850 -382365 -178248 98740
16348I8740J04916K00345J21955j60645k54286K18781p2696k52028p1000K080
$$ 98740 203656 404001 525956 365311 111025 329806 257110 5082 -65918 -63838
16338f3838J05135J33186K08281m4962j3059o3620j10526k18232p1347n2806J00403
$$ -63838 41297 174483 382764 337802 324743 261123 150597 -67635 -138982 -191788 -91385
16327i1385J33167J50873N2459k34011N0327Q5945q6078l1429j32943j76201P55
$$ -91385 41782 192655 245114 11103 61430 147375 61297 29868 -103075 -279276 -278521
16316b78521K48652K75246k06401j39674j81609J53977P8469J38536p313k35058
$$ -278521 -29869 245377 38976 -100698 -282307 -128330 -49861 88675 81362 -153696
16306a53696J12034M1772j80432k6063O6056l918N3183Q8755K34342J6719r1258
$$ -153696 -41662 110 -180322 -206385 -140329 -144247 -91064 -2309 232033 248752 157494
16295A57494k63121L5805N00789R5251j98473k25746j05474n0815j65386J09669
$$ 157494 -105627 -69822 430967 526218 327745 101999 -3475 -54290 -219676 -110007
16285a10007J08691J0961n5154N8734J66626j38790j25021o0621N5680J3818J41968
$$ -110007 -1316 9645 -45509 13225 179851 41061 -83960 -144581 -88901 -75083 66885
16274F6885J71548K01j36892m551q4039j21532J96500J17134n7026k36462j27664
$$ 66885 238433 238634 101742 97191 13152 -108380 88120 205254 148228 -88234 -215898
16263b15898Q123O8522J11238J034q7536K205R1368O6132P9054n8222o6962p6277
$$ -215898 -207775 -139253 -28015 -26981 -114517 -112312 -20944 45188 124242 66020 -942 -77219
16251g7219j11564j13354O563P2217J03949J84622K04828j19096r4769J492q3189
$$ -77219 -188783 -302137 -295574 -223357 -119408 65214 270042 150946 56177 57669 -25520
16240b5520j12659k6142M2260J40010J188l01900j37742j4228Q3248J79363M3551
$$ -25520 -138179 -164321 -122061 17949 19137 -282763 -420505 -434733 -351485 -172122 -128571
16229a28571J53004O6734j4721j54424P2466k65972j73554O5913J52800Q3171
$$ -128571 24433 91167 76446 -77978 -5512 -271484 -445038 -379125 -226325 -143154
16219a43154q6188J0081K1239n0749o9370K73573J48904p0407L608J5605p4749
$$ -143154 -229342 -219261 -198022 -248771 -318141 -44568 104336 33929 37537 53142 -21607
16208b1607L9983j60864j69499J17988J17384K17880K66695j42152j99419k097
$$ -21607 18376 -142488 -311987 -193999 -76615 141265 407960 265808 66389 64292
16198F4292J64032J7305j42588k3416O2268p5220j45400J85663k885j46732K8564
$$ 64292 228324 245629 103041 79625 141893 66673 -78727 106936 104051 -42681 -14117
16187a4117J2379J54665J14800L4492j36225P0856L9815j0199j61944r3214K7205
$$ -14117 -1738 152927 267727 302219 165994 236850 276665 266466 104522 11308 38513
16176C8513O9119p2583K4707J01731j20511k62324j48277m3141L03597J21593
$$ 38513 107632 35049 59756 161487 40976 -221348 -369625 -412766 -109169 12424
16166A2424p1554O7495n1477J81214N6157q6137N1927J35227L9321M5551N6567
$$ 12424 -59130 8365 -43112 138102 194259 108122 160049 295276 334597 380148 436715
16155D36715q1279l07761o9454j00480L9541Q2988M1119m617p7070k01361R1673
$$ 436715 355436 47675 -21779 -122259 -82718 270 41389 36772 -40298 -241659 -149986
16144a49986K86932l468j45231O7359J32831j5123l5276r5358l9058O0836J68526
$$ -149986 136946 133478 -11753 55606 188437 173314 138038 42680 3622 64458 232984
16133B32984N013m4920p6091o9990k11198j22483J7650L9920K9620P3321O9954
$$ 232984 237997 193077 116986 46996 -164202 -286685 -269035 -229115 -199495 -126174 -56220
16122e6220N5378N8373j44505J09834J3168L8917j00969M4883J63871O1520r4549
$$ -56220 -842 57531 -86974 22860 36028 74945 -26024 18859 182730 244250 149701
16111A49701m7618j16562l9286O2895J93124k9035p1636l2462n6445K4264j64165
$$ 149701 102083 -14479 -53765 9130 202254 173219 101583 69121 12676 36940 -127225
16100a27225l7622J76252O7257j8816P6584j07010R598J81395k4354j7851j45887
$$ -127225 -164847 11405 78662 59846 136430 29420 39018 220413 196059 178208 32321
16089C2321k28791j0067J08637R5776j05484k3775j22144n6733O6878k0624J07113
$$ 32321 -196470 -206537 -97900 -2124 -107608 -131383 -253527 -310260 -243382 -264006 -156893
16078a56893J05846K98744j52317k09300N5337Q1325m3192j68793p3467K20961
$$ -156893 -51047 247697 95380 -113920 -58583 22742 -20450 -189243 -262710 -41749
16068d1749M2467m4979P9281J25772l4085K4793o3379j27640R5361m3453o4242
$$ -41749 718 -44261 35020 160792 126707 151500 88121 -39519 55842 12389 -51853
16057e1853J18826M8375K8599M1306R5608q5042m0669r8859k3486J47102J69321
$$ -51853 66973 115348 143947 185253 280861 195819 155150 56291 32805 179907 349228
16046C49228k32755m8326L4309M641N5978J6791o7891O7406J7564k5136J1269
$$ 349228 116473 68147 102456 107097 163075 179866 111975 179381 196945 171809 183078
16035A83078J5061K663J10069J22817k11323k01726L5204K65520Q8262K1734k27155
$$ 183078 198139 200802 310871 433688 222365 20639 55843 321363 409625 431359 204204
16024B04204J5752O8978j11762L5576j28720k84964j4895N5152P455j10395j04088
$$ 204204 219956 288934 177172 212748 84028 -200936 -215831 -160679 -153224 -263619 -367707
16013c67707P4377J55583R211q8520K49000P9268Q9323k3739O1616J84356k3919
$$ -367707 -293330 -137747 -128536 -217056 31944 111212 200535 176796 238412 422768 398849
16002C98849k87259j09450J81426K37952J24928P5699k14018j20906j95046j05718
$$ 398849 111590 2140 183566 421518 546446 622145 408127 287221 92175 -13543
15992a3543J8220q4416l1345m9800M8276J61711K0061L8444J18149P8274j56250
$$ -13543 4677 -79739 -111084 -160884 -112608 49103 69164 107608 225757 304031 147781
15981A47781j45289r1467r7030K78921N9507M9617k354p3048j70542k45484p7592
$$ 147781 2492 -88975 -186005 92916 152423 202040 199686 126638 -43904 -289388 -366980
15970c66980J92030K45846Q1342K89122J6459j61286j22160j34505j57751k07792
$$ -366980 -174950 70896 152238 441360 457819 296533 174373 39868 -117883 -325675
15960c25675R6800j9213N9573q4779p7300q3352p2875K952j5107N1169J28673
$$ -325675 -228875 -248088 -188515 -273294 -350594 -433946 -506821 -503869 -518976 -467807 -339134
15949c39134K21833J06408j77798m9120J09669J71785j23692j02548m0947K78957
$$ -339134 -117301 -10893 -188691 -237811 -128142 43643 -80049 -182597 -223544 55413
15939E5413J78084k11534q0351K12023O8655j03311j82118O1605N6367j17118
$$ 55413 233497 21963 -58388 153635 222290 118979 -63139 -1534 54833 -62285
15929f2285m2411K5700o6595M4855O397j13596r8169q580K3563K50202K95152
$$ -62285 -104696 -78996 -145591 -100736 -94339 -207935 -306104 -314684 -291121 -40919 254233
15918B54233p156l45854J99107N1351j93313l3985r4087J19907M154P549j5477
$$ 254233 247077 -98777 100330 151681 -41632 -75617 -169704 -49797 -45643 -38094 -53571
15907e3571o2152K70244j27041j26149L9006N5712j73610j69501L9732O0732J24306
$$ -53571 -115723 154521 27480 -98669 -59663 -3951 -177561 -347062 -307330 -246598 -122292
15896a22292K49032K95363p0592j43595l8063j12130k1334R743p0001J03769J26024
$$ -122292 126740 422103 351511 207916 169853 57723 36389 46132 -23869 79900 205924
15885B05924j13579O3535l3372j30746j22681J11488k3688J14067J44162m7748
$$ 205924 92345 155880 122508 -8238 -130919 -19431 -43119 70948 215110 167362
15875A67362J61722J08009j83836j62575k6574l27620j16263N1145J79836J2234
$$ 167362 329084 437093 253257 90682 64108 -263512 -379775 -328630 -148794 -136560
15865a36560K05375J12n5934r1108k37661o050m824O6919m535K67465L06253J2164
$$ -136560 68815 68927 12993 -78115 -315776 -321826 -326650 -259731 -264266 3199 309452 321616
15853C21616l0470l4959k72504R0943O1431q001R8296r8059p8573j0523P4135
$$ 321616 291146 256187 -16317 74626 136057 128056 226352 128293 49720 39197 113332
15842A13332j47919m8086J07533N0008o8255j0756K03713o208o8086o7865L8752
$$ 113332 -34587 -82673 24860 74868 6613 -4143 199570 193362 125276 57411 96163
15831I6163J12371k4003m2335J22583k83625p3543r4621J3804R6784n4118q1161
$$ 96163 208534 184531 142196 264779 -18846 -92389 -187010 -173206 -76422 -130540 -211701
15820b11701k8030O8868K14694Q7789m3801j5489j6171Q2441O4689P9518O7313
$$ -211701 -239731 -170863 43831 131620 87819 72330 56159 138600 203289 282807 350120
15809C50120N7668j35265n5217J70023k4719q1970Q5997M503j79819j58950L336
$$ 350120 407788 272523 217306 387329 362610 280640 366637 371140 191321 32371 35707
15798C5707M1784k7400n1463j1767J46120m4012k09681Q3382N3015L242l3760
$$ 35707 77491 50091 -1372 -13139 132981 88969 -120712 -37330 15685 18927 -14833
15787a4833K601R1045K32629J07582O085k94874L5299L1976m6728j13275m5929
$$ -14833 -12232 78813 311442 419024 425109 130235 165534 197510 150782 37507 -8422
15776h422K45854n7632j33837j4449J65368p9212j92365O4390K5996L6749J67220
$$ -8422 237432 179800 45963 31514 196882 117670 -74695 -10305 15691 52440 219660
15765B19660J0724r624J22244O7080k26047j5260k2449R6625R8423J07647q7951
$$ 219660 230384 220760 343004 410084 184037 168777 146328 242953 341376 449023 361072
15754C61072j65020J33084J2876m1941Q069P8109k3106j99784q9083P7862J85926
$$ 361072 196052 329136 342012 300071 308140 386249 363143 163359 74276 152138 338064
15743C38064n7516j66232M7589R6105K9138j07791j51041j54781J99800J06585
$$ 338064 280548 114316 161905 258010 287148 179357 28316 -126465 73335 179920
15733A79920J79987J37015L5067k20389j65176R255q1042p0619J08472L6535J80136
$$ 179920 359907 496922 531989 311600 146424 155679 74637 4018 112490 149025 329161
15722C29161K13505k32584k29488K37031L44823K51780j37259k99804j06761j03902
$$ 329161 542666 310082 80594 317625 662448 914228 776969 477165 370404 266502
15712B66502k5611J14614J07909j3172j77904m4019J42301k152j55990q117J25085
$$ 266502 240891 355505 463414 450242 272338 228319 370620 368468 212478 204361 329446
15701C29446J79696p1344n5896J79977J52410J03252l00209k31124k9141k2155
$$ 329446 509142 437798 381902 561879 714289 817541 517332 286208 257067 234912
15691B34912K8605J0843j86986N4080J48624M2484J02068L0739j08984P4110o6705
$$ 234912 263517 274360 87374 141454 290078 332562 434630 465369 356385 430495 363790
15680C63790j11880j9333j05282j92307k8860L6289K19317J00858O9119j35415
$$ 363790 251910 232577 127295 -65012 -93872 -57583 161734 262592 331711 196296
15670A96296l23230O4732L7278J07293J26615L3625J76630j25237o8169L0813
$$ 196296 -126934 -62202 -24924 82369 208984 242609 419239 294002 225833 256646
15660B56646J43510J07933p8776j57436l20663J2499J07215j18164o6896q5103
$$ 256646 400156 508089 429313 271877 -48786 -36287 70928 -47236 -114132 -199235
15650a99235k3149J98083J35742k56927k5246L74157J19701K7939O3954j38112
$$ -199235 -222384 -24301 111441 -145486 -170732 203425 323126 351065 415019 276907
15640B76907l06178k14322k1509K24632J89902J26534m1401j01887j62450L1050
$$ 276907 -29271 -243593 -265102 -40470 149432 275966 234565 132678 -29772 1278
15630A278L2963j2950k8273m4934j00934J23596o8407q4708Q3927O6461j06668
$$ 1278 34241 21291 -6982 -51916 -152850 -29254 -97661 -182369 -98442 -31981 -138649
15619a38649J20665Q4815r1018q2645j43640k3193l3001j06720M0331K96387J86600
$$ -138649 -17984 66831 -24187 -106832 -250472 -273665 -306666 -413386 -373055 -76668 109932
15608A09932n1347j65648r2106K68147J02234r2824J36120J56600q8139j69953
$$ 109932 58585 -107063 -199169 68978 171212 78388 214508 371108 282969 113016
15598A13016n2465q3464J05156j55490m4297L1227J32023L08725J42409j02555
$$ 113016 60551 -22913 82243 -73247 -117544 -86317 45706 354431 496840 394285
15588C94285J07323O4687l1510k16648n1712M5036J32005k26288m1137p2370r8225
$$ 394285 501608 566295 534785 318137 266425 311461 443466 217178 176041 103671 5446
15577E446k5301k5808K3299O7841J11980J51833j04258j52347m3710K08490k30677
$$ 5446 -19855 -45663 -22364 45477 157457 309290 205032 52685 8975 217465 -13212
15566a3212j25114P0994K48812r4632M990j46850k59928J03235J56091Q7180r7373
$$ -13212 -138326 -67332 181480 86848 91838 -55012 -314940 -211705 -55614 31566 -65807
15555f5807P4324m610O4939J98958R992k8448j8482j08554Q495J00838m7090k64638
$$ -65807 8517 3907 68846 267804 277796 249348 230866 122312 130807 231645 184555 -80083
15543h0083j41710m7029M9730R057j6484L11280L2452K9919P4795J49872l9486
$$ -80083 -221793 -268822 -219092 -210035 -226519 84761 117213 147132 221927 371799 332313
15532C32313k1049R6012m6884j67433L494k25203r5573P6977j01635q4717L5859
$$ 332313 311264 407276 360392 192959 196453 -28750 -124323 -47346 -148981 -233698 -197839
15521a97839K3777O3631N0059O8325K7409j51347k5677K10438O0529M8597k5490
$$ -197839 -174062 -110431 -60372 7953 35362 -115985 -141662 68776 129305 177902 152412
15510A52412p5093n6530q6139n6550n645N2197J13559K0275q9210J2876k3772
$$ 152412 77319 20789 -65350 -121900 -127545 -75348 38211 58486 -30724 -17848 -41620
15499d1620p0167J40987L6740K1533K41606L65249J54602m56690l68628q5509
$$ -41620 -111787 29200 65940 87473 329079 694328 848930 392240 23612 -61897
15489f1897K66800N8222j65135M519N5957K54405m1700j65136o2287j47559l1808
$$ -61897 204903 263125 97990 102509 158466 412871 371171 206035 143748 -3811 -35619
15478c5619O5496j95891q4969K92439J37339l3123Q3355m680Q0521N0369k7053
$$ -35619 29877 -166014 -250983 41456 178795 145672 229027 224347 304868 355237 328184
15467C28184p0908O1463O426j54437l07567m7414J71806p1993K74220M8276l63747
$$ 328184 257276 318739 325165 170728 -136839 -184253 -12447 -84440 189780 238056 -125691
15456a25691N6283K11258o7273n8691j27087L9068R4183J09066M2539Q6429j65472
$$ -125691 -69408 141850 74577 15886 -111201 -72133 22050 131116 173655 260084 94612
15445I4612m1178O4327m9678j45266j33639P9382l2002J20642r5007j64470r7223
$$ 94612 53434 117761 68083 -77183 -210822 -131440 -163442 -42800 -137807 -302277 -399500
15434c99500P7667r9606J10466J97093j8651j18938J58978J08320k92413J85340
$$ -399500 -321833 -421439 -310973 -113880 -132531 -251469 -92491 15829 -276584 -91244
15424i1244K45871O100j14415P977k49141R4806j03831j75442J58141J95495J09890
$$ -91244 154627 160727 46312 54289 -194852 -100046 -203877 -379319 -221178 -25683 84207
15413H4207R89l3829o2446q0687M6789J11010k7730O987Q9783O1621r0683M2388
$$ 84207 85196 51367 -11079 -91766 -44977 66033 38303 45290 135073 196694 106011 148399
15401A48399M5782j283j83296j42917J4382r082j61614k95206J04974L15114J08257
$$ 148399 194181 192898 9602 -133315 -118933 -128015 -289629 -584835 -479861 -164747 -56490
15390e6490K2136J04193J87379p1853o5409O236J05760j0915p7521K9627Q4914
$$ -56490 -34354 69839 257218 185365 119956 126192 231952 221037 143516 173143 258057
15379B58057L7380j56433j35005P8768J31383N0968K9369m0942N2080j52666n2339
$$ 258057 295437 139004 3999 82767 214150 265118 294487 253545 305625 152959 100620
15368A00620J32958O5870J01671l9943k7422O5143r6022k4540j36716P6104J93217
$$ 100620 233578 299448 401119 361176 333754 398897 302875 278335 141619 217723 410940
15357D10940J06650j25505K14l9682K3425M4987j8919M3841J41856J14071K755
$$ 410940 517590 392085 392299 352617 376042 421029 402110 445951 587807 701878 704633
15346G04633j637r9471K1237K31491N3623J9308p6661n5717K95281r382j27061
$$ 704633 702996 603525 624762 856253 909876 929184 852523 796806 1092087 1082705 955644
15335I55644k25656p6001r9681k8202l7881p4550k15711m3006j52512k3645J18677
$$ 955644 729988 653987 554306 526104 488223 413673 197962 154956 2444 -21201 97476
15324I7476J2654J62655L5062j16576L6845J12432p5756q0795n0660j39891L9215
$$ 97476 110130 272785 307847 191271 228116 340548 264792 183997 133337 -6554 32661
15313C2661M0348M61j2347L9311n454o4117k3446j69724q2598K79266K55059J59118
$$ 32661 73009 73470 61123 100434 94980 30863 7417 -162307 -244905 34361 289420 448538
15301D48538j11631k27258j77010K2999j09634J7986m3482j46379K213N8971j52095
$$ 448538 336907 109649 -67361 -44362 -153996 -136010 -179492 -325871 -323658 -264687 -416782
15290d16782k7576J47537K69233L223J93442r4947j27734O0511q905j23388M5671
$$ -416782 -444358 -296821 -27588 -24365 169077 74130 -53604 6907 -1998 -125386 -79715
15279g9715j55310j27204J21670J82892K00443q5920N37n1381j01333J14984P4635
$$ -79715 -235025 -362229 -240559 -57667 142776 56856 57393 6012 -95321 19663 94298
15268I4298L0469Q3484j16161m8221k5736m802j13174m4409J17566m2600j843
$$ 94298 124767 208251 92090 43869 18133 13331 -99843 -144252 -26686 -69286 -71129
15257g1129m1871m8166L0507j31788J02986O8620k44639R9990K59378j32474m0523
$$ -71129 -113000 -161166 -130659 -262447 -159461 -90841 -335480 -235490 23888 -108586 -149109
15246a49109J79915M7589J48428j20973k64482q1614j62k1209J34447K8582R8076
$$ -149109 30806 78395 226823 105850 -158632 -240246 -240408 -261617 -127170 -98588 -512
15235e12K3811l2197r1998j24212J6205r480N1567J12816p042p1865K2471O7981
$$ -512 23299 -8898 -100896 -225108 -208903 -218383 -166816 -54000 -61042 -132907 -110436 -42455
15223d2455r6386l9678o5883J09434K0830N3144p5645P601J08583J11848Q9920
$$ -42455 -138841 -178519 -244402 -134968 -114138 -60994 -136639 -129038 -20455 91393 181313
15212A81313l4623k62101m052M4626J28304J11901j73725q1019l0692l4407j0498
$$ 181313 146690 -115411 -119463 -74837 53467 165368 -8357 -89376 -120068 -154475 -164973
15201a64973K3966J11080P5327j12737r8219J31076N225j1514L5563P3467J7786
$$ -164973 -141007 -29927 45400 -67337 -165556 -34480 -29255 -40769 -5206 68261 86047
15190H6047j9054l5611K533j65146j18393o9774J30594J6846k793m2422j35192
$$ 86047 66993 31382 33915 -131231 -249624 -319398 -188804 -171958 -174751 -217173 -352365
15179c52365K01818P7820K10511j32722k57621l9177J27049p5924j52944J00460
$$ -352365 -150547 -72727 137784 5062 -252559 -291736 -164687 -240611 -393555 -293095
15169b93095K45832J39932n1547k21630Q6139m6543j83569M4302K48339N1170
$$ -293095 -47263 92669 41122 -180508 -94369 -140912 -324481 -280179 -31840 19330
15159A9330j77820j37524j16818J60291J11139J19883P7430l156O0470J36694
$$ 19330 -158490 -296014 -412832 -252541 -141402 -21519 55911 52755 113225 249919
15149B49919o5347J3372l9574k82717k51990n1274J53650J10390L9719M5261M4159
$$ 249919 184572 197944 158370 -124347 -376337 -427611 -273961 -163571 -123852 -78591 -34432
$$ [...]
##END NTUPLES=NMR SPECTRUM
##END=
