##TITLE=Analysis number 320399
Compound Code ac 15550
Project Code adrs
Chemist Name flurochem
##JCAMPDX= 6.0         $$ Bruker NMR JCAMP-DX V2.0
##DATA TYPE= NMR SPECTRUM
##DATA CLASS= NTUPLES
##ORIGIN= Bruker BioSpin GmbH
##OWNER= nmr
$$ XWIN-NMR		Version 3.5
$$ Fri Jun 23 08:40:28 2006 GMT Daylight Time (UT+1h)  MAYBRIDGE\nmr@NMR_250MHZ
##.OBSERVE FREQUENCY= 250.131544655141
##.OBSERVE NUCLEUS= ^1H
##.ACQUISITION MODE= SIMULTANEOUS (DQD)
##.ACQUISITION SCHEME= undefined
##.AVERAGES= 16
##.DIGITISER RES= 18
##SPECTROMETER/DATA SYSTEM= dpx250
##.PULSE SEQUENCE= zg30
##.SOLVENT NAME= CDCl3
##.SHIFT REFERENCE= (INTERNAL, CDCl3, 0, 16.522)
##AUDIT TRAIL= $$ (NUMBER, WHEN, WHO, WHERE, WHAT)
$$ ##TITLE= Audit trail, XWIN-NMR		Version 3.5
$$ ##JCAMPDX= 5.01
$$ ##ORIGIN= Bruker BioSpin GmbH
$$ ##OWNER= nmr
$$ C:\u/data/dgb/nmr/ADRS/1260/pdata/1/auditp.txt
$$ ##AUDIT TRAIL=  $$ (NUMBER, WHEN, WHO, WHERE, WHAT)
(   1,<2006-06-23 08:39:37.64 +100>,<MAYBRIDGE\nmr>,<NMR_250MHZ>,
      <created by zg, POWCHK disabled, PULCHK disabled
       configuration hash MD5:
       E2 DF 36 D8 04 B2 41 60 5A D7 A3 38 5A 4B D0 FE
       data hash MD5: 64K
       CD FB A9 D9 E2 E3 96 4A 85 FF DB 1A FC F2 C5 A4>)
(   2,<2006-06-23 08:40:07.02 +100>,<MAYBRIDGE\nmr>,<NMR_250MHZ>,
      <Start of raw data processing
       ef LB = 0.3 FT_mod = 6 PKNL = 1 SI = 32K 
       data hash MD5: 32K
       05 8E 1B 59 EB 32 CE 9C A9 E8 55 51 51 29 BE 64>)
(   3,<2006-06-23 08:40:11.55 +100>,<MAYBRIDGE\nmr>,<NMR_250MHZ>,
      <apk 
       data hash MD5: 32K
       6A FF 83 0B 20 C8 AC E9 C2 3B BA AE 7B 92 19 4E>)
(   4,<2006-06-23 08:40:12.99 +100>,<MAYBRIDGE\nmr>,<NMR_250MHZ>,
      <abs ABSG = 5 
       data hash MD5: 32K
       18 DA F5 DA EE 83 74 12 E1 B0 F6 5E 83 DD 40 A6>)
$$ ##END=
$$ 
$$ hash MD5
$$ 15 F1 08 30 A5 7E 58 D4 6D F5 C5 39 7B 0E C6 7C
##$RELAX= 
##$RELAX= 
##$RELAX= 
##$RELAX= 
##$RELAX= 
##$RELAX= 
##$RELAX= 
$$ Bruker specific parameters
$$ --------------------------
##$DU= <C:\u>
##$EXPNO= 1260
##$NAME= <ADRS>
##$PROCNO= 1
##$TYPE= <nmr>
##$USER= <dgb>
##$AMP= (0..31)
100 100 100 100 100 100 100 100 100 100 100 100 100 100 100 100 100 100 
100 100 100 100 100 100 100 100 100 100 100 100 100 100 
##$AQSEQ= 0
##$AQ_mod= 3
##$AUNM= <au_zg>
##$AUTOPOS= <2 >
##$BF1= 250.13
##$BF2= 250.13
##$BF3= 250.13
##$BF4= 250.13
##$BF5= 500.13
##$BF6= 500.13
##$BF7= 500.13
##$BF8= 500.13
##$BYTORDA= 1
##$CFDGTYP= 0
##$CFRGTYP= 5
##$CHEMSTR= <none>
##$CNST= (0..31)
1 1 145 1 1 1 1 1 1 1 1 1 1 1 1 1 1 1 1 1 1 1 1 1 1 1 1 1 1 1 1 1 
##$CPDPRG= <>
##$CPDPRG1= <>
##$CPDPRG2= <>
##$CPDPRG3= <>
##$CPDPRG4= <mlev>
##$CPDPRG5= <mlev>
##$CPDPRG6= <mlev>
##$CPDPRG7= <mlev>
##$CPDPRG8= <mlev>
##$CPDPRGB= <>
##$CPDPRGT= <>
##$D= (0..31)
0 1 0 0 0 0 0 0 0 0.06 0 0 0 0 0 0 0.0002 0 0 0 0 0 0 0 0 0 0 0 0 0 0 
0 
##$DATE= 1151048376
##$DBL= (0..7)
120 120 120 120 120 120 120 120 
##$DBP= (0..7)
150 150 150 150 150 150 150 150 
##$DBP07= 0
##$DBPNAM0= <>
##$DBPNAM1= <>
##$DBPNAM2= <>
$$ [...]
##$SUBNAM7= <"">
##$SUBNAM8= <"">
##$SUBNAM9= <"">
##$SW= 20.6930455092707
##$SWIBOX= (0..15)
0 0 3 0 0 0 0 0 0 0 0 0 0 0 0 0 
##$SW_h= 5175.983436853
##$TD= 65536
##$TD0= 1
##$TE= 295.16
##$TE2= 300
##$TE3= 300
##$TEG= 300
##$TL= (0..7)
0 120 120 120 120 120 120 120 
##$TP= (0..7)
150 150 150 150 150 150 150 150 
##$TP07= 0
##$TPNAME0= <>
##$TPNAME1= <>
##$TPNAME2= <>
##$TPNAME3= <>
##$TPNAME4= <>
##$TPNAME5= <>
##$TPNAME6= <>
##$TPNAME7= <>
##$TPOAL= (0..7)
0.5 0.5 0.5 0.5 0.5 0.5 0.5 0.5 
##$TPOFFS= (0..7)
0 0 0 0 0 0 0 0 
##$TUNHIN= 0
##$TUNHOUT= 0
##$TUNXOUT= 0
##$USERA1= <user>
##$USERA2= <user>
##$USERA3= <user>
##$USERA4= <user>
##$USERA5= <user>
##$V9= 5
##$VALIST= <valist>
##$VCLIST= <CCCCCCCCCCCCCCC>
##$VD= 0
##$VDLIST= <DDDDDDDDDDDDDDD>
##$VPLIST= <PPPPPPPPPPPPPPP>
##$VTLIST= <TTTTTTTTTTTTTTT>
##$WBST= 1024
##$WBSW= 4
##$XGAIN= (0..3)
0 0 0 0 
##$XL= 0
##$YL= 0
##$YMAX_a= 374420
##$YMIN_a= -420747
##$ZGOPTNS= <>
##$ZL1= 120
##$ZL2= 120
##$ZL3= 120
##$ZL4= 120
##$ABSF1= 16.522
##$ABSF2= -4.171173
##$ABSG= 5
##$ABSL= 3
##$ALPHA= 0
##$AQORDER= 0
##$ASSFAC= 0
##$ASSFACI= 0
##$ASSFACX= 0
##$ASSWID= 0
##$AUNMP= <proc_1d>
##$AZFE= 0.1
##$AZFW= 0.1
##$BCFW= 0
##$BC_mod= 0
##$BYTORDP= 0
##$COROFFS= 0
##$CY= 12.5
##$DATMOD= 1
##$DC= 0
##$DFILT= <>
##$DTYPP= 0
##$F1P= 14.0000005364418
##$F2P= -0.99999901652339
##$FCOR= 0.5
##$FTSIZE= 32768
##$FT_mod= 6
##$GAMMA= 0
##$GB= 0
##$INTBC= 1
##$INTSCL= 1
##$ISEN= 128
##$LB= 0.3
##$LEV0= 0
##$LPBIN= 0
##$MAXI= 10000
##$MC2= 0
##$MEAN= 0
##$ME_mod= 0
##$MI= 0
##$NCOEF= 0
##$NC_proc= -4
##$NLEV= 6
##$NOISF1= 0
##$NOISF2= 0
##$NSP= 0
##$NTH_PI= 0
##$NZP= 0
##$OFFSET= 16.522
##$PC= 1
##$PHC0= 17.70367
##$PHC1= 6.207778
##$PH_mod= 1
##$PKNL= yes
##$PPARMOD= 0
##$PSCAL= 4
##$PSIGN= 0
##$REVERSE= no
##$SF= 250.13
##$SI= 32768
##$SIGF1= 0
##$SIGF2= 0
##$SINO= 400
##$SIOLD= 32768
##$SREGLST= <1H.CDCl3>
##$SSB= 0
##$STSI= 32768
##$STSR= 0
##$SW_p= 5175.98343685301
##$SYMM= 0
##$S_DEV= 0
##$TDeff= 65536
##$TDoff= 0
##$TI= <Analysis number 999999
Compound Code 99
Book Reference 9
Project Code 9>
##$TILT= no
##$TM1= 0
##$TM2= 0
##$TOPLEV= 0
##$USERP1= <user>
##$USERP2= <user>
##$USERP3= <user>
##$USERP4= <user>
##$USERP5= <user>
##$WDW= 1
##$XDIM= 32768
##$YMAX_p= 400008146
##$YMIN_p= -55807
$$ End of Bruker specific parameters
$$ ---------------------------------
##NTUPLES= NMR SPECTRUM
##VAR_NAME=  FREQUENCY,     SPECTRUM/REAL,   SPECTRUM/IMAG
##SYMBOL=    X,             R,               I
##VAR_TYPE=  INDEPENDENT,   DEPENDENT,       DEPENDENT
##VAR_FORM=  AFFN,          ASDF,            ASDF
##VAR_DIM=   32768,         32768,           32768
##UNITS=     HZ,            ARBITRARY UNITS, ARBITRARY UNITS
##FACTOR=    0.157963299565203, 1,           1
##FIRST=     4132.6476996994, 0,             0
##LAST=      -1043.33573715361, 0,           0
##MIN=       -1043.33573715361, -55807,      0
##MAX=       4132.6476996994, 400008146,     0
$$ Real data points
##PAGE= N=1
##DATA TABLE= (X++(R..R)), XYDATA
$$ [...]
18680H2419R804M879j3565j0212J141m120K539J4907j768r314J3604M693K555
$$ 82419 92223 97102 83537 73325 74466 70346 72885 87792 86024 76710 90314 95007 97562
18667I7562J1707R666Q965K6656K4071J8737K0033J3364J4797R360j0405q060
$$ 97562 109269 118935 127900 154556 178627 197364 217397 230761 245558 254918 244513 236453
18655B36453m189p334K6258L5780K9392J7158J9091J2222o882J995p688k0411
$$ 236453 232264 224930 251188 286968 316360 333518 352609 364831 357949 359944 352256 331845
18643C31845m0350l3338l2798k8737l1144j7662j0673o782k125j0735L210l316
$$ 331845 291495 258157 225359 196622 165478 147816 137143 130361 128236 117501 120711 117395
18631A17395r013M838n707m385j5212n745J5568J9055p321J6632L673N011N930
$$ 117395 108382 113220 107513 103128 87916 82171 97739 116794 109473 126105 129778 134789 140719
18618A40719J5580J9017K1457M9153M9544M8768K9804K5400O903k568k2601l3195
$$ 140719 156299 175316 196773 245926 295470 344238 374042 399442 406345 403777 381176 347981
18606C47981k6636j8649k0245o769j3453p18K8176L0719n235j6566j2433j4142
$$ 347981 321345 302696 282451 275682 262229 261511 289687 320406 315171 298605 286172 272030
18594B72030k5624l7057l2194k4388k7120j787o195M244k151j2624L335q604O441
$$ 272030 246406 209349 177155 152767 125647 123860 117665 121909 119758 107134 110469 101865 108306
18581A08306J1988M309N364n071O835N650k2521k3986P846J5372o375j3199J1298
$$ 108306 120294 124603 129967 124896 131731 137381 114860 90874 98720 114092 107717 94518 105816
18568A05816L999K011R790J3005M0552M9382L5835K1031J4703k0140k3078k3468
$$ 105816 109815 111826 121616 134621 175173 224555 260390 281421 296124 275984 252906 229438
18556B29438k4569j7442k0381k3819n572j8669j4814n155j0548o08Q38J3047J0313
$$ 229438 204869 187427 167046 143227 137655 118986 104172 99017 88469 87861 88699 101746 112059
18543A12059m817J262N96n883j339j7284O64J650o90N097J1388j0174k1891O542
$$ 112059 107242 108504 109100 103217 101878 84594 85258 86908 86218 91315 102703 92529 70638 77180
18529G7180N425M298j5508L706r507J357J0277L244l622j489K718J0331K142k695
$$ 77180 82605 86903 71395 75101 65594 66951 77228 80472 76850 75361 78079 88410 90552 87857
18515H7857j733m408J9709K3171m805j1443j6454q588Q416k194j6556r383J8184
$$ 87857 86124 81716 101425 124596 119791 108348 91894 83306 91722 89528 72972 63589 81773
18502H1773J0831M353o20k3143K879J2023k070q290N645K797M721l106O667J4259
$$ 81773 92604 96957 96337 73194 76073 88096 86026 77736 83381 86178 90899 87793 94460 108719
18488A08719q975M369j0106m31P087M792k0124j826J9234o50k325J153O450p319
$$ 108719 99744 104113 94007 93576 100663 105455 85331 83505 102739 102089 99764 100917 107367 100048
18474A00048m086q082j0698j350O29j56J137Q659K789P732J111J1161M139j350
$$ 100048 95962 87880 77182 75832 76461 76305 77442 86101 88890 96622 97733 108894 113033 111683
18460A11683j1899P210N260J360L52j4223m762J3848J5066j428j2193r711K326
$$ 111683 99784 106994 112254 113614 113966 99743 94981 108829 123895 122467 110274 100563 102889
18447A02889J4279J150p266q475K963R345r720o351m393J285L261R850r546k1116
$$ 102889 117168 118318 111052 102577 105540 114885 105165 98814 94421 95706 98967 108817 99271 78155
18433G8155q370P118O305O844R12M223Q543N989r442k472m341r588L793k276J510
$$ 78155 69785 76903 83208 90052 90964 95187 103730 109719 100277 97805 93464 83876 87669 85393 86903
18418H6903P410O787J0643L601o065K338J3740J6257L737o627P636J824q624k970
$$ 86903 94313 101100 111743 115344 109279 111617 125357 141614 145351 138724 146360 148184 139560 136590
18404A36590J623m332K078K483J6368J4246r594r842J081O311m411M60n995n387
$$ 136590 138213 133881 135959 138442 154810 169056 159462 149620 150701 157012 152601 153061 147066 141679
18390A41679p375n4k31L081N034M222o998k078J8063Q920o378j9247r940M689
$$ 141679 134304 134250 134019 137100 142134 146356 139358 137280 155343 164263 157885 138638 128698 133387
18376A33387J678L56K79J3553O414k588j2984j5166J0025k740L0028Q162m249
$$ 133387 135065 135421 135700 149253 155667 153079 140095 124929 134954 132214 162242 170404 166155
18363A66155P730J3532J2447p146m263J23j4155O304O715N868L775M36O276R815
$$ 166155 173885 187417 199864 192718 188455 188578 174423 180727 187442 193310 197085 197521 203797 213612
18349B13612m339M460J8885l742j103J063P381R111J6002J7113J0698O143J3390
$$ 213612 209273 213733 232618 228876 227773 228836 236217 245328 261330 278443 289141 295284 308674
18336C08674L1906K8570J9820O134J2572J7823J8274J9340N684l359l40N618r045
$$ 308674 340580 369150 388970 395104 407676 425499 443773 463113 468797 465438 465098 470716 461671
18323D61671m847n251J645j5462o01l011l446p966j7480k0535l853o860m128j4627
$$ 461671 456824 451573 453218 437756 437155 434144 430698 422732 405252 384717 380864 374004 369876 355249
18309C55249k1457j4003o620m220J098L628N832N749Q336J9696J6647K349O38
$$ 355249 333792 319789 313169 308949 310047 313675 319507 325256 333592 353288 369935 372284 372922
18296C72922N609J2702J4544J8118K457J5695L0661M7286M0690M2414N5063M3118
$$ 372922 378531 391233 405777 423895 426352 442047 472708 519994 560684 603098 658161 701279
18284G01279L8139M9683M3803N2482L7594M2931J4455K143J331j788J018K621
$$ 701279 739418 789101 832904 885386 922980 965911 980366 982509 983840 982052 983070 985691
18272I85691m953j2577r315j9137j2874j6959j1964j6401m947r846j9469k9385
$$ 985691 980738 968161 958846 939709 926835 909876 897912 881511 876564 866718 847249 817864
18260H17864k5157j9938k5861j9605p26J5553o559k0832j1058o351r032j3057
$$ 817864 792707 772769 746908 727303 726577 742130 735571 714739 703681 697330 688298 675241
18248F75241k3983j8264j2228j8777j4341r243K037L385p183l256P54J7322K8891
$$ 675241 651258 632994 620766 601989 587648 578405 580442 583827 576644 573388 574142 591464 620355
18235F20355M5940N8135M7173N4143M2083L8252M3284N3766N4471M3318K3922
$$ 620355 666295 724430 771603 825746 867829 906081 949365 1003131 1057602 1100920 1124842
18224A124842K1990M1308M3632M5794O7000Q0674P9674Q3853O9052O9453N4786
$$ 1124842 1146832 1188140 1231772 1277566 1344566 1425240 1504914 1588767 1657819 1727272 1782058
18213A782058M9177Q0390J24482J65784K03687K61010L21128M02055M78777N63928
$$ 1782058 1831235 1911625 2036107 2201891 2405578 2666588 2987716 3389771 3868548 4432476
18203D432476O33300P25640Q69419J141418J584262K082814K532740K843802K886282
$$ 4432476 5065776 5791416 6660835 7802253 9386515 11469329 14002069 16845871 19732153
18194A9732153K274623J091557k75700r27668j206308j626633k392424k895964
$$ 19732153 22006776 23098333 22822633 21894965 20688657 19062024 16669600 13773636
18186A3773636k680743k021138j283507p76072m57522k70090j27944l2303k746
$$ 13773636 11092893 9071755 7788248 7012176 6554654 6284564 6156620 6124317 6121571
18177F121571J402P210O650k2908o7561n4883j5245J8843P5919J46011K50810
$$ 6121571 6122973 6130183 6136833 6113925 6046364 5991481 5976236 5995079 6070998 6217009 6467819
18166F467819M02486O22532R29498J351314J969835K656983L349020L880706M136590
$$ 6467819 6870305 7492837 8422335 9773649 11743484 14400467 17749487 21630193 25766783
18157B5766783L893651K920159J476242J03286o76471r08507k56295J071543K649049
$$ 25766783 29660434 32580593 34056835 34160121 33483650 32575143 32318848 33390391 36039440
18148C6039440L664329L704505L116354K857759K980264K348788K89869k558281
$$ 36039440 39703769 43408274 46524628 49382387 52362651 54711439 55001308 52443027
18140E2443027m462063m999914m990757n123177m959311m283933l345264k510470
$$ 52443027 47980964 42981050 37990293 32867116 27907805 23623872 20278608 17768138
18132A7768138j881867j384838r77501p08162n25173l91884k96923j81910j03286
$$ 17768138 15886271 14501433 13523932 12815770 12290597 11898713 11601790 11419880 11316594
18123A1316594J2480J25671K57225M06343N97863Q31006J175720J714948K576545
$$ 11316594 11329074 11454745 11711970 12118313 12716176 13547182 14722902 16437850 19014395
18114A9014395L840327N536454P432251Q646493R265107R982648Q286068K732490
$$ 19014395 22854722 28391176 35823427 44469920 53735027 63717675 72003743 74736233
18106G4736233j987887k829287m043278n387717n899287n420363m275661k391449
$$ 74736233 72748346 69919059 65875781 60488064 54588777 49168414 44892753 42501304
18098D2501304k19692J847099L125402K981637J458629p40504k506329l995525
$$ 42501304 42281612 44128711 47254113 50235750 51694379 50953875 48447546 44452021
18090D4452021n317841o096511n619811m385138l002095k090117j527030j154727
$$ 44452021 39134180 33037669 27417858 23032720 20030625 17940508 16413478 15258751
18082A5258751q93449p38024n69801m25608l02253k08833j45637j34001j67524
$$ 15258751 14365302 13627278 13057477 12631869 12329616 12120783 11975146 11841145 11673621
18073A1673621k18414j93788j60812j14178j5293J26203K80474M73138P55261
$$ 11673621 11455207 11261419 11100607 10986429 10971136 11097339 11377813 11850951 12606212
18064A2606212J180525J852972K785752L819134M791880N569086N845030N141861
$$ 12606212 13786737 15639709 18425461 22244595 27036475 32605561 38450591 43592452
18056D3592452L092636J32769k886095n160418o539717o420782n230095l679643
$$ 43592452 46685088 46817857 43931762 38771344 32231627 25810845 20580750 16901107
18048A6901107k417942j704424j288945j018464q39695o79002n39142m24489l41982
$$ 16901107 14483165 12778741 11489796 10471332 9631637 8952635 8413493 7989004 7647022
18039G647022k78922k43176k15902k10705k12091j80861j75293j75633j54062
$$ 7647022 7368100 7124924 6909022 6698317 6486226 6305365 6130072 5954439 5800377
18030E800377j39540j61370j60157j31056j25640j26426j23836j24058j03306
$$ 5800377 5660837 5499467 5339310 5208254 5082614 4956188 4832352 4708294 4604988
18021D604988j08880j13482j15697j36028j41411j03115r3204p3425o1299n6009
$$ 4604988 4496108 4382626 4266929 4130901 3989490 3886375 3793171 3719746 3658447 3602438
18011C602438m8765p8754r4519p7512q2174j05995j03605r9542r0743r1877q9629
$$ 3602438 3553673 3474919 3380400 3302888 3220714 3114719 3011114 2911572 2820829 2728952 2639323
18000B639323p1152n6681o4428o8337o7380o4839n4185m5127n3391m4738k8613
$$ 2639323 2568171 2511490 2447062 2378725 2311345 2246506 2192321 2147194 2093803 2049065 2020452
17989B020452l3602m1158m6551m4275m4998l5158j5884k1330k2347j5708j1841
$$ 2020452 1986850 1945692 1899141 1854866 1809868 1774710 1758826 1737496 1715149 1699441 1687600
17978A687600j3535K280R507J154Q541j1915l6749o2067o2942n4299m0434j1308
$$ 1687600 1674065 1676345 1685852 1687006 1695547 1683632 1646883 1584816 1521874 1467575 1427141 1415833
17966A415833k3143k6962j3124J0948N575k4603k9109l2013l5414k7511k2256
$$ 1415833 1392690 1365728 1352604 1363552 1369127 1344524 1315415 1283402 1247988 1220477 1198221
17955A198221k1933j8351j6664m316p307j53N9K920k858j1288j2376R48j0786
$$ 1198221 1176288 1157937 1141273 1136957 1129650 1129497 1129556 1132476 1129618 1118330 1105954 1106902 1096116
17942A096116j8378k1620n434J5408j737j8873j2931K597r248j4243n338K645
$$ 1096116 1077738 1056118 1050684 1066092 1064355 1045482 1032551 1035148 1025900 1011657 1006319 1008964
17930A008964L11L670j6287j3859o126K607J0340j237j3705l9134k6471k0330
$$ 1008964 1009275 1012945 996658 982799 976673 979280 989620 988383 974678 935544 909073 888743
17918H88743k5255k3408l0082j1902J4438O572K0220O503P45Q729l010j0215Q926
$$ 888743 863488 840080 809998 798096 812534 819106 839326 845829 846574 855303 852293 842078 851004
17905H51004J1084j116M443J3580J9403L7561K1533j62K6441K9584L0809J5228
$$ 851004 862088 860972 865415 878995 898398 935959 957492 957330 983771 1013355 1044164 1059392
17893A059392K645n623J3795M318J252L572J4995J1896O168K0662K6172J3845
$$ 1059392 1062037 1056414 1070209 1074527 1075779 1079351 1094346 1106242 1112410 1133072 1159244 1173089
17881A173089J0669J8629J3595J7009O502J2607N664J184K2915L9656M5306J7362
$$ 1173089 1183758 1202387 1215982 1232991 1239493 1252100 1257764 1258948 1281863 1321519 1366825 1384187
17869A384187J0337L9410M5898K9985N2569O0515P3895Q8888R1497J07211J08885
$$ 1384187 1394524 1433934 1479832 1509817 1562386 1622901 1696796 1785684 1877181 1984392 2093277
17858B093277J26050J39617J45883J43998J45020J68491J86099J87339K00220
$$ 2093277 2219327 2358944 2504827 2648825 2793845 2962336 3148435 3335774 3535994
17849C535994K20641K58057L00271L42247L90675M43038N24339O67289Q53986
$$ 3535994 3756635 4014692 4314963 4657210 5047885 5490923 6015262 6682551 7536537
17840G536537J129188J514926K018087K537671L089702L765496M399234M531540
$$ 7536537 8665725 10180651 12198738 14736409 17826111 21591607 25990841 30522381
17832C0522381M330389M433897N018950N370114M797438M020423L623162M113728
$$ 30522381 34852770 39286667 44305617 49675731 54473169 58493592 62116754 66230482
17824F6230482M312541L672916J945631O31075M07326N53082l52775j959662l316341
$$ 66230482 70543023 74215939 76161570 76792645 77199971 77753053 77400278 75440616 72124275
17815G2124275l384664l112470l180664m367335n695635n997344n152970m247810
$$ 72124275 68739611 65627141 62446477 58079142 52383507 46386163 41233193 36985383
17807C6985383m248154m256555l682622k616449j764057j238219q96827o65177
$$ 36985383 32737229 28480674 24798052 22181603 20417546 19179327 18282500 17617323
17799A7617323m81825l49920k44278j23730j772J38050K98491M70804P24419J022620
$$ 17617323 17135498 16785578 16541300 16417570 16415798 16553848 16852339 17323143 18047562 19070182
17789A9070182J424757J842760K197769K697259L589641M442226M772497N393556
$$ 19070182 20494939 22337699 24535468 27232727 30822368 35264594 40037091 45430647
17781D5430647P020242Q307690Q065274P327996P768210P813284O889156M459542
$$ 45430647 52450889 60758579 68823853 76151849 83920059 91733343 98622499 103082041
17773A03082041K295956Q51796P20754l71634l275955m483527k844789j550680
$$ 103082041 105377997 106229793 106950547 106578913 103302958 98819431 95974642 94423962
17765I4423962k574371l889468l049666k495789k226168j596218j987143l606740
$$ 94423962 91849591 87960123 84910457 82414668 80188500 78592282 76605139 72998399
17757G2998399m044290k310557j847246l356864l905508l078152k335927k032645
$$ 72998399 68954109 66643552 64796306 61439442 57533934 54455782 52119855 50087210
17749E0087210k257428k988576l288178k450905k143627k947216l364060k739559
$$ 50087210 47829782 44841206 41553028 39102123 36958496 34011280 30647220 27907661
17741B7907661k139813k024405j872042j463604j094830q82576p26067n85130
$$ 27907661 25767848 23743443 21871401 20407797 19312967 18430391 17704324 17119194
17733A7119194m73704l82707k98761k58286k12966j46766q2047K1214J61997L21652
$$ 17119194 16645490 16262783 15964022 15705736 15492770 15346004 15263957 15285171 15447168 15768820
17723A5768820N57012R52100J356475J727175K288134K873443L063274K758644
$$ 15768820 16325832 17277932 18634407 20361582 22649716 25523159 28586433 31345077
17715C1345077K745501K916591K148176J033522O06340P41083P8626k88405K44146
$$ 31345077 34090578 37007169 39155345 40188867 40795207 41536290 41614916 41326511 41570657
17706D1570657P66229J126260J550115J837767J980995K190614K134644J010791
$$ 41570657 42336886 43463146 45013261 46851028 48832023 51022637 53157281 54168072
17698E4168072M97931N32876j88051j331293j573844j294439j690743j472452
$$ 54168072 54666003 55198879 55010828 53679535 52105691 50811252 49120509 47648057
17690D7648057j015623r47239r24481q37153j258259k031458k237639k405728
$$ 47648057 46632434 45685195 44760714 43923561 42665302 40633844 38396205 35990477
17682C5990477l322696l576654l154867k735872k675334k375684j751369j264008
$$ 35990477 32667781 29091127 25936260 23200388 20525054 18149370 16398001 15133993
17674A5133993r65320p62875o31044n62623m94846m51918m41673m04571l83265
$$ 15133993 14168673 13405798 12774754 12212131 11717285 11265367 10823694 10419123 10035858
17665A0035858l60951l48920l33054l06942k77190k59916k37323k24028k04686
$$ 10035858 9674907 9325987 8992933 8685991 8408801 8148885 7911562 7687534 7482848
17656G482848j80078j66764j31041j27914j22082j17184r5301p3604o9662n7620
$$ 7482848 7302770 7136006 7004965 6877051 6754969 6637785 6542484 6468880 6399218 6341598
17646F341598o3934o6498m6803m0027n2173m2191j4135J7726N7991R8159J20499
$$ 6341598 6277664 6211166 6164363 6124336 6072163 6029972 6015837 6033563 6091554 6189713 6310212
17635F310212J25513J57847J88609K03652K66813M24384O52857R66438J378259
$$ 6310212 6435725 6593572 6782181 6985833 7252646 7677030 8329887 9296325 10674584
17626A0674584J804039K255560K837941L327069L093403K521872K382875J815594
$$ 10674584 12478623 14734183 17572124 20899193 23992596 26514468 28897343 30712937
17618C0712937M15914R7095M07573l57887q92023o22427j113655k021440j613196
$$ 30712937 31128851 31225946 31633519 31275632 30383609 29761182 28647527 26626087 25012891
17609B5012891r87071o39245L19063J176107J249625J193413J288014N97275k96629
$$ 25012891 24025820 23386575 23705638 24881745 26131370 27324783 28612797 29210072 28913443
17600B8913443p5572j44279r17183j037052j049215j955948k610158k341814k238254
$$ 28913443 28837871 28693592 27776409 26739357 25690142 23734194 21124036 18782222 16543968
17591A6543968k136523j599369j061625p07465m99274l52203k22166j07811j1554
$$ 16543968 14407445 12808076 11746451 11038986 10539712 10187509 9965343 9857532 9845978
17582I845978P5089J64495K62100L65191N28873P95538J171494J673626K191067
$$ 9845978 9921067 10085562 10347662 10712853 11241726 12037264 13208758 14882384 17073451
17573A7073451K815116L688160M328103M336047M388783M729859L916723K204890
$$ 17073451 19888567 23576727 27904830 32240877 36629660 41359519 45276242 47481132
17565D7481132K060998K154419P04752R4366O37360J80531r39225j420389j476892
$$ 47481132 49542130 51696549 52401301 52495667 53133027 53313558 52374333 50953944 49477052
17556D9477052j956183j733262j112732n02112N68919R07510M96392Q63284J257631
$$ 49477052 47520869 45787607 44674875 44172763 44741682 45649192 46145584 47008868 48266499
17547D8266499L57059p93672n83775q68248k589833l264015l006343l806198m429821
$$ 48266499 48623558 47829886 47246111 46377863 43788030 40524015 37517672 33711474 29281653
17538B9281653l749461l185275k840981k173175j528630j086743q02662o35287
$$ 29281653 25532192 22346917 19505936 17332761 15804131 14717388 13914726 13279439
17530A3279439n22774m24047l46767k67722j89739j24453r112J38019L15567O02577
$$ 13279439 12756665 12332618 11985851 11718129 11528390 11403937 11394825 11532844 11848411 12450988
17520A2450988R79309J349874J713175K232685K539515K192520J790385J776212
$$ 12450988 13430297 14780171 16493346 18726031 21265546 23458066 25248451 27024663
17512B7024663J172846N101M2838K63198m50202p53608m97162j014180j744899
$$ 27024663 28197509 28202610 28245448 28508646 28058444 27304836 26807674 25793494 24048595
17503B4048595j322836q14121m88096L23318R22098Q92590R11545R25664J89816
$$ 24048595 22725759 21911638 21423542 21746860 22668958 23561548 24473093 25398757 25588573
17494B5588573m60431j27278l10581r73171r86772j055754j892013k355320k068323
$$ 25588573 25128142 25000864 24690283 23717112 22730340 21674586 19782573 17427253 15358930
17485A5358930k018320j896910j402674r50597o92603n32426m45548l77186l14938
$$ 15358930 13340610 11443700 10041026 9090429 8397826 7865400 7419852 7042666 6727728
17476F727728k72233k63618k28821k01217k04214j90490j68822j71153j68658
$$ 6727728 6455495 6191877 5963056 5761839 5557625 5367135 5198313 5027160 4858502
17467D858502j74119j47534j35697j46552j32982j23110j07213j05881r2340j04120
$$ 4858502 4684383 4536849 4401152 4254600 4121618 3998508 3891295 3785414 3693074 3588954
17457C588954j10412j01850r4063q0009o7428q9256q3969n8835n2700p3454o6139
$$ 3588954 3478542 3376692 3282629 3202620 3135192 3045936 2961967 2903132 2850432 2776978 2710839
17446B710839m5538n3880l1697m8489m9020n0754p6126r3904n5336m3752o2627
$$ 2710839 2665301 2611421 2579724 2531235 2482215 2431461 2355335 2261431 2206095 2162343 2099716
17435B099716n6263n1781n3241m3548n3609n6335m0452m2102l7061k8565k8465
$$ 2099716 2043453 1991672 1938431 1894883 1841274 1784939 1744487 1702385 1665324 1636759 1608294
17424A608294k4092l2488m1598l3387k0158m0114l1539j3252j2537k8071l5074
$$ 1608294 1584202 1551714 1510116 1476729 1456571 1416457 1384918 1371666 1359129 1331058 1295984
17413A295984k2272k6273k1197j7031k7000k1027k196k1134l5290k8746j1876
$$ 1295984 1273712 1247439 1226242 1209211 1182211 1161184 1158988 1137854 1102564 1073818 1061942
17402A061942j0307j8426k4171j1240j5233j5696j8471j3899l1172l3002j5540
$$ 1061942 1051635 1033209 1009038 997798 982565 966869 948398 934499 903327 870325 854785
17391H54785o644j4534r574j8867q420k3281k0259j6768k5997k4410j7040k7684
$$ 854785 848141 833607 824033 805166 796746 773465 753206 736438 710441 686031 668991 641307
17379F41307k3072k0094j7732p522j0873J925r80K468j3888j3965k1444j4730
$$ 641307 618235 598141 580409 572887 562014 563939 562959 565427 551539 537574 516130 501400
17367E01400P633j87j3549k2966k1020p172l059k728j0732p639j0076o417n110
$$ 501400 509033 508846 495297 472331 451311 444139 441080 438352 427620 419981 409905 403488 398378
17354C98378K410O426J2645l388p055J894r184j7702j3262J077k528R036P533
$$ 398378 400788 407214 419859 416471 409416 411310 402126 384424 371162 372239 369711 378747 386280
17341C86280k595j262l325J148J3j817l137M793J231J6213K2566Q746J6890K2968
$$ 386280 383685 382423 379098 380246 380259 378442 375305 380098 381329 397542 420108 428854 445744 468712
17327D68712J4248J2031J3460K2754L0482K1275K506K502J3099J7758J4610O849
$$ 468712 482960 494991 508451 531205 561687 582962 585468 587970 601069 618827 633437 640286
17315F40286r463q603o634k4964m1524k6775m138k3514l1087k5854l6888j8898
$$ 640286 630823 622220 615586 590622 549098 522323 518185 494671 463584 437730 400842 381944
17303C81944j8302l6612l8078p834m722K262R393m486j1989n573K410r509j975
$$ 381944 363642 327030 288952 281118 276396 278658 288051 283565 271576 266003 268413 258904 256929
17290B56929J4570J2699j0692o216j1676J4650L1934J6926J1923J3466J2857K1011
$$ 256929 271499 284198 273506 267290 255614 270264 302198 319124 331047 344513 357370 378381
17278C78381K6775K1653L5478M1140K3206J8326K9791J8989K5873K7696J0067
$$ 378381 405156 426809 462287 503427 526633 544959 574750 593739 619612 647308 657375
17267F57375K510K0814J0295r197j1440j6060j8529j1581j6404o132l7875n680
$$ 657375 659885 680699 690994 681797 670357 654297 635768 624187 607783 601651 563776 558096
17255E58096K776k3110j7908p352k1438j9351M783o670l2945k8326p242J389M206
$$ 558096 560872 537762 519854 512502 491064 471713 476496 469826 436881 408555 401313 402702 406908
17242D06908o908j3982q53k4209k7186j4558j1244j9844j3418j3230L240q466
$$ 406908 400000 386018 385165 360956 333770 319212 307968 288124 274706 261476 264716 256250
17230B56250l1767k2745k131r208j0757l062N219L925n057j69j102j1447p413
$$ 256250 224483 201738 199607 190399 179642 176580 181799 185724 180667 180498 179396 167949 160536
17217A60536j6015M486K0040K0837m536J170n322N934J3581J8456J4030P736K3798
$$ 160536 144521 149007 169047 189884 185348 186518 181196 187130 200711 219167 233197 240933 264731
17204B64731J9633K1048J7294j0256J999L954J8015K105j3176j08Q149P62q76
$$ 264731 284364 305412 322706 312450 314449 318403 336418 338523 325347 325239 333388 334150 333274
17191C33274K2295K598n440Q410O250j6737j4415l457p771j4448j5666o451j897
$$ 333274 355569 358167 352727 361137 367387 350650 336235 332778 325007 310559 294893 288442 286545
17178B86545j5520M16N493k309j5605k7634j3414j7294j3407k0487j1651P25o91
$$ 286545 271025 271441 276934 274625 259020 231386 217972 200678 187271 166784 155133 155858 155167
17165A55167j4732q151K357Q304p123q944r082o262j2677l37J486L77q180j6469
$$ 155167 140435 132284 134641 142945 135822 126878 117796 111534 98857 98520 100006 100383 92203 75734
17151G5734m861k490P228J3975J432n071l07n022Q001l448q082j563P074N223
$$ 75734 70873 68383 75611 89586 91018 85947 85640 80618 88619 85171 77089 75526 82600 87823
17137H7823j3981j9396m850K0895Q758L115L413K165j3665n29q874j1258K294
$$ 87823 73842 54446 49596 70491 79249 82364 85777 87942 74277 73748 64874 53616 55910
17124E5910K416J0419Q317n078J039J0509k016j3518p731L160J386m979J1714
$$ 55910 58326 68745 77062 71984 73023 83532 81516 67998 60267 63427 64813 59834 71548
17111G1548J4711N186M532j150J8588P578J6304J6162j986J3380J1470J9673J7404
$$ 71548 86259 91445 95977 94827 113415 120993 137297 153459 151473 164853 176323 195996 213400
17098B13400j3219j2839j854q520r580m82K706J2259j3342k071K509P280L301
$$ 213400 200181 187342 185488 176968 167388 166906 169612 181871 168529 166458 168967 176247 179548
17085A79548L514O38N89N798J4150j0189q143r58K62k3748l3215k5287l431R783
$$ 179548 183062 183700 184289 190087 204237 194048 185905 184947 185209 161461 128246 102959 99528 109311
17071A09311r266j2133j0407l284n143O710M529J1150Q385l939p186k354k20L504
$$ 109311 100045 87912 77505 74221 69078 75788 80317 91467 99852 95913 88727 86373 86153 89657
17057H9657J0278N705J080K8388M1191L3736J8863m843J4663K9547N764O948q33
$$ 89657 99935 105640 106720 135108 176299 210035 228898 224055 238718 268265 274029 280977 280144
17044B80144n739L336N654R936J1280k702k69j312k1885j8877J0753J74o163P333
$$ 280144 274405 277741 283395 293331 304611 301909 301640 300328 278443 259566 270319 270493 264330 271663
17030B71663Q839K2850R845Q889j7413k1624j1731k0839j9725m1190k5358p583
$$ 271663 280502 303352 313197 322086 304673 283049 271318 250479 230754 189564 164206 156623
17018A56623j027p162j0155k1247p234n068r891J422j1623n150K624N195R782
$$ 156623 155596 148434 138279 117032 109798 104730 94839 96261 84638 79488 82112 87307 97089
17005I7089R84j1561o064J1956K0302J3954q939m170K3674L2223R423K740Q019
$$ 97089 98073 86512 80448 92404 112706 126660 117721 113551 137225 169448 178871 181611 189630
16992A89630n760J421J577j1302q116K284j1351j2259p511o077m476N647M875
$$ 189630 183870 185291 186868 175566 167450 169734 158383 146124 138613 132536 128060 133707 138582
16979A38582J0676R198P386k555J365m199j0505j3989m355M933l063p522k2011
$$ 138582 149258 158456 165842 163287 164652 160453 149948 135959 131604 136537 133474 125952 103941
16966A03941k2874q979j1112L223o133j6691p66J9032R763j0197n716k526J25
$$ 103941 81067 72088 60976 64199 58066 41375 40609 59641 69404 59207 53491 50965 51090
16953E1090l254J0546N47o387J209j7889l185J4779j6014n701j0643N239J679
$$ 51090 47836 58382 58929 52542 53751 35862 32677 47456 31442 25741 15098 20337 22016
16940B2016p930p088J854N598j845l712l110l495J5804P975J1356K293m093L895
$$ 22016 14086 6998 8852 14450 12605 8893 5783 2288 18092 26067 37423 39716 35623 39518
16926C9518p586k978K53P881N67J769p96J176O691L289o355N99O776q276j986
$$ 39518 31932 28954 29207 37088 37655 39424 38628 39804 46495 49784 43429 44028 50804 42528 40542
16911D0542j3020P240O287n178R241o813j5373j6634k89N470J1210k588r764R09
$$ 40542 27522 34762 41049 35871 45112 38299 22926 6292 6003 11473 22683 20095 10331 11240
16897A1240j43p262j0190J011J4808Q984J1427o965K532P275J0922j3552p593
$$ 11240 11097 3835 -6355 -5344 9464 18448 29875 22910 25442 32717 43639 30087 22494
16884B2494p606q979O076L009k927j0385l109Q654q033K276M833J299Q20q632
$$ 22494 14888 5909 11985 14994 12067 1682 -1427 7227 -806 1470 6303 7602 8422 -210
16870b10r97J6773j0515l879L022n884Q748O142J374n871N994O14p718o869l153
$$ -210 -1207 15566 5051 1172 4194 -1690 7058 13200 14574 8703 14697 15311 7593 724 -2429
16855b429J5748R113l011p646l705O605J267J3486j3777k22N50k0416p696J1494
$$ -2429 13319 22432 19421 11775 8070 14675 15942 29428 15651 15429 15979 -4437 -12133 -639
16841f39Q354J684r345r977Q12o205J5540p710n545J0584J0397J3607J404p597
$$ -639 7715 9399 54 -9923 -9111 -15316 224 -7486 -13031 -2447 7950 21557 22961 15364
16827A5364j2262r948M142j433P323J0348n764l827R056J0707n319o107N349N455
$$ 15364 3102 -6846 -2704 -4137 3186 13534 7770 3943 12999 23706 18387 12280 17629 23084
16813B3084j2952j7438n854q52J0245K60J039L878J2396o754l365o156j3367J4405
$$ 23084 10132 -7306 -13160 -14012 -3767 -3507 -2468 1410 13806 7052 3687 -2469 -15836 -1431
16799a431L305l747N317R303N23P065r338p771N169Q902q985j0150P685L893l141
$$ -1431 1874 -1873 3444 12747 13270 20335 10997 3226 8395 17297 8312 -1838 5847 9740 6599
16784F599j669l14R847j120j627l888J335L623Q139L737l222Q071q729m785J556
$$ 6599 4930 4616 14463 13343 11716 7828 9163 12786 20925 24662 21440 29511 20782 15997 17553
16769A7553j35j676J727J6634j116p08j1423j1304p291m52R191J5518p086j0028
$$ 17553 17418 15742 17469 34103 32987 32279 20856 9552 2261 1809 11000 26518 19432 9404
16755I404q744r229J317O639J5912J4682O503N566j1490j5386K997o18j53k074
$$ 9404 660 -8569 -7252 -613 15299 29981 36484 42050 30560 15174 18171 17553 17400 15326
16741A5326j0798j0883R516m87M353J002k828n357J1630J0465K259K70j6764l585
$$ 15326 4528 -6355 3161 2674 7027 8029 5201 -156 11474 21939 24198 24468 7704 4119
16727D119o266o34J5470J2268p192j0684o402L032P921k924r965k687j0330J0085
$$ 4119 -2147 -2781 12689 24957 17765 7081 679 3711 11632 8708 -1257 -3944 -14274 -4189
16713d189l991P588P771L67j872l881n110J3356J3368P90m173K060l934p501J6892
$$ -4189 -8180 -592 7179 7546 5674 1793 -3317 10039 23407 24197 20024 22084 18150 10649 27541
16698B7541K814j0421q333M137J1263m212l304n148j2961O666Q895L01N288p537
$$ 27541 30355 19934 11601 15738 27001 22789 19485 14337 1376 8042 16937 17238 22526 14989
16684A4989N047m208j176j392K230J0837l66m892J19l629P46m327J6188m788r521
$$ 14989 20036 15828 14652 13260 15490 26327 25961 21069 21188 17559 18305 13978 30166 25378 15857
16669A5857R821l173n289k1170j303R622Q846L33j2206L80K708j1086J434o153
$$ 15857 25678 22505 17216 -3954 -5257 4365 13211 13544 1338 1718 4426 -6660 -5226 -11379
16655a1379O31j898j523M487J9796k60n630j540q729r162n732k008J2269K0384
$$ -11379 -10748 -12646 -14169 -9682 10114 9854 4224 2684 -6045 -15207 -20939 -22947 -10678 9706
16641I706K637M027m971r712j886N514L653p872j582J2971J9708j7953l66q436
$$ 9706 12343 16370 11399 1687 -199 5315 8968 1096 -486 12485 32193 14240 13874 5438
16627E438k500m273j3998J1102o236l163K1462N448J6137P055M438J2624J2202
$$ 5438 2938 -1335 -15333 -4231 -10467 -13630 7832 13280 29417 36472 40910 53534 65736
16614F5736R67P01M74m158q663n955j089P006k520K416n260j2573j6076p841r725
$$ 65736 66703 67404 67878 63720 55057 49102 48013 55019 52499 54915 49655 37082 21006 13165 3440
16599C440r627J470R95n257J2087N463j958L086L940R795L307L865l927n663j0939
$$ 3440 -6187 -4717 -3722 -8979 3108 8571 6613 9699 13639 23434 26741 30606 26679 21016 10077
16584A0077o400k466N319K60q996L109J0376O662K514J397p433p855N938J146
$$ 10077 3677 1211 6530 6790 -2206 903 11279 17941 20455 21852 14419 6564 12502 13648
16570A3648J035N73p063p021J824o778j3553L455J4553K389j8914j2533J9717
$$ 13648 14683 15256 8193 1172 2996 -3782 -17335 -13880 673 3062 -15852 -28385 -8668
16557h668J4361j5009j2356J5025R924m724q20J0367J5705K595j0163j5178L279
$$ -8668 5693 -9316 -21672 -6647 3277 -1447 -2267 8100 23805 26400 16237 1059 4338
16544D338m898j030K086Q859l343k337J7641J578j366l004o086K685r384j0850
$$ 4338 -560 -1590 496 9355 6012 3675 21316 22894 21528 18524 12438 15123 5739 -5111
16530e111K204o683O77J681k477l621R522J6254k0906N997P534j203p77p197P80
$$ -5111 -2907 -9590 -8913 -7232 -9709 -13330 -3808 12446 -8460 -2463 5071 3868 3091 -4106 -3326
16515c326O714R548J1134Q849j881j0131j2013J0098R642l989Q49o406j8032N20
$$ -3326 3388 12936 24070 32919 31038 20907 8894 18992 28634 24645 25494 19088 1056 1576
16501A576m78R30r29J2565K163p475p070J0812J475k433p00P353j877M888j4103
$$ 1576 1098 2028 1099 13664 15827 8352 1282 12094 13569 11136 10436 17789 15912 20800 6697
16486F697p545M734J0865o761j3879j0724Q988O787j4767M114M543J5399L877
$$ 6697 -848 3886 14751 7990 -5889 -16613 -7625 -838 -15605 -11491 -6948 8451 12328
16473A2328n692R930o374j8016j0547q845m148M435K859J4678M570j7776Q388
$$ 12328 6636 16566 10192 -7824 -18371 -27216 -31364 -26929 -24070 -9392 -4822 -22598 -14210
16460a4210J087O676J776M697Q026j8851L942o477m523N502p569j165P299R442
$$ -14210 -13123 -6447 -4671 26 8052 -10799 -6857 -13334 -17857 -12355 -19924 -21089 -13790 -4348
16446d348j4823M953R865J1972J166n69J5551k818L035k029k1324p049J3682J510
$$ -4348 -19171 -14218 -4353 7619 8785 8216 23767 20949 23984 21955 631 -6418 7264 8774
16432H774j804q555j2111K879K2953q088q882O554L58q191K564Q415r731k2363
$$ 8774 6970 -1585 -13696 -10817 12136 4048 -4834 1720 2078 -6113 -3549 4866 -4865 -27228
16418b7228l251L290R318J3183J5087M358j134j6038N448o383j063J0926O119
$$ -27228 -30479 -27189 -17871 -4688 10399 14757 13623 -2415 3033 -3350 -4413 6513 12632
16405A2632n423j1888O203K751N075J5981P68q277j3943j0240n183J554J1515
$$ 12632 7209 -4679 1524 4275 9350 25331 26099 17822 3879 -6361 -11544 -9990 1525
16392A525l165L274Q721k409m284k676j2732M060J998l400J0594P079J6894j1097
$$ 1525 -1640 1634 10355 7946 3662 986 -11746 -7686 -5688 -9088 1506 8585 25479 14382
16378A4382j8807N787Q505q0M051o855j8458j4859P549Q903l531J3623m291j1667
$$ 14382 -4425 1362 9867 9787 13838 6983 -11475 -26334 -18785 -9882 -13413 210 -4081 -15748
16364a5748L161P076J6701K61Q985o19j3238j245o255q016M805J6807J1162k3739
$$ -15748 -12587 -5511 11190 11451 20436 19817 6579 5334 -921 -8937 -4132 12675 23837 98
16350I8K997O102j7168j1590Q003O869K364J0300o863o707J119J06K766R800o107
$$ 98 3095 9197 -7971 -19561 -11558 -4689 -2325 7975 1112 -5595 -4476 -4370 -1604 8196 2089
16335B089j1839J0608J0054J1628r491j9703m972J0070J943o348J4580q373o592
$$ 2089 -9750 858 10912 22540 13049 -6654 -11626 -1556 387 -5961 8619 246 -6346
16322f346R385M16r403J744J3280n455J164J437M219p951L410n625j3986l131
$$ -6346 3039 3455 -5948 -4204 9076 3621 4785 6222 10441 2490 5900 275 -13711 -16842
16308a6842J3815P867J0239O942o463j4962m043Q951Q751J0407K94j5392n000
$$ -16842 -3027 4840 15079 22021 15558 596 -3447 5504 14255 24662 24956 9564 4564
16295D564k063J3488m613k839J1184L460j2209k941J1670k831j8209O777j3132
$$ 4564 2501 15989 11376 8537 19721 23181 10972 8031 19701 16870 -1339 5438 -7694
16282g694k8845J5714Q450j846L938j555N654J225k570N895k746j0370O663J4201
$$ -7694 -36539 -20825 -12375 -14221 -10283 -11838 -6184 -4959 -7529 -1634 -4380 -14750 -8087 6114
16268F114J6064j124N395J033O804j8945l039L813j353k95L102j999j847p598
$$ 6114 22178 21054 26449 27482 34286 15341 12302 16115 14762 14467 17569 15570 13723 6125
16254F125M16R092q723q260K461J1128M161l532j3087j7351k753P770J1619P195
$$ 6125 6541 15633 6910 -1350 1111 12239 16400 12868 -219 -17570 -20323 -12553 -934 6261
16240F261n398O149L737j4634n513N668M348J046j3953N208K0345O048r318j0013
$$ 6261 863 7012 10749 -3885 -9398 -3730 618 1664 -12289 -7081 13264 19312 9994 -19
16226a9k980N868M538N59l491j0891K149K341O48j403j0775p765R37j140k953
$$ -19 -2999 2869 7407 7966 4475 -6416 -4267 -1926 -1278 -2681 -13456 -21221 -20284 -21424 -24377
16211b4377n268J6039J3190r108N492m538p143K167J0162R305M895j2987l875
$$ -24377 -29645 -13606 -416 -9524 -4032 -8570 -15713 -13546 -3384 5921 10816 -2171 -6046
16198f046m22R310L67r549J900m365n734K366J4028j796o313L31j212P48J814
$$ -6046 -6468 2842 3209 -6340 -4440 -8805 -14539 -12173 1855 59 -6254 -5923 -7135 -6387 -4573
16183d573J9240K138k1304K292J5936j271o438l285j660j948k798j0102o849m246
$$ -4573 14667 16805 -4499 -2207 13729 12458 6020 2735 1075 -873 -3671 -13773 -20622 -24868
16169b4868M78q663l895J5163J2710M005J2016r026M75J0241j315j6548j169p168
$$ -24868 -24390 -33053 -36948 -21785 -9075 -5070 6946 -2080 -1605 8636 7321 -9227 -10396 -17564
16155a7564M397L261q534R636R676p792J042J8641j617J608p281J13l854p100
$$ -17564 -13167 -9906 -18440 -8804 872 -6920 -5878 12763 11146 12754 5473 5586 1732 -5368
16141e368J146j056L537j754j567p815J808J3010p9J3577J3153l453p590M545
$$ -5368 -4222 -5278 -1741 -3495 -5062 -12877 -11069 1941 1862 15439 28592 25139 17549 22094
16127B2094L341J1460p539k3382j8561r346J490J0344J704j9593o394P128J6782
$$ 22094 25435 36895 29356 5974 -12587 -21933 -20443 -10099 -8395 -27988 -34382 -27254 -10472
16114a0472M298n306Q988O425q787m810O81m31n32L647J741k524K358O833k868
$$ -10472 -6174 -11480 -2492 3933 -4854 -9664 -8983 -9414 -9946 -6299 -4558 -7082 -4724 2109 -759
16099g59m705j2910J3717R373L014m415l068j052r957j4686J4725K868j552Q983
$$ -759 -5464 -18374 -4657 4716 7730 3315 247 -805 -10762 -25448 -10723 -7855 -9407 -424
16085d24N962l504J2457K884q325r886l071n865o277l809J8094R227p644k0749
$$ -424 5538 2034 14491 17375 9050 -836 -3907 -9772 -16049 -19858 -1764 7463 -181 -20930
16071b0930k146J260q21J6058j1087R146p43K002j23L959R785p087m719M012N471
$$ -20930 -23076 -21816 -22637 -6579 -17666 -8520 -9263 -7261 -7384 -3425 6360 -727 -5446 -1434 4037
16056D037n952O307O226l223k239o750m34J803Q085J5651P661j6680m905p999
$$ 4037 -1915 4392 10618 7395 5156 -1594 -2028 -225 7860 23511 31172 14492 9587 1588
16042A588r332J4081j153j2357M746L083L163l917P422j3595QM761k617o620R093
$$ 1588 -7744 6337 5184 -7173 -2427 656 3819 -98 7324 -6271 -6263 -1502 -4119 -10739 -1646
16027a646J9238j692m138P657o043j3820J148L568l853P15M940K458J727j2068
$$ -1646 17592 15900 11762 19419 13376 -444 704 4272 419 1134 6074 8532 10259 -1809
16013a809r217J342O003J27j3149K476J8697n41q767L807J1626k138m016k846
$$ -1809 -11026 -9684 -3681 -3554 -16703 -14227 4470 3929 -4838 -1031 10595 8457 4441 1595
15999A595o623J344O613j7273J9J2180K676j4081o321n749m720J2790R180O386
$$ 1595 -5028 -3684 2929 -14344 -14325 -2145 531 -13550 -19871 -25620 -30340 -17550 -8370 -1984
15985a984N108m230p62N696L394j3859j454M4L937P767L697M739L113j52L817
$$ -1984 3124 -1106 -1868 3828 7222 -6637 -8091 -8047 -4110 3657 7354 12093 15206 15054 18871
15970A8871k550r327j1474l461J5602J7609j1444k0693j1584Q187N177j125K476
$$ 18871 16321 6994 -4480 -7941 7661 25270 13826 -6867 -18451 -10264 -5087 -6212 -3736
15957c736l437J4340J0842J438j6295J513Q295j0071k772j4303l577j65J0879
$$ -3736 -7173 7167 18009 19447 3152 4665 12960 2889 117 -14186 -17763 -17928 -7049
15944g049p150j2559m139J5739R743P289l36l677o168m247O406r972j903K287
$$ -7049 -14199 -26758 -30897 -15158 -5415 1874 1538 -2139 -8307 -12554 -6148 -16120 -18023 -15736
15930a5736J458q013j169J0670K334k05Q579m53n854K235J4l007J0266P677r445
$$ -15736 -14278 -22291 -23460 -12790 -10456 -10661 -2082 -2535 -8389 -6154 -6140 -9147 1119 8796 -649
15915f49P329J0806P63j4743K905k516L721J626l756L247k737J5408k103j5503
$$ -649 6680 17486 18249 3506 6411 3895 7616 9242 5486 8733 5996 21404 19301 3798
15901C798l846J0188M526k461o653n357K988M402R145j1371j907O983r583k102
$$ 3798 -48 10140 14666 12205 5552 195 3183 7585 16730 5359 3452 10435 852 -1250
15887a250o916q258O710N612J037M174M375m463j0978q720K2567K4086J728j0619
$$ -1250 -8166 -16424 -9714 -4102 -3065 1109 5484 1021 -9957 -18677 3890 27976 29704 19085
15873A9085j1547j1075r198k456N923J3614L614j7601o787R194K2375N253k3418
$$ 19085 7538 -3537 -12735 -15191 -9268 4346 7960 -9641 -16428 -7234 15141 20394 -3024
15860c024j0328O644m48J1302l050j2557O751J1231L602K069p030o777n368J385
$$ -3024 -13352 -6708 -7156 4146 1096 -11461 -4710 6521 10123 12192 5162 -1615 -6983 -5598
15846e598J666O004m689k338k562R975k508O80R454o438n27J0084J7420m973j5687
$$ -5598 -3932 2072 -2617 -4955 -7517 2458 -50 630 10084 3646 3119 13203 30623 25650 9963
15831I963j477J2340p67j4068o649M697j067j1587j0766J8554R354R210j8145
$$ 9963 8486 20826 20059 5991 -658 4039 2972 -8615 -19381 -827 8527 17737 -408
15818d08j1189n870q74O55l46J3089m260J570l226o508O525l445Q362O112r826
$$ -408 -11597 -17467 -18341 -17686 -18032 -4943 -9203 -7633 -10859 -17367 -10842 -14287 -5925 187 -9639
15803i639j5563p626N741R594J0088k538Q094o352l496q742l963M550L922J0631
$$ -9639 -25202 -32828 -27087 -17493 -7405 -9943 -1849 -8201 -11697 -20439 -24402 -19852 -15930 -5299
15789e299K0386R543N942n568k2834m84Q640j5743n935m113j2213o612J0154K751
$$ -5299 15087 24630 30572 25004 2170 1686 10326 -5417 -11352 -15465 -27678 -34290 -24136 -21385
15775b1385M783K830J1350L062r684J0776J1952j2479n188j518q74M935Q617j1059
$$ -21385 -16602 -13772 -2422 640 -9044 1732 13684 1205 -3983 -5501 -6375 -1440 7177 -3882
15761c882j7039j5600J5018J4731J3232O593n870r80J838m307P284m019l811m345
$$ -3882 -20921 -36521 -21503 -6772 6460 13053 7183 6203 8041 3734 11018 6999 3188 -1157
15747a157k720j3221k847Q993J643L971J3269k785o028n148j0397j583N661P160
$$ -1157 -3877 -17098 -19945 -10952 -9309 -5338 7931 5146 -882 -6030 -16427 -18010 -12349 -5189
15733e189Q86k187N408o900j2200L40N639L27k587J487l96p252K267K694N463
$$ -5189 -4303 -6490 -1082 -7982 -20182 -19842 -14203 -13876 -16463 -14976 -15372 -22624 -20357 -17663 -12200
15718a2200Q824j4568j2678J3648J1676p390j5572N358k778J213R33N630l522
$$ -12200 -3376 -17944 -30622 -16974 -5298 -12688 -28260 -22902 -25680 -24467 -23534 -17904 -21426
15705b1426r219o301J7525l123l413K0107K87p390o114n643j0604K273N638J899
$$ -21426 -30645 -36946 -19421 -22544 -25957 -5850 -5563 -12953 -19067 -24710 -35314 -33041 -27403 -25504
15691b5504J5769K09J0561J5159j1534k0528m998J0469R411O655j339m918l419
$$ -25504 -9735 -9526 1035 16194 4660 -15868 -20866 -10397 -986 5669 4330 -588 -4007
15678d007j998m753Q131O642J0410r353j4152J667l772l921O334J1057j4999R156
$$ -4007 -6005 -10758 -2627 4015 14425 5072 -9080 -7413 -11185 -15106 -8772 2285 -12714 -3558
15664c558J2695j258O682l439j7625m672m718J3993J7434K635J0420k4297j2583
$$ -3558 9137 7879 14561 11122 -6503 -11175 -15893 -1900 15534 18169 28589 4292 -8291
15651h291Q554R019o98k651k990j269K34P50j693j4091o652P198N3J554J6704
$$ -8291 263 9282 8584 5933 2943 1674 1908 2658 965 -13126 -19778 -12580 -12527 -10973 5731
15636E731m644j917j714K487N59J426n648j2443o435j438j2062p890J6295L2013
$$ 5731 1087 -830 -2544 -57 502 1928 -3720 -16163 -22598 -24036 -36098 -43988 -27693 4320
15622D320K695j8211k735J2937J126j081P112j3118k0133q305Q769j47j1368J3000
$$ 4320 7015 -11196 -13931 -994 132 -949 6163 -6955 -27088 -35393 -26624 -26771 -38139 -25139
15608b5139O865N643O804j3730J842p215R182K0301k645r040q241r027J035L431
$$ -25139 -18274 -12631 -5827 -19557 -17715 -24930 -15748 4553 1908 -7132 -15373 -24400 -23365 -19934
15594a9934K971N504L433q229M472J7142L297q085q25k620M32O602n628N554K938
$$ -19934 -16963 -11459 -8026 -16255 -11783 5359 8656 571 -254 -2874 -2442 4160 -1468 4086 7024
15579G024n045l449m586J3351Q994l340j1485j4093j818Q882O024O257J1475l451
$$ 7024 1979 -1470 -6056 7295 16289 12949 1464 -12629 -14447 -5565 459 6716 18191 14740
15565A4740r153o183K385k954J3689m116m897l980l648j5499r02P527l70l878
$$ 14740 5587 -596 1789 -1165 12524 8408 3511 -469 -4117 -19616 -20518 -12991 -13361 -17239
15551a7239R094L39o116k346J395R388Q716P182J0077j545j3003J0159Q20j2937
$$ -17239 -8145 -7806 -13922 -16268 -14873 -5485 3231 10413 20490 18945 5942 16101 16921 3984
15537C984m202R830o464k617o654n693J1561P3j4607k573J3593J3634M402o756
$$ 3984 -218 9612 3148 531 -6123 -11816 -255 -182 -14789 -17362 -3769 9865 14267 7511
15523G511m548j217k640j4216j3952Q286K463O016P050n003J1346J704J489L673
$$ 7511 2963 1746 -894 -15110 -29062 -20776 -18313 -12297 -5247 -10250 1096 2800 4289 7962
15509G962o476j238J059k818n924n029M995O898M383J4799O105j2703k1084r003
$$ 7962 1486 248 1307 -1511 -7435 -12464 -7469 -571 3812 18611 24716 12013 -9071 -18074
15495a8074l055P874Q328J3793j564J853k213K770P729j930n87l433r22j1884
$$ -18074 -21129 -13255 -4927 8866 7302 9155 6942 9712 17441 15511 14924 11491 10569 -1315
15481a315j7029N138J571o888J900R157J1427n519Q326L756n845O156J1197l24
$$ -1315 -18344 -13206 -11635 -18523 -16623 -7466 3961 -1558 6768 10524 4679 10835 22032 21708
15467B1708j2720k0603k814k604r4N832J1006j0215K446L430j714M632l687k519
$$ 21708 8988 -11615 -14429 -17033 -17127 -11295 -289 -10504 -8058 -4628 -6342 -1710 -5397 -7916
15453g916j695O107o717N206n744l117q356J1386J5283P177J2288n091l962j2167
$$ -7916 -9611 -3504 -10221 -5015 -10759 -13876 -22232 -10846 4437 11614 23902 18811 14849 2682
15439B682l350P088J1059j2650j1398q406r471L704J323R009Q882L404J0297N544
$$ 2682 -668 6420 17479 4829 -6569 -14975 -24446 -20742 -19419 -10410 -1528 1876 12173 17717
15425A7717k0109j4409r417N44P973O242o265o204L252J618R954P593Q73O349
$$ 17717 -2392 -16801 -26218 -25674 -17701 -11459 -17724 -23928 -20676 -19058 -9104 -1511 -638 5711
15411E711Q580j877k528M252n964q050j1261j540l634o537j029J337O651K812
$$ 5711 14291 12414 9886 14138 8174 124 -11137 -12677 -16311 -22848 -23877 -22540 -15889 -13077
15397a3077J437O749j0323M266J548K818O898K788o108n835L200L429R337q622
$$ -13077 -11640 -4891 -15214 -10948 -9400 -6582 316 3104 -3004 -8839 -5639 -2210 7127 -1495
15383a495q757K010L697J1936O849q761N455k504l153L227n373L743P293j1942
$$ -1495 -10252 -8242 -4545 7391 14240 5479 10934 8430 5277 8504 3131 6874 14167 2225
15369B225n268J856j005k560J5937J0390l808j4282m499j1313k249L08L56M740
$$ 2225 -3043 -1187 -2192 -4752 11185 21575 17767 3485 -1014 -12327 -14576 -14268 -13912 -9172
15355i172J6422L889k70q084j0359K892O113J1664j0226o227O436q782k764O306
$$ -9172 7250 11139 10869 2785 -7574 -4682 1431 13095 2869 -3358 3078 -5704 -8468 -2162
15341b162k337M82J1868Q73K668j953j5139l063J4260N155k1741j6569J0666J5577
$$ -2162 -4499 -4017 7851 8724 11392 9439 -5700 -8763 5497 10652 -11089 -27658 -16992 -1415
15327a415R184L48J0321J6336j1109j3752j8291O060k763l617l48O905J7378l456
$$ -1415 7769 8117 18438 34774 23665 9913 -8378 -2318 -5081 -8698 -9046 -2141 15237 11781
15313A1781j2278j1694K856L528n59O749k646J2551L255m649j5936k0854j17J2740
$$ 11781 -497 -12191 -9335 -5807 -6366 383 -2263 10288 13543 8894 -7042 -27896 -28013 -15273
15299a5273J5952N032L61n773j3872j0811J5798O105m847q566p405m118R736R879
$$ -15273 679 5711 6072 299 -13573 -24384 -8586 -2481 -7328 -15894 -23299 -27417 -17681 -7802
15285g802l11J5395J317K29J131q671p945j868n978J561J1839j5847n757J7915
$$ -7802 -8113 7282 8599 8828 9959 1288 -6657 -8525 -14503 -12942 -1103 -16950 -22707 -4792
15271d792J3396J1747M882q883j0154p019j7244j1906K2380J6187l99j6356k637
$$ -4792 8604 20351 25233 16350 6196 -823 -18067 -29973 -7593 8594 8195 -8161 -10798
15258a0798R21N017Q993l037L247k694p205j3031k931J6347j232l33K037q176
$$ -10798 -9877 -4860 4133 1096 4343 1649 -5556 -18587 -21518 -5171 -6403 -6736 -4699 -12875
15244a2875O938P500j1066k383k901Q968J485l222l097j0103Q66J1504J027j336
$$ -12875 -5937 1563 -9503 -11886 -14787 -5819 -4334 -7556 -10653 -20756 -19890 -8386 -7359 -8695
15230h695k311R457J2253j06J1943m146k0892k3165j368Q796K1418J3648q517
$$ -8695 -11006 -1549 10704 10598 22541 18395 -2497 -25662 -27030 -18234 3184 16832 8315
15217H315J222L315K7n863o786r021j0854L53k995k0498P869K691N871J2103J1585
$$ 8315 9537 12852 12879 7016 230 -8791 -19645 -19292 -22287 -42785 -34916 -32225 -26354 -14251 -2666
15202b666M496M302M337J857j4300r701l00k55n70m678K214O247M702l537l533
$$ -2666 1830 6132 10469 12326 -1974 -11675 -11975 -12230 -12800 -17478 -15264 -9017 -4315 -7852 -11385
15187a1385N462J9203l749m864m781j1953j0474L265k061Q97r372J8804J1181
$$ -11385 -5923 13280 9531 4667 -114 -12067 -22541 -19276 -21337 -20440 -29812 -11008 173
15174A73J91q747l946j365j3617R05k1O016j3927l169K0831K4318j4453j7503
$$ 173 364 -8383 -12329 -13694 -27311 -26406 -26427 -20411 -34338 -37507 -16676 7642 -6811 -24314
15160b4314j7763M146J0071O154L152n40r969m946R266N581J0405N195L324m091
$$ -24314 -42077 -37931 -27860 -21706 -18554 -19094 -29063 -34009 -24743 -19162 -8757 -3562 -238 -4329
15146d329L716k035o410m094k607k554J0519J1420O497J504o253o251q193r572
$$ -4329 -613 -2648 -9058 -13152 -15759 -18313 -7794 3626 10123 11627 5374 -877 -9070 -18642
15132a8642R240R896p413k355o638R064J5942J43j5028m27J052l242k142N223
$$ -18642 -9402 494 -6919 -9274 -15912 -6848 9094 9237 -5791 -6218 -5166 -8408 -10550 -5327
15118e327j464p936r319P590J7822n32R07O487J74N122L530P728k877j8699K830
$$ -5327 -6791 -14727 -24046 -16456 1366 834 1741 8228 8402 13524 17054 24782 21905 3206 6036
15103F036J058K907r156N200j799k1371j4241J7698J9384l444k204M13O327J212
$$ 6036 7094 10001 845 6045 4246 -17125 -31366 -13668 5716 2272 68 481 6808 8020
15089H020k655M354j1694j602N713j0136n689k019n02J6833L327k574j0755r140
$$ 8020 5365 9719 -1975 -3577 2136 -8000 -13689 -15708 -16210 623 3950 1376 -9379 -18519
15075a8519J4601N50m576k334m253P582J7498N84k56O427m814q076j5272O988
$$ -18519 -3918 -3368 -7944 -10278 -14531 -6949 10549 11133 10877 17304 12490 4414 -10858 -3870
15061c870Q219l411k060l198J150m590M079P376M094j2191j1430j1752J047Q453
$$ -3870 4349 938 -1122 -4320 -3170 -7760 -3681 3695 7789 -4402 -15832 -27584 -26537 -18084
15047a8084Q414N37L931k41J9685K6660n57j2346j2563j5740j0489O228N491j686
$$ -18084 -9670 -9133 -5202 -5443 14242 40902 40345 27999 15436 -304 -10793 -4565 926 -760
15033g60N360Q555L59n565L47J580L06n129o597j8620l024K659O662J9377K618
$$ -760 4600 13155 13514 7949 8296 9876 10182 5053 -1544 -20164 -23188 -20529 -13867 5510 8128
15018H128j9249j4345J0610Q059Q762O383K568j4155k042Q942k033k502j2038
$$ 8128 -11121 -25466 -14856 -6797 1965 8348 10916 -3239 -5281 3661 1628 -874 -12912
15005a2912n525J5149J8938j7983j2538L547j2601m334P505L313Q917N830L88
$$ -12912 -18437 -3288 15650 -2333 -14871 -11324 -23925 -28259 -20754 -17441 -8524 -2694 -2306
14992b306j961p957n381J3506K086k993n416n555P609J0858n573l912m366O41
$$ -2306 -4267 -12224 -17605 -4099 -2013 -5006 -10422 -15977 -8368 2490 -3083 -6995 -11361 -10720
14978a0720R302J6638k922j2551k212O420K774N135k328j4558m586o220O87M635
$$ -10720 -1418 15220 12298 -253 -2465 3955 6729 11864 9536 -5022 -9608 -15828 -15141 -10506
14964a0506q255j220J4016L918j921P261P507K687q748o452O649k612j1765R031
$$ -10506 -18761 -19981 -5965 -2047 -3968 3293 10800 13487 4739 -1713 4936 2324 -9441 -410
14950d10J9879j7453p125R515L894n827l239Q312p166k2028q382k021R505J5676
$$ -410 19469 2016 -5109 4406 8300 2473 -766 7546 380 -21648 -30030 -32051 -22546 -6870
14936f870J1183n625j0955O638j197N777J6227n881K560N848j4463l019P28k0333
$$ -6870 4313 -1312 -12267 -5629 -6826 -1049 15178 9297 11857 17705 3242 223 951 -19382
14922a9382m239o021M756M205Q580o639k380P539l028j210R676Q059j393M730
$$ -19382 -23621 -29642 -24886 -20681 -12101 -18740 -21120 -13581 -16609 -17819 -8143 -84 -1477 3253
14908C253j140r524p84R98R956q079j1836J1589n515r30J1085J576q203q658M498
$$ 3253 2113 -7411 -8195 -7197 2759 -5320 -17156 -5567 -11082 -12012 -927 649 -7554 -16212 -11714
14893a1714Q1K56M899L175M777k390P541J036n768j701K351N452n61q838j4304
$$ -11714 -11633 -11377 -6478 -3303 1474 -916 6625 7661 1893 192 2543 7995 7434 -1404 -15708
14878a5708m498P207J1980M429p0n759n983Q173L326J466l341K420R428N502m706
$$ -15708 -20206 -12999 -1019 3410 3340 -2419 -8402 -229 3097 4563 1222 3642 13070 18572 13866
14863A3866J448m91J60o048m906O313j2524j4623J75L0154l422j3394K495N193
$$ 13866 15314 14823 14983 8935 4029 10342 -2182 -16805 -16630 13524 10102 -3292 -797 4396
14849D396K372j2280J362q808q608P996N654N606M969K269j6217j2901P930P815
$$ 4396 6768 -5512 -4150 -12958 -21566 -13570 -7916 -2310 2659 4928 -11289 -24190 -16260 -8445
14835h445l136M903L984M361L904P74J344J292r879o461p134N804J2455J0606
$$ -8445 -11581 -6678 -2694 1667 5571 6345 7689 8981 -898 -7359 -14493 -8689 3766 14372
14821A4372P769j402q732p762j0278J216p354J1829Q182l646J2236K1192r035
$$ 14372 22141 20739 12007 4245 -6033 -4817 -12171 -342 7840 4194 16430 37622 28587
14808B8587m380J411p032q1p561n241L653m546m262j1471L571J6099p393q578
$$ 28587 24207 25618 18586 18505 10944 5703 9356 4810 548 -10923 -7352 8747 1354 -7224
14794g224R300M616j5770j3847n51Q61J909K947J1295J2890Q498K112m591l185
$$ -7224 2076 6692 -9078 -22925 -23476 -22615 -20706 -17759 -6464 6426 14924 17036 12445 9260
14780I260j2443J1573J6795j215j2184N66L784Q833p958m63p123P428r022k211
$$ 9260 -3183 8390 25185 23970 11786 12352 16136 24969 17011 16548 9425 16853 7831 5620
14766E620k765L899j3297m304N420o147K673k519J2325n812j251J27O57j0480
$$ 5620 2855 6754 -6543 -10847 -5427 -11574 -8901 -11420 905 -4907 -6158 -6031 -5374 -15854
14752a5854K066J0628J5528n011j0659r257j4295m686J382P836J4417J0672j9385
$$ -15854 -13788 -3160 12368 7357 -3302 -12559 -26854 -31540 -30158 -22322 -7905 2767 -16618
14739a6618j124K831j222l8J4091n731j1169R056P939N344j3163m883O234J2469
$$ -16618 -17742 -14911 -16133 -16171 -2080 -7811 -18980 -9924 -1985 3359 -9804 -14687 -8453 4016
14725D016M880M445j4841o631N308J431l622K329P236k202K533l34n423j5678
$$ 4016 8896 13341 -1500 -8131 -2823 -1392 -5014 -2685 4551 2349 4882 4548 -875 -16553
14711a6553n850p281J0835J7405m64j4361J4801J2427k112j796L444m789k705
$$ -16553 -22403 -29684 -18849 -1444 -1908 -16269 -1468 10959 8847 7051 10495 5706 3001
14698C001r568m207Q00n436o490o806N302p030R541Q097J955m430m646L256M516
$$ 3001 -6567 -10774 -9974 -15410 -21900 -28706 -23404 -30434 -20893 -12796 -10841 -15271 -19917 -16661 -12145
14683a2145N354P843N231r478Q831K0078p529l640o566k214o71R17k918j3175
$$ -12145 -6791 1052 6283 -3195 5636 25714 18185 14545 7979 5765 5094 6011 3093 -10082
14669a0082j1309J727l638P565O272q545j8030k817J8289J457l873J6235N075
$$ -10082 -21391 -19664 -23302 -15737 -9465 -18010 -36040 -38857 -20568 -19111 -22984 -6749 -1674
14656a674p048O988Q216J416k287p521o814l403p605n546J7015J2607N452q836
$$ -1674 -8722 -1734 6482 7898 5611 -1910 -8724 -12127 -19732 -25278 -8263 4344 9796 960
14642I60o480j1959j2010L200j2020l981J4319J7170k328m027N494q521o325R544
$$ 960 -5520 -17479 -29489 -26289 -38309 -42290 -27971 -10801 -13129 -17156 -11662 -20183 -26508 -16964
14628a6964M921O009l82Q945K810m977j6602p431J0861J6719J402J7419J1431
$$ -16964 -12043 -6034 -6416 2529 5339 362 -16240 -23671 -12810 3909 5311 22730 34161
14615C4161j841k1851p058P582k375j833n259p658J308Q811o305j3539J0046L031
$$ 34161 32320 10469 3411 10993 8618 6785 1526 -6132 -4824 3987 -2318 -15857 -5811 -2780
14601b780j6320M002M884M85J171M557N339L393j0374k4767N399l91m113J1282
$$ -2780 -19100 -15098 -10214 -9729 -8558 -4001 1338 4731 -5643 -30410 -25011 -25402 -29515 -18233
14587a8233P795n904J804p689N779J3513J719o650P507M986k430j37j261q114
$$ -18233 -10438 -16342 -14538 -22227 -16448 -2935 -1216 -7866 -359 4627 2197 2060 799 -7315
14573g315j029J2109R088k997j507J058m97M046j084j2966r763n82Q563K677j0190
$$ -7315 -8344 3765 12853 9856 8349 9407 8910 12956 11872 -1094 -10857 -11439 -2876 -199 -10389
14558a0389J76j3267k745R162p560M490Q124j046j08K267j057J8014l799r596
$$ -10389 -10213 -23480 -26225 -17063 -24623 -20133 -12009 -13055 -13163 -10896 -11953 6061 2262 -7334
14544g334l017o994p352K9J3799m2k068o610k890J310L748k547K346K556K308
$$ -7334 -10351 -17345 -24697 -24668 -10869 -10911 -12979 -19589 -22479 -21169 -17421 -19968 -17622 -15066 -12758
14529a2758m408j7661l720J3265M66J3678j007o749M709N411n499j514J6821m233
$$ -12758 -17166 -34827 -38547 -25282 -24816 -11138 -12145 -18894 -14185 -8774 -14273 -15787 1034 -3199
14515c199j1024N264J2126J328j943p816K997J1367j228K73n842j6279q046J2002
$$ -3199 -14223 -8959 3167 4495 2552 -5264 -2267 9100 7872 8145 2303 -13976 -22022 -10020
14501a0020R311j690J590Q10J5954M45j7010r785j3090m517J7835M656j3170M908
$$ -10020 -709 -2399 -809 1 15955 16400 -610 -10395 -23485 -28002 -10167 -5511 -18681 -13773
14487a3773J7211J2957k737j5121j0912j0993J056J3570J2974J1012O913k354
$$ -13773 3438 16395 13658 -1463 -12375 -23368 -22312 -8742 4232 15244 22157 19803
14475A9803j3020j1354j2127J2717J8185j4772j6046P45Q151p857J120Q830J629
$$ 19803 6783 -4571 -16698 -3981 14204 -568 -16614 -15869 -7718 -15575 -14455 -5625 -3996
14462c996l873l027j5161P914N936q58M773Q322M141j0284m853L891j1072L667
$$ -3996 -7869 -10896 -26057 -18143 -12207 -13065 -8292 30 4171 -6113 -10966 -7075 -18147 -14480
14448a4480J1489L684J411o604O620P64k75n182q069q341O088J6403l191Q399
$$ -14480 -2991 693 2104 -4500 2120 2884 2609 -2573 -10642 -18983 -12895 3508 317 8716
14434H716J9209J088j3726j4870k2010j94K886j2521Q800N855m97J6888l478L883
$$ 8716 27925 29013 15287 417 -21593 -21787 -18901 -31422 -22622 -16767 -17264 -376 -3854 29
14420B9p066N176K579p201m758J2105L602J934o560r704m946l65J3805l231M937
$$ 29 -7037 -1861 718 -6483 -11241 864 4466 6400 -160 -9864 -14810 -15175 -1370 -4601 336
14405C36N017Q498o829j4965J741j5216j5062P618J1216M212j6337Q237K1847
$$ 336 5353 13851 7022 -7943 -6202 -21418 -36480 -28862 -17646 -13434 -29771 -21534 313
14392C13J923l622l104M234O356J2149j887m635j782J714O143j7471k2996J3829
$$ 313 2236 -1386 -4490 -256 6100 18249 16362 11727 9945 11659 17802 331 -22665 -8836
14378h836N358J364P455O966J196p531l179K783m265q519j1476j79J491k125K30
$$ -8836 -3478 -2114 5341 12307 13503 5972 2793 5576 1311 -7208 -18684 -18863 -17372 -19497 -19267
14363a9267J4406O462m949j2212Q295Q875O410L114o079j0229m850J752J3838
$$ -19267 -4861 1601 -3348 -15560 -7265 1610 8020 11134 5055 -5174 -10024 -8272 5566
14350E566o743n788p573o540j9082P319J2340n137J144J1697J4062K186j3582
$$ 5566 -1177 -6965 -14538 -21078 -40160 -32841 -20501 -25638 -24494 -12797 1265 3451 -10131
14337a0131m683M069R364j6946j0524K312p549N180m594n646J155m64J3196k281
$$ -10131 -14814 -10745 -1381 -18327 -28851 -26539 -34088 -28908 -33502 -39148 -37993 -38457 -25261 -27542
14323b7542Q072J2042j35L074k188P287l090j811l416l56K056p292l765J9261
$$ -27542 -19470 -7428 -7563 -4489 -6677 610 -2480 -4291 -7707 -8063 -6007 -13299 -17064 2197
14309B197j337K543j5466k2118J491j091J6228J8547m781n316k1426j1924J2339
$$ 2197 860 3403 -12063 -34181 -32690 -33781 -17553 994 -3787 -9103 -30529 -42453 -30114
14296c0114J3409N948O542P197m377M06M77j157n880j2809q515J1019L962j738
$$ -30114 -16705 -10757 -4215 2982 -1395 -989 -512 -1669 -7549 -20358 -28873 -17854 -13892 -15630
14282a5630p405j1842q30J9118R363J155q309l509Q806k890N771L394K411J0847
$$ -15630 -23035 -34877 -35707 -16589 -7226 -6071 -14380 -17889 -9083 -11973 -6202 -2808 -397 10450
14268A0450j3746p021l075p00j0715N309J3070q684J1886M008k730n068l808j4581
$$ 10450 -3296 -10317 -13392 -14092 -24807 -19498 -6428 -15112 -3226 782 -1948 -7016 -10824 -25405
14254b5405q769M317J0555n97m492Q546J0679N079P670K964J1092J607j9366M66
$$ -25405 -34174 -29857 -19302 -19899 -24391 -15845 -5166 -87 7583 10547 21639 23246 3880 4346
14240D346Q811p816j0319j1988k1405L069J2471J4491J308r16Q997J6948N589
$$ 4346 13157 5341 -4978 -16966 -38371 -35302 -22831 -8340 -7032 -7948 1049 17997 23586
14227B3586j8660m698o284k732Q018J013Q252J471L337Q18q785P018O043M453
$$ 23586 4926 228 -6056 -8788 -770 243 8495 9966 13303 14121 5336 12354 18397 22850
14213B2850J0240n15o751O377Q236J040Q608N064o608j5908K276J4448J5815M15
$$ 22850 33090 32575 25824 32201 40437 41477 50085 55149 48541 32633 34909 49357 65172 65587
14199F5587J141M484j1349k330k105R975J344n249j911j0386j2678o784j4969
$$ 65587 66728 71212 59863 57533 55428 65403 66747 61498 59587 49201 36523 29739 14770
14186A4770o819R44j814j401K132J5261O936K929k4257l691J0519R073j2587j2978
$$ 14770 7951 8895 7081 5680 7812 23073 30009 32938 8681 4990 15509 24582 11995 -983
14172i83r148j786N571O486N207J2175p5j7108r302j18Q993J152p108n720k57
$$ -983 -10131 -11917 -6346 140 5347 17522 17447 339 -8963 -9081 -88 1064 -6044 -11764 -12021
14157a2021K786m89r233J407o867m499k156O601K740j443N168P965n146O702R632
$$ -12021 -9235 -9724 -18957 -17550 -24417 -28916 -31072 -24471 -21731 -23174 -18006 -10041 -15187 -8485 1147
14142A147l971q905O103M192P249q922m301j0142M526J3358k191N220k961p215
$$ 1147 -2824 -11729 -5626 -1434 5815 -3107 -7408 -17550 -13024 334 -1857 3363 402 -6813
14128f813J1366J5298l974j0196q210P61j896J042M62n403J404p786J38O881j908
$$ -6813 4553 19851 15877 5681 -2529 -1768 -3664 -2622 -2160 -7563 -6159 -13945 -13807 -6926 -8834
14113h834m387K797K961q722L318R106l604j2729O775N766n205m810o40j670j169
$$ -8834 -13221 -10424 -7463 -16185 -12867 -3761 -7365 -20094 -13319 -7553 -12758 -17568 -18208 -19878 -21047
14098b1047j801J0817K3884p146j6920j0632N640J6745N646o790j0812l65J1155
$$ -21047 -22848 -12031 11853 4707 -12213 -22845 -17205 -460 5186 -1604 -12416 -12781 -1626
14085a626Q220j0118j3781j2396j4654R97J6210J0136k50k323J8424J1808o369
$$ -1626 6594 -3524 -17305 -29701 -44355 -43358 -27148 -17012 -17262 -19585 -1161 10647 4278
14072D278j0221j0009j976m021K0479q44o972n382n553P919M861J1564N285N396
$$ 4278 -5943 -15952 -17928 -21949 -1470 -2314 -9286 -14668 -20221 -12302 -7441 4123 9408 14804
14058A4804j046l568k1234k0907m804K2531j301l432J8452j552o15P426J925k265
$$ 14804 13758 10190 -11044 -31951 -36755 -14224 -15525 -18957 -505 -2057 -2672 4754 6679 4414
14044D414m246o183k601l364O650L47p532o038J4252j381q037p536P247J1683
$$ 4414 168 -6015 -8616 -11980 -5330 -4983 -12515 -18553 -4301 -5682 -13719 -21255 -14008 -2325
14030b325N421K492q465k0499p651l764J2290J1296M490O639L475Q624j3437p873
$$ -2325 3096 5588 -2877 -23376 -31027 -34791 -22501 -11205 -6715 -76 3399 12023 -1414 -9287
14016i287j728J5726J0157M834j5143n911k957k318p627P725R697r460j0103R569
$$ -9287 -11015 4711 14868 19702 4559 -1352 -4309 -6627 -14254 -6529 3168 -6292 -16395 -6826
14002f826O916j0530m233L396j0j9027k892J6542k63J2935K1439J136r758j6962
$$ -6826 90 -10440 -14673 -11277 -11287 -30314 -33206 -16664 -16927 -3992 17447 18583 8825 -8137
13988h137j5239K0P667O663Q24N493N255L510r668L720Q274P11m119M43j2021
$$ -8137 -23376 -23356 -15689 -9026 -8202 -2709 2546 6056 -3612 108 8382 9093 4974 5417 -6604
13973f604r031N108R477p708J531P037J543N347j1656n971R894j3686l983N311
$$ -6604 -15635 -10527 -1050 -8758 -7227 -190 1353 6700 -4956 -10927 -1033 -14719 -18702 -13391
13959a3391p527L833K269r023O549J4526O394K796P74m162K998L252N377P100
$$ -13391 -20918 -17085 -14816 -23839 -17290 -2764 3630 6426 7200 3038 6036 9288 14665 21765
13945B1765K044p042J322P694O895P543N829M002n910j2038r609K912k2973N765
$$ 21765 23809 16767 18089 25783 32678 40221 46050 50052 44142 32104 22495 25407 2434 8199
13931H199m818O199n372k0077Q433J0350K5629K487k1467j9766P426J2082J7461
$$ 8199 3381 9580 4208 -15869 -7436 2914 28543 31030 9563 -10203 -2777 9305 26766
13918B6766Q608j0428p073N470n936j642o343k945q53J04K169j7012J629o779
$$ 26766 35374 24946 17873 23343 17407 15765 9422 6477 5624 5728 7897 -9115 -7486 -14265
13904a4265m052P40l819k600k887j381M351K597l909J3447M870K513J1579j487
$$ -14265 -18317 -17577 -21396 -23996 -26883 -28264 -23913 -21316 -25225 -11778 -6908 -4395 7184 5697
13890E697j6022q138j983J5988J108j7296K174J0222L268k286O354j732J2843
$$ 5697 -10325 -18463 -20446 -4458 -3350 -20646 -18472 -8250 -4982 -7268 -914 -2646 10197
13877A0197P32j2024m757J2420M677j1634l796R084q63j2747M69k285q59L314
$$ 10197 10929 -1095 -5852 6568 11245 -389 -4185 4899 4036 -8711 -8242 -10527 -11386 -8072
13863h072J352p700J0405n176j28N467Q463k593r562j824p980O71j206n607k716
$$ -8072 -6720 -14420 -4015 -9191 -9319 -3852 4611 2018 -7544 -9368 -17348 -16677 -17883 -23490 -26206
13848b6206Q961K875Q399P274J3401R533j3429k3811L08L257o294m898k612J5798
$$ -26206 -17245 -14370 -5971 1303 14704 24237 10808 -13003 -12695 -9438 -15732 -20630 -23242 -7444
13834g444L592n180k939r16O590q836p315J1140N16q283J570P926O561K07N016
$$ -7444 -3852 -9032 -11971 -12887 -6297 -15133 -22448 -11308 -10792 -19075 -17505 -9579 -3018 -2811 2205
13819B205J542k822n210j0648o068J990P190J9994O098j862J4754J068j9487n227
$$ 2205 3747 925 -4285 -14933 -21001 -19011 -11821 8173 14271 12409 27163 28231 8744 3517
13805C517m85p237J904J808J1308l851m131j259m733j1033J0962L371R484M509
$$ 3517 3032 -4205 -2301 -493 10815 6964 2833 1574 -3159 -14192 -3230 141 9625 14134
13791A4134n381q680L576P721l129j0636j5965m078J8122J5211p489n757P048
$$ 14134 8753 73 3649 11370 8241 -2395 -18360 -22438 -4316 10895 3406 -2351 4697
13778D697M349p28J0201J377j6149m852M47r701N777N486j1970j844L783n123
$$ 4697 9046 8318 18519 19896 3747 -1105 -658 -10359 -4582 904 -11066 -12910 -9127 -14250
13764a4250M558O4p179K638N805L087q186k440R074L948P779r071j2041Q42R451
$$ -14250 -9692 -9628 -16807 -14169 -8364 -5277 -13463 -15903 -6829 -2881 4898 -4173 -16214 -15372 -5921
13749e921n148J2289k634j4778n914P315K109m181M978J0313O228j875j5382K402
$$ -5921 -11069 1220 -1414 -16192 -22106 -14791 -12682 -16863 -11885 -1572 4656 2781 -12601 -10199
13735a0199N795m669q428Q014J2275o326m988L203J7119k042j2984o113K763J4750
$$ -10199 -4404 -9073 -17501 -9487 2788 -3538 -8526 -5323 11796 9754 -3230 -9343 -6580 8170
13721H170J4381j1763n403J5206M528j7650l331N331J649J895l984L285N088n612
$$ 8170 22551 10788 5385 20591 25119 7469 4138 9469 11118 13013 9029 12314 17402 11790
13707A1790j6381j0065Q32R115Q409k988p57R373m053m144L42M694j4764r562
$$ 11790 -4591 -14656 -13824 -4709 3700 712 -45 9328 5275 1131 1473 6167 -8597 -18159
13693a8159J1413J2447K261j7435J366K310L191k702J5784R194M539j3587r726
$$ -18159 -6746 5701 7962 -9473 -8107 -5797 -2606 -5308 10476 19670 24209 10622 896
13680H96P13j696k286n84O325N908n60P12n323K163Q225k997m545J4481K054Q34
$$ 896 1609 -87 -2373 -2957 3368 9276 8716 9428 4105 6268 14493 11496 6951 21432 23486 24320
13664B4320N502K819m910L229p74l031j1634r675L967J7451J1285r196o742j887
$$ 24320 29822 32641 27731 30960 30186 27155 15521 5846 9813 27264 38549 29353 22611 20724
13650B0724N010k357K126j2040q387l855J2146q340l117k56m176p38n643j811
$$ 20724 25734 23377 25503 13463 5076 1221 13367 5027 1910 1654 -2522 -3260 -8903 -10714
13636a0714q223m591J7171R664o06N493J716k767k332L434m696j288q793j0889
$$ -10714 -18937 -23528 -6357 3307 2701 8194 9910 7143 4811 8245 3549 2261 -6532 -17421
13622a7421J0217J12j3967N39Q239J1375J4217q568p136p871j910R40J4283J0053
$$ -17421 -7204 -7092 -21059 -20520 -12281 -906 13311 4743 -2393 -10264 -12174 -11234 3049 13102
13608A3102l980L395k791O458k71l92n958j9037r669J601R727J7551l386q090
$$ 13102 9122 12517 9726 16184 15913 15521 9563 -9474 -19143 -17542 -7815 9736 6350 -1740
13594a740P399m097p911N198J3052K179R33m946j8749j299m822j6798R962J4155
$$ -1740 5659 1562 -6349 -1151 11901 14080 15013 10067 -8682 -9981 -14803 -31601 -21639 -7484
13580g484J2088M188m076Q713Q764j0108o069O1k061m124l656R231M916k727q416
$$ -7484 4604 8792 4716 13429 22193 12085 6016 6077 4016 -108 -3764 5467 10383 7656 -760
13565g60r942M284j0788O850P066j428J885O944J7181O384L870L605r705j9051
$$ -760 -10702 -6418 -17206 -10356 -3290 -4718 -2833 4111 21292 27676 31546 35151 25446 6395
13551F395j4425j0616m219O391J2430j408k621r463N217O464J6474J867j4957
$$ 6395 -8030 -18646 -22865 -16474 -4044 -5452 -8073 -17536 -12319 -5855 10619 12486 -2471
13538b471j1394o653J4672J2727j294L413j1526n739k300J0626R802p969m720
$$ -2471 -13865 -20518 -5846 6881 5587 9000 -2526 -8265 -10565 61 9863 1894 -2826
13525b826N066R921O759J551Q593j0965j306l205j790n017n86q845L237P292R75
$$ -2826 2240 12161 18920 20471 29064 18099 16793 13588 11798 6781 6195 -2650 587 7879 8854
13510H854j28L361J3253k1996K748j507l382l446o762M669Q961L40M752J0673
$$ 8854 8726 12087 25340 3344 6092 4585 1203 -2243 -9005 -4336 4625 4965 9717 20390
13496B0390P022J0226L010J919j6551m738n245n071K6416N091L948K532j2726
$$ 20390 27412 37638 40648 42567 26016 21278 16033 10962 37378 42469 46417 48949 36223
13483C6223j8602p981N53O710N003J2269Q418p630Q930P764J87l374k1905q942
$$ 36223 17621 9640 10193 16903 21906 34175 42593 34963 43893 51657 51844 48470 26565 17623
13469A7623j6186J017R425q56r502L59J0553j25M165R678J507L405L97r872k783
$$ 17623 1437 2454 11879 11023 1521 1880 12433 12308 16473 26151 27658 31063 31460 21588 18805
13454A8805k246J1705J0358N348R95j1328J2545J9984j311k3397o039J8j3057
$$ 18805 16559 28264 38622 43970 44965 33637 46182 66166 64855 41458 35419 35437 22380
13441B2380J368L006P868m92M645M379J0651N976o146q275j0818m90J5894L893
$$ 22380 23748 26754 34622 34130 38775 43154 53805 59781 53635 45360 34542 34052 49946 53839
13427E3839n530N688j1148O544m222j0228p416o955L853o14L472M391J089P145
$$ 53839 48309 53997 42849 49393 45171 34943 27527 20572 24425 23811 27283 31674 32763 39908
13413C9908P801N318M081n799Q96o696l873j7547k101Q365J2417Q929l799j1510
$$ 39908 47709 53027 57108 51309 52205 45509 41636 24089 21988 30353 42770 51699 47900 36390
13399C6390j8503m069l398j984P462J2881M040m452j0207j6906n808J6207R255
$$ 36390 17887 13818 10420 8436 15898 28779 32819 28367 18160 1254 -4554 11653 20908
13386B0908J6243j355p362k914r600n782R704q69J2404N302R730N2n183k549j3508
$$ 20908 37151 35796 28434 25520 15920 10138 19842 18973 31377 36679 46409 46461 41278 38729 25221
13371B5221J2635J7665K240n883o223n690N83L077J4012k621J182j2072k5818
$$ 25221 37856 55521 57761 51878 45655 39965 40548 43625 57637 55016 56198 44126 18308
13358A8308J866J2941J0277l508l394J923p180j357J1568M721j3056j5465R341
$$ 18308 20174 33115 43392 39884 36490 38413 31233 29876 41444 46165 33109 17644 26985
13345B6985J0107R891J3720M79j667J86k453j1638j213o430j4471J2390N561N298
$$ 26985 37092 46983 60703 61182 59515 59701 57248 45610 44397 37967 23496 35886 41447 46745
13331D6745N59j0855l950j153j16N986k158p076N188Q926j75j922j0390R103J4891
$$ 46745 47304 36449 32499 31346 31230 37216 35058 27982 33170 42096 41921 39999 29609 38712 53603
13316E3603K792j7130q242R661o002q28J60l177r372N102n210o873N130o836R417
$$ 53603 56395 39265 31023 40684 34682 33854 34014 30837 21465 26567 21357 14484 19614 12778 22195
13301B2195O484n661p785k758O208M353N410M050l992J6015O194m017l81l135
$$ 22195 28679 23018 15233 12475 18683 23036 28446 32496 28504 44519 50713 46696 46315 43180
13287D3180P366K768j3068M281l949j0308N267J736n29O531p562r283p238P699
$$ 43180 50546 53314 40246 44527 40578 30270 35537 37273 36744 43275 35713 26430 19192 26891
13273B6891P157J6392l008N78n477M25J1827m384q780N437n16j8227r699J0985
$$ 26891 34048 50440 47432 48010 42533 42958 54785 50401 41621 47058 46542 28315 18616 29601
13259B9601M927k543M069Q732M747o790L866J6853J36l02r291q03N024j1434%
$$ 29601 34528 31985 36054 44786 49533 42743 46609 63462 63598 63296 54005 53202 58226 46792 46792
13244D6792n180j115m70L963Q08o728Q171o719J472R541M994N541j9179j1718
$$ 46792 41612 40497 40027 43990 44798 38070 46241 39522 40994 50535 55529 61070 41891 30173
13230C0173l576P102J2482m199j6930R961J3471L129r10r473L678P65O301n35
$$ 30173 26597 33699 46181 41982 25052 35013 48484 51613 50703 41230 44908 45673 51974 51439
13216E1439K109l564N140J984q491L212m716O57K3241r714o196j579J4440N808
$$ 51439 53548 49984 55124 57108 48617 51829 47113 47770 71011 61297 55101 53522 67962 73770
13202G3770n222Q458M393j1124l1266k0521R77n15J7299K4557m118j3466J0472
$$ 73770 68548 77006 81399 70275 39009 18488 19465 18950 36249 60806 56688 43222 53694
13189E3694J4463q579j8388N290K010l374j919N578o792L256L331m758j4127j577
$$ 53694 68157 59578 41190 46480 48490 45116 43197 48775 41983 45239 48570 43812 29685 28108
13175B8108l147o619j2010m681P068K0044J0796J5485K5888K2730l12l13k627
$$ 28108 24961 18342 6332 1651 8719 28763 39559 55044 80932 103662 103350 103037 100410
13162A00410P81l318j0171J0503K2954J9220J1223J5377K9724J1950J2030K0095
$$ 100410 101191 97873 87702 98205 121159 140379 151602 166979 196703 208653 220683 240778
13150B40778N7689O4821R5859J18509J51825J86319K28932K45646K18978K28410
$$ 240778 298467 363288 459147 577656 729481 915800 1144732 1390378 1609356 1837766
13140A837766K13418J39967M9827k7668q1014j48554j91941k39316k24430j92660
$$ 1837766 2051184 2191151 2240978 2213310 2132296 1983742 1791801 1552485 1328055 1135395
13130A135395j87700j53986j25078j05003o8695l4483k8707l5152j1354l0587
$$ 1135395 947695 793709 668631 563628 494933 460450 431743 396591 385237 354650
13120C54650m1213n601q779j5298j9711j7004o080j0305l17M072J8367m343j4539
$$ 354650 313437 307836 299057 283759 264048 247044 240964 230659 230342 234414 252781 248438 233899
13107B33899j4308l211J2116r114k208m505k913k291o649q760j0484k2813j1977
$$ 233899 219591 216380 228496 219382 217174 212669 209756 207465 200816 192056 181572 158759 146782
13094A46782L393P03J367L54o374j6219j072l434n554n436k557j2025q673r28
$$ 146782 150175 150878 152245 152599 146225 130006 128934 125500 119946 114510 111953 99928 91255 90327
13080I0327m059M413N53R69J4342j5309j2644l833N593j376j2121l442N991J4585
$$ 90327 86268 90681 91234 92203 106545 91236 78592 74759 80352 78976 66855 63413 69404 83989
13066H3989K063n438p372n338O482n606o183M275J0269Q37K676N944R935O338
$$ 83989 86052 80614 73242 67904 74386 68780 62597 66872 77141 77978 80654 86598 96533 102871
13052A02871q079j6028r95N428p069m045O73j0163q847r052k104Q29J1357J9895
$$ 102871 94792 78764 77769 83197 76128 72083 72756 62593 53746 44694 42590 43419 54776 74671
13038G4671r737o937J4328m307Q86R289K45Q541r358l313M056J0026j1725j3014
$$ 74671 64934 57997 72325 68018 68904 78193 78438 86979 77621 74308 78364 88390 76665 63651
13024F3651K061P993m974p031n22J5069J0565J797l34P455O781m076m592l751
$$ 63651 65712 73705 68731 61700 61178 76247 86812 88609 88275 95730 102511 98435 93843 90092
13010I0092q70M642l892q505n317q364M386j099l1531l2668j2766O09L173l11
$$ 90092 89222 93864 89972 81467 76150 67786 72172 71073 39542 6874 -5892 -5283 -2110 -2421
12996b421L67n90J0762J1863O69K075N836J8433N217L544k058N85m398r763K960
$$ -2421 -2054 -2644 8118 19981 20650 22725 28561 46994 52211 55755 53697 54282 49884 40121 43081
12981D3081L239K295K6776J8725J379J4373K0639L8350K7699K5719K9109K9199
$$ 43081 46320 48615 75391 94116 95495 109868 130507 168857 196556 222275 251384 280583
12969B80583L0761L333o748J951O811K67j5719K156K878k3808j6008j1568p844
$$ 280583 311344 314677 307929 309880 316691 316958 301239 303395 306273 282465 266457 254889 247045
12956B47045P71j0880j4210j9213q887J0709Q102J7231J60J5513O365J306J5472
$$ 247045 247816 236936 222726 203513 194626 205335 213437 230668 230828 246341 252706 254012 269484
12943B69484o053j1190j6523j2394q724J6499J916m873J000o34p701M923j2344
$$ 269484 263431 252241 235718 223324 214600 231099 233015 228142 229142 228508 220807 225730 213386
12930B13386n400j650r966j8715J0362M424J549R209J3129m381K863K013n019
$$ 213386 207986 206336 196370 177655 188017 192441 193990 203199 216328 211947 214810 216823 211804
12917B11804n05Q051K76J546o346M922J4600J3382J2931K3923K6551L8302K8877
$$ 211804 211299 219350 219626 221172 214826 219748 234348 247730 260661 284584 311135 349437 378314
12904C78314J6104P412o554l704k6147k4977j7273k4003j4809j9689k6900j8765
$$ 378314 394418 401830 395276 391572 365425 340448 323175 299172 284363 264674 237774 219009
12892B19009k1346p489j788K22M694K335K980L686J5710K364N614J3883n956R190
$$ 219009 197663 190174 188386 188608 193302 195637 198617 202303 218013 220377 225991 239874 233918 243108
12878B43108r863l90q813j3260O095J1162p045m86k240J643P701j76L388O473
$$ 243108 233245 232855 224042 210782 216877 228039 220994 220508 218268 219911 227612 227436 230824 237297
12864B37297M434k743j5l016k0948K061L422l144O974J3639P312J6866J3241P490
$$ 237297 241731 238988 238973 235957 215009 217070 220492 217348 224322 237961 245273 262139 275380 282870
12850B82870J5178J4889J3480K8308K4075Q143L4737N2477O2141M7677L8055N0602
$$ 282870 298048 312937 326417 354725 378800 386943 421680 474157 536298 583975 622030 672632
12838F72632N8732M3223J9487J7745J7067J3242o775k040R645O935J2781p995
$$ 672632 731364 774587 794074 811819 828886 842128 835353 833313 842958 849893 862674 854679
12826H54679k1592j3554l907J5589K769j3504j283J5654J957P012O777k089j303
$$ 854679 833087 819533 815626 831215 833984 820480 819197 834851 836808 843820 850597 848508 847205
12813H47205p336k961R113J0168j8599m410K1470O158L546K2902K0889J2982J6964
$$ 847205 839869 836908 846021 856189 837590 833180 854650 860808 864354 887256 908145 921127 938091
12800I38091L2145L1892K1421J8661J8559J5313J0881J4896J8850K9753J9839
$$ 938091 970236 1002128 1023549 1042210 1060769 1076082 1086963 1101859 1120709 1150462 1170301
12789A170301J8534J1764K0408L0067J7436K2974N706J4772M5259L6630M2822
$$ 1170301 1188835 1200599 1221007 1251074 1268510 1291484 1297190 1311962 1357221 1393851 1436673
12778A436673N2844M3134N4603N5599O3709N1216M4136N0809N8875M8632K9755
$$ 1436673 1489517 1532651 1587254 1642853 1706562 1757778 1801914 1852723 1911598 1960230 1989985
12767A989985K7200L1486L7265L6968M4279N8135Q5661R8680J13206J40237J58247
$$ 1989985 2017185 2048671 2085936 2122904 2167183 2225318 2310979 2409659 2522865 2663102 2821349
12756B821349J92797K17827K66050L02130L11347L21865L43028L53962L50222
$$ 2821349 3014146 3231973 3498023 3800153 4111500 4433365 4776393 5130355 5480577
12747E480577L66542L66599L83135L84537M02492M51276N11460O02608P02228
$$ 5480577 5847119 6213718 6596853 6981390 7383882 7835158 8346618 8949226 9651454
12738I651454Q22060J013222J239480J491639J788623K142550K499322K849123
$$ 9651454 10473514 11486736 12726216 14217855 16006478 18149028 20648350 23497473
12730B3497473L290146L842848M576862N554774P091855R659589J3535692J8334434
$$ 23497473 26787619 30630467 35207329 40762103 47853958 57513547 71049239 89383673
12722H9383673K3503685K9795727L7231497M2770718M2602125L9192250L6922130
$$ 89383673 112887358 142683085 179914582 222685300 265287425 304479675 341401805
12715C41401805L2732057K1606803M267481q795096j6878921k5589068l6486668
$$ 341401805 374133862 395740665 400008146 391213050 374334129 348745061 312258393
12708C12258393m3737172m0939326l5750258l2206746k9174916k2826189j5307436
$$ 312258393 268521221 227581895 191831637 159624891 130449975 107623786 92316350
12701I2316350j0388852p584819n923894m872549m162355l727143l453577l186413
$$ 92316350 81927498 74342679 68418785 63546236 59383881 55656738 52203161 49016748
12693D9016748k895498k649209k461165k285547k069335j881971j735273j571184
$$ 49016748 46121250 43472041 41010876 38725329 36655994 34774023 33038750 31467566
12685C1467566j420362j309609j215956j126623j031663r37495q60859p82284
$$ 31467566 30047204 28737595 27521639 26395016 25363353 24425858 23564999 22782715
12677B2782715o80906o29251n71134m92577m52645m30246m19755m12433m14284
$$ 22782715 22101809 21472558 20901424 20408847 19956202 19525956 19106201 18693768 18279484
12668A8279484m24070m26323m36703m56194m76286m79594m77627m77657m89664
$$ 18279484 17855414 17429091 16992388 16536194 16059908 15580314 15102687 14625030 14135366
12659A4135366m75707m52157m44388m14892l83212l74696l37955l12883l04610
$$ 14135366 13659659 13207502 12763114 12348222 11965010 11590314 11252359 10939476 10634866
12650A0634866k94062k68614k40582k14174k32577k52064k31272k27100k20790
$$ 10634866 10340804 10072190 9831608 9617434 9384857 9132793 8901521 8674421 8453631
12641H453631k26704k20390j96262j85422j70459j63430j83374j81178j66086
$$ 8453631 8226927 8006537 7810275 7624853 7454394 7290964 7107590 6926412 6760326
12632F760326j71460j67555j51224j65128j59048j51105j49321j39000j23151
$$ 6760326 6588866 6421311 6270087 6104959 5945911 5794806 5645485 5506485 5383334
12623E383334j31632j17240j29804j20323j21266j13490j11709j13006j05959
$$ 5383334 5251702 5134462 5004658 4884335 4763069 4649579 4537870 4424864 4318905
12614D318905j13299r8339p0997q9591q6554p8318q7567q0200p8873p3691o9217
$$ 4318905 4205606 4107267 4036270 3946679 3860125 3781807 3694240 3614040 3535167 3461476 3392259
12603C392259q5847r5498p9701n2519o2533p1543n0474n2454m4848l5622l9293
$$ 3392259 3306412 3210914 3131213 3078694 3016161 2944618 2894144 2841690 2796842 2761220 2721927
12592B721927l5965k7381m5495m9466n2244j4171l0813m0456l2433m2095o6227
$$ 2721927 2685962 2658581 2613086 2563620 2511376 2497205 2466392 2425936 2393503 2351408 2285181
12581B285181o8496o5585m6966l4212l2015m2944l4122j4765j9372k0001k1268
$$ 2285181 2216685 2151100 2104134 2069922 2037907 1994963 1960841 1946076 1926704 1906703 1885435
12570A885435n788n788k4795k5901k2657l9493k0276k9543k8953l1504l5263l1610
$$ 1885435 1879647 1873859 1849064 1823163 1800506 1761013 1740737 1711194 1682241 1650737 1615474 1583864
12558A583864k2305k0041k5069j6846r252k4846k3837k2768l9676l1745l2767
$$ 1583864 1561559 1541518 1516449 1499603 1490351 1465505 1441668 1418900 1379224 1347479 1314712
12547A314712m2867l3677m8262n5955l7950r341o055j8017l3951l2414l3082l4622
$$ 1314712 1271845 1238168 1189906 1133951 1096001 1086660 1080605 1062588 1028637 996223 963141 928519
12535I28519k3715l4065m3442m2201m9985n9177n4997n9292n0123m2026m5179
$$ 928519 904804 870739 827297 785096 735111 675934 620937 561645 511522 469496 424317
12524D24317l1706j4039j0557q890J3611L1985L1643J8976J188J1839J0666M799
$$ 424317 392611 378572 368015 359125 372736 404721 436364 455340 456528 468367 479033 483832
12512D83832p270m280j0319J2012J9604r059M13k611j3744n394o351M360j503
$$ 483832 476562 472282 461963 473975 493579 484520 484933 482322 468578 463184 456833 461193 459690
12499D59690j4418j007q540j3079k2408j7437k1495j342M304j8823o428j0866
$$ 459690 445272 444265 435725 422646 400238 382801 361306 359964 364268 345445 339017 328151
12487C28151o630l710P239j48n059k504n435L87L464J1960J1092J0083o151j0221
$$ 328151 321521 317811 325050 324902 319843 317339 311904 312291 315755 327715 338807 348890 342739 332518
12473C32518q726k5114K936L0542J1225q326J391j0392j1112q88j323q906O812
$$ 332518 323792 298678 301614 332156 343381 335055 336446 326054 314942 314054 312731 303825 310637
12460C10637L553o853O00P097M7J292N307K455m613J6766J2027J6508k264n75
$$ 310637 314190 307337 307937 315034 315081 316373 321680 324135 319522 336288 348315 364823 362559 361984
12446C61984p380M897L306r234j5717K944N89n659l04L3J064K238Q55j1127J4244
$$ 361984 354604 359501 362807 353573 337856 340800 341389 335730 335426 335459 336523 338761 339616 328489 342733
12431C42733J9022m483l513n867j3321p711R685q925j9574j9689j0274l1447k4941
$$ 342733 361755 357272 353759 347892 334571 326860 336545 327620 308046 288357 278083 246636 221695
12418B21695j5029j2279j0873Q89M939K620Q698p480k1809q103P761j551J769
$$ 221695 206666 194387 183514 184403 189342 191962 200660 193180 171371 163268 171029 169478 171247
12405A71247J3028j0235j5009n136J2928k441p702r038p07k793N909J1589J62
$$ 171247 184275 174040 159031 153895 166823 164382 156680 147642 146935 144142 150051 161640 161802
12392A61802J667J0332m736J356M127j783l020j3953j0519o001k0532q210L60
$$ 161802 163469 173801 169065 170421 174548 172765 169745 155792 145273 139272 118740 110530 110890
12379A10890J0968J1018m003n901q129j4008J6131J6574q075q919r927N014L095
$$ 110890 121858 132876 128873 122972 114843 100835 116966 133540 125465 116546 106619 111633 114728
12366A14728j1081m395k911l125J2559L655L993m959m722j0427l245J0456j719
$$ 114728 103647 99252 96341 93216 105775 109430 113423 108464 103742 93315 90070 100526 98807
12353I8807n146K237R773J4706L641k072l619K420j406k1074K89O451J529j2482
$$ 98807 93661 95898 105671 120377 124018 121946 118327 120747 119341 98267 98556 105007 106536 94054
12339I4054m008n078O061K623j1267j0586n119k213l554q51O516P041k3961o992
$$ 94054 90046 84968 91029 93652 82385 71799 66680 64467 60913 60062 66578 73619 49658 42666
12325D2666j498M515j3359l928J5151R608J1627J4143M622J033Q049j713p791
$$ 42666 41168 45683 32324 28396 43547 53155 64782 78925 83547 84580 92629 90916 83125
12312H3125O529O451q902o285J1390O129j1260J0668J5982K3131K1186J8640L970
$$ 83125 89654 96105 87203 80918 92308 98437 87177 97845 113827 136958 158144 176784 180754
12299A80754J4905J0547J1058K6034M8350O2171P7001J08298J35648J54083J87770
$$ 180754 195659 206206 217264 243298 291648 353819 430820 539118 674766 828849 1016619
12288A016619K34065K40584K36254K17293J81695J27468K7603l3934j02586j55357
$$ 1016619 1250684 1491268 1727522 1944815 2126510 2253978 2281581 2247647 2145061 1989704
12278A989704k07654k44272k22178j94632j81314j65740j18365r6215p3208m7823
$$ 1989704 1782050 1537778 1315600 1120968 939654 773914 655549 559334 486126 438303
12268D38303m3478j8921k0227l8393j6661p608j3826j0279j9681o421K794j3162
$$ 438303 394825 375904 355677 317284 300623 293015 279189 268910 249229 242808 245602 232440
12256B32440J2264P621j5994j2915l352q421n739j7248k2880j0923R17j5811r167
$$ 232440 244704 252325 236331 223416 220064 211643 205904 188656 165776 154853 155770 139959 130792
12243A30792J341L709N17j150o522j384N373r866p701l045L584P444J98j8804
$$ 130792 132133 135842 136359 135209 128687 127303 132676 122810 115109 112064 115648 123092 123290 104486
12229A04486m971j928l914k02J5816o991j4084n62l499q697j004q345o785j24
$$ 104486 99515 97587 93673 93471 109287 102296 88212 87650 84151 75454 74450 66105 59320 59196
12215E9196q924Q067J1898l230J0126M710n451N136J1451n974l961k6256j3440
$$ 59196 50272 58339 70237 67007 77133 81843 76392 81528 92979 87005 83044 56788 43348
12202D3348O510J1240m920j6564j1979J7009N436r127P119p622l596Q425P689
$$ 43348 49858 61098 56178 39614 27635 44644 50080 40953 48072 40450 36854 45279 52968
12189E2968j4462P70l750l244l457P356k807j382O49O764j418j2754r09q946L162
$$ 52968 38506 39276 35526 32282 28825 36181 33374 31992 32641 39405 37987 25233 24324 15378 18540
12174A8540P434J0576N353N629J752J852N119J6597O720l86M019J0289J3321K935
$$ 18540 25974 36550 41903 47532 49284 51136 56255 72852 79572 79186 83205 93494 106815 109750
12160A09750K896R957o525J869j4717j5142j1871n904r753j1329p262J0535o43
$$ 109750 112646 122603 116078 117947 103230 88088 76217 70313 60560 49231 41969 52504 51861
12147E1861l699L167l422j1447r806m250n764l181j854L513l645Q544n670l671
$$ 51861 48162 51329 47907 36460 26654 22404 16640 13459 11605 15118 11473 20017 14347 10676
12133A0676J4282J7404m423m660M487N140M552l105p840J6101J7449n585O332
$$ 10676 24958 42362 37939 33279 37766 42906 47458 44353 36513 52614 70063 64478 70810
12120G0810K3725M2726K8804K2508L7419M3167J5486l9614n6496n0796l8185k1409
$$ 70810 94535 137261 166065 188573 225992 269159 284645 245031 188535 137739 99554 78145
12108G8145j3234j1300k767M489Q706k006n391q831p537j822k195r53k217k995
$$ 78145 64911 53611 50844 55333 64039 62033 56642 47811 40274 38452 36257 35304 33087 30092
12094C0092P351K098j1219n209m546n572j637K011O013J0278Q804O536m641P427
$$ 30092 37443 39541 28322 23113 18567 12995 11358 13369 19382 29660 38464 45000 40359 47786
12080D7786K053k279J1143J6338P352K3548M3769M3382K8093L0979L0876m917
$$ 47786 49839 47560 58703 75041 82393 105941 149710 193092 221185 252164 283040 278123
12068B78123n0442p1703m7414j4226n145r259j9291k305N078P594N129j1651j1634
$$ 278123 227681 155978 108564 94338 89193 79934 60643 58338 63416 71010 76139 64488 52854
12055E2854P872J5783M001j3926j4875j6607J451k002m904J5975Q854k163l867
$$ 52854 60726 76509 80510 66584 51709 35102 36553 34551 29647 45622 54476 52313 48446
12042D8446j280r908K140K942Q232o92j0989j1530J0900J815J4812J0895Q400
$$ 48446 47166 37258 39398 42340 50572 49880 38891 27361 38261 40076 54888 65783 74183
12029G4183K1583J5481K0216J0631j2032l5973l3208j1704L842O300j4060k3013
$$ 74183 95766 111247 131463 142094 130062 94089 60881 49177 53019 59319 45259 22246
12017B2246p520J0937r44K876j572K496l918m040j655J835j3038j2347n30L631
$$ 22246 14726 25663 24719 27595 26023 28519 24601 20561 18906 20741 7703 -4644 -5174 -1543
12003a543P637O788P71M769l871n28J0433J194n368M878k849l619l970o043j6483
$$ -1543 6094 12882 13653 18422 14551 14023 24456 25650 20282 25160 22311 18692 14722 8679 -7804
11988g804L694P263J0476J1194K766j1271m093m757l730O115j85k488R542m624
$$ -7804 -4110 3153 13629 24823 27589 16318 12225 7468 3738 9853 9668 7180 16722 12098
11974A2098L644J4149J3351K27j2679k935l313M702K589p459j265l203j8840r076
$$ 12098 15742 29891 43242 43469 30790 27855 24542 29244 31833 24374 23109 19906 1066 -8010
11960h010M147k312J273J1049L360p411l995Q153R483l525o799M140L699Q276
$$ -8010 -3863 -6175 -4902 6147 9507 2096 -1899 6254 15737 12212 5413 9553 13252 21528
11946B1528M136n036j057J518J7992J185r955p685j602k3374k002M399J062k926
$$ 21528 25664 20628 19571 21089 39081 40266 30311 22626 21024 -2350 -4352 47 1109 -1817
11932a817K879k993N554J1880J0866o169p103j9472p970P608M80m539Q253J0788
$$ -1817 1062 -1931 3623 15503 26369 20200 13097 -6375 -14345 -6737 -6257 -10796 -2543 8245
11918H245J1546J940K147n059j8816J1141P18l97L534j1749o726J7579K390j4823
$$ 8245 19791 21731 23878 18819 3 11144 11862 11465 14999 3250 -3476 14103 16493 1670
11904A670N098O504j192N675L341o330j0145o736n591j6969J7999K6906j0607
$$ 1670 6768 13272 12080 17755 21096 14766 4621 -2115 -7706 -24675 -6676 20230 9623
11891I623j7589o233J4508J2095K092J215o133l086n872l069J765P048M485q535
$$ 9623 -7966 -14199 309 12404 14496 15711 9578 6492 620 -2449 -684 6364 10849 2314
11877B314o329J5248R56l569J93j018M275K040r82q940k375k499m971N444j420
$$ 2314 -4015 11233 12189 8620 8813 7795 12070 14110 13128 4188 1813 -686 -5657 -213 -1633
11862a633M191J311j1763k38p961K317N457m344K2078R011n895J5210j0278l896
$$ -1633 2558 3869 -7894 -8132 -16093 -13776 -8319 -12663 9415 18426 12531 27741 17463 13567
11848A3567j20J4456j374j0560J1339K568j5867r938q016m708K825O793n70P542
$$ 13567 13447 27903 26529 15969 27308 29876 14009 4071 -3945 -8653 -5828 965 395 7937
11834G937R615K64J6356p441l1501j1640K746P965J5769k322j9403n579P525J703
$$ 7937 17552 17816 34172 26731 -4770 -16410 -13664 -5699 10070 7748 -11655 -17234 -9709 -8006
11820h006K155O583Q085L063L355p062k467J010m496J66M971n108m210M720j6548
$$ -8006 -5851 732 8817 11880 15235 8173 5706 6716 2220 2386 7357 2249 -1961 2759 -13789
11805a3789j1538m249L915j790M724R978N646J0166J5256q48j9153k46J0202n317
$$ -13789 -25327 -29576 -25661 -27451 -22727 -12749 -7103 3063 18319 17471 -1682 -1928 8274 2957
11791B957j2520l578n350J4627J5419n472r443J967P745J015K495L327Q562J1007
$$ 2957 -9563 -13141 -18491 -3864 11555 6083 -3360 -1393 6352 7367 9862 13189 21751 32758
11777C2758Q118j1162l4359l354J2265N803j2902k50j63M940p950l367R450K926
$$ 32758 40876 29714 -4645 -7999 4266 10069 -2833 -3083 -3246 1694 -6256 -9623 -173 2753
11763B753J5710m362j1422r83L359p66J1026O074m997q034k307o729Q031J8765
$$ 2753 18463 14101 2679 1696 5055 4289 15315 21389 16392 8358 6051 -678 7353 26118
11749B6118n07k7683o502j663P509l862l914n97q550j1453j84N37K0672O951K057
$$ 26118 25611 -2072 -8574 -10237 -2728 -6590 -10504 -11101 -19651 -31104 -31288 -30751 -10079 -3128 -1071
11734a071N391L541q966l081k125J3689m83M875r11m974j1929M042J53j866o176
$$ -1071 4320 7861 -1105 -4186 -6311 7378 6895 11770 10859 5885 -6044 -2002 -1849 -3715 -9891
11719i891J317J5385O449J1879Q494j307N688r028j4778J537q329o255n585k537
$$ -9891 -8574 6811 13260 25139 33633 32326 38014 28986 14208 15745 7416 1161 -4424 -6961
11705f961J54M975J923J3010j0416j5151J2266J4270P07q9L058P448p409j6384
$$ -6961 -6807 -1832 91 13101 2685 -12466 -200 14070 14777 14688 17746 25194 17785 1401
11691A401j0415J6J0445N562n103l237L146J3871J1097m077r535j4367k522k365
$$ 1401 -9014 -8998 1447 7009 1906 -1331 1815 15686 26783 22706 13171 -1196 -3718 -6083
11677f083O116k030j1855P845k054k339k372K278J3532M043p109k226J385O338
$$ -6083 33 -1997 -13852 -6007 -8061 -10400 -12772 -10494 3038 7081 -28 -2254 -869 5469
11663E469l944n268L95L815Q50K547k429m371O844L309k304m77R273J431j6914
$$ 5469 1525 -3743 -3348 467 1317 3864 1435 -2936 3908 7217 4913 4436 13709 15140 -1774
11648a774m110L246N033M141j5544j0306Q017J1055l053o710R724m094R66O213
$$ -1774 -5884 -2638 2395 6536 -9008 -19314 -11297 -242 -3295 -10005 -281 -4375 -3409 2804
11634B804l294j1866j1588l361M582J0021R18P845K424J26j00m690J294O285j6548
$$ 2804 -490 -12356 -23944 -27305 -22723 -12702 -11784 -3939 -1515 -1389 -1489 -6179 -4885 1400 -15148
11619a5148l288j805R531L317L997O504N908m290j2779O821N311j2163K410J1406
$$ -15148 -18436 -20241 -10710 -7393 -3396 3108 9016 4726 -8053 -1232 4079 -8084 -5674 5732
11605E732j749m320l005j879J3133k356r128J3779L0643M803j2368q562J334j0905
$$ 5732 3983 -337 -3342 -5221 7912 5556 -3572 10207 40850 45653 33285 24723 26057 15152
11591A5152j7048P28j3119r336O327R292n507r773n98n9N425R438P166O405J259
$$ 15152 -1896 -1168 -14287 -23623 -17296 -8004 -13511 -23284 -23882 -23941 -18516 -9078 -1912 4493 5752
11576E752K664L050M106o958j5179O373m379m83J1778o30N386q620o327n862j078
$$ 5752 8416 11466 15572 8614 -6565 -192 -4571 -5054 6724 6094 11480 2860 -3467 -9329 -10407
11561a0407K643M728K519j6013q288n349R492O521J986M965P772j3782o800q76
$$ -10407 -7764 -3036 -517 -16530 -24818 -30167 -20675 -14154 -12168 -7203 569 -13213 -20013 -20889
11547b0889M047O096l174R317Q930l771M209J1596J0293m602l420j4329j1057
$$ -20889 -16842 -10746 -13920 -4603 4327 556 4765 16361 26654 22052 18632 4303 -6754
11534f754n532M104O377j2901m828M645Q603R218P246R994p584k3239p860M966
$$ -6754 -12286 -8182 -1805 -14706 -19534 -14889 -6286 2932 10178 20172 12588 -10651 -18511 -13545
11520a3545J1702K11l870j4784L40Q528R892m69p942q535K487J5218J4378o223
$$ -13545 -1843 -1632 -5502 -20286 -19946 -11418 -1526 -1995 -9937 -18472 -15985 -767 13611 7388
11506G388k6670Q9j170j3077J1853K6912R508j7726p767r50J0935m351M078q331
$$ 7388 -19282 -19193 -20363 -33440 -21587 5325 14833 -2893 -10660 -11610 -675 -5026 -948 -9279
11492i279M585N027J6508m972j2761K108k162o494R952o663J1k510r29l021Q374
$$ -9279 -4694 333 16841 11869 -892 1216 -946 -7440 2512 -4151 -4140 -6650 -7579 -10600 -2226
11477b226J695r136k75M064o379j983Q773J2948M3q847m048J7316J316j8656n286
$$ -2226 -531 -9667 -9942 -5878 -12257 -14240 -5467 7481 7524 -1323 -5371 11945 13261 -5395 -10681
11462a0681J0041r1k621O291Q003n120j3802n89N723L602O13N74j0117j2614M057
$$ -10681 -640 -731 -3352 2939 10942 5822 -7980 -8569 -2846 756 1369 1943 -8174 -20788 -16731
11447a6731K9473Q835j4989j5143l616N645j772j1197m472L734J2026l321j3529
$$ -16731 12742 21577 6588 -8555 -12171 -6526 -8298 -19495 -23967 -20233 -8207 -11528 -25057
11434b5057Q355P385R725k187M197k311K008j216L878j729Q112J331m973J593
$$ -25057 -16702 -9317 408 -1779 2418 107 2115 899 4777 3048 11160 12491 7518 9111
11420I111q328j587K935J755q666K656n333k8J0580p938J0774O020m44j0248k415
$$ 9111 783 -804 2131 3886 -4780 -2124 -7457 -7485 3095 -4843 5931 11951 11507 1259 -1156
11405a156j0567p566N744N182Q326Q746m313j2194M951J137J029o774r054q929
$$ -1156 -11723 -19289 -13545 -8363 -37 8709 4396 -7798 -2847 -1710 -681 -7455 -16509 -25438
11391b5438J103J851J2868m615K885R533r948j66L428P603P290o048q80J4893
$$ -25438 -24335 -22484 -9616 -14231 -11346 -1813 -11761 -11927 -8499 -896 6394 346 -534 14359
11377A4359O467j0907j8095M285P357l583m859R0N121P651O053n54j6311j8429
$$ 14359 20826 9919 -8176 -3891 3466 -117 -4976 -4886 235 7886 13939 13385 -2926 -21355
11363b1355N282L688l216l923N467J2514l959M243k926n440l754m696J6814R797
$$ -21355 -16073 -12385 -15601 -19524 -14057 -1543 -5502 -1259 -4185 -9625 -13379 -18075 -1261 8536
11349H536R16k987p014o715k39J1280P943J538q114l381J2881O07j1053m676K525
$$ 8536 9452 6465 -549 -7264 -7503 3777 11720 13258 5144 1763 14644 15251 4198 -478 2047
11334B047o926j2883J8300l335j1554J569K0017J3609j0518k0629r300J5152M10
$$ 2047 -4879 -17762 538 -2797 -14351 -12782 7235 20844 10326 -10303 -19603 -4451 -4041
11321d041J4730R9J909n15k635j2095j1339N885n414N97N061m021n646K310m641
$$ -4041 10689 10788 12697 12182 9547 -2548 -13887 -8002 -13416 -12819 -7758 -11779 -17425 -15115 -19756
11306a9756r361P101j876M145J1512M892l050o31m011J4549l901k2787J497N120
$$ -19756 -29117 -22016 -23892 -19747 -8235 -3343 -6393 -7024 -11035 3514 -387 -23174 -21677 -16557
11292a6557K438K318M584J1069J340J2324M150j1035J1836N60n232k041j779L397
$$ -16557 -14119 -11801 -7217 3852 5192 17516 21666 10631 22467 23027 17795 15754 13975 17372
11278A7372j009M655n840l1793o834N415R059O193o321j86N119k001O60j0426
$$ 17372 16363 21018 15178 -16615 -23449 -18034 -8975 -2782 -9103 -9289 -4170 -6171 -5511 -15937
11264a5937n636K322K1142J6607j785k177j0678M719M959j7302j9211l766P132
$$ -15937 -21573 -19251 1891 18498 16713 14536 3858 8577 13536 -3766 -22977 -26743 -19611
11251a9611L827J1264J3897o957j5092p628J2640J1428K2351L419J658k610j5605
$$ -19611 -15784 -4520 9377 2420 -12672 -20300 -7660 3768 26119 29538 31196 28586 12981
11238A2981j0951n938o481R30m443o63j711m611P722Q443Q867n070j741K800O166
$$ 12981 2030 -3908 -10389 -9459 -13902 -14565 -16276 -20887 -13165 -4722 4145 -925 -2666 134 6300
11223F300L005j2388o187J581l788q577j0105N352o73N458Q762O411r894n638
$$ 6300 9305 -3083 -9270 -7689 -11477 -20054 -30159 -24807 -25480 -20022 -11260 -4849 -14743 -20381
11209b0381j4335K598J9621J1821q247L993L168N95p126QK0698J769k0638j4738
$$ -20381 -34716 -32118 -12497 -676 -8923 -4930 -1762 -1167 -8293 -8285 12413 14182 -6456 -21194
11195b1194o808N448J6678n460n557K040J118o139L178O194J0525m956j0136n804
$$ -21194 -28002 -22554 -5876 -11336 -16893 -14853 -13735 -19874 -16696 -10502 23 -4933 -15069 -20873
11181b0873J1232K207J52k730m084Q902r45l917j1275m71J9905J395r063R987
$$ -20873 -9641 -7434 -7282 -10012 -14096 -5194 -6139 -10056 -21331 -21802 -1897 -502 -9565 422
11167D22J085J3028J1667o138j0612j3198j1764R594M680K377p221J4936M242
$$ 422 1507 14535 26202 20064 9452 -3746 -15510 -5916 -1236 1141 -6080 8856 13098
11154A3098l806p861j1715j2471q735N415J2922n727q194J293J455J9620J336
$$ 13098 9292 1431 -10284 -22755 -31490 -26075 -13153 -18880 -27074 -25781 -24326 -4706 -3370
11141c370n885j066J330J8096Q964q052l596k5146j4999J038J4815J5933M251
$$ -3370 -9255 -10321 -8991 9105 18069 10017 6421 -18725 -33724 -32686 -17871 -1938 2313
11128B313k827j833j0689j1706K814Q953j533m939J5231J1387m705O322l835r351
$$ 2313 -514 -2347 -13036 -24742 -21928 -12975 -14508 -19447 -4216 7171 2466 8788 4953 -4398
11114d398m859J845k865L19N082J1333n098l215J1323j571L060l013j1348K274
$$ -4398 -9257 -7412 -10277 -9958 -4876 6457 1359 -1856 9467 7896 10956 7943 -3405 -1131
11100a131j2933m646M543N638m888k54j0788L852k879J0863j569J8379R184j4757
$$ -1131 -14064 -18710 -14167 -8529 -13417 -13671 -24459 -20607 -23486 -12623 -14192 4187 13371 -1386
11086a386p307J887P746j3439k1722p628J1092J2821J0546P331L71N53j5795p414
$$ -1386 -8693 -6806 940 -12499 -34221 -41849 -30757 -17936 -7390 -59 312 865 -14930 -22344
11072b2344J6433R168j2606j833j726j2363J0921Q487j7251L893j76M38P022M217
$$ -22344 -5911 3257 -9349 -11182 -12908 -25271 -14350 -5863 -23114 -19221 -19397 -18959 -11937 -7720
11058g720J1154m27q117M419J0986m7m080j3398q061J742P363q646n067R854q260
$$ -7720 3434 3007 -5110 -691 10295 10248 6168 -7230 -15291 -13549 -6186 -14832 -19899 -10045 -18305
11043a8305L47q968m332J1634R893L316P048R33p467j2795M485K899n515J694
$$ -18305 -17958 -26926 -31258 -19624 -9731 -6415 633 1566 -5901 -18696 -14211 -11312 -16827 -15133
11029a5133J0090Q511R494r75q92o782l902k860J812J2359n101j2701J388j3099
$$ -15133 -5043 3468 12962 11987 11095 4313 411 -2449 -637 11722 6621 -6080 -4692 -17791
11015a7791q97K4934J3578k758q801n242j2037j9124L820l66M522J442K8918J4044
$$ -17791 -18688 6246 19824 17066 8265 3023 -9014 -28138 -24318 -24684 -20162 -18720 10198 24242
11001B4242j956j6770j5961n604O371q503O190J7915k341r802j5755k234M420
$$ 24242 22286 5516 -10445 -16049 -9678 -18181 -11991 5924 3583 -6219 -21974 -24208 -19788
10988a9788P337l451j9714K288J285m366j7915R001J2102k65p864j0916l541K1132
$$ -19788 -12451 -15902 -35616 -33328 -32043 -36409 -54324 -45323 -33221 -33486 -41350 -52266 -55807 -34675
10974c4675J3542J8168l099k003L792M189N065M04L747p863k6621p796J9521J4515
$$ -34675 -21133 -2965 -6064 -8067 -4275 -86 4979 5383 9130 1267 -25354 -33150 -13629 886
10960H86r930j4978j871l451J8568O964r95q221j1469J3007l89r4p035J3297n22
$$ 886 -9044 -24022 -25893 -29344 -10776 -3812 -4807 -13028 -24497 -11490 -11879 -11973 -19008 -5711 -6233
10945f233J758j500o023l281k910J3261N897k584p704J0347j615n205O137J8062
$$ -6233 -4475 -5975 -11998 -15279 -18189 -4928 969 -1615 -9319 1028 -587 -5792 345 18407
10931A8407N554j0116k2465j3197o722J083O316J6130O150m930j102n221r35q039
$$ 18407 23961 13845 -8620 -21817 -28539 -27456 -21140 -5010 1140 -3790 -4892 -10113 -11048 -19087
10917a9087o583J3402J4785J5087J0185k147o876l746j509p658j4004r002J2345
$$ -19087 -25670 -12268 2517 17604 27789 25642 18766 15020 13511 5853 -8151 -17153 -4808
10904d808Q076r44m391m7M384n452p311R871R354P566o062K161J1957o995l342
$$ -4808 3268 2324 -2067 -2114 2270 -3182 -10493 -622 8732 16298 10236 12397 24354 17359 14017
10889A4017r732o442N816J973o868O538O494N964p598j7168r939q265L578R221
$$ 14017 4285 -2157 3659 5632 -1236 5302 11796 17760 10162 -7006 -16945 -25210 -21632 -12411
10875a2411O825k109o323P504l077j2364q136J8449k910J165q886j4416l356J3784
$$ -12411 -5586 -7695 -14018 -6514 -9591 -21955 -30091 -11642 -14552 -13387 -22273 -36689 -40045 -26261
10861b6261Q93K550J6749n660j3191O25J2313P988P242M406o356n343r817r952
$$ -26261 -25368 -22818 -6069 -11729 -24920 -24295 -11982 -3994 3248 7654 1298 -4045 -13862 -23814
10847b3814J2730R174O955L565L279r29Q269N506j8165p377p243o189p154R319
$$ -23814 -11084 -1910 5045 8610 11889 10960 19229 24735 6570 -807 -8050 -14239 -21393 -12074
10833a2074J835m25m141q83J6199k321j3996M006n879o328o587J0185O147k751
$$ -12074 -10239 -10664 -14805 -15688 511 -1810 -15806 -11800 -17679 -24007 -30594 -20409 -14262 -17013
10819a7013O156J2547J3358n07J886J2551n565n668l235l97o888j3448P907K076
$$ -17013 -10857 1690 15048 14541 16427 28978 23413 17745 14510 14113 7225 -6223 1684 3760
10805C760p171o169k340M804O558K415L453R868L448l263m249m50J4064q098r643
$$ 3760 -3411 -9580 -11920 -7116 -558 1857 5310 15178 18626 15363 11114 10664 24728 16630 6987
10790F987p879m009q363m139k717N838j68J4883K729j8531m439J6952J8700L021
$$ 6987 -892 -4901 -13264 -17403 -20120 -14282 -14450 433 3162 -15369 -19808 -2856 15844 18865
10776A8865k805o389j4768p862P393j190N165N699n924P283O702k232j540o593
$$ 18865 16060 9671 -5097 -12959 -5566 -6756 -1591 4108 -1816 5467 12169 9937 8397 1804
10762A804M506N148j0685J346J329q69K850m777K702O960q332j7577J0288P136
$$ 1804 6310 11458 773 2119 3448 2579 5429 652 3354 10314 1982 -15595 -5307 1829
10748A829k598M429q335j389M418K745j0762Q093j4635o096O867J3034p024J1638
$$ 1829 -769 3660 -4675 -6064 -1646 1099 -9663 -1570 -16205 -22301 -15434 -2400 -9424 2214
10734B214Q852m358j6489P23J873r980J043j860J7096Q04j414m422J3588J8521
$$ 2214 11066 6708 -9781 -9058 -7185 -17165 -16122 -17982 -886 -82 -1496 -5918 7670 26191
10720B6191p16j2082j0710j3440Q761J1239J026O826j1113j2460M046O535j7106
$$ 26191 25475 13393 2683 -10757 -1996 9243 10269 17095 5982 -6478 -2432 4103 -13003
10707a3003l620O149J6103j3160q73R10k682m73J367n573O761Q539J4638Q709
$$ -13003 -16623 -10474 5629 -7531 -8404 -7494 -10176 -10649 -9282 -14855 -8094 445 15083 23792
10693B3792n971p406P666K507j976o773j1792j130k890k09o770O364M561l105
$$ 23792 17821 10415 18081 20588 18612 11839 47 -1083 -3973 -4182 -10952 -4588 -27 -3132
10679c132p613J165K0993k3620k5751O76J6727J3983J0666p854n428m038N983
$$ -3132 -10745 -9580 11413 -12207 -37958 -37282 -20555 -6572 4094 -3760 -9188 -13226 -7243
10666g243q379j1650K768N782J7415k983O155M905J043m958J100K818J04m105
$$ -7243 -15622 -27272 -24504 -18722 -1307 -4290 1865 6770 7813 2855 3955 6773 6877 2772
10652B772r459J30K670q121O458O480q048J6811M016j3402j7685j0140Q68J812
$$ 2772 -6687 -6557 -3887 -12008 -5550 930 -7118 9693 13709 307 -17378 -27518 -26650 -24838
10638b4838K1m611k980J1229Q780J498j049K351J2634l822k210M643L308j472
$$ -24838 -24817 -29428 -32408 -21179 -12399 -10901 -11950 -9599 3035 -787 -2997 1646 4954 3482
10624C482J624m245J457O579j1326M296n44n532P982N816k151r526q569K529J419
$$ 3482 5106 861 2318 8897 -2429 1867 1323 -4209 3773 9589 7438 -2088 -10657 -8128 -6709
10609f709J3387J5607j5312k1178j4641J424J7619K754n79J195P289j49M834r892
$$ -6709 6678 22285 6973 -14205 -28846 -27422 -9803 -7049 -7628 -6433 856 707 5541 -4351
10595d351M629O353l345m03K925N080p897q083n448m392j18J0859J0995j4311
$$ -4351 278 6631 3286 2883 5808 10888 2991 -5092 -10540 -14932 -15050 -4191 6804 -7507
10581g507j9616l156J4152J7208l20O098n095r033l907J0120m316o068m94m253
$$ -7507 -27123 -30279 -16127 1081 761 6859 1764 -7269 -11176 -1056 -5372 -11440 -11934 -16187
10567a6187M011r97p268K70J6620j0503l278J0001p84m138l560M007R308J4325
$$ -16187 -12176 -13173 -20441 -20171 -3551 -14054 -17332 -7331 -8115 -12253 -15813 -11806 -2498 11827
10553A1827j258o355j5060k3094m68J9817N258O37N249J3946L92K5J463j6973
$$ 11827 10569 4214 -10846 -33940 -34408 -14591 -9333 -8696 -3447 10499 10891 10916 12379 -4594
10539d594m809r671r398J345N841J2214J1124n0o82p568l509m268O748J1097j2485
$$ -4594 -9403 -19074 -28472 -27127 -21286 -9072 2052 2002 1320 -6248 -9757 -14025 -7277 3820 -8665
10524h665o792Q213l498j0426J0615k769j0300M732P758J1692J0021m447O693
$$ -8665 -15457 -7244 -10742 -21168 -10553 -13322 -23622 -18890 -11132 560 10581 6134 12827
10511A2827p695l622O934R905m917j0324n814j3944m306J0896L787j6768p251
$$ 12827 5132 1510 8444 18349 13432 3108 -2706 -16650 -20956 -10060 -6273 -23041 -30292
10498c0292J8321N306k75L559P940p117j7609M574P607J2505p271k781j8053n3
$$ -30292 -11971 -6665 -6940 -3381 4559 -2558 -20167 -15593 -7986 4519 -2752 -5533 -23586 -23639
10484b3639q687K73J0518J7749O55k1230p979J729o90J969Q226Q513k063M143
$$ -23639 -32326 -32053 -21535 -3786 -3131 -24361 -32340 -30611 -31301 -29332 -21106 -12593 -14656 -10513
10470a0513J300Q589j47M10q10m284N38K026r431R845O185m403n199P580L947
$$ -10513 -9213 -624 -771 -361 -1171 -5455 -4917 -2891 -12322 -2477 3708 -695 -5894 1686 5633
10455E633K813j2762q255j04N316j156Q043K537R969p566r351l051L603J1486
$$ 5633 8446 -4316 -12571 -12675 -7359 -8515 -472 2065 12034 4468 -4883 -7934 -4331 7155
10441G155o526n525L530N866m3j2213L69J593l761Q851J2794M220k277j0034N013
$$ 7155 629 -4896 -1366 4500 4457 -7756 -7387 -5794 -9555 -704 12090 16310 14033 3999 9012
10426I012j4378p99R59j0524n480j1472l273L932J0715M934j3827Q195J5088k116
$$ 9012 -5366 -6165 -5206 -15730 -21210 -32682 -35955 -32023 -21308 -16374 -30201 -22006 -6918 -9034
10412i034k279k916J299J0927n967p785J064O080j4252R197J9613Q769j2432j1040
$$ -9034 -11313 -14229 -12930 -2003 -7970 -15755 -14691 -8611 -22863 -13666 5947 14716 2284 -8756
10398h756J452R256P52l424o82k063j5763M276K025q24K970j122O591O061k568
$$ -8756 -7304 1952 2704 -720 -1402 -3465 -19228 -14952 -12927 -13751 -10781 -11903 -5312 749 -1819
10383a819J998n190j2523J7348M5M391Q817p069q229r5n598J0039j0080r688P374
$$ -1819 179 -5011 -17534 -186 -141 4250 13067 5998 -2231 -2326 -7924 2115 -7965 -17653 -10279
10368a0279J4215J383j1166j1591M215j3017m94O675Q610J1131K290k170j1313
$$ -10279 3936 5319 -5847 -17438 -13223 -26240 -26734 -20059 -11449 -318 1972 -198 -11511
10355a1511l806K448k219N693R321L7J2004l828k1068L022K629R007m271q90p421
$$ -11511 -15317 -12869 -15088 -9395 -74 -37 11967 8139 -12929 -9907 -7278 1729 -2542 -3432 -10853
10340a0853m653n122r249m449J4131m061J1648K190R059J133K268J1313m053j7344
$$ -10853 -15506 -20628 -29877 -34326 -20195 -24256 -12608 -10418 -1359 -226 2042 13355 9302 -8042
10326h042m70J4339M719M367P622M95r936j4579Q381K7017J6606p924n189k690
$$ -8042 -8512 5827 10546 14913 22535 23030 13094 -1485 6896 33913 50519 42595 37406 34716
10312C4716Q197k452j1417j0923p168l876j637M456M464K75r463r190r68o47j693
$$ 34716 42913 40461 29044 18121 10953 7077 5440 9896 14360 14635 5172 -4018 -4986 -5633 -7326
10297g326q677k628K595j568j070M786K54o739p423J971J667K3506J2740J4340
$$ -7326 -16003 -18631 -16036 -17604 -18674 -13888 -13634 -20373 -27796 -25825 -24158 -652 12088 26428
10283B6428M017k4708k0347N252K052p062o562P470K0522P538q045p929k907J8228
$$ 26428 30445 5737 -14610 -9358 -7306 -14368 -20930 -13460 7062 14600 6555 -1374 -4281 13947
10269A3947q037j2280O218q59l422J607R902q106p605J032L065R22l84o930N849
$$ 13947 5910 -6370 -152 -1011 -4433 -2826 7076 -1030 -8635 -7603 -4538 -3616 -4000 -10930 -5081
10254e081J3796M299J791r312R591l437R495M363j4444k040l080m564M798m317
$$ -5081 8715 13014 14805 5493 15084 11647 21142 25505 11061 9021 5941 1377 6175 1858
10240A858r617M214j1561j747J0173J1166L253N46j19Q34K945l92j905q201J727
$$ 1858 -7759 -3545 -15106 -16853 -6680 4486 7739 8285 8166 9000 11945 11553 9648 1447 3174
10225C174l751n135P148L992n757l978M638m603L163j7115j1877o080R299O147
$$ 3174 -577 -5712 1436 5428 -329 -4307 331 -4272 -1109 -18224 -30101 -36181 -26882 -20735
10211b0735L199m677r057L243o71J1662J4377N610k871J5099R885j1357j324R939
$$ -20735 -17536 -22213 -31270 -28027 -28698 -17036 -2659 2951 80 15179 25064 13707 12383 22322
10197B2322j4801j2138K3250K2466p852j1922j4549q35O556o5p450n065k247l860
$$ 22322 7521 -4617 18633 41099 33247 21325 6776 5941 12497 12432 4982 -83 -2330 -6190
10183f190q595J365j444L898j3879J06K0258Q685o840k78M956J0234j437r831
$$ -6190 -14785 -13420 -14864 -10966 -24845 -24739 -4481 4204 -2636 -2914 2042 12276 10839 1008
10169A008K790m098R784o04n691N906j845K328k526l726j744J265O552J4032L541
$$ 1008 3798 -300 9484 8880 3189 9095 7250 9578 7052 3326 1582 2847 9399 23431 26972
10154B6972L857j3660j6322j091j7668m370R480K173J0310K730j273Q700k647
$$ 26972 30829 17169 847 -244 -17912 -22282 -12802 -10629 -319 2411 1138 9838 7191
10141G191O620J1748Q56o001q212j0782o938Q819O404l235n059q352P00N173r24
$$ 7191 13811 25559 26415 20414 12202 1420 -5518 3301 9705 6470 1411 -6941 -6241 -1068 -1992
10126a992r836j1186J2458J4540o437q31J506q382Q743K055p858j5591P093K503
$$ -1992 -11828 -23014 -10556 3984 -2453 -3284 -1778 -10160 -1417 638 -7220 -22811 -15718 -13215
10112a3215R26N928N969J305N132N780O438o749j3746j8196P356J0254M014J4683
$$ -13215 -12289 -6361 -392 913 6045 11825 18263 11514 -2232 -20428 -13072 -2818 1196 15879
10098A5879M570M600p187m273M447j793j4508l97J2858L24l452o085q412k253
$$ 15879 20449 25049 17862 13589 18036 16243 1735 1338 14196 14520 11068 4983 -3429 -5682
10084e682o637O850J0919m072J8258k546o224K277j0778j5859O904J4284m141
$$ -5682 -12319 -5469 5450 1378 19636 17090 10866 13143 2365 -13494 -6590 7694 3553
10071C553q405n274J0224m85Q201M225m906q443j194O8k119j7868j169L31o189
$$ 3553 -4852 -10126 98 -387 7814 12039 7133 -1310 -2504 -2436 -4555 -22423 -23592 -23261 -29450
10056b9450J656N766j447L480R609J7915o188m523q894o704J934j725J8074J4992
$$ -29450 -27794 -22028 -23475 -19995 -10386 7529 1341 -3182 -12076 -18780 -16846 -18571 -497 14495
10042A4495K1329j3049j5956J0034Q203n117j6188O8O071J1219k661n562p358
$$ 14495 35824 22775 6819 16853 25056 19939 3751 3819 9890 21109 18448 12886 5528
10029E528j2285m05J6186M96k095M741j3484j8912o449L517m104O395O394k411
$$ 5528 -6757 -7162 9024 9520 7425 12166 -1318 -20230 -26679 -23162 -27266 -20871 -14477 -16888
10015a6888J946Q484q544m989P863L398P784J691m616j03J3076K785L098M654
$$ -16888 -14942 -6458 -15002 -19991 -12128 -8730 -946 745 -3871 -3974 9102 11887 14985 19639
10001A9639M355m199O77R412j133K62j1221j958Q215M016k2759m889m4J0696J3444
$$ 19639 23994 19795 20472 29884 28751 29013 17792 15834 24049 28065 5306 417 373 11069 24513
9986B4513p866r250r98L700j0641J913m547j774o227K542R52j4216k794P861P478
$$ 24513 16647 7397 6399 10099 -542 1371 -3176 -4950 -11177 -8635 -7683 -21899 -24693 -16832 -9354
9971i354j3814j6178M043R890J2562K128j5874k415o53K694p401J1577J3726K359
$$ -9354 -23168 -39346 -35303 -25413 -12851 -10723 -26597 -29012 -29665 -26971 -34372 -22795 -9069 -6710
9957f710M285k79J0425J7263j290j5460J46K483P200k558l241L387n357o176m105
$$ -6710 -2425 -2704 7721 24984 23694 8234 8380 10863 18063 15505 12264 15651 10294 4118 13
9942A3l088J9704J033p98j456O746m257J46l061K36j6187j0536k395J6244N598
$$ 13 -3075 16629 17662 16864 15408 22154 17897 18043 14982 15218 -969 -11505 -13900 2344 7942
9927G942Q075k244k238m435m112k092M21j533o719L657Q075k494j1684Q730K787
$$ 7942 16017 13773 11535 7100 2988 896 1317 -216 -6935 -3278 4797 2303 -9381 -651 2136
9912B136Q578o906q413K0380L264k683L399O001M342o78k0300R3r364o042n673
$$ 2136 10714 3808 -4605 15775 19039 16356 19755 25756 30098 29420 9120 9213 -151 -6193 -11866
9897a1866J5342Q45j141M237J124k671M771j175K496L135N616J869m455j2152
$$ -11866 3476 4321 3180 7417 8541 5870 10641 9466 11962 15097 20713 22582 18127 5975
9883E975j1287K1730l661L020Q706L725j9231N062J1512J3733q712k0643J868
$$ 5975 -5312 16418 12757 15777 24483 28208 8977 14039 25551 39284 30572 9929 11797
9870A1797l47J0328N731j8332j4237K159J875L828O037l442J1123N67r25K732
$$ 11797 11450 21778 27509 9177 -5060 -2901 -1026 2802 8839 5397 16520 17087 16162 18894
9856A8894J418l077o939J1948R507q611j7819R862J2010L3j9216q453j450M582
$$ 18894 20312 17235 10296 22244 31751 23140 5321 15183 27193 27226 8010 -443 -1893 2689
9842B689J4680M789K235j537N727p565k3716j2733O309Q770Q132J1199l835L514
$$ 2689 17369 22158 24393 22856 28583 21018 -2698 -15431 -9122 -352 7780 18979 15144 18658
9828A8658K699P95j4653K418J0149K475R40N530j3539K278J3046M544j0033j5809
$$ 18658 21357 22152 7499 9917 20066 22541 23481 29011 15472 17750 30796 35340 25307 9498
9814I498k212l639O138J5531L02j0105j4097p70M534K479J5479J4810J2985j3337
$$ 9498 7286 3647 9785 25316 25618 15513 1416 646 5180 7659 23138 37948 50933 37596
9800C7596k6261M43n352L455J0848m428J77J0531n936k494J5647n915o891j2902
$$ 37596 11335 11778 6426 9881 20729 16301 16478 27009 21073 18579 34226 28311 21420 8518
9786H518n651M250K055J3456Q639k545p741j7497p055J0276J635r435o739J853
$$ 8518 2867 7117 9172 22628 31267 28722 20981 3484 -3571 6705 8340 -1095 -7834 -5981
9772e981k813O347J874R804J5252o096j143K905q516j4771j1558J0254J2799J40
$$ -5981 -8794 -2447 -573 9231 24483 18387 17244 20149 11633 -3138 -14696 -4442 8357 8497
9758H497m932J620q6K778j2375N786J3542o057r128O396L791r530r56M275k890
$$ 8497 3565 5185 5099 7877 -4498 1288 14830 8773 -355 6041 9832 302 -654 3621 731
9743G31j684o789j248l161k666O436K9407O344k822L218J4966k0500j3913J41
$$ 731 -953 -7742 -8990 -12151 -14817 -8381 21026 27370 24548 27766 42732 22232 8319 8460
9729H460Q827M449j6890p790J3358J1935L639o874J793p315J530n631L45p390
$$ 8460 17287 21736 4846 -2944 10414 22349 25988 19114 20907 13592 15122 9491 9836 2446
9715B446l072N037N976n135j821N608M930o958J0430J7385o327K962q356o770
$$ 2446 -626 4411 10387 5252 3431 9039 13969 7011 17441 34826 28499 31461 23105 16335
9701A6335j6817n214P081K234Q105k14Q346q301q805l493J1894J017j942N502
$$ 16335 -482 -5696 1385 3619 11724 11510 19856 11555 2750 -743 11151 12168 10226 15728
9687A5728O10J6845n911j834j995p867J1344K846n336j121q184Q423J0236J636
$$ 15728 16338 33183 27272 25438 23443 15576 26920 29766 24430 23309 15125 23548 33784 35420
9673C5420j3843q837O473J2901Q836j0011m742M632M241j53j1426M4J629o189
$$ 35420 21577 12740 19213 32114 40950 30939 26197 30829 35070 34917 23491 23535 25164 18975
9659A8975m287M028r28j476k040P423M403r509J594J0191l314m10l093j259J654
$$ 18975 14688 18716 17788 16312 14272 21695 26098 16589 18183 28374 25060 24650 21557 20298 21952
9644B1952O555R728K988k491K563o944P673R11R685J638q470n339Q416j0681j8494
$$ 21952 28507 38235 41223 38732 41295 34351 42024 42935 52620 54258 45788 40449 48865 38184 19690
9629A9690k835N405o232m433M314K2374J006n031R681N795Q88j2531o219M276
$$ 19690 16855 22260 16028 11595 15909 38283 39289 34258 43939 49734 50622 38091 31872 36148
9615C6148j096l695j0430j1449N182K3469J1787k729j3572o860M137k035Q765
$$ 36148 35052 31357 20927 9478 14660 38129 49916 47187 33615 26755 30892 28857 37622
9602C7622N449l273n911o714l666k458l907L959J4295m781Q218K324k7577q018
$$ 37622 43071 39798 33887 27173 23507 21049 17142 21101 35396 30615 38833 41157 13580 5562
9588E562J4891J7887Q900q296j0522j3286j238J0304K931l603L642m589R204N206
$$ 5562 20453 38340 47240 38944 28422 15136 13898 24202 27133 23530 27172 22583 31787 36993
9574C6993j0446P846p503p144J746M096k107j82L584P724j844j0043o91j994Q659
$$ 36993 26547 34393 26890 19746 21492 25588 23481 23299 26883 34607 32763 22720 22029 20035 28694
9559B8694J374o576J0523o017p96R344Q271n748p025N269J1364k333n972j1913
$$ 28694 30068 23492 34015 27998 27202 36546 44817 39069 32044 37313 48677 46344 40372 28459
9545B8459Q730O955m244N06P64k018n193O227M158L752O228L921L657r341p186
$$ 28459 37189 44144 39900 40406 41170 39152 33959 40186 44344 48096 54324 58245 61902 52561 45375
9530D5375m414J37Q821P591j007j3629r859o869j81J3613L46k322l799J4559J0363
$$ 45375 40961 41098 49919 57510 56503 42874 33015 26146 25965 39578 39924 37602 33803 48362 58725
9515E8725J1859l782j1685k266m516m961K067M661P349J7345N146p793o66j5688
$$ 58725 70584 66802 55117 52851 48335 43374 45441 50102 57451 74796 79942 72149 71483 55795
9501E5795j2275M233K040j1960N785J4707k642m652l42J1346R519j2589k946L964
$$ 55795 43520 47753 49793 37833 43618 58325 55683 51031 50689 62035 71554 58965 56019 59983
9487E9983J5190P663j1752P121p917P96m617Q847J3917m889k0884j0804L344J2496
$$ 59983 75173 82836 71084 78205 70288 71084 66467 75314 89231 84342 63458 52654 55998 68494
9473F8494K017j1065l246k717R709J5619m9l104k603N728j1931q649L784j740
$$ 68494 70511 59446 56200 53483 63192 78811 78762 75658 73055 78783 66852 58203 61987 60247
9459F0247L539q97O200R691j5494l966R989P743q168j0133J479N951r506j3289
$$ 60247 63786 62889 69089 78780 63286 59320 69309 77052 68884 58751 60230 66181 56675 43386
9445D3386J4088K0594M853p106o553j697P147M308J503j166R80n955L319j0818
$$ 43386 57474 78068 82921 75815 69262 67565 74712 79020 80523 79357 80337 74382 77701 66883
9431F6883P598q852j844L381m444Q844L394o880J997N927n796J1372L535p495
$$ 66883 74481 65629 63785 67166 62722 71566 74960 68080 70077 76004 70208 81580 85115 77620
9417G7620q970K893K34q832J9773R811q472q916o56m203r088j0479J0515J7204
$$ 77620 68650 71543 71777 62945 82718 92529 84057 75141 74485 70282 61194 50715 61230 78434
9403G8434K3600o90j3244q251N794r13j2094k553J1021L500l42K880k239J0342
$$ 78434 102034 101344 88100 79849 85643 84730 72636 70083 81104 84604 84262 87142 84903 95245
9389I5245k05J8929J6652j1855J105r132k1158r831N068J0179P997J704M022l266
$$ 95245 95040 113969 130621 118766 119871 110739 89581 79750 84818 94997 102994 104698 108720 105454
9375A05454m964q522q885J708N779L526K3843P81r490J0519o603j2363q3Q51n613
$$ 105454 100490 91968 83083 84791 90570 94096 117939 118720 109230 119749 113146 100783 100700 101551 95938
9360I5938J4147p606n567r88P60p528q095N468j3652J885R694l23L884p2p5p269
$$ 95938 110085 102479 96912 95924 96684 89156 81061 86529 72877 74762 84456 84133 88017 87945 87870 80601
9344H0601N374M52P358N883o042p135J0804K043m315k416o242J199M353j198P769
$$ 80601 85975 86427 93785 99668 93626 86491 97295 99338 95023 92607 86365 87564 91917 90719 98488
9329I8488O966L402m657j265j610R688J1293K317J776l857r700o984N090j1770
$$ 98488 105454 108856 104199 102934 101324 111012 122305 124622 126398 122541 112841 105857 110947 99177
9315I9177k714P615o11r933r893M97J2570m734m933L608N027j075m021N236M881
$$ 99177 96463 104078 103467 93534 83641 84138 96708 91974 87041 90649 95676 94601 90580 95816 100697
9300A00697L756J7965q992j4088o95J9057L403q203P374j841o661J582j0972M478
$$ 100697 104453 122418 113426 99338 98643 117700 121103 112900 120274 118433 111772 113354 102382 106860
9286A06860p354o691J2630J392k0834n460R635K532K208M192O898L673K477O180
$$ 106860 99506 92815 105445 106837 86003 80543 90178 92710 94918 99110 106008 109681 112158 118338
9272A18338j4504r024j3833M299Q928K241K6733O790j2302j4241O525o631r235
$$ 118338 103834 94810 80977 85276 94204 96445 123178 129968 117666 103425 109950 103319 94084
9259I4084P15J5806k653l397J840m636r938L640J3893K577n107o066N704J2249
$$ 94084 94799 110605 107952 104555 106395 101759 91821 95461 109354 111931 106824 100758 106462 118711
9245A18711M768r594j1836j631L629n954j561J1730N178O597M092L454j304J671
$$ 118711 123479 113885 102049 100418 104047 98093 96532 108262 113440 120037 124129 127583 126279 127950
9231A27950K109M275J565j46J7508j781J012M245j4032Q450P781p909n242N13
$$ 127950 130059 134334 135899 135753 153261 151480 152492 156737 142705 151155 158936 151027 145785 146298
9217A46298p56l56j919J052Q651m449Q281k646k235Q431J1375k426j954K219J0064
$$ 146298 145542 145186 143267 144319 152970 148521 156802 154156 151921 160352 171727 169301 167347 169566 179630
9202A79630o764J79p990N350M643o559M245k28l676j1571n922R564n411k610P832
$$ 179630 172866 173045 165055 170405 175048 168489 172734 172506 168830 157259 151337 160901 155490 152880 160712
9187A60712J905P70O556p353k1174j8121P646L452N546J9825K62r98L953J213
$$ 160712 162617 163387 169943 162590 141416 123295 130941 134393 139939 159764 160026 159028 162981 164194
9173A64194R99J77N141K836j1367j3361N715Q501l555p09q744l578J5478R062
$$ 164194 165193 165370 170511 173347 161980 148619 154334 162835 159280 158571 149827 146249 161727 170789
9159A70789j927L349J499M403k319o473J095P008J6346M58j789j948R55l113k892
$$ 170789 168862 172211 173710 178113 175794 169321 170416 177424 193770 194228 192439 190491 191446 188333 185441
9144A85441n027r848m637j415K136N070P109J9294J6577m522k5661O785J1548
$$ 185441 180414 170566 165929 164514 166650 171720 178829 198123 214700 210178 184517 191302 202850
9131B02850R796J0175J2943M114J406q403M982J8601O524j64q052j5289P21j321
$$ 202850 212646 222821 235764 239878 241284 232881 237863 256464 262988 262824 254772 239483 240204 238883
9117B38883O096J5334K807L039J634k098l636m570j984k749p574j3850j0159q319
$$ 238883 244979 260313 263120 266159 267793 265695 262059 257489 255505 252756 245182 231332 221173 212854
9103B12854j420Q980k020L709J8572k52j037J0571P018P104p070P332L044Q856
$$ 212854 211434 220414 218394 222103 240675 240423 239386 249957 256975 264079 257009 264341 267385 276241
9089B76241J2654k355P41J0292j627J620K7586R791j308N685L439J3191K8159
$$ 276241 288895 286540 287281 297573 295946 297566 325152 334943 333635 339320 342759 355950 384109
9076C84109K8440K3668J2516N976K520M567Q743Q51J1331Q257N86n646p067o831
$$ 384109 412549 436217 448733 454709 457229 461796 470539 471390 482721 490978 491564 485918 478851 472020
9062D72020K327m224p321l849N125J4592J6148L467L99Q807k0853j0911K1553
$$ 472020 474347 470123 462802 458953 464078 478670 494818 498285 498684 507491 486638 475727 497280
9049D97280o344n761K1385J5603J2133M761q028k560J122o115j2173J972J4833
$$ 497280 490936 485175 506560 522163 534296 539057 531029 528469 529591 523476 511303 513275 528108
9036E28108J9472R960k2525j0364J8303Q04M978Q635j047P782O343P844k173Q28
$$ 528108 547580 557540 535015 524651 542954 543758 548736 557371 556324 564106 570449 578293 576120 576948
9022E76948J2068j3217l019J4794J3913p302J8964L1579p42K268O023J3980K0704
$$ 576948 589016 575799 572780 587574 601487 594185 613149 644728 643986 646254 652277 666257 686961
9009F86961J7345N414O854J3749o4o174k830M585n045k34N200K68J0318q630j0988
$$ 686961 704306 709720 716574 730323 730259 724085 721255 725840 720795 720561 725761 726029 736347 727717 716729
8994G16729J967R104P425P931p512j908M326J0812K7645K5954N027l542M847J2186
$$ 716729 718696 727800 735225 743156 735644 733736 738062 748874 776519 802473 807500 803958 808805 820991
8980H20991J1874L806L034J2198J7374R693L900l789O922K4664O920k170Q345
$$ 820991 832865 836671 839705 851903 869277 878970 882870 879081 886003 910667 917587 915417 923762
8967I23762J2643K2829J1589Q786R833J8859J1273K7772J8861K4365J2589J6983
$$ 923762 936405 959234 970823 979609 989442 1008301 1019574 1047346 1066207 1090572 1103161 1120144
8955A120144K2968J5997L2186L8600J3219J5702K3612K8104L8770M2541N7233
$$ 1120144 1143112 1159109 1191295 1229895 1243114 1258816 1282428 1310532 1349302 1391843 1449076
8944A449076M7071L3813N2592N0774L9150M5016K1741R856K4569K0422K4615J6389
$$ 1449076 1496147 1529960 1582552 1633326 1672476 1717492 1739233 1749089 1773658 1794080 1818695 1835084
8932A835084K4416M3736J3644J0285L6143K5112L7408M0118L8270K6537K4944
$$ 1835084 1859500 1903236 1916880 1927165 1963308 1988420 2025828 2065946 2104216 2130753 2155697
8921B155697K3870L4068K3444K4905L1956L4303M4147N7673L7422L2575M4420
$$ 2155697 2179567 2213635 2237079 2261984 2293940 2328243 2372390 2430063 2467485 2500060 2544480
8910B544480M8804M8448L4271M5575N7219M9537O0875O5871Q0263N9513N7392
$$ 2544480 2593284 2641732 2676003 2721578 2778797 2828334 2889209 2955080 3035343 3094856 3152248
8899C152248P7219P2456P8931P4848N3810O9689R6019R3538P6173Q4437R7781
$$ 3152248 3229467 3301923 3380854 3455702 3509512 3579201 3675220 3768758 3844931 3929368 4027149
8888D027149R1094Q5696J19883J34652J20496J14292J27145J46670J56568J56539
$$ 4027149 4118243 4203939 4323822 4458474 4578970 4693262 4820407 4967077 5123645 5280184
8878E280184J56153J59033J71247J92090J91742J97438K06965K15839K30922K54409
$$ 5280184 5436337 5595370 5766617 5958707 6150449 6347887 6554852 6770691 7001613 7256022
8868G256022K66356K57707K73458L13349L45184L70482M02062M25588M52766M79721
$$ 7256022 7522378 7780085 8053543 8366892 8712076 9082558 9484620 9910208 10362974 10842695
8858A0842695N50752N75968N91656O43250O78042P36837Q02043Q52095R03027
$$ 10842695 11393447 11969415 12561071 13204321 13882363 14619200 15421243 16273338 17176365
8849A7176365R64308J044893J139602J213155J326592J469934J608702J785320
$$ 17176365 18140673 19185566 20325168 21538323 22864915 24334849 25943551 27728871
8841B7728871J982755K191213K446309K716838L020210L417641L849547M360337
$$ 27728871 29711626 31902839 34349148 37065986 40086196 43503837 47353384 51713721
8833E1713721M948573N591309O353329P248624Q261816R393554J0649165J2009261
$$ 51713721 56662294 62253603 68606932 75855556 84117372 93510926 104160091 116169352
8825A16169352J3383852J4707091J5806857J6437997J6390547J5385316J3251492
$$ 116169352 129553204 144260295 160067152 176505149 192895696 208281012 221532504
8818B21532504J0014748N760960Q58655m153706q613576j2037289j4182116j5089669
$$ 221532504 231547252 237308212 238166867 234013161 225399585 213362296 199180180 184090511
8810A84090511j5013746j4283628j3181772j1934261j0676497r465835q383993
$$ 184090511 169076765 154793137 141611365 129677104 119000607 109534772 101150779
8803A01150779p420830o541597n795464n165605m626128m165076l771994l442672
$$ 101150779 93729949 87188352 81392888 76227283 71601155 67436079 63664085 60221413
8795F0221413l151580k887527k681563k481246k300138k114135j955395j820519
$$ 60221413 57069833 54182306 51500743 49019497 46719359 44605224 42649829 40829310
8787D0829310j695503j592638j481241j372257j284658j195210j128574j050259
$$ 40829310 39133807 37541169 36059928 34687671 33403013 32207803 31079229 30028970
8779C0028970r90593r07063q50121q13310p85978p38312p01381o81733o42411
$$ 30028970 29038377 28131314 27281193 26467883 25681905 24943593 24242212 23560479 22918068
8770B2918068o37206o32946o04696o05511n92365n67118n55132n42645n21309
$$ 22918068 22280862 21647916 21043220 20437709 19845344 19278226 18723094 18180449 17659140
8761A7659140n00585m86395m63254m45210m28669m08461m01900l77899l76634
$$ 17659140 17158555 16672160 16208906 15763696 15335027 14926566 14524666 14146767 13770133
8752A3770133l64145l37023l37613l15677k96196k87384k90174k85251k75195
$$ 13770133 13405988 13068965 12731352 12415675 12119479 11832095 11541921 11256670 10981475
8743A0981475k46934k38988k39362k41171k25443k10634k15857k27059k20715
$$ 10981475 10734541 10495553 10256191 10015020 9789577 9578943 9363086 9136027 8915312
8734H915312k27690k07243j67353j70850j87815j69944j69543j76120j73680j61063
$$ 8915312 8687622 8480379 8313026 8142176 7954361 7784417 7614874 7438754 7265074 7104011
8724G104011j55862j51746j45957j32098j34676j38165j32612j15178j32961j25307
$$ 7104011 6948149 6796403 6650446 6518348 6383672 6245507 6112895 5997717 5864756 5739449
8714E739449j18545j12900j08051j11216j17205j01591j03948r7103q9188r9673
$$ 5739449 5620904 5508004 5399953 5288737 5171532 5069941 4965993 4868890 4779702 4680029
8704D680029q5856r6205p1533p6070p8274q8168p4895p3530o5855p2610p1369
$$ 4680029 4594173 4497968 4426435 4350365 4272091 4183923 4109028 4035498 3969643 3897033 3825664
8693C825664l9183k9742o2414p6527o8736n2816m8592m5247o3007p0388n3974
$$ 3825664 3786481 3756739 3694325 3617798 3549062 3496246 3447654 3402407 3339400 3269012 3215038
8682C215038l7444o8400n8499m1320m1144k7986l5995m4063m7923k3664k8024
$$ 3215038 3177594 3109194 3050695 3009375 2968231 2940245 2904250 2860187 2812264 2788600 2760576
8671B760576m3073l8273m3643l4416n0747n5120m2402l7858m2970l8947m0427
$$ 2760576 2717503 2679230 2635587 2601171 2550424 2495304 2452902 2415044 2372074 2333127 2292700
8660B292700j9942m1429m0356k9446k3322l6280k2985k8259m0124l1945l2374
$$ 2292700 2272758 2231329 2190973 2161527 2138205 2101925 2078940 2050681 2010557 1978612 1946238
8649A946238l8605n0984l8133m5273l9410l2926l9040l6966k9494l1975k8481
$$ 1946238 1907633 1856649 1818516 1773243 1733833 1700907 1661867 1624901 1595407 1563432 1534951
8638A534951m1363k8937l7993m8588m9207k7477k8641l8709m2566l0276k6477
$$ 1534951 1493588 1464651 1426658 1378070 1328863 1301386 1272745 1234036 1191470 1161194 1134717
8627A134717k7317l7065k4372K426j0489o159j160Q634Q915j4139k5343j1452
$$ 1134717 1107400 1070335 1045963 1048389 1037900 1031741 1030581 1039215 1048130 1033991 1008648 997196
8615I97196q928k696r836k0256j8197m85P49j4790j1549N243N117J640j0319j2065
$$ 997196 988268 985572 975736 955480 937283 936798 937547 922757 911208 916451 921568 923208 912889 900824
8601I00824k032q168j1232l8512l1434n158p370j1045J0602n145k4089j2028n392
$$ 900824 898792 890624 879392 840880 809446 804288 796918 785873 796475 791330 767241 755213 749821
8588G49821k378j3002M812J792q46o32j5522j0978q84M413j0262k1821r175p819
$$ 749821 747443 734441 739253 741045 740199 739567 724045 713067 712183 716596 706334 684513 675338 667519
8574F67519P720J56o722j4634j3873J1090q671M618R757K846j0008r399J6822
$$ 667519 675239 675395 668673 654039 640166 651256 642585 647203 656960 659806 649798 640399 657221
8561F57221P800k448r732R478Q219j2015o934l938L797J1412K2672K1952L3639
$$ 657221 665021 662573 652841 662319 670538 658523 651589 647651 651448 662860 685532 707484 741123
8548G41123L3372K7846L5480K5471j8994p5535n9162l3637k2935j3481r725l898
$$ 741123 774495 802341 837821 863292 844298 768763 709601 675964 653029 639548 629823 625925
8536F25925p193j679j3436P91P081j3924k6661j0766j247j6347j6963o607J3038
$$ 625925 618732 617053 603617 604408 611489 597565 570904 560138 558891 542544 525581 518974 532012
8523E32012j0610j3060j3964o619l546j6707R060J1442M473K127N786m111M194
$$ 532012 521402 508342 494378 487759 484213 467506 476566 488008 492481 494608 500394 496283 500477
8510E00477O265j276L3377J3162N6929Q2801J00415R1952R6317R4575M5463o5531
$$ 500477 506742 505466 538843 552005 608934 691735 792150 884102 980419 1074994 1120457 1054926
8498A054926j67999j68545j15140n2533m1662k9145j4567k3250k0362j3518j1822
$$ 1054926 886927 718382 603242 550709 509047 479902 465335 442085 421723 408205 396383
8487C96383n639l592r021r045N391K732M633j1756j2445m295L456J1808J2270
$$ 396383 390744 387152 378131 369086 374477 377209 381842 370086 357641 353346 356802 368610 380880
8474C80880m524k3033k8000N708J6347Q982Q728J3533J1304K5786L7780L7679
$$ 380880 376356 353323 325323 331031 347378 356360 365088 378621 389925 415711 453491 491170
8462D91170L4069N8114O2974Q462l7133r676P453m4823q7399p4275l8679j9596
$$ 491170 525239 583353 646327 654789 617656 607980 615433 570610 483211 408936 370257 350661
8450C50661l0202p457M929j0026o330j4775l215J111k174M980M219o504j1138
$$ 350661 320459 313002 317931 307905 301575 286800 283585 284696 282522 287502 291721 285217 274079
8437B74079j1998j1989q113P517M318n726j3811n474m717j3166j5547n00l365
$$ 274079 262081 250092 241979 249496 253814 248088 234277 228803 224086 210920 195373 194873 191508
8424A91508k745N71l573J5145P445P38m937l069l960Q557J0384M3l572j5759O31
$$ 191508 188763 189334 185761 200906 208351 209089 204152 201083 197123 205680 216064 216107 212535 196776 197407
8409A97407L522l579j0244j685l86o163K384L901p032k433j616K699J964o534
$$ 197407 200929 197350 187106 185421 185035 178872 181256 185157 178125 175692 174076 176775 178739 172205
8395A72205k04N024p915P955J6818n019r186n436J3572O263j1613q218Q056P881
$$ 172205 172001 177025 169110 177065 193883 188864 179678 174242 187814 194077 182464 174246 182302 190183
8381A90183j6770p864o8l843N77r201k944J1860N337K709r901j0789K601Q462
$$ 190183 173413 165549 165481 161638 162215 153014 150070 161930 167267 169976 160075 149286 151887 160349
8367A60349j030j0374j3517k398p08j122K906K965p845j2488J3704J5378L719
$$ 160349 159319 148945 135428 133030 132322 131200 134106 137071 129226 116738 130442 145820 149539
8354A49539L706O866O604j2620q030m266K848j796k418R42m907m088q190L953
$$ 149539 153245 160111 166715 154095 146065 141799 144647 142851 140433 141375 136468 132380 124190 128143
8340A28143J2990N903r201p506Q142j611k0078j1213j0198J1461k172K805L348
$$ 128143 141133 147036 137835 130329 138471 136860 116782 105569 95371 106832 104660 107465 110813
8327A10813j6051O985Q741j296K603j500j0436P122n491J413j905R054J1337j811
$$ 110813 94762 101747 110488 109192 111795 110295 99859 106981 101490 102903 100998 110052 121389 119578
8313A19578o79O383n205m852k339j4277n903J1576k563L784l864m10j7o166l348
$$ 119578 118899 125282 120077 115225 112886 98609 92706 104282 101719 105503 101639 101229 101212 95046 91698
8298I1698l544j684n767J2215j451L944k525M716K083o604m471O437n346j5295
$$ 91698 88154 86470 80703 92918 91467 95411 92886 97602 99685 93081 88610 95047 89701 74406
8284G4406k886o963j332J3807R406j6387o004n13l236O04P23L885p909q566P508
$$ 74406 71520 64557 63225 77032 86438 70051 64047 63534 60298 60902 61625 65510 57601 49035 56543
8269E6543k163n619O000J5473O190n308R775J1850M410j4102o613P49k190o978
$$ 56543 54380 48761 54761 70234 76424 71116 80891 92741 97151 83049 76436 77185 74995 68017
8255F8017O520O321q514k675j881o273L302m064j47J0657P314j827k893M970q100
$$ 68017 74537 80858 72344 69669 67788 61515 64817 60753 60606 71263 78577 76750 73857 78827 70727
8240G0727r308n958o912K714O997J457l82k220m112K420R89R846q80J9J005P00
$$ 70727 61419 55461 48549 51263 58260 59717 59335 57115 53003 55423 56412 66258 65378 65397 66402 67102
8224F7102M099k400J966m063o204M265J7814L945N980J048j6473j8076J0332J3155
$$ 67102 71201 68801 70767 66704 60500 64765 82579 86524 92504 93552 77079 59003 69335 82490
8210H2490M78q82j7307r849J530O483l016P76p998k827r88J0165O465L985q797
$$ 82490 82968 82086 64779 54930 56460 62943 59927 60703 52705 49878 48890 59055 65520 69505 60708
8195F0708j10L532L06Q882K625K788P498j9422o670P614K264M05L26j2434j034
$$ 60708 60598 64130 64436 73318 75943 78731 86229 66807 60137 67751 70015 70420 70746 58312 57278
8180E7278J8388j0386j4446L175J006p991j2141Q882j1739j4830J2339K3816J7497
$$ 57278 75666 65280 50834 54009 55015 47024 34883 43765 32026 17196 29535 53351 70848
8167G0848j4877o629J3428K1105J564j0648q472o565n245N957m286J1354L865
$$ 70848 55971 49342 62770 83875 85439 74791 66319 59754 54509 60466 56180 67534 71399
8154G1399p454J516o335Q112J1916p99p385j5527m502j1359n739J2552L805m64
$$ 71399 63945 65461 59126 67238 79154 78355 70970 55443 50941 39582 33843 46395 50200 49736
8140D9736O286R452O443r320J750J1209q158l145l297N358J3472k213j0944k805
$$ 49736 56022 65474 71917 62597 64347 75556 67398 64253 60956 66314 79786 77573 66629 63824
8126F3824K161l798j4916L633L903L21j0969O723N416J0651O82j2475j7297P982
$$ 63824 65985 62187 47271 50904 54807 55128 44159 50882 56298 66949 67631 55156 37859 45841
8112D5841J7339k616m118k86k038N55J5142o28l112k0471r840J1943n696j5372
$$ 45841 63180 60564 56446 56160 54122 54677 69819 69191 66079 45608 35768 47711 42015 26643
8098B6643J494j57J2557J2001N133k346M8j057l899n148k649R202J1749j1953
$$ 26643 28137 27980 40537 52538 57671 55325 55373 54316 50417 45269 42620 51822 63571 51618
8084E1618Q387J0723k2380m694R572J3796m663k076J919n89q074q641P92n746
$$ 51618 60005 70728 48348 43654 53226 67022 62359 60283 62202 61613 53539 44898 45690 39944
8070C9944J597J0460J86o492N480j1393J1455N754r823Q782J1442m249j867k732
$$ 39944 41541 52001 52187 45695 51175 39782 51237 56991 47168 55950 67392 63143 61276 58544
8056E8544k2162r469J3505j1703L431J599L18J0745j199M492p644K130M504L273
$$ 58544 36382 26913 40418 28715 32146 33745 34063 44808 43609 48101 40457 42587 47091 50364
8042E0364k015n011n059O418L471r259O220m36j1683j592J4378N953J624p105
$$ 50364 48349 43338 38279 44697 48168 38909 45129 44693 33010 31418 45796 51749 53373 46268
8028D6268K002R978r491j6071Q720J2646n013J142N789L459k990m641m54J480
$$ 46268 48270 58248 48757 32686 41406 54052 49039 50181 55970 59429 56439 51798 51344 52824
8014E2824m372l646J637r629P218J3591j463j2600n975J9159m56j7266l323J2864
$$ 52824 48452 44806 46443 36814 44032 57623 56160 43560 37585 56744 56288 39022 35699 48563
8000D8563O207M518K733j761J62k418L879J700l482J1141O048k5707j3891k01
$$ 48563 54770 59288 62021 60260 60422 58004 61883 63583 60101 71242 77290 51583 37692 37491
7986C7491J4157m809p651l500l220J7808P336j2595k105O680j399P643J0113P430
$$ 37491 51648 46839 39188 35688 32468 50276 57612 45017 42912 49592 48193 55836 65949 73379
7972G3379K051q56j2697q034L782R782J036j7406j2422J6374P151n477p403N25
$$ 73379 75430 74574 61877 53843 57625 67407 68443 51037 38615 54989 62140 56663 49260 49785
7958D9785o6j153R955j0162J0737K007j1677m691k395N434K146q604j446j3580
$$ 49785 49719 48566 58521 48359 59096 61103 49426 44735 42340 47774 49920 41316 39870 26290
7944B6290j2046K722N913J1277J2291J5499n730o952j7843R633J0620o229o866
$$ 26290 14244 16966 22879 34156 46447 61946 56216 49264 31421 41054 51674 45445 38579
7931C8579j1695N630J2845j314p895M781Q515r120k849M483J2218o058N8P169
$$ 38579 26884 32514 45359 44045 36150 40931 49446 40326 37477 41960 54178 48120 48178 55347
7917E5347m604q250j0690K057J1015k438j7436N432k284k898j2429P239J9526
$$ 55347 50743 42493 31803 33860 44875 42437 25001 30433 28149 25251 12822 20061 39587
7904C9587J0163Q6K767q630j5935K484L793k043M793o696o704K497J4497J712
$$ 39587 49750 49836 52603 43973 28038 30522 34315 32272 37065 30369 23665 26162 40659 42371
7890D2371r32J2592J6165j0343j3154j0855l581p114q977J3336J154r646J955
$$ 42371 41439 54031 70196 59853 46699 35844 32263 25149 16172 29508 30662 21016 22971
7877B2971O186O975K557p325j2869k892O137J4116O270J255j70j1663j307Q149
$$ 22971 29157 36132 38689 31364 18495 15603 21740 35856 42126 43381 43211 31548 30241 38390
7863C8390Q247N460r095N929K056q754j5090j1004j972o286l24K2406K008k2806
$$ 38390 46637 52097 43002 48931 50987 42233 27143 16139 14167 7881 7557 29963 31971 9165
7849I165p79L876K883j3597J440M029O81P123R376k180l04M835J0099j1184l136
$$ 9165 8386 12262 15145 1548 2988 7017 7698 14821 24197 22017 21713 26548 36647 25463 22327
7834B2327J6751O312m446n133M327k548J51Q75k979j8067l535L225P845P284m49
$$ 22327 39078 45390 40944 35811 40138 37590 37741 38616 35637 17570 14035 17260 25105 32389 31940
7819C1940j7372J1039J7930Q42p950j4678p105J0393O867O251m827N951O184p044
$$ 31940 14568 25607 43537 44379 36429 21751 14646 25039 31906 38157 33330 39281 45465 38421
7805C8421q979l948N161K331m271k2157m318P369N569R914L846j0006q328j5088
$$ 38421 29442 25494 30655 32986 28715 6558 2240 9609 15178 25092 28938 18932 10604 -4484
7791d484P894K0866J9159N939J2r41j2544q373M842L377M361k152r98N94j1202
$$ -4484 3410 24276 43435 49374 49386 48445 35901 27528 32370 35747 40108 37956 36958 37552 26350
7776B6350j2649N002N187j7716j3561K2553J4594J5107n643j8492m968K206N882
$$ 26350 13701 18703 23890 6174 -7387 15166 29760 44867 39224 20732 15764 17970 23852
7763B3852Q823p545j9067J185K252K220N996n475r087j2729L708N838Q375J8006
$$ 23852 32675 25130 6063 7248 9500 11720 17716 12241 3154 -9575 -5867 -29 8346 26352
7749B6352J9321K883k742n772k3465r639n413o13m292J733J228R308J4485J1216
$$ 26352 45673 48556 45814 40042 16577 6938 1525 912 -3380 -1647 -419 8889 23374 34590
7735C4590L643r65K035r111p821J3825j5424K715J0779J5211M55j4811j3727J833
$$ 34590 38233 37268 39303 30192 22371 36196 20772 23487 34266 49477 49932 35121 21394 23227
7721B3227p45J1952J0204M105k004L834j2559o206k287K637L343j065o380o154
$$ 23227 22482 34434 44638 48743 46739 50573 38014 31808 29521 32158 35501 34436 28056 21902
7707B1902j6602m703r560l180J784N327K605J7564N917k698N250j221r228j2816
$$ 21902 5300 597 -8963 -12143 -10359 -5032 -2427 15137 21054 18356 23606 22385 13157 341
7693C41j113K346r00j035j0606M95N423M068r865j195L701J6396J1799j0590l609
$$ 341 -772 1574 674 -361 -10967 -10472 -5049 -981 -10846 -12041 -8340 8056 19855 9265 5656
7678E656j1357K288l820P815k128j5822j883K3222L2149J770n070p997L88M797
$$ 5656 -5701 -3413 -7233 582 -1546 -17368 -19251 3971 36120 37890 32820 24823 25211 30008
7664C0008l851J623O744R909l488o729j2498l549O871K94k010K229N049Q110p916
$$ 30008 26157 27780 34524 44433 40945 34216 21718 18169 25040 25334 23324 25553 30602 38712 30796
7649C0796p147o665r198n242K011O257j979r212n058J2711M788K14J3306K375
$$ 30796 23649 16984 7786 2544 4555 10812 8833 -379 -5437 7274 12062 12276 25582 27957
7635B7957O788k173o581r27o566q191k772l40O364p151j2648m947L384P89J8497
$$ 27957 34745 32572 25991 25064 18498 10307 7535 7195 13559 6408 -6240 -11187 -7803 -7014 11483
7620A1483J974j026j0578n997p509o43R799R733O379M686o333l104K029Q611p046
$$ 11483 13457 12431 1853 -4144 -11653 -12296 -2497 7236 13615 18301 11968 8864 10893 19504 12458
7605A2458o849J941k799J2752j378r588j794J554n090P28O855M184O157R54L970
$$ 12458 5609 7550 4751 17503 16125 6537 4743 6297 1207 1935 8790 12974 19131 20085 24055
7590B4055k1933j5402N147p812j1960j65K6317J9176m361q051r94J4465J0015
$$ 24055 2122 -13280 -8133 -15945 -27905 -28070 -1753 17423 13062 5011 4017 18482 28497
7577B8497K210l152q60J518j7911o51j0005j0947J5010J1892j0982J1912q111
$$ 28497 30707 27555 26695 28213 10302 9651 -354 -11301 3709 15601 4619 16531 8420
7564H420l132m940m520Q201P721K655P378P191O155l610K250k5734K538l995J1189
$$ 8420 5288 348 -4172 4029 11750 14405 21783 28974 35129 31519 33769 8035 10573 6578 17767
7549A7767O466l183m805o871j4233n379K181N099Q547k828p880l110K404P402
$$ 17767 24233 21050 16245 9374 -4859 -10238 -8057 -2958 5589 2761 -5119 -8229 -5825 1577
7535A577p921q747J3613P193M688J774j6359M932J1637j505m084l114o144K452
$$ 1577 -6344 -15091 -1478 5715 10403 12177 -4182 750 12387 10882 6798 3684 -2460 -8
7521hJ2874L508M970Q014M545l652K830r705j3482m889j424N406O458J1949N864
$$ -8 12866 16374 21344 29358 33903 30251 33081 23376 9894 5005 3581 8987 15445 27394 33258
7506C3258M856N1O454j4740o921k421j8529m344R855k055L407r21J0672j4172
$$ 33258 38114 38165 44619 29879 22958 20537 2008 -2336 7519 5464 8871 7950 18622 4450
7492D450m766J1176Q732L703j0622p246P259j86M842J3452K339j1421j8634j990
$$ 4450 -316 10860 19592 23295 12673 5427 12686 12500 17342 30794 33133 21712 3078 1088
7478A088N941n50j5934j286K619K67J6389M702R729l955j949j254q165k472j0845
$$ 1088 7029 6479 -9455 -10741 -8122 -7855 8534 13236 22965 19010 17061 15807 7642 5170 -5675
7463e675l737J1070O022R00K396m631Q954j031l772j0372j2212J1368k530J0542
$$ -5675 -9412 1658 7680 8580 10976 6345 15299 14268 10496 124 -12088 -720 -3250 7292
7449G292J3457m397K075J0023j621r152r378p822K928K002K307k571K318j352
$$ 7292 20749 16352 18427 28450 26829 17677 8299 477 3405 5407 7714 5143 7461 6109
7435F109j464K312p895j358j426j764R022j0192M68k020K762Q290J3893K023r058
$$ 6109 4645 6957 -938 -2296 -3722 -5486 3536 -6656 -6188 -8208 -5446 2844 16737 18760 9702
7420I702P471P569j202j693o69j2684p212n152p045K2867J3896J1384r420K656
$$ 9702 17173 24742 23540 21847 21178 8494 1282 -3870 -10915 11952 25848 37232 27812 30468
7406C0468j7403j0117O09n822j3530J3046K2408J1351j0639p535j532N200P571
$$ 30468 13065 2948 3557 -2265 -15795 -2749 19659 31010 20371 12836 11304 16504 24075
7393B4075J075j5370p742q618k964l844O800m424L370K657m787o266l975J4106
$$ 24075 25150 9780 2038 -6580 -9544 -13388 -6588 -11012 -7642 -4985 -9772 -16038 -20013 -5907
7379e907Q297R503l002Q882m195J773N372q054n206J0859R8J6421M505l982O456
$$ -5907 2390 11893 8891 17773 13578 15351 20723 12669 7463 18322 18420 34841 39346 35364 41820
7364D1820r596k8272j1693j19L259n252m096J2831J7023P053r10k937K091j1494
$$ 41820 32224 3952 -7741 -7860 -4601 -9853 -13949 -1118 15905 22958 22048 19111 21202 9708
7350I708j2482q002j7764J650J6843M533q045J586J7088J2567n335n81k895J3155
$$ 9708 -2774 -10776 -28540 -26890 -10047 -5514 -13559 -11973 5115 17682 12347 11766 8871 22026
7336B2026N663j1838q129j1557n920J2572n131k38L793Q581P830R283q090k108
$$ 22026 27689 15851 7722 -3835 -9755 2817 -2314 -2552 1241 9822 17652 26935 18845 16737
7322A6737N53o741n848J931N682J0613J068j1132j1047k687J90r784q891j260
$$ 16737 17290 10549 4701 6632 12314 22927 23995 12863 1816 -871 -681 -10465 -19356 -20616
7308b0616r66K716M294j167J4297Q511o969n65k965j599J893j868J0841r116l863
$$ -20616 -21582 -18866 -14572 -15739 -1442 7069 100 -465 -3430 -5029 -3136 -5004 5837 -3279 -7142
7293g142O827Q229N410N348J1661J682j6708m313P313J0448j3163j4399K876N396
$$ -7142 -315 7914 13324 18672 30333 32015 15307 10994 18307 28755 15592 1193 4069 9465
7279I465q468J1506N594L039m103o701o417n098M44Q799N154O792j0544p917k477
$$ 9465 997 12503 18097 21136 17033 10332 3915 -1183 -739 8060 13214 20006 9462 1545 -932
7264i32k81o470m04R964K827j3318j2568J0203P457M355Q661p605j0554j097j8123
$$ -932 -1213 -7683 -8087 1877 4704 -8614 -21182 -10979 -3522 833 9494 1889 -8665 -9762 -27885
7249b7885K099K2440R781o820r701N152R683O886k407L81N49r182O02n453r363
$$ -27885 -25786 -3346 6435 -385 -10086 -4934 4749 11635 9228 9609 10158 976 1578 -3875 -13238
7234a3238j547J5370J8712M58j3275J3056L546m119k679q901m203J5337K501l826
$$ -13238 -14785 585 19297 19755 6480 19536 23082 18963 16284 7383 3180 18517 21018 17192
7220A7192m184j1944j7040Q240J7465J337n641L28J0431p370K504j0435n911j934
$$ 17192 13008 1064 -15976 -7736 9729 11066 5425 5753 16184 8814 11318 883 -5028 -6962
7206f962N02J465R246N582J91J141j4903m866L829M932Q884O76L289O120n315
$$ -6962 -6460 -4995 4251 9833 10024 11165 -3738 -8604 -4775 157 9041 9717 13006 19126 13811
7191A3811q199p867J4356j454m007q647J378J784N549n15M135j3431q806O573
$$ 13811 5612 -2255 12101 10647 6640 -2007 -629 1155 6704 6189 10324 -3107 -11913 -5340
7177e340P399j8596L593J4975j302L827J0384O25R55o774K977k679p042p62N363
$$ -5340 2059 -16537 -12944 2031 729 4556 14940 15565 16520 9746 12723 10044 3002 2240 7603
7162G603j143r105J5240N742j0247n049J5781P250j2137o916k1095j6337L848
$$ 7603 6460 -2645 12595 18337 8090 3041 18822 26072 13935 7019 -14076 -30413 -26565
7149b6565K8462P100j0040P501P345m110j4175Q176J8529j6292M402p664j3519
$$ -26565 1897 8997 -1043 6458 13803 9693 -4482 3694 22223 5931 10333 2669 -10850
7136a0850j2212M241N374k222p63O001j241l887L384l802k589J3249J2763n695
$$ -10850 -23062 -18821 -13447 -15669 -16432 -10431 -11672 -15559 -12175 -15977 -18566 -5317 7446 1751
7122A751j0813j1575j379N596J6041M49o852o27J0998Q880m40j013O30K892r566
$$ 1751 -9062 -20637 -22016 -16420 -379 70 -6782 -7409 3589 12469 12029 11016 11646 14538 4972
7107D972j4655r630K477l66J3065m571J270O293P257Q825o077m598L486L965P939
$$ 4972 -9683 -19313 -16836 -17202 -4137 -8708 -7438 -1145 6112 14937 8860 4262 7748 11713 19652
7092A9652m142q563l987R912M126L527l368j0079q9M226j0638j8225k578Q405
$$ 19652 15510 6947 2960 12872 16998 20525 17157 7078 6989 11215 577 -17648 -20226 -11821
7078a1821J7848M389J620Q386q861j0735L758m88M615L3k341k707j6364j0297
$$ -11821 6027 10416 12036 20422 11561 826 4584 4096 8711 8744 6403 3696 -12668 -22965
7064b2965R049R887J3556j087l892j2755l343J0063L689p811J259J740P675N838
$$ -22965 -13916 -4029 9527 8440 4548 -8207 -11550 -1487 2202 -5609 -4350 -2610 5065 10903
7050A0903l872k122j393N90L77p352O262j6577l280q03K1932m343o282Q34j179
$$ 10903 7031 4909 3516 4106 4483 -2869 3393 -13184 -16464 -17267 4665 322 -5960 -5126 -6305
7035f305m524K86l72k00J148j381O890J0226m062k835r536q459J408J0118J0107
$$ -6305 -10829 -10543 -10915 -11115 -9967 -11348 -4458 5768 1706 -1129 -10665 -19124 -17716 -7598 2509
7020B509R078P94L695k212Q348n405j2311p402N912q485r541P363R210n09m650
$$ 2509 11587 12381 16076 13864 22212 16807 4496 -2906 3006 -5479 -15020 -7657 1553 1044 -3606
7005c606k16K613Q694n416L164N250k062j2881J895O813q814p01J5101J2319n609
$$ -3606 -3822 -1209 7485 2069 5233 10483 8421 -4460 -2565 4248 -4566 -5267 9834 22153 16544
6990A6544L605j5309p279m941m59N162J3028Q285j49r929k305K067K100j4399
$$ 16544 20149 4840 -2439 -7380 -7839 -2677 10351 18636 18487 8558 6253 8320 10420 -3979
6976c979l638r038k102N825O669m018Q935L481j107Q235k032l951j5429M204L522
$$ -3979 -7617 -16655 -18757 -12932 -6263 -10281 -1346 2135 1028 9263 7231 3280 -12149 -7945 -4423
6961d423n838M065L555m889K780m992O948K333K448j1195j2271K485j449P558
$$ -4423 -10261 -6196 -2641 -7530 -4750 -9742 -2794 -461 1987 -9208 -21479 -18994 -20443 -12885
6947a2885O641n367l631M780k560lj341l680N924j2989j462J0069M979P497Q968
$$ -12885 -6244 -11611 -15242 -10462 -13022 -13025 -14366 -18046 -12122 -25111 -26573 -16504 -11525 -4028 4940
6932D940p837p855j3107j766K653M710k118K207j71J0505Q873m533l565l713O119
$$ 4940 -2897 -10752 -23859 -25625 -22972 -18262 -20380 -18173 -18344 -7839 1034 -3499 -7064 -10777 -4658
6917d658j153o25L285J2524L844q444j1868k1390L144K3203O676j5215l770n985
$$ -4658 -5811 -6436 -3151 9373 13217 4773 -7095 -28485 -25341 -2138 4538 -10677 -14447 -20432
6903b0432P498N003k710K354n775Q826L705r217P052N314j366J0952J6024j146
$$ -20432 -12934 -7931 -10641 -8287 -14062 -5236 -1531 -10748 -3696 1618 252 11204 27228 26082
6889B6082Rq869l836k823j7940j7707M368K0613Q739k736L854k590k786r532l972
$$ 26082 26091 17222 13386 10563 -7377 -25084 -20716 -103 8636 5900 9754 7164 4378 -5154 -9126
6874i126q346l681Q139N12Q378J1522L194Q34o053r355L944J5136M544j4637l337
$$ -9126 -17472 -21153 -13014 -12502 -4124 7398 10592 11426 5373 -3982 -38 15098 19642 5005 1668
6859A668K530k567p463L860M754R90J2850N560l918j1760k2547j835R679M771
$$ 1668 4198 1631 -5832 -1972 2782 3772 16622 22182 18264 6504 -16043 -17878 -8199 -3428
6845c428O397M26M194l135j024m041j358m72J0266m493j3977j1796K909J7003
$$ -3428 2969 3395 7589 4454 3430 -611 -1969 -2441 7825 3332 -10645 -22441 -19532 -2529
6831b529J5682j0256j2097n926m581O067M416L119K415m947J5492N827j4851l71
$$ -2529 13153 2897 -9200 -15126 -19707 -13640 -9224 -6105 -3690 -8637 6855 12682 -2169 -2540
6817b540o248L317k876l219m604J0751P46K916k937j0295n763J8218J148j4765
$$ -2540 -8788 -5471 -8347 -11566 -16170 -5419 -4673 -1757 -4694 -14989 -20752 -2534 -1386 -16151
6803a6151k488O184P531L551N932j6114q292J0216P389m480L077J2202J0971K240
$$ -16151 -18639 -12455 -4924 -1373 4559 -11555 -19847 -9631 -2242 -6722 -3645 8557 19528 21768
6789B1768j8039j2210KP957R065j3295l780J473J316M226Q728m79P110o437r874
$$ 21768 3729 -8481 -8479 -522 8543 -4752 -8532 -7059 -5743 -1517 7211 6732 13842 7405 -2469
6774b469Q03P043M900j3136M298l492q205J0113Q419m075n98j000q267o497O295
$$ -2469 -1666 5377 10277 -2859 1439 -2053 -10258 -145 8274 4199 3601 2601 -5666 -12163 -5868
6759e868J51r878o861P788m107m253K6810J4249J859j847q368k283j8862j3717
$$ -5868 -5717 -15595 -22456 -14668 -18775 -23028 3782 18031 19890 18043 9675 7392 -11470 -25187
6745b5187J3569J1036J5911M649J411n478p723q699p710k92Q874O272J1657J939
$$ -25187 -11618 -582 15329 19978 21389 15911 8188 -511 -8221 -8513 361 6633 18290 20229
6731B0229o689j722J343M530l31n446O389j0330k1611q1J5650J210L986l053R97
$$ 20229 13540 11818 13161 17691 17360 11914 18303 7973 -13638 -13719 1931 3141 7127 4074 5071
6716E071J127o805j919k868q745O261J037J9320L52q211k881k387Q312J2920L127
$$ 5071 6198 -607 -2526 -5394 -14139 -7878 -6841 12479 12831 4620 1739 -648 7664 20584 23711
6701B3711J165j4622k793O488j7781j1311N566o500K100J233n281p531M013N14
$$ 23711 24876 10254 7461 13949 -3832 -15143 -9577 -16077 -13977 -12744 -18025 -25556 -21543 -21029
6687b1029J05Q864J741l884O413n483m510j659Q53P734l644r95K077p926j1877
$$ -21029 -20924 -12060 -10319 -14203 -7790 -13273 -17783 -19442 -18589 -10855 -14499 -15494 -13417 -21343 -33220
6672c3220O454J1902j413Q07L444l341N203N062r52n24j0235R559O049L170J5806
$$ -33220 -26766 -14864 -16277 -15470 -12026 -15367 -10164 -5102 -6054 -6578 -16813 -7254 -1205 1965 17771
6657A7771j477k762j1960J505q44n298L235J961J911R130N792J602j1370o390
$$ 17771 16294 13532 1572 3077 2233 -3065 170 2131 4042 13172 18964 20566 9196 2806
6643B806M772l62r761q356K401L130n542k981j602j3199M745J2686K172M497J042
$$ 2806 7578 7216 -2545 -10901 -8500 -5370 -10912 -13893 -15495 -28694 -23949 -11263 -9091 -4594 -3552
6628c552q237Q232j419k761r822q093M656J3115L967j8832L249J0669O984O790
$$ -3552 -11789 -3557 -4976 -7737 -17559 -25652 -20996 -7881 -3914 -22746 -19497 -8828 -1844 4946
6614D946m093k989K421q568q712K880o122L565j74k231J2873l807q253J439Q469
$$ 4946 853 -2136 285 -8283 -16995 -14115 -20237 -16672 -16846 -19077 -6204 -10011 -18264 -16825 -8356
6599h356Q769j6851j6081M303J1780q082k888Q420J4530J1896M224p352m74q349
$$ -8356 413 -16438 -32519 -28216 -16436 -24518 -27406 -18986 -4456 7440 11664 4312 3838 -4511
6585d511k6884l960J2403J0685p536O79J1096q503q997o022J7940K0939J0991
$$ -4511 -31395 -35355 -22952 -12267 -19803 -19124 -8028 -16531 -25528 -31550 -13610 7329 18320
6572A8320n996j2109j7037q394N442Q580P596K4184P975o704j4277m941n172K328
$$ 18320 12324 215 -16822 -25216 -19774 -11194 -3598 20586 28561 21857 7580 2639 -2533 -205
6558b05m243l759M597J0569R560J0177K57k5720O389J0501o239j3737j2990j1029
$$ -205 -4448 -8207 -3610 6959 16519 26696 26953 1233 7622 18123 11884 -1853 -14843 -25872
6544b5872J3571k346j1425Q643M929r941J128n539O062N549l812m085o095K6756
$$ -25872 -12301 -14647 -26072 -17429 -12500 -22441 -21313 -26852 -20790 -15241 -19053 -23138 -29233 -2477
6530b477R666k1962k128N979Q774j0766j7054p896q076R689K0284R212N377j087
$$ -2477 7189 -14773 -16901 -10922 -2148 -12914 -29968 -37864 -45940 -36251 -15967 -6755 -1378 -2465
6516b465m023Q443K889J1607J6560j6866L719r110j6910M750M743o135M1N891
$$ -2465 -6488 1955 4844 16451 33011 16145 19864 10754 -6156 -1406 3337 -2798 -2757 3134
6502C134P845L463q213o903p586K256J3926O759K101j3486J0152J204J698L213
$$ 3134 10979 14442 6229 -674 -8260 -6004 7922 14681 16782 3296 13448 14652 16350 19563
6488A9563j0743j6116j869J0814j300j301O200K089j3363M59l004Q657p40l502
$$ 19563 8820 -7296 -9165 1649 349 -952 5248 7337 -6026 -5567 -8571 86 -654 -4156
6474d156L41J720j181J038J815J822K368O866L655K060j873q560j1890r593r25
$$ -4156 -3815 -2095 -3276 -2238 -423 1399 3767 10633 14288 16348 14475 5915 -5975 -15568 -16493
6459a6493L129l132o696K062J45j80N050k73Q058j749p961K525M45k623J1597
$$ -16493 -13364 -16496 -23192 -21130 -20985 -21165 -16115 -16388 -8330 -10079 -18040 -15515 -15070 -17693 -6096
6444f096M436N218l862l610M151K2045q431J514O929q087N568r710k178Q88r469
$$ -6096 -1660 3558 -304 -3914 237 22282 13851 15365 22294 14207 19775 10065 7887 8775 -694
6429f94P451M200r003J0755P105j1947n679r4L786J861j5558o630O061O864J6150
$$ -694 6757 10957 1954 12709 19814 7867 2188 2094 5880 7741 -7817 -14447 -8386 -1522 14628
$$ [...]
##END NTUPLES=NMR SPECTRUM
##END=
