##TITLE=Analysis number 328153
Compound Code btb 12974
Project Code adrs
Chemist Name cyclan
##JCAMPDX= 6.0         $$ Bruker NMR JCAMP-DX V2.0
##DATA TYPE= NMR SPECTRUM
##DATA CLASS= NTUPLES
##ORIGIN= Bruker BioSpin GmbH
##OWNER= nmr
$$ XWIN-NMR		Version 3.5
$$ Tue May  8 15:23:11 2007 GMT Daylight Time (UT+1h)  MAYBRIDGE\nmr@NMR_250MHZ
##.OBSERVE FREQUENCY= 250.131544655141
##.OBSERVE NUCLEUS= ^1H
##.ACQUISITION MODE= SIMULTANEOUS (DQD)
##.ACQUISITION SCHEME= undefined
##.AVERAGES= 16
##.DIGITISER RES= 18
##SPECTROMETER/DATA SYSTEM= dpx250
##.PULSE SEQUENCE= zg30
##.SOLVENT NAME= DMSO
##.SHIFT REFERENCE= (INTERNAL, DMSO, 0, 16.522)
##AUDIT TRAIL= $$ (NUMBER, WHEN, WHO, WHERE, WHAT)
$$ ##TITLE= Audit trail, XWIN-NMR		Version 3.5
$$ ##JCAMPDX= 5.01
$$ ##ORIGIN= Bruker BioSpin GmbH
$$ ##OWNER= nmr
$$ C:\u/data/dgb/nmr/ADRS/610/pdata/1/auditp.txt
$$ ##AUDIT TRAIL=  $$ (NUMBER, WHEN, WHO, WHERE, WHAT)
(   1,<2007-05-08 15:22:47.96 +100>,<MAYBRIDGE\nmr>,<NMR_250MHZ>,
      <created by zg, POWCHK disabled, PULCHK disabled
       configuration hash MD5:
       76 6E 9A 78 1E 09 19 81 EC 84 63 8F B0 6A 59 2D
       data hash MD5: 64K
       26 B4 C1 1E B7 39 A0 BA A3 15 CE 81 BE BF 91 1B>)
(   2,<2007-05-08 15:23:00.20 +100>,<MAYBRIDGE\nmr>,<NMR_250MHZ>,
      <Start of raw data processing
       ef LB = 0.3 FT_mod = 6 PKNL = 1 SI = 32K 
       data hash MD5: 32K
       84 0B 98 F7 F6 C9 77 E7 06 23 EF 13 56 61 AE BE>)
(   3,<2007-05-08 15:23:02.18 +100>,<MAYBRIDGE\nmr>,<NMR_250MHZ>,
      <apk 
       data hash MD5: 32K
       B6 5B A7 BB 54 AC 22 81 62 8A D6 2D 59 F3 09 A7>)
(   4,<2007-05-08 15:23:03.40 +100>,<MAYBRIDGE\nmr>,<NMR_250MHZ>,
      <abs ABSG = 5 
       data hash MD5: 32K
       A3 77 68 BB B4 A9 97 48 C5 F8 B4 90 41 06 EA F7>)
$$ ##END=
$$ 
$$ hash MD5
$$ 3B 84 83 1A BF B3 5F D7 92 E1 30 57 5F 88 9F 5D
##$RELAX= 
##$RELAX= 
##$RELAX= 
##$RELAX= 
##$RELAX= 
##$RELAX= 
##$RELAX= 
$$ Bruker specific parameters
$$ --------------------------
##$DU= <C:\u>
##$EXPNO= 610
##$NAME= <ADRS>
##$PROCNO= 1
##$TYPE= <nmr>
##$USER= <dgb>
##$AMP= (0..31)
100 100 100 100 100 100 100 100 100 100 100 100 100 100 100 100 100 100 
100 100 100 100 100 100 100 100 100 100 100 100 100 100 
##$AQSEQ= 0
##$AQ_mod= 3
##$AUNM= <au_zg>
##$AUTOPOS= <31 >
##$BF1= 250.13
##$BF2= 250.13
##$BF3= 250.13
##$BF4= 250.13
##$BF5= 500.13
##$BF6= 500.13
##$BF7= 500.13
##$BF8= 500.13
##$BYTORDA= 1
##$CFDGTYP= 0
##$CFRGTYP= 5
##$CHEMSTR= <none>
##$CNST= (0..31)
1 1 145 1 1 1 1 1 1 1 1 1 1 1 1 1 1 1 1 1 1 1 1 1 1 1 1 1 1 1 1 1 
##$CPDPRG= <>
##$CPDPRG1= <>
##$CPDPRG2= <>
##$CPDPRG3= <>
##$CPDPRG4= <mlev>
##$CPDPRG5= <mlev>
##$CPDPRG6= <mlev>
##$CPDPRG7= <mlev>
##$CPDPRG8= <mlev>
##$CPDPRGB= <>
##$CPDPRGT= <>
##$D= (0..31)
0 1 0 0 0 0 0 0 0 0.06 0 0 0 0 0 0 0.0002 0 0 0 0 0 0 0 0 0 0 0 0 0 0 
0 
##$DATE= 1178634166
##$DBL= (0..7)
120 120 120 120 120 120 120 120 
##$DBP= (0..7)
150 150 150 150 150 150 150 150 
##$DBP07= 0
##$DBPNAM0= <>
##$DBPNAM1= <>
##$DBPNAM2= <>
##$DBPNAM3= <>
$$ [...]
##$SUBNAM7= <"">
##$SUBNAM8= <"">
##$SUBNAM9= <"">
##$SW= 20.6930455092707
##$SWIBOX= (0..15)
0 0 3 0 0 0 0 0 0 0 0 0 0 0 0 0 
##$SW_h= 5175.983436853
##$TD= 65536
##$TD0= 1
##$TE= 683.16
##$TE2= 300
##$TE3= 300
##$TEG= 300
##$TL= (0..7)
0 120 120 120 120 120 120 120 
##$TP= (0..7)
150 150 150 150 150 150 150 150 
##$TP07= 0
##$TPNAME0= <>
##$TPNAME1= <>
##$TPNAME2= <>
##$TPNAME3= <>
##$TPNAME4= <>
##$TPNAME5= <>
##$TPNAME6= <>
##$TPNAME7= <>
##$TPOAL= (0..7)
0.5 0.5 0.5 0.5 0.5 0.5 0.5 0.5 
##$TPOFFS= (0..7)
0 0 0 0 0 0 0 0 
##$TUNHIN= 0
##$TUNHOUT= 0
##$TUNXOUT= 0
##$USERA1= <user>
##$USERA2= <user>
##$USERA3= <user>
##$USERA4= <user>
##$USERA5= <user>
##$V9= 5
##$VALIST= <valist>
##$VCLIST= <CCCCCCCCCCCCCCC>
##$VD= 0
##$VDLIST= <DDDDDDDDDDDDDDD>
##$VPLIST= <PPPPPPPPPPPPPPP>
##$VTLIST= <TTTTTTTTTTTTTTT>
##$WBST= 1024
##$WBSW= 4
##$XGAIN= (0..3)
0 0 0 0 
##$XL= 0
##$YL= 0
##$YMAX_a= 418356
##$YMIN_a= -530032
##$ZGOPTNS= <>
##$ZL1= 120
##$ZL2= 120
##$ZL3= 120
##$ZL4= 120
##$ABSF1= 16.522
##$ABSF2= -4.171173
##$ABSG= 5
##$ABSL= 3
##$ALPHA= 0
##$AQORDER= 0
##$ASSFAC= 0
##$ASSFACI= 0
##$ASSFACX= 0
##$ASSWID= 0
##$AUNMP= <proc_1d>
##$AZFE= 0.1
##$AZFW= 0.1
##$BCFW= 0
##$BC_mod= 0
##$BYTORDP= 0
##$COROFFS= 0
##$CY= 12.5
##$DATMOD= 1
##$DC= 0
##$DFILT= <>
##$DTYPP= 0
##$F1P= 14.0000005364418
##$F2P= -0.99999901652339
##$FCOR= 0.5
##$FTSIZE= 32768
##$FT_mod= 6
##$GAMMA= 0
##$GB= 0
##$INTBC= 1
##$INTSCL= 1
##$ISEN= 128
##$LB= 0.3
##$LEV0= 0
##$LPBIN= 0
##$MAXI= 10000
##$MC2= 0
##$MEAN= 0
##$ME_mod= 0
##$MI= 0
##$NCOEF= 0
##$NC_proc= -5
##$NLEV= 6
##$NOISF1= 0
##$NOISF2= 0
##$NSP= 0
##$NTH_PI= 0
##$NZP= 0
##$OFFSET= 16.522
##$PC= 1
##$PHC0= -67.29328
##$PHC1= 7.762267
##$PH_mod= 1
##$PKNL= yes
##$PPARMOD= 0
##$PSCAL= 4
##$PSIGN= 0
##$REVERSE= no
##$SF= 250.13
##$SI= 32768
##$SIGF1= 0
##$SIGF2= 0
##$SINO= 400
##$SIOLD= 32768
##$SREGLST= <1H.DMSO>
##$SSB= 0
##$STSI= 32768
##$STSR= 0
##$SW_p= 5175.98343685301
##$SYMM= 0
##$S_DEV= 0
##$TDeff= 65536
##$TDoff= 0
##$TI= <Analysis number 999999
Compound Code 99
Book Reference 9
Project Code 9>
##$TILT= no
##$TM1= 0
##$TM2= 0
##$TOPLEV= 0
##$USERP1= <user>
##$USERP2= <user>
##$USERP3= <user>
##$USERP4= <user>
##$USERP5= <user>
##$WDW= 1
##$XDIM= 32768
##$YMAX_p= 473004280
##$YMIN_p= -1048039
$$ End of Bruker specific parameters
$$ ---------------------------------
##NTUPLES= NMR SPECTRUM
##VAR_NAME=  FREQUENCY,     SPECTRUM/REAL,   SPECTRUM/IMAG
##SYMBOL=    X,             R,               I
##VAR_TYPE=  INDEPENDENT,   DEPENDENT,       DEPENDENT
##VAR_FORM=  AFFN,          ASDF,            ASDF
##VAR_DIM=   32768,         32768,           32768
##UNITS=     HZ,            ARBITRARY UNITS, ARBITRARY UNITS
##FACTOR=    0.157963299565203, 1,           1
##FIRST=     4132.6476996994, 0,             0
##LAST=      -1043.33573715361, 0,           0
##MIN=       -1043.33573715361, -1048039,    0
##MAX=       4132.6476996994, 473004280,     0
$$ Real data points
##PAGE= N=1
##DATA TABLE= (X++(R..R)), XYDATA
$$ [...]
$$ plain form
14186 154182 169621 143941 154553 126101 83607 100057 79586 67140 50979 40112 74304
14175 74304 53450 3041 -114018 -106425 -88719 -6138 -3198 41320 -26161 -51923 -9735 25333
14163 25333 7801 2419 7886 65746 61081 36505 67989 46515 -2865 -42022 1061 -56225
14151 -56225 -38199 -7139 -1691 16185 15864 -6457 -95997 -58608 -7703 58855 55370 48937 9327
14138 9327 -46812 -116366 -106416 -86951 -29262 -36421 -74073 -4068 23045 -42327 -121179 -127016
14126 -127016 -55631 9664 -45935 -16838 348 -64465 -159058 -100853 -56866 -30758 -17181
14115 -17181 2275 49543 63950 53199 30316 39590 20812 -7051 26797 -39845 -89679 -37954
14103 -37954 -56613 -88279 -37597 36913 -1840 -44822 -55133 -59457 -39219 24661 6638 9932
$$ packed form
14186A54182J5439k5680J0612k8452m2494J6450k0471j2446j6161j0867L4192
14175G4304k0854n0409j17059P593J7706Q2581K940M4518o7481k5762M2188L5068
14163B5333j7532n382N467N7860m665k4576L1484k1474m9380l9157M3083n7286
14151e6225J8026L1060N448J7876l21k2321q9540L7389N0905O6558l485o433l9610
14138I327n6139o9554R950J9465N7689p159l7652P0005K7113o5372p8852n837
14126a27016P1385O5295n5599K9097J7186o4813r4593N8205M3987K6108J3577
14115a7181J9456M7268J4407j0751k2883R274j8778k7863L3848o6642m9834N1725
14103c7954j8659l1666N0682P4510l8753m2982j0311m324K0238O3880j8023L294
$$ plain form
14091 9932 32352 46055 15886 35916 15608 -28111 -102562 -110476 41453 158951 117135 29757
14079 29757 48584 59604 81571 66693 24408 26664 47726 91152 61193 -43854 -73529 27337
14067 27337 -17161 -49957 -124517 -148279 -120591 -57337 64900 70991 70768 115045 76697 60535
14055 60535 50922 20959 -53356 -11218 20466 -110585 -215357 -173735 -51521 27672 40630
14044 40630 1118 28954 103348 41908 -55297 -115784 -84181 -82271 -34971 14942 34260 59456
14032 59456 68959 103743 65519 45909 74532 170735 26804 31023 14165 -43381 30113 104978
14020 104978 59893 26021 54933 -1373 -15304 -12944 -26514 -65303 -42181 6841 -7465 -4135
14008 -4135 -31083 -50628 -74487 -50984 8815 12158 50361 33058 46871 3919 -97204 -71546
$$ packed form
14091I932K2420J3703l0169K0030k0308m3719p4451p914J51929J17498m1816q7378
14079B9757J8827J1020K1967j4878m2285K256K1062M3426k9959j05047k9675J00866
14067B7337m4498l2796p4560k3762K7688O3254J22237O091k23M4277l8348j6162
14055F0535r613k9963p4315M2138L1684j31051j04772M1622J22214P9193J2958
14044D0630l9512K7836P4394o1440r7205o0487L1603J910M7300M9913J9318K5196
14032E9456R503L4784l8224j9610K8623R6203j43931M219j6858n7546P3494P4865
14020A04978m5085l3872K8912n6306j3931K360j3570l8789K3122M9022j4306L330
14008d135k6948j9545k3859K3503N9799L343L8203j7303J3813m2952j01123K5658
$$ plain form
13996 -71546 -68496 -20318 -36585 -50591 -67243 -9702 257 -968 64195 49533 -53015 -87959
13984 -87959 -71928 -37325 7854 -12973 -120194 -175691 -146510 -164795 -184599 -188473 -100680 -5344
13972 -5344 -4040 35984 -20950 -66590 -61534 -72874 -108026 -128084 -131033 -26756 74849 107837
13960 107837 126258 142218 114218 59929 69299 21476 33823 17457 -5645 -41380 -63510 -39934
13948 -39934 -55850 1799 67427 84377 115573 80965 67959 61482 69613 38032 -2610 -38225
13936 -38225 -31228 15080 67214 -18782 -106724 -69017 -15684 35970 94821 91742 52175 28989
13924 28989 42223 61472 23621 -32451 -14881 -42024 -19888 46034 44724 -36669 -40746 -10331
13912 -10331 9448 10577 61466 8456 -20828 21814 57670 84204 53447 -53924 -37914 -36964
$$ packed form
13996g1546L050M8178j6267j4006j6652N7541R959j225O5163j4662j02548l4944
13984h7959J6031L4603M5179k0827j07221n5497K9181j8285j9804l874Q7793R5336
13972e344J304M0024n6934m5640N056j1340l5152k0058k949J04277J01605L2988
13960A07837J8421J5960k8000n4289R370m7823J2347j6366k3102l5735k2130K3576
13948c9934j5916N7649O5628J6950L1196l4608j3006o477Q131l1581m0642l5615
13936c8225O997M6308N2134q5996q7942L7707N3333N1654N8851l079l9567k3186
13924B8989J3234J9249l7851n6072J7570k7143K2136O5922j310q1393m077L0415
13912a0331J9779J129N0889n3010k9284M2642L5856K6534l0757j07371J6010R50
$$ plain form
13900 -36964 -78075 -98002 -60889 34608 65450 88506 53593 33729 16416 44350 53423 52254
13888 52254 57979 21714 -6407 18064 -63184 -110644 -112263 -96439 -57086 55521 97641 106493
13876 106493 109782 87131 -30797 -116273 2347 49056 92882 112941 92224 52548 68692
13865 68692 96675 66807 55145 -45767 -140359 -103577 -63607 -6164 -14091 10172 69320 32159
13853 32159 -59952 -24212 34075 88846 94303 50676 -25732 -40890 -64428 -49789 -12800 67540
13841 67540 163478 191025 169789 72720 19436 35965 -19736 -77589 -71549 -61038 -52390 -28021
13829 -28021 24319 40133 -19257 -85052 -134201 -158567 -143803 -133440 -110658 -27307 17952 -46716
13817 -46716 -60771 -85070 -116049 -160679 -192745 -120511 -63030 -137785 -149465 -113580 -81216 -32654
$$ packed form
13900c6964m1111j9927L7113R5497L0842K3056l4913j9864j7313K7934R073j169
13888E2254N725l6265k8121K4471q1248m7460j619J5824L9353J12607M2120Q852
13876A06493L289k2651j17928q5476J18620M6709M3826K0059k0717l9676J6144
13865F8692K7983k9868j1662j00912r4592L6782L9970N7443p927K4263N9148l7161
13853C2159r2111L5740N8287N4771N457m3627p6408j5158k3538J4639L6989Q0340
13841F7540R5938K7547k1236r7069n3284J6529n5701n7853O040J0511Q648K4369
13829b8021N2340J5814n9390o5795m9149k4366J4764J0363K2782Q3351M5259o4668
13817d6716j4055k4299l0979m4630l2066P2234N7481p4755j1680L5885L2364M8562
$$ plain form
13805 -32654 -3602 27351 -61979 -98862 -92889 -88162 -67683 -11316 -32669 -1521 57426 107018
13793 107018 166776 213138 98407 -22224 21983 113806 149660 175532 132388 61209 33972
13782 33972 78026 -44688 -79125 -41816 -69943 -60278 28375 57849 36581 90315 50173 -17147
13770 -17147 -126501 -124898 -79303 -49592 65265 128174 63426 -21251 -115786 -123574 -123082 -115334
13758 -115334 -70878 -95105 -73053 6965 58408 46561 17348 -38711 -81061 -70380 -98343
13747 -98343 -89444 -63437 42957 21217 -6555 15571 41158 51717 8764 -91533 -97086 -8473
13735 -8473 -22594 -15619 -30718 -15394 12219 -33236 -65646 -68309 -37396 -4732 -11117 -41417
13723 -41417 -59538 -71827 -66298 13973 58702 109160 43293 57671 35243 47301 48189 62422
$$ packed form
13805c2654K9052L0953q9330l6883N973M727K0479N6367k1353L1148N8947M9592
13793A07018N9758M6362j14731j20631M4207R1823L5854K5872m3144p1179k7237
13782C3972M4054j22714l4437L7309k8127R665Q8653K9474k1268N3734m0142o7320
13770a7147j09354J603M5595K9711J14857O2909o4748q4677r4535p788M92P748
13758a15334M4456k4227K2052Q0018N1443j1847k9213n6059m2350J0681k7963
13747i8343Q899K6007J06394k1740k7772K2126K5587J0559m2953j00297n553Q8613
13735h473j4121O975j5099J5324K7613m5455l2410k663L0913L2664o385l0300
13723d1417j8121j2289N529Q0271M4729N0458o5867J4378k2428J2058Q88J4233
$$ plain form
13711 62422 32942 -338 13663 43718 -9016 -73716 -73911 -36392 12579 32065 121336 138166
13699 138166 109374 47039 12705 -9835 -29816 25535 82325 49923 -10757 -83573 -106170
13688 -106170 -134763 -116791 -126509 -147420 -116996 -29265 -35866 -70006 -81407 -73323 -72951 -67179 -47530
13675 -47530 -41176 35587 84293 55308 -27141 6299 39390 -40 -43882 -2214 -3533 -20325
13663 -20325 7894 75490 114113 -31135 -101290 -41943 -30207 -67321 -88483 -69013 40115
13652 40115 88740 110003 143034 102564 -6115 30859 125794 174649 111396 8946 -4115
13641 -4115 -8506 -89023 -140819 -42858 -11531 -64532 -85292 -57193 -11069 -5958 19863 59984
13629 59984 109734 167818 125744 27335 30823 -41082 38489 104790 105760 -3698 -58251 -16079
$$ packed form
13711F2422k9480l3280J4001L0055n2734o4700j95L7519M8971J9486Q9271J6830
13699A38166k8792o2335l4334k2540j9981N5351N6790l2402o0680p2816k2597
13688a06170k8593J7972r718k0911L0424Q7731o601l4140j1401Q084L72N772J9649
13675d7530O354P6763M8706k8985q2449L3440L3091l9430m3842M1668j319j6792
13663b0325K8219O7596L8623j45248p0155N9347J1736l7114k1162J9470J09128
13652D0115M8625K1263L3031m0470j08679L6974R4935M8855o3253j02450j3061
13641d115m391q0517n1796R7961L1327n3001k0760K8099M6124N111K5821M0121
13629E9984M9750N8084m2074r8409L488p1905P9571O6301R70j09458n4553M2172
$$ plain form
13617 -16079 -102101 -88321 -5427 -198 -66297 -40853 14128 35635 -23293 -112966 -82170 -12768
13605 -12768 -40623 -48397 685 229 -56694 14646 44202 41806 -18162 468 -4710 -28958 -34384
13592 -34384 6409 28010 -11756 -78522 -76804 -27286 11494 -8028 1893 15836 4691 14587
13580 14587 18968 52830 92580 156723 177295 107335 41941 43608 32274 -47472 -41825 -20884
13568 -20884 -86545 -120291 -59947 -14353 -6976 37682 68511 11758 -35144 12128 -18475 -53085
13556 -53085 -24207 33972 14524 -71034 -173894 -236627 -179914 -144662 -61025 -16690 -4827
13545 -4827 -4148 51446 107422 63105 -45346 -55278 31055 37088 -15441 -81895 -8273 17215
13533 17215 -49674 -82399 -81684 -120875 -151212 -93612 -30014 -11838 -96679 -67267 60857 142263
$$ packed form
13617a6079q6022J3780Q2894N229o6099K5444N4981K1507n8928q9673L0796O9402
13605a2768k7855p774M9082m56n6923P1340K9556k396n9968J8630n178k4248n426
13592c4384M0793K1601l9766o6766J718M9518L8780j9522R921J3943j1145R896
13580A4587M381L3862L9750O4143K0572o9960o5394J667j1334p9746N647K0941
13568b0884o5661l3746O0344M5594P377M4658L0829n6753m6902M7272l0603l4610
13556e3085K8878N8179j9448q5558j02860o2733N6713L5252Q3637M4335J1863
13545d827O79N5594N5976m4317j08451r932Q6333O033n2529o6454P3622K5488
13533A7215o6889l2725P15l9191l0337N7600O3598J8176q4841K9412J28124Q1406
$$ plain form
13521 142263 86560 49858 6538 -43444 -45352 -6164 -9580 22143 37632 90036 90631 45363
13509 45363 -16375 -86694 -48317 41776 19562 -73593 -58358 -30639 30438 68124 105625 -53637
13497 -53637 -91130 -66245 -33935 7114 17207 22641 34662 38510 50564 23305 6075 -17209
13485 -17209 -22977 22774 -39231 -56976 -17205 22905 -33927 -13991 40204 -9051 -41571 1021
13473 1021 -4197 13340 6128 -16849 -33193 -32812 38228 56493 29481 -9820 -33705 -51384 -1907
13460 -1907 57804 35622 -49440 -86319 -42480 24949 77414 42149 17182 32274 16640 -27515
13448 -27515 11613 34294 43165 43527 42954 74466 89369 6038 -23312 -33364 -107062 -96225 -8204
13435 -8204 -10498 -11808 50219 69625 -40798 -96120 7859 98078 97587 69941 4159 -89568
$$ packed form
13521A42263n5703l6702m3320m9982j908L9188l416L1723J5489N2404N95m5268
13509D5363o1738p0319L8377R0093k2214r3155J5235K7719O1077L7686L7501j59262
13497e3637l7493K4885L2310M1049J0093N434J2021L848J2054k7259j7230k3284
13485a7209n768M5751o2005j7745L9771M0110n6832J9936N4195m9255l2520M2592
13473A021n218J7537p212k2977j6344L81P1040J8265k7012l9301k3885j7679M9477
13460a907N9711k2182q5062l6879M3839O7429N2465l5265k4967J5092j5634m4155
13448b7515L9128K2681Q871L62n73L1512J4903q3331k9350j0052p3698J0837Q8021
13435h204k294j310O2027J9406j10423n5322J03979R0219m91k7646o5782r3727
$$ plain form
13423 -89568 -104314 -61687 -68100 -98680 -70948 -42751 -38547 -26611 41081 108683 130927 152545
13411 152545 160966 108768 60723 16502 3678 19209 -30322 -86931 -35535 -1121 32855 -20698
13399 -20698 -55314 -48348 -59766 -25474 -21553 71328 50705 54939 -25845 -47671 -37919 -8493
13387 -8493 -37927 -33016 30058 -17016 -33218 17461 21787 -2038 -47766 -12329 17477 -2276
13375 -2276 1867 3484 19613 -98711 -151425 -115813 -109600 -113298 -52069 -20872 -13412 -46451 -102688
13362 -102688 -135882 -136976 -81475 -106944 -117888 -169754 -110749 -41048 -25689 -18181 44198 84877
13350 84877 -29640 -94289 -33597 -11493 3507 20922 -82500 -140369 -45442 -2825 74813
13339 74813 63194 66161 98973 46494 49342 87415 140671 144650 82422 -53007 -64060 -83052
$$ packed form
13423h9568j4746M2627o413l0580K7732K8197M204J1936O7692O7602K2244K1618
13411A52545Q421n2198m8045m4221j2824J5531m9531n6609N1396L4414L3976n3553
13399b0698l4616O966j1418L4292L921R2881k0623M234q0784k1826R752K9426
13387h493k9434M911O3074m7074j6202N0679M326k3825m5728L5437K9806j9753
13375b276M143J617J6129j18324n2714L5612O213l698O1229L1197P460l3039n6237
13362a02688l3194j094N5501k5469j0944n1866N9005O9701J5359P508O2379M0679
13350H4877j14517o4649O0692K2104J5000J7415j03422n7869R4927M2617P7638
13339G4813j1619K967L2812n2479K848L8073N3256L979o2228j35429j1053j8992
$$ plain form
13327 -83052 -89352 -131187 -135048 -142803 -79692 -38756 -26280 32405 85104 89979 14291 -25283
13315 -25283 -44353 -100805 -8701 71529 22709 -12667 -32648 -21981 -21779 31924 37519 699
13303 699 -52185 -33529 -11920 16652 33384 117175 147304 166391 74211 -44542 -64787 -16416
13291 -16416 -33943 -5407 39947 -32314 -25114 17997 10844 -47293 -72893 -45494 11241 41166
13279 41166 62402 21254 -67855 -68856 -26915 42276 52557 112564 154274 110162 49301 18752
13267 18752 -20672 -56630 -91160 -5704 145158 144307 59746 -60075 -66814 -94549 -61568 -1153
13255 -1153 57493 62476 36647 28953 1419 -19144 -62020 -63566 -7689 76002 110334 102854 93711
13242 93711 62764 5981 -12768 54436 157520 177678 121336 101535 136612 107293 17528
$$ packed form
13327h3052o300m1835l861p755O3111M0936J2476N8685N2699M875p5688l9574
13315b5283j9070n6452R2104Q0230m8820l5376j9981J0667K02N3703N595l6820
13303F99n2884J8656K1609K8572J6732Q3791L0129J9087r2180j18753k0245M8371
13291a6416j7527K8536M5354p2261P200M3111p153n8137k5600K7399N6735K9925
13279D1166K1236m1148q9109j001M1941O9191J0281O0007M1710m4112o0861l0549
13267A8752l9424l5958l4530Q5456J50862q51q4561j19821o739k7735L2981O0415
13255a153N8646M983k5829p694k7534k0563m2876j546N5877Q3691L4332p480r143
13242I3711l0947n6783j8749O7204J03084K0158n6342j9801L5077k9319q9765
$$ plain form
13231 17528 -67044 -62205 9139 98891 65728 -5202 -55071 -102438 -117875 -31910 -3825 -81867
13219 -81867 -103364 -1099 78130 69455 90320 81793 -13294 -68992 -53012 -49500 -77973 -30993
13207 -30993 4381 10179 -20391 -102079 -61696 18591 13424 57415 13376 11444 1750 -95210
13195 -95210 -71045 -29084 -51639 -82584 -108243 -29890 11808 -29266 -29396 -20625 29836 18890
13183 18890 27624 73634 45397 14719 53035 113972 62373 -33736 -116686 -114087 3571 11076
13171 11076 -10006 33411 51299 9778 -18595 -2403 26799 -67047 -79570 -118057 -79900 -59893
13159 -59893 -56038 -26941 -74084 -109382 -124327 -137163 -117521 -93417 -128535 -132799 -124159 -32881
13147 -32881 26513 4418 -43099 -99520 -56838 -31061 -36638 -111027 -130232 -78524 -20471 -17373
$$ packed form
13231A7528q4572M839P1344Q9752l3163p0930m9869m7367j5437Q5965K8085p8042
13219h1867k1497J02265P9229q675K0865q527r5087n5698J5980L512k8473M6980
13207c0993L5374N798l0570q1688M0383Q0287n167M3991m4039j932r694r6960
13195i5210K4165M1961k2555l0945k5659P8353M1698m1074j30Q771N0461j0946
13183A8890Q734M6010k8237l0678L8316O0937n1599r6109q2950K599J17658P505
13171A1076k1082M3417J7888m1521k8373J6192K9202r3846j2523l8487L8157K0007
13159e9893L855K9097m7143l5298j4945j2836J9642K4104l5118m264Q640R1278
13147c2881N9394k2095m7517n6421M2682K5777n577p4389j9205N1708N8053L098
$$ plain form
13135 -17373 -11576 50327 42438 -35188 11091 51149 81781 28155 -22753 -27547 -47927 -100255
13123 -100255 -134927 -66641 -28992 -8380 -50797 -104653 -4181 20735 697 13992 60093
13112 60093 59990 -41301 -40817 -18756 -101615 -86057 25022 36313 26528 526 -6960 29558
13100 29558 23128 -10837 33323 21911 -39001 -3751 12366 17384 5935 -26266 -57533 11868
13088 11868 70986 73839 74998 57384 36045 -50330 -119587 -87087 -33678 17281 79067 58664
13076 58664 50119 38819 72583 71370 2023 -47495 -91548 -147363 -150266 -123395 -90715 -34102
13064 -34102 31786 19794 -82399 -29883 8238 -24574 -123777 -137416 -30557 -81643 -95125
13053 -95125 -118033 -126553 -44775 22062 6001 10562 -30526 -76346 -90798 -87749 -94502 -114411
$$ packed form
13135a7373N797O1903p889p7626M6279M0058L0632n3626n0908m794k0380n2328
13123a00255l4672O8286L7649K0612m2417n3856J00472K4916k0038J3295M6101
13112F0093j03j01291M84K2061q2859J5558J11079J1291r785k6002p486L6518
13100B9558o430l3965M4160j1412o0912L5250J6117N018j1449l2201l1267O9401
13088A1868N9118K853J159j7614k1339q6375o9257L2500N3409N0959O1786k0403
13076E8664q545j1300L3764j213o9347m9518m4053n5815k903K6871L2680N6613
13064c4102O5888j1992j02193N2516L8121l2812r9203j3639J06859n1086j3482
13053i5125k2908q520Q1778O6837j6061M561m1088m5820j4452L049o753j9909
$$ plain form
13041 -114411 -97858 -49455 2764 25399 65728 39769 -782 -59546 -112094 -46672 -27486
13030 -27486 -22887 -37542 -75267 -80810 -76023 -16229 3249 33046 22860 40149 60020 69290
13018 69290 -37501 -10308 23160 59414 141683 102082 28058 45014 26570 -32880 -82780
13007 -82780 -27717 21650 635 -9639 -32085 -12342 12755 -10240 -41256 -118286 -155912 -83910
12995 -83910 -18250 55056 39683 70346 49122 -11279 -27035 50626 78504 42664 37854 -13327
12983 -13327 5288 15588 -20069 -23957 41811 107135 102000 148995 183018 139254 95331 41012
12971 41012 59664 25800 49478 29969 24190 -8940 -38047 10619 15124 -26609 -17678 10969
12959 10969 5342 106764 154186 137294 58482 34169 93111 27041 26843 76712 87990 49785
$$ packed form
13041a14411J6553M8403N2219K2635M0329k5959m0551n8764n2548O5422J9186
13030b7486M599j4655l7725n543M787N9794J9478K9797j0186J7289J9871R270
13018F9290j06791K7193L3468L6254Q2269l9601p4024J6956j8444n9450m9900
13007h2780N5063M9367k1015j0274k2446J9743K5097k2995l1016p7030l7626P2002
12995h3910O5660P3306j5373L0663k1224o0401j5756P7661K7878l5840m810n1181
12983a3327J8615J0300l5657l888O5768O5324n135M6995L4023m3764m3923n4319
12971D1012J8652l3864K3678j9509n779l3130k9107M8666M505m1733Q931K8647
12959A0969n627J01422M7422j6892p8812k4313N8942o6070j98M9869J1278l8205
$$ plain form
12947 49785 30734 49162 46241 103310 77396 100475 62979 -26463 -53543 -77951 -78365 27582
12935 27582 90389 111884 94842 64092 12756 29039 878 -55920 -26393 19874 33531 75661
12923 75661 73536 -9236 -83538 -121516 -136303 -81854 2179 87400 88815 49607 47578 93713
12911 93713 46336 57962 120913 94214 95503 186273 119728 60643 90835 133251 89893 122772
12899 122772 58248 -37660 -78840 -79000 -67442 -104777 -67811 -1229 79328 148516 138079 118869
12887 118869 107622 75379 99877 17192 -56696 -15337 -60227 -77768 27770 96766 123051
12876 123051 116200 61356 22463 42237 20282 13475 21486 23829 -14109 38091 33466 -3036
12864 -3036 -63519 -77640 -27685 15578 60672 -3184 -20270 -21969 810 -3635 -16682 39970
$$ packed form
12947D9785j9051J8428k921N7069k5914K3079l7496q9442k7080k4408m14J05947
12935B7582O2807K1495j7042l0750n1336J6283k8161n6798K9527M6267J3657M2130
12923G5661k125q2772p4302l7978j4787N4449Q4033Q5221J415l9208k029M6135
12911I3713m7377J1626O2951k6699J289R0770o6545n9085L0192M2416m3358L2879
12899A22772o4524r5908m1180j60J1558l7335L6966O6582Q0557O9188j0437j9210
12887A18869j1247l2243K4498q2685p3888M1359m4890j7541J05538O8996K6285
12876A23051o851n4844l8893J9774k1955o807Q011K343l7938N2200m625l6502
12864c036o0483j4121M9955M3263M5094o3856j7086j699K2779m445j3047N6652
$$ plain form
12852 39970 9388 -1446 36611 -43628 -85400 -43408 -50000 -82069 -58570 -44374 2561 75871
12840 75871 34244 35057 -4429 38083 -3202 -20659 34106 68081 59654 -14086 14884 90477
12828 90477 86738 102133 108967 146343 174103 81676 -44300 -99739 -35447 9483 3134 -46282
12816 -46282 -58859 -64719 -79189 -105817 -53382 -53598 -103139 -63577 -71458 -52694 -40379 -83935
12804 -83935 -29210 -55813 -11250 41461 75113 51743 -77586 -60174 -14812 8547 27509
12793 27509 9299 17300 65868 42604 -23676 -116334 -79218 -6216 -54013 -83023 -60775 -31316
12781 -31316 -143717 -152838 -91775 24196 22053 -10318 -23582 -40333 -103108 -91625 -2835 38854
12769 38854 66318 71502 8853 -33083 -101857 -96583 -62321 -81428 -65722 -44235 -31599 -85476
$$ packed form
12852C9970l0582j0834L8057q0239m1772M1992o592l2069K3499J4196M6935P3310
12840G5871m1627Q13l9486M2512m1285j7457N4765L3975q427p3740K8970P5593
12828I0477l739J5395O834L7376K7760r2427j25976n5439O4292M4930o349m9416
12816d6282j2577n860j4470k6628N2435k16m9541L9562p881J8764J2315m3556
12804h3935N4725k6603M4563N2711L3652k3370j29329J7412M5362K3359J8962
12793B7509j8210Q001M8568k3264o6280r2658L7116P3002m7797k9010K2248K9459
12781c1316j12401r121O1063J15971k143l2371j3264j6751o2775J1483Q8790M1689
12769C8854K7464N184o2649m1936o8774N274L4262j9107J5706K1487J2636n3877
$$ plain form
12757 -85476 -151370 -84660 -63406 -80479 -92064 -86115 -85332 -121411 -93699 -36913 -30288 -94494
12745 -94494 -82220 -36431 31930 87001 35722 -23361 -4395 -50992 -35403 -694 -53770 -75602
12733 -75602 -92850 -116999 -79292 -19370 -2968 -1014 -17523 -16143 19619 56389 49729 6318
12721 6318 -47309 10457 67523 8972 1183 -16887 22733 27715 -52650 -136994 -123102 -89329
12709 -89329 -59147 -34165 -41169 -71049 -38626 7844 36450 -52138 -100419 -92804 -60974 -9391
12697 -9391 4985 34530 81641 141521 46553 4221 42351 7787 -14628 -70027 -82975 -12401
12685 -12401 33973 13522 11640 -28872 -107767 -72036 5006 46283 53882 38587 29705 -5072
12673 -5072 -27808 -11485 -13852 -64276 -69656 387 -6099 -27967 -74704 -58419 -76086 -101431
$$ packed form
12757h5476o5894O6710K1254j7073j1585N949P83l6079K7712N6786O625o4206
12745i4494J2274M5789O8361N5071n1279n9083J8966m6597J5589L4709n3076k1832
12733g5602j7248k4149L7707N9922J6402J954j6509J380L5762L6770o660m3411
12721F318n3627N7766N7066n8551p789j8070L9620M982q0365q4344J3892L3773
12709h9329L0182K4982p004k9880L2423M6470K8606q8588m8281P615L1830N1583
12697i391J4376K9545M7111N9880r4968m2332L8130l4564k2415n5399j2948P0574
12685a2401M6374k0451j882m0512p8895L5731P7042M1277P599j5295q882l4777
12673e072k2736J6323k367n0424n380P0043o486k1868m6737J6285j7667k5345
$$ plain form
12661 -101431 -76528 -101047 -16697 88917 91856 54135 44414 -6649 -9710 4789 75860 20651
12649 20651 -73726 -17475 -33994 -148468 -83439 -10232 21013 87456 109779 48011 5210
12638 5210 40138 84407 74847 123768 79857 32569 -6206 -24031 -42798 -7370 -33960 -73447
12626 -73447 -58957 15545 36497 108141 156570 203313 200238 146717 69729 71900 83075 62701
12614 62701 25219 -66706 -145058 -125794 -59342 12707 42463 -40224 -104919 -81724 -18415 -33016
12602 -33016 42657 65531 6516 -20292 -58563 -30928 3604 -571 55662 -10937 -64792 -47089
12590 -47089 -55098 -47507 -77090 -92299 -54779 -8937 10904 27510 45871 15116 -721 -1538
12578 -1538 -44388 -7611 -34008 -82545 -36828 -87103 -124859 -108829 -117608 -110302 -38269 -23264
$$ packed form
12661a01431K4903k4519Q4350J05614K939l7721r721n1063l061J4499P1071n5209
12649B0651r4377N6251j6519j14474O5029P3207L1245O6443K2323o1768m2801
12638E210L4928M4269r560M8921m3911m7288l8775j7825j8767L5428k6590l9487
12626g3447J4490P4502K0952P1644M8429M6743l075n3521p6988K171J1175k0374
12614F2701l7482r1925p8352J9264O6452P2049K9756q2687o4695K3195O3309j4601
12602c3016P5673K2874n9015k6808l8271K7635L4532m175N6233o6599n3855J7703
12590d7089q009P591k9583j5209L7520M5842J9841J6606J8361l0755j5837q17
12578a538m2850L6777k6397m8537M5717n0275l7756J6030q779P306P2033J5005
$$ plain form
12566 -23264 26932 12 -23049 -53073 -65103 -80708 -75303 -76336 -90519 -26288 -18611 -5555
12554 -5555 -9688 -13931 -16467 11108 21964 11292 -122052 -133355 -7426 -9867 -163723 -174421
12542 -174421 -107909 -98295 -90973 -31017 -24153 -95997 -148011 -100754 -111085 -116005 -94672 -47748
12530 -47748 -30627 17625 18676 -1432 -55477 -91785 -88743 -55706 -75439 -928 46803 76476
12518 76476 91865 70167 15453 36591 23758 480 -71761 -65647 -50652 -36911 -60632 -125554
12506 -125554 -131186 -144102 -107387 -51403 -1085 24804 45668 -18468 -3743 19313 -27339 -12752
12494 -12752 -50611 -32808 -45280 -24933 1932 -2275 -7571 -3213 -1343 20027 -24659 -70098
12482 -70098 -73680 -123584 -106530 -76970 5642 -63001 -79218 -56041 -26385 24431 16031 -25505
$$ packed form
12566b3264N0196k6920k3061l0024j2030j5605N405j033j4183O4231P677J3056
12554e555m133m243k536K7575J0856j0672j33344j1303J25929k441j53856j0698
12542a74421O6512R614P322N9956O864p1844n2014M7257j0331m920K1333M6924
12530d7748J7121M8252J051k0108n4045l6308L042L3037j9733P4511M7731K9673
12518G6476J5389k1698n4714K1138j2833k3278p2241O114J4995J3741k3721o4922
12506a25554n632j2916L6715N5984N0318K5889K0864o4136J4725K3056m6652J4587
12494a2752l7859J7803j2472K0347K6865m207n296M358J870K1370m4686m5439
12482g0098l582m9904J7054K9560Q2612o8643j6217K3177K9656N0816q400m1536
$$ plain form
12470 -25505 -22472 13576 -11921 -29037 -21057 -20002 -37552 -17970 -17351 -51451 -29100 -3564 26076
12457 26076 39424 -14331 -74938 -72615 -26546 -33704 -57706 -94358 -117626 -120794 -104323 -133434
12445 -133434 -72622 27004 28691 32836 46928 59167 -24481 -72548 -24623 1758 -821 14889
12433 14889 -36556 -16608 6688 120347 163729 159159 97462 44539 -3347 -32902 -73410 -45378
12421 -45378 -18609 -63842 -57913 17137 -72937 -83326 9437 21369 32534 50905 -8855 -67791
12409 -67791 -43994 -49294 -76526 -103887 -144808 -120490 -115746 -101545 -71745 -111920 -124316 -38607
12397 -38607 7014 14055 -50879 -24568 -21573 -57533 -71226 -52619 4615 54588 99212 120921
12385 120921 115578 70217 61503 -3573 -18115 -50456 -89344 -100171 -104920 -73037 -51918 -18473
$$ packed form
12470b5505L033L6048k5497j7116P980J055j7550J9582O19l4100K2351K5536K9640
12457B6076J3348n3755o0607K323M6069p158k4002l6652k3268l168J6471k9111
12445a33434O0812R9626J687M145J4092J2239q3648m8067M7925K6381k579J5710
12433A4889n1445J9948K3296J13659M3382m570o1697n2923m7886k9555m0508K8032
12421d5378K6769m5233N929P5050r0074j0389R2763J1932J1165J8371n9760n8936
12409f7791K3797n300k7232k7361m0921K4318M744J4201K9800m0175j2396Q5709
12397c8607M5621P041o4934K6311K995l5960j3693J8607N7234M9973M4624K1709
12385A20921n343m5361q714o5076j4542l2341l8888j0827m749L1883K1119L3445
$$ plain form
12373 -18473 10726 4978 -18997 17227 24037 15368 25865 8113 35689 -10235 -48681 -40697
12361 -40697 -57207 -57218 34454 102325 85076 3821 -29547 23506 2165 -76347 -111762 -39406
12349 -39406 -43109 -47076 -34132 -48473 14041 75353 40887 -52227 -21055 -10617 2588 12307
12337 12307 27793 28064 82734 129786 97864 94557 4876 8954 16187 3506 -41686 -49703 -5670
12324 -5670 87806 51278 -71033 -167508 -164786 -156188 -55995 22300 15797 35962 122942 170735
12312 170735 155245 100675 73914 68465 90822 96220 39398 26483 67703 129158 181376 140798
12300 140798 166471 195981 106654 24775 5244 10189 -78756 -98898 -17441 33726 110787 119178
12288 119178 54584 -36063 -78147 -17409 74611 8566 -7354 51116 83851 57867 17574
$$ packed form
12373a8473K9199n748k3975L6224O810q669J0497j7752K7576m5924l8446P984
12361d0697j6510j1R1672O7871j7249q1255l3368N3053k1341p8512l5415P2356
12349c9406l703l967J2944j4341O2514O1312l4466r3114L1172J0438J3205R719
12337A2307J5486K71N4670M7052l1922l307q9681M078P233j2681m5192q017M4033
12324e670R3476l6528j22311r6475K722Q598J00193P8295o503K0165Q6980M7793
12312A70735j5490n4570k6761n449K2357N398n6822j2915M1220O1455N2218m0578
12300A40798K5673K9510q9327q1879j9531M945q8945k0142Q1457N1167P7061Q391
12288A19178o4594r0647m2084O0738R2020o6045j5920N8470L2735k5984m0293
$$ plain form
12277 17574 30211 92317 172569 180501 144374 110947 120638 118901 79096 61242 64940 55160 66770
12264 66770 51942 27136 40821 90318 184748 112762 -11814 -25 29551 55175 83267
12253 83267 86263 64516 103382 76601 102705 107379 83708 41136 44295 168161 162171 133356
12241 133356 107285 166077 138659 137254 148979 95664 51460 75515 113545 50131 95052 87299
12229 87299 34177 33465 50774 147744 195301 192693 117174 115751 125776 142908 150563 215975 236338
12216 236338 189289 134522 71570 101188 102893 46495 26320 41323 116078 190191 164867 170154
12204 170154 170661 163044 73867 69531 17353 50003 61155 124700 163070 220895 259910 267307
12192 267307 215258 158902 150155 154043 164444 238924 258201 298869 305164 290336 317931 349269
$$ packed form
12277A7574J2637O2106Q0252P932l6127l3427R691j737l9805j7854L698r780J1610
12264F6770j4828k4806J3685M9497R4430p1986j24576J1789K9576K5624K8092
12253H3267K996k1747L8866k6781K6104M674k3671m2572L159J23866n990k8815
12241A33356k6071N8792k7418j405J1725n3315m4204K4055L8030o3414M4921p753
12229H7299n3122p12J7309R6970M7557k608p5519j423J0025J7132P655O5412K0363
12216B36338m7049n4767o2952K9618J705n6398k0175J5003P4755P4113k5324N287
12204A70154N07p617q9177m336n2178L2650J1152O3545L8370N7825L9015P397
12192B67307n2049n6356q747L888J0401P4480J9277M0668O295j4828K7595L1338
$$ plain form
12180 349269 276176 161576 177830 193079 163912 147680 151855 232373 239148 142832 58962 52986
12168 52986 72012 130396 212808 162722 93275 25697 50494 58977 53878 -1102 -10920 37420
12156 37420 139861 153485 133495 126428 218684 143179 103397 100320 97443 157011 196592 158980
12144 158980 101370 60621 66044 50328 123851 172650 159566 180018 248672 278051 250929 205305
12132 205305 247515 258941 224298 158461 135460 169410 293468 330166 323428 227098 172378
12121 172378 138612 196770 208192 222883 161938 160891 149673 177982 205729 276218 367040 310457
12109 310457 247376 300876 273862 156948 47781 88075 98093 104991 183800 173547 172026
12098 172026 122665 128360 205243 297631 297254 287634 350163 403338 321597 361161 372063 353556
$$ packed form
12180C49269p3093j14600J6254J5249k9167j6232M175Q0518O775r6316q3870n976
12168E2986J9026N8384Q2412n0086o9447o7578K4797Q483n099n4980r818M8340
12156C7420J02441J3624j9990p067R2256p5505l9782l077k877N9568L9581l7612
12144A58980n7610m0749N423j5716P3523M8799j3084K0452O8654K9379k7122m5624
12132B05305M2210J1426l4643o5837k3001L3950J24058L6698o738r6330n4720
12121A72378l3766N8158J1422J4691o0945j047j1218K8309K7747P0489R0822n6583
12109C10457o3081N3500k7014j16914j09167M0294J0018O898P8809j0253j521
12098A72026m9361N695P6883R2388l77r620O2529N3175q1741L9564J0902j8507
$$ plain form
12086 353556 357728 390732 365738 322270 311979 302715 334075 347117 363012 361095 320878 245101
12074 245101 324487 419310 401242 368881 371339 274202 251670 248482 276458 289785 324990 423514
12062 423514 407625 397299 401268 367522 371863 401660 402379 384622 407218 414721 444909 427873
12050 427873 385965 418898 482547 441772 458326 534309 566247 531427 521020 487451 585609
12039 585609 602859 559948 593538 555935 555528 556519 547334 597818 618683 673887 716566 657313
12027 657313 670284 787110 783934 777182 742675 828695 871107 925352 946747 945413 915016 854440
12015 854440 813770 876941 950936 969867 982743 1006350 994620 1034016 1156654 1197705 1204003
12004 1204003 1312898 1443305 1405038 1424232 1466941 1558393 1692428 1820931 1982076 2152647
$$ packed form
12086C53556M172L3004k4994m3468j0291r264L1360J3042J5895j917m0217p5777
12074B45101P9386R4823j8068l2361K458r7137k2532l188K7976J3327L5205R8524
12062D23514j5889j0326L969l3746M341K9797P19j7757K2596P503L0188j7036
12050D27873m1908L2933O3649m0775J6554P5983L1938l4820j0407l3569R8158
12039E85609J7250m2911L3590l7603m07R91r185N0484K0865N5204M2679n9253
12027F57313J2971J16826l176o752l4507Q6020M2412N4245K1395j334l0397o0576
12015H54440m0670O3171P3995J8931J2876K3607j1730L9396J22638M1051O298
12004A204003J08895J30407l8267J9194M2709R1452J34035J28503J61145J70571
$$ plain form
11994 2152647 2292245 2358552 2480307 2474350 2337499 2175352 2067892 2033920 2009491 2016224 1923025
11983 1923025 1888036 1904189 1982443 1995791 2085660 2099955 2123161 2204354 2303800 2284752 2329209
11972 2329209 2438055 2513601 2527458 2635808 2751437 2856237 2860207 2860921 3034077 3216286 3351129
11961 3351129 3437460 3501762 3589227 3792377 3974042 4123204 4275512 4408611 4541491 4666599
11951 4666599 4867647 5070522 5229233 5405183 5694743 5993520 6288741 6563587 6851732
11942 6851732 7155433 7469189 7862657 8294784 8719505 9170804 9586118 10077849 10676283
11933 10676283 11292261 11917468 12451243 13093016 13796590 14528541 15268495 16048896 16928712
11924 16928712 17880117 18850882 19818027 20791858 21749922 22682142 23631426 24590543 25475322
$$ packed form
11994B152647J39598O6307J21755n957j36851j62147j07460l3972k4429O733r3199
11983A923025l4989J6153P8254J3348Q9869J4295K3206Q1193R9446j9048M4457
11972B329209J08846P5546J3857J08350J15629J04800L970P14J73156J82209J34843
11961C351129Q6331O4302Q7465K03150J81665J49162J52308J33099J32880J25108
11951D666599K01048K02875J58711J75950K89560K98777K95221K74846K88145
11942F851732L03701L13756L93468M32127M24721M51299M15314M91731N98434
11933A0676283O15978O25207N33775O41773P03574P31951P39954P80401Q79816
11924A6928712R51405R70765R67145R73831R58064R32220R49284R59117Q84779
$$ plain form
11915 25475322 26277112 27078009 27770639 28290931 28753959 29007807 29042932 29007491 28751777 28380384
11905 28380384 27930145 27346714 26649581 25851546 24968573 24046730 23084226 22066137 21044661
11896 21044661 20125889 19255686 18414172 17586469 16681893 15809624 15124465 14458761 13698587
11887 13698587 13008592 12427274 11910788 11365449 10753258 10191318 9681981 9179808 8744196
11878 8744196 8440957 8043485 7697902 7437292 7054245 6668685 6438938 6190994 5904310
11869 5904310 5662697 5441857 5210593 5010962 4798199 4613781 4445220 4228574 4102177
11860 4102177 3975502 3796718 3650098 3526006 3378310 3302762 3178608 3034960 2960870 2962409
11850 2962409 2829806 2709047 2547686 2485059 2473349 2461469 2422518 2346738 2244353 2143478
$$ packed form
11915B5475322Q01790Q00897O92630N20292M63028K53848L5125l5441k55714l71393
11905B8380384m50239n83431o97133p98035q82973r21843r62504j018089j021476
11896B1044661r18772q70203q41514q27703r04576q72269o85159o65704p60174
11887A3698587o89995n81318n16486n45339o12191n61940n09337n02173m35612
11878H744196l03239l97472l45583k60610l83047l85560k29747k47944k86684
11869E904310k41613k20840k31264j99631k12763j84418j68561k16646j26397
11860D102177j26675j78784j46620j24092j47696p5548j24154j43648p4090J539
11850B962409j32603j20759j61361o2627j1710j1880l8951p5780j02385j00875
$$ plain form
11840 2143478 2104816 2099505 2020129 1973342 1930226 1901036 1898074 1819435 1754827 1608657 1544893
11829 1544893 1545388 1524976 1428252 1373868 1377032 1353087 1351971 1303582 1293712 1263817 1189159 1247986
11817 1247986 1326540 1242839 1102355 1136722 1065527 1011852 1055451 1001641 898606 865296 987364
11806 987364 1043065 1013743 916654 869078 912726 945756 942713 897795 831932 808836 800947 752756
11794 752756 744884 677480 666474 659996 744020 764232 768556 784072 818211 817936 763289 737078
11782 737078 672427 714475 663060 602796 594749 603572 641374 623540 594781 545877 466513 465521
11770 465521 473260 453757 421300 417551 496459 585881 542461 535242 483168 389916 385578 310530
11758 310530 338343 421116 401552 374662 342892 337989 336291 351368 379909 339972 272104 260998
$$ packed form
11840B143478l8662n311p9376m6787m3116k9190k962p8639o4608j46170o3764
11829A544893M95k0412r6724n4384L164k3945j116m8389r870k9895p4658N8827
11817A247986P8554q3701j40484L4367p1195n3675M3599n3810j03035l3310J22068
11806I87364N5701k9322r7089m7576M3648L3030l043m4918o5863k3096p889m8191
11794G52756p872o7404j1006o478Q4024K0212M324J5516L4139k75n4647k6211
11782G37078o4651M2048n1415o0264q047Q823L7802j7834k8759m8904p9364r92
11770D65521P739j9503l2457l749P8908Q9422m3420p219n2074r3252m338p5048
11758C10530K7813Q2773j9564k6890l1770m903j698J5077K8541l9937o7868j1106
$$ plain form
11746 260998 213167 247075 228434 235522 307731 340585 375825 362246 321807 355966 334848 274809
11734 274809 328827 364003 329239 264408 289264 317378 413875 346555 287399 263266 237736
11723 237736 212426 208163 204340 181535 179973 214976 227782 245800 198505 162461 112832 186487
11711 186487 202372 187039 188633 191936 260288 224372 218075 248710 246444 226645 213974 235507
11699 235507 276017 265824 222479 212362 216114 262704 203500 227049 235405 215348 201654 247511
11687 247511 236682 254154 278596 247381 255634 222773 280454 260406 208800 210647 218477 214128
11675 214128 170283 142811 128138 151376 135952 232393 291830 313159 272794 138757 109506
11664 109506 188533 219535 294057 290174 178152 124407 115643 -4274 -34510 23020 64840
$$ packed form
11746B60998m7831L3908j8641P088P2209L2854L5240j3579m0439L4159k1118o0039
11734B74809N4018L5176l4764o4831K4856K8114R6497o7320n9156k4133k5530
11723B37736k5310m263l823k2805j562L5003J2806J8018m7295l6044m9629P3655
11711A86487J5885j5333J594L303O8352l5916o297L0635k266j9799j2671K1533
11699B35507M0510j0193m3345j0117L752M6590n9204K3549Q356k0057j3694M5857
11687B47511j0829J7472K4442l1215Q253l2861N7681k0048n1606J847P830m349
11675B14128m3845k7472j4673K3238j5424R6441N9437K1329m0365j34037k9251
11664A09506P9027L1002P4522l883j12022n3745q764j19917l0236N7530M1820
$$ plain form
11653 64840 100723 145474 201293 177934 180725 135442 127411 186268 213854 138350 142190 107573
11641 107573 76609 -7659 7988 52551 58934 61545 130423 142294 203635 208692 213940 190255
11629 190255 136507 81412 131451 192607 263468 292751 231819 182596 160560 147452 105625
11618 105625 92879 149062 119929 79277 64176 82361 89305 24143 -12585 -36684 18629 -11576
11606 -11576 -65537 -82134 -41347 12335 65190 58210 105168 148999 108108 24211 41111 65236
11594 65236 39691 66965 85320 62009 -1448 3779 8502 -42233 -60619 -29774 3271 27845
11582 27845 50496 -1113 -23827 -24510 -19254 -90363 -106444 -10609 89986 155196 129048 4514
11570 4514 35359 89589 110867 62438 59135 77708 133368 158487 70337 4977 -18733 -50045
$$ packed form
11653F4840L5883M4751N5819k3359K791m5283q031N8857K7586p5504L840l4617
11641A07573l0964q4268J5647M4563O383K611O8878J1871O1341N057N248k3685
11629A90255n3748n5095N0039O1156P0861K9283o0932m9223k2036j3108m1827
11618A05625j2746N6183k9133m0652j5101J8185O944o5162l6728k4099N5313l0205
11606a1576n3961j6597M0787N3682N2855o980M6958M3831m0891q3897J6900K4125
11594F5236k5545K7274J8355k3311o3457N227M723n0735j8386L0845L3045K4574
11582B7845K2651n1609k2714o83N256p1109j6081R5835J00595O5210k6148j24534
11570D514L0845N4230K1278m8429l303J8573N5660K5119q8150o5360k3710l1312
$$ plain form
11558 -50045 -67398 -55241 21463 2536 -58991 -49464 56858 44652 74925 163076 164618 149272
11546 149272 175872 124220 94751 33346 16569 -6407 -66077 6535 50186 48228 -10231 15138
11534 15138 23968 -29790 -46216 -42275 14828 80597 85818 41463 -67048 -54437 44336 107873
11522 107873 68554 -47677 -45291 -54064 29594 83999 72249 117524 133174 55383 14831 -10646
11510 -10646 46373 100576 90916 108860 97755 103627 122343 58338 33253 14207 3565 116585
11498 116585 126132 48439 44908 18290 -27560 -46284 -21628 -43088 -81195 -39433 28962 80011
11486 80011 108012 84332 32600 61062 17865 -22140 -19331 -66472 -44578 2998 53287 64011
11474 64011 37764 21650 26799 661 29108 -25016 -57326 -56967 -29406 29224 -17174 -53069
$$ packed form
11558e0045j7353J2157P6704j8927o1527R527J06322j2206L0273Q8151J542j5346
11546A49272K6600n1652k9469o1405j6777k2976n9670P2612M3651j958n8459K5369
11534A5138Q830n3758j6426L941N7103O5769N221m4355j08511J2611R8773O3537
11522A07873l9319j16231K386q773Q3658N4405j1750M5275J5650p7791m0552k5477
11510a0646N7019N4203r660J7944j1105N872J8716o4005k5085j9046j0642J13020
11498A16585R547p7693l531k6618m5850j8724K4656k1460l8107M1762O8395N1049
11486H0011K8001k3680n1732K8462m3197m0005K809m7141K1894M7576N0289J0724
11474F4011k6247j6114N149k6138K8447n4124l2310L59K7561N8630m6398l5895
$$ plain form
11462 -53069 -10137 50207 27234 -18479 -42889 13396 -47477 -124444 -119138 -85450 -38644 3301
11450 3301 53506 65355 90997 103687 106470 139598 179691 95687 15106 67022 46670 13834
11438 13834 -42397 5361 66912 66201 52312 160942 211483 111819 -24294 -114533 -89749 -79025
11426 -79025 -103607 -86536 -112015 -82407 -76325 -40263 -5423 -28810 -64524 -73021 -26378 14221
11414 14221 -34308 -59186 -28480 57203 34882 -8509 11967 77 46545 5812 2318 102
11402 102 7249 37982 42809 36153 35442 31458 -55315 -74572 -78186 -108050 -66456 20414 -6522
11389 -6522 -68537 -28841 44602 71932 43739 -18877 -102000 -163761 -160517 -46793 73840 101594
11377 101594 55693 -66338 -124017 -140831 -145491 -46265 -11550 -568 14220 7686 -53497 -39101
$$ packed form
11462e3069M2932O0344k2973m5713k4410N6285o0873p6967N306L3688M6806M1945
11450C301N0205J1849K5642J2690K783L3128M0093q4004q0581N1916k0352l2836
11438A3834n6231M7758O1551p11j3889J08630N0541r9664j36113r0239K4784J0724
11426g9025k4582J7071k5479K9608O082L6062L4840k3387l5714q497M6643M0599
11414A4221m8529k4878L0706Q5683k2321m3391K0476j1890M6468m0733l494k216
11402A02P147L0733M827o656p11l984q6773j9257l614k9864M1594Q6870k6936
11389f522o2015L9696P3443K7330k8193o2616q3123o1761L244J13724J20633K7754
11377A01594m5901j22031n7679j6814m660R9226L4715J0982J4788o534o1183J4396
$$ plain form
11365 -39101 4367 -27916 -63222 -74419 -71196 -140166 -177572 -136685 -169543 -168249 -112745 -79234
11353 -79234 -89172 -92540 -28924 -35083 -75410 -87412 -100462 -73739 -36962 -34930 -7230 21300
11341 21300 3646 -6870 -51406 -39512 12206 29115 10010 31240 92802 81249 87339 58170
11329 58170 3982 5502 79549 145333 106228 28854 -79578 -92783 -21514 -10582 -55002 -14397
11317 -14397 -51706 -134761 -93170 21813 30652 14478 7445 -41354 -40993 -106130 -178219 -144017
11305 -144017 -43067 -75412 -66594 -5415 -21526 3273 -12498 47318 78680 52429 -7627
11294 -7627 -48051 -37521 -35556 -42494 -127968 -82962 -20086 53250 34455 56435 33202 57862
11282 57862 57197 18881 -28061 -32112 -4068 705 -35717 -24207 -31441 -47963 36006 -8876 26642
$$ packed form
11365c9101M3468l2283l5306j1197L223o8970l7406M0887l2858J294N5504L3511
11353g9234r938l368O3616o159m0327j2002j3050K6723L6777K032K7700K8530
11341B1300j7654j0516m4536J1894N1718J6909j9105K1230O1562j1553O090k9169
11329E8170n4188J520P4047O5784l9105p7374j08432j3205P1269J0932m4420M0605
11317a4397l7309q3055M1591J14983Q839j6174p033m8799L61o5137p2089L4202
11305a44017J00950l2345Q818O1179j6111K4799j5771N9816L1362k6251o0056
11294g627m0424J0530J965o938q5474M5006O2876P3336j8795K1980k3233K4660
11282E7862o65l8316m6942m051K8044M773l6422J1510p234j6522Q3969m4882L5518
$$ plain form
11269 26642 -16422 -15271 -36923 -54939 -75724 -43635 -12992 -12131 -51061 -83912 -82109 -4489
11257 -4489 26733 -10389 20675 -7564 19646 4776 -92135 -70931 -62366 -49809 -98823 -67524
11245 -67524 14568 -43397 -55680 -24670 -122637 -118125 -20230 97542 202742 118394 50767
11234 50767 -15692 -10113 15556 32190 -18419 -99433 -165488 -181995 -114257 -34145 -16307 -26646
11222 -26646 -17813 -73962 -169928 -150163 -73171 -19 49221 84553 101809 109441 80096 21858
11210 21858 381 11724 141345 186766 156297 12242 -86675 -103606 -66474 1648 30270
11199 30270 -61965 -56667 -59563 -44274 -32025 -50310 -19010 -68117 -76611 -20169 5443 -12108
11187 -12108 -11613 -21594 14683 -20157 -84272 -106068 -93294 -95102 -93474 -92775 -55148 -51942 -84068
$$ packed form
11269B6642m3064J151k1652j8016k0785L2089L0643Q61l8930l2851J803P7620
11257d489L1222l7122L1064k8239K7210j4870r6911K1204Q565J2557m9014L1299
11245f7524Q2092n7965j2283L1010r7967M512R7895J17772J05200q4348o7627
11234E0767o6459N579K5669J6634n0609q1014o6055j6507O7738Q0112J7838j0339
11222b6646Q833n6149r5966J9765P6992P3152M9240L5332J7256P632k9345n8238
11210B1858k1477J1343J29621M5421l0469j44055r8917j6931L7132O8122K8622
11199C0270r2235N298k896J5289J2249j8285L1300m9107q494N6442K5612j7551
11187a2108M95r981L6277l4840o4115k1796J2774j808J628O99L7627L206l2126
$$ plain form
11174 -84068 -156319 -196538 -178012 -119283 -81309 -120480 -117536 -107224 -59283 -7395 -22279 -37704
11162 -37704 -29402 -40821 -34462 -90261 -148189 -71060 -58581 -75234 -36422 -53171 -88811 -96080
11150 -96080 -105063 -75582 12541 -53621 -155446 -179329 -237738 -257749 -187533 -174981 -119585 -86038
11138 -86038 -106698 -199746 -156723 -131118 -140435 -138791 -129934 -140949 -131879 -113587 -87552 -62370
11126 -62370 -89917 -51742 26369 106235 80670 40338 71304 -3689 -56361 -35247 -28335 -74785
11114 -74785 -113020 -84302 -58802 -59569 -133103 -192267 -177572 -104824 -56612 -66080 -91049 -75348
11102 -75348 -45091 -44231 -39010 -49836 -17186 -35473 -126273 -133735 -126485 -45625 24763 3357 63550
11089 63550 54943 56285 86528 39885 18283 75432 91714 28818 -85421 -158092 -131046 -178888
$$ packed form
11174h4068p2251m0219J8526N8729L7974l9171K944J0312M7941N1888j4884j5425
11162c7704Q302j1419O359n5799n7928P7129J2479j6653L8812j6749l5640p269
11150i6080q983K9481Q8123o6162j01825k3883n8409k0011P0216J2552N5396L3547
11138h6038k0660r3048M3023K5605r317J644Q857j1015R070J8292K6035K5182
11126f2370k7547L8175P8111P9866k5565m0332L0966p4993n2672K1114O912m6450
11114g4785l8235K8718K5500p67p3534n9164J4695P2748M8212r468k4969J5701
11102g5348L0257Q60N221j0826L2650j8287r0800p462P250Q0860P0388k1406O0193
11089F3550q607J342L0243m6643k1602N7149J6282o2896j14239p2671K7046m7842
$$ plain form
11077 -178888 -114967 -20391 19792 -14018 -104458 -110198 -36672 -321 26519 -15145 -30701 -66657
11065 -66657 -124272 -141347 -151027 -64188 -24721 -11061 5862 -21615 -31351 29616 34978 -53586
11053 -53586 -74264 -139648 -141960 -58405 2080 21174 100579 106685 128474 123743 146401 130019
11041 130019 111385 147620 166990 155940 104554 66560 130141 304276 420927 339095 296771
11030 296771 296650 250891 256134 268983 251963 322400 432120 470510 512877 546483 508716 466243
11018 466243 412481 325766 335838 291742 221116 182528 224555 292981 348693 365975 350261
11007 350261 294610 194650 98647 117547 78353 34006 -58965 -62580 20520 34549 96865 119063
10995 119063 84272 -691 2877 -45085 -51034 -63515 -30220 -14982 -25996 5492 55734 69566
$$ packed form
11077a78888O3921R4576M0183l3810r0440n740P3526L6351K6840m1664j5556l5956
11065f6657n7615j7075r680Q6839L9467J3660J6923k7477r736O0967N362q8564
11053e3586k0678o5384k312Q3555O0485J9094P9405O106K1789m731K2658j6382
11041A30019j8634L6235J9370j1050n1386l7994O3581J74135J16651q1832m2324
11030B96771j21m5759N243J2849j7020P0437J09720L8390M2367L3606l7767m2473
11018D66243n3762q6715J0072m4096p0626l8588M2027O8426N5712J7282j5714
11007C50261n5651r9960r6003J8900l9194m4347r2971l615Q3100J4029O2316K2198
10995A19063l4791q4963L568m7962n949j2481L3295J5238j1014L1488N0242J3832
$$ plain form
10983 69566 90958 51508 -26864 -166 100214 110051 87659 59169 9966 -28300 -13196 -54873
10971 -54873 -121878 -136446 -115685 -133198 -119540 -86363 -13281 -29023 -88653 -99354 -111055 -70303
10959 -70303 -112027 -118191 -104626 -14243 -6542 -26438 -44016 -142331 -174294 -189658 -153115 -97522
10947 -97522 -114909 -123334 -64929 -108994 -124280 -16994 26726 -75375 -187820 -152762 -100031
10936 -100031 -50922 -34699 -2250 -7128 -21693 -72992 -98234 -85622 -8707 66676 72408 51244
10924 51244 45739 18791 14536 14204 -1539 -8291 -25580 -65182 -82864 -26019 -36263 -79045 -74483
10911 -74483 -42744 64318 69850 19353 -9770 14990 14540 -23013 -37046 6134 19809 18220
10899 18220 -29820 14246 59491 72901 7074 94356 127137 85130 65564 12724 -27868 63996
$$ packed form
10983F9566K1392l9450p8372K6698J00380R837k2392k8490m9203l8266J5104m1677
10971e4873o7005j4568K0761j7513J3658L3177P3082j5742n9630j0701j1701M0752
10959g0303m1724o164J3565R0383P701j9896j7578r8315l1963j5364L6543N5593
10947i7522j7387q425N8405m4065j5286J07286M3720j02101j12445L5058N2731
10936a00031M9109J6223L2449m878j4565n1299k5242J2612P6915P5383N732k1164
10924E1244n505k6948m255l32j5743o752j7289l9602j7682N6845j0244m2782M562
10911g4483L1739J07062N532n0497k9123K4760m50l7553j4033M3180J3675j589
10899A8220m8040M4066M5245J3410o5827Q7282L2781m2007j9566n2840m0592R1864
$$ plain form
10887 63996 163653 173145 202129 243320 163335 47361 6423 4681 31426 70423 32505 3107
10875 3107 -13204 -14532 34569 11758 -40083 -41768 22065 22007 -11544 -47247 -142697 -228054 -241511
10862 -241511 -212896 -208931 -208604 -164876 -108979 -44737 -8323 51708 121530 43653 -30448 28903
10850 28903 14221 44064 54322 111901 145868 134470 111395 66389 34033 30111 -38099 -119215
10838 -119215 -74409 -48330 -76001 -146568 -107312 -76885 -112013 -153833 -143951 -109238 -73995 -9960
10826 -9960 -15905 -4072 -62788 -114397 -98553 -86417 -17963 -49527 -100894 -177453 -122406 -26571
10814 -26571 25392 37532 -18598 -69818 -130582 -96497 -10728 40810 17109 25033 -13289 -39271
10802 -39271 -23365 24000 90096 47923 -46801 -91855 -45790 -43420 -10507 19682 -38191 -64951
$$ packed form
10887F3996R9657R492K8984M1191p9985j15974m0938j742K6745L8997l7918k9398
10875C107j6311j328M9101k2811n1841j685O3833n8l3551l5703r5450q5357j3457
10862b41511K8615L965L27M3728N5897O4242L6414O0031O9822p7877p4101N9351
10850B8903j4682K9843J0258N7579L3967j1398k3075m5006l2356l922o8210q1116
10838a19215M4806K6079k7671p0567L9256L0427l5128m1820R882L4713L5243O4035
10826i960n945J1833n8716n1609J5844J2136O8454l1564n1367p6559N5047R5835
10814b6571N1963J2140n6130n1220o0764L4085Q5769N1538k3701P924l8322k5982
10802c9271J5906M7365O6096m2173r4724m5054M6065K370L2913L0189n7873k6760
$$ plain form
10790 -64951 -41923 -10426 44569 -25906 -18063 -28888 -93333 -101922 -101464 -91483 -51174 64117
10778 64117 141690 105034 -23092 -21734 27464 18468 18252 -37185 -52834 -15754 -16774 -20894 -104090
10765 -104090 -185067 -190281 -129323 -151873 -160758 -82301 -68470 -131657 -118501 -135601 -79705 -26639
10753 -26639 1760 -29467 -14976 -11905 -59588 -62253 -62050 -165095 -201979 -196698 -126806 -95276
10741 -95276 -64049 -50799 -24337 22700 29048 72780 70426 65446 131308 84201 42606 81352
10729 81352 24762 36539 13617 -37465 -76743 -36594 -31729 42812 98338 -1657 -34323 -72165
10717 -72165 -153543 -134453 -62107 -4746 48160 44531 113257 197666 129611 68401 76350 14058
10705 14058 -17974 29054 41856 83648 71272 102034 181727 163934 119486 130877 195009 200166
$$ packed form
10790f4951K3028L1497N4995p0475P843j0825o4445q589M58R981M0309J15291
10778F4117P7573l6656j28126J358M9198q996k16n5437j5649L7080j020m120q3196
10765a04090q0977n214O0958k2550q885P8457J3831o3187J3156j7100N5896N3066
10753b6639K8399l1227J4491L071m7683k665K03j03045l6884N281O9892L1530
10741i5276L1227J3250K6462M7037O348M3732k354m980O5862m7107m1595L8746
10729H1352n6590J1777k2922n1082l9278M0149M865P4541N5526r9995l2666l7842
10717g2165q1378J9090P2346N7361N2906l629O8726Q4409o8055o1210P949o2292
10705A4058l2032M7028J2802M1792j2376L0762P9693j7793m4448J1391O4132N157
$$ plain form
10693 200166 174509 133397 123693 147166 195706 197995 228913 244517 204474 191775 127943 115536
10681 115536 148825 128083 138748 139763 110677 133818 71809 72974 106716 105882 200609 191598
10669 191598 160147 164935 150549 118738 111207 134548 122615 53768 18361 21845 95277 125596
10657 125596 147943 184183 309613 393161 409647 408642 318267 326170 317281 330438 272531 243809
10645 243809 264258 382437 372908 363550 473299 615145 621721 623155 598935 727951 907848
10634 907848 1089061 1154042 1285240 1404833 1554175 1728176 1961363 2282982 2680988 3042035
10624 3042035 3500248 4087197 4997504 6299335 8072645 10520284 13976747 18632968 24204814
10615 24204814 29444801 32820550 33409956 31816625 29665031 28091279 27731035 29110555
$$ packed form
10693B00166k5657m1112r704K3473M8540K289L0918J5604m0043j2699o3832j2407
10681A15536L3289k0742J0665J015k9086K3141o2009J165L3742q34R4727r011
10669A91598l1451M788j4386l1811p531K3341j1933o8847l5407L484P3432L0319
10657A25596K2347L6240J25430Q3548J6486j005r0375P903q889J3157n7907k8722
10645B43809K0449J18179r529r358J09749J41846O576J434k4220J29016J79897
10634I07848J81213O4981J31198J19593J49342J74001K33187L21619L98006L61047
10624C042035M58213N86949R10307J301831J773310K447639L456463M656221N571846
10615B4204814N239987L375749N89406j593331k151594j573752l60244J379520
$$ plain form
10607 29110555 32609206 38757419 47803094 59163019 69799142 75026656 73147497 66391171
10599 66391171 58739850 53018926 50362768 50986320 55068756 63142207 75229981 89840975
10591 89840975 102251725 105947128 99122090 85998085 72282179 61589459 54848893
10584 54848893 51803112 52137303 55870579 62525742 70514704 76257737 75796996 68628825
10576 68628825 57801357 47256335 39195295 33847458 30902675 29981063 30736013 32620025
10568 32620025 34738206 35652621 33969025 29828590 24471308 19253690 14967121 11782328
10560 11782328 9438320 7628312 6357548 5439355 4802481 4242658 3733976 3345336 2998345
10551 2998345 2702653 2408408 2073620 1832386 1664153 1480906 1390540 1358892 1225428 1109006
$$ packed form
10607B9110555L498651O148213R045675J1359925J0636123N227514j879159o756326
10599F6391171p651321n720924k656158O23552M082436Q073451J2087774J4610994
10591H9840975J2410750L695403o825038j3124005j3715906j0692720o740566
10584E4848893l045781L34191L733276O655163P988962N743033m60741p168171
10576F8628825j0827468j0545022q061040n347837k944783r21612P54950J884012
10568C2620025K118181R14415j683596m140435n357282n217618m286569l184793
10560A1782328k344008j810008j270764r18193o36874n59823n08682l88640l46991
10551B998345k95692k94245l34788k41234j68233j83247r0366l1648j33464j16422
$$ plain form
10541 1109006 1068092 1031213 975235 934741 852461 746630 755492 754930 741503 723812 667392 571020
10529 571020 477533 414368 443264 378497 395329 485264 499697 469141 450208 377486 304044
10518 304044 242687 196766 204396 220697 196309 200016 148206 143200 175643 234208 211378 191354
10506 191354 209950 225835 254307 202350 147060 138868 165275 172780 94338 64508 44294 22842
10494 22842 -58653 -12118 75817 96461 89424 92525 39766 21030 70999 58375 15877 -11874
10482 -11874 -62415 6134 36563 64648 89989 129638 121094 100022 96397 66975 69690 21337
10470 21337 5786 65962 135074 147426 136660 129937 154698 246292 253371 345374 395665 332197
10458 332197 355598 424317 480722 468375 506042 571741 631765 667550 605867 498274 391302
$$ packed form
10541A109006m0914l6879n5978m0494q2280j05831Q862n62j3427j7691n6420r6372
10529E71020r3487o3165K8896o4767J6832Q9935J4433l0556j8933p2722p3442
10518C04044o1357m5921P630J6301k4388L707n1810n006L2443N8565k2830k0024
10506A91354J8596J5885K8472n1957n5290q192K6407P505p8442k9830k0214k1452
10494B2842q1495M6535Q7935K0644p037L101n2759j8736M9969j2624m2498k7751
10482a1874n0541O8549L0429K8085K5341L9649q544k1072l625k9422K715m8353
10470B1337j5551O0176O9112J2352j0766o723K4761R1594P079R2003N0291o3468
10458C32197K3401O8719N6405j2347L7667O5699O0024L5785o1683j07593j06972
$$ plain form
10447 391302 335480 278116 237175 164056 180242 275496 299996 304594 215979 202100 225808 268261
10435 268261 211485 125991 47486 74719 160925 192380 160277 170861 158776 233612 286163
10424 286163 310213 387114 331790 260442 275720 269168 226569 247916 273079 285398 285474 357302
10412 357302 356780 323706 318007 421185 432219 454225 504839 421917 381667 457459 511957 523643
10400 523643 534136 486209 397138 383163 436627 432664 393482 348032 275646 236172 199657 281281
10388 281281 377380 463319 375537 292683 292656 293380 173427 110506 107567 114590 157304 258804
10376 258804 268024 239820 184749 106771 100918 56716 65832 112335 205543 225431 189542 220653
10364 220653 330560 356033 289309 264335 279332 302488 341534 345069 362976 359856 445499 470787
$$ packed form
10447C91302n5822n7364m0941p3119J6186R5254K4500M598q8615j3879K3708M2453
10435B68261n6776q5494p8505K7233Q6206L1455l2103J0584j2085P4836N2551
10424B86163K4050P6901n5324p1348J5278o552m2599K1347K5163J2319P6P1828
10412C57302n22l3074n699J03178J1034K2006N0614q2922m0250P5792N4498J1686
10400E23643J0493m7927q9071j3975N3464l963l9182m5450p2386l9474l6515Q1624
10388B81281R6099Q5939q7782q2854k7P24j19953o2921k939P023M2714J01500
10376B58804R220k8204n5071p7978n853m4202R116M6503R3208J9888l5889L1111
10364B20653J09907K5473o6724k4974J4997K3156L9046L535J7907l120Q5643K5288
$$ plain form
10352 470787 557187 613461 651193 652524 561862 497408 412056 414247 351508 251163 219769 172498
10340 172498 106693 77756 -18137 92104 114660 81976 146555 35758 -12541 -5815 12584
10329 12584 62022 51966 82738 74457 110120 67785 124989 207523 258099 230462 246672 225454
10317 225454 213987 244310 272403 266150 255681 196507 236358 252247 211603 103410 109507 156981
10305 156981 137543 181994 263832 252959 195436 183252 100219 43251 10108 -44756 -69227
10294 -69227 -106754 -196752 -232785 -191681 -173016 -138868 -104721 -106616 -109629 -158343 -75473 -55033
10282 -55033 -94456 -71003 -6898 -15732 -30739 -86540 -139162 -112238 -102744 -99224 -88055 -32980
10270 -32980 -52217 -75284 -52940 -2079 89153 99987 119213 109476 212914 243569 325572 366068
$$ packed form
10352D70787Q6400N6274L7732J331r0662o4454q5352K191o2739j00345l1394m7271
10340A72498o5805k8937r5893J10241K2556l2684O4579j10797m8299O726J8399
10329A2584M9438j0056L0772q281L5663m2335N7204Q2534N0576k7637J6210k1218
10317B25454j1467L0323K8093o253j0469n9174L9851J5889m0644j08193O097M7474
10305A56981j9438M4451Q1838j0873n7523j2184q3033n6968l3143n4864k4471
10294f9227l7527q9998l6033M1104J8665L4148L4147j895l013m8714Q2870K0440
10282e5033l9423K3453O4105q834j5007n5801n2622K6924R494L520J1169N5075
10270c2980j9237k3067K2344N0861R1232J0834J9226r737J03438L0655Q2003M0496
$$ plain form
10258 366068 276834 249150 238064 199774 286275 297995 263371 267645 225725 237791 329576 351209
10246 351209 214776 142861 112765 81036 106590 109544 76326 75535 66317 168830 81556 11023
10234 11023 79775 97172 52575 70690 63136 18228 99233 91690 95043 45796 -46132 -105774
10222 -105774 -79375 -70072 -64952 -43752 4617 58398 77727 112776 87023 112679 177095 37273
10210 37273 -45487 -19483 9570 33543 88596 98750 130748 100945 132722 217193 232751 199390
10198 199390 218938 188678 169368 231546 293912 394503 531553 614110 584545 483215 367728
10187 367728 324192 340301 342173 334552 275248 277508 261501 274334 326026 381935 327596 338975
10175 338975 425874 414827 378136 321526 330027 379213 435455 495281 536285 637031 685440
$$ packed form
10258C66068q9234k7684j1086l8290Q6501J1720l4624M274m1920J2066R1785K1633
10246C51209j36433p1915l0096l1729K5554K954l3218p91r218J02513q7274p0533
10234A1023O8752J7397m4597J8115p554m4908Q1005p543L353m9247r1928n9642
10222a05774K6399R303N120K1200M8369N3781J9329L5049k5753K5656O4416j39822
10210C7273q2760K6004K9053K3973N5053J0154L1998k9803L1777Q4471J5558l3361
10198A99390J9548l0260j9310O2178O2366J00591J37050Q2557k9565j01330j15487
10187C67728m3536J6109J872p621n9304K260j6007J2833N1692N5909n4339J1379
10175C38975Q6899j1047l6691n6610Q501M9186N6242N9826M1004J00746M8409
$$ plain form
10164 685440 633857 516064 485003 510701 516162 528010 579064 606276 688681 758766 817912
10153 817912 801638 696216 573562 503083 478584 411996 440745 491732 534675 634398 645633
10142 645633 659400 664431 595631 550986 564677 556063 543563 496329 448974 460970 481445 448083
10130 448083 413739 360453 432252 460360 537190 663139 674908 570996 634983 702938 635136
10119 635136 686279 755931 780008 834638 891512 874750 898654 945053 942254 853099 826540 858211
10107 858211 875126 853255 863704 886422 944295 995307 1116720 1171794 1251626 1344971 1419707
10096 1419707 1498595 1573808 1611387 1576993 1619617 1708439 1822922 1904527 2061485 2194353 2342537
10085 2342537 2486075 2694356 2917916 3163661 3383159 3648287 3882526 4197224 4499549
$$ packed form
10164F85440n1583j17793l1061K5698N461J1848N1054K7212Q2405P0085N9146
10153H17912j6274j05422j22654p0479k4499o6588K8749N0987M2943R9723J1235
10142F45633J3767N031o8800m4645J3691q614j2500m7234m7355J1996K0475l3362
10130D48083l4344n3286P1799K8108P6830J25949J1769j03912O3987O7955o7802
10119F35136N1143O9652K4077N4630N6874j6762K3904M6399k799q9155k6559L1671
10107H58211J6915k1871J0449K2718N7873N1012J21413N5074P9832R3345P4736
10096A419707P8888P5213L7579l4394M2624Q8822J14483Q1605J56958J32868J48184
10085B342537J43538K08281K23560K45745K19498K65128K34239L14698L02325
$$ plain form
10076 4499549 4761660 5049936 5445984 5916307 6439863 7190734 8040167 8956721 10090412
10067 10090412 11478780 13144818 15348806 18285706 22250416 27626023 34921272 44885513
10059 44885513 58218168 74799222 92730579 107656566 114440808 110192464 96713055
10052 96713055 79378634 62947658 49735713 39929740 32859135 27698675 23683479 20556320
10044 20556320 18268820 16511164 15216611 14169843 13316804 12667767 12261497 12073750 12045157
10035 12045157 12210003 12525073 13179685 14203606 15680242 17992460 21514538 26305590
10027 26305590 31309127 34434500 34144992 31346588 28058779 25736764 24955083 25755478
10019 25755478 28318558 32910155 39903843 49557192 60636054 69370301 72031155 69603165
$$ packed form
10076D499549K62111K88276L96048M70323N23556P50871Q49433R16554J133691
10067A0090412J388368J666038K203988K936900L964710N375607P295249R964241
10059D4885513J3332655J6581054J7931357J4925987O784242m248344j3479409
10052I6713055j7334421j6430976j3211945r805973p070605n160460m015196l127159
10044B0556320k287500j757656j294553j046768q53039o49037m06270j87747k8593
10035A2045157J64846L15070O54612J023921J476636K312218L522078M791052
10027B6305590N003537L125373k89508k798404l287809k322015p81681Q00395
10019B5755478K563080M591597O993688R653349J1078862Q734247K660854k427990
$$ plain form
10011 69603165 66319273 65942937 70226128 78984492 90708759 102570536 111439946 115465519
10003 115465519 113846123 106534735 94669633 80920175 68078609 57869214 50865999
9996 50865999 46808585 45713711 47745975 53079218 60614014 66763745 66820604 60041199
9988 60041199 50069707 40791183 34003200 29610961 27198611 26351202 27200844 29608803
9980 29608803 33266234 36637494 37317540 34454627 29501278 24621094 20902570 18310605
9972 18310605 16535581 15316740 14508740 14064220 13894574 14014153 14428236 15117356 16068868
9963 16068868 17341432 19029136 21301131 24273081 28245714 33642885 41101102 51365759
9955 51365759 65150870 82794833 102821171 121060649 131555431 129907261 116589718
$$ packed form
10011F9603165l283892l76336M283191Q758364J1724267J1861777Q869410M025573
10003A15465519j619396p311388j1865102j3749458j2841566j0209395p003215
9996E0865999m057414j094874K032264N333243P534796O149731N6859o779405
9988F0041199r971492r278524o787983m392239k412350q47409Q49642K407959
9980B9608803L657431L371260O80046k862913m953349m880184l718524k591965
9972A8310605j775024j218841q08000m44520j69646J19579M14083O89120R51512
9963A6068868J272564J687704K271995K971950L972633N397171P458217J0264657
9955E1365759J3785111J7643963K0026338J8239478J0494782j648170j3317543
$$ plain form
9948 116589718 96835580 76665937 59790260 46949412 37521730 30612136 25396827
9941 25396827 21450649 18288771 15924498 14098222 12644460 11415148 10299081 9316352
9933 9316352 8534427 7939680 7352796 6784393 6370168 6016534 5619987 5219086 4818677 4430675
9923 4430675 4046549 3718379 3434223 3169158 2959300 2700163 2482911 2357948 2241560 2093183
9913 2093183 1996233 1854630 1790791 1751949 1799063 1756785 1677733 1609538 1540963 1495184 1448424
9902 1448424 1370899 1301327 1208381 1120570 1104956 1065533 990118 912520 943165 956949 964868 934347
9890 934347 876356 833667 860721 924336 919177 870856 851068 872020 848632 756154 694872 697111
9878 697111 812010 788608 700374 650027 630245 688526 730187 720877 688955 631597 606474 633741
$$ packed form
9948A16589718j9754138k0169643j6875677j2840848r427682o909594n215309
9941B5396827l946178l161878k364273j826276j453762j229312j116067r82729
9933I316352p81925n94747n86884n68403m14225l53634l96547m00901m00409l88002
9923D430675l84126l28170k84156k65065k09858k59137k17252j24963j16388j48377
9913B093183r6950j41603o3839l8842M7114m2278p9052o8195o8575m5779m6760
9902A448424p7525o9572r2946q7811j5614l9423p5415p7598L0645J3784P919l0521
9890I34347n7991m2689K7054O3615n159m8321j9788K0952k3388r2478o1282K239
9878F97111J14899k3402q8234n0347j9782N8281M1661r310l1922n7358k5123K7267
$$ plain form
9866 633741 642054 549900 513876 536716 543881 469578 458877 493302 483820 507197 579275 597596
9854 597596 635374 669004 613709 586138 527022 451971 406525 399124 389740 430246 438685 451513
9842 451513 393868 376213 330435 280317 257182 297046 300011 262126 249830 280334 307167 318270
9830 318270 346727 361629 344572 360419 432090 510556 534827 607622 657865 730894 898620
9819 898620 989604 1135125 1253208 1187251 1016638 808518 640289 571017 574255 494401 538003
9808 538003 577998 587460 561228 522213 466096 362058 334556 397769 451078 414702 348464 398365
9796 398365 485012 432946 449303 477607 420554 370048 480516 541279 494321 482546 494142
9785 494142 527059 585970 625278 644767 633255 569374 541783 638615 660237 680691 689486 612641
$$ packed form
9866F33741Q313r2154l6024K2840P165p4303j0701L4425r482K3377P2078J8321
9854E97596L7778L3630n5295k7571n9116p5051m5446p401r384M0506Q439J2828
9842D51513n7645j7655m5778n0118k3135L9864K965l7885j2296L0504K6833J1103
9830C18270K8457J4902j7057J5847P1671P8466K4271P2795N0243P3029J67726
9819H98620R0984J45521J18083o5957j70613k08120j68229o9272L238p9854M3602
9808E38003L9995R462k6232l9015n6117j04038k7502O3213N3309l6376o6238M9901
9796C98365Q6647n2066J6357K8304n7053n0506J10468O0763m6958j1775J1596
9785D94142L2917N8911L9308J9489j1512o3881k7591R6832K1622K0454Q795p6845
$$ plain form
9773 612641 597019 616268 642082 721329 727746 741095 739859 762524 770744 759293 786785 782196
9761 782196 834803 884117 853214 874162 770483 712473 743073 818140 833318 824093 869368 925067
9749 925067 967918 957426 944490 1009236 1063398 1204212 1331126 1392939 1407072 1387150 1464222
9738 1464222 1577933 1678037 1821122 1950050 2052902 2157877 2441181 2678696 2904020 3286894
9728 3286894 3605754 3892775 4242340 4744167 5230220 5715675 6198686 6723769 7260521 7826772
9718 7826772 8472152 9196906 9930843 10676167 11537898 12473357 13520438 14577663 15779435
9709 15779435 17243571 18736717 20333020 22106113 23977250 25983451 28097533 30306269
9701 30306269 32492468 34614872 36802421 38962973 41141014 43286995 45506884 47796013
$$ packed form
9773F12641j5622J9249K5814P9247O417J3349j236K2665Q220j1451K7492m589
9761G82196N2607M9314l0903K0948j03679n8010L0600P5067J5178r225M5275N5699
9749I25067M2851j0492j2936O4746N4162J40814J26914O1813J4133j9922P7072
9738A464222J13711J00104J43085J28928J02852J04975K83304K37515K25324L82874
9728C286894L18860K87021L49565N01827M86053M85455M83011N25083N36752N66251
9718G826772O45380P24754P33937P45324Q61731R35459J047081J057225J201772
9709A5779435J464136J493146J596303J773093J871137K006201K114082K208736
9701C0306269K186199K122404K187549K160552K178041K145981K219889K289129
$$ plain form
9693 47796013 50234813 52697715 55193491 57722759 60428107 63403020 66588295 70065477
9685 70065477 73725190 77479293 81362589 85243425 88977347 92603743 96085106 99311376
9677 99311376 102214104 104778907 107050294 109111103 111013813 112773941 114473879 116153219
9669 116153219 117903697 119763499 121775892 124113526 126664393 129430452 132215824 135086355
9661 135086355 137846792 140082363 141814222 142838156 142966005 142362398 141124265 139578369
9653 139578369 137909871 136044075 134152720 132404553 130755313 129268284 127929588 126735620
9645 126735620 125675460 124697178 123693634 122622991 121464394 120040162 118182030 115864954
9637 115864954 113103978 109995589 106578138 102859463 98858073 94772810 90668885 86729302
$$ packed form
9693D7796013K438800K462902K495776K529268K705348K974913L185275L477182
9685G0065477L659713L754103L883296L880836L733922L626396L481363L226270
9677I9311376K902728K564803K271387K060809J902710J760128J699938J679340
9669A16153219J750478J859802K012393K337634K550867K766059K785372K870531
9661A35086355K760437K235571J731859J023934J27849o03607j238133j545896
9653A39578369j668498j865796j891355j748167j649240j487029j338696j193968
9645A26735620j060160r78282j003544j070643j158597j424232j858132k317076
9637A15864954k760976l108389l417451l718675m001390m085263m103925l939583
$$ plain form
9629 86729302 83057282 79691164 76561834 73627334 70913323 68362557 65913413 63650492
9621 63650492 61228528 58820523 56450029 53954756 51395749 48769002 45922045 43116920
9613 43116920 40419115 37869475 35396465 33003398 30709461 28496386 26500470 24695778
9605 24695778 23040356 21495083 20122830 18927110 17755299 16719666 15681708 14636461
9597 14636461 13687336 12801409 11896113 11009678 10200580 9411010 8689983 8029136 7452683
9588 7452683 6981726 6537012 6070146 5585263 5108317 4743204 4340833 4084364 3909132 3636709
9578 3636709 3452418 3332611 3295735 3181844 3041055 2858569 2665620 2568745 2506738 2423216
9568 2423216 2335071 2213891 2096460 2097202 2134690 2133554 2179623 2160209 2064047 1954668 1839502
$$ packed form
9629H6729302l672020l366118l129330k934500k714011k550766k449144k262921
9621F3650492k421964k408005k370494k495273k559007k626747k846957k805125
9613D3116920k697805k549640k473010k393067k293937k213075j995916j804692
9605B4695778j655422j545273j372253j195720j171811j035633j037958j045247
9597A4636461r49125q85927r05296q86435q09098p89570p21027o60847n76453
9588G452683m70957m44714m66866m84883m76946l65113m02371k56469j75232k72423
9578C636709j84291j19807l6876j13891j40789j82486j92949r6875o2007q3522
9568B423216q8145j21180j17431P42L7488j136M6069j9414r6162j09379j15166
$$ plain form
9557 1839502 1797853 1837768 1891100 1972801 2003548 2005217 2050933 2078624 2057293 2109616 2113366 2061605
9545 2061605 1901333 1802526 1719719 1636599 1568766 1578221 1555775 1471772 1487710 1534373 1557836
9534 1557836 1494953 1423311 1385664 1294250 1300713 1282660 1259143 1129005 1017911 989262 973699
9523 973699 956945 1074552 1053653 1004731 1065484 1093277 1072430 1035845 961449 953484 1016378 1037894
9511 1037894 975676 897610 898221 954859 1005594 1028012 1014780 1070050 1018565 1012636 1003863 968949
9499 968949 945922 877011 900699 889227 928313 1026511 1023575 1025368 994227 944639 973644 1022169
9487 1022169 1004734 1005377 950546 972020 1050195 989056 889376 856331 979756 1017269 1041482 964735
9475 964735 961248 964741 873473 906835 960091 932280 888874 852842 791700 744219 740619 722639
$$ packed form
9557A839502m1649L9915N3332Q1701L0747J669M5716K7691k1331N2323L750n1761
9545B061605j60272r8807q2807q3120o7833R455k2446q4003J5938M6663K3463
9534A557836o2883p1642l7647r1414O463j8053k3517j30138j11094k8649j5563
9523I73699j6754J17607k0899m8922O0753K7793k0847l6585p4396p965O2894K1516
9511A037894o2218p8066O11N6638N0735K2418j3232N5270n1485n929q773l4914
9499I68949k3027o8911K3688j1472L9086R8198k936J793l1141m9588K9005M8525
9487A022169j7435O43n4831K1474P8175o1139r9680l3045J23425L7513K4213p6747
9475I64735l487L493r1268L3362N3256k7811m3406l6032o1142m7481l600j7980
$$ plain form
9463 722639 783629 797448 797964 797635 731127 669280 731138 691545 606684 581648 596167 660935
9451 660935 716016 732954 687963 620570 580372 599715 569201 561181 539790 495659 508441 563609
9439 563609 525658 482503 524138 550161 537729 512756 566957 594411 530833 522783 477919 474079
9427 474079 541868 618767 643703 641621 592573 571335 597029 620952 614494 601947 595757 593084
9415 593084 596474 604795 658561 635720 647755 614605 567534 561678 571912 640190 717598 687546
9403 687546 674724 722463 746737 755747 763350 698621 673404 638519 651171 686730 708086 714723
9391 714723 662640 654246 665508 663287 662896 631632 664219 711246 710535 752235 784057 726965 782417
9378 782417 793100 794555 744327 734964 767516 818147 832145 793376 773540 772204 794726 805502
$$ packed form
9463G22639O0990J3819N16l29o6508o1847O1858l9593q4861k5036J4519O4768
9451F60935N5081J6938m4991o7393m0198J9343l0514q020k1391m4131J2782N5168
9439E63609l7951m3155M1635K6023j2432k4973N4201K7454o3578q050m4864l840
9427D74079O7789P6899K4936k082m9048k1238K5694K3923o458j2547o190k673
9415E93084L390Q321N3766k2841J2035l3150m7071n856J0234O8278P7408l0052
9403F87546j2822M7739K4274R010P603o4729k5217l4885J2652L5559K1356O637
9391G14723n2083q394J1262k221l91l1264L2587M7027p11M1700L1822n7092N5452
9378G82417J0683J455n0228r363L2552N0631J3998l8769j9836j336K2522J0776
$$ plain form
9366 805502 827310 825975 883705 886592 929819 1014934 1019444 1069754 1062401 1143590 1196565 1235245
9354 1235245 1305254 1321356 1460697 1574637 1772075 2001171 2050110 2134767 2347874 2572023
9344 2572023 2678774 2909581 3284024 3641977 3982943 4468124 4981338 5551262 6133472 6786483
9334 6786483 7643066 8602894 9710457 10865324 12030661 13390173 14931536 16447274 18054283
9325 18054283 19716313 21352339 23003093 24579534 26050162 27437081 28649913 29736149
9317 29736149 30697952 31561183 32309638 33043501 33834492 34716024 35675191 36799427 37968515
9308 37968515 39140678 40352973 41634921 42846315 43971060 44933197 45662246 46154232 46357640
9299 46357640 46324875 45835721 44977542 44031233 42958354 41659589 40264843 38915067 37593457
$$ packed form
9366H05502K1808j335N7730K887M3227Q5115M510N0310p353Q1189N2975L8680
9354A235245P0009J6102J39341J13940J97438K29096M8939Q4657K13107K24149
9344B572023J06751K30807L74443L57953L40966M85181N13214N69924N82210O53011
9334F786483Q56583R59828J107563J154867J165337J359512J541363J515738J607009
9325A8054283J662030J636026J650754J576441J470628J386919J212832J086236
9317B9736149R61803Q63231P48455P33863P90991Q81532R59167J124236J169088
9308C7968515J172163J212295J281948J211394J124745R62137P29049M91986K03408
9299D6357640l2765m89154q58179r46309j072879j298765j394746j349776j321610
$$ plain form
9290 37593457 36426018 35399904 34437988 33590400 32905623 32240050 31670295 31125079 30454294
9281 30454294 29743138 28892632 27960896 27046913 26164727 25248375 24213588 23118818 22282926
9272 22282926 21452179 20784522 20234915 19816451 19536145 19500102 19619280 19851806 20409043 21222528
9262 21222528 22334016 23656415 25280082 27226798 29498655 32261261 35369986 38907157
9254 38907157 42840679 47118897 51714107 56549439 61597909 66748160 71975179 77146479
9246 77146479 82126304 86944622 91523965 95855946 99758970 103172940 106369746 109443709
9238 109443709 112450113 115600658 118879499 122411210 126322442 130569590 135018381 139636555
9230 139636555 144256374 148781879 152906006 156354599 158986402 160805719 161762688 161730848
$$ packed form
9290C7593457j167439j026114r61916q47588o84777o65573n69755n45216o70785
9281C0454294p11156q50506r31736r13983q82186r16352j034787j094770q35892
9272B2282926q30747o67657n49607m18464k80306l6043J19178K32526N57237Q13485
9262B1222528J111488J322399J623667J946716K271857K762606L108725L537171
9254C8907157L933522M278218M595210M835332N048470N150251N227019N171300
9246G7146479M979825M818318M579343M331981L903024L413970L196806L073963
9238A09443709L006404L150545L278841L531711L911232M247148M448791M618174
9230A39636555M619819M525505M124127L448593K631803J819317R56969l1840
$$ plain form
9222 161730848 160629694 158553895 155605061 151987726 147815440 143400082 138942519 134661904
9214 134661904 130686882 127115134 123896976 120987922 118347032 116015904 113925588 111861432
9206 111861432 109921004 108063413 106263915 104425285 102648538 100867419 99237787 97789308
9198 97789308 96561657 95831907 95460467 95471531 95816513 96402195 97255367 98518253 100504539
9189 100504539 103153352 106106071 108888672 111084702 112603567 113824505 115064586 116488428
9181 116488428 118419532 120906527 124031387 127699479 131431192 134909290 138181533 141465419
9173 141465419 145140941 149234978 153552373 157450967 160279240 161747532 161942504 161227613
9165 161227613 159972385 158398098 156638413 154738920 152642678 150268751 147434655 144032166
$$ packed form
9222A61730848j101154k075799k948834l617335m172286m415358m457563m280615
9214A34661904l975022l571748l218158k909054k640890k331128k090316k064156
9206A11861432j940428j857591j799498j838630j776747j781119j629632j448479
9198I7789308j227651p29750l71440J1064L44982N85682Q53172J262886J986286
9189A00504539K648813K952719K782601K196030J518865J220938J240081J423842
9181A16488428J931104K486995L124860L668092L731713L478098L272243L283886
9173A41465419L675522M094037M317395L898594K828273J468292J94972p14891
9165A61227613j255228j574287j759685j899493k096242k373927k834096l402489
$$ plain form
9157 144032166 139909764 134996047 129415222 123582199 117873333 112653285 108133614 104221670
9149 104221670 100758140 97616306 94839433 92160142 89365532 86144080 82200662 77516825
9141 77516825 72698330 68186676 63905163 59440629 54490937 49341090 44439731 39968943
9133 39968943 35939686 32297582 29067065 26199484 23782638 21808550 20278021 19095190
9125 19095190 18290873 17781075 17672250 17888933 18503314 19311733 20246609 21473736 22801851
9116 22801851 24145577 25438536 26733356 28027856 29219247 30056503 30599738 30862614 30843032
9107 30843032 30895468 31096829 31559972 32231912 32992159 33828447 34959474 36480765 38309182
9098 38309182 40322426 42369592 44218902 45797263 46820576 47322114 47398678 47221509 46864105
$$ packed form
9157A44032166m122402m913717n580825n833023n708866n220048m519671l911944
9149A04221670l463530l141834k776873k679291k794610l221452l943418m683837
9141G7516825m818495m511654m281513m464534m949692n149847m901359m470788
9133C9968943m029257l642104l230517k867581k416846j974088j530529j182831
9125A9095190q04317n09798j08825K16683O14381Q08419R34876J227127J328115
9116B2801851J343726J292959J294820J294500J191391Q37256N43235K62876j9582
9107C0843032N2436K01361M63143O71940P60247Q36288J131027J521291J828417
9098C8309182K013244K047166J849310J578361J023313N01538P6564j77169l57404
$$ plain form
9089 46864105 46440889 46038276 45546832 44935231 44072287 42821077 41316994 39807809 38356671
9080 38356671 37156797 36189127 35327442 34358859 33274481 32184128 31154328 30173154 29271230
9071 29271230 28484668 27719673 26910663 26060502 24785036 23203661 21444611 19730529 18165648
9062 18165648 16769300 15600510 14489907 13275494 12089096 10945493 9869320 8847134
9054 8847134 8002663 7344403 6711969 6030777 5342500 4828273 4489386 4193819 3939013 3707610
9044 3707610 3539540 3462545 3369600 3183428 2982182 2892502 2787193 2718025 2635357 2565919 2465259
9033 2465259 2376398 2283975 2237688 2261032 2249358 2324145 2286164 2208229 2189737 2115644 2106064 2112498
9021 2112498 2021921 1985997 1909671 1915768 1884564 1878353 1939282 1947093 1887147 1843284 1780974 1749475
$$ packed form
9089D6864105m23216m02613m91444o11601q62944j251210j504083j509185j451138
9080C8356671j199874r67670q61685r68583j084378j090353j029800r81174r01924
9071B9271230p86562p64995q09010q50161j275466j581375j759050j714082j564881
9062A8165648j396348j168790j110603j214413j186398j143603j076173j022186
9054H847134q44471o58260o32434o81192o88277n14227l38887k95567k54806k31403
9044C707610j68070p6995r2945j86172k01246q9680j05309o9168q2668o9438j00660
9033B465259q8861r2423m6287K3344j1674P4787l7981p7935j8492p4093r580O434
9021B112498r0577l5924p6326O097l1204o211O0929P811n9946m3863o2310l1499
$$ plain form
9009 1749475 1741902 1741284 1759477 1826807 1854378 1859005 1912199 2017060 2069831 2088471 2112008 2114576
8997 2114576 2135791 2149133 2204765 2219106 2251594 2279764 2337405 2389413 2444392 2475477 2465275
8986 2465275 2493449 2545753 2616799 2703416 2745679 2715922 2705897 2702088 2727554 2754632 2723095 2690553
8974 2690553 2638501 2693563 2803604 2942550 3020802 3040985 3172772 3268531 3243200 3305628 3378669
8963 3378669 3524059 3562881 3616961 3679601 3775357 3893430 3933620 3922273 3908069 3975977 4018686
8952 4018686 4025216 4055531 4176037 4231487 4252255 4299845 4362226 4394315 4501882 4566889 4713919
8941 4713919 4897182 5063453 5164217 5303952 5341866 5370729 5404660 5515011 5630360 5698695
8931 5698695 5808443 5898420 5986077 6036920 6128205 6286276 6476313 6796213 7053073 7355853
$$ packed form
9009A749475p573o18J8193O7330K7571M627N3194J04861N2771J8640K3537K568
8997B114576K1215J3342N5632J4341L2488K8170N7641N2008N4979L1085j0202
8986B465275K8174N2304P1046Q6617M2263k9757j0025l809K5466K7078l1537l2542
8974B690553n2052N5062J10041J38946P8252K0183J31787R5759k5331O2428P3041
8963C378669J45390L8822N4080O2640R5756J18073M0190j1347j4204O7908M2709
8952D018686O530L0315J20506N5450K0768M7590O2381L2089J07567O5007J47030
8941D713919J83263J66271J00764J39735L7914K8863L3931J10351J15349O8335
8931E698695J09748Q9977Q7657N0843R1285J58071J90037L19900K56860L02780
$$ plain form
8921 7355853 7636541 7952721 8371044 8905953 9476691 10139374 10803507 11517042 12371656 13417017
8911 13417017 14512962 15713554 17211607 18905215 20812531 23029153 25586230 28518759
8903 28518759 31995614 36024415 40822908 46515289 53227652 61238784 70839092 82445400
8895 82445400 96546657 113720553 134455130 159218162 188053583 220323450 255015981
8888 255015981 290733887 326079749 359909112 391058953 418453750 441100571 458036267
8881 458036267 468747176 473004280 471158965 464291425 454022210 442492273 431596192
8874 431596192 422701451 416673133 413913309 414590611 418462150 425232992 434262300 444574666
8866 444574666 454622618 462542027 466498046 465245845 458004067 444648603 425472446 401313824
$$ packed form
8921G355853K80688L16180M18323N34909N70738O62683O64133P13535Q54614J045361
8911A3417017J095945J200592J498053J693608J907316K216622K557077K932529
8903B8518759L476855M028801M798493N692381O712363Q011132R600308J1606308
8895H2445400J4101257J7173896K0734577K4763032K8835421L2269867L4692531
8888B55015981L5717906L5345862L3829363L1149841K7394797K2646821J6935696
8881D58036267J0710909M257104j845315o867540j0269215j1529937j0896081
8874D31596192q894741o028318k759824O77302L871539O770842R029308J0312366
8866D44574666J0047952P919409L956019j252201p241778j3355464j9176157k4158622
$$ plain form
8858 401313824 373041365 341823579 308688439 274914905 241687770 210301455 181786800
8851 181786800 156794730 135457228 117640241 102872627 90618177 80419815 72167689
8844 72167689 65750652 61036818 57513859 53164142 47564302 41827590 36863559 32887211
8836 32887211 29642131 27029779 24779806 22815635 21130938 19726110 18427140 17334427
8828 17334427 16380418 15340561 14526273 13812999 13103020 12487577 11990604 11511400 10997326
8819 10997326 10577863 10264870 9939111 9625355 9298761 8967748 8710317 8484195 8272939
8810 8272939 8078081 7837168 7670168 7548566 7347100 7203203 7091700 7006480 6828536 6614389
8800 6614389 6381470 6207018 6108811 5919490 5728627 5643888 5501712 5345901 5272432 5190314
$$ packed form
8858D01313824k8272459l1217786l3135140l3773534l3227135l1386315k8514655
8851A81786800k4992070k1337502j7816987j4767614j2254450j0198362q252126
8844G2167689o417037m713834l522959m349717n599840n736712m964031l976348
8836C2887211l245080k612352k249973j964171j684697j404828j298970j092713
8828A7334427r54009j039857q14288p13274p09979o15443m96973m79204n14074
8819A0997326m19463l12993l25759l13756l26594l31013k57431k26122k11256
8810H272939j94858k40913j67000j21602k01466j43897j11503q5220j77944k14147
8800F614389k32919j74452r8207j89321j90863q4739j42176j55811p3469q2118
$$ plain form
8790 5190314 5068356 4986476 4996001 4959854 4955223 4920145 4888217 4867686 4851747 4806586 4728782 4626091
8778 4626091 4540983 4485636 4461069 4512750 4454886 4469051 4540855 4483968 4452142 4481946 4485281 4447840
8766 4447840 4536052 4628169 4814991 4973975 5130945 5288445 5448325 5769803 6120756 6452675
8756 6452675 6864219 7414864 8009455 8639534 9498923 10524529 11679902 13016757 14504851
8747 14504851 16277357 18266560 20665122 23871492 28151554 33922495 41802884 52008572
8739 52008572 64558433 78779951 92982927 104675340 111617232 112489873 107229341 97229115
8731 97229115 84668021 71563432 59559870 49550124 41542356 35434208 30893375 27544652
8723 27544652 25110692 23254563 21762893 20491587 19295377 18394912 17743634 17285857 17211893
$$ packed form
8790E190314j21958q1880R525l6147m631l5078l1928k0531j5939m5161p7804j02691
8778D626091q5108n5347k4567N1681n7864J4165P1804n6887l1826K9804L335l7441
8766D447840Q8212R2117J86822J58984J56970J57500J59880L21478L50953L31919
8756F452675M11544N50645N94591O30079Q59389J025606J155373J336855J488094
8747A4504851J772506J989203K398562L206370M280062N770941P880389J0205688
8739E2008572J2549861J4221518J4202976J1692413O941892Q72641n260532j0000226
8731I7229115j2561094j3104589j2003562j0009746q007768o108148m540833l348723
8723B7544652k433960j856129j491670j271306j196210r00465o51278m57777p3964
$$ plain form
8714 17211893 17658057 18694710 20495459 22996590 25991765 29020416 31578224 33056178
8706 33056178 33176857 32241482 30789180 29667837 29515923 30802216 33770483 38452597 44548832
8697 44548832 50843570 56075629 59104695 59358736 57431256 54471481 51941294 50885738
8689 50885738 52173879 56077476 62550311 71158128 81017490 90834637 99107557 104445377
8681 104445377 105976315 103590129 98020125 90808645 83606546 77742941 74017974 72144597
8673 72144597 71098706 69588694 66490086 61385790 54961752 48137050 41961693 37133170
8665 37133170 33964858 32477714 32326193 32946986 33641185 33758873 32711647 30505300 27535217
8656 27535217 24329839 21276579 18663815 16677887 15341366 14414606 13889807 13695815 13858642
$$ packed form
8714A7211893M46164J036653J800749K501131K995175L028651K557808J477954
8706C3056178J20679r35375j452302j121343j51914J286293K968267M682114O096235
8697D4548832O294738N232059L029066K54041j927480k959775k530187j055556
8689E0885738J288141L903597O472835Q607817R859362R817147Q272920N337820
8681A04445377J530938k386186n570004p211480p202099n863605l724967j873377
8673G2144597j045891j510012l098608n104296o424038o824702o175357m828523
8665C7133170l168312j487144j51521O20793O94199J17688j047226k206347k970083
8656B7535217l205378l053260k612764j985928j336521r26760n24799j93992J62827
$$ plain form
8647 13858642 14206102 14699068 15380853 16270310 17390118 18697547 20494030 22799115 25914801
8638 25914801 30265440 36188066 44176900 54280016 66075503 78225204 88905868 95881575
8630 95881575 97445654 93324977 84583121 73207430 61252693 50286689 41081166 33737903
8622 33737903 28104332 23873369 20731079 18257638 16355452 14824214 13447205 12110537
8614 12110537 10860243 9737392 8839579 8079174 7362242 6798148 6273820 5774474 5448818
8605 5448818 5218253 4923081 4619642 4388668 4115067 3789560 3558127 3354493 3191315 3089007
8595 3089007 3036936 2853483 2708165 2552708 2351781 2264846 2226744 2225717 2196953 2095662 2021489
8584 2021489 1886906 1785838 1686887 1558333 1553596 1493503 1355832 1278579 1177342 1107813 1150194
$$ packed form
8647A3858642L47460M92966O81785Q89457J119808J307429J796483K305085L115686
8638B5914801M350639N922626P988834J0103116J1795487J2149701J0680664O975707
8630I5881575J564079m120677q741856j1375691j1954737j0966004r205523p343263
8622C3737903n633571m230963l142290k473441j902186j531238j377009j336668
8614A2110537j250294j122851q97813p60405p16932n64094n24328m99346l25656
8605E448818k30565k95172l03439k30974k73601l25507k31433k03634j63178j02308
8595C089007n2071j83453j45318j55457k00927q6935l8102j027k8764j01291p4173
8584B021489j34583j01068r8951j28554m737o0093j37671p7253j01237o9529M2381
$$ plain form
8573 1150194 1162799 1105011 1033948 1031889 1016820 1006719 1030206 1007003 1029547 922319 825515
8562 825515 789813 721488 652468 621707 551672 590585 752221 834920 887623 885365 871585 797859
8550 797859 787798 850294 906527 1027802 1009850 955238 933854 1006129 1048905 1021318 1036314
8539 1036314 1035483 1034394 1056552 1015052 1005839 1073783 1006141 1049359 1099623 1091903 1099853 1039981 994968
8526 994968 1044114 1092850 1049386 1015025 965352 981419 975438 980505 929997 799152 773603 772313
8514 772313 782748 805073 867826 916193 967230 970824 1004380 1025151 1029319 960387 1057864 1213356
8502 1213356 1338402 1430127 1476592 1532505 1637422 1768199 1935351 2138912 2171316 2153075
8492 2153075 2224851 2313528 2386998 2506608 2565288 2569062 2658871 2810958 2951269 3103203 3127213
$$ packed form
8573A150194J2605n7788p1063k059j5069j0101K3487k3203K2544j07228r6804
8562H25515l5702o8325o9020l0761p0035L8913J61636Q2699N2703k258j3780p3726
8550G97859j0061O2496N6233J21275j7952n4612k1384P2275M2776k7587J4996
8539A036314q31j089K2158m1500r213O7944o7642M3218N0264p720P950n9872m5013
8526I94968M9146M8736m3464l4361m9673J6067n981N067n0508j30845k5549j290
8514G72313J0435K2325O2753M8367N1037L594L3556K0771M168o8932R7477J55492
8502A213356J25046R1725M6465N5913J04917J30777J67152K03561L2404j8241
8492B153075P1776Q8677P3470J19610N8680L774Q9809J52087J40311J51934K4010
$$ plain form
8481 3127213 3058370 2983013 3007782 2933808 2953238 2910613 2926076 2885682 2872350 2860609 2875148
8470 2875148 2799482 2828239 2831157 2792482 2842672 2884590 2931191 2907917 2839819 2794467 2754557 2695334
8458 2695334 2599365 2416511 2214543 2015996 1853023 1789982 1700510 1573842 1463458 1391825
8448 1391825 1257010 1194515 1093826 1061539 1065419 1048956 1009111 922300 921339 926490 832839 760520
8436 760520 719843 748629 654325 597268 632509 571590 579565 534460 521404 453903 485477 573248
8424 573248 582356 536576 513946 533300 561972 549772 584025 613697 569776 470035 475711 479793
8412 479793 496916 553244 609774 648583 644546 693545 725584 696692 676695 603430 491465 487282
8400 487282 513928 618240 628671 642013 635544 609010 564514 563895 530176 497771 478695 478929
$$ packed form
8481C127213o8843p5357K4769p3974J9430m2625J5463m0394j3332j1741J4539
8470B875148p5666K8757K918l8675N0190M1918M6601k3274o8098m5352l9910n9223
8458B695334r5969j82854k01968j98547j62973o3041q9472j26668j10384p1633
8448A391825j34815o2495j00689l2287L880j6463l9845q6811r61N151r3651p2319
8436G60520m0677K8786r4304n7057L5241o0919P975m5105j3056o7501L1574Q7771
8424E73248R108m5780k2630J9354K8672j2200L4253K9672m3921r9741N676M082
8412D79793J7123N6328N6530L8809m037M8999L2039k8892j9997p3265j11965m183
8400D87282K6646J04312J0431J3342o469k6534m4496o19l3719l2405j9076K34
$$ plain form
8388 478929 536587 574178 498326 443780 468538 504746 481824 468858 461848 450039 451601 478593
8376 478593 440149 417172 379723 390346 373496 387295 328882 269625 291177 303981 400347 393223
8364 393223 378251 352688 396399 384685 403919 408346 394900 370169 419650 366893 379032 370677
8352 370677 389867 359693 419198 455828 500615 492703 519225 506043 484339 514955 561832 589728
8340 589728 651974 718585 737063 782571 797190 833583 888549 969660 957175 947036 828688
8329 828688 754477 670492 548472 518826 491594 515336 490502 443917 446481 432784 456658 497935
8317 497935 532973 510692 474760 455778 510054 536129 526960 477321 455302 485256 506489 499864
8305 499864 581888 660343 591400 501472 443302 502751 641201 622796 671112 676743 666782 667001
$$ packed form
8388D78929N7658L7591p5852n4546K4758L6208k2922j2966p010j1809J562K6992
8376D78593l8444k2977l7449J0623j6850J3799n8413n9257K1552J2804R6366p124
8364C93223j4972k5563M3711j1714J9234M427j3446k4731M9481n2757J2139q355
8352C70677J9190l0174N9505L6630M4787p912K6522j3182k1704L0616M6877K7896
8340E89728O2246O6611J8478M5508J4619L6393N4966Q1111j2485j0139j18348
8329H28688p4211q3985j22020k9646k7232K3742k4834m6585K564j3697K3874M1277
8317D97935L5038k2281l5932j8982N4276K6075r169m9639k2019K9954K1233o625
8305D99864Q2024P8455o8943q9928n8170N9449J38450j8405M8316N631r961K19
$$ plain form
8293 667001 690493 727022 679263 640354 676385 678150 614891 615807 627948 737776 882088 933926
8281 933926 980524 967400 980211 935184 920174 910176 794818 662141 657932 673390 669795 706058
8269 706058 729117 684799 616939 690858 629245 522343 551033 581143 570619 499598 481046
8258 481046 496894 448562 398294 478553 442140 402246 478874 465218 431648 384365 423451 402443
8246 402443 359385 396921 362227 367802 359412 373375 327558 355190 369656 306755 275828 341408
8234 341408 449943 511720 536547 606064 666280 741538 859937 806662 670058 602327 525195
8223 525195 449324 442147 480766 471613 513500 493335 454588 439939 484268 433656 326902 281236
8211 281236 293436 299816 262965 321983 337794 343660 331346 290185 238938 272199 344530 314679
$$ packed form
8293F67001K3492L6529m7759l8909L6031J765o3259R16J2141J09828J44312N1838
8281I33926M6598j3124J2811m5027j5010r998j15358j32677m209J5458l595L6263
8269G06058K3059m4318o7860P3919o1613j06902K8690L0110j0524p1021j8552
8258D81046J5848m8332n0268Q0259l6413l9894P6628j3656l3570m7283L9086k1008
8246D02443m3058L7536l4694N575q390J3963m5817K7632J4466o2901l0927O5580
8234C41408J08535O1777K4827O9517O0216P5258J18399n3275j36604o7731p7132
8223E25195p5871p177L8619r153M1887k0165l8747j4649M4329n0612j06754m5666
8211B81236J2200O380l6851N9018J5811N866j2314m1161n1247L3261P2331k9851
$$ plain form
8199 314679 322179 274127 217594 196175 174103 163573 225510 248797 289350 304336 331857 356029
8187 356029 389168 386281 316318 304029 326049 242335 221869 194013 312833 347126 369774 328191
8175 328191 285248 336058 384028 387931 403556 384972 374060 290064 165507 209349 229335 133142
8163 133142 143361 160561 141514 246922 282000 301218 362936 375154 281208 204142 202956 251043
8151 251043 209008 222270 244774 214131 181397 154118 162401 175296 153976 125569 159708 199631
8139 199631 321769 349805 303468 288795 287188 226165 209673 191217 185385 179120 201630 232972
8127 232972 327574 313045 282127 261034 272911 283770 216010 83734 90172 111874 126738 232279
8115 232279 292575 308089 236441 188666 275730 253105 339815 406987 433689 392661 409346 401091
$$ packed form
8199C14679P500m8052n6533k1419k2072j0530O1937K3287M0553J4986K7521K4172
8187C56029L3139k887o9963j2289K2020q3714k0466k7856J18820L4293K2648m1583
8175C28191m2943N0810M7970L903J5625j8584j0912q3996j24557M3842J9986r6193
8163A33142J0219J7200j9047J05408L5078J9218O1718J2218r3946p7066j186M8087
8151B51043m2035J3262K2504l0643l2734k7279Q283J2895k1320k8407L4139L9923
8139A99631J22138K8036m6337j4673j607o1023j6492j8456n832o265K2510L1342
8127B32972R4602j4529l0918k1093J1877J0859o7760j32276O438K1702J4864J05541
8115B32279O0296J5514p1648m7775Q7064k2625Q6710O7172K6702m1028J6685q255
$$ plain form
8103 401091 379976 391397 363783 223118 178939 157720 143773 192519 178155 193594 156678
8092 156678 148791 165084 215299 314293 312321 227690 159523 256024 270936 215173 237160 217898
8080 217898 200846 126362 135446 131898 172359 281460 316646 307957 267532 293285 319011 347100
8068 347100 282201 247494 292624 267891 265000 184665 100241 109494 133020 131068 163489 156480
8056 156480 144718 93022 128530 221712 228255 205627 191077 249084 250666 213612 187690 249013
8044 249013 310731 250158 199387 244264 245349 203694 157927 162390 212631 195984 201440 215117
8032 215117 215929 277296 335660 353382 295729 330007 394321 365874 399032 487875 467668 461354
8020 461354 422701 398601 379710 357798 306469 304889 295634 283482 291946 292443 316467 391034 414137
$$ packed form
8103D01091k1115J1421k7614j40665m4179k1219j3947M8746j4364J5439l6916
8092A56678p887J6293N0215R8994j972q4631o8167R6501J4912n5763K1987j9262
8080B17898j7052p4484R084l548M0461J09101L5186q689m0425K5753K5726K8089
8068C47100o4899l4707M5130k4733k891q0335q4424R253K3526j952L2421p009
8056A56480j1762n1696L5508R3182O543k2628j4550N8007J582l7054k5922O1323
8044B49013O1718o0573n0771M4877J085m1655m5767M463N0241j6647N456J3677
8032B15117Q12O1367N8364J7722n7653L4278O4314k8447L3158Q8843k0207o314
8020D61354l8653k4100j8891k1912n1329j580r255j2152Q464M97K4024P4567K3103
$$ plain form
8007 414137 435677 424504 417291 384236 389768 369073 367552 356580 362189 384997 378643 453514 530646
7994 530646 536502 599320 696396 786004 812437 757891 636261 503872 452234 353265 295621
7983 295621 337996 396622 441583 415714 343487 349235 401933 456232 420847 377355 419140 378242
7971 378242 317355 311383 383465 420549 338270 263093 335636 334176 287289 289648 296364 277848
7959 277848 218914 189057 201327 208414 300433 343180 301795 264423 251575 202653 178816 246548
7947 246548 285511 393854 422554 366527 299381 308600 329524 281167 266798 243183 191584 187662
7935 187662 201583 184216 181835 152566 236757 268976 195278 180436 207148 219013 203520 86766
7923 86766 43068 152498 185521 144217 153881 162067 125978 132979 164900 244433 296331 260568
$$ packed form
8007D14137K1540j1173p213l3055N532k0695j521j0972N609K2808o354P4871P7132
7994E30646N856O2818R7076Q9608K6433n4546j21630j32389n1638r8969n7644
7983B95621M2375N8626M4961k5869p2227N748N2698N4299l5385m3492M1785m0898
7971C78242o0887n972P2082L7084q2279p5177P2543j460m6887K359O716j8516
7959B77848n8934k9857J2270P087R2019M2747m1385l7372j2848m8922k3837O7732
7947B46548L8963J08343K8700n6027o7146R219K0924m8357j4369k3615n1599l922
7935A87662J3921j7367k381k9269Q4191L2219p3698j4842K6712J1865j5493j16754
7923H6766m3698J09430L3023m1304R664Q186l6089P001L1921P9533N1898l5763
$$ plain form
7911 260568 198864 259455 288710 309401 303878 330277 259530 197106 125624 124640 88725 87516
7899 87516 58430 112839 171608 143749 99160 135061 114733 64743 120093 114609 162192 174766
7887 174766 125869 155796 174712 187801 131439 105514 132948 133959 113232 110425 158792 241442
7875 241442 275592 303635 242434 224330 273904 294109 244294 228704 179975 151865 152371 99649
7863 99649 138392 120284 105154 125973 117757 84652 144140 138266 145130 147933 296033 415366
7851 415366 389826 273826 180466 124446 180541 206995 130337 131380 56245 107948 123709 154701
7839 154701 183191 72805 51785 98930 83496 56109 91780 107815 94369 151518 160739 133232
7827 133232 104860 83401 127451 167965 179295 183857 202492 131807 158668 145777 153639 206610
$$ packed form
7911B60568o1704O0591K9255K0691n523K6399p0747o2424p1482r84l5915j209
7899H7516k9086N4409N8769k7859m4589L5901k0328m9990N5350n484M7583J2574
7887A74766m8897K9927J8916J3089n6362k5925K7434J011k0727k807M8367Q2650
7875B41442L4150K8043o1201j8104M9574K0205m9815j5590m8729k8110N06n2722
7863I9649L8743j8108j5130K0819q216l3105N9488n874O864K803J48100J19333
7851D15366k5540j16000r3360n6020N6095K6454p6658J043p5135N1703J5761L0992
7839A54701K8490j10386k1020M7145j5434k7387L5671J6035j3446N7149R221k7507
7827A33232k8372k1459M4050M0514J1330M562J8635p0685K6861j2891P862N2971
$$ plain form
7815 206610 227673 155752 123678 208238 309237 281516 153188 69585 95307 153027 187994
7804 187994 140879 125423 150446 79803 105515 167023 166373 111122 122225 156144 222330 224161
7792 224161 149566 171833 251634 325170 250242 145387 142005 207811 179885 50319 -2919
7781 -2919 79191 182173 259542 219788 140447 132063 238603 204512 174700 184635 151420 109971
7769 109971 110644 136555 161093 138773 145482 201697 171966 140276 177590 198596 117978 118908 47181
7756 47181 46416 -19504 -41953 103667 175822 174297 145364 127665 118550 133192 174296 145356
7744 145356 130867 152554 169054 154222 151188 142298 159770 138385 147679 169670 212048 248594
7732 248594 214811 180605 158616 140051 141663 97531 102938 83799 6510 -5327 55505 125574
$$ packed form
7815B06610K1063p1921l2074Q4560J00999k7721j28328q3603K5722N7720L4967
7804A87994m7115j5456K5023p0643K5712O1508o50n5251J1103L3919O6186J831
7792B24161p4595K2267P9801P3536p4928j04855l382O5806k7926j29566n3238
7781b919Q2110J02982P7369l9754p9341q384J06540l4091k9812R935l3215m1449
7769A09971O73K5911K4538k2320O709N6215k9731l1690L7314K1006q0618R30p1727
7756D7181p65o5920k2449J45620P2155j525k8933j7699r115J4642M1104k8940
7744A45356j4489K1687J6500j4832l034q890J7472k1385R294K1991M2378L6546
7732B48594l3783l4206k1989j8565J612m4132N407j9139p7289j1837O0832P0069
$$ plain form
7720 125574 213265 201274 100792 129117 103872 69772 99729 63031 -8722 44151 70530
7709 70530 94512 96277 50253 54977 141861 186329 98096 20690 30597 91666 152044 143766 155617
7696 155617 130363 80730 88026 171942 195852 161896 189630 196778 178132 101536 39309 60404
7684 60404 21685 -10424 -39033 12944 47194 60287 25040 15294 -14181 -42444 -21035 61029
7672 61029 152521 272967 252122 213940 152793 117413 156602 174206 147888 186522 145291 122033
7660 122033 156394 139562 110023 50042 14301 -25112 -8085 110705 134276 125236 233408
7649 233408 207528 125890 143698 153237 152401 154893 219548 208214 179835 96989 87885 118898 99456
7636 99456 145947 147793 75493 121239 155730 153896 98499 44350 66469 63572 42904 20894
$$ packed form
7720A25574Q7691j1991j00482K8325k5245l4100K9957l6698p1753N2873K6379
7709G0530K3982J765m6024M724Q6884M4468q8233p7406R907O1069O0378q278J1851
7696A55617k5254m9633P296Q3916K3910l3956K7734P148j8646p6596o2227K1095
7684F0404l8719l2109k8609N1977L4250J3093l5247r746k9475k8263K1409Q2064
7672F1029R1492J20446k0845l8182o1147l5380L9189J7604k6318L8634m1231k3258
7660A22033L4361j6832k9539n9981l5741l9413J7027J18790K3571r040J08172
7649B33408k5880q1638J7808R539q36K492O4655j1334k8379q2846r104L1013j9442
7636I9456M6491J846p2300M5746L4491j834n5397n4149K2119k897k0668k2010
$$ plain form
7624 20894 101870 90256 72416 62891 24851 9923 19007 92310 130113 126803 108380 128530
7612 128530 208601 174874 94839 14983 32775 97964 108352 106697 49037 83097 131019 181760
7600 181760 235444 227012 139144 133044 144366 137337 134209 109419 57512 79030 43762 63054
7588 63054 90493 95023 56337 28211 29224 113652 131219 155874 105982 49900 81570 43559
7576 43559 82634 97607 127068 170945 182466 100895 99877 93638 47390 58966 61255 84477
7564 84477 103131 71528 93872 117138 79284 132440 136456 133161 128725 113948 139237 85020
7552 85020 71635 80178 89962 127982 195333 183021 161892 111276 135469 162644 132865 61765
7540 61765 76374 157799 273362 174254 92115 61639 106830 126858 84478 -72117 -97538
$$ packed form
7624B0894Q0976j1614j7840r525l8040j4928R084P3303L7803l310j8423K0150
7612A28530Q0071l3727q0035p9856J7792O5189J0388j655n7660L4060M7922N0741
7600A81760N3684q432q7868o100J1322p029l128k4790n1907K1518l5268J9292
7588F3054K7439M530l8686k8126J013Q4428J7567K4655m9892n6082L1670l8011
7576D3559L9075J4973K9461M3877J1521q1571j018o239m6248J1576K289K3222
7564H4477J8654l1603K2344K3266l7854N3156M016l295m436j4777K5289n4217
7552H5020j3385Q543R784L8020O7351j2312k1129n0616K4193K7175k9779p1100
7540F1765J4609Q1425J15563r9108q2139l0476M5191K0028m2380j56595k5421
$$ plain form
7529 -97538 6191 23228 68381 114653 119215 143933 183232 145693 171974 211285 276843 260909
7517 260909 147276 52236 23675 19733 58153 161429 183264 90698 112016 197416 219142
7506 219142 179537 193557 157168 164499 100285 35712 55605 54199 34507 38698 -45094 -106465
7494 -106465 -53007 45721 20786 2772 18043 13531 85182 107954 115036 55298 12640 88568
7482 88568 113919 79952 74822 -15153 11445 17285 26871 36050 52978 28537 -1492 -554 31508
7469 31508 39944 49959 71944 97658 68505 40057 -26833 -11446 24273 81565 102094 86317
7457 86317 48178 1037 -11575 19805 56913 97084 72250 64063 -58339 -33584 7939 14532
7445 14532 72089 63300 21673 76759 110485 75822 56684 76978 118794 129103 123249 81180
$$ packed form
7529i7538J03729J7037M5153M6272M562K4718L9299l7539K6281L9311O5558j5934
7517B60909j13633r5040k8561l942L8420J03276K1835r2566K1318Q5400K1726
7506B19142l9605J4020l6389P331o4214o4573J9893j406j9692M191q3792o1371
7494a06465N3458R8728k4935j8014J5271m512P1651K2772P082n9738m2658P5928
7482H8568K5351l3967n130q9975K6598N840R586R179J6928k4441l0029R38L2062
7469C1508Q436J0015K1985K5714k9153k8448o6890J5387L5719N7292K0529j5777
7457H6317l8139m7141j2612L1380L7108M0171k4834q187j22402K4755M1523O593
7445A4532N7557q789m1627N5086L3726l4663j9138K0294M1816J0309n854m2069
$$ plain form
7433 81180 11282 -64216 -40064 74211 132811 125401 170604 176657 134652 84895 29741 120108
7421 120108 214138 146510 147800 188281 180052 146114 158679 249128 209203 136543 117531 119824
7409 119824 94004 76742 62009 111555 145788 154554 186766 52039 42 76497 93657 75755
7397 75755 62911 78721 30017 -79912 -21632 16366 58044 97761 100109 147459 155293 129698
7385 129698 130255 159386 169638 179963 138082 45351 46608 80207 114096 123476 138167 80172
7373 80172 52962 9368 17191 60048 73136 77857 106356 157351 150374 186296 151979 196462
7361 196462 207834 139877 22028 61329 78238 128429 71980 22670 -9866 7062 77483
7350 77483 7812 1056 8814 -16125 43300 40606 24501 29995 7743 -17884 -22277 23661 191861
$$ packed form
7433H1180o9898p5498K4152J14275N8600p410M5203O053m2005m9757n5154R0367
7421A20108R4030o7628J290M0481q229l3938J2565R0449l9925p2660j9012K293
7409A19824k5820j7262j4733M9546L4233Q766L2212j34727n1997P6455J7160j7902
7397G5755j2844J5810m8704j09929N8280L7998M1678L9717K348M7350P834k5595
7385A29698N57K9131J0252J0325m1881r2731J257L3599L3889R380J4691n7995
7373H0172k7210m3594P823M2857J3088M721K8499N0995o977L5922l4317M4483
7361A96462J1372o7957j17849L9301J6909N0191n6449m9310l2536J6928P0421
7350G7483o9671o756P758k4939N9425k694j6105N494k2252k5627m393M5938J68200
$$ plain form
7337 191861 272178 256966 222564 117094 114757 140777 117474 38113 -35364 291 49033 5658
7325 5658 52278 95352 113565 121363 75947 13961 58719 161913 204250 195457 229513 232728
7313 232728 263957 153971 91157 88969 139384 176730 160997 199245 164653 104446 25081 -40410
7301 -40410 19937 162512 208680 219634 152603 90048 69123 -2886 -16192 -42344 18261 25323
7289 25323 72814 146785 24327 11837 29510 100151 97262 38810 14127 51383 79048 87653
7277 87653 66456 55308 68042 54372 87440 58725 83866 21992 -12179 -35510 -50347 -43937
7265 -43937 -8070 -76303 -67065 -63033 5307 57939 111508 119011 93239 60188 31292 57495
7253 57495 -14886 14597 78129 72516 78256 105490 166668 166942 167626 115904 78650 90756 100316
$$ packed form
7337A91861Q0317j5212l4402j05470k337K6020k3303p9361p3477L5655M8742m3375
7325E658M6620M3074J8213P798m5416o1986M4758J03194M2337q793L4056L215
7313B32728L1229j09986o2814k188N0415L7346j5733L8248l4592o0207p9365o5491
7301d0410O0347J42575M6168J0954o7031o2555k0925p2009j3306k6152O0605P062
7289B5323M7491P3971j22458j2490J7673P0641k889n8452k4683L7256K7665Q605
7277H7653k1197j1148J2734j3670L3068k8715K5141o1874l4171k3331j4837O410
7265d3937L5867o8233R238M032O8340N2632N3569P503k5772l3051k8896K6203
7253E7495p2381K9483O3532n613N740K7234O1178K74O84n1722l7254J2106R560
$$ plain form
7240 100316 140361 123646 77681 83878 164593 197372 151774 164408 98936 113817 140882 132640
7228 132640 99562 96898 153223 177313 172354 149945 113742 63088 53980 100499 92533 128931
7216 128931 151586 120080 38494 -25238 -55334 3748 12010 -28084 2951 59763 80811 106548
7204 106548 133491 115965 148130 153385 63755 99063 106448 36966 5487 5412 -66101 -5092 25306
7191 25306 29446 2228 -4789 26046 88738 -5296 14384 16366 32876 92580 80393 27567
7179 27567 -342 22521 -26361 27706 90583 123811 186179 132837 119154 157883 191654 130290
7167 130290 97247 85415 112266 86126 57905 103080 132968 153749 179759 195452 248245 212027
7155 212027 153315 92901 126251 89858 115946 124363 152322 200781 172439 185607 134775 59499
$$ packed form
7240A00316M0045j6715m5965O197Q0715L2779m5598J2634o5472J4881K7065q242
7228A32640l3078k664N6325K4090m959k2409l6203n0654r108M6519p966L6398
7216A28931K2655l1506q1586o3732l0096N9082Q262m0094L1035N6812K1048K5737
7204A06548K6943j7526L2165N255q9630L5308P385o9482l1479p5p1513O1009L0398
7191B5306M140k7218p017L0835O2692r4034J9680J982J6510N9704j2187n2826
7179B7567k7909K2863m8882N4067O2877L3228O2368n3342j3683L8729L3771o1364
7167A30290l3043j1832K6851k6140k8221M5175K9888K0781K6010J5693N2793l6218
7155B12027n8712o0414L3350l6393K6088Q417K7959M8459k8342J3168n0832p5276
$$ plain form
7143 59499 29972 31764 50353 7046 37679 133368 132487 68011 80472 178820 172278 132532 107101
7130 107101 33543 -22939 33050 58463 90360 17930 -22405 -15115 -21821 -23969 47579 41391
7118 41391 34968 64719 137440 137677 83116 49628 47249 8476 24109 -40921 -109228 -133675 -112651
7105 -112651 -69152 -37500 -41344 -43222 10101 25827 94601 108229 124928 104207 69320 47581
7093 47581 13764 8023 -19265 -52249 16475 119343 163862 112748 237457 220402 98225
7082 98225 59152 90252 48800 12572 74089 120012 127399 78654 10057 -42090 18685 39789
7070 39789 35862 90002 105918 44826 11784 33100 96439 107690 116163 94206 56173 73025
7058 73025 77908 39946 59505 42779 58576 79165 47586 -3161 -9280 70389 92551 88754
$$ packed form
7143E9499k9527J792J8589m3307L0633R5689q81o4476J2461R8348o542l9746k5431
7130A07101p3558n6482N5989K5413L1897p2430m0335P290o706k148P1548o188
7118D1391o423K9751P2721K37n4561l3488k379l8773J5633o5030o8307k4447K1024
7105a12651M3499L1652l844j878N3323J5726O8774J3628J6699k0721l4887k1739
7093D7581l3817n741k7288l2984O8724J02868M4519n1114J24709j7055j22177
7082I8225l9073L1100m1452l6228O1517M5923P387m8745o8597n2147O0775K1104
7070C9789l927N4140J5916o1092l3042K1316O3339J1251Q473k1957l8033J6852
7058G3025M883l7962J9559j6726J5797K0589l1579n0747o119P9669K2162l797
$$ plain form
7046 88754 107727 94852 117441 155901 130294 136781 127064 52619 15388 50155 83698 41930
7034 41930 25112 49277 46169 -20972 -30272 -24131 31559 4635 -52572 -27147 -30150 2479 46939
7021 46939 53679 94421 82842 98027 74112 74865 146978 159329 89944 813 -7964 25645 83019
7008 83019 61611 89304 64389 7545 -88405 -107806 4517 113954 82859 122163 127107 122212
6996 122212 165179 155385 55479 35204 76130 161297 165185 114749 175397 205708 171376 89445
6984 89445 21264 16399 14734 23 -54760 -88748 -56561 -25579 4440 8573 -4252 28530
6972 28530 18361 45795 62197 77816 133476 175662 134779 81089 38076 59885 46212 60693
6960 60693 35661 14121 52592 34751 42150 25366 -77614 -57519 73383 95975 116547 125773
$$ packed form
7046H8754J8973j2875K2589L8460k5607O487r717p4445l7231L4767L3543m1768
7034D1930j6818K4165l108o7141r300O141N5690k6924n7207K5425l003L2629M4460
7021D6939O740M0742j1579J5185k3915P53P2113J2351o9385q9131q777L3609N7374
7008H3019k1408K7693k4915n6844r5950j9401J12323J09437l1095L9304M944m895
6996A22212M2967r794r9906k0275M0926Q5167L888n0436O0648L0311l4332q1931
6984H9445o8181m865j665j4711n4783l3988L2187L0982L0019M133j2825L2782
6972B8530j0169K7434J6402J5619N5660M2186m0883n3690m3013K1809j3673J4481
6960F0693k5032k1540L8471j7841P399j6784j02980K0095J30902K2592K0572R226
$$ plain form
6948 125773 37492 -29869 -35964 -28545 -59410 -94613 -142115 -80029 3345 11416 -1369 10778
6936 10778 -17878 -29569 -20411 27534 34019 26732 5792 3188 98376 142981 152261 84093 53528
6923 53528 63552 96683 120975 155310 106743 -29522 -63330 44228 138070 111441 122380
6912 122380 143611 88680 51988 57401 89498 127732 151072 98718 93668 158789 135049 132829
6900 132829 150733 146586 129144 69120 47711 36171 92098 96091 52584 10506 11634 32513
6888 32513 36438 38058 -16366 -50007 -42675 12955 13210 66295 89082 94246 15934 27740 22223
6875 22223 -23739 -69168 -36928 -19180 8530 75319 38450 -49036 -45510 50445 119228 155586
6863 155586 162537 170612 183949 212165 190926 128167 103886 154124 122758 131059 65984 26346
$$ packed form
6948A25773q8281o7361o095P419l0865l5203m7502O2086Q3374Q071j2785J2147
6936A0778k8656j1691R158M7945O485p287k0940k604R5188M4605R280o8168l0565
6923E3528J0024L3131K4292L4335m8567j36265l3808J07558R3842k6629J0939
6912A22380K1231n4931l6692N413L2097L8234K3340n2354n050O5121k3740k220
6900A32829J7904m147j7442o0024k1409j1540N5927L993m3507m2078J128K0879
6888C2513L925J620n4424l3641P332N5630K55N3085K2787N164p8312J1806n517
6875B2223m5962m5429L2240J7748K7710O6789l6869q7486L526R5955O8783L6358
6863A55586O951Q075J3337K8216k1239o2759k4281N0238l1366Q301o5075l9638
$$ plain form
6851 26346 62566 110110 155587 169149 126162 113100 110196 151894 155249 98045 65950 -30987
6839 -30987 -30079 35510 85882 67130 62374 15434 -6820 5692 2913 44258 75850 115277 191752
6826 191752 150502 97584 65640 18972 7353 21106 39989 13834 -35496 29708 86927 140521
6814 140521 173466 213211 189072 148351 148501 126994 127047 76338 30147 -38877 -89302 -6282 43413
6801 43413 33408 65422 63756 27278 42680 52815 81421 10075 -41731 -53337 -56444 -66563
6789 -66563 -31625 -12693 7772 44356 10111 -18126 -57568 -52793 -34501 53783 46233 -38205
6777 -38205 -53016 -19582 28745 40035 -19920 -68874 -81744 8824 46413 38959 -4332 -90029
6765 -90029 -90750 -67816 -32087 31246 102593 121734 68686 -22127 7550 114305 200255 157592
$$ packed form
6851B6346L6220M7544M5477J3562m2987j3062k904M1698L355n7204l2095r6937
6839c0987R08O5589N0372j8752m756m6940k2254J2512k779M1345L1592L9427P6475
6826A91752m1250n2918l1944m6668j1619J3753J8883k6155m9330O5204N7219N3594
6814A40521L2945L9745k4139m0721J50k1507N3n0709m6191o9024n0425Q3020M9695
6801D3413j0005L2014j666l6478J5402J0135K8606p1346n1806j1606l107j0119
6789f6563L4938J8932K0465L6584l4245k8237l9442M775J8292Q8284p550q4438
6777c8205j4811L3434M8327J1290n9955m8954j2870R0568L7589p454m3291q5697
6765i0029p21K2934L5729O3333P1347J9141n3048r0813K9677J06755Q5950m2663
$$ plain form
6753 157592 127971 93984 2847 -62510 -22550 -12574 -3294 -43612 -54468 -44262 -23065 -24014
6741 -24014 -21193 -22583 20910 6337 16126 44394 7152 -56938 -65684 24891 109545 84530 19290
6728 19290 68784 101484 122997 94520 37077 -1229 -48310 -45355 80271 135483 137961 143148
6716 143148 105647 146990 124705 84384 153706 116053 15021 -40832 -811 71870 35529
6705 35529 38604 57136 63011 48676 -13574 -10746 7615 81855 63051 50458 44368 17147 -17888
6692 -17888 -38590 -55581 -93164 -171108 -161345 -65528 -16854 82658 98080 37691 72638 66269
6680 66269 23399 12532 -29408 -44516 29065 111763 134119 90575 35598 31467 61634 50204
6668 50204 36749 58601 50299 31139 27780 -24584 -35601 -5024 70574 23505 2913 3918
$$ packed form
6753A57592k9621l3987r1137o5357L9960R976R280m0318j0856J0206K1197r49
6741b4014K821j390M3493j4573R789K8268l7242o4090q746R0575Q4654k5015o5240
6728A9290M9494L2700K1513k8477n7443l8306m7081K955J25626N5212K478N187
6716A43148l7501M1343k2285m0321O9322l7653j01032n5853M0021P2681l6341
6705C5529L075J8532N875j4335o2250K828J8361P4240j8804j2593o090k7221l5035
6692a7888k0702j6991l7583p7944R763R5817M8674R9512J5422o0389L4947o369
6680F6269m2870j0867m1940j5108P3581Q2698K2356m3544n4977m131L0167j1430
6668E0204j3455K1852q302j9160l359n2364j1017L0577P5598m7069k0592J005
$$ plain form
6656 3918 833 -58048 -40728 33928 47892 104030 108944 141352 98046 83611 76944 89299 49102
6643 49102 24989 52076 40561 30058 70150 152579 148661 33880 22606 116291 124206 95884
6631 95884 -23612 -94338 -55517 -733 45987 55997 -2666 15441 39347 -24016 -28687 -16621
6619 -16621 52424 87051 68652 -17567 8839 39487 38571 64509 109151 44351 23126 15370
6607 15370 35812 34078 16501 81556 55452 -9208 16863 18434 21990 -21393 -23893 -7222 15548
6594 15548 42009 33286 7574 -25036 -23527 15171 -52864 -65182 -31701 -8161 31012 68579
6582 68579 6269 23827 63838 -2444 -11503 41001 112870 108331 71874 -19968 5097 73894
6570 73894 65218 27548 58629 58660 -2237 -44812 -48676 -47694 57801 107168 114005 43141 -20889
$$ packed form
6656C918l085n8881J7320P4656J3964N6138M914L2408m3306j4435o667J2355m0197
6643D9102k4113K7087j1515j0503M0092Q2429l918j14781j1274R3685P915k8322
6631I5884j19496p0726L8821N4784M6720J0010n8663J8107K3906o3363m671J2066
6619a6621O9045L4627j8399q6219K6406L0648r16K5938M4642o4800k1225p756
6607A5370K0442j734j7577O5055k6104o4660K6071J571L556m3383k500J6671K2770
6594A5548K6461q723k5712l2610J509L8698o8035j2318L3481K3540L9173L7567
6582F8579o2310J7558M0011o6282r059N2504P1869m539l6457r1842K5065O8797
6570G3894q676l7670L1081L1o0897m2575l864R82J05495M9367O837p0864o4030
$$ plain form
6557 -20889 -39041 -2876 51457 49452 6186 -6604 -19562 9026 79198 95506 27066 -8909
6545 -8909 16579 30570 -26611 -66916 -81685 -48187 -2144 35055 -8884 -62515 25410 72653
6533 72653 56396 51649 -3458 -23389 29552 56849 -15925 -22631 13607 -46722 -80365 -93955
6521 -93955 -61703 -2176 -51847 8320 27042 2048 45727 15891 -82772 -83785 -3692 30675
6509 30675 106010 60181 -30711 10479 84361 54951 23792 34010 -5192 -42886 -52657 -61741
6497 -61741 -146432 -177444 -131254 -101615 -45814 -18489 -4173 -3224 -65097 -40341 -49263 16199
6485 16199 -2166 -91724 -124458 -138409 -175507 -186235 -134133 -47446 67316 93828 83137 52939
6473 52939 10195 -21989 -77717 -41097 -35046 -40740 31716 103371 117251 141171 167255 103855
$$ packed form
6557b0889j8152L6165N4333k005m3266j2790j2958K8588P0172J6308o8440l5975
6545h909K5488J3991n7181m0305j4769L3498M6043L7199m3939n3631Q7925M7243
6533G2653j6257m747n5107j9931N2941K7297p2774o706L6238o0329l3643j3590
6521i3955L2252N9527m9671O0167J8722k4994M3679k9836r8663j013Q0093L4367
6509C0675P5335m5829r0892M1190P3882k9410l1159J0218l9202l7694r771r084
6497f1741q4691l1012M6190K9639N5801K7325J4316R49o1873K4756q922O5462
6485A6199j8365q9558l2734j3951l7098j0728N2102Q6687J14762K6512j0691l0198
6473E2939m2744l2184n5728L6620O051n694P2456P1655J3880K3920K6084o3400
$$ plain form
6461 103855 98256 42991 -47595 14129 40016 9073 62700 103490 89210 109296 109214 -7926
6449 -7926 1508 87001 82318 1439 -59775 -65258 -49503 1602 -14664 -50307 -45878 -88586 -51517
6436 -51517 -29009 43835 108630 109433 125134 133849 60682 -14322 -13897 28755 -16357 -42247 -63544
6423 -63544 -67592 -89451 -134748 -27979 39071 12034 34961 67885 34958 -53971 -38464 -48832
6411 -48832 -94958 -49697 -24682 40108 58600 72698 90477 79348 -1014 64017 93745 106215
6399 106215 78534 57401 36958 -50720 -38246 -7283 -53192 -67980 -36044 -38973 -64604 15269
6387 15269 63605 40013 -37160 31663 147599 131935 96960 44075 -14864 -49602 41075 23316
6375 23316 -11069 6919 30461 -1627 38277 -17 -7345 37458 43897 23530 -27771 -59814
$$ packed form
6461A03855n599n5265r0586O1724K5887l0943N3627M0790j4280K0086q2j17140
6449g926R434Q5493m683q0879o1214n483J5755N1105j6266l5643M429m2708L7069
6436e1517K2508P2844O4795Q03J5701Q715p3167p5004M25M2652m5112k5890k1297
6423f3544m048k1859m5297J06769O7050k7037K2927L2924l2927q8929J5507j0368
6411d8832m6126M5261K5015O4790J8492J4098J7779j1129q0362O5031K9728J2470
6399A06215k7681k1133k0443q7678J2474L0963m5909j4788L1936k929k5631P9873
6387A5269M8336k3592p7173O8823J15936j5664l4975n2885n8939l4738R0677j7759
6375B3316l4385J7988K3542l2088L9904l8294p328M4803O439k0367n1301l2043
$$ plain form
6363 -59814 -56662 -12155 -4829 -44676 -36342 -68053 -81435 -87705 -72245 -55713 -40574 26900 37902
6350 37902 -48755 -88212 -63385 -47086 -37218 82485 74269 88999 70762 26429 50924 101169
6338 101169 63561 72025 77976 45823 59649 74569 109556 9737 -6381 14927 10892 60347
6326 60347 73385 109998 127095 100633 71215 -21903 -79038 -22433 26352 41265 -14675 6233
6314 6233 29922 32135 24854 -68340 -94599 -96776 -37763 -42990 -39032 49138 59036 56887 8329
6301 8329 -42947 -60601 -49688 -56801 -72412 -113946 -59991 36783 10347 -20829 429 -19341
6289 -19341 -90077 -57771 -5694 -6220 14346 76075 110090 50082 15149 55950 114747 142933
6277 142933 145363 134392 91575 73034 54224 21057 -37279 -79351 -59456 36166 86515 92279
$$ packed form
6363e9814L152M4507P326l9847Q334l1711j3382o270J5460J6532J5139O7474J1002
6350C7902q6657l9457K4827J6299R868J19703q216J4730j8237m4333K4495N0245
6338A01169l7608Q464N951l2153J3826J4920L4987r9819j6118K1308m035M9455
6326F0347J3038L6613J7097k6462k9418r3118n7135N6605M8785J4913n5940K0908
6314F233K3689K213p281r3194k6259k177N9013n227L958Q8170R898k149m8558
6301H329n1276j7654J0913p113j5611m1534N3955R6774k6436l1176K1258j9770
6289a9341p0736L2306N2077n26K0566O1729L4015o0008l4933M0801N8797K8186
6277A42933K430j0971m2817j8541j8810l3167n8336m2072J9895R5622N0349N764
$$ plain form
6265 92279 -23482 -46188 -77991 -128497 -183232 -102944 -5723 13985 41484 61152 58989 59153
6253 59153 58024 92882 68637 3939 -11609 46367 37614 -25413 -44305 -23973 -1120 34475
6241 34475 28347 30230 27001 46998 -10344 -26230 -31283 8432 10727 55968 84941 22209 -7226
6228 -7226 -51547 -50314 -32987 32542 64386 34815 -24027 -22759 -4845 -5490 -40803 -76400 -82692
6215 -82692 -65482 -71765 -113291 -74437 -17893 -9826 -20218 -5732 48542 57198 696 7277 46044
6202 46044 108257 114555 76677 128136 147871 135476 47336 15051 20259 71536 127181 139416
6190 139416 47744 -814 31691 70877 72309 37098 61434 112217 73740 16446 -81934 -152547
6178 -152547 -130602 -131431 -53418 -10771 -19387 -17540 69811 30384 -55973 -66514 48177 14983
$$ packed form
6265I2279j15761k2706l1803n0506n4735Q0288R7221J9708K7499J9668k163J64
6253E9153j129L4858k4245o4698j5548N7976q753o3027j8892K0332K2853L5595
6241C4475o128J883l229J9997n7342j5886n053L9715K295M5241K8973o2732k9435
6228g226m4321J233J7327O5529L1844k9571n8842J268J7914o45l5313l5597o292
6215h2692J7210o283m1526L8854N6544Q067j0392J4486N4274Q656n6502O581L8767
6202D6044O2213O298l7878N1459J9735j2395q8140l2285N208N1277N5645J2235
6190A39416r1672m8558L2505L9186J432l5211K4336N0783l8477n7294r8380p0613
6178a52547K1945q29P8013M2647q616J847Q7351l9427q6357j0541J14691l3194
$$ plain form
6166 14983 -2051 93765 130996 55862 -41473 -58743 -55803 -42950 -57294 -153903 -199054 -191402
6154 -191402 -155874 -76474 -39972 13182 39218 -6295 2931 31679 9309 11266 48008 27511
6142 27511 -59724 -71743 -25195 -30330 -30247 16269 42593 76543 90580 607 -119719 -149836
6130 -149836 -117102 -93222 -49628 -23714 -23072 -31620 -58629 -72742 94166 175715 106790 4828
6118 4828 -82540 -146758 -173304 -99380 -78927 -79208 -122583 -159539 -101517 -12157 19943 19651 -14041
6105 -14041 -40275 1631 16117 8778 -74747 -64563 -105477 -153755 -97780 -26581 -66071 -97362
6093 -97362 -153872 -79693 40527 -12240 -19759 37842 -16459 13224 59870 13002 0 -15270
6081 -15270 -8389 29796 52890 108454 110235 133648 84539 -43175 -24019 -10017 -10746 66508
$$ packed form
6166A4983j7034R5816L7231p5134r7335j7270K940J2853j4344r6609m5151P652
6154a91402L5528P9400L6502N3154K6036m5513R226K8748k2370J957L6742k0497
6142B7511q7235j2019M6548n135Q3M6516K6324L3950J4037q9973j20326l0117
6130a49836L2734K3880M3594K5914O42q548k7009j4113J66908Q1549o8925j01962
6118D828q7368o4218k6546P3924K0453k81m3375l6956N8022Q9360L2100k92l3692
6105a4041k6234M1906J4486p339q3525J0184m0914m8278N5975P1199l9490l1291
6093i7362n6510P4179J20220n2767p519N7601n4301K9683M6646m6868j3002j5270
6081a5270O881L8185K3094N5564J781K3413m9109j27714J9156J4002p29P7254
$$ plain form
6069 66508 116644 101182 38534 74792 133431 77760 63390 90009 44546 26543 67734 87561
6057 87561 49193 15552 -27188 -5798 75546 73306 17146 -60610 12555 58354 -57455 -116794
6045 -116794 -84541 -21119 -16849 -40680 -41612 -63903 -107472 -58045 19118 93207 96758 6576
6033 6576 -94890 -121448 -138342 -93974 -38233 24859 41405 63020 51964 -87230 -89349 -57809
6021 -57809 -24744 -90641 -80793 27730 30879 55379 58088 -35794 -75492 -66710 -32952 13133
6009 13133 16372 14749 30106 52487 43517 16114 18646 58980 72845 86853 1251 -18005 -15584
5996 -15584 -38501 -39446 -9458 -29453 52481 104369 111582 84488 22209 -35490 10257 60913
5984 60913 44575 80793 110780 142055 121781 77348 68271 18174 -35077 -97263 -113905 -73897
$$ packed form
6069F6508N0136j5462o2648L6258N8639n5671j4370K6619m5463j8003M1191J9827
6057H7561l8368l3641m2740K1390Q1344k240n6160p7756P3165M5799j15809n9339
6045a16794L2253O3422M270k3831r32k2291m3569M9427P7163P4089L551r0182
6033F576j01466k6558j6894M4368N5741O3092J6546K1615j1056j39194k119L1540
6021e7809L3065o5897R848J08523L149K4500K709r3882l9698Q782L3758M6085
6009A3133L239j623J5357K2381q970k7403K532M0334J3865J4008q5602j9256K421
5996a5584k2917r45K9988j9995Q1934N1888P213k7094o2279n7699M5747N0656
5984F0913j6338L6218K9987L1275k0274m4433r077n0097n3251o2186j6642M0008
$$ plain form
5972 -73897 -8662 -6263 -24040 -33834 -92531 -76158 -20821 -18794 21451 44963 -42484 -20920
5960 -20920 46812 107170 123614 138351 156832 85527 2220 31439 68972 77375 3176 -78668
5948 -78668 -117351 -8875 50850 6299 -100832 -60096 38382 31047 -43409 -25851 -60727 -131986
5936 -131986 -8413 18509 -58034 -28062 -40956 1403 -261 58322 128761 128741 83301 62470
5924 62470 37796 30460 20320 45261 52515 19006 -25639 10991 12886 -6001 23315 157
5912 157 -28869 5091 63660 48065 13601 27351 40363 -53030 -78614 2541 16154 109441
5900 109441 63337 23035 -17449 -35050 -54889 -72929 -92003 -115728 -154041 -119600 -95163 17710
5888 17710 52335 64681 42951 -29731 -63785 -57673 -27874 2416 -5604 16307 -14193 28346
$$ packed form
5972g3897O5235K399j7777r794n8697J6373N5337K027M0245K3512q7447K1564
5960b0920O7732O0358J6444J4737J8481p1305q3307K9219L7533Q403p4199q1844
5948g8668l8683J08476N9725m4551j07131M0736R8478p335p4456J7558l4876p1259
5936a31986J23573K6922p6543K9972j2894M2359j664N8583P0439k0m5440k0831
5924F2470k4674p336j0140K4941P254l3509m4645L6630J895j8887K9316k3158
5912A57k9026L3960N8569j5595l4464J3750J3012r3393k5584Q1155J3613R3287
5900A09441m6104m0302m0484j7601j9839j8040j9074k3725l8313L4441K4437J12873
5888A7710L4625J2346k1730p2682l4054O112K9799L0290q020K1911l0500M2539
$$ plain form
5876 28346 29653 35855 80205 132613 76858 -41499 -50758 44840 108741 103030 13796 37480
5864 37480 -9175 -81969 -89308 18855 98327 31211 -40420 -13225 17590 -24344 -94045 -97409
5852 -97409 5430 98515 93585 45680 -13887 -46184 -122575 -96755 -35121 14280 37176 6939
5840 6939 57290 -32270 -29467 64310 53092 47288 22701 18053 10696 -33814 -71910 -60697 3109
5827 3109 -4412 -16169 -14829 -83780 -36569 42324 63356 11080 -37880 -30966 -16686 -59087 -62024
5814 -62024 153 22822 10829 58963 16043 -72620 -76714 -41626 -40123 -55233 -97730 -110894
5802 -110894 -39252 -30243 90470 148220 110398 53933 24548 10728 11459 42695 74016 96399
5790 96399 74988 16306 54278 118777 62395 10795 24539 16202 7497 45672 53871 43617
$$ packed form
5876B8346J307O202M4350N2408n5755j18357r259R5598O3901n711q9234K3684
5864C7480m6655p2794p339J08163P9472o7116p1631K7195L0815m1934o9701l364
5852i7409J02839R3085m930m7905n9567l2297p6391K5820O1634M9401K2896l0237
5840F939N0351q9560K803R3777j1218n804k4587m648p357m4510l8096J1213O3806
5827C109p521j1757J340o8951M7211P8893K1032n2276m8960O914J4280m2401k937
5814f2024O2177K2669j1993M8134m2920q8663m094L5088J503j5110m2497j3164
5802a10894P1642R009J20713N7750l7822n6465k9385j3820P31L1236L1321K2383
5790I6399k1411n8682L7972O4499n6382n1600J3744q337q705L8175Q199j0254
$$ plain form
5778 43617 38064 -38469 -23094 -4793 -49085 -53171 -41452 -18895 -18971 -2208 17686 -43125 -66965
5765 -66965 -6690 -16095 4115 -9171 -10074 22866 -21842 -107267 -29952 -7252 -8665 -110580
5753 -110580 -151782 -153377 -130934 -132417 -68217 43032 59399 4909 -82547 -56792 -40365 -77975
5741 -77975 -71230 -8731 -7993 -30896 -88671 -70313 -17756 -39094 -93518 -148858 -86103 -9145
5729 -9145 -38426 -52277 -16139 108635 64394 3280 -50630 -70512 -114685 -89665 -68544 -60320
5717 -60320 -72061 14676 66028 12029 34802 28370 -22430 -56696 -83450 -94193 -96753 -75933
5705 -75933 -62745 -58076 -110108 -67048 -14808 37715 127941 92726 35603 -29691 -22019 874
5693 874 -15174 -34737 -6409 -42609 -54756 -27043 -14709 -7871 -35656 -109682 -76340 -54466
$$ packed form
5778D3617n553p6533J5375J8301m4292m086J1719K2557p6J6763J9894o0811k3840
5765f6965O0275r405K0210j3286r03L2940m4708q5425P7315K2700j413j01915
5753a10580m1202j595K2443j483O4200J11249J6367n4490q7456K5755J6427l7610
5741g7975O745O2499P38k2903n7775J8358N2557k1338n4424n5340O2755P6958
5729i145k9281j3851L6138J24774m4241o1114n3910j9882m4173K5020K1121Q224
5717f0320j1741Q6737N1352n3999K2773o432n0800l4266k6754j0743k560K0820
5705g5933J3188M669n2032M3060N2240N2523R0226l5215n7123o5294P672K2893
5693H74j6048j9563K8328l6200j2147K7713J2334O838k7785p4026L3342K1874
$$ plain form
5681 -54466 -108547 -152015 -195561 -176658 -27970 28468 45432 89622 4301 -17480 -7560 -37410
5669 -37410 -21709 18491 21258 6059 -19143 41 60994 63859 49835 59467 47898 51401 55016
5656 55016 19047 -15416 -9418 6032 76028 105771 96258 71094 46006 81969 41894 65144
5644 65144 47811 -32237 -270 -27103 -71300 -65649 -50748 -54333 -13310 72506 177364 147178
5632 147178 117088 134461 110661 115933 110145 -1193 -54520 -5758 48414 -16660 -82543 10356
5620 10356 74960 71155 42212 91960 74947 37573 24485 34075 21227 40712 80984 128146
5608 128146 152578 62666 18340 2233 10756 73863 89042 -50256 -108980 -41563 43266 99950
5596 99950 55447 35408 86617 142465 154599 114441 127673 49997 17178 138186 183009 48288
$$ packed form
5681e4466n4081m3468m3546J8903J48688N6438J6964M4190q5321k1781R920k9850
5669c7410J5701M0200K767j5199k5202J9184O0953K865j4024R632j1569L503L615
5656E5016l5969l4463N998J5450O9996K9743r513k5164k5088L5963m0075K3250
5644F5144j7333q0048L1967k6833m4197N651J4901l585M1023Q5816J04858l0186
5632A47178l0090J7373k3800N272n788j11338n3327M8762N4172o5074o5883R2899
5620A0356O4604l805k8943M9748j7013l7374j3088R590j2848J9485M0272M7162
5608A28146K4432q9912m4326j6107Q523O3107J5179j39298n8724O7417Q4829N6684
5596I9950m4503k0039N1209N5848J2134m0158J3232p7676l2819J21008M4823j34721
$$ plain form
5584 48288 -12838 56830 54974 84672 92158 80984 81107 23129 79874 80960 43203 40329 70847
5571 70847 45467 35660 48540 56325 7281 -71994 -59783 -38096 -71567 -17866 24447 -12642
5559 -12642 8175 30133 105877 109421 147635 136913 49213 29638 -6595 -15162 1332 77238
5547 77238 78832 49646 -50412 5277 34034 -6743 24296 41129 30182 -10463 -85850 -111431
5535 -111431 -133397 -110891 -13751 7398 -35273 -62123 -74929 -35619 -15972 111559 117276 59884
5523 59884 31215 -13394 -79637 -98113 -32104 -8890 -26810 -57871 -1261 -1031 -62470 -62524 -39381
5510 -39381 15839 13592 57770 80735 41464 18822 -42567 -93267 -98447 2074 4212 26997
5498 26997 -12718 13652 -38203 -26254 -14626 -36444 -74731 -121941 -97988 -43445 -2365 17694
$$ packed form
5584D8288o1126O9668j856K9698P486j1174J23n7978N6745J086l7757k874L0518
5571G0847k5380r807J2880P785m9044p9275J2211K1687l3471N3701M2313l7089
5559a2642K0817K1958P5744L544L8214j0722q7700j9575l6233q567J6494P5906
5547G7238J594k9186j00058N5689K8757m0777L1039J6833j0947m0645p5387k5581
5535a11431k1966K2506R7140K1149m2671k6850j2806L9310J9647J27531N717n7392
5523E9884k8669m4609o6243j8476O6009K3214j7920l1061N6610K30o1439n4K3143
5510c9381N5220k247M4178K2965l9271k2642o1389n0700n180J00521K138K2785
5498B6997l9715K6370n1855J1949J1628k1818l8287m7210K3953N4543M1080K0059
$$ plain form
5486 17694 93510 105054 28590 -79427 -74167 -67943 23061 107623 94525 46253 -5957 22901
5474 22901 47136 4181 5529 -19035 38834 1626 -289 51543 38180 35600 26654 39665 23592
5461 23592 44124 39658 -12504 49482 40473 88321 105881 128008 59934 26494 53078 50292
5449 50292 38841 46183 3167 -114840 -122108 -40667 -44033 -88057 -61819 -68563 -63766 18078 29454
5436 29454 24320 52127 39580 40253 7928 -8369 -39204 -56193 -76716 -112037 -92048 -91190 -39574
5423 -39574 -12358 64317 113707 117278 60513 109784 153478 55903 -30993 -104083 -64965 -78817
5411 -78817 -95724 -118560 -57097 -20773 70701 89047 37854 -45775 -29260 32209 -29417 -17203
5399 -17203 6934 -27301 -65374 -59886 -51853 -81861 -156614 -132948 -43006 -36158 -35126 17209 11794
$$ packed form
5486A7694P5816J1544p6464j08017N260O224R1004Q4562j3098m8272n2210K8858
5474B2901K4235m2955J348k4564N7869l7208j915N1832j3363k580q946J3011j6073
5461B3592K0532m466n2162O1986r009M7848J7560K2127o8074l3440K6584k786
5449E0292j1451P342m3016j18007p268Q1441l366m4024K6238o744M797Q1844J1376
5436B9454n134K7807j2547O73l2325j6297l0835j6989k0523l5321J9989Q58N1616
5423c9574K7216P6675M9390L571n6765M9271M3694r7575q6896p3090L9118j3852
5411g8817j6907k2836O1463L6324R1474J8346n1193q3629J6515O1469o1626J2214
5399a7203K4137l4235l8073N488Q033l0008p4753K3666Q9942O848J032N2335n415
$$ plain form
5386 11794 26652 75324 126518 71212 -75834 -136438 -162778 -143372 -16179 9540 41171
5375 41171 45265 50575 44438 58810 96802 21088 4858 23118 6515 63975 33011 -31996
5363 -31996 -15564 -1426 14370 69699 59776 -959 -44412 5884 17475 -2930 36746 18690
5351 18690 -5157 -27439 -34793 -61634 -105307 -69939 18975 44811 64171 96305 25896 -40380
5339 -40380 4059 44654 41421 19052 9239 47695 19695 14829 19513 31586 1435 -66056 -54686
5326 -54686 -23531 -85419 -72762 -90267 -113484 -93974 12158 52630 6717 -19246 46542 68689
5314 68689 63221 -21909 -87839 -40839 9765 30997 -22158 -11838 8814 66955 114959 108704
5302 108704 114961 185352 165391 26518 -60786 -48318 -34464 6999 16889 9874 -12830 -57521
$$ packed form
5386A1794J4858M8672N1194n5306j47046o0604k6340J9406J27193K5719L1631
5375D1171M094N310o137J4372L7992p5714j6230J8260j6603N7460l0964o5007
5363c1996J6432J4138J5796N5329r923o0735m3453N0296J1591k0405L9676j8056
5351A8690k3847k2282p354k6841m3673L5368Q8914K5836J9360L2134p0409o6276
5339d0380M4439M0595l233k2369r813L8456k8000m866M684J2073l0151o7491J1370
5326e4686L1155o1888J2657j7505k3217J9510J06132M0472m5913k5963O5788K2147
5314F8689n468q5130o5930M7000N0604K1232n3155J0320K0652N8141M8004o255
5302A08704O257P0391j9961j38873q7304J2468J3854M1463R890p015k2704m4691
$$ plain form
5290 -57521 -71709 6163 -12155 -83391 -75350 -22703 18521 26057 -18489 76354 35466 42642
5278 42642 50440 79246 60450 -14844 -18737 -26957 -16637 -22998 -70857 -89160 -28380 -49766 -62377
5265 -62377 -84972 -70249 -46363 -29341 1017 -1400 15192 -19004 -59771 -104017 -22579 49
5253 49 -61352 -94762 -126187 -88897 -51192 1009 22571 12746 -1284 -41041 -58433 -48759 -12424
5240 -12424 34299 -47487 -83803 -93833 -75772 -43078 -7400 -395 -21354 -26102 64625 91396
5228 91396 17916 -55255 -105016 -42955 -16908 -104732 -106536 -25213 42444 27103 -49860 -92524
5216 -92524 -79717 -94148 -147678 -123542 -38718 88094 172569 135416 -3709 -110128 -115645
5205 -115645 -70716 -89439 -113457 -80584 -82007 -67629 -115671 -115293 -22708 42227 43466 91689
$$ packed form
5290e7521j4188P7872j8318p1236Q041N2647M1224P536m4546R4843m0888P176
5278D2642P798K8806j8796p5294l893q220J0320o361m7859j8303O0780k1386j2611
5265f2377k2595J4723K3886J7022L0358k417J6592l4196m0767m4246Q1438K2628
5253D9o1401l3410l1425L7290L7705N2201K1562r825j4030l9757j7392R674L6335
5240a2424M6723q1786l6316j0030J8061L2694L5678P005k0959m748R0727K6771
5228I1396p3480p3171m9761O2061K6047q7824j804Q1323O7657j5341p6963m2664
5216i2524J2807j4431n3530K4136Q4824J26812Q4475l7153j39125j06419n517
5205a15645M4929j8723k4018L2873j423J4378m8042L78R2585O4935J239M8223
$$ plain form
5193 91689 118259 67951 36412 -2237 -30892 -102161 -100051 -56295 -61180 -21009 11829 -15000
5181 -15000 -55792 -89797 -168065 -190417 -64271 40991 111927 90037 66304 120797 102009
5170 102009 42742 59266 52472 -23751 -61648 29329 -4868 41497 112817 21793 -42230 -48654
5158 -48654 -105262 -112790 -139425 -102007 -39512 -58181 -66671 -10604 -43442 2001 33091 47004
5146 47004 78733 88386 170131 197201 124498 95862 -2225 -75360 -110734 -44593 1869 7526
5134 7526 13285 -56664 -45680 22113 -11679 -77793 -51761 -17485 9934 -17760 -77342 -75575
5122 -75575 -108801 -80488 -70704 -123944 -45169 36263 29766 64295 82610 64338 7576 -46
5110 -46 -44900 -29784 25994 76464 103333 -27111 -43197 -12385 95396 24121 -22030 6446
$$ packed form
5193I1689K6570n0308l1539l8649k8655p1269K110M3756m885M0171L2838k6829
5181a5000m0792l4005p8268k2352J26146J05262P0936k1890k3733N4493j8788
5170A02009n9267J6524o794p6223l7897R0977l4197M6365P1320r1024o4023o424
5158d8654n6608p528k6635L7418O2495j8669q490N6067l2838M5443L1090J3913
5146D7004L1729R653Q1745K7070p2703k8636r8087p3135l5374O6141M6462N657
5134G526N759o9949J0984O7793l3792o6114K6032L4276K7419k7694n9582J767
5122g5575l3226K8313R784n3240P8775Q1432o497L4529J8315j8272n6762p622
5110d6m4854J5116N5778N0470K6869j30444j6086L0812J07781p1275m6151K8476
$$ plain form
5098 6446 22063 38238 -78853 -114014 -11032 22534 -5145 -60298 -56451 -87688 -48382 -35263
5086 -35263 -58950 -31748 8093 10704 15875 2053 -11571 -10409 14791 15183 -18078 997 35165
5073 35165 -21495 -28573 -89605 -141484 -102968 -66515 -21241 -65903 -123173 -45524 4648 -8373
5061 -8373 -18050 -34929 -12127 -51167 -35200 -14270 -46061 -22368 -29157 22803 -22901 -114885
5049 -114885 -90144 -56620 -48509 -3961 7565 -12050 -31834 -100265 -175827 -140334 -125201 -55767
5037 -55767 -41733 -25481 -59610 -123031 -70813 -46448 -71694 17395 42204 19817 -18164 -69502
5025 -69502 -87108 -123395 -153239 -130911 -81576 -8528 -24478 -17314 -91759 -157513 -126665 -111361
5013 -111361 -118323 -113944 -70643 -1432 -4938 -14284 -62873 -13222 49438 40279 39045 21455 95305
$$ packed form
5098F446J5617J6175j17091l5161J02982L3566k7679n5153L847l1237L9306J3119
5086c5263k3687K7202L9841K611N171j3822j3624J162K5200L92l3261J9075L4168
5073C5165n6660p078o1032n1879L8516L6453M5274m4662n7270P7649N0172j3021
5061h373r677j6879K2802l9040J5967K0930l1791K3693o789N1960m5704r1984
5049a14885K4741L3524Q111M4548J1526j9615j9784o8431p5562L5493J5133O9434
5037e5767J4034J6252l4129o3421N2218K4365k5246Q9089K4809k2387l7981n1338
5025f9502j7606l6287k9844K2328M9335P3048j5950P164p4445o5754L0848J5304
5013a11361o962M379M3301O9211l506r346m8589M9651O2660r159j234j7590P3850
$$ plain form
5000 95305 152003 165023 124439 48364 -35253 -49338 -13599 46560 30346 -15835 -13618 31615
4988 31615 2322 -64000 4999 62432 80517 -7283 -72732 -85143 -30643 53432 16037 56617
4976 56617 65378 -16795 -40323 -57296 -49662 -78343 -59025 -79133 32106 92265 -9012 -52705
4964 -52705 -145693 -125032 10276 115688 20587 22745 -16764 -43387 -52731 -518 -1297 5151
4952 5151 -33824 226 -10411 -58413 19328 55802 41869 66673 68242 9084 -57469 -93974
4940 -93974 -34756 24820 31659 31470 66242 47288 57014 53604 34026 88253 152135 150463 52968
4927 52968 27356 51798 42289 -6902 -20723 -4592 -15773 -48285 -39566 -17465 -87399 -87768 -67924
4914 -67924 -89328 -22282 6950 -70762 -35744 -15264 8801 14253 -384 8025 -1771 26408
$$ packed form
5000I5305N6698J3020m0584p6075q3617j4085L5739O0159j6214m6181K217M5233
4988C1615k9293o6322O8999N7433J8085q7800o5449j2411N4500Q4075l7395M0580
4976E6617Q761q2173k3528j6973P634k8681J9318k0108J11239O0159j01277m3693
4964e2705r2988K0661J35308J05412r5101K158l9509k6623r344N2213p79O448
4952E151l8975L4050j0637m8002P7741L6474j3933K4804J569n9158o6553l6505
4940i3974N9218N9576O839j89L4772j8954R726l410j9578N4227O3882j672r7495
4927E2968k5612K4442r509m9191j3821J6131j1181l2512Q719K2101o9934l69J9844
4914f7924k1404O7046K9232p7712L5018K0480K4065N452j4637Q409r796K8179
$$ plain form
4902 26408 62457 25356 23360 -6911 -9583 -19685 -4188 -29884 -118774 -189931 -103023 -37529
4890 -37529 -14554 21538 67639 -10617 -49140 -79210 -121700 -152949 -139823 -95025 -104986 -93524
4878 -93524 -68699 21036 -9864 -52180 -86334 -94422 -161435 -125706 -51724 2744 -43512 -76197
4866 -76197 -135005 -136777 -74351 2386 12999 -47608 -14546 22726 44202 -29761 -80422 -69773
4854 -69773 4645 72684 115245 70365 -98064 -146095 -154017 -57827 -47060 -48806 -114544 -98927
4842 -98927 -47789 -22307 33949 162349 160677 44556 30752 63522 4326 -20141 65929 65405
4830 65405 5459 -9330 37048 139981 143261 95215 32636 -5252 47157 147482 131973 119278
4818 119278 90938 87514 74383 -15582 -63095 -45378 -34699 1323 -57970 -81205 -34508 5490
$$ packed form
4902B6408L6049l7101j996l0271k672j0102J5497k5696q8890p1157Q6908O5494
4890c7529K2975L6092M6101p8256l8523l0070m2490l1249J3126M4798r961J1462
4878i3524K4825Q9735l0900m2316l4154q088o7013L5729P3982N4468m6256l2685
4866g6197n8808j772O2426P6737J0613o0607L3062L7272K1476p3963n0661J0649
4854f9773P4418O8039M2561m4880j68429m8031p922R6190J0767j746o5738J5617
4842i8927N1138K5482N6256J28400j672j16121j3804L2770n9196k4467Q6070n24
4830F5405n9946j4789M6378J02933L280m8046o2579l7888N2409J00325j5509j2695
4818A19278k8340l424j3131q9965m7513J7717J0679L6022n9293k3235M6697L9998
$$ plain form
4806 5490 70093 81853 109297 96027 113634 135957 25525 -57418 -92433 -149534 -145201 -124879
4794 -124879 -61247 -23627 14385 -34613 5027 42688 -65104 -129320 -114878 -118296 -86182 -45539
4782 -45539 -29662 -16306 14182 17047 -31747 -2351 -25836 -44479 -57366 -57878 1703 5038 45311
4769 45311 48639 39481 55490 34947 48548 90513 115866 112285 62073 42875 55577 82400
4757 82400 49232 -9937 -14434 -28946 -56028 -54758 -26529 -99078 -60942 -37401 35558 49159
4745 49159 -23879 -64473 -47679 -71402 -54460 17694 68774 -12521 -146639 -170786 -141775 -164203
4733 -164203 -129348 -39490 -34374 -22334 17968 38082 1381 -40803 -7004 -22355 -52968 -9718
4721 -9718 11886 -15328 -77781 -10245 61887 78268 14247 -3697 -3318 -65914 -48218 -37495
$$ packed form
4806E490O4603J1760K7444j3270J7607K2323j10432q2943l5015n7101M333K0322
4794a24879O3632L7620L8012m8998L9640L7661j07792o4216J4442l418L2114M0643
4782d5539J5877J3356L0488K865m8794K9396k3485j8643j2887n12N9581L335M0273
4769D5311L328r158J6009k0543J3601M1965K5353l581n0212j9198J2702K6823
4757H2400l3168n9169m497j4512k7082J270K8229p2549L8136K3541P2959J3601
4745D9159p3038m0594J6794k3723J6942P2154N1080q1295j34118k4147K9011k2428
4733a64203L4855Q9858N116J2040M0302K0114l6701m2184L3799j5351l0613M3250
4721i718K1604k7214o2453O7536P2132J6381o4021j7944L79o2596J7696J0723
$$ plain form
4709 -37495 -83133 -114685 -93065 -5475 8619 17067 -7188 -13633 -1256 50507 58668 25091
4697 25091 65642 94327 87750 49644 50983 100404 40688 -31509 -41363 -12990 17650 -21352
4685 -21352 -51097 -50942 -130750 -146700 -93920 -98617 -4710 44969 41569 39152 5814 16229 -9420
4672 -9420 -37385 -9800 -97576 -105317 -73263 -61748 -62747 -83499 -142428 -126928 -40444 -33285 3825
4659 3825 -14056 -42228 -62397 -31306 49703 51064 81833 138840 112735 72579 4181 244
4647 244 59475 126997 33116 -22337 -100313 -115658 -49169 50241 38144 -36301 -54875 -1114
4635 -1114 17184 -71247 -130014 -59433 15168 14750 -71679 -128926 -141370 -108957 -90004 -48942
4623 -48942 -119607 -109266 -96454 -97916 -71695 -33843 -78111 -66697 -21069 -78198 -57170 30769
$$ packed form
4709c7495m5638l1552K1620Q7590J4094Q448k4255o445J2377N1763Q161l3577
4697B5091M0551K8685o577l8106J339M9421n9716p2197r854K8373L0640l9002
4685b1352k9745J55p9808j5950N2780m697R3907M9679l400k417l3338J0415k5649
4672i420k7965K7585q7776p741L2054J1515r99k0752n8929J5500Q6484P159L7110
4659C825j7881k8172k0169L1091Q1009J361L0769N7007k6105m0156o8398l937
4647B44N9231O7522r3881n5453p7976j5345O6489R9410j2097p4445j8574N3761
4635a114J8298q8431n8767P0581P4601m18q6429n7247j2444L2413J8953M1062
4623d8942p0665J0341J2812j462K6221L7852m4268J1414M5628n7129K1028Q7939
$$ plain form
4611 30769 104144 69565 -49819 -103904 -89678 -64468 -91177 -100755 -42741 -67071 -16569 -9211
4599 -9211 -79839 -112217 -77039 -34405 -19764 43039 92318 -2773 -93713 -37058 48947 70643
4587 70643 89790 41438 3687 -30423 -691 42298 37540 -10776 -5772 6142 -4267 -17463
4575 -17463 -18735 -41493 -72845 -321 -55005 -52860 -76105 -100700 -41018 -36804 -18196 -36275
4563 -36275 -52019 -76896 -56100 -99385 -117388 -102667 -89965 -141150 -158240 -163173 -109957 -72063
4551 -72063 -111569 -43548 -26495 -23127 -21104 -96728 -122778 -67605 -18174 -50307 -38415 45562
4539 45562 -18906 -110417 -151810 -122131 -75232 -20412 -4900 17333 -1738 24456 7447 -21051
4527 -21051 -9035 8551 10664 -34978 -35792 -62861 -53475 12996 33230 30420 39358 113088 127713
$$ packed form
4611C0769P3375l4579j19384n4085J4226K5210k6709r578N8014k4330N0502P358
4599i211p0628l2378L5178M2634J4641O2803M9279r5091r0940N6655Q6005K1696
4587G0643J9147m8352l7751l4110K9732M2989m758m8316N004J1914j0409j3196
4575a7463j272k2758l1352P2524n4684K145k3245k4595N9682M214J8608j8079
4563c6275j5744k4877K0796m3285j8003J4721J2702n1185j7090m933N3216L7894
4551g2063l9506O8021J7053L368K023p5624k6050N5173M9431l2133J1892Q3977
4539D5562o4468r1511m1393K9679M6899N4820J5512K2233j9071K6194j7009k8498
4527b1051J2016J7586K113m5642q14k7069R386O6471K0234k810Q938P3730J4625
$$ plain form
4514 127713 83458 97777 66469 73692 41014 43731 99073 103100 73072 68759 24414 24968 94916
4501 94916 67231 45265 -14530 1973 34732 -21184 -17383 -35403 -50610 -33849 -47304 -59128
4489 -59128 30224 62868 81106 58550 61833 9298 -25597 -4384 -63883 -112957 -31545 -20203
4477 -20203 -79462 -73406 -10291 -30666 -45587 -6966 -17461 -11874 78659 78080 45737 28321 52237
4464 52237 -59555 -199441 -126290 -38678 -53505 -68368 -35428 -13513 -12614 -42716 -112239 -110748
4452 -110748 -62264 21095 23246 38416 102117 105799 90997 82523 116702 93912 54365 32696
4440 32696 41309 37612 -57049 -169355 -143816 -106884 -119529 -89655 -93501 -97768 -79785 -13074
4428 -13074 -65557 -115355 -139361 -152375 -116547 -80282 -14377 33244 87228 111131 111979 108391
$$ packed form
4514A27713m4255J4319l1308P223l2678K717N5342M027l0028m313m4345N54O9948
4501I4916k7685k1966n9795J6503L2759n5916L801j8020j5207J6761j3455j1824
4489e9128Q9352L2644J8238k2556L283n2535l4895K1213n9499m9074Q1412J1342
4477b0203n9259O056O3115k0375j4921L8621j0495N587R0533n79l2343j7416K3916
4464E2237j11792j39886P3151Q7612j4827j4863L2940K1915Q99l0102o9523J491
4452a10748M8484Q3359K151J5170O3701L682j4802q474L4179k2790l9547k1669
4440C2696Q613l697r4661j12306K5539L6932j2645K9874l846m267J7983O6711
4428a3074n2483m9798k4006j3014L5828L6265O5905M7621N3984K3903Q48l588
$$ plain form
4416 108391 92601 56487 50787 19794 -24072 -65023 -109636 -116626 -70974 -16295 31552 -20036
4404 -20036 74386 91150 117443 120954 71287 11620 -33894 17847 22255 -31484 -10064 11477
4392 11477 -19268 51669 46574 47298 63068 57340 37865 41492 42430 39428 -7919 6972 75393
4379 75393 98602 65271 53028 -10017 -31594 -81476 -67045 -49893 -96276 -159530 -108585 -34750
4367 -34750 -34414 -81040 -92391 -5621 38984 -36843 -6674 52445 67051 42572 80386 79304
4355 79304 7242 -80718 -92129 -79910 -28495 -37464 9453 2570 -13032 -23739 -99604 -92617
4343 -92617 -148637 -176957 -143267 -116178 -84874 -36335 22824 27629 43134 -42333 -85833 -75386
4331 -75386 -95067 7396 42319 -35729 11070 42109 106512 125739 100100 78816 82862 -25032
$$ packed form
4416A08391j5790l6114n700l0993m3866m0951m4613o990M5652N4679M7847n1588
4404b0036R4422J6764K6293L511m9667n9667m5514N1741M408n3739K1420K1541
4392A1477l0745P0937n095P24J5770n728j9475L627R38l002m7347J4891O8421
4379G5393K3209l3331j2243o3045k1577m9882J4431J7152m6383o3254N0945P3835
4367c4750L36m6626j1351Q6770M4605p5827L0169N9119J4606k4479L7814j082
4355G9304p2062q7960j1411J2219N1415q969M6917o883j5602j0707p5865O987
4343i2617n6020k8320L3690K7089L1304M8539N9159M805J5505q5467m3500J0447
4331g5386j9681J02463L4923p8048M6799L1039O4403J9227k5639k1284M046j07894
$$ plain form
4319 -25032 -25503 -34770 20180 75753 33975 1330 -20094 -38996 -10926 33678 8062 12342 8018
4306 8018 -60478 -134383 -81005 -19787 4936 -6306 -13972 -86190 -71503 -37095 -63520 -52863
4294 -52863 -55713 -62138 -64739 51428 165761 172696 147437 160915 138108 54278 -20223 -70044
4282 -70044 -169675 -158787 -123638 -129787 -139798 -111425 -59675 -41618 15105 22201 -46291 -49469
4270 -49469 -59229 -74339 -165054 -182809 -130531 -95229 -102265 -87920 -91128 -64527 5870 4403 -47653
4257 -47653 -41244 -27256 -33943 -14960 -32297 -45016 -63503 -38817 -35074 -8320 -10507 -65492 -121726
4244 -121726 -123960 -168621 -105822 -1398 12161 -53938 -121349 -129361 -102848 24193 134792
4233 134792 51120 -29794 -81624 -34465 16766 74614 151883 129504 59396 92704 75316 57853
$$ packed form
4319b5032m71r267N4950N5573m1778l2645k1424j8902K8070M4604k5616M280m324
4306H018o8496p3905N3378O1218K4723j1242p666p2218J4687L4408k6425J0657
4294e2863k850o425k601J16167J14333O935k5259J3478k2807q3830p4501m9821
4282g0044r9631J0888L5149o149j0011K8373N1750J8057N6723P096o8492l178
4270d9469r760j5110r0715j7755N2278L5302p036J4345l208K6601P0397j467n2056
4257d7653O409J3988o687J8983j7337j2719j8487K4686L743K6754k187n4985n6234
4244a21726k234m4661O2799J04424J3559o6099o7411q012K6513J27041J10599
4233A34792q3672q0914n1830M7159N1231N7848P7269k2379p0108L3308j7388j7463
$$ plain form
4221 57853 68212 74218 32991 1425 -32497 -49364 -55678 -77287 -122186 -121276 -26071 -10282 -38154
4208 -38154 -91511 -60219 44063 7735 -2466 -6754 -41864 12295 -267 -15240 -69962 -67279
4196 -67279 -63627 -54368 -49664 -48931 -72892 -63029 -55610 -45405 -38519 -31509 -92611 -129066 -120772 -110013
4182 -110013 -110398 -72251 -995 11615 73866 109751 72061 37573 17901 -17583 -117733 28949
4170 28949 139051 120463 42392 -44786 -49644 -28275 -21154 -7724 3571 16128 -8372 17752
4158 17752 -14317 39856 107959 47688 -558 -16933 37758 64125 104071 70985 3958 -30083
4146 -30083 -60305 -65038 -109824 -57889 -19819 -50908 -92509 -36035 -59488 -35245 23499 42031
4134 42031 50614 71486 -10452 4033 -5792 -37410 -26495 -99725 -78361 -42733 -67282 -40832
$$ packed form
4221E7853J0359O006m1227l1566l3922j6867o314k1609m4899R10R5205J5789k7872
4208c8154n3357L1292J04282l6328j0201m288l5110N4159j2562j4973n4722K683
4196f7279L652R259M704P33k3961R863P419J0205O886P010o1102l6455Q294J0759
4182a10013l85L8147P1256J2610O2251L5885l7690l4488j9672l5484j00150J46682
4170B8949J10102j8588p8071q7178m858K1369P121J3430J1295J2557k4500K6124
4158A7752l2069N4173O8103o0271m8246j6375N4691K6367L9946l3086o7027l4041
4146c0083l0222m733m4786N1935L8070l1089m1601N6474k3453K4243N8744J8532
4134D2031Q583K0872q1938J4485r825l1618J0915p3230K1364L5628k4549K6450
$$ plain form
4122 -40832 45428 61242 17710 -67646 -100961 -82802 -58143 -73654 -91347 -60259 -64434 -68456
4110 -68456 -54780 -39697 -51414 -7528 -10667 -20850 30442 12709 57094 -26324 -98125 -47729
4098 -47729 -12047 102648 76712 66777 17658 -172 15396 72757 61937 73366 85267 75519
4086 75519 49399 62939 34353 447 -17044 -909 30134 -54099 -62071 -17044 -31586 -72379
4074 -72379 38917 75223 108844 76552 -12646 -57462 -86235 -170538 -176687 -151852 -151460 -99771
4062 -99771 -97748 -63853 -45475 -60536 -63639 15208 33311 -2302 -49685 34017 -3724 -49562
4050 -49562 -90526 -69982 -69745 -50537 17711 38056 26295 -89088 -67773 10893 2279 37021
4038 37021 53339 68198 112030 25363 -59763 39663 9480 -67813 -68296 -135253 -128122 -86082
$$ packed form
4122d0832Q6260J5814m3532q5356l3315J8159K4659j5511j7693L1088m175m022
4110f8456J3676J5083j1717M3886l139j0183N1292j7733M4385q3418p1801N0396
4098d7729L5682J14695k5936r935m9119j7830J5568N7361j0820J1429J1901r748
4086G5519k6120J3540k8586l3906j7491J6135L1043q4233p972M5027j4542m0793
4074g2379J11296L6306L3621l2292q9198m4816k8773q4303o149K4835L92N1689
4062i9771K023L3895J8378j5061l103P8847J8103l5613m7383Q3702l7741m5838
4050d9562m0964K0544K37J9208O8248K0345j1761j15383K1315P8666q614L4742
4038C7021J6318J4859M3832q6667q5126R9426l0183p7293m83o6957P131M2040
$$ plain form
4026 -86082 -22658 27574 -40933 -18090 36407 33003 16584 -4455 36812 -32840 -95213 -82966
4014 -82966 -82671 -154697 -167293 -85095 -126535 -78752 -54103 -108137 -144613 -89017 -51804 -39727
4002 -39727 -52949 -43517 -34673 -62586 -86108 -73756 -67371 19971 66371 57913 31228 15778 46477
3989 46477 71872 47872 48592 25082 36683 117470 76486 75830 82212 75943 32195 10859 -7712
3976 -7712 -94910 -127264 -45241 -47067 -10581 11193 61546 74598 79175 102881 106293 59922 -9905
3963 -9905 23217 -20248 -35361 -42736 -95410 -147118 -157061 -89548 21883 -28321 -35130 -20386
3951 -20386 -27306 -102378 21892 67290 35292 -76735 -59249 -46902 -49871 -71231 -58268 -70089
3939 -70089 -142007 -169327 -229996 -125528 1890 -39577 -62633 -9364 69129 -5977 -29251
$$ packed form
4026h6082O3424N0232o8507K2843N4497l404j6419k1039M1267o9652o2373J2247
4014h2966K95p2026j2596Q2198m1440M7783K4649n4034l6476N5596L7213J2077
4002c9727j3222R432Q844k7913k3522J2352O385Q7342M6400q458k6685j5450L0699
3989D6477K5395k4000P20k3510J1601Q0787m0984o56O382o269m3748k1336j8571
3976g712q7198l2354Q2023j826L6486K1774N0353J3052M577K3706L412m6371o9827
3963i905L3122m3465j5113p375n2674n1708r943O7513J11431n0204o809J4744
3951b0386o920p5072J24270M5398l1998j12027J7486J2347k969k1360J2963j1821
3939g0089p1918k7320o0669J04468J27418m1467k3056N3269P8493p5106k3274
$$ plain form
3928 -29251 29739 34167 -15022 -59707 -73143 -87957 6412 59824 40946 45154 -18877 -42444
3916 -42444 38990 17622 -64020 -70152 -61995 12378 85795 74711 -3083 -23205 18289 -307
3904 -307 -71404 -34993 38923 32719 37698 29010 57835 86384 116956 54059 31587 47666 438
3891 438 -111214 -88463 -47076 -8703 -26846 -13009 -19799 -24226 -1863 71168 66514 22152 40210
3878 40210 80141 35543 52003 -2546 -83115 -74025 -49952 -40746 -11021 -16154 -35075 -55388
3866 -55388 17576 86865 65057 26912 -58818 -44656 -17419 37408 40889 -14258 3275 8831
3854 8831 6489 -60370 -70984 6510 4554 48543 59468 23071 63669 96078 -22819 -80759
3842 -80759 -67189 -84998 -71377 -40973 105160 116698 61159 69740 74507 25233 -37771 -120717
$$ packed form
3928b9251N8990M428m9189m4685j3436j4814R4369N3412j8878M208o4031k3567
3916d2444Q1434k1368q1642o132Q157P4373P3417j1084p7794k0122M1494j8596
3904c07p1097L6411P3916o204M979q688K8825K8549L0572o2897k2472J6079m7228
3891D38j11652K2751M1387L8373j8143J3837o790m427K2363P3031m654m4362J8058
3878D0210L9931m4598J6460n4549q0569R090K4073R206K9725n133j8921k0313
3866e5388P2964O9289k1808l8145q5730J4162K7237N4827L481n5147J7533N556
3854H831k342o6859j0614P7494j956M3989J0925l6397M0598L2409j18897n7940
3842h0759J3570j7809J3621L0404J46133J1538n5539Q581M767m9274o3004q2946
$$ plain form
3830 -120717 -180016 -136653 -118901 -74164 -68773 -33905 -5260 25263 20219 -19355 -33376 -33176
3818 -33176 -67429 -123952 -106095 -31730 -11096 -18870 -82525 -105803 -100040 -138639 -132548 -109831
3806 -109831 -126141 -162184 -63855 11081 -40703 -92959 -125979 -32288 -25951 -26118 -64970 -117607
3794 -117607 -35365 41485 47148 67052 9010 -16735 -16446 -34553 -76601 -120962 -140461 -121465
3782 -121465 -104543 -83456 -70573 -115411 -86768 -68212 -22595 43479 42963 8845 -32044 -15572
3770 -15572 2923 -52112 -53403 -13452 26683 82739 14896 20026 75558 101990 37894 14174
3758 14174 30652 64207 73329 54370 35977 86309 33992 -36578 -6321 22181 31646 -741
3746 -741 80113 73079 20302 12692 -29904 -7279 73783 69498 94391 87391 39342 1733 -48020
$$ packed form
3830a20717n9299M3363J7752M4737N391L4868K8645L0523n044l9574j4021K00
3818c3176l4253n6523J7857P4365K0634p774o3655k3278N763l8599O091K2717
3806a09831j6310l6043R8329P4936n1784n2256l3020R3691O337j67l8852n2637
3794a17607Q2242P6850N663J9904n8042k5745K89j8107m2048m4361j9499J8996
3782a21465J6922K1087J2883m4838K8643J8556M5617O6074n16l4118m0889J6472
3770a5572J8495n5035j291L9951M0135N6056o7843N130N5532K6432o4096k3720
3758A4174J6478L3555R122j8959j8393N0332n2317p0570L0257K8502R465l2387
3746g41Q0854p034n2777p610m2596K2625Q1062m285K4893p000m8049l7609m9753
$$ plain form
3733 -48020 -29119 53829 46666 40015 113218 146716 120202 108759 98386 93574 2262 15452
3721 15452 33029 -23153 -15489 -69986 -135003 -202315 -201264 -123996 -73316 -103472 -124858 -136402
3709 -136402 -48339 39506 68940 -4059 -12768 459 34233 84541 64015 -21413 -5402 56713
3697 56713 68086 61901 -33407 -55939 -26278 -46524 -51826 -48330 -113598 -108775 -105337 -136326 -83264
3684 -83264 -59329 -106936 -98611 -113737 -86095 5539 99652 58200 27911 57612 39953 -929
3672 -929 6043 -12852 -81591 -140937 -125261 -64135 -103428 -152963 -63944 -41935 -11363 -27354
3660 -27354 -25506 -432 -11502 -17806 -70884 -136700 -170906 -169267 -98908 -9464 27804 -7123
3648 -7123 -83265 -125044 -82331 -25963 79831 10201 -78364 -126568 -134617 -82989 -112728 -138624
$$ packed form
3733d8020J8901Q2948p163o651P3203L3498k6514j1443j0373m812r1312J3190
3721A5452J7577n6182P664n4497o5017o7312J051P7268N0680l0156k1386j1544
3709a36402Q8063Q7845K9434p2999q709J3227L3774N0308k0526q5428J6011O2115
3697E6713J1373o185r5308k2532K9661k0246n302L496o5268M823L438l0989N3062
3684h3264K3935m7607Q325j5126K7642R1634R4113m1452l0289K9701j7659m0882
3672i29O972j8895o8739n9346J5676O1126l9293m9535Q9019K2009L0572j5991
3660b7354J848K5074j1070o304n3078o5816l4206J639P0359Q9444L7268l4927
3648g123p6142m1779M2713N6368J05794o9630q8565m8204q049N1628k9739k5896
$$ plain form
3636 -138624 -98250 -67020 -68076 -145501 -104525 -37691 -6944 -63782 -107453 -51034 12170 55329
3624 55329 84606 81325 -1991 -9425 -1840 8027 -11684 -31330 31964 48771 53625 38430 4436
3611 4436 -59794 -134259 -150601 -109341 -38563 -34860 -7110 1596 -71111 -75790 -79434 -121746 -104679
3598 -104679 -2371 4832 -93696 -85063 -5622 41685 23627 120618 169514 66888 29460 63330
3586 63330 96352 9617 -29843 63813 111506 80260 56317 -13501 3161 94111 117864 64516
3574 64516 32613 104876 81055 21896 77120 86203 38693 19444 -10698 -17697 4623 -18876
3562 -18876 -6355 20746 58065 18849 -87380 -71699 -49414 -55680 -81175 -44049 -5133 19040
3550 19040 26958 68788 10710 51817 11768 -26732 -19211 -2368 -52136 -27239 -20134 -69250
$$ packed form
3636a38624M0374L1230j056p7425M0976O6834L0747n6838m3671N6419O3204M3159
3624E5329K9277l281q3316p434P585R867j9711j9646O3294J6807M854j5195l3994
3611D436o4230p4465j6342M1260P0778L703K7750Q706p2707m679l644m2312J7067
3598a04679J02308P203r8528Q633P9441M7307j8058R6991M8896j02626l7428L3870
3586F3330L3022q6735l9460R3656M7693l1246k3943o9818J6662R0950K3753n3348
3574F4516l1903P2263k3821n9159N5224R083m7510j9249l0142o999K2320k3499
3562a8876J2521K7101L7319l9216j06229J5681K2285o266k5495L7126L8916K4173
3550A9040P918M1830n8078M1107m0049l8500P521J6843m9768K4897P105m9116
$$ plain form
3538 -69250 -53844 -70944 -84870 -83464 -102590 -96529 -75931 -114897 -67581 -16102 -23731 -72973
3526 -72973 -36827 47792 13571 18862 -28539 -57880 -84697 -17967 30086 -9387 -25839 -39402
3514 -39402 -26571 -43656 -12110 -59742 -133267 -156847 -176141 -156236 -64490 -36035 -38520 -73204
3502 -73204 -73861 -75480 -101345 -22296 -55942 -87517 -36106 -5060 -59052 -103766 -125236 -99501
3490 -99501 -7577 57034 97153 90101 79027 43364 -19741 -74550 -52863 -51785 -37396 -20870
3478 -20870 -52594 -46138 -25636 38169 59974 54297 83687 26648 5295 20486 -24287 -103409
3466 -103409 -108784 -11958 35042 36983 -5056 -49866 -66868 -66442 -45560 -33775 -11852 -16208 -12539
3453 -12539 -53235 -79535 -6378 -886 -85374 -50425 -105759 -129981 -79755 -61375 -107957 -56353
$$ packed form
3538f9250J5406j7100j3926J406j9126O061K0598l8966M7316N1479p629m9242
3526g2973L6146Q4619l4221N291m7401k9341k6817O6730M8053l9473j6452j3563
3514c9402J2831j7085L1546m7632p3525k3580j9294J9905R1746K8455k485l4684
3502g3204o57j619k5865P9049l3646l1575N1411L1046n3992m4714k1470K5735
3490i9501R1924O4611M0119p052j1074l5663o3105n4809K1687J078J4389J6526
3478b0870l1724O456K0502O3805K1805n677K9390n7039k1353J5191m4773p9122
3466a03409n375R6826M7000J941m2039m4810j7002M26K0882J1785K1923m356L669
3453a2539m0696k6300P3157N492q4488L4949n5334k4222N0226J8380m6582N1604
$$ plain form
3441 -56353 -45377 -26489 -9765 -22025 -20570 -20620 -50504 -36615 -61352 -46153 330 24318 -45058
3428 -45058 -49723 3322 55763 39357 27034 -31757 -57178 15289 48570 31772 34383 4724
3416 4724 12439 14196 59306 65853 74852 37569 -27521 -56639 -34914 -36925 -16356 -16462 17062
3403 17062 -24984 -66336 -86029 -117501 -79431 -148812 -100108 -85366 -98996 -50288 -52329 -87434
3391 -87434 -110629 7655 20024 37187 2573 -12275 44174 -16340 -50072 -82766 -54698 -83781
3379 -83781 -70900 -22356 5945 -39720 -3737 22171 30113 11059 -79845 -76803 -65888 -74476
3367 -74476 -92444 -55773 -85898 -93428 -45588 -14398 72711 124842 92667 46403 -13673 -5560
3355 -5560 16296 33563 46051 41605 55310 80424 19676 18468 54396 90809 -2230 7641 73558
$$ packed form
3441e6353J0976J8888J6724j2260J455n0k9884J3889k4737J5199M6483K3988o9376
3428d5058m665N3045N2441j6406j2323n8791k5421P2467L3281j6798K611k9659
3416D724P715J757M5110O547Q999l7283o5090k9118K1725k011K0569j06L3524
3403A7062m2046m1352j9693l1472L8070o9381M8704J4742j3630M8708k041l5105
3391h7434k3195J18284J2369J7163l4614j4848N6449o0514l3732l2694K8068k9083
3379h3781J2881M8544K8301m5665L5983K5908P942j9054r0904L042J0915q588
3367g4476j7968L6671l0125p530M7840L1190Q7109N2131l2175m6264o0076Q113
3355e560K1856J7267J2488m446J3705K5114o0748j208L5928L6413r3039R871O5917
$$ plain form
3342 73558 51456 -1617 -18670 -83644 -160793 -167694 -123716 -19330 -22441 -55022 -64896 -93363
3330 -93363 -20856 -2204 -66312 -68963 -59923 -46690 -61291 -108876 -27361 1738 8414 15016 14029
3317 14029 1304 -11688 40801 70542 53916 17927 49330 129384 133481 103389 47962 -29632
3305 -29632 -32683 86241 151536 38667 -48991 -14668 -27719 -54888 -76898 -96232 -108889 -112503
3293 -112503 -30192 -85439 -115112 -113090 -100968 -121794 -49288 35722 7836 -102344 -53129 -14444
3281 -14444 -11181 -15952 -19230 -12471 -34943 25776 -28956 -101381 17582 102328 87057 1761
3269 1761 -66272 -92812 -142621 -94261 -23732 -49254 -10021 54433 60436 72268 54816 40981
3257 40981 17777 50390 105284 75706 59627 43417 26971 34769 36453 63473 109444 19526
$$ packed form
3342G3558k2102n3073j7053o4974p7149o901M3978J04386l111l2581r874k8467
3330i3363P2507J8652o4108k651R040J3233j4601m7585Q1515K9099O676O602r87
3317A4029j2725j2992N2489K9741j6626l5989L1403Q0054M097l0092n5427p7594
3305b9632l051J18924O5295j12869q7658L4323j3051k7169k2010j9334j2657l614
3293a12503Q2311n5247k9673K022J2122k0826P2506Q5010k7886j10180M9215L8685
3281a4444L263m771l278O759k2472O0719n4732p2425J18963Q4746j5271q5296
3269A761o8033k6540m9809M8360P0529k5522L9233O4454O003J1832j7452j3835
3257D0981k3204L2613N4894k9578j6079j6210j6446P798J684K7020M5971q9918
$$ plain form
3245 19526 -64339 -16595 67124 133192 94348 14718 -33 19803 14021 70458 123234 29915
3233 29915 -42773 -73495 -156699 -129998 -81360 -31002 44358 105344 12751 -48952 -30387 1981
3221 1981 68530 169375 217172 131719 101356 23629 59737 89079 62721 19465 34739 85883
$$ packed form
3245A9526q3865M7744Q3719O6068l8844p9630j4751J9836n782N6437N2776r3319
3233B9915p2688l0722q3204K6701M8638N0358P5360O0986r2593o1703J8565L2368
3221A981O6549J00845M7797q5453l0363p7727L6108K9342k6358m3256J5274N1144
$$ [...]
##END NTUPLES=NMR SPECTRUM
##END=
