##TITLE=Analysis number 328273
Compound Code cc 01502
Book Reference 510/51
Project Code adrs
Chemist Name jimp
##JCAMPDX= 6.0         $$ Bruker NMR JCAMP-DX V2.0
##DATA TYPE= NMR SPECTRUM
##DATA CLASS= NTUPLES
##ORIGIN= Bruker BioSpin GmbH
##OWNER= nmr
$$ XWIN-NMR		Version 3.5
$$ Mon May 21 09:08:07 2007 GMT Daylight Time (UT+1h)  MAYBRIDGE\nmr@NMR_250MHZ
##.OBSERVE FREQUENCY= 250.131544655141
##.OBSERVE NUCLEUS= ^1H
##.ACQUISITION MODE= SIMULTANEOUS (DQD)
##.ACQUISITION SCHEME= undefined
##.AVERAGES= 16
##.DIGITISER RES= 18
##SPECTROMETER/DATA SYSTEM= dpx250
##.PULSE SEQUENCE= zg30
##.SOLVENT NAME= CDCl3
##.SHIFT REFERENCE= (INTERNAL, CDCl3, 0, 16.4417)
##AUDIT TRAIL= $$ (NUMBER, WHEN, WHO, WHERE, WHAT)
$$ ##TITLE= Audit trail, XWIN-NMR		Version 3.5
$$ ##JCAMPDX= 5.01
$$ ##ORIGIN= Bruker BioSpin GmbH
$$ ##OWNER= nmr
$$ C:\u/data/dgb/nmr/ADRS/1250/pdata/1/auditp.txt
$$ ##AUDIT TRAIL=  $$ (NUMBER, WHEN, WHO, WHERE, WHAT)
(   1,<2007-05-21 09:07:41.56 +100>,<MAYBRIDGE\nmr>,<NMR_250MHZ>,
      <created by zg, POWCHK disabled, PULCHK disabled
       configuration hash MD5:
       76 6E 9A 78 1E 09 19 81 EC 84 63 8F B0 6A 59 2D
       data hash MD5: 64K
       BC 22 23 DE A8 43 D9 04 B7 49 9E 3A 20 5F 04 31>)
(   2,<2007-05-21 09:07:56.93 +100>,<MAYBRIDGE\nmr>,<NMR_250MHZ>,
      <Start of raw data processing
       ef LB = 0.3 FT_mod = 6 PKNL = 1 SI = 32K 
       data hash MD5: 32K
       D8 4A 85 B3 11 32 8C 3F B4 BD 04 A7 98 32 EC 70>)
(   3,<2007-05-21 09:07:58.62 +100>,<MAYBRIDGE\nmr>,<NMR_250MHZ>,
      <apk 
       data hash MD5: 32K
       B5 B7 B9 9A DD 63 68 CD 2D C0 42 A0 7F B6 E5 3C>)
(   4,<2007-05-21 09:07:59.31 +100>,<MAYBRIDGE\nmr>,<NMR_250MHZ>,
      <abs ABSG = 5 
       data hash MD5: 32K
       95 39 10 15 DA D5 6E FD 68 DB CF 0C 58 8C B3 F5>)
$$ ##END=
$$ 
$$ hash MD5
$$ AD 1E B9 E8 8A 7B A8 33 64 B1 B8 1E 2B AA 4D 7E
##$RELAX= 
##$RELAX= 
##$RELAX= 
##$RELAX= 
##$RELAX= 
##$RELAX= 
##$RELAX= 
$$ Bruker specific parameters
$$ --------------------------
##$DU= <C:\u>
##$EXPNO= 1250
##$NAME= <ADRS>
##$PROCNO= 1
##$TYPE= <nmr>
##$USER= <dgb>
##$AMP= (0..31)
100 100 100 100 100 100 100 100 100 100 100 100 100 100 100 100 100 100 
100 100 100 100 100 100 100 100 100 100 100 100 100 100 
##$AQSEQ= 0
##$AQ_mod= 3
##$AUNM= <au_zg>
##$AUTOPOS= <2 >
##$BF1= 250.13
##$BF2= 250.13
##$BF3= 250.13
##$BF4= 250.13
##$BF5= 500.13
##$BF6= 500.13
##$BF7= 500.13
##$BF8= 500.13
##$BYTORDA= 1
##$CFDGTYP= 0
##$CFRGTYP= 5
##$CHEMSTR= <none>
##$CNST= (0..31)
1 1 145 1 1 1 1 1 1 1 1 1 1 1 1 1 1 1 1 1 1 1 1 1 1 1 1 1 1 1 1 1 
##$CPDPRG= <>
##$CPDPRG1= <>
##$CPDPRG2= <>
##$CPDPRG3= <>
##$CPDPRG4= <mlev>
##$CPDPRG5= <mlev>
##$CPDPRG6= <mlev>
##$CPDPRG7= <mlev>
##$CPDPRG8= <mlev>
##$CPDPRGB= <>
##$CPDPRGT= <>
##$D= (0..31)
0 1 0 0 0 0 0 0 0 0.06 0 0 0 0 0 0 0.0002 0 0 0 0 0 0 0 0 0 0 0 0 0 0 
0 
##$DATE= 1179734859
##$DBL= (0..7)
120 120 120 120 120 120 120 120 
##$DBP= (0..7)
150 150 150 150 150 150 150 150 
##$DBP07= 0
##$DBPNAM0= <>
##$DBPNAM1= <>
$$ [...]
##$SUBNAM7= <"">
##$SUBNAM8= <"">
##$SUBNAM9= <"">
##$SW= 20.6930455092707
##$SWIBOX= (0..15)
0 0 3 0 0 0 0 0 0 0 0 0 0 0 0 0 
##$SW_h= 5175.983436853
##$TD= 65536
##$TD0= 1
##$TE= 683.16
##$TE2= 300
##$TE3= 300
##$TEG= 300
##$TL= (0..7)
0 120 120 120 120 120 120 120 
##$TP= (0..7)
150 150 150 150 150 150 150 150 
##$TP07= 0
##$TPNAME0= <>
##$TPNAME1= <>
##$TPNAME2= <>
##$TPNAME3= <>
##$TPNAME4= <>
##$TPNAME5= <>
##$TPNAME6= <>
##$TPNAME7= <>
##$TPOAL= (0..7)
0.5 0.5 0.5 0.5 0.5 0.5 0.5 0.5 
##$TPOFFS= (0..7)
0 0 0 0 0 0 0 0 
##$TUNHIN= 0
##$TUNHOUT= 0
##$TUNXOUT= 0
##$USERA1= <user>
##$USERA2= <user>
##$USERA3= <user>
##$USERA4= <user>
##$USERA5= <user>
##$V9= 5
##$VALIST= <valist>
##$VCLIST= <CCCCCCCCCCCCCCC>
##$VD= 0
##$VDLIST= <DDDDDDDDDDDDDDD>
##$VPLIST= <PPPPPPPPPPPPPPP>
##$VTLIST= <TTTTTTTTTTTTTTT>
##$WBST= 1024
##$WBSW= 4
##$XGAIN= (0..3)
0 0 0 0 
##$XL= 0
##$YL= 0
##$YMAX_a= 471498
##$YMIN_a= -290642
##$ZGOPTNS= <>
##$ZL1= 120
##$ZL2= 120
##$ZL3= 120
##$ZL4= 120
##$ABSF1= 16.44173
##$ABSF2= -4.251442
##$ABSG= 5
##$ABSL= 3
##$ALPHA= 0
##$AQORDER= 0
##$ASSFAC= 0
##$ASSFACI= 0
##$ASSFACX= 0
##$ASSWID= 0
##$AUNMP= <proc_1d>
##$AZFE= 0.1
##$AZFW= 0.1
##$BCFW= 0
##$BC_mod= 0
##$BYTORDP= 0
##$COROFFS= 0
##$CY= 12.5
##$DATMOD= 1
##$DC= 0
##$DFILT= <>
##$DTYPP= 0
##$F1P= 14.0000005364418
##$F2P= -0.99999901652339
##$FCOR= 0.5
##$FTSIZE= 32768
##$FT_mod= 6
##$GAMMA= 0
##$GB= 0
##$INTBC= 1
##$INTSCL= 1
##$ISEN= 128
##$LB= 0.3
##$LEV0= 0
##$LPBIN= 0
##$MAXI= 10000
##$MC2= 0
##$MEAN= 0
##$ME_mod= 0
##$MI= 0
##$NCOEF= 0
##$NC_proc= -4
##$NLEV= 6
##$NOISF1= 0
##$NOISF2= 0
##$NSP= 0
##$NTH_PI= 0
##$NZP= 0
##$OFFSET= 16.44173
##$PC= 1
##$PHC0= -55.04863
##$PHC1= 6.866691
##$PH_mod= 1
##$PKNL= yes
##$PPARMOD= 0
##$PSCAL= 4
##$PSIGN= 0
##$REVERSE= no
##$SF= 250.130020077119
##$SI= 32768
##$SIGF1= 0
##$SIGF2= 0
##$SINO= 400
##$SIOLD= 32768
##$SREGLST= <1H.CDCl3>
##$SSB= 0
##$STSI= 32768
##$STSR= 0
##$SW_p= 5175.98343685301
##$SYMM= 0
##$S_DEV= 0
##$TDeff= 65536
##$TDoff= 0
##$TI= <Analysis number 999999
Compound Code 99
Book Reference 9
Project Code 9>
##$TILT= no
##$TM1= 0
##$TM2= 0
##$TOPLEV= 0
##$USERP1= <user>
##$USERP2= <user>
##$USERP3= <user>
##$USERP4= <user>
##$USERP5= <user>
##$WDW= 1
##$XDIM= 32768
##$YMAX_p= 357721500
##$YMIN_p= -230156
$$ End of Bruker specific parameters
$$ ---------------------------------
##NTUPLES= NMR SPECTRUM
##VAR_NAME=  FREQUENCY,     SPECTRUM/REAL,   SPECTRUM/IMAG
##SYMBOL=    X,             R,               I
##VAR_TYPE=  INDEPENDENT,   DEPENDENT,       DEPENDENT
##VAR_FORM=  AFFN,          ASDF,            ASDF
##VAR_DIM=   32768,         32768,           32768
##UNITS=     HZ,            ARBITRARY UNITS, ARBITRARY UNITS
##FACTOR=    0.157963299565203, 1,           1
##FIRST=     4112.57037988438, 0,            0
##LAST=      -1063.41305696863, 0,           0
##MIN=       -1063.41305696863, -230156,     0
##MAX=       4112.57037988438, 357721500,    0
$$ Real data points
##PAGE= N=1
##DATA TABLE= (X++(R..R)), XYDATA
$$ [...]
23204A38023m6397l2268l4945l9799K0400l5954M7007M4938K5432L6374l1400
23193I1411P495J2026n9808k546l1688q3933p5552J3713R4011N4170j3254k7238
23181b1193L3927j2199j6529k8945M5342l5671N7778R1746l3672k3019K1700k4349
23169E4916n9243p7904M0460P647l8006k7756M3929L0906J0385J5358l2893M8716
23157A6515j3076l3666J1785L0948L8658n1912k0123J8230p2853p1808N6809Q7237
23145c256N3512o797k8119K2025m281j9635q8600l7215O0910K9975q0759j1755
23133a13995l1630k6783j1574M3542Q7995O7308j1851l0406O5599J9353k4906
23122C2652l5830n8049L6262O9142l3807m4130m8451k9764L6178J4790L1499L7734
$$ plain form
23204 138023 91626 59358 24413 -15386 5014 -30940 16067 61005 86437 122811 91411
23193 91411 98906 110932 51124 48578 16890 -67043 -142595 -128882 -34871 19299 6045 -21193
23181 -21193 12734 535 -15994 -44939 403 -35268 22510 114256 80584 57565 79265 54916
23169 54916 -4327 -82231 -41771 -34124 -72130 -99886 -55957 -25051 -14666 692 -32201 16515
23157 16515 3439 -30227 -18442 12506 51164 -748 -20871 -2641 -75494 -147302 -90493 -3256
23145 -3256 50256 43459 15340 37365 33084 13449 -75151 -112366 -51456 -21481 -102240 -113995
23133 -113995 -145625 -172408 -183982 -140440 -52445 14863 3012 -27394 38205 57558 32652
23122 32652 -3178 -61227 -24965 44177 10370 -33760 -82211 -111975 -75797 -61007 -29508 8226
23110H226M9852p5854n646n6411n5952L3998M7057j1142M0751M7257j9330j4430
23098a1624m209K1654P276M7519P610l6611n2757o4119K4706K1117J1694K5556
23086b188k3615o0054L0643N7254K8312M634l431j8892k253O5103n253l0810J6095
23073E5545j5369j0225l0567l6774l2190O702K5391K0444K5393q097o7810J7871
23061d9686L4689M0725m5329k7270L5159O9053J8313m1477L2218j410n8642k6213
23049a9870k3742j9286K9603P0065P706n1330m8818m3718l4287N5358J27814N2010
23037A01505j7116K4046k61l5827n4507l5278K4970M5726q866l0452p7550o6277
23025a29887L6967M8101l783m5039Q033n679J5606K7990L8097l1803J1299R577
$$ plain form
23110 8226 58078 -17776 -23422 -79833 -135785 -101787 -54730 -65872 -25121 22136 2806 -11624
23098 -11624 -15833 5821 13097 60616 68226 31615 -21142 -85261 -60555 -39438 -27744 -2188
23086 -2188 -25803 -85857 -55214 2040 30352 34986 31555 12663 10410 75513 70260 39450 55545
23073 55545 40176 29951 -616 -37390 -69580 -62878 -37487 -17043 8350 253 -67557 -49686
23061 -49686 -14997 25728 -19601 -46871 -11712 57341 75654 34177 66395 64985 6343 -19870
23049 -19870 -43612 -62898 -33295 36770 44476 -6854 -55672 -99390 -133677 -78319 49495 101505
23037 101505 84389 108435 108174 72347 17840 -17438 7532 53258 44392 13940 -63610 -129887
23025 -129887 -92920 -44819 -48602 -93641 -85608 -91287 -75681 -47691 -9594 -41397 -30098 -20521
23013b0521N918L1959J924j1902O072l2567l6943j1770N2873L659J1574M657j3641
23000h708j4713J8145l172K3356L9829n5358k6472J5800r415n782M7264l78k3581
22987c185O011r595k6608K3621J6227O135J36M6210J8782j4017l2641J5720k7375
22974A9421n204l679l3867L7690M6149J6319m5756k9085K9537M0989m3926q33
22962B7755M0326j7936k2127o2560K0700L3599k4653o4742l6490P9952M8142m7928
22950b5962l4022P218M816Q766M8546j0185K6102M564m7249k995k4685j4126o6546
22937a25758N1815M7523j567n6441m6019N2383K4077L5215n746M8318P9122k8084
22925G4838j47010r6706O2991Q0863M1231k2335K3773j6729k9327K0862k7983
$$ plain form
23013 -20521 -14603 17356 19280 7378 13450 -19117 -56060 -67830 -14957 -11298 276 4933 -8708
23000 -8708 -23421 -5276 -8448 14908 54737 -621 -27093 -11293 -20708 -26490 20774 20396 -3185
22987 -3185 2826 -6769 -33377 -9756 6471 12606 12742 58952 77734 63717 31076 46796 19421
22974 19421 14217 10538 -23329 14361 60510 76829 31073 1988 31525 72514 28588 27755
22962 27755 68081 50145 28018 -34542 -13842 19757 -4896 -69638 -106128 -26176 21966 -25962
22950 -25962 -59984 -52766 -47950 -39184 9362 -823 25279 29843 -17406 -20401 -45086 -59212 -125758
22937 -125758 -73943 -26420 -27987 -84428 -130447 -78064 -53987 -18772 -24518 23800 102922 74838
22925 74838 -72172 -168878 -105887 -25024 16207 -6128 17645 916 -28411 -7549 -35532
22914c5532R283n156q2647K1502Q2047P5400j2126p0638p287R980P2330j8784
22902C8372k941m5563n3523J0149N160Q537K7144O629N48N7050K6307l1664k4512
22889B1693J4601L815J5041o432j5510j215q277k8620k3876j5306J0509n567k0266
22876e9410N7460O3447l8268J5958j9574p964Q686J7517L9977o0482k1298p201
22864a1152o3929L1931N1968N3677K7666m8089n8538o0715L6176L7227k7039k299
22852c3116M017R080J8762l2419j5451M829k880J0424N559j4958o78q44n345m707
22838e7727j6178M9654j0269r34J567O4506N1019k2377j4410M8122j4179k2001
22826E6793k1731l6520k231m8880R760J00154N652o6253N1073o50o0184l3632
$$ plain form
22914 -35532 -26249 -31405 -114052 -92550 -10503 64897 52771 -17867 -25154 -15174 57156 38372
22902 38372 35431 -10132 -63655 -53506 -48346 -39809 -12665 -6036 -5488 51562 77869 46205 21693
22889 21693 36294 40109 55150 48718 33208 31993 23716 -4904 -28780 -44086 -33577 -39144 -59410
22876 -59410 -1950 61497 23229 39187 19613 11649 20335 37852 77829 17347 -3951 -11152
22864 -11152 -75081 -43150 8818 62495 90161 42072 -16466 -77181 -41005 -3778 -30817 -33116
22852 -33116 -29099 -20019 -1257 -33676 -49127 -44298 -47178 -36754 -31195 -46153 -46831 -47675 -53020 -57727
22838 -57727 -73905 -24251 -34520 -35454 -33887 30619 81638 59261 44851 92973 78794 56793
22826 56793 35062 -1458 -3689 -52569 -42809 57345 62997 -3256 47817 47167 -13017 -46649
22814d6649k9349l7481O0460P6960K2817m4790j8029J0156K3805k4040J3250J6755
22802B3865L1216J5311Q058P27l0914q8321l0292m259l7689j4191R3529o039K7402
22789a1597K0667O2741n255m1000R458k1410j4126j1743L451R643j3421l2376
22777d4968k605L2580L9998l2136q4754J5608N2848p646K8781M9941l7260l2374
22765b1987M368m6290N608j2218j349L7691l1705N634K2630j3925O03J6473k9294
22752f3761K7428K7621L5680R3982r675k5158l0972n1263j2096j257K6914m6166
22740b8723m5875k4827K0365o4673K5654Q3563K6357K914k6920k0330M557O2703
22728A4765M521o3548k0618J9039K9766o373J8646j3157o008K6487K9420j8464
$$ plain form
22814 -46649 -75998 -113479 -53019 23941 46758 1968 -16061 -5905 17900 -6140 7110 23865
22802 23865 55081 70392 78450 79177 48263 -40058 -70350 -74609 -112298 -126489 -32960 -38999 -11597
22789 -11597 9070 71811 66556 25556 35014 13604 -522 -12265 -8814 829 -12592 -44968
22777 -44968 -47573 -14993 25005 -7131 -91885 -76277 -23429 -31075 -2294 47647 10387 -21987
22765 -21987 -17619 -63909 -58301 -70519 -71868 -34177 -65882 -60248 -37618 -51543 -50940 -34467 -63761
22752 -63761 -36333 -8712 26968 120950 111275 86117 55145 3882 -8214 -9471 17443 -28723
22740 -28723 -74598 -99425 -79060 -143733 -118079 -34516 -8159 -5245 -32165 -52495 -47938 14765
22728 14765 19286 -44262 -64880 -45841 -16075 -22448 -3802 -16959 -22967 3520 32940 14476
22716A4476l7595j4584k1722L8202j6541m6007j8732K8091N6087Q3328M2847m5473
22704F2377k8481m11n3784N027J495r104K4591K0444l3899J9235k6091P161L0524
22691A9084n9714o6081p973L9971r814K9903R1878J691N8612L1773m3095R547
22679I5782j1823j6659l820J0297l6495l7432K1826l9477l9673M2625M6595N3325
22667H5071k0746m4170J40N0925k3390m9539J1772q73R605l4200l1383l370J2022
22654c8136M084J9216N661r401P906l820N5110l4126m7621L5490k6803k0713K4215
22641b8938M0097R060j4389O1762M0018q5592j7257L2073j2225K2235j751J2050
22629E7143k9219p436J1194p7916k3237J9546q572o72O6542P0014O197k8080q252
$$ plain form
22716 14476 -23119 -37703 -59425 -21223 -37764 -83771 -102503 -74412 -18325 65003 107850 62377
22704 62377 33896 33485 -20299 -15272 -13777 -22881 1710 22154 -11745 7490 -18601 -11440 19084
22691 19084 -40630 -106711 -114684 -74713 -84527 -54624 37254 38945 97557 129330 86235 95782
22679 95782 83959 67300 63480 73777 37282 -150 21676 -17801 -57474 -14849 31746 85071
22667 85071 64325 20155 20295 71220 47830 -1709 10063 9190 18795 -15405 -46788 -50158 -38136
22654 -38136 -34052 -14836 -9175 -18576 -10670 -14490 40620 6494 -41127 -5637 -32440 -53153 -28938
22641 -28938 11159 20219 5830 67592 107610 22018 4761 36834 24609 46844 45093 57143
22629 57143 27924 20488 31682 -46234 -69471 -49925 -58497 -59169 7373 77387 83584 55504 47252
22616D7252j848l1606k0059O7403j1771J3940q701J5042K1622l3532k0070q4764
22604d7092q5287m8836J965N7169P8060L1455n2065n374l184P871J8579L0651
22592a6088n947K3906K4792J0946L4920J9677m3173M652j8327j7094J3449J4642
22580D6355m7868O793j9316n2549K2351N3937N539m2557L6411R452J3906K8775
22568F1229n6845o4104j3204J7663M017Q062J5176q0081q187N4219L0891M3697
22556A2533l3569m1343N2511O2263k5414n5341M6880J1441j5576k3145l1168j0604
22544e0532j2694n3140j5876o302P6790P4826k9791n5533N9598L6862J4236N5889
22532I4333J4204n2166k8403J0344j5246l3207J5831l9040m9831o4590L1061J01806
$$ plain form
22616 47252 45404 13798 -6261 61142 49371 63311 54610 69652 91274 57742 37672 -47092
22604 -47092 -132379 -181215 -179250 -122081 -44021 -12566 -64631 -70005 -73189 -65318 -46739 -16088
22592 -16088 -22035 1871 26663 37609 72529 92206 49033 53685 35358 18264 31713 46355
22580 46355 -1513 5280 -14036 -66585 -44234 9703 15242 -27315 9096 18548 32454 61229
22568 61229 4384 -59720 -72924 -55261 -51244 -43182 -28006 -108087 -116274 -62055 -31164 12533
22556 12533 -21036 -62379 -9868 52395 26981 -28360 18520 29961 14385 -8760 -39928 -50532
22544 -50532 -63226 -116366 -132242 -138544 -61754 13072 -16719 -72252 -12654 24208 38444 94333
22532 94333 108537 56371 27968 38312 23066 -10141 5690 -33350 -83181 -147771 -116710 -14904
22520a4904o75p78r013L0020M8066J7446J3790l2434n6387k561l281j8443L8497
22507I343J3028n406p1890o921Q8781J7794L9096J2774k2140J8197l7307n0543
22495D806j8945L2831j3678p222L6930j4575n7341Q143k5134j0079k932l3581
22483a00777O967M9087j2979M9843j3902J7406N3120j0003n0846l0367M5056k1334
22471a8729m7154Q1468O5027J4576l7321p1361r3152J2580L7744j3094N0275j0458
22459b9599k618m364j866j6757p837M6692N9202K9728l9635m2071o633J0568M4423
22446C9233l282o514m375L7981P606M072o0048k7474J0671k5291M475m5049K6409
22433d1586o422J6473K8648O1202N7371j5708m7700R26l063J7771L8411j9801
$$ plain form
22520 -14904 -15579 -16357 -25370 4650 52716 70162 83952 51518 -4869 -7430 -10711 -29154 9343
22507 9343 22371 16965 -54925 -61846 26935 44729 83825 96599 74459 92656 55349 4806
22495 4806 -14139 18692 5014 -2208 34722 20147 -37194 -29051 -54185 -64264 -67196 -100777
22483 -100777 -93810 -44723 -57702 -7859 -21761 -4355 48765 38762 -12084 -42451 2605 -18729
22471 -18729 -65883 15585 80612 95188 57867 -13494 -106646 -94066 -56322 -69416 -19141 -29599
22459 -29599 -32217 -36581 -38447 -55204 -63041 -16349 42853 72581 32946 -9125 -15758 -5190 39233
22446 39233 35951 29437 25062 63043 70649 74721 14673 -12801 -2130 -27421 -22946 -67995 -41586
22433 -41586 -48008 -31535 -2887 58315 115686 99978 52278 53204 50141 67912 106323 86522
22421H6522j1047p590q7464k0576J9040m6140J0346N8438j0226k4442L7893j3001
22409h247j6145P3017P126m5625p4048l8379J2230L9592l0576q6843k6569L1546
22397a62921J4966L7723P7671P3181k3914N353l6403l3467j4751M4123M1998j6595
22385F964l9141l3310J9935m036N4218O5135j793l0684J398N042J4404l9950r9157
22372h0975n1356j5235L489P9310L2052L0262P922k7323L8899J2981n762p5437
22360e1173l1611L2196j2697j7721R150K7535J8979J7826M2433J8523j3250j5922
22348B4268l363N534j3805O491J1038J4952n1696P311K0804j3696P616L2324j4980
22335C2798l2595r017J1838J7495L8641O3748r0651p0939o457M1696K5308K3556
$$ plain form
22421 86522 75475 67885 -19579 -40155 -21115 -67255 -56909 1529 -8697 -33139 4754 -8247
22409 -8247 -24392 48625 55751 10126 -63922 -102301 -90071 -50479 -81055 -167898 -194467 -162921
22397 -162921 -147955 -110232 -32561 40620 16706 22059 -14344 -47811 -62562 -18439 23559 6964
22385 6964 -32177 -65487 -45552 -49588 4630 69765 67972 37288 38686 43728 58132 18182 -80975
22372 -80975 -132331 -147566 -144077 -64767 -32715 -2453 5469 -21854 17045 30026 24264 -51173
22360 -51173 -82784 -50588 -63285 -81006 -71856 -44321 -25342 -7516 34917 53440 40190 24268
22348 24268 20905 26439 12634 19125 30163 45115 -6581 730 21534 7838 15454 47778 32798
22335 32798 203 -8814 3024 20519 59160 122908 32257 -38682 -45139 -3443 21865 45421
22323D5421L374J5794k1705l6492n30n7658k9535J0750K374m473O922Q2419r373
22310G288l7406k7119j8796l550L6298K7962M7593O5610j1964p2720o1399m8341
22298i6544j7212N6107J10936J0816j2626M1132l471m0191K9983j382m4999j0478
22286B2071J0537j3341L2903K4059j4151n3940j4936K9651r392n6808j980P5309
22274B9982L4471j8504K820k0828J7470k1287n1394k8896K3744L6841j0470K1181
22262A5130l965J2224q538k2790M9756J2411j2071m8516j7931j5203N195Q476
22250b5822J8747K1154M0123K0049l160K2737l4012n7759q8590L6818j1179l2850
22238i3744j7959L3721M1460l358j5751k493K1145j8273j8148K6482o1092m889
$$ plain form
22323 45421 48795 64589 42884 6392 5862 -51796 -81331 -70581 -68207 -72680 -65758 16661 7288
22310 7288 -30118 -57237 -76033 -79583 -43285 -15323 32270 97880 85916 13196 -48203 -96544
22298 -96544 -113756 -57649 53287 64103 51477 92609 89138 48947 78930 77548 32549 22071
22286 22071 32608 19267 52170 76229 62078 8138 -6798 22853 13461 -43347 -45327 29982
22274 29982 64453 45949 48769 27941 45411 24124 -27270 -56166 -32422 4419 -6051 15130
22262 15130 11165 23389 14851 -7939 41817 54228 42157 -6359 -24290 -39493 -34298 -25822
22250 -25822 -7075 14079 54202 74251 71091 93828 59816 2057 -86533 -49715 -60894 -93744
22238 -93744 -111703 -77982 -36522 -39880 -55631 -58124 -36979 -55252 -73400 -46918 -108010 -112899
22226a12899J943N9307O0083Q654n0411K7494M7280K6140P00l8903k8431J7137
22214A8094K0368n9578m0402Q0094K4817k135r351K7541J014j9776k072J3762
22202E2376m6497o6413k474M7809K210n1230o599k481J7465j4807k1617K1678
22190g0580J4117L9154J4183k1683L2437P558m4054K2053Q782j2062R543J1634
22178A1082j2747L2426l2657m9632l458k2357j4534L3548P7817N521k6526n5390
22166e6907M137k965r612K3356L1382K4281L659n7011m2205M137J829J022l723
22153g8620J2452K5349J4913K304p3564n0899K1968Q4045Q664m7610N4114N6294
22141B9410L3473j9707J2993L7328J0091m3221l3949J7862q172N395m248l2853
$$ plain form
22226 -112899 -110956 -51649 8434 17088 -33323 -5829 41451 67591 68291 29388 957 18094
22214 18094 38462 -21116 -61518 18576 43393 41258 31907 59448 60462 40686 38614 52376
22202 52376 5879 -60534 -63008 -15199 -12989 -64219 -70818 -73299 -55834 -70641 -92258 -70580
22190 -70580 -56463 -17309 -3126 -24809 7628 15186 -28868 -6815 1967 -10095 -552 11082
22178 11082 -1665 30761 -1896 -51528 -54986 -77343 -91877 -58329 19488 25009 -1517 -56907
22166 -56907 -52770 -55735 -65347 -41991 -10609 13672 17331 -39680 -81885 -77748 -75919 -74897 -78620
22153 -78620 -66168 -40819 -25906 -23602 -97166 -148065 -126097 -42052 -33388 -80998 -26884 29410
22141 29410 62883 43176 56169 93497 103588 60367 26418 44280 36108 41503 37255 4402
22129D402j3605L2178J0859m0976k2584K7077Q658n675k421j297m8369N4437N3324
22116E6008L9043P528k5768Q03K809o0268m6529n334L2671P1641k8170r2848j5933
22103f4347L9985L3233J9790J4796L5310p3021J278K530L3100K8065j8515m1330
22091A0874l3925J2055O6200J3892j6618j0722j8900n5668k0955n673N8632k7839
22079b8647m7287R35p973N7701K8892n400N0446j7098k9608k2569M2308m5035
22067b3335J1201p819K0043N3828o1889m2335k2588m900k7935k7959j5701K1372
22055a28017J0605j2461N1519O5880Q4786J04730j2770q3332r9863r888L8218
22044I407k5025N965j1854O573K2650l7688m0453j1464j8603j3787m849j419K4282
$$ plain form
22129 4402 -9203 22975 33834 -7142 -29726 -2649 6009 334 -2087 -3384 -51753 2684 56008
22116 56008 95051 102579 76811 77614 80423 20155 -26374 -31708 963 72604 44434 -48414 -64347
22103 -64347 -24362 8871 28661 43457 78767 5746 7024 9554 42654 70719 52204 10874
22091 10874 -23051 -10996 55204 69096 52478 41756 22856 -32812 -53767 -59440 -808 -28647
22079 -28647 -75934 -74999 -82972 -25271 3621 -1779 48667 31569 1961 -20608 21700 -23335
22067 -23335 -12134 -19953 90 53918 -7971 -50306 -72894 -77794 -105729 -133688 -149389 -128017
22055 -128017 -117412 -129873 -78354 -12474 72312 177042 164272 80940 -18923 -28811 9407
22044 9407 -15618 -9653 -21507 -14934 7716 -29972 -70425 -81889 -100492 -114279 -119128 -120547 -96265
22031i6265R996P770r167K7358K7712L7284p339n1381n3617j4990M6963J9989
22019e5687R744k2857J8284K5958L3380K4506l8390p8057j9899L9674L0068j1405
22007d4681N1064O4091k1081k4398k158k9498m2877k0657J4005M8275J8203L8887
21995D9175p560o3767l9232P20M8014J9647L2298q283k9684k2835k5033J1850
21983c4690j594K0032l1219Q280O3671N092J5815j0443o5803l288M7440k1810
21971h517k6335q834J4863K0663j3448M1534M8687j0378j7475K5130m6340n4526
21959c4976j4885N1093P0813J2787m8664J2578J7831n745o9116j147l2334k0595
21947f2360L0719r160N1024N6324k7185o0544k9644L3961k6275l4343J4623J5705
$$ plain form
22031 -96265 -86269 -78499 -87666 -60308 -32596 4688 -2651 -54032 -107649 -122639 -75676 -55687
22019 -55687 -45943 -68800 -50516 -24558 8822 33328 -5062 -83119 -103018 -63344 -33276 -44681
22007 -44681 6383 70474 49393 24995 22837 -6661 -49538 -70195 -56190 -7915 10288 49175
21995 49175 41615 -22152 -61384 -60664 -12650 6997 39295 31012 1328 -21507 -46540 -34690
21983 -34690 -36284 -16252 -47471 -39191 24480 29572 45387 34944 -30859 -34147 13293 -8517
21971 -8517 -34852 -43686 -28823 -8160 -21608 19926 68613 58235 40760 65890 19550 -34976
21959 -34976 -49861 1232 72045 84832 36168 48746 66577 60832 -8284 -9431 -41765 -62360
21947 -62360 -31641 -40801 10223 66547 39362 -21182 -50826 -16865 -43140 -77483 -62860 -47155
21935d7155l7346N74O8515j0669j7749L2818k3753k2740J3010Q265M9577J7228
21923C0575J250j4701J6777J3335l3276k5303l645l2900m1158p623J2348M2991
21911d1330L3225K491o1339m3817K1380K1438K9677N9136J5417R323m3005o684
21899d088L3412n3498l2204L9199O5365L1404j8645l6256k6342K601M4222l1697
21887A3473K1461K4403N0382J3477k8622o0338m6228L0276N714J2618J1200m3819
21875C997m5486N6593R795l2675J6487K4137l2561p0137O332j2927J6628O5889
21863F072k907J1645L0844J0884m9378l609j3452L0190r857j0293n1907M9496
21851b272j1461L1649M2357l1205J6531J6854o505k4246m2241m9450l8434O0947
$$ plain form
21935 -47155 -84501 -83927 -15412 -26081 -43830 -11012 -34765 -57505 -44495 -36230 13347 30575
21923 30575 31825 17124 33901 47236 13960 -11343 -14988 -47888 -89046 -96669 -84321 -41330
21911 -41330 -8105 -5614 -66953 -110770 -89390 -67952 -38275 20861 36278 45601 2596 -4088
21899 -4088 29324 -24174 -56378 -17179 48186 79590 60945 24689 -1653 948 45170 13473
21887 13473 34934 59337 109719 123196 94574 34236 -11992 18284 23998 36616 47816 3997
21875 3997 -41489 15104 24899 -7776 8711 32848 287 -69850 -63518 -76445 -59817 6072
21863 6072 3165 14810 45654 56538 7160 3551 -9901 20289 10432 139 -51768 -2272
21851 -2272 -13733 17916 60273 29068 45599 62453 55948 31702 -10539 -59989 -98423 -37476
21839c7476J12428L7392n018k5319p9550m1292J7839l9749k9295j5655K3958N1723
21827c0014N067J9000l68J5097J2348l5295j1886L2530R4622l3868n1197K3700
21815C9736K3055j7940l8569j0668o1968q926L2730N2847n9971l8248J6348K7147
21803d4427K1534l4683K6867m3383M0034o069J32j3664K6849M0963O0626J3221
21791H8000j3115m7485n3349k3594l8963L5974Q903n582N452j8903j9474p471
21779h9607Q113J9928J1051j7224m781l26M1266j581m4953p509N686l715N8539
21766b5113J734k0568m6070k8487K5144L0367J7896j3184J5609p3j2588J2042
21754d3291N7761j0964l9438N472L5055j7105J8712l5164m1899J2422R041M251
$$ plain form
21839 -37476 74952 112344 107326 82007 2457 -38835 -20996 -60745 -90040 -105695 -81737 -30014
21827 -30014 -24947 -5947 -6315 8782 21130 -14165 -26051 6479 101101 67233 16036 39736
21815 39736 62791 44851 6282 -4386 -66354 -75280 -42550 10297 -49674 -87922 -71574 -44427
21803 -44427 -22893 -57576 -30709 -74092 -34058 -40127 -39995 -53659 -26810 14153 74779 88000
21791 88000 74885 27400 -25949 -49543 -88506 -52532 -43629 -49211 -43759 -62662 -82136 -89607
21779 -89607 -81494 -61566 -50515 -67739 -72520 -72846 -31580 -33161 -78114 -85623 -79937 -83652 -25113
21766 -25113 -23379 -43947 -90017 -118504 -93360 -62993 -45097 -58281 -42672 -42745 -55333 -43291
21754 -43291 14470 3506 -35932 -30460 4595 -12510 6202 -28962 -70861 -58439 -49398 -45147
21742d5147k1657J3272o7082K3400Q8052L2844p6231O203M0459J9660m5792n565
21730c7584j9051l1207L5763m017r629N0594L6794P037J3793j1871k2490l9030
21718c0898K6113N5588o5682n3975M3622n6572k8072Q2906N6835j351l444j0986
21706A4084L40K0493p703n1357j8299P0566J1627m2779k7579j757R559M7014J6855
21693D1064j2536k4277k0857l672L931j3219M5184L6413K3988k4745n7983k7311
21681c4020M3392N9046o4497j852j1560l1252L2079q362j2911Q294K1143m130
21669d630M373L2131R476j6085n6873K4978L2484R821K3623L0512k2103K7773
21657I5480m884m5308o928M5113l3106p1822j0356j6745J2823K3268N849j0633
$$ plain form
21742 -45147 -66804 -53532 -120614 -97214 -9162 23682 -52549 -46346 -5887 13773 -32019 -37584
21730 -37584 -56635 -87842 -52079 -56096 -65725 -15131 21663 28700 42493 30622 8132 -30898
21718 -30898 -4785 50803 -14879 -68854 -25232 -81804 -109876 -26970 29865 28514 25070 14084
21706 14084 14424 34917 27214 -24143 -42442 28124 39751 -3028 -30607 -32364 -22805 24209 41064
21693 41064 28528 4251 -16606 -20278 -16347 -29566 15618 52031 76019 51274 -6709 -34020
21681 -34020 9372 68418 3921 2069 -9491 -40743 -8664 -17026 -29937 -21643 -500 -4630
21669 -4630 -257 31874 41350 25265 -31608 -6630 25854 35675 59298 89810 67707 95480
21657 95480 90596 45288 38360 83473 50367 -21455 -31811 -48556 -35733 -12465 -6616 -17249
21645a7249j5033o1715l849N5318p93M887L6957J3206l6713J6925J1797n6298
21633e2560L1299O4766J359n9368J6396Q3098p812o3245l6456J9991k5665M832
21621b3365j986j9578O262l5636M1333R8749k3620o3740m1189J4157O4438k1694
21609e869K0457P752m9235l6252M471O2856P9383j4113j8646M9671l6653p4151
21597a0329n3094K1309j048L0112j5428r239K2676m468J8759k2401j1386M995
21585b9542O015j8577L0689K6275L4515j5117l3664K1857N8320l3831o1367J5620
21573A193l3065l1134N7968N6134L7335j1238n1404k6033o257N7927j00302l2550
21561h1426O0546j2347m0680L116l887n9225K0996P9233M56k3754K1731J9703
$$ plain form
21645 -17249 -32282 -93997 -97846 -42528 -43321 -38434 -1477 11729 -24984 -8059 3738 -52560
21633 -52560 -21261 43505 44864 -14504 1892 84990 77178 13933 -22523 -2532 -28197 -23365
21621 -23365 -25351 -44929 -38667 -74303 -32970 65779 42159 -21581 -62770 -48613 15825 -5869
21609 -5869 14588 22340 -26895 -63147 -58676 4180 83563 69450 50804 100475 63822 -10329
21597 -10329 -63423 -42114 -43162 -13050 -28478 -37717 -15041 -19509 -750 -23151 -34537 -29542
21585 -29542 -23527 -42104 -11415 14860 49375 34258 594 22451 80771 46940 -14427 1193
21573 1193 -31872 -63006 -5038 51096 88431 77193 25789 -244 -6501 51426 -48876 -81426
21561 -81426 -20880 -33227 -73907 -70791 -74678 -133903 -112907 -33674 -33218 -56972 -35241 -15538
21549a5538Q2354M8968n3101r889j3071m7102N323J3597l6181J1119M273p2294
21537h1542k9519l1351P7102J14451O703q4851K9236J5478j7559j67l735j6310
21525b2064j006P051J1913l2023K0890J8703K4504J8605n6521k1406m69k6538
21513e8361M8287R1302J6419K2980j8421n2066M7351J3078o1693p4761K9513P899
21501A1527m553m7415l566K428J3653O31L1757M6783K218K0104p6811k5142k4688
21488e3074K1721J6237j8173M3570o26n1703R517k2854k2136M0362K7184Q919
21476a056M8568Q915k1829K7359p783n3204n1533J346N3312m991J9457k1988r526
21463a2953Q590l8919n6056K5807j1766j3030m3688K3709N3698j844j2190L933
$$ plain form
21549 -15538 66816 115784 62683 52794 39723 -7379 -2056 11541 -24640 -13521 -9248 -81542
21537 -81542 -111061 -142412 -65310 49141 55844 -29007 229 15707 -1852 -2019 -5754 -22064
21525 -22064 -23070 -16019 -4106 -36129 -15239 3464 27968 46573 -9948 -31354 -31823 -58361
21513 -58361 -10074 81228 97647 120627 102206 50140 97491 110569 48876 -25885 3628 11527
21501 11527 6974 -40441 -44007 -41579 -27926 -27295 4462 51245 53463 73567 -3244 -28386 -53074
21488 -53074 -31353 -15116 -33289 10281 9655 -42048 -32531 -55385 -77521 -37159 -9975 -1056
21476 -1056 47512 56427 34598 61957 54174 970 -50563 -49217 4095 -896 18561 -3427 -12953
21463 -12953 -4363 -43282 -99338 -73531 -85297 -98327 -142015 -118306 -64608 -66452 -78642 -74709
21451g4709K6620N3604N113k0250l0786m1346L8269j6791m9127j3500q392J0162
21439a21133P0280Q0869k8964K8542k5913k4092L4102K431l4683L7535m081o7823
21427e2930l7340J8509L0695N0102L4974k7857J3049K0676j3049j4345k3306m4899
21415d5721l2053l9564k4336j4261L6004P4902K9488K9013k0812J8564L1236n0747
21403h287l608M533o8053q0649M7298P174K21L5524n200L4588q836Q406M2859
21390E970j7877m0529M0788J6694l0254m2825o4265j3164N8932N6478K9183p6685
21378g7554j2218J1161N687k6986o457L113L2453M1501l5090K8383N9828J4202
21366C8023k3248Q1178L7384n2070n3356j2609J0214N0554l4559L214J5437o4341
$$ plain form
21451 -74709 -48089 5515 10628 -9622 -40408 -81754 -43485 -60276 -109403 -122903 -131295 -121133
21439 -121133 -50853 30016 1052 29594 3681 -20411 13691 16122 -18561 18974 14893 -52930
21427 -52930 -90270 -71761 -41066 9036 44010 16153 29202 49878 36829 22484 -822 -45721
21415 -45721 -77774 -117338 -141674 -155935 -119931 -45029 -15541 13472 -7340 11224 42460 -8287
21403 -8287 -11895 -7362 -75415 -156064 -108766 -101592 -101371 -65847 -71047 -36459 -45295 -36889 5970
21390 5970 -11907 -52436 -11648 5046 -25208 -68033 -132298 -145462 -86530 -30052 -869 -77554
21378 -77554 -89772 -78611 -72924 -99910 -106367 -103254 -70801 -29300 -64390 -36007 23821 38023
21366 38023 14775 95953 133337 81267 27911 15302 25516 76070 41511 44725 60162 -4179
21354d179n5678K2025j333M0344o883j7964L1961p1714o7041j5647N6397J15395
21342B5683m7052j06155N5350J02603L7210Q848r0236q2101j366M1947M3114L0598
21330A8443M044K0795m4321l3620J5767k1432m2640O2449n915J4587Q264L883
21318C04m7574J659m39k7171m3551r157K3527L8416J3009m853N3749k5049k5114
21305e2244J5772j5955k7140O1085P1871O0454j6396o3438n0184l1461j3105K2656
21293c8085j8861j409P4136L2259m3987k3135j2361K4349m8104p56J0802l5169
21281h0321q336N3227L87l4534p990j3789O1459M3469l0676o172P682N119M7160
21268C6685j4568J8989j6134l2298m6282P6437O2627R539k7472n2936j8082l0238
$$ plain form
21354 -4179 -59857 -37832 -39165 1179 -5704 -23668 8293 -63421 -130462 -146109 -89712 25683
21342 25683 -21369 -127524 -72174 30429 67639 76487 -13749 -95850 -97216 -55269 -12155 18443
21330 18443 22487 43282 -1039 -34659 -18892 -40324 -82964 -20515 -26430 -11843 -3579 304
21318 304 -47270 -45611 -46050 -73221 -116772 -125929 -102402 -63986 -50977 -55830 -2081 -27130 -52244
21305 -52244 -36472 -52427 -79567 -18482 53389 113843 97447 34009 -16175 -47636 -60741 -38085
21293 -38085 -56946 -58355 15781 48040 4053 -19082 -31443 -7094 -55198 -55954 -45152 -80321
21281 -80321 -88657 -35430 -35043 -69577 -77567 -91356 -29897 13572 -17104 -23276 -15594 -10475 36685
21268 36685 22117 41106 24972 -7326 -53608 22829 85456 94995 67523 14587 -3495 -33733
21256c3733J1133L7438j5149j6673P849n694l6370m4551J192K4451Q8281L7458
21244E5632R025j4868n694M167j9353m1172p273j8435Q254O2172O2986M526p1854
21231B8113l043N9509K0638m6338P070j2337q001k9096j5496l15j0805J3331n991
21218b761o6586J5274M5722k9653k6399j4835O1167N6576k3745o5962j05516k6981
21206a83699M2184k8683l0104O0923J06686L2411n7624j9528J4544r222k1439
21195i3551N0460L5785M6638q574J163J041K3532R086n987J3416J343N698m8069
21182C1981j14710n0295N9084P6947M6098j5032k8571k6291k1182J1911O0224
21171C0164N1765n1830o8495L1486J1959m7965l7524L218N1139j0255Q654O7671
$$ plain form
21256 -33733 -22600 14838 -311 -16984 -9135 -14829 -51199 -95750 -94558 -70107 18174 55632
21244 55632 64657 49789 44095 48262 28909 -12263 -19536 -37971 -29717 32455 95441 99967 28113
21231 28113 25070 84579 105217 58879 65949 53612 45611 16515 1019 704 -10101 3230 -2761
21218 -2761 -69347 -54073 -8351 -38004 -64403 -79238 -18071 38505 14760 -51202 -156718 -183699
21206 -183699 -141515 -170198 -200302 -139379 -32693 -282 -57906 -77434 -62890 -72112 -93551
21195 -93551 -43091 -7306 39332 30758 31921 32962 56494 65580 59593 73009 74352 80050 31981
21182 31981 -82729 -133024 -73940 3007 49105 34073 5502 -20789 -41971 -30060 30164
21171 30164 81929 30099 -38396 -6910 5049 -42916 -80440 -77222 -26083 -36338 -27684 39987
21159C9987N3214o0443m4693Q6211M2704m5492l4654K4751K6235k5717p396k7221
21147B7486q9280J357L3058K492J6482m455J3288l0935O079m250J7185J4100m3002
21134d0395P518O7485j0961o3136l6298M011P712M1325Q38r859j0076o8551j6374
21121a26761L2812K402O377o294K9510K4800q568m9688K2651R4285R647J4132
21109D5305j505Q917K1469l7557p1130L624K2907K2760l9251o3551k7669j8991
21097a34672Q899K6282Q237K8894r838k6444K4710N2196J9334n7658j8402R470
21085f8992k2994P948O816K0026J5299J5963L502O278k2021K981O9542j1599m9065
21072b6316j3927m9182p8982k3427M7236N6379N2334o1964M3737Q2360j870R91
$$ plain form
21159 39987 93201 32758 -11935 74276 116980 71488 36834 61585 87820 62103 54707 27486
21147 27486 -61794 -60437 -27379 -24887 -8405 -12860 428 -30507 -24428 -28678 -11493 2607 -40395
21134 -40395 -32877 34608 23647 -39489 -75787 -71776 -64064 -22739 -21901 -31760 -41836 -110387 -126761
21121 -126761 -93949 -91547 -85170 -91464 -61954 -37154 -45722 -95410 -72759 21526 31173 45305
21109 45305 43800 52717 74186 36629 -34501 -30877 -7970 14790 -24461 -88012 -115681 -134672
21097 -134672 -125773 -99491 -91254 -62360 -72198 -98642 -73932 -21736 -2402 -60060 -78462 -68992
21085 -68992 -91986 -84038 -77222 -57196 -41897 -25934 -22432 -16154 -38175 -35194 34348 22749 -26316
21072 -26316 -40243 -89425 -168407 -191834 -144598 -88219 -35885 -97849 -54112 28248 26378 27369
21060B7369O9457L9493n2977o3767j9853l6693k4576P478Q363K3687O5954j7768
21048B6167o8709L0096L5478m4744n6588l0016j4402P531J7925N4046K6478J6953
21036B15j437l5320l031j4971K9819j1090k5166K7555M8723N6203N299o7817k6995
21023a8013K626l413o534J2084L0503k45q4640n738j4433L3150O551m187p189
21010e9478M8579J5077j2086M5689J9667k8917m6811K951M638K3774j2900k4399
20998b4216j7792m302L5287l4676j1397J4514N0411K2456p556l9147o904M7262
20986B3940N0988M5725M8314q7165p1415J4971m0237L2402M2429M0216p4524l4247
20974h603r534m0091j5098N728j0729M2946k6377n861j4005j5389K9716r887m0242
$$ plain form
21060 27369 96826 136319 83342 19575 -278 -36971 -61547 -54069 -45706 -22019 43935 26167
21048 26167 -42542 -12446 23032 -21712 -78300 -108316 -122718 -115187 -97262 -43216 -16738 215
21036 215 -1222 -36542 -39573 -54544 -24725 -35815 -60981 -33426 15297 71500 76799 8982 -18013
21023 -18013 -15387 -18800 -25334 -13250 17253 17008 -67632 -73370 -87803 -54653 -48102 -52289 -59478
21010 -59478 -10899 4178 -7908 37781 57448 28531 -18280 -15329 -10691 13083 183 -24216
20998 -24216 -42008 -46310 -11023 -45699 -57096 -42582 7829 30285 22729 -16418 -23322 23940
20986 23940 74928 120653 168967 81802 10387 25358 -14879 17523 59952 100168 25644 -8603
20974 -8603 -18137 -58228 -73326 -67598 -78327 -35381 -61758 -67619 -81624 -97013 -67297 -77184 -117426
20961a17426L9022Q6191L4501m3046Q673k5458K1428M0154L2868M8897k9026m6207
20949E0571l9952j2107L552q729K8935L1752k2181l433l5567l3183M1529K699
20937C886n0918q322K337j372K6763m5916P6980Q9220K193l3948J0928J016j0720
20924F2127M577Q576k2794n9682q195J7825k2544l9490l3701j4330M3558O6399
20912B326N7620k561k3782k8924m6709n572L9990K5840l1784J164L7424L6713
20900F1745j134Q674k6560n5185p1694n5466N2687M5620M7780m0928l9383l698
20888g7542O4703N7585j6441p1200o103j6434K3940Q4368K0416n6517k7787k8031
20876d9043K7753M1383Q8794J1821k9440k7757n7561P036J1686l633l2380k3694
$$ plain form
20961 -117426 -78404 7787 42288 -758 7915 -17543 3885 44039 76907 125804 96778 50571
20949 50571 10619 -1488 2064 -6665 22270 54022 31841 28408 -7159 -40342 1187 3886
20937 3886 -47032 -55354 -53017 -54389 -27626 -73542 3438 92658 94851 60903 71831 72847 62127
20924 62127 66704 75280 52486 -7196 -15391 2434 -20110 -59600 -93301 -107631 -64073 2326
20912 2326 59946 57385 33603 4679 -42030 -47602 -7612 18228 -13556 -12392 25032 61745
20900 61745 60611 69285 42725 -12460 -84154 -139620 -86933 -41313 6467 -34461 -73844 -77542
20888 -77542 -12839 44746 28305 -42895 -48998 -65432 -41492 42876 63292 6775 -21012 -49043
20876 -49043 -21290 20093 108887 120708 91268 63511 5950 12986 24672 21039 -11341 -35035
20864c5035j7183R971L782K5506l1265J4226Q0220j2170K582J0770m1003m3083
20852c2682K1942M6765L2604l6572o6784m3116J3932J5312L7966k5451K1533M9203
20840C4652l482k7511L2431p828k0200o9098K0469Q979J6255K1190l6053l7404
20828f7600j3146J5554K7510k800m8349m6091O8591R9383L2889N7359l927l8168
20816H1205q4389o4423L9743M323O6066R346j5610k873l6103n1461M3042k217
20804a3351N5045L4874j8262n1773o6637k3079P116O3810J0265l9057J363M5687
20792F001o1558m345K8615K0504O6124J8405o9335p569K0232k6746M1313M2261
20780G3902j7322m7735J2322L970J8718o5672j0104K0073L8141j6401r297j3497
$$ plain form
20864 -35035 -52218 -42247 -38465 -12959 -44224 -29998 50222 38052 40634 51404 10401 -32682
20852 -32682 -10740 36025 68629 32057 -34727 -77843 -63911 -48599 -10633 -36084 -14551 34652
20840 34652 31170 3659 36090 28262 8062 -61036 -40567 -31588 -15333 5857 -30196 -67600
20828 -67600 -80746 -65192 -37682 -40482 -88831 -134922 -66331 33052 65941 123300 119373 81205
20816 81205 -3184 -67607 -27864 -23541 42525 51871 36261 33388 -2715 -54176 -11134 -13351
20804 -13351 41694 76568 58306 6533 -60104 -83183 -76067 -12257 -1992 -41049 -39686 6001
20792 6001 -55557 -59902 -31287 -10783 55341 73746 4411 -3158 17074 -9672 31641 73902
20780 73902 56580 8845 21167 25137 43855 -21817 -31921 -11848 26293 9892 595 -12902
20768a2902L2713N9761O0549l3566l6192M441k2988n2225k4281O143M0501N1592
20756G3546l1666n7282k998p764o0658j7171O4437K4874L5152M9566K201J2988
20744H5225K9219K1603J0353j01143q1760J6914R477J2468O0764l7016M963j241
20732B9826j2026P135K9425O8910K7021q6623m4566L237K6151K4952k6822j0232
20720C6388K0379o6243k6350L429J9701j43l3313j3774N3305N2412L5903J7515
20708I9209l1570k7707j262N7638L969l4258n2764o1709J9821j5054m1418l3901
20696a19006K6275J8016O4816J8161Q756m0879k003L4481P2009O0325m9532n6444
20684C4975j1246J3891L279j6946p3356j3754K6412p070K9412M390l0763O0200
$$ plain form
20768 -12902 19811 79572 140121 106555 70363 74804 51816 -409 -24690 -18547 21954 73546
20756 73546 41880 -15402 -18400 -26164 -86822 -103993 -39556 -14682 20470 70036 72237 85225
20744 85225 114444 136047 146400 45257 -36503 -19589 -10112 2356 63120 26104 31067 29826
20732 29826 17800 24935 54360 123270 150291 63668 19102 22339 48490 73442 46620 36388
20720 36388 56767 -9476 -35826 -32397 -12696 -12839 -46152 -59926 -6621 45791 81694 99209
20708 99209 67639 39932 38670 96308 100277 66019 13255 -48454 -28633 -43687 -85105 -119006
20696 -119006 -92731 -74715 -9899 8262 17018 -23861 -25864 8617 80626 140951 91419 34975
20684 34975 23729 37620 40899 23953 -49403 -63157 -36745 -43815 -14403 -10013 -40776 19424
20672A9424N1956l0365m7750k0579j2456J9613J7322j4066K534K8851J2576k687
20660B4373l130O384m3659l6187j6571J6228n953K8739N3661J044j6830O341k158
20647A2282k5536L305k2548l3778k3665J3126J7007l531L7523m7175K02J4333
20635e8455m9129L9014L1481J5546L3273l0936O04l646O701m4187k2931K2989
20623e9676Q0730L3228N6664q0432o6838K4809M2338n8140k3774M2137L5048P535
20611C3629J4276l9578j7823M941k0222K5128P4361j2423o4270J175J3823k6372
20599a3355K6936K3518k7707k5875K8944k5565j3189N8339k4970m1289l1244M4174
20587b1283N9666n871k2216m7381n2834K6904j5385K2245r387k6704M390N5026
$$ plain form
20672 19424 71380 41015 -6735 -27314 -39770 -20157 -2835 -16901 -14367 14484 27060 24373
20660 24373 21243 27627 -16032 -52219 -68790 -52562 -58515 -29776 23885 24929 8099 14440 12282
20647 12282 -13254 -9949 -32497 -66275 -89940 -76814 -59807 -63338 -25815 -72990 -72788 -58455
20635 -58455 -107584 -68570 -37089 -21543 11730 -19206 -18602 -22248 -15547 -59734 -82665 -59676
20623 -59676 21054 54282 110946 30514 -36324 -11515 30823 -27317 -51091 -8954 26094 33629
20611 33629 47905 8327 -9496 -4555 -24777 351 74712 62289 -1981 -806 13017 -13355
20599 -13355 13581 37099 9392 -16483 12461 -13104 -26293 32046 7076 -34213 -65457 -21283
20587 -21283 38383 32512 10296 -37085 -89919 -63015 -78400 -56155 -65542 -92246 -87856 -32830
20575c2830L1786j7005q715K366p572n1007L857N4720l8209J5665L580M0713p998
20562a0649O780M5074K2021l0792l4098n696N9547l9089p208N5704O326J275j3317
20549E5878j2670j5554n3044j9877o95Q3704N1537J9030m6422o7967m6714K0941
20537c1853K3592j7906l3970r692P364K1374J17399K1563l5789P815J26p655j1748
20524E0620m5290m4864j9822N3169K3342K1628j1029L2425O7649j3081K9120o3350
20512H0517k4972j1303q5422l6724L3133K7655j003l4566L0502L0276l4840j2613
20500c9360P421j7746r964M4018N2147N0407k1512R000l4245k0007k603l2846
20488a5290K2060K3067K4647j9150m0588j7181J4285J9622q112m7697l3826M3422
$$ plain form
20575 -32830 -1044 -18049 -26764 -24398 -31970 -82977 -79120 -24400 -62609 -46944 -43364 -2651 -10649
20562 -10649 -3869 41205 63226 32434 -1664 -7360 52187 13098 5890 61594 67920 69195 55878
20549 55878 43208 27654 -25390 -45267 -45962 37742 89279 108309 61887 -6080 -52794 -31853
20537 -31853 -8261 -26167 -60137 -69829 -62465 -41091 76308 97871 62082 69897 70023 62368 50620
20524 50620 5330 -39534 -59356 -6187 17155 38783 27754 60179 127828 114747 143867 80517
20512 80517 55545 44242 -41180 -77904 -44771 -17116 -18119 -52685 -22183 8093 -26747 -39360
20500 -39360 -31939 -49685 -59649 -15631 36516 86923 65411 74411 40166 20159 17556 -15290
20488 -15290 6770 29837 54484 35334 -5254 -22435 -8150 11472 3360 -44337 -78163 -34741
20476c4741J1361N8339m3638M705N2733P472q623j633o561o313L1283k8099l9595
20463c310k0455L9026M268k6173j7853M6873J8145J6011J9953n4882j6848p594
20451b839l1581K0910K9542l5396p895P2M6876J14o5476p616L1394l3893n8467
20438a14255l3192M3324J9665n2735o159N4612M7461k3524p9069k984J3416Q1075
20426e2365O4820j4595m1640L2341m1807m4803j6760j0701L642M9630N1083l1357
20414e2512L6468J2992m7344n3119l5201j2498N9594J41226J7297J3849o917o2658
20402A1177k3486P622j1342P938k44q381K1347K9066J881l2857m9260k0516l2869
20389i9924J2581K8442J1765K4436n6030m9265k484L2771K5979p853K7523k1154
$$ plain form
20476 -34741 -23380 34959 -8679 -3974 48759 56231 47608 45975 39414 33101 64384 36285 -3310
20463 -3310 -23765 15261 19529 -6644 -24497 22376 40521 56532 76485 21603 4755 -2839
20451 -2839 -34420 -13510 16032 -19364 -27259 -27187 19689 19803 -45673 -53289 -21895 -55788 -114255
20438 -114255 -147447 -104123 -84458 -137193 -143352 -88740 -41279 -64803 -143872 -146856 -133440 -52365
20426 -52365 12455 -2140 -43780 -11439 -53246 -98049 -114809 -125510 -121868 -72238 -21155 -52512
20414 -52512 -16044 -3052 -50396 -103515 -138716 -151214 -91620 49606 66903 80752 73835 11177
20402 11177 -12309 -4687 -16029 -8091 -8335 -16716 4631 33697 35578 2721 -46539 -67055 -99924
20389 -99924 -87343 -58901 -47136 -22700 -78730 -127995 -130479 -97708 -71729 -79582 -52059 -73213
20377g3213L1695J6982j1433R129k1675m9760J5563K8285K9369p719k577Q5556
20365E0202O4344j9444n7799k3777k6369j5544N4498K493j8541n276L5690j9894
20353B0583l0862k7581K2371p657o4426j7115M1878L6293Q8692L1550l1259l400
20341E9067o6778o4451j333J2705M8203J2107j9271k582l846K5976L9987n3728
20329a3944m780R055k8194o4508N8349K9819m0912l4557O224M1481J515J0188
20317c0264J9516O073K0435p5334l1776l5504K2607L9863J6627k0896J2486N8362
20305B195k4788m6529n824j0130K7463O9576k8856k4894N940O8083Q250m3332
20293b846j014Q099P5O821L8411l4516m7237O4684J5916p7883J9396K592l5140
$$ plain form
20377 -73213 -41518 -24536 -35969 -26840 -48515 -98275 -82712 -54427 -25058 -32777 -35354 50202
20365 50202 114546 95102 37303 13526 -12843 -28387 26111 28604 10063 4787 40477 20583
20353 20583 -10279 -37860 -15489 -23146 -87572 -104687 -62809 -26516 62176 93726 62467 59067
20341 59067 -7711 -72162 -73495 -60790 -12587 -480 -19751 -22333 -26179 -203 39784 -13944
20329 -13944 -18724 -9669 -37863 -102371 -44022 -14203 -55115 -89672 -83448 -41967 -40452 -30264
20317 -30264 -10748 -4675 15760 -59574 -91350 -126854 -104247 -64384 -47757 -68653 -56167 2195
20305 2195 -22593 -69122 -74946 -85076 -57613 11963 -16893 -41787 -35847 32236 40486 -2846
20293 -2846 -3860 4239 4314 11135 49546 15030 -32207 32477 48393 -29490 -10094 -7502 -42642
20280d2642k1128M7702N2693j6312m9567K7072m3309O882o7803Q621K4446L777
20268f9568k8128o894M0271k5209K0718M7167k0097J1896j1458l0048P1813N8024
20256E8487K919k6669o3862m9341R836N8366L3357L9299j3135L780n975m3066
20244C996n4278o4611M967l5721K4105O1989N3225K3980j2452m0182L9141L3696
20232C7855l7597n9256K6177J3038m7693j814L1360J74K0345J2470M1179J1343
20220D7581m9850o556k0166N162K9040J9713J273M6822L5751k9524k3460J5178
20208G0964m8697k2754l7908p134k1166O459K7883l921k1503k6859L9562L1993
20196a3081n5435p0879p946O3436L4634o270j1739J5172J3105P334k2092m7236
$$ plain form
20280 -42642 -63770 -16068 36625 20313 -29254 -2182 -45491 -38609 -106412 -97791 -73345 -69568
20268 -69568 -97696 -104590 -64319 -89528 -68810 -21643 -41740 -29844 -41302 -71350 463 58487
20256 58487 61406 34737 -29125 -78466 -68630 -10264 23093 62392 49257 53037 47062 3996
20244 3996 -50282 -114893 -109926 -145647 -121542 -59553 -6328 17652 5200 -34982 4159 37855
20232 37855 258 -58998 -32821 -19783 -67476 -69290 -37930 -37756 -17411 -4941 36238 47581
20220 47581 -2269 -8825 -28991 -23829 5211 24924 26197 73019 108770 79246 55786 70964
20208 70964 22267 -487 -38395 -45529 -66695 -60236 -32353 -36274 -57777 -84636 -45074 -13081
20196 -13081 -68516 -139395 -147341 -83905 -49271 -55541 -67280 -52108 -39003 -31669 -53761 -100997
20184a00997J6428O0651L4696p645j0179k4076j8310N533L6095J972O252J1947
20172A2367K0440m0424n3305L2867J2593k041j0968m2684Q8939n1572l9481J0932
20160f2337K2941J0582J5642k172l4460K1260K7286m1671k9235K4456M2176L3718
20148B8186M977l8078n8595j8311L6508j6306j1056n522P549J7900M2395J6937
20136F584N4800P26l8771k4177q0216o0872N9808Q5484q067k9337O448l5929N291
20123e8228K0327k9655m8134O4726P0621P361q329l8491p652l8991l3471l820
20111a03736K5307O4394M6286J8703k041k5253n0646j5359J0268j3479k3326L4403
20099c4479O2074j6573o2636j4521Q772Q3842K8503k0367o00O62M0088l6619n9938
$$ plain form
20184 -100997 -84569 -23918 10778 3133 -7046 -31122 -49432 -43899 -7804 -5832 420 12367
20172 12367 32807 -7617 -60922 -28055 -15462 -17503 -28471 -71155 17784 -33788 -73269 -62337
20160 -62337 -39396 -28814 -13172 -15344 -49804 -28544 -1258 -42929 -72164 -47708 -5532 28186
20148 28186 33163 -4915 -63510 -81821 -45313 -61619 -72675 -78197 -70648 -52748 -10353 6584
20136 6584 61384 62110 23339 -838 -81054 -141926 -82118 3366 -4701 -34038 -27590 -63519 -58228
20123 -58228 -37901 -67556 -115690 -50964 19657 27018 18689 -19802 -27454 -66445 -99916 -103736
20111 -103736 -78429 -14035 32251 50954 48913 23660 -26986 -42345 -32077 -45556 -68882 -34479
20099 -34479 27595 11022 -51614 -66135 -57363 26479 54982 34615 34015 34677 74765 38146 -21792
20086b1792L359m731K5590l2419j2915P902J6665J7673M2233J098K4051K5788
20074I2502r507O711L2557n0316p1338j7977j3207m6986k7320J228J3992K3711
20062f5950m9O568j3058J5507K3999l4277l0098P2839M4407K8079K7880n0598
20050B5249j9154K1425K3385l8749j1516L2557l904m6545j7819J2723j0926M4462
20038A1188j8316p6416k8056M0315N5957L2616l5405J6199N0531q030J5144m7729
20026G998j8736r2251l9386J3228R578M3312N1349O639r293k8015L0782J3764
20014a1031J5589K7923j3900r2308m3164K8984L9090K9963L0306J1712n4871j3034
20002d4741L7428N8112J6494n1314k1668M2027n109n8021j5080O230M7988N3614
$$ plain form
20086 -21792 -18433 -23164 2426 -29993 -42908 -35006 -18341 -668 41565 42663 66714 92502
20074 92502 82995 89706 122263 71947 609 -17368 -30575 -77561 -104881 -103653 -89661 -65950
20062 -65950 -65999 -59431 -72489 -56982 -32983 -67260 -97358 -24519 19888 47967 75847 25249
20050 25249 6095 27520 50905 12156 640 33197 29293 -17252 -35071 -22348 -33274 11188
20038 11188 -7128 -83544 -111600 -71285 -15328 17288 -18117 -1918 48613 40583 55727 7998
20026 7998 -10738 -102989 -142375 -129147 -119569 -76257 -24908 -18269 -27562 -55577 -24795 -11031
20014 -11031 4558 32481 18581 -73727 -116891 -87907 -48817 -18854 11452 23164 -31707 -44741
20002 -44741 -7313 50799 67293 15979 -5689 36338 31229 -26792 -41872 -35642 12346 65960
19990F5960N3955K3370r1070l1928k6125r130N5982J1826M510N1844l1465n8644
19978A9085l1227L2588K1507N518K244q7123o1030N9484P3483K5654l3371k8471
19966a659k6856j0902o578J1773l4026P3968P6603k2636m9825j1682K650K2716
19954B3546j7581J0386L9205M4233j7733m4748L5531J256J2457J2889l4229p476
19942E7736q230K0340k6541O48j7679M5850j065n1935j3602L0229P254O302L3532
19929H2839r219k417l2516R054L9000n7042k9397K865M3626M6720N6077k2928
19917A26662n7860l5561k0061l1737J0521M8090M572n9957n76M1362k8730L3167
19905B9892m1220K9928j354n2081k5160O5723N952k0268j4886R2227M1980R805
$$ plain form
19990 65960 119915 143285 52215 20287 -5838 -14968 41014 52840 57350 109194 77729 19085
19978 19085 -12142 20446 41953 47471 49715 -37408 -98438 -38954 34529 60183 26812 -1659
19966 -1659 -28515 -39417 -45995 -34222 -68248 5720 82323 59687 9862 -1820 830 23546
19954 23546 5965 16351 55556 99789 82056 37308 72839 74095 86552 99441 65212 57736
19942 57736 49506 69846 43305 43953 26274 72124 71059 19124 5522 35751 43005 49307 82839
19929 82839 73620 71203 38687 47741 86741 29699 302 3167 46793 93513 149590 126662
19917 126662 68802 33241 13180 -18557 -8036 40054 44626 -15331 -15907 25455 -3275 29892
19905 29892 -11328 18600 17246 -34835 -59995 5728 11680 -8588 -23474 68753 110733 120538
19893A20538m5592j02617N8451K7140l4792j0650K2490n6842M1925J5592J1799
19882D7442m4067r080j2478j4470L0553K4893j0252j6582n3666k3173K2480L7889
19870b0511K1792K6618K8664m9176l5580K759p511M572J6076o1168m7563R3540
19858b7488N5889q405j4364L137k9489J1700L8368R163j2149j5252R638M5155
19846F5903M2063k9949j1712O2854m0383j035j0878j7991j2482J1372l3603Q575
19834C2734J561l0429K7611r915p129n8483n974M3506L295K8689L7592L5680m135
19821I4603p368J8262k5111L9389L3169l7725p9977P738j6772j9357L0987M672
19809D2510K5101Q415q3698m0249L6348M2628l1615p1108j0582M7564j1716L3464
$$ plain form
19893 120538 74946 -27671 30780 57920 23128 12478 34968 -21874 20051 35643 47442
19882 47442 3375 -5705 -18183 -32653 -2100 22793 12541 -4041 -57707 -80880 -58400 -20511
19870 -20511 1281 27899 56563 7387 -28193 -25434 -32945 -28373 -12297 -73465 -121028 -27488
19858 -27488 28401 19996 5632 8769 -20720 -9020 29348 38511 26362 11110 20748 65903
19846 65903 107966 78017 66305 129159 88776 87741 76863 58872 46390 57762 24159 32734
19834 32734 34295 3866 31477 21562 14433 -44050 -50024 -6518 -3223 25466 63058 98738 94603
19821 94603 87235 105497 80386 119775 152944 115219 35242 42980 26208 6851 37838 42510
19809 42510 67611 76026 -7672 -47921 -11573 31055 -560 -71668 -82250 -34686 -46402 -12938
19797a2938L7187J2469J7025l595m8958m0299n1601N7131k6737o272L5018P0064
19785C8494J1242j6777M8442k5271q884M0755r044n597J229j0405j0356l284K1997
19772G2541l7741l4715n2464k9133P743O6543M725J6599k6482p2760O81P3318
19760a1145L7186M6696Q728p1056n4240K3111P385P6266M0621k3590j1955K0299
19748H8306N0235j8858j27561m9282L3419N5258P037p0747n4320N2046L8411N8609
19736F2553J39k1700j5279p949m024n681k7550l2366l7128N9614L4772j2093l0165
19723c6857Q074K5165N6383l1797l6496K203l0163q477k1658J9083N6723r617
19711g434j395L2138j4461r355k9124L8703M9838j1994j0948L9582N7800m4000
$$ plain form
19797 -12938 24249 36718 53743 50148 1190 -39109 -90710 -33579 -60316 -66588 -31570 38494
19785 38494 49736 32959 81401 56130 47246 88001 78957 73360 74589 64184 53828 50544 72541
19772 72541 34800 85 -52379 -81512 -73769 -7226 -2501 14098 -12384 -85144 -84463 -11145
19760 -11145 26041 72737 81465 10409 -43831 -20720 -13335 62931 103552 79962 68007 88306
19748 88306 138541 119683 -7878 -57160 -23741 31517 38554 -32193 -86513 -34467 3944 62553
19736 62553 62692 40992 25713 17764 13740 8059 -19491 -51857 -88985 -29371 5401 -6692 -36857
19723 -36857 -28783 -3618 52765 20968 -15528 -13325 -43488 -51965 -73623 -54540 2183 -7434
19711 -7434 -8829 23309 8848 -507 -29631 9072 58910 46916 35968 75550 133350 89350
19699H9350k0767j303m028q2817j4671k7134P566M9257k5168J3281M380O3355
19687E1301j0651j5196k4548k5703k9388j9142K5956N4386J2382K5168M4149Q285
19675I6999k9903k8801n2919j7161J428o7316K4570P462n226O7349N4399K3578
19663G4459K4573l6295n7197k7699J470O2651p647J0328m413k73r258k985r759
19650A7955n4246l548J1565P311p088o5400K0132P3877j1888L1489n4556l0741
19638f5138L4060J0201j7431J0415m0618j0487K871j4232K8009O3252J4094l3731
19626a8735M5448J5356k4524m0023N7144O1551j4433o3469l0549r331j8594L2299
19614g860o449m1957J2680J6339m1963l7963K5508O4139J8276K4444j9975R779
$$ plain form
19699 89350 68583 67280 63252 -19565 -34236 -61370 -53804 -4547 -29715 -16434 -12054 51301
19687 51301 40650 25454 906 -24797 -54185 -73327 -47371 7015 19397 44565 88714 96999
19675 96999 67096 38295 -14624 -31785 -30357 -97673 -73103 -65641 -70867 -3518 50881 74459
19663 74459 99032 62737 5540 -22159 -20689 41962 34315 44643 40230 39957 30699 27714 17955
19650 17955 -36291 -39839 -28274 -20963 -28051 -93451 -73319 558 -11330 20159 -34397 -65138
19638 -65138 -31078 -20877 -38308 -27893 -68511 -78998 -76127 -90359 -62350 902 14996 -18735
19626 -18735 26713 42069 17545 -22478 34666 96217 81784 18315 -12234 -21565 -40159 -7860
19614 -7860 -14309 -56266 -43586 -27247 -69210 -107173 -81665 -17526 750 25194 5219 14998
19602A4998O4263J1954r4804l1342M5603K2369n7029l1283j2181K9356R779Q820
19590a9497j386j7140K9374l1681L4795K8713r079L519R208K5139l2868k6348
19578g251k0147K9157K4877j5861r6258l7342J7995R904Q79l8510L3057M5040
19566e4460K9449j0623R205L692M3718k6589L9164J1460l1886l839N3037j6897
19554D5431j3517L0176m1681m2045J0451L5339K3900l837o1062k1769k2017L2864
19542b7767L7547l953n826l3863j231N9276L5591K9867P7112q994q3566r2603
19530a8410m3136j8953m4391O4711K1314M8090Q1970J5552l4978j6079p528l8239
19518I923m3673N139j2013j8860N4566J8232k6757l194p876r223P234J4831m2248
$$ plain form
19602 14998 79261 91215 -3589 -34931 10672 33041 -23988 -55271 -67452 -38096 -28317 -19497
19590 -19497 -20883 -38023 -8649 -40330 -5535 23178 14099 17618 26826 51965 19097 -7251
19578 -7251 -27398 1759 26636 10775 -85483 -122825 -104830 -94926 -94047 -132557 -99500 -54460
19566 -54460 -25011 -35634 -26429 -22737 20981 -5608 33556 45016 13130 9291 62328 45431
19554 45431 31914 62090 20409 -21636 -11185 24154 48054 44217 -16845 -38614 -60631 -27767
19542 -27767 9780 5827 1 -33862 -35093 24183 59774 89641 166753 157759 74193 -18410
19530 -18410 -61546 -80499 -124890 -60179 -38865 9225 91195 106747 71769 55690 48162 9923
19518 9923 -33750 -28611 -40624 -59484 -4918 13314 -13443 -16637 -24513 -33736 -26502 -11671 -53919
19505e3919n8214J3927N8919j3762n7684J264L9703m0506Q074K8176L000k9571
19493a00593j4612O1010L8137k1818m3815J0769J845L1146M9323J1706J0337l6251
19481b816k9609Q468K820L4897q383k637L5117R836n7460n804m3683j8884N0949
19468b7189M4072j1851j118o1478K7149K6580M3942L8568j1622n5592j3909j0451
19456a2899m7037M5220J3569j3765M3683L4329j2985k1754m1272k3028M2528k0147
19444a3558O680J1517O456r254K313l819M3170O117k4230L1126K9807J1719l2245
19431F5799m2138L5161N152o9771n8804N1661J7267r235K0443j247l3292n5008
19419g4012J4753P3632M530L0998j0906k9362o0842j4041o684J2527N9664O3605
$$ plain form
19505 -53919 -112133 -98206 -39287 -53049 -110733 -109469 -69766 -110272 -102198 -74022 -71022 -100593
19493 -100593 -115205 -54195 -16058 -37876 -81691 -70922 -69077 -37931 11392 23098 33435 -2816
19481 -2816 -32425 -23957 -21137 13760 5377 2740 37857 47693 -9767 -15571 -59254 -78138 -27189
19468 -27189 16883 5032 3914 -57564 -30415 -3835 40107 78675 67053 11461 -2448 -12899
19456 -12899 -59936 -14716 -1147 -14912 28771 63100 50115 28361 -12911 -35939 6589 -13558
19444 -13558 -6878 4639 11095 1841 4154 335 43505 49622 25392 56518 86325 98044 65799
19431 65799 23661 58822 63974 -5797 -64601 -12940 4327 -4908 15535 14288 -19004 -74012
19419 -74012 -59259 14373 18903 49901 38995 9633 -51209 -65250 -71934 -59407 257 63862
19407F3862l3216n3399N2805j7892N067L3841J5700l3198q5812m861J05978M2484
19395I1359k9842p081O934K8795j6321m7539n1270n8251N1535N2605L2869o207
19383D7586L304n4680l8697k971N365m1141P683N5194L0140K8467K0598k2630
19371C8218J2039M2774p3795m6599K3428Q475n3902N1j0387k9525j49L5817O3042
19358I487J0630o673o704n873O174l631L1858j2776K5289M6281l0968j1324n2475
19345g05j2414m6948k5859K3767j4833O103MM5264j3488O287M3482K7321M9816
19332H7797K298m8314j4754K5795P871J608k2450K7783O140J2137k8481l5057
19320B2373L1707q848p35Q286r046P985j1241N132M492k3420q649J3102j8289
$$ plain form
19407 63862 30646 -22753 30052 12160 17227 51068 66768 33570 -52242 -57103 48875 91359
19395 91359 61517 54436 61370 90165 73844 26305 -24965 -83216 -31681 20924 53793 47586
19383 47586 50890 -3790 -42487 -45458 -40093 -81234 -73551 -18357 11783 40250 60848 38218
19371 38218 50257 93031 19236 -27363 -3935 4540 -49362 -49311 -59698 -89223 -89372 -53555 9487
19358 9487 20117 13444 6740 867 7041 3410 35268 22492 47781 94062 63094 51770 -705
19345 -705 -13119 -60067 -85926 -62159 -76992 -70889 -70885 -25621 -39109 -32822 10660 37981 87797
19332 87797 90095 41781 27027 52822 60693 62301 39851 67634 73774 85911 57430 22373
19320 22373 54080 45232 44497 52783 43737 51722 40481 45613 50105 26685 18036 31138 12849
19307A2849m2528m6381K932L1893N564P2176K9296j8323l3378J0110j8575J3900
19295A9535M9716m959l64n5345M041M6485L4123J2024J1251k497l3500m0738k7487
19282A2285j4756L097j6942K8490K7258l3021j7419J2848J6889k9667K2210J7835
19270B9107n832l0276J7939J6966J8802l7032l4336K5727J5891J0311k5379k8784
19258b6896k1249J6474K6545m7764j241N4164P1596m1245m2242k8373o229J3617
19246c2843Q1514O388l2006p7891j7114k1211L032J7962K0817O58L3407R6608
19234G9321R967j008n391j260j5080j2144J082l831n9920J3172M3314k7889n3731
19221c3398m613k6874M5197Q7034N242l2952J2181k0558n5473j794j4606K6049
$$ plain form
19307 12849 -29679 -76060 -73128 -41235 -35671 36505 65801 47478 14100 24210 5635 19535
19295 19535 69251 64292 63928 8583 12624 59109 93232 105256 116507 114010 80510 39772 12285
19282 12285 -2471 626 -16316 12174 39432 6411 -11008 1840 18729 -10938 11272 29107
19270 29107 23275 -7001 10938 27904 46706 9674 -24662 1065 16956 27267 1888 -26896
19258 -26896 -48145 -31671 -5126 -52890 -54131 33 71629 30384 -11858 -40231 -46460 -32843
19246 -32843 48671 55059 23053 -54838 -71952 -93163 -90131 -72169 -51352 -50694 -17287 79321
19234 79321 89288 88280 82889 81629 66549 54405 55487 51656 -8264 4908 48222 20333 -33398
19221 -33398 -38011 -64885 -19688 67346 72588 39636 51817 31259 -24214 -26008 -40614 -14565
19209a4565Q5632j7873l6770L0049l585N300M0605J9883m2123k9000J5170o097
19197D6626J1506N756l8750m3059m7340J2333K4302K3450K1373k8844m9678K3500
19185c8825o321j493M631k6390P2390J2817n9122P2887l445j4125k1181m1944
19173e0121j8005M2585j5502N7737O7550m1785l7110J9509N3509K232j5615o6755
19161a771l4261k0345P340N9263R682M6012N25j7297k4888j9258j5158N3191K7313
19148G0348N893J1594n3998k4158N8218K1443J0151K79r810p0634k8814J367j7794
19135b5915J67P126M6570L5655m2206j0033O5977k3798n8734j8831M6115j7819
19123D274K8598O4226J2573L4004K7561N328j8912q4603J9601o0489n2224M6482
$$ plain form
19209 -14565 71067 53194 16424 46473 42888 48188 88793 108676 66553 37553 52723 46626
19197 46626 58132 63888 25138 -17921 -65261 -52928 -28626 -5176 16197 -12647 -62325 -38825
19185 -38825 -45146 -46639 -42008 -68398 3992 16809 -42313 30574 27129 13004 -8177 -50121
19173 -50121 -68126 -25541 -41043 16694 84244 42459 5349 24858 78367 80599 64984 -1771
19161 -1771 -36032 -56377 -49037 10226 19908 65920 66445 49148 24260 5002 -10156 43035 70348
19148 70348 76241 87835 33837 9679 67897 89340 99491 99770 89960 19326 -9488 -8121 -25915
19135 -25915 -25748 -18622 27948 63603 21397 11364 77341 53543 -5191 -24022 22093 4274
19123 4274 32872 97098 109671 143675 171236 176564 157652 73049 92650 32161 -20063 26419
19111B6419l7005K066J5795M0770J4492j9019l9676m0551L0744j9933l1722m0766
19099i8386l7789M1054J4545P374J0493N585P426O0263L6017K1109l3581j5191
19087A8919J4039o288K9367m3381K0431N1459k145k0384J8022L3008m1225p4654
19075b832K5249Q7101M1898j9408l5084n1939k0499m453j8678j2195J03253j1716
19063H0697p1694l4130j6449k7752K9734K8268O6251Q573l6631K5425J051m3767
19051I576k5255J7785R907K8287K4392K7851k7397J4128n365o9469n8101j710
19039e5371L5904K0926k4484l96J7335O9166L7870l7305j8781L953m1615m6756
19027c9554P38J7728L7556O704o8253k260M785N2333M7916j3885j9985j0804J7627
$$ plain form
19111 26419 -10586 -8520 7275 48045 62537 43518 3842 -36709 -5965 -25898 -57620 -98386
19099 -98386 -136175 -95121 -80576 -73202 -62709 -57124 -49698 10565 46582 67691 34110 18919
19087 18919 32958 26670 56037 12656 33087 84546 82401 62017 80039 113047 71822 -2832
19075 -2832 22417 109518 151416 132008 96924 44985 24486 20033 1355 -10840 92413 80697
19063 80697 9003 -25127 -41576 -69328 -39594 -11326 54925 63498 26867 52292 53343 9576
19051 9576 -15679 2106 12013 40300 64692 92543 65146 79274 73909 4440 -53661 -55371
19039 -55371 -19467 1459 -23025 -23421 -6086 63080 100950 63645 44864 48817 7202 -39554
19027 -39554 -38816 -21088 16468 23172 -45081 -47341 -42556 9777 57693 43808 23823 13019 30646
19014C0646K6865J0346J1723l3498j8650l6215l719M1229M9010k040j4628k2822
19002C8247m948N1837K6331N4333l9574r172m959p8041k2681l37M9269L4360k4520
18989G0145P643l1395K0364J530k5414m9646r9315m0264P3787K5061j1436m805
18977f3745L719K2442M8622J7504o5499M0578J05164O913M922k728j3713l4173
18965G0006n9026K7309P5458j595k2261j9119K91j5626m8402L247m772l0225l3196
18952e7911R6750O5675K7109j2986l0146p0413l4443N7157L1652k7652l9067j2758
18940g033j3873m0949K6132R288M2685K4133L2701k1149k789l596j0618j8389
18928A6543L3135N528m4855m117M0222j6241J7020J6625m6525q060j9588m9895
$$ plain form
19014 30646 57511 67857 79580 46082 27432 -8783 -12502 28727 77737 75697 61069 38247
19002 38247 33299 85136 111467 165800 126226 117054 112095 34054 11373 11036 60305 94665 70145
18989 70145 77788 46393 66757 68287 42873 -6773 -106088 -146352 -72565 -47504 -58940 -63745
18977 -63745 -60026 -37584 11038 28542 -36957 3621 108785 115698 120620 117892 104179 70006
18965 70006 10980 38289 113747 112152 89891 70772 71063 55437 7035 10282 5510 -24715 -57911
18952 -57911 38839 104514 131623 118637 88491 18078 -16365 40792 72444 44792 5725 -7033
18940 -7033 -20906 -61855 -35723 -26435 16250 40383 73084 51935 49146 45550 34932 16543
18928 16543 49678 55206 10351 6234 46456 30215 47235 63860 17335 9275 -10313 -60208
18916f0208K2783N6427K079p346M2475j3935M9498k5324j7046J8994R491Q896
18904H6784j7228r2544o5589k7991j605O4552j3573O2526M2660Q809k701O629
18892E0729m2007j9301K105P802l2225l1716R810N3194M8469j0981m4289l0112
18880c8522j7868N3491J7993K0796k4122m8207N751R2047M5278l336J5229k5669
18868I2861o4349r120L9328K4214N032j2144j867j0511k7796o5128j0322Q343
18856c1459j4378l8599N4619M683l1044J7446N0319M7692j5115n713J5318k8590
18844B5179m0067j1094J172L2236m058K0558l560O8429K8600n2187l216m2938
18832A9054j5595Q678n322k884r527K1131k4752n1311j8892R1647L4523J1587
$$ plain form
18916 -60208 -37425 19002 21081 13735 56210 42275 91773 66449 49403 68397 77888 86784
18904 86784 69556 -22988 -88577 -116568 -118173 -53621 -67194 -4668 37992 46801 44100 50729
18892 50729 8722 -10579 -8474 -672 -32897 -64613 -54803 -1609 46860 35879 -8410 -38522
18880 -38522 -56390 -2899 15094 35890 11768 -36439 -30688 61359 106637 103301 118530 92861
18868 92861 28512 19392 58720 82934 87966 75822 73955 63444 35648 -29480 -39802 -31459
18856 -31459 -45837 -84436 -29817 -25134 -56178 -38732 11587 59279 44164 38451 53769 25179
18844 25179 -14888 -25982 -24810 7426 3368 23926 20366 88795 117395 65208 61992 19054
18832 19054 3459 12137 6815 3931 -5596 15535 -9217 -60528 -79420 12227 46750 58337
18820E8337K9412M1535j4580k5597k5486K0472P3914k7337p2270j41l7694r853
18808A0712j640J3894L0900p598L0917m31P372m5148m1396m839l742J2736J2930
18795A4667L4105L777j0620K2427M0439k1519j7311K5725j2485K0088M5545j2371
18783A32467p4205j2671r812M294K5984L9686o649m6629m2395K9965O0207K7150
18771A27392N5719K6440J13814J17856J30322J52564q4362k02538j88665j24068
18761A24474l2549k5513m139J8928L6520P0775q297j1580K0089K3531n7012m9371
18749A05856K2546M2323P953L9038m3043m5725m0279m2656L7353M3358J6681m5938
18737I7467k8040j4977k8231J1471p973l3m2347N699K2180L9396Q870m3248L3615
$$ plain form
18820 58337 87749 129284 114704 89107 63621 84093 158007 130670 58400 58259 20565 10712
18808 10712 9072 22966 53866 46268 77185 76754 84126 38978 -2418 -7257 -10999 1737 14667
18795 14667 48772 52549 41929 64356 104795 83276 65965 91690 79205 99293 144838 132467
18783 132467 58262 45591 35779 40073 66057 105743 99094 52465 10070 40035 100242 127392
18771 127392 183111 209551 323365 441221 571543 724107 639745 437207 248542 124474
18761 124474 91925 66412 62273 81201 117721 188496 180199 168619 188708 212239 155227 105856
18749 105856 128402 170725 178678 217716 174673 128948 88669 46013 83366 126724 143405 97467
18737 97467 69427 54450 26219 37690 29717 29684 -12663 -6964 15216 54612 63482 20234 53849
18724E3849K9312k2957O5535M6856q9993p1617N8264J4832k1070k050j9108j1431
18712C0422j5746L514m0304N4785K1531p8788o3382K0162M8727N6516J2749K5980
18700G6166Q8980j4509o0720m4679j6862m9282L9057K0734L221Q151n2644K7026
18688B4639O227M4852L0675K7334j7216q162l4929K514L0598k7704k8575m2711
18676G542M697m456K6958k715j1554Q364m4710N7576N6935l5672J2598o826O6482
18663A35219J4692j9399j6525M6587K8212k1313l6777l5184n818l0235j0000q384
18651D1075J5360M3796P544J6436L5596j5173k1814r334J3684m3676k8444L1921
18639H6971K0076m4160k7139K8666J4714q001n211K2229l8124k8298J09277R272
$$ plain form
18724 53849 83161 60204 125739 172595 82602 10985 69249 84081 63011 60961 41853 30422
18712 30422 14676 18190 -22114 32671 54202 -24586 -87968 -67806 -19079 37437 50186 76166
18700 76166 165146 150637 89917 45238 28376 -20906 18151 38885 42106 50257 -2387 24639
18688 24639 30866 75718 106393 133727 116511 108349 73420 75934 106532 78828 50253 7542
18676 7542 12239 7783 34741 32026 20472 28836 -15874 41702 98637 62965 75563 68737 135219
18663 135219 149911 130512 113987 160574 188786 167473 130696 95512 89694 59459 49459 41075
18651 41075 56435 100231 107775 124211 159807 144634 122820 113486 127170 83494 55050 86971
18639 86971 107047 62887 35748 64414 79128 71127 65916 88145 50021 21723 131000 140272
18627A40272k8741k333l0627p208K861k5427k0375l672k4868l1382L8510R402
18615A6412j9942m0738L3133Q9793K893n4946l592R778M5473O2767k76n4394n3855
18602C2506o7036j4246O9346j044j1576P4602M1565L537r943L2202M4176l1047
18590A63042k1491k693p0208k5336m0816j180j3334l1985M0482R1830o2542m2839
18578a7070J5770K5036R462L3183j058K6827P3305k5715o3054M8668j1009o0931
18566E3414K4428J02355K4039k5792l7523p6384N5762O8461j1375l7098r184O449
18554A37552k7317P159M3L3624P977p892J2779J0876j1137k1284l0851q536L7831
18541A40824m6023K0535J0009j1022J8210J0218n8385n8898o8665l7381O5298
$$ plain form
18627 140272 111531 109198 78571 71363 74224 48797 28422 24750 -118 -31500 7010 16412
18615 16412 -3530 -44268 -11135 78658 81551 26605 23013 32791 78264 141031 140755 86361 32506
18602 32506 -34530 -48776 20570 19526 7950 82552 124117 127654 117711 149913 194089 163042
18590 163042 141551 138858 68650 43314 2498 1318 -12016 -44001 -3519 88311 25769 -17070
18578 -17070 -1300 23736 33198 66381 65323 92150 165455 139740 76686 125354 114345 53414
18566 53414 77842 180197 204236 178444 140921 64537 120299 188760 177385 140287 131103 137552
18554 137552 110235 117394 117437 151061 159038 151146 163925 174801 163664 142380 111529 102993 140824
18541 140824 94801 115336 125345 114323 132533 142751 84366 25468 -43197 -80578 -15280
18530a5280L5108J7970m7503J9474K1404J4103J0710k1100l0989k7920N0146K0695
18518D6818M8180M1150R345l0793q570K4194k2479l5173j6855j2327L1791N3380
18506A28661m0173J0398M0181J935J0280J6633j4547o479O513L7308j1185p6887
18494A02638q1767m0538j0230J07166O6565m592m4909l3954L3447J8307l8369
18483G3764M169o642J0283j3078L612N4685J3007L1871j6328o9494m6264n9950
18471b0365r994J1010p131j5139J11080N1943n5540M4193N0273q613j7227k0170
18459A14320N1994r507m6929j4972L2382N7302p521l6850j3592N58j1815L332
18447A18702K9621N302k9089o8556r767J4469j3812M6141O8896k033p4974m1550
$$ plain form
18530 -15280 19828 37798 -9705 9769 31173 45276 55986 34886 3897 -24023 26123 46818
18518 46818 94998 136148 145493 114700 106130 130324 107845 72672 55817 43490 75281 128661
18506 128661 88488 98886 139067 141002 151282 167915 153368 146889 153402 190710 179525 102638
18494 102638 20871 -19667 -29897 77269 143834 139242 94333 60379 93826 112133 73764
18483 73764 77933 71291 81574 68496 72108 126793 139800 171671 155343 85849 39585 -20365
18471 -20365 -30359 -19349 -26480 -41619 69461 121404 65864 110057 160330 151717 134490 114320
18459 114320 166314 156807 109878 94906 127288 184590 177069 140219 126627 127185 115370 118702
18447 118702 148323 153625 124536 55980 46213 60682 46870 93011 161907 159874 84900 43350
18435D3350M1483M0807j8779K2551q488l7639K0532l1910L02J6560N0793J0516
18423A50078K4825J7494J476J8733k8977K6734j9499J3317k5271q0285j4838O248
18411I0035j9006P047k771q558J3111N0115P096K308Q0293K8675k0112K3787k4977
18398B27043n0617p5313l5184K4239K7056J8953K2497j318P173k0068K5026k0795
18386A48692j0429M2762L7655N690l1118l4937l2353K3732N0448J6465m9675p1651
18374I5281L2379K3711l0481r356L3071P0110k6470o189K5091M1062k816j5558
18362B29835M9896L8591k7611R739m4655p7869J5403J865l4927k6912K743j3105
18350A22993j5975L4084r952R248M2233K8508R143q1563p198L9503J7927P1150
$$ plain form
18435 43350 84833 125640 106861 129412 120924 83285 103817 71907 72209 88769 139562 150078
18423 150078 174903 192397 193873 212606 183629 210363 190864 204181 178910 98625 83787 90035
18411 90035 71029 78076 75305 66747 79858 129973 137069 139377 219670 248345 228233 252020 227043
18398 227043 176426 101113 65929 90168 117224 136177 158674 157356 164529 144461 169487 148692
18386 148692 138263 181025 218680 224370 193252 158315 125962 149694 200142 216607 166932 95281
18374 95281 127660 151371 120890 111534 144605 214715 188245 182056 207147 248209 245393 229835
18362 229835 279731 318322 290711 300450 255795 177926 193329 195194 160267 133355 136098 122993
18350 122993 107018 141102 131150 140398 182631 211139 220282 138719 131521 171024 188951 260101
18338B60101O620m0183k5898K3778n321l0321l4713k2309L7633J8895J1516l2926
18326A66872k7224J0936K1484J8790l580m3447J3445L3599L5128o7029K9833N5648
18314B44455N309M187q888k7242n8853j5368l2951j2939j9106J0240L1585K0316
18302A40745K5359K7724J3888k9818k7452q33m2173j5082K2291j2994K5694J6160
18290A43509M0508j8765m6149N0139M5419O4932K7923L9924j4638j5458n286j3044
18278B99014J7164J1257K3553N190n5813j4697j240M0869j4443n2389m20K3317
18266B81362L824k4084n5466K7255L8105l8915m4548K6574J8935J6533N8426K9339
18254C37340P84J10996P5794K3121J08117P2349j8077n2943M0576O532p7669q3568
$$ plain form
18338 260101 266721 226538 200640 224418 219097 188776 154063 131754 169387 188282 199798 166872
18326 166872 139648 150584 172068 190858 187278 143831 157276 190875 226003 158974 188807 244455
18314 244455 249764 253951 245063 217821 158968 143600 110649 97710 78604 88844 120429 140745
18302 140745 166104 193828 207716 177898 150446 149613 107440 92358 114649 101655 127349 143509
18290 143509 184017 165252 119103 169242 214661 279593 307516 347440 332802 317344 312058 299014
18278 299014 316178 327435 350988 356178 300365 285668 284428 325297 310854 258465 258045 281362
18266 281362 285186 261102 205636 232891 270996 232081 187533 214107 233042 249575 308001 337340
18254 337340 338124 449120 524914 548035 656152 728501 710424 657481 698057 704589 626920 543352
18242E43352K216m7832q9311m0129j6921M0907J04617P729J6829j6546N4308J3164
18230E72383k69o440M1888M7689m974o5739J6484K117L9582J01139O8627r0301
18218G22186j10814l2989r5096j8889P2319J4186q3619p6496n8769M4244K0735
18207C96998N4517M1100Q2472N0660N7990K4922m5616r1024l7305k5827n2415
18196D56472Q247K7664Q2877J57616P3202Q4500p591r9852j2294L0072J8033j7482
18184H01464r7606j33837n0904k0527j5580o242J9166k994K2790M0859K6517n7078
18172E26028M9336K4117K5428O9320J00395K4376j6266o522m1310r2849l1136
18161F30917m9189K0867J34672L839r6880q2177l3775K8259J0671J7215J2502
$$ plain form
18242 543352 545568 497736 408425 368296 351375 392282 496899 504628 521457 504911 559219 572383
18230 572383 572114 565674 607562 655251 650277 584538 601022 603139 642721 743860 812487 722186
18218 722186 611372 578383 483287 464398 536717 550903 467284 390788 332019 376263 396998
18207 396998 451515 492615 575087 625747 683737 708659 663043 572019 534714 508887 456472
18196 456472 464719 492383 575260 732876 806078 890578 882987 783135 770841 800913 818946 801464
18184 801464 703858 570021 519117 498590 483010 476768 495934 492940 515730 556589 583106 526028
18172 526028 575364 599481 624909 694229 794624 819000 802734 796212 754902 662053 630917
18161 630917 581728 602595 737267 741106 644226 562049 528274 556533 567204 584419 596921
18150E96921N7382K4267l2240J0358R7701O5331P6468J13221J01396N4692l4511
18139A130986m2703j8185Q484R0774O1635M0083Q27J5211J6346L1399Q2292J02585
18127A519734Q9067N0091J24951P9308K06472K74938K70527L34021M77643O96835
18117D123587J025717J417042J962902K831063M399515P336555J2532715K0747393
18109E6376489L3099556L3460467p201277l7904736l1758615j6526190q562058
18102B0983636m927050l095553k021203j397110j046569p44388m55261k89250
18094G007252l08144m44514m66462n52347n83715n69812m83130l56377k80918
18085B961833j75481p3724r4895j15354q7896r2678j04404q7186n0596q2543j05063
$$ plain form
18150 596921 654303 678570 646330 656688 754389 819720 896188 1009409 1110805 1165497 1130986
18139 1130986 1088283 1070098 1078582 1169356 1230991 1271074 1271901 1287112 1303458 1334857 1417149 1519734
18127 1519734 1608801 1658892 1783843 1863151 2069623 2344561 2615088 2949109 3426752 4123587
18117 4123587 5149304 6566346 8529248 11360311 15759826 23096381 35629096 56376489
18109 56376489 89476045 122936512 115735235 77830499 46071884 29545694 20983636
18102 20983636 16056586 12961033 10939830 9542720 8496151 7751763 7296502 7007252
18094 7007252 6699108 6254594 5788132 5235785 4652070 4082258 3599128 3242751 2961833
18085 2961833 2786352 2712628 2617733 2502379 2414483 2321805 2217401 2130215 2079619 1997076 1892013
18074A892013n8003l4929k444N9651O1835O1152J4153O659J4686j2546q2953p5774
18062A843500M903O6380J32738R2423j1387k27336k37100j43743j07012j03187
18052A310179j28316r3399q0260j02664n0250k9296r107k1732p1157p8359n5308
18041E90331o8973Q3406J32746j4828L0861O5116J15320Q1955L3201J79372K41852
18030A470359J42846n391j80340j69253j64664j21401r3941N6263P1296J51154
18020A156928K32286K06964J03804J7900n0230j12082q1316j28917q8209n4327
18010A202801M0130P4576Q8350O0943j15395o2415L9901N1592N7912k093q4958
17999A351344m2396r8747j34503q089J9272o0692r5230o5552o1482m0097l8173
$$ plain form
18074 1892013 1834010 1799081 1796637 1856288 1918123 1979275 1993428 2000087 2014773 2002227 1919274 1843500
18062 1843500 1848403 1914783 2047521 2139944 2128557 1901221 1664121 1520378 1413366 1310179
18052 1310179 1181863 1088464 1008204 905540 855290 825994 816887 795155 723998 645639 590331
18041 590331 521358 604764 737510 722682 753543 818659 933979 1015934 1049135 1228507 1470359
18030 1470359 1613205 1607814 1427474 1258221 1093557 972156 878215 934478 1005774 1156928
18020 1156928 1389214 1596178 1699982 1717882 1667652 1555570 1474254 1345337 1257128 1202801
18010 1202801 1242931 1317507 1405857 1466800 1351405 1288990 1328891 1380483 1438395 1436302 1351344
17999 1351344 1308948 1210201 1075698 1067609 1086881 1026189 930959 865407 803925 763828 725655
17988G25655q008O199K8440L3032K2648L3416l5875n2212p5934m5445q712k1385
17976F01819l7751K974j0777N70J4710k6805M4724J04094N365k0424M4673M9388
17964G72560L0509r41j7284l0064P891L9056k4425m6015Q349P8659M6646k5687
17952H39254j568P5983P9594j4958n4812m9994p1499q258k8355j2917k4878J087
17940G28679k2520j1395j9844k5973m0161n185o950o5748k7172o122Q4146O2088
17928F43843k769P598k4958r3038n0304J7044l920m0908k2515L0360k5217k0367
17916D14849J6466O1030O7909J6542J2287k4841k3334k1710J0140j0542J6900
17905E35696K5949K5692m6215P098l9564K162P3036J1688k8592k1870n6038m9738
$$ plain form
17988 725655 717647 723846 752286 785318 807966 841382 805507 753295 677361 631916 623204 601819
17976 601819 564068 567042 556265 556835 571545 544740 589464 693558 698923 678499 723172 772560
17964 772560 803069 802128 784844 754780 762671 801727 777302 731287 739636 818295 864941 839254
17952 839254 837686 913669 993263 978305 923493 873499 802000 793742 765387 752470 727592 728679
17940 728679 706159 694764 674920 648947 608786 603601 596651 530903 503731 497609 581755 643843
17928 643843 641074 648672 623714 530676 480372 497416 493496 452588 430073 460433 435216 414849
17916 414849 431315 492345 560254 576796 589083 564242 540908 519198 529338 518796 535696
17905 535696 561645 587337 541122 548220 508656 510818 583854 595542 566950 545080 489042 439304
17893D39304J8246M1609o80J1086M3152M6248J3393M1757L1230j1585o0295o5240
17881E48225J6776M3681M9162k5987o122o172J505j4212M8156O7081k2478j0952
17869F88663K0060r0054r6637L0580P5609j6792j6032O915n425O0673O8912K3887
17857G50359k1446K4128O877q840L302K397M456k5738M0935j3417m0099m1601
17845F81313m9662n5815N8586O9292J1206L3809l0016l6105J4048O2517L0972
17834G90145k350O5963P9653J4517N216K1553j4693J384N4182L1741l1308m1423
17822I74580N811p464K5703J5215j9482J24221J03589N3530p9780l6317P0186
17811A229792N4081Q6245N8177J234q2590o9024k2864q166M8522L3932J5418n945
$$ plain form
17893 439304 457550 499159 498479 509565 552717 598965 612358 654115 685345 673760 613465 548225
17881 548225 565001 608682 657844 631857 625735 619563 621068 606856 655012 722093 699615 688663
17869 688663 708723 618669 522032 552612 628221 611429 595397 602312 596887 657560 726472 750359
17857 750359 728913 753041 759918 751078 754380 756777 761233 735495 776430 763013 722914 681313
17845 681313 631651 575836 634422 703714 714920 748729 718713 682608 696656 759173 790145
17834 790145 787795 853758 933411 947928 953144 974697 960004 961388 1015570 1047311 1016003 974580
17822 974580 980391 972927 998630 1013845 994363 1118584 1222173 1275703 1195923 1159606 1229792
17811 1229792 1283873 1370118 1428295 1429529 1346939 1277915 1255051 1246885 1295407 1329339 1344757 1338812
17799A338812k9181j0585k642k1421L7763j3081m450n5242L0407J21312N1886
17788A443578P7987J53005J01740J88545J80781Q6067j02842j26946r5616n8273
17778A848026M9716J13893O0934J14597J64806J67258P8473J00636J96094L31889
17768C226322N72502P07938N26713J58084R9142L51427Q41917J383751J803099
17759I670895P54962j201186j531617p20267K37249R21386J766990K889667M461745
17750A7249824O808680R557591O525134l384345p588828m220247L33331M242765
17742B9523905P449423N898429k760099q636620p552530m070026j525652J48295
17734A8475125J449564K834820M908780Q107162J2517381J6887095J3080154l418214
$$ plain form
17799 1338812 1309631 1299046 1296404 1274983 1312746 1299665 1295215 1239973 1270380 1391692 1443578
17788 1443578 1521565 1674570 1776310 1964855 2145636 2231703 2128861 2001915 1906299 1848026
17778 1848026 1897742 2011635 2072569 2187166 2351972 2519230 2597703 2698339 2894433 3226322
17768 3226322 3798824 4506762 5033475 5191559 5290701 5642128 6484045 7867796 9670895
17759 9670895 10425857 9224671 7693054 6972787 7210036 8131422 9898412 12788079 17249824
17750 17249824 24058504 33616095 40141229 36756884 29168056 24947809 25281140 29523905
17742 29523905 36973328 42871757 40111658 31475038 23922508 19852482 18326830 18475125
17734 18475125 19924689 22759509 27668289 35775451 48292832 65179927 78260081 74841867
17726G4841867j7337296j7331618j1002845o209919l450436k042531j438325q10206
17718A5218691M1396R71239J956419L531466N882750R585165J4139673J0466802
17710F1793601o165763j5457512j1866989o279807l167750j443772l04218N30315
17702A7638105J283520K217024L252177M739844P773838J3142153K1083764K9777019
17694A00907444K5945568J1810167M344753j4326074l0880180k5343896j1002400
17687F1455382q55032P651951J7002034K5729686J8453239r886577k4369612j6572779
17679G8608292q436405j1179834j3447897j0308980o361833m015457k662041j917382
17671B0278463j302084r05375q87672q16163o54491m23548L6582N89672J438174
$$ plain form
17726 74841867 57504571 40172953 29170108 22960189 19509753 17467222 16028897 15218691
17718 15218691 15260087 16231326 18187745 21719211 27601961 37187126 51326799 61793601
17710 61793601 55627838 40170326 28303337 22023530 18855780 17412008 17107790 17638105
17702 17638105 18921625 21138649 24390826 29130670 36904508 50046661 71130425 100907444
17694 100907444 126853012 138663179 143007932 128681858 97801678 72457782 61455382
17687 61455382 60600350 68252301 85254335 110984021 129437260 119550683 95181071 78608292
17679 78608292 70171887 58992053 45544156 35235176 28873343 24857886 22195845 20278463
17671 20278463 18976379 18071004 17183332 16367169 15712678 15289130 15325712 15915384 17353558
17662A7353558K832054N127981Q713322J2149543Q345280k332079r363470j0477876
17654C2348313q331279n242387l028451j690577q99062k84380L03054M93767r4139
17645A3574859q49667o87588k8434M95354R07553J495938K387865M009966O554582
17636B7860428R519600J2332340J2045324K086203j0023936j2110760o748528
17629C4960671q71521M279024J0000889J7021177J8089351J29238j8789982k0146238
17621D4672609j2399483o695995l773798k176396j062832k80001O19615J883914
17613B0787633L562522O102230R180158Q552479m25782p401782n660474n27253
17605C4169731M292187R719610J7213147K7527470L8008623K9295857r969798
$$ plain form
17662 17353558 20185612 25313593 34026915 46176458 54521738 52189659 42826189 32348313
17654 32348313 24017034 18774647 15746196 14055619 13156557 12872177 13175231 13668998 13574859
17645 13574859 12725192 12037604 12009170 12504524 13412077 14908015 17295880 21305846 27860428
17636 27860428 37380028 49712368 61757692 63843895 53819959 41709199 34960671
17629 34960671 34089150 38368174 48369063 65390240 83479591 83608829 64818847 44672609
17621 44672609 32273126 25577131 21803333 19626937 18564105 18284104 18903719 20787633
17613 20787633 24350155 30452385 39632543 48185022 47759240 40357458 34696984 34169731
17605 34169731 38461918 48181528 65394675 92922145 130930768 160226625 150256827
17598A50256827l8911838l6052446k2000500j2225012p029073l878978j661649
17591B8497331L26698J947430K023867n74390k441073k522406j775438n35927
17583B4946092O92501J766892L130174N683676R711319J4149175J2140652j352301
17575G0868180j2873470j2240040o366898k231579l05013P75312K337285M752843
17567D4716620P902303J2782228K0765748L2800831M8374428N2116296J6133435
17560B35591889k4495212k4451909L026582K8436513M2715930N2090418L8302173
17553C51216384m208096l6992826k2169996K0243953L8810238J0821843r699472
17546C48022028j8031850m1772148n3238250n0827545m2329307k9432668j9110513
$$ plain form
17598 150256827 111344989 75292543 53292043 41067031 34037958 30158980 28497331
17591 28497331 28824029 30771459 32795326 32220936 29779863 27257457 25482019 24946092
17583 24946092 25638593 27405485 30535659 36219335 45930654 60079829 72220481 70868180
17575 70868180 57994710 45754670 39387772 37156193 36851180 37626492 39963777 44716620
17567 44716620 52618923 65401151 86166899 118967730 167342158 219458454 235591889
17560 235591889 211096677 186644768 189671350 218107863 260823793 312914211 351216384
17553 351216384 347008288 310015462 287845466 308089419 346899657 357721500 348022028
17546 348022028 329990178 288218030 234979780 184152235 141822928 112390260 93279747
17539I3279747j2941144q311951m738773k761037j690488O5006L564202R209742
17531G5675304J7276867K8771729L6473478J3386155k8592397m2571027k9597691
17524G0822418j6080888q803998m953364k115485O92138L779334P275697P439455
17516E8055307j198587q017392o018296q32986R00244l578152o852121n266964
17508B7191053k272748j22126N20608j246150l621865l962003k855446j850881
17500A1780442j235574p55851n05312l83056k65342o567l2863m97412r47689j000750
17490F150026q25408o11357m47421l07764k40748j63322p7927n3235j03484j00809
17480C218551j62205k04674j74351j70932p5989j05326p2264j7761j3400k2887
$$ plain form
17539 93279747 80338603 72026652 67287879 64526842 62836354 62901360 66465562 75675304
17531 75675304 92952171 121723900 158197378 171583533 142991136 100420109 70822418
17524 70822418 54741530 45937532 40984168 38868683 39560821 43340155 50615852 58055307
17516 58055307 56856720 48839328 42821032 41988046 42888290 39310138 32458017 27191053
17508 27191053 24918305 24796179 25316787 24070637 20448772 16486769 13631323 11780442
17500 11780442 10544868 9789017 9283705 8900649 8635307 8628740 8595877 8098465 7150776 6150026
17490 6150026 5324618 4713261 4265840 3958076 3717328 3554006 3476079 3422844 3319360 3218551
17480 3218551 3056346 2851672 2677321 2506389 2430400 2325074 2252810 2235049 2221649 2198762
17470B198762j77374k03930j73065j01496p3878j0497j24026J168L8690L8153
17460A412507k7646r2502n1541j3151L3415J07399O4460R858J9914o053L7330
17449A493990r6948j76455j10123k0540j2223O8534J65849K09034J01891l2207
17439A590802o7071j19726j02585j86532q6640n6350j3472K6946M6945J853l7602
17428I96568n9646o5680m3729n3018j3610k8207K9854O5611K6199L2076N579J0072
17416I02069Q105J9976M3385m4644L2692L24m337k5674p7457j2761K2616K1561
17404H85855P883L6224l9821j28216o9651K4956N286o856l7438O98j3062M0827
17392G06685k5625l6135N4028l4034k5062j7992j0528j8246q250j675K0794o2298
$$ plain form
17470 2198762 2021388 1817458 1644393 1542897 1469019 1458522 1334496 1335664 1374354 1412507
17460 1412507 1384861 1292359 1240818 1227667 1261082 1368481 1432941 1442799 1462713 1456660 1493990
17449 1493990 1397042 1220587 1110464 1089924 1077701 1146235 1312084 1521118 1623009 1590802
17439 1590802 1523731 1404005 1301420 1114888 1028248 971898 958426 985372 1032317 1034170 996568
17428 996568 936922 871242 827513 774495 760885 732678 762532 828143 854342 886418 891997 902069
17416 902069 910174 930150 973535 928891 961583 961907 957570 931896 854439 841678 864294 885855
17404 885855 893738 929962 890141 761925 692274 717230 722516 715660 678222 678920 665858 706685
17392 706685 681060 644925 698953 664919 639857 621865 611337 593091 584841 583166 603960 541662
17380E41662Q61N5909N7119j6460l0448k5609q1052m9089o1556l8255p8633l8849
17368B35600j8919K0494j2532Q019N3673P068R50K3674K5241L7521J492R5595
17356D77876J8274o1827q8481j1656o690k7280j8571l9710m005N7473R2048K4165
17344D11616p3722k5727M7937j1999o0054j2472K0802l5571q9449p4576L0322
17333A27107N8849p2200j3801L5538L2631P7998O7816J3673J933J500n806m9265
17321B75973n2158k6030J0376Q33o8146m396j920k6737q156N6722K7611k9709
17309A54263J6413J02097J5978p4546k4746r861m1596j2812K5150k30n666M8670
17297A93114k72n5297m1566m2362J2917J0164m8296l6270l1638L5816k733l0674
$$ plain form
17380 541662 542523 598432 655551 639091 608643 583034 501982 452893 391337 353082 274449 235600
17368 235600 216681 237175 224643 232662 286335 293403 294353 318027 343268 380789 382281 477876
17356 477876 496150 434323 345842 334186 327496 300216 281645 241935 237930 295403 387451 411616
17344 411616 337894 312167 360104 348105 288051 275579 296381 260810 171361 96785 127107
17333 127107 185956 113756 99955 135493 168124 246122 313938 327611 329544 331044 325238 275973
17321 275973 223815 197785 208161 208994 140848 136452 134532 107795 99639 156361 183972 154263
17309 154263 170676 272773 288751 214205 189459 179598 138002 125190 150340 150110 144444 193114
17297 193114 192842 137545 95979 53617 66534 76698 28402 -7868 -39506 -3690 -6423 -37097
17285c7097P790M106k2800J1338L0930o928M564K7907N7505L7987k2884l2820
17273E9598k9872M4491j0661n222j3851j686j7810l3772r593K6453K194M812L3042
17260D8123L1984J3381K0734Q6402K5379K903R506o0080l9324N5272r259J2970
17248A97991m2332M8718J01068K7082M0425o134O130L0343K6392m4865o6564n1783
17236B66471m2604m1759j3377r47j3128m1331O6506J14876J18821M8959j6499
17225D45988m9239j10085p1424k0070L4485K8239O3562J95485J61310O8570q1547
17214F65274k19713j46763o4449P3847J01070L4194j29636j06340j28353l2881
17204D6250m3915J5555N6797M7712M1499j3481l7099o5n493j210K0921n6849n6674
$$ plain form
17285 -37097 -29307 -25201 -48001 -36663 -5733 -12661 -8097 19810 77315 115302 92418 59598
17273 59598 29726 74217 63556 58334 44483 42797 24987 -8785 -18378 8075 10269 15081 48123
17260 48123 80107 93488 114222 200624 226003 228906 238412 178332 139008 194280 185021 197991
17248 197991 155659 204377 305445 332527 372952 366818 372948 403291 429683 384818 318254 266471
17236 266471 223867 182108 168731 167784 154656 113325 179831 294707 413528 462487 445988
17225 445988 396749 286664 215240 195170 229655 257894 321456 516941 678251 746821 665274
17214 665274 445561 298798 234349 308196 409266 443460 313824 207484 79131 46250
17204 46250 2335 17890 74687 122399 163898 150417 113318 113253 107760 106550 127471 70622 13948
17191A3948J7060N9875O5660m581l8500J0867Q6939Q3085M8483J2608k8447j04028
17179B22969j07280L532N1594M5597Q8398M9354J32379N6649n0238q6746r9400
17168C06808q4170j01235k7322R8709Q9136N2880m2593r9261o9242m8470n5527
17157A9713m704M693M852p6500J295K7301j859p800l885K5873P2740j8813m1679
17144A227K7003k9449k754Q1596Q9475Q0839O7774K5945m0485l1334p3420j5106
17132A81311j637p9571k7352K5944n0485J2628l9913l0881j8097J844M1577O0762
17120G6130J16651O0720k9432q9122q7982J4718r934n400l1911K7403l5495m8764
17108d2418n613L1469L5536J1701N699Q7577J2652L5229P1692O8710K9996O258
$$ plain form
17191 13948 31008 90883 156543 151962 113462 124329 211268 294353 342836 355444 326997 222969
17179 222969 115689 119221 170815 216412 304810 354164 486543 543192 492954 406208 306808
17168 306808 222638 121403 94081 192790 281926 334806 292213 192952 123710 75240 19713
17157 19713 15009 19702 24554 -51946 -50651 -23350 -25209 -33009 -36894 -11021 61719 42906 1227
17144 1227 28230 -1219 -3973 77623 167098 247937 315711 341656 301171 269837 196417 181311
17132 181311 179674 100103 72751 98695 48210 60838 20925 -9956 -28053 -26209 15368 76130
17120 76130 192781 253501 224069 134947 46965 61683 51749 46349 14438 41841 6346 -42418
17108 -42418 -48031 -16562 18974 30675 36374 123951 136603 171832 243524 312234 342230 348488
17096C48488o5430j10263p5056K1369P7963J17154P6324j8433O5035J11665J23374
17085F72190J9509q9002p1811q1866L2036Q3873J1875K2337k3843J9336M1381
17074F36015N2658l3791k1314o6480n0621q3410p7150j4572K7597O4641n3956
17063C79617q9204l6267j6625N337M9853J45758J72013J8667J187P843o9196j02306
17051D66677l6600k5037O2810Q3844P7056Q1324K7193J5436K0318m1920k9161
17040G01940j978l5954o8905n7277N633K8338q729j9774J20954J08724M001K0811
17028G97784o8970q9755J8870Q3412O8943N3313n5411j30511j59332j00088r4697
17017C23558J4574m9629l4673N4965Q5329K6498N3410K6905J1459J44007K30039
$$ plain form
17096 348488 283058 172795 97739 119108 197071 314225 390549 372116 437151 548816 672190
17085 672190 691699 602697 530886 449020 481056 564929 576804 599141 575298 594634 636015
17074 636015 688673 654882 633568 567088 516467 433057 355907 341335 368932 433573 379617
17063 379617 290413 254146 237521 242858 292711 438469 610482 629149 630336 638179 568983 466677
17051 466677 430077 405040 467850 551694 628750 710074 737267 752703 773021 731101 701940
17040 701940 699962 664008 595103 537826 543459 571797 563068 543294 664248 772972 776973 797784
17028 797784 728814 639059 657929 741341 810284 863597 808186 677675 518343 418255 323558
17017 323558 338132 288503 253830 308795 394124 420622 474032 500937 512396 656403 886442
17006H86442K23859K14134N4535k4899j70823k47741k62656j81712k4969M5393
16996E11563J16158R2604J15105k696j02355n9586j45855j07666n7984q2937n7367
16985B18984j19017k0478L8803O136n0107M3807J11672l30n1115j31361o6542
16974a9548M0407Q6800k3824n5580m1313J7592K680k5256j334k9952n111M4102
16962a0337L4677l8703l672K936J7186k1445j37251p022R8791P1833o2730K534
16950e3203O6142L9386K2569j2996k8776o0090J3686m3770o3719k9251l6054L8544
16938a47532M4995L8333k2875n1406N6414Q4076q985r404J2094n4407k7476Q553
16926g7620K4272m342l3133K2440o809q386K1052R59p5121L8159K2077L6902L2518
$$ plain form
17006 886442 1110301 1324435 1378970 1354071 1183248 935507 672851 491139 466170 511563
16996 511563 627721 720325 835430 832734 730379 670793 524938 417272 359288 276351 218984
16985 218984 99967 79489 118292 124428 74321 118128 229800 229470 178355 46994 -19548
16974 -19548 20859 107659 83835 28255 -13058 4534 7214 -18042 -19376 -49328 -54439 -10337
16962 -10337 24340 -14363 -18035 -15099 2087 -19358 -156609 -163631 -64840 6993 -55737 -53203
16950 -53203 12939 52325 74894 61898 33122 -26968 -13282 -57052 -120771 -150022 -186076 -147532
16938 -147532 -102537 -64204 -87079 -138485 -82071 2005 -6980 -16384 -4290 -58697 -86173 -77620
16926 -77620 -53348 -57690 -90823 -68383 -75192 -83578 -62526 -61567 -136688 -98529 -76452 -39550 -7032
16913g032m5713k1166K3886O467K6378L5914K8948q3299K6578Q998j0742n6679
16901f7462l9989n067O920J6975n7380l6837k9325O5981M9012k4117K3987R1955
16889e347k454J0947Q296j01730o4434K8299j119L4945O0629k6669M1254k7168
16877d4551p7595o8293K9778M2558k0982l5364j0812J4406M5246P2257J9304k6270
16865f0318J4221K2301J2389J2807O1058k9415J4608L3273o3536o2594p311n4609
16853a07126o317j0364p712L6409M4798K7669j1489q233L9154K4344M3901P5500
16841A40534P2177m2672J9317L9597q787J6694Q7213K31309K81798J12433j2915
16830I36698j5525k76102k62243j98835j68214k0717J00791J562j04878K533K5379
$$ plain form
16913 -7032 -52745 -73911 -50025 -43558 -17180 18734 47682 -35617 -9039 -41 -10783 -67462
16901 -67462 -107451 -112518 -105598 -88623 -146003 -182840 -212165 -146184 -97172 -121289 -97302 -5347
16889 -5347 -7801 3146 11442 -90288 -154722 -126423 -127542 -92597 -31968 -58637 -17383 -44551
16877 -44551 -122146 -190439 -160661 -118103 -139085 -174449 -185261 -170855 -125609 -53352 -34048 -60318
16865 -60318 -46097 -23796 -11407 1400 62458 33043 47651 80924 17388 -45206 -52517 -107126
16853 -107126 -113443 -123807 -131519 -95110 -50312 -22643 -34132 -42365 -3211 21133 65034 140534
16841 140534 212711 170039 189356 228953 220166 236860 324073 555382 837180 949613 936698
16830 936698 921173 645071 382828 183993 15779 -4938 95853 97415 -7463 -4930 20449
16819B0449J705m3509k1627K980q270j8952L4962n8530j3008L4391J7778L73J1122
16806d0136k6217K6820J7136L7747K1161p2355o0408j8508J7304k0493M789M4136
16794f9024o037j1718p826M4419R320k5531l114l6971j1961j3462k997K4369m504
16781a15037p7360R085P5907K6485k4523k1118M564R996K2259J3393j4930J4391
16769g6888r212j6549J7445L7815j6388Q370m1659K0402l6500l1378J9786O7844
16757e6912L8322R259l230m2712m5083J5466r99J1907o047J9913O0599p148k2216
16744b8881K979n8296N807K6901k4081J8799j0752k5741q927o0359J3719J773
16732a47059K3808j146J309J4844K298K5881J800N9661k6071p1245M517M1117
$$ plain form
16819 20449 22154 -21355 -42982 -40002 -48272 -67224 -32262 -90792 -103800 -69409 -51631 -51258 -40136
16806 -40136 -66353 -39533 -22397 15350 36511 -35844 -96252 -114760 -97456 -117949 -113160 -69024
16794 -69024 -75061 -86779 -94605 -50186 -40866 -66397 -69511 -106482 -118443 -131905 -134902 -110533 -115037
16781 -115037 -192397 -183312 -107405 -80920 -105443 -126561 -121997 -112001 -89742 -76349 -91279 -76888
16769 -76888 -86100 -102649 -85204 -47389 -63777 -55407 -97066 -76664 -113164 -144542 -124756 -56912
16757 -56912 -18590 -9331 -12561 -55273 -100356 -84890 -85889 -73982 -80029 -60116 483 -6665 -28881
16744 -28881 -25902 -84198 -78391 -51490 -75571 -56772 -67524 -93265 -102192 -162551 -148832 -147059
16732 -147059 -123251 -124397 -123088 -108244 -105946 -80065 -78265 -18604 -44675 -115920 -111403 -70286
16720g0286O4998k7992r2077q1257r117P7555O2983L2268J0648k6363l4027N3734
16708c8933L4400L1767p4986k0801l8564q258J5666k180j1927O2889m4153p8755
16696a73835K4424J1128K8588L899l5919K7082K4415r403M7264k4232P91N3398
16684b2400n2904j7639L789k7469J4251K4329K6840m585N4575n829q2680m8076
16672a37798o977J5649n359O1718n1089J3045L2955j2133k7305O4391K9607m7824
16660g1120J1036J2683l7593j6598M9556J9872j4522j7076j0150J3713k9243P539
16648h1903N0664k2931K556J9859K3195o1326l5055P64L1569K6298M5259k8355
16636b9406L240k3305k9403L1778j4243K8195L1307p318l9468K2710K8158K0032
$$ plain form
16720 -70286 -5288 -33280 -125357 -206614 -215731 -138176 -75193 -42925 -32277 -58640 -92667 -38933
16708 -38933 -4533 27234 -47752 -68553 -107117 -115375 -99709 -101889 -113816 -50927 -95080 -173835
16696 -173835 -149411 -138283 -109695 -105796 -141715 -114633 -90218 -99621 -52357 -76589 -75798 -22400
16684 -22400 -75304 -92943 -89154 -116623 -102372 -78043 -51203 -55788 -1213 -7042 -89722 -137798
16672 -137798 -144775 -129126 -134485 -72767 -123856 -110811 -77856 -89989 -117294 -52903 -23296 -71120
16660 -71120 -60084 -47401 -84994 -101592 -52036 -32164 -46686 -63762 -73912 -60199 -89442 -81903
16648 -81903 -31239 -54170 -51614 -31755 -8560 -69886 -104941 -104177 -72608 -46310 -1051 -29406
16636 -29406 -26166 -49471 -78874 -47096 -61339 -33144 -1837 -9155 -48623 -25913 2245 22277
16624B2277o3621l6001J3045l6873j9256n6429j0619J01143L4411l2405j9850
16613a04178L5065j8276k0850k5241M2394n389r444K1951j5328L897L8548M2266
16601a4585j838l5445o4499o560M7619K9708L728m466R6847L430p5421o4739j5452
16588a01673K4928K4719P294J9132k1984k5764k2395o767J4011l0432R4658M452
16576a9821j9637J8722n1961R496L8998O6817M4986q361m8775l4617k3063k2590
16564d9806j6250l9018j2949M3678M6233k5930k4784o6814k8226P9029L7849l1931
16552h8919j4608M513q775L748K5633L9577l5031k5827R321k1447O857N9553j6207
16539f1612L1311J0080L378M200n4145p845m4045j5929P702K9029m5102j9468
$$ plain form
16624 22277 -41344 -77345 -64300 -101173 -120429 -176858 -187477 -86334 -51923 -84328 -104178
16613 -104178 -69113 -87389 -108239 -133480 -91086 -96475 -105919 -83968 -99296 -95399 -56851 -14585
16601 -14585 -16423 -51868 -116367 -122927 -75308 -45600 -41872 -46338 50509 53939 -21482 -86221 -101673
16588 -101673 -76745 -52026 -44732 -25600 -47584 -73348 -95743 -102510 -88499 -118931 -24273 -19821
16576 -19821 -39458 -20736 -72697 -63201 -24203 42614 87600 79239 30464 -4153 -27216 -49806
16564 -49806 -66056 -105074 -118023 -74345 -28112 -54042 -78826 -145640 -173866 -94837 -56988 -88919
16552 -88919 -103527 -99014 -107789 -104041 -78408 -38831 -73862 -99689 -90368 -111815 -104958 -45405 -61612
16539 -61612 -30301 -20221 -16843 -12643 -66788 -74633 -118678 -134607 -126905 -97876 -142978 -162446
16527a62446O345P5201J4274n292j7575n1960M9572L0081j3467n7995L4503Q8960
16515i799N650n6476N1905j4321n5814L6136L0078K8278n0430p3593M468K863
16503a01055j3961n521K2452K0161L2636R53M5845K2988M0925p6943n9232N5819
16491a4933O676o0102J9645m8800o36j6428l9364J2943O1515N6510J6270n8476
16479f5180q5573Q9008k1368l1713k3594L11K2569R750r452K2133N4761J8330
16467b0018m0483k1469O4758O1506L2389l0563o4345m419L7059r611k0962J754
16455a4404K4064K4746k498k4784m4766J2486j4306l5559j7117j4957J5904K0623
16443g0568J3132J891O136o1856q067M1861L6259K8308J8078M468p5100l1975
$$ plain form
16527 -162446 -156101 -80900 -66626 -71918 -89493 -141453 -91881 -61800 -75267 -133262 -98759 -9799
16515 -9799 -4149 -60625 -8720 -23041 -78855 -42719 -12641 15637 -34793 -108386 -103918 -101055
16503 -101055 -115016 -120537 -98085 -77924 -45288 -44335 1510 24498 65423 -11520 -70752 -14933
16491 -14933 -8257 -68359 -48714 -97514 -98150 -114578 -153942 -140999 -79484 -22974 -6704 -65180
16479 -65180 -150753 -61745 -83113 -114826 -138420 -138109 -115540 -105790 -115242 -93109 -38348 -20018
16467 -20018 -60501 -81970 -17212 44294 76683 46120 -18225 -22644 14415 4804 -16158 -14404
16455 -14404 9660 34406 31908 7124 -37642 -25156 -39462 -75021 -92138 -107095 -91191 -70568
16443 -70568 -57436 -55545 -49409 -111265 -119332 -77471 -41212 -12904 5174 9642 -65458 -97433
16431i7433L1244m1429j2296L2001M4710J8824M1058L4457K3438o2992o2474l5769
16419h6661j1827J9459j1252K3203L567j1224l2133j1690q769K9493O4450L8243
16407D859J124j2848o661j1458N5767p628o8012j7545R123L9733l6496q6594J6956
16394a19680O6011n242j9524J1663l0837R203J3645K889J3966K2706K8890m1207
16382d7517m4569l951j0618k6572m6338l2432R5361J2342r7067j7316Q0466L0214
16370a07997j3584M9670N0562j7981P988j1513k7601j9095K6430J2649K5434r35
16358b5973k0540k4294l9463J6994J233j393O5012l9306J3616L0628L0065j1874
16346e295l0654K1095l1531K7490P2816l712j9989l9032l9388m564K8512K6660
$$ plain form
16431 -97433 -66189 -107618 -119914 -87913 -43203 -24379 16679 51136 74574 11582 -50892 -86661
16419 -86661 -98488 -79029 -90281 -67078 -63511 -74735 -106868 -118558 -127327 -97834 -33384 4859
16407 4859 5983 -6865 -13526 -24984 30783 23155 -44857 -62402 -53279 -13546 -50042 -136636 -119680
16394 -119680 -53669 -58911 -78435 -66772 -97609 -88406 -74761 -71872 -57906 -35200 -6310 -47517
16382 -47517 -92086 -96037 -106655 -133227 -179565 -211997 -116636 -104294 -201361 -218677 -138211 -107997
16370 -107997 -121581 -71911 -21349 -39330 -31342 -42855 -70456 -89551 -63121 -50472 -25038 -25973
16358 -25973 -46513 -70807 -110270 -93276 -92043 -93436 -28424 -67730 -54114 -23486 6579 -5295
16346 -5295 -35949 -14854 -46385 -18895 53921 50209 30220 -8812 -48200 -52764 -24252 2408
16334B408M8815K526q4398J5803K5776q148J6201K5725l4096q1691N485P922k4319
16321h1991J147P3714N471j6476l0725k5234k4915J4289L355R906k879j1323j4103
16308i9764J0686j5672K9742P8593K2517j282l9121m1463L9109J0297j346j7664
16296b5368m225l1424j3969Q99m8141q040j8867J4450R0363M0555L2281J0336
16284C8850n7149m1254l3975J8995M2004J2636M0149L2666k052q9334m3577J7372
16272f4669J2286J4761p3679j8717P1383P7013M8275L962o0612j4295J4739O4944
16260G5391k0529l8156l689k3282l2138J6690l920N57K923J5698J3844p505L3840
16247B9724j4765k8201k3745l6232k1969N5261q312m261j1628n6153l0002L2560
$$ plain form
16334 2408 51223 53749 -30649 -14846 10930 2782 18983 44708 10612 -71079 -65594 -57672 -81991
16321 -81991 -80844 -7130 -1659 -18135 -48860 -74094 -99009 -84720 -81365 -71459 -74338 -85661 -99764
16308 -99764 -89078 -104750 -75008 3585 26102 24820 -14301 -55764 -16655 -6358 -7704 -25368
16296 -25368 -29593 -61017 -74986 -74087 -122228 -130268 -149135 -134685 -44322 -3767 28514 38850
16284 38850 -18299 -59553 -93528 -74533 -32529 -19893 20256 52922 50870 -38464 -82041 -64669
16272 -64669 -52383 -37622 -111301 -130018 -58635 18378 66653 70615 10003 -4292 10447 75391
16260 75391 54862 16706 13017 -10265 -42403 -25713 -29633 -29076 -26153 -10455 3389 -4116 29724
16247 29724 14959 -13242 -36987 -73219 -95188 -39927 -48239 -52500 -64128 -120281 -150283 -117723
16235a17723L6576j0458k8962L3469M150J9882R219m776l5982J1128P3765K1662
16223A1950r7577L8527O9313k7734n9213J1461m198n923J3883n5344L370L7628
16211f3857L4738J3395q6277p677O1481P478j0723K818N3160k7757o3683r066
16199i5970M1120J3408n1953L0125O3044n0642n263J4547k1976K9394P3502n8144
16187a8808J149j2757O5533K7975N718l8532r7831l6654J8316k0906M3229M2119
16175b1449j08728J3572M9925k1216l5743J278K6149O3685K2206k3338k7150M063
16163e6746n8721J6927j1299l0090L0273Q0083L3986k3120k3568P4749M53n3053
16151b0126j5811J6941m8967M95K8632K3425j1517N570n880m9919l0960K0863
$$ plain form
16235 -117723 -81147 -91605 -120567 -87098 -82948 -63066 -53847 -58623 -94605 -83477 -9712 11950
16223 11950 -85627 -47100 22213 -5521 -64734 -53273 -57471 -63394 -49511 -104855 -101485 -63857
16211 -63857 -29119 -15724 -102001 -109678 -48197 -40719 -51442 -48624 4536 -23221 -86904 -95970
16199 -95970 -54850 -41442 -93395 -63270 -226 -50868 -56131 -41584 -63560 -34166 39336 -18808
16187 -18808 -17659 -30416 35117 63092 68810 30278 -67553 -104207 -85891 -106797 -63568 -21449
16175 -21449 -130177 -116605 -66680 -87896 -123639 -122361 -96212 -32527 -10321 -33659 -60809 -56746
16163 -56746 -115467 -98540 -109839 -139929 -109656 -29573 4413 -18707 -42275 32474 32927 -20126
16151 -20126 -35937 -18996 -67963 -67468 -38836 -15411 -26928 -21358 -27238 -77157 -108117 -87254
16139h7254O7541J4580M933K2062l9594n6320Q2571K9615n0153p4698l106K8639
16127f1184K2763N3293o619n0578K5900n2043m3317K8038L4965n785m367J4563
16115d4371m3453n2049O265l7610P547M3006L447O0393Q0655J5818J7430j6979
16103D0099J9267q9318P08L1436m252p1236O4275Q643J8640K7959L4146o202o6623
16090G542l6818K0632K5537m0495m8153n574O4671M5196q9099o9679j90Q9237
16078c7193L9914J9499l837K8168O740l2652r9357J2199L7538j1863K2494N2014
16066C3664R3796j573o1939n5496q9042o3680j4371J3207j233M1462j4460M2039
16054g7626L868p0131L3830L2905M6106j4300k8485K9896O753n448k5988J4517
$$ plain form
16139 -87254 -19713 -5133 -200 21862 -17732 -74052 8519 38134 -12019 -86717 -89823 -61184
16127 -61184 -38421 14872 8253 -42325 -16425 -68468 -111785 -83747 -48782 -54567 -58934 -44371
16115 -44371 -87824 -139873 -133608 -171218 -163671 -120665 -117218 -56825 23830 39648 57078 40099
16103 40099 59366 -29952 -29244 2192 -2060 -73296 -9021 -378 18262 46221 80367 74165 7542
16090 7542 -29276 -8644 16893 -23602 -71755 -77329 -12658 32538 -56561 -126240 -126430 -37193
16078 -37193 2721 22220 18383 46551 53291 20639 -78718 -66519 -28981 -40844 -18350 33664
16066 33664 127460 125887 63948 8452 -80590 -144270 -158641 -145434 -146667 -105205 -119665 -77626
16054 -77626 -73758 -143889 -110059 -77154 -31048 -45348 -73833 -43937 -37184 -42632 -68620 -54103
16042e4103j085n448j9127j2941J4165P8863K0619L9206J940k0572K3256K5806
16030I0579j4996l1843m603n7076o5389L7870P2961j8049Q649k1512l4373k082
16018c9864J9811M813j5238n4649L0971R2213J5157n3161k6909K6549N479k6331
16006b1159l2507J9983r322J144m3774K2164M2381l3425n4493k0418O5512Q616
15994e5298L6210m5410l4681K6691M506Q996M5939J8637K2293Q380m0407J614
15982b530K5793j8084J9252m0909K9892J7462m7159l4910J1737M794L2383J118
15970a161J6998P8333o202j3226p5044j1550j2996o7219M083L8061p273k849J7246
15957d2799K4787j5997k8493j3240q125k4685L2418K0497l5417M9673N2265j3171
$$ plain form
16042 -54103 -55188 -60636 -79763 -92704 -78539 324 20943 60149 62089 41517 64773 90579
16030 90579 75583 43740 39137 -17939 -83328 -45458 27503 9454 18103 -3409 -37782 -39864
16018 -39864 -20053 -15240 -30478 -85127 -54156 38057 53214 53 -26856 -307 5172 -21159
16006 -21159 -53666 -33683 -43005 -41861 -85635 -63471 -21090 -54515 -109008 -129426 -63914 -55298
15994 -55298 -19088 -64498 -99179 -72488 -67982 -58986 -13047 5590 27883 36263 -4144 -2530
15982 -2530 23263 5179 24431 -16478 13414 30876 -16283 -51193 -39456 -34662 -2279 -1161
15970 -1161 15837 94170 87968 74742 -302 -11852 -24848 -92067 -87984 -49923 -57196 -60045 -42799
15957 -42799 -18012 -34009 -62502 -75742 -83867 -108552 -76134 -55637 -91054 -41381 10884 -2287
15945b287k9370k6790j26M2113L0247K0727J8728j8487n9387o4415L3528K1185
15933c4334m06k7083j9376l6081K1119L8239K5507n1405J7241j2675J0150J2541
15921e6563j9656L0574J4050k4239l1425j9068n0147l1657P7654J06146Q528l466
15909G31j9239L5582j5612O47l4752k9270K0419J1889L9191k2660J3646O4124
15897F4696K6363n2906L7067N0993p3081q8500k3460Q9188l3523l9989k498K7437
15885a8213Q884J6526o0233k6871M2371j0657k9517O5336m3626p0803L5610K1221
15873f9972L0917L1881L3191j9124L0676k1640p977K8167K1453l8589J5283K3874
15861E8140j0983j9486n4255p7125m1105M6843M8720J4914m1156r1869j8270J1005
$$ plain form
15945 -2287 -31657 -58447 -58573 -16460 13787 34514 53242 34755 -24632 -89047 -55519 -34334
15933 -34334 -34740 -61823 -81199 -117280 -96161 -57922 -32415 -83820 -66579 -79254 -69104 -56563
15921 -56563 -76219 -45645 -31595 -55834 -87259 -106327 -156474 -188131 -110477 -4331 4197 731
15909 731 -18508 17074 1462 2109 -32643 -61913 -41494 -29605 9586 -13074 572 64696
15897 64696 91059 38153 75220 126213 53132 -35368 -58828 30360 -3163 -43152 -45650 -18213
15885 -18213 -9329 7197 -53036 -79907 -37536 -48193 -77710 -12374 -56000 -126803 -91193 -69972
15873 -69972 -39055 -7174 26017 6893 37569 15929 7952 36119 57572 18983 34266 58140
15861 58140 47157 27671 -26584 -103709 -144814 -97971 -49251 -34337 -75493 -167362 -185632 -174627
15849a74627O7908Q1582M5145M126k5637M8241m377R518j0481K5877k8549p4336
15837c5610l1912l4915J5064O3577n6830J9032K3622J3792k382o429n9992o0395
15825a53378Q6609N7158o4626k2952M4974J528l8757J1305M1523M1432Q108n8419
15813d5495R629k4257K0691M4874N3554l193K1769o3592q4401l3630L6820K7131
15801d0100Q480L0784M4105J303q2347j006R400k5477k35k4480L9604L4422N81
15788d966l0169m1566K4857L7538K4395M110J7546J0259Q179M9000j8113m6271
15776C4799o8182K2237l0211O441j5787l5785K3522N1176L0014j4111m2843k3489
15764f2219k0026K0652P6013L5986j5560m4782l1560j4444m0721K6178K4744o532
$$ plain form
15849 -174627 -106719 -25137 20008 24134 -1503 46738 42361 51879 41398 67275 38726 -35610
15837 -35610 -67522 -102437 -87373 -23796 -80626 -61594 -37972 -24180 -26562 -32991 -92983 -153378
15825 -153378 -66769 -9611 -74237 -97189 -52215 -50687 -89444 -78139 -36616 4816 12924 -45495
15813 -45495 -35866 -60123 -39432 5442 58996 55803 77572 13980 -70421 -104051 -67231 -40100
15801 -40100 -31620 -836 43269 44572 -37775 -38781 -29381 -54858 -55093 -79573 -39969 -5547 -4966
15788 -4966 -35135 -76701 -51844 -14306 10089 14199 31745 42004 50183 99183 81070 34799
15776 34799 -33383 -11146 -41357 -34916 -50703 -86488 -62966 -11790 18224 4113 -38730 -62219
15764 -62219 -82245 -61593 14420 50406 34846 -9936 -41496 -55940 -96661 -70483 -45739 -52271
15752e2271L1218O1334j0746n952J1421l3777k1111j5632j5182J0624P0541K0680
15740E1147j0547l1554K709M100j9261L1390M007k0104l4989m165K2173N74l3953
15727c8473l6467k1259K0871P2623k7318p54k560k6943q5244K0549M7738J09329
15715C2092P3773o1928o2115J1631n08j7222j0439l870j8882M273K5928l1834
15703e9101o484J6809K8470L6288k2703q263m0293k1649j4258r136K3443K2235
15691e4642K7529N6519l7694k2638j7140O3807O3880Q969o1479n1876j6730J03816
15679F2321K4909m4159l9107K7361J5794q63k0199o5670j0877k6842R429k562
15667g0465K0065N222K3260j5942j2074J5372K3338Q4854M241o6811k9530R410
$$ plain form
15752 -52271 -21053 40281 29535 23583 35004 1227 -19884 -35516 -50698 -40074 30467 51147
15740 51147 40600 9046 11755 15855 -3406 27984 31991 11887 -23102 -27267 -5094 -4520 -38473
15727 -38473 -74940 -96199 -75328 -2705 -30023 -30777 -33337 -60280 -145524 -124975 -77237 32092
15715 32092 105865 43937 -18178 -6547 -7055 -24277 -34716 -38586 -57468 -53195 -27267 -59101
15703 -59101 -65585 -48776 -20306 15982 -6721 -14984 -55277 -76926 -91184 -100320 -76877 -54642
15691 -54642 -27113 29406 -8288 -30926 -48066 15741 79621 88590 27111 -24765 -41495 62321
15679 62321 87230 43071 3964 31325 47119 46256 26057 -39613 -50490 -77332 -67903 -70465
15667 -70465 -50400 -45178 -21918 -37860 -49934 -34562 -11224 73630 77871 11060 -18470 -9060
15655i060n0643m9805L0787M7172R772J4698l0657k2618N5912M1485K0337m1877
15643A5503m4523m6052M2579K9508n987J0116Q0699J2597o7513m5020k7691K2818
15631b2966k1133r901l2412o0057K35J2101J1184L4325N1645K0489k6840j7590
15619f0920k0353J5038K6244M0258m820q0669n2282R5961P9712r714m7400l9850
15607e8795j6354j0472N9021O0472j2641o2710k1346j6243M3425K6459p483J6463
15595b04n31K6836j0068n0358M7982M7405N777j6890j3522o6090k9768K0136Q7030
15582D7735j3570j0868k5712k5590J6318N8853J5371k4489j0048J2661j0148m7663
15570a7150k7236O2176P5069j1166k8808k7733l8530l1255K5695K950J8769r2973
$$ plain form
15655 -9060 -59703 -109508 -78721 -31549 -21777 -7079 -37736 -60354 -4442 37043 57380 15503
15643 15503 -29020 -75072 -32493 -2985 -8972 1144 81843 94440 26927 -18093 -45784 -22966
15631 -22966 -44099 -54000 -86412 -146469 -146234 -134133 -122949 -88624 -36979 -16490 -43330 -60920
15619 -60920 -81273 -66235 -39991 267 -4553 -85222 -137504 -41543 38169 28455 -18945 -58795
15607 -58795 -75149 -85621 -26600 33872 21231 -41479 -62825 -79068 -35643 -9184 -16667 -204
15595 -204 -735 26101 16033 -34325 13657 61062 66839 49949 36427 -29663 -59431 -39295 47735
15582 47735 34165 23297 -2415 -28005 -11687 47166 62537 38048 28000 40661 30513 -17150
15570 -17150 -44386 17790 92859 81693 52885 25152 -13378 -44633 -18938 -15988 2781 -90192
15558i0192P5710L0182o9520K0144j7461K1569J7173j1024l5840j9876l9942J3104
15546a05973M2045P9584K6298n1154o4021m2458l7618L2903L5920K5615M9526
15535i333O419p3821l2955K9185K6499N8130R977j8226L0224n5274J0403k085
15523b0857K1446m8564j8113R889M1189l2598J2229K5236k1165m6191K8428M3468
15511e603j2992p424O8862J6506r469l3582k0767m797L6259N8675k8514m2816
15499A4338L7755L7975K4555J8843o0189n0109J2494m6024p030j5566k449N513
15487b9894l7565o752j445M5533K7373k1923P152K7671N2933M3598j04496l4216
15475c2031p9547m1040K1912O1685M8260K3288J1518N2927L7040n3333o7063k8096
$$ plain form
15558 -90192 -14482 15700 -53820 -33676 -51137 -29568 -12395 -23419 -59259 -79135 -119077 -105973
15546 -105973 -63928 15656 41954 -9200 -73221 -115679 -153297 -120394 -84474 -58859 -9333
15535 -9333 -2914 -76735 -109690 -80505 -54006 4124 14101 -4125 26099 -29175 -18772 -20857
15523 -20857 589 -47975 -66088 -56199 -15010 -47608 -35379 -10143 -31308 -77499 -49071 -5603
15511 -5603 -18595 -26019 42843 59349 49880 16298 -4469 -9266 26993 85668 57154 14338
15499 14338 52093 90068 114623 133466 73277 23168 35662 -10362 -17392 -32958 -35407 -29894
15487 -29894 -67459 -74211 -75656 -30123 -2750 -24673 -17521 10150 63083 106681 2185 -32031
15475 -32031 -111578 -152618 -130706 -69021 -20761 2527 14045 66972 104012 50679 -16384 -44480
15463d4480m2340P155Q0765P0726j8793j3651p286l3394J334q494m6031k0262
15451g4751P808k9227L3j8353M7305L8421K293J0967J3088k9701k5347l9863P4303
15438b3024O4443L6691j1899l1505j9787o5123l6063j362L4206Q2107K9396Ok7823
15425C0263J2740l55l1211K863K3650j2386q8241l7088K7226Q225l8295K0387
15413h2222P2781M2818K2737k0126K2212K7599m8992j2466N1524k3605l7146K8499
15401D3613k3656l6834j1370J6226M6401j1907m0409n85l7173J8408L2079N4943
15389D9736l3214k7544J7569Q872M5717r7585p4540M852L0752J9219N2657M7434
15377D3925m4616n3222L9912j374n9570k1346L2896J5309R748K6979K4302L8627
$$ plain form
15463 -44480 -86820 -79665 1100 71826 53033 39382 32096 -1298 36 -8458 -54489 -74751
15451 -74751 -66943 -96170 -96137 -114490 -67185 -28764 -26471 -15504 -2416 -32117 -57464 -97327 -23024
15438 -23024 41419 78110 66211 34706 14919 -50204 -86267 -87629 -53423 28684 58080 58086 30263
15425 30263 43003 42648 11437 14300 37950 25564 -62677 -99765 -72539 -64314 -102609 -82222
15413 -82222 -9441 33377 56114 35988 58200 85799 36807 24341 75865 52260 15114 43613
15401 43613 19957 -16877 -28247 -12021 34380 22473 -17936 -18521 -55694 -37286 -5207 49736
15389 49736 16522 -11022 6547 15419 61136 -36449 -110989 -106137 -75385 -56166 -3509 43925
15377 43925 -691 -53913 -14001 -15375 -74945 -96291 -63395 -48086 -38338 -11359 12943 51570
15365E1570Q4427q113p9361m9073m2871k702N0931P766K2033k5861L0243J6082
15353E5071m2654j7310J3723j6888J0321j3275K2612L5588M5454P674l3676M9605
15341A16245l8406n5762j3478p0526k6592J6601J1969J8632O6848Q1941K3410
15330A30882j8581n2507o197Q420K2607k3360n4751K6523N0151K0398m830j7801
15318H0954o6102N369J1780J0048j5593r960k4415j6704J380N8743J4402k3576
15306B6326o1594l2245L21L8249J5718l4863L3202M2164j6683M5889j5079k0768
15294B0637r259j4131K4163K3183k6197O007m0528L6660K8932K9012q901l1714
15282C7864J2864k3938J0238j3436l0314L656j6972J4582J6557J8700N5364j590
$$ plain form
15365 51570 135997 127884 48523 -550 -43421 -46123 4808 12574 34607 8746 38989 55071
15353 55071 12417 -4893 8830 -8058 2263 -11012 11600 47188 92642 100316 66640 116245
15341 116245 77839 22077 8599 -61927 -88519 -71918 -59949 -41317 25531 107472 130882
15330 130882 112301 59794 53597 62017 84624 61264 6513 33036 83187 103585 98755 80954
15318 80954 14852 20221 32001 42049 26456 16496 -7919 -24623 -23243 35500 49902 26326
15306 26326 -35268 -67513 -67192 -28943 -13225 -48088 -14886 27278 10595 56484 41405 20637
15294 20637 11378 -2753 21410 44593 18396 24403 -16125 20535 49467 78479 69578 37864
15282 37864 50728 26790 37028 23592 -6722 -3066 -20038 -5456 11101 29801 85165 83575
15270H3575l1628l3202n6725k9053L6174L9499L7283J8116P043p777k201K1570
15258H2674L3405r3144K4810j6322M0315M7687m3640l1633l63K2645P713r163
15246F4984L8886L9015j7186q7635m8996K7961P446J4465l0409K3540r164j487
15234B1420O911l1217o8202q442R5737P7956k9323n4020n0042K386O925M437N6546
15221C1072N8646M6705m0397j3365k1069k4621m6733O4037K2740M301J2106j1885
15209H1537J6865O726j2263n3431O548j8012l984J6760N7685K6720p7196N549
15197E3504K5738K1445M8133M0916J14635J25040J13014O757j08494r3755q2507
15186B64426l8245J055n1969J2623J4908m6692J0352J5441P6910J13144J24020
$$ plain form
15270 83575 51947 18745 -37980 -67033 -30859 8640 45923 64039 71082 63305 61104 82674
15258 82674 116079 22935 47745 31423 71738 119425 75785 44152 43789 66434 74147 64984
15246 64984 103870 142885 125699 38064 -10932 17029 24475 38940 8531 32071 22907 21420
15234 21420 28331 -2886 -71088 -79530 16207 94163 64840 10820 -39222 -36836 -29911 -25474 31072
15221 31072 89718 136423 96026 82661 61592 36971 -9762 54275 77015 81316 93422 81537
15209 81537 98402 105128 92865 39434 45982 27970 23986 40746 98431 125151 47955 53504
15197 53504 79242 100687 148820 189736 304371 429411 542425 549182 440688 346933 264426
15186 264426 226181 227236 175267 187890 202798 156106 166458 181899 258809 371953 495973
15175D95973K34062K70702L30489J42819k54582m04588k77206j89143p7579k1141
15165B49806L6763n2064j6748O519K40K8951M6223Q6851J28549Q7366J11759L6499
15153G50714p8921k38473j70634n0013j0707l257q4850l0503k56l0235J7852k1374
15141D9343K9738N9972K0792P161k6035k9598J2415L8421R773r574r7221j2174
15129E3013L7358o5320J907P9252M7892J3275k4154n8548m5215l4208M4665L923
15117E3840j845J5059m9013J6828J7419K2303N583m3051k5043J8096K3955q434
15105D5697m0469r557k8894k4019M4067K0683o1320k1504k962K0542M0184j0754
15093b8306M8388M321p053K216O376N4232l0773J2985N544Q773j4357J8531M0706
$$ plain form
15175 495973 730035 1000737 1331226 1474045 1219463 814875 537669 348526 270947 249806
15165 249806 286569 234505 217757 224276 224516 253467 299690 386541 515090 602456 714215 750714
15153 750714 671793 433320 262686 212673 201966 198709 113859 83356 83100 52865 70717 49343
15141 49343 79081 139053 159845 167006 140971 111373 123788 162209 171982 162408 65187 53013
15129 53013 90371 25051 26958 106210 154102 167377 143223 84675 39460 5252 49917 53840
15117 53840 51995 67054 18041 34869 52288 74591 80174 37123 12080 30176 54131 45697
15105 45697 5228 -4329 -33223 -57242 -13175 7508 -53812 -75316 -78278 -57736 -17552 -28306
15093 -28306 20082 24403 17350 19566 25942 80174 49401 62386 67930 76703 62346 80877 121583
15080A21583k9313R697k7461J7711l5514j0492k2801J9309p444L5810L7828k1500
15068H7413L2441k2643p6271P382K5513J8380O9473J502l3453j9009R042O09J1857
15055A12236J5997r677k2175q8356M2346O0066r755m7119o182Q4219O6937o0606
15043A37931j9974J2789P701k5875n8995J9284p04l9022k0139j8924P132m0994
15031c9790L3999L2447N4270O1982l9440P466K4059l5500l5999L700P535j3784
15019F0945N6594J0451l5751M3182M2087q0512o5175R638m519n5749l240L5044
15007A2995J5302N1148k2460J5567p904l8050l0298J00550p394k0085K7339n1275
14995D5435k9443M8353P113K6066M4194k120j3503j8703k4746J3791J5669p4780
$$ plain form
15080 121583 92270 101967 74506 92217 56703 46211 23410 42719 35275 71085 108913 87413
15068 87413 119854 97211 20940 28322 53835 72215 141688 143190 109737 90728 99770 100379 112236
15055 112236 128233 118556 96381 8025 50371 110437 100682 53563 47381 131600 198537 137931
15043 137931 117957 130746 138447 112572 53577 72861 72157 33135 12996 -5928 1204 -39790
15031 -39790 -5791 26656 80926 142908 103468 110934 134993 99493 63494 67194 74729 60945
15019 60945 117539 127990 92239 135421 177508 96996 31821 41459 36940 -18809 -22049 12995
15007 12995 28297 79445 56985 72552 64648 26598 -3700 96850 89456 69371 96710 45435
14995 45435 15992 64345 71458 97524 141718 139598 126095 107392 82646 96437 112106 37326
14983C7326o2869K4242M3116N8713l1171J0744P2273P4816J198k5540j9866k8936
14971A54046l4561P633O5782l121l1307k1502J4813l6497m7480l0309k3779m330
14959I388M5535O6555N7015K1556k8769o428L077k2951j5497k0218O95O0754j863
14946A68849K0902j3912M2834M3639j7093M3144L2081L7035K0030p0658j51184
14935A55667n4599N5914L7274n1994P3381M1712j5854m8719K6113q0023n2622
14924H6250J1495P8076O5656L8134J9006o2422l4855r273n9382J0691J2789k9266
14912A26899K719q26M9975n7103m017J7983j0210k4533M194K2126K3097l2879
14900A17425k5051J3206N2027R1191K0822k4528q1876l4153J8106k2300L118j5233
$$ plain form
14983 37326 -25543 -1301 41815 100528 69357 80101 152374 227190 228388 202848 182982 154046
14971 154046 119485 127118 192900 189779 158472 136970 151783 115286 67806 37497 13718 9388
14959 9388 54923 121478 178493 200049 171280 164852 167929 144978 129481 109263 109958 170712 168849
14946 168849 189751 175839 218673 262312 245219 288363 320444 357479 377509 306851 155667
14935 155667 101068 156982 194256 142262 215643 257355 241501 192782 218895 138872 86250
14924 86250 97745 175821 241477 279611 298617 236195 201340 192067 132685 143376 156165 126899
14912 126899 129618 128792 178767 121664 117647 135630 125420 100887 105081 127207 150304 117425
14900 117425 92374 105580 157607 248798 269620 245092 163216 129063 147169 124869 127987 112754
14888A12754J5040O676K9060R996J4077k994m7145L915k7307M496L3560j3299
14876A38829m364K2380o6785n3411L218N6274P4918J828o2286J6725J334K2828
14864A51488O4537j6064j0779N133Q511J0984j5699p1265j6906M2973L913n5343
14852A01483j2578K7189Q904K8587M1122J0674m0618r058L0955J4582O8667K3721
14840B93630M2017K9733l2656m4533k8639K914J2097n898L1864L0045p89L0027
14828C59812k5742l3143k5607n064O15j4696M685j0288J9225N636R2264K1548
14816C89245P606K5886N8314k6039o4434o6289k8452l9385J1717P952l9385j83
14804B36553K1309L7283K0939p2995J5825J2941P5976J7246J136O6833L6656K0477
$$ plain form
14888 112754 127794 134470 163530 173526 187603 184609 137464 141379 114072 118568 152128 138829
14876 138829 134465 156845 90060 36649 39867 96141 171059 172887 110601 127326 128660 151488
14864 151488 216025 199961 189182 194315 202826 213810 198111 126846 109940 152913 156826 101483
14852 101483 88905 116094 124998 153585 194707 205381 164763 155705 186660 201242 269909 293630
14840 293630 335647 365380 332724 288191 259552 262466 274563 268665 300529 330574 329785 359812
14828 359812 334070 300927 275320 270256 270871 256175 260860 250572 269797 275433 367697 389245
14816 389245 396851 422737 481051 455012 390578 324289 295837 256452 268169 276121 236736 236553
14804 236553 257862 295145 316084 243089 258914 271855 347831 365077 366213 433046 469702 490179
14792D90179j7153J1857P477j3790j4890O956J3923k1108j5277m237L0393O4396
14780E38726Q4135l0829l2532j1814k7486J2021j5727J4281K659n5172m8600L2325
14768D61987Q8136J4959J8227N6132K9890k214K9509J683k6407J3547j4751m1375
14756F29323K786N2015P2877K7767q8813J7056L9010K3202Q0447Q0299N3590K2279
14744A011838j6322k4749j077L8626N9948L1087J5358J4318R2319P8386K6413
14733A326145J4561j2981J05301N9980J32242J45798M7509J003J06002J98097
14723B123657K51809K75286J86113K46468M74982O51019M82135K92682K52043
14714E236194L64545O36761J008617J690867K445156L441486N007764Q029156
$$ plain form
14792 490179 473026 484883 492360 478570 463680 470636 484559 463451 448174 443937 474330 538726
14780 538726 622861 592032 559500 547686 520200 532221 516494 530775 533434 478262 429662 461987
14768 461987 550123 565082 583309 639441 669331 667117 696626 698309 671902 685449 670698 629323
14756 629323 632109 684124 757001 784768 695955 713011 752021 775223 855670 935969 989559 1011838
14744 1011838 995516 970767 969690 1008316 1068264 1099351 1114709 1129027 1221346 1299732 1326145
14733 1326145 1340706 1327725 1433026 1493006 1625248 1771046 1818555 1819558 1925560 2123657
14723 2123657 2375466 2650752 2836865 3083333 3558315 4209334 4691469 4984151 5236194
14714 5236194 5600739 6237500 7246117 8936984 11382140 14823626 19831390 27860546
14706B7860546J3241936K1116697L0712483K9607822K41279k8307861k9844456
14699F4628446j8497681j0158550n763962l250220j359410P5668J616625L482430
14691C0773346N967930R527874J5639240K6120495M2243060O3585791O6814343
14684B60672079N773011o3578845p1460820m4334406k3855477j3368851p912053
14677D1934638m889403l056014j510993K55997K049981M328674P655113J2531236
14669E9299229J9547066K8696625L1031301M427616l0352172l7244802k4730618
14662E0674245j3809068p971073n057955l573601k693795k046462j532084j001365
14654A2988842o58532m90683m71400o42049r70503j130017r75982q00357o53362
$$ plain form
14706 27860546 41102482 62219179 92931662 122539484 122780763 94472902 64628446
14699 64628446 46130765 35972215 30208253 26958033 25598623 25674291 27290916 30773346
14691 30773346 36741276 46269150 61908390 88028885 130271945 193857736 260672079
14684 260672079 266445090 202866245 131405425 87071019 63215542 49846691 41934638
14677 41934638 37045235 33989221 32478228 32734225 34784206 39112880 46767993 59299229
14669 59299229 78846295 107542920 138574221 143001837 112649665 75404863 50674245
14662 50674245 36865177 28894104 23836149 20262548 17568753 15522291 13990207 12988842
14654 12988842 12330310 11839627 11368227 10726178 9755675 8625658 7649676 6849319 6195957
14645F195957m71130k69943k37614l46681m74254n18421m13491l62755l30340
14636B771328k25841k17968j82182j18751m7684j0351j4679k2382r5539j15370
14626A720581q9999k3662j64775j99640j19197k1577o2102l8530r343m5737j7640
14615I28379j1527k5899r6156j7504J4542j24422l6801o5698m0287L1518n1062
14604E05083J0442j0959P3379J00095J12705K2285l8320j16574j17396j00913
14594D39827j01409j1890K7720N9298l1341j01399l0791P4396Q4601M9620J5243
14583D73875o1231M4985N3997J0022j8774p6750m7815j3576j9513M3715M9347
14572D38282J38564K11157J79947O9297m9402j68843k08221j64848l5999L1385
$$ plain form
14645 6195957 5724827 5454884 5217270 4870589 4396335 3877914 3464423 3101668 2771328
14636 2771328 2545487 2327519 2145337 2026586 1978902 1968551 1953872 1931490 1835951 1720581
14626 1720581 1630582 1606920 1442145 1242505 1123308 1101731 1039629 1001099 991756 946019 928379
14615 928379 916852 890953 794797 777293 791835 667413 630612 564914 524627 556145 505083
14604 505083 515525 504566 577945 678040 790745 813030 774710 658136 540740 439827
14594 439827 338418 326528 354248 413546 382205 280806 250015 324411 409012 458632 473875
14583 473875 412644 457629 511626 521648 502874 426124 378309 364733 345220 388935 438282
14572 438282 576846 788003 967950 1037247 987845 819002 610781 445933 409934 441319
14562D41319r767m5307k1353r913j4146L8686j4911K8151J27663J09781J26437
14551G56640O4879p7539j82331j32726l4369m6948q180l1353n7479M2623K1537
14540C14754k5220o3435q4706K8376J0513j095j3307l4319m4053r608M4104N3321
14528A75325M3854j916M4711l3008l070M3703K7248J321l6676k701J2845j5804
14516B55832l7836j0576j2887j1359m8896L267J04755J8634j0887m6097L3568
14505B37518O665k6533k2951l9563j16934j989M8729N1759N8983M8981l7031r4396
14493A13238Q640M2974l47r0081p6995j461Q1921N217j1202J2032m8987n7699
14481b2750L0164J4197J8337q582l0890n561Q6606N6932K5079M514q2817l1607
$$ plain form
14562 441319 431552 386245 364892 354979 340833 379519 364608 392759 520422 630203 756640
14551 756640 821519 743980 561649 428923 394554 347606 339426 308073 250594 293217 314754
14540 314754 289534 226099 141393 169769 180282 179187 165880 131561 87508 77900 122004 175325
14528 175325 219179 217263 261974 228966 225896 269599 296847 298168 261492 258791 271636 255832
14516 255832 217996 207420 194533 183174 134278 137545 242300 260934 250047 203950 237518
14505 237518 244183 217650 194699 155136 38202 36213 84942 136701 195684 244665 207634 113238
14493 113238 121878 164852 164505 74424 -2571 -4032 77889 83106 71904 83936 34949 -22750
14481 -22750 7414 21611 39948 31366 476 -5085 81521 138453 163532 168046 85229 53622
14469E3622k2811m0627N9168J271L16k283m6200P214J2858O810K9286q968L311
14456E2967P6695N1380o4221q0206k0720K0237J5157M9157j5503K4637M9245M4650
14444B03475m6094k7270j1876k9379J5048O1052M0811K4100j1094j2955Q730j6033
14432A98515K0307J2659k0698J28o0309J7347K2486j082m7469L1394R1853l7585
14420B27546j1628p68L5620J8352N3332m3501p190l2501o3711O6540L1826k5527
14408B48390l36J8889J03320J33306J71554K66134M55253N55275K43532l15475
14398A879842m89035l93311k23026j55396n7446o3481k4884J0002o856p1438j9367
14387C85604P7138P0798J16083J95127L34324M27306M05989J95109k02738m75186
$$ plain form
14469 53622 30811 -9816 49352 50623 50939 48656 2456 9670 22528 29338 58624 49656 52967
14456 52967 129662 181042 116821 36615 15895 36132 51289 100446 84943 109580 158825 203475
14444 203475 157381 130111 118235 88856 103904 164956 205767 229867 218773 205818 214548 198515
14432 198515 218822 231481 210783 210911 150602 167949 190435 189353 141884 173278 265131 227546
14420 227546 215918 215150 250770 269122 322454 278953 271763 239262 175551 242091 273917 248390
14408 248390 248054 266943 370263 503569 675123 941257 1396510 1951785 2195317 1879842
14398 1879842 1390807 997496 774470 619074 561628 498147 473263 483265 476409 404971 385604
14387 385604 462742 533540 649623 844750 1179074 1606380 2012369 2207478 2004740 1529554
14377A529554l72393k26577r4088J16J20346K44322K71625M91698N79800p3197
14367B471206n38880n00778l22982k22124j40969j04943o2645q2782J1327Q9358
14357E95788p687l4572L5880P2675R0702K35087M74080O00262L89771q3040m65741
14346A903205m58716l37367j69838j13909p2093j31468j20217l1908k6854m1820
14336C99015k7394m619j3983j6973Q1662L3789L8378j655J2111n8169o2102J7297
14324C97357M2187l1390k8533j2281m5890J7281J3134j3905k3867L7940k0485
14313C31548L7595q439K2266r168l4667q0480N383k7148n723N9263N4003L1594
14301C76027l8349j09818l6212M6148L8969j5310j1238K1879J0499K8508K8495
$$ plain form
14377 1529554 1157161 930584 836496 836612 956958 1201280 1472905 1964603 2544403 2471206
14367 2471206 1932326 1431548 1108566 886442 745473 640530 577885 495103 506430 595788
14357 595788 588101 553529 589409 662084 752786 987873 1461953 2062215 2451986 2368946 1903205
14346 1903205 1444489 1107122 937284 823375 751282 619814 499597 467689 440835 399015
14336 399015 371621 367002 353019 336046 417708 451497 489875 488220 500331 442162 380060 397357
14324 397357 439544 408154 379621 367340 321450 338731 351865 337960 314093 352033 331548
14313 331548 369143 360704 382970 373802 339135 258655 264038 236890 231167 290430 344433 376027
14301 376027 337678 227860 191648 237796 276765 261455 250217 272096 282595 311103 339598
14290C39598k7222j3854K2642J1910m2163r985J3070K3260K3387N4127J1197K4768
14278D30735R8605N9336M5131P4450R148p802m34o5133j60786m2804j2841P471
14266D35076l3347k9974p6389R3737P9364j92r1087q6062o6396M6427J1723K6462
14254C09342l8999J9740J92118K18152J70847J52155L6506r3248j61868j93769
14244F10976q4650Q86L1860k4165L5346k839l4991j0251j834j0838l6868l485
14232D69147K2545N9415J773J5420J12594L7036L5782M0827N0114M4139o1344
14221H27448l9706j3019P362m1821k9295K61l4754J2491j031O3083J51098J60875
14209A062992J48497K8561j19515j46603n8716N571k2416P1722O6528L6601M6873
$$ plain form
14290 339598 312376 298522 321164 333074 290911 280926 293996 317256 340643 394770 405967 430735
14278 430735 529340 588676 633807 708257 717405 709603 709169 644036 483250 440446 427605 435076
14266 435076 401729 371755 295366 389103 468467 468275 377188 291126 224730 271157 282880 309342
14254 309342 270343 290083 482201 700353 871200 1023355 1059861 966613 804745 610976
14244 610976 526326 527212 559072 534907 570253 567414 532423 522172 520338 509500 472632 469147
14232 469147 491692 551107 552880 568300 680894 717930 753712 794539 844653 888792 827448
14221 827448 787742 774723 782085 740264 710969 711230 676476 688967 687936 751019 902117 1062992
14209 1062992 1211489 1240050 1120535 973932 915216 920787 898371 970093 1036621 1073222 1120095
14198A120095M3839R8796N5234J13642K36141K26646J75014R4874o811j48999
14188B008471j10440k512J48446K53993K46207K85079K94199R5978R7909J44079
14178C461409K51579M49574O86723Q50217P90065Q27228J341816K128424L399904
14169A4186939N240350Q386403J3502784K1249132L1062620K8931071k522745
14162A20036554l0750114l0726266j8514849j0110011n817377l567204k088872
14155A8461861q94094J57292J221937K583481M584113P659228J2409674J9827243
14147F6010735K8750303K4415541o600597l0808861k8493368j6899136r469413
14140B6905204n715564l826705k689330j895854j322829r99112q00613n00440
$$ plain form
14198 1120095 1163934 1262730 1317964 1431606 1667747 1894393 2069407 2164281 2157470 2008471
14188 2008471 1898031 1895519 2043965 2297958 2544165 2829244 3123443 3219421 3317330 3461409
14178 3461409 3712988 4162562 4849285 5699502 6489567 7316795 8658611 10787035 14186939
14169 14186939 19427289 27813692 41316476 62565608 93628228 122559299 120036554
14162 120036554 89286440 58560174 40045325 29935314 24117937 20550733 18461861
14155 18461861 17567767 17725059 18946996 21530477 26114590 33773818 46183492 66010735
14147 66010735 94761038 119176579 112575982 81767121 53273753 36374617 26905204
14140 26905204 21189640 17362935 14673605 12777751 11454922 10455810 9655197 9154757
14132I154757m75754n98607o46583n03368l70097l73618n41437n67476m23299
14123D654518k50302k47486k36853j20624q2106o5606j68773k06736o8118k5261
14113C182653J09988J65259Q1792P8542J92129L03741K73869L1945k6212J31044
14103D524750K10496L07595N04805P74497J004683J402616K103586L012162M516407
14094A8361597O954683J0989006J7484197K7350099L9098691L4159513n740100
14087A48657686l8947760l7572042k2624963j2426156p174083m357339k473763
14080B3081580j048886K60541J766446L552699O171999J0116582J6331451K5753363
14072H5985775L6334183K8708694j0526516l8985978l5107431k0876964j1832237
$$ plain form
14132 9154757 8679003 8080396 7433813 6930445 6560348 6186730 5645293 5077817 4654518
14123 4654518 4404216 4156730 3919877 3799253 3717147 3651541 3482768 3276032 3207914 3182653
14113 3182653 3292641 3457900 3539692 3618234 3810363 4114104 4387973 4419918 4393706 4524750
14103 4524750 4735246 5042841 5547646 6322143 7326826 8729442 10833028 13845190 18361597
14094 18361597 25316280 36305286 53789483 81139582 120238273 154397786 148657686
14087 148657686 109709926 72137884 49512921 37086765 29912682 25555343 23081580
14080 23081580 22032694 22293235 24059681 27612380 33784379 43900961 60232412 85985775
14072 85985775 122319958 151028652 140502136 101516158 66408727 45531763 33699526
14065C3699526p312477m884398l377756k352922j654751j347315j015727p11856
14057A1042324p21019p94316o83556o51552n98920o16441p91228p70878n63488
14048D850926m69546m04585l13850k40376j57307j49656k73896k36114j76130
14039B429466l7963l6306q2255j65022k35416k22858j57191r6790q6711o3815
14029A245139p7927l8756n7143j5511n3016L2391L2654P0837R2154M5824J8267
14018A294913L2467k1539m9732j93572j91726j78421j15995o2151k4579j103q9921
14007C98641K8624R5720K8078K1068P8957O5710J15618J76475P2670j77126k37279
13996F67156j87683q7846k1777M480l1098o6288L7837M5654O4991N9299J4442
$$ plain form
14065 33699526 26387049 21502651 18124895 15771973 14117222 12769907 11754180 11042324
14057 11042324 10321305 9526989 8843433 8191881 7592961 6976520 6185292 5414414 4850926
14048 4850926 4381380 3976795 3662945 3422569 3265262 3115606 2841710 2605596 2429466
14039 2429466 2391503 2355197 2272942 2107920 1872504 1649646 1492455 1395665 1308954 1245139
14029 1245139 1167212 1128456 1071313 1055802 1002786 1035177 1067831 1138668 1230822 1276646 1294913
14018 1294913 1327380 1305841 1256109 1062537 870811 692390 576395 514244 489665 488562 398641
14007 398641 427265 522985 551063 572131 651088 716798 832416 1008891 1081561 904435 667156
13996 667156 479473 391627 369850 374330 343232 276944 314781 360435 425426 484725 499167
13985D99167n9100r8567o8314k5205O8349l7153m7541Q8K328n0837o2744K4394
13973A44865N9196O3726O1925J1188r2245j3772P4338K5947j8049Q270k9637l6976
13961B58776n2608r9440k6693M8922L036l8334J3045L3416j9142L7047J2610P567
13949A78202K9827K8448Q9443J41031J30426O9753M6137o4272j97727p9609j3641
13938C58018j1986N2466o6364q0666J0388N5099l7154j6533M9919J01244J67068
13927E81499J73694P4564n9566j47493j23523o5826l0324o6723o8319L2447q418
13916B92012l3803j3054M0097J960o1012N2435N5159l1556m5844J8870q482p7273
13904A89509l0359J6283J4239m486L955j6847l1336O8593Q3579n3978p2408l3306
$$ plain form
13985 499167 440067 341500 273186 247981 316330 279177 231636 231724 234052 183215 120471 144865
13973 144865 204061 267787 329712 340900 248655 234883 309221 335168 317119 325389 295752 258776
13961 258776 206168 106728 80035 128957 131993 93659 106704 140120 120978 158025 170635 178202
13949 178202 208029 236477 325920 466951 597377 667130 713267 648995 451268 371659 358018
13938 358018 346032 398498 332134 251468 261856 316955 279801 263268 313187 414431 581499
13927 581499 755193 829757 770191 622698 499175 433349 403025 336302 267983 300430 292012
13916 292012 258209 245155 285252 287212 226200 278635 333794 302238 256394 275264 266782 189509
13904 189509 159150 175433 189672 185186 189141 172294 140958 209551 293130 239152 166744 133438
13892A33438l6211l7894m0024r033L0013L2727l2180M4977k867l423r383J6546
13880H6686M3981K6185l3077n3199k295m6558K8808L7152Q8475n397p2489K0888
13868A19160j541n0736m4308P2198N7992M1777j4369m8159n013M73k641J4176
13856A39009k8526n3810P8169m4632n1268J1459K8707K7690n789N42k9886j01444
13844b9779l819N2233N2917N1254M190n5979L035J0315N0337L7869M007m4765
13832A31815n8152O6417l4870k5761J7524L8333J0841M7155L1842K4628K0035
13821B69807p6824k3643Q528n080j990L6040k958P108j769n1629k2333L2585K6911
13808A94753m4064n7316M375N1013K3220p736o3006N8174Q0338K5292n1199q199
$$ plain form
13892 133438 97227 59333 19309 10276 40289 73016 40836 85813 82946 79523 70140 86686
13880 86686 130667 156852 123775 70576 68281 21723 50531 87683 176158 170761 98272 119160
13868 119160 117619 66883 22575 94773 152765 194542 180173 132014 127001 127474 124833 139009
13856 139009 110483 56673 134842 90210 38942 50401 79108 106798 101009 101551 71665 -29779
13844 -29779 -33598 18635 71552 122806 126996 71017 74052 84367 134704 172573 176580 131815
13832 131815 73663 140080 105210 79449 96973 135306 146147 193302 225144 249772 269807
13821 269807 192983 169340 177868 172788 170798 206838 203880 210988 209219 157590 135257 167842 194753
13808 194753 150689 93373 97748 148761 171981 164245 101239 159413 239751 265043 213844 205645
13796B05645M6353n3071n1795j8580m8451K1028K7331o6885J5347J1336N431p142
13784H6547l666J9299m696j7017N536j944M6173N9013N9113J1640N085L4852m9031
13771B50904o1722J0461r949m328l3385k7491M3010L7229o100J72J07190j9424
13759B86567m0373l5100j897j3117J5248J9375l7097l4636L888j9325j0660N3985
13747A86858k044J9673O9540J9222l6293k3455M6553N7223N607p9410p9567J1696
13735A95603k8734j8211J4910k2973M2147N823O273j4179l0804p640r097L891
13723A37009K5353L7258J2892N1110K7711O3115J1681k3260K4632M7137Q6187
13712E00825P5092P8907K4736j79857j30508n3715j2528k1621j8295M6765L1887
$$ plain form
13796 205645 251998 198927 147132 128552 80101 101129 128460 61575 76922 88258 93689 86547
13784 86547 82881 102180 97484 80467 86003 84059 130232 189245 248358 259998 265083 299935 250904
13771 250904 189182 199643 189694 185366 151981 124490 167500 204729 198629 198801 305991 286567
13759 286567 246194 211094 209197 196080 211328 230703 193606 158970 162858 143533 132873 186858
13747 186858 184814 204487 274027 293249 256956 233501 280054 337277 342884 263474 183907 195603
13735 195603 166869 148658 163568 140595 182742 188565 194838 180659 149855 142215 133118 137009
13723 137009 162362 199620 212512 263622 291333 354448 366129 342869 367501 414638 500825
13712 500825 575917 654824 679560 499703 369195 315480 302952 281331 263036 309801 341688
13701C41688L780J5115J7882K4252j7569K085N3694O8231P8634J52807J31389
13690H71988k0141j22264k02753m2591L2252R364m5265q3771j6137R8741J9246
13679D98669K0383J51030J76912L0844r3764j24397k6611k7390m7291L781P5144
13668F37310J9420p0547o3264K645K2284L5742L7113O4255J00207J20235O9046
13657I74446r6012j70003q0039l8740m970J8505J2794M2720J0123k3522J2605
13646F57907M9970P0778J00581K39359K88018M31278P22556Q34619N69001k17081
13636C746986q03532p57640n34353k95253r9939j4609n2429q197j5116M7629J03604
13625A317151P8617J32076J85516L68947N93043Q32325J094553J019812M90997
$$ plain form
13701 341688 345468 360583 378465 402717 385148 387233 440927 509158 587792 740599 871988
13690 871988 851847 729583 526830 484239 516491 525855 480590 396819 380682 479423 498669
13679 498669 519052 670082 846994 877838 784074 659677 633066 605676 558385 562166 637310
13668 637310 656730 586183 522919 525564 547848 583590 620703 684958 785165 905400 974446
13657 974446 878434 708431 628392 589652 584682 603187 615981 658701 668824 645302 657907
13646 657907 707877 778655 879236 1118595 1406613 1837891 2560447 3395066 3964067 3746986
13636 3746986 2943454 2185814 1651461 1356208 1256269 1241660 1189231 1181034 1165918 1213547 1317151
13625 1317151 1395768 1527844 1713360 2082307 2675350 3507675 4602228 5622040 6113037
13616F113037L8806m36306r98833j160287q79504m94130k98207j96231j02208
13607A586137o1043j7686L6238J34485K09779J99376m0516k54757k60630q4652
13597A446731q8992R114j5696m7322n0738L7086J20436Q1607J61647L12974N34488
13586B501335P16495R13582O97531j35505p74722q22284o22228l36817l5901P8369
13576B179855N9656K1717P9133J84733K79428L48144M78080L01579p5597k72247
13566C584481l24130l26370k60883j50984J5160J58069J93020K44572J79925K47527
13556C560387K50111L24016L78240M38278O84291R93034J294761J747088K389673
13547A2059879L250318M740835O963804J0419560J6422124K5944503L7975852
$$ plain form
13616 6113037 6151843 5715537 4716704 3556417 2676913 2182783 1884576 1688345 1586137
13607 1586137 1525094 1507408 1543646 1678131 1887910 2087286 2046770 1792013 1531383 1446731
13597 1446731 1357739 1366853 1351157 1303835 1253097 1290183 1410619 1492226 1653873 1966847 2501335
13586 2501335 3217830 4131412 4828943 4693438 3918716 3096432 2474204 2137387 2101486 2179855
13576 2179855 2239511 2261228 2340361 2525094 2804522 3152666 3630746 3932325 3856728 3584481
13566 3584481 3260351 2933981 2673098 2522114 2537274 2695343 2888363 3132935 3312860 3560387
13556 3560387 3810498 4134514 4512754 4951032 5635323 6628357 7923118 9670206 12059879
13547 12059879 15310197 20051032 27014836 37434396 53856520 79801023 117776875
13540A17776875L4821686n613764l9365315l7369259k2052032j1843317o382624
13533B9972250l604861k345040j294218j43633J175014K867689M958417P816371
13525C9401989J2878717K1269812L3069313L8345667Q130435l3301896m1127505
13518G8666532k6445863j4476459q135159m851664l245180k573742k159547j789997
13510A4988921j387605j010984q52979r48956j019889r62988q39933p55967o96631
13501F512989n64455l43329k92781j84197j45992M7734L2049j65061k80313l28822
13491D287822l14197l31651k07941j78089j07021K374M2049J38790R1012O7056
13481C490204J12094J49068K56691L88953N13387P03517R38460J294015J665573
$$ plain form
13540 117776875 152598561 146984797 107619482 70250223 48198191 36354874 29972250
13533 29972250 26367389 24022349 22728131 22584498 23759512 26627201 31585618 39401989
13525 39401989 52280706 73550518 106619831 144965498 153095933 119794037 78666532
13518 78666532 52220669 37744210 29609051 24757387 21512207 18938465 16778918 14988921
13510 14988921 13601316 12590332 11737353 10788397 9768508 8805520 7965587 7209620 6512989
13501 6512989 5948534 5605205 5312424 5128227 4982235 5029969 5062018 4896957 4616644 4287822
13491 4287822 3973625 3641974 3434033 3255944 3148923 3151297 3193346 3332136 3423148 3490204
13481 3490204 3602298 3751366 4008057 4397010 4910397 5613914 6552374 7846389 9511962
13472I511962K298163L445459N159520P962721J3230176K1382356L1618838K8290806
13464A22900001o459039l3040971k9721338j7008845q875269m735142k619742
13457B0439655j599639q40560J20301R76846K119393L799499O233851J0457195
13449D1706541J7214825K6746435L0515402M656285k7853092l2611259k0465576
13442C9909561j1072439o085562l717262k530359k096308j775892j456097j140510
13434A0035132p79310n78599o52168p90973p81895o92691n64046m64767l83313
13425D347370l93426k65184k31176r3323o7731n5305j74880l09239k60743j67018
13415B329345n8784o8261r5409j17624j30982k04917j62117j31203m3244J16287
$$ plain form
13472 9511962 11810125 15255584 20415104 28377825 41608001 62990357 94609195 122900001
13464 122900001 116440962 83399991 53678653 36669808 27794539 23059397 20439655
13457 20439655 18840016 17999456 18119757 19096603 21215996 25015495 31249346 41706541
13449 41706541 58921366 85667801 116183203 120839488 92986396 60375137 39909561
13442 39909561 28837122 22751560 19034298 16503939 14407631 12631739 11175642 10035132
13434 10035132 9255822 8677223 8025055 7234082 6452187 5759496 5195450 4730683 4347370
13425 4347370 3953944 3688760 3457584 3364261 3296530 3241225 3066345 2757106 2496363 2329345
13415 2329345 2270561 2202300 2106891 1989267 1858285 1653368 1491251 1360048 1316804 1433091
13405A433091J61325R9756q3668j92165k10959k23083r5972N242j0282o3193r6435
13394G23657J9699q974p1405l2762m7032j06659p3883k4240p016L5148K7377K7013
13382D60923K7979R5102N9055j2736n171p122N8780q5068o8736n7140k6768M4521
13370D83619R1904J46681J52497M0358m4759p8452j20477l225J40545J89291J38390
13359A136372n1072j14975j76851j55377n0689q2477q3947l2435m8406r9487K4222
13348B64878K418j0432q5016o9074j07340l6584L9027M5085O9703J4359K4163
13337A51187M7659J41344K946r9947m7233K6226m723q7837k0443O4400k6587K6487
13325A73479Q8479M1245J0370j5167p9240k5046R977K2124Q6q7P2131j799o5665
$$ plain form
13405 1433091 1594416 1694172 1610504 1418339 1207380 984297 888325 893567 883285 820092 723657
13394 723657 743356 734382 662977 630215 583183 476524 402641 378401 371385 406533 433910 460923
13382 460923 488902 584004 643059 630323 625152 618030 676810 591742 523006 465866 439098 483619
13370 483619 575523 722204 874701 915059 870300 791848 671371 668146 808691 997982 1136372
13359 1136372 1085300 970325 793474 638097 587408 504931 420984 388549 340143 240656 264878
13348 264878 267296 256864 171848 102774 -4566 -41150 -2123 42962 112665 127024 151187
13337 151187 198846 340190 343136 243189 195956 222182 217459 129622 109179 173579 146992 173479
13325 173479 261958 303203 313573 298406 219166 194120 204097 226221 226307 226220 298351 296552 230887
13312B30887j2554m4624m1413M09k8851r91o4965l4271K3850P8213J0810J8299
13300A34799K2757l6495r8150r316N216K1730J0350J2394j8902J6003K9852K4415
13288A14653N6244l530L5312M4124J2845n7502j1167j9631n6636m6597k898M722
13276F9939M850k3156k0265m2124O069Q820J1685l2764K1868J56k6804j03362
13264a25088n433L0452O187O5082M5790k7100m6505j0337j2493n9665M0030O4111
13252c4969K001M3483j8030j2031k5009j7751N691N854N5713J02804N8180o2025
13240A03911m2866m36j5968m3451k197l325k8210J37P065l1628j5738L7315J0707
13227b4684N4001M8864N069P831m7920l8240o313L6599M7193j9532p2982M295
$$ plain form
13312 230887 218333 173709 132296 132705 103854 102863 37898 3627 27477 105690 116500 134799
13300 134799 157556 121061 22911 13595 18811 40541 50891 63285 44383 60386 90238 114653
13288 114653 170897 167367 202679 246803 259648 202146 190979 171348 114712 68115 65217 69939
13276 69939 74789 51633 31368 -10756 -4687 4133 15818 -16946 4922 5078 -21726 -125088
13264 -125088 -130521 -100069 -93882 -28800 16990 -10110 -56615 -66952 -79445 -139110 -99080 -34969
13252 -34969 -32968 10515 -7515 -19546 -44555 -62306 -56615 -50761 4952 107756 165936 103911
13240 103911 61045 60609 44641 1190 -1007 -4332 -32542 -32405 -25340 -56968 -72706 -35391 -24684
13227 -24684 29317 78181 83250 91081 43161 4921 -1392 35207 82400 62868 -10114 -5819
13215e819N0937j5160l9024J7318k1045J608M7993J0438p1127l0893M7975R504
13203B705j3182J6059L69M592M7861J7878k3136k9763p2281j212j3191R882R1873
13190C8454j5495J3212N640n085o8995m834J150N0850O9831j070K9647L0031K543
13177A45879m7566n8644k4460o083L943O683m6827M3136K8739j3524j6995j4900
13165f19L3701k8934m5158j88j6714J1397K6289j4383j1834l5802K9925K6491
13153b5829j8247K99j6532k5549p814M0329K5754k1039m7204J2591N2387O0378
13141B9524p133l2334o1988n9603N2141O2288o035j945K5319M501K2078k5050
13129A763k8379q485N1499J4436m9747o472M010R745O992J2970O343k9129Q677
$$ plain form
13215 -5819 45118 29958 -9066 8252 -12793 -11185 36808 47246 -23881 -54774 -6799 2705
13203 2705 -10477 5582 5951 10543 58404 76282 53146 23383 -48898 -50110 -63301 -53419 38454
13190 38454 22959 36171 41811 36726 -32269 -37103 -35953 14897 84728 83658 113305 143336 145879
13177 145879 98313 39669 15209 9126 13069 19752 -27075 16061 44800 31276 14281 -619
13165 -619 33082 4148 -41010 -41198 -57912 -46515 -20226 -34609 -46443 -82245 -52320 -25829
13153 -25829 -44076 -43777 -60309 -85858 -93672 -53343 -27589 -48628 -95832 -83241 -30854 29524
13141 29524 22391 -9943 -71931 -131534 -79393 -17105 -23140 -25085 234 4735 26813 1763
13129 1763 -26616 -35101 16398 30834 -18913 -25385 -21375 -11630 -4638 8332 14675 -14454 -5777
13116e777M0391K6927n1767k6749j9505k9077m208N065M6699L4596l2952n3455
13104f9812k2241O5071j4842k9278m5077M4943J9033k2193J5086K7316r6595o5086
13092a93675L8070N8669L7867K5539K8888j8816M3263j9880n5118j6055Q674J8139
13080d4435N26M0753K7867L227k4269N1L0192j3292k5297P0478j2430p7871l7194
13067f1694K5229M3401J1166l1033k5438M3504J5187K8296O6370J25181J22150
13056C62319J28753J26013M6481j33273j33645j19508m6350p5465n2759o812K3956
13045A19710L646K1237j143j754R7435P7380N1961J10270J14910q120q2619j19307
13033C83606p0943l4840k3360K4439J9157q9176j01867L7071K6529l0888q5052
$$ plain form
13116 -5777 34614 61541 9774 -16975 -36480 -65557 -69765 -64700 -18001 16595 -16357 -69812
13104 -69812 -92053 -26982 -41824 -71102 -116179 -71236 -52203 -74396 -59310 -31994 -128589 -193675
13092 -193675 -155605 -96936 -59069 -33530 -4642 -23458 19805 -75 -55193 -71248 -62574 -44435
13080 -44435 -43909 -3156 24711 27938 3669 3720 33912 20620 -4677 65801 53371 -24500 -61694
13067 -61694 -36465 6936 18102 -12931 -38369 5135 20322 48618 114988 240169 362319
13056 362319 491072 617085 663566 530293 396648 277140 230790 155325 102566 95754 119710
13045 119710 123356 144593 143450 141696 239131 316511 368472 478742 593652 585532 502913 383606
13033 383606 312663 277823 254463 278902 298059 208883 107016 144087 170616 139728 54676
13022E4676j00144K5422P5961J8424j3014j7779k0338J1912j5463o3568M9309
13011E398R6588k3725o3157q775N516k6433N109j5864j4015J9488l5716j8138
12999g3724J2740M3438O0633M7243K4453j2614m9115n2316K9352Q663M7316k762
12987H3307m1916n0354M9958O7679M9453J04163J26075J05539R3138j09361j68956
12976C08725o6847o3758n221k2692M613O4303l0976m4751j6984m3484N5808M5153
12964A83889R0930J17503J28014R1138j03356j86807q7486j6347n5896q5573k7993
12953D8016r239l5379l2611j2359L1676L2013M6925K2977o728K6729p457N3652
12941A58215o3271m6774J9k599N6803n5995o2153l8559L9987k9674k2688K7599
$$ plain form
13022 54676 -45468 -20046 55915 74339 61325 43546 23208 35120 19657 -43911 5398
13011 5398 101986 78261 15104 6329 11845 -14588 -9479 -25343 -39358 -19870 -55586 -73724
12999 -73724 -60984 -17546 43087 90330 114783 102169 53054 738 30090 38753 86069 83307
12987 83307 41391 -8963 40995 108674 158127 262290 388365 493904 587042 477681 308725
12976 308725 241878 178120 172899 150207 154820 219123 188147 143396 126412 82928 138736 183889
12964 183889 274819 392322 520336 611474 508118 321311 233825 217478 161582 76009 48016
12953 48016 38777 3398 -29213 -41572 -9896 22117 69042 92019 85291 112020 104563 158215
12941 158215 94944 48170 48189 45590 102393 46398 -15755 -54314 -14327 -44001 -66689 -39090
12929c9090K1019Q54O6110J4439o7482o8582k7968J9523k505K8247N6902K727
12917D194K2390o2333k0382j0822M694J2263J4359N037R804K4392Q9393m0508
12905E2481m5707Q348R289L1543m6893J9442K9652m307J2274k3760m5620J7379
12893A4121m9212K2071j6558n9142m2652K1061M6725M4582L2427R194J5395j196
12881C6816n1199r4269k8352K0440P087j0443j6442M2654L5216J5017P7539L3012
12869F7076R850m0784j5069l4029p9954m224J2245J4671M086L1454J9431l1579
12857d6826k4228r094k506k3804L3067j1157n048O9188n052j8291J660q8n3048
12844i5227J3203L1546r341j4503o767O204L8447L2539L9041J1981j1338K0382
$$ plain form
12929 -39090 -18071 -17217 48893 63332 -4150 -72732 -100700 -81177 -83682 -55435 1467 4194
12917 4194 26584 -35749 -56131 -66953 -62259 -49996 -35637 -30600 -20796 3596 92989 52481
12905 52481 6774 15122 24411 55954 9061 28503 58155 53848 66122 42362 -3258 14121
12893 14121 -35091 -13020 -29578 -88720 -131372 -110311 -63586 -19004 13423 22617 38012 36816
12881 36816 -14383 -108652 -137004 -116564 -109477 -119920 -136362 -93708 -58492 -43475 34064 67076
12869 67076 76926 36142 21073 -12956 -92910 -97134 -84889 -70218 -66132 -34678 -15247 -46826
12857 -46826 -71054 -80148 -82654 -106458 -73391 -84548 -89596 -20408 -25460 -43751 -42091 -42179 -95227
12844 -95227 -82024 -50478 -59819 -74322 -81089 -74885 -36438 -3899 35142 47123 35785 56167
12832E6167k504m3365R14q3634j9553K7786O7182m083j6484O2580L519M3123m763
12819H6885l7141k6164k189R500k5459p013p445m6314n9581M5121L0474J3968
12807b5358k6394j5502M6195k8402L0810K772j2489l722j6505l9319J6157j503
12795g3260K5372O8774K3906l5986p3775l4889O019J05268J4824k7314m043k0158
12783b5262P40o7737m7395L6564L542K2454K8024k2117O184L0869J4515K4677
12771E058M6827K7968q7051m8817r392J2969k4301l2859n1139O679M7214K7903
12759g8941K1624Q462K6695J9787j4606Q294L5596m5627r633J2040J8385L8517
12747D0593k6922m0735J1133k5732m4566l2783J2093J87O3371O3786k2332k2l5522
$$ plain form
12832 56167 53663 10298 11212 -72422 -91975 -64189 2993 -1090 -17574 45006 48525 91648 86885
12819 86885 49744 23580 21391 30891 5432 -1581 -9026 -55340 -114921 -69800 -39326 -25358
12807 -25358 -51752 -67254 -21059 -49461 -18651 -15879 -28368 -32090 -48595 -87914 -71757 -73260
12795 -73260 -47888 20886 44792 8806 -64969 -99858 -93839 11429 26253 -1061 -5104 -25262
12783 -25262 -24522 -92259 -139654 -103090 -99548 -77094 -49070 -71187 -65003 -34134 -19619 5058
12771 5058 51885 79853 -7198 -56015 -65407 -52438 -76739 -109598 -160737 -154058 -106844 -78941
12759 -78941 -57317 -48855 -22160 -2373 -16979 -8685 26911 -18716 -28349 -16309 2076 40593
12747 40593 13671 -27064 -15931 -41663 -86229 -119012 -106919 -106732 -43361 20425 -1907 -1929 -37451
12734c7451j0127M4771M3924K4683n7434L9468K2259j8965M0827j5563n7757k2826
12722d191k455N1787K6099o3836q687j4323n0182j0818m5604k9858K4960N9923
12710f7185M6495j937J5659l879r451p652K9799J4452J952k8749p29R433O5874
12697F4082J7574j7439j3888m3257l4033P953O0875Q972k4700n606l5635m621
12685a9723j1032R159j121k2426j4522l6977K5040K6351m2036J2197J004L4808
12673c9278P470m0140L3024M4193J5982q3836L0970M7623L6096N3345M5508k1140
12661A29817m5603k1081r9631j03168Q6726O352k9462Q194L7134O716M7026j918
12649B1102l8322n326L0641N5320o3275o7253k381O2157J35181M2947j15706p2336
$$ plain form
12734 -37451 -47578 -2807 41117 65800 8366 47834 70093 51128 91955 76392 18635 -4191
12722 -4191 -6646 45141 71240 7404 -1283 -15606 -65788 -76606 -122210 -152068 -127108 -67185
12710 -67185 -20690 -22627 -6968 -10847 -20298 -27950 1849 16301 18253 -10496 -11225 -1792 64082
12697 64082 81656 64217 50329 7072 -26961 -19008 41867 50839 26139 20533 -15102 -19723
12685 -19723 -30755 -21596 -22717 -45143 -59665 -96642 -71602 -45251 -87287 -75090 -74086 -39278
12673 -39278 -31808 -71948 -38924 5269 21251 -62585 -31615 16008 52104 105449 150957 129817
12661 129817 84214 63133 -36498 -139666 -52940 -46588 -76050 -67856 -30722 -24006 23020 21102
12649 21102 -17220 -22546 8095 63415 140 -67113 -69494 -7337 127844 170791 55085 -17251
12637a7251O5403K4973m412L0443l0498p4680l8750k3139M5053Q282m8947k9207
12625i2730K5888k3494M9269J9569k5863J5321O1020L1136o1977L9681M756k0402
12613B2174N0640j7209Q384j6864m5467k0057K361M819P969k7214N5682J8927
12601D4145k301j3474l5674K1554Q628p4467k1605r960J0407M3713M7745l5803
12589a7092q01J2007l574M8685J5384o263q789k4371n7337j7734M3856N4262r421
12576B8812J6085j4520K4042k0605j180q768j2694j9776j5279m5760j1789j2755
12564i4187M8101P0713M5536M1165O731m9370q3232L834R6269N4604p9725m6840
12552A3599j9872l1523m0532J7355j5478M9965N9771k4061j1836J9561Q189j2323
$$ plain form
12637 -17251 48152 73125 68713 99156 68658 -6022 -44772 -67911 -22858 -14576 -63523 -92730
12625 -92730 -66842 -90336 -41067 -21498 -47361 -32040 28980 60116 -1861 37820 42576 22174
12613 22174 72814 55605 63989 47125 1658 -18399 -16038 -11219 -3250 -30464 25218 44145
12601 44145 41844 28370 -7304 14250 22878 -51589 -73194 -83154 -72747 -29034 18711 -17092
12589 -17092 -17893 -5886 -9460 39225 54609 48346 39557 15186 -42151 -59885 -16029 38233 28812
12576 28812 44897 30377 54419 33814 32634 23866 11172 -8604 -23883 -69643 -81432 -94187
12564 -94187 -46086 24627 70163 111328 118059 68689 -14543 -10709 85560 140164 60439 13599
12552 13599 -6273 -37796 -78328 -60973 -76451 -26486 33285 9224 -2612 16949 25138 12815
12540A2815j1078N640J7003k970M489l7766L0129J9722m4833J1118m3777m5501
12528h5009P4838k1510J92l2752L3722m1322p0979j2627N8566L0469J9173m679
12516e1918l3204M7042L7990M654k0460l8421L9901R569K1092j5857n0564K2261
12504b7915l6693n0104j1110j154N6768L9546N0949k7651K171j5802m2054L5491
12492b7558M6088P0720K664l9488k2710j8900J7644J3997J0632l6831j8251M9033
12480D7040L3671m7258j4583j7814j6890L1874O179l186k8389o5969k547L7287
12468d0585J8222m2652k5969K5062j3648j1262K8830O4436l8364n695N6711k1713
12456f627k3167M4743K9680l0783m0571Q903J1164K6782k776m5032J4460M1459
$$ plain form
12540 12815 1737 7377 24380 21410 25899 -11867 18262 37984 -6849 4269 -39508 -85009
12528 -85009 -10171 -31681 -31489 -64241 -30519 -71841 -142820 -155447 -96881 -66412 -47239 -51918
12516 -51918 -85122 -38080 -90 4564 -15896 -54317 -14416 -4847 16245 388 -50176 -27915
12504 -27915 -64608 -114712 -125822 -126976 -70208 -30662 20287 -7364 -5193 -20995 -63049 -27558
12492 -27558 18530 89250 91914 52426 29716 10816 28460 42457 53089 16258 -1993 47040
12480 47040 80711 33453 18870 1056 -15834 16040 22219 19033 -9356 -75325 -77872 -40585
12468 -40585 -22363 -65015 -90984 -65922 -79570 -90832 -62002 2434 -35930 -41625 15086 -6627
12456 -6627 -29794 14949 44629 13846 -26725 -17822 -6658 20124 17348 -27684 -13224 28235
12444B8235k3618K5094o974o7699n9138M7106O0360O8357k7156k3084m0503m5292
12432f4312N694j8107k4562J3496K0214O3087O4133N0967k7083l7018j8640M0677
12420F8546k5159o0536j0595O2145J7028j273k7749j9267l2669o4785J8635M3431
12408c2248M0798o1118k4069M9502L9512j8730k440O010j3844j9217N6013m3684
12396b3515q390R4403K3707k8205n9060m0014J9711J6134l7232m0740m1937L4036
12384i1102o719J1996M0418J3319O5703R711o8196K4J5098L4062O177n7741j7543
12371d4793K2149N8639m2575m696l3579L453M2871K0004L5587L8077n1836j8600
12359B4701K0567r533l8635o5456k5547M3689O4072j3809m8350k3632R105k5274
$$ plain form
12444 28235 4617 29711 22737 -44962 -104100 -56994 3366 71723 44567 21483 -19020 -64312
12432 -64312 -58618 -76725 -101287 -87791 -67577 -4490 59643 110610 83527 46509 27869 68546
12420 68546 43387 -17149 -27744 34401 51429 50156 22407 3140 -29529 -94314 -75679 -32248
12408 -32248 8550 -52568 -76637 -27135 12377 -6353 -8793 -2783 -16627 -35844 20169 -23515
12396 -23515 -31905 62498 86205 58000 -1060 -41074 -21363 -5229 -42461 -83201 -125138 -91102
12384 -91102 -97821 -85825 -45407 -32088 33615 43326 -24870 -24846 -9748 24314 30491 -27250 -44793
12371 -44793 -22644 35995 -6580 -11276 -44855 -41402 1469 21473 57060 95137 43301 24701
12359 24701 45268 35735 -2900 -68356 -93903 -50214 13858 49 -48301 -71933 -62828 -88102
12347h8102k1255P453P9307K3863n9343l003L7307m1251L978l370j6308R815O104
12334f4805M082K0095M2153L7924K5640l1822o1017j5450j6307M855l9109m3700
12322a37461K1903Q567M0259O0112J01655M8315l7738k4751M9003n9897j15372
12311d5405j7934K7170R1061m6750o2003j3683N4464J6441j3744R28M0272m6204
12299a5387l5987Q8334k0907r6605J4329J9632J1696j9895J6660K7001m5913j778
12287e8820J2603j988K4577L8292l5338l1346K3331K2900k1606m1397n9180k0268
12275a48240L3156J4072l0214k2570k6430M76Q354R4196N3601L654O691j278Q0787
12262F6255R408n1683q7594q129j3694n4035k0444J7427n2137K2289Q2127N9860
$$ plain form
12347 -88102 -109357 -101904 -22597 1266 -58077 -61080 -23773 -65024 -61046 -64416 -80724 -70909 -64805
12334 -64805 -60723 -40628 1525 39449 65089 33267 -27750 -43200 -59507 -54652 -93761 -137461
12322 -137461 -115558 -106991 -66732 -6620 95035 143350 105612 80861 129864 69967 -45405
12311 -45405 -63339 -36169 54892 8142 -53861 -67544 -13080 3361 -10383 -9455 30817 -15387
12299 -15387 -51374 36960 16053 -80552 -66223 -46591 -34895 -54790 -38130 -11129 -57042 -58820
12287 -58820 -46217 -48205 -23628 14664 -20674 -52020 -28689 -5789 -27395 -68792 -127972 -148240
12275 -148240 -115084 -101012 -131226 -153796 -180226 -179750 -171396 -77200 -23599 -19945 -13254 -14532 66255
12262 66255 75663 23980 -63614 -71743 -85437 -139472 -159916 -142489 -194626 -172337 -90210 -30350
12250c0350J1380P170l0564k3531l7205K2067l234N1029L8955j5060j2772o8102
12238i0217p8626L8630K8474O5856N1432K294J2476R683N583j7542k1907l5722
12226b9586M5594K2846K508r817m9224N6127M152n7897L1625K0262M8775n3951
12214C1414k5663L3928J165j01801J0267k645n5310n7160M2869O8989L4016J6669
12202c262M0596R844K2022K6422j7437m4742m4333K013L7767J239Q246j0205K454
12189C0624K3386K2658M1716M2029l5895l2407p1899l4918N3540L7489j5104j548
12177E9671n6943l4052O4025k8493n4687M3995J8872L0886m2413K3907j1715j2263
12165G90M5461P875j0045n8940l47J7371J1731m4910P143p130O745k4949k4044
$$ plain form
12250 -30350 -18970 -11800 -42364 -65895 -103100 -81033 -84267 -33238 5717 -9343 -22115 -90217
12238 -90217 -168843 -130213 -101739 -35883 15549 17843 30319 40002 45585 28043 6136 -29586
12226 -29586 16008 38854 41362 31545 -17679 38448 42600 -15297 16328 36590 85365 31414
12214 31414 5751 39679 40844 -60957 -50690 -53335 -108645 -165805 -122936 -53947 -19931 -3262
12202 -3262 37334 47178 69200 95622 78185 33443 -10890 -8877 28890 30129 38375 28170 30624
12189 30624 54010 76668 118384 160413 124518 92111 20212 -14706 38834 76323 61219 59671
12177 59671 2728 -31324 32701 4208 -50479 -6484 12388 43274 861 24768 13053 790
12165 790 46251 54126 44081 -14859 -15206 2165 13896 -31014 -23871 -31001 -24256 -49205 -73249
12152g3249J5345J9301L679K8237K0846M6533P706L3727o873n0272q8824k0306
12140f4150J7931n2043J6529J486K8165j6005N3126K2122j4163o735J7626L9402
12128D3291L7498J8936j3623k6198m2034n5842N466m9344j1731K1627M2032K3013
12116f909j6944J8839M0607r13R986k4269K0736L0525p575l3245j4362R1531K3558
12103A31565k140m8601q5725n318j9220K2239O704r347J1707J8911K5048O301
12091E2124J658j7806m8012l5258M5084J0427m0020l3405N9536M0464L1800k3248
$$ plain form
12152 -73249 -57904 -38603 -34924 -6687 14159 60692 68398 102125 95252 44980 -43844 -64150
12140 -64150 -46219 -98262 -81733 -80247 -52082 -68087 -14961 7161 -7002 -13737 3889 43291
12128 43291 80789 99725 86102 59904 17870 -37972 -32506 -81850 -93581 -71954 -29922 -6909
12116 -6909 -23853 -5014 35593 34680 44666 20397 41133 71658 64083 30838 16476 108007 131565
12103 131565 129425 80824 -4901 -10219 -29439 -7200 -496 -9843 1864 20775 45823 52124
12091 52124 53782 35976 -12036 -47294 -2210 8217 -31803 -65208 -5672 34792 66592 43344
$$ [...]
##END NTUPLES=NMR SPECTRUM
##END=
