##TITLE=Analysis number 328403
Compound Code cc 02213
Book Reference lab3
Project Code adrs
Chemist Name stores
##JCAMPDX= 6.0         $$ Bruker NMR JCAMP-DX V2.0
##DATA TYPE= NMR SPECTRUM
##DATA CLASS= NTUPLES
##ORIGIN= Bruker BioSpin GmbH
##OWNER= nmr
$$ XWIN-NMR		Version 3.5
$$ Tue May 29 09:53:31 2007 GMT Daylight Time (UT+1h)  MAYBRIDGE\nmr@NMR_250MHZ
##.OBSERVE FREQUENCY= 250.131544655141
##.OBSERVE NUCLEUS= ^1H
##.ACQUISITION MODE= SIMULTANEOUS (DQD)
##.ACQUISITION SCHEME= undefined
##.AVERAGES= 16
##.DIGITISER RES= 18
##SPECTROMETER/DATA SYSTEM= dpx250
##.PULSE SEQUENCE= zg30
##.SOLVENT NAME= DMSO
##.SHIFT REFERENCE= (INTERNAL, DMSO, 0, 16.522)
##AUDIT TRAIL= $$ (NUMBER, WHEN, WHO, WHERE, WHAT)
$$ ##TITLE= Audit trail, XWIN-NMR		Version 3.5
$$ ##JCAMPDX= 5.01
$$ ##ORIGIN= Bruker BioSpin GmbH
$$ ##OWNER= nmr
$$ C:\u/data/dgb/nmr/ADRS/1590/pdata/1/auditp.txt
$$ ##AUDIT TRAIL=  $$ (NUMBER, WHEN, WHO, WHERE, WHAT)
(   1,<2007-05-29 09:53:10.21 +100>,<MAYBRIDGE\nmr>,<NMR_250MHZ>,
      <created by zg, POWCHK disabled, PULCHK disabled
       configuration hash MD5:
       76 6E 9A 78 1E 09 19 81 EC 84 63 8F B0 6A 59 2D
       data hash MD5: 64K
       52 A4 1F B2 F4 55 36 47 53 5D DA 10 5F 2D 38 95>)
(   2,<2007-05-29 09:53:22.64 +100>,<MAYBRIDGE\nmr>,<NMR_250MHZ>,
      <Start of raw data processing
       ef LB = 0.3 FT_mod = 6 PKNL = 1 SI = 32K 
       data hash MD5: 32K
       39 62 BD 95 9B 97 83 2E 91 E4 0B 82 96 E3 16 1B>)
(   3,<2007-05-29 09:53:24.44 +100>,<MAYBRIDGE\nmr>,<NMR_250MHZ>,
      <apk 
       data hash MD5: 32K
       AF 29 2E C3 BE 44 E7 32 3E CC 2D 00 D7 DA 4A BE>)
(   4,<2007-05-29 09:53:25.14 +100>,<MAYBRIDGE\nmr>,<NMR_250MHZ>,
      <abs ABSG = 5 
       data hash MD5: 32K
       78 44 B4 83 DA 55 F0 96 B1 30 52 38 DD 6F 7F 47>)
$$ ##END=
$$ 
$$ hash MD5
$$ 39 F1 AD EB 62 46 6E 75 AE 8D F3 06 3A 7C 86 94
##$RELAX= 
##$RELAX= 
##$RELAX= 
##$RELAX= 
##$RELAX= 
##$RELAX= 
##$RELAX= 
$$ Bruker specific parameters
$$ --------------------------
##$DU= <C:\u>
##$EXPNO= 1590
##$NAME= <ADRS>
##$PROCNO= 1
##$TYPE= <nmr>
##$USER= <dgb>
##$AMP= (0..31)
100 100 100 100 100 100 100 100 100 100 100 100 100 100 100 100 100 100 
100 100 100 100 100 100 100 100 100 100 100 100 100 100 
##$AQSEQ= 0
##$AQ_mod= 3
##$AUNM= <au_zg>
##$AUTOPOS= <10 >
##$BF1= 250.13
##$BF2= 250.13
##$BF3= 250.13
##$BF4= 250.13
##$BF5= 500.13
##$BF6= 500.13
##$BF7= 500.13
##$BF8= 500.13
##$BYTORDA= 1
##$CFDGTYP= 0
##$CFRGTYP= 5
##$CHEMSTR= <none>
##$CNST= (0..31)
1 1 145 1 1 1 1 1 1 1 1 1 1 1 1 1 1 1 1 1 1 1 1 1 1 1 1 1 1 1 1 1 
##$CPDPRG= <>
##$CPDPRG1= <>
##$CPDPRG2= <>
##$CPDPRG3= <>
##$CPDPRG4= <mlev>
##$CPDPRG5= <mlev>
##$CPDPRG6= <mlev>
##$CPDPRG7= <mlev>
##$CPDPRG8= <mlev>
##$CPDPRGB= <>
##$CPDPRGT= <>
##$D= (0..31)
0 1 0 0 0 0 0 0 0 0.06 0 0 0 0 0 0 0.0002 0 0 0 0 0 0 0 0 0 0 0 0 0 0 
0 
##$DATE= 1180428789
##$DBL= (0..7)
120 120 120 120 120 120 120 120 
##$DBP= (0..7)
150 150 150 150 150 150 150 150 
##$DBP07= 0
##$DBPNAM0= <>
##$DBPNAM1= <>
$$ [...]
##$SUBNAM7= <"">
##$SUBNAM8= <"">
##$SUBNAM9= <"">
##$SW= 20.6930455092707
##$SWIBOX= (0..15)
0 0 3 0 0 0 0 0 0 0 0 0 0 0 0 0 
##$SW_h= 5175.983436853
##$TD= 65536
##$TD0= 1
##$TE= 683.16
##$TE2= 300
##$TE3= 300
##$TEG= 300
##$TL= (0..7)
0 120 120 120 120 120 120 120 
##$TP= (0..7)
150 150 150 150 150 150 150 150 
##$TP07= 0
##$TPNAME0= <>
##$TPNAME1= <>
##$TPNAME2= <>
##$TPNAME3= <>
##$TPNAME4= <>
##$TPNAME5= <>
##$TPNAME6= <>
##$TPNAME7= <>
##$TPOAL= (0..7)
0.5 0.5 0.5 0.5 0.5 0.5 0.5 0.5 
##$TPOFFS= (0..7)
0 0 0 0 0 0 0 0 
##$TUNHIN= 0
##$TUNHOUT= 0
##$TUNXOUT= 0
##$USERA1= <user>
##$USERA2= <user>
##$USERA3= <user>
##$USERA4= <user>
##$USERA5= <user>
##$V9= 5
##$VALIST= <valist>
##$VCLIST= <CCCCCCCCCCCCCCC>
##$VD= 0
##$VDLIST= <DDDDDDDDDDDDDDD>
##$VPLIST= <PPPPPPPPPPPPPPP>
##$VTLIST= <TTTTTTTTTTTTTTT>
##$WBST= 1024
##$WBSW= 4
##$XGAIN= (0..3)
0 0 0 0 
##$XL= 0
##$YL= 0
##$YMAX_a= 346682
##$YMIN_a= -195071
##$ZGOPTNS= <>
##$ZL1= 120
##$ZL2= 120
##$ZL3= 120
##$ZL4= 120
##$ABSF1= 16.522
##$ABSF2= -4.171173
##$ABSG= 5
##$ABSL= 3
##$ALPHA= 0
##$AQORDER= 0
##$ASSFAC= 0
##$ASSFACI= 0
##$ASSFACX= 0
##$ASSWID= 0
##$AUNMP= <proc_1d>
##$AZFE= 0.1
##$AZFW= 0.1
##$BCFW= 0
##$BC_mod= 0
##$BYTORDP= 0
##$COROFFS= 0
##$CY= 12.5
##$DATMOD= 1
##$DC= 0
##$DFILT= <>
##$DTYPP= 0
##$F1P= 14.0000005364418
##$F2P= -0.99999901652339
##$FCOR= 0.5
##$FTSIZE= 32768
##$FT_mod= 6
##$GAMMA= 0
##$GB= 0
##$INTBC= 1
##$INTSCL= 1
##$ISEN= 128
##$LB= 0.3
##$LEV0= 0
##$LPBIN= 0
##$MAXI= 10000
##$MC2= 0
##$MEAN= 0
##$ME_mod= 0
##$MI= 0
##$NCOEF= 0
##$NC_proc= -6
##$NLEV= 6
##$NOISF1= 0
##$NOISF2= 0
##$NSP= 0
##$NTH_PI= 0
##$NZP= 0
##$OFFSET= 16.522
##$PC= 1
##$PHC0= -61.09238
##$PHC1= 5.165768
##$PH_mod= 1
##$PKNL= yes
##$PPARMOD= 0
##$PSCAL= 4
##$PSIGN= 0
##$REVERSE= no
##$SF= 250.13
##$SI= 32768
##$SIGF1= 0
##$SIGF2= 0
##$SINO= 400
##$SIOLD= 32768
##$SREGLST= <1H.DMSO>
##$SSB= 0
##$STSI= 32768
##$STSR= 0
##$SW_p= 5175.98343685301
##$SYMM= 0
##$S_DEV= 0
##$TDeff= 65536
##$TDoff= 0
##$TI= <Analysis number 999999
Compound Code 99
Book Reference 9
Project Code 9>
##$TILT= no
##$TM1= 0
##$TM2= 0
##$TOPLEV= 0
##$USERP1= <user>
##$USERP2= <user>
##$USERP3= <user>
##$USERP4= <user>
##$USERP5= <user>
##$WDW= 1
##$XDIM= 32768
##$YMAX_p= 356050543
##$YMIN_p= -967463
$$ End of Bruker specific parameters
$$ ---------------------------------
##NTUPLES= NMR SPECTRUM
##VAR_NAME=  FREQUENCY,     SPECTRUM/REAL,   SPECTRUM/IMAG
##SYMBOL=    X,             R,               I
##VAR_TYPE=  INDEPENDENT,   DEPENDENT,       DEPENDENT
##VAR_FORM=  AFFN,          ASDF,            ASDF
##VAR_DIM=   32768,         32768,           32768
##UNITS=     HZ,            ARBITRARY UNITS, ARBITRARY UNITS
##FACTOR=    0.157963299565203, 1,           1
##FIRST=     4132.6476996994, 0,             0
##LAST=      -1043.33573715361, 0,           0
##MIN=       -1043.33573715361, -967463,     0
##MAX=       4132.6476996994, 356050543,     0
$$ Real data points
##PAGE= N=1
##DATA TABLE= (X++(R..R)), XYDATA
$$ [...]
$$ plain form
24143 -515369 -422409 -608046 -537177 -311116 -9515 61497 275505 245285 48243 -43508
24133 -43508 -83124 -221595 -345380 -374196 -88447 74451 91956 241550 161391 172702 273234
24122 273234 66500 -135633 -25831 36380 -38884 99337 267703 208030 306926 346246
24112 346246 262135 354459 404675 389575 263557 82724 -14055 -268122 -430458 -322667
24102 -322667 -371735 -305506 -200120 -247283 -9290 56384 -204903 -414823 -518109 -635599
24092 -635599 -565007 -264871 10175 46015 -292466 -280192 -166737 -104511 85565 456289
24082 456289 515905 265815 520911 569507 599544 452195 164605 41470 -91355 -83750
24072 -83750 -49507 -280725 -177662 -211272 -208552 -48565 35888 -34549 -193389 -181167 -205547
$$ packed form
24143e15369R2960j85637P0869K26061L01601P1012K14008l0220j97042r1751
24133d3508l9616j38471j23785k8816K85749J62898J7505J49594q0159J1311J00532
24122B73234k06734k02133J09802O2211p5264J38221J68366n9673R8896L9320
24112C46246q4111R2324N0216j5100j26018j80833r6779k54067j62336J07791
24102c22667m9068O6229J05386m7163K37993O5674k61287k09920j03286j17490
24092f35599P0592L00136K75046L5840l38481J2274J13455O2226J90076L70724
24082D56289N9616k50090K55096M8596L0037j47349k87590j23135j32825P605
24072h3750L4243k31218J03063l3610K720J59987Q4453p0437j58840J2222k4380
$$ plain form
24061 -205547 -229501 50029 385078 190523 -196988 -227076 49676 152431 93604 -104649
24051 -104649 -237777 -372641 -308119 -212488 -165093 -69213 -154975 -121040 69109 -78357 -78754
24040 -78754 -188533 -251051 -245029 -223847 -54641 90565 72570 -94474 -151351 -167627 -173091
24029 -173091 -261202 -532349 -393784 -71452 -63632 64754 47836 -314519 -468306 -397392
24019 -397392 -318218 108804 4038 -123877 -107532 -23218 -104464 -294634 -339398 -396345 -341361
24008 -341361 -103814 13472 33921 23612 -219905 -330986 -262360 -146911 52013 132180
23998 132180 -62563 -120630 -62825 -53101 -71822 -178023 -118761 -79820 -84082 -342865 -163384
23987 -163384 -6324 -26423 -190094 -64046 -24416 -16473 -84369 -147981 -233799 -226067 -139018
$$ packed form
24061b05547k3954K79530L35049j94555l87511l0088K76752J02755n8827j98253
24051a04649j33128j34864O4522R5631M7395R5880q5762L3935J90149j47466l97
24040g8754j09779o2518O022K1182J69206J45206j7995j67044n6877j6276n464
24029a73091q8111k71147J38565L22332P820J28386j6918l62355j53787P0914
24019c97392P9174M27022j04766j27915J6345Q4314q1246j90170m4764n6947N4984
24008c41361K37547J17286K0449j0309k43517j11081O8626J15449J98924Q0167
23998A32180j94743n8067N7805R724j8721j06201N9262L8941m262k58783J79481
23987a63384J57060k0099j63671J26048L9630P943o7896o3612q5818P732Q7049
$$ plain form
23976 -139018 -75505 -195920 -319665 -352066 -323398 -380475 -376361 -468729 -372537 -186949 121676
23965 121676 152163 133125 215294 -82758 -294525 -373382 -154525 30857 22626 -153016 -51439
23954 -51439 21275 -165926 -273989 -69779 170666 213233 59462 78955 -19651 -287436
23944 -287436 -91131 53231 -93349 -73999 87222 -170378 -106508 -67222 29169 204209
23934 204209 170402 260538 379818 277449 110941 -8079 -166915 -10384 92886 300580
23924 300580 225683 121962 139290 271918 71856 40966 140995 86804 -59150 -156855
23914 -156855 51875 74566 -57227 -337467 -239215 45922 143535 244218 69992 -149479
23904 -149479 26419 152511 61135 -131463 -141372 -150875 -408075 -228856 -13905 -123268
$$ packed form
23976a39018O3513j20415j23745l2401K8668n7077M114r2368R6192J85588L08625
23965A21676L0487j9038Q2169k98052k11767p8857K18857J85382q231j75642J01577
23954e1439P2714j87201j08063K04210K40445M2567j53771J9493r8606k67785
23944b87436J96305J44362j46580J9350J61221k57600O3870L9286R6391J75040
23934B04209l3807R0136J19280j02369j66508j19020j58836J56531J03270K07694
23924C00580p4897j03721J7328J32628k00062l0890J00029n4191j45954r7705
23914a56855K08730K2691j31793k80240R8252K85137R7613J00683j74226k19471
23904a49479J75898J26092r1376j92598r909r503k57200J79219K14951j09363
$$ plain form
23894 -123268 -162882 -273323 -213109 -107462 -241254 -361711 -505503 -473436 -397898 -366231
23884 -366231 -305795 21151 -10615 160662 62890 -357717 -484732 -75391 127639 164248
23874 164248 212886 511822 728323 558177 252129 45785 -143946 -163225 -50062 101021
23864 101021 183859 266521 89500 -91539 -155838 -316059 -314864 -134098 -47943 73468 42414
23853 42414 -180915 -331747 -483762 -257452 -57756 90689 35747 -6372 281981 524947
23843 524947 397896 27685 -16034 101155 60826 -100096 -61823 152957 250410 407679
23833 407679 344489 164401 88008 -20857 -43363 97041 79151 28468 40860 141830 101232
23822 101232 489 18340 -190296 -169104 57455 76980 -128874 -427062 -443229 -94487
$$ packed form
23894a23268l9614j10441O0214J05647j33792j20457j43792L2067P5538L1667
23884c66231O0436L26946l1766J71277r7772m20607j27015M09341K03030L6609
23874A64248M8638K98936K16501j70146l06048k06344j89731j9279J13163J51083
23864A01021Q2838Q2662j77021j81039o4299j60221J195J80766Q6155J21411l1054
23853D2414k23329j50832j52015K26310J99696J48445n4942m2119K88353K42966
23843E24947j27051l70211m3719J17189m0329j60922L8273K14780R7453J57269
23833D07679o3190j80088p6393j08865k2506J40404j7890n0683J2392J00970m0598
23822A01232j00743J7851k08636K1192K26559J9525k05854k98188j6167L48742
$$ plain form
23812 -94487 31686 -6749 -250926 -374679 -260517 47950 411826 370187 92650 -170640
23802 -170640 -192352 -185192 118478 255927 371569 345298 515739 257385 -151074 -334085
23792 -334085 -502785 -354575 -200985 -336704 -429622 -239734 -47650 -115790 -29177 143424
23782 143424 98122 54888 -1388 -146755 -361442 -295849 -23067 45854 -138436 -193983 -178098
23771 -178098 -266921 59834 309521 317370 230013 241519 368507 409209 215893 266340 184917
23760 184917 -92020 -80259 20978 22725 -66250 -127470 -189028 -310724 -254709 -186713 -417357
23749 -417357 -374963 -134239 172277 95405 -37025 -22589 24301 -28273 -35335 -188625 -345724
23738 -345724 -251841 -151240 8200 -62306 -126879 -148991 -237962 -3562 246858 293690 273072
$$ packed form
23812i4487J26173l8435k44177j23753J14162L08467L63876m1639k77537k63290
23802a70640k1712P160L03670J37449J15642k6271J70441k58354m08459j83011
23792c34085j68700J48210J53590j35719r2918J89888J92084o8140Q6613J72601
23782A43424m5302m3234n6276j45367k14687O5593K72782O8921j84290n5547J5885
23771a78098q8823L26755K49687P849q7357J1506J26988M0702j93316N0447q1423
23760A84917k76937J1761J01237J747q8975o1220o1558j21696N6015O7996k30644
23749d17357M2394K40724L06516p6872j32430J4436M6890n2574p062j53290j57099
23738c45724R3883J00601J59440p0506o4573k2112q8971K34400K50420M6832k0618
$$ plain form
23727 273072 182803 39560 -156324 -139016 -334243 -386909 -271593 -26318 -134815 -96338
23717 -96338 -255287 -62961 -7866 -146200 -41189 -28730 -173349 -86237 -124182 -516
23707 -516 212184 257110 232163 143223 171969 -10399 -105208 -207764 -275738 -219249 -89489
23696 -89489 -263825 -358439 -270575 -74711 -14892 -58805 253942 444339 352593 115961 12771
23685 12771 316201 369736 -59480 -113992 -147978 -240682 -252281 -97831 -11864 -133165 -217260
23674 -217260 -45311 117900 135449 74655 -105975 -223085 -275191 -269603 -230945 -86447 -85452
23663 -85452 -155745 -164824 5087 160685 69203 -42002 133272 239550 381418 414232 306370
23652 306370 20430 54963 96550 15359 42602 -24710 17777 118940 -9930 -293902 -76939
$$ packed form
23727B73072r0269j43243j95884J7308j95227n2666J15316K45275j08497L8477
23717i6338j58949J92326N5095j38334J05011J2459j44619Q7112l7945J23666
23707e16K12700M4926k4947q8940K8746j82368r4809j02556o7974N6489J29760
23696h9489j74336r4614Q7864J95864N9819m3913L12747J90397r1746k36632j03190
23685A2771L03430N3535m29216n4512l3986r2704j1599J54450Q5967j21301q4095
23674b17260J71949J63211J7549o0794j80630j17110n2106N588L8658J44498R95
23663h5452p0293r079J69911J55598r1482j11205J75274J06278J41868L2814j07862
23652C06370k85940L4533M1587q1191K7243o7312M2487J01163j28870k83972K16963
$$ plain form
23641 -76939 132154 161831 -35103 10700 97473 151438 233034 462219 308567 -139493 -206187
23630 -206187 -121520 -61106 -296721 -119066 67786 7182 -130407 -140283 -375731 -370376 -219592
23619 -219592 -188160 -68917 21740 -179884 -148482 -127717 -313189 -286681 -320949 -242754 -18027
23608 -18027 153705 60850 229935 381261 450337 278659 151644 228206 321735 337096 217342
23597 217342 150603 106604 194433 331213 373296 365450 224790 198659 159603 -257534 -278195
23586 -278195 -26183 121581 143163 134643 225063 42506 -116732 -109902 1748 149967 229713
23575 229713 147062 262300 191364 136481 4122 -135738 -35322 -122589 -190887 -51452
23565 -51452 -223679 -169562 -100121 5467 33995 200430 203642 149279 81433 229899 353304
$$ packed form
23641g6939K09093K9677j96934M5803Q6773N3965Q1596K29185j53652m48060o6694
23630b06187Q4667O0414k35615J77655J86852o0604j37589r876k35448N355J50784
23619b19592L1432J19243R0657k01624L1402K0765j85472K6508l4268P8195K24727
23608a8027J71732r2855J69085J51326O9076j71678j27015P6562R3529J5361j19754
23597B17342o6739m3999Q7829J36780M2083p846j40660k6131l9056m17137k0661
23586b78195K52012J47764K1582q520R0420j82557j59238O830J11650J48219P9746
23575B29713q2651J15238p0936n4883j32359j39860J00416q7267o8298J39435
23565e1452j72227N4117O9441J05588K8528J66435L212n4363o7846J48466J23405
$$ plain form
23554 353304 300877 145760 312667 352604 179181 225518 186371 64733 -93183 -351402
23544 -351402 -298416 -313068 -324709 -238763 -238034 -241253 -298333 -38834 269362 461505 481846
23533 481846 321653 110420 48986 -94021 -49027 -104101 -161211 -208969 -78739 74943
23523 74943 2987 7171 16817 159417 268354 167130 -100263 -96441 44204 49685 7494
23512 7494 102982 58029 -39622 -298443 -100410 25328 -102293 -224759 -241220 -103644 115338
23501 115338 143631 228003 214632 260342 -90465 -228401 -246345 -456301 -481401 -413572 -241902
23490 -241902 -47482 119101 452532 194811 -164855 -140224 -42294 -266508 -303830 -102188
23480 -102188 70547 249203 161088 34 24758 71940 -54722 -307228 -283273 -151310
$$ packed form
23554C53304n2427j55117J66907L9937j73423M6337l9147j21638j57916k58219
23544c51402N2986j4652j1641Q5946P29l219n7080K59499L08196J92143K0341
23533D81846j60193k11233o1434j43007M4994n5074n7110m7758J30230J53682
23523G4943p1956M184R646J42600J08937j01224k67393L822J40645N481m2191
23512G494R5488m4953r7651k58821J98033J25738j27621j22466j6461J37576K18982
23501A15338K8293Q4372j3371M5710l50807j37936j7944k09956k5100O7829J71670
23490b41902J94420J66583L33431k57721l59666K4631R7930k24214l7322K01642
23480a02188J72735J78656q8115j61054K4724M7182j26662k52506K3955J31963
$$ plain form
23470 -151310 -29911 30691 5325 70986 -60955 1404 207702 171375 65478 -25196 -230790
23459 -230790 -247762 -332335 -346234 -448519 -345173 -442033 -442299 -213736 9659 -163653 -133350
23448 -133350 70616 120393 147081 18087 37924 106723 57682 38904 61984 216988 221480
23437 221480 204325 130660 262336 21458 -318781 -242928 -36765 54869 139631 35011
23427 35011 -10555 -106855 -139670 -251635 -241275 -80710 -176923 -367619 -276193 -47192 -146312
23416 -146312 155337 219369 31855 -53251 -76730 -108298 -182526 -105294 -38028 -4512 84153
23405 84153 -19844 -93003 -15961 46215 115704 146006 182456 -25774 -453199 -593170 -423437
23394 -423437 -113493 -48756 -54665 -140392 -294516 -47687 144697 388781 476647 378241 501645
$$ packed form
23470a51310J21399O0602k5366O5661j31941O2359K06298l6327j05897r0674k05594
23459b30790j6972q4573j3899j02285J03346r6860k66K28563K23395j73312L0303
23448a33350K03966M9777K6688j28994J9837O8799m9041j8778K3080J55004M492
23437B21480j7155p3665J31676k40878l40239P5853K06163R1634Q4762j04620
23427C5011m5566r6300l2815j11965J0360J60565r6213j90696R1426K29001r9120
23416a46312L01649O4032j87514q5106k3479l1568p4228P7232O7266L3516Q8665
23405H4153j03997p3159P7042O2176O9489L0302L6450k08230m27425j39971J69733
23394d23437L09944O4737n909q5727j54124K46829J92384K44084Q7866r8406J23404
$$ plain form
23383 501645 700789 595436 390736 213060 66702 -55707 -30993 130623 127412 266178
23373 266178 266220 57295 55746 61633 189755 213265 98730 -125486 -289163 -83573 30660
23362 30660 -6341 -69958 -186839 -237537 -113808 124645 167138 56332 19134 -157209 -12133
23351 -12133 178251 110675 65368 34064 169540 56210 -98802 13608 63413 97223 149450
23340 149450 193784 281194 30656 -131701 -49584 -60618 -281219 -278662 -180143 -236327 -136508
23329 -136508 226799 340693 389597 288314 230512 106103 67390 287485 266085 136124
23319 136124 -120842 -188729 -347006 -358729 -119016 -120429 -141297 77286 235866 273300 316393
23308 316393 341612 297190 146923 21070 69804 129736 138136 188955 288228 271419 181315
$$ packed form
23383E01645J99144j05353k04700j77676j46358j22409K4714J61616l211J38766
23373B66178M2k08925j549N887J28122K3510j14535k24216j63677K05590J14233
23362C0660l7001o3617j16881n0698J23729K38453M2493j10806l7198j76343J45076
23351a2133J90384o7576m5307l1304J35476j13330j55012J12410M9805L3810N2227
23340A49450M4334Q7410k50538j62357Q2117j1034k20601K557R8519n6184R9819
23329a36508L63307J13894M8904j01283n7802j24409l8713K20095k1400j29961
23319A36124k56966o7887j58277j1723K39713j413k0868K18583J58580L7434M3093
23308C16393K5219m4422j50267j25853M8734N9932Q400N0819R9273j6809r0104
$$ plain form
23297 181315 124119 30564 -203131 -24291 100190 58924 91460 -62605 121292 169530
23287 169530 167603 155063 85417 237527 173372 -51712 -56261 -185543 -411194 -491303 -310323
23276 -310323 -146888 -57410 92585 169283 212641 271100 90243 -217986 -417300 -383179
23266 -383179 -205098 -17750 160561 32936 -172162 -60639 -215612 -456552 -594588 -519619
23256 -519619 -438589 -161641 -284915 -186265 -41579 -169571 -179803 106397 269804 187055
23246 187055 148444 16823 -36683 -226568 -243593 -331871 -453888 -665625 -472619 -246513
23236 -246513 -249995 31768 -24773 -141642 -199937 -295148 -491823 -427433 -317192 -82106 22004
23225 22004 -67399 -160097 -297096 -328161 -194419 9673 -1975 -59641 -126957 74622 77653
$$ packed form
23297A81315n7196r3555k33695J78840J24481m1266L2536j54065J83897M8238
23287A69530j927j2540o9646J52110o4155k25084m549j29282k25651q0109J80980
23276c10323J63435Q9478J49995P6698M3358N8459j80857l08229j99314L4121
23266c83179J78081J87348J78311j27625k05098J11523j54973k40940j38036P4969
23256e19619Q1030K76948j23274R8650J44686j27992j0232K86200J63407q2749
23246A87055l8611j31621n3506j89885j7025q8278j22017k11737J93006K26106
23236b46513l482K81763n6541j16869n8295r5211j96675O4390J10241K35086J04110
23225B2004q9403r2698j36999l1065J33742K04092j1648n7666o7316K01579L031
$$ plain form
23214 77653 -46373 11636 -64917 -64786 -83890 -145942 -172320 -34115 161434 76947 46196
23203 46196 -4274 -172743 -334248 -410950 -235993 -122102 -104936 -5007 -85011 -114075 -33047
23192 -33047 -2597 331631 386204 49818 -146324 -293660 -344308 -29556 113089 908
23182 908 -177988 -82697 -196592 -180399 -221504 -290206 -165498 -115611 -40347 312106 406239
23171 406239 214517 -6271 -250725 -263382 -281651 -294177 -474674 -414767 -284254 -203919
23161 -203919 -102217 -277017 -289831 -268034 -308536 -233912 -261382 -247506 -225672 -307280 -153998
23150 -153998 40841 -86614 -160481 -221823 -206564 -128775 -67511 -69958 84255 -5904 -268317
23139 -268317 -392540 -384097 -236785 -68423 28818 -65310 -280331 -228013 -53790 -274360
$$ packed form
23214G7653j24026N8009p6553J31j9104o2052k6378J38205J95549q4487l0751
23203D6196n0470j68469j61505p6702J74957J13891J7166R9929q0004k9064Q1028
23192c3047L0450L34228N4573l36386j96142j47336n0648L14752J42645j12181
23182I08j78896R5291j13895J6193m1105o8702J24708M9887P5264L52453R4133
23171D06239j91722k20788k44454j2657j8269j2526j80497N9907J30513Q0335
23161b03919J01702j74800j2814K1797m0502P4624k7470J3876K1834q1608J53282
23150a53998J94839j27455p3867o1342J5259P7789O1264k447J54213r0159k62413
23139b68317j24223Q443J47312J68362R7241r4128k15021N2318J74223k20570
$$ plain form
23129 -274360 -133370 -72037 -204465 -229810 -98550 -147754 52973 217263 19839 -14995
23119 -14995 -90738 -236545 -1994 104251 -136853 -230830 -83640 -29126 89990 109156
23109 109156 80129 1571 180029 226072 141607 139503 140749 165399 10755 -92354 -346315
23098 -346315 -270052 -292673 -442939 -206409 -32971 19482 18011 16658 -172477 -335123 -277428
23087 -277428 -187412 -46779 -18666 -3799 -96003 -131632 -300283 -351178 -244941 -225846 -4990
23076 -4990 125810 -126445 -170605 -87489 22235 -105998 -56557 -69691 -136556 -241549 -163023
23065 -163023 -277451 -314174 -208588 19410 160799 118333 260269 313662 212091 179843
23055 179843 203974 81740 -106748 -181682 -386261 -525458 -306624 51994 205150 92861
$$ packed form
23129b74360J40990O1333j32428k5345J31260m9204K00727J64290j97424l4834
23119a4995p5743j45807K34551J06245k41104r3977J47190N4514J19116J9166
23109A09156k9027p8558J78458M6043q4465k104J246K4650j54644j03109k53961
23098c46315P6263k2621j50266K36530J73438N2453j471j353j89135j62646N7695
23087b77428R0016J40633K8113J4867r2204l5629j68651n0895J06237J9095K20856
23076d990J30800k52255m4160Q3116J09724j28233M9441j3134o6865j04993P8526
23065a63023j14428l6723J05586K27998J41389m2466J41936N3393j01571l2248
23055A79843K4131j22234j88488p4934k04579j39197K18834L58618J53156j12289
$$ plain form
23045 92861 -5710 -16145 -56056 17472 123414 262144 287323 194030 352 5613 -84501
23034 -84501 -185932 -303521 -202043 -125013 -71166 -237476 -312813 -404126 -404999 -104264 39899
23023 39899 -31594 -122684 -31878 -151838 -259490 -321192 -341045 -482597 -474321 -244031 -81825
23012 -81825 -111476 -159559 -16138 164833 197670 196323 145243 -54782 -47069 55067 225616
23001 225616 294386 188016 309699 376225 -15339 -178286 -227768 -174864 -278193 -158641
22991 -158641 1218 160922 364754 351287 224081 264397 230457 -163834 -144970 26883
22981 26883 -26266 -20999 -41221 -212200 -269347 -304355 -264530 -318508 -370024 -396304 -286412
22970 -286412 -267136 -339858 -106896 204788 296569 258802 128159 -20973 -107482 105947
$$ packed form
23045I2861r8571j0435l9911P3528J05942J38730K5179r3293j93678N261r0114
23034h4501j01431j17589J01478P7030N3847j66310p5337r1313q73L00735J44163
23023C9899p1493r1090R0806j19960j07652o1702j9853j41552Q276K30290J62206
23012h1825k9651m8083J43421J80971L2837j347n1080k00025P713J02136J70549
23001B25616O8770j06370J21683O6526l91564j62947m9482N2904j03329J19552
22991a58641J59859J59704K03832j3467j27206M0316l3940l94291J8864J71853
22981B6883n3149N267k0222j70979n7147l5008L9825n3978n1516k6280J09892
22970b86412J9276p2722K32962L11684R1781l7767j30643j49132q6509K13429
$$ plain form
22960 105947 189473 144483 70197 -82179 12148 137926 103550 22217 -220327 -328095 -327493
22949 -327493 -304414 -347151 -229887 -208115 -296536 -399602 -149223 218319 167411 -126703
22939 -126703 -76621 -93229 -234228 -12768 70229 68330 173053 188428 312241 223983 72707
22928 72707 2252 -118365 -267948 -424732 -466393 -172376 238814 375218 292305 202557
22918 202557 67449 43711 112230 68968 42294 -82056 -173213 -21403 151568 49325
22908 49325 241968 511168 563549 536172 484944 247884 173853 87982 196057 121174 126030
22897 126030 10534 -172160 -42097 1437 102047 2671 -79411 -268146 -328510 -387307
22887 -387307 -302307 -414554 -311422 -225073 -14517 106657 28636 139758 132137 -156071
$$ packed form
22960A05947Q3526m4990p4286j52376R4327J25778l4376q1333k42544j07768O02
22949c27493K3079m2737J17264K1772q8421j03066K50379L67542n0908k94114
22939a26703N0082j6608j40999K21460Q2997j899J04723J5375J23813q8258j51276
22928G2707p0455j20617j49583j56784m1661K94017M11190J36404q2913q9748
22918B02557j35108k3738O8519m3262k6674j24350r1157J51810J72971j02243
22908D9325J92643K69200N2381k7377n1228k37060p4031q5871J08075p4883M856
22897A26030j15496j82694J30063M3534J00610r9376q2082j88735o0364n8797
22887c87307Q5000j12247J03132Q6349K10556J21174p8021J11122p621k88208
$$ plain form
22877 -156071 -265273 -185920 -237209 206942 270468 70782 -88911 -139789 -115656 54317
22867 54317 69308 105713 76693 -3769 -157680 -43122 151095 152739 62180 128275 47681
22856 47681 -253368 -183583 -104316 -41325 -220379 -46272 -66906 57772 139941 -186217 -263118
22845 -263118 -139173 -35364 94364 165790 43018 -102090 -205107 -242551 -122419 -224305
22835 -224305 -153340 4674 23129 -30290 95715 -52071 -367475 -318266 -98724 113137
22825 113137 76305 380969 451231 418413 557228 453281 89039 -256 7119 14656 128996
22814 128996 62419 47796 -20074 362301 512236 425392 234439 -125249 14910 100365
22804 100365 274307 266254 -120771 -244643 -228093 -222786 -53604 92312 -164885 -320400
$$ packed form
22877a56071j09202P9353n1289M44151O3526j99686j59693n0878K4133J69973
22867E4317J4991L6405k9020q0462j53911J14558J94217J644r0559O6095q0594
22856D7681l01049O9785P9267O2991j79054J74107k0634J24678Q2169l26158p6901
22845b63118J23945J03809J29728P1426j22772j45108j03017l7444J20132j01886
22835b24305P0965J58014J8455n3419J26005j47786l15404M9209K19542K11861
22825A13137l6832L04664P0262l2818J38815j03947l64242q9295P375P537J14340
22814A28996o6577j4623o7870L82375J49935q6844j90953l59688J40159Q5455
22804A00365J73942q053l87025j23872J6550N307J69182J45916k57197j55515
$$ plain form
22794 -320400 -242004 -90950 -211618 39154 312397 497206 167823 -18147 -171058 -110368
22784 -110368 -5036 175019 335352 316107 160749 77529 128899 175945 2312 -144565
22774 -144565 -247740 -58980 -46768 -140623 5463 12820 34450 184055 -35190 -370819
22764 -370819 -301899 -324431 -228068 -162858 -65880 -20958 36907 165197 193344 137988 -80335
22753 -80335 -104983 -226542 -122069 3714 14798 74210 48564 -107217 -68495 97431 48830
22742 48830 180914 -12744 -108576 -80820 -192859 -159269 -213904 -305420 -157988 -193641 -170518
22731 -170518 -353780 -368434 -236978 -124430 -79301 31386 183022 211895 159078 138603
22721 138603 -32708 -55457 -125475 71111 -70475 -58902 167735 266800 366682 362331 369331
$$ packed form
22794c20400P8396J51054j20668K50772K73243J84809l29383j85970j52911O0690
22784a10368J05332J80055J60333j9245j55358q3220N1370M7046j73633j46877
22774a44565j03175J88760J2212r3855J46086P357K1630J49605k19245l35629
22764c70819O8920k2532R6363O5210R6978M4922N7865J28290K8147n5356k18323
22753h0335k4648j21559J04473J25783J1084N9412k5646j55781L8722J65926m8601
22742D8830J32084j93658r5832K7756j12039L3590n4635r1516J47432l5653K3123
22731a70518j83262j4654J31456J12548M5129J10687J51636K8873n2817k0475
22721A38603j71311k2749p0018J96586j41586J1573K26637R9065R9882m351P000
$$ plain form
22710 369331 411973 175922 23622 -48976 102688 275756 -54353 -174819 93298 -38332
22700 -38332 -79547 33055 -4038 10466 -80392 -40817 9870 16551 169320 49459 109923
22689 109923 172659 50492 -99973 -269623 -399670 -480744 -289250 -110567 90897 -236478
22679 -236478 -193878 -128650 -13848 47618 -133943 -231871 78488 231129 -70279 -203490
22669 -203490 -66616 223033 167955 -40943 -237235 -130441 32515 64673 218888 139175
22659 139175 -51367 -82521 88353 26033 -79513 -185710 -253495 -241828 -337036 -285125 -33216
22648 -33216 -113026 -258965 -28871 1835 -171583 -262985 -212759 39005 201066 141019 -61171
22637 -61171 114889 319264 197841 -166528 -132091 -207787 -343706 -249333 -185172 -50574
$$ packed form
22710C69331M2642k36051j52300p2598J51664J73068l30109j20466K68117j31630
22700c8332m1215J12602l7093J4504r0858L9575N0687O681J52769j19861O0464
22689A09923O2736j22167j50465j69650j30047q1074J91494J78683K01464l27375
22679b36478M2600O5228J14802O1466j81561r7928L10359J52641l01408j33211
22669b03490J36874K89649n5078k08898j96292J06794J62956L2158J54215p9713
22659A39175j90542l1154J70874o2320j05546j06197o7785J1667r5208N1911K51909
22648c3216p9810j45939K30094L0706j73418r1402N0226K51764J62061o0047k02190
22637f1171J76060K04375j21423l64369L4437p5696j35919R4373O4161J34598
$$ plain form
22627 -50574 -52523 108687 233934 60975 -92498 -237307 -244326 -284906 -370380 -217666 -182321
22616 -182321 -210021 -332506 -405015 -172474 -190649 -276222 -125442 -149140 -198310 -287580 -221111
22605 -221111 -204702 -192980 -250842 -104941 -106781 -170695 -117993 -135671 -331363 -350334 -320386
22594 -320386 -263628 -174110 -77099 70396 140724 64417 -67267 -105588 -199189 -160972 -69595
22583 -69595 -63034 -8119 133196 279473 276847 102623 10583 32622 -81104 -50838 -246375
22572 -246375 -207826 -174615 -119837 -77396 60291 105527 171996 361620 481942 301611 169609
22561 169609 104947 -98964 -257539 -164614 -116754 -484939 -441808 -163156 -131082 -133510 -230386
22550 -230386 -590089 -863287 -704792 -529685 -324704 6799 115394 330145 321612 369667
$$ packed form
22627e0574j949J61210J25247j72959j53473j44809p019m0580q5474J52714L5345
22616a82321k7700j22485p2509K32541j8175q5573J50780k3698m9170q9270O6469
22605b21111J6409J1722n7862J45901j840o3914N2702j7678j95692j8971K9948
22594c20386N6758Q9518R7011J47495P0328p6307j31684l8321r3601L8217R1377
22583f9595O561N4915J41315J46277k626j74224r2040K2039j13726L0266j95537
22572b46375L8549L3211N4778M2441J37687M5236O6469J89624J20322j80331j32002
22561A69609o4662k03911j58575R2925M7860l68185M3131K78652L2074k428r6876
22550b30386l59703k73198J58495J75107K04981L31503J08595K14751q533M8055
$$ plain form
22540 369667 390636 215971 27729 132052 306707 236980 172862 40710 271205 254582
22530 254582 415398 451010 290613 292094 202327 15983 117435 170990 -29278 56680 194998
22519 194998 285320 522527 543157 407556 258849 61831 78540 287568 310988 27273
22509 27273 -86410 -25294 -90545 46877 -56821 -50693 -100814 -317826 -323779 -227893 51216
22498 51216 139164 61455 -126 -53472 4549 77446 51255 -35225 -18325 -33785 -52814 -244900
22486 -244900 -180920 5062 121913 32540 -197561 -307250 -208279 -103178 156138 7178
22476 7178 -146768 -161165 -58606 -75385 -77650 -192740 -140387 150240 311547 360310 238337
22465 238337 291024 297011 -25276 -44533 11619 143840 -55922 -238269 -173213 -250644 -405151
$$ packed form
22540C69667K0969j74665j88242J04323J74655o9727o4118j32152K30495j6623
22530B54582J60816L5612j60397J481q9767j86344J01452N3555k00268Q5958J38318
22519A94998R0322K37207K0630j35601j48707j97018J6709K09028K3420k83715
22509B7273j13683O1116o5251J37422j03698O128n0121k17012n953R5886K79109
22498E1216Q7948p7709o1581n3346N8021P2897k6191q6480J6900j5460j9029j92086
22486b44900O3980J85982J16851q9373k30101j09689R8971J05101K59316j48960
22476G178j53946j4397J02559j6779k265j15090N2353K90627J61307M8763j21973
22465B38337N2687N987l22287j9257N6152J32221j99762j82347O5056p7431j54507
$$ plain form
22454 -405151 -439254 -385912 -252959 67895 215765 226201 224139 137179 222115 111439 17212
22443 17212 -102589 -89436 -59331 -254888 -299471 -41775 34599 153860 107727 39516 198522
22432 198522 288946 59658 -141470 -215297 -141317 -148182 -49204 -408431 -534216 -311764 28262
22421 28262 -44060 -4157 -87382 62609 -29057 -60373 15095 9084 -85159 -168633 -278724
22410 -278724 -415041 -77595 64131 -6842 42453 10062 -73604 -71078 -116558 -236807 -250777
22399 -250777 -309484 -294323 -181909 -40015 6002 -77733 -158985 59563 102706 -153213 -179423
22388 -179423 -69366 -59094 -276332 -268481 -89672 11154 -143183 -191775 -242261 -207132 -174669
22377 -174669 -224555 -160018 -110943 -368233 -490217 -283795 40955 165357 -90271 -408658
$$ packed form
22454d05151l4103N3342J32953L20854J47870J0436k062q6960Q4936j10676r4227
22443A7212j19801J3153L0105j95557m4583K57696P6374J19261m6133o8211J59006
22432A98522R0424k29288k01128p3827P3980o865R8978l59227j25785K22452L40026
22421B8262p2322L9903q3225J49991r1666l1316P5468o011r4243q3474j10091
22410b78724j36317L37446J41726p0973M9295l2391q3666K526m5480j20249j3970
22399b50777n8707J5161J12414J41894M6017q3735q1252K18548M3143k55919k6210
22388a79423J10057J0272k17238P851J78809J00826j54337m8592n0486L5129L2463
22377a74669m9886O4537M9075k57290j21984K06422L24750J24402k55628l18387
$$ plain form
22367 -408658 -290490 -70674 58135 215165 278656 112807 -22795 -97756 26951 -59235
22357 -59235 -178327 -232851 -90783 -113045 -238737 -199443 -17859 176874 322833 475028
22347 475028 586443 659398 288843 -63303 28391 313355 359969 184969 -244002 -120124
22337 -120124 35706 47003 -155698 -226284 -132390 33350 -31891 -95335 -177584 -326227 -316943
22326 -316943 -413477 -16039 249996 113705 -60266 127504 55959 -53534 7037 -70559
22316 -70559 -28201 100569 -20532 -136297 -403428 -226543 12959 -107119 -175688 -408454
22306 -408454 -501048 -294827 5191 -2827 -60728 -327218 -398298 -195691 -176689 -386276 -177751
22295 -177751 -92950 38905 -69206 -195140 90977 156580 183251 42703 222047 304193
$$ packed form
22367d08658J18168K19816J28809J57030O3491j65849j35602p4961J24707q6186
22357e9235j19092n4524J42068k2262j25692L9294J81584J94733J45959J52195
22347D75028J11415P2955l70555l52146R1694K84964M6614j75000m28971J23878
22337a20124J55830J1297k02701p0586R3894J65740o5241o3444q2249j48643R284
22326c16943r6534L97438K66035j36291j73971J87770p1545j09493O0571p7596
22316g0559M2358J28770j21101j15765k67131J76885K39502j20078o8569k32766
22306d08454r2594K06221L00018q018n7901k66490p1080K02607J9002k09587K08525
22295a77751Q4801J31855j08111j25934K86117O5603K6671j40548J79344Q2146
$$ plain form
22285 304193 159808 12269 -55287 -52341 -74262 -67708 40959 161645 -8077 -114176 -155307
22274 -155307 -199588 -179360 -40867 246165 436523 478943 411995 576605 433659 192872
22264 192872 38128 -23450 -5289 135537 176673 107702 -54822 -108151 -65094 230451 132839
22253 132839 -5653 -179874 -290124 -226549 -301195 -105584 139019 -97041 -175103 -294034
22243 -294034 -489034 -255807 -285756 -246860 -49110 28966 -18770 -160281 -354703 -257107
22233 -257107 -128175 -2806 82523 3800 123431 410565 458481 140085 -65835 -110533
22223 -110533 -19583 125089 123485 -161908 -189342 -98801 -135780 -97882 -123195 -113367 -105456 -313340
22211 -313340 -409712 -248934 -69300 48641 -96588 -407196 -440164 -511374 -452923 -228127
$$ packed form
22285C04193j44385j47539o7556K946k1921O554J08667J20686j69722j06099m1131
22274a55307m4281K0228J38493K87032J90358M2420o6948J64610j42946k40787
22264A92872j54744o1578J8161J40826M1136o8971j62524n3329M3057K95545r7612
22253A32839j38492j74221j10250O3575p4646J95611K44603k36060p8062j18931
22243b94034j95000K33227k9949L8896J97750P8076m7736j41511j94422R7596
22233b57107J28932J25369Q5329p8723J19631K87134M7916l18396k05920m4698
22223a10533R0950J44672j604k85393k7434R0541l6979L7898k5313R828P911k07884
22211c13340r6372J60778J79634J17941j45229l10608l2968p1210N8451K24796
$$ plain form
22201 -228127 -166881 -81337 10259 154871 167935 199264 102818 -135694 55894 190202 -45386
22190 -45386 -161990 -46174 89762 -30829 -4263 53015 -184294 -398575 -303850 -86349
22180 -86349 -2360 69113 145492 -1596 -234251 -214719 -196012 -233073 35342 -36065 -72018
22169 -72018 3848 28981 110844 292592 58634 -246021 -179436 -174169 -7952 93409 102084
22158 102084 153934 144589 -3865 70315 104783 184959 171445 9315 -153674 -199852 -146784
22147 -146784 39678 129237 4987 51178 173481 134788 215721 167581 171635 200765 339666
22136 339666 349627 28913 -50240 -203504 -158475 1404 195938 164742 180624 150271 119845
22125 119845 -99883 -322761 -367172 -266288 87528 220692 224173 264303 114965 -55823
$$ packed form
22201b28127O1246Q5544R1596J44612J3064L1329r6446k38512J91588J34308k35588
22190d5386j16604J15816J35936j20591K6566N7278k37309k14281R4725K17501
22180h6349Q3989P1473P6379j47088k32655J9532J8707l7061K68415p1407l5953
22169g2018P5866K5133Q1863J81748k33958l04655O6585N267J66217J01361Q675
22158A02084N1850r345j48454P4180L4468Q0176j3514j62130j62989m6178N3068
22147a46784J86462Q9559j24250M6191J22303l8693Q0933m8140M054K9130J38901
22136C39666R961l20714p9153j53264M5029J59879J94534l1196J5882l0353l0426
22125A19845k19728k22878m4411J00884L53816J33164L481M0130j49338j70788
$$ plain form
22115 -55823 -94100 -138912 -267770 -90508 -124355 -295919 -324242 -260598 -161709 -62778 173246
22104 173246 -2156 -160863 -112787 71851 126602 18921 -128170 -45054 32332 72909
22094 72909 -105911 -175993 -90842 -202974 -192464 -177410 -342079 -381209 -141387 -157870 -95667
22083 -95667 -160757 -20323 115486 162328 315753 355594 320841 -148158 -237447 -132096 -18883
22072 -18883 -150807 -227630 -389432 -406616 -298115 -178934 -93704 17938 198121 202139 138834
22061 138834 -10589 -236328 -56139 129918 206738 -170190 -273609 -73704 56532 40177
22051 40177 22113 233659 395236 348510 116821 74183 16417 -80081 -143382 -18365 239641
22040 239641 109301 -104882 -176364 -301590 -230404 56185 141194 -64651 67684 17750
$$ packed form
22115e5823l8277m4812j28858J77262l3847j71564k8323O3644R8889R8931K36024
22104A73246j75402j58707M8076J84638N4751j07681j47091Q3116P7386M0577
22094G2909j78820p0082Q5151j12132J0510J5054j64669l9130K39822j6483O2203
22083i5667o5090J40434J35809M6842J53425L9841l4753m68999q9289J05351J13213
22072a8883j31924p6823j61802j7184J08501J19181Q5230J11642J80183M018o3305
22061A38834j49423k25739J80189J86057P6820l76928j03419J99905J30236j6355
22051D0177j8064K11546J61577m6726k31689m2638n7766r6498o3301J25017K58006
22040B39641j30340k14183p1482j25226P1186K86589Q5009k05845J32335m9934
$$ plain form
22030 17750 -94995 -221810 -98746 112873 257860 150085 -61337 -154407 -215215 -181670
22020 -181670 -228844 -288064 -333493 -288458 37518 207894 169802 197184 -87010 -36411 46805
22009 46805 -46181 21660 73032 91235 -112424 -43049 -130933 -251980 -287070 -304901 -433216
21998 -433216 -269527 120478 465169 398072 320550 210402 242450 23940 -116077 -134841
21988 -134841 -310583 -216425 -56142 -151499 11248 25743 -9117 101376 66261 89946 86093
21977 86093 70622 -108637 -355697 -156954 33346 170526 41205 -55594 203903 416173
21967 416173 288919 351554 517214 420873 354871 352989 397838 338671 210594 183414 -159628
21956 -159628 -251838 -255216 -258200 233683 383840 390920 235840 84771 -78814 -20693 -349
$$ packed form
22030A7750j12745j26815J23064K11619J44987j07775k11422r3070o0808L3545
22020a81670m7174n9220m5429M5035L25976J70376l8092K7382k84194N0599Q3216
22009D6805r2986O7841N1372J8203k03659O9375q7884j21047l5090j7831j28315
21998d33216J63689L90005L44691o7097p7522j10148L2048k18510j40017j8764
21988a34841j75742R4158J60283r5357J62747J4495l4860J10493l5115K3685l853
21977H6093j5471j79259k47060J98743J90300J37180j29321r6799K59497K12270
21967D16173j27254O2635J65660r6341o6002j882M4849n9167j28077k7180l43042
21956a59628r2210l378k984M91883J50157P080j55080j51069j63585N8121K0344
$$ plain form
21945 -349 82844 72731 20212 121018 21387 72696 171698 254825 230680 179670 275198 398168
21933 398168 317685 152171 -48275 47823 -3872 -75901 -87664 129170 169067 295475 331043
21922 331043 407877 407770 196238 138863 174132 236582 296608 514119 426203 275989 507444
21911 507444 596548 686882 1004006 761916 292377 24005 472223 699290 463318 272817
21901 272817 17683 43040 193861 384254 151675 -95861 -137175 122819 247025 380553
21891 380553 669287 684534 553815 417517 229265 28891 38586 43086 176769 378686
21881 378686 391389 382032 368634 236432 458357 780010 689068 468480 264231 219998 265645
21870 265645 369980 426774 441741 284285 321713 355782 344038 610824 677198 490202 340872
$$ packed form
21945c49Q3193j0113n2519J00806r9631N1309R9002Q3127k4145n1010R5528J22970
21933C98168q0483j65514k00446R6098n1695p2029j1763K16834L9897J26408L5568
21922C31043P6834j07k11532n7375L5269O2450O0026K17511q7916j50214K31455
21911E07444Q9104R0334L17124k42090m69539k68372M48218K27067k35972j90501
21901B72817k55134K5357J50821J90393k32579k47536m1314K59994J24206J33528
21891C80553K88734J5247j30719j36298j88252k00374R695M500J33683K01917
21881C78686J2703r357j3398j32202K21925L21653r0942k20588k04249m4233M5647
21870B65645J04335N6794J4967j57456L7428L4069j1744K66786O6374j86996j49330
$$ plain form
21859 340872 125943 134516 238279 372316 220289 77727 244478 340990 319050 255278
21849 255278 236283 196104 225805 373389 541679 625866 438034 353823 439716 409641 401013
21838 401013 268377 140606 316425 412255 384295 278805 389524 614065 571667 301303
21828 301303 263191 330082 526209 274838 303641 288033 312242 434160 356935 204489 374097
21817 374097 443626 514520 383301 396007 382389 287778 162403 139165 156574 173975 182947
21806 182947 426393 596113 634909 421745 433639 424130 375239 426157 349831 210769 477465
21795 477465 807823 597322 434308 400539 564971 731158 571356 612190 579287 523715
21785 523715 633067 398435 421425 488850 338401 312218 360435 527397 464089 391753 495955
$$ packed form
21859C40872k14929Q573J03763J34037j52027j42562J66751R6512k1940o3772
21849B55278j8995m0179K9701J47584J68290Q4187j87832q4211Q5893l0075q628
21838D01013j32636j27771J75819R5830k7960j05490J10719K24541m2398k70364
21828C01303l8112O6891J96127k51371K8803j5608K4209J21918p7225j52446J69608
21817C74097O9529P0894j31219J2706j3618r4611j25375k3238J7409J7401Q972
21806A82947K43446J69720L8796k13164J1894r509m8891N0918p6326j39062K66696
21795D77465L30358k10501j63014l3769J64432J66187j59802M0834l2903n5572
21785E23715J09352k34632K2990O7425j50449k6183M8217J66962o3308p2336J04202
$$ plain form
21774 495955 438468 432732 377196 339465 396671 299885 294760 178580 29740 194607 59433
21763 59433 -174457 -82775 40414 116304 126734 -220356 -293673 -280214 -291118 -374919 -163983
21752 -163983 -9656 209782 114521 158942 193555 276135 242219 167308 192202 328998 314990
21741 314990 423551 516974 423986 483761 518996 229189 131896 260370 446641 366719 151915
21730 151915 79799 113115 102481 98716 64713 -45275 -43424 -257248 -93940 154696 213270
21719 213270 135185 246436 315198 426305 89444 -39713 155314 216425 297330 225035
21709 225035 81105 261767 306227 220709 321104 439690 553580 583773 600026 377614
21699 377614 257476 76608 -151485 -251215 -276667 -200191 -82901 22587 196017 140622
$$ packed form
21774D95955n7487n736n5536l7731N7206r6786n125j16180j48840J64867j35174
21763E9433k33890R1682J23189P5890J0430l47090p3317J3459j0904q3801K10936
21752a63983J54327K19438r5261M4421L4613Q2580l3916p4911K4894J36796j4008
21741C14990J08561R3423r2988N9775L5235k89807r7293J28474J86271p9922k14804
21730A51915p2116L3316j0634l765l4003j09988J851k13824J63308K48636N8574
21719B13270p8085J11251O8762J11107l36861j29157J95027O1111Q0905p2295
21709B25035j43930J80662M4460q5518J00395J18586J13890L0193J6253k22412
21699C77614j20138j80868k28093r9730k5452P6476J17290J05488J73430n5395
$$ plain form
21689 140622 192729 333291 303376 205154 184012 192196 291122 416317 391732 257976 327256
21678 327256 146102 13840 -143670 -221231 -75399 124919 382549 342358 349307 120655
21668 120655 222597 240358 217300 199361 43291 146014 205500 105821 178784 56199 116256
21657 116256 179790 257157 171693 140047 -168310 3182 18555 -200868 -312214 -265353 -169146
21646 -169146 22489 129351 270343 340004 213744 104305 -174406 -48665 223740 284336
21636 284336 406697 279763 121308 109154 -113668 12054 66704 153872 88460 75219
21626 75219 38103 -76541 -116863 95155 12482 -12264 63875 -42728 -100439 -76695 -290801
21615 -290801 -358994 -212184 -114403 -95736 -107118 -65038 132337 183903 90290 -153980 -15177
$$ packed form
21689A40622N2107J40562k9915r8222k1142Q184R8926J25195k4585j33756O9280
21678C27256j81154j32262j57510p7561J45832K00318K57630m0191O949k28652
21668A20655J01942J7761k3058j7939j56070J02723N9486r9679P2963j22585O0057
21657A16256O3534P7367q5464l1646l08357J71492J5373k19423j11346M6861R6207
21646a69146J91635J06862J40992O9661j26260j09439k78711J25741K72405O0596
21636B84336J22361j26934j58455j2154k22822J25722N4650Q7168o5412j3241
21626G5219l7116j14644m0322K12018q2673k4746P6139j06603n7711K3744k14106
21615b90801o8193J46810R7781J8667j1382M2080J97375N1566r3613k44270J38803
$$ plain form
21604 -15177 173864 209608 286660 378580 347089 414474 590228 555718 433633 398490 581003
21593 581003 460656 275613 115909 -46376 23793 114327 120085 96043 10921 146414 130926
21582 130926 -24466 -88276 189873 237853 58296 97096 11848 83487 224385 83231
21572 83231 -144810 -154827 -165168 -318411 -279022 -1901 102639 249961 360902 365422 436202
21561 436202 377708 196863 -38258 13355 18228 -136275 -118299 9068 193152 -47681
21551 -47681 -152072 -30809 -88634 13820 81694 90725 2470 12135 -104535 -29959 243861
21540 243861 118908 -35024 -54395 -90156 156679 107151 103774 122289 -208885 -367250 -209153
21529 -209153 184140 182015 30935 -39829 133709 260935 153273 220596 253441 323456 91531
$$ packed form
21604a5177J89041L5744P7052R1920l1491O7385J75754l4510j22085l5143J82513
21593E81003j20347j85043j59704j62285P0169R0534N758k4042q5122J35493j5488
21582A30926j55392o3810K78149M7980j79557L8800q5248P1639J40898j41154
21572H3231k28041j0017j0341j53243L9389K77121J04540J47322J10941M520P0780
21561D36202n8494j80845k35121N1613M873j54503J7976J27367J84084k40833
21551d7681j04391J21263n7825J02454O7874R031q8255R665j16670P4576K73820
21540B43861j24953j53932j9371l5761K46835m9528l377J8515l31174j58365J58097
21529b09153L93293k125j51080p0764J73538J27226j07662O7323L2845P0015k31925
$$ plain form
21518 91531 -209523 -260117 -9805 -23253 -94394 120598 370531 250125 48452 136035
21508 136035 146149 87191 129439 162502 142834 167875 368386 425437 174069 89411 269156
21497 269156 421402 501552 639152 593399 399081 -29077 17898 163184 208852 282344
21487 282344 284364 219156 306052 325466 157752 -26316 86211 95390 364813 602818 583359
21476 583359 223286 110980 160598 -15189 70733 152737 54834 56711 42447 -25930 142216
21465 142216 228411 79580 257836 393168 239008 237876 352556 320752 244068 119402
21455 119402 132473 256268 318687 182892 170209 395739 404711 95440 -110115 -62410 -32532
21444 -32532 5600 52867 -106220 -345573 -301661 -40929 -55808 -280380 -269070 -143467 19659
$$ packed form
21518I1531l01054n0594K50312j3448p1141K14992K49933j20406k01673Q7583
21508A36035J0114n8958M2248L3063j9668K5041K00511N7051k51368q4658J79745
21497B69156J52246Q0150J37600m5753j94318m28158M6975J45286M5668P3492
21487B82344K020o5208Q6896J9414j67714j84068J12527R179K69423K38005j9459
21476E83359l60073j12306M9618j75787Q5922Q2004r7903J877j4264o8377J68146
21465A42216Q6195j48831J78256J35332j54160j132J14680l1804p6684j24666
21455A19402J3071J23795O2419j35795j2683K25530Q972l09271k05555M7705K9878
21444c2532L8132M7267j59087k39353M3912K60732j4879k24572J1310J25603J63126
$$ plain form
21433 19659 -43658 -132923 -217 160702 134722 119890 38764 137416 206617 288046 388440
21422 388440 383264 196818 -77372 -125573 -152444 67718 259361 343792 411351 549166 460820
21411 460820 616958 578456 356733 332760 412774 315718 142778 48818 161090 147289 186300
21400 186300 273116 89148 152196 345145 291388 347349 443568 466390 469369 367870 166816
21389 166816 74213 376658 402183 273195 211879 297138 202301 133580 165275 79554 179463
21378 179463 256278 326853 344880 281321 162048 237907 192591 -45089 -123290 -67813 288602
21367 288602 489199 391938 247688 81264 295375 331957 466321 426247 318154 327873
21357 327873 388865 244785 119662 103221 59500 36877 243394 254638 219356 290763 383538
$$ packed form
21433A9659o3317q9265J32706J60919k5980j4832q1126R8652O9201Q1429J00394
21422C88440n176j86446k74190m8201k6871K20162J91643Q4431O7559J37815q8346
21411D60820J56138l8502k21723k3973Q0014r7056j72940r3960J12272j3801L9011
21400A86300Q6816j83968O3048J92949n3757N5961R6219K2822K979j01499k01054
21389A66816r2603L02445K5525j28988o1316Q5259r4837o8721L1695q5721R9909
21378A79463P6815P0575J8027o3559j19273P5859m5316k37680p8201N5477L56415
21367B88602K00597r7261j44250j66424K14111L6582J34364m0074j08093R719
21357C27873O0992j44080j25123j6441m3721k2623K06517J1244l5282P1407R2775
$$ plain form
21346 383538 705834 536095 207621 400868 284529 116054 362847 447738 265778 -54329
21336 -54329 -155950 -137056 -251473 -190844 50937 271350 494000 656744 638585 460922
21326 460922 100152 35817 284175 427683 251981 246570 415743 430054 396133 238891
21316 238891 181703 149108 82616 51663 -30084 104067 163236 99693 309663 468041 380280
21305 380280 417081 514595 513985 457597 463106 396981 332172 287708 161150 30328 -78497
21294 -78497 -60911 -4190 165 3767 -10287 181993 190615 376452 515986 450400 349237
21283 349237 296240 207195 154398 -78242 16667 101746 192442 133828 -72805 -72688 -188389
21272 -188389 -239374 59634 302185 135193 95261 222086 245708 376016 275739 125365
$$ packed form
21346C83538L22296j69739l28474J93247j16339j68475K46793Q4891j81960l20107
21336e4329j01621J8894j14417O0629K41781K20413K22650J62744j8159j77663
21326D60922l60770o4335K48358J43508j75702n411J69173J4311l3921j57242
21316B38891n7188l2595o6492l0953q1747J34151N9169o3543K09970J58378q7761
21305C80280L6801R7514o10n6388N509o6125o4809m4464j26558j30822j08825
21294g8497J7586N6721M355L602j4054J92280Q622J85837J39534o5586j01163
21283C49237n2997q9045n2797k32640R4909Q5079R0696n8614k06633J17j15701
21272a88389n0985K99008K42551j66992l9932J26825K3622J30308j00277j50374
$$ plain form
21262 125365 381985 513823 542338 290717 86676 163341 46345 153598 390800 347387
21252 347387 486811 343691 259971 263942 292020 449861 421266 271207 151029 317235
21242 317235 372421 151242 155465 298763 477325 272848 65355 -93159 33167 132773
21232 132773 202207 70686 135069 578106 553938 459002 363773 473316 553502 239604 260748
21221 260748 455473 359931 338126 283299 355783 410520 321513 326867 184619 289590 271232
21210 271232 155034 -122066 -160653 -54260 241464 452556 499659 367108 196375 140552
21200 140552 116810 201849 75629 -11824 -130766 -1015 91917 17366 326496 381639 265251
21189 265251 310091 344650 373472 530359 234641 -51126 -82332 -115039 134179 441374
$$ packed form
21262A25365K56620J31838K8515k51621k04041P6665j16996J07253K37202m3413
21252C47387J39424j43120q3720L971K8078J57841k8595j50059j20178J66206
21242C17235N5186k21179M223J43298J78562k04477k07493j58514J26326R9606
21232A32773O9434j31521O4383M43037k4168r4936r5229J09543Q0186l13898K1144
21221B60748J94725r5542k1805n4827P2484N4737q9007N354j42248J04971j8358
21210B71232j16198k77100l8587J06393K95724K11092M7103j32551j70733n5823
21200A40552k3742Q5039j26220q7453j18942J29751R2932p4551L09130N5143j16388
21189B65251M4840L4559K8822J56887k95718k85767l1206l2707K49218L07195
$$ plain form
21179 441374 455317 403773 453987 312314 191260 95109 171460 166266 369162 417326 317460
21168 317460 173195 125380 33911 157569 318198 188855 247908 431225 412067 532331
21158 532331 472031 382502 337642 339170 434466 508066 562766 461237 547855 551201 559185 850102
21146 850102 867445 605403 385312 274512 216681 -5761 -43562 207921 353807 210835
21136 210835 270470 611500 636109 663617 469428 347352 366543 108485 168561 77705 -202951
21125 -202951 -75868 225735 426998 506958 517501 538474 475066 494643 556869 506376 246500
21114 246500 236328 461114 666796 462357 481181 456342 569670 694373 837916 993135
21104 993135 718311 686755 890268 1196390 1094392 913072 649102 717658 680511 540188
$$ packed form
21179D41374J3943n1544N0214j41673j21054r6151P6351n194K02896M8164r9866
21168C17460j44265m7815r1469J23658J60629j29343N9053J83317j9158J20264
21158E32331o0300q9529m4860J528R5296P3600N4700j01529Q6618L346P984K90917
21146H50102J7343k62042k20091j10800n7831k22442l7801K51483J45886j42972
21136B10835N9635L41030K4609K7508j94189j22076J9191k58058O0076r0856k80656
21125b02951J27083L01603K01263P9960J0543K0973o3408J9577O2226n0493k59876
21114B46500j0172K24786K05682k04439J8824k4839J13328J24703J43543J55219
21104I93135k74824l1556K03513L06122j01998j81320k63970O8556l7147j40323
$$ plain form
21094 540188 484052 438913 312751 543049 712563 614255 634209 831043 891311 843193 546780
21083 546780 560753 722505 916338 943075 895963 777613 576429 163505 395773 685039
21073 685039 637477 510115 646123 667736 553008 421198 478732 425292 588792 530363
21063 530363 530119 764055 1008658 940232 600351 590443 516992 393499 601489 945326 936522
21052 936522 583843 478749 468700 418335 357841 328418 477833 599222 672523 499537
21042 499537 472606 408257 463720 663146 643753 366787 156329 76592 425407 697258
21032 697258 538298 403340 506044 684783 668165 696033 654806 521568 651653 605724
21022 605724 530403 676578 584895 470066 467571 585749 762460 671263 584796 653279 694262
$$ packed form
21094E40188n6136m5139j26162K30298J69514r8308J9954J96834O0268m8118k96413
21083E46780J3973J61752J93833K6737m7112j18350k01184m12924K32268K89266
21073F85039m7562j27362J36008K1613j14728j31810N7534n3440J63500n8429
21063E30363k44K33936K44603o8426l39881r908p3451j23493K07990L43837q804
21052I36522l52679j05094j0049n0365o0494k9423J49415J21389P3301j72986
21042D99537k6931o4349N5463J99426j9393k76966k10458p9737L48815K71851
21032F97258j58960j34958J02704J78739j6618K7868m1227j33238J30085m5929
21022F05724p5321J46175r1683j14829k495J18178J76711r1197q6467O8483M0983
$$ plain form
21011 694262 716548 631326 426236 314565 538169 623621 660437 369443 459677 667058
21001 667058 735092 773477 611597 759760 845904 836309 700397 530762 555922 996891 959837
20990 959837 769572 611803 511729 276073 453928 731881 740192 834168 835309 851068 988973
20979 988973 841324 737235 683716 649236 676861 826181 680595 556540 704346 861194
20969 861194 1275863 1237043 1150938 1020174 795599 667019 655612 637803 642652 708939 788901
20958 788901 1097763 1300734 1042507 654333 773492 941054 1028010 1227937 1197242 1052848
20948 1052848 991490 962795 977839 913166 951900 855152 816558 688352 715076 850220 631782
20937 631782 798188 1015064 972547 846201 895545 1041177 829094 530594 359635 440576
$$ packed form
21011F94262K2286q5222k05090j11671K23604Q5452L6816k90994R0234K07381
21001F67058O8034L8385j61880J48163Q6144r595j35912j69635K5160M40969l7054
20990I59837j90265j57769j00074k35656J77855K77953Q311R3976J141J5759J37905
20979I88973j47649j04089n3519l4480K7625J49320j45586j24055J47806J56848
20969H61194M14669l8820q6105j30764k24575j28580j1407j7809M849O6287P9962
20958G88901L08862K02971k58227l88174J19159J67562Q6956J99927l0695j44394
20948A052848o1358k8695J5044o4673L8734r6748l8594j28206K6724J35144k18438
20937F31782J66406K16876m2517j26346M9344J45632k12083k98500j70959Q0941
$$ plain form
20927 440576 649342 885639 813422 591116 483211 719308 1068877 1204532 1209211 1199105
20917 1199105 1264223 1276230 1045192 868485 759478 764614 942497 1176884 1379895 1419035
20907 1419035 1227732 1025928 1120701 1042428 979934 976789 1151116 1255855 1020730 763441
20897 763441 507498 432815 550995 656772 784550 972849 995483 979778 1047754 1021566
20887 1021566 1077521 1028588 1045073 1030152 813819 1139768 1211028 1175577 1044507 976244 1078960
20876 1078960 1277336 1295791 1268221 1262452 1190997 1128454 1442285 1574666 1500128 1310156 1283264
20865 1283264 1175869 1141723 1145540 1255055 1435028 1391866 1246921 1435154 1311057 1152353
20855 1152353 1100295 878761 901156 1104657 1531385 1331152 1034719 918540 954216 1019581
$$ packed form
20927D40576K08766K36297p2217k22306j07905K36097L49569J35655M679j0106
20917A199105O5118J2007k31038j76707j09007N136J77883K34387K03011L9140
20907A419035j91303k01804R4773p8273o2494l145J74327J04739k35125k57289
20897G63441k55943p4683J18180J05777J27778J88299K2634j5705O7976k6188
20887A021566N5955m8933J6485j4921k16333L25949P1260l5451j31070o8263J02716
20876A078960J98376J8455k7570n769p1455o2543L13831J32381p4538j89972k6892
20865A283264j07395l4146L817J09515J79973m3162j44945J88233j24097j58704
20855A152353n2058k21534K2395K03501M26728k00233k96433j16179L5676O5365
$$ plain form
20845 1019581 1006288 971271 1000470 1084390 1266764 1420544 1405707 1601013 1378509 1285814
20835 1285814 1383675 1501330 1617322 1529154 1300495 1253434 1254479 1356377 1521968 1380448
20825 1380448 1136744 1214817 1317939 1111748 1466021 1433753 1364051 1468956 1357434 1401591
20815 1401591 1582316 1666366 1639669 1471347 1403824 1245445 1249271 1205680 1082283 1133944 1460818
20804 1460818 1330825 1316546 1501510 1534767 1592035 1693767 1695454 1806209 1826599 1904600 1980965
20793 1980965 1976146 1804046 1558859 1580389 1446493 1623409 1771949 1964775 1987470 1804756
20783 1804756 1836674 1913288 1838952 1546033 1559217 1556595 1686394 1800126 2049105 1894257
20773 1894257 1951184 2052681 2076336 1875590 1977711 2002176 1920389 2183824 2296230 2269133
$$ packed form
20845A019581j3293l5017K9199Q3920J82374J53780j4837J95306k22504r2695
20835A285814R7861J17655J15992q8168k28659m7061J045J01898J65591j41520
20825A380448k43704P8073J03122k06191L54273l2268o9702J04905j11522M4157
20815A401591J80725Q4050k6697j68322o7523j58379L826m3591j23397N1661L26874
20804A460818j29993j4279J84964L3257N7268J01732J687J10755K0390P8001P6365
20793A980965m819j72100k45187K1530j33896J76916J48540J92826K2695j82714
20783A804756L1918P6614p4336k92919J3184k622J29799J13732K48979j54848
20773A894257N6927J01497K3655k00746J02121K4465q1787K63435J12406k7097
$$ plain form
20763 2269133 2318347 2209301 2220296 2521619 2774199 2669528 2542237 2459404 2514912 2599775
20753 2599775 2565707 2362870 2587326 2639068 2523120 2380606 2600774 2889964 2886429 2918397
20743 2918397 2703543 2538815 2264681 2325528 2364028 2646705 2832472 2806281 2950626 2842207
20733 2842207 2553272 2473592 2443861 2583600 2714918 2738382 3059868 3224299 3165743 3099015
20723 3099015 3149203 3188589 3071199 2761477 2569020 2668892 2600762 2790508 2846800 2961025
20713 2961025 2756179 2829146 3004843 2907169 2664767 2556371 2649283 2597399 2526137 2571968
20703 2571968 2713568 2604087 2741990 2881318 2983009 2901984 2877112 2997279 3138169 3201057
20693 3201057 3077185 2999366 2784260 2803611 2949977 3013675 2997304 3052765 3019515 3188892
$$ packed form
20763B269133M9214j09046J0995L01323K52580j04671j27291q2833N5508Q4863
20753B599775l4068k02837K24456N1742j15948j42514K20168K89190l535L1968
20743B918397k14854j64728k74134O0847L8500K82677J85767k6191J44345j08419
20733B842207k88935p9680k9731J39739J31318K3464L21486J64431n8556o6728
20723C099015N0188L9386j17390l09722j92457R9872o8130J89746N6292J14225
20713B961025k04846P2967J75697r7674k42402j08396R2912n1884p1262M5831
20703B571968J41600j09481J37903J39328J01691q1025k4872J20167J40890O2888
20693C201057j23872p7819k15106J9351J46366O3698j6371N5461l3250J69377
$$ plain form
20683 3188892 3425915 3453982 3443847 3253665 3173302 3121813 3007581 2999256 3021156 3024302 3061071
20672 3061071 3107574 3180235 3326095 3208452 2898297 2930792 3157793 3447699 3461925 3322704
20662 3322704 3108772 3256696 3142188 3085799 3253430 3579751 3642114 3898401 4045849 3628875
20652 3628875 3466344 3825476 4330917 4169062 3864286 3994641 3913920 3589471 3728734 4071156
20642 4071156 4183713 4330961 4173216 4109774 4042259 4162770 3999359 3816919 4197203 4545273
20632 4545273 4409155 4284654 4433143 4494793 4372569 4372115 4387250 4290894 4315917 4436984 4460502
20621 4460502 4557856 4775002 4855518 5014749 5101021 5219189 5479974 5511197 5352826 5304233
20611 5304233 5281471 5356954 5498463 5661380 5585029 5454688 5825900 6146254 5928557 5835625
$$ packed form
20683C188892K37023K8067j0135j90182q0363n1489j14232q325K1900L146L6769
20672C061071M6503P2661J45860j17643l10155L2495K27001K89906J4226j39221
20662C322704k13932J47924j14508n6389J67631L26321O2363K56287J47448m16974
20652C628875j62531L59132N05441j61855l04776J30355q0721l24449J39263L42422
20642D071156J12557J47248j57745o3442o7515J20511j63411j82440L80284L48070
20632D545273j36118j24501J48489O1650j22224m54J5135r6356K5023J21067K3518
20621D460502R7354K17146Q0516J59231Q6272J18168K60785L1223j58371m8593
20611E304233k2762P5483J41509J62917p6351j30341L71212L20354k17697r2932
$$ plain form
20601 5835625 5705643 5580386 5647095 5723870 6102101 6548356 6488243 6185105 6052274 6190666
20591 6190666 6177592 6283044 6106974 6083674 6040336 6238408 6185545 6322748 6418571 6821954
20581 6821954 7046146 6957734 6882193 6565439 6517557 6677051 6708995 6868347 7041765 7156871
20571 7156871 7069710 7326760 7605772 7712580 7832539 8053659 8113401 8129081 8353447 8220613
20561 8220613 8150552 8118088 8270860 8456577 8727506 8839849 8998816 8835045 8960393 8928129
20551 8928129 8828358 8911768 9045137 9270360 9415393 9556120 9489214 9526613 9701605 9946992
20541 9946992 10099400 10113480 9850930 9685223 9883105 10218168 10367116 10398530 10543683 10823169
20531 10823169 11076765 11094372 11123296 11309012 11597810 11757759 11931280 12128118 12054696 12147998
$$ packed form
20601E835625j29982j25257O6709P6775L78231M46255o0113l03138j32831J38392
20591F190666j3074J05452j76070k3300m3338J98072n2863J37203R5823M03383
20581F821954K24192q8412p5541l16754m7882J59494L1944J59352J73418J15106
20571G156871q7161K57050K79012J06808J19959K21120N9742J5680K24366j32834
20561H220613p0061l2464J52772J85717K70929J12343J58967j63771J25348l2264
20551H928129r9771Q3410J33369K25223J45033J40727o6906L7399J74992K45387
20541I946992J52408J4080k62550j65707J97882L35063J48948L1414J45153K79486
20531A0823169K53596J7607K8924J85716K88798J59949J73521J96838p3422R3302
$$ plain form
20521 12147998 12429866 12661504 12940350 13023543 13016881 13321842 13314804 13482652 13725720 14031437
20511 14031437 14241646 14695609 14990483 15000058 15091045 15353394 15904048 16121522 16239228 16448055
20501 16448055 16628298 17173288 17729119 18018123 18450129 18621488 18783456 19061160 19303390
20492 19303390 19646244 20073132 20339076 20518416 20745833 21060287 21244689 21621833 22151271
20483 22151271 22393349 22831687 23283849 23773312 24135507 24424205 24945624 25361886 25848960
20474 25848960 26476606 27212944 27893745 28316986 28715243 29269165 29945904 30615013 30987622
20465 30987622 31615566 32209543 32715223 33344854 33902672 34476294 35005574 35828464 36550594
20456 36550594 37274086 38220421 39064125 39778795 40776232 41964436 42924914 43616988 44517140
$$ packed form
20521A2147998K81868K31638K78846Q3193o662L04961p038J67848K43068L05717
20511A4031437K10209M53963K94874R575R0987K62349N50654K17474J17706K08827
20501A6448055J80243N44990N55831K89004M32006J71359J61968K77704K42230
20492A9303390L42854M26888K65944J79340K27417L14454J84402L77144N29438
20483B2151271K42078M38338M52162M89463L62195K88698N21419M16262M87074
20474B5848960O27646P36338O80801M23241L98257N53922O76739O69109L72609
20465C0987622O27944N93977N05680O29631N57818N73622N29280Q22890P22130
20456C6550594P23492R46335Q43704P14670R97437J188204R60478O92074R00152
$$ plain form
20447 44517140 45577663 46773070 47944396 49034587 49908260 50808283 51942715 53176064
20439 53176064 54285871 55484784 56744539 57964541 59107824 60437975 61729569 63135100
20431 63135100 64398453 65767405 67233627 68656763 69873000 71282890 72719844 73939428
20423 73939428 75387963 76782362 78023504 79375986 80547695 81679367 83427968 84982414
20415 84982414 86429074 87845083 89075823 90477516 91687259 92784095 94051685 95118799
20407 95118799 96100300 97203868 98250168 99379362 100527767 101597705 102590350 103545186
20399 103545186 104590360 105943731 107353590 108134041 108827510 109902383 111042626 112067988
20391 112067988 113020265 113936681 114564112 115283987 116032147 116932560 117906121 118817147 119359186
$$ packed form
20447D4517140J060523J195407J171326J090191Q73673R00023J134432J233349
20439E3176064J109807J198913J259755J220002J143283J330151J291594J405531
20431F3135100J263353J368952J466222J423136J216237J409890J436954J219584
20423G3939428J448535J394399J241142J352482J171709J131672J748601J554446
20415H4982414J446660J416009J230740J401693J209743J096836J267590J067114
20407I5118799R81501J103568J046300J129194J148405J069938R92645R54836
20399A03545186J045174J353371J409859P80451O93469J074873J140243J025362
20391A12067988R52277R16416O27431P19875P48160R00413R73561R11026N42039
$$ plain form
20382 119359186 119772735 120218944 120568598 120716619 120871718 120794751 120683567 120759291 120712030 120415248
20372 120415248 120306333 120030964 119555604 118845340 118361354 117835614 117140949 116454950 115565714
20363 115565714 114755728 113842946 113026716 112356016 111431505 110680348 109752301 108599283 107503764
20354 107503764 106367744 105144327 103972459 102907353 101819737 100897649 99671928 98448013
20346 98448013 97354722 96212672 95084477 94204417 93205240 91859537 90603103 89402177
20338 89402177 88094980 86785035 85386565 84010681 82783842 81646879 80273058 78668296
20330 78668296 77412170 76003040 74528419 73178104 71880882 70381908 68483247 67058500
20322 67058500 65905499 64746687 63381789 61983306 60515890 59202922 57833559 56793264
$$ packed form
20382A19359186M13549M46209L49654J48021J55099p6967j11184P5724m7261k96782
20372A20415248j08915k75369m75360p10264m83986n25740o94665o85999q89236
20363A15565714q09986r12782q16230o70700r24511p51157r28047j153018j095519
20354A07503764j136020j223417j171868j065106j087616r22088j225721j223915
20346I8448013j093291j142050j128195q80060r99177j345703j256434j200926
20338H9402177j307197j309945j398470j375884j226839j136963j373821j604762
20330G8668296j256126j409130j474621j350315j297222j498974j898661j424747
20322F7058500j153001j158812j364898j398483j467416j312968j369363j040295
$$ plain form
20314 56793264 55960581 54706841 53395062 52362377 51144281 50000588 49081912 48283271
20306 48283271 47365500 46051713 45182824 44381371 43497223 42489992 41751086 40951251 40094531
20297 40094531 39202517 38184946 37505976 36859416 36232978 35351069 34518318 33925795 33366656
20288 33366656 32746826 32006556 31464678 30858558 30056038 29195525 28496196 28044711 27569480
20279 27569480 27223034 26942414 26755069 26481705 26131832 25596704 24969192 24640022 24332882
20270 24332882 23985150 23627788 23444136 23059241 22536376 22083061 21683301 21422725 20981295
20261 20981295 20714590 20555497 20423943 20234130 20010438 19736193 19490870 19087315 18620030
20252 18620030 18525609 18324057 18197382 18049068 17637160 17492116 17307578 16901698 16658040
$$ packed form
20314E6793264q32683j253740j311779j032685j218096j143693r18676p98641
20306D8283271r17771j313787q68889q01453q84148j007231p38906p99835q56720
20297D0094531q92014j017571o78970o46560o26438q81909q32751n92523n59139
20288C3366656o19830p40270n41878o06120q02520q60513o99329m51485m75231
20279B7569480l46446k80620j87345k73364l49873n35128o27512l29170l07140
20270B4332882l47732l57362j83652l84895n22865m53315l99760k60576m41430
20261B0981295k66705j59093j31554j89813k23692k74245k45323m03555m67285
20252A8620030r4421k01552j26675j48314m11908j45044j84538m05880k43658
$$ plain form
20243 16658040 16430247 16319226 16162463 16269715 16483202 16382490 16553077 16743274 16931216
20234 16931216 17001975 16722673 16291192 16000000 16060157 16348992 16763710 17417796 18074391 18316905
20224 18316905 18153641 17958119 17607854 17527283 17346922 17252933 17391976 17698112 17922557 17961767
20214 17961767 18096428 18253175 18930928 19744357 20609016 21578684 22925404 24686387 27423085
20205 27423085 31534657 37498357 46380416 59288514 76760236 95982844 109116677
20198 109116677 110881144 104330742 99217211 102923157 117519655 140922126 165338562
20191 165338562 179219393 178766286 167103497 147948634 127042104 111571055 105911968
20184 105911968 109409763 118062164 123271708 116095718 97500391 77036436 61720247
$$ packed form
20243A6658040k27793j11021j56763J07252K13487j00712J70587J90197J87942
20234A6931216P0759k79302m31481k91192O0157K88835M14718O54086O56595K42514
20224A8316905j63264j95522l50265q0571j80361r3989J39043L06136K24445L9210
20214A7961767J34661J56747O77753Q13429Q64659R69668J346720J760983K736698
20205B7423085M111572N963700Q882059J2908098J7471722J9222608J3133833
20198A09116677J764467o550402n113531L705946J4596498K3402471K4416436
20191A65338562J3880831m53107j1662789j9154863k0906530j5471049n659087
20184A05911968L497795Q652401N209544p175990j8595327k0463955j5316189
$$ plain form
20177 61720247 52322638 46739220 43968640 43833978 45855443 50718647 59728173 73737414
20169 73737414 92762303 112004194 121871369 119711167 113279122 112460524 122731493 141726807
20161 141726807 158503093 161533065 154981399 150028102 148844983 142733267 129433063 116173603
20153 116173603 110519217 113559641 120448989 121042194 108024606 86545786 65529010 50139234
20145 50139234 40070691 33305775 28584481 25146279 22276254 20409962 18853296 17634624
20137 17634624 16713395 15987935 15185312 14816433 14297401 13724812 13411262 12836510 12145437
20128 12145437 11667174 11706787 11543608 11164879 10939143 10624508 10251419 10010615 9912550 9819318
20118 9819318 9689193 9744589 9443561 9165337 8600267 8167272 8205652 7943775 7700419 7642957
$$ packed form
20177F1720247r397609n583418k770580j34662K021465M863204R009526J4009241
20169G3737414J9024889J9241891R867175k160202o432045q18598J0270969J8995314
20161A41726807J6776286L029972o551666m953297j183119o111716j3300204j3259460
20153A16173603n654386L040424O889348N93205j3017588k1478820k1016776j5389776
20145E0139234j0068543o764916m721294l438202k870025j866292j556666j218672
20137A7634624r21229p25460q02623l68879n19032n72589l13550n74752o91073
20128A2145437m78263L9613j63179l78729k25736l14635l73089k40804r8065r3232
20118I819318j30125N5396l01028k78224n65070m32995L8380k61877k43356n7462
$$ plain form
20108 7642957 7768867 7725612 7731725 7693795 7586973 7447422 7180420 6863981 7015598 7083535
20098 7083535 6906987 6790324 6741798 6776928 6863157 6704416 6760764 6877207 6812273 6835369
20088 6835369 7047323 7006028 6785155 6626686 6701796 6695529 6521427 6281317 6335534 6507273
20078 6507273 6526573 6436835 6342772 6338778 6188433 6374220 6353217 6112220 6019649 6030987 6028540
20067 6028540 6147555 6183398 6275711 6294514 6031472 5880258 5864893 6013407 6197589 6282190
20057 6282190 6400198 6284465 6298837 6053112 5908049 6110045 6260483 6323124 6194317 6117592
20047 6117592 6020082 5779339 5586001 5684781 5746058 5884762 6045918 5875658 5534940 5590080
20037 5590080 5813915 6035147 6205380 6402390 6434577 6125811 6009112 5983742 5978031 6058533
$$ packed form
20108G642957J25910m3255O113l7930j06822j39551k67002l16439J51617O7937
20098G083535j76548j16663m8526L5130Q6229j58741N6348J16443o4934K3096
20088F835369K11954m1295k20873j58469P5110o267j74102k40110N4217J71739
20078F507273J9300q9738r4063l994j50345J85787k1003k40997r2571J1338k447
20067F028540J19015L5843R2313J8803k63042j51214j5365J48514J84182Q4601
20057F282190J18008j15733J4372k45725j45063K01996J50438O2641j28807p6725
20047F117592r7510k40743j93338R8780O1277J38704J61156j70260l40718N5140
20037E590080K23835K21232J70233J97010L2187l08766j16699k5370n711Q0502
$$ plain form
20027 6058533 6177246 6333777 6314571 6321271 6246692 6131594 6078426 5976689 5994437 6089917 6501702
20016 6501702 6736590 6645210 6661897 6441549 6340548 6510961 6236837 6054427 5995903 6089125
20006 6089125 6469822 6610490 6606491 6663112 6782791 6726327 6559649 6418716 6406548 6511137
19996 6511137 6437067 6132844 6094586 6313890 6512977 6495441 6495620 6588788 6394096 6381737 6384557
19985 6384557 6335349 6262505 6488487 6750020 6811793 6766727 6604057 6423465 6313830 6446996
19975 6446996 6522059 6694717 6772354 6722578 6940076 7046607 7286611 7535865 7510470 7433014
19965 7433014 7170021 7005657 6854792 6822382 7003042 6982164 7205379 7133317 7069014 7104394
19955 7104394 7192580 7367047 7400483 7496401 7248565 7070810 6985177 7028476 6881232 6867345
$$ packed form
20027F058533J18713J56531j9206O700p4579j15098n3168j01737J7748R5480M11785
20016F501702K34888r1380J6687k20348j01001J70413k74124j82410n8524R3222
20006F089125L80697J40668l999N6621J19679n6464j66678j40933j2168J04589
19996F511137p4070l04223l8258K19304J99087j7536J79R3168j94692j2359K820
19985F384557m9208p2844K25982K61533O1773m5066j62670j80592j09635J33166
19975F446996P5063J72658P7637m9776K17498J06531K40004K49254k5395p7456
19965G433014k62993j64364j50865l2410J80660k0878K23215p2062o4303L5380
19955G104394Q8186J74467L3436R5918k47836j77755q5633M3299j47244j3887
$$ plain form
19945 6867345 7226273 7244548 7217071 7220208 7285768 7282465 7309103 7448017 7473164 7445284 7384861
19934 7384861 7224668 7197198 7230210 7266962 7230980 7458761 7517569 7604346 7836915 7793689 7558183
19923 7558183 7386374 7483871 7697881 7791543 7825941 7874756 7871653 7878017 8051825 8039529 8119825
19912 8119825 8104029 8036308 8142577 8286824 8330488 8272858 8584578 8759065 8619349 8480571
19902 8480571 8329045 8351171 8405026 8373823 8290738 8259947 8537113 8642580 8487390 8522865
19892 8522865 8740022 8880710 9038504 9108375 9098612 9205089 9169230 9234624 9164732 9053982
19882 9053982 9078035 9000876 8966841 9146516 9128318 9144045 9252842 9480158 9356544 9257480
19872 9257480 9383947 9594578 9659833 9784655 10032682 10057971 10052088 10177281 10432918 10439441
$$ packed form
19945F867345L58928J8275k7477L137O5560l303K6638J38914K5147k7880o0423
19934G384861j60193k7470L3012L6752l5982K27781N8808Q6777K32569m3226k35506
19923G558183j71809R7497K14010R3662L4398M8815l103O364J73808j2296Q0296
19912H119825j5796o7721J06269J44247M3664n7630L11720J74487j39716j38778
19902H480571j51526K2126N3855l1203q3085l0791K77166J05467j55190L5475
19892H522865K17157J40688J57794O9871r763J06477l5859O5394o9892j10750
19882I053982K4053p7159l4035J79675j8198J5727J08797K27316j23614r9064
19872I257480J26467K10631O5255J24822K48027K5289n883J25193K55637O523
$$ plain form
19862 10439441 10338284 10224647 10208384 10172725 10087483 10036205 10151703 10351060 10287607 10210582
19852 10210582 10316046 10366381 10660004 10816930 10902099 11006158 11167166 11219874 11161540 11195733
19842 11195733 11277257 11235626 11289843 11574552 11740861 11827793 11721896 11540873 11531845 11774779
19832 11774779 11790327 11871420 11976402 12200338 12224074 11992938 12173424 12022807 12152564 12511740
19822 12511740 12738873 12834475 12840251 12946634 13132566 13206299 13191965 13331164 13479236 13473726
19812 13473726 13503713 13855988 14127622 13968347 14056393 14280180 14533773 14853407 15087079 15167336
19802 15167336 15222594 15159186 15061361 15398265 15630610 15589130 15502824 15453963 15521748 15552531 15659491
19791 15659491 16172154 16537019 16664985 16844980 16829710 16702346 16876068 16925941 17015545 17318627
$$ packed form
19862A0439441j01157j13637j6263l5659q5242n1278J15498J99357o3453p7025
19852A0210582J05464N0335K93623J56926Q5169J04059J61008N2708n8334L4193
19842A1195733Q1524m1631N4217K84709J66309Q6932j05897j81023r028K42934
19832A1774779J5548Q1093J04982K23936K3736k31136J80486j50617J29757L59176
19822A2511740K27133R5602N776J06383J85932P3733j4334J39199J48072n510
19812A3473726K9987L52275K71634j59275Q8046K23787K53593L19634K33672Q0257
19802A5167336N5258o3408r7825L36904K32345m1480q6306m8861O7785L0783J06960
19791A5659491N12663L64865J27966J79995j5270j27364J73722M9873Q9604L03082
$$ plain form
19781 17318627 17625407 17895550 18046685 17871556 17821001 17915169 18118645 18216919 18131684 18053378
19771 18053378 18256825 18481004 18697524 18821909 18808652 18870935 18922387 19141056 19583664 20026322
19761 20026322 20257919 20231873 20304248 20268361 20204547 20581321 20844562 20912378 21283701 21628696
19751 21628696 21835015 21940237 21901136 21991931 21986681 22231133 22401171 22661745 23032287 23464254
19741 23464254 23501036 23734787 23968990 24205512 24351373 24554842 24755889 25029521 25114699 25130799
19731 25130799 25102137 25233741 25428073 25492911 25360157 25549246 25844017 26145075 26251920 26385819
19721 26385819 26631655 26741918 26891673 27347812 27838631 27939954 28125644 28409421 28400444 28556012
19711 28556012 28759657 28910678 29128342 29302000 29613300 29747237 29751684 29966980 30138367 30447470
$$ packed form
19781A7318627L06780K70143J51135j75129n0555R4168K03476R8274q5235p8306
19771A8053378K03447K24179K16520J24385j3257O2283N1452K18669M42608M42658
19761B0026322K31597k6046P2375l5887o3814L76774K63241O7816L71323L44995
19751B1628696K06319J05222l9101R0795n250K44452J70038K60574L70542M31967
19741B3464254L6782K33751K34203K36522J45861K03469K01047K73632Q5178J6100
19731B5130799k8662J31604J94332O4838j32754J89089K94771L01058J06845J33899
19721B6385819K45836J10263J49755M56139M90819J01323J85690K83777q977J55568
19711B8556012K03645J51021K17664J73658L11300J33937M447K15296J71387L09103
$$ plain form
19701 30447470 30599553 30675888 30809158 31017732 31134651 31419574 31704379 31665382 31765828 32080269
19691 32080269 32189452 32278367 32237511 32295578 32342652 32569312 32880780 33084588 33368821 33594952
19681 33594952 33532123 33499442 33858913 34371317 34569918 34421886 34495995 34676942 35008531 35109249
19671 35109249 35281533 35467074 35535565 35509687 35735251 36007677 36193738 36346373 36330552 36578327
19661 36578327 36992061 37221213 37206437 37344462 37325579 36944087 37213757 37646845 37598796 37683713
19651 37683713 37852658 37832974 37887287 37974442 38151383 38155447 38039245 37988208 37824854 37862219
19641 37862219 38092527 37928055 38047074 38193370 38247244 38252084 38324263 38420419 38375296 38351415
19631 38351415 38365482 38565360 38587935 38562758 38451260 38635039 38784145 38699756 38545493 38522260
$$ packed form
19701C0447470J52083P6335J33270K08574J16919K84923K84805l8997J00446L14441
19691C2080269J09183Q8915m0856N8067M7074K26660L11468K03808K84233K26131
19681C3594952o2829l2681L59471N12404J98601j48032P4109J80947L31589J00718
19671C5109249J72284J85541O8491k5878K25564K72426J86061J52635j5821K47775
19661C6578327M13734K29152j4776J38025j8883l81492K69670M33088m8049Q4917
19651C7683713J68945j9684N4313Q7155J76941M064j16202n1037j63354L7365
19641C7862219K30308j64472J19019J46296N3874M840P2179R6156m5123k3881
19631C8351415J4067J99878K2575k5177j11498J83779J49106q4389j54263k3233
$$ plain form
19621 38522260 38399530 38554618 38578041 38330331 38086420 37906461 37960063 37877261 37806073 37841781
19611 37841781 37494498 37080794 37037951 37123863 37241145 37000391 36801996 36635443 36314723 36119797
19601 36119797 36122646 36215276 36120347 35900270 35720245 35507020 35531095 35561679 35476133 35198531
19591 35198531 34875615 34811317 34718604 34696706 34806417 34607331 34525586 34282934 34144479 33559711
19581 33559711 33192431 32856350 32741899 33037999 33099961 32501535 31964930 31694492 31364510
19572 31364510 31095268 30818122 30710553 30507582 30538897 30477914 30106894 29743864 29636575 29706976
19562 29706976 29784613 29929341 29880238 29752047 29638625 29304235 29338818 29481141 29213111 28853968
19552 28853968 28625450 28390504 27839679 27487342 27306646 27133366 26952953 26751821 26379128
$$ packed form
19621C8522260j22730J55088K3423k47710k43911j79959N3602q2802p1188L5708
19611C7841781l47283m13704m2843Q5912J17282k40754j98395j66553l20720j94926
19601C6119797K849R2630r4929k20077j80025k13225K4075L0584q5546k77602
19591C5198531l22916o4298r2713k1898J09711j99086q1745k42652j38455n84768
19581C3559711l67280l36081j14451K96100O1962n98426n36605k70438l29982
19572C1364510k69242k77146j07569k02971L1315o0983l71020l63030j07289P0401
19562B9706976P7637J44728m9103j28191j13422l34390L4583J42323k68030l59143
19552B8853968k28518k34946n50825l52337j80696j73280j80413k01132l72693
$$ plain form
19543 26379128 26052332 25758414 25717585 25623593 25599452 25163967 25033881 25024150 25031981 25044228 24990369
19532 24990369 24998015 24925989 24752872 24527101 24211133 23803011 23435393 23245823 23034137 22744242
19522 22744242 22587022 22525262 22288929 21847825 21569810 21492296 21386155 20962068 20861608 20931323
19512 20931323 20637594 20332166 20042291 19944169 20002521 19816564 19697964 19536548 19373160 19122477
19502 19122477 18998383 19024227 18910023 18856564 18908726 18703478 18270481 18163757 18227113 18007143
19492 18007143 17941427 17681137 17395671 17131296 16973798 16920436 17085890 16979093 17011730 16764111
19482 16764111 16782132 16754557 16487399 16128082 16003776 16016756 15959024 15562479 15362390 15431086
19472 15431086 15547285 15462926 15420581 15417608 15357152 15414374 15259041 14959567 15015342 14890129
$$ packed form
19543B6379128l26796k93918m0829r3992k4141m35485j30086r731P831J2247n3859
19532B4990369P646p2026j73117k25771l15968m08122l67618j89570k11686k89895
19522B2744242j57220o1760k36333m41104k78015p7514j06141m24087j00460O9715
19512B0931323k93729l05428k89875r8122N8352j85957j18600j61416j63388k50683
19502A9122477j24094K5844j14204n3459N2162k05248m32997j06724O3356k19970
19492A8007143o5716k60290k85466k64375j57498n3362J65454j06797L2637k47619
19482A6764111J8021k7575k67158l59317j24306J2980n7732l96545k00089O8696
19472A5431086J16199q4359m2345k973o0456N7222j55333k99474N5775j25213
$$ plain form
19462 14890129 14590234 14521295 14702627 14649483 14528627 14604081 14588809 14434227 14087123 13976506
19452 13976506 13924674 13725960 13644063 13780533 13534838 13481009 13661461 13524118 13215233 13101142
19442 13101142 12978742 12967507 12877986 12611951 12578104 12613932 12297526 12271237 12061555 11847584
19432 11847584 11482668 11625720 11544777 11469615 11323263 11080219 11149587 11020982 10869863 11044663
19422 11044663 11123953 11158226 11014124 11135731 11070711 11018588 11021081 10836604 11032413 11087261
19412 11087261 11069869 11029938 10928154 11075452 11139774 11011746 10997392 11140128 10998049 10887481
19402 10887481 10715159 10796957 10559114 10506583 10353862 10300070 10414936 10494601 10376962 9950173
19392 9950173 9576454 9419921 9148757 9056351 8890286 8629363 8508822 8423651 8529076 8669804
$$ packed form
19462A4890129k99895o8939J81332n3144j20856P5454j5272j54582l47104j10617
19452A3976506n1832j98714q1897J36470k45695n3829J80452j37343l08885j14091
19442A3101142j22400j1235q9521k66035l3847L5828l16406k6289k09682k13971
19432A1847584l64916J43052q0943p5162j46352k43044O9368j28605j51119J74800
19422A1044663P9290L4273j44102J21607o5020n2123K493j84477J95809N4848
19412A1087261j7392l9931j01784J47298O4322j28028j4354J42736j42079j10568
19402A0887481j72322Q1798k37843n2531j52721n3792J14866P9665j17639m26789
19392I950173l73719j56533k71164r2406j66065k60923j20541q5171J05425J40728
$$ plain form
19382 8669804 8682296 8604135 8571380 8757124 8899501 8874660 8563315 8123254 8221555 8499105
19372 8499105 8484710 8307407 8467982 8402252 8311361 8333300 8524605 8615361 8603385 8800160
19362 8800160 8911754 8751304 8813870 9056868 9334869 9166056 8638050 8436534 8512834 8748691
19352 8748691 8644898 8392317 8391667 8579805 8877930 8949040 9004950 9084720 9064486 9057114 9305409
19341 9305409 9696410 10195105 10522162 10416631 10156272 9778154 9710037 9868733 10320250 10985689
19331 10985689 11415510 11239268 10551790 9486532 8546925 8260920 8186682 8241139 8236216 8241417
19321 8241417 8362655 8183101 8222099 8559638 8880146 9436094 9805300 9693890 9699183 9638591
19311 9638591 9916495 10459029 10981236 11107583 10883115 10308476 9779848 9650449 9983214
$$ packed form
19382H669804J2492p8161l2755J85744J42377k4841l11345m40061R8301K77550
19372H499105j4395j77303J60575o5730r0891K1939J91305R0756j1976J96775
19362H800160J11594j60450O2566K42998K78001j68813n28006k01516P6300K35857
19352H748691j03793k52581o50J88138K98125P1110N5910P9770k0234p372K48295
19341I305409L91001M98695L27057j05531k60359l78118o8117J58696M51517O65439
19331A0985689M29821j76242o87478j065258r39607k86005p4238N4457m923N201
19321H241417J21238j79554L8998L37539L20508N55948L69206j11410N293o0592
19311I638591K77904N42534N22207J26347k24468n74639n28628j29399L32765
$$ plain form
19302 9983214 10157173 10410460 10856133 11273723 11546095 11349289 11070571 11116894 11523146 12209777
19292 12209777 12777901 13611040 14636411 16120320 18569340 21541530 23642119 24019617
19284 24019617 23110274 22766407 23709523 26098997 29658648 32813815 34651473 35635706 37996882
19275 37996882 43532746 50796251 56136212 56418826 52558206 48972898 49072957 52246430
19267 52246430 56129090 56261074 50919050 42180080 34067802 28372124 25072180 23029911
19259 23029911 21396435 19911404 18924320 18198015 17930106 18124845 18456274 18833290 19435784
19250 19435784 20237682 21423910 23323870 25188148 27300452 30288203 34232140 39100785
19242 39100785 45436908 53842115 65468697 82458508 106669304 138140721 171648431
$$ packed form
19302I983214J73959K53287M45673M17590K72372j96806k78718M6323M06252O86631
19292A2209777N68124Q33139J025371J483909K449020K972190K100589L77498
19284B4019617r09343l43867R43116K389474L559651L155167J837658R84233K361176
19275C7996882N535864P263505N339961K82614l860620l585308J00059L173473
19267E2246430L882660J31984n342024q738970q112278n695678l299944k042269
19259B3029911j633476j485031r87084p26305k67909J94739L31429L77016O02494
19250A9435784Q01898J186228J899960J864278K112304K987751L943937M868645
19242C9100785O336123Q405207J1626582J6989811K4210796L1471417L3507710
$$ plain form
19235 171648431 196137507 204065213 201204527 202191992 218656165 254883772 304587017
19228 304587017 346506186 356050543 332098170 298454093 278654990 277351617 284205368
19221 284205368 286692435 285147697 289281068 300852840 308286088 299627502 271106958 227145263
19213 227145263 179201688 138440703 108654872 88054762 73753031 63597721 55515602
19206 55515602 49450603 44517231 40052031 36477191 33952541 32316154 31406005 31116989
19198 31116989 30984239 31129130 31922754 33172513 35550073 39637913 45717165 54555993
19190 54555993 68081556 87434726 111599139 135159378 147045316 140559606 121656673
19183 121656673 101690661 87827197 81961853 83459074 92276064 107451371 126424205
$$ packed form
19235A71648431K4489076P927706k860686R87465J6464173L6227607M9703245
19228C04587017M1919169R544357k3952373l3644077j9799103j303373O853751
19221B84205368K487067j544738M133371J1571772P433248q658586k8520544m3961695
19213B27145263m7943575m0760985k9785831k0600110j4301731j0155310q082119
19206E5515602o064999m933372m465200l574840k524650j636387r10149k89016
19198C1116989j32750J44891P93624J249759K377560M087840O079252Q838828
19190E4555993J3525563J9353170K4164413K3560239J1885938o485710j8902933
19183A21656673j9966012j3863464n865344J497221Q816990J5175307J8972834
$$ plain form
19176 126424205 141551224 143254298 128851770 105647662 83066127 66087102 54753033
19169 54753033 47647389 43883323 41839260 39118237 34873964 30045073 25562070 21914459
19161 21914459 19580314 18072892 16818076 15633891 14969534 14802822 14495433 14154630 13662615
19152 13662615 13289412 13308284 13201862 13077141 13087557 13188822 13185574 13231103 13284735 13740910
19142 13740910 14489202 15466817 17602428 21165421 26741631 34237822 42154291 46400218
19134 46400218 44381267 37767035 31072088 27173622 25774996 25879552 28154911 32880812
19126 32880812 39575252 45879339 47674828 43303777 34965299 27011898 21198212 17155928
19118 17155928 14306822 12438396 11008620 9840807 8826032 8330790 8018722 7233993
$$ packed form
19176A26424205J5127019J703074j4402528k3204108k2581535j6979025j1334069
19169E4753033p105644l764066k044063k721023m244273m828891m483003l647611
19161B1914459k334145j507422j254816j184185o64357j66712l07389l40803m92015
19152A3662615l73203J8872j06422j24721J0416J01265l248M5529N3632M56175
19142A3740910P48292R77615K135611L562993N576210P496191P916469M245927
19134D6400218k018951o614232o694947l898466j398626J04556K275359M725901
19126C2880812O694440O304087J795489m371051q338478p953401n813686m042284
19118A7155928k849106j868426j429776j167813j014775m95242l12068p84729
$$ plain form
19110 7233993 6856318 6480216 6207170 6045260 5801554 5596364 5629263 5685522 5466836 5436019
19100 5436019 5323174 5272793 5143915 5059441 5086119 5128469 5045031 5024821 4814042 4401035
19090 4401035 4291976 4456765 4503246 4232180 4071770 3996452 3841165 3999213 4181039 4190513
19080 4190513 4139714 4039293 3886173 3835130 3832119 3911304 3985364 4166316 4349618 4524802
19070 4524802 4402312 4178289 4386430 4350169 4362255 4658548 4736287 5030678 5350094 5559146
19060 5559146 5757705 6333938 6825788 6696711 6244270 6257951 6555319 6697744 6951546 7038821
19050 7038821 7359227 7698453 8302467 9233410 10152685 10902820 11663684 12458677 13331736
19041 13331736 14234025 15408453 16711859 18177405 19965743 22313413 25710003 29914815
$$ packed form
19110G233993l77675l76102k73046j61910k43706k05190L2899N6259k18686l0817
19100E436019j12845n0381j28878q4474K6678M2350q3438k0210k10779m13007
19090D401035j09059J64789M6481k71066j60410p5318j55287J58048J81826R474
19080D190513n0799j00421j53120n1043l011P9185P4060J80952J83302J75184
19070D524802j22490k24023K08141l6261J2086K96293P7739K94391L19416K09052
19060E559146J98559N76233M91850j29077m52441J3681K97368J42425K53802Q7275
19050G038821L20406L39226O04014R30943R19275P50135P60864P94993Q73059
19041A3331736R02289J174428J303406J465546J788338K347670L396590M204812
$$ plain form
19033 29914815 35419330 42903784 53331981 68433251 90539594 121771271 163312544
19026 163312544 211847276 256601108 280425491 271816821 235574110 188683682 145725514
19019 145725514 112589387 89334267 73450574 62558424 54955523 49909088 46800534
19012 46800534 45382095 45402713 47471373 51481242 57924164 67936370 83191852 105754323
19004 105754323 138544960 182302307 232665274 277800731 299897598 287086899 245591037
18997 245591037 193586322 146417158 110783544 85368538 67542529 55077457 46055958
18990 46055958 39210469 33826371 29327375 25734486 22863659 20433810 18653845 17308992
18982 17308992 16098207 14971778 14014646 13208860 11988507 10915636 10015136 9054410 8487660
$$ packed form
19033B9914815N504515P484454J0428197J5101270K2106343L1231677M1541273
19026A63312544M8534732M4753832K3824383q608670l6242711m6890428m2958168
19019A45725514l3136127k3255120j5883693j0892150p602901n046435l108554
19012D6800534j418439K0618K068660M009869O442922J0012206J5255482K2562471
19004A05754323L2790637M3757347N0362967M5135457K2096867j2810699m1495862
18997B45591037n2004715m7169164l5633614k5415006j7826009j2465072r021499
18990D6055958o845489n384098m498996l592889k870827k429849j779965j344853
18982A7308992j210785j126429r57132q05786j220353j072871r00500r60726n66750
$$ plain form
18973 8487660 8169727 8002471 7773525 7512699 7140610 7265340 7314698 7220082 7141466 6682062
18963 6682062 6139958 5813396 5476120 5054834 4811664 4604593 4549485 4349578 4292007 4396088
18953 4396088 4420844 4225976 4041439 3856960 3714556 3812858 4150157 4190824 3760599 3482714
18943 3482714 3766669 3833286 3624162 3801463 4068396 3967691 4140212 4099536 4092723 4111080
18933 4111080 4615899 5214479 5634193 6139830 6216468 5807535 5510017 5039394 4807670 5109236
18923 5109236 5358457 5338413 5111338 4556947 4255367 4210196 4284569 4395745 4579857 4972232
18913 4972232 4696220 4135120 3756891 3511514 3381565 3069027 2734367 2371145 2273670 2307344
18903 2307344 2460001 2705692 3055733 3275857 3619165 4093559 4629484 4435553 4034639
$$ packed form
18973H487660l17933j67256k28946k60826l72089J24730M9358r4616p8616m59404
18963F682062n42104l26562l37276m21286k43170k07071n5108j99907n7571J04081
18953D396088K4756j94868j84537j84479j42404R8302L37299M0667m30225k77885
18943C482714K83955O6617k09124J77301K66933j00705J72521m0676o813J8357
18933D111080N04819N98580M19714N05637P6638m08933k97518m70623k31724L01566
18923E109236K49221k0044k27075n54391l01580m5171P4373J11176J84112L92375
18913D972232k76012n61100l78229k45377j29949l12538l34660l63222r7475L3674
18903B307344J52657K45691L50041K20124L43308M74394N35925j93931m00914
$$ plain form
18894 4034639 3886643 3985955 4079626 4408009 4743768 4885235 4780142 4295187 3878026 3908691
18884 3908691 4524035 5254309 5734190 5617608 5104205 4477965 3646282 3266712 3280847 3020001
18874 3020001 2947883 2689324 2430531 2697137 2680030 2339167 2087628 1922654 1790657 1881763
18864 1881763 2069153 1920751 2179854 2324857 2294004 2154926 1990025 1846951 1821648 1998381
18854 1998381 2088474 2069332 2126913 1926955 2007538 1972045 1988289 2168875 1935603 1496297
18844 1496297 1455751 1541939 1694938 1947770 1964072 1964729 1976877 2158495 2115635 2080240 1862126
18833 1862126 1731123 1840715 1905894 1864861 2112680 2180650 2131212 1956377 1861055 1918369
18823 1918369 2068144 2119036 2097071 2174851 2282558 2261437 2285820 2245374 2091245 1858483
$$ packed form
18894D034639j47996R9312R3671L28383L35759J41467j05093m84955m17161L0665
18884C908691O15344P30274M79881j16582n13403o26240q31683l79570J4135k60846
18874C020001p2118k58559k58793K66606j7107l40863k51539j64974j31997R1106
18864A881763J87390j48402K59103J45003l0853j39078j64901j43074k5303J76733
18854A998381R0093j9142N7581j99958Q0583l5493J6244J80586k33272m39306
18844A496297m0546Q6188J52999K52832J6302O57J2148J81618m2860l5395k18114
18833A862126j31003J09592O5179m1033K47819O7970m9438j74835r5322N7314
18823A918369J49775N0892k1965P7780J07707k1121K4383m0446j54129k32762
$$ plain form
18813 1858483 1486693 1481843 1418246 1298127 1554434 1736442 1930865 1912659 1865227 1757563
18803 1757563 1797200 1783126 1645106 1693708 1848541 2027282 2045614 1966021 1830914 1826771 1560117
18792 1560117 1343637 1319044 1389498 1633508 1765391 1726426 1915538 1851319 1963914 2089034
18782 2089034 2177800 2258613 2310578 2303157 2401010 2484636 2576403 2499244 2310164 2284973 2287083
18771 2287083 2180058 1996518 1935734 2021319 1921532 1809483 1709225 1710190 1842292 2037876
18761 2037876 1823635 1649171 1719694 1912077 2163517 2335420 2493165 2525019 2308364 2249589
18751 2249589 2109112 1911385 1822543 1914333 2161803 2137855 2156424 2172345 2054072 1678081
18741 1678081 1706304 2065424 2353256 2189823 2051502 1934480 2059188 1872869 1729951 1919244
$$ packed form
18813A858483l71790m850o3597j20119K56307J82008J94423j8206m7432j07664
18803A757563L9637j4074j38020M8602J54833J78741J8332p9593j35107m143k66654
18792A560117k16480k4593P0454K44010J31883l8965J89112o4219J12595J25120
18782B089034Q8766Q0813N1965p421R7853Q3626R1767p7159j89080k5191K110
18771B287083j07025j83540o0784Q5585r9787j12049j00258R65J32102J95584
18761B037876k14241j74464P0523J92383K51440J71903J57745L1854k16655n8775
18751B249589j40477j97727q8842R1790K47470k3948J8569J5921j18273l75991
18741A678081K8223L59120K87832j63433j38321j17022J24708j86319j42918J89293
$$ plain form
18731 1919244 2133240 2083568 1849070 1542066 1286978 1186002 1146644 1280557 969380 904106
18721 904106 1080399 960685 1137960 1361220 1458313 1322179 1235664 1017149 984187 987738
18711 987738 1150731 1215536 1251936 1168620 1219389 1259991 1422463 1506197 1349228 1302555 1343528
18700 1343528 1287855 1531448 1558426 1441042 1259493 1189604 1210806 1513151 1621330 1651839
18690 1651839 1679847 1711688 1778425 1788406 1866207 1798900 1823070 1852928 1880189 1827044 1724127
18679 1724127 1663903 1692288 1745915 1896475 1975487 1936455 1866762 1575921 1451243 1407177 1440408
18668 1440408 1582375 1532955 1703762 1961401 1845499 1565684 1527082 1546150 1619876 1672966
18658 1672966 1763420 1783366 1482099 1245868 1140412 1131302 1182172 1442440 1431015 1471306 1443693
$$ packed form
18731A919244K13996m9672k34498l07004k55088j00976l9358J33913l11177o5274
18721I04106J76293j19714J77275K23260R7093j36134q6515k18515l2962L551
18711I87738J62993O4805L6400q3316N0769M0602J62472Q3734j56969m6673M0973
18700A343528n5673K43593K6978j17384j81549o9889K1202L02345J08179L0509
18690A651839K8008L1841O6737R981P7801o7307K4170K9858K7261n3145j02917
18679A724127o0224K8385N3627J50560P9012l9032o9693k90841j24678m4066L3231
18668A440408J41967m9420J70807K57639j15902k79815l8602J9068P3726N3090
18658A672966R0454J9946l01267k36231j05456r110N0870K60268j1425M0291k7613
$$ plain form
18647 1443693 1178583 830327 781700 755490 553714 665258 982306 903407 914327 913172
18637 913172 941638 1142779 1097144 1043980 1201912 1270614 1047411 1025124 1194629 1301241
18627 1301241 1552138 1458525 1288930 1286445 1311559 1300755 1246381 1267988 1340135 1491474 1406862
18616 1406862 1182489 1077099 1035336 1060233 1182116 1163492 1231341 1211660 1234170 1378371
18606 1378371 1313298 957827 972532 1106412 1007244 994792 917091 926655 989433 838563 877927
18595 877927 738746 717718 1009909 1117249 1112846 996989 926892 882122 807988 865072 824776
18584 824776 837522 951823 917457 907730 818707 702733 646810 772323 966689 1033373 1102800
18573 1102800 1161007 1038100 994512 976041 989711 936442 991935 1081634 760636 724121 724139
$$ packed form
18647A443693k65110l48256m8627k6210k01776J11544L17048p8899J0920j155
18637I13172K8466K01141m5635n3164J57932O8702k23203k2287J69505J06612
18627A301241K50897r3613j69595k485K5114j0804n4374K1607P2147J51339q4612
18616A406862k24373j05390m1763K4897J21883j8624O7849j9681K2510J44201
18606A378371o5073l55471J4705J33880r9168j2452p7701R564O2778j50870L9364
18595H77927j39181k1028K92191J07340m403j15857p0097m4770p4134N7084m0296
18584H24776J2746J14301l4366r727q9023j15974n5923J25513J94366O6684O9427
18573A102800N8207j22907m3588j8471J3670n3269N5493Q9699l20998l6515J8
$$ plain form
18562 724139 712664 614824 731241 813969 803487 871776 879367 755270 791506 842690 775531
18551 775531 790593 795070 744776 611346 630197 582594 627132 717847 670124 741182 897662
18540 897662 946548 1000863 652811 359238 398471 489865 352715 458687 813928 771031
18530 771031 630128 701242 677175 924701 823594 653667 692101 720941 950394 1032528
18520 1032528 896772 931182 1025336 808637 530951 520118 658652 581551 639797 671650
18510 671650 591815 649142 552377 371748 438118 832116 822622 921228 881810 874089 913103
18499 913103 891128 1052871 1206406 1269635 1318224 1114995 1032149 1285644 1590759 1645345
18489 1645345 1506939 1574467 1841374 1890274 1512464 1250752 1212206 1317573 1536316 1771223
$$ packed form
18562G24139j1475r7840J16417Q2728j0482O8289P591j24097L6236N1184o7159
18551G75531J5062M477n0294j33430J8851m7603M4538R0715m7723P1058J56480
18540H97662M8886N4315l48052k93573L9233R1394j37150J05972L55241m2897
18530G71031j40903P1114k4067K47526j01107j69927L8434K8840K29453Q2134
18520A032528j35756L4410R4154k16699k77686j0833J38534p7101N8246L1853
18510F71650p9835N7327r6765j80629O6370L93998r494R8606l9418p721L9014
18499I13103k1975J61743J53535O3229M8589k03229q2846K53495L05115N4586
18489A645345j38406O7528K66907M8900l77810k61712l8546J05367K18743K34907
$$ plain form
18479 1771223 1976953 2124350 2244299 2533118 2634730 2861274 2854882 2790652 2741992 2815240
18469 2815240 3118520 3488714 3529858 3780446 3609853 3149607 2892765 2704291 2465457 2235293
18459 2235293 1966984 1866280 1839612 1658780 1492788 1255307 1213191 1249241 1330833 1232291
18449 1232291 1107340 1059713 1313021 1635654 1812335 2233330 2479672 2529616 2761968 2882282
18439 2882282 2744138 2906037 3209699 3577543 3701083 3827378 3515517 2988765 2834724
18430 2834724 2861548 2794325 2865100 3083535 3031709 2767283 2590868 2536505 2579068 2624266 2466369
18419 2466369 2437606 2190282 1968488 1782182 1707350 1458089 1441215 1368862 1392715 1572565
18409 1572565 1986601 2286193 2423383 2757951 2844767 2907700 2879537 2692833 2606769 2457059
$$ packed form
18479A771223K05730J47397J19949K88819J01612K26544o392o4230m8660P3248
18469B815240L03280L70194M1144K50588j70593m60246k56842j88474k38834k30164
18459B235293k68309j00704k6668j80832j65992k37481m2116L6050Q1592r8542
18449A232291j24951m7627K53308L22633J76681M20995K46342M9944K32352J20314
18439B882282j38144J61899L03662L67844J23540J26295l11861n26752j54041
18430B834724K6824o7223P0775K18435n1826k64426j76415n4363M2563M5198j57897
18419B466369k8763k47324k21794j86306p4832k49261j6874p2353K3853J79850
18409A572565M14036K99592J37190L34568Q6816O2933k8163j86704q6064j49710
$$ plain form
18399 2457059 2644785 2832011 2828409 2712915 2702621 2647359 2347699 2211262 2669192 3079611
18389 3079611 3226826 3499857 3996546 4196672 4571444 5012994 5770599 6697818 7007810
18380 7007810 6703089 6074392 5283195 4663693 4034880 3322729 3141064 3063086 3104730 3222051
18370 3222051 3157015 3249272 3524960 3927133 4326465 4764813 4959393 4609403 4344197 4306530
18360 4306530 4101028 3929904 4275620 4711424 5199867 6104050 7158843 7717332 7662308
18351 7662308 7603997 7618850 7692888 8094189 9079555 10152022 11551852 13540787 16072394
18342 16072394 19990172 25658348 34236293 46649178 62737601 79717833 90712996
18335 90712996 89249750 77234614 62093494 49785952 41921305 37358002 35679170 37145654
$$ packed form
18399B457059J87726J87226l602j15494j0294n5262k99660j36437M57930M10419
18389C079611J47215K73031M96689K00126L74772M41550P57605R27219L09992
18380G007810l04721o28697p91197o19502o28813p12151j81665p7978M1644J17321
18370C222051o5036R2257K75688M02173L99332M38348J94580l49990k65206l7667
18360D306530k05502j71124L45716M35804M88443R04183J054793N58489n5024
18351G662308n8311J4853P4038M01301R85366J072467J399830J988935K531607
18342A6072394L917778N668176Q577945J2412885J6088423J6980232J0995163
18335I0712996j463246j2015136j5141120j2307542p864647m563303j678832J466484
$$ plain form
18327 37145654 42011140 51378043 65588703 82647344 95524074 95391212 81627894 62935836
18319 62935836 47525799 37386836 31406448 27689526 25287626 24419360 24737135 25696158
18311 25696158 27794745 31663121 37352113 46151667 58610332 73992406 88215161 94852441
18303 94852441 91378372 81329253 71457813 66216353 66856120 73907576 87295514 105311724
18295 105311724 123905461 138580099 146556529 145783046 132718077 110768285 88720119
18288 88720119 72649121 63878561 61449014 64380349 72394004 83257432 92022957 92534995
18280 92534995 83068833 68321434 54215524 43598328 36367062 31684765 28602155 26800140
18272 26800140 26088042 26221471 27493811 29848026 33416012 39481769 48284286 60178841
$$ packed form
18327C7145654M865486R366903J4210660J7058641J2876730j32862j3763318j8692058
18319F2935836j5410037j0138963n980388l716922k401900q68266L17775R59023
18311B5696158K098587L868376N688992Q799554J2458665J5382074J4222755O637280
18303I4852441l474069j0049119r871440n241460O39767P051456J3387938J8016210
18295A05311724J8593737J4674638P976430p73483j3064969k1949792k2048166
18288H8720119j6070998q770560k429547K931335Q013655J0863428Q765525N12038
18280I2534995r466162j4747399j4105910j0617196p231266m682297l082610j802015
18272B6800140p12098J33429J272340K354215L567986O065757Q802517J1894555
$$ plain form
18264 60178841 74556086 88036317 95099136 93026294 85647622 79104178 77502545 82551875
18256 82551875 94783120 114472453 141343421 173727976 209932095 249134660 286518666
18249 286518666 311360059 310856110 283164578 242894968 205637476 176120762 150891781
18242 150891781 127077394 105433146 87787360 74924311 66341790 61207778 58945251
18235 58945251 59047320 61810794 67877643 78328212 93519883 112453024 132680055 153081517
18227 153081517 175327868 200946277 225549391 235542623 222936434 195905893 168185313
18220 168185313 144661314 122709138 100912912 80338273 63111379 49891923 40095267
18213 40095267 33068003 27999787 24301957 21354777 18906832 16896554 15352547 14426868
$$ packed form
18264F0178841J4377245J3480231P062819k072842p378672o543444j601633N049330
18256H2551875J2231245J9689333K6870968L2384555L6204119L9202565L7384006
18249B86518666K4841393n03949k7691532m0269610l7257492k9516714k5228981
18242A50891781k3814387k1644248j7645786j2863049q582521n134012k262527
18235E8945251J02069K763474O066849J0450569J5191671J8933141K0227031K0401462
18227A53081517K2246351K5618409K4603114R993232j2606189k7030541k7720580
18220A68185313k3523999k1952176k1796226k0574639j7226894j3219456r796656
18213D0095267p027264n068216l697830k947180k447945k010278j544007r25679
$$ plain form
18205 14426868 13715462 13094511 12690009 12118509 11573337 10869363 9773958 8816631 8127190
18196 8127190 7612419 7285849 6932431 6697386 6399114 5887723 5397539 5115211 4764655
18187 4764655 4378047 4263109 4024373 3621360 3220211 3348232 3374230 3098685 2857897 2671326
18177 2671326 2452293 2485965 2497369 2400452 2420446 2488973 2726957 2922935 2735146 2443142
18167 2443142 2384815 2113880 1850558 1912237 2021459 2240828 2080039 1929518 2084823 2102925
18157 2102925 1905720 1634223 1470628 1714430 1924947 1935143 1793383 1842856 1663342 1519071
18147 1519071 1336765 1278756 1437768 1605006 1734941 1651834 1510883 1472026 1499833 1521973
18137 1521973 1466464 1280752 1227568 1228350 1493051 1618609 1529845 1211129 1018277 972705 888572
$$ packed form
18205A4426868p11406o20951m04502n71500n45172p03974j095405r57327o89441
18196H127190n14771l26570l53418k35045k98272n11391m90184k82328l50556
18187D764655l86608j14938k38736m03013m01149J28021K5998k75545k40788j86571
18177B671326k19033L3672J1404r6917J9994O8527K37984J95978j87789k92004
18167B443142n8327k70935k63322O1679J09222K19369j60789j50521J55305J8102
18157B102925j97205k71497j63595K43802K10517J0196j41760M9473j79514j44271
18147A519071j82306n8009J59012J67238J29935q3107j40951l8857K7807K2140
18137A521973n5509j85712n3184P82K64701J25558q8764l18716j92852m5572q4133
$$ plain form
18126 888572 823108 910441 1112286 1138594 1007798 1005996 1170335 1051968 1057955 1146878 1091856
18115 1091856 1395955 1247528 1268434 1352115 1330717 1377681 1215592 1294621 1277891 1285224 1353147
18104 1353147 1418373 1351397 1323175 1358420 1389564 1368323 1514551 1755741 2263845 2884181
18094 2884181 3738613 3793647 3378994 2895770 2297916 1797853 1684822 1572327 1533752 1485998
18084 1485998 1504306 1714998 1564344 1480088 1325065 1130054 1166614 1386126 1548888 1558127
18074 1558127 1649099 1752382 2264549 3229766 4006293 3934847 3476805 2732421 2151550 2243624
18064 2243624 2387433 2914320 3619914 3717367 3382991 2841178 2272669 2082749 2011950 1860921
18054 1860921 1581402 1457112 1277727 1096569 1029738 1259465 1271709 1170252 1223013 1302181
$$ packed form
18126H88572o5464Q7333K01845K6308j30796j802J64339j18367N987Q8923n5022
18115A091856L04099j48427K0906Q3681k1398M6964j62089P9029j6730P333O7923
18104A353147O5226o6976k8222L5245L1144k1241J46228K41190N08104O20336
18094B884181Q54432N5034m14653m83224n97854n00063j13031j12495l8575m7754
18084A485998J8308K10692j50654q4256j55023j95011L6560K19512J62762R239
18074A558127R0972J03283N12167R65217P76527p1446m58042p44384n80871R2074
18064B243624J43809N26887P05594R7453l34376n41813n68509j89920p0799j51029
18054A860921k79519j24290j79385j81158o6831K29727J2244j01457N2761P9168
$$ plain form
18044 1302181 1291448 1206938 1127418 1572132 2049311 2732429 3281182 3211666 2813029 2379536
18034 2379536 1904905 1503213 1236258 1353785 1249266 1121400 1047261 848200 762111 812741
18024 812741 868039 825101 693913 526259 586339 508592 518508 752517 802527 737986 492586
18013 492586 351883 467384 672041 594982 901050 932430 716946 595158 445963 780812
18003 780812 873377 576943 562353 658760 343757 660840 923404 936098 767381 477322
17993 477322 457036 355908 346053 398627 556329 449234 614782 611932 402424 240168 339228
17982 339228 426519 448652 602330 998313 879147 597064 653199 746704 422543 119418
17972 119418 199862 345363 304844 414059 413232 562072 445094 357071 587557 625391 674536
$$ packed form
18044A302181j0733q4510p9520M44714M77179O83118N48753o9516l98637m33493
18034B379536m74631m01692k66955J17527j04519j27866p4139j99061q6089N0630
18024H12741N5298m2938j31188j67654O0080p7747R916K34009N0010o4541k45400
18013D92586j40703J15501K04657p7059L06068L1380k15484j21788j49195L34849
18003G80812R2565k96434j4590R6407l15003L17083K62564J2694j68717k90059
17993D77322k0286j01128r855N2574J57702j07095J65548k850k09508j62256R9060
17982C39228Q7291K2133J53678L95983j19166k82083N6135R3505l24161l03125
17972A19418Q0444J45501m0519J09215q27J48840j16978q8023K30486L7834M9145
$$ plain form
17961 674536 733450 698579 556671 479763 370901 416833 609039 816820 755197 653226
17951 653226 499754 315094 196679 362826 207849 46637 257033 300418 198360 441197
17941 441197 541571 649231 584404 492385 466466 549666 593366 590205 397915 408985 216952
17930 216952 302618 439165 421259 465861 343616 323025 433460 404814 240592 111861
17920 111861 134983 353504 442303 572529 579666 525618 520500 246722 -10938 -36617 210138
17909 210138 342522 485391 542279 380969 405708 553291 566607 686636 701713 461402
17899 461402 581867 424230 242353 223146 216030 208751 294512 267405 357520 122889 175725
17888 175725 245038 298322 591167 328752 192049 51752 29229 84810 105528 204577 358123
$$ packed form
17961F74536N8914l4871j41908p6908j08862M5932J92206K07781o1623j01971
17951F53226j53472j84660j18415J66147j54977j61212K10396M3385j02058K42837
17941D41197J00374J07660o4827r2019k5919Q3200M3700l161j92290J1070j92033
17930B16952Q5666J36547j7906M4602j22245k0591J10435k8646j64222j28731
17920A11861K3122K18521Q8799J30226P137n4048n118k73778k57660k5679K46755
17909B10138J32384J42869N6888j61310K4739J47583J3316J20029J5077k40311
17899D61402J20465j57637j81877j9207p116p279Q5761k7107R0115k34631N2836
17888A75725O9313N3284K92845k62415j36703j40297k2523N5581K0718R9049J53546
$$ plain form
17877 358123 414222 458796 589692 726353 747780 541645 450050 507986 760222 721721 657694
17866 657694 629082 499493 298066 528462 866200 906136 799297 618480 691613 784950
17856 784950 576790 482427 567164 585231 447539 322125 277263 161933 -54771 36466
17846 36466 235301 148200 231299 316423 249965 168327 296133 433348 550613 374661 436820
17835 436820 509725 325858 409690 350531 360084 395136 518920 461985 364124 300636 278762
17824 278762 415236 332829 473104 627323 638459 570042 622546 741676 489149 165347
17814 165347 373523 590689 693437 643138 212915 285739 491799 700231 658957 537445
17804 537445 572209 687244 486927 437831 487352 491311 734448 770827 583590 466732 565127
$$ packed form
17877C58123N6099M4574J30896J36661K1427k06135r1595N7936K52236l8501o4027
17866F57694k8612j29589k01427K30396L37738L9936j06839j80817P3133R3337
17856G84950k08160r4363Q4737J8067j37692j25414m4862j15330k16704R1237
17846C6466J98835q7101Q3099Q5124o6458q1638J27806J37215J17265j75952O2159
17835D36820P2905j83867Q3832n9159R553L5052J23784n6935r7861o3488k1874
17824B78762J36474q2407J40275J54219J1136o8417N2504J19130k52527l23802
17814A65347K08176K17166J02748n0299m30223P2824K06060K08432m1274j21512
17804E37445L4764J15035k00317m9096M9521L959K43137L6379j87237j16858R8395
$$ plain form
17793 565127 700896 521937 353048 269068 333840 469343 589448 637729 910959 848602
17783 848602 433335 231706 342512 460074 294338 212307 458987 751616 869375 887442
17773 887442 944478 1078156 1038500 1058723 959598 1026097 961712 823571 810668 998683 1149523
17762 1149523 972028 749357 706040 706504 710852 578561 507792 517211 501287 469242 566962
17751 566962 572512 687674 460153 463538 439497 466077 534211 397098 219036 318165 447178
17740 447178 458223 364316 222729 204364 359171 354186 454366 352773 393354 400324 142173
17729 142173 102847 177987 411866 639088 567173 460537 548646 509381 554944 744203 1062530
17718 1062530 1220042 1173321 1080200 928621 956060 1163313 1220315 1161936 1369864 1388009
$$ packed form
17793E65127J35769j78959j68889q3980O4772J35503J20105M8281K73230o2357
17783H48602m15267k01629J10806J17562j65736q2031K46680K92629J17759J8067
17773H87442N7036J33678l9656K0223r9125O6499o4385j38141j2903J88015J50840
17762A149523j77495k22671m3317M64M348j32291p0769R419j5924l2045R7720
17751E66962N550J15162k27521L385k4041K6580O8134j37113j78062R9129J29013
17740D47178J1045r3907j41587j8365J54807m985J00180j01593M0581O970k58151
17729A42173l9326P5140K33879K27222p1915j06636Q8109l9265M5563J89259L18327
17718A062530J57512m6721r3121j51579K7439K07253N7002n8379K07928J8145
$$ plain form
17708 1388009 1330207 880631 689212 555897 378297 360330 386256 534853 588581 565845
17698 565845 553489 678692 767876 778058 882993 858814 999254 1105061 1320350 1410976
17688 1410976 1559885 1463092 1350837 1216754 901548 897909 1018198 1131016 1011514 789865
17678 789865 760390 631908 620560 590861 637327 850692 859766 544927 391960 425794 645067
17667 645067 732383 754366 798875 942072 882375 809268 862547 699833 1022108 1475912 1845392
17656 1845392 2219491 2174165 1955272 1713667 1731909 1771448 2207902 2488341 2233383 2155566
17646 2155566 1879742 1661693 1507769 1522866 1688796 1725849 1622665 1801648 1678527 1523169
17636 1523169 1651341 2147650 2163550 2073678 2194185 2260278 2092280 1759660 1606984 1661205
$$ packed form
17708A388009n7802m49576j91419j33315j77600j7967K5926J48597N3728k2736
17698E65845j2356J25203Q9184J0182J04935k4179J40440J05807K15289R0626
17688A410976J48909r6793j12255j34083l15206l639J20289J12818j19502k21649
17678G89865k9475j28482j1348k9699M6466K13365R074l14839j52967L3834K19273
17667F45067Q7316K1983M4509J43197n9697p3107N3279j62714L22275M53804L69480
17656A845392L74099m5326k18893k41605J8242L9539M36454K80439k54958p7817
17646B155566k75824k18049j53924J5097J65930L7053j03184J78983j23121j55358
17636A523169J28172M96309J5900q9872J20507O6093j67998l32620j52676N4221
$$ plain form
17626 1661205 1875160 2028925 2179135 1938167 1517327 1271244 1109684 1138454 1266875 1162705
17616 1162705 1016950 929792 549611 438481 258157 210631 265600 357785 201793 100679
17606 100679 153880 264416 278095 225542 374308 405024 390006 104318 -111060 60999
17596 60999 8597 -220871 -312262 -57637 193799 244006 189799 307438 661561 679446 241708
17585 241708 8470 98052 239655 246231 132712 116594 99613 33887 139865 412507 486097
17574 486097 436868 360838 15448 -176307 -20487 108386 114778 99820 133473 112232 -4473
17563 -4473 -48449 -170635 -38081 67040 420729 513334 259599 366941 495902 657280
17553 657280 682112 697165 599297 443494 412795 483758 578610 500330 282673 357823 396571
$$ packed form
17626A661205K13955J53765J50210k40968m20840k46083j61560K8770J28421j04170
17616A162705j45755q7158l80181j11130j80324m7526N4969R2185j55992j01114
17606A00679N3201J10536J3679n2553J48766L0716j5018k85688k15378J72059
17596F0999n2402k29468r1391K54625K51436N0207n4207J17639L54123J7885m37738
17585B41708k33238Q9582J41603O576j13519j6118j6981o5726J05978K72642P3590
17574D86097m9229p6030l45390j91755J55820J28873O392j4958L3653k1241j16705
17563d473m3976j22186J32554J05121L53689R2605k53735J07342J28961J61378
17553F57280K4832J5053r7868j55803l0699P0963R4852p8280k17657P5150L8748
$$ plain form
17542 396571 610127 515211 437398 414425 387444 212498 104662 196230 151000 82093 130139
17531 130139 155262 46060 78563 190227 -137863 -205638 -126223 94019 -101760 -55435
17521 -55435 337076 364492 55431 23455 170921 47641 196416 376687 454274 384472
17511 384472 409456 375547 101697 14047 92175 87249 -31299 -63255 54136 -11112 -166454
17500 -166454 -113814 35476 127046 378776 407725 463802 281161 204774 -25355 -216016
17490 -216016 -13514 -12726 -218580 -204317 -22190 29360 -6766 -93857 -235267 -156578 -21856
17479 -21856 -39651 -26223 -26842 -83453 -48227 69918 193142 403966 449643 409746 221660
17468 221660 184022 221623 262283 387777 291076 272360 907 -115118 66024 93708 41205
$$ packed form
17542C96571K13556r4916p7813k2973k6981j74946j07836R1568m5230o8907M8046
17531A30139K5123j09202L2503J11664l28090o7775P9415K20242j95779M6325
17521e5435L92511K7416l09061l1976J47466j23280J48775J80271P7587o9802
17511C84472K4984l3909k73850q7650P8128m926j18548l1956J17391o5248j55342
17500a66454N2640J49290R1570K51730K8949N6077j82641p6387k30129j90661
17490b16016K02502P88k05854J4263J82127N1550l6126q7091j41410P8689J34722
17479b1856j7795J3428o19n6611L5226J18145J23224K10824M5677l9897j88086
17468B21660l7638L7601M0660J25494r6701j8716k71453j16025J81142K7684n2503
$$ plain form
17457 41205 -7739 -178973 -136542 -98480 202649 236002 -21115 3578 -115447 -15599 -29206
17446 -29206 -50873 -34706 -47845 -106348 121499 170476 359870 98239 -25827 -24684 -48638
17435 -48638 -198920 3995 28603 57750 255280 272836 38954 -19034 -81994 51839 307509
17424 307509 319235 73758 179078 302361 115822 -95191 -17041 -75753 78435 317638
17414 317638 219514 160179 249097 292127 116602 54872 170952 -70793 -320502 -121431
17404 -121431 16638 -156779 -195022 -291862 -174896 244172 396064 179568 6605 -109721
17394 -109721 3016 106050 252058 118758 66959 -48513 -178571 -75518 46348 174155
17384 174155 338402 302899 304222 248388 47416 -54473 -51585 -23216 106823 336360 340240
$$ packed form
17457D1205m8944j71234M2431L8062L01129L3353k57117K4693j19025R9848j3607
17446b9206k1667J6167j3139n8503K27847M8977J89394k61631j24066J143k3954
17435d8638j50282K02915K4608K9147J97530J7556k33882n7988o2960J33833K55670
17424C07509J1726k45477J05320J23283j86539k11013P8150n8712J54188K39203
17414C17638r8124n9335Q8918M3030j75525o1730J16080k41745k49709J99071
17404a21431J38069j73417l8243r6840J16966M19068J51892k16496j72963j16326
17394a09721J12737J03034J46008j33300n1799j15472j30058J03053J21866J27807
17384A74155J64247l5503J323n5834k00972j01889K888K8369J30039K29537L880
$$ plain form
17373 340240 192666 252891 288038 229912 79842 246472 206466 115142 17005 193987 209161
17362 209161 105302 79890 152472 170129 29157 56481 -209343 -119699 178785 319912
17352 319912 80163 -40127 -110131 39237 45703 -84702 88892 231852 168892 181531
17342 181531 110071 14493 -59686 19510 -10794 37120 237454 377209 527093 395945 96551
17331 96551 -66245 20772 218373 258447 -78023 -322366 -181472 -334510 -442350 -413442
17321 -413442 -273844 -24231 130215 -142742 -185986 37541 261818 2008 -186831 -19640
17311 -19640 -49152 -125404 -120827 -82432 -61104 -82684 12561 66778 261584 216068 -40376
17300 -40376 217304 139264 154806 303328 164533 -137140 -288794 -419574 -361914 -246533
$$ packed form
17373C40240j47574O0225L5147n8126j50070J66630m0006r1324r8137J76982J5174
17362B09161j03859k5412P2582J7657j40972K7324k65824Q9644K98484J41127
17352C19912k39749j20290p0004J49368O466j30405J73594J42960o2960J2639
17342A81531p1460r5578p4179P9196l0304M7914K00334J39755J49884j31148k99394
17331I6551j62796Q7017J97601M0074l36470k44343J40894j53038j07840K8908
17321d13442J39598K49613J54446k72957m3244K23527K24277k59810j88839J67191
17311a9640k9512p6252M577L8395K1328k1580R5245N4217J94806m5516k56444
17300d0376K57680p8040J5542J48522j38795l01673j51654j30780N7660J15381
$$ plain form
17290 -246533 -165863 -39329 147207 89233 -74981 82144 284297 295063 200773 269862
17280 269862 53246 -165688 -132248 -176344 -198922 -14210 84753 203986 187908 239481 196435
17269 196435 202001 205541 215576 220855 -11591 -86231 2334 -10728 165929 156443 128994 223417
17257 223417 363035 200085 91509 -381322 -288921 -35333 -26810 99620 373265 508748
17247 508748 647759 496878 249543 235314 15379 -110285 64056 174088 176907 184083
17237 184083 229276 268519 264715 143358 -242279 -217328 -217247 -134913 -206058 -98830 -37922 -29578
17225 -29578 -177285 -380069 -173177 121728 -29577 -30097 -14000 -270003 55841 257083
17215 257083 205032 -32852 -220401 -292604 -152427 75921 97854 91662 194481 177495 114765
$$ packed form
17290b46533Q0670J26534J86536n7974j64214J57125K02153J0766r4290O9089
17280B69862k16616k18934L3440m4096k2578J84712R8963J19233j6078N1573m3046
17269A96435N566L540J0035N279k32446p4640Q8565j3062J76657r486k7449R4423
17257B23417J39618j62950j08576m72831R2401K53588Q523J26430K73645J35483
17247E08748J39011j50881k47335j4229k19935j25664J74341J10032K819P176
17237A84083M5193L9243l804j21357l85637K4951Q1Q2334p1145J07228O0908Q344
17225b9578j47707k02784K06892K94905j51305n20J6097k56003L25844K01242
17215B57083n2051k37884j87549p2203J40177K28348K1933o192J02819j6986o2730
$$ plain form
17204 114765 40563 72387 103652 -152651 -124907 -24266 39452 70867 -44113 -228078 -166373
17193 -166373 -10169 -98342 -184539 -18420 78483 -19665 -81757 -36252 -323302 -429790 -403440
17182 -403440 -287020 -31645 223281 422111 340748 186758 374726 219672 43001 -97930
17172 -97930 -127257 -112259 -63452 -16165 141017 127848 15951 25053 54035 142293 59113
17161 59113 24548 -37496 -114139 -193693 -231740 -215539 -91735 130421 315353 286095 147114
17150 147114 98823 51387 -154107 -320184 -220128 31865 79478 25349 -9405 -189337
17140 -189337 37583 203234 305949 160169 104032 -46730 -135039 -96483 -218135 6103
17130 6103 252512 -96190 -348066 -471634 -438104 -394309 -293366 -184105 -37747 -130626
$$ packed form
17204A14765p4202L1824L1265k56303K7744J00641O3718L1415j14980j83965O1705
17193a66373J56204q8173q6197J66119R6903r8148o2092M5505k87050j06488K6350
17182d03440J16420K55375K54926J98830q1363j53990J87968j55054j76671j40931
17172i7930k9327J4998M8807M7287J57182j3169j11897R102K8982Q8258q3180
17161E9113l4565o2044p6643p9554l8047J6201J23804K22156J84932k9258j38981
17150A47114m8291m7436k05494j66077J00056K51993M7613n4129l4754j79932
17140a89337K26920J65651J02715j45780n6137j50762q8309L8556j21652K24238
17130F103K46409l48702k51876j23568L3530M3795J00943J09261J46358r2879
$$ plain form
17120 -130626 4252 -107556 6512 95642 41644 -40290 -50596 -130789 51489 350657
17110 350657 352237 23687 -93452 -38935 62997 130890 -130232 -114466 9463 -5719 -4381
17099 -4381 -189630 -209997 125152 16489 114166 216285 248152 207642 80729 132640 181458
17088 181458 255412 129014 -79455 -95598 -266685 -390937 -203995 -150495 53423 176922
17078 176922 276545 86654 -144380 -323559 -507956 -552679 -399605 -234696 -218417 -89021
17068 -89021 24372 98908 -130365 -193593 -92774 116273 110468 -181704 -298847 -275731 -98160
17057 -98160 -7328 -66198 -89994 -97101 -152581 -62095 -96286 -131025 52437 60609 81784 232859
17045 232859 237008 288067 383911 236832 589 -95550 -126021 122628 150949 8803 61405
$$ packed form
17120a30626J34878j11808J14068Q9130n3998q1934j0306q0193J82278K99168
17110C50657J580l28550j17139N4517J01932O7893k61122J5766J23929j5182J338
17099d381j85249k0367L35149j08663R7677J02119L1867m0510j26913N1911M8818
17088A81458P3954j26398k08469j6143j71087j24252J86942N3500K03918J23499
17078A76922R9623j89891k31034j79179j84397m4723J53074J64909J6279J29396
17068h9021J13393P4536k29273o3228J00819K09047n805k92172j17143K3116J77571
17057i8160R0832n8870k3796p107n5480R0486l4191l4739J83462Q172K1175J51075
17045B32859M149N1059R5844j47079k36243r6139l0471K48649K8321j42146N2602
$$ plain form
17034 61405 53934 -5370 34647 199091 362885 133116 6869 -11533 -133482 -114091 -32945
17023 -32945 -8256 -34212 45471 54872 33894 348402 376583 315434 93022 -68936 -9502
17012 -9502 141387 261669 458628 406023 36865 -92084 92618 306237 418886 476766
17002 476766 454960 442644 427665 337559 76562 171419 85237 61924 -192869 -29343 151125
16991 151125 187198 156996 56075 -170639 -126037 -265945 -226020 -128525 21518 312306
16981 312306 374038 109951 -159333 -226971 -337714 -209350 -51980 51152 74065 36262
16971 36262 -139774 -221367 -103294 27214 92464 -4362 7771 -115664 -185121 36089 124819
16960 124819 199879 73694 -71526 67527 -23344 -268927 -225022 89577 274635 254267
$$ packed form
17034F1405p471n9304M0017J64444J63794k29769j26247j8402j21949J9391Q1146
17023c2945K4689k5956P9683R401k0978L14508K8181o1149k22412j61958N9434
17012i502J50889J20282J96959n2605l69158j28949J84702K13619J12649N7880
17002D76766k1806j2316j4979r0106k60997R4857q6182k3313k54793J63526J80468
16991A51125L6073l0202j00921k26714M4602j39908L9925R7495J50043K90788
16981C12306O1732k64087k69284o7638j10743J28364J57370J03132K2913l7803
16971C6262j76036q1593J18073J30508O5250r6826J2133j23435o9457K21210Q8730
16960A24819P5060j26185j45220J39053r0871k45583M3905L14599J85058k0368
$$ plain form
16950 254267 138376 -42765 -141142 -66021 86695 -94193 -44071 145614 57678 108025
16940 108025 286823 378219 552751 375087 220934 147311 72268 123863 199508 64627
16930 64627 50460 197128 374293 299592 223856 237243 302018 284938 246622 58795 -81675
16919 -81675 -249262 -633435 -486619 -372207 -309982 -274573 -59027 -153166 -243855 -538679
16909 -538679 -647166 -283718 -238389 -79034 308522 392215 241608 52915 -84596 -152196
16899 -152196 -96128 5491 129022 138636 185136 370380 251681 41012 -104143 -252005
16889 -252005 61067 192673 125796 246465 313366 111617 162009 -22157 -217323 -341992
16879 -341992 -275317 -257653 -198293 -80825 -161914 -198685 155870 -62479 20848 144799 60083
$$ packed form
16950B54267j15891j81141r8377P5121J52716j80888N0122J89685q7936N0347
16940A08025J78798R1396J74532j77664j54153p3623p5043N1595P5645j34881
16930F4627j4167J46668J77165p4701p5736J3387O4775j7080l8316j87827j40470
16919h1675j67587l84173J46816J14412O2225L5409K15546r4139r0689k94824
16909e38679j08487L63448M5329J59355L87556Q3693j50607j88693j37511o7600
16899a52196N6068J01619J23531R614M6500J85244j18699k10669j45155j47862
16889b52005L13072J31606o6877J20669O6901k01749N0392j84166j95166j24669
16879c41992O6675J7664N9360J17468q1089l6771L54555k18349Q3327J23951q4716
$$ plain form
16868 60083 -103811 -133893 73779 186966 101263 -146947 -49609 -87873 -205061 -82492
16858 -82492 -2817 177688 419077 535400 301498 62758 175963 203748 101673 -105025
16848 -105025 -7171 223411 280667 293732 151634 -21235 371 82827 260972 361527
16838 361527 364961 196994 23802 165607 247614 77150 63400 288090 60610 33791
16828 33791 -91945 -377263 -428580 -179819 -107156 -113839 -44608 -96885 -335097 -295326 -15190
16817 -15190 47231 -120493 -207296 -357746 -309477 -370442 -348699 -354337 -455544 -309935 -131290
16806 -131290 -80060 -157764 -218745 -268972 -263358 -357540 -259836 -98850 -54863 -163013 -111259
16795 -111259 61109 188543 336112 205087 25054 27643 -266412 -367972 -316487 -194735
$$ packed form
16868F0083j63894l0082K07672J13187q5703k48210R7338l8264j17188J22569
16858h2492P9675J80505K41389J16323k33902k38740J13205K7785j02075k06698
16848a05025R7854K30582N7256J3065j42098j72869K1606Q2456J78145J00555
16838C61527L434j67967j73192J41805Q2007j70464j3750K24690k27480k6819
16828C3791j25736k85318n1317K48761P2663o683O9231n2277k38212L9771K80136
16817a5190O2421j67724q6803j50450M8269o0965K1743n638j01207J45609J78645
16806a31290N1230p7704o0981n0227N614r4182R7704J60986M3987j08150N1754
16795a11259J72368J27434J47569j31025j80033K589k94055j01560N1485J21752
$$ plain form
16785 -194735 -203102 -331761 -369918 -422514 -499171 -529963 -427540 -164905 -265042 -285473 -257339
16774 -257339 -145577 207054 211447 -113275 -448384 -306705 -89331 -18522 200306 297015
16764 297015 71353 208724 211256 184654 113457 184146 92334 -54244 -97415 148373 49187
16753 49187 22417 89003 157828 94497 67967 117729 146650 115155 173945 98176 -332720
16742 -332720 -352553 -257703 -113287 -49098 -35808 -214306 -367719 -270924 -171771 -176205 -77131
16731 -77131 -123382 -56258 -127936 9569 12790 157829 261860 246832 166575 175357 -5261
16720 -5261 -211261 -287270 -362806 -205568 -51074 -83158 -36563 18966 18485 2169 83438 142511
16708 142511 157209 308064 557910 334342 -58387 -194907 77275 317556 156845 -66047
$$ packed form
16785a94735q367j28659l8157n2596p6657l0792J02423K62635j00137k0431K8134
16774b57339J11762L52631M393l24722l35109J41679K17374P0809K18828R6709
16764B97015k25662J37371K532k6602p1197P0689r1812j46578m3171K45788r9186
16753D9187k6770O6586O8825o3331k6530M9762K8921l1495N8790p5769m30896
16742c32720j9833R4850J44416O4189J3290j78498j53413R6795R9153m434R9074
16731g7131m6251O7124p1678J37505L221J45039J04031j5028q0257Q782j80618
16720e261k06000p6009p5536J57238J54494l2084M6595N5529m81j6316Q1269N9073
16708A42511J4698J50855K49846k23568l92729j36520K72182K40281j60711k22892
$$ plain form
16698 -66047 -136666 -100897 -131369 -50138 -192774 -321693 -163594 -140672 -141103 -98235 101383
16687 101383 64077 -7711 -26136 25139 -26924 -126460 89614 224178 -15132 -191234 -92147
16676 -92147 -84419 -240995 -409125 -536321 -528654 -305005 -363230 -294665 -199732 -170054 -218059
16665 -218059 -493336 -435514 -159194 -11192 33758 -3896 3999 198834 276656 168933 -164836
16654 -164836 -503197 -637887 -352569 -46797 -105366 -181024 -109871 18516 -27339 -391621
16644 -391621 -332459 -316496 -467202 -340790 -106244 78194 116624 -17346 -10807 7708 -125514
16633 -125514 -257946 -375562 -231923 -101547 -168659 -260087 -289682 -258799 -12516 -134082
16623 -134082 -283264 -495760 -234788 28062 7582 74105 10108 -27079 -301237 -369152
$$ packed form
16698f6047p0619L5769l0472Q1231j42636j28919J58099K2922m31M2868J99618
16687A01383l7306p1788j8425N1275n2063r9536K16074J34564k39310j76102R9087
16676i2147P728j56576j68130j27196P667K23649n8225O8565R4933K9678m8005
16665b18059k75277N7822K76320J48002M4950l7654P895J94835P7822j07723l33769
16654a64836l38361j34690K85318L05772n8569p5658P1153J28387m5855l64282
16644c91621N9162J5963j50706J26412K34546J84438L8430j33970O539J8515j33222
16633a25514j32432j17616J43639J30376o7112r1428k9595L0883K46283j21566
16623a34082j49182k12496K60972K62850k0480O6523o3997l7187k74158o7915
$$ plain form
16613 -369152 -258977 -155726 -97009 -35985 -126352 -94217 -72761 27534 33835 -52939 -21778
16602 -21778 3966 32619 81715 60206 -64707 -165583 -16542 -27229 -11314 63932 197144
16591 197144 -53520 -187817 -266405 -289958 -162160 -393414 -458322 -251257 -63698 92450
16581 92450 85072 -18577 -135501 -54704 -88207 -194024 -362800 -347852 -182610 -135971 -106783
16570 -106783 -23149 -86496 -195094 -221242 -26637 200382 112661 -307621 -326227 -266953 -241033
16559 -241033 -66758 -777 35957 -4430 135323 106764 -67097 -45909 -35798 -214504 -266044
16548 -266044 -146390 -175019 -208547 -83367 172798 409510 248987 -60830 -145741 -195467
16538 -195467 -274092 -552152 -317177 55302 82521 -101241 -83839 -126983 -97321 100913
$$ packed form
16613c69152J10175J03251N8717O1024r0367L2135K1456J00295O301q6774L1161
16602b1778K5744K8653M9096k1509j24913j00876J49041j0687J5915P5246J33212
16591A97144k50664j34297p8588k3553J27798k31254o4908K07065J87559J56148
16581I2450p378j03649j16924Q0797l3503j05817j68776J4948J65242M6639K9188
16570a06783Q3634o3347j08598k6148J94605K27019q7721m20282j8606N9274K5920
16559b41033J74275O5981L6734m0387J39753k8559j73861K1188J0111j78706n1540
16548b66044J19654k8629l3528J25180K56165K36712j60523l09817q4911m9726
16538a95467p8625k78060K34975L72479K7219j83762J7402m3144K9662J98234
$$ plain form
16528 100913 405518 193805 -32204 -149874 -520352 -420661 -333673 -308181 -246674 -268632
16518 -268632 -268940 -204806 -300019 -329060 -405417 -518318 -660542 -438178 -362228 -434433 -125015
16507 -125015 186863 128226 -4028 -75802 69262 58822 -215782 43461 78289 192369
16497 192369 108627 -170409 -313277 -301295 22414 -21209 -121596 -11678 -55034 -136552
16487 -136552 -97320 -141483 -269387 -484517 -387076 -474208 -230237 -127209 -298419 -334221
16477 -334221 -251316 -192355 -201218 -312147 -401581 -303711 -193304 -194437 -409362 -458720 -302583
16466 -302583 -175069 -212179 -152850 218318 233616 -65430 -66218 5729 17643 9196 -32066
16455 -32066 61855 42332 -200937 -86366 35186 -38303 -24017 66837 67579 -17739 -199133
$$ packed form
16528A00913L04605k11713k26009j17670l70478R9691Q6988K5492O1507k1958
16518b68632l08O4134r5213k9041p6357j12901j42224K22364P5950p2205L09418
16507a25015L11878n8637j32254p1774J45064j0440k74604K59243L4828J14080
16497A92369q3742k79036j42868J1982L23709m3623j00387J09918m3356q1518
16487a36552L9232m4163j27904k15130R7441q7132K43971J03028j71210l5802
16477c34221Q2905N8961q863j10929q9434R7870J10407j133k14925m9358J56137
16466c02583J27514l7110N9329L71168J5298k99046p88P1947J1914q447m1262
16455c2066R3921j9523k43269J14571J21552p3489J4286R0854P42q5318j81394
$$ plain form
16444 -199133 -190351 -41358 -31210 -89124 -246344 -221679 -224248 -329160 -253144 -164656 -79454
16433 -79454 92482 343079 195487 55748 228769 -125288 -210723 -301169 -235934 -92725
16423 -92725 -2455 -139421 -63035 40448 234256 471760 618444 630878 476565 254271
16413 254271 74499 -78914 -10862 -32102 44833 -137391 -221719 -329401 -241472 -158188 -175415
16402 -175415 -126467 -177040 -329034 -195980 163065 350154 210883 50804 -187999 -347699
16392 -347699 -505546 -568078 -514244 -555962 -589735 -447463 -157720 94132 97157 19881 -128968
16381 -128968 -177049 -308840 -380300 -420099 -182778 -126056 -420416 -183743 147912 116428
16371 116428 170191 193124 52376 54080 -32902 -41150 96028 287860 355812 228481 125111
$$ packed form
16444a99133Q782J48993J0148n7914j57220K4665k569j04912P6016Q8488Q5202
16433g9454J71936K50597j47592j39739J73021l54057q5435r0446O5235J43209
16423i2725R0270j36966P6386J03483J93808K37504J46684J2434j54313k22294
16413B54271j79772j53413O8052k1240P6935j82224q4328j07682Q7929Q3284j7227
16402a75415M8948n0573j51994J33054L59045J87089j39271j60079k38803j59700
16392c47699j57847o2532N3834m1718l3773J42272K89743K51852L025p7276j48849
16381a28968m8081j31791p1460l9799K37321N6722k94360K36673L31655l1484
16371A16428N3763K2933j40748J704q6982q248J37178J91832O7952j27331j03370
$$ plain form
16360 125111 -85099 -265059 -437473 -175049 39122 -33001 -242272 -261907 44425 243988
16350 243988 210928 140520 198989 91936 -68402 27023 124137 30888 8825 -212364 -318779
16339 -318779 -349741 -196858 -30387 76619 33903 -151073 -424977 -384581 -323124 -375828
16329 -375828 -447787 -404860 -470728 -296881 -247730 -510170 -531825 -485844 -250140 45999 67387
16318 67387 -141981 -239053 -475580 -497080 -307678 -260049 -505104 -444822 -206889 110233
16308 110233 171659 -284218 -274439 -236237 -378836 -324561 -221677 41072 -6552 -91670 -91889
16297 -91889 114409 143178 110319 122984 75407 -175465 -308713 -245164 -264245 -41788 90062
16286 90062 302413 190790 -39058 -67220 145716 44296 -27456 -82102 -67859 -120803 -82170
$$ packed form
16360A25111k10210j79960j72414K62424K14171p2123k09271j9635L06332J99563
16350B43988l3060p0408N8469j07053j60338R5425R7114r3249k2063k21189j06415
16339c18779l0962J52883J66471J07006m2716j84976k73904M0396O1457n2704
16329c75828p1959M2927o5868J73847M9151k62440k1655M5981K35704K96139K1388
16318F7387k09368r7072k36527k1500J89402M7629k45055O0282K37933L17122
16308A10233O1426m55877R779L8202j42599N4275J02884K62749m7624q5118k19
16297i1889K06298K8769l2859J2665m7577k50872j33248O3549j9081K22457J31850
16286I0062K12351j11623k29848k8162K12936j01420p1752n4646J4243n2944L8633
$$ plain form
16275 -82170 -46343 -27796 -135995 -316885 -429813 -200122 -68882 82709 12638 -86196
16265 -86196 -248654 -199992 -85420 -120124 46461 255842 163691 213844 150621 85209 175546
16254 175546 206321 -29342 10172 176382 224543 194421 228011 7978 -31434 -15908 -107705
16243 -107705 -110393 -5201 55713 -60942 -178973 -107918 -113065 -64671 81750 65823 280267
16232 280267 296196 282620 321744 250861 -24169 -97543 -80351 -226674 -99271 -55438 -127939
16221 -127939 -49635 24987 148615 337520 229499 79632 -195174 -320098 -257231 46191
16211 46191 381054 662466 428709 203902 303269 333785 515754 520247 366883 238722
16201 238722 162708 133123 112149 7028 74559 99053 88342 141887 35495 -174538 -14938
$$ packed form
16275h2170L5827J8547j08199j80890j12928K29691J31240J51591p0071r8834
16265h6196j62458M8662J14572l4704J66585K09381r2151N0153o3223o5412R0337
16254A75546L0775k35663L9514J66210M8161l0122L3590k20033l9412J5526r1797
16243a07705k688J05192O0914j16655j18031P1055n147M8394J46421j5927K14444
16232B80267J5929j3576L9124p0883k75030p3374J7192j46323J27403M3833p2501
16221a27939P8304P4622J23628J88905j08021j49867k74806j24924O2867L03422
16211D6191L34863K81412k33757k24807R9367L0516J81969M493j53364j28161
16201B38722p6014k9585k0974j05121O7531K4494j0711N3545j06392k10033J59600
$$ plain form
16190 -14938 130317 156545 168219 16780 -86582 -205546 -437672 -64370 63714 15333
16180 15333 -60621 -53036 236754 109759 -63863 -7536 141848 97565 -101593 -67712 180179
16169 180179 103862 162037 173170 260618 214251 239599 298240 410893 136986 -110530 -132269
16158 -132269 -221199 -192912 -166934 -163261 -164118 -118692 -71359 -133251 -105644 -87934 13610 -19254
16146 -19254 -54751 -128989 -271199 -146089 -135655 22837 279996 195313 79872 180357
16136 180357 -67416 -395154 -457619 -261800 -185545 -365351 -426546 -435740 -395843 -545369 -733372
16125 -733372 -613441 -241294 -150652 -102594 -183880 -327010 -431847 -374042 -330841 -410247 -470764
16114 -470764 -386015 -205281 -171293 -86837 108462 155381 94755 -121229 -85356 25412 -78900
$$ packed form
16190a4938J45255K6228J1674j51439j03362j18964k32126L73302J28084m8381
16180A5333p5954P585K89790j26995j73622N6327J49384m4283j99158L3881K47891
16169A80179p6317N8175J1133Q7448m6367K5348N8641J12653k73907k47516k1739
16158a32269q8930K8287K5978L673q57M5426M7333o1892K7607J7710J01544l2864
16146a9254l5497p4238j42210J25110J0434J58492K57159q4683j15441J00485
16136A80357k47773l27738o2465J95819P6255j79806o1195r194L9897j49526j88003
16125g33372J19931L72147R0642M8058q1286j43130j04837N7805M3201p9406o0517
16114d70764Q4749J80734L3988Q4456J95299M6919o0626k15984L5873J10768j04312
$$ plain form
16103 -78900 -75269 11901 58725 -8527 -29289 -166510 -287077 -331632 -143557 72242 152966
16092 152966 57677 70690 140164 -181338 -135073 50149 103257 -71776 -202995 -327907
16082 -327907 -292928 -206068 -27178 73784 -40912 -121527 41585 199639 343778 324298
16072 324298 116299 107995 406726 115589 63576 -32457 -143443 -112745 111427 48432 133482
16061 133482 298148 315679 260473 169186 294601 470920 347414 179867 12762 80447
16051 80447 55957 -94616 126168 278835 167619 148035 189811 117868 207395 265392 362067
16040 362067 201042 102076 35400 -17585 -116953 -155461 -134183 -284678 -194736 -19515 8645
16029 8645 -36804 -210334 -229123 -218979 -245114 -321799 -115396 -53554 -112481 -18541 148687
$$ packed form
16103g8900L631Q7170M6824o7252k0762j37221j20567m4555J88075K15799Q0724
16092A52966r5289J3013O9474l21502M6265J85222N3108j75033j31219j24912
16082c27907L4979Q6860J78890J00962j14696q0615J63112J58054J44139j9480
16072C24298k07999q304K98731k91137n2013r6033j10986L0698K24172o2995Q5050
16061A33482J64666J7531n5206r1287J25415J76319j23506j67547j67105O7685
16051H0447k4490j50573K20784J52667j11216j9584M1776p1943Q9527N7997R6675
16040C62067j61025r8966o6676n2985r9368l8508K1278j50495Q9942J75221K8160
16029H645m5449j73530j8789J0144k6135p6685K06403O1842n8927R3940J67228
$$ plain form
16018 148687 153155 -37396 -174200 -83456 112838 255003 -95404 -240146 -108270 40542
16008 40542 -26828 -135744 -202746 -132773 226871 392997 214184 159352 3488 196460
15998 196460 119501 118207 -46028 -126451 -295050 -446654 -462964 -250808 -143260 -181086 -186191
15987 -186191 -301833 -534335 -576612 -477346 -238317 -210884 -388758 -102997 120178 214212
15977 214212 187836 39952 107390 -48181 -178383 -253157 -228841 -18578 78339 439285
15967 439285 349377 116230 -22086 -253865 -196536 -63798 -27242 -133857 -185879 -69201
15957 -69201 -16670 -86026 -205481 -125409 -199535 -301673 -202733 21769 47466 -25785 -162883
15946 -162883 -128570 -86325 -43789 -149740 -37969 -175054 -340954 -509170 -493026 -555599
$$ packed form
16018A48687M468j90551j36804R0744J96294J42165l50407j44742J31876J48812
16008D0542o7370j08916o7002O9973L59644J66126j78813n4832j55864J92972
15998A96460p6959j294j64235q0423j68599j51604j6310K12156J07548l7826n105
15987a86191j15642k32502m2277R9266K39029K7433j77874K85761K23175R4034
15977B14212k6376j47884O7438j55571j30202p4774K4316K10263R6917L60946
15967D39285q9908k33147j38316k31779N7329J32738L6556j06615n2022J16678
15957f9201N2531o9356j19455Q0072p4126j02138R8940K24502K5697p3251j37098
15946a62883L4313M2245M2536j05951J11771j37085j65900j68216J6144o2573
$$ plain form
15936 -555599 -447361 -320952 -196735 -49423 -47462 -10414 50826 83009 64869 -65548 25796
15925 25796 -123474 -162284 -302428 -208619 -184963 -204982 -170901 -50072 -52602 -31062 -12672
15914 -12672 108065 163964 257030 81573 -56669 -331526 -414769 -577226 -330638 61847
15904 61847 147937 187109 143413 -58545 -14498 -72104 37839 9433 -126241 -5876 37118
15893 37118 -170489 -177409 -54988 119253 280007 388065 408943 456724 205613 158521 217418
15882 217418 17933 -28386 -215708 -211154 -294381 -77548 21765 24915 -219703 -118690 46840
15871 46840 107545 -181072 -275063 -196856 26740 121982 125907 216516 199287 185926 124944
15860 124944 86292 -34015 -189 13168 -84829 -75485 20092 69351 229982 222965 195189
$$ packed form
15936e55599J08238J26409J24217J47312J961L7048O1240L2183j8140j30417R1344
15925B5796j49270l8810j40144R3809K3656k0019L4081J20829k530K1540J8390
15914a2672J20737N5899R3066j75457j38242k74857q3243j62457K46588L92485
15904F1847Q6090L9172m3696k01958M4047n7606J09943k8406j35674J20365M2994
15893C7118k07607o920J22421J74241J60754J08058K0878M7781k51111m7092N8897
15882B17418j99485m6319j87322M554q3227K16833R9313L150k44618J01013J65530
15871D6840O0705k88617r3991P8207K23596R5242L925R0609j7229j3361o0982
15860A24944l8652j20307L3826J3357r7997R344R5577M9259J60631p017k7776
$$ plain form
15849 195189 52285 -114317 16290 164348 -63651 -283611 -461386 -198619 71652 129908
15839 129908 388519 557561 664937 659226 391357 293853 411993 455637 556832 532605
15829 532605 393525 368309 326541 255025 304601 119826 225779 210122 -21913 -105086 -108908
15818 -108908 79497 128904 73528 10348 -41108 -61648 24957 -138216 -160674 -205419 -274690
15807 -274690 -209842 -2626 272816 237914 43727 166224 169734 252994 193248 89949 -104276
15796 -104276 -133082 -104954 -80436 69716 54933 6250 -48403 17816 186263 327795 214263
15785 214263 192550 82600 67090 -111075 -41807 -147714 -280659 -292387 -219489 -305912 -609174
15774 -609174 -588586 -511730 -284344 -136723 -13242 -277972 -292935 -313621 -406914 -409919 -251772
$$ packed form
15849A95189j42904j66602J30607J48058k27999k19960j77775K62767K70271N8256
15839A29908K58611J69042J07376n711k67869r7504J18140M3644J01195k4227
15829E32605j39080k5216m1768p1516M9576j84775J05953j5657k32035q3173l822
15818a08908J88405M9407n5376o3180n1456k0540Q6605j63173k2458m4745o9271
15807b74690O4848K07216K75442l4902j94187J22497L510Q3260n9746j03299j94225
15796a04276k8806K8128K4518J50152j4783m8683n4653O6219J68447J41532j13532
15785B14263k1713j09950j5510j78165O9268j05907j32945j1728P2898q6423l03262
15774f09174K0588P6856K27386J47621J23481k64730j4963k0686r3293l005J58147
$$ plain form
15763 -251772 -242517 -370801 -321227 -137186 -158534 -235327 -285230 -341443 -311642 -225742 -265186
15752 -265186 -181951 -155869 -219626 -300920 1175 161193 47314 50808 50054 60661 68965 -22293
15740 -22293 -38348 -55982 -33482 -32302 -49932 49934 48119 -182006 -263227 -238841 -114817 -166543
15728 -166543 -134728 21708 55650 -128501 -185092 -207403 -179579 -111743 -188630 -48698 298387
15717 298387 189283 -90700 -271465 -291015 -320103 -339475 -131665 -192402 -509632 -450881
15707 -450881 -171447 43107 -22160 -282530 -282866 -306509 -258200 -208666 -111425 -40860 -33376
15696 -33376 -117899 -117320 -34729 -96822 26775 75623 -47520 -83922 -276437 -92531 82009
15685 82009 36767 61899 -10189 -56585 -200773 -377873 -276767 -24797 -41020 -142833 169465
$$ packed form
15763b51772R255j28284M9574J84041k1348p6793m9903n6213K9801Q5900l9444
15752b65186Q3235K6082o3757q1294L02095J60018j13879L494p54J0607Q304r1258
15740b2293j6055j7634K2500J180j7630R9866j815k30125q1221K4386J24024n1726
15728a66543L1815J56436L3942j84151n6591k2311K7824O7836p6887J39932L47085
15717B98387j09104k79983j80765j9550k9088j9372K07810o0737l17230N8751
15707d50881K79434K14554o5267k60370l36k3643M8309M9534R7241P0565P484
15696c3376q4523N79Q2591o2093J23597M8848j23143l6402j92515J83906J74540
15685H2009m5242K5132p2088m6396j44188j77100J01106K51970j6223j01813L12298
$$ plain form
15674 169465 321859 386562 27084 -50640 151995 415413 336511 85425 54462 9216
15664 9216 35597 54134 -317085 -504174 -459612 -51128 201184 245992 227078 55786 -301460
15653 -301460 -242457 -230725 -330112 -352982 -390579 -172725 63597 154500 245059 134470 267370
15642 267370 203321 137888 -30099 -375209 -295364 -68175 154052 204899 -64637 -219083
15632 -219083 -174752 -264370 -314646 -316866 -165826 89730 -169819 -413046 -371536 -469445 -349776
15621 -349776 -180631 -106043 -72420 -79785 -89068 44542 89250 143716 27334 -93577 -224907
15610 -224907 -314956 -277829 206507 317570 -31575 -69348 -226297 64099 370423 125971
15600 125971 -130192 187843 291432 136848 62639 29633 -388067 -463638 -409145 -411962 -404861
$$ packed form
15674A69465J52394O4703l59478p7724K02635K63418p8902k51086l0963m5246
15664I216K6381J8537l71219j87089M4562M08484K52312M4808j8914j71292l57246
15653c01460N9003J1732r9387k2870l7597K17854K36322R0903R0559j10589J32900
15642B67370o4049o5433j67987l45110P9845K27189K22227N0847k69536j54446
15632b19083M4331q9618n0276k220J51040K55556k59549k43227M1510r7909J19669
15621c49776J69145P4588L3623p365r283J33610M4708N4466j16382j20911j31330
15610b24907r0049L7127M84336J11063l49145l7773j56949K90396L06324k44452
15600A25971k56163L18035J03589j54584p4209l3006m17700p5571N4493k817P101
$$ plain form
15589 -404861 -380368 -543235 -672156 -423514 -202636 -124876 -24005 -71593 -98701 -148493
15579 -148493 -88954 -24988 17231 225190 320164 475234 560838 499418 460867 528735 404363
15568 404363 452423 449682 590825 513661 255113 188520 81615 101881 193603 128468 138645
15557 138645 9251 -189926 -279512 -199129 -248859 -182039 -92253 -22075 -17141 -62407 21297
15546 21297 196457 320057 282117 -95982 -252423 -239107 -34322 -2502 -225295 -64337
15536 -64337 -72411 -99057 39657 237620 -56283 -192705 38208 180341 58291 -71734
15526 -71734 -367053 -331184 -325282 -344501 -347199 -111409 -37508 -110368 -243968 -335874 -275742
15515 -275742 -111275 -45737 -16437 -26200 -175452 -125066 -19315 22150 -24266 50645 -58865
$$ packed form
15589d04861K4493j62867j28921K48642K20878P7760J00871m7588k7108m9792
15579a48493N9539O3966M2219K07959R4974J55070Q5604o1420l8551O7868j24372
15568D04363M8060k741J41143p7164k58548o6593j06905K0266R1722o5135J0177
15557A38645j29394j99177q9586Q0383m9730O6820Q9786P0178M934m5266Q3704
15546B1297J75160J23600l7940l78099j56441J3316K04785L1820k22793J60958
15536f4337q074k6646J38714J97963k93903j36422K30913J42133j22050j30025
15526g1734k95319L5869N902j9219k698K35790P3901p2860j33600r1906O0132
15515b75742J64467O5538K9300r763j49252N0386J05751M1465m6416P4911j09510
$$ plain form
15504 -58865 -19127 -11376 -17858 -17641 1616 -707 210755 264531 297596 64521 -166748 -208399
15492 -208399 -236065 -235549 -139360 -348086 -309517 -250449 -342233 -453637 -386682 -482511 -582433
15481 -582433 -306052 -244598 -297059 -221567 -141151 41395 182849 -125255 -141744 -134871 -185030
15470 -185030 -235951 -309002 -68925 301844 415462 248441 163802 22123 -94728 5090
15460 5090 -104852 -324449 -208755 104048 252909 195885 -129755 -33961 -44317 197681
15450 197681 310117 -139758 -551487 -516191 -214893 -86486 -17954 17950 35333 83644
15440 83644 82199 99684 -104299 -263763 -94668 -39467 -138420 -263994 -62445 -103549 -108496
15429 -108496 -117609 -226929 -368957 -525195 -652654 -471029 -41165 251966 227266 179587
$$ packed form
15504e8865L9738P751o482K17J9257k323K11462N3776L3065k33075k31269m1651
15492b08399k7666N16R6189k08726L8569N9068r1784j11404O6955r5829r9922
15481e82433K76381O1454n2461P5492Q0416J82546J41454l08104j6489O873n0159
15470a85030n0921p3051K40077L70769J13618j67021q4639j41679j16851R9818
15460E090j09942k19597J15694L12803J48861n7024l25640R5794j0356K41998
15450A97681J12436m49875m11729L5296L01298J28407O8532L5904J7383M8311
15440H3644j445J7485k03983j59464J69095N5201r8953j25574K01549m1104m947
15429a08496r113j09320j42028j56238j27459J81625M29864K93131k4700m7679
$$ plain form
15419 179587 246042 176359 35238 -96157 -2742 283810 249780 -29484 -109007 -78140 -259263
15408 -259263 -241436 -177578 -178570 86266 -24935 -36451 -30791 52486 -163728 -199500 -181826
15397 -181826 -312036 -291148 -84748 120710 84522 64111 -83265 -187632 -365881 -357490
15387 -357490 -373668 -184905 -147608 -163585 -234984 -258207 -318724 -402928 -250955 -20528 246725
15376 246725 330023 240357 -76637 9219 146744 31682 -25849 71201 -55815 -469185
15366 -469185 -414198 -227842 -214016 -200038 -244711 -229614 -77126 -757 86889 -145422 -39855
15355 -39855 -84916 81863 21793 84070 122675 -48532 -63049 13603 -263781 -432428 -351986
15344 -351986 -299606 -269923 -224011 -51646 -146539 -193693 -163099 -66713 -101527 -277823 -216903
$$ packed form
15419A79587O6455o9683j41121j31395R3415K86552l4030k79264p9523L0867j81123
15408b59263J7827O3858r92K64836j11201j1516N660Q3277k16214l5772J7674
15397a81826j30210K0888K06400K05458l6188k0411j47376j04367j78249Q391
15387c57490j6178J88763L7297j5977p1399k3223o0517q4204J51973K30427K67253
15376B46725Q3298q9666l16994Q5856J37525j15062n7531R7050j27016m13370
15366d69185N4987J86356J3826J3978m4673J5097J52488P6369Q7646k32311J05567
15355c9855m5061J66779o0070O2277L8605j71207j4517P6652k77384j68647Q0442
15344c51986N2380K9683M5912J72365r4893m7154L0594R6386l4814j76296O0920
$$ plain form
15333 -216903 -25626 -137650 40946 222307 -18179 -339249 -434707 -215278 -7955 29912
15323 29912 -122293 -160929 -274140 -188090 -203035 -302637 -198370 -81804 183521 258242 148633
15312 148633 208227 412572 573780 315956 116546 -190459 -202614 -162877 58511 171244
15302 171244 48359 15284 81495 236735 304054 353024 252964 60119 24021 33605 106780
15291 106780 111269 -33893 -197210 -329830 -355709 8472 81629 -56278 -287394 -195649
15281 -195649 -126215 -222760 -609242 -771800 -668151 -585985 -199823 -7010 139971 152707
15271 152707 129637 -15530 94770 -55686 -188239 -271872 -271481 -301186 -417351 -567678 -442875
15260 -442875 -249688 99827 116110 -131222 79828 205465 96901 30245 -89416 -63959
$$ packed form
15333b16903J91277j12024J78596J81361k40486l21070r5458K19429K07323L7867
15323B9912j52205l8636j13211Q6050j4945r9602J04267J16566K65325P4721j09609
15312A48633N9594K04345J61208k57824j99410l07005j2155L9737K21388J12733
15302A71244j22885l3075O6211J55240O7319M8970j00060j92845l6098R584P3175
15291A06780M489j45162j63317j32620k5879L64181P3157j37907k31116R1745
15281a95649O9434r6545l86482j62558J03649Q2166L86162J92813J46981J2736
15271A52707k3070j45167J10300j50456j32553q3633L91k9705j16165j50327J24803
15260d42875J93187L49515J6283k47332K11050J25637j08564o6656j19661K5457
$$ plain form
15250 -63959 -90303 -147958 -163090 -45736 15312 -24040 28082 142109 111942 263046 223166
15239 223166 207750 174731 -242630 -574900 -477264 -210251 4734 85306 58527 -100294
15229 -100294 -263793 17564 204427 31712 -167444 -437928 -518598 -514389 -253732 -161278
15219 -161278 -15588 -88872 -29759 106101 249964 265330 141168 20966 8740 -105555
15209 -105555 -106564 -133814 -163786 -75147 166057 -138378 -350268 -344358 -155993 163564 -108764
15198 -108764 -244509 -402897 -448457 -337884 -279101 -248962 -249937 -115366 118208 39698 -104783
15187 -104783 101671 88318 -237175 -362435 -125198 -3517 8776 123599 419279 334095
15177 334095 114452 261457 305801 142745 34572 -213336 -367484 -255019 -186109 -65708
$$ packed form
15250f3959k6344n7655j5132J17354O1048l9352N2122J14027l0167J51104l9880
15239B23166j5416l3019m17361l32270R7636K67013K14985Q0572k6779j58821
15229a00294j63499K81357J86863j72715j99156k70484q0670M209K60657R2454
15219a61278J45690p3284N9113J35860J43863J5366j24162j20202j2226j14295
15209a05555j009k7250k9972Q8639K41204l04435k11890N910J88365L19557k72328
15198a08764j35745j58388m5560J10573N8783L0139r75J34571K33574p8510j44481
15187a04783K06454j3353l25493j25260K37237J21681J2293J14823K95680q5184
15177C34095k19643J47005M4344j63056j08173k47908j54148J12465O8910J20401
$$ plain form
15167 -65708 -170218 -275850 -62823 84065 37174 -85902 -79294 -188651 -377076 -396723
15157 -396723 -60743 67561 -142968 -217157 -442107 -348097 -316527 -303920 -374360 -427071 -306132
15146 -306132 -288957 -377514 -269512 -70865 103730 -14815 -146084 -21836 179359 108518
15136 108518 -83084 -193850 14599 208592 42035 28288 58649 -3366 -122514 -97848
15126 -97848 -83327 -78996 -209745 -244193 -32315 -100974 -315798 -585844 -629371 -512732 -329890
15115 -329890 -156634 -244731 -107357 259083 134069 -66408 -34357 29499 154155 42322
15105 42322 60856 98821 -67469 -122116 -111578 -82504 -149478 -95792 -21202 -95611 -143295
15094 -143295 -126257 -164063 24760 -138733 -293983 -283102 -431690 -391670 -134194 -33484
$$ packed form
15167f5708j04510j05632K13027J46888m6891j23076O608j09357j88425j9647
15157c96723L35980J28304k10529p4189k24950R4010L1570J2607p0440n2711J20939
15146c06132J7175q8557J08002J98647J74595j18545j31269J24248K01195p0841
15136A08518j91602j10766K08449J93993j66557j3747L0361o2015j19148K4666
15126i7848J4521M331j30749l4448K11878o8659k14824k70046m3527J16639J82842
15115c29890J73256q8097J37374L66440j25014k00477L2051O3856J24656j11833
15105D2322J8534L7965j66290n4647J0538K9074o6974N3686P4590p4409m7684
15094a43295J7038l7806J88823j63493j55250J0881j48588M0020K57476J00710
$$ plain form
15084 -33484 -257290 -212238 -149955 -205647 -116985 -307826 -329708 -407365 -267354 -155641 -230699
15073 -230699 -220774 -176654 -237506 -387001 -496605 -554021 -576445 -375485 -161660 -291790 -497253
15062 -497253 -510757 -466995 -284427 -166123 -287069 -292838 -264668 -467214 -493664 -540862 -535254
15051 -535254 -313753 -224993 -262304 -317780 -446530 -298299 116309 306589 190558 -28198
15041 -28198 -7971 123446 180369 255854 206771 171933 9371 -27740 -32154 -262443 -403847
15030 -403847 -264558 -241289 -248053 -390905 -317453 -248600 -47789 63710 275224 125691
15020 125691 -48165 -60809 -179224 -219862 -50077 10558 29966 63921 -72643 -355242
15010 -355242 -320625 -274780 -239262 -344508 -178726 -160128 138628 436388 686654 497730
$$ packed form
15084c3484k23806M5052O2283n5692Q8662j90841k1882p7657J40011J11713p5058
15073b30699R925M4120o0852j49495j09604n7416k2424K00960K13825j30130k05463
15062d97253j3504M3762J82568J18304j20946n769K8170k02546k6450m7198N608
15051e35254K21501Q8760l7311n5476j28750J48231M14608J90280j16031k18756
15041b8198K0227J31417N6923P5485m9083l4838j62562l7111m414k30289j41404
15030d03847J39289K3269o764j42852P3452O8853K00811J11499K11514j49533
15020A25691j73856j2644j18415m0638J69785O0635J9408L3955j36564k82599
15010c55242L4617M5845L5518j05246J65782J8598K98756K97760K50266j88924
$$ plain form
15000 497730 214641 -54105 74691 111009 -107677 -215898 -157083 -242087 -386414 -481608
14990 -481608 -182607 5963 51502 -61222 -97421 -54762 -189731 -128068 -30498 -9902 48087
14979 48087 232841 297795 125129 -147120 -186776 -103321 65137 169795 140155 295685
14969 295685 488561 374490 115967 52195 -19901 -200372 -131364 22255 157747 124646
14959 124646 -115554 -116389 -377443 -454519 -311141 -61067 -63728 25136 43911 -207334 -314995
14948 -314995 -208990 -117663 25329 32836 -73073 -61484 -173070 -118075 27103 197364
14938 197364 458317 421304 258820 143227 410264 349185 2886 -105141 -101100 -76622
14928 -76622 -52584 44025 -177684 -249154 -482747 -189926 43176 37131 105043 170498 28684
$$ packed form
15000D97730k83089k68746J28796L6318k18686j08221N8815q5004j44327r5194
14990d81608K99001J88570M5539j12724l6199M2659j34969O1663R7570K0596N7989
14979D8087J84754O4954j72666k72249l9656Q3455J68458J04658k9640J55530
14969B95685J92876j14071k58523o3772p2096j80471O9008J53619J35492l3101
14959A24646k40200q35k61054p7076J43378K50074k661Q8864J8775k51245j07661
14948c14995J06005R1327J42992P507j05909J1589j11586N4995J45178J70261
14938A97364K60953l7013j62484j15593K67037o1079l46299j08027M041K4478
14928g6622K4038R6609k21709p1470k33593K92821K33102o045O7912O5455j41814
$$ plain form
14917 28684 -61788 -48023 -127318 -211040 -99226 100609 127896 45525 122543 36298 -254117
14906 -254117 -171081 -277504 -268489 98988 261825 260831 425195 448308 126216 -64998 -274966
14895 -274966 -404537 -266597 -114461 -8063 -172245 -210050 -83500 -59711 -96462 -138376
14885 -138376 16350 95315 308522 269706 200552 220220 25731 -232826 -122244 -127876 -247965
14874 -247965 -480959 -422035 -322986 -226491 -10043 -74948 -98728 -303436 -285941 -264600 49096
14863 49096 27599 -94450 -85977 124799 308421 366758 391457 215021 -222195 -232830 -111142
14852 -111142 185586 548723 475910 73852 -291627 -443711 -542207 -328731 -210423 -238853
14842 -238853 147615 168096 -37005 -248334 -295144 -275951 -191191 77861 73262 -176792 -242597
$$ packed form
14917B8684r0472J3765p9295q3722J11814J99835K7287q2371P7018q6245k90415
14906b54117Q3036j06423R015L67477J62837r94J64364K3113l22092j91214k09968
14895b74966j29571J37940J52136J06398j64182l7805J26550K3789l6751m1914
14885a38376J54726P8965K13207l8816o9154J9668j94489k58557J10582n632j20089
14874b47965k32994N8924R9049R6495K16448o4905k3780k04708J7495K1341L13696
14863D9096k1497j22049Q473K10776J83622N8337K4699j76436m37216j0635J21688
14852a11142K96728L63137p2813m02058l65479j52084r8496K13476J18308k8430
14842b38853L86468K0481k05101k11329m6810J9193Q4760K69052m599k50054o5805
$$ plain form
14831 -242597 -368675 -322487 -256085 -230007 -254832 -451616 -438575 -411734 -493831 -330338 -87056
14820 -87056 -322579 -631998 -585666 -356104 -426797 -232299 -219588 -322351 -287546 -302472 -265592
14809 -265592 -202914 -187406 -311595 -74803 84979 118779 146084 57097 45551 -65013 -142808
14798 -142808 -50127 -50642 -28770 -131686 -208208 -46635 -33683 116123 -72228 -213648 -357495
14787 -357495 -234506 -146405 -195493 -347896 -329004 -304933 -414104 -499604 -606375 -678578 -497299
14776 -497299 -487003 -558797 -411314 -358980 -319616 -175331 -8759 79363 52879 145472 208072
14765 208072 -11761 -1373 -138096 -285821 -151045 132056 275199 186247 55989 140345
14755 140345 -124005 -118246 13445 -88798 -242055 -82179 -138723 -72003 148346 263468
$$ packed form
14831b42597j26078M6188O6402K6078k4825j96784J3041K6841q2097J63493K43282
14820h7056k35523l09419M6332K29562p0693J94498J2711j02763L4805j4926L6880
14809b65592O2678J5508j24189K36792J59782L3800K7305q8987j1546j10564p7795
14798a42808R2681n15K1872j02916p6522J61573J2952J49806j88351j41420j43847
14787c57495J22989Q8101m9088j52403J8892K4071j09171q5500j06771p2203J81279
14776d97299J0296p1794J47483N2334L9364J44285J66572Q8122k6484R2593O2600
14765B08072k19833J0388j36723j47725J34776K83101J43143q8952j30258Q4356
14755A40345k64350N759J31691j02243j53257J59876n6544O6720K20349J15122
$$ plain form
14745 263468 578721 537617 497458 319602 231673 285450 191108 163759 253335 172365 70779
14734 70779 107414 100494 -14279 -68832 37299 199755 80236 -108031 -348938 -214351
14724 -214351 -18529 59435 49602 85648 -84546 -30651 -114290 92356 320718 334356 103692
14713 103692 -191407 -419184 -648393 -710114 -505731 -374997 -300618 -168878 -308211 -467477
14703 -467477 -430228 -388172 -309849 -320913 -187795 -206189 -192988 -313183 -384182 -425599 -311958
14692 -311958 -328260 -111384 -240354 -269791 -258805 -206705 -242891 -323121 -225358 -217587 74010
14681 74010 277543 315645 213632 166466 114242 118695 101986 25326 -61547 -236239 -187256
14670 -187256 -234856 -564111 -542065 -279241 -99358 -63293 11663 38151 -164172 -217512 -258567
$$ packed form
14745B63468L15253m1104m0159j77856q7929N3777r4342k7349Q9576q0970j01586
14734G0779L6635o920j14773n4553J06131J62456j19519j88267k40907J34587
14724b14351J95822P7964r833L6046j70194N3895q3639K06646K28362J3638k30664
14713A03692k95099k27777k29209o1721K04383J30734P4379J31740j39333j59266
14703d67477L7249M2056P8323j1064J33118j8394J3201j20195p0999m1417J13641
14692c11958j6302K16876j28970k9437J0986N2100l6186q0230R7763P771K91597
14681G4010K03533L8102j02013m7166n2224M453j6709p6660q6873j74692M8983
14670a87256m7600l29255K2046K62824J79883L6065P4956K6488k02323n3340m1055
$$ plain form
14659 -258567 -180594 6947 -93346 -156524 -187028 -196574 -158238 -167977 -136870 -241136 -40380
14648 -40380 -23744 -202961 -259799 -45461 -82832 -206084 -129196 75786 -97800 -394591
14638 -394591 -441920 -279392 -207014 -51190 -18313 60186 28687 55755 8253 124811 67774
14627 67774 -65953 29197 134147 215311 136813 -4345 -482049 -453182 -201566 31425
14617 31425 122 -94657 -89343 -101450 -264000 -340756 -223610 -127231 26464 2155 156426
14606 156426 344776 117417 -29752 -273820 -457691 -463034 -120825 65514 -132824 -203253
14596 -203253 -104005 -61136 164104 83204 64263 114335 99483 -70977 -54891 -148907 -481331
14585 -481331 -412412 -357825 -338858 -183814 -33985 274237 291207 155755 153053 43766 240497
$$ packed form
14659b58567P7973J87541j00293o3178l0504r546L8336r739L1107j04266K00756
14648d0380J6636j79217n6838K14338l7371j23252P6888K04982j73586k96791
14638c94591m7329J62528P2378J55824L2877P8499l1499K7068m7502J16558n7037
14627F7774j33727R5150J04950Q1164p8498j41158m77704K8867K51616K32991
14617C1425l1303r4779N314j2107j62550p6756J17146R6379J53695k4309J54271
14606A56426J88350k27359j47169k44068j83871n343L42209J86339j98338p0429
14596b03253R9248M2869K25240q0900j8941N0072j4852j70460J6086r4016l32424
14585d81331O8919N4587J8967J55044J49829L08222J6970j35452k702j09287J96731
$$ plain form
14574 240497 187856 109498 184865 186715 153042 204129 254871 -42848 -31612 -107990 -320352
14563 -320352 -301316 -312667 -51385 -70962 -109697 -155750 -309664 -442961 -473738 -280218 155158
14552 155158 361547 364294 255269 84717 68334 -204017 -234899 -162630 -222404 -174588 -59372
14541 -59372 27239 58332 -111753 -11134 11484 -135816 -108903 -12384 -5504 14707 -72005
14530 -72005 18062 -91860 -117009 -213443 -355313 -168973 -130208 44724 62864 59833 148404
14519 148404 137144 -18535 80608 -755 -111007 68474 98114 135406 77279 -163974 -173047
14508 -173047 73578 115086 -99997 -94204 -72231 59760 243546 20799 107292 265144
14498 265144 251064 157604 -121597 9276 28186 -205860 -316371 -147687 100794 312534
$$ packed form
14574B40497n2641p8358P5367J850l3673N1087N0742k97719J1236p6378k12362
14563c20352J9036j1351K61282j9577l8735m6053j53914j33297l0777J93520M35376
14552A55158K06389K747j09025j70552j6383k72351l0882P2269n9774M7816J15216
14541e9372Q6611L1093j70085J00619K2618j47300K6913R6519O880K0211q6712
14530g2005R0067j09922k5149r6434j41870J86340L8765J74932J8140l031Q8571
14519A48404j1260j55679R9143q1363j10252J79481K9640L7292n8127k41253r073
14508a73047K46625M1508k15083N793K1973J31991J83786k22747Q6493J57852
14498B65144j4080r3460k79201J30873J8910k34046j10511J68684K48481K11740
$$ plain form
14488 312534 269913 137352 138465 162672 65857 93373 106441 176008 197318 168065 -215962
14477 -215962 -356959 -350033 -208273 -309797 -349022 -241136 -428335 -237781 -164846 -241665
14467 -241665 -228215 -289588 -433752 -240969 -111737 -78271 11543 122542 196061 -72371
14457 -72371 -123333 -31102 -3287 172257 117130 -111037 -239521 -169490 -338297 -373884 -30854
14446 -30854 -69553 -10874 -19613 -244663 -148886 -21151 60113 -111840 -272986 -309309 -340159
14435 -340159 -418126 -373582 -201157 -90278 -102477 76747 32946 109205 259074 135976
14425 135976 103242 -9209 115048 194257 146080 203346 124498 140907 -11249 -349956 -514457
14414 -514457 -400800 -312649 -207834 -250115 -345275 -330155 71755 305946 362895 112056
$$ packed form
14488C12534m2621j32561J113K4207r6815K7516J3068O9567K1310k9253l84027
14477b15962j40997O926J41760j01524l9225J07886j87199J90554P2935p6819
14467b41665J3450o1373j44164J92783J29232L3466Q9814J10999P3519k68432
14457g2371n0962R2231K7815J75544n5127k28167j28484P0031j68807l5587L43030
14446c0854l8699N8679q739k25050R5777J27735Q1264j71953j61146l6323l0850
14435c40159p7967M4544J72425J10879j2199J79224m3801P6259J49869j23098
14425A35976l2734j12451J24257P9209m8177N7266p8848J6409j52156l38707j64501
14414e14457J13657Q8151J04815m2281r5160J5120M01910K34191N6949k50839
$$ plain form
14404 112056 -44560 31544 38390 48785 80093 209263 256297 196223 263581 16687 -223584
14393 -223584 -421910 -277427 -160282 22362 33527 -126183 -199859 -284076 -410162 -331096
14383 -331096 -51064 16617 -168308 4574 62275 -94579 -77555 21147 48687 2879 -109949
14372 -109949 74338 161214 -212690 9073 202298 57873 -47382 -85987 -29839 -97634
14362 -97634 -193264 -17290 114569 66618 -22158 -30477 -78759 -245433 -193928 -13130 229631
14351 229631 154450 -63582 -170562 -12553 94855 -75570 -165475 1051 158037 168924
14341 168924 175639 229055 335136 201793 -17598 -173906 -138399 -6717 -3665 -1387 5535
14330 5535 60888 314830 149890 198422 227820 123539 185000 142499 259151 277532 31113
$$ packed form
14404A12056j56616P6104O846J0395L1308J29170M7034o0074O7358k46894k40271
14393b23584j98326J44483J17145J82644J1165j59710p3676q4217j26086P9066
14383c31096K80032O7681j84925J72882N7701j56854J7024R8702K7540m5808j12828
14372a09949J84287Q6876l73904K21763J93225j44425j05255l8605N6148o7795
14362i7634r5630J75974J31859m7951q8776q319m8282j66674N1505J80798K42761
14351B29631p5181k18032j06980J58009J07408j70425q9905J66526J56986J0887
14341A68924O715N3416J06081j33343k19391j56308L5507J31682L052K278O922
14330E535N5353K53942j64940M8532K9398j04281O1461m2501J16652J8381k46419
$$ plain form
14319 31113 -137823 -371600 -215738 -16890 -108622 39232 36925 81736 8229 -195622 -328736
14308 -328736 -224422 -122341 53982 258203 328919 403823 266480 231400 141291 135636 74433
14297 74433 -88858 88811 187390 127689 357229 268861 121019 79006 -75967 44985
$$ packed form
14319C1113j68936k33777J55862J98848r1732J47854k307M4811p3507k03851j33114
14308c28736J04314J02081J76323K04221P0716P4904j37343l5080r0109n655o1203
14297G4433j63291J77669R8579n9701K29540q8368j47842m2013j54973J20952
$$ [...]
##END NTUPLES=NMR SPECTRUM
##END=
