##TITLE=Analysis number 328402
Compound Code cc 02301
Book Reference lab3
Project Code adrs
Chemist Name stores
##JCAMPDX= 6.0         $$ Bruker NMR JCAMP-DX V2.0
##DATA TYPE= NMR SPECTRUM
##DATA CLASS= NTUPLES
##ORIGIN= Bruker BioSpin GmbH
##OWNER= nmr
$$ XWIN-NMR		Version 3.5
$$ Tue May 29 09:46:11 2007 GMT Daylight Time (UT+1h)  MAYBRIDGE\nmr@NMR_250MHZ
##.OBSERVE FREQUENCY= 250.131544655141
##.OBSERVE NUCLEUS= ^1H
##.ACQUISITION MODE= SIMULTANEOUS (DQD)
##.ACQUISITION SCHEME= undefined
##.AVERAGES= 16
##.DIGITISER RES= 18
##SPECTROMETER/DATA SYSTEM= dpx250
##.PULSE SEQUENCE= zg30
##.SOLVENT NAME= DMSO
##.SHIFT REFERENCE= (INTERNAL, DMSO, 0, 16.522)
##AUDIT TRAIL= $$ (NUMBER, WHEN, WHO, WHERE, WHAT)
$$ ##TITLE= Audit trail, XWIN-NMR		Version 3.5
$$ ##JCAMPDX= 5.01
$$ ##ORIGIN= Bruker BioSpin GmbH
$$ ##OWNER= nmr
$$ C:\u/data/dgb/nmr/ADRS/1580/pdata/1/auditp.txt
$$ ##AUDIT TRAIL=  $$ (NUMBER, WHEN, WHO, WHERE, WHAT)
(   1,<2007-05-29 09:45:45.77 +100>,<MAYBRIDGE\nmr>,<NMR_250MHZ>,
      <created by zg, POWCHK disabled, PULCHK disabled
       configuration hash MD5:
       76 6E 9A 78 1E 09 19 81 EC 84 63 8F B0 6A 59 2D
       data hash MD5: 64K
       60 CC 74 82 62 60 DD 09 07 D9 B2 5B 91 31 D5 9D>)
(   2,<2007-05-29 09:45:59.89 +100>,<MAYBRIDGE\nmr>,<NMR_250MHZ>,
      <Start of raw data processing
       ef LB = 0.3 FT_mod = 6 PKNL = 1 SI = 32K 
       data hash MD5: 32K
       88 37 53 FA A8 6A 99 B7 90 75 36 3E 1B 40 9B BB>)
(   3,<2007-05-29 09:46:02.60 +100>,<MAYBRIDGE\nmr>,<NMR_250MHZ>,
      <apk 
       data hash MD5: 32K
       B7 EC A0 EC D7 B7 7B 55 77 7B 52 5B 98 1E FD 2A>)
(   4,<2007-05-29 09:46:03.42 +100>,<MAYBRIDGE\nmr>,<NMR_250MHZ>,
      <abs ABSG = 5 
       data hash MD5: 32K
       34 64 E0 DE 5E 0B 37 D2 5F 30 4E 8B 16 12 C0 13>)
$$ ##END=
$$ 
$$ hash MD5
$$ D7 A1 A9 56 DA D9 F5 FC 10 49 35 76 26 4E FC 2C
##$RELAX= 
##$RELAX= 
##$RELAX= 
##$RELAX= 
##$RELAX= 
##$RELAX= 
##$RELAX= 
$$ Bruker specific parameters
$$ --------------------------
##$DU= <C:\u>
##$EXPNO= 1580
##$NAME= <ADRS>
##$PROCNO= 1
##$TYPE= <nmr>
##$USER= <dgb>
##$AMP= (0..31)
100 100 100 100 100 100 100 100 100 100 100 100 100 100 100 100 100 100 
100 100 100 100 100 100 100 100 100 100 100 100 100 100 
##$AQSEQ= 0
##$AQ_mod= 3
##$AUNM= <au_zg>
##$AUTOPOS= <9 >
##$BF1= 250.13
##$BF2= 250.13
##$BF3= 250.13
##$BF4= 250.13
##$BF5= 500.13
##$BF6= 500.13
##$BF7= 500.13
##$BF8= 500.13
##$BYTORDA= 1
##$CFDGTYP= 0
##$CFRGTYP= 5
##$CHEMSTR= <none>
##$CNST= (0..31)
1 1 145 1 1 1 1 1 1 1 1 1 1 1 1 1 1 1 1 1 1 1 1 1 1 1 1 1 1 1 1 1 
##$CPDPRG= <>
##$CPDPRG1= <>
##$CPDPRG2= <>
##$CPDPRG3= <>
##$CPDPRG4= <mlev>
##$CPDPRG5= <mlev>
##$CPDPRG6= <mlev>
##$CPDPRG7= <mlev>
##$CPDPRG8= <mlev>
##$CPDPRGB= <>
##$CPDPRGT= <>
##$D= (0..31)
0 1 0 0 0 0 0 0 0 0.06 0 0 0 0 0 0 0.0002 0 0 0 0 0 0 0 0 0 0 0 0 0 0 
0 
##$DATE= 1180428343
##$DBL= (0..7)
120 120 120 120 120 120 120 120 
##$DBP= (0..7)
150 150 150 150 150 150 150 150 
##$DBP07= 0
##$DBPNAM0= <>
##$DBPNAM1= <>
$$ [...]
##$SUBNAM7= <"">
##$SUBNAM8= <"">
##$SUBNAM9= <"">
##$SW= 20.6930455092707
##$SWIBOX= (0..15)
0 0 3 0 0 0 0 0 0 0 0 0 0 0 0 0 
##$SW_h= 5175.983436853
##$TD= 65536
##$TD0= 1
##$TE= 683.16
##$TE2= 300
##$TE3= 300
##$TEG= 300
##$TL= (0..7)
0 120 120 120 120 120 120 120 
##$TP= (0..7)
150 150 150 150 150 150 150 150 
##$TP07= 0
##$TPNAME0= <>
##$TPNAME1= <>
##$TPNAME2= <>
##$TPNAME3= <>
##$TPNAME4= <>
##$TPNAME5= <>
##$TPNAME6= <>
##$TPNAME7= <>
##$TPOAL= (0..7)
0.5 0.5 0.5 0.5 0.5 0.5 0.5 0.5 
##$TPOFFS= (0..7)
0 0 0 0 0 0 0 0 
##$TUNHIN= 0
##$TUNHOUT= 0
##$TUNXOUT= 0
##$USERA1= <user>
##$USERA2= <user>
##$USERA3= <user>
##$USERA4= <user>
##$USERA5= <user>
##$V9= 5
##$VALIST= <valist>
##$VCLIST= <CCCCCCCCCCCCCCC>
##$VD= 0
##$VDLIST= <DDDDDDDDDDDDDDD>
##$VPLIST= <PPPPPPPPPPPPPPP>
##$VTLIST= <TTTTTTTTTTTTTTT>
##$WBST= 1024
##$WBSW= 4
##$XGAIN= (0..3)
0 0 0 0 
##$XL= 0
##$YL= 0
##$YMAX_a= 355964
##$YMIN_a= -345305
##$ZGOPTNS= <>
##$ZL1= 120
##$ZL2= 120
##$ZL3= 120
##$ZL4= 120
##$ABSF1= 16.522
##$ABSF2= -4.171173
##$ABSG= 5
##$ABSL= 3
##$ALPHA= 0
##$AQORDER= 0
##$ASSFAC= 0
##$ASSFACI= 0
##$ASSFACX= 0
##$ASSWID= 0
##$AUNMP= <proc_1d>
##$AZFE= 0.1
##$AZFW= 0.1
##$BCFW= 0
##$BC_mod= 0
##$BYTORDP= 0
##$COROFFS= 0
##$CY= 12.5
##$DATMOD= 1
##$DC= 0
##$DFILT= <>
##$DTYPP= 0
##$F1P= 14.0000005364418
##$F2P= -0.99999901652339
##$FCOR= 0.5
##$FTSIZE= 32768
##$FT_mod= 6
##$GAMMA= 0
##$GB= 0
##$INTBC= 1
##$INTSCL= 1
##$ISEN= 128
##$LB= 0.3
##$LEV0= 0
##$LPBIN= 0
##$MAXI= 10000
##$MC2= 0
##$MEAN= 0
##$ME_mod= 0
##$MI= 0
##$NCOEF= 0
##$NC_proc= -2
##$NLEV= 6
##$NOISF1= 0
##$NOISF2= 0
##$NSP= 0
##$NTH_PI= 0
##$NZP= 0
##$OFFSET= 16.522
##$PC= 1
##$PHC0= -104.9185
##$PHC1= 72.05533
##$PH_mod= 1
##$PKNL= yes
##$PPARMOD= 0
##$PSCAL= 4
##$PSIGN= 0
##$REVERSE= no
##$SF= 250.13
##$SI= 32768
##$SIGF1= 0
##$SIGF2= 0
##$SINO= 400
##$SIOLD= 32768
##$SREGLST= <1H.DMSO>
##$SSB= 0
##$STSI= 32768
##$STSR= 0
##$SW_p= 5175.98343685301
##$SYMM= 0
##$S_DEV= 0
##$TDeff= 65536
##$TDoff= 0
##$TI= <Analysis number 999999
Compound Code 99
Book Reference 9
Project Code 9>
##$TILT= no
##$TM1= 0
##$TM2= 0
##$TOPLEV= 0
##$USERP1= <user>
##$USERP2= <user>
##$USERP3= <user>
##$USERP4= <user>
##$USERP5= <user>
##$WDW= 1
##$XDIM= 32768
##$YMAX_p= 546295812
##$YMIN_p= -114431
$$ End of Bruker specific parameters
$$ ---------------------------------
##NTUPLES= NMR SPECTRUM
##VAR_NAME=  FREQUENCY,     SPECTRUM/REAL,   SPECTRUM/IMAG
##SYMBOL=    X,             R,               I
##VAR_TYPE=  INDEPENDENT,   DEPENDENT,       DEPENDENT
##VAR_FORM=  AFFN,          ASDF,            ASDF
##VAR_DIM=   32768,         32768,           32768
##UNITS=     HZ,            ARBITRARY UNITS, ARBITRARY UNITS
##FACTOR=    0.157963299565203, 1,           1
##FIRST=     4132.6476996994, 0,             0
##LAST=      -1043.33573715361, 0,           0
##MIN=       -1043.33573715361, -114431,     0
##MAX=       4132.6476996994, 546295812,     0
$$ Real data points
##PAGE= N=1
##DATA TABLE= (X++(R..R)), XYDATA
$$ [...]
17583B5839n300r031j8358n497J0000Q735j0882j081K673N29k099J816o200N295
17569c561J5477L797j0170j4796r584P650Q795j809r376n599N807o09P986M572
17555a420J0698r033j3465n313K965O755l881M848N738k993j4928m726Q5o391
17541c1061J5398P148O26K800J4779L879J6619o11p491l578J367p627j0505k860
17527a117j146k243n520n17k477k474Q465K414j6985K145J0554J1169P15j2190
17513i207p951Q453P392l710l145K032P334p466l041J8558L874j0705r842p880
17499a5304Q538j2338j1304Q995m06K3162Q5j9617l96j240K88p665J2506M695
17485a0001l597J160n488m171K0134o818j4004n84Q82Q465M631k891P659n525
$$ y = [25839, 20539, 11508, -6850, -12347, -2347, 6388, -4494, -5575, -2902, -2373, -4472, -2656, -8856, -3561, 11916, 15713, 5543, -9253, -18837, -11187, -2392, -4201, -13577, -19176, -13369, -13978, -5992, -1420, 9278, 245, -13220, -18533, -15568, -8813, -12694, -7846, -2108, -5101, -20029, -24755, -24670, -31061, -15663, -8515, -7889, -5089, 9690, 13569, 30188, 29577, 22086, 18508, 19875, 12248, 1743, -1117, -2263, -4506, -10026, -10543, -13020, -15494, -7029, -4615, -21600, -19455, -8901, 2268, 2983, -9207, -17158, -8705, -1313, -5023, -8168, -6136, 1198, -6268, -9309, 9249, 13123, 2418, -7424, -15304, -6766, -19104, -30408, -21413, -21819, 1343, 1428, -18189, -18585, -19825, -19537, -27202, -14696, -10001, -13598, -12438, -17926, -22097, -1963, -8781, -22785, -23369, -22487, -14022, -9391, -12282, -4623, -10148]
17471a0148k1976L300j740Q157N364l373M29l326J6689j022n199J723m220L721
17457a1621N773J498m466m143J396p829K026N098P626j738o117K81P788n37j224
17442f189j2527q28J5808J7528O398J0879r878p597j2038n451n0k243r049j1504
17428b6741J966j161J6588R044K441m855j0388q285O42M748n525j1037N499P906
17414a9158l178J5829P981J796l481p142p161k402N511m604q199N518J1958J785
17400d947j0729J1353K53M051M040n747k6561o577N807J4070P868M464m593o031
17386a3279K008J0192J0025K321j4012j7163l707J0394n058Q494m466k598Q201
17373h648Q751P50j3291n641Q092P873J7171j514n069j653q307n958M718J0260
$$ y = [-10148, -32124, -28824, -30564, -22407, -17043, -20416, -19987, -23313, -6624, -7646, -12845, -11122, -15342, -11621, -5848, -4350, -8816, -12959, -11563, -19392, -17366, -12268, -4642, -6380, -12497, -12216, -4428, -4965, -6189, -18716, -19544, -3736, 13792, 20190, 31069, 21191, 13594, 1556, -3895, -3945, -6188, -15237, -26741, -24775, -25936, -9348, -304, 2137, -2718, -13106, -21391, -20749, -16001, -21526, -32563, -27064, -19158, -22336, -6507, 1474, 3270, -211, -7353, -14514, -16916, -11405, -16009, -24208, -18690, -6732, -4947, -15676, -4323, -4070, -19, 4021, -1726, -28287, -34864, -29057, -14987, -7119, -2655, -7248, -13279, -11271, -1079, 8946, 11267, -2745, -19908, -23615, -13221, -18279, -9785, -14251, -16849, -8648, 103, 853, -12438, -18079, -9987, -2114, 15057, 13543, 8474, 6821, -1486, -7444, -2726, 7534]
17359G534p149N999k149n386L949K471q544r484l662J0105l646K735K572j3623
17345a8278J1178J2401J282l717K235k670j4762r411O345M775k18n09K1300Q91
17331A0842k4600k1342O798J0935l032r486n925Q229Q071K198R194O854j9170
17318b0434r459N057P755M82Q651n015p93J1521L127p543j0350o676p248P608
17304b3317L237Q584j260K4191Q676j1100j6157q432m173n513m505o374p690J3467
17290c0366L116j775O803M606J3883L46k220j0554M577j3139n635L838O270M841
17276a5409p099j2253J562J9040R890r53P567j7635j7081J2171M398P633J8949
17263A0780K213m670o631q66J1584J261m039l827l018L317k677k507K66q269m309
$$ y = [7534, 385, 6384, 4235, -1151, 2798, 5269, -3275, -12759, -16421, -6316, -9962, -7227, -4655, -18278, -7100, 5301, 6583, 2866, 5101, 2431, -12331, -21742, -15397, -10622, -10840, -11349, 9951, 10842, -13758, -35100, -28302, -17367, -20399, -29885, -35810, -27581, -19510, -17312, -8118, -1264, -20434, -29893, -24836, -17081, -16599, -7948, -12963, -13756, -2235, 892, -6651, -17001, -23677, -30925, -23317, -20080, -11496, -12756, 11435, 20111, 9011, -7146, -15578, -19751, -25264, -29769, -36143, -43833, -30366, -27250, -29025, -22222, -17616, -3733, -3387, -5607, -16161, -11584, -24723, -30358, -26520, -20250, -15409, -22508, -34761, -33199, -14159, -4269, -5222, 2345, -15290, -32371, -20200, -15802, -8169, 10780, 12993, 8323, 1692, 826, 12410, 13671, 9632, 5805, 2787, 6104, 3427, 920, 1186, -7083, -11392]
17248a1392j680k099j0528q583J3475K2336k050o173j1202j89N340J273m465M108
17234a1829L183l648J0731J9146J6213o437j4674j1690j686j4341j5012l551J1008
17221b2587Q612l798Q679R756Q236o059j3589K129R455q015Q079Q61J2521O437
17207B0717R453n98j9993k2041n773J398K2191R167j2723m124o981j1516l53j4350
17193c5526k233J5358O65J015J3882k483j6865M604k167Q072J6853O532k1826
17180a4119o782K2258J2286j0302n49j6561k5745J4190J1590Q237L753M77R236
17167G969P903J795j5685j9291R740J1914P698p081l572o079p449K742J1227O775
17153H606q563p273L976l355J368J685J965J175K855J9109m939k9925j1964N332
$$ y = [-11392, -13072, -15171, -25699, -34282, -20807, 1529, -521, -6694, -17896, -18085, -12745, -11472, -15937, -11829, -8646, -12294, -1563, 17583, 33796, 27359, 12685, 995, -691, -15032, -30044, -33595, -22587, -13975, -17773, -9094, 662, 8898, 2839, -10750, -8621, 834, -7181, 898, 1759, 14280, 20717, 30170, 29572, 9579, -12462, -18235, -16837, 5354, 14521, 1798, -2326, -9307, -20823, -21176, -35526, -37759, -22401, -21736, -20721, -6839, -9322, -26187, -21583, -23750, -15678, 1175, 7707, -14119, -20901, 1357, 13643, 3341, 2792, -13769, -39514, -25324, -13734, -5497, -1744, -1267, 7969, 15872, 17667, 1982, -17309, -7569, 4345, 12043, 4962, 1390, -4689, -12138, -9396, 1831, 8606, 43, -7230, -3254, -6609, -5241, -3556, -1591, -416, 2439, 21548, 16609, -13316, -25280, -19948]
17139a9948k594L755p610J0162K4417J6053O4j1811o448l201j52j1785O55o761
17125a5204p089N441P653M868R787k553k3350j0469M655J1576P33K2374Q879N88
17111A7889l625r196j4632j1334L149J4480Q23M91n246J5144K097j1509k0751
17098b2220o575J66n652R254J1679J0223o405q315N309O408K212j0351r216N68
17084b2915R03j310M609J2462N2J73L888K52k0547n922K0672K0795n935p799J922
17069A300n853k2154n768J5536M600j013n866p47J022j104M902M739k53r214J1306
17054h567L425j441l976l458O966K562p55J99p90k9m842k1316O713P287L087m591
17038a9526L265R803L118p535M880M194N56j1531j2362o235m493N521J9254J4758
$$ y = [-19948, -22542, -18787, -26397, -16235, 8182, 24235, 24299, 12488, 6040, 2839, 2687, -9098, -8443, -15204, -22293, -16852, -9199, -4331, 5456, 2903, -20447, -30916, -26261, -14685, -13952, 8422, 17301, 17889, 14264, 5068, -9564, -20898, -17749, -3269, -2446, -1955, -7201, 7943, 10040, -1469, -22220, -28795, -28629, -34281, -25027, -13348, -3125, -9530, -17845, -12536, -6128, -3916, -14267, -23483, -22915, -22012, -23322, -18713, -6251, -6199, -6026, -2138, -1886, -22433, -28355, -7683, 13112, 7177, -622, 1300, -4553, -26707, -32475, -16939, -12339, -13352, -19218, -19965, -18943, -20047, -15145, -10406, -10659, -19873, -8567, -5142, -6583, -10559, -14017, -7051, -4489, -5244, -5045, -5835, -5864, -10706, -32022, -25309, -18022, -14935, -19526, -16261, -6458, -3340, -10875, -5995, -1801, -1245, -12776, -25138, -31373, -35866, -30345, -11091, 3667]
17024C667N057N712o181k9723j1564L699p213Q841J5546l266p97M185M296n298
17010a3039k0882M225J3633j1203r635L422J1771l144J0117J397j1329J464M992
16997a8211p14p112O860J2682K0418r66r383k649r45P892Q206r115j1240o48j958
16982f883K4046K4472j6953j1253R218q770k2247p799P933K44J8058J3748J050
16969B4864j6672j4140m451k1323Q385K7118P350p082j1400K0153K142j1444j140
16956B360L408J114k233J2483J0462r499j2483m057k575K875N896r516j6151P579
16942a0337M909O567J560R408j2237p995K063K288J1687P279n385p434K5j2374
16928i976M965P127m630j0403l955J41p33L735L194J0396K078r581l807p762J7474
$$ y = [3667, 8724, 14436, 8255, -21468, -33032, -29333, -36546, -27705, -12159, -15425, -16222, -12037, -7741, -13039, -33921, -29696, -16063, -27266, -36901, -33479, -21708, -24852, -14735, -13338, -24667, -23203, -18211, -18925, -26037, -19177, -6495, 13923, 12957, 3574, 925, -20, 7872, 16078, 6963, -4277, -4925, -6883, 17163, 41635, 24682, 13429, 22647, 13877, -8370, -16169, -8236, -7992, 10066, 23814, 24864, 8192, -5948, -10399, -31722, -23337, 3781, 11131, 4049, -7351, 12802, 14944, 3500, 2360, 5768, 6882, 4649, 17132, 27594, 18095, 5612, 1555, -1020, 1855, 7751, -1765, -17916, -10337, -5428, 1139, 2699, 12107, -130, -8125, -6062, -3774, 7913, 15192, 9807, 2373, 2398, -9976, -5011, 2116, -2514, -12917, -16872, -16731, -17464, -13729, -10535, -139, 1939, -7642, -11449, -19211, -1737]
16913a737L506P463J3212K031l2754N048L148m563j2002L286o527M610K2240p699
16899g38j4336p643O304J8220Q16j5853K767L566J8483J2720n902m702r725r941
16885e964L958N700p583O11p360l98P269R036Q326J1334k438j6958j7794J234
16871a1027j0172j3225J698N287J8974K423K0963m63p526j529j477m8j4908Q25
16857a0205m126P671K554Q20p662k0912n557Q604J6262J2965J6580j4841Q663
16844A0816r858j9477j741m548R624J5836K4611K043j4900Q4Q995r116J951l792
16830A0528j2122Q17J870P297K003k515j7110q924O06o212k0989M51K6416J6165
16816a719M899J6382q933k0485n951k977J2684Q79o388M473M250k195r533p6J943
$$ y = [-1737, 1769, 9232, 22444, 24475, -8279, -3231, -83, -4646, -16648, -13362, -19889, -15279, 6961, -738, -15074, -22717, -16413, 1807, 2623, -13230, -10463, -6897, 11586, 24306, 18404, 13702, 3977, -5964, -2006, 3694, -3889, -3278, -10638, -11036, -3767, 5269, 13595, 24929, 22491, 5533, -12261, -11027, -21199, -34424, -32726, -27439, -8465, -6042, 14921, 14458, 6932, 5403, 3926, 3878, -11030, -10205, -14331, -6660, -4106, -3286, -10948, -31860, -37417, -28813, -12551, 414, 16994, 2153, 10816, 958, -18519, -20260, -24808, -15184, 652, 25263, 27306, 12406, 12490, 21485, 12369, 14320, 10528, -1594, -777, 1093, 8390, 10393, 7878, -9232, -18156, -17550, -23762, -44751, -44300, -17884, -1719, 3180, 19562, 10629, -9856, -15807, -18784, -6100, -5221, -11609, -7136, -2886, -5081, -14614, -14690, -12747]
16801a2747J376J4017k763r034j2492o176q518R251L246m507N777J6086P783O120
16787G419J1047o113l307m988P87j784M57J0890K291M295m370j3550j6026j3784
16773b6736M484J4131P603j6903j0936J788P49k736m291Q310J0905M097K235L503
16759c797Q674K973Q152j1105o816R731P142r380m578j4140o36N59j1712P444
16745a7489J1012K1574o467k3728r544Q669p154N912J4289K370J71q138m785N096
16731h212L551J5578Q352j0320j0739o750J0533j448j0215j7538j3505J1190K2817
16718f706J9078k171L498p941j2235r315o7l751N594M371O084m857q703n196J4889
16703g428J039p346l263k934l782O376K0939J348j2749Q884K1775J258k890j0990
$$ y = [-12747, -11371, 2646, -117, -9151, -21643, -27819, -36337, -27086, -23840, -28347, -22570, -6484, 1299, 7419, 18466, 12353, 9046, 4058, 4845, 3061, 3518, 14408, 16699, 20994, 16624, 3074, -12952, -26736, -22252, -8121, -518, -17421, -28357, -26569, -25820, -28556, -32847, -24537, -13632, -9535, -7300, -3797, 4877, 7850, 16002, 4897, -1919, 7812, 14954, 5574, 996, -13144, -13780, -13221, -24933, -17489, -6477, 15097, 8630, -15098, -24642, -15973, -23127, -17215, -2926, -556, -385, -8523, -13308, -8212, -4661, 10917, 19269, 8949, -1790, -8540, 1993, 545, -9670, -27208, -40713, -29523, -6706, 12372, 10201, 13699, 5758, -6477, -15792, -15859, -19610, -14016, -9645, -3561, -8418, -17121, -22317, -7428, -6389, -13735, -16998, -19932, -23714, -17338, 3601, 4949, -7800, 1084, 22859, 24117, 21227, 10237]
16689A0237j4878j0506P557j1895j5140J563l135m736J9601N567q479J2362o579
16676a8461N549K981l514o789R39Q363P655l897j5056K90K242R827P889L741j4134
16661a2375j3849k687J9048L050k482L79j662j963j396n719q85q217n456L912
16647c0302J1557J1461J924N561j4r7p346k196j016N183p036J9935O138n220K703
16632A1235m021M049j0642L360P109j1234Q273N514Q353p504k4243K11K3890P755
16618B2105j6299p817M643L212Q706n426q625k876n453j2748K956R724n825J278
16604a2445m917Q489k976L978J2888j6058n361j05n808J3587R10j2716J4525R847
16590C838J0614l454l059k056k0506p353J2314R279m815K931J2361J6337p715
$$ y = [10237, -4641, -15147, -7590, -19485, -34625, -33062, -36197, -40933, -21332, -15765, -24244, -11882, -18461, -12912, -9931, -13445, -20234, -19295, -10932, -3277, -7174, -22230, -21940, -19698, -9871, -1982, 1759, -12375, -26224, -28911, -9863, -6813, -9295, -8916, -10578, -12541, -13937, -19656, -20541, -28758, -34214, -30302, -18745, -7284, -5360, 201, 187, 90, -7256, -9452, -10468, -5285, -12321, 7614, 13752, 8532, 11235, 7214, 11263, 621, 3981, 11090, -144, 8129, 13643, 21996, 14492, -9751, -9540, 14350, 22105, 5806, -2011, 2632, 5844, 14550, 9124, 499, -2377, -7830, -20578, -17622, -7898, -13723, -12445, -17362, -8873, -11849, -7871, 5017, -11041, -16402, -16507, -22315, -8728, -7818, -20534, -6009, 3838, 14452, 10998, 7939, 5883, -14623, -21976, -9662, -383, -5198, -2267, 10094, 26431, 18716]
16577A8716j3731j2422q576L85p516j0293j98L648P650J0654M486N36j0836j1113
16563b8610m241J5424K028P17l91P155j431l086O378K787q02j1820r88N012M597
16548g271j2725Q184J1885m503n918k148Q212J2348J164k023j3434n39O945O326
16534F503j94k2390o437J0684Q752k30r681j047J5294L050j5215p3j6437j0308
16520c7729K6076k472k723j5704j916J5082J8968Q683k85m391p474j7104q271
16507b9260O222J4665O149J2839O302k269o152j9243k3569k7590R58J4085K6102
16494b0761L863O054P354p979o632j7098J5481L84j0252j656J5514N920j0419
16481b0227j6594Q926J7929k510J803q318k282K564J1326n148M916J2693l909
$$ y = [18716, 4985, -7437, -16013, -15628, -23144, -33437, -33635, -29987, -22337, -11683, -7197, -6661, -17497, -28610, -32851, -17427, -15399, -14682, -15073, -7918, -9349, -12435, -6057, -3270, -4072, -15892, -16880, -11868, -7271, -19996, -11812, 73, -4430, -10348, -12496, -4284, 8064, 9228, 7205, -6229, -6768, 177, 6503, 6309, -16081, -22518, -11834, -3082, -3312, -12993, -14040, 1254, 4304, -10911, -10984, -27421, -37729, -11653, -14125, -16848, -32552, -34468, -19386, -418, 8265, 7980, 3589, -3885, -20989, -29260, -23038, -8373, -2224, 10615, 16917, 14648, 8496, -10747, -34316, -61906, -60948, -46863, -20761, -16898, -10844, -3490, -11469, -18101, -35199, -19718, -19334, -29586, -31242, -15728, -9808, -20227, -36821, -27895, -9966, -12476, -10673, -18991, -21273, -18709, -7383, -12531, -7615, 5078, 1169]
16468A169l744l088R464m749j1651K81J1621K651p698M733l321M663P52K823M247
16453H153j5641P517L913j4011j3818K737J2810Q369o221m22P684o418O39J1685
16439F976O051m555j467m040q771L301m013j0487P622Q491K135o027q707J563
16425a1928k335p629N525J1147n062J4250N219K551j3796o856m269Q269K200o575
16411i289j0953M015L943j4106n95N672j1461N696J2844J8123l166j85k0787p033
16397b7282R115k882O59N850j439j3566N208J773l542L002J0421j878R078J3000
16383G517j5110r823L651P9P977m90j2825L528J3899o15q227m148q71j744P729
16368i473R569j561q724k611M858K481j329L251o661j956o763k648p714m497j3927
$$ y = [1169, -2575, -5663, 3801, -948, -12599, -12318, -697, 1954, -5744, -1011, -4332, 331, 1083, 3906, 8153, -7488, 29, 3942, -10069, -23887, -21150, -8340, 29, -6192, -6614, 1070, -5348, -4709, 6976, 13027, 8472, 7005, 2965, -5806, -2505, -6518, -17005, -9383, -892, 1243, -4784, -13491, -11928, -14263, -21892, -16367, -5220, -10282, 3968, 9187, 11738, -2058, -8914, -13183, -4914, -2714, -9289, -20242, -16227, -12284, -26390, -26985, -21313, -32774, -27078, -14234, 3889, 723, 538, -20249, -27282, -18167, -21049, -20390, -14540, -15979, -29545, -24337, -22564, -26106, -23104, -12683, -14561, -5483, 7517, -7593, -17416, -13765, -13686, -5709, -6199, -19024, -15496, -1597, -2212, -10439, -14587, -15458, -17202, -9473, 96, -1465, -10189, -12800, -7942, -5461, -6790, -3539, -10200, -12156, -18919, -21567, -29281, -33778, -47705]
16353d7705J0814K2142L260m994J0825j0220J549K2896M045r933j454l353k445
16340d573n680m942Q531O731q919m800J697L735p578n531M449o025j1609O886
16326b7628K1209M535N458P92M009r473p119J030l636j2508R538J1942J1310m821
16312D638l723j930N825o717k0834k4P336J616L655l331j3883J645R706O251j524
16297a1294K136r080j715M882J0612P303J910q474j399r073k241L798j410L434
16283a0611j5697p808J1778M28M080J0316q194j0208k599J0725O694k465n27J636
16269a2452p367J293J24L039K809K973k56K1921Q492j0947p686l381n892l25j3878
16254b1533j7055l867K0345J5200J5524o60q341k719l289J952K153m399p299K14
$$ y = [-47705, -36891, -14749, -11489, -16483, -5658, -15878, -14329, 8567, 12612, 2679, 1225, -2128, -4573, -10253, -15195, -6664, 67, -8852, -13652, -11955, -8220, -15798, -21329, -16880, -22905, -34514, -27628, -6419, -1884, 3574, 4366, 8375, -1098, -8217, -7187, -10823, -23331, -13793, -1851, 9459, 4638, 915, -1015, 4810, -1907, -22741, -22765, -15429, -13813, -10158, -13489, -27372, -25727, -16021, -9770, -11294, -9158, -18238, -19953, -15071, -4459, 2844, 4754, -3720, -5119, -14192, -16433, -12635, -14045, -10611, -26308, -34116, -22338, -21910, -17830, -7514, -15708, -25916, -28515, -17790, -11096, -13561, -14088, -12452, -19819, -18526, -18402, -15363, -12554, -9581, -9837, 12084, 20576, 9629, 1943, -1438, -7330, -7655, -21533, -38588, -42455, -22110, -6910, 8614, 7954, -387, -3106, -6395, -4443, -2290, -6689, -13988, -13774]
16240a3774k076k533P562O220J0454P119k5855k3349J7946J1294j8011J547K3891
16227D35j094o961Q30J0428j901m496J276n143P04o000l141l048j2371k0884M375
16212d6991K1588J1727K459j0794J616J983O089O160K726M877P095P659j3547
16199B647n235m228j802o499K435r2j720L442J4438O20o850p268J713J5445o00
16184F446j2825M250p89p652j1504j5356J165J3744J6134J4496L149l034n74L562
16170A1212k311j332r602j5273j3109N026n347J2052J3010N46j1713j5151P590
16157b4402N203p592J7155J5905N627p846j0438K049k841j5707J2542j630R355
16144b620Q538k007J8977m982l907r426m573l906l826K321J0032M669n423K746
$$ y = [-13774, -15850, -18383, -10821, -4601, 5853, 12972, -12883, -36232, -18286, -6992, -25003, -23456, 435, -659, -7620, -6790, 3638, 1737, -2759, -1483, -6626, -5922, -11922, -15063, -18111, -30482, -51366, -46991, -25403, -13676, -11217, -22011, -20395, -18412, -12323, -6163, -3437, 1440, 8535, 16194, 2647, -2588, -6816, -8618, -15117, -12682, -12774, -14494, -11052, 3386, 4006, -2844, -10112, -8399, 7046, 6446, -6379, -2129, -2918, -10570, -22074, -37430, -36265, -22521, -6387, 8109, 11258, 8224, 7650, 11212, 8901, 7569, -2033, -17306, -30415, -25389, -30736, -18684, -5674, -5128, -16841, -31992, -24402, -19199, -26791, -9636, 6269, 11896, 4050, -6388, -4339, -7180, -22887, -10345, -11975, -2620, 5918, 3911, 22888, 17906, 13999, 4573, 0, -3906, -7732, -5411, 4621, 9290, 3867, 6613]
16130F613O296j4582P525J289j4559p61N926O709j9213L939J6374L221n432N242
16116H587m982l257p838j0445M61J1540k215j95J0552k2157K61K1474P852N184
16102A4822k625j9234j6039J8500K0734L038K184j1066r946l935j0232L027J3228
16089B456j0806k182N985L675l432n216j0524Q275l434k321Q567Q436J455n208
16075d274j720N668j3109k2148M284O850q60K544J23R883J4240k742p807k0151
16061b9219j1384J0295J9682R690j2485j5165Q249N577M158j537p100k431J8753
16048b917O912j8694l782K907Q954K928j2427M129N281J267m903M388O314r049
16034h692m016R707O039j5969M54J39N547P75o284O172j4813j0714Q093J1841
$$ y = [6613, 12909, -1673, 5852, 7141, -7418, -8179, -2253, 4456, -14757, -10818, 5556, 8777, 3345, 8587, 3605, 348, -7490, -17935, -17474, -5934, -8149, -8344, 2208, -19949, -19688, 1786, 9638, 14822, 12197, -7037, -23076, -4576, 16158, 19196, 21380, 10314, 368, -3567, -13799, -10772, 2456, -8350, -10532, -4547, -872, -4304, -9520, -20044, -11769, -15203, -17524, -8957, -521, 934, -4274, -5994, -326, -13435, -35583, -31299, -24449, -25309, -22765, -22642, -12759, 1481, -1261, -9068, -29219, -40603, -30308, -10626, -936, -13421, -28586, -20337, -14760, -10602, -12139, -19239, -21670, -2917, 3995, -14699, -18481, -15574, -6620, -3692, -16119, -11990, -6709, -5442, -10345, -5957, 357, -8692, -12708, -3001, 3038, -12931, -12477, -12338, -6791, -6016, -12300, -6128, -20941, -31655, -23562, -11721]
16020a1721j1534l030N247M417J8135J5021j103j0501l135q13Q893J5764l625
16007B2015q681r725j4175r359J268J3290O469o899P073J476k056p969p690j4056
15993b9019J3828J0863k0056j7274J1343J2639j643m519K731J0211m391N76M831
15980i880J2326l827j3751k456J1255O045R031K685p965j702p246J376J572l580
15966f117N901n801p606K262P317J558K615Q51N681N90q306j2025J3483J891L230
15951E524M050p441k3698j737J3436J0342j0770J4544j2331k6322Q76J3861J9630
15938c6n06p718L362J702L685o300j220J7444m627k2397n905M920O905J3201R803
15923A2313O719j0700k395Q518k0081p783J7221J1917p996K530p81N220m859k0213
$$ y = [-11721, -23255, -26285, -21038, -16621, 1514, 16535, 15432, 4931, 1796, 983, 9876, 25640, 22015, 13334, 3609, -10566, -19925, -18657, -5367, 1102, -5797, 1276, 2752, 696, -7273, -14963, -29019, -15191, -4328, -24384, -41658, -30315, -17676, -19319, -23838, -21107, -10896, -15287, -14711, -9880, 2446, -1381, -15132, -17588, -6333, -288, 8743, 11428, 3463, 1761, -5485, -4109, -2537, -6117, -216, -6017, -13623, -11361, -4044, -2486, 129, 980, 6661, 7251, -1055, -13080, 403, 2294, 5524, 9574, 2133, -21565, -23302, -9866, 476, -10294, 4250, -8081, -34403, -33527, -19666, -36, -542, -8260, -4898, -3196, 489, -5811, -7031, 10413, 5786, -16611, -22516, -17596, -10691, 2510, 12313, 19032, 8332, 5937, 14455, -5626, -13409, 3812, 15729, 7733, 10263, 9482, 14702, 9843, -10370]
15909a0370j631M231N457o588q229l55O883J8504J2168M83j8008n351k629r762
15895a5197O43R001M171r49o455n288N944J784J4633L328m765L519l065O888r260
15880D932j4588N375r55k2013n20R998j1101K569N533P317J722l583q013J5709
15866g618J1474o98j5241k244L07p083j448O105Q01k003q774j3437R96K776K1121
15851a4966J6178k031j1959J850o585j6729m076J0928J8696r17l542J0972j122
15838c303K281Q823n614m018l681N11r747j846O550j6664L686J9623M221J453
15824B275k3239J2624P925J643R552k425j1981j6152j1259R824P721P386j962
15811h068o300P09k505n539O320Q016m811o384n952l509L003L128K3343M182j8931
$$ y = [-10370, -12001, -7770, -2313, -8901, -17130, -17485, -10602, 7902, 20070, 20553, 2545, -2806, -5435, -15197, -14554, -5553, -1382, -2331, -8786, -14074, -8130, -6346, 8287, 11615, 6850, 10369, 7304, 14192, 4932, -9656, -4281, -5236, -27249, -27769, -17771, -28872, -26303, -20770, -13453, -11731, -15314, -23327, -7618, 3856, 3158, -12083, -14327, -14020, -21103, -22551, -16446, -15645, -17648, -26422, -39859, -38863, -36087, -14966, 1212, -819, -12778, -10928, -17513, -34242, -38318, -27390, -8694, -9611, -13153, -2181, -3303, -1022, 7801, 2187, -1831, -5512, -5001, -14748, -16594, -10044, -26708, -23022, -3399, 822, 2275, -20964, -8340, -415, 1228, 10780, 8355, -3626, -19778, -31037, -21213, -13492, -6106, -8068, -14368, -13659, -16164, -21703, -15383, -7367, -12178, -18562, -24514, -28023, -25020, -21892, 1451, 5633, -13298]
15796a3298P732j432R395L491o614Q174m005j1253j4045p595J1441J0750J107
15783f152P80p768m46P967o517O445K548J788r580N716M524L887r924L496P396
15768D160l913N651J2632l597n952o748O54l384o175m46m16k06J2214J7574j550
15753B0498k05r637j4255j2885K238J5219Q422j3042q297N38M58l505N927O199
15739b327J06M442L439j775n573r699o973M987J0665j1916r797L32O203J1121
15725f765Q608j3952L625p079m567K16P416M897k735p131l607m110J0103M230
15711a0851K24O141j0035p130N599Q364L270m726r097M92j251Q460j464K014j266
15696a1256j68J7091p568j7680P984J2242J1993n254n317q275o250N058J0012
$$ y = [-13298, -5566, -6998, 2397, 5888, -726, 7448, 3443, -7810, -21855, -29450, -18009, -7259, -6152, -5372, -13140, -13586, -5619, -12136, -5691, -3143, -1355, -10935, -5219, -695, 3192, -6732, -3236, 4160, 247, 5898, 18530, 14933, 8981, 2233, 2887, -497, -6672, -7118, -7534, -7740, 4474, 22048, 20498, 20293, 10656, -3599, -16484, -14246, 973, 9395, -3647, -11944, -11406, -10948, -14453, -8526, -2327, -2221, 2221, 5660, 3885, -1688, -11387, -18360, -13373, -2708, -14624, -24421, -24089, -17886, -6765, 1843, -12109, -8484, -15563, -20130, -19914, -12498, -7601, -10336, -17467, -21074, -25184, -15081, -10851, -10627, -4486, -14521, -21651, -16052, -7688, -4418, -9144, -18241, -17749, -19000, -10540, -12004, -9990, -11256, -11424, 5667, -1901, -19581, -11597, 645, 12638, 7384, 2067, -6208, -12458, -7400, 2612]
15683B612j230K144j0250l987q993J1331p72j3760O104O992R630R692R645j7141
15669B017k4200O245J5437Q765K3418K302m438j1658r65k0858r030R89J3590j3068
15655a1454k0167O399J7476Q423J2420M549k0839P192j8871j1287r425J3224N538
15642a6822N628L985j14q109j924j7113k970K0388J3005q16o089j495K83O584
15628e579O922n775P28L401j875o41O517q932j620k70J44P149m0R136Q67j2286
15612b154j0492o370k962k103M324j012L954J1626J6449J2882j241p624j3017
15599B260k858O10L829K658l893j961m028K722Q808R962O109j249j2139K427o705
15584F552j3556k338k818O295L332k062J0817M388L726J4119o027j3256j47j7948
$$ y = [2612, 1382, 3526, -6724, -10711, -19704, -8373, -9145, -22905, -16801, -9809, -179, 9513, 19158, 2017, -22183, -15938, -501, 8264, 31682, 33984, 29546, 17888, 16923, -3935, -12965, -11976, 1614, -11454, -31621, -25222, -7746, 677, 13097, 17646, -3193, 3999, -14872, -26159, -35584, -22360, -16822, -11194, -7209, -7323, -15432, -17356, -34469, -37439, -17051, -4046, -4862, -10951, -12446, -12163, -5579, 1343, -4432, -3704, -303, -2178, -2819, 3698, -5234, -6854, -7124, -6980, 169, 129, 9265, 10132, -2154, -12646, -19016, -21978, -24081, -19757, -20769, -16815, -5189, 11260, 24142, 22901, 15277, 2260, -598, 12, 3841, 6499, 2606, 645, -3383, -661, 8147, 18109, 24218, 22969, 10830, 13257, 6552, -7004, -9342, -12160, -5865, -2533, -4595, 6222, 10610, 14336, 28455, 22428, 9172, 9025, -8923]
15570h923j1169N643j271K544Q556o49L577J1494m032j2831m226o426R793j6654
15556b4574o963k424n490Q145J1213M131J240J0135J2040L93m931o683M735J1569
15542A2536l52j9743k347j530n435l617j0502q562L442J8017J0479M555o471O211
15528c319m326j7748K5681K7178k667j9095o248R100l042l582J270P842L20j618
15514I746j5251O045O877j2703j1047R47N04K0802L093k0278q306Q31N649J949
15500a1142J3731P35J0240q158j3926N822k842j0326J4945p630j058r679Q787
15487a0501K4l377N755J1373J248j1012L087J3778j2361j1120r631Q777J4964
15474A004P497J4530j394j0279j1363j0650k763j066P484J276q147j0418J1343
$$ y = [-8923, -20092, -14449, -15720, -13176, -4620, -5269, -1692, 9802, 5770, -7061, -11287, -17713, -7920, -24574, -31537, -33961, -39451, -31306, -20093, -15962, -14722, -4587, 7453, 7846, 2915, -3768, 967, 12536, 12184, -7559, -9906, -11436, -16871, -20488, -30990, -39552, -36110, -18093, -7614, -3059, -9530, -3319, -7645, -25393, 288, 27466, 24799, 5704, -544, 8556, 5514, 1932, 3202, 11044, 11364, 9746, -5505, 540, 7417, -5286, -16333, -15386, -14882, 5920, 9013, -11265, -19571, -18740, -13091, -11142, 2589, 3324, 13564, 5406, -8520, -2698, -5540, -15866, -921, -8551, -9609, -19288, -10501, -10477, -13854, -8099, 3274, 4522, -6490, -3403, 10375, -1986, -13106, -22737, -13960, 1004, 8501, 23031, 21637, 11358, -5, -10655, -13418, -14484, -7000, -5724, -13871, -24289, -12946]
15461a2946J4322Q281L545L672J1142J964j1243j1649m788M056J7304j0471m961
15448H228j0001o084J1337n939k008J5202J2963p766j3007R651J341o70L60p024
15434F583k066J4724M124p238j4754p697j86n61o333o15L924N078N757N482j1531
15419e309j1047J0133N937j1624M198J1240j341j495j7523p053R210M003Q57J2441
15405B627P388J010o288J088P752L933N175k996q194j0065m741M941J2462j3779
15391C13q359j1855l852K37l599J0442J7030k74l820J7329K442J372J2160K239
15377C1805p386k1519k1751N67J0307O335r780O175j642p567k80j1514M891J4573
15363f786J4663n155j4550p570L464R939j1939J0712J596j0937k214q380m86Q486
$$ y = [-12946, 1376, 9657, 13202, 16874, 28016, 29980, 18737, 7088, 2300, 6356, 23660, 13189, 8228, -1773, -7857, 3480, -2459, -4467, 10735, 23698, 15932, 2925, 12576, 13917, 13247, 13607, 6583, 4517, 19241, 23365, 16127, 1373, -6324, -6510, -7071, -13404, -14019, -10095, -5017, 740, 6222, -5309, -16356, -6223, -286, -11910, -7712, 3528, 2187, 692, -16831, -23884, -14674, -10671, -9814, 2627, 10015, 11025, 4737, 5825, 13577, 17510, 22685, 19689, 11495, 1430, -3311, 1630, 14092, 313, -8046, -19901, -23753, -23516, -27115, -16673, 357, 83, -3737, 13592, 16034, 17406, 29566, 31805, 24419, 2900, -18851, -18284, -7977, -1642, -11422, -5247, -6889, -14456, -14736, -26250, -21359, -6786, 7877, 2722, -11828, -19398, -15934, -5995, -17934, -7222, -5626, -16563, -18777, -27157, -27643, -19157]
15349a9157P510r955Q092M65J0557n125q073L823J7217P324J126j4463l932J2819
15335H228R283j6012n691J305J0777M807m060j8418k2011M135q03m775L805P183
15321b2247q430J124J5637J2622L905k4913m992J0730J0422o90p673r83R569M63
15307e456Q28J0801J246L425l731M7k411j3474j6934l303J4411j0471k132J590
15293b5564N932P632J5107N733r600J7319K511l918l928p565M738k477j4081M691
15279c470j833J9820j1085m400Q010L398k251o466J0087J5451r541k4763q033
15266a5076O871N606R065r498j0416k881o066O595J8744R707q792q333M624j8429
15252a8279p611Q197q465n461N484N932l295m480J3714J3038J300j4613p15J169
$$ y = [-19157, -11647, -21602, -13510, -13045, -2488, -7613, -15686, -11863, 5354, 12678, 13804, -659, -4591, 8228, 17511, 1499, -4192, -2887, 7890, 12697, 8637, -9781, -31792, -27657, -28460, -33235, -29430, -22247, -30677, -29553, -13916, -1294, 2611, -22302, -27294, -16564, -6142, -6832, -14505, -15488, -5919, -5456, -4628, 6173, 7419, 10844, 7113, 7160, 4749, -8725, -25659, -28962, -14551, -25022, -27154, -25564, -19632, -12000, 3107, 8840, -760, 16559, 19070, 15152, 11224, 3659, 8397, 5920, -8161, -3470, -5303, 14517, 3432, -968, 7042, 10440, 8189, 1723, 11810, 27261, 17720, -7043, -15076, -8205, -2599, 6466, -3032, -13448, -16329, -22395, -15800, 2944, 12651, 3859, -4474, 150, -18279, -25890, -17693, -26158, -31619, -26135, -20203, -23498, -27978, -14264, -1226, 74, -14539, -15254, -14085]
15238a4085O62j533N759K590j1756j3835P232J8888M864j1195o918l800L957P53
15224a8417l424J4611P332p889l428p5M079M967k657j287o249j5421k381J2994
15210a7245P575r750j521J2335J5428J1000P475j0911j7601m351m946K130j572
15197a1954J3149j7389j5957J879J5535J5564J067l682k392k200j1147O037J579
15184i911R987R884L915p286j6734r710J2984n742m574P675j0126j0083j1950
15171d1671J0512J1346M355K912O031q832r91o038l677l512P77J8722L912n595
15157a1749L254M745L603J4897j030j3988k469Q611l66j2612k055J925J366p593
15143a3461m764K0079K1106k8j2211m505r645j520K883M087m122j2706j451K135
$$ y = [-14085, -13423, -14956, -9197, -6607, -18363, -32198, -24966, -6078, -1214, -12409, -19327, -23127, -19170, -18417, -21841, -7230, 102, -7787, -11215, -11290, -7211, -2244, -4901, -6188, -12437, -27858, -30239, -17245, -9670, -19420, -20941, -8606, 6822, 17822, 25297, 14386, -3215, -7566, -12512, -10382, -11954, 1195, -16194, -32151, -30272, -14737, 827, 1894, -1788, -4180, -6380, -17527, -11490, -9911, 76, 9960, 13875, 6589, -10145, -19855, -6871, -12613, -17187, -9512, -19638, -29721, -41671, -31159, -19813, -15458, -12546, -6515, -15347, -16338, -22376, -26053, -29565, -28788, -10066, -6154, -11749, -8495, -3750, -147, 14750, 13720, -268, -2737, 5874, 5508, -7104, -9159, -7234, -5868, -13461, -18225, 1854, 22960, 22932, 10721, 6216, -3429, -4949, -2066, 2021, -2101, -14807, -16258, -14123]
15129a4123N075J1023J0783n330j0212j999K327Q31p733N621k24n310l250j707
15115a4228n256R452k184N763p699j7784j342J7299J3612N269M09O588m034j8346
15101a2481J507K2443J4648N286k93j4912J016l782q466M693J193n544L169L144
15087A1621l546n445J2590J536L482M027j875k113j2397m846L804p982k536P874
15073D194J6835Q02o789j5754j1425J763L587p263n757M511Q938P996K502m593
15059d53J2719j81m213m210j7156o362N56r161l819J9704N176L181L253L394m188
15044a760j8644j640J8230r011K340O654o182k898j756K700J5028K1747N009l695
15030B6122k907l627j4535o958l870r071J225J3971J0833L852j1467J64n218j3115
$$ y = [-14123, -9048, 1975, 12758, 7428, -2784, -4783, -2456, -1625, -9358, -3737, -3961, -9271, -12521, -14228, -19484, -10032, -12216, -6453, -14152, -31936, -33278, -15979, -2367, 2902, 3311, 9899, 5865, -12481, -10974, 11469, 26117, 31403, 31110, 16198, 17214, 13432, 4966, 9659, 10852, 5308, 8477, 11621, 8075, 2630, 15220, 16756, 20238, 24265, 22390, 20277, 7880, 3034, 6838, -1144, -3680, 4194, 21029, 21831, 15042, -712, -12137, -10374, -6787, -14050, -19807, -15296, -6358, 1638, 4140, -453, 12266, 12085, 7872, 3662, -13494, -19856, -19300, -28461, -32280, -12576, -7400, -4219, -966, 2428, -1760, -20404, -22044, -3814, -12825, -10485, -3831, -10013, -12911, -14667, -11967, 3061, 24808, 29817, 26122, 23215, 19588, 5053, -1905, -5775, -14846, -13621, 350, 11183, 15035, 3568, 3732, -1486, -14601]
15016a4601q69P086N303k861J121J531J231l411l629l874j2455K463K6664J2038
15002A5737j1831q770l295q55J4342K224p004K278L43K393J0461j9909m954J4913
14988F073J3672n802j2041k3229j1855M549K0705O908m214n257j138k016N362
14975h283J2782j1413J033o706J310P494N451R074j4553o191m460J0L920J0372
14961a60J5560m427j4153k846q545J2185j76n149j3Q128Q879p120j6439P162J4194
14946G080l03j565j0133O262K550M713j4195j743M696j402p96k861N61M768j860
14931d228J4726j570m669j56r612l10k168M134L010j0969j44J2642J7366k832
14917A5220j4108n809q01j280r147n337J3541K365p857j934p283J1312N66j558
$$ y = [-14601, -15470, -8384, -3081, -5942, -4821, -3290, -2059, -5470, -9099, -12973, -25428, -22965, 3699, 15737, 3906, -4864, -8159, -9014, 5328, 7552, 548, 2826, 3169, 5562, 16023, -3886, -8840, 6073, 19745, 13943, 1902, -21327, -33182, -28633, -7928, -1020, -5234, -10491, -11629, -13645, -8283, 4499, -6914, -5881, -12587, -11277, -3783, 1668, 10742, -3811, -10002, -14462, -14452, -10532, -160, 15400, 10973, -3180, -6026, -14571, -2386, -2562, -7711, -7724, 404, 9283, 2163, -14276, -7114, 7080, 6777, 5212, -4921, 1341, 3891, 8604, -5591, -7334, -2638, -4040, -4836, -7697, -7136, -2368, -4228, 10498, 8928, 4259, 4103, -5509, -5819, -7987, -3853, -843, -11812, -11956, 686, 18052, 15220, 1112, -4697, -5498, -6778, -15925, -21262, -7721, -5356, -13213, -15147, -22430, -11118, -10552, -12110]
14903a2110p044k265l692l242j2955l689Q163J8476l761P108l926P884Q803K918
14889F68L219r640l99k690R371N278J1660j0077j7192l627J7705O571l693n821
14875A333j0158j4258K193N801n551O123Q603L153J1634l537j2297j3357J0466
14862i852P825m010J1258j0775N052J5828J6571o442l819k124j1202j3190j3385
14849a8265o449r644J1904J2966O141J0333o770r577n080L937J037J250l826Q964
14835c079J5679J1985j1906j2058J031j2024l525J3933M708q212l972o779M048
14822a0171J4979N824r47q288j7815q293m972J1486J3604k958J3068R786n21m302
14808A0480m731k0019N532J0552q434M414n009P388k719j5188k75M538K938p222
$$ y = [-12110, -19154, -21419, -25111, -28353, -41308, -44997, -36834, -18358, -22119, -15011, -18937, -11053, -2250, 668, 3887, -5753, -6152, -8842, 529, 5807, 17467, 7390, -9802, -13429, 4276, 10847, 7154, 1333, -8825, -23083, -20890, -15089, -20640, -14517, -5914, -2761, 8873, 5336, -6961, -20318, -9852, -2027, -6037, 5221, -5554, -502, 15326, 31897, 25455, 21636, 19512, 8310, -4880, -18265, -24714, -34358, -22454, -9488, -3347, 6986, 216, -9361, -14441, -10504, -9467, -8217, -12043, -3079, 12600, 24585, 12679, 621, 1652, -10372, -13897, 36, 4744, -3468, -7440, -14219, -10171, 4808, 10632, 9685, 1397, -16418, -24711, -29683, -18197, -4593, -7551, 5517, 15303, 14782, 10480, 5749, -14270, -8738, 1814, -6620, -2206, -7215, 173, -2546, -17734, -18009, -13471, -10533, -17755]
14794a7755o407J5618k806L541R565R91M256j2913M63J0833J847k795N262j0894
14780a194k2026J0000J0273J0915R139L599j2047k4227q46L799J1163L717j2368
14767a0103j4367P215J3115K990r200p635K627k20R345J0136k966l500k202o24
14753e389n795R043J0323m877m170j7283q830l426O383M072K988J8168O6O247
14739G520j7223L436N545m110p658L95q36P402Q593o160n26J2706K750o788P756
14724A2802j2637j0621M030J0215N955N523K411K842N200m586j3948P855j518
14711A3523j7961j2306o471R008Q201p927N7j349Q431P66n103j5524L401J5581
14697g673O526K424J0601o604j1885L196n544j1176J5154J4700J5438M447n258
$$ y = [-17755, -24162, -8544, -11350, -7809, 1756, 2747, 7003, -5910, -5447, 5386, 7233, 4438, 9700, -1194, -23220, -13220, -2947, 7968, 17107, 20706, 8659, -15568, -16414, -12615, -1452, 2265, -10103, -24470, -17255, -4140, -1150, -10350, -17985, -15358, -15578, -6233, 3903, 937, -2563, -4765, -5389, -11184, -2141, 8182, 3305, -865, -18148, -26978, -30404, -24021, -19949, -16961, 1207, 1273, 7520, -9703, -6267, -722, -4832, -12490, -12095, -12931, -5529, 3064, -3096, -3622, 9084, 11834, 5046, 12802, 165, -10456, -6426, 3789, 9744, 15267, 17678, 20520, 25720, 21134, 7186, 15041, 13523, -4438, -16744, -23215, -14207, -6006, -13933, -13876, -15225, -6794, -6028, -11131, -26655, -23254, -7673, -1147, 1277, 11878, 5274, -6611, -3415, -8959, -20135, -4981, 9719, 25157, 29604, 24346]
14684B4346k909j4354j745L980p355l900R239N77N19j4128J115O57P173n226O671
14669D660L128J117m453o107j2274n65J4633O504L078m863l982j0319N60M175
14655d708j6723J4133J745J6027j0674r195R38k2698R716K6347J9252o389k370
14642A5401j789j7899m179R927m844k937K139l500k79j7035k840k273J0885J0004
14628i219j8893j0280L120R398P762K0450P769n805O044K4562K524m960j7475
14615A4997j3051O154j984k849l83K775N19O49r129K419m815P321j1070m915O218
14600g144n108n386N475R753J047p580O314o644R828J0910P355p6j9548q759M666
14585d897j0315Q486N579K688L986l262j928M177J4045o780j1935j934j2419k280
$$ y = [24346, 21437, 7083, 5338, 9318, 1963, -1937, 7302, 7879, 8398, -5730, -4615, -3958, 3215, -2011, 4660, 7788, 8905, 4452, -1655, -13929, -14494, 139, 6643, 9721, 4858, 876, -9443, -8883, -4708, -21431, -7298, -5553, 10474, -200, -9395, -8457, -31155, -21439, 4908, 24160, 17771, 15401, 13612, -4287, -8466, 1461, -3383, -6320, -4181, -7681, -7960, -24995, -27835, -30108, -19223, -9219, -28112, -38392, -35272, -25874, -18112, 2338, 10107, 4302, 10346, 34908, 37432, 32472, 14997, 1946, 8100, 6116, 3267, 2884, 5659, 6178, 6827, -2302, 117, -4698, 2623, -8447, -13362, -7144, -12252, -17638, -12163, -2410, -1363, -8943, -2629, -9273, 555, 11465, 18820, 18744, -804, -9563, -4897, -15212, -6726, -1147, 1541, 5527, 2265, 337, 4514, 18559, 11779, -156, -2090, -14509, -16789]
14571a6789p893O440O736j3204n589k07q317n404P701K2930J8917n666N180l799
14557A036M403L223J0410J585k612j780o037p712q48J3032O701r049k5510j6801
14543b9959J8430q34J859l214O553J9973N354n249p392o669J0826j458j5649J0901
14529C472l828K576L16J1368L155j1277o78K128L191J715N937N683q684j0417
14515D657j4988n511M757J9175L367M299r249j0217J0709m75K137N708m596J3349
14501B3122K619q924j1377J2481o576l104j3481j0753J846K0012K1482q727j2352
14488F268L879J89M883n697j4272M347j6526j1941M151R572n408P265L860J0437
14474A007K175j1271N755L320j8943j7101L536Q947J7741j409P107m246L174K173
$$ y = [-16789, -24682, -18242, -11506, -24710, -30299, -30506, -38823, -44227, -36526, -13596, 5321, -345, 4835, 1036, 5439, 8662, 19072, 20657, 18045, 16265, 10228, 2516, 1668, 14700, 21401, 12352, -13158, -29959, -11529, -12363, -10504, -13718, -7165, 12808, 18162, 12913, 5521, -1148, 9678, 8220, -7429, 3472, -356, 2220, 2536, 13904, 17059, 5782, 5104, 7232, 10423, 12138, 18075, 23758, 15074, 4657, -10331, -15842, -11085, 8090, 11457, 15756, 6507, -3710, 6999, 6524, 8661, 14369, 9773, 23122, 25741, 16817, 5440, 17921, 11345, 8241, -5240, -15993, -14147, 5865, 27347, 18620, 6268, 10147, 10336, 15219, 9522, -4750, -403, -16929, -28870, -24719, -15147, -20555, -13290, -9430, 1007, 3182, -8089, -2334, 986, -17957, -35058, -31522, -22575, -4834, -6243, 864, -3382, -208, 1965]
14460A965Q78j1494n858J0848K235j078M685L313J1158k692j189j1851O428p10
14446F638j869n773o260r152O310p877k028R319Q218q332k217K744O208n175L977
14431e269J14j0222m913J3831J868n878L912L852m035p410l241Q665K173q395
14417a4948m065M246N760O908L90l317m871J237O68m599M107O888m63j6356M685
14402a3730j540R824p37l549J528l524j1391k995J8643J6127K106r729L969l511
14388A491p778K940K963j9501j95K249k422L022Q757j2823l291O604J1010Q685
14374A711L704m956L533n766k98K293R69J4030R703n753j4452M703L345o086k199
14359D481K151l952q472l941l366j934K36N510Q063j1389j1461P591K3403J1363
$$ y = [1965, 2843, -8651, -14509, -3661, -1426, -2504, 2181, 5494, 16652, 13960, 12771, 920, 7348, 6638, 4769, -1004, -7264, -16416, -10106, -17983, -20011, -10692, -2474, -10806, -13023, -10279, -4071, -9246, -5269, -5155, -15377, -20290, -6459, -4591, -10469, -6557, -2705, -6740, -14150, -17391, -8726, -6553, -14948, -19013, -14767, -9007, -2099, -1709, -5026, -9897, -8660, -7992, -12591, -8484, -1596, -2059, -18415, -13730, -15270, -5446, -6183, -9732, -8204, -11728, -23119, -26114, -7471, 8656, 10762, 1033, 5002, 1491, -6287, -3347, -384, -19885, -20080, -17831, -20253, -17231, -8474, -21297, -24588, -17984, -6974, 1711, 5415, 459, 3992, -1774, -2072, 221, 1190, 15220, 24923, 19170, 4718, 9421, 12766, 6680, 4481, 6632, 2680, -5792, -9733, -13099, -15033, -14797, -9287, -1224, -12613, -24074, -16483, 6920, 18283]
14345A8283q672j5643J850p086K083P303O016j462j529L764j54L176N701o012
14331G618k957m695j224O723j780m627J739j4351m920K94L143n521o182J4673
14317a2067O665l649J0989n736M252K5494N153q337j0431r427O33k300j7300J188
14303a4873J2934J1278L659p710j2944j3977J8564J6071j7014m821K542L483J6322
14290A3514N79p523j6022K751j939j344O671J0270q20j6693p520N502Q555k872
14276f891l005j8759K137J9131j066j0006L483J9258M508o485j4937j8184m107
14263c4923J0187J0620j0335J6831J2519j6609j5247N590K0332J6026J4599j415
14251B8175j8457J0246O52p845K026P745r969j2969L062j355l504N972q688k042
$$ y = [18283, 9611, -6032, -4182, -11268, -9185, -1882, 4134, 2672, 1143, 4907, 4753, 7929, 13630, 7618, 4661, -34, -1258, 5465, 3685, -942, 797, -13554, -18474, -18180, -15037, -20558, -26740, -12067, -5402, -9051, 1938, -3798, 454, 25948, 31101, 22764, 12333, 2906, 3539, 1239, -16061, -14873, -1939, 9339, 12998, 5288, -7656, -21633, -3069, 13002, -4012, -8833, -6291, -2808, 13514, 14093, 6570, -9452, -6701, -8640, -9984, -3313, 6957, 6137, -10556, -18076, -12574, -4019, -6891, -9896, -28655, -26518, -7387, -8453, -18459, -14976, 4282, 8790, 2305, -12632, -30816, -34923, -24736, -14116, -24451, -7620, 4899, -11710, -26957, -21367, -1035, 14991, 29590, 28175, 9718, 19964, 20616, 12771, 14797, 22542, 12573, -396, 2666, 1311, -2193, 3779, -4909, -6951]
14237f951j51k062P616N232l729o92Q90J4408M67j0469l786j483p298l304J9237
14222G925J580j21q385j5329O869R914R973M930k3498J540N751l508L264j053
14208a48p006K254J708j3726O685q208l14N497J5003m645k2299l395P601R690
14194a1303P240K1596J3699j7347k5344j4599Q766J1087q38K914J8586J5561Q82
14181C0900o047r674R035R879o208o341J491k008o632L934J363l143k612j6619
14167b682j5935L776j7826J0693J9705N324J356n53q091O044k075n608l631j264
14153a0767Q207L868L249J2632K950K399O07r861P72q088j230Q578Q944R577l58
14138C1479m001K960j7675r836o907K073m617O566J5074r688p460K373j0485m716
$$ y = [-6951, -7102, -9164, -1548, 3684, -45, -737, 153, 14561, 15028, 4559, 773, -710, -8008, -11312, 7925, 9505, 9384, 999, -14330, -7461, 2453, 12426, 17356, -6142, -4602, 1149, -2359, 905, -148, -7154, -4900, -3192, -16918, -10233, -18441, -18755, -13258, 1745, -2900, -25199, -28594, -20993, -11303, -4063, 17533, 31232, 13885, -11459, -26058, -17292, -6205, -7043, -4129, 14457, 30018, 30900, 24853, 15179, 24214, 34093, 27885, 21544, 23035, 21027, 14395, 18329, 19692, 16549, 13937, -2682, -18617, -14841, -32667, -21974, -2269, 3055, 4411, 3858, -4233, 1811, -264, -5872, -9503, -10767, -2560, 1308, 4557, 17189, 20139, 22538, 23145, 13284, 14056, 5968, 4738, 13316, 22260, 31837, 31479, 27478, 30438, 12763, 2927, -3980, -1907, -6524, 42, 15116, 5428, -2032, 341, -10144, -14860]
14124a4860J0375n828n364n238P706M775K832k1L142J146j51P389m262J914M687
14109H242o528Q918M44k4952J563O920P340J5938P3r224Q075l744J884r106O946
14094A2789K739j042l832j272p401r56K0832P88r421j9308M780J3365R379J846
14080B3286q648l265j2003j3756J301J036L49N912J1146j067L034O598N000j1302
14066G621j4241Q230j211j0102l066o428P60J2046P157r829N42J937K663l071
14052f992n665J3959Q528l25j9021n689m009N465m677j6379J1609J061m798K4525
14038b408Q470k0n725O35r883M711o231o937J1739J3622k746N548R454L396j4149
14023I476o027k542N450L691N957j2012J2286m807j9418j290n04P281k441Q156
$$ y = [-14860, -4485, -10313, -15677, -20915, -13209, -8434, -5602, -5623, -2481, -1335, -1486, 5903, 1641, 3555, 8242, 1714, 10632, 11076, -13876, -12313, -5393, 1947, 17885, 17958, 8734, 16809, 13065, 14949, 5843, 12789, 15528, 14486, 10654, 9382, 1981, 1025, 21857, 22645, 13224, -6084, -1304, 12061, 21440, 23286, 14638, 11373, -630, -14386, -13085, -12049, -11700, -5788, 5358, 4291, 7325, 13923, 18923, 7621, -6620, 1610, 399, -9703, -12769, -19197, -18437, -6391, 766, -9063, -8521, -6584, -3921, -6992, -12657, 1302, 9830, 9505, -9516, -15205, -19214, -13749, -18426, -34805, -23196, -22135, -26933, -2408, 6062, 6042, 317, 952, -8931, -4220, -10451, -17388, -5649, 7973, 5227, 10775, 20229, 23625, 9476, 3449, 907, 6357, 10048, 16005, 3993, 16279, 11472, -7946, -9236, -9740, -2459, -4900, 3256]
14009C256N291o373M555q582N924J9878r304k5034j5322n437J137J350P410J7723
13995c528p615K610J134m791j964J481J9177J5837k097j601N411o377L480j2622
13981H535j0413J0800N138n770j0220j3831Q982Q295j062O330k419J177P436j0344
13967B634O236n266j7574j0380K2170K0238O440k2021p683M377J0690r25j8278
13954i342o031N091L123m162O169O737o887l300l52r051J0390K2415o13l25l691
13939A0171R707m995q183R716J2280R53j0435j9617J1258J0247p927O308J6544
13926C6027j2017j7489r312n13n074j557K427J2144O239M224j6231j4581J5218
13913d95O380l133m297o618n735M451l778r35j0086J551K0892R43N753j0778j481
$$ y = [3256, 8547, 2174, 6729, -1853, 4071, 23949, 14645, -10389, -25711, -31148, -30011, -28661, -21251, -3528, -11143, -8533, -7399, -12190, -14154, -12673, 6504, 22341, 20244, 18643, 24054, 17677, 21157, 8535, -1878, 8922, 14060, 8290, -1930, -15761, -6779, 1516, 454, 6784, 4365, 5542, 12978, 2634, 8870, 3604, -13970, -24350, -2180, 18058, 24498, 2477, -5206, -829, 9861, 8936, -9342, -15373, -10282, -7159, -11321, -5152, 1585, -5302, -8602, -8954, -18005, -7615, 14800, 14187, 13862, 10171, 19878, 14883, 6700, 16416, 28696, 29649, 19214, -403, 10855, 21102, 13175, 19483, 36027, 24010, 6521, -2791, -3304, -8378, -9935, -7508, 4636, 10875, 15099, -1132, -15713, -495, 5885, 2752, -1545, -8163, -13898, -9447, -13225, -14160, -24246, -22695, -1803, -860, 4893, -5885, -7366]
13898g366l098m420n798l959r70N627k629m19J0414r69P994L796m112n962L64
13883a1507J1985m73j2912J0241N648k845J3145o966J174K2996q273j1938N171
13870A5446J5960k298j0888L997O710j0023k062k4300N207J2013o248j0574k3581
13857c0641Q952J6903j505l674K1473L058n280r363Q843n23m600j157o339r054
13843a2907l431K728J7397J4843J4532r665j9553j08R01l168O488j069J9072P662
13829C3722l1770j4976J1335M041K962r788l576Q265O220J717q341Q285N897j7305
13815c312n008m846R157r455N463Q370o722j857O824R703j143j6337j3630l64
13801b3157J1424j0570O480n523J7319J0600j6872o434M287M039q439N03J0201
$$ y = [-7366, -10464, -14884, -20682, -24641, -25611, -19984, -22613, -23032, -12618, -13587, -5593, -1797, -5909, -11871, -11507, 478, 5, -12907, -2666, 2982, 137, 13282, 6316, 7490, 30486, 22213, 10275, 15446, 31406, 29108, 18220, 22217, 28927, 18904, 16842, -7458, -2251, 9762, 3514, -7060, -30641, -21689, -4786, -6291, -9965, 11508, 14566, 9286, -77, 8766, 8243, 3643, 2486, -3853, -12907, -16338, -13610, 3787, 18630, 33162, 23497, 3944, 3836, 4737, 1569, 8057, 6988, 26060, 33722, 1952, -13024, -1689, 2352, 5314, -4474, -8050, 215, 6435, 8152, -189, 8096, 13993, -3312, -8320, -13166, -4009, -13464, -8001, 369, -6353, -8210, -1386, 8317, 7174, -9163, -22793, -23157, -11733, -22303, -15823, -21346, -4027, 6573, -10299, -16733, -12446, -8407, -16846, -16343, -6142]
13788f142J3643L867r780K545k376O344N93O569K355m471j3013j648N414j4938
13774a1038N466j432L12J1145k118r919K690o140m671l462R937J5747N425k267
13760I675n370j1134L790R516R695K0o96L105j0948o838m432M809k017p750k046
13745a0621O225K28m158L80o288j4472q981J1679N315J4272Q764M50n737Q505
13731E561N45q955L798K702o938K678j348R369m371j1366j075L0535j0348j0575
13717B12l06R12O150J670O996p548j3673L535M062j3378L481O11R537L229k622
13702B868m917j0717l682P07Q031m345N111J740J4039J5827m376k3937j2180L005
13688a2826K833J101N327j254P797j382O016J6972J599q924n760l974O479J876
$$ y = [-6142, 7501, 11368, 1588, 4133, 1757, 8101, 8694, 15263, 17618, 13147, 134, -1514, 3900, -11038, -5572, -7004, -6692, 4453, 2335, -7584, -4894, -11034, -15705, -19167, -9230, 6517, 11942, 9675, 4305, -6829, -3039, 6477, 16172, 16192, 15496, 18601, 7653, 815, -3617, 1192, -825, -8575, -10621, -4396, -4168, -8326, -7946, -14234, -28706, -37687, -26008, -20693, -6421, 2343, 2793, -2944, 5561, 6106, -2849, 949, 3651, -3287, -609, -1957, 7412, 3041, -8325, -9400, 21135, 10787, 212, -94, 818, 6968, 8638, 15634, 8086, -5587, -2052, 2010, -11368, -7887, -7276, 2261, 5490, 2868, -2049, -12766, -16448, -15741, -7710, -12055, -6944, -5204, 8835, 24662, 20286, -3651, -15831, -12826, -9993, -8892, -3565, -4819, 2978, 1596, 7612, 24584, 26183, 17259, 11499, 7525, 14004, 15880]
13674A5880J543L337L246p853p594L569K383M319M28j8448L47K412r715j1775
13660a7921O969J2026P000N197j0114k0710q909r879o271O384J6815J4177R165
13647C929j0626k2073j4019J2263J4309M093n2J058k786k042J172q039j457O845
13633a7425Q305M699r171l972N015qN647K4296K5840j3031k1109P920l543j1872
13619A591k0070k384J3258J3343J521O883N226l944l500j6565J3100J0808p046
13606A2221l053O353m880j5174M62M774l595p061r190m248m110Q010J7275m613
13592f829L843P309J7961J2517N174j9522j4059M99L243p113J169Q051N715k971
13578A4987J002l434O356n155J325j4647J311Q655K693Q845p914j1569o511P792
$$ y = [15880, 17423, 20760, 24006, 16153, 8559, 12128, 14511, 18830, 19258, 810, 1157, 3569, -6146, -17921, -10952, 1074, 8074, 13271, 3157, -17553, -26462, -36341, -42612, -36228, -19413, -5236, 3929, -6697, -28770, -42789, -30526, -16217, -12124, -12176, -11118, -13904, -15946, -14774, -22813, -24270, -17425, -9120, -4421, -13592, -17564, -12549, -12557, -6910, 17386, 43226, 30195, 9086, 17006, 13463, 1591, -18479, -20863, -7605, 5738, 7259, 14142, 19368, 15424, 11924, -4641, 8459, 19267, 12221, 9168, 15521, 10641, -4533, -4071, 703, -2892, -9953, -19143, -23391, -27501, -19491, -2216, -6829, -2986, 4323, 22284, 34801, 39975, 20453, 6394, 6893, 10136, 3023, 4192, 12243, 17958, 14987, 15989, 12555, 18911, 13756, 15081, 434, 1745, 10400, 13093, 21938, 14024, 2455, -4056, 3736]
13564C736l817J4369O449j9320k0250N92K370p578k273l48l153o236O132K3327
13550f000N346j1742L041J6399P612j1958j5308N103J9634Q056J25m577m579n375
13536E777M137Q599j4316Q50p824r06m470j429J075P852L427J1936j736Q555J81
13521B1708p662j844J386J263J1522j524r578L151Q222P15r102K373j1804j2498
13507c672m125P442L496n494J8456N785o236k043n027J3465J2012j7080j8136
13494a157j0821j5386J4746J0086k435n828j8762M175P040J2496m120q67O140
13481d693n084r761k32J3520O756j1906M096J71n125J7695n827k643O242k390
13467H19m300N984N053n965p081L368O113L045l305L563N494j619N269j3292j2173
$$ y = [3736, -81, 14288, 20737, 1417, -18833, -18241, -15871, -23449, -25722, -26070, -29223, -35459, -29327, -6000, -654, -12396, -9355, 7044, 14656, 2698, -12610, -7507, 12127, 20183, 20308, 15731, 11152, 5777, 9914, 18513, 4197, 5047, -2777, -3683, -8153, -9582, -8507, -655, 2772, 14708, 12972, 21527, 21708, 14046, 12202, 13588, 14851, 26373, 24849, 15271, 18422, 26644, 27359, 18257, 20630, 8826, -3672, -7797, -355, 3141, -2353, 16103, 21888, 15652, 13609, 8582, 22047, 34059, 16979, -1157, -11978, -27364, -12618, -2532, -4967, -10795, -29557, -25382, -18342, -5846, -9966, -10833, -4693, -9777, -19538, -19770, -6250, 506, -11400, -7304, -7133, -12258, 5437, -390, -3033, 3209, 819, -3481, 2503, 7556, 1591, -5490, -2122, 3991, 7036, 3731, 7294, 12788, 11169, 16438, 3146, -9027]
13452i027J313J290J1657R45L098J4388Q618N821k2406J113M849J917o661j4074
13438B841j4794m930J1517J8114Q939o218R635L327j2142j0058o971j4152J5043
13425A51K1097K407n261j3064j4125j800k19J5555Q220M666r008j143O731J266
13411A5473N525m033p77o861j041j4307J795p598j9777l647R688L3359o61m722
13397B416p744K093R109n125L247j114l830k2k255K249m987P614J8483J2939k1200
13382A1873R79Q896k983j1560q974m368n772l252k91J0574Q961P939J4869j2654
13368A4237J845R926j312j6633j6854Q505N443j0363j1255L435k080N487J8055
13355H436q813k487K838n238N434P178j193J640j411K287M20l940n960J873J6018
$$ y = [-9027, -7714, -6424, 5233, 6178, 9276, 23664, 32282, 38103, 15697, 16810, 21659, 23576, 16915, 2841, -11953, -16883, -5366, 12748, 21687, 15469, 25104, 28431, 16289, 6231, -740, -14892, 151, 21248, 23655, 18394, 5330, -8795, -10595, -10814, 4741, 12961, 17627, 8619, 7476, 14207, 15473, 20998, 16965, 16188, 9327, 8286, -6021, -4226, -11824, -31601, -35248, -25560, 7799, 7138, 2416, -5328, -3235, 5874, 749, 3996, 2882, -948, -970, -3225, -976, -5963, 1651, 20134, 33073, 11873, 12852, 21748, 18765, 7205, -1769, -6137, -11909, -15161, -15452, -4878, 4083, 12022, 26891, 14237, 16082, 26008, 24696, 8063, -8791, -286, 5157, -5206, -16461, -13026, -15106, -9619, 8436, -377, -2864, -26, -5264, 170, 7348, 6155, 7795, 6384, 8671, 9091, 5151, -809, 1064, 17082]
13340A7082Q673M90L266q167q662J5326l464m213K148r785j0749o110j143J519
13326c789j429J854J7643j2555L965R264M473M145j1974O212K9541l35j8981j3701
13312A4333j6419L807J174p632K636j1623j8069P159J5134K8530l499j9691q244
13299a2404J7014J2817o473Q10k006q827m294M962J500L965M380L177N39q652
13285F508m210j7150L804J6505J4944l586j2619l153P934K193j60N081J0610m781
13271B1920q534M695K2519K20k1151j252L589k1751o276N340N279j0398j7526
13258b3326n690J1746J0724q568J6249O267m590J625K28M200k94r270p557J9500
13244A1244J3948J351L268N645j1207K304J1238j4764j6391k0866M136P513K177
$$ y = [17082, 25755, 26245, 29511, 21344, 12682, 28008, 24544, 20331, 22479, 12694, 1945, -4165, -5308, -3789, -5218, -3364, 14279, 1724, 5689, 14953, 19426, 23571, 11597, 17809, 47350, 47015, 28034, 14333, -2086, 1721, 2895, -4737, -2101, -13724, -31793, -24634, -9500, 19030, 15531, -4160, -12404, 4610, 17427, 10954, 11764, 9758, 931, -3363, 1599, 3099, 7064, 11444, 14621, 15160, 6508, 2298, -14852, -11048, 5457, 20401, 16815, 4196, 1043, 8977, 11170, 11010, 16091, 26701, 21920, 13386, 18081, 40600, 40820, 19669, 18417, 22006, 255, -6021, -681, 4598, -5800, -23326, -29016, -17270, -6546, -15114, 1135, 7402, 2812, 4437, 4665, 8865, 8571, -699, -8256, 11244, 25192, 26543, 29811, 35456, 24249, 26553, 37791, 23027, 6636, -14230, -10094, -2581, -404]
13231d04O493k511m150Q549o05m732j4420N358J1817L878j0461j130M315L906
13217E903J2244l461l340L651l907L091K186P32M155L914l553R962K880j1520
13203B2937J0365o233j1576j0373Q593J5454J5979j4113j8052q560r268k41J6307
13190A1219R879m872j9367N269J4883q514j4496j5934P576J0353K2210p822j2194
13177a810j302J496Q506j2247r714J0740L588P052J6654R021N323k3684j7659
13164d036J1003J700J5070q635O737O257q600j6587l026L183J4639j537j957L499
13150A7710p06r033O311M18q206K02R903k5157j6329N708J1352L75m562P005J6182
13135A1173R013J505n468R42q882K305M243O351K657l806j4488n186j756J1818
$$ y = [-404, 6089, 3578, -572, 7977, 7372, 2640, -11780, -6422, 5395, 9273, -1188, -2318, 1997, 5903, 18147, 14686, 11346, 14997, 11090, 14181, 16367, 17099, 21254, 25168, 21615, 31577, 34457, 22937, 33302, 27069, 15493, 5120, 13713, 29167, 45146, 31033, 12981, 4421, -4847, -5088, 11219, 21098, 16226, -3141, 2128, 17011, 8497, -5999, -21933, -14357, -4004, 18206, 10384, -1810, -3112, -1616, 6890, -5357, -15071, -4331, -743, 6309, 22963, 31984, 37307, 13623, -4036, 6967, 8667, 23737, 15102, 21839, 28096, 19496, 2909, -117, 3066, 17705, 16168, 14211, 17710, 17004, 7971, 14282, 14700, 6494, 6696, 16599, -8558, -24887, -19179, -7827, -7452, -12014, -5009, 11173, 20186, 21691, 16223, 17165, 8283, 10588, 14831, 21182, 23839, 20033, 5545, 359, -1397, 10421]
13121A0421L257K351R946j467k1378o190L63j1071n079R179O519M190n79J351
13107A813o07L528J0154K098J832M647Q937j0168p432k787j1657m287N124j3768
13093a2573M875L0276J746j3529q971L093m785k598j975J1163J5870J4331l116
13080C3807j9510l557O607O985R031L96j6189K168Q837L145K093J3964K7648J5140
13066I0565J1053K1621M6395N1436L5668K0132k2236n6027n4488m4252k0703j1623
13054F7541j1281o784r444k0114j6668j0973J3572J3805R355O408o627P448k832
13041C3406K944o570p802P418J718M922o922m631k108P93M246N824Q482J4033
13027E5753J8312K6708K0505K2602M8024O9824P6384P2585Q8152J08533J27639
$$ y = [10421, 13678, 16029, 25975, 24508, 3130, -3060, -2697, -13768, -18847, -9668, -3149, 1041, 462, 1813, 1206, 4734, 14888, 16986, 18818, 23465, 32402, 22234, 14802, 12015, 358, -3929, 1195, -12573, -7698, 22578, 24324, 10795, 1824, 4917, 132, -2466, -4441, 6722, 22592, 36923, 33807, 14297, 10740, 17347, 24332, 33363, 33759, 17570, 19738, 28575, 31720, 33813, 47777, 75425, 90565, 101618, 123239, 169634, 221070, 256738, 276870, 254634, 198607, 144119, 99867, 79164, 67541, 56260, 49476, 40032, 19918, 3250, -7723, 5849, 19654, 29009, 35417, 28790, 36238, 33406, 36350, 29780, 21978, 29396, 31114, 36036, 29114, 24483, 22375, 23168, 27414, 33238, 41720, 55753, 74065, 100773, 121278, 143880, 191904, 261728, 338112, 410697, 498849, 607382, 735021]
13016G35021O1572n1272j58656j85849j54532q3287n0011k6791j9257j5311l812
13005D7815N348J0001j5884j2215j3067j1027n414j8082N131J5993m673l446q203
12992g723J2318K1009K300k4155j0614R456Q586J3383J4646J1064K0133K5084
12980I5487J3538L4138L3610M2590P0234Q1724J03061J26572J14008O4394m7340
12969G32016j68102j92645j41601q3056m9602j3991p195j8383k518O339M87j5978
12957D5771k3168J446m50n450j5862j65K401j494K519O513R991j1730L620J0154
12943B4096m563J2213n98m056n980O087O771P937M604M737L086K2026L2403J1597
12929A20360K9386M4905L1898K7624p913m7212o4900m6167k6413j5690j0656p786
$$ y = [735021, 796593, 745321, 586665, 400816, 246284, 162997, 112986, 86195, 66938, 51627, 47815, 53163, 63164, 47280, 35065, 21998, 10971, 5557, -12525, -7394, 8599, 3926, 480, -7723, 4595, 25604, 27904, 3749, -6865, 2591, 11177, 24560, 39206, 50270, 70403, 95487, 109025, 143163, 176773, 219363, 289597, 371321, 474382, 600954, 714962, 779356, 732016, 563914, 371269, 229668, 146612, 97010, 83019, 75824, 57441, 54923, 61262, 61749, 45771, 22603, 24049, 23599, 18149, 2287, 2122, 4523, 3029, 5548, 12061, 22052, 10322, 13942, 24096, 19533, 31746, 31148, 27092, 21112, 27199, 33970, 41907, 46511, 51248, 54334, 76360, 108763, 120360, 149746, 194651, 226549, 254173, 246260, 199048, 134148, 87981, 61568, 45878, 35222, 27436]
12917B7436L840q701k161Q126L319l169j4316j3038K619q434q497J572K0558J138
12903A0292R765l331j1997n202N540l240p538Q295l807o199r8K920P037J1095
12889A3532k514q704O793l804q224r550O061K403j17r917M985J0375J642j283
12875A678m988J5940k708j0184M267j3356j43L874O790M30j3298J3285N966l090
12861D463M124J4552m68j2896M218R369n214P369J146n025p651j0094j5380P65
12847a0722K111J265l158Q561J1542J7154J739n012j6538O536p138l517Q318l657
12833G484j2839J2648j417j1065R7O443j1744r040j229L980l66J1003L348n910
12819h607r356Q729P868j219O43J860o464j2308J3971L941J777P981K827j3949
$$ y = [27436, 31276, 22575, 20414, 28540, 31859, 28690, 14374, 1336, 3955, -4479, -12976, -11404, 9154, 10292, 20057, 16726, 4729, -473, 5067, 1827, -5711, 2584, -1223, -7422, -7520, -4600, 2437, 13532, 11018, 2314, 9107, 5303, -2921, -12471, -6410, -4007, -4124, -14041, -9056, 1319, 2961, 1678, -3310, 12630, 9922, -262, 4005, -9351, -9494, -5620, 1170, 1600, -11698, 1587, 7553, 4463, 8587, 23139, 22671, 9775, 13993, 23362, 18148, 25517, 26663, 21638, 13987, 3893, -11487, -10722, -8611, -7346, -10504, -1943, 9599, 26753, 28492, 23480, 6942, 13478, 6340, 2823, 11141, 7484, -5355, 7293, 5876, -5189, -5092, 1351, -10393, -19433, -20662, -16682, -17048, -6045, -2697, -8607, -17963, -9234, -1366, -2585, -1942, -82, -6546, -18854, -4883, -942, 835, 8816, 11643, -2306]
12805b306m118J1207J2316l690K560p143j8618o455J8727J2593m654P430N734
12792B3583Q027q045o629l086K194l185k915r370R02M360N564n210Q190j2313
12778B067j5296j867Q972j875J367J814l77O328J3630o019k624P732Q162j692
12764B0322j0700j0270O262m63j930q371l205K918J2664J1704P407O29N014J0355
12750D2336j5310j766o358p965N012J3360p295m306j5220Q580L1917J2356m995
12737E0346k1873k1386R980j2184j0400R062K049j466n946j687K359O194P754
12724A2802P3J0209J0799j267j5645j3241J0894k208n810l878j0624M081J0454
12711F639m218o28J3089k794m289m91q68l276m909Q820P557O74J0263j93n105
$$ y = [-2306, -6424, 4783, 17099, 13409, 15969, 8826, -9792, -16247, 2480, 15073, 10419, 17849, 23583, 31610, 23565, 16936, 13850, 16044, 12859, 9944, 574, 1476, 5836, 11400, 6190, 14380, 2067, -13229, -15096, -6124, -7999, -6632, -4818, -5195, 1133, 14763, 8744, 6120, 13852, 22014, 20322, 9622, -648, 5614, 5151, 3221, -5150, -8355, -5437, 7227, 18931, 26338, 26967, 31981, 42336, 27026, 25260, 18902, 10937, 15949, 29309, 22014, 17708, 2488, 11068, 42985, 55341, 50346, 28473, 7087, 17067, 4883, -5517, 3545, 5594, 4128, -1818, -3505, -1146, 5048, 12802, 12875, 23084, 33883, 32616, 16971, 3730, 14624, 12416, 6606, 2728, -7896, -3815, 6639, 2421, 1793, 14882, 12088, 7799, 7308, 6440, 3164, -1745, 7075, 14632, 15306, 25569, 25376, 20271]
12696B0271P983O906j0318q833O7K557K207N311j65n569n018k809j0922j964j5622
12681a5918Q55R367r18J350j2978N016O645R176j039L328J4542q820L126k340
12667A1392p894j0582J006K2380q097j1102q37J2849j268Q174J3647N217L14o545
12653B8654o333j3017L756N102M084m025K36p357p968j6527M688l023J820q539
12639a8449p540Q950J4221k569N333l975N26J527j8899L434J8299O451O106J5761
12625B9176M034j6840j3258O907l791p433M426j836j406K489K350j1283k137P528
12611a074l220k171J0564J2527j280n349j553q485P535N064r029L498K653k182
12597G498j866Q998J8944p907k6230l81P610j2198q592k217L634n610M912J7724
$$ y = [20271, 28254, 35160, 24842, 16009, 16076, 18633, 20840, 26151, 25986, 20417, 15399, 12590, 1668, -296, -15918, -15063, -5696, -6614, -5264, -18242, -13226, -6581, 2595, 1556, 4884, 19426, 10606, 13732, 11392, 3498, -7084, -6078, 16302, 8205, -2897, -3734, 9115, 7847, 16021, 29668, 34885, 35199, 28654, 22321, 9304, 13060, 18162, 22246, 18221, 18457, 11100, 3132, -13395, -8707, -11730, -9910, -18449, -25989, -17039, -2818, -5387, -54, -4029, -3503, -1976, -20875, -17441, 858, 7309, 13415, 29176, 33210, 16370, 3112, 10019, 6228, -1205, 3221, 1385, -21, 2468, 4818, -6465, -8602, -1074, -4294, -6465, 4099, 16626, 15346, 9997, 8444, -41, 7494, 12558, 3529, 7027, 9680, 7498, 5632, 14630, 33574, 25667, -563, -944, 6666, -5532, -14124, -16341, -12707, -18317, -13405, 4319]
12583D319M296o693J566K649J1672r101l574l250O536J4400J0662j7685o933J1432
12569B0296q85j373O728m004J632M366J2902k274j1506n723m20r429r601K277
12555B986Q301K1634j0630j6218l82O270k696J402J1340j0116k110R600R209p30
12541B7860j439P093j4986L141O495j5885j9090P535P125K557M4q983m412j0433
12527a3378Q316k49Q19m679j421m521n326J3907Q97p383k044j4469P751l195k597
12512b7572J698M018P837O399P360k576j222j3170k42J2227q810L941J6359K884
12498I131p747j0637j9684J258J7962R887p101j0884M561J2772M444o735j4293
12485a7066O813J5831Q454k751n222J731K829O100J0234j2110q558j1596j2590
$$ y = [4319, 8615, 1922, 3488, 6137, 17809, 8708, 5134, 1884, 8420, 22820, 33482, 15797, 8864, 20296, 19411, 18038, 24766, 20762, 22394, 26760, 39662, 37388, 25882, 20159, 19739, 10310, 709, 2986, 11287, 32921, 22291, 6073, 5691, 11961, 9265, 10667, 22007, 11891, 9781, 19381, 28590, 27860, 26421, 33514, 18528, 21669, 28164, 12279, -6811, 724, 7849, 10406, 10450, 1467, -2945, -13378, -5062, -5311, -4492, -9171, -10592, -15113, -20439, -6532, -5635, -13018, -15062, -29531, -21780, -24975, -27572, -25874, -21856, -14019, -7620, -260, -2836, -4058, -17228, -17470, -5243, -14053, -10112, 6247, 9131, 1384, -9253, -28937, -27679, -9717, 170, -6931, -17815, -13254, -482, 3962, -2773, -17066, -10253, 5578, 14032, 11281, 6059, 7790, 10619, 16719, 26953, 14843, 6285, -5311, -17901]
12472a7901M231J0325n11m760j485N274j1731m694n456O215J1717J4146Q940n595
12458H715N50J663m249m587l358O615o916M532n142m815M866K027J1615k021l297
12443F198p035J090q197N931J661j1929j5152r462N636K7471M772L943J3486n030
12429A3383M272p169j3257k4966K62J0074Q647N853K971q966j1879J1946L067
12416e762k607j0117l77j0524l251O064M877J3991J6566l138n320r82q88o332
12402g800j3285K410M680R826P35J485Q673K851m684M175O95L735Q618j544j5432
12387E138O925N806J897K911L3q467J429r277j7264j1056k396J8087o795N792
12373g237J2306j1345o176J4248o13k771Q063R037L28Q131J978j8770j1732q865
$$ y = [-17901, -13670, -3345, -3856, -8616, -10101, -4827, -16558, -21252, -26708, -20493, -8776, 5370, 14310, 8715, 9265, 10928, 6679, 2092, -1266, 5349, -1567, 2965, -2177, -6992, -2126, -99, 11516, 9495, 6198, -837, 253, -7944, -2013, -352, -12281, -27433, -36895, -31259, -3788, 984, 4927, 18413, 13383, 17655, 10486, -2771, -27737, -27475, -17401, -8754, -2901, 70, -8896, -20775, -8829, -5762, -8369, -18486, -18863, -29387, -32638, -26574, -21697, -7706, 8860, 5722, 402, -580, -1468, -7800, -21085, -18675, -13995, -4169, -3434, -1949, 6724, 9575, 4891, 9066, 9761, 13496, 22114, 20570, 5138, 12063, 17869, 19766, 22677, 22710, 14243, 15672, 6395, -10869, -21925, -24321, -6234, -13029, -7237, 5069, -6276, -12452, 1796, 1183, -1588, 6475, 15512, 15840, 23971, 25949, 7179, -4553, -13418]
12359a3418K724K881P792p610l34N824P575O336O14p225o740o714j410N939O694
12344B928R707j4940k142j201Q938R524J405J7742M173k2357p961q952k360N423
12330g3R002J990m723k430n009j2197L954N861J0000j7229o293J8107j910j2636
12316a3586J494L760P019k452O60K754o338q647L691J2648J8126j3007p198m042
12302e118j0817r245J5990J3855q229R505P372j5066q166J1469N617j41J330J3594
12288B1950l540R37J1445j8387j9538J6756J0813l021n096J555M605j4131p220
12275b872Q044K0868j476j0498l056q79P081p729j1698m479M028O687o349l956
12261f284r983j4457J6905P356L10J0562n656q396P156Q804j2732l775M47P065
$$ y = [-13418, -10694, -7813, -21, -7631, -7965, -2141, 5434, 11770, 12384, 5159, -1581, -8295, -9705, -3766, 2928, 12635, -2305, -4447, -5648, 3290, 12814, 14219, 31961, 36134, 13777, 5816, -3136, -5496, -73, 8929, 10919, 6196, 3766, -1243, -13440, -9486, -3625, 6375, -10854, -17147, 960, -950, -13586, -12092, -8332, -1313, -3765, -3105, -351, -6689, -15336, -11645, 1003, 19129, 6122, -1076, -5118, -15935, -25180, -9190, 4665, -3564, 5941, 13313, -1753, -9919, 1550, 7167, 7026, 8356, 21950, 18410, 19347, 30792, 12405, -7133, 9623, 20436, 17415, 12319, 13874, 18479, 4348, -2872, 5172, 26040, 24564, 14066, 11010, 10131, 17212, 9483, -2215, -6694, -2666, 4021, -2328, -6284, -16267, -30724, -13819, -6463, -6153, 4409, -1247, -9643, -2487, 6317, -6415, -10190, -9743, -2678]
12247b678q81j6249L119K2564J1729p309l204j490l635j3714j5309n640M902l902
12233c1697K44J9448O10m755N841l958J076p94J1324P94n319n918L790L305K438
12218c571M551K541m458j2446J0322J1496l636N459n306r065o375P772K145n058
12204e629Q941K0034O34p464p901k677r329m066n585j060L222N510J0069K297
12190F996M845l128O04j0224q380L015j248R092J0979R90L185j6289r182j1110
12176a9855p520P131J7076L826K316R070R432J0387J56k514j8041j0047n679p113
12162a1375J713O367l602Q425J3945q34Q929O327O310j0344j8043k481J1568J0910
12148B7815q047r265j2274J76l045p11l529R564p366N815M998o527J3410J2874
$$ y = [-2678, -3559, -19808, -16689, 5875, 17604, 10295, 7091, 5601, 1966, -11748, -27057, -32697, -27795, -31697, -31453, -12005, -11395, -16150, -10309, -14267, -13191, -13985, -2661, -1867, -7186, -13104, -9314, -6009, -3571, 980, 3521, -937, -13383, -3061, 8435, 4799, 10258, 4952, -4113, -10488, -2716, -571, -5629, 3312, 23346, 23980, 16516, 8615, 5938, -3391, -7457, -13042, -14102, -10880, -5370, 4699, 6996, 11841, 8713, 9317, -907, -9287, -6272, -7520, 1572, 12551, 13541, 16726, 437, -8745, -19855, -27375, -20244, -3168, 658, 2974, 12044, 21476, 31863, 32019, 29505, 11464, 1417, -4262, -11375, -9662, -3295, -6897, 1528, 15473, 14639, 23568, 29895, 36205, 25861, 7818, 5337, 16905, 27815, 19768, 10503, -1771, -1595, -4640, -5351, -8880, 684, -6682, -867, 4131, -2396, 11014, 23888]
12134B3888J373J931N134k735J435j3001q665L733j1550q482R377l104M823N147
12120I304j3076j9780j641N775m22Q05K2927m638j8599k634Q211J0951o37j0060
12106a3514k471J1510j665M540P811j1004o190J3144P341M723Q201r572k86J7631
12092C0199Q575Q044J4076R116k835k2412l1310j6553M487j0930J6606J6269r719
12079A3613l154L594k1601j0222J4971J5527p188P19R605o166k402J753o624q527
12065f102j243O017L131k186J752K475o169q062L795K73J0994J2528J0814J4251
12051D2268o583j517m161J2731J6640M804N438P843p961k0876j8833j3959j1685
12038D149K108j2141m324J0166J5457J3611J335k4512j2257J3644n606L139J1076
$$ y = [23888, 25261, 27192, 32326, 29591, 31026, 18025, 9360, 13093, 1543, -6939, 2438, -666, 4157, 9304, -3772, -23552, -25193, -19418, -19840, -19035, 3892, -746, -19345, -21979, -13768, -2817, -3454, -13514, -15985, -4475, -6140, -1600, 6211, -4793, -10983, 2161, 9502, 14225, 22426, 12854, 12568, 30199, 38774, 46818, 60894, 70010, 67175, 44763, 13453, -3100, 1387, -9543, 7063, 23332, 13613, 10459, 14053, -7548, -17770, -2799, 12728, 5540, 6259, 15864, 9698, 7296, 9049, 2425, -6102, -7345, -1328, 1803, -383, 1369, 3844, -2325, -10387, -6592, -6319, 4675, 17203, 28017, 42268, 35685, 34168, 30007, 42738, 59378, 64182, 69620, 77463, 69502, 48626, 29793, 15834, 4149, 6257, -5884, -10208, -42, 15415, 29026, 30361, 5849, -6408, 7236, 1630, 4769, 15845]
12025A5845M265j826o610j6950j3720P209N593m364j3874J0O618J4562J341O047
12011D146N255k4384k840J9744J2087K031O744J4758l440k499P291R545l623l1809
11997A3006k1524L790k181N236Q080J3350o38o87j0824j6396P671M343R010N976
11983A8212M291j9335k2149J0439N882M627j5707k778R510k322R770p023r875
11970a6458J5636J8013j396O22p032p332o784o108K737n695j293M35K1431Q585
11956A5361l397j629O691p931j9846p85J64O309O353J2122j8589k642J139j3719
11942b0399J1089J9148J554q805J772n680J01j5085j6148j2190J3971J1103o064
11929b5633M12L335O148L632p424j5846L264J7766J3575m645N027J4787N187m82
$$ y = [15845, 20110, 18284, 11674, -5276, -18996, -11787, -6194, -10558, -24432, -24422, -17804, -3242, -1901, 4146, 9401, -14983, -17823, 1921, 14008, 16039, 22783, 37541, 34101, 31602, 38893, 48438, 44815, 13006, -8518, -4728, -6909, -1673, 6407, 19757, 19119, 18432, 7608, -8788, -1117, 3226, 12236, 18212, 22503, 3168, -18981, -8542, -2660, 1967, -13740, -16518, -7008, -9330, 440, -6583, -16458, -822, 17191, 15795, 16417, 9385, 2053, -4731, -10839, -8102, -13797, -15090, -14655, 6776, 15361, 11964, 10335, 17026, 9095, -10751, -11536, -11372, -5063, 1290, 13412, -5177, -7819, -6680, -20399, -9310, 9838, 11392, 2587, 4359, -1321, -1220, -16305, -32453, -44643, -30672, -19569, -25633, -25221, -21886, -15738, -12106, -19530, -35376, -32112, -14346, -771, -5416, -389, 14398, 19585, 19103]
11915A9103N396N944o518r679j6040j0858m44N337M569K688L663m890n548Q748
11901A471q599J264j663o580J4776J2831L237n13m181o330j2594l876M103R013
11887B359k569k707j445M89L716j4038j0568J0935J7234j972p137L705P340j989
11873C353m04Q454p708j709l949l879l601M512o519Q477J2082n084k486N7N194
11858F790l058n273q804j4535l612j188J7J0021O671M338j0775K004J160l918
11844b0162m63j320l028J8584J21J0366o720k0453m518J0663O14J38j800k1074
11830c9052n422J9976J3350p593o933q840J975J4203J9846K1072n467j6090o183
11817e158j329J3067P29m088r541q273p042J404K788J5182R876K007o954j110
$$ y = [19103, 24499, 30443, 23925, 14246, -1794, -12652, -13096, -7759, -3190, -502, 3161, -1729, -7277, 1471, -7128, -5864, -7527, -14107, 669, 13500, 16737, 16224, 12043, 5713, -6881, -10757, -6654, 2359, -210, -2917, -4362, -3873, -157, -14195, -24763, -13828, 3406, 1434, -5703, -1998, 5342, 3353, 2949, 11403, 3695, 1986, -1963, -5842, -9443, -4931, -11450, -2973, 9109, 4025, 1539, 1596, 6790, 3732, -1541, -10345, -24880, -28492, -29680, -29663, -19642, -12971, -8633, -19408, -17404, -16244, -20162, -20625, -21945, -24973, -6389, -6268, 4098, -2622, -23075, -27593, -16930, -16316, -16178, -17978, -39052, -44474, -24498, -11148, -18741, -25674, -34514, -32539, -18336, 1510, 22582, 17115, 1025, -5158, -6487, 6580, 7309, 3221, -6320, -14593, -21635, -20231, -17443, -2261, 7615, 9622, 2668, 1558]
11803A558j12m110J121K1700o488k1539k883R496M198R023R337l222q945r402
11789b68k875p543N601J1676M187n526r593J1497n224j396k179J4177p5j0326
11775B133r756P05n906P619m707p218R059J6453R586O475K860j2780j2173j5469
11761a3119M510K941j4815j3580m942P675o23J600J6504k017N675j636o402P529
11747a0700m335j3111j2943J6790K225J968J929p694j9376o810k537R104Q906
11734c6584K5749J2337l01M942K59q997n50k258p946K532P548M708j189J1622
11720A1872K223j0055j352j2433o681J1448p987o887J502N27k799N116O841n318
11706a3983j0034R684N272N857k479m719j6122o666n780N685J0606k23O284J3076
$$ y = [1558, 1446, -2664, -1543, 20157, 13669, -7870, -10753, -1257, 2941, 11964, 21301, 18079, 9134, -268, -3143, -10686, -5085, 6591, 10778, 5252, -4341, 7156, 1932, 536, -1643, 12534, 12459, 2133, -7623, -6918, -12824, -5205, -9912, -17130, -8071, 8382, 17968, 24443, 27303, 14523, 2350, -13119, -8609, -5668, -20483, -34063, -39005, -31330, -31953, -30353, -13849, -15866, -10191, -11827, -18229, -10700, -15035, -28146, -41089, -24299, -22074, -20106, -18177, -25871, -45247, -52057, -54594, -45490, -36584, -10835, 1502, 1201, 6143, 6402, -2595, -3145, -5403, -13349, -10817, -3269, 1439, 250, 11872, 14095, 4040, 2688, -9745, -16426, -4978, -12965, -19852, -18350, -17823, -20622, -15506, -8665, -13983, -24017, -14333, -9061, -3204, -5683, -10402, -26524, -33190, -38970, -33285, -22679, -22902, -16618, -3542]
11692c542l051n392j4031n621R710J6729k230j603k520k147J578P481J5374M204
11678A4939o141j3351P277O369j1602o404Q941J338j0350m736k541R919R667l746
11664d21r222Q730J2081j3690j8405J0040J2878M716j680n837K262J228Q73R537
11650A3090j0426j2912O864j500o346J1489j831l503l205O149J1764m576p935
11637b878j2329l147J0050J4849o710j976Q753L793j4334m488K0255n280q930
11624b372r611k111P999N781P072o384L72q382J541J1434P681M145o092l74m899
11609E800j1485k163q955j4301j432J0975l071p469M051n411j1357k4567j830
11596g1215O099J6327J6684R782r784l787J972M072K1897J0197J817j271r050
$$ y = [-3542, -6593, -11985, -26016, -31637, -21927, -5198, -7428, -9031, -11551, -13698, -12120, -4639, 10735, 14939, 8798, -4553, 2724, 9093, -2509, -8913, 28, 1366, -8984, -13720, -16261, -6342, 3325, -421, -9643, -913, 11168, -2522, -20927, -10887, 1991, 6707, 5027, -810, 1452, 2680, 3553, 13090, 2664, -10248, -3384, -4884, -11230, 259, -1572, -5075, -8280, -2131, 9633, 5057, -2878, -15207, -18354, -8304, 6545, -165, -2141, 6612, 10405, -3929, -8417, 11838, 6558, -2372, -11983, -14094, -6095, -314, 6758, 374, 746, -7636, -6095, 5339, 13020, 17165, 11073, 10699, 5800, -5685, -7848, -16803, -31104, -32536, -21561, -24632, -32101, -28050, -33461, -44818, -69385, -71215, -65116, -48789, -32105, -22323, -32107, -35894, -33922, -29850, -7953, 2244, 4061, 2790, -6260]
11583f260j4516J7750J2035L85R488Q385J918j058R749J0850L182p346P07P218
11569E2487O575M45K37J0654J5459P071o185P606J3403J7638J3964L1569M1096
11556B12019O1105J10085J56242K23603L15247L20839L08829L78499N11617L63739
11546B961824l66214p58053o42995m28152k50327j59862r9058o2527m2746j1282
11536A40608j0797k1767k4395n093n678r563j193r206o246j427K283j4333r146
11523B4047q029n106n045j1946M488J5290J297L588K678K178r335j091P184l0248
11509a0050j6411l473M431J1477J4380J7518Q915p87N397K51n801k1486r068j8197
11495b2904n566m031N666L426n860J909J605j2537J4225O761j621K124q661p880
$$ y = [-6260, -20776, -3026, 9009, 9394, 18882, 27267, 29185, 28127, 37876, 48726, 51908, 44562, 45269, 52487, 59062, 59507, 59744, 70398, 85857, 92928, 86743, 94349, 107752, 125390, 139354, 170923, 212019, 273124, 383209, 539451, 763054, 1078301, 1399140, 1707969, 2086468, 2598085, 2961824, 2595610, 1837557, 1194562, 766410, 516083, 356221, 257163, 194636, 151890, 140608, 129811, 108044, 83649, 78556, 72878, 63315, 62122, 52916, 46670, 45243, 47526, 33193, 24047, 16018, 10912, 5867, -6079, -1591, 13699, 14996, 18584, 21262, 23440, 14105, 13014, 20198, -10050, -26461, -29934, -25503, -14026, 354, 17872, 26787, 26000, 31397, 31648, 25847, 4361, -4707, -22904, -28470, -32501, -26835, -23409, -29269, -27360, -25755, -38292, -24067, -17306, -18927, -16803, -25464, -33344]
11481c3344J0527O755j0835L890p981r391O470P802K952k730L468j7372r171j3672
11467f2632l090l88R65J0319K417L520K301L426j0092l996p993r765p294o568
11453h8870J842o6J8181n183j2463k503n729J4638Q802q828m919O8731P9324L6069
11439I9026o532j645j540j5138j3562j0730n030m99j6438N888K2861R561n074
11426F1148r631n987l731J5336L160L924k3778m052j2495o46q755j3342j541J7461
11412A7071L3748K8100K7857L1910K4462K232K1528k867j6716N665n671k0254
11400A47065k5876k1572L584q103n937j4373j8286L4723M9410j129j271J9429
11388A57664J8761J3868k1252p2833l1889k0373k4674j7843r354j369J5979N132
$$ y = [-33344, -22817, -16062, -26897, -23007, -30988, -40379, -33909, -26107, -23155, -25885, -22417, -39789, -48960, -62632, -65722, -66110, -65145, -54826, -52409, -48889, -46588, -43162, -53254, -57250, -65243, -75008, -82302, -88870, -87028, -87094, -68913, -74096, -86559, -89062, -94791, -80153, -71351, -80179, -85098, -16367, 62957, 99026, 92494, 90849, 89309, 74171, 60609, 49879, 44849, 44350, 27912, 33800, 56661, 66222, 61148, 51517, 45530, 41799, 57135, 60295, 64219, 40441, 36389, 23894, 23248, 14493, 1151, -390, 17071, 50819, 78919, 106776, 138686, 163148, 165380, 186908, 184041, 167325, 172990, 167319, 147065, 121189, 99617, 103201, 95098, 89161, 74788, 56502, 91225, 140635, 139506, 138235, 157664, 176425, 190293, 169041, 96208, 64319, 43946, 19272, 1429, -7925, -9294, 6685, 11817]
11376A1817k888j122J8145m725j7351k1793n776J6397p491m859j092j11l820K4314
11362c55R194J2558k416j4147J675J8434J3879k304j294M676j9567R771J3462
11349D3566m678M92o943o926k1473l126p728l1591k4856p90Q879k2108l3883l266
11335a14431J288J9004L2131K9011J2769P778R49j0072J2072K1819J1552m88j09
11322B3273n354j5314L765j367K315J0656o923O541K5024R750M529J836j845j3590
11308D3296l43O212K3988O117n031j3340p80J2901q764j0237j0j4796l39m772
11294C4102k8485j7719O748K6406K0487R694J3914J8125J5679K328q603j7405
11282G5271l580J676P245J5042J9394M9194L8501J6858l7698l9354N139M6327
$$ y = [11817, 8929, 7807, 25952, 21227, 3876, -17917, -23693, -7296, -14787, -19646, -20738, -20849, -24669, -355, 8839, 21397, 18981, 4834, 6509, 24943, 38822, 36518, 35224, 39900, 20333, 30104, 43566, 38888, 39380, 32437, 25511, 4038, 912, -6816, -38407, -63263, -64053, -55174, -77282, -111165, -114431, -113143, -94139, -62008, -32997, -20228, -12450, -11501, -21573, -9501, 12318, 23870, 23382, 23273, 17919, 2605, 6370, 5003, 7318, 17974, 11051, 17592, 42616, 52366, 56895, 58731, 56886, 43296, 42953, 49165, 73153, 79270, 74239, 60899, 60119, 73020, 64256, 54019, 54009, 39213, 38874, 34102, 5617, -12102, -5354, 21052, 41539, 51233, 65147, 83272, 98951, 101279, 92676, 75271, 71691, 73367, 80612, 95654, 115048, 164242, 202743, 219601, 181903, 142549, 147688, 194015]
11270A94015L7218Q925j80j7930l9733l9012K1236j5700K4997k7746o5836j3947
11258F6307L784m350j6381q904j2678P999L3273K7959K8583J634M304j5117r826
11245A06587P086m393j6482J147J0925K1407J9414j5105l854j431J550N308O32
11232A32791M23L963m301r116J4536J998J458M63j119J8749J8921j328K3039J6091
11218B16568J3001O390n46l507L920q260j0415J0118j6763j8185N608L877n786
11205A96020k766J3815L2486K0434K6478K8106L5626L3605K9299K691K210J3515
11193D31519L9605M2948L5593L8858M4513N3869M0437N9741P1735P7257P0912
11182A006987N0958L5494L1516M8629O1024P5842Q5773J05244J48409J59283J59001
$$ y = [194015, 231233, 240158, 239978, 222048, 182315, 143303, 164539, 148839, 173836, 146090, 80254, 66307, 70091, 65741, 49360, 40456, 27778, 35777, 69050, 97009, 125592, 127226, 131530, 116413, 106587, 113673, 109280, 92798, 93945, 104870, 126277, 145691, 130586, 126732, 125301, 126851, 132159, 132791, 133214, 137177, 132876, 123760, 138296, 140294, 141752, 142215, 141096, 159845, 178766, 177438, 200477, 216568, 229569, 235959, 235413, 231906, 235826, 227566, 217151, 227269, 210506, 192321, 197929, 201806, 196020, 193254, 207069, 239555, 259989, 286467, 314573, 350199, 383804, 413103, 415794, 418004, 431519, 471124, 514072, 549665, 588523, 633036, 686905, 727342, 787083, 858818, 936075, 1006987, 1057945, 1093439, 1124955, 1173584, 1234608, 1310450, 1396223, 1501467, 1649876, 1809159, 1968160]
11171A968160J45585J54409J76689K03201K56691L49679M68826N93968P05830
11162E023038P44653P70478R56029J155618N85551K0012K42832P88670J356394
11153A1643275J877531K407824K970892L813499N198463P017271R101579J3000170
11145E7030504K0250790L1801011M5735819N7674853N9207205N6701394P4688935
11138D03090511J02970126M0235175j04478835j45144531j08371412o4948165
11132A23352869l7610570k2451638j4058801r314144o576282m808043l946681
11125B4586710l765174l188141k422249j805425j365366r78931o76676n11294
11117I873454m62557k35545L2613l96491j121081j150914q26153n82482m39042
$$ y = [1968160, 2113745, 2268154, 2444843, 2648044, 2904735, 3254414, 3723240, 4317208, 5023038, 5767691, 6538169, 7494198, 8649816, 9235367, 9255379, 9498211, 10286881, 11643275, 13520806, 15928630, 18899522, 22713021, 27911484, 34928755, 44030334, 57030504, 77281294, 109082305, 154818124, 212492977, 271700182, 328401576, 403090511, 506060637, 546295812, 441816977, 296672446, 188301034, 123352869, 85742299, 63290661, 49231860, 39917716, 33341434, 28533391, 24586710, 20821536, 17633395, 15211146, 13405721, 12040355, 11061424, 10384748, 9873454, 9410897, 9175352, 9207965, 8811474, 7690393, 6539479, 5713326, 5130844, 4691802]
11108D691802l37045l04033l04940k88122k19142j79053j47157j17863r1104j06346
11098B596997j31130j28746j32810j16891j00214r4282q3339n8311k8682k4864
11088A697728m1836n7292o1377k4067m1279m2786l8948k4770l2570l0027k3979
11077A278797k3811k2433j7880k3190m0904k4043o60k2783l2183l7505l2032m6129
11065I55244m5357n4848m8821l4895k4555j5584j8060j9892q096O038m667p65
11053F85742q627L599q444k0202l0427j3173j020P115o761j3548j2225q820q207
11040E65002j6623j3566O271J380l477J2106N201N646n950j723q891k9857q5J8133
11026E33567j2117J0645K3947J8913K3079K8346K9845p243l5369M458O275j2250
$$ y = [4691802, 4354757, 4050724, 3745784, 3457662, 3238520, 3059467, 2912310, 2794447, 2703343, 2596997, 2465867, 2337121, 2204311, 2087420, 1987206, 1892924, 1809585, 1751274, 1722592, 1697728, 1655892, 1598600, 1537223, 1513156, 1471877, 1429091, 1390143, 1365373, 1332803, 1302776, 1278797, 1254986, 1232553, 1214673, 1191483, 1150579, 1126536, 1125876, 1103093, 1070910, 1033405, 1001373, 955244, 909887, 855039, 806218, 771323, 746768, 731184, 713124, 693232, 685136, 691174, 686507, 685742, 677115, 680714, 672270, 652068, 621641, 608468, 607448, 614563, 607802, 594254, 582029, 573209, 565002, 548379, 534813, 541084, 542464, 538987, 551093, 556294, 561940, 555990, 554267, 545376, 515519, 515434, 533567, 521450, 532095, 556042, 574955, 598034, 626380, 656225, 648982, 613613, 618071, 624346, 612096]
11014F12096k622j0968j9335p27P714j2572J1056J6377k2486p7735q5547k8467
11002C86784j8048P78p647j7733j5138j4267j0518j5870j2499m464q151m817l419
10989B54991O274J183L150J6636J9214J2644J2465k527j8486k2957j7654l8432
10977B26501l7997j3718n655K94j64r121q151K342J298J0838K5911J6614K655
10964B11647r509j1415r349j194Q111Q713J5773N260k0446o130p481o405P344
10951A84919q160j4005l944J5177M885o948K1695J2566J2934L8700O087O631j1547
10938B58990k2733j1874j8129k3261k4376l889j7395j7878q824o465M005Q418
10926A16589N504N426J7878j0780j6715q024J1107P739J206K272j0720o128J1019
$$ y = [612096, 609474, 598506, 579171, 578444, 586158, 573586, 584642, 601019, 578533, 500798, 415251, 386784, 368736, 369514, 361867, 344134, 328996, 314729, 304211, 288341, 275842, 271378, 263227, 258410, 254991, 261265, 262448, 265598, 282234, 301448, 314092, 326557, 324030, 305544, 282587, 264933, 226501, 188504, 174786, 169131, 169425, 169261, 160140, 151989, 154331, 155629, 166467, 192378, 208992, 211647, 202138, 190723, 181374, 180180, 188291, 197004, 212777, 218037, 197591, 191461, 183980, 177575, 184919, 176759, 162754, 158810, 173987, 178872, 171924, 193619, 206185, 219119, 257819, 263906, 270537, 258990, 236257, 224383, 206254, 182993, 158617, 154728, 137333, 119455, 110631, 104166, 108171, 116589, 122093, 127519, 145397, 134617, 117902, 109878, 120985, 128724, 129930, 132202, 121482, 115354, 126373]
10913A26373J4701K5395J5114J7506q006k7863j3996L114p342k1535j5743m353
10901A03365J5160J9322J3457m32N226l150k756L74R220j549j1392R0k5366k0648
10887A00921O428m075L285q263k420P974K5543k545j1000o799l349M949m5j8631
10873I1973m12l952j8893k358k2896K659O821q868M984J5036O887n27q25m823
10859F4806K61l12j235L128P126K014j5511j8835j5324j1040M345J1709J3266
10846D4398J1030J6146j2145J1444j4073k5633j4826j1406O583J8884p83q071
10834B1548K0144M7435O4942N5412J7603j0906k9201j9622J0804R99j7345j5964
10822A45849K020J1560N996j0868k7133p751o427L391L272K340M415m608K102
$$ y = [126373, 141074, 166469, 181583, 199089, 191083, 163220, 149224, 152338, 144996, 123461, 107718, 103365, 118525, 137847, 151304, 150872, 156098, 152948, 150192, 150566, 159786, 158237, 146845, 146935, 121569, 100921, 107349, 103274, 106559, 98296, 95876, 103850, 129393, 126848, 115848, 109049, 105700, 110649, 110604, 91973, 91561, 87609, 68716, 66358, 43462, 46121, 52942, 44074, 49058, 64094, 70981, 70454, 69629, 64806, 65067, 64755, 63520, 66648, 73774, 75788, 60277, 41442, 26118, 15078, 19423, 31132, 44398, 55428, 71574, 59429, 70873, 56800, 31167, 16341, 4935, 11518, 30402, 29619, 21548, 41692, 89127, 154069, 209481, 227084, 216178, 186977, 167355, 178159, 179158, 161813, 145849, 147869, 159429, 165425, 154557, 127424, 119673, 113246, 116637, 119909, 122249, 126664, 122056, 124158]
10809A24158Q96j0158j1852k605P027q259K996K554J284j7883k1946P89k665J1815
10795G6151n404j0055P457K893j4634l785K647K206m278r1J5087r199k0747j4958
10781B3290J7018K3968J0862l351o466J0216j8810L161K584J962r821Q603J4224
10768G7440k593j3517j5966k183L101O9N037J1030J1464J0666j9696J2084k22
10755G6714p753j48L803J0617Q790j742m840l500N525q455K512M10P842R140K1581
10740A20496l805k5135J830M0690K5511L9161J6075M1769N2215N9594J14420J57075
10728F39896K05778K81434L10153L04849L77095N14643L94015l24772p64730o62485
10718A275876m21362k34786j38056j04222n8443m6985m8072k6338k3071k5460
$$ y = [124158, 125054, 114896, 103044, 100439, 107466, 99207, 102203, 104757, 106041, 88158, 66212, 67001, 64336, 76151, 70747, 60692, 68149, 71042, 56408, 52623, 55270, 57476, 53198, 53107, 68194, 58995, 38248, 23290, 40308, 64276, 75138, 71787, 65321, 75537, 56727, 59888, 62472, 64434, 54613, 63216, 77440, 74847, 61330, 45364, 43181, 46282, 46351, 51388, 62418, 73882, 84548, 64852, 76936, 76714, 68961, 68813, 72616, 83233, 92023, 90281, 85441, 81941, 87466, 79011, 81523, 81933, 89775, 98915, 120496, 116691, 91556, 93386, 134076, 159587, 198748, 214823, 256592, 308807, 368401, 482821, 639896, 845674, 1127108, 1437261, 1742110, 2119205, 2633848, 3027863, 2703091, 1938361, 1275876, 854514, 619728, 481672, 377450, 319007, 272022, 223950, 197612, 174541, 149081]
10708A49081k2752k5028l915j3000p348o04p511m809O589K479q155P704J1004
10695H3735n169l273l55j223K386Q598K846j3008m762M687J707j81R554p660P991
10680H5873P178j84m09j300j5328j1301j587n166j1894q584q824p036J424J242
10666B4104j87l794l566J6739j1347j62J3018P901O576j4841k5340j1314M69J3615
10652A1871J3903J3260n254j1865J261O209J1743R9J0599R997J6789N831J304
10639H5747O544l755J4224J1228Q214K4098L3536M2500L5659M2469L9912M7540
10627C87916M4360N9663R0421J15437J65000K28776L06489L86535M94154O12174
10617B890925P03134P70381P94816P77400N84202K35679o9782j68175m4598K67643
$$ y = [149081, 126329, 101301, 97386, 84386, 77038, 76434, 68923, 64114, 70703, 73182, 65027, 72731, 83735, 78566, 75293, 74938, 73715, 76101, 84699, 87545, 74537, 69775, 74462, 76169, 75988, 85542, 77882, 85873, 93051, 92867, 92458, 91158, 75830, 64529, 62942, 57776, 45882, 37298, 28474, 21438, 22862, 24104, 23917, 20123, 16557, 33296, 21949, 21787, 34805, 42706, 49282, 34441, 9101, -2213, -1744, 11871, 25774, 39034, 33780, 21915, 23176, 29385, 41128, 41227, 51826, 61823, 78612, 84443, 85747, 92291, 88536, 102760, 113988, 122202, 146300, 179836, 222336, 257995, 300464, 340376, 387916, 432276, 491939, 582360, 697797, 862797, 1091573, 1398062, 1784597, 2278751, 2890925, 3594059, 4364440, 5159256, 5936656, 6520858, 6756537, 6686755, 6518580, 6473982, 6741625]
10607F741625O23738R55346J206484J370231J473940J393278Q71092q9982q81478
10598A3664274j046680o75919p6874N60933J081697J442443J630974J693212J463603
10589A9737663N43892r53094k093202k265728j770082j047606l56379J85464N31480
10580A2512408P06365P62815N52792j28481j134013j804086j842154j438903r42792
10571G243951n03681j79134J5623J00513Q8772m2879l58823p06194r37322r43541
10561C777285p85349o04163m49264l24938k28200j85071j43599j09630p7606o5770
10551H03695o2818n0582o1559n6151l0258l0941l8943k8798k0139q053p484j7273
10539C90696q802j3287j6960r569j0137r200j8299k1680M982j6742j2453j364
$$ y = [6741625, 7365363, 8320709, 9527193, 10897424, 12371364, 13764642, 14635734, 14545752, 13664274, 12617594, 11941675, 11864801, 12425734, 13507431, 14949874, 16580848, 18274060, 19737663, 20281555, 19328461, 17235259, 14969531, 13199449, 12151843, 11795464, 11980928, 12512408, 13218773, 13981588, 14534380, 14405899, 13271886, 11467800, 9625646, 8186743, 7243951, 6740270, 6561136, 6576759, 6677272, 6766044, 6723165, 6364342, 5658148, 4720826, 3777285, 2991936, 2387773, 1938509, 1613571, 1385371, 1200300, 1056701, 947071, 869465, 803695, 740877, 690295, 628736, 572585, 542327, 511386, 472443, 443645, 423506, 415453, 407969, 390696, 381894, 368607, 351647, 342078, 331941, 322741, 304442, 282762, 287744, 271002, 258549, 257185]
10527B57185j154R43j6220l631o327J235m058j0513j0706k421j305J2748L104
10514B18880N568P179k047k0415p916Q63j346m661r739r069l993q337r77J16M854
10499A68960p08j3246o510J280K390L10j718q987p944m681J763m894k887J7962
10485A41090J8193j5683j3572o759O492J1645q59j5304K717P008j7230m464Q349
10472A21623J8098J1874r595p859k3789J0174M857m701J3037J2620j3357k4068
10460A08914M147O370J373K995N344K395r997k5382o388J0631L617R247M093p980
10446A09379J3155K962m864j0140L744k1678p419O54K3760J567j0922O870Q996
10433A16064p315j5927j4812m004o117R843P266j3584q051J0831P163K604K886
$$ y = [257185, 256031, 256974, 240754, 237123, 230796, 232031, 227973, 217460, 206754, 204333, 203028, 215776, 218880, 224448, 231627, 229580, 209165, 201249, 202112, 200766, 196105, 186366, 177297, 173304, 164967, 163990, 164106, 168960, 168252, 155006, 148496, 149776, 152166, 152476, 150758, 141771, 133827, 129146, 130909, 126015, 123128, 141090, 159283, 143600, 130028, 123269, 129761, 141406, 140547, 125243, 127960, 134968, 117738, 113274, 121623, 139721, 151595, 142000, 134141, 110352, 120526, 125383, 120682, 133719, 146339, 132982, 108914, 113061, 119431, 120804, 123799, 129143, 131538, 121541, 96159, 89771, 100402, 104019, 113266, 117359, 109379, 122534, 125496, 120632, 110492, 114236, 92558, 85139, 85793, 109553, 111120, 100198, 107068, 116064, 108749, 92822, 78010, 74006, 67889, 77732, 84998, 71414, 63363, 74194, 81357, 83961, 86847]
10420H6847o689m725j2785j3798R94M017J3418J0727O07q993L50m063j761n227
10406E8919N210j50k977J9227J0502j1447j7694j491J7662J714M13j190n368j516
10392G1814K935O910P66n292j2660L898J4933k438r972l92Q18j869L907n114r399
10377E8845n209p818Q205l876P794J5273j970r354p727J1493o168k21L538K925
10363F5730R032o136k429N503j3445p879J4374o62Q385N826k089p014o48J72o084
10348F2636j8505j0407n48O838J326J2935j616J909K129J1066J288K837l188j4294
10334E4406j0571r850J0703O007q043L687K85r771l307J883J0735J4115l362n681
10320E1236Q343N17q151o374j3602o650J4602J283J4242J7607l287r589r121k467
$$ y = [86847, 80158, 75433, 62648, 48850, 49844, 53861, 67279, 78006, 78613, 69620, 69970, 65907, 64146, 58919, 64129, 63979, 61002, 80229, 90731, 79284, 61590, 60099, 77761, 79475, 79888, 78698, 73330, 71814, 74749, 81659, 82425, 77133, 64473, 68371, 83304, 80866, 70894, 70502, 71320, 69451, 73358, 68244, 58845, 53636, 45818, 54023, 50147, 57941, 73214, 71244, 61890, 54163, 65656, 59488, 59267, 62805, 65730, 74762, 68626, 66197, 71700, 58255, 50376, 64750, 64088, 72473, 78299, 76210, 69196, 68548, 68720, 62636, 44131, 33724, 33176, 40014, 41340, 54275, 52659, 54568, 56697, 67763, 69051, 71888, 68700, 54406, 43835, 33985, 44688, 50695, 42652, 46339, 46624, 36853, 33546, 35429, 46164, 60279, 56917, 51236, 59579, 60096, 51945, 45571, 31969, 25319, 39921, 41204, 55446, 73053, 69766, 60177, 51056, 48589]
10306D8589l171o142Q473L1383j266J539M765n174n776J4945L674j2547j1969
10293F7323j401k331n653J3403Q918N043l619J932j1998j0917l611K578O300R991
10279G5958L197j2472m074j281J3356j7008o817Q162L761p036o185M22R565m022
10265E5526N561o60N633J046j6438m090j0185O845k067j1611L508L764N196J5804
10251E7832k954k3729n91J2400J5065L375r072j6323o340L621J2399J2026J117
10238E8826l978j221k693p104L206r075j1194j866K477M648J0480k581j1911l536
10224B4478N842M820m064k009n778O51Q695o36R384O470J1324P29N866n106j4760
10209D5906k7033o168J3595J3007o1m553p773l075J0544L857J125n731j9386M765
$$ y = [48589, 45418, 39276, 47749, 79132, 77866, 79405, 84170, 78996, 73220, 88165, 91839, 79292, 67323, 65922, 63591, 57938, 71341, 80259, 85302, 81683, 83615, 71617, 60700, 57089, 59667, 65967, 75958, 79155, 66683, 62609, 61328, 74684, 57676, 50859, 59021, 62782, 55746, 49561, 49983, 59548, 55526, 61087, 60427, 66060, 67106, 50668, 46578, 36393, 43238, 41171, 29560, 33068, 36832, 42028, 57832, 54878, 31149, 30558, 42958, 58023, 61398, 52326, 36003, 29663, 33284, 45683, 57709, 58826, 54848, 53627, 50934, 43830, 47036, 37961, 26767, 24901, 27378, 32026, 42506, 39925, 28014, 24478, 30320, 35140, 31076, 29067, 23289, 23940, 32635, 31999, 41383, 47853, 59177, 59906, 65772, 60666, 45906, 18873, 12705, 26300, 39307, 39246, 34693, 26920, 23845, 34389, 38246, 39371, 33640, 14254, 19019]
10195A9019R974J203K993k883k106K214k708R994m126l141M017Q32J0016j457
10181D3841N155J0825J2732J5464P319J656m073o405M420K708q093J559J3491
10168A00599N131J49j2346M099p639J4149j985o14N851j659j101R439R862P742
10154A31677k577Q814n623m590n164q966P536J1980j0145j0231j1960P309J3286
10141A21346K615p938K181j3732k9447j0563m962l370M423N852J1427N840K842
10128H6514m306p497j4834r074p011r240m482J038P269r16k472K030J9627K492
10114E9138M905j6117j5285K45J4919P08n204o446j277N533l353j4957J204k357
10100B1656K799R522L900j1389j61N54J0110J0006n722J979n82q608K515j8140
$$ y = [19019, 28993, 30196, 33189, 30306, 28200, 30414, 27706, 37700, 33574, 30433, 34450, 35282, 45298, 43841, 48996, 59821, 72553, 88017, 95336, 96992, 92919, 86514, 90934, 93642, 85549, 87108, 100599, 105730, 105879, 93533, 97632, 89993, 104142, 102157, 101543, 107394, 105735, 104634, 114073, 123935, 131677, 129100, 137914, 132291, 127701, 122537, 113571, 121107, 133087, 122942, 112711, 100751, 108060, 121346, 123961, 116023, 118204, 104472, 75025, 64462, 59500, 56130, 60553, 66405, 77832, 83672, 86514, 82208, 74711, 59877, 50803, 43792, 34552, 30070, 31108, 38377, 37461, 34989, 37019, 56646, 59138, 64043, 47926, 32641, 32886, 47805, 48513, 43309, 36863, 35586, 41119, 37766, 22809, 24013, 21656, 24455, 33977, 37877, 26488, 26327, 26881, 36991, 46997, 41275, 43254, 42672, 34064, 36579, 18439]
10086A8439k29J2573K4044J6073j0860j8410j1455m755j043L467O158p885n236
10073B0881N982J0013J2431J2118p368j6138j4616J1273Q068j582l446M820M510
10060D6946M165j5194j574K99r929L071p857r43n401N401N796L975J661L169N243
10045C8828M282l745n347l001K265K015K068o375O541n191j0348L795J9792N908
10031E1487R435m224k2794n000L191R094J0016J1153o954j4818k1245j4819o380
10018a858J1000j239J804J4086J3357l161N313P366p765r543M95R31M0M585J735
10003C7146o667N113j6105j4037P317M260p713J843J3592K39m032k5354j559K1470
9989A5513P003R561q697j0972m915o984j0109L876L436J0663L186l861j2649J481
$$ y = [18439, 18210, 30783, 54827, 70900, 60040, 41630, 30175, 25420, 24377, 27844, 34002, 26117, 20881, 26863, 36876, 49307, 61425, 54057, 37919, 23303, 34576, 42644, 41062, 37616, 42436, 46946, 51111, 35917, 34343, 34642, 24713, 27784, 19927, 18984, 13583, 18984, 24780, 28755, 30416, 33585, 38828, 43110, 39365, 34018, 31017, 33282, 35297, 37365, 30990, 37531, 32340, 21992, 25787, 45579, 51487, 60922, 56698, 33904, 28904, 32095, 41189, 51205, 62358, 55404, 40586, 19341, 4522, -1858, 9142, 7903, 9707, 23793, 37150, 33989, 39302, 46668, 38903, 29360, 29855, 30786, 30826, 35411, 37146, 30479, 35592, 19487, 5450, 12767, 17027, 9314, 11157, 24749, 24988, 20956, -4398, -5957, 15513, 22516, 32077, 23380, 12408, 7493, 509, -9600, -5724, -2288, 8375, 11561, 7700, -4949, -3468]
9975c468J9448J3041l364O964L8l56m967l720P8r480j0607P654J7968M006J136
9960C4371q735p77m758r361k377O826P244N825j3748l962P452N910j4876o575
9946B459l962n22K2578M268j2809R1M282N428j1180j4J3038M964N420J3229l556
9931D3714r645j4956O807m134N722M109J1392r771r366j2601O273J0851P347n554
9917C0188j1941j259J4006j591L673J2509j1366j0833p897j8147L627Q414o046
9904C337R588J5201r673L066L064Q04l766Q469l245p748L765K111j449K764o471
9889A9817J07p24N44K798k177r049M503n879K52P342O492P195J3355k116j1452
9874C1008k3474j069J4269N727O621R905m929p802k427R520M463n894r021j0875
$$ y = [-3468, 15980, 29021, 25657, 32621, 32659, 32303, 27336, 23616, 23694, 14214, 3607, 11261, 29229, 33235, 34371, 25636, 24859, 20101, 10740, 8363, 15189, 22433, 28258, 14510, 10548, 18000, 23910, 9034, 2459, -1503, -2025, 20553, 24821, 12012, 12103, 16385, 21813, 10633, 10619, 23657, 28621, 34041, 47270, 43714, 34069, 19113, 25920, 21786, 27508, 31617, 43009, 33238, 23872, 11271, 17544, 28395, 35742, 30188, 18247, 16988, 30994, 29403, 33076, 45585, 34219, 23386, 15489, -2658, 969, 9383, 3337, 12925, 28126, 18453, 21519, 24583, 25387, 21621, 30090, 26845, 19097, 22862, 24973, 23524, 26288, 19817, 19924, 19200, 19744, 22542, 20365, 11316, 15819, 9940, 10192, 17534, 24026, 31221, 44576, 42460, 31008, 7534, 6465, 20734, 26461, 33082, 42987, 38058, 30256, 27829, 37349, 41812, 35918, 26897, 16022]
9860A6022o983k762Q959P438q492r261L845J576j90J928o558O5m960j4359J1217
9845b515J7601J9790N031j034q615j889L560j1260M495o785J3697m202j7033L645
9831A4486J9564J8208o305j7717k0025q091k31R15J5612k667o658q581M144J62
9817B816k975J791K993O605J809Lq778J6610M139j8669n219J0153j590P28l786
9802F630j4158J0882J6919K672N703K413p716n212N262J3571j2736J66J1919K0269
9788E6584J4935r685j1266J2512o812o195j7506k873J6793L5898M2569N2151P3020
9775B50125J15830J63074K51312L52252L99732M09098N32685O61615L85115l39028
9765C181810q53747q38793n50758k94286j78905j20732p6645n7686l2874l4237
$$ y = [16022, 9039, 6277, 15236, 22674, 14182, 4921, 8766, 10342, 10152, 12080, 5522, 5587, 627, -13732, -2515, 15086, 34876, 39907, 38873, 30258, 28369, 31929, 20669, 25164, 18379, 32076, 27874, 10841, 14486, 34050, 52258, 45953, 28236, 8211, 120, -111, 804, 16416, 13749, 7091, -1490, 2654, 2816, -159, 1632, 4625, 11230, 13039, 13042, 4264, 20874, 25013, 6344, 1125, 11278, 9688, 10416, 6630, -7528, 3354, 20273, 22945, 28648, 31061, 23345, 18133, 23395, 36966, 24230, 24396, 36315, 56584, 71519, 61834, 50568, 63080, 56268, 50073, 32567, 29694, 46487, 82385, 124954, 177105, 250125, 365955, 529029, 780341, 1132593, 1532325, 1941423, 2474108, 3135723, 3520838, 3181810, 2328063, 1489270, 938512, 644226, 465321, 344589, 267944, 210258, 177384, 143147]
9755A43147l1316k3091L315R020J2796M651j5562j8418j1681j913J1182K059r195
9742G4994n863j434q840j1808l942P052N29M869r739k1796p349P143J3629J5547
9728E2992J2630j061m136k844k3625r370K3586n818j15J0018N117j4288k1403
9715B1683p716j420N740K444p177M301K6302J0920q882j0185j7131m714K634P188
9701B3987P878q342j4598N818J3387J0390J1382K226j3988k1245n453j0656P483
9688H269J3474Q17j3027R75n4l002m580R541K098l984k870R64R189R315l190R066
9672C3001L576J0253J2055k352j3265j3968k826l590p926J2540J1225m351o700
9659B7672K1186N857l986l643J3838Q326P36N364O960K5049L9400O0422P3368
$$ y = [143147, 111831, 88740, 92055, 101075, 113871, 118522, 102960, 84542, 72861, 70948, 82130, 84189, 74994, 69131, 67697, 58857, 47049, 43107, 50159, 50688, 55557, 45818, 24022, 16673, 23816, 37445, 52992, 65622, 64561, 60425, 57581, 33956, 24586, 48172, 42354, 42239, 52257, 57374, 43086, 21683, 13967, 12547, 18287, 20731, 13554, 17855, 44157, 55077, 46195, 36010, 18879, 14165, 16799, 23987, 31865, 23523, 8925, 14743, 28130, 38520, 49902, 52128, 38140, 16895, 11442, 786, 8269, 21743, 22560, 9533, 10508, 10454, 7452, 2872, 12413, 14511, 10527, 7657, 8621, 17810, 27125, 23935, 33001, 36577, 46830, 58885, 56533, 43268, 29300, 26474, 22884, 14958, 27498, 38723, 34372, 27672, 48858, 54715, 50729, 47086, 60924, 69250, 69986, 75350, 82310, 107359, 146759, 207181, 280549]
9646B80549P1196P5055J18649J02457q2937j73629j42225q4991l4028k0588j1798
9635I7710j6395N019L813j5629j4585j5633j643J0435o539j9745n340J7276J4686
9622E3430j0136j0798j4598M358J0595J2150J1139j4587k4469j445L346P72p005
9609A2752n116J0794M536P55l408M56r73K795K466k80p929M70p998r508J81P4
9593F7J2034l214j8251j1877N726J2303k805P42J9564J4011M554l046q177j2606
9579I025R35l922j0185O268M379J2644o12m889m257k198q714L16L975Q972P119
9564A8856m684p407p789R636J1594Q042r093o927j864R80p3Q506M792j4497j0498
9549d26n356o000Q294N738O180J125N723o97m054M63l117J750o80J280J2087q889
$$ y = [280549, 351745, 426800, 545449, 647906, 564969, 391340, 249115, 164124, 130096, 109508, 97710, 81315, 86334, 90147, 74518, 59933, 44300, 42657, 53092, 46553, 26808, 21468, 38744, 53430, 43294, 32496, 17898, 22256, 32851, 45001, 56140, 41553, 17084, 15639, 18985, 19757, 12752, 7636, 18430, 22966, 23721, 20313, 20769, 19796, 22591, 25057, 24777, 16848, 17318, 9320, -188, -7, 67, 12101, 8887, -9364, -21241, -15515, -3212, -6017, -5275, 14289, 28300, 32854, 29808, 21631, 9025, 9960, 6038, -4147, 2121, 6500, 19144, 18532, 13643, 9386, 7188, -1526, -1210, 2765, 11737, 18856, 14172, 6765, -1024, 8612, 20206, 28248, 19155, 12228, 10364, 11344, 11271, 19777, 24569, 10072, -426, -5782, -11782, -3488, 2250, 8430, 9555, 15278, 14581, 10527, 10990, 7873, 9623, 8943, 10223, 22310, 13421]
9533A3421L968J8270j0081r306r687J8576q866p759J7004J5028j6628j2297n008
9520F635J6203O423P56K430j0336j8304J949P859l385M580m803J2284P420p630
9506B2081l294j3555R108N75j7695j787R079K454N017M132M538j2576M662n969
9492F770q221P879L206P565L994p139N700J510j0913N631L521P498j4626R318
9478B1693O379n992L391q316p445J0076J0313o048J2079k121l225o958m899N349
9464B4276j709q99o00N537n15q972K084K534j4300j2934L064O726J3348J1947
9450B9587j3291j6849O281N56J16j0273J357J2049N853K776q641r229J152M109
9436E553J0367J265N614J335J033j0030K212M545K732J314j3775J244R014M632
$$ y = [13421, 17389, 35659, 25578, 16272, 6585, 25161, 16295, 8536, 25540, 40568, 23940, 11643, 6635, 22838, 29261, 30017, 32447, 22111, 3807, 5756, 13615, 10230, 14810, 10007, 22291, 29711, 22081, 18787, 5232, 14340, 14915, -2780, -4567, 4512, 6966, 11983, 16115, 20653, 8077, 12739, 6770, -1451, 6428, 9634, 17199, 21193, 14054, 19754, 21264, 10351, 15982, 19503, 27001, 12375, 21693, 28072, 22080, 25471, 17155, 9710, 19786, 30099, 24051, 36130, 34009, 30784, 23826, 18927, 24276, 22567, 21668, 21068, 26605, 26090, 17118, 19202, 21736, 7436, -5498, -2434, 4292, 17640, 29587, 16296, -553, 5728, 6284, 6400, -3873, -2516, 9533, 15386, 18162, 9521, 292, 1444, 5553, 15920, 17185, 22799, 24134, 25167, 15137, 17349, 21894, 24626, 25940, 12165, 13409, 22423, 27055]
9422B7055n951l885j3474J0571N052n822l679J0367Q583p66j1825l400j4843K421
9408D04K437J2720N496q228J032R754J428n415k771P208j057j6770M083N648j9303
9393c334k803J4343l689J2055L97Q242N349j5687k910J4149L794k3463m79n591
9379C73M482J4526O00K568K0218j387N378j1487r049r329k623m840j425n276J1081
9364A3810q046m980J326K75J1263J6383J2960j4832j0275J9063J5341J742l671
9351E0359j0481j1565j0286j381P54M734n643K403k939k467j2996K087J598o251
9337b074P699J0339l356J0174N241j3773q306j245J1665Q307N88j282K456j4846
9323A1587o771L813J806J8575J265k0995o052Q131R288r960k532J659J551l815
$$ y = [27055, 21104, 17219, 3745, 14316, 19368, 13546, 9867, 20234, 28817, 28051, 16226, 12826, -2017, 404, 2841, 15561, 21057, 12829, 13861, 23615, 25043, 19628, 16857, 24065, 23008, 6238, 10321, 15969, -3334, -6137, 8206, 4517, 16572, 16969, 25211, 30560, 14873, 11963, 26112, 29906, 6443, 5964, 373, 4855, 19381, 19981, 22549, 42767, 41380, 46758, 35271, 26222, 16893, 14270, 9430, 8005, 2729, 13810, 5764, 784, 2110, 2385, 13648, 30031, 42991, 28159, 17884, 36947, 52288, 54030, 50359, 39878, 28313, 18027, 16646, 17400, 22134, 16491, 18894, 15955, 13488, 492, 2579, 4177, -2074, 5625, 15964, 12608, 22782, 28023, 14250, 5944, 4699, 16364, 24671, 25259, 23977, 26433, 11587, 4816, 8629, 10435, 29010, 30275, 9280, 3228, 11359, 20647, 10687, 8155, 9814, 11365, 7550]
9309G550Q234J7j1639L316k577Q605M233j417p367m7K956O311q23k136L293j50
9293A8359o081k962O490Q53L970n112l131n797O118n770j219J5779R114k155j250
9278B7206j6422K291J0824N024j0966k3124j1883M732R003J2881J3905k185M33
9265B1719L47N626j0204j9367O925J3879p491r941n801J2290mn408J7399Q92j460
9250A9401J299O281n109j2888O389K370j2402m628J6049J1920j2250K989M675
9237B4096m84N895K793l296q358n098j8206l078M944Q332r936j1379l874L437
9223a4212R14M776J2633R254m139J2791L996j8310j0462j343J8055J1402j0576
9210A4779m123K204l319M37M766O805O807K210K833r413m147J2545J1655O008
$$ y = [7550, 15784, 15801, 4162, 7478, 4901, 13506, 17739, 16322, 8955, 8908, 11864, 18175, 17352, 15216, 18509, 18359, 12278, 9316, 15806, 16659, 20629, 15517, 12386, 6589, 12707, 6937, 5718, 21497, 30611, 28456, 27206, 10784, 13075, 23899, 28923, 17957, -5167, -17050, -12318, -3315, 9566, 23471, 21286, 21719, 22066, 27692, 17488, -1879, 5046, 18925, 11434, 1493, -4308, 7982, 7978, 2570, 19969, 20861, 19401, 20700, 26981, 21872, 8984, 15373, 17743, 5341, 713, 16762, 28682, 16432, 19421, 24096, 23612, 29507, 32300, 29004, 20646, 15548, -2658, -5736, -792, 7540, -2396, -13775, -17649, -14212, -13298, -8522, 4111, 13365, 9226, 22017, 26013, 7703, -2759, -4102, 13953, 25355, 14779, 10656, 12860, 9541, 9978, 14744, 21549, 28356, 30566, 33399, 23986, 19839, 32384, 44039, 50047]
9196E0047j835k0084j1016O041j5190j0889k933l592J748J701R86O652K5933P039
9182C4608N91n77k2336j4135L686N825K341l432p81q667J891n239q628J4125J3987
9167A3259J2438j782r884k8701j3394J2089J972O94J1224N061M538q199n536J70
9153f051p76K707M173m896N393J1522J830j0238N830N896m075j076q719P69n161
9138b872P097J4077j076q622N605J0204p554j5367R48J5313K707o968j7608J543
9124b573J5322Q621K027K271q056m542r238L078m753m127J0039O416J2115k598
9110B4002j6507l339q075P724J2750O532M215L486j1247j6307m775N174L861J1690
9096A9184L447L796O224q896N129l77k2760n659J397l877q378M091Q870L032j078
$$ y = [50047, 48212, 28128, 17112, 23153, 7963, -2926, -5859, -9451, -7703, -6002, -5016, 1636, 27569, 34608, 35199, 34622, 12286, -1849, 1837, 7662, 10003, 6571, 5790, -2877, -986, -6225, -14853, -728, 13259, 25697, 23915, 14031, -14670, -28064, -15975, -14003, -13309, -2085, 2976, 7514, -685, -6221, -6051, -6827, -4120, 53, -4843, 550, 12072, 13902, 3664, 9494, 15390, 11315, 10239, 1520, 2289, -2872, 4225, 18302, 17226, 8604, 14209, 24413, 16859, 1492, 2440, 17753, 20460, 13492, -4116, -2573, 12749, 21370, 23397, 25668, 17612, 13070, 3832, 6910, 2157, -1970, 8069, 14485, 26600, 24002, 7495, 4156, -3919, 3805, 16555, 23087, 27302, 30788, 19541, 3234, -1541, 3633, 7494, 19184, 22631, 26427, 32651, 23755, 28884, 28507, 5747, 88, 1485, -2392, -10770, -6679, 2191, 5223, 4145]
9081D145q1M992J3702O154j505L0j2706o293j6J629l848j2952j7706n438N019
9066b4874Q781O416j944J3467J0598q664j5896J0646J236r349R608j997O488J3833
9052A8349r774o056M151M485J0764j1746q642m733p188k300N418P992M618k448
9038B890l124n090q603K579O058J2741q320n170Q065J480o288J3846Q477J601
9024B1142K980Q97l034J398k085R324K954j4454q986q338Q190P257k37R318o517
9009A9809l0998l819k642o448Q351p794k790L904K2298J2425P920j861l009j2957
8995B389J748R143R456P946j2846p543O184q917n648m249l42m77O416L203K769
8980I232M146o57j0758k0130O715k158m942j359J2513R148Q196R884p077Q352
$$ y = [4145, 4064, 9056, 22758, 28912, 27407, 27437, 14731, 8438, 8422, 10051, 6203, -6749, -24455, -29893, -24874, -16093, -9677, -11621, 1846, 12444, 3780, -12116, -1470, -234, -9583, 25, -1972, 4516, 18349, 8575, 2519, 6670, 11155, 21919, 10173, 1531, -3202, -10390, -12690, -7272, 720, 5338, 2890, -234, -5324, -13927, -11348, -5290, 7451, -869, -6039, 2026, 3506, -2782, 11064, 19541, 21142, 24122, 25019, 21985, 23383, 21298, 30622, 33576, 19122, 10136, 1798, 9988, 17245, 17008, 26326, 19809, -11189, -15008, -17650, -24098, -15747, -23541, -26331, -22427, -129, 12296, 20216, 18355, 15346, 2389, 4137, 13280, 22736, 30682, 17836, 10293, 16477, 7560, 1912, -2337, -2679, -3156, 3260, 6463, 9232, 13378, 12721, 1963, -18167, -11452, -13610, -18552, -19911, -7398, 1750, 9946, 19830, 12753, 21105]
8966B1105l51j4111J143l767k677Q198q086n231J44j4041M499J6717l150j9733
8952a9341J0644J1869p057J52M211M441q282j1517O172R107P229l200k211J4013
8938A6230N019j0643l555L638l095J1542M37p023j2531M320O767J2379j153k401
8924A9931M864o79K091r144L65R903M118l549k653q727J487M710J07N990j747
8909B7067k170Q922j184r973n684k3812q60K9326k620j7910n195J0554M386j0624
8895B23J1160L620J2535q842j3073M712P851k360j5159M353M856j1653m320l495
8881i592P194j4551j0854K1526J6383J847J2034j1206l80N450j1504j1050j544
8868f247O290j1077m215n616R927J5177Q800j08k0080p315J5155l305j4230M183
$$ y = [21105, 20754, 6643, 7786, 4019, 1342, 9540, 1454, -3777, -3633, -17674, -13175, 3542, 392, -19341, -8697, 3172, -3885, -3733, 478, 4919, -3363, -14880, -8708, 399, 7628, 4428, 2217, 16230, 21249, 10606, 7051, 10689, 7594, 19136, 19573, 12550, 19, 4339, 11106, 23485, 22332, 19931, 24795, 24116, 26207, 17063, 17428, 27331, 31449, 27900, 25247, 16520, 18007, 22717, 22824, 28814, 27067, 24897, 33819, 32635, 22662, 16978, -6834, -7694, 21632, 19012, 1102, -4093, 6461, 10847, 223, 11383, 15003, 27538, 18696, 5623, 10335, 18186, 15826, 667, 5020, 9876, -1777, -6097, -9592, -2398, -16949, -27803, -6277, 10106, 11953, 23987, 12781, 12401, 17851, 6347, -4703, -6247, 43, -11034, -15249, -20865, -10938, 4239, 13039, 12931, -7149, -14464, 691, -2614, -16844, -12661]
8854a2661M19k378j1456k0003J0134J2571M121J3947J4971n469j737Q668m272
8841F855L981l262J1209q260k674n835m781K935J6249K361j6192j7083R509K089
8827b899n534j661P650O58q155P373J5213J333j2592k07R641n366N212J235L365
8812A5266q168o027j8520p699O788J2319j125j848J8437n705m950n955j056o727
8798a4970P549J1675O208O549j1333o323n301m481J2875q18L20r517l2244o23
8784d0434J5596J0792r80r68J00q923R625Q179n166p6J2597R341o344j271n133
8769c065R580l747J4572r602j7048J598k490n331N761M450K137R00J664K171J098
8754B648n750j4882J0482J3213K884J499O482k2173J371k01M168R014r177L794
$$ y = [-12661, -12242, -14620, -26076, -46079, -35945, -23374, -19253, -5306, 9665, 4196, 2459, 11127, 6855, 10836, 7574, 18783, 10523, 7849, 2014, -2767, 168, 16417, 18778, 2586, -14497, -4988, -2899, -8433, -10094, -2444, -1786, -9941, -2568, 12645, 13978, 1386, 1179, 10820, 5454, 10666, 11901, 15266, 7098, 1071, -17449, -25148, -18360, -6041, -7166, -9014, 9423, 3718, -1232, -7187, -8243, -14970, -7421, 4254, 10462, 17011, 5678, -645, -5946, -10427, 2448, 1630, 1950, -7567, -39811, -40434, -24838, -14046, -15026, -15994, -15894, -24817, -15192, -7013, -12179, -12255, 342, 9683, 3339, 2068, -3065, 6515, 2768, 17340, 7738, -9310, -7712, -10202, -15533, -9772, -5322, -3185, -2285, -621, 1550, 2648, -3102, -17984, -7502, 5711, 8595, 10094, 16576, -5597, -4226, -4427, -259, 8755, -422, 3372]
8740C372J0228J3041l450k608j2083r546K037J3553k24k149j0136O455R506L683
8726B1679m311l763k958l962l50Q325N721K169n434p048O53P502P250j775L837
8711B7535m304j9266p54l675N070q170l505J296N694m574k813J286R345R575j6710
8696c970M675J3449L308O420n209k809P900O30l080j8024j0639J2431J5508N913
8682B6503K0032m532k7224j1836l577k616j715L066O093N558k158j0623j5204
8669a8233k807M589J76K683J7213R235l803k083L495j1458J1622L290J177l252
8655A1844J434O160J43q401o731m937k274j2176j0110P289m2J4343J995J645n437
8640e255N236L744M180o786J906k141n852j2787k326P011M540m462q193m651K4679
$$ y = [3372, 13600, 26641, 23191, 20583, 8500, -1046, 991, 14544, 14320, 12171, 2035, 8490, 17996, 21679, 17368, 13605, 10647, 6685, 6335, 14660, 20381, 22550, 17116, 10068, 10721, 18223, 25473, 23698, 27535, 23231, 3965, 3211, -464, 4606, -3564, -7069, -5773, -79, -4653, -7466, -6180, 3165, 12740, -3970, 705, 14154, 17462, 23882, 18673, 15864, 23764, 24394, 21314, 3290, -7349, 5082, 20590, 26503, 46535, 42003, 14779, 2943, -634, -3250, -4965, -1899, 4194, 9752, 7594, -3029, -18233, -21040, -16451, -16275, -13592, 3621, 12856, 9053, 6970, 10465, -993, 10629, 13919, 15096, 11844, 13278, 19438, 19581, 11180, 4449, -488, -2762, -14938, -25048, -17759, -17801, -3458, -1463, 182, -5255, -19, 3725, 7905, 1119, 3025, 884, -4968, -17755, -20081, -13070, -8530, -12992, -21185, -25836, -1157]
8625a157L821N22n274J0633j656j3033N13q913K066M162Q50J0930J1418J422R27
8610A7231m131r915K550j8504o790R648J7909N292j248p104P43J2636k260j1692
8596D365O23n380J7930N61L596Q378P546j8452k265j1832j3141Q149Q18r592P924
8581g72l036P125K0395K419p006J0707J051j6122j6722J0114J6018O87M904q118
8567B1644L201P472J0903n397j017J4795j8461j2068J3001J4343q892J618j483
8554C9659q421R804j4008r54Q144j0171j2560k830p903J2672K3787j7810k205
8541A7204L053k082J6221M088j5386q826j092J5589R713K455j0546p819J6123
8528C8695K1132M5248P1647Q4146J02741J03946J10318J81600J90039o0757k57051
$$ y = [-1157, 2664, 3186, -2088, 8545, 6889, -6144, -5631, -14544, -12478, -8316, -7466, 3464, 14882, 16304, 17231, 13100, 3185, 5735, -12769, -19559, -9911, 7998, 13290, 12042, 4938, 5681, 18317, 16057, 4365, 4988, -392, 17538, 18099, 21695, 30073, 37619, 19167, 16902, 5070, -8071, 78, 896, -8696, -772, -3808, 3317, 23712, 26131, 19125, 29832, 30883, 14761, -1961, 8153, 24171, 24858, 29762, 21644, 24845, 32317, 43220, 37823, 36806, 51601, 33140, 21072, 34073, 48416, 39524, 41142, 39659, 31238, 41042, 27034, 26080, 34224, 24053, 11493, 8663, 760, 13432, 37219, 19409, 17204, 20257, 18175, 34396, 38484, 23098, 14272, 13180, 28769, 38482, 40937, 30391, 22572, 38695, 59827, 105075, 176722, 260868, 363609, 467555, 577873, 759473, 949512, 888755, 631704]
8517F31704k22029j38669q0569m4121l7579j7322l4457k3751j884k343j079J4378
8505D2279j33j8171K372J1578L388L6j3369o488j599M114K842j8450k4429L790
8491a2240R766J1958J3915M057n274J328K8585K8038M6797O7533J00630J73018
8479D68111K02093J95754K14501L54558M29171p5299m92991m55906k82567j68959
8469C88466j07925o2311m2664l8346j5018q34j5373k8532J342r108O467K383j4818
8456F3729r173l803K328m618j914K362m77j1084k2565j043K2720J0810m882K832
8442D5222O363O626K1826K2287K3760K5737O1532O7301Q4551J10638J10443J55084
8430G41370J93190j3428k12826k21558j62238r8240n9227l5510j0447p958p443
$$ y = [631704, 409675, 271006, 190437, 146316, 108737, 91415, 56958, 33207, 31323, 28980, 27901, 42279, 42146, 23975, 26347, 37925, 41313, 41349, 27980, 21492, 19893, 24007, 26849, 8399, -16030, -12240, -2474, 9484, 23399, 27456, 22182, 23510, 52095, 80133, 126930, 194463, 295093, 468111, 670204, 865958, 1080459, 1435017, 1864188, 1788889, 1295898, 839992, 557425, 388466, 280541, 218230, 175566, 137220, 122202, 121368, 105995, 77463, 78805, 69697, 76164, 78547, 63729, 54556, 50753, 53081, 48463, 46549, 48911, 48434, 37350, 14785, 13742, 36462, 47272, 42390, 45222, 51585, 58211, 80037, 102324, 126084, 151821, 213353, 280654, 365205, 475843, 586286, 741370, 934560, 921132, 708306, 486748, 324510, 226270, 167043, 131533, 121086, 113128, 105685]
8419A05685l1765j9412N751J703j327j823J6065m68j538j174j0438o881j542n741
8405D7095q329r303L669j0409j1388K3P479n230l992j606P372q280r448K369J0201
8390A0223J287M459m141o367O74o03Q234k544k1551J5526p918p360M959J8998
8376A3876K239p035o101m252M768J3696J4111M745j0379Q910J673j2838P57J1172
8362C5342R101j8366j8991n545J4663j230l843M618n346K432k71q116p37J0754
8348A4465J0888p721n239o761J2954k134J67n97J289j906Q330l486J0981N699
8334C6929J3881L0985O099j3303j7343k3242O551L409n79r073m213J87j8230j1252
8320H06m232j046P714Q490o376J2653R283p32q268q812O42Q079O944m361n996
$$ y = [105685, 73920, 54508, 60259, 61962, 60635, 58812, 74877, 74409, 72871, 71697, 61259, 54378, 52836, 47095, 38766, 29463, 33132, 22723, 11335, 11358, 18837, 13607, 9615, 8009, 15381, 7101, -2347, 22, 10223, 11510, 15969, 11828, 5461, 6135, 5532, 13766, 11222, -10329, 5197, -2721, -10081, -5122, 13876, 16115, 9080, 2979, -1273, 3495, 17191, 31302, 36047, 25668, 34578, 36251, 23413, 24170, 35342, 44443, 26077, 7086, 1541, 16204, 14974, 11131, 15749, 10403, 12835, 12564, 4448, 3711, 14465, 25353, 17632, 12393, 5632, 18586, 16452, 16619, 16022, 17311, 15405, 23735, 20249, 31230, 36929, 50810, 81795, 87894, 74591, 57248, 34006, 40557, 43966, 43387, 34314, 30101, 30288, 12058, 806, -3426, -4472, 3242, 11732, 5356, 18009, 27292, 26560, 18292, 9480, 10122, 18201, 25145, 20784, 14788]
8305A4788J4461J220l606m744O676n217r079J6380M420j3446L624N582O596K8089
8291F5744L6176K4747K4303K9612o515m9666m1377k4450k1081k417p250j855m139
8278B1832J5849P628o667r720N947r487m087m759q043j4094r30M410K515J318
8264A712J0023Q996k449j5367J0441M073k5763m301K630Q940N646J956L573l778
8250F332r594J6790K6177J7856R199P100K1344J8957j838k6214k2167k5161l299
8237C5482o117k42N244l845n071j4674L313m831j1055N579r104n514Q27J0692
8223F84J443j161J5038M937r022Q021J2360L139o745n347J582O360N051M133p925
8208C2548j4469j9607O15J3876N217m321j1629k917k083L553L59l487R46j1667
$$ y = [14788, 29249, 30469, 26863, 22119, 28795, 23578, 14499, 30879, 35299, 21853, 25477, 31059, 37655, 65744, 101920, 126667, 150970, 180582, 174067, 124401, 83024, 58574, 37493, 35076, 27826, 25971, 21832, 37681, 45309, 38642, 28922, 34869, 25382, 21295, 16536, 8493, -5601, -6531, -2121, 394, 1712, 11735, 20731, 18282, 2915, 13356, 17429, -8334, -12635, -10005, -1065, 4581, 6537, 10110, 6332, -3262, 13528, 39705, 57561, 66760, 73860, 95204, 114161, 112323, 86109, 63942, 38781, 35482, 29365, 29123, 34367, 30522, 25451, 10777, 14090, 9259, -1796, 3783, -5321, -10835, -10008, 684, 2127, 966, 16004, 20941, 11919, 19940, 32300, 35439, 28694, 23347, 24929, 31289, 36340, 40473, 32548, 18079, -1528, -913, 12963, 18180, 13859, 2230, -687, -2770, 783, 1142, -2345, -1399, -13066]
8194a3066P989K3060K407j321K311n720q93j390j2115K895J7651J439j5522p253
8180D72K5143M974n518k2532j5272J3335J1175j779k06J1798O037K293p919o415
8166A5586J955J3198J4431o362j7218j556J1857k0j0639o293j4673m991O346M268
8152E889J3046k30M060k94j0375j0268j3598q80P400J132o971Q497K168j1228
8138a1652k083P225j93P095N119J9600Q784n333O454l276k8981o666L775kl558
8123c692o608Q696k369O54N227q868J5534J588L967P271j4663l579j78L177K2734
8108B8891m719m157j2477j4515K348J1889J2145j2706l119N541j1147O354k110
8095B218m400j3925J5107N363j911j714l083O511J1137k400l730n68P17r168j888
$$ y = [-13066, -5077, 17983, 20390, 19069, 21380, 15660, 14767, 13377, 1262, 4157, 21808, 23247, 7725, 472, 25615, 30589, 25071, 2539, -12733, 602, 11777, 9998, 9792, 21590, 27627, 29920, 22001, 15586, 17541, 30739, 45170, 38808, 21590, 20034, 31891, 31871, 21232, 14939, 266, -4725, 1621, 5889, 18935, 18705, 22765, 22471, 12096, 1828, -11770, -12650, -5250, -4118, -11089, -2592, -424, -11652, -13735, -6510, -6703, 392, 5511, 25111, 33895, 28562, 35016, 31740, 2759, -3907, -132, -134, -3692, -10300, -1604, -3973, -3319, 1908, -6960, 8574, 10162, 14129, 21400, 6737, 3158, 2980, 6157, 28891, 24172, 20015, 7538, -6977, -4629, 7260, 19405, 6699, 3580, 9121, -2026, 4328, 2218, -2182, -16107, -1000, 4363, 2452, 738, -2345, 4166, 15303, 12903, 9173, 8605, 9322, 154, -1734]
8080a734N225J0541k752O588p95m529p850j1195P660J4549J0971m769Q72q574
8066A4208r099J6627O631o204n869n095L595q49n433J8681r736j7399k0911l423
8052b4276J6154J4977J4574p76r320o852n655N702N650l196j6473J665R817q963
8038f972R851J5694P052m512o900j443n67k809J573j2111L836J4152R798r9p017
8023A9526n439j3429j4200J0608J6920J0175k804k348J2889m916p311K290R461
8010C1422N315o795N036J295K015k2847k3254Q87j664O129J0418K476k420J5307
7996B3320m733m830J0332k494o500J887l715L139j4479o532M44L289L135l862
7982a599J467q068K189J4140J1882r940m050k350K079l742J6366K129j4098p250
$$ y = [-1734, 3491, 14032, 11280, 17868, 17073, 12544, 4694, -6501, 1159, 15708, 26679, 21910, 22782, 14208, 5109, 21736, 28367, 22163, 16294, 11199, 14794, 13945, 8512, 27193, 17457, 58, -20853, -24276, -8122, 6855, 21429, 20653, 11333, 4481, -1174, 4528, 10178, 6982, -9491, -7826, 1991, -6972, 2879, 18573, 25625, 21113, 14213, 12770, 12203, 9394, 10967, -1144, 2692, 16844, 26642, 26543, 19526, 14087, 658, -13542, -2934, 13986, 24161, 21357, 19009, 31898, 26982, 19671, 21961, 31422, 36737, 29942, 34978, 36273, 38288, 15441, -7813, -6926, -8590, -2461, 7957, 10433, 8013, 23320, 18587, 13757, 24089, 21595, 15095, 16982, 13267, 16406, 1927, -4605, -4161, -872, 2263, -1599, -132, -8200, -6011, 8129, 20011, 10071, 6021, 3671, 5750, 2008, 18374, 20503, 6405, -845]
7968h45N36p004j841R653Q579l146M263N911o758j8978n946J5272Q741o078K978
7953E337K012Q340J0836J260k618J379j544l515j696R050P152J796j4224k2418
7939A147n438Q072P884n33R06Q213O841r599j0015p421J1697M426P029j1050r22
7924A1237L2283R892m382l867L98k400j5901q54j7629n361j268J5563O874J506
7910B6091Q970m558Q965j502j5179p390q048j4040k644J2177N119N433M032J637
7896A9063K793j439l613l02P528j3641k2643L161Q628O412l68j1202p233O089
7882f767M474k565r481l082N801k653K319J17P536J6604N508j8910q550N595m285
7867h339k5350J593O803J2100J3323J986J354K011K28P208Q11l305n620O496m174
$$ y = [-845, -309, -7313, -9154, 499, 9078, 5932, 10195, 16106, 9348, -9630, -15576, -304, 8437, 2359, 5337, 7349, 15689, 26525, 27785, 25167, 26546, 25002, 21487, 19791, 28841, 35993, 37789, 23565, 1147, -4291, 3781, 11665, 11132, 12038, 20251, 27092, 17493, 7478, 57, 11754, 16180, 23209, 12159, 11237, 43520, 53412, 49030, 45163, 45561, 43161, 27260, 26406, 8777, 3416, 2148, 17711, 24585, 26091, 35061, 30503, 39468, 37966, 22787, 15397, 7349, -6691, -9335, 2842, 7961, 13394, 17426, 19063, 21856, 20417, 16804, 16502, 24030, 10389, -12254, -9093, -465, 5947, 5579, -5623, -12856, -6767, -2293, -4858, -14339, -17421, -11620, -14273, -11954, -11837, -4301, 12303, 17811, -1099, -9649, -4054, -8339, -33689, -32096, -25293, -13193, 130, 2116, 3470, 5481, 5709, 12917, 13728, 10423, 4803, 11299, 7125]
7852G125l444J959m16P929K329k306j2471P908J6018m776p551R831P922j6453
7838A3604r593J8678R786o052q222n034j0026k024j045M510L894R718J5175q297
7824B5072k2641p292N605L998n848o587j6103kR175J3010k0242j5064K0061P567
7810i291q051R044O022M122J606m567o064o458J1110J0293p577Q208n849Q86K383
7795E817p441k478K799Q013j358m490O336n697K454r95j2193K97J3874J320p008
7780g50N898J1314j8464j078j8023O779Q22L472J7809K1362q990j0718j5867k0655
7766b7089j420J4385N659j0268J5627J5521R263j3485j8812o960o721J5386J5075
7753F161K817Q682P094l360q534q019M139J1005o598r16J0075N618L264K885m120
$$ y = [7125, 3681, 5640, 5224, 13153, 15482, 13176, 705, 8613, 24631, 19855, 12304, 22135, 30057, 13604, 4011, 22689, 32475, 26423, 18201, 13167, 3141, 1117, 72, 4582, 8476, 18194, 33369, 25072, 2431, -4861, 744, 4742, -1106, -7693, -23796, -23798, -14623, -1613, -21855, -36919, -16858, -9291, -17342, -8298, -2276, 1846, 3452, -1115, -7179, -13637, -2527, 7766, 189, 8397, 2548, 3434, 5817, -1624, -4102, -1303, 6710, 5352, 862, 7198, 1501, 3955, 2960, -9233, -8936, 4938, 6258, -750, 5148, 16462, -2002, -3080, -21103, -14324, -13502, -10030, 7779, 29141, 20151, 9433, -6434, -27089, -28509, -14124, -8465, -18733, -3106, 12415, 21678, 8193, -10619, -17579, -24300, -8914, 6161, 8978, 17660, 24754, 21394, 12860, 4841, 8980, 19985, 13387, 12471, 22546, 28164, 31428, 34313, 30193]
7738C0193k1741q541j3162o057K5276o320n330J2154J119K151j6400m473O210
7725d921Q920n323L04j011J072J720m306r418m122m062p56J7605J734k548j635
7710f747J0955k383l585L258n400m191N150k502L518Q010p670o452R91M06R249
7695B607J6472Q88n344l23Q964O601n699r950j0565j300J6448M026p027o6j6213
7680d81j4672o102Q083J3323K927m555o305r960q251l584k357J8856J8347O788
7666A2057q676n613l915q621J7352L839k206j760p609n603J0928k1341j5597L397
7652c3368m39J2987J11l479q546J1744L2771K641J618N45R335J1428j2250j0477
7638A4621k5113p634m5N600l405k975O117K7290n856j6914N563M50o237K457j0955
$$ y = [30193, 8452, -89, -13251, -19308, 5968, -352, -5682, 6472, 7591, 9742, -6658, -11131, -4921, 3999, -1324, -1020, -2031, -959, 761, -3545, -12963, -17085, -21147, -21903, -4298, -2564, -5112, -6747, 4208, 1825, -1760, 1498, -3902, -8093, -2943, -5445, -1927, 6083, -1587, -8039, -7048, -6642, 2607, 19079, 19967, 14623, 14300, 23264, 29865, 24166, 14216, 3651, 2351, 18799, 22825, 15798, 15732, -481, -15153, -21255, -13172, 151, 3078, -1477, -7782, -17742, -25993, -29577, -31934, -13078, 5269, 12057, 3381, -2232, -6147, -14768, 2584, 6423, 4217, 2457, -5152, -10755, 173, -21168, -36765, -33368, -33807, -20820, -20709, -24188, -32734, -20990, 11781, 14422, 16040, 16585, 25920, 37348, 25098, 14621, -10492, -18126, -18171, -12571, -15976, -18951, -12834, 14456, 8600, -8314, -2751, -2301, -8538, -6081, -17036]
7623a7036N173L418j6677m065P980J6045J555J4649m394m329K1349j4352j1736
7610b420Q860J0355J726n610r505j3518k546o477k833q61K2029n492r079O67J50
7595a4554j866j130J6816M133L66n501m233O042j0787r341P318O97m037j997K84
7580a7790J7660Q092p422k802N672L023o902n933J2745J8679N07j1910j7343j6080
7566a9804l685J842J8013Q798j7658J84p913l12J4608J6182n706J221m592q990
7552g812J5775N386o955m758Q176J3657K901J0191j2714j1999p533j0583l06M203
7538b371P358P499n426N531j560M139j483j1502j430m145Q957M918j5661j0411
7524a5587O423K473p214K711p70Q579K639N2K318J1219J1892r174j4979j3086
$$ y = [-17036, -11863, -8445, -25122, -29187, -21207, -5162, -3607, 11042, 6648, 2319, 23668, 9316, -2420, 6440, 16795, 18521, 12911, 3406, -10112, -12658, -19135, -21968, -22829, -800, -6292, -15371, -14704, -14554, -16420, -17550, -734, 3399, 3765, -1736, -5969, 73, -10714, -20055, -12737, -12040, -16077, -18074, -17790, -130, 7962, 540, -2262, 3410, 6433, -469, -6402, 6343, 25022, 25529, 13619, -3724, -19804, -23489, -21647, -3634, 5164, -12494, -12310, -20223, -20535, -5927, 10255, 4549, 5770, 1178, -7812, 7963, 13349, 6394, 1636, 9812, 23469, 26370, 36561, 23847, 11848, 4315, -6268, -6574, -2371, 4987, 12486, 7060, 12591, 11031, 15170, 13687, 2185, 755, -3390, 5567, 10485, -5176, -15587, -9164, -6691, -13905, -11194, -11964, -3385, -746, -694, 1624, 12843, 24735, 15561, 582, -12504]
7510a2504K055J6603M945j7607M750R185L297k428q824p840P813K917j1078k986
7496a1702P300P380K659r16p760j6438J5688J5818n415r441R574R369j365j8364
7482c613J302O861Q743J4426K312r439L708J004r186n331j5721j4536P980O582
7468d908J1040J2252j8191r709Q838L250m164n488r08J1101r670j2370k113P584
7454a3456M470Q765q143n196o564p906o789p51j1478L589K2133K0974k112O644
7440D180K26O475J985l402j5378K961O504o597l970p640P444R739O043K900N845
7425A7315n870j3337k378l05m185O330L847J0864m567o910o352Q366K177j4967
7411i972J2521L975Q458k172r182n127o137P228r510k1763J9262Q681m041J5540
$$ y = [-12504, -10449, 6154, 11099, -6508, -1758, 7427, 10724, 8296, -528, -8368, -555, 2362, -8716, -11702, -4402, 2978, 5637, 4721, -3039, -19477, -3789, 12029, 6614, -2827, 6747, 16116, 14751, -3613, -2311, 4550, 13293, 27719, 30031, 20592, 24300, 25304, 16118, 10787, -4934, -19470, -11490, -4908, 6132, 18384, 193, -9516, -678, 2572, -1592, -7080, -7988, 3113, -6557, -18927, -21040, -13456, -8986, -221, -8364, -13560, -20124, -28030, -34819, -35570, -47048, -43459, -21326, -352, -2464, 4180, 4406, 10881, 12866, 9464, -5914, -2953, 3551, -3046, -7016, -14656, -7212, 2527, 8570, 11470, 17315, 11445, -1892, -4270, -4575, -8760, -2430, 1417, 12281, 7714, 804, -5548, 2818, 4995, -9972, 2549, 6524, 14982, 12810, 3628, -1499, -7636, -408, -9918, -31681, -12419, -3738, -7779, 7761]
7397G761N441l985l039n48l073q582K055R463j6252n724K466J0656L67L813M226
7382E045L391m854J089p665K80J4626P066q440n481p239q730r953Q47R326o624
7367a7316J1357Q580p70n227O608J4398m435o206O96o564r698N830M814K130O58
7352D855n373j0866J596o726q011J5148O974O30Q377k828n335p855r698L134J6552
7337E74P418R995N252q503j1892J1925o884o305Q198j4200j4800n508P759R007
7323g964K977j0498J249M632K801p863n86M936J9292O927m771o733R785m263k8476
7308a8555K398J5153M59j9203J087m418K866J5205P175N714P712o233J0271n569
7294A4062r185m05K343j2666j4892Q08O674q776L341N816J4693j03j547Q316n510
$$ y = [7761, 13202, 9217, 6178, 5630, 2557, -6025, -3970, 5493, -10759, -16483, -14017, -3361, -2994, 819, 5045, 8436, 3582, 4671, -2994, -2714, 11912, 18978, 10538, 5057, -2182, -10912, -20865, -20018, -10692, -17316, -5959, 2621, 1851, -3376, 3232, 17630, 13195, 6989, 7685, 1121, -8577, -2747, 2067, 4197, 4855, -518, -11384, -9788, -16514, -24525, -9377, -2403, -1773, 6604, 3776, -1559, -9414, -19112, -15978, 574, 7992, 17987, 23239, 14736, 2844, 14769, 7885, 1580, 9778, -4422, -19222, -24730, -16971, -7964, -4987, -15485, -14236, -9604, -6803, -14666, -15252, -10316, 8976, 15903, 11132, 4399, 14184, 9921, -18555, -16157, -1004, -545, -19748, -18661, -23079, -20213, -5008, 2167, 7881, 15593, 9360, 19631, 14062, 4877, 4472, 6815, -5851, -20743, -19935, -13261, -22037, -18696, -12880, 1813, 1710, 163, 8479, 2969]
7279B969L650Q323r270j6035n42q579L422N446j942K139J230N811M421P273N773
7264A4089N595k182j5052j3962J6465M779k3711p263r132K0830j555J216l493
7251a3376M543J1152O945J234n702j663n237k016O955J7798n021j1805j0749m455
7237a1397j2205R949Q094J3048l810j3974j0087m013j397J2669R716k822j1767
7224a7996k525L990N981O547j790j1705j2308Q222Q353l225K826J356P243O436
7210A405k037O683m130m339j144K493j756P241k919j3243N219K390L364J1463
7196A0690P352k856K186J812k742L444j859j7160q276j5198O979J2205J53L19
7182b951m87k773n43L683O307J3550J3876L55j4728J473K292q906r170m2l595
$$ y = [2969, 6619, 14942, 5672, -10363, -10905, -19484, -16062, -10616, -12558, -10419, -9189, -3378, 1043, 8316, 14089, 19684, 17502, 2450, -11512, 4953, 9732, -13979, -21242, -30374, -9544, -11099, -9883, -13376, -8833, 2319, 9264, 10498, 4796, 3133, -2104, -4120, 2835, 20633, 15612, 3807, -6942, -11397, -23602, -13653, -5559, 7489, 3679, -10295, -20382, -24395, -25792, -13123, -3407, -6229, -17996, -20521, -16531, -10550, -4003, -5793, -17498, -29806, -21584, -13231, -16456, -13630, -12274, -5031, 1405, -632, 6051, 1921, -2418, -3562, -1069, -2825, 4416, 1497, -11746, -6527, -4137, -773, 10690, 18042, 15186, 17372, 19184, 16442, 19886, 18027, 867, -7409, -22607, -15628, -3423, -3270, -2951, -3438, -6211, -6754, -3071, 3236, 16786, 30662, 31017, 16289, 17762, 20054, 11148, 1978, 1936, -1659]
7167a659L743R322o292o859p157r446r19K0078P138m36O385k336j7494M620k772
7152d084k96j1618r964K5299J3885Q075r018j0672k106j969j258P203K106k230
7138C353k84j2277N687O062p696N913m65n965R091M717K20j003o997k52n386p1
7122e353J6386O309J5898J2760j403j9902k9032m040M126M649n426J76N994L947
7108E089M842R032J2814O275j8403k6868l084j5749p164K3229J6712L31q776q367
7094a0087j0090k52J4188n63j4838n454N199P069j341M230P924M809N502k307
7080C989j1445k970n273q28n964J660M586n127j2879m115N977Q417R568l858j4086
7065c2348k693J1299J7081l52k826K66M234j0690j1321o907k35P150K1424K378
$$ y = [-1659, 2084, 11406, 5114, -1745, -8902, -18348, -19267, 811, 7949, 7513, 13898, 11562, -5932, -1312, -4084, -4380, -15998, -25962, -663, 13222, 21297, 12279, 1607, -499, -2468, -3726, 3477, 5583, 3353, 3069, -9208, -3521, 2541, -5155, 758, 293, -5672, 3419, 8136, 8356, 7353, 356, 104, -5282, -5353, 11033, 17342, 33240, 46000, 44597, 24695, -4337, -8377, -4251, 398, -5028, -4852, 1142, 5089, 9931, 18963, 31777, 38052, 19649, -7219, -10303, -26052, -33216, -9987, 6725, 7056, -1720, -10087, -20177, -20429, -6241, -6804, -21642, -27096, -21897, -14828, -16169, -11939, -4015, 794, 6296, 3989, -7456, -10426, -15699, -16527, -22491, -20831, -16245, -21372, -34251, -38366, -32389, -23972, -14404, -18262, -32348, -35041, -23742, -6661, -7013, -9839, -9573, -5339, -16029, -27350, -34257, -34492, -27342, -5918, -3540]
7051c540l760K437M989n089r233j873j2987J2971R381k378o458O157P849K823
7037A289m255q544M326N073R568j866k912j417l319M136l037j061J606q290k300
7022a1003J2240J43j361L166k56Q124P717k439J351p717j0485o282M955P361L360
7007H874j4307j3983j903J2219N617P54K301p279m109J4235l41j1224n58J0215
6993E11M287M11j2057l349L260J0402p097N430Lk444j4113o516P284j0905j0317
6978c5210J1813L097p13J2936J1624j5748j3271J1353J5875L15N173j1205j0134
6965a4095J6209N29R195K162r028k1968M574R799R891k049k940q123j0239M888
6951a1195J4456M983J00r114j6842J0758q282K193k766J2241J208j0691j7066
$$ y = [-3540, -7300, -4863, 126, -4963, -14196, -16069, -29056, -16085, -6704, -9082, -15540, -9383, -1534, 1289, -2966, -11510, -7184, -2111, 7457, 5591, 2679, 1262, -2057, 2079, -958, -2019, -413, -8703, -11003, 1237, 1380, 19, 3185, 2929, 11053, 18770, 16331, 17682, 9965, -520, -6802, -1847, 5514, 8874, -5433, -19416, -21319, -9100, -3483, -2729, -428, -7707, -11816, 2419, 2078, -9146, -9704, 511, 4798, 5209, -6848, -10197, -6937, 3465, -3632, 1798, 1801, -643, -14756, -21272, -13988, -24893, -35210, -23397, -20300, -21013, -8077, 3547, -12201, -25472, -14119, 1756, 2071, 7244, -3961, -14095, 2114, 2643, 11838, 14000, 4972, -16996, -12422, -2623, 7268, 5219, 2279, -5844, -16083, -11195, 3261, 8244, 8344, -770, -17612, -6854, -15136, -12943, -15709, -3468, -2260, -12951, -30017]
6938c0017J1893L6552J2451p342q527j8287m664J6151k855p298j1115j3192O578
6925a9672Q441J869P655L956L373l088K361n098k2125p250J8710k500R601L95
6911c372j0341j4278M319K4982O13Q146j1904l213L5J069M37q374r650n762P589
6896a9704J4389j198O083j1249k491q06K779J1831K832N772j6815j1510r84r938
6882c1009l217R768R572K0429j1642j4013j3531l903k780N616k01L114J8225L623
6868i949P161p750K64j206j0904k060J4926Q805R04j8744l574j444K208j2707
6854c4070k121k20Q490M001M078R889M073J5184j18j8554m87k968K735j5262k0519
6839d5869k382J9987L1522J3061j6060j6963j7J1260J008j0021p628J5233J2972
$$ y = [-30017, -18124, 18428, 30879, 23537, 15010, -3277, -7941, 8210, 5355, -1943, -13058, -26250, -19672, -11231, -9362, -1707, 2249, 5622, 2534, 4895, -203, -22328, -29578, -10868, -13368, -3767, -3372, -13713, -27991, -23672, 1310, 1923, 10069, -1835, -5048, -5013, -3944, -3507, -11881, -21531, -27293, -19704, -5315, -6513, -430, -11679, -14170, -14976, -12197, -366, 2466, 8238, -8577, -20087, -21071, -31009, -34226, -24458, -14886, 5543, -6099, -20112, -33643, -37546, -40326, -34710, -34911, -31797, -13572, -9949, -2788, -10538, -10274, -11480, -22384, -24444, -9518, -713, 191, -18553, -22127, -23571, -21363, -34070, -36191, -36411, -27921, -23920, -19842, -9953, -5880, 9304, 9186, -9368, -9855, -12823, -10088, -25350, -45869, -48251, -28264, 3258, 16319, 259, -16704, -16721, -5461, -4453, -14474, -22102, -6869, 6103]
6826F103J087K455r369l288J0558r899o475K1323M101j2986k5469o385J7735M765
6812e744J1364L069j66j813o649o991N603K606r990P50R125J149n701O270J4607
6797A7489M852N396m596o700j680J7649L560j2815r637j1828m832O812m488l297
6783d115l373J1126J1662J180k2965j9125j0950O254J1250N403K032K3k805j0351
6769b4754R663J4191Q64j1234R336M566p212m574J7373R206J0890m596R154k621
6755C0252j7333j2985L266K885j5892j0483J1691j152j0676J0096J5730j24r713
6742d438j2125K157m34n51Q518j571K895j695l310l513j469J4356J0320j0838
6728a698j0595J7367j058O305L848p000j9051j0695o106N910J3146J0929n189
$$ y = [6103, 7190, 9645, 276, -3012, 7546, -2353, -8828, 12495, 16596, 3610, -21859, -28244, -10509, -5744, 5620, 8689, 8523, 6710, 61, -6930, -1327, 1279, -8711, -7961, 1164, 2313, -3388, 2882, 17489, 22341, 27737, 23141, 16441, 14761, 32410, 35970, 23155, 13518, 1690, -3142, 3670, -818, -4115, -7488, 3638, 15300, 16480, -6485, -25610, -36560, -30306, -19056, -13653, -11621, -11598, -14403, -24754, -15091, -900, -36, -11270, -1934, 2632, -4580, -9154, 8219, 17425, 28315, 23719, 32873, 30252, 12919, -66, 3200, 6085, -9807, -20290, -8599, -9751, -20427, -10331, 5399, 5275, -4438, -16563, -14406, -14840, -15391, -6873, -8444, -5549, -7244, -10554, -14067, -15536, -1180, 9140, -1698, -12293, 5074, 4016, 10321, 14169, 7169, -11882, -22577, -28683, -22773, -9627, 1302, -3887]
6715c887j2586M446P02O869m14o021K214K067o537q928k482m741N075N000J3256
6700e967J7968j2889j2024n101o981j734r906l794J9387J4981k668m21K564J1635
6686E050M238k443q787N276J6758J2757M514m38J058q843j2778j1263j4791n793
6672a5485N757J8318O024n988k0224n968n806M59Q356p671J314P156J0834J3767
6658A0843j4106q578P749l906j279R768M582k54M496R239j7767j1434N619L364
6644a664r031n797N467j182j4610J1383J1768R512J1798k324k0198R682j0424
6631e620L313L780R227l023m500n844O05K355r837j4738j512n729R886K630L1808
6616A2801J1544j5674O869J3147P281m320j0775K4096K7973N437l9308k3620p405
$$ y = [-3887, -16473, -12027, -11325, -4456, -4870, -10891, -8677, -6610, -13147, -22075, -24557, -29298, -24223, -19223, -5967, 12001, -888, -12912, -18013, -24994, -26728, -36634, -40428, -21041, -6060, -8728, -9149, -6585, 5050, 9288, 6845, -1942, 3334, 20092, 32849, 37363, 36925, 37983, 29140, 16362, 5099, -9692, -15485, -9728, 8590, 14614, 8626, -11598, -17566, -23372, -22913, -14557, -22228, -20914, -13758, -2924, 10843, -3263, -11841, -4092, -7998, -9277, 491, 5073, 4819, 9315, 18554, 787, -10647, -5028, -1664, -10695, -16492, -11025, -12207, -26817, -15434, -3666, 5846, 17644, 15320, -4878, 4804, -5620, -2307, 1473, 10700, 7677, 3177, -2667, -2062, 293, -9544, -24282, -25794, -31523, -21637, -19007, 12801, 24345, 8671, 15540, 28687, 35968, 31648, 20873, 44969, 72942, 78379, 39071, 15451, 8046]
6603H046O450R805k241j6019j0846k015J124J5693j5194J952J0675r176L167q91
6589E30o939p897M547j0008j3967K0594P001j02J597J2231O727j2249j8446L454
6575a2927J0454J353q959p561n513O995K367J334J4998L533N26p397m115K363
6561b549n167J0624r567j7858J615k767m568Q528l272Q520L394J463R529R966
6547G891L867j098k1541j8027j3563J4303J5224l42J9924P146p379n26M104p059
6533B924m75j4034j1748r042K40J4829O745m369M53K241n736j1262L906J0268
6519a5060p87K665k429L670j240J0889J771r97j1260p367P55J428J4094J9535
6505A5667l158j0720j2567R284J0510J4501p859j6896j0410P848J2494p180r325
$$ y = [8046, 14496, 24301, 22060, 6041, -4805, -6820, -5696, 9997, -5197, -3245, 7430, -1746, 1421, 530, -6409, -14306, -9759, -19767, -33734, -13140, -6139, -6241, -4644, 7587, 14314, 2065, -16381, -12927, -2473, -1120, -10079, -17640, -23153, -16158, -13791, -12457, 2541, 6074, 6600, -797, -4912, -2549, -7716, 2908, -6659, -24517, -22902, -25669, -30237, -21709, -24981, -16461, -13067, -11604, -2075, 7891, 11758, 10660, -10881, -28908, -42471, -28168, -12944, -13286, 6638, 13784, 6405, 5879, 9983, 2924, 2449, -11585, -23333, -32375, -32135, -17306, -10561, -14930, -14477, -12236, -17972, -29234, -25328, -15060, -15847, -13182, -15611, -11941, -13181, -2292, -521, -1518, -12778, -20145, -19390, -17962, -3868, 15667, 12509, 1789, -10778, -1494, 9016, 23517, 15658, -1238, -11648, -3800, 8694, 1514, -7811]
6492g811J5678N954l540o493m761Q811j2794q97P13m806j44R622Q82r445O18k2
6476h435n574K140L326N060k511L011q630j641M13J1505k086o228n66j069P07
6461a0578p736O587P254m610j3087j285J6594P713l220M835n282m644J9520K3398
6447C5459j843j6539R77K361j0957p251j822K536o383Q668n988j4698p786J2951
6433a0315J0021q319q218j0716Q05J9136K1257j856j4172j4146Q617J3958k861
6420C191q014l142k418j893J6173o757m908j1954o897J0442k269J02M679J0265
6406c400Q497o22l724j4248j454J037P26J791l797j0266k720J2853P172N030m713
6391g838q845P895J4475p566l708M424m960n572m232R197J0270k45J765m601J1941
$$ y = [-7811, 7867, 13821, 10281, 3788, -973, 7838, -4956, -5853, -5140, -9946, -10090, -468, 414, -9031, -8413, -8435, -14009, -11869, -8543, -3483, -5994, -2983, -11613, -13254, -12841, -1336, -3422, -9650, -10216, -11285, -10578, -18314, -11727, -4473, -9083, -22170, -23455, -6861, 852, -2368, 2467, -2815, -7459, 12061, 35459, 33616, 17077, 18054, 20415, 9458, 2207, 385, 2921, -3462, 5206, -782, -15480, -23266, -10315, -294, -8613, -16831, -27547, -26742, -7606, 13651, 11795, -2377, -16523, -7906, 6052, 3191, -4823, -7965, -10383, -12276, 3897, -2860, -7768, -19722, -26619, -16177, -18446, -18344, -13665, -3400, 5097, 4475, 751, -13497, -14951, -13914, -13188, -11397, -15194, -25460, -28180, -15327, -8155, -3125, -7838, -16683, -8788, 5687, -1879, -5587, -1163, -6123, -11695, -15927, -6730, 3540, 3295, 5060, 459, 12400]
6376A2400L701j5822p862J65r032L233J9289p955j5502L145j1894j0049K3627
6363a2556J3313M073l200j2138j341K240L667o64p180P28J2790o000r900R78k798
6348a7988Q224Q365O820l390O989j0366j3117P92P35L12J253J2423L438l440j976
6333i26m603k136N156m739l398M66J7586k760k1546P172Q449o137o489j2703L844
6318b2764O919P617j792j8263P477R253m628O050j3967k974M052J3036j2021M795
6304a7210O106q72j4421K38K820P739o667K051J8493q89J2516J1140n861k997
6290A2186k37l170j92j0709R07o157k76J289R170j224J699M116l863j6683n513
6275a8657J320P293Q909r456O018K413j0470P223K343q200r700J947N031j1323
$$ y = [12400, 16101, 279, -7583, -7418, -16450, -13217, 6072, -1883, -17385, -14240, -26134, -36183, -12556, 757, 4830, 1630, -10508, -11849, -9609, -5942, -6606, -13786, -13058, -268, -6268, -16168, -15190, -17988, -9764, -1399, 5421, 2031, 9020, -1346, -14463, -13671, -12936, -12624, -11371, 1052, 4490, 1050, -926, -5529, -7665, -2509, -7248, -10646, -10180, 7406, 4646, -16900, -9728, -1279, -7416, -13905, -26608, -22764, -15845, -8228, -10020, -28283, -20806, -11553, -16181, -10131, -24098, -27072, -23020, -9984, -22005, -17210, -11104, -11976, -26397, -26159, -23339, -15600, -22267, -20216, -1723, -2612, 9904, 21044, 15183, 12186, 11949, 8779, 8587, -2122, -1215, -7372, -7648, -6359, 2811, 1587, 3286, 7402, 3539, -13144, -18657, -17337, -10044, -1135, -10591, -4573, -2160, -12630, -5407, -3064, -11264, -20964, -19017, -13986, -25309]
6261b5309r335r83O856J2698K997L562O578J7088o100j6524j3364k87J6662L617
6247a844j392O747J1471K154o436N353j455r881L815J447p871K992j568J08J785
6232E425j5311j198Q050M963j2917j9808J3598K5673J196q962o357r139K490M835
6218g462J107P100K059K163N839n047l737k004J353o818q983J4770j301K547L182
6203D768N788J0035p82j4635o288l711k464R927J1521j0553p408L495j1280l477
6189a5064p334J0196J9405j168n965j7835j2947J2655j1670k510K6989J6340l994
6176G098r549M592J4744p376l23j793o367L100O545L773p83q885l156k159j3953
6161a4492O154J0238n591r483M523N100L791k5109J892N513k92J432N018N364
$$ y = [-25309, -34644, -35627, -28771, -16073, -13076, -9514, -2936, 14152, 8052, -8472, -21836, -22123, -5461, -1844, -3236, 3511, 14982, 17136, 10700, 16053, 14598, 4717, 8532, 9979, 2108, 5100, 3532, 3640, 5425, -9886, -11084, -3034, 1929, -10988, -30796, -17198, 8475, 9671, 709, -5648, -14787, -12297, -7462, -6355, 745, 2804, 4967, 10806, 5759, 2022, 18, 1371, -5447, -14430, 340, -961, 1586, 4768, 10556, 20591, 19809, 5174, -1114, -4825, -7289, 2638, 14159, 3606, -3802, -307, -11587, -15064, -22398, -12202, 7203, 6035, 70, -17765, -30712, -18057, -29727, -32237, -5248, 11092, 7098, -2451, 2141, 16885, 9509, 9186, 7393, 1026, 4126, 10671, 14444, 13661, 4776, 1620, -539, -14492, -8338, 1900, -3691, -13174, -8651, -3551, 240, -24869, -22977, -17464, -17756, -16324, -11306, -5942]
6147e942Q493l957q52M93j2250k950o705J2929L445n112q891Q006J1537q129j0137
6132b0022n671J3212J1025p29q150l321J403l726J388O722Q504J5595J809k2118
6118d079j4755J0603K295n376O819J35j690Q707j551p411J813J1884M218O670
6104A8282K626j6115j6812j281M621r87Q7L680j435Q802R077j101p852k1784K61
6089a9931Q982k783j3042N947L217P26R693l093K566m723K990N653K030M893j2790
6074i665o337K745m262J371Q711l876N771O434r171k072j293J4057O659k7651
6060a8579j0048R01J3188M698K798p633Q737J800l772l646j7123p659J7863J706
6046a6769R082O346k0848j8322P171K6935P743j8755p761J8685O084K979K564
$$ y = [-5942, 2551, -1406, -2258, -1765, -14015, -16965, -23670, -10741, -7296, -12408, -21299, -13293, -1756, -9885, -20022, -25693, -12481, -1456, -2185, -10335, -13656, -12253, -15979, -14591, -7869, 635, 16230, 18039, -4079, -18834, -8231, -5936, -11312, -4493, -4358, -6048, 2659, 1108, -6303, -4490, 7394, 11612, 18282, 20908, 4793, -12019, -13300, -8679, -9666, -9579, -5899, -7334, 1468, 10545, 9444, 1592, -20192, -19931, -10949, -13732, -26774, -20827, -17610, -16884, -7191, -10284, -7718, -12441, -9451, -3798, -1768, 3125, -9665, -16002, -13257, -17519, -16148, -7437, -11313, -5542, 892, -8279, -10351, -11644, 2413, 9072, -18579, -28627, -27726, -14538, -9840, -7042, -14675, -5938, -4138, -7910, -11556, -28679, -36338, -18475, -16769, -7687, -1341, -22189, -40511, -33340, -6405, 1338, -17417, -25178, -6493, -409, 2570, 5134]
6033E134K351J0048P18r81j3296j2116m971M947j76j6087J4217N513L618K521
6019A440o349j5735k158J5526J000n538l943L135N479o83K635j0342k899J0318
6005h114J0752n803r313L022J1294O549k736k35p862j0379j3345m015J3910r04
5991a7179R252R356J66K868Q916j6990R654J3118o446p574j079j1576j1647M218
5977a4943p678n955J5306Q870l325n713o466j555O433j2368l303L583K1054P591
5963A531Q2K129j759q654N107N373J0729L700j4004p038M417J516l189j0154J679
5948h535r16N419O154l166q466o604L646Q183J1020j39k2698j2683m346N217m562
5933c2476L907l335J1075r38q716M946N918M832O209P297p819O845L181K982q311
$$ y = [5134, 7485, 17533, 18251, 17270, 3974, -8142, -13113, -8166, -8342, -24429, -10212, -4699, -1081, 1440, -4909, -20644, -22802, -7276, -6276, -11814, -15757, -12622, -7143, -7826, -5191, -15533, -18432, -8114, 2638, -3165, -12478, -9456, 1838, 8387, 5651, 5416, -2446, -12825, -26170, -30185, -16275, -17179, -7927, 1429, 1595, 4463, 13379, -3611, 6043, 19161, 12715, 5141, 4062, -7514, -19161, -14943, -22621, -28576, -13270, -4400, -7725, -13438, -19904, -21459, -15026, -27394, -30697, -27114, -6060, 1531, 1613, 3742, 1983, -6671, -1564, 3809, 14538, 18238, 4234, -2804, 1613, 3129, -60, -10214, -8535, -9451, -4032, 2122, -1044, -9510, -16114, -12468, -4285, 6735, 6596, -16102, -28785, -33131, -27914, -32476, -28569, -31904, -20829, -21767, -30483, -25537, -19619, -14787, -8578, -1281, -9100, -2255, 926, 3908, -4403]
5918d403k2538L495J8808M790K150j4772p549j0201J4276J6151k116J077j0778
5905a1610O32j0466M426J6546P751q440Q368J3993J942j1814j1640n541j58j2402
5891a8413J2953M615k921m627j2814q03M652P604R499j435R202L583j068n106
5877D921j4505K941Q269j0647k6451n980P255J4157J7192L391r100r96n675O619
5863h609j1018p777P963J0126O094O738l422K167j5013o23Q316R827P36j7026
5849a1521j9071J4918Q773N305N814j0719q811K198K318K052L752L562O324k478
5835B416m051l521j3862j750Q577O144J1566k961q890o958o638r747J2058O592
5821a1025K996K783Q242J549j3024j7334j461J2929Q285n293n134o887J1369J8783
$$ y = [-4403, -26941, -23446, -4638, 152, 2302, -12470, -20019, -30220, -15944, 207, -1909, -832, -11610, -10978, -21444, -17018, -472, 7279, -1161, 7207, 21200, 23142, 11328, -312, -5853, -6011, -18413, -5460, -845, -3766, -8393, -21207, -22010, -17358, -9754, -255, -1690, 7512, 11095, 10027, 4921, -9584, -6643, 1626, -9021, -35472, -41452, -34197, -20040, -2848, 543, -8557, -9553, -15228, -8609, -19627, -27404, -19441, -9315, -3221, 3517, 95, 2262, -12751, -13374, -5058, 4769, 5505, -11521, -30592, -15674, -6901, -1596, 4218, -6501, -15312, -13114, -10796, -8744, -4992, -1430, 4894, 2416, -1635, -5156, -19018, -20768, -12191, -6047, 5519, 2558, -6332, -13290, -19928, -29675, -17617, -11025, -8029, -5246, 2996, 4545, -8479, -25813, -27274, -14345, -6060, -11353, -16487, -23374, -12005, 6778]
5807F778J9623l93j7724n373K65m877J557N625M949p687N24J336j439l84N722
5792H502j3494N115J4130l193j7955n353l660n619N640J3610K1005J0930p055
5779B2603r881l426O67m357N003o055J2328J211k541J2032o995j2847R936L000
5765B0678L520j3346m899J4801j135j1279o877m062j707N215K037K180J299k992
5751C433J3522J1640q046j0048j0241l709N251J1042p871N493Q453n227j0896
5738B796p202L674l916K98k803p45M66j4351j690N186M5j7874Q900J0782J3438
5723b996r157l758J7557P947o818r297r264j974P132R919O271k995o829o51j1657
5708a6570n891L829N135J377L453p93n006J864P485o549r892k991N225M653r3
$$ y = [6778, 26401, 26008, 8284, 2911, 3176, -1701, -144, 5481, 10430, 2743, 3267, 4603, 3164, 2780, 8502, -4992, 123, 14253, 11060, -6895, -12248, -15908, -21527, -15887, -2277, 18728, 29658, 22603, 12722, 9296, 9963, 5606, 10609, 4554, 16882, 18093, 15552, 27584, 20589, 7742, 17678, 20678, 24198, 10852, 5953, 20754, 19619, 8340, 1463, -2599, -4306, 909, 2946, 5126, 6425, 3433, 16955, 28595, 20549, 10501, 260, -3449, 1802, 12844, 4973, 10466, 18919, 13692, 2796, -4406, -732, -4648, -4350, -7153, -7898, -7432, -21783, -23473, -18287, -18242, -36116, -27216, -16434, -2996, -12153, -15911, 1646, 9593, 2775, -6522, -15786, -17760, -10628, -709, 5562, 2567, -4262, -4913, -16570, -22461, -18632, -13497, -12120, -8667, -9460, -14466, -12602, -5117, -11666, -21558, -24549, -19324, -14671, -14764]
5693a4764j0490n10l499Q22J0873k969J3399M280L840J3553o247j6167n439L004
5679a0314j200R401m599j5886J633k674M033J4036J1246J4858p053k313M645L022
5665A8835k0363j0620P14m45p873J981J36R744q533l272J3423J9764j0420j4523
5651a1452j0358n000J9904J2102r92j2952j7321j2993J1409J6896J4548O005m047
5638E749L748j165q458l110j2145J163Q000p938J0723l012O186J3795J4019jn679
5623B1875R981k704m335K513L229j0325k2738j2299j3291O854J1074K173Q020
5610B7J1175J388l662l386N594j2306o415j3155r477L201J2228j97n836J038O349
5595a3434Q405p666O21O189N21q465k850K263p19q948j775J0094R225k190j1639
$$ y = [-14764, -25254, -25764, -29263, -28441, -17568, -20537, -7138, -2858, 982, 14535, 8288, -7879, -13318, -10314, -11514, -2113, -6712, -22598, -20965, -23639, -19606, -5570, 5676, 20534, 13481, 11168, 15813, 18835, -1528, -12148, -11434, -11879, -19752, -17771, -17635, -7891, -16424, -19696, -6273, 13491, 3071, -11452, -21810, -26810, -6906, 5196, 4204, -8748, -26069, -39062, -27653, -10757, 3791, 9796, 5749, 9497, 8332, -126, -3236, -15381, -14218, -6218, -14156, -3433, -6445, -259, 13536, 27555, 27554, 21875, 31856, 29152, 24817, 27330, 30559, 20234, -2504, -14803, -28094, -21240, -10166, -7993, 27, 11202, 12590, 8928, 5542, 11136, -1170, -7585, -20740, -30217, -27016, -14788, -14985, -20821, -19783, -13434, -5029, -12695, -12074, -5885, -5364, -13829, -16679, -14416, -15135, -24083, -25858, -15764, -6539, -8729, -20368]
5580b0368J0669R402Q469p913n24M88j2082q572R851L094l434L820O342M02m632
5565d988o796q535j024r74J0723K0006J3100p877n532Q892J0j2926n25P863k257
5550I160M346j3075k5237N889J0064k775Q493J3617k181p532n748n322P900K4189
5536B1788J1125j4891j1579J994J925p594O11M293r012l812P478L462r245o044
5522i501l823n547j83J1176J6322J0827P51r021o299n442M025N35l989m814J7990
5507A3007P370j2007j2323M834L944j757N2p086M771Q469J6060K2908j1571j2273
5493B4398m574o07j5828L239K742k2379j9479J1380J1733Q455O864m446o504M518
5479d88n779j6458n947K2794J9017r267n540q212j1317j2755N024J7399o660K085
$$ y = [-20368, -9699, -297, 8172, 259, -265, 223, -11859, -20431, -10580, -7486, -10920, -7100, -758, -356, -4988, -11784, -20319, -21343, -22317, -11594, 8412, 21512, 13635, 8103, 16995, 17005, 4079, 3554, 11417, 9160, 13506, 431, -24806, -18917, -8853, -11628, -3135, 10482, 8301, 769, -4979, -10301, -2401, 21788, 32913, 18022, 6443, 8437, 10362, 2768, 3379, 7672, -1340, -5152, 2326, 5788, -3457, -9501, -13324, -18871, -19054, -7878, 8444, 19271, 20022, 11001, 4702, -740, 3285, 3820, -169, -4983, 13007, 20377, 8370, -3953, 881, 4825, 3068, 3120, -3966, 805, 9274, 25334, 48242, 36671, 24398, 19824, 19217, 3389, 6628, 9370, -13009, -32488, -21108, -9375, -920, 5944, 1498, -5006, -488, -6267, -22725, -28672, -5878, 13139, 3872, -1668, -9880, -21197, -33952, -28928, -11529, -18189, -16104]
5465a6104P715P252K1592M747j0091j916N565p537L48R45j0230m058m732J683
5451d821L329J0440J3074p949m197m554p887q675r858R927K031J1330Q531M816
5437A5537L424j1046q704J3K062j2309n524O93M687J0539j578j79r1j0222j793
5422a4491L486J3074k31j051N921O388L10j436n507m829r720j0459N472l394k985
5407a9452J0816O654N073m580k1618L561j563n284R005m713k69J0987M590J0994
5393D201N980j0895k6781n763O004N596l426K1473j981j1602N209P339J1575L72
5379G301j3388j208m95P67r761k76j269J0094Q358o261n794j9804n59J5265O501
5364a0529r522j3440R086J5710j371j1537R393N869P308K821Q030J973j298n608
$$ y = [-16104, -8389, -1137, 20455, 25202, 15111, 13195, 18760, 11223, 11571, 12516, 2286, -1772, -6504, -4821, -1492, 8948, 22022, 14073, 9876, 5322, -2565, -11240, -21098, -11171, -9140, 2190, 10721, 15537, 18961, 7915, -789, -776, 1286, -11023, -16547, -15854, -11167, -628, -2206, -2385, -2476, -12698, -14491, -11005, 2069, 1838, 787, 6708, 13096, 13406, 11970, 6463, 1634, -8086, -18545, -13073, -16467, -19452, -8636, -1982, 3091, -1489, -23107, -19546, -21109, -26393, -17388, -22101, -22370, -11383, -6793, 4201, 10181, -714, -27495, -33258, -27254, -21658, -25084, -3611, -5592, -17194, -11985, -4646, 6929, 7301, -6087, -7295, -7790, -7023, -16784, -17060, -18329, -8235, 123, -6138, -11932, -31736, -32295, -17030, -10529, -20051, -33491, -24405, -8695, -10066, -21603, -12210, -6341, 967, 3788, 11818, 13791, 12493, 6885]
5350F885M065j331N379j511n658j3526j965J1096Q615p349l721q284J733M129
5336a443L583p274M013N780k758O42j1512N211J194l125o585j28J0163k722j0004
5321a4965N219O743N000O156q686J599m475j7944m091l880j4524m212K0575J8326
5307i159N76K555l527J4365Q151R10n629m862J1891k297q219r304O199J4985m551
5292A2084k3028r948K5209L852n916j17p664M736J2404j029q285o114P843m79
5278C548N02l942n049M921j0231N030M487j0l721J029J4800N728m415j1140j0984
5263i447J097j850k906M559K384l726L432J4876J921R59L64q984j050J1626j4243
5248i88K457J4200n797k0084K483m158R136Q617r558j1213j481J3090J1509J5026
$$ y = [6885, 10950, 9619, 14998, 13487, 7829, -5697, -7662, 3434, 12049, 4700, 979, -7305, -5572, -1443, 2140, -5134, -1121, 4659, 1901, 2543, -8969, -3758, -2564, -5689, -12274, -12402, -2239, -4961, -14965, -9746, -3003, 1997, 8153, -533, 1066, -3409, -21353, -25444, -29324, -43848, -48060, -27485, -9159, -8583, -6028, -9555, 4810, 12961, 13871, 8242, 3380, 15271, 12974, 4755, -4549, 1650, 16635, 12084, -10944, -20892, 4317, 8169, 2253, 2136, -5528, -792, 11612, 10583, 2298, -3816, 4027, 3548, 4050, 108, -4941, -20, -10251, -5221, -734, -744, -4465, -3436, 11364, 17092, 12677, 1537, -9447, -8350, -10200, -13106, -8547, -6163, -9889, -6457, 8419, 10340, 11299, 11663, 2679, 1629, 13255, -988, 1469, 15669, 9872, -10212, -7729, -11887, -2751, 5866, -3692, -14905, -16386, -3296, 8213, 23239]
5234B3239j571q729q669j8624J96m166O31P398l781L118J0035j104j745K836L52
5219e84n47J3064q565k8367J121P424J8288j115j1452o183J670K1096n80o911
5205a641n604j867O346n431M785J1394M541J2731p650j4638j8802n292L186k176
5191b0118k244m614q509J0777k066J842N102J3866J427j1999r156N464Q168J1966
5177i4K637j2654q559k415O94J7198J6494L559j7793k1223j2097j0701j0262Q854
5163d6362J0945J2916K810M063J576q324n858K6900K236j4379k31n022r642J927
5149b6445n427J1693J5317o28j9848K4740n163j0802Q049l070j4384K660L786
5136a9522J8005N019l115q319j0052R457m831n428j545J181Q011p495K205M85
$$ y = [23239, 21668, 12939, 4270, -14354, -14158, -18324, -17693, -10295, -14076, -10958, -923, -2027, -3772, -936, -584, -1131, 11933, 3368, -24999, -23878, -16454, 1834, 719, -10733, -16916, -15246, 5850, 5270, -1641, -7245, -9112, -2766, -8197, -3412, 7982, 12523, 25254, 17604, 2966, -15836, -21128, -17942, -20118, -22362, -26976, -35485, -24708, -26774, -24932, -19830, -5964, -4537, -16536, -25692, -20228, -12060, -94, 2543, -10111, -18670, -21085, -20391, -3193, 13301, 16860, -933, -22156, -34253, -44954, -55216, -46362, -35417, -22501, -19691, -15628, -14052, -22376, -28234, -1334, 902, -13477, -13708, -18730, -28372, -26445, -31872, -20179, -4862, -5490, -25338, -598, -5761, -16563, -8514, -11584, -25968, -23308, -19522, -1517, 3502, 387, -7932, -17984, -8527, -13358, -18786, -20331, -19150, -11139, -18634, -16429, -15944]
5122a5944q49J48J536J1548k219r201J1786J2268J4264L360j8188r21o630p766
5108f808j0670O257P440K974M416O014j524j960J290Q90q88l683m378R2J2J380
5092H54J069r829J562l694M092K0092p251l388R939L899r244j0849n349R971O738
5077H612m514Q423j4129j3425p63J8838Q214q644j1559J794m482O729J5883O710
5063A7687j2468l95L272J2269k312j1719q540l000J5742L271n546L044K477j1280
5049B502j5565K02j775J3442J3032j716j8887k076K22Q40J658J6683P487O773
5035B2822q020j6302n945m863N730r089j0179J0956p152L870k791L061N966K586
5021i350j5716j1442N32J0130J1976J2945L423n19j0634M012o057j207J6279M851
$$ y = [-15944, -16793, -16645, -15109, -3561, -5780, -14981, -3195, 9073, 23337, 26697, 8509, 7588, 958, -6808, -17478, -11221, -3781, -807, 3609, 9623, 8099, 6139, 7429, 8319, 7431, 3748, -630, -538, -526, 854, 1923, -7906, -6344, -10038, -5946, 14146, 6895, 3507, 13446, 17345, 8101, -2748, -8097, 1874, 8612, 4098, 12521, -1608, -15033, -15796, 3042, 11256, 2612, -8947, -7153, -11635, -4906, 10977, 17687, 5219, 4824, 8096, 20365, 18053, 6334, -2206, -5206, 10536, 13807, 8261, 11305, 13782, 2502, -13063, -12861, -14636, -1194, 11838, 10122, -8765, -10841, -10619, -9779, -8121, 8562, 16049, 22822, 14802, -1500, -7445, -12308, -6578, -15667, -25846, -14890, -22042, -18172, -20963, -17902, -11936, -9350, -25066, -36508, -35976, -25846, -13870, -925, 2498, 1979, -8655, -4643, -10700, -11907, 4372, 9223]
5007I223m035j1812r573Q300J5443r519p622J2455J182K412k253o309m322L941
4993b489n273j9068M091J7630J6636L069o546O882k149j3473p73L714r75j145
4979A31J090k1393p53R639J3253J0028J20k882K251k934p454r47r106m521m336
4964a7814p483J299L6181N356k4674J434q076N262K415n357J1424N541O928l118
4950I318r220J910l221J6954o705n720m62l732L37J092n864N49O447k727o609
4935g653n25k197L558J699q875r606k787p8L207j881P549Q242O27R900O073j42
4919G111M199j2693j4112R452r240j3358M778k322Q146L388N082P742J7856m300
4905A1729j5171o296J81P334l264M699J135j6631j122K404r495n95J8023K567
$$ y = [9223, 5188, -6624, -16197, -7897, 7546, -1973, -9595, 2860, 4042, 6454, 4201, -2108, -6430, -2489, -7762, -26830, -22739, -5109, 11527, 14596, 8050, 14932, 12783, -690, -1463, 2251, 1276, 131, 1221, -20172, -20925, -11286, 1967, 11995, 12115, 9233, 11484, 8550, 1096, 149, -8957, -13478, -17814, -25297, -23998, 12183, 17539, -7135, -5701, -13777, -8515, -6100, -11457, -33, 5508, 12436, 9318, 98, 2008, -1213, 15741, 9036, 3316, 2854, -878, -541, 551, -5313, -4764, 1683, -1044, -7653, -8178, -10375, -6817, -5118, -13993, -23599, -26386, -26464, -23257, -25138, -17589, -9347, -8720, 1180, 7253, 7111, 11310, -1383, -15495, -6043, -15283, -28641, -23863, -26185, -18039, -14651, -9569, -1827, 16029, 11729, -3442, -9738, -9557, -2223, -5487, -788, 347, -16284, -17406, -15002, -24497, -25092, -7069, -4502]
4891d502K490L529P816J1707j973r251J9907J0373k1807j3777O777R21R020m314
4877A6916k996K868p462j3062m780m227o56l211K442J3228M180k624j0928L763
4863f549M575L899m112r902J55J1501M923J1313q697j9051n954k8J4917q387k049
4848a3446k632O458l894J3436k533r672M756J1586Q926M980l722q830q267j641
4834d495J926M955J107Q96o72j553j5524j7396M769R574l408n68M692J090j0512
4819b5119R850J0719K531P88k5327l457M933Q709J4065N70J813N863l912k163
4805a37K233J1028j8270m415J2149j7305q639J041J6435k699l234j172k662N589
4791a0058J2807j074j185k101r397J033l745j774J5749J3179q713q977J097J795
$$ y = [-4502, -2012, 1517, 9333, 21040, 19067, 9816, 29723, 40096, 18289, 4512, 11289, 12210, 21230, 16916, 13920, 16788, 9326, -3736, -8516, -12743, -13399, -16610, -14168, -940, 3240, 616, -10312, -6549, -1974, 1925, -2187, -12089, -11934, -433, 4490, 15803, 7106, -11945, -17899, -17927, -3010, -11397, -13446, -16078, -9620, -13514, -78, -2611, -12283, -7527, 4059, 12985, 17965, 14243, 5413, -2854, -4495, -2569, 2386, 3493, 4389, 3717, 2164, -13360, -30756, -25987, -16413, -19821, -20389, -15697, -14607, -25119, -15269, -4550, -2019, -1231, -26558, -30015, -25082, -16373, -2308, -1738, 75, 5938, 2026, -137, 2096, 13124, -5146, -9561, 2588, -14717, -23356, -22315, -5880, -8579, -11813, -12985, -15647, -10058, 2749, 1675, 490, -1611, -11008, -9975, -13720, -15494, 255, 13434, 4721, -4256, -3159, -1364]
4777a364J182L980m759o896q5J374J009J596j71l33n049j5761r628L8054J0203
4762A3352n557j8854K4039N756o474J248M352n280n306q542p54l228k171J0823
4748C404J9271j1353p964N251j311j3663o909L708l676K853J6117j065j393m392
4734a122r073o284l187J3534L550o233P300o150m090L364J1281J108r019j6800
4720b1821q813J8141O535j226J174l497q807J0147L144n496m528n099j178j082
4706b2406J700J0987N63L328J7394M05L884j5374o382j1536j5465J0874J4493
4693g535q102K260L599J1805J76P366P509m380l595j4072j8207L632K9988J5405
4679B5849K328r830j0014j0199m202j722M900q729o450m843J1379Q595R363o221
$$ y = [-1364, -182, 3798, -961, -7857, -7942, -6568, -5559, -3963, -4134, -4467, -9516, -25277, -34905, 3149, 13352, 7795, -11059, 12980, 18736, 12262, 13510, 17862, 12582, 7276, -1266, -2020, -5248, -7419, 3404, 22675, 11322, 3358, 8609, 7298, -6365, -13274, -9566, -13242, -10389, 5728, 4663, 3270, -1122, -10195, -16479, -19666, -6132, -2582, -8815, -1515, -7665, -11755, -8391, 2890, 3998, -5021, -21821, -30634, -12493, -5958, -7184, -6010, -9507, -18314, -8167, -5023, -10519, -15047, -20146, -21324, -22406, -20706, -9719, -9156, -5828, 11566, 11971, 15855, 481, -5901, -17437, -32902, -22028, -7535, -15637, -13377, -9778, 2027, 2203, 9569, 17078, 12698, 9103, -4969, -23176, -19544, 10444, 25849, 28177, 18347, 8333, -1866, -6068, -7790, -2890, -11619, -18069, -22912, -11533, -2938, 6425, 204]
4665B04o035n196J0743o6j0565j3436M285P354P391n053n741L248q42P366P39
$$ y = [204, -5831, -11027, -284, -350, -10915, -24351, -20066, -12712, -5321, -10374, -16115, -12867, -13709, -6343, -5604]
$$ [...]
##END NTUPLES=NMR SPECTRUM
##END=
