##TITLE=Analysis number 328473
Compound Code cc 02713
Book Reference lab3
Project Code adrs
Chemist Name stores
##JCAMPDX= 6.0         $$ Bruker NMR JCAMP-DX V2.0
##DATA TYPE= NMR SPECTRUM
##DATA CLASS= NTUPLES
##ORIGIN= Bruker BioSpin GmbH
##OWNER= nmr
$$ XWIN-NMR		Version 3.5
$$ Thu Jun  7 11:02:40 2007 GMT Daylight Time (UT+1h)  MAYBRIDGE\nmr@NMR_250MHZ
##.OBSERVE FREQUENCY= 250.131544655141
##.OBSERVE NUCLEUS= ^1H
##.ACQUISITION MODE= SIMULTANEOUS (DQD)
##.ACQUISITION SCHEME= undefined
##.AVERAGES= 16
##.DIGITISER RES= 18
##SPECTROMETER/DATA SYSTEM= dpx250
##.PULSE SEQUENCE= zg30
##.SOLVENT NAME= CDCl3
##.SHIFT REFERENCE= (INTERNAL, CDCl3, 0, 16.522)
##AUDIT TRAIL= $$ (NUMBER, WHEN, WHO, WHERE, WHAT)
$$ ##TITLE= Audit trail, XWIN-NMR		Version 3.5
$$ ##JCAMPDX= 5.01
$$ ##ORIGIN= Bruker BioSpin GmbH
$$ ##OWNER= nmr
$$ C:\u/data/dgb/nmr/ADRS/480/pdata/1/auditp.txt
$$ ##AUDIT TRAIL=  $$ (NUMBER, WHEN, WHO, WHERE, WHAT)
(   1,<2007-06-07 11:02:17.98 +100>,<MAYBRIDGE\nmr>,<NMR_250MHZ>,
      <created by zg, POWCHK disabled, PULCHK disabled
       configuration hash MD5:
       76 6E 9A 78 1E 09 19 81 EC 84 63 8F B0 6A 59 2D
       data hash MD5: 64K
       B4 1E FE 1B C3 F5 46 7F 55 BD 85 75 9C E8 14 86>)
(   2,<2007-06-07 11:02:30.08 +100>,<MAYBRIDGE\nmr>,<NMR_250MHZ>,
      <Start of raw data processing
       ef LB = 0.3 FT_mod = 6 PKNL = 1 SI = 32K 
       data hash MD5: 32K
       A0 6C 9A 0C DA 33 68 B7 08 10 25 42 C0 F2 8D F7>)
(   3,<2007-06-07 11:02:31.80 +100>,<MAYBRIDGE\nmr>,<NMR_250MHZ>,
      <apk 
       data hash MD5: 32K
       77 DE 2F 12 31 56 17 2A 22 2F 1D 7C 9F 2F B1 9E>)
(   4,<2007-06-07 11:02:32.65 +100>,<MAYBRIDGE\nmr>,<NMR_250MHZ>,
      <abs ABSG = 5 
       data hash MD5: 32K
       ED 0B 87 A3 61 16 35 3A 54 D1 AE 0B A7 4D 75 7C>)
$$ ##END=
$$ 
$$ hash MD5
$$ BD 25 B2 7D EA 5A E9 27 5D 18 33 37 C4 9C 1F 34
##$RELAX= 
##$RELAX= 
##$RELAX= 
##$RELAX= 
##$RELAX= 
##$RELAX= 
##$RELAX= 
$$ Bruker specific parameters
$$ --------------------------
##$DU= <C:\u>
##$EXPNO= 480
##$NAME= <ADRS>
##$PROCNO= 1
##$TYPE= <nmr>
##$USER= <dgb>
##$AMP= (0..31)
100 100 100 100 100 100 100 100 100 100 100 100 100 100 100 100 100 100 
100 100 100 100 100 100 100 100 100 100 100 100 100 100 
##$AQSEQ= 0
##$AQ_mod= 3
##$AUNM= <au_zg>
##$AUTOPOS= <12 >
##$BF1= 250.13
##$BF2= 250.13
##$BF3= 250.13
##$BF4= 250.13
##$BF5= 500.13
##$BF6= 500.13
##$BF7= 500.13
##$BF8= 500.13
##$BYTORDA= 1
##$CFDGTYP= 0
##$CFRGTYP= 5
##$CHEMSTR= <none>
##$CNST= (0..31)
1 1 145 1 1 1 1 1 1 1 1 1 1 1 1 1 1 1 1 1 1 1 1 1 1 1 1 1 1 1 1 1 
##$CPDPRG= <>
##$CPDPRG1= <>
##$CPDPRG2= <>
##$CPDPRG3= <>
##$CPDPRG4= <mlev>
##$CPDPRG5= <mlev>
##$CPDPRG6= <mlev>
##$CPDPRG7= <mlev>
##$CPDPRG8= <mlev>
##$CPDPRGB= <>
##$CPDPRGT= <>
##$D= (0..31)
0 1 0 0 0 0 0 0 0 0.06 0 0 0 0 0 0 0.0002 0 0 0 0 0 0 0 0 0 0 0 0 0 0 
0 
##$DATE= 1181210537
##$DBL= (0..7)
120 120 120 120 120 120 120 120 
##$DBP= (0..7)
150 150 150 150 150 150 150 150 
##$DBP07= 0
##$DBPNAM0= <>
##$DBPNAM1= <>
$$ [...]
##$SUBNAM7= <"">
##$SUBNAM8= <"">
##$SUBNAM9= <"">
##$SW= 20.6930455092707
##$SWIBOX= (0..15)
0 0 3 0 0 0 0 0 0 0 0 0 0 0 0 0 
##$SW_h= 5175.983436853
##$TD= 65536
##$TD0= 1
##$TE= 297.16
##$TE2= 300
##$TE3= 300
##$TEG= 300
##$TL= (0..7)
0 120 120 120 120 120 120 120 
##$TP= (0..7)
150 150 150 150 150 150 150 150 
##$TP07= 0
##$TPNAME0= <>
##$TPNAME1= <>
##$TPNAME2= <>
##$TPNAME3= <>
##$TPNAME4= <>
##$TPNAME5= <>
##$TPNAME6= <>
##$TPNAME7= <>
##$TPOAL= (0..7)
0.5 0.5 0.5 0.5 0.5 0.5 0.5 0.5 
##$TPOFFS= (0..7)
0 0 0 0 0 0 0 0 
##$TUNHIN= 0
##$TUNHOUT= 0
##$TUNXOUT= 0
##$USERA1= <user>
##$USERA2= <user>
##$USERA3= <user>
##$USERA4= <user>
##$USERA5= <user>
##$V9= 5
##$VALIST= <valist>
##$VCLIST= <CCCCCCCCCCCCCCC>
##$VD= 0
##$VDLIST= <DDDDDDDDDDDDDDD>
##$VPLIST= <PPPPPPPPPPPPPPP>
##$VTLIST= <TTTTTTTTTTTTTTT>
##$WBST= 1024
##$WBSW= 4
##$XGAIN= (0..3)
0 0 0 0 
##$XL= 0
##$YL= 0
##$YMAX_a= 442902
##$YMIN_a= -591766
##$ZGOPTNS= <>
##$ZL1= 120
##$ZL2= 120
##$ZL3= 120
##$ZL4= 120
##$ABSF1= 16.522
##$ABSF2= -4.171173
##$ABSG= 5
##$ABSL= 3
##$ALPHA= 0
##$AQORDER= 0
##$ASSFAC= 0
##$ASSFACI= 0
##$ASSFACX= 0
##$ASSWID= 0
##$AUNMP= <proc_1d>
##$AZFE= 0.1
##$AZFW= 0.1
##$BCFW= 0
##$BC_mod= 0
##$BYTORDP= 0
##$COROFFS= 0
##$CY= 12.5
##$DATMOD= 1
##$DC= 0
##$DFILT= <>
##$DTYPP= 0
##$F1P= 14.0000005364418
##$F2P= -0.99999901652339
##$FCOR= 0.5
##$FTSIZE= 32768
##$FT_mod= 6
##$GAMMA= 0
##$GB= 0
##$INTBC= 1
##$INTSCL= 1
##$ISEN= 128
##$LB= 0.3
##$LEV0= 0
##$LPBIN= 0
##$MAXI= 10000
##$MC2= 0
##$MEAN= 0
##$ME_mod= 0
##$MI= 0
##$NCOEF= 0
##$NC_proc= -2
##$NLEV= 6
##$NOISF1= 0
##$NOISF2= 0
##$NSP= 0
##$NTH_PI= 0
##$NZP= 0
##$OFFSET= 16.522
##$PC= 1
##$PHC0= 152.7345
##$PHC1= 8.752642
##$PH_mod= 1
##$PKNL= yes
##$PPARMOD= 0
##$PSCAL= 4
##$PSIGN= 0
##$REVERSE= no
##$SF= 250.13
##$SI= 32768
##$SIGF1= 0
##$SIGF2= 0
##$SINO= 400
##$SIOLD= 32768
##$SREGLST= <1H.CDCl3>
##$SSB= 0
##$STSI= 32768
##$STSR= 0
##$SW_p= 5175.98343685301
##$SYMM= 0
##$S_DEV= 0
##$TDeff= 65536
##$TDoff= 0
##$TI= <Analysis number 999999
Compound Code 99
Book Reference 9
Project Code 9>
##$TILT= no
##$TM1= 0
##$TM2= 0
##$TOPLEV= 0
##$USERP1= <user>
##$USERP2= <user>
##$USERP3= <user>
##$USERP4= <user>
##$USERP5= <user>
##$WDW= 1
##$XDIM= 32768
##$YMAX_p= 368881807
##$YMIN_p= -74845
$$ End of Bruker specific parameters
$$ ---------------------------------
##NTUPLES= NMR SPECTRUM
##VAR_NAME=  FREQUENCY,     SPECTRUM/REAL,   SPECTRUM/IMAG
##SYMBOL=    X,             R,               I
##VAR_TYPE=  INDEPENDENT,   DEPENDENT,       DEPENDENT
##VAR_FORM=  AFFN,          ASDF,            ASDF
##VAR_DIM=   32768,         32768,           32768
##UNITS=     HZ,            ARBITRARY UNITS, ARBITRARY UNITS
##FACTOR=    0.157963299565203, 1,           1
##FIRST=     4132.6476996994, 0,             0
##LAST=      -1043.33573715361, 0,           0
##MIN=       -1043.33573715361, -74845,      0
##MAX=       4132.6476996994, 368881807,     0
$$ Real data points
##PAGE= N=1
##DATA TABLE= (X++(R..R)), XYDATA
$$ [...]
18949d875J309n71l3J853k245l644j78K475M298N109l69l608j259j133l100K31
18933e740J941k521j377j531n10N370k406M7l3L48j31r48K654K600O74j543n17
18916c623j251p92j790N160j359l02K766j92m56n26L75k604n10J715Qr69P22O96
18898b932n37l124j051n66O41K415K700k843l523l13L9K274J083Q38K157Q15J84
18881a743k741K58K366N792J603r97j711m38J108ll33j86r15m557l722L521P34
18864a964j023j5J824n462J27O405l09l355J032K367j811K61K191k89K564K797
18848E340J12j659k98p71L82R88M52J010l26L5p84j113J628J065j464R55n9k048
18830C445j476j956K565j53P98J691l31l913j932J174L314M605J401l709k265
$$ y = [-4875, -3566, -4137, -4170, -2317, -4562, -8206, -8384, -5909, -1611, 3498, 3129, -479, -1738, -2871, -5971, -5740, -3799, -6320, -7697, -9228, -9738, -4368, -6774, -6727, -6760, -6412, -6543, -7491, -4837, -2237, -1563, -3106, -3623, -4874, -5666, -7456, -2296, -3655, -3957, -1191, -1383, -1839, -2365, -1990, -4594, -5104, -3389, -3381, -4350, -3628, -2932, -3469, -6593, -7644, -8210, -7569, -5154, -2454, -5297, -8820, -9133, -9094, -6820, -5737, -4899, -2742, -1927, -1743, -4484, -4226, -1860, 3932, 5535, 4538, 2827, 2389, 3497, 3494, 3161, 2975, 2060, -2497, -6219, -2698, -1964, -2987, -3002, -1178, -6640, -6513, -108, -417, -3772, -2740, -373, -2184, -1923, 268, -21, 2543, 5340, 5452, 3793, 3495, 2724, 3106, 4094, 4546, 5556, 5230, 5265, 4481, 3368, 4996, 6061, 4597, 5552, 5493, 3445, 1969, 13, 2578, 2425, 3223, 4914, 4583, 670, -1262, -88, 3226, 7831, 9232, 5523, 3258]
18815C258J784l617m120J337L333L489J741J395L83l383k471p56q61J293L275
18800F080O25k322J457p07m371k172j135K192L488M005j619r43J448j512j913
18785B601l661j843r22J982J124L577j30p42P70k756k311o3J254L402K316L811
18769H409N862R458J0743K579j1762j2202r906k557k68J390K21m98k24K94K7l508
18753a942q10n30M73M97q85j582K050K424l3J009o76l45k83M4K446N80J613n84
18735C466j712j389l070k630l529J782N40J328K667l91n9J587p29k392J124j036
18719d443m51k6J942J578J51L76j765k97j282Q0j457M523J751P56j148k138j371
18702c221k031j308p81m25L504K187L084J403p08j701Q31j434j199p82J290J477
$$ y = [3258, 5042, 1425, -2695, -1358, 1975, 5464, 7205, 8600, 8983, 5600, 3129, 2373, 1512, 2805, 6080, 6705, 4383, 5840, 5133, 762, -1410, -2545, -353, 3135, 7140, 5521, 4578, 6026, 4514, 2601, -1060, -2903, -3825, -1843, -719, 2858, 2728, 1986, 2756, 0, -2311, -2374, -1120, 2282, 4598, 8409, 14271, 23729, 34472, 37051, 25289, 13087, 3181, 624, 356, 1746, 1967, 1469, 1245, 1539, 1566, -1942, -2752, -3282, -2809, -2312, -3197, -4779, -2729, -305, -338, 671, -5, -350, -633, -589, 1857, 2437, 4050, 3466, 1754, 365, -2705, -5335, -8864, -7082, -6542, -5214, -2547, -2938, -2997, -1410, -2139, -4531, -3407, -4443, -4894, -4920, -2978, -1400, -1249, -873, -2638, -2935, -4217, -4137, -5594, -1071, 680, 1436, 288, -1850, -3221, -5252, -6560, -7341, -7766, -4262, -2075, 1009, 2412, 1704, 3, 834, -600, -1799, -2581, -1291, 186]
18686A86j426j897J491J247N92K025M40l691l134l720M43J118j60M18m77N98J432
18669d515l18N433J941k333l82j290j213j755m056J007M130j159R49m26r71L522
18653a436L398m8j841k901l740j956J672J907R91k002L737M417L797k498k302
18638A195j336r3J861r18m304l150J137N96J32K134K019J149M13q29k156k096
18622d246L6J088j411k56Q07J861l472j757M593K094l423j511M74J281K316l23
18606a849j588k742m307n01L840J579M182M123k013k890l33L087P60k456k671
18591c779J143K022M598R00k223l81P10j435l437J366J550k987O93J011l844k089
18575f182k07j799P70J537R83J720L38J296j559l277J8K800M270J167j392l149
$$ y = [186, -1240, -3137, -1646, -399, 193, 2218, 2658, -1033, -4167, -7887, -7444, -6326, -6486, -6068, -6545, -5947, -4515, -4833, 600, 2541, 208, -174, -1464, -2677, -4432, -8488, -7481, -3351, -4510, -3561, -3987, -4958, -1436, 1962, 1914, 73, -2828, -6568, -8524, -6852, -4945, -3954, -5956, -2219, 2198, 5995, 3497, 1195, -141, -234, 1627, 709, -3595, -6745, -5608, -5012, -4880, -2746, -727, 422, 835, 6, -2150, -4246, -4210, -3122, -4533, -4789, -3982, -2121, -5593, -7350, -2757, -663, -4086, -5597, -5123, -3842, -1526, -1849, -3437, -6179, -10486, -10987, -7147, -5568, -1386, 2737, 724, -2166, -2499, 588, 1348, -1108, -3779, -2636, -614, 3984, 4884, 2661, 2280, 2990, 1555, -1882, -516, 1034, -1953, -1260, -249, -4093, -6182, -6389, -8188, -7418, -5881, -4898, -3178, -2840, -1544, -3103, -6380, -6362, -3562, 708, 1875, 483, -2666]
18559b666k511J966K49j514Q46O08r09m499J292J230N77j788j266L462L471N76
18543h76j187k545k950N05L477K073j248J793L263j912j959k3N04m06J571J109
18527A189J744j458l451N45K203L089k885k439j187k507l62n03j65K419L656j311
18511a423k052m9J168J163n05l281K89J084k050k801m02M664L668j332L46L617
18495B104K655n906m196L428O47O73l558l21O12Q04K858J847l28p6l720j276Q97
18478b856l58o11P0O97K451L601j685j20J729j583k405O73j26j445M08l06J021
18461h45J222K741L1n868K71J585k500q59J797K258j216k121m593J567K714j769
18445e585r3J393k247r6K121J421K525J055J292k990j361J868J5j722m32K071
$$ y = [-2666, -5177, -3211, -2962, -4476, -3630, -3022, -3931, -8430, -7138, -5908, -5331, -7119, -8385, -4923, -1452, -876, -2063, -4608, -7558, -7053, -3576, -1503, -2751, -958, 2305, 393, -1566, -1589, -1085, -1491, 80, 1189, 2933, 1475, -1976, -1431, 772, 3861, 976, -1463, -2650, -5157, -5519, -6022, -6187, -3768, -112, -1423, -3475, -3524, -2356, -1193, -1698, -4979, -4690, -3606, -5656, -8457, -8859, -4195, -527, -1859, -1513, 2104, 4759, -1147, -5343, -1915, -1268, -595, -4153, -4474, -3862, -3058, -200, 1647, 1319, 1243, -2477, -3753, -2856, -3214, -3825, -3755, -3058, -607, 2994, 1309, 1189, 2918, 1335, -1070, -397, -523, -1968, -1560, -1866, -845, 377, 3118, 3149, -2719, -2448, -863, -3363, -4222, -2425, -167, -1383, -3504, -8097, -6530, -3816, -5585, -5678, -4285, -6532, -6628, -4507, -3086, -561, 494, 1786, -1204, -2565, -697, -682, -2404, -2836, -765]
18429g65j309O32J825O96J685n12j894p62Q50j37j206q35J442j18k347l638n69
18412f962J513K088k013n37K787L56K644K422K190p80k283k164j501k239M08l39
18396d410l0K053o2j461N43q39L859k95o2J069k695j118k31J974J339o66k413
18379c445J154M044K39m799J153K835Q62K784n47j122N04R68l841J190J359k318
18363A020r31N48L090l57k498o54Q05J919L373l73K218M56l563n955j984M630
18347A744p6j108j252m36M88Q81J433m28Q61K595L502J627q47l921k684j360L61
18330A380n06k654l468J467K718K151j592R10J574J511J43K155j295l29k87m49
18314C429r50m21m54j662k841q93P76M063J479n89J349l01j477l77K203K143l317
$$ y = [-765, -2074, -1442, 383, 1079, 2764, 2252, 358, -404, 446, 309, -897, -1732, -290, -408, -2755, -6393, -6962, -5449, -3361, -5374, -5911, -3124, -2768, -124, 2298, 4488, 3708, 1425, -739, -2240, -4479, -4071, -4410, -4440, -2387, -2449, -3910, -3367, -4206, -347, -642, -704, 365, -2330, -3448, -3679, -1705, -366, -1032, -3445, -2291, 1753, 1992, -2807, -1654, 1181, 2043, 4827, 4280, 3158, 3662, 4630, 789, 1979, 3338, 1020, 89, 637, 3727, 3370, 872, 218, 1023, 2942, 6315, 5942, 8160, 8616, 5053, -902, -2886, 1744, 1668, 560, -692, -1128, -640, 241, 1674, 1246, 2107, 4702, 8204, 9831, 8984, 5063, 2379, 1019, 1380, 874, -1780, -5248, -3781, -1063, 1088, -504, 406, 1980, 3491, 3634, 5789, 4494, 4165, 3878, 3429, 2479, 2058, 1604, -58, -2899, -3792, -3016, 1047, 2526, 1937, 3286, 2985, 1508, 1131, 3334, 5477, 2160]
18297B160l884j316P83L901K455K658k728m148L76j979m803l61J858K017J979
18282a032j127j863k398J24J798n55R26J400j854j188R2R37K2Q37M486J855j666
18265G94j084r74o51m31j62j209M67j006P25m367k389M275K305K029K586j56j208
18248d56J4K600m33k063O40L653m232m68J303J250J665p2J308k309j248p20k111
18231a679j867K251K448o76k272j650J6R11L349r21k282O73J766k524l499j357
18215g313L813L756N56O93K727K774m816j964J174J107N29j994j446K871P77R8
18199C342k823j929L356M77L275J558O05M74p66Q05q79J149N55J677J314q2k207
18182I901J073K809l294j484R4m28J302K026J218J228j60j23J820n75p61j692
$$ y = [2160, -1724, -3040, -2257, 1644, 4099, 6757, 4029, -119, 257, -1722, -6525, -6886, -5028, -3011, -1032, -2159, -4022, -6420, -6296, -4498, -5053, -4127, -2727, -4581, -5769, -5677, -4740, -4718, -3881, 605, 2460, 794, -290, -1264, -1915, -2346, -2508, -3717, -3250, -4256, -3531, -7898, -10287, -6012, -3707, -1678, 908, 752, -456, -442, 2158, 1725, -338, 302, 3955, -277, -745, 558, 1808, 3473, 3401, 4709, 2400, 1152, 432, -1679, -3546, -1295, 1153, 477, -1795, -3445, -3429, -2518, 831, -90, -2372, -1699, 67, -2457, -5956, -7313, -3500, 256, 812, 1505, 4232, 7006, 2190, 226, 1400, 2507, 3036, 1042, -404, 2467, 3244, 3342, 519, -1410, 1946, 2423, 5698, 7256, 7861, 8335, 7569, 8374, 7495, 8644, 9199, 10876, 12190, 12108, 9901, 10974, 13783, 10489, 9005, 9099, 8671, 9973, 11999, 13217, 14445, 14285, 14162, 15982, 15407, 14646, 12954]
18166A2954n318j683O16K206J142K401M47K8k117k137k943j040O59K814J85J281
18150I495K964j05k63r11J53M07m69J922N09K964L202L235k45m39P77J00J751
18133B5047J326j042J238M754M866J914J015L749P318R540J0025Q288J1491J5700
18119A05229J8552K8821L6020M5918O2527R2860J49476K55279M40390P89585J427376
18108C452033K365634K183304j176007k760489j780070q95537m64443k71069j73034
18099D80322j16421q1231n7059l6426k2607k0714k0812j4144j5009j5579o800
18088G3520o024q711m378n668m355k908r234m845m502l528J770K144l922n890
18074A3469k937M185Q3l656p48J820l841j847Q63M09J378k392l060j003J697L98
$$ y = [12954, 7636, 5953, 6569, 8775, 9917, 12318, 12765, 12793, 10676, 8539, 5596, 4556, 5215, 8029, 8214, 9495, 12459, 12354, 12091, 11180, 11333, 11740, 11271, 13193, 13702, 16666, 19868, 23103, 22858, 22419, 23196, 23296, 25047, 26373, 25331, 26569, 31323, 36189, 38103, 39118, 42867, 50185, 59725, 69750, 78038, 89529, 105229, 123781, 152602, 188622, 234540, 297067, 389927, 539403, 794682, 1235072, 2024657, 3452033, 5817667, 8000971, 6824964, 4064475, 2284405, 1388868, 924425, 653356, 480322, 363901, 282670, 225611, 189185, 166578, 145864, 125052, 110908, 95899, 80320, 73520, 67496, 58785, 54407, 48739, 44384, 41476, 32242, 27397, 22895, 19367, 21137, 23281, 19359, 13469, 10532, 14717, 14800, 11144, 10396, 12216, 8375, 6528, 7391, 7800, 9178, 6786, 3726, 2723, 4420, 4818]
18058D818J939q06k397k780p00L543M378l38j973n75J749l73n70k793l493n94
18042i65K702n71j558J311L47l24J552J083M01k111n579O11P99J026n78L065M264
18025E475J67j397k905j839l114j5O46M356J656j258O59n02N31j711K18K556n37
18008B986k21n552l71M003J361J481k71R05J615n72k387n145l829J927K92j008
17992d786L342K973j721m33O91J425K365K29j314J452J4N940Q5o333o19J842j366
17975C786l049l005J36K305L068N81R70J331k858m128n683M73L230M487j335j398
17959a089p46M42K18M41Q78J372o33k311l240K090J645J484K005p97j477J17M276
17942D675j872p848j013K708J375K05j066J841M957J01j60J049M79J582k06k713
$$ y = [4818, 6757, 5951, 3554, 774, 74, 3617, 7995, 7657, 5684, 5109, 6858, 6485, 5915, 3122, -371, -965, 1737, 1166, -392, 919, 1266, 942, 2494, 3577, 3978, 1867, -3712, -3101, -2302, -1276, -1854, 1211, 5475, 5642, 4245, 1340, -499, -3613, -3628, -2982, 1374, 3030, 1772, 2431, 1929, 2460, 749, 967, 3523, 2986, 2765, -2787, -3158, 845, 2206, 3687, 3416, 4321, 5936, 5364, 2977, -2168, -5997, -4070, -3778, -4786, -1444, 1529, -192, -625, 66, 1491, 3856, 4085, 2771, 4223, 4237, 10177, 10262, 3929, 3310, 5152, 3786, 737, -2268, -2132, 173, 3241, 3822, 4792, 6123, 3265, -863, -6546, -6073, -2843, 1644, 309, -1089, -1835, -1393, -1175, -734, 144, 1516, 883, -1428, -4668, -2578, -933, 551, 2556, 1759, 282, 399, 4675, 2803, -5045, -6058, -3350, -1975, -1770, -2836, -995, 3962, 4063, 3903, 4952, 5431, 7013, 6807, 4094]
17926D094R68j654l372l839L85M284R4k131l101K403L384j615k665N35k486M004
17910g12K62K239P94m91j949K428M995j327j264L123P42l01k385l465j820L71
17894A240J004r9l252k582K173J450J689J345j871J378p16l516J100L014N68j882
17878A043J683K713J178P39K638J586k28j385o73k499k975q90M22M87k753r94
17862I2k372O05J892O97P18j132j29M85J092L719M091j507n07L485O653R72j931
17845A6923k412j50r11l847m556j362K782j631m412p13K226j480l262J710J310
17830B15R97j263j420L186J416k035K219L432J57j928l864l195N534M285j829
17815E907k784l623k154r47k320j964J70L354M521M15q31j905j027K637M321J335
$$ y = [4094, 5062, 3408, 36, -3803, -3418, 866, 960, -1171, -4272, -1869, 1515, -100, -2765, -2230, -4716, -712, -450, 1789, 2583, 2092, 143, 2571, 7566, 6239, 4975, 8098, 8840, 8539, 6154, 2689, 869, 1240, 2244, 2145, -1107, -3689, -1516, -66, 1623, 2968, 1097, 2475, 1759, -1757, -657, 2357, 2925, 1043, 2726, 5439, 6617, 7356, 9994, 11580, 11352, 9967, 9294, 6795, 3820, 2930, 3352, 3839, 1086, 92, -2280, -1675, 217, 914, 1632, 500, 371, 856, 1948, 5667, 9758, 8251, 7744, 11229, 17882, 18854, 16923, 14511, 14361, 13450, 9603, 5047, 3685, 6467, 4836, 424, -289, 1937, 457, -2805, -1095, 215, 1212, -51, -1471, 1715, 3131, 1096, 3315, 6747, 6904, 4976, 1112, -2083, 3451, 7736, 5907, 3123, -500, -2654, -3601, -5921, -7885, -7715, -4361, 160, 575, -256, -2161, -3188, -551, 3770, 5105]
17799E105j261j518l236l770J186K047Q15J306m37k4K135q80K372J181j922m512
17783a413k348L732J052k950j66J28K138l18j425r0j774k59J901N66L54j279J023
17766a128L415L041J254k283k632j923j101J286P68j966J257J829J275j399k372
17751f79L83J890L561J205K56m47p90J493Q49m664l090k522J121j050n5M11m820
17734f948j702L055M81K549n13J460K819J006K5n38l4k60j835R99J918J187k07
17717C462N19j018J728N252O584L881Q153J2963J0934J5217J6742K2092K2337
17704A28846L240m802J562O241m603j8955k3093j8900j3220r717j2253j1094l476
17691A9776m485m186m846J476m32M099n23k564P37L385O76k169k058m856k253
$$ y = [5105, 3844, 2326, -910, -4680, -3494, -1447, -632, 674, 237, 213, 2348, 1468, 3840, 5021, 3099, -1413, -3761, -29, 1023, -1927, -2093, -1965, 173, -145, -1570, -1660, -3434, -3693, -1792, -1226, -872, -2151, -1128, 2287, 5328, 6582, 4299, 1667, -256, -1357, -71, 697, -1269, -12, 1817, 3092, 1693, -679, -296, 1594, 5155, 6360, 6616, 6169, 5379, 6872, 7721, 3057, -33, -2555, -1434, -2484, -2539, -2128, -6948, -8650, -5595, -5114, -2565, -3078, -1618, 1201, 2207, 2232, 1694, 1660, 1400, -435, 564, 2482, 3669, 3462, 3981, 2963, 4691, 9943, 16527, 20408, 28561, 41524, 52458, 67675, 84417, 106509, 128846, 132086, 127284, 128846, 135087, 130484, 111529, 88436, 69536, 56316, 46599, 34346, 23252, 19776, 15291, 11105, 6259, 7735, 7303, 11402, 10879, 8315, 9052, 12437, 13113, 10944, 8886, 4030, 1777]
17676A777n14J306k192O50J389L038K174l822p89J022J423l27J823J993J152K712
17660A2815L105k57m275k154j013K88N86P84J604J109J667K261K042O073O926
17645C1561O338J0992J7867K6488K8898K4395O091o018j4897k0431j6533j3942
17633H0809l274R214J6472K5948K9092K4520J5267O167k845R37j332p042j2459
17620A81474k5626l0427k5398j8261l543O616J6100K2433J9207J7778r80j6176
17608A43197k3524l1593k8645j9446p645n481p403j894k321l116k383L438p87
17595A2397P88P99j971M14j223p84k242l59K43J410M261K218L32l102k338j728
17579I115k63J160L637j416j633J379Q15M35k568j391k064j786o61o16L888Q06
$$ y = [1777, 1263, 2569, 377, 1027, 2416, 5454, 7628, 3806, 3017, 4039, 5462, 5135, 6958, 8951, 10103, 12815, 15920, 15663, 11388, 9234, 8221, 8509, 9095, 9879, 11483, 12592, 14259, 16520, 18562, 24635, 31561, 37899, 48891, 66758, 93246, 122144, 146539, 152630, 146612, 131715, 111284, 94751, 80809, 77535, 86749, 103221, 129169, 158261, 182781, 198048, 204215, 201370, 202307, 200975, 193933, 181474, 155848, 125421, 100023, 81762, 78219, 84835, 100935, 123368, 142575, 160353, 159373, 143197, 119673, 88080, 59435, 39989, 32344, 26863, 19460, 17566, 15245, 12129, 9746, 13184, 12397, 13185, 13984, 12013, 12427, 11204, 10420, 8178, 7819, 8062, 9472, 13733, 15951, 16283, 13181, 10843, 9115, 8852, 10012, 13649, 12233, 10600, 11979, 12794, 13229, 10661, 9270, 7206, 5420, 4759, 4143, 8031, 8837]
17563H837n08j643k240l417l294J149J453J868J526J569P77P86k22j098m833j587
17547h77K702j03O50M178N3l237m655K363P086K458m760l954K62O00k814k538
17531b586m063K513K856M156J118o06k720K216K298M83J237R52M993M436j836
17516A5447k558J637K288R68j643o06K065J029l84p99M46j964m473j361m97l048
17500F547L347L461K233K96o569j638k811J782Q03N36L97n78r93J17P25j173n87
17483E895j710q40K530N94P69r95o700l03J991N71k22L314K453k992m97J977L306
17466I141L452M34j516m240k439J926L953j957J504N80j289m31K200m84k206n041
17450C587j19M231k3L72n33o13k87L194O400J1012J5697R003q274j3528j1807
$$ y = [8837, 8329, 6686, 4446, 1029, -2265, -1116, 337, 2205, 3731, 5300, 6077, 6863, 6641, 5543, 710, -877, 1825, 1722, 2372, 6550, 6603, 3366, -1289, 1074, 8160, 10618, 5858, 1904, 2166, 2766, -48, -2586, -6649, -4136, -1280, 2876, 3994, 3388, 668, 2884, 5182, 5665, 6902, 7854, 12847, 17283, 15447, 12889, 14526, 16814, 17782, 16139, 15533, 17598, 18627, 18243, 17444, 17890, 15926, 11453, 10092, 9595, 6547, 9894, 13355, 15588, 15884, 9315, 7677, 4866, 6648, 7451, 7987, 8384, 7806, 6813, 6930, 7655, 6482, 5895, 4185, 3345, 5875, 6469, 7238, 6243, -457, -760, 1231, 1802, 1580, 4894, 7347, 4355, 3858, 5835, 9141, 12593, 13027, 11511, 7271, 4832, 6758, 10711, 8754, 10258, 10838, 9549, 9118, 11318, 10834, 8628, 3587, 3468, 7699, 7676, 8048, 7515, 6902, 6615, 9809, 16209, 27221, 42918, 51921, 43647, 30119, 18312]
17435A8312p507k977n368K06R3q58r08k515k754K203L929k619k112J514J199Q76
17419G14L42J409L375N42J045J918O4m098j611r46j018k307K125M91m89j515k701
17402b660K056L15J8j002R25K463K113Q0J369N64m49j150l477M48K597k2j236
17385B952J383K35K632P69l02K34m007m574L19j376M38k003j929j003K6K54J904
17368d048L250J933m57p11j247k844J149N41Oq94k060O49L321L983L205L948Q89
17351A0613J396J14K90j313MO59j708q51j121j367j7K728M457K615J478l750l166
17334A1061K078L694R00K671J638o77J12j506J613K336K716K794L235J744P27
17319C5136J910M695J813k363m173j205j072j466J693M7J28K009L720K961M986
$$ y = [18312, 10805, 7828, 2460, 2666, 2759, 1901, 993, -1522, -4276, -2073, 1856, -763, -2875, -1361, -162, 714, 1056, 2465, 5840, 6382, 7427, 9345, 9409, 5311, 3700, 2754, 1736, -571, 1554, 2045, 1556, 41, -2660, -604, -289, -271, -1273, -348, 2115, 4228, 4308, 5677, 6241, 5792, 4642, 1165, 1613, 4210, 4188, 2952, 4335, 4570, 7202, 7971, 7669, 7903, 3896, -678, -359, -1735, -1297, -3300, -5229, -6232, -6206, -5952, -4048, -798, 1135, 678, -33, -1280, -4124, -2975, -2434, -2428, -3322, -5382, -4733, -1412, 2571, 5776, 9724, 10613, 12009, 12123, 12413, 11100, 11104, 11763, 10055, 9204, 8083, 6716, 6699, 9427, 13884, 16499, 17977, 14227, 11061, 13139, 16833, 17733, 20404, 22042, 21365, 21477, 19971, 21584, 23920, 26636, 29430, 32665, 34409, 35136, 37046, 41741, 43554, 41191, 37018, 35813, 34741, 33275, 34968, 35015, 35143, 37152, 40872, 43833, 48819]
17304D8819K708R0P99j176k361l933m415l009k530K71o50J16J380L510M095L94
17288D4108J669k363o768p023n439P92J938k235j34L358J495o97l76L634J912
17273C3871o58k807l018J35k577o625O66J325j81L54N399l69K659K387n49l382
17257B6630l151n70n27J076q98p58j995p21L340N372P785k424j920K818L936P92
17241C8785J553R36J00L505Q139J0982J2485K7067L5753M0110M0463L9940L0246
17228B90064J6615N798o649j5305j7910r569K291J7646K9155L8539M5856M6544
17216D43075L3274K0962Q388l120j5846l3506l8551l6487l6583k7551j8309k789
17204B92957J0583J7245J9501J4794l2j6417k8124l5579l9009l4152l3791l1214
$$ y = [48819, 51527, 51617, 52416, 51240, 48879, 44946, 40531, 37522, 34992, 35263, 34613, 34729, 36109, 39619, 43714, 44108, 45777, 43414, 36646, 29623, 24184, 24976, 26914, 24679, 24545, 27903, 29398, 28701, 28325, 31959, 33871, 33213, 30406, 27388, 27523, 24946, 18321, 18987, 20312, 20131, 20485, 25884, 25515, 28174, 30561, 30012, 26630, 23479, 22909, 22382, 23458, 22560, 21802, 19807, 19086, 22426, 27798, 35583, 33159, 31239, 34057, 37993, 38785, 40338, 41274, 41374, 44879, 53018, 64000, 76485, 103552, 139305, 179415, 219878, 259818, 290064, 306679, 312477, 305828, 290523, 272613, 263044, 265335, 282981, 312136, 350675, 396531, 443075, 476349, 497311, 505699, 502579, 486733, 453227, 414676, 378189, 341606, 314055, 295746, 292957, 303540, 320785, 340286, 355080, 355048, 338631, 310507, 274928, 235919, 201767, 167976, 136762]
17192A36762k1523j5084j3574q912l434k099j856j928J711L102k454k287K300
17179G0724J748l303j217J062j328m030k707j334J59M74P75P5M817K643m31j852
17163F6275j280K000l227n678m784k029k994J022M362K587J324J730J563Q42J680
17148F3393n88l371J821j125K41K912J597M476N731M411j113n47N084M573N462
17133I2957L292J933M434L25K003J438N280Q421P617Q091J2591J2628K2943L5622
17119B19575M4609O3584P7526Q1023M7471O460l2097n5217m9274l2932p547K3144
17107C86325M8947P0871Q4830Q4991O0824L8750K3129K1987K4163P728j4552m2278
17095G95715o1373m4487j2290K6458O5889R8973J30708J37909J18620N6519O062
$$ y = [136762, 115239, 100155, 86581, 77669, 74235, 72136, 70280, 68352, 70063, 73165, 70711, 68424, 70724, 72472, 69169, 67952, 69014, 67686, 63656, 60949, 59615, 59774, 60248, 61023, 61098, 65915, 68558, 68127, 66275, 64995, 66995, 63768, 58090, 53306, 51277, 48283, 49305, 53667, 56254, 57578, 59308, 60871, 61713, 63393, 62805, 59434, 61255, 60130, 60371, 63283, 64880, 69356, 75087, 79498, 78385, 77838, 82922, 87495, 92957, 96249, 98182, 102616, 102941, 104944, 106382, 111662, 120083, 127700, 135791, 148382, 161010, 183953, 219575, 264184, 327768, 405294, 486317, 533788, 540248, 508151, 452934, 403660, 370728, 363181, 386325, 435272, 506143, 590973, 675964, 736788, 775538, 798667, 820654, 844817, 852545, 837993, 795715, 734342, 689855, 677565, 704023, 769912, 868885, 999593, 1137502, 1256122, 1312641, 1318703]
17084A318703k5635k9782p152K7545O9051J12091J60617J97735K37042K96909
17074B357124L78672N10377P21922J063235J634135K547392L748502M740817M915175
17065B2617351L521349R09740j716429l780031m083701l148361j541361K63523
17057A3042080K084567L805511M957210N090415L687171J904489N17848j8691
17049C5070600L19407m4171j553275l386710n109553n251400m138408k351184
17041A3555306l94401J512408L248266M329500M251962K314792n24776l311956
17033B4981101n157687n194014m216117k905764j850175j191318q13669n84968
17025C067389m31953l25493k56146k14780j82250j57020j40303j24688j07688
$$ y = [1318703, 1293068, 1263286, 1256134, 1283679, 1352730, 1464821, 1625438, 1823173, 2060215, 2357124, 2735796, 3246173, 3968095, 5031330, 6665465, 9212857, 12961359, 17702176, 22617351, 26138700, 27048440, 25332011, 21551980, 17468279, 14319918, 12778557, 13042080, 15126647, 18932158, 23889368, 28979783, 32666954, 34571443, 35089291, 35070600, 35390007, 35345836, 33792561, 30405851, 25296298, 20044898, 15906490, 13555306, 13160905, 14673313, 17921579, 22251079, 26503041, 28817833, 28293057, 24981101, 19823414, 14629400, 10413283, 7507519, 5657344, 4466026, 3652357, 3067389, 2635436, 2309943, 2053797, 1839017, 1656767, 1499747, 1359444, 1234756, 1127068]
17016A127068q8276o6226m7545l8240l6328m4455n7807o5448o5890o3484n6229
17005D97140m5420l4413k3333j8792k2385j8801j8206j6097j4948j0009j1422
16994B63314o414o178p605m575m387k928o781q066q372m633m805j0322o885q300
16980A73063p722j573J03k206j766j37L04r468j0206q384o118k357m055n325o16
16965A13537J647l26l064l605l023L25o84l36n09n096k879l50j021k073k963R48
16949I0528K34l280l18k283M954O501L599L705J585o39K550m01l685p670o477
16934H8903l108j481q16K448L783M893N644K549p76j886k697o402m486o854m450
16919G5264N60m34k472k701j91K522N138O872K355J241l489n560q840n564n298
$$ y = [1127068, 1038792, 972566, 925021, 886781, 850453, 805998, 748191, 682743, 616853, 553369, 497140, 451720, 417307, 393974, 375182, 352797, 333996, 315790, 299693, 284745, 274736, 263314, 256900, 250722, 243117, 238542, 234155, 231227, 224446, 216380, 208008, 203375, 198570, 188248, 181363, 173063, 165341, 163768, 163871, 161665, 159899, 159762, 160066, 150598, 140392, 132008, 125890, 123533, 119478, 114153, 113537, 115184, 114858, 111794, 108189, 105166, 105491, 104807, 104471, 103962, 98866, 95987, 95637, 94616, 92543, 89580, 90528, 90762, 87482, 87164, 84881, 89835, 96336, 99935, 103640, 105225, 104586, 107136, 106735, 103050, 95380, 88903, 85795, 84314, 83498, 85946, 89729, 94622, 100266, 102815, 102039, 100153, 97456, 91054, 86568, 79714, 75264, 75824, 75390, 72918, 70217, 70026, 72548, 77686, 84558, 86913, 88154, 84665, 79105, 70265, 64701, 59403]
16904E9403m737j082q77L065N086K267K487j587m128L709K542M165L550K595J426
16889G7884N609J4276K0765L1982N0760O9881P7920O5319K0234k9115o1982o5104
16877B78429m8538k6159o66J8418M4586N7851N7415K7743j8231n4963o5972n4080
16865B15833l2059j0259N510K1775M5049O5552P1829N6584J4768l3915p1134p1783
16853B77750n2037k9344M43K7654N1150O5068N6853K0399k5442o4898q1514p1028
16841A75054n0447l1384k1552r414p208o634n39M01n765n068n631m149k320R91
16827B6335j158j046k569l211j293O45k96j693J297k115n08J583l201J606O39
16812A5015j301J134M487N92k936l031j187k417K725J185k093P73L252M016K228
$$ y = [59403, 54666, 53584, 52707, 55772, 60858, 63125, 65612, 64025, 59897, 63606, 66148, 70313, 73863, 76458, 77884, 83493, 97769, 118534, 150516, 201276, 271157, 349077, 414396, 434630, 405515, 343533, 278429, 229891, 203732, 203066, 221484, 266070, 323921, 381336, 409079, 390848, 335885, 269913, 215833, 183774, 173515, 179025, 200800, 245849, 311401, 383230, 439814, 454582, 420667, 349533, 277750, 225713, 196369, 196812, 224466, 275616, 340684, 397537, 417936, 392494, 327596, 246082, 175054, 124607, 93223, 71671, 62257, 55049, 48415, 47876, 48277, 42512, 37444, 31813, 27664, 25344, 26335, 25177, 24131, 21562, 18351, 17058, 17703, 17407, 15714, 17011, 14896, 14388, 15971, 12770, 14376, 15015, 13714, 14848, 19335, 19927, 16991, 13960, 12773, 10356, 13081, 14266, 12173, 12946, 16198, 20214, 22442]
16797B2442o97r62K03K154N622Q679J0082J6952K5657L1515K8092J6724l251k4673
16783A38539k9553k8581j6377j0288p252l925k224K249L342O728J4969J9891L1834
16770A19352L6511K7128R370L276O935J1077M700j1083k9346l3678l2084k1136
16758I1022j2127j0213q360o787k158Q76L617J3453J9827K6517L5003K8540L70
16745A79580k3250k7949k7812k2931j4497q587n761o348m457l617j143K32L003
16732C6463J145K70k820J182r44j592j032k400j872o46n31J175j779K914M757
16717C4290J384J281R20J537N353O967Q346J3282J1876Q022M190J1418J6415J1399
16703A36680o273q449k250N12l546k992K065N19J875J0502J5680M811r073j0519
$$ y = [22442, 21745, 20783, 20986, 23140, 28762, 37441, 47523, 64475, 90132, 121647, 149739, 166463, 163212, 138539, 108986, 80405, 64028, 53740, 46488, 42563, 40339, 42588, 45930, 52658, 67627, 87518, 119352, 155863, 182991, 192361, 195637, 202572, 213649, 218349, 207266, 177920, 144242, 112158, 91022, 78895, 68682, 60322, 53535, 51377, 52253, 55870, 69323, 89150, 115667, 150670, 179210, 179580, 156330, 128381, 100569, 77638, 63141, 54554, 48793, 42445, 37988, 34371, 33228, 33460, 36463, 37608, 37878, 35058, 36240, 35296, 33704, 32672, 30272, 28400, 27754, 27223, 28398, 26619, 29533, 34290, 35674, 36955, 37875, 39412, 44765, 51732, 60078, 73360, 85236, 93258, 97448, 108866, 125281, 136680, 130407, 121958, 119708, 120220, 116674, 113682, 115747, 116266, 118141, 128643, 144323, 149134, 140061, 129542]
16689A29542k34K254L33j444J97N650J1621P937n734j4718n075J412j863k881
16675A26997J643K048k914N396Q330l102j6533j7497p914q078j5937j7440j4440
16662D0559q902m594k422k78J078M01j237m745j843L711j243k216p88r3r57q63
16646A5568P63n614Q89L573K527m12n49K085J279J035q37J60Q70N55l491M2n71
16629A7872j316J778j79P76j776n49N521O95k079j125rr41l271J210j556j426
16613A3625J497L95k95R13J417N206j381m411m795n259K26L184Q00J306K222k616
16597A2034l11j300k96m285m10J81m064K322N93j238n415K75L911J917l604k072
16581a762K437K572N405M13m672k892l172l831M236O977L154l642K101L7K074
$$ y = [129542, 129308, 131562, 131895, 130451, 130648, 136298, 147919, 155856, 150122, 135404, 130329, 131741, 129878, 126997, 128640, 130688, 127774, 133170, 141500, 138398, 121865, 104368, 96454, 88376, 72439, 54999, 40559, 31657, 27063, 24641, 24363, 25441, 25842, 24605, 19860, 18017, 21728, 20485, 18269, 17481, 17388, 16431, 15568, 16331, 10717, 11606, 15179, 17706, 17294, 16745, 18830, 20109, 21144, 20307, 20467, 21337, 21892, 18401, 18443, 17872, 16556, 18334, 18155, 18931, 17155, 16606, 22127, 22822, 20743, 19618, 19609, 18668, 15397, 16607, 15051, 13625, 15122, 15517, 15222, 16135, 17552, 22758, 21377, 16966, 12171, 6912, 7138, 10322, 11122, 12428, 14650, 12034, 11723, 10423, 10127, 5842, 5432, 5613, 1549, 3871, 4464, 3226, -2189, -1914, 1997, 3914, 310, -1762, 675, 3247, 8652, 9065, 4393, 1501, -1671, -5502, -1266, 5711, 8865, 5223, 7324, 7361, 9435]
16566I435o1L357K721l819l810q95m218k314N56M304M841j805j880m205J380M058
16550G645L667O35j774j217k597o67q68j313k987j265J322J492J903k73j498L84
16534B589O845O718q15m042k577l487p30L058J90j867k022J131K064j781m238
16519A036k342N916P431P780K987J085L810m41j025m5J572N118J837K279L534
16504D0532j04l359n026l71J400j230K175L062O44k950K463N607M941L475Q581
16489E9840J3076R437J3404K3883K7268K6376J9447J042j6973k9177l1193j6237
16477A00193l248L785J4379K2716K7560K3624J8922J3632O475M253N630J0273
16465B48194n681k6912l4174k3299j6924j0517p78O762J5916K3365K4148Q418
$$ y = [9435, 9374, 12731, 15452, 11633, 7823, 6928, 2710, 396, 952, 5256, 10097, 8292, 6412, 2207, 3587, 7645, 11312, 11947, 10173, 8956, 6359, 5692, 4824, 3511, 524, -741, 581, 2073, 3976, 3703, 2205, 2589, 9434, 16152, 15337, 11295, 8718, 5231, 4501, 7559, 7749, 5882, 3860, 4991, 7055, 5274, 1036, -1306, 4610, 12041, 19821, 22808, 23893, 27703, 27262, 26237, 26192, 27764, 32882, 34719, 36998, 40532, 40428, 37069, 32043, 31672, 33072, 31842, 34017, 37079, 37723, 34773, 37236, 42843, 47784, 51259, 59840, 72916, 82353, 95757, 119640, 146908, 173284, 192731, 193773, 176800, 147623, 116430, 100193, 96945, 100730, 115109, 137825, 165385, 189009, 207931, 221563, 228038, 232291, 237921, 248194, 242513, 215601, 181427, 158128, 141204, 130687, 129909, 136671, 152587, 175952, 200100, 208518]
16453B08518j0644k5093l3228k8301k1079j0717p736n661o912m171l475k211j573
16440D7717l89j765k564M19J684L044L7K296k107K471K885P66N199Q798M277l832
16424F8936P13M85n051l244m210l617l189j667j420k261R1N735N366L759J679
16409F2105j763J089j899J395N194j18m806n506l479n680m898p93M450N167L525
16394E3983N380N688K174m4j977m665j92p51m53J298K459K507M6m226k121r79
16378E8127l304n283m735L28N144P310M190M123M367R13M449L639K805k19k965
16363G8889J62j273J37l3M656L806k217k769j540M516M445M386P788J0321K0004
16348A31278L1095M9388P6554J19590J36078M7006r2854j30370r5713n7809l3507
$$ y = [208518, 197874, 172781, 139553, 111252, 90173, 79456, 71720, 66059, 59147, 54976, 51501, 49290, 47717, 47328, 45563, 42999, 43418, 45102, 48146, 48183, 50479, 48372, 50843, 53728, 54494, 59693, 68491, 72768, 68936, 69649, 70134, 65083, 61839, 57629, 54012, 50823, 49156, 47736, 45475, 45566, 51301, 56667, 60426, 62105, 60342, 61431, 59532, 60927, 66121, 66003, 61197, 55691, 52212, 46532, 41634, 40841, 45291, 50458, 53983, 59363, 65051, 67225, 67181, 65204, 60539, 60347, 59596, 59143, 60441, 62900, 65407, 65453, 61227, 59106, 58127, 54823, 49540, 44805, 45133, 50277, 57587, 61777, 65900, 70267, 71180, 75629, 79268, 82073, 81854, 78889, 79051, 77778, 77915, 77882, 82538, 86344, 84127, 81358, 79818, 84334, 88779, 93165, 100953, 111274, 131278, 162373, 211761, 288315, 407905, 543983, 590989, 498135, 367765, 272052, 214243, 180736]
16337A80736j8993p141q4K784J5303K6352M5798O7296R5708J23743Q2483n3277
16325E60708j16231q1036k2112L4900Q0668J04678L4567r0367j20409q7041n3648
16314B44677l1213j7683j0341j375N229J7911K5543L5754N9448R1475J16196P5502
16302F11123n0795j16919q8844n7945l0302j1763r351j0186p097j50N491O697
16290B39959P432K694L369J633P188J4345J7109J9255K6244L2745M0184M8210
16278D60367N5582N4761M2405K9481K0101Q148M232J6772M2262O6077Q8596J17207
16266A005991J55071J89679J95758J82876J88444K45708L51681N40793Q53490
16257C909491J372905K206467L403854M610184M639669K570223j155525m019616
$$ y = [180736, 161743, 154602, 154518, 157302, 172605, 198957, 244755, 312051, 407759, 531502, 613985, 560708, 444477, 363441, 341329, 376229, 456897, 561575, 596142, 505775, 385366, 298325, 244677, 213464, 195781, 185440, 184065, 189294, 207205, 232748, 268502, 327950, 419425, 535621, 611123, 560328, 443409, 354565, 296620, 266318, 254555, 245204, 235018, 227921, 227771, 233262, 239959, 247391, 250085, 253454, 255087, 262275, 276620, 293729, 312984, 339228, 371973, 412157, 460367, 515949, 570710, 613115, 642596, 662697, 670845, 675077, 691849, 734111, 800188, 888784, 1005991, 1161062, 1350741, 1546499, 1729375, 1917819, 2163527, 2515208, 3056001, 3909491, 5282396, 7488863, 10892717, 15502901, 20142570, 22712793, 21557268, 17537652]
16249A7537652m602873l516420k158917j212794o14327j94675J48887M44438P70445
16240F601416J313435K225141L536075M981834N575827M522173K352058J518752
16232C2626711L050410M554862K883980k333919p224284q644619p015569m608240
16224A3289332k843213j737254j005104m26945J37907P83265J668676L018086
16216A2884750M978738P156024P850986N160336p94049o353159q294564o968621
16208A5620441m642333k873587j804752j161815p48936m78992l03874j73314j03368
16199C329470j20118j37125j15254j10959j38189j31632m8016M7263Q6262Q5717
16189B747419J05337J09658P9361J26777K41324L36331M29175O34882J019785
$$ y = [17537652, 12934779, 9418359, 7259442, 6046648, 5432321, 5237646, 5386533, 5830971, 6601416, 7914851, 10139992, 13676067, 18657901, 24233728, 28755901, 31107959, 32626711, 35677121, 40231983, 43115963, 40782044, 33557760, 24913141, 17897572, 13289332, 10446119, 8708865, 7703761, 7276816, 7414723, 8197988, 9866664, 12884750, 17863488, 25019512, 32870498, 38030834, 37236785, 30883626, 22589062, 15620441, 10978108, 8104521, 6299769, 5137954, 4389018, 3910026, 3606152, 3432838, 3329470, 3209352, 3072227, 2956973, 2846014, 2707825, 2576193, 2528177, 2575440, 2661702, 2747419, 2852756, 2962414, 3041775, 3168552, 3409876, 3746207, 4175382, 4810264, 5830049]
16180E830049J606645K493246L532365L804398K470978J787746L143084L786135
16172B8454646N23155k976193k374830m51932k10798o76498L07738J021617L90044
16163B4006949R47933K791367K494890j500853l586990k004781m58238r28813
16155B1761464j625239j637361j096545L62918J445650J38132k012055j870192
16147A5466772o51630l66938p98539l64197K56075P6851K93474J329095J470098
16138A6711061o66532k269080j695315r56967j487142k210553j955671j331641
16130D138160q59828n63953l79400k78007k26206j83469j45223j27217j17772
16121A257085r4284o9217o3065n6855m0516m0519m2908m6323m3204m7334n0180
$$ y = [5830049, 7436694, 9929940, 13462305, 17266703, 19737681, 21525427, 24668511, 28454646, 28977801, 26001608, 23626778, 23174846, 22964048, 22287550, 22595288, 23616905, 24006949, 24954882, 27746249, 30241139, 28740286, 25153296, 23148515, 22690277, 21761464, 20136225, 18498864, 17402319, 17765237, 19210887, 19349019, 17336964, 15466772, 14815142, 14448204, 13649665, 13285468, 13541543, 13618394, 13911868, 15240963, 16711061, 16044529, 13775449, 12080134, 11123167, 9636025, 7425472, 5469801, 4138160, 3278332, 2714379, 2334979, 2056972, 1830766, 1647297, 1502074, 1374857, 1257085, 1162801, 1093584, 1030519, 973664, 933148, 892629, 849721, 803398, 760194, 712860, 662680]
16110F62680m1815l0990k7301k9152l1326k1919j7049j9552k4618k5507k2951
16099C70500j7545j2736p812j3231q933p930q288n138O17j741k462L88l241o058
16085B76390j1684j5942j6630j1130m678q385j0458q210k292k720k807m193n954
16072A71307n816k326L811L378k78q51K06l677p003m676o065l522n515l684K154
16057A37443j052l471k128L630M564N185M224N220k92N65J459K297k026m161l329
16042A48128m135l804l823j561j82l638r39P9j94l843L103Q764L741k004j451
16027A38241k589j426o804o087p021j3733q175O93j192l666k314M052L034j437
16013I1576j716J285j398m143n686k525J96m671m387j559J479k615m021k156m874
$$ y = [662680, 620865, 589875, 562574, 533422, 502096, 480177, 463128, 443576, 418958, 393451, 370500, 352955, 340219, 332407, 319176, 310243, 302313, 294025, 288887, 289504, 287763, 285301, 285689, 282448, 276390, 264706, 248764, 232134, 221004, 216326, 207941, 197483, 189273, 186981, 184261, 181454, 177261, 171307, 165491, 163165, 166976, 170354, 170076, 169225, 169431, 165754, 158751, 154075, 148010, 144488, 138973, 135289, 137443, 136391, 132920, 130792, 134422, 138986, 144171, 148395, 153615, 153323, 153888, 155347, 157644, 155618, 151457, 148128, 143993, 140189, 136366, 134805, 134623, 130985, 130046, 130125, 129931, 126088, 129191, 137955, 141696, 139692, 138241, 135652, 134226, 127422, 121335, 114314, 100581, 92406, 93099, 91907, 88241, 85927, 89979, 93013, 91576, 89860, 91145, 89747, 85604, 79918, 77393, 77589, 72918, 68531, 66972, 68451, 65836, 61815, 59659, 54785]
15998E4785k673q48j67O94j326P81k360k692k45K73J298k736Q23K347o70K259
15982D9543o081k564Q20K395j360n49L320m23k23k672k563J265k273k082M5J898
15966C8496j071n90j75l58q34J225Q1o79j14j526j513k840l217k831J462J905
15950B7421K67J402J626J200J041J914N55k723m639l048m78k104l06J381l500
15935B0009j400J410P57J674o87k118N767O756L327M373K699n62L190j315k932
15920D0948o756q478k702k275k431j480m469m095J300L811M774N268O347P588
15906C7350K402J84n913o732m717k057O58j718m194O29p59q80R38J716K303J797
15890B1007l612k364K207K321j583j896j1J047q72j45j636o99J716M519K072J659
$$ y = [54785, 52112, 51264, 51097, 51791, 50465, 51246, 48886, 46194, 45949, 46222, 47520, 44784, 45607, 47954, 47284, 49543, 43462, 40898, 41718, 44113, 42753, 42204, 45524, 45101, 44878, 42206, 39643, 40908, 38635, 36553, 36598, 38496, 37425, 36835, 36660, 36302, 35468, 36693, 36774, 36095, 35981, 34455, 32942, 30102, 26885, 24054, 25516, 27421, 27688, 29090, 30716, 31916, 32957, 34871, 35426, 32703, 28064, 25016, 24538, 22434, 22128, 23509, 20009, 18609, 20019, 20776, 22450, 21763, 19645, 25412, 32168, 35495, 39868, 42567, 42005, 45195, 43880, 40948, 34192, 25714, 23012, 20737, 18306, 16826, 12357, 8262, 9562, 13373, 18147, 23415, 29762, 37350, 39752, 39936, 34023, 27291, 22574, 20517, 21175, 19457, 15263, 15892, 15133, 14253, 15191, 16907, 19210, 21007, 17395, 15031, 17238, 19559, 17976, 16080, 16069, 17116, 16244, 16099, 14463, 13764, 15480, 19999, 22071, 23730]
15874B3730j233K936k627j517M458K453o499n349L096L952j296j655j172J414
15860B0691m18O12N493R76k679l659M676Q76n606p43M829J065o326m079J293j230
15844A5771o131j861M083j543j922Q67L663l094J859M835K863l272l188m3k831
15829A0056l673K250L918j742k279j594l074l663j705K085O56J816Q57j391J04
15814B621J714q88r8R82Q07J628K099K296o88k111k7M47R36j876j321J887O19
15797I027K511R49k481n441m362m07R69L456J295j366N39k442N08J453J186K075
15781G469j85j366J924L915l563l888J312N52k224k972n811k833k860L081M183
15766c266J487j310L605p98p20r79J626j836J98O160J501j060m310m384n271o1
$$ y = [23730, 22497, 25433, 22806, 21289, 25747, 28200, 21701, 16352, 19448, 23400, 22104, 20449, 19277, 20691, 20273, 20885, 26378, 27354, 24675, 21016, 25692, 26568, 20962, 20219, 25048, 26113, 19787, 15708, 17001, 15771, 9640, 7779, 11862, 10319, 8397, 9264, 12927, 9833, 11692, 16527, 19390, 16118, 12930, 12887, 10056, 6383, 8633, 12551, 10809, 8530, 6936, 3862, 199, -1506, 579, 1235, 3051, 3908, 2517, 2621, 4335, 3447, 3349, 4331, 5138, 6766, 8865, 11161, 10473, 8362, 8335, 8782, 9718, 7842, 6521, 8408, 9027, 11538, 12487, 10006, 4565, 203, -204, 765, 4221, 5516, 4150, 4689, 2247, 2755, 4208, 5394, 7469, 7284, 5918, 7842, 11757, 8194, 4306, 5618, 6170, 3946, 974, -4837, -7670, -10530, -7449, -3266, -1779, -3089, 516, -282, -1002, -1981, -355, -2191, -1993, 4167, 5668, 4608, 298, -4086, -9357, -9418]
15750i418J437L607P651K751k054k65j097k729L81L77K83k799RK313J689k306
15734a70L662L405J653o11k944j597J142J923L81J237k592M0J143L880J683K662
15718A4897L15k004J575M370M002J0945J7254K6480L3746L2589J8521q602k9694
15705A24394l1448k5762j7507j1317o046l203j366K389P100J0298J7778K9600
15693I4910L6978L6162K5941R187n756l341K01n407j9730l1801l6317k7610k0934
15680E2483j1318p886l779J205L103J891Q582J6931K2423K8901K8084J1463l707
15667A48376k3478l2582k7170j9851j3877o507n295k082K39J058k599n67q15j232
15653A3618Q21o6M68j368P84q26M427Q678N776J2303J6384J4622R414P506J7627
$$ y = [-9418, -7981, -4374, 3277, 6028, 3974, 3709, 2612, -117, 264, 641, 924, -1875, -1866, 447, 2136, -170, 3492, 6897, 8550, 7939, 4995, 3398, 4540, 6463, 6844, 8081, 5489, 5529, 6672, 10552, 12235, 14897, 15212, 13208, 14783, 19153, 23155, 34100, 51354, 77834, 111580, 144169, 162690, 154088, 124394, 92946, 67184, 49677, 38360, 32314, 29111, 27745, 30134, 37234, 47532, 65310, 94910, 131888, 168050, 193991, 203178, 197422, 194081, 194282, 188875, 169145, 137344, 101027, 73417, 52483, 41165, 33279, 29500, 30705, 33808, 35699, 44281, 61212, 83635, 112536, 140620, 152083, 148376, 124898, 92316, 65146, 45295, 31418, 24911, 19616, 17534, 17773, 18831, 16232, 15665, 14850, 13618, 14439, 14373, 14841, 13473, 14257, 13431, 17858, 26536, 32312, 44615, 60999, 75621, 85035, 92541, 110168]
15638A10168J8638K520j3025q718j81j71J492K88o82P96P866J4139Q349q962j1638
15623A20879j418K111J105m396q387j250P129J4594K738j3150j3356m019M607
15610A07187l6n201o029m73M805Q599O996n492j4167j3229r921j1715j1935j1787
15596C7602r644o084l747m625n340k023p46j160N73L21J541N71k123j996r51K348
15580D517K013K769M90l806l547P36K27J049k278m05K086l94k493q46N66K545
15564C229J515l132l520j009m072j223P30J685J117J832k02j553J715L157k318
15549b049l455j028L240J984j939m52R39Q93J370k469l92J031J133J208J93N2
15533B59m875p87Q21Q81K896L723J995l640k850l360l806L703N460K267k414m929
$$ y = [110168, 128806, 131326, 118301, 109583, 109402, 109231, 110723, 111011, 110329, 111125, 118991, 133130, 141479, 132517, 120879, 119461, 121572, 122677, 118281, 109894, 108644, 115773, 130367, 133105, 119955, 106599, 102580, 107187, 107151, 101950, 95921, 95448, 100253, 108852, 115848, 110356, 96189, 82960, 73039, 61324, 49389, 37602, 27958, 21874, 18127, 13502, 8162, 6139, 5393, 4233, 4806, 5127, 6668, 7239, 5116, 3120, 2169, 4517, 6530, 9299, 9789, 5983, 2436, 3172, 3399, 4448, 2170, 1765, 3851, 3457, 964, 118, 684, 3229, 4744, 1612, -1908, -2917, -6989, -8212, -7482, -5797, -4680, -2848, -3050, -4603, -2888, 269, -2049, -5504, -6532, -3292, -1308, -3247, -3699, -2760, -1867, -497, -2966, -3358, -2327, -1194, 14, 207, 259, -4616, -5403, -4582, -3701, -805, 2918, 4913, 1273, -1577, -4937, -8743, -5040, 420, 2687, 273, -4656]
15517d656k734J185q02j34J420J927L448r73n34J32J972l151l129J10L101J634
15501a184J73j298O5J274j967n571j731nL672M636p14l061k697J816J205k244
15485g631J713R30L28N52Q89N95j453J892K288K414J128m747k797r65k579J185
15469f258J283J246M51L24j339k82j058j560k464j436k045j26J453M852K156L98
15453d405m426P51K016K736n47r67J156k286J664j038J30J232L966m74j991q81
15437c364J722j519m281j272M439J547J056L054n29k628k720J95J958N42j134
15422b934l10M022p15k757J083J05k392j457M46R19N35K661l357L07J531l128
15406e441l828J181j938n60L169M36L370K615K463k573j757j20m0N408m3m604
$$ y = [-4656, -7390, -6205, -7007, -7141, -5721, -3794, -346, -1319, -1853, -1721, 251, -2900, -6029, -5919, -2818, -1184, -1011, -2309, -2244, -970, -2937, -8508, -10239, -10244, -6572, -1936, -2650, -5711, -8408, -6592, -5387, -7631, -5918, -4988, -4660, -4108, -3219, -2624, -4077, -2185, 103, 2517, 3645, -1102, -3899, -4864, -7443, -6258, -4975, -3729, -3278, -2954, -4293, -4575, -5633, -7193, -9657, -11093, -13138, -13264, -11811, -6959, -4803, -4405, -8831, -8080, -6064, -3328, -3875, -4842, -3686, -5972, -4308, -5346, -5216, -3984, -18, -492, -2483, -3364, -1642, -3161, -7442, -8714, -4275, -2728, -1672, 1382, 853, -1775, -4495, -4300, -2342, -1800, -2934, -3244, 778, 63, -2694, -1611, -1506, -3898, -5355, -4909, -3990, -3455, -794, -4151, -3844, -2313, -5441, -9269, -8088, -10026, -10586, -7417, -6981, -3611, -996, 1467, -1106, -2863, -2983, -3023, 2385, 2342, -2262]
15390b262l852m392K442K353L524Q66l438k469N48L543K363j163O13R47k448p97
15374c622J085n43j687jk015j205l18j717n00L921M568j32P58K658j534m700J48
15357d836k065m86L94J151l64k11K739L23m416l10J52k37j177j884J07P54m30
15340a0796J435K65K664M68P79n15k36r55J234j402O86J28o59j312P9l688k250
15323a4075Q46Q92N64M46l180KL446L427J284O55K517l71k603j239J74o90K189
15306e716K093r6k300q64l40k237l256K494L110L42j244k578j59J48k366Q99J831
15289a0239j172J992L398N36K824r46k915n237k370K952J807R6j13J35l94l37
15273i983j533R51M093j087k954j381r60Q91M224N51J203M334j256k894k655k213
$$ y = [-2262, -6114, -10506, -8064, -5711, -2187, -1321, -4759, -7228, -6680, -3137, -774, -1937, -1324, -377, -2825, -3622, -2537, -3080, -4767, -4768, -6783, -7988, -8306, -10023, -10523, -6602, -2034, -2166, -1408, 1250, -284, -4984, -4836, -6901, -7387, -6993, -5842, -6206, -6417, -3678, -3355, -7771, -8081, -7929, -8166, -9343, -11227, -11120, -10366, -10796, -9361, -9096, -6432, -5964, -5185, -5700, -5936, -6891, -5657, -7059, -6373, -6245, -6904, -8216, -8137, -11825, -14075, -13229, -12337, -11773, -11327, -14507, -14505, -11059, -7632, -6348, -5693, -3176, -3547, -6150, -7389, -7215, -7905, -5716, -3623, -3719, -6019, -6883, -7223, -9460, -12716, -10222, -7112, -6770, -8014, -10592, -10751, -10603, -12969, -12070, -10239, -11411, -9419, -6021, -5485, -2661, -3607, -6522, -11759, -14129, -11177, -9370, -9274, -9387, -9252, -9646, -9983, -11516, -10565, -6472, -7559, -10513, -11894, -12854, -11963, -7739, -7188, -5985, -1651, -2907, -5801, -8456, -10669]
15257a0669J938K834Q92r51R50P02N95J078k85k437r62L63p79k149k61J004l617
15240a1754r66O96J513o63K81J230J976m28q79N26L531K658n98k484k199k260
15224i820N21L081p23l695L242L132j61m057K03j3J127M12R69K938Q37O85k271
15207c593m715j011J184P67M67q66n95o28j980q69J869J176k27k114L7l84J307
15190a0175j027O58j26o37k321q6l97N74m46L987N975k395k655j019P98O66n15
15173i141J617j083K399J471j433k254n17m134L73J560K524J032J049R71Q79M92
15157d195l515J815k220k186j073p19j591Q19O32K287K882J546L58J731p95m010
15141h234j617K925N54K60M66n86j906q01l24k261r52M064J833j727K863J417
$$ y = [-10669, -8731, -5897, -5005, -5956, -5006, -4304, -3709, -2631, -2916, -5353, -6315, -5952, -6731, -8880, -9141, -8137, -11754, -12720, -12024, -10511, -11174, -10893, -9663, -7687, -8115, -8994, -8468, -4937, -2279, -2877, -5361, -7560, -9820, -9299, -6218, -6941, -10636, -7394, -4262, -4423, -8480, -8277, -8290, -7163, -6751, -5782, -2844, -2007, -1322, -3593, -8308, -9319, -8135, -7368, -6901, -7767, -8362, -8990, -10970, -11839, -9970, -8794, -9021, -11135, -11098, -11482, -10175, -11202, -10544, -10670, -11307, -13628, -13714, -14111, -13537, -13983, -9996, -4021, -6416, -9071, -10090, -9292, -8626, -9141, -7524, -8607, -6208, -4737, -6170, -8424, -8941, -13075, -12702, -11142, -8618, -7586, -6537, -5566, -4687, -4195, -7710, -5895, -8115, -10301, -11374, -12093, -13684, -12865, -12233, -9946, -7064, -5518, -5160, -3429, -4224, -8234, -9851, -6926, -6372, -6112, -5646, -6232, -8138, -8939, -9263, -11524, -12476, -8412, -6579, -8306, -5443, -4026]
15125d026Q30k44k399m106j466P63J259K324L427L435r43k03k583k693k33l478
15109a0336l085j472K493J488j968N20J092M371q27j606K564M88J726K263k123
15094d412k886K9J68k986P78J051J209J137p90n2J169P34l19m348k086J129j067
15077a1542K073L471l68j311j823R32k63J273j615J085M402K158O9J646l03J080
15061I64M79j389l988l150j752O38J184M400J400j309l342j543m55l03r51J371
15045g746L08j756M83J276l593j313M474N07m362P11O61J230M31l317P63J581
15029i662q12R56m2M79L604J154m751l32p51P91j269k248Q61k097k51J671j75
15012a2874K522R71m321M45K92k242J237J662j939r5K843M435m3q34J763J098
$$ y = [-4026, -3196, -3440, -5839, -9945, -11411, -10648, -9389, -7065, -3638, -203, -1146, -1349, -3932, -6625, -6858, -10336, -13421, -14893, -12400, -10912, -12880, -12360, -11268, -6897, -7724, -9330, -6766, -6278, -4552, -2289, -4412, -7298, -7269, -7101, -10087, -9309, -8258, -7049, -5912, -6702, -6754, -5585, -4851, -5170, -9518, -11604, -10475, -11542, -9469, -5998, -6366, -7677, -9500, -8568, -8831, -7558, -9173, -8088, -3686, -1528, -1459, 187, -116, 964, 1443, 54, -3934, -7084, -8836, -8198, -7014, -2614, -1214, -2523, -5865, -7408, -7863, -8166, -9117, -7746, -7438, -9194, -8711, -7435, -11028, -12341, -7867, -7360, -11722, -11011, -10350, -9120, -8689, -12006, -11243, -9662, -10474, -9518, -9560, -9081, -5477, -4323, -9074, -9406, -10157, -9366, -10635, -12883, -12022, -14119, -14370, -12699, -12874, -10352, -9381, -13702, -13257, -12965, -15207, -13970, -12308, -14247, -14342, -11499, -7064, -7107, -7941, -6178, -5080]
14996e080k983k870N5j470k967M25J697J072J824K036O47j37Q12k801j646J538
14980i848P64o2k154J925Q45o47K690j987j861J490n54k086j35K345L696m290
14964i869J485K824j647l845Rl56J102J345M246L532l816k768K505J56j490k022
14948h609j859J535L461J070L32J229k15l944j184J441j775K067R87R11r80K79
14932e254L25k323k448K46r19K480J494J288j867q46K259J834k678o19J105k880
14916h803J90K831l2J57M90l572m653n01l58J961O70L77J174O98J92K464L195
14899c520K780j591k622k010K684M329J262j888l500k342k041K562J96j674k664
14884a0039l470L26L309J176q86K47k682j855J489K738J337J905J339r51l038
$$ y = [-5080, -8063, -10933, -10878, -12348, -15315, -14890, -13193, -12121, -10297, -8261, -7614, -7751, -6939, -9740, -11386, -9848, -9084, -9146, -11300, -9375, -8530, -9177, -6487, -8474, -10335, -8845, -9399, -11485, -11620, -9275, -5579, -9869, -8384, -5560, -7207, -11052, -11043, -11399, -10297, -8952, -4706, -1174, -4990, -7758, -5253, -5097, -6587, -8609, -10468, -8933, -5472, -4402, -4070, -2841, -3056, -7000, -8184, -6743, -8518, -6451, -5464, -4553, -5533, -5254, -4929, -7252, -9700, -9454, -10373, -7893, -6399, -5111, -6978, -7824, -5565, -3731, -6409, -7028, -5923, -8803, -8613, -5782, -5814, -5657, -5167, -8739, -13392, -13893, -14251, -12290, -11620, -11243, -10069, -9371, -9179, -6715, -3520, -740, -2331, -4953, -6963, -4279, 50, 1312, -576, -4076, -6418, -8459, -5897, -5701, -7375, -10039, -13509, -13183, -9874, -8698, -9584, -9337, -12019, -13874, -12385, -9647, -8310, -6405, -5066, -6017, -9055]
14869i055j223M94K386Rj038k63O29K269R91k960k770k689J568L004n53Q00L174
14852e227k263k765j396Q68L55K03j72J913R25k37p77L026l90j965K43M06L675
14835c578J294k012j590M61J131j464O63J572k645R88p04j985j014Q14K144J729
14819d196k124l399p27J541L424Q11k895J79J804Q82j244O96N00L35k26m61l070
14802h170l792j24q81k8K582J078p76j78j979K960J962J219l30q9J715j701j078
14785g610r64n57P94K024R30j389j484j309j097J922K23L019K873J37m142q52
14769g482N03k74j939J051J069P25P8j053j095J184j051p04l35O60L389q98n891
14752a2063k730K490N212K05m1L42p42n55n22j354k508J221M363J98j973m275
$$ y = [-9055, -10278, -9784, -7398, -7389, -8427, -8690, -8061, -5792, -4801, -7761, -10531, -13220, -11652, -8648, -9201, -8401, -5227, -7490, -10255, -11651, -10783, -10428, -10225, -10397, -8484, -7559, -7796, -8573, -5547, -5937, -7902, -7659, -7253, -3578, -2284, -4296, -5886, -5425, -4294, -5758, -5095, -3523, -6168, -5180, -5884, -7869, -8883, -8069, -5925, -4196, -6320, -9719, -10446, -8905, -5481, -4670, -7565, -7386, -5582, -4700, -5944, -5248, -4748, -4413, -4639, -5100, -8170, -11962, -12086, -12967, -12995, -10413, -9335, -10111, -10289, -12268, -9308, -7346, -6127, -6457, -6546, -4831, -6532, -7610, -8574, -9131, -8337, -6313, -5383, -6772, -8256, -9565, -10662, -8740, -8517, -5498, -2625, -2488, -6630, -7482, -6979, -7253, -9192, -8141, -7072, -6347, -6269, -7322, -8417, -7233, -8284, -8988, -9323, -8663, -5274, -6172, -12063, -14793, -12303, -7091, -6886, -6927, -6585, -7327, -7882, -8404, -9758, -12266, -11045, -6682, -6484, -8457, -12732]
14736a2732m223J968K676J196O05K052J307O16J372O38l602l257K870K037Q28
14721e649k619j583P23l490Q77O038l61l486j765o0J834K837k865K101J088l033
14705i413l145L85J547K022K560R10l41J816n63k002q99k742j987L332K121P36
14689e663K50o86q04m060j632j244J177K833j028R14L148j969j844n12R94L234
14673f892L001k12J8K077J123k956m170J142l24Pr37j367J329k723j421K133J483
14656h689k291j971L969M181L94l434j402K861N245j920n129m913j017O755K50
14641g111j467K232J380P2j256m311j060J034J633L672M79j98m57L88k621k275
14625i866J94L94R86l50o10J151L69m77J45m98R08J137J624m13J658n30j852k645
$$ y = [-12732, -16955, -14987, -12311, -11115, -10510, -8458, -7151, -6535, -5163, -4525, -8127, -11384, -8514, -6477, -5649, -8268, -9851, -9128, -12618, -11741, -5703, -6064, -9550, -11315, -11375, -9541, -6704, -9569, -7468, -6380, -9413, -12558, -12173, -10626, -8604, -6044, -5134, -5475, -3659, -4222, -6224, -7123, -9865, -11852, -8520, -6399, -5663, -5413, -6099, -6903, -10963, -12595, -13839, -12662, -9829, -10857, -9943, -6795, -8764, -10608, -11120, -10126, -6892, -3891, -4103, -4085, -2008, -885, -3841, -8011, -6869, -7193, -7186, -8123, -9490, -8161, -10884, -12305, -10172, -8689, -10980, -12951, -8982, -4801, -4407, -7841, -9243, -6382, -1137, -3057, -8186, -13099, -14116, -7361, -7111, -8578, -6346, -4966, -4894, -6150, -10461, -11521, -10487, -8854, -5182, -4703, -4901, -5358, -4970, -7591, -9866, -9672, -9278, -8292, -8642, -9252, -8101, -7732, -8209, -8064, -8562, -7654, -6517, -4893, -5306, -3648, -4178, -6030, -8675]
14607h675j833m67L156j390k282j676L41n08M020j166K52K633J433l074l929j097
14591a4262K371L711J133o43L100J924l802l817j898K878J36l073p07L431K747
14576f771q37j353kM049J869j369j452m757r72j515K858L812m38k11J906J369
14560c814j006k398K91l403o54J233q46K864R73J828J567k548J625J245O84m06
14544b765o214j194K135o05p78m65m62l751L956M574j013j666r10j444J075J262
14528h265R42j058L599J30j718k320J114j388K653K196J301J38N21J71k135j458
14512e577K077L646j654k193j343K373q33j105K05R33J534J894J210k504J386
14497D9J83L64j305j21O25K073J288j963j467k83l980k848l297J577M450L420
$$ y = [-8675, -10508, -10975, -7819, -9209, -11491, -13167, -12826, -13334, -9314, -10480, -10228, -7595, -6162, -9236, -13165, -14262, -11891, -8180, -7047, -7690, -4590, -2666, -6468, -10285, -12183, -9305, -9169, -12242, -12949, -9518, -6771, -7608, -8961, -8963, -4914, -3045, -4414, -5866, -10623, -11595, -13110, -10252, -6440, -6878, -7089, -5183, -3814, -4820, -7218, -6927, -10330, -10984, -9751, -10597, -7733, -6760, -4932, -3365, -5913, -4288, -3043, -2359, -2765, -8979, -10173, -8038, -8643, -9421, -9886, -10348, -14099, -10143, -5569, -6582, -8248, -9158, -10602, -9527, -8265, -7323, -8381, -4782, -4652, -6370, -8690, -7576, -8964, -6311, -4115, -2814, -2676, -2155, -1984, -4119, -5577, -3500, 146, -1508, -3701, -5044, -2671, -3504, -4609, -4404, -3471, -1937, -43, 1167, -1337, 49, 232, 596, -709, -830, -205, 1868, 3156, 1193, -274, -557, -4537, -7385, -10682, -9105, -4655, -1235]
14481a235J661O00k771o123k440m04j444O50K969K300k062j738r81L602K657k96
14465e055n56p22k302K508j009l860J386K077J917k408k212J541K486n54p33K417
14449e079N71p50k262n213l864P88N307M563K85j989m13Q91K9N22l59J436O17
14432d920L94j659J43j509K322J258P80J946J638J03J039j246j136r29L0r23k961
14415e630l017K328L195J008R02K999o15j685k264k87q08j259j003J44Q67K139
14399b986o69q42P76K072k259l108J643K150j288m881k25K162q70L73M441K418
14383a093K172j061k888n38K178l899j876k400n63J17L09j395J804p46j573k17
14367a1669K558j127l819j025k573K705O445Q98M65m92l110J219k806p11K255
$$ y = [-1235, 426, 1026, -1745, -7868, -10308, -10712, -12156, -11506, -8537, -6237, -8299, -10037, -11018, -7416, -4759, -5055, -5611, -6333, -8635, -6127, -7136, -10996, -9610, -7533, -5616, -8024, -10236, -8695, -6209, -6763, -7496, -5079, -4508, -5258, -7520, -12733, -16597, -15809, -10502, -5939, -5654, -7643, -8056, -7165, -7136, -6614, -6973, -5537, -4920, -4526, -6185, -6042, -7551, -5229, -3971, -3191, -1245, 393, 496, 1535, 289, -847, -1776, -1746, -2669, -5630, -8647, -6319, -3124, -2116, -1214, 1785, 1170, -515, -2779, -3066, -3874, -5133, -6136, -5992, -5125, -2986, -3655, -4497, -3721, -1649, -3908, -7016, -5373, -3223, -4511, -9392, -9617, -7455, -8325, -7952, -3511, -1093, 1079, 18, -2870, -3408, -1230, -5129, -7005, -9405, -9968, -9851, -9542, -10937, -9133, -9879, -11452, -11669, -9111, -10238, -14057, -15082, -17655, -14950, -8505, -7607, -7142, -7634, -10744, -9525, -12331, -13042, -10787]
14352a0787O01P38j130j459q55J825J2J72k301J247k53j490k07J397OR59N67k142
14334a3100r88L034L724K277m497k982J035K007L857l464m22j769K238J343l78
14319h085j365K377K435J939j30m70j408j926l943m28K550R38L704L049k377l74
14303c514j036L123l950K06J105J845K649R24m59l09P16j912m286L27Q34J469
14287b268N28m42R82l46j948R27Q53l415q76l28J811O55j15m712k791K338L021
14270f126p19m009K172J123j518k992l690k226J230r73L265L954K492j512l38
14255i867J04k44m80N578L085J08j270l094r22j410r30R20M39J665j011j479k09
14238i017Q35J75j369j515r47J622M0o19R69N85j634N25J660l73l81l451j723
$$ y = [-10787, -10186, -9448, -10578, -12037, -12892, -11067, -11055, -10883, -13184, -11937, -12190, -13680, -13887, -12490, -12484, -11525, -10958, -13100, -14088, -11054, -7330, -5053, -9550, -12532, -11497, -9490, -5633, -9097, -9519, -11288, -9050, -7707, -8085, -9450, -7073, -4638, -2699, -2829, -3299, -4707, -6633, -10576, -11004, -8454, -7516, -3812, -763, -3140, -3514, -4550, -1427, -5377, -5171, -4066, -2221, 428, 1352, 893, 584, 1300, -612, -4898, -4571, -3737, -2268, -1740, -2182, -1200, -1546, -3494, -2567, -1714, -5129, -6005, -6333, -4522, -3867, -3982, -8694, -11485, -9147, -6126, -6845, -10854, -8682, -7559, -9077, -12069, -15759, -17985, -16755, -17728, -14463, -10509, -8017, -9529, -9867, -9763, -10007, -10487, -4909, -1824, -1716, -2986, -6080, -7002, -8412, -9342, -8422, -7983, -6318, -7329, -8808, -9017, -8182, -8007, -9376, -10891, -11838, -10216, -10176, -10795, -9826, -9241, -10875, -10350, -8690, -9063, -9444, -12895, -14618]
14221a4618k07L622L480K589K484P74n15r89M374K057M99l28p76j251J498p36
14205A957p74K338j274j993l398o95L240J810L10l911l952j9L743Q17n39N93L784
14188B037j180J403j610m06O07k100j866k746j705r0J73K363j91P93k001j091
14172g610J846K194Q25k735j586J90q38j07L055J973l670k573K661l089m025j873
14156a5362Q79P60L63K944K147l280l77J136J009j158j337J92J634l9k84L75K790
14139g608j76L65l603N28J855n77J284K449K960k165Q52j79K034j442m750p18
14123h891J753J330J053Q48l359j368J280j160L11O58k25j760n808j157J356K161
14107a2978J521K332K478j659j33J19j479J652K27Q56j194k6l31K106K621k382
$$ y = [-14618, -14825, -11203, -7723, -5134, -2650, -1876, -2391, -3380, 994, 3051, 3550, 3222, 2446, 1195, 2693, 1957, 1183, 3521, 2247, 254, -3144, -3839, -599, 1211, 1521, -2390, -6342, -6361, -2618, -1801, -2340, -1747, 2037, 857, 2260, 650, 244, 851, -1249, -3115, -5861, -7566, -7656, -7483, -5120, -5311, -4518, -6519, -7610, -5764, -3570, -2745, -5480, -7066, -6876, -7714, -7821, -4766, -2793, -6463, -9036, -6375, -9464, -13489, -15362, -14483, -13723, -13360, -10416, -8269, -11549, -11926, -10790, -9781, -10939, -12276, -12084, -10450, -10489, -10773, -10398, -7608, -7784, -7419, -11022, -10494, -8639, -9216, -7932, -5483, -2523, -4688, -3836, -4015, -1981, -3423, -8173, -8891, -7138, -5808, -4755, -3907, -7266, -8634, -7354, -8514, -8203, -7545, -7770, -9530, -15338, -16495, -15139, -12978, -11457, -9125, -6647, -8306, -8439, -8320, -9799, -8147, -7920, -7064, -8258, -8284, -8615, -6509, -3888, -6270]
14091f270l17J327J024k569o26O99j347j935K201N034L596M41j2o66N75J957J612
14074D724K097O33J57L062L801P83l67j441j19J215L263N128O273N199N484J1139
14058E1031O831O633M147j579l975m070n653r206o420p988p789o954k246K568
14044A5330o09j585J9k21m165k13J276K492k87m664p35M486J348j237K03N16l85
14027A1569K230N924K185k162J627K876K505L603L77K099Q378O148P387P623M675
14012F7044O535J1089J4272J7682K8428L7171O0610R8306J46248J90225K14905
14001H92515K03632J52542Q8185K8726j8845m9194m8868q964L9910N7181L7360
13990A374180j4290o9736j27883j84814k12903j98777j56545j09208o8950m6342
$$ y = [-6270, -6587, -5260, -4236, -6805, -7431, -6732, -8079, -10014, -7813, -2779, 817, 1258, 1246, 580, 1155, 3112, 4724, 6821, 7454, 7611, 10673, 14474, 15257, 14890, 13449, 13330, 14545, 17808, 22936, 29209, 34408, 39892, 51031, 57862, 64495, 68642, 67063, 63088, 59018, 53365, 44159, 37739, 29751, 21962, 15008, 12762, 15330, 14721, 13136, 13155, 12934, 8769, 8556, 9832, 12324, 12037, 7373, 6638, 11124, 12472, 11235, 11438, 11954, 11569, 13799, 19723, 21908, 19746, 21373, 24249, 26754, 30357, 30734, 32833, 41211, 47359, 54746, 62369, 67044, 73579, 84668, 98940, 116622, 145050, 182221, 242831, 341137, 487385, 677610, 892515, 1096147, 1248689, 1336874, 1365600, 1346755, 1297561, 1248693, 1239729, 1279639, 1336820, 1374180, 1359890, 1290154, 1162271, 977457, 764554, 565777, 409232, 300024, 231074, 184732]
13980A84732l5512k2638j7737j5373j0883q972p340n092n342n759m60j715l280
13967D4629o953o984Q83O94m205m186m868L0L096Q96k651k007k018J112m13k488
13951A4567k500k472R77J837j946j392Ll08q30k712m080L80M004j000j96J793
13935F125K063L405J170o12J823l584j761J679J45k88m98n58p76j187m720k381
13919D5J007J112Q39k877R77q21K410m89L97J170l83j287N5P12n535j058N55k617
13901e788n41M57J686J089R8J406K81L78L046m177k614k3J399o63p89K231K600
13884G6j168j116o58L50j828k507k676K187K001K742J509p00n56J824J997R78
13868B455l246l335J792J388N33L281K050M28k881Q67P58K130r77l111j264p21
$$ y = [184732, 149220, 126582, 108845, 93472, 82589, 73617, 66277, 61185, 55843, 50084, 49624, 47909, 44629, 37676, 30692, 31575, 32269, 28064, 23878, 19010, 19040, 22136, 23032, 20381, 18374, 16356, 17468, 17055, 14567, 12067, 9595, 10572, 12409, 10463, 9071, 9074, 8766, 7936, 5224, 1144, 1524, 5528, 4528, 4332, 6125, 8188, 11593, 12763, 12151, 13974, 10390, 8629, 10308, 10453, 10165, 9667, 9109, 8333, 7146, 2426, 45, 1052, 2164, 3003, 126, 1103, 282, 2692, 2203, 2600, 3770, 3387, 2100, 2155, 2867, -2668, -3726, -3171, -5788, -6329, -5872, -4186, -3097, -2999, -1593, -1312, -934, 2112, -2065, -4679, -4702, -3303, -3966, -4755, -2524, 76, -1092, -2208, -2866, -2516, -4344, -6851, -9527, -7340, -5339, -2597, -1088, -1788, -2344, -520, 1477, 2455, -791, -4126, -2334, -946, -413, 2868, 4918, 5346, 2465, 3332, 4090, 6220, 5243, 2132, 868, 147]
13852A47K659J346J481o02m5J97L628K288L296j838K419Q665R751J2434K4616
13837G0442L1540L1658L1740J7371K655j3212l0836m0739l3516k2034j0138q046
13825B6885p349p367k075J357Q29j305k446J628j926m53j654j638K148L110k859
13810F885k957J790K88p97J472k775M74K181J266J974r78J515p5M403J815M240
13794B0721K003R24j143k430J239M397L982J948P94n89M96k380m204k121j870
13779B1767L23K200q91k063m42j630l010j987l9r09r19n111k090l956l276n784
13763g817n926L311K793J968P604O88l623M40r98j032k402l226j759j595J171
13748a0403k97K99J899K578J075J926j788j463q24J692K36j91k728K164o96J250
$$ y = [147, 2806, 4152, 5633, 5031, 4986, 5183, 8811, 11099, 14395, 12557, 14976, 23641, 33392, 45826, 70442, 101982, 133640, 165380, 182751, 185406, 172194, 141358, 100619, 67103, 45069, 34931, 26885, 19536, 12169, 10094, 11451, 12280, 10975, 8529, 10157, 8231, 7778, 6124, 4486, 6634, 9744, 6885, 3928, 5718, 6006, 5209, 6681, 3906, 4380, 6561, 7827, 9801, 8823, 10338, 10263, 14666, 16481, 20721, 22724, 23648, 22505, 20075, 21314, 25711, 29693, 31641, 32435, 31846, 32342, 29962, 25758, 23637, 21767, 22090, 24290, 23399, 21336, 20894, 19264, 16254, 14267, 14228, 13319, 12400, 7289, 5199, 1243, -2033, -7817, -13743, -10432, -7639, -5671, 1933, 2621, -1002, -562, -1560, -2592, -4994, -8220, -9979, -11574, -10403, -10700, -10401, -8502, -5924, -4849, -2923, -4711, -6174, -6998, -5306, -5070, -5261, -7989, -5825, -6521, -5271]
13732e271N851P74j653m939m151J561J666M446M907J555j912N15K366L41l31Q85
13716F610P62J565J747M175j457r55j873Q88K034K732n52l032l28l125o638m170
13700a617J543O51K022J607M684O163P709J0549L156J355m27n416n32O161K877
13685D0485j976o571m404o412m001K321L572M953J545j192R06p84m102l799j684
13670A8857k111k976L34N62j967j166j592j031M335K246J821Q645R213N035L27
13655D0532l323n160N276N543l048o972q035l559r83k662n755l305J293K785k428
13640A0199j96J663K401k162p90M033J0645Q813M798N122N430J105j047j434p261
13625D1319p909p427n424l524R04K001m76n87k095J68m61l446o20K423M66j400
$$ y = [-5271, 580, 1354, -299, -5238, -9389, -7828, -6162, -1716, 3191, 4746, 2834, 3349, 5715, 6056, 5725, 6610, 7372, 8937, 10684, 14859, 13402, 12447, 10574, 11462, 13496, 16228, 15676, 12644, 12316, 9191, 2553, -1617, -74, 577, 2599, 4206, 8890, 15053, 22762, 33311, 36467, 37822, 37395, 31979, 31447, 37608, 40485, 38509, 31938, 27534, 21122, 17121, 19442, 23014, 27967, 29512, 28320, 29226, 28442, 24340, 20541, 18857, 16746, 13770, 14104, 14666, 12699, 11533, 9941, 8910, 13245, 15491, 17312, 25957, 35170, 40205, 40532, 37209, 32049, 37325, 42868, 39820, 32848, 24813, 21254, 20271, 17609, 11854, 8549, 9842, 12627, 10199, 10003, 11666, 14067, 11905, 11115, 15148, 25793, 34606, 39404, 44526, 49956, 51061, 50014, 48580, 41319, 33410, 25983, 20559, 17035, 17939, 19940, 19464, 18877, 16782, 16950, 16489, 13043, 12423, 14846, 15312, 13912]
13609A3912l135p16J0L482J918L858L432O279O399M611P939J0984P521L057P49
13594G0300l555l883n274n148p260o115j143j878j703M34K073L115L497K359P83
13579D6602P696N150L878N501J937O512J3764J5043Q739N833R500R520L101j378
13565A41398k986o008o253r753n277o609j6077n090j448k109p398q339l530k729
13551E7792k042k973k636k098l257k621o68l908l93M875L449L822L381J501K493
13536E6717M337M899J757J10L39l051p296o748l893n735l713q27j488j748L916
13521C7576O604P770L468R00M699M220l832m786k318m620l124j835n500n880j775
13506C1567R7l972q96J711j316P74K299j865m995K06O86p74O04J771k02J60J021
$$ y = [13912, 10777, 10061, 10071, 13553, 15471, 19329, 22761, 29040, 35439, 40050, 47989, 58973, 66494, 69551, 70300, 66745, 62862, 57588, 52440, 45180, 39065, 37922, 36044, 34341, 34775, 36848, 39963, 43460, 45819, 46602, 54298, 59448, 63326, 68827, 70764, 77276, 91040, 106083, 114822, 120655, 130155, 139675, 142776, 141398, 138412, 132404, 126151, 116398, 111121, 104512, 88435, 83345, 81897, 79788, 72390, 64051, 60521, 57792, 55750, 52777, 50141, 48043, 44786, 42165, 41497, 37589, 37196, 42071, 45520, 49342, 52723, 54224, 56717, 61054, 65953, 67710, 67820, 68159, 65108, 57812, 51064, 47171, 41436, 37723, 36896, 35408, 33660, 37576, 44180, 51950, 55418, 56318, 61017, 65237, 61405, 56619, 54301, 49681, 46557, 44722, 39222, 33342, 31567, 31664, 27692, 26796, 28507, 27191, 27965, 30264, 28399, 23404, 23610, 24296, 23522, 24126, 25897, 25695, 25855, 26876]
13489B6876J697K721L08p48k121N28M1n926O22L090K081M66k610k842J285L181
13473B8649j410q13q72Q82K42j673k924j108j035k767L84L797K099k050m630k771
13457A4000Q50J109K21O40l58r7L35o1r5n87j857N45K914P36j255o84L063J389
13439B0808O96k553n99K021j062l334k561J89K525P22j897l883m70m23m30j435
13423H314l91M774L887k594l210K096J082j603k57j367l827k745j800M340K440
13408I139l367k441p43J815K095M441K615k417j652j238r63L084p48j223k541
13393E856p27P0Q21J146k330L6K828J496K684m78j532k899l08J837N53k83k700
13376F070k563l921k271j94q5K328K251J144J222j847m180R60j567K412J951j560
$$ y = [26876, 28573, 31294, 31602, 30854, 28733, 29261, 29302, 23376, 23998, 27088, 29169, 29635, 27025, 24183, 25468, 28649, 27239, 26426, 25554, 26436, 26678, 25005, 22081, 20973, 19938, 17171, 17555, 21352, 23451, 21401, 16771, 14000, 14850, 15959, 16180, 16820, 16462, 16365, 16700, 16639, 16544, 15957, 14100, 14645, 17559, 18295, 17040, 16356, 19419, 20808, 21504, 18951, 18352, 20373, 19311, 15977, 13416, 13605, 16130, 16852, 14955, 11072, 10602, 10179, 9749, 8314, 7923, 12697, 16584, 13990, 10780, 12876, 13958, 12355, 12098, 10731, 6904, 4159, 2359, 6699, 9139, 5772, 3331, 2588, 4403, 6498, 10939, 13554, 11137, 9485, 8247, 7284, 10368, 9620, 8397, 5856, 5129, 5199, 6020, 7166, 4836, 4872, 7700, 9196, 11880, 11402, 9870, 6971, 6663, 8500, 9053, 8770, 6070, 3507, -414, -2685, -2879, -2964, -636, 1615, 2759, 3981, 2134, -2046, -1086, -2653, -241, 1710, 150]
13360A50p90N81J251m547L16J804k966L314K965J1Om891j970K110J894K402k281
13343f41k079K317J669K930J49M1K632M70L620J785L26k155O91Q33K948k280n027
13326H229l388j690J371J256j489J801K320j218K312K138m366l593k733K918Q97
13311D765K980k63k407N97q39K285L713Q52k576j873N63K280k310k615j838J078
13295D392J885Q13l390j594M675K525m235k212q9Q02j658l737J01K175L661J505
13279E619K539P559R248M716J170m695o918n777l999l403l667J220L35n51j49
13264C247j441j901P9l445n85J603L039J28Pp01k127j880j605O82K077j649J236
13247c236J634o32j115J482j153j88K993k852k266q23J622K189j123j880M39M278
$$ y = [150, -640, -59, 1192, -3355, -3039, -1235, -4201, -887, 2078, 2089, 2095, -2796, -4766, -2656, -762, 1640, -641, -2720, -403, 1266, 4196, 4345, 4386, 7018, 7488, 11108, 12893, 13219, 11064, 11755, 12588, 15536, 13256, 8229, 4841, 3151, 4522, 5778, 4289, 6090, 8410, 7192, 9504, 11642, 7276, 3683, 950, 3868, 4765, 7745, 7482, 5075, 5672, 4833, 7118, 10831, 11683, 9107, 7234, 7797, 10077, 7767, 5152, 3314, 4392, 6277, 7090, 3700, 2106, 6781, 9306, 5071, 2859, 2770, 3572, 1914, -1823, -1722, 453, 4114, 5619, 8158, 15717, 24965, 29681, 30851, 26156, 19238, 13461, 9462, 6059, 2392, 3612, 3947, 3396, 3247, 1806, -95, -16, -3461, -4046, -2443, 596, 724, 731, 30, -2097, -3977, -5582, -4900, -2823, -4472, -3236, -1602, -2234, -3349, -1867, -3020, -3208, -215, -3067, -5333, -6156, -4534, -2345, -3468, -5348, -4909, -631]
13231f31J520j653q40J919J426j056m267k326J70M080K288l805m689J111L457
13216c296K330J459p12k321j589k238j308k63R73L130L824K643o83k233k065n65
13200b914m13J755Q57N49K90l175J487M807J29k836L700K641j485o62R56K548
13184H234m95k115K058j404n228n88J94l754j263r91p86K686K312j51j60L929
13168B478K032N70k294k192J516K066r96j4P25q03j120K43K239J789M021J638
13152A1898M477j426K53J214J478L56l517L46J903N600P746N262P741R603R49
13137E3883l959J344k196q379r838j2047q555l959m403j805Q30K075l016P44K938
13122C657K56l457L445O186M210L248K545J438O928P621N277Q841J1532J1822
$$ y = [-631, 889, -764, -1604, 315, 1741, 685, -3582, -5908, -5738, -1658, 630, -3175, -7864, -6753, -3296, -966, 493, -219, -2540, -4129, -6367, -7675, -7938, -6965, -3835, -11, 2632, 1949, -284, -2349, -2914, -3327, -1572, -715, -166, 124, -3051, -1564, 3243, 3372, 536, 4236, 6877, 5392, 4730, 5686, 8234, 7739, 5624, 7682, 6278, 1050, 462, 656, -3098, -4361, -5352, -6138, -3452, -1140, -1291, -1451, 2478, 4510, 5080, 2786, 594, 2110, 4176, 3180, 3166, 3891, 3088, 1968, 2211, 4450, 6239, 10260, 11898, 16375, 14949, 15202, 16416, 17894, 18250, 14733, 15079, 16982, 22582, 30328, 35590, 43331, 52934, 53883, 49924, 51268, 49072, 40693, 30855, 18808, 10253, 6294, 1891, 86, 916, 2991, -25, 719, 3657, 3913, 456, 3901, 10087, 14297, 17545, 20090, 21528, 28456, 36077, 41354, 50195, 61727, 73549]
13108G3549K2055L4183N0188Q0670J26319J86386J96970J14302J4890j3028Q873
13097H95357l1498j36996k01927j73608j14435o5288m2735l0983j8111j4523p345
13086E7908p208r204l653k993n005j31l340n798l815n489k352j346l283l009K295
13071C577L553Q7j327K536R41j278j179J099j404l804j962r92m61R1K141J554
13055C172j106m50j411L77j038l077R35N8O83J365k61j816j020j850k536k939
13039a0914K086N794J047J678K259O42m43j01J516L96k904m859K57n79m130j379
13023i634k211K762M613R61j497k483k675m95J216K411k092n60N498K083J788
13008c15J529N37P50k729O70q91l167k503k2J775j376m227m273L86K417k971k700
$$ y = [73549, 95604, 129787, 179975, 260645, 386964, 573350, 770320, 884622, 899512, 886484, 895357, 863859, 726863, 524936, 351328, 236893, 171605, 128870, 97887, 79776, 65253, 57908, 50700, 41496, 37843, 34850, 29845, 29714, 26374, 20576, 16761, 11272, 8920, 7574, 4291, 1282, 3577, 7130, 7217, 5890, 8426, 9367, 8089, 6910, 8009, 6605, 2801, 839, -153, -614, -523, 1618, 3172, 2066, 1616, 205, 582, -456, -3533, -2598, -2540, -1857, -492, -753, -2569, -3589, -5439, -7975, -10914, -8828, -3034, -1987, -309, 1950, 2592, 2149, 2048, 3564, 3960, 1056, -3803, -3546, -4125, -8255, -9634, -11845, -9083, -4470, -3509, -5006, -7489, -10164, -10659, -9443, -7032, -9124, -9684, -4186, -2103, -315, 1214, 1751, 2501, -228, 442, -449, -3616, -6119, -6141, -4366, -5742, -9969, -14242, -13856, -11439, -14410, -17110]
12991a7110q953l732L11m361r282j6229j5489L670J6673Q889j194O584J6263K1111
12977b849J3335M757O005K111J98N513N40k286l918k766L3p31k936n65M759M571
12961B5771M985O77l28N197L293J016R71l496l161j962l31m298j846j86L37k877
12945B3762M327N029L088L976N483L523M562J338n2M277J4740K3913K9356K3597
12931A50919P900O56L737k345j2322k1658k7133k2756j6384r339n827l236n894
12918C6318o244o666l569j888K346L554K171N22J934O128M963O41j042n919l405
12903B9844J170R76o69J938J112p83j701r02n65j041l639j493k03K760M783K692
12887C4279K174k35p68j113j595l325l851L614J3222J0927L232L925r07J927L831
$$ y = [-17110, -26063, -29795, -29484, -33845, -43127, -59356, -74845, -71175, -54502, -45613, -46807, -40223, -23960, -2849, 10486, 15243, 21248, 23359, 23557, 29070, 29610, 27324, 23406, 20640, 20673, 19942, 17006, 16441, 21200, 25771, 30756, 31433, 31105, 36302, 39595, 40611, 41582, 38086, 34925, 32963, 32632, 28334, 26488, 26302, 26639, 23762, 28089, 33118, 36206, 40182, 45665, 49188, 53750, 55088, 55036, 59313, 74053, 97966, 127322, 150919, 158819, 159475, 163212, 160867, 148545, 126887, 99754, 76998, 60614, 51275, 45448, 42212, 36318, 30074, 23408, 19839, 17951, 20297, 23851, 26022, 26544, 28478, 34606, 39569, 40210, 39168, 33249, 29844, 31014, 31990, 31321, 33259, 34371, 33588, 31887, 30985, 30420, 29379, 25740, 24247, 24044, 26804, 31587, 34279, 36453, 36218, 35450, 34337, 32742, 29417, 25566, 29180, 42402, 53329, 56561, 60486, 59579, 61506, 65337]
12872F5337Q222N681K326o824j5736j5746j3319j4859j1319m312P67P102J1578
12859A8898J1740J4557J3521J0804J1729Q837J1818J7859J9372K4748L0848L5740
12847B30471M5135O3088Q4006J23891J96699L19727N39255Q90592J252685J039065
12837D784614K70424j82248q54105j269705r57937n43549l05026j99537j62088
12828E80843j31726q8930n5587l6126l5455l1397k3275k1207j2641l420N768J5204
12816A62051K0182J8661J9007J8611K5539M1487P0208J21274J97867L19620N03285
12805A517792N71125K49498j21228n06399o07334m12602k32311j25493o4788m1565
12795B26695k7606k5324j6657j5942j9048k0111j9510j2700q936n014k524n354
$$ y = [65337, 73559, 79240, 81566, 74742, 59006, 43260, 29941, 15082, 3763, -549, 218, 7320, 18898, 30638, 45195, 58716, 69520, 81249, 90086, 101904, 119763, 139135, 163883, 194731, 230471, 275606, 338694, 422700, 546591, 743290, 1063017, 1602272, 2492864, 3745549, 4784614, 5055038, 4872790, 4018685, 2748980, 1791043, 1247494, 942468, 742931, 580843, 449117, 360187, 304600, 268474, 233019, 201622, 178347, 157140, 144499, 141079, 146847, 162051, 182233, 200894, 219901, 238512, 264051, 305538, 375746, 497020, 694887, 1014507, 1517792, 2088917, 2338415, 2217187, 1710788, 1103454, 690852, 458541, 333048, 268260, 226695, 199089, 173765, 157108, 141166, 122118, 102007, 82497, 69797, 60861, 55847, 53323, 47969]
12783D7969N02N507K920Q047N999L491N336P661M441k864n711q157l695J31j960
12768F9617K578M747Q894J1882J2700O652K559P071N686N773R275P052J927m306
12754A52107j858N187N127J124j033L630L505o05K501R430P731N787N089J518
12740A99240j0475j4602k966L891P423Q141J1553J2699J3300J5999J6628R004
12728B69835O462L095J2988K2784K4183K1635K3880K9321L5102M0201L9005L3535
12716E62026K8143K9665L4209M1452M8661N1744N7693O2846O9139Q5732J02980
12705A174290J04865J06390J08056J21209J42533J68870J99343K42824L18880
12696B687260M28904N39757N83828N89431O79188R07564J087172J154468J308778
$$ y = [47969, 48471, 53978, 56898, 64945, 70944, 74435, 79771, 87432, 91873, 89009, 83298, 75141, 71446, 71577, 69617, 72195, 76942, 85836, 97718, 110418, 117070, 119629, 126700, 132386, 138159, 147434, 154486, 156413, 152107, 150249, 155436, 160563, 161687, 160654, 164284, 167789, 167184, 169685, 179115, 186846, 192633, 197722, 199240, 188765, 174163, 171197, 175088, 182511, 190652, 202205, 214904, 228204, 244203, 260831, 269835, 276297, 279392, 292380, 315164, 339347, 360982, 384862, 414183, 449285, 489486, 528491, 562026, 590169, 619834, 654043, 695495, 744156, 795900, 853593, 916439, 985578, 1071310, 1174290, 1279155, 1385545, 1493601, 1614810, 1757343, 1926213, 2125556, 2368380, 2687260, 3116164, 3655921, 4239749, 4829180, 5508368, 6415932, 7503104, 8657572, 9966350]
12687I966350J787767K655661L888723N879614R372412J5375147K4657332L5171168
12679A08754174L6152152K0471778J722080l918711K410929l458387k1382728
12672A40751287l6362147l4158486k2850596j3730081q386100n465413l807771
12665A5990693k742647j911424j314790j038860j006784r79830q24484o42638
12657E529236n85485o01767n90682n04196l92937l08067k45667k09774j87751
12648A902910j60773j26955r7221q9362q1428p4454o4452n8196n6450m7405m2074
12637A004140l7475l5409k7292k0174r888m647j3509j7281j8173j7758J607M5935
12625H50076N7991K4129j0131o5948r2266o4178n6983m2881k6170k3647k1999
$$ y = [9966350, 11754117, 14409778, 18298501, 24178115, 33550527, 48925674, 73583006, 108754174, 144906326, 165378104, 167100184, 163181473, 165592402, 162134015, 140751287, 104389140, 70230654, 47380058, 33649977, 25263877, 19798464, 15990693, 13248046, 11336622, 10021832, 8982972, 7976188, 6996358, 6171874, 5529236, 4943751, 4341984, 3751302, 3247106, 2854169, 2546102, 2300435, 2090661, 1902910, 1742137, 1615182, 1517961, 1428599, 1347171, 1272717, 1208265, 1150069, 1093619, 1046214, 1004140, 966665, 931256, 903964, 883790, 873902, 869255, 855746, 838465, 820292, 802534, 804141, 850076, 908067, 932196, 922065, 856117, 763851, 699673, 642690, 599809, 573639, 549992, 527993]
12614E27993k4144k0481j7940j1241k078J427J048M763J8604L6809O3600R8097
12602F76457J32964J38081R6439K9852j0313l7696r0123j40848j39316j06097
12592E49400p8989n9602m1986k8620j6536p667o291q056m975m408k320l850o145
12579B79955q260j1967j9007j9878j5974j9916j6621m341j831J2599K7029L3893
12567B35681K8899J6744R161m842j7538k6240l4089l2841k9732j5448r796O19
12555A20578K5876M6732N8764M5210J5588m117j1089r930k5349l3551k9016n672
12543A94024M463R739J7854K6151L9510O5654P1489M0439J2340J585j0377l8347
12531D34524o2182o1317m2450l4832l3097k2058n123L413R582K763j0070k1818
$$ y = [527993, 503849, 483368, 465428, 454187, 452109, 453536, 454584, 459347, 477951, 514760, 578360, 676457, 809421, 947502, 1043941, 1073793, 1063480, 1025784, 935661, 794813, 655497, 549400, 470411, 410809, 368823, 340203, 323667, 316000, 309709, 301653, 296678, 292270, 289950, 286100, 279955, 271695, 259728, 240721, 220843, 204869, 184953, 168332, 163991, 162160, 174759, 201788, 235681, 264580, 281324, 290485, 285643, 268105, 241865, 207776, 174935, 145203, 129755, 119959, 120578, 146454, 193186, 251950, 297160, 312748, 308631, 297542, 287612, 262263, 228712, 199696, 194024, 198487, 208226, 226080, 252231, 291741, 357395, 428884, 469323, 481663, 483248, 472871, 434524, 372342, 311025, 268575, 233743, 200646, 178588, 173465, 176878, 186460, 189223, 179153, 157335]
12519A57335l4226l2790j3229J930J3880K5357K8509K0604J3332L328k425p207
12507A74398j463R093J0907K4555M5379O4290Q5919R1111P8655P2573L5799J117
12495F92333q3547j33980q3896n4901k8336j2916j3148k0474k6347l0553l1082
12484A73153l0531l2127k8081j8284N30J4087J8725K1715J7789J4878J3310K789
12472A67953r255j2670j6432j0947n221L727L718L602N570J1985J4791J0251J1857
12459A78929J2339J0149J4204K0919K4838L2613N5118Q1934O6417K0721k1702
12448D96479n4941k7605l935n273j7315k7051k3397r169M824M917J314m914j5243
12435C18691j1198q953r66P393N555J4071K1363K5864L4128M0148L6215L4713
$$ y = [157335, 123109, 90319, 77090, 79020, 92900, 118257, 146766, 167370, 180702, 184030, 181605, 174398, 172935, 182028, 192935, 217490, 262869, 327159, 413078, 504189, 582844, 655417, 691216, 692333, 608786, 474806, 390910, 336009, 307673, 294757, 281609, 261135, 234788, 204235, 173153, 142622, 110495, 82414, 64130, 64660, 78747, 97472, 119187, 136976, 151854, 165164, 167953, 158698, 146028, 129596, 118649, 113428, 117155, 120873, 124475, 130045, 142030, 156821, 167072, 178929, 191268, 201417, 215621, 236540, 261378, 293991, 349109, 431043, 497460, 518181, 496479, 441538, 413933, 409998, 404725, 387410, 360359, 336962, 327793, 332617, 337534, 338848, 333934, 318691, 307493, 298540, 297574, 304967, 310522, 324593, 345956, 371820, 405948, 446096, 482311, 517024]
12423E17024L4212L3476L3174M6587O3559Q1385J08054J34342J72059K42267L82859
12412A848998O32292J055838J647071J909639R77378k32586j435432j823883j234441
12403C344874o38988k98337j30215l9852K1637O7655J00308J22176J38583J75016
12393B862857K45463L48010M67145M76183M22910M01099M25498O59477J014989
12384G323631J478066K114574K701010L049367L484185M271399N632978Q653023
12376C8708233J4133757K3814998M0416132O5911181R1856371P6371350J7669785
12369C68881807k8184880q2660805q9526993n9645841l4436654k0131242j2592786
12362D1702606q506322n886688m424192l535026k870055k591197k138714j675613
$$ y = [517024, 551236, 584712, 617886, 664473, 728032, 809417, 917471, 1051813, 1223872, 1466139, 1848998, 2481290, 3537128, 5184199, 7093838, 8071216, 7838630, 6403198, 4579315, 3344874, 2705886, 2407549, 2277334, 2237482, 2259119, 2326774, 2427082, 2549258, 2687841, 2862857, 3108320, 3456330, 3923475, 4399658, 4822568, 5223667, 5649165, 6308642, 7323631, 8801697, 10916271, 13617281, 16666648, 20150833, 24422232, 30055210, 38708233, 52841990, 76656988, 117073120, 182984301, 274840672, 351212022, 368881807, 340696927, 258036122, 168509129, 108863288, 74426634, 54295392, 41702606, 33196284, 27309596, 22885404, 19350378, 16480323, 13889126, 11750412, 10074799]
12354A0074799j302908j065599q84028p22139o14983n31341m52788m08036l72079
12345C720898l27682k80207k35065j92276j70733j47375j20007q3577n5423m3270
12335B065283m2450m8909o2027r4215j09691j15317r0885p2779n3651k8508j7049
12324A329802j0354j7682l8432n7416o2425n0474m3601m2122l1702k3422j4801
12313I37371r138j0958j9286k3960k3893k9457k3470j7054j9177k4880l0828j7818
12301F87452q124J356O2n220m624o025J083P765K4190K8611J7899Q969R512K4234
12287G87140M1927L5675n786n5442q1053p2531n1403l4576k4401k3152k1137j3886
12275D81375n480o697q572r422j0781q500q47L970O181J7701J8510K5527K9050
$$ y = [10074799, 8771891, 7706292, 6822264, 6100125, 5485142, 4953801, 4501013, 4092977, 3720898, 3393216, 3113009, 2877944, 2685668, 2514935, 2367560, 2247553, 2163976, 2108553, 2065283, 2022833, 1973924, 1911897, 1817682, 1707991, 1592674, 1501789, 1429010, 1375359, 1346851, 1329802, 1319448, 1301766, 1263334, 1205918, 1143493, 1093019, 1049418, 1007296, 975594, 952172, 937371, 928233, 917275, 897989, 874029, 850136, 820679, 797209, 780155, 760978, 736098, 705270, 687452, 679328, 680684, 680746, 675526, 670902, 664877, 665960, 673725, 697915, 726526, 744425, 753394, 762906, 787140, 829067, 864742, 858956, 803514, 722461, 649930, 598527, 563951, 539550, 516398, 495261, 481375, 475895, 469198, 460626, 451204, 440423, 431923, 431076, 435046, 441227, 458928, 477438, 502965, 532015]
12262E32015K8325K9125J3236p038j9494k2522j4623J135K0090M7378R3290J62063
12250H62980K19377J96910J03307K5564M5785N8448o2905k23819k82335k60112
12240F83200j50515p8176m2867k5627j6551j2855j0334j2463j5627j4482j2795
12229B90908m928K579R232J5957J3595N023n738k0461m2066n0602l8198j7280
12217A58021P652J7824J0389n653r924j193R582O409O171Q653P885M603J1312
12204B31731R469J2402J4438J4209N608j360n300k375m421N27k085j219K473k20
12190B73877j193M176J8603K8624J9846J620r238k3755l3920l5794l8013l5965
12178A68868l2606j9879n865M555J6789K8775L0720K6929K2678Q497l829j5427
$$ y = [532015, 560340, 589465, 602701, 595663, 576169, 553647, 539024, 540159, 560249, 607627, 700917, 862980, 1082357, 1279267, 1382574, 1408138, 1453923, 1512371, 1449466, 1225647, 943312, 683200, 532685, 454509, 411642, 386015, 369464, 356609, 346275, 333812, 318185, 303703, 290908, 285980, 288559, 297791, 313748, 327343, 332366, 326628, 306167, 264101, 213499, 175301, 158021, 165673, 183497, 193886, 188233, 178309, 177116, 186698, 193107, 199278, 207931, 215816, 220419, 231731, 241200, 253602, 268040, 282249, 287857, 286497, 281197, 278822, 274401, 274928, 272843, 271624, 274097, 273877, 272684, 276860, 295463, 324087, 343933, 345553, 336315, 312560, 278640, 242846, 204833, 168868, 136262, 116383, 110518, 115073, 131862, 160637, 191357, 218286, 240964, 249461, 245632, 230205]
12166B30205k5138k5162k1491k1617j3257p387K432M588L818K913J0805Q799P153
12153A56661K047o544j4540j4468j3994r773m160L752M187M435j094p990m997
12140I3522J471L326K042N91J121l60O73j850k601k074k734K622L25j867m620
12125H9587l924k195J808P812N280M822M899M143N940L398m486r888j3171j0840
12111H3185p476k889p043q475j569J839M956J4284J1290J2398J1921M006n137
12098A11290r004n747n748m662n424l975j629P16j053O63l019n728j582P04L913
12083F9715j015j924K078q58l551p387n953o008k886j692m264m449p731N012L3048
12068F2135M6093M1362L9110L4168K8273J3325m281l6620m5557l9798j2934r20
$$ y = [230205, 205067, 179905, 158414, 136797, 123540, 116153, 118585, 123173, 126991, 129904, 140709, 149508, 156661, 158708, 152164, 137624, 123156, 109162, 99389, 95229, 98981, 103168, 107603, 106509, 98519, 93522, 94993, 98319, 100361, 100952, 102073, 101713, 102386, 100536, 97935, 95861, 93127, 95749, 96074, 94207, 89587, 85663, 83468, 85276, 93088, 98368, 103190, 108089, 112232, 118172, 121570, 117084, 107196, 94025, 83185, 75709, 72820, 65777, 57302, 55733, 57572, 62528, 76812, 88102, 100500, 112421, 116427, 111290, 102286, 96539, 90791, 86129, 80705, 76730, 75101, 75817, 74764, 75427, 72408, 66680, 65098, 65802, 69715, 68700, 66776, 68854, 67996, 64445, 57058, 51105, 45097, 42211, 40519, 36255, 31806, 24075, 29087, 62135, 108228, 149590, 188700, 222868, 251141, 264466, 260185, 223565, 178008, 138210, 125276, 124356]
12056A24356j421r58m866k587r944m894k014p453p937o739l891J690K367j03q10
12041G4796p58l502n69j068L553M605P265L219j339o713n147p42j862l705k077
12026F5956j634j664j556k822J746K80K328J514J419J20Q51L270L736L476J117
12011G8137q20k007j776m563j992L04k133k111j044L831R12k449n98M128M045
11996G1864j289l841Q36K312J330l211k405l092m7k638n001k641k360m099m313
11981D1405N74K387L442M041J031K743J846K660N377q06Q66L303N674N574J385
11966H1502l697j0479o518l966l670l98M078M53J638K116k573j406J021K985J294
11951F2380m76r12J816M835M441M704P191Q980J1224J5089K3782L0147L3090L3541
$$ y = [124356, 122935, 121977, 117111, 114524, 104580, 99686, 97672, 90219, 82282, 75543, 71652, 73342, 75709, 75606, 74796, 74038, 70536, 69967, 68899, 72452, 77057, 84322, 87541, 86202, 79489, 74342, 73600, 71738, 68033, 65956, 64322, 62658, 61102, 58280, 60026, 60306, 62634, 64148, 65567, 65687, 66538, 69808, 73544, 77020, 78137, 77317, 75310, 73534, 68971, 66979, 67283, 65150, 63039, 61995, 65826, 66738, 64289, 63691, 67819, 71864, 70575, 66734, 67570, 69882, 71212, 68001, 65596, 62504, 62457, 59819, 54818, 52177, 49817, 45718, 41405, 41979, 44366, 47808, 51849, 52880, 55623, 57469, 60129, 65506, 64700, 65566, 68869, 74543, 80117, 81502, 77805, 67326, 60808, 56842, 53172, 52774, 56852, 57305, 58943, 61059, 58486, 57080, 58101, 61086, 62380, 61904, 60992, 62808, 67643, 72084, 76788, 83979, 92959, 104183, 119272, 143054, 173201, 206291, 239832]
11937B39832L2981M4249Q0644J54279K85906M77703N94653L17922o2769m43950
11927A721450n96308m12472k30284j28381p4933n2400l5072k5897k0408j7188
11917A28107j3410j5235j4509j4901k0666k8070l4179k6900l196R094K1932K2753
11905A0820J2470M557K086J484M857k350J882N970M91J805J68J206o60k766m035
11890C7985p80M026L214K188j978k753k900k988q39J130r11l710J659L778K571
11875C9692J20M71j502P29M87J32k440l43j751J369l031k866J987P82j038m978
11859B7820m435j675J856P77L186N107MK129J502l292l058K087k176m419j28K899
11843B8184j83j844L082j786j322R49P77L238j849l548R6J33q50j199R06k04n78
$$ y = [239832, 272813, 317062, 397706, 551985, 837891, 1315594, 1910247, 2228169, 2165400, 1721450, 1125142, 712670, 482386, 354005, 279072, 226672, 191600, 165703, 145295, 128107, 114697, 99462, 84953, 70052, 49386, 21316, -12863, -39763, -42959, -33865, -11933, 10820, 23290, 27847, 29933, 31417, 36274, 33924, 35806, 41776, 42267, 44072, 44240, 45446, 44786, 42020, 37985, 37205, 41231, 44445, 46633, 44655, 41902, 39002, 36014, 35175, 36305, 35394, 31684, 33343, 37121, 39692, 39812, 40283, 38781, 39510, 39997, 40129, 37689, 37346, 35595, 36964, 33933, 31067, 33054, 33836, 32798, 27820, 23385, 21710, 23566, 24343, 27529, 32636, 32640, 34769, 36271, 32979, 29921, 32008, 29832, 25413, 25285, 28184, 28001, 26157, 29239, 27453, 26131, 27080, 27857, 31095, 29246, 25698, 25794, 25927, 25077, 23878, 24784, 24580, 24002]
11826B4002K104K597m48r61M074j653m55J912K377l5N87q60J145J357j423j954
11810C2366k220P66n36J950j193K495L988r28m836k281j215k043l890j63J853
11795B4113k137L43k3j699r11K1o99M670j53q04K776J392j595K96m94j46n11K098
11777B6537Q19J058m27J558q00j135rJ759J284L451p76p772l583l063k938k377
11761A3586l529k701j219Q2M001K301N12M932N956K226n14N439j240m403n101
11746B0328l619LJ752l1K235j643j668J170J373J877M486N606M184L569J28n424
11730C4326o558n699J600K310K637L23q2N30k410k692o95L827K277q84m086m792
11714A9932l22K65p7q03j086k149k011K016K360k205j246L262K992l731m667p44
$$ y = [24002, 26106, 28703, 28255, 27294, 31368, 29715, 29260, 31172, 33549, 33514, 34101, 33241, 34386, 35743, 34320, 32366, 30146, 30912, 30376, 32326, 31133, 33628, 37616, 36688, 31852, 29571, 28356, 26313, 22423, 22260, 24113, 21976, 22319, 22296, 20597, 19686, 19707, 19008, 23678, 23525, 22721, 25497, 26889, 25294, 25590, 25096, 24950, 24439, 26537, 27356, 28414, 27987, 29545, 28745, 27610, 27601, 29360, 30644, 34095, 33319, 25547, 21964, 18901, 15963, 13586, 10057, 7356, 6137, 6219, 10220, 12521, 13033, 17965, 23921, 26147, 25633, 31072, 29832, 25429, 20328, 16709, 16712, 18464, 18433, 20668, 19025, 17357, 18527, 19900, 21777, 26263, 31869, 36053, 39622, 39750, 34326, 27768, 22069, 23669, 25979, 28616, 28939, 28857, 29387, 26977, 24285, 23590, 27417, 29694, 28810, 24724, 19932, 19610, 19875, 19798, 18995, 17909, 15760, 13749, 15765, 18125, 15920, 14674, 17936, 20928, 17197, 12530, 11786]
11698A1786K838R10j33j951k795J678K16P60L076Q33J155j361j866R81n39O90
11682A6278P23j570j592Q19L99K867K507j904K514j871k511N99J99k785j757j39
11666A2776k722j140K290j204r49j014j897n32n43K386J865p83J970L017r89p64
11650A1767L50j061k951k470J32K835K362J762k162j468L412o37m4o93J81J762
11634A3077j712k16k64K092N201N677L863o2k208k288o42P31Q59k296L828K965
11618B8605k991l119k056o62j850j851j940L58K105Q28k977m129J272J548J632
11603A4773j357l53J284k680n55n07k667j945K989P82J289N4J242q62Q65j54l62
11586A1836r1J913J155J728J284j86j480j337m333O38p05L31P17m59n14j459J638
$$ y = [11786, 14624, 15534, 15401, 13450, 10655, 12333, 12549, 13309, 16385, 17218, 18373, 17012, 15146, 16127, 15588, 16278, 17001, 15431, 13839, 14658, 15057, 17924, 20431, 18527, 21041, 19170, 16659, 17258, 17457, 14672, 12915, 12776, 10054, 8914, 11204, 10000, 9051, 8037, 6140, 5608, 5065, 7451, 9316, 8533, 10503, 13520, 12531, 11767, 12117, 11056, 8105, 5635, 5767, 8602, 10964, 12726, 10564, 9096, 12508, 11871, 11827, 11134, 11315, 13077, 11365, 11149, 10885, 12977, 18178, 23855, 27718, 27656, 25448, 23160, 22518, 23249, 24108, 21812, 25640, 28605, 25614, 22495, 20439, 19777, 17927, 16076, 14136, 14494, 16599, 17427, 14450, 10321, 11593, 13141, 14773, 13416, 13063, 14347, 11667, 11112, 10605, 7938, 5993, 8982, 9764, 11053, 11107, 12349, 11487, 12352, 12198, 11836, 11745, 13658, 14813, 16541, 17825, 17639, 16159, 14822, 10489, 11127, 10422, 10753, 11470, 11011, 10497, 9038, 10676]
11569A0676K712M873P45n115j626k84L294K958j101j634m677J818J725l908l26
11554A0130K490K793N819J064l584m57J176m3j368Q44j487J149K469j487r44l449
11538A5115r80K5j439L10j748k33M72L345R72k925m706L057N59k420N34L126m19
11521A2645k036R33K133J321N8K5j090l347j09Q60L91j031J253M431O336Q907
11505C1680Q302O607J348q863o991m806n463n841m59j220J186j54k214j388j860
11490I864K252L355J787Q56O79m508k225J135q41J352K701l0k210l782j049k861
11474F475m77M676K849J42l438l071l80J254L814L464m20j736O36K824j794q08
11458A4010K595M252K443m141l391K738P5J236M930j123q0J992m813l137k340
$$ y = [10676, 13388, 18261, 19006, 13891, 12265, 11981, 15275, 18233, 17132, 15498, 10821, 12639, 14364, 10456, 10130, 12620, 15413, 21232, 22296, 18712, 18255, 19431, 19388, 18020, 18864, 17377, 18526, 20995, 19508, 18564, 15115, 14135, 14160, 12721, 13031, 11283, 11050, 11522, 14867, 15839, 12914, 8208, 11265, 11824, 9404, 9938, 13064, 12645, 10609, 11542, 13675, 14996, 15054, 15079, 13989, 10642, 10533, 11393, 11784, 10753, 12006, 16437, 22773, 31680, 39982, 46589, 47937, 39074, 32083, 27277, 21814, 15973, 15514, 14294, 15480, 15326, 13112, 11724, 9864, 12116, 15471, 17258, 18114, 18793, 14285, 12060, 13195, 12354, 13706, 16407, 16377, 14167, 10385, 9336, 6475, 5998, 10674, 13523, 13665, 10227, 7156, 6776, 8030, 11844, 15308, 14888, 13152, 13788, 16612, 14818, 14010, 16605, 20857, 23300, 19159, 15768, 18506, 18581, 19817, 24747, 23624, 23544, 25536, 20723, 17586, 15246]
11443A5246k388n317m208J126M712M886M766n01l092l958q98J299K379K68l094
11428A1226n951L14n79J13J881L524J204N86k386J792L954R13j042j035j919J21
11412A2716J094q63K334K276l771l934n17J590J881N408K795k481m621M97P76
11397A5180J417k117N73O255J953L756O107O316J710r37p70l45J293J679j247
11382D0823n980o859p380j593K053J992Q95l436J610J824J944K607j673P99J449
11367B9075n67j952m262j714Q47L11j634l689l824j069m39M04K174R82j451q84
11351A2308J47L836L713M135M193L060L309j564j49k528J767n72m301k711n640
11336A9003n359m749j036M282l30o071J200j99K610L05Q2K54J693J40o33j291
$$ y = [15246, 12858, 7541, 3333, 4459, 9171, 14057, 18823, 18322, 15230, 11272, 10374, 11673, 14052, 14320, 11226, 5275, 5589, 5010, 5123, 7004, 10528, 11732, 12318, 9932, 11724, 15678, 16591, 15549, 14514, 12595, 12716, 13810, 12947, 15281, 17557, 13786, 9852, 9335, 10925, 12806, 18214, 21009, 18528, 13907, 14404, 15180, 16597, 14480, 15053, 21308, 23261, 27017, 33124, 39440, 41150, 40213, 39443, 39098, 40391, 42070, 40823, 34843, 27984, 20604, 19011, 21064, 23056, 23951, 20515, 22125, 23949, 25893, 28500, 26827, 27626, 29075, 28508, 26556, 22294, 20580, 21427, 21738, 20104, 16415, 12591, 11522, 11083, 11487, 13661, 14643, 13192, 12308, 12455, 16291, 20004, 24139, 28332, 31392, 34701, 33137, 32988, 30460, 32227, 31655, 27354, 24643, 19003, 13644, 8895, 7859, 12141, 11811, 5740, 6940, 6741, 9351, 9656, 9738, 9992, 11685, 11825, 11192, 9901]
11320I901J291M61K456J019j212J871J30l836j782q80K902K320k104l007j269
11305H261p72k183N47M870L772N70k829K55K136K394j898n112J25N07K087J728
11289A4458k042j4J440ML413K659K185P18k86O9j444l220k385K07O32j233M053
11272A9214R37j499k601R12k66L779N04l279l463p23j786l895J292K316M018N09
11256A5969%m01l647j652q7j307J702R86k708K21N92j310J611K88j100L635J821
11239A4613k791l403M34P62J408m54j613K884r11j535M677N786J945m44R40J535
11223B3833j571j629n54j096m385k947J100J583J589l053J122K516O98l148m286
11208I772M179J296l522r04P48O85M756p72n725l22l860J74L411J061M73J756
$$ y = [9901, 11192, 11653, 14109, 15128, 13916, 15787, 15917, 12081, 10299, 9419, 12321, 14641, 12537, 9530, 8261, 7489, 5306, 5853, 10723, 14495, 15065, 12236, 12491, 14627, 17021, 15123, 10011, 10136, 10643, 12730, 14458, 12416, 12402, 13842, 13846, 17259, 19918, 22103, 22821, 22535, 22604, 21160, 17940, 15555, 15762, 16394, 15161, 19214, 20151, 18652, 16051, 16963, 16697, 20476, 20980, 17701, 14238, 13515, 11729, 7834, 9126, 11442, 15460, 15969, 15969, 15568, 11921, 10269, 10182, 8875, 10577, 11563, 8855, 9076, 9668, 8358, 9969, 10257, 9157, 12792, 14613, 11822, 8419, 8853, 9615, 11023, 10569, 8956, 11840, 10929, 9394, 14071, 19857, 21802, 21358, 22298, 23833, 22262, 20633, 20079, 18983, 14598, 11651, 12751, 14334, 15923, 12870, 13992, 16508, 17206, 14058, 9772, 13951, 15247, 11725, 10821, 11569, 12254, 17010, 16238, 10513, 10191, 6331, 6505, 9916, 10977, 11450, 13206]
11192A3206j981j301K567L62l350k006k778J319M446K631R08J587j70R05k340
11177A4005J513K426K929K050L27J447k112l621O17j67o30j132r54k85j750M856
11161A9519L317R5j346J00j570p98m842k826J197O510J655K356j940k097O79k40
11145A9769j17L016R22N27M375L874L011P196Q920O727J669k38O50K563J156j044
11129F2976l821k727n122j707n82j718j158q85m627k861j402J299l013l466l072
11114B8114r89j49P25K041l14m479k955o91l013j160J055l30L87J72M75J540k02
11097B0227m0m05k12J384K525q39K248L892O74j122n038n009J109p47j474j622
11081A5551N72k098J625J136P92l183p89P18j643j035j775K760L714j328k161
$$ y = [13206, 11225, 9924, 12491, 12853, 9503, 7497, 4719, 6038, 10484, 13115, 14023, 15610, 15440, 16345, 14005, 15518, 17944, 20873, 22923, 23250, 24697, 22585, 18964, 19581, 19414, 18784, 17652, 16698, 16413, 14663, 19519, 22836, 22931, 21585, 21685, 20115, 19317, 14475, 11649, 12846, 19356, 21011, 23367, 21427, 19330, 20009, 19769, 19652, 22668, 23590, 24117, 28492, 32366, 35377, 42573, 51493, 58220, 59889, 59651, 60301, 62864, 64020, 62976, 59155, 56428, 51306, 49599, 49017, 47299, 46141, 45256, 40629, 37768, 36366, 37665, 34652, 31186, 28114, 27125, 26976, 27701, 29742, 29428, 24949, 21994, 21303, 18290, 17130, 18185, 17855, 18242, 18414, 18889, 20429, 20227, 20187, 19782, 19570, 20954, 23479, 22640, 24888, 28780, 29454, 28332, 23294, 18285, 19394, 18647, 17173, 15551, 16123, 14025, 15650, 16786, 17578, 14395, 13606, 14324, 12681, 11646, 9871, 12631, 16345, 15017, 12856]
11066A2856L339j171j9K699J215J921k525l218O75J882j58l39J708J646k4J448
11050B1935j084l487J88J987Q27k779m034j34L036N95j808l13L04K360N486N041
11034B8120j692m351J49K504j936m541j716m74j106M114K782K211l615m829j885
11019A3735q47k685L80K434K298j90L847M531L849n04l199K048J025J387L481
11004C1590M097L460K011l318m827p083m616p5Q12N27l444p871N85J866n92J588
10988A4710o00j365J742K104j299R88K834K449r86j629J88K233J544m13L140L267
10972B8907j238k914K599L040N448J0177J0152N666L975l581q878j0301p317o417
10958B9318p450J373j9m713l34j889M033M227k735P95j034m667K250K818N8J190
$$ y = [12856, 16195, 15024, 15005, 17704, 18919, 20840, 18315, 15097, 15772, 17654, 17496, 17157, 18865, 20511, 20487, 21935, 20851, 17364, 17552, 19539, 20366, 17587, 13553, 13419, 16455, 17050, 15242, 14929, 15233, 17593, 23079, 28120, 26428, 22077, 22226, 24730, 22794, 18253, 16537, 16063, 14957, 19071, 21853, 24064, 20449, 15620, 13735, 12888, 10203, 10583, 13017, 15315, 15125, 18972, 23503, 27352, 26848, 23649, 25697, 26722, 28109, 31590, 35687, 39147, 41158, 37840, 33013, 25930, 21314, 21239, 22051, 22578, 19134, 11263, 11848, 13714, 13122, 14710, 14110, 12745, 14487, 16591, 15292, 16280, 19114, 21563, 20577, 18948, 19136, 21369, 22913, 22500, 25640, 28907, 27669, 24755, 27354, 30394, 35842, 46019, 56171, 61837, 65812, 62231, 53353, 43052, 35735, 29318, 21868, 23241, 23222, 18509, 18175, 16286, 20319, 24546, 21811, 22606, 21572, 16905, 19155, 21973, 22031, 23221]
10942B3221M846L223J215P82K831J89m339p337L8J81n276l524J744L311j292l271
10926A6542M039R143J3117J2798K2349L2675L9705K8911j4163m1182l3101k5131
10914F5702j8284j0309k036j440j676l145L09K046n425l407m957r08O07J88k480
10899A4785l792q19P040j091o967K18J997K11J766M353Q38K511j151k635J207
10884A8471K093L792K150K755K601J0022J3424K1274L1816M2353L0589r418m4502
10871A27420l9888k3307j3793q104p145n968r366O9L619j715L30m31m843m085
10857A2793l159j48m81k059n06m2q76j598j706L366K734K779j712P8j219j474
10841F770L497K59l384n32N147K223k92N83O725J0583J1548J1685O416l868j1547
$$ y = [23221, 28067, 31290, 32505, 33287, 36118, 36307, 31968, 24631, 24669, 24850, 19574, 16050, 17794, 21105, 19813, 16542, 20581, 29724, 42841, 55639, 77988, 110663, 150368, 179279, 165116, 123934, 90833, 65702, 47418, 37109, 35073, 33633, 31957, 28812, 29121, 31167, 25742, 22335, 17378, 16470, 17077, 17265, 14785, 10993, 10174, 17214, 16123, 9156, 9374, 11371, 11582, 13348, 17701, 18539, 21050, 19899, 17264, 18471, 20564, 24356, 26506, 29261, 31862, 41884, 55308, 76582, 108398, 150751, 181340, 171922, 127420, 87532, 64225, 50432, 42328, 35183, 29215, 19849, 19918, 23537, 21822, 22152, 21721, 16878, 12793, 9634, 9486, 9005, 6946, 6440, 6398, 5522, 3924, 2218, 5584, 8318, 11097, 9385, 9463, 8244, 6770, 10267, 10526, 7142, 6610, 11757, 13980, 13688, 14271, 20996, 31579, 43127, 54812, 61228, 57360, 45813]
10826D5813j5223r589J15l692l351N33j328M24L35m85J490n57l387l956P19o37
10810G224p67L699N73j447l414j704N92p40J278p13n115m35M600N741J599k558
10794H413r19k730j219j68K642J242k98j072j188K7r87L363J855J001l814n784
10778C64j885K747J243k760p07J013K437L017N035M17p20N6P19k621J848J537
10762A1740k038q19m133k137J423K162j694l820N70j009k29j033J321L378J207
10747D889j363J451J973J38l295J361R35m01K99j699k16P21J144l610k142j4M858
10730E029n62l047P07j92l665j103J728J628J975M505O43Q84k267j850R31j215
10714D129l398j92J693O30N30j532j49r4Q50J955J859K73r86j615L36n79J765
$$ y = [45813, 30590, 21001, 21116, 17424, 14073, 14606, 13278, 13702, 14037, 13552, 15042, 14485, 11098, 7142, 7861, 7224, 6457, 10156, 10729, 9282, 5868, 4164, 4756, 4016, 5294, 4581, -534, -969, 3631, 9372, 10971, 8413, 7494, 4764, 3545, 3377, 6019, 7261, 6963, 5891, 4703, 4730, 3743, 7106, 8961, 9962, 6148, 364, -1521, 1226, 2469, -291, -998, 15, 2452, 5469, 10504, 10921, 10201, 10257, 10976, 8355, 10203, 11740, 9702, 8883, 4750, 2613, 4036, 6198, 4504, 684, 1254, 245, 16, -1017, 304, 3682, 4889, 3526, 4977, 6950, 7088, 3793, 5154, 6089, 5688, 5987, 4288, 4072, 4793, 5937, 2327, 185, 171, 5029, 4467, 1420, 2127, 1935, -1730, -2833, -1105, 523, 2498, 7003, 7646, 8530, 6263, 4413, 5344, 4129, 731, 539, 2232, 2862, 3392, 1860, 1711, 1617, 2467, 4422, 6281, 6554, 5568, 3953, 4289, 3710, 5475]
10697E475k387j241L475M56L061M31k631m914J476L041j546P97K679N1l802p55
10681C666J132K584J008j464L13j90j126M82l032m958r49N18L26L98M537J83p83
10664B645j21Q15Q13O27m437l421J984J763O92N99j762L992K118j754K578J709
10648H840j235l254L60j205j334q10K94J962l64J12P25j125M615K968j419p632
10632A498j917K841L30R0k302j796J8O140K017J386K516m14l969k688j728p11
10616A311M91J220K47J832J278N77o86j420N90l867J622K548k5j571j909J654
10600C892L356N58J005L255Q85m94j435l791q35K015j91r66j919N29M494N257
10584A5615P5n8p42k335L35n24j659mL125K284m009oJ359R14L54J60J47k031k621
$$ y = [5475, 3088, 1847, 5322, 5778, 8839, 9270, 6639, 1725, 3201, 6242, 4696, 5493, 8172, 8223, 4421, 3666, 4798, 7382, 8390, 6926, 7239, 7049, 5923, 6405, 3373, -1585, -2534, -2016, -1690, -1292, 3245, 3428, 2645, 2524, 3339, 4152, 4779, 342, -3079, -1095, 668, 1360, 1959, 197, 4189, 6307, 4553, 7131, 8840, 7605, 4351, 4711, 3506, 2172, 1362, 1656, 3618, 3254, 3366, 4091, 2966, 7581, 10549, 9130, 1498, -419, 2422, 2752, 2842, 540, -1256, -1238, 4902, 6919, 8305, 10821, 10407, 6438, 3750, 2022, 1311, 1802, 3022, 3269, 5101, 6379, 6956, 6270, 4850, 5440, 1573, 3195, 5743, 5718, 4147, 2238, 3892, 7248, 7806, 8811, 12066, 12951, 12457, 11022, 7231, 6396, 8411, 8220, 7254, 5335, 5864, 10358, 15615, 15690, 15632, 14890, 12555, 12890, 12366, 10707, 10703, 13828, 16112, 12103, 12097, 13456, 14370, 14724, 14884, 15031, 13000, 10379]
10565A0379L8N228r17k412k005J415J091k558k366L096M767N020M411j316m44
10550B3427j20j444j08k15J170l388l164j470j988K382J207K273R72O06N607O505
10534C2252M389Q102J7029K3397L7409O1655J00409J60531K05834Q0522j58217
10523E73312k01591j26718o9727l4844k5665k6624j9886j5707j0459q380m537
10512B9174j400m109l452n101k48K350r02j465k12M33J563k721j720Q42k072l616
10496G344k693l554L783r54j273L067m16k236p4j020l641L074M360K9j182r33
10480C681J960r09n98R93J764Q71K955L066Q351M067p94o348l283k42k469k431
10464A0634m089l499k31K147J750J020j007k087K227M645K257l194n589l893k06
$$ y = [10379, 10417, 15645, 14728, 12316, 10311, 11726, 12817, 10259, 7893, 10989, 15756, 20776, 25187, 23871, 23427, 23307, 21863, 21755, 21540, 22710, 19322, 16158, 14688, 12700, 15082, 16289, 18562, 19534, 20140, 25747, 32252, 36641, 44743, 61772, 85169, 122578, 184233, 284642, 445173, 651007, 731529, 573312, 371721, 245003, 175276, 140432, 114767, 88143, 68257, 52550, 42091, 33711, 29174, 27774, 23665, 20213, 15112, 14864, 17214, 16312, 14847, 14635, 15068, 16631, 13910, 12190, 13032, 10960, 7344, 4651, 1097, 4880, 3926, 2653, 5720, 5304, 3068, 2994, 1974, -1667, 1407, 5767, 5796, 4614, 3681, 5641, 4732, 4134, 5127, 6891, 7762, 10717, 13783, 22134, 26201, 25407, 19059, 15776, 15534, 13065, 10634, 6545, 3046, 2815, 4962, 6712, 7732, 6725, 4638, 6865, 11510, 13767, 10573, 4984, 1091, 885]
10449H85J513O91j152R16M79p00r96j637o71L685k83o19K317m14j983j864N336
10432E503K189j569j075j782j592K870J705K213K191j614j231l074N19J458n02
10417F209q85k487j747J986L657J571n09J973O56o192j363L156p48j597J634K000
10401G314K26J916K452j156o106j919K011j686k354M25J39J421J172j177J255
10386C933l752o2N10K837L695o54j384m24K536K867k83l399l416L44K86k40M931
10369H325P23o38J141L892l502m592m84k836K472J670j048k263K782J003l91j149
10353E105l105j792K921L276k119l953j892k028L32K429J705J722rL26j235k526
10337h43M73M78O00O37k116j203K755j901K77J789j438m98L343M312K560k557
$$ y = [885, 2398, 3089, 1937, 2853, 3332, 2632, 1636, -1, -672, 3013, 2730, 2111, 4428, 4014, 2031, 167, 5503, 7692, 6123, 5048, 3266, 1674, 4544, 6249, 8462, 10653, 9039, 7808, 4734, 5253, 6711, 6209, 5324, 2837, 1090, 3076, 6733, 8304, 7795, 9768, 10424, 4232, 2869, 6025, 5277, 3680, 5314, 7314, 7540, 9456, 11908, 10752, 4646, 2727, 4738, 3052, 698, 1123, 1262, 2683, 3855, 2678, 3933, 181, 119, 629, 3466, 7161, 6507, 5123, 4699, 7235, 10102, 9819, 6420, 3004, 3348, 3634, 3394, 8325, 9048, 8410, 9551, 13443, 9941, 5349, 4865, 2029, 4501, 6171, 5123, 2860, 5642, 6645, 6254, 5105, 2000, 208, 3129, 6405, 4286, 333, -1559, -3587, -3255, -826, 879, 2601, 2592, 2918, 1683, -843, -370, 108, 708, 1345, -771, -1974, 781, -1120, -843, 946, -492, -990, 2353, 6665, 9225, 6668]
10321F668M52J647k323j292K264R21L10K139j169k334J299r86q90O84j753n91
10305E046J48k358p78M71K626J160j277n164j500K440K901L186j258L49r25O55
10289E722j971Q40J600j727k802J029K762J081J120K171m2J314j307N14j960j428
10273F916O39J243j450K030K746J278L137j157j819J97K04K543J408L456M384
10258B5755M313P447P923J1998K4391L2189L8174K4966J7007K9490L8342J1323
10246B73318k9562l2770k1551k2926l5532l9796k8239j8266j1370n007k935k886
10234B2478m533n44l334k173k993R98J557J807K680l309j085l5J34l9J629Ol976
10217I268N74N22K184j018J013j111j570j791J946J473M44r55m951j877J45m36
$$ y = [6668, 7120, 8767, 6444, 5152, 7416, 8337, 8647, 10786, 9617, 7283, 8582, 7596, 6706, 7390, 5637, 5046, 5194, 2836, 2058, 2529, 5155, 6315, 5038, -126, -1626, 814, 3715, 6901, 5643, 5992, 5067, 5722, 3751, 4591, 6191, 4464, 1662, 2691, 5453, 6534, 7654, 9825, 9783, 11097, 9790, 10304, 8344, 6916, 7555, 8798, 7348, 9378, 12124, 13402, 16539, 15382, 13563, 13760, 13964, 16507, 17915, 21371, 25755, 30068, 37515, 45438, 57436, 81827, 114016, 152190, 177156, 194163, 223653, 261995, 273318, 243756, 210986, 189435, 166509, 130977, 91181, 62942, 44676, 33306, 28299, 25364, 22478, 17945, 17401, 14067, 11894, 8901, 9899, 11456, 13263, 15943, 12634, 11549, 11514, 11648, 11609, 13238, 13244, 9268, 9842, 10364, 12548, 11530, 12543, 11432, 9862, 8071, 10017, 11490, 11934, 10979, 6028, 4151, 4296, 3860]
10201C860J827j937l559J793P60o80M08M616J352j948k397o85l670k452k206L28
10185d590J502q19K647L949Q50J943R45Q80j573p92j235L127J327j718p5j954
10169D414k041J728M059K844k386k084m57l73K158m64J16j092j614l98O64K235
10153G309j155l340n70J577k10k710J758J567K851L119K055K539J316K1l074m160
10137H893O77P44q61J7o25n927n190j578O66L788k82L55n8J00P97L534J533j120
10119E463p50Q11J050l386K1M221K353j614k712m19J657j743p85K320N79j612
10103E454L907K011j879k078L9j673q19j010o00O98q45J535J137M8r89m367J046
10086A615J751o47J273j757k534j577K879K880l117j041L287J834Ol381K129K85
$$ y = [3860, 5687, 3750, 191, 1984, 2744, 2064, 2472, 7088, 8440, 6492, 4095, 3410, -260, -2712, -4918, -4590, -3088, -3907, -1260, 2689, 3539, 5482, 6427, 7307, 5734, 4942, 3707, 6834, 8161, 6443, 6368, 4414, 2373, 4101, 8160, 11004, 8618, 6534, 6077, 5704, 7862, 7398, 7514, 6422, 4808, 4410, 5074, 7309, 6154, 2814, 2244, 3821, 3611, 901, 2659, 4226, 7077, 10196, 12251, 14790, 16106, 16127, 13053, 8893, 9570, 10314, 9453, 9470, 8845, 2918, -2272, -3850, -3184, 604, 322, 677, 619, 719, 1516, 5050, 6583, 5463, 4713, 5524, 6574, 3188, 3209, 7430, 9783, 8169, 5457, 5038, 6695, 4952, 4167, 6487, 7066, 5454, 9361, 11372, 9493, 7415, 7454, 5781, 4962, 3952, 3352, 4050, 3205, 4740, 5877, 5925, 4936, 569, 1615, 3366, 2719, 3992, 2235, -299, -1876, 1003, 3883, 766, -275, 3012, 4846, 4852, 1471, 3600, 3885]
10070C885j168j060Q475O273M607m673o446k284p13o23J114j775J21j045j184
10055C504K717K502j705Q7J164l95j337j141J362k45o09j048J559M204J237j962
10039I894m01o85k717k697K637N0k053j954L221o13j464j772j027j863O59m1K419
10022A593J309j625K89L77o63k398J495L598J573j132l74K035K614j063k304l900
10006A424j601J584R45m196K30N22l92L369K851K64k729k316J66K362K254K096
9990F833l023m905k996J511L17P30M56K16R17L35J799J199j50p14k455L252j548
9973A774j863L428J809N85j852J101O70J068N52l300J046K77k209J31k297o02
9957C18p17k64K416k792m581L164K750j632n81J130K216Nr95j275J559J555R61
$$ y = [3885, 2717, 1657, 10132, 16405, 21012, 16339, 9893, 7609, 6896, 6273, 7387, 5612, 5733, 4688, 3504, 6221, 8723, 7018, 7105, 8269, 7874, 6537, 5396, 6758, 6513, 5904, 4856, 6415, 10619, 11856, 9894, 9493, 8808, 6091, 3394, 6031, 6081, 4028, 2074, 5295, 4682, 3218, 1446, 419, -1444, -785, -826, 1593, 2902, 1277, 1566, 1943, 1280, -1118, 377, 3975, 5548, 4416, 4042, 6077, 8691, 7628, 5324, 1424, -177, 1407, 2352, -1844, -1614, -1092, -1484, 1885, 4736, 5000, 2271, -45, 121, 2483, 4737, 6833, 3810, -1095, -4091, -2580, -2263, -1533, -1077, -861, 56, 391, 2190, 3389, 3239, 2525, 70, 3322, 1774, -89, 3339, 5148, 5733, 3881, 4982, 5652, 6720, 7272, 3972, 5018, 5295, 3086, 3217, 920, 318, -399, -663, 1753, -1039, -5620, -2456, 294, -1338, -1919, -789, 1427, 1432, 437, -838, 721, 2276, 3237]
9940C237J113l497l342k541N68M99L539K005l654J038M868K143N80k047k205N41
9924B845J583R58l093k636J928J220n10K695M699K577n82n37K159k219n357P07
9908F437r16j313J301L433M60l580k395J071j135r44J083Q60O24k00j74K792K84
9891G688J094J303J930L408k414m977j900l49o56O44l72J210K594J576m23K649
9875A3005L812K788L929J464L979Q669J5704K0794J4274J741o252k426L508J1465
9861I6454K1228L2799K9011r367l3222k8392j7524q230J76R172N993p134j8708
9848G2256j7272j2642j1388q599Q54j242k664P21J945m94l822m756p84K754J195
9833A6062Q59m99N34L211K533r44n889l697J174J667J663N92N30j253o20j062
$$ y = [3237, 4350, 853, -2489, -5030, -4462, -3963, -424, 1581, -2073, -1035, 3833, 5976, 6556, 4509, 2304, 2845, 4428, 5386, 2293, -343, 1585, 2805, 2295, 4990, 9689, 12266, 11684, 11147, 13306, 11087, 5730, 6437, 5521, 4208, 5509, 8942, 9402, 5822, 3427, 4498, 3363, 2419, 3502, 4362, 4986, 4786, 4612, 7404, 7688, 8782, 10085, 12015, 15423, 13009, 8032, 6132, 5783, 5127, 5771, 5399, 6609, 9203, 10779, 10356, 13005, 16817, 19605, 23534, 24998, 28977, 37646, 53350, 74144, 88418, 90159, 83907, 81481, 84989, 96454, 117682, 150481, 179492, 170125, 136903, 108511, 90987, 82757, 82933, 92105, 98098, 90964, 72256, 54984, 42342, 30954, 22355, 23209, 21967, 19303, 20024, 21969, 21475, 17653, 12897, 12113, 14867, 16062, 16921, 16422, 16956, 20167, 22700, 21756, 15867, 12170, 13344, 15011, 16674, 17266, 17796, 16543, 15923, 14861]
9817A4861J192Q3l657n58K239J041j527j577Q77j203j834J483J953j703k409K928
9801A2189J949N76L254j812j149l890j661j114j170j712J890K184j576p62K472
9786I668N82j155J417L061K134K529L549L438M585J429K412K546j506M531L926
9771D3146O190M971k028q209q522k778r46K403O072K278k989n222n464l293l443
9756B2166k298j365j107M30J912L620N110M398R021P272M393K801P764K1802L2156
9741A18075L2835L5725K2584k671k7762l8485l4920k2926j1125l764j527o602
9729E9437j0110o438m051o62J266o10m23M504J2237J8049J9028J7017P689k399
9715A14534p380m492J0056K0806J5589Q595J4499K9528K2181j3791k9143j8950
$$ y = [14861, 16053, 16136, 12479, 11921, 14160, 15201, 13674, 12097, 12974, 11771, 9937, 11420, 13373, 11670, 9261, 12189, 14138, 14714, 17968, 16156, 15007, 11117, 9456, 8342, 7172, 5460, 7350, 9534, 7958, 7196, 9668, 10250, 9095, 10512, 13573, 15707, 18236, 21785, 25223, 29808, 31237, 33649, 36195, 34689, 39220, 43146, 49336, 54307, 52279, 44070, 35548, 32770, 31824, 34227, 40299, 42577, 39588, 34366, 28902, 25609, 22166, 19868, 18503, 17396, 17826, 19738, 23358, 28468, 32866, 41887, 49159, 53552, 56353, 64117, 85919, 118075, 150910, 186635, 209219, 206548, 178786, 140301, 105381, 82455, 71330, 67566, 66039, 59437, 49327, 42889, 38838, 38176, 39442, 38832, 38409, 42913, 55150, 73199, 92227, 109244, 116933, 114534, 107154, 102662, 112718, 133524, 149113, 157708, 172207, 201735, 223916, 210125, 180982, 162032]
9703A62032j4093k1571l0607k3639j7187j1622n382n391n304k988K48M140J90
9690B8826k119m472j663k395l217m42J043Q6j07Q29N51m123j30N97J273k594l63
9673A1580J70L397j569k751j469j18j127L98o17k56J107Q72L57J208J184k06l354
9656H806k522m24p72M870M497J702j055j652k687j822n82L514L502J038M755L294
9640B4462l550m725k844j695J154J873Q8l34J748N57P35J006K759Q187O836J4675
9624E0932J8731J4743J5064M110r239j6323j7623j6111p524k756m957l174o95
9611B5178O298J0703J3338J8787J5640L603k525r422j6790j3633j1612r012o349
9598B4204l98k571k345k794n02N21j650K025J490j973l578l089P56N179Q9l039
$$ y = [162032, 147939, 126368, 95761, 72122, 54935, 43313, 37931, 32540, 27236, 24248, 24496, 28636, 28826, 26707, 22235, 20572, 18177, 14960, 14518, 15561, 15647, 15540, 16369, 16920, 12797, 12667, 13264, 14537, 11943, 11580, 11750, 15147, 13578, 10827, 9358, 9240, 8113, 8511, 7894, 7638, 8745, 9617, 9974, 11182, 12366, 12160, 8806, 6284, 5860, 5088, 9958, 14455, 16157, 15102, 13450, 10763, 8941, 8359, 11873, 15375, 16413, 21168, 24462, 20912, 16187, 13343, 11648, 12802, 14675, 14763, 14429, 16177, 16734, 17469, 18475, 21234, 29421, 36257, 50932, 69663, 84406, 99470, 103580, 94341, 78018, 60395, 44284, 36760, 34004, 29047, 25873, 25178, 31476, 42179, 55517, 74304, 89944, 93547, 91022, 81600, 64810, 51177, 39565, 30553, 24204, 23806, 21235, 18890, 16096, 15594, 16115, 14465, 16490, 17980, 16007, 12429, 9340, 10096, 15275, 15364, 12325]
9582A2325k832j72L098K664m82l228j610j770K386M103L597j740l640j405J161
9567A2455J975K477p52j221j259k207j623l82N33J163M949J379k776l367L133
9552A4477J372J531P2k023j993J626N367q18l807m823n44L7K355J410k43r21Q22
9535A3897Q82j964M28J463l23J184M49j782L118K466j081K09K269j133r38R96
9519B0140k374m572K00L568p56l389j230J49J502K644K872K0j113j193q26q88
9503A4754J481L829L546m843k037l32j839k502J388J175r93K02K132m4M33K046
9487A8396O31j773j375j827L208O57k827O47O20j226r0o19n96L329P76k847Q39
9470A5923M905j049m447n71J706J932L52m52j81j565l55J163J411K5l270K26K738
$$ y = [12325, 9493, 9321, 12419, 15083, 14601, 11373, 9763, 7993, 10379, 14482, 18079, 16339, 12699, 11294, 12455, 14430, 16907, 16155, 14934, 13675, 11468, 9845, 9463, 9996, 11159, 16108, 17487, 14711, 11344, 14477, 15849, 17380, 17452, 15429, 13436, 15062, 20429, 19611, 15804, 10981, 10437, 10474, 12829, 14239, 13996, 13075, 13897, 14779, 12815, 13243, 14706, 14383, 15567, 16016, 14234, 17352, 19818, 18737, 18946, 21215, 20082, 19144, 20140, 17766, 13194, 13394, 16962, 16206, 12817, 11587, 11736, 13238, 15882, 18754, 18774, 17661, 16468, 15642, 14754, 16235, 20064, 23610, 18767, 16730, 16398, 14559, 12057, 13445, 14620, 13627, 13829, 15961, 15917, 16350, 18396, 19027, 17254, 15879, 14052, 17260, 17917, 15090, 15737, 16357, 15131, 15041, 14422, 13826, 17155, 17931, 15084, 15923, 20828, 19779, 15332, 14761, 16467, 18399, 18751, 18299, 18118, 16553, 16198, 17361, 18772, 18797, 15527, 15753, 18491]
9453A8491o31R48K145j008P19k490Q99r52O65K36k66K338J501J428k449l862k338
9436A5374K259J617M38K201J22o19P26M58J473P70k182n705Q4K756J291j862k270
9419A6931P10L87k376j466K798L021N13L401K999k96L45J134M353j027q45L560
9403C4142N556L757K566M724M985N36p52j579j262k139K255n956l988J127K851
9388D6823K971k436n019m829j047P91j916m411k505K003J601K25L319J511j962
9373C5119J597l656l724n05p67J777M29K72k222L65n11J326K645K671K218n10
9357C6524q48J674K372j332j062K853j347l788j611M476j743k786K976l43k771
9342C3244K083J805J86J459P01L43P58o47J125J55J429J526m92o42j329n019M17
$$ y = [18491, 17860, 18808, 20953, 19945, 20664, 18174, 19073, 18121, 18786, 19022, 18756, 21094, 22595, 24023, 21574, 17712, 15374, 17633, 19250, 19688, 21889, 22011, 21392, 22118, 22576, 24049, 24819, 22637, 16932, 17016, 19772, 21063, 19201, 16931, 17641, 18028, 15652, 14186, 16984, 20005, 20518, 23919, 26918, 26622, 26967, 28101, 32454, 31427, 30582, 34142, 39698, 43455, 46021, 50745, 55730, 56266, 55514, 53935, 52673, 50534, 52789, 46833, 42845, 43972, 46823, 49794, 47358, 42339, 37510, 36463, 37254, 35338, 30927, 28422, 30425, 32026, 32251, 35570, 37081, 35119, 36716, 33060, 29336, 28831, 28064, 29841, 30270, 30542, 28320, 28685, 28174, 29500, 32145, 34816, 37034, 36524, 35676, 37350, 39722, 38390, 37328, 40181, 38834, 35046, 33435, 37911, 36168, 33382, 36358, 36015, 33244, 35327, 37132, 37318, 38777, 39478, 39821, 40579, 39932, 41057, 41212, 42641, 44167, 43675, 43033, 41704, 36685, 37102]
9325C7102P82K67P14N07L293J526l528j108o73j58N35K875n99m273L710L008J019
9308D4999J95J195O66k580m464q34M88M68j884L303K253N65k045k598M72K314
9292D2513k993N44k220j226J552K065M549J786N45L353L57R69k625j898O17k686
9276D5202J059M17l795k26M443K372j808R20L232K904k849K463j71m76j194k310
9260E0183N85K582K378P91j861l473l278J789N893J128j49R58N746M524K471J491
9244G1758J689k493m737l871J885k490o90J062k227m393K396N539o96j036K422
9229F4118L839K508K295R03l34j674o709n300k254k176k421K338R20l55J165K683
9213E9546J804K376L933p31j67R80j058k189j361k024K747J160j64k45r19n260
$$ y = [37102, 37884, 38151, 38865, 39372, 42665, 44191, 40663, 39555, 38882, 38724, 39259, 42134, 41535, 37262, 40972, 43980, 44999, 45194, 46389, 47055, 44475, 40011, 39177, 39665, 40133, 38249, 41552, 43805, 44370, 42325, 39727, 40199, 42513, 39520, 40064, 37844, 36618, 38170, 40235, 44784, 46570, 47115, 50468, 50825, 51794, 49169, 47271, 47888, 45202, 46261, 46678, 42883, 42657, 47100, 49472, 47664, 48584, 51816, 54720, 51871, 54334, 54163, 53687, 52493, 50183, 50768, 53350, 55728, 56519, 54658, 51185, 47907, 49696, 55589, 56717, 56568, 57526, 63272, 67796, 70267, 71758, 73447, 70954, 66217, 62346, 64231, 61741, 61051, 62113, 59886, 55493, 57889, 63428, 62732, 61696, 64118, 67957, 70465, 72760, 73663, 73329, 71655, 64946, 59646, 57392, 55216, 52795, 55133, 56053, 55698, 56863, 59546, 61350, 63726, 67659, 66928, 66761, 67741, 66683, 64494, 63133, 61109, 63856, 65016, 64852, 64607, 63688, 58428]
9197E8428m322L871J560n27l069O13N389K347k437j424K515K505j386K26L36K534
9181F7159m75m092R62N026J535j517j794K043L704L293l49N15J197l004m278J436
9165G1361N242P48j097j663K54L757K202J457j067l022j421L802P3K742k814j372
9149G9182p90k339N43j345j430K061P00J696L499L951J474N055L90q24k281j643
9133H7899P42l57j529q20K981Q84j349M645N498R25j755J31L008Q84j598o13Q60
9116A00436M407M205R02k913j487k264j721L013o86k704k125n85M392K284o80
9101A04474k081p08K52j536P80J982q23K662K068N451M792J10l341L730K731j655
9085A18888M24K790R34J957J640K443M786O92j357j31J745J503L294M880K841
$$ y = [58428, 54106, 57977, 59537, 59010, 55941, 56554, 61943, 64290, 61853, 60429, 62944, 65449, 64063, 64289, 64625, 67159, 66684, 62592, 63554, 68580, 70115, 68598, 66804, 68847, 72551, 75844, 75495, 76010, 77207, 74203, 69925, 71361, 76603, 77351, 76254, 74591, 74845, 78602, 80804, 82261, 81194, 78172, 76751, 80553, 80626, 83368, 80554, 79182, 78392, 76053, 76596, 75251, 73821, 75882, 76582, 78278, 81777, 85728, 87202, 92257, 92647, 91823, 89542, 87899, 88641, 88284, 86755, 85935, 88916, 89800, 88451, 93096, 98594, 99519, 97764, 97895, 100903, 101787, 100189, 99576, 100436, 104843, 109048, 109950, 107037, 105550, 103286, 101565, 104578, 103892, 101188, 99063, 98478, 102870, 105154, 104474, 102393, 101685, 101937, 100401, 101181, 103163, 102340, 105002, 107070, 112521, 117313, 117423, 114082, 117812, 120543, 118888, 119312, 122102, 123036, 124993, 126633, 129076, 133862, 134554, 133197, 133066, 134811, 136314, 139608, 144488, 147329]
9070A47329J620J661k766j514k429L744M627J226O18R50K518L770O712k00K440
9055A70306n73k293J149M492o63L079L953J294p54j065M986K442N406M227J455
9040A97441L696K187m39Q27K248J610r92O205O728N685L658K325L075J222k759
9025B32717P38J482j139O04j494J173L362L222L374L298O98P0j831L518K895J964
9009B54651j881q71p12n52k759L089M306K328N28p33k671N10K41O564O905K958
8993B71901L634J790J462J926K128J307M048L470M222L091M47K02J647j09M594
8978C05760O23k766P47N263L647N778M686J872l01M051L305L263K196O145N476
8963C49745p51j58M570N880O944N518K459J899N668R564O470K224K525M037M254
$$ y = [147329, 148949, 150610, 147844, 146330, 143901, 147645, 152272, 153498, 154116, 155066, 157584, 161354, 168066, 167866, 170306, 169733, 167440, 168589, 173081, 172418, 175497, 179450, 180744, 179990, 178925, 183911, 186353, 191759, 195986, 197441, 201137, 203324, 202885, 203712, 205960, 207570, 206578, 212783, 219511, 225196, 228854, 231179, 234254, 235476, 232717, 233455, 234937, 233798, 234402, 232908, 234081, 237443, 240665, 244039, 247337, 248035, 248105, 246274, 249792, 252687, 254651, 252770, 251899, 251187, 250635, 247876, 250965, 255271, 257599, 258127, 257394, 254723, 255233, 255474, 262038, 268943, 271901, 275535, 277325, 278787, 280713, 282841, 284148, 288196, 291666, 295888, 298979, 299426, 299628, 301275, 301166, 305760, 306383, 303617, 304364, 309627, 313274, 319052, 323738, 325610, 325309, 329360, 332665, 335928, 338124, 344269, 349745, 348994, 348836, 353406, 359286, 366230, 371748, 374207, 376106, 381774, 391338, 397808, 400032, 402557, 406594, 410848]
8948D10848N289O215R643O721L247N982Q580J1112J0183Q014R637R830R611J1821
8934E26733J1953J4173J5382J7629J4776J8281K1259J9489J8852K5464L2867M8395
8922G85253P5309J22814J94449L13691M74279O01451M17830j79259n69764n21181
8912A714872l42439k07085j20566p6489m9569k7350p630j041N12k288M94j232
8900H80189M287N790L097l815J283J4724J2739J0151R612R118P334Q982J3206
8887I76697J4723R643J5296J7845J7656J5117J6350K0711K1245J8563J9587K1727
8875A185160K2902K0297K0564K6747K5480K1726K7091K8219K4030K7284K9286
8864A458786L4101L2911L5105L3729L3811L3161M0318M0375M0535M1722M5339
$$ y = [410848, 416137, 422352, 431995, 438716, 441963, 447945, 456525, 467637, 477820, 485834, 495471, 505301, 514912, 526733, 538686, 552859, 568241, 585870, 600646, 618927, 640186, 659675, 678527, 703991, 736858, 785253, 860562, 983376, 1177825, 1491516, 1965795, 2567246, 2985076, 2805817, 2236053, 1714872, 1372433, 1165348, 1044782, 968293, 918724, 891374, 883744, 882703, 883215, 880927, 881421, 880189, 884476, 890266, 893363, 889548, 890831, 905555, 918294, 928445, 938057, 947175, 954509, 963491, 976697, 991420, 1001063, 1016359, 1034204, 1051860, 1066977, 1083327, 1104038, 1125283, 1143846, 1163433, 1185160, 1208062, 1228359, 1248923, 1275670, 1301150, 1322876, 1349967, 1378186, 1402216, 1429500, 1458786, 1492887, 1525798, 1560903, 1594632, 1628443, 1661604, 1701922, 1742297, 1782832, 1824554, 1869893]
8853A869893M6363M9326M7034M5501M9271M8349N4654N9641N6341O0876O3836
8842B451085O5129O5036P1485P3164P4331P8303P9671Q3121Q7886R5485R9671
8831C324367J02275J01256J05337J14228J24385J35533J34185J39688J43304J53299
8821D577857J62124J73678J79879J85970J95755K07188K19214K28589K40873K51441
8811F622568K65009K81544K98959L17782L37083L53151L66843L91881M18826M40044
8801A0093690M65674M92230N24167N55297N89165O20789O47945O81693P15318
8792A5385968P51816P92699Q29254Q66893Q99127R29369R56518R82172R99440
8783B3393256J005633J005271R93404R67072R27970Q75161Q04391P20032O19575
$$ y = [1869893, 1916256, 1965582, 2012616, 2058117, 2107388, 2155737, 2210391, 2270032, 2326373, 2387249, 2451085, 2516214, 2581250, 2652735, 2725899, 2800230, 2878533, 2958204, 3041325, 3129211, 3224696, 3324367, 3426642, 3527898, 3633235, 3747463, 3871848, 4007381, 4141566, 4281254, 4424558, 4577857, 4739981, 4913659, 5093538, 5279508, 5475263, 5682451, 5901665, 6130254, 6371127, 6622568, 6887577, 7169121, 7468080, 7785862, 8122945, 8476096, 8842939, 9234820, 9653646, 10093690, 10559364, 11051594, 11575761, 12131058, 12720223, 13341012, 13988957, 14670650, 15385968, 16137784, 16930483, 17759737, 18626630, 19525757, 20455126, 21411644, 22393816, 23393256, 24398889, 25404160, 26397564, 27364636, 28292606, 29167767, 29972158, 30692190, 31311765]
8774C1311765N03066L76591K41316J01790m3251j84164l21338m52204n68181o69495
8764C0295895p55739q34345q91992r32909r59277r75755r85160r81971r64584
8755B2014163r48330r26848q95025q62121q31391p97759p60406p24231o90417
8746A4577635o57494o22891n87284n59719n31319m98958m70253m46987m24402
8737I778328l99558l78342l55156l38929l26047l07744k89411k75240k63617k49852
8727F594432k35474k22224k09499k03993j97474j84204j74091j67451j60006j54133
8717D685883j44296j36345j30283j25634j22717j18973j12871j04834r9292r5902
8707C494736r3521r3629q6339q5283q2713p6372o8698p0383o6354o5182o3759
$$ y = [31311765, 31814831, 32191422, 32432738, 32534528, 32491277, 32307113, 31985775, 31533571, 30965390, 30295895, 29540156, 28705811, 27813819, 26880910, 25921633, 24945878, 23960718, 22978747, 22014163, 21065833, 20138985, 19243960, 18381839, 17550448, 16752689, 15992283, 15268052, 14577635, 13920141, 13297250, 12709966, 12150247, 11618928, 11119970, 10649717, 10202730, 9778328, 9378770, 9000428, 8645272, 8306343, 7980296, 7672552, 7383141, 7107901, 6844284, 6594432, 6358958, 6136734, 5927235, 5723242, 5525768, 5341564, 5167473, 5000022, 4840016, 4685883, 4541587, 4405242, 4274959, 4149325, 4026608, 3907635, 3794764, 3689930, 3590638, 3494736, 3401215, 3307586, 3221247, 3135964, 3053251, 2976879, 2908181, 2837798, 2771444, 2706262, 2642503]
8696B642503o2987o0679n8410n8295n9033n1645m9370m7591m9587m5536m4856
8685B054514m4721l9593l7723l9408m0868l5426l2711l4194l5140l2893k7385
8674A654452k9185l0153l0441k7043k6352k6605k5466k3044k4673k1681k0510
8663A369299k1500k1903j8881j9306k1777k0571k0342k0062j6598j4981j3798
8652A159580j7366j3996j5175j4359j8946j7603j3483j4334j4628j6000j6897
8641I86793j4398j4723j9095j8061j2660j1179p457r698j2021r839j6546j0208
8629H30908j2155j6316j0625p405j0062j5235j0320r624j0727p137o369j1535
8617G03398j2486o737r073p915q919r479r222o205m875o432n134k291m516m842
$$ y = [2642503, 2579516, 2518837, 2460427, 2402132, 2343099, 2291454, 2242084, 2194493, 2144906, 2099370, 2054514, 2009793, 1970200, 1932477, 1893069, 1852201, 1816775, 1784064, 1749870, 1714730, 1681837, 1654452, 1625267, 1595114, 1564673, 1537630, 1511278, 1484673, 1459207, 1436163, 1411490, 1389809, 1369299, 1347799, 1325896, 1307015, 1287709, 1265932, 1245361, 1225019, 1204957, 1188359, 1173378, 1159580, 1142214, 1128218, 1113043, 1098684, 1079738, 1062135, 1048652, 1034318, 1019690, 1003690, 986793, 972395, 957672, 938577, 920516, 907856, 896677, 889220, 879522, 867501, 857662, 841116, 830908, 818753, 802437, 791812, 784407, 774345, 759110, 748790, 739166, 728439, 721302, 714933, 703398, 690912, 684175, 675102, 667187, 658268, 648789, 639567, 633362, 628487, 622055, 616921, 614630, 610114, 605272]
8603F05272q612r839p342p468o767p714l608k318r016r424m515o124m558n825
8589E12142l308m102o306l719k974n420q337n399m43l377m898o426m964m601m022
8574D43846o460q769n352m509k662m628n253k225l686m679k267q04m317j0615
8560C77620o725m060m338j184J498J703k144l524l658p085l592l357j214k533
8546C37407k728l701l235p04m610l996j850j377m336n134j280m563l946o844k422
8531B86681J803N914K910j199N68o928q742m388n90j424p62J736k296k019q41
8516B70423n19q22j312k595M035L839l859r989n388k512J106j718p671q050j607
8501B33361J811o64o85o74k433n968n254q33q43l43K371K779M729O21k302l933
$$ y = [605272, 596660, 586821, 579479, 572011, 565244, 557530, 553922, 551604, 542588, 533164, 528649, 522525, 517967, 512142, 508834, 504732, 498426, 494707, 491733, 486313, 477976, 472577, 472134, 468757, 463859, 457433, 452469, 447868, 443846, 437386, 428617, 423265, 418756, 416094, 411466, 406213, 403988, 400302, 395623, 393356, 392552, 388235, 377620, 370895, 366835, 362497, 361313, 362811, 364514, 362370, 358846, 355188, 348103, 344511, 341154, 339940, 337407, 334679, 330978, 327743, 327039, 322429, 318433, 316583, 315206, 310870, 305736, 304456, 299893, 295947, 289103, 286681, 288484, 294398, 297308, 296109, 296677, 289749, 281007, 276619, 276029, 274605, 273843, 275579, 273283, 271264, 270423, 269904, 269082, 267770, 265175, 269210, 273049, 269190, 259201, 253813, 251301, 252407, 250689, 243018, 234968, 233361, 235172, 234508, 233823, 233149, 230716, 224748, 219494, 218661, 217818, 217475, 219846, 222625, 227354, 227975, 225673, 221740]
8485B21740l502n075J023k781j074O53j925R16q58l69O4l03j268L091O047O885
8469B23264J619l549m364o899n59j317j516O89k57L372J1667J7043K6632L6291
8455C02116M1518J3212k6572m6084l8777k5969j1742n328k955m298l807o432m742
8442A80140j038P44J550j054n249l081l91k986l038M426L977j110l038k40J694
8427A71306L244P777R341J0796N957m62j0061j1675o618k534P74K563Q841K1310
8413B10559K9664M5805P4666R1126M0012m9240q4233o6733m7838l2973k1007j3896
8401A75912p740o072l177m173j147n909o47k003j068q27p75o418k034o383m615
8386A22924j077M154R85k818j124J650K973N671O476N479K119j933n516l342k199
$$ y = [221740, 218238, 213163, 214186, 211405, 210331, 210984, 209059, 209975, 209117, 208748, 208812, 208509, 207241, 210332, 216379, 223264, 224883, 221334, 216970, 210071, 209512, 208195, 206679, 207368, 207111, 210483, 222150, 239193, 265825, 302116, 343634, 356846, 330274, 284190, 245413, 219444, 207702, 202374, 199419, 195121, 191314, 184882, 180140, 179102, 179846, 181396, 180342, 175093, 172012, 171621, 168635, 165597, 170023, 174000, 172890, 169852, 169612, 171306, 174550, 182327, 191668, 202464, 208421, 207959, 197898, 186223, 179605, 177071, 177845, 180408, 189249, 210559, 240223, 286028, 360694, 451820, 491832, 442592, 358359, 291626, 243788, 210815, 189808, 175912, 168172, 162100, 158923, 154750, 153603, 147694, 147047, 145044, 143976, 143149, 142374, 135956, 133922, 127539, 122924, 121847, 126001, 126986, 124168, 123044, 124694, 127667, 133338, 139814, 145293, 147412, 145479, 139963, 136621, 134422]
8371A34422k453K392Q564J1598K0315L3245M1368K5340j3019l6333l6620k7632
8359A61187j7193j2608q634n328j823m21m141o155q23R91k862K107m95J552J826
8344A07180q58p56L199R87l487n774k514l912q79L929M10j592o46l215K70L94
8328I2736J370K53j575n73k309j940J30j711j110k489q80o72L224R14k572j439
8312H1357k405j439l78K179m70M253K17k205k821j390l801j696j488n06L139J733
8296G4279P30n68K209J60k48l138j059K802L570m002k984K553K931r92k547k335
8280G1361J122L062J675n93l79m78J174m953o938j016K295K066K232l09k791m535
8264F2995k958J507J326n27n58L626K913J066j739j12j580j521j069J021Q16j134
$$ y = [134422, 131969, 134361, 142925, 154523, 174838, 208083, 249451, 274791, 261772, 225439, 188819, 161187, 143994, 131386, 122752, 117424, 115601, 115180, 111039, 104884, 104061, 105052, 102190, 104297, 103802, 105354, 107180, 106322, 105566, 108765, 109752, 106265, 100491, 97977, 94065, 93186, 97115, 97525, 95933, 95287, 92072, 92342, 92736, 94106, 94359, 92784, 92211, 89902, 87962, 88092, 86381, 85271, 82782, 81902, 81230, 84454, 85368, 82796, 81357, 78952, 77513, 77135, 79314, 78844, 83097, 83314, 81109, 78288, 76898, 73097, 71401, 69913, 69407, 72546, 74279, 75009, 74441, 76650, 76810, 76562, 73424, 72365, 75167, 78737, 74735, 71751, 74304, 77235, 76243, 73696, 71361, 72483, 75545, 77220, 76627, 76248, 75770, 76944, 71991, 65053, 64037, 66332, 68398, 70630, 70321, 67530, 62995, 60037, 61544, 62870, 62343, 61785, 65411, 68324, 69390, 67651, 67539, 65959, 64438, 63369, 64390, 65206, 64072]
8248F4072k365j071r41n84q56L774K424M321O85l599l248j885K4r2j129L84k095
8231E7819P69N09j103O00l458l594m19K632J664M50K353J080N89J983K043J228
8215F5145k683m947Q40L756j706j213M11j504k222o81N86k222J05L607J56j218
8199E6210j954R78K74q26P56Q3K242K985P65k348l910k910m55k407J068K894r37
8182E2508j479k722P67P22K750M283K916q78K6M163M982K342K522P156J008k454
8166G8612l931k109p20n520o803l758m0l737o156o47N783M735k977r8N40K54k196
8149E1232j315J249P61n08K265k26l100j809j754j95k692J710M469K568j902J577
8133E2330N98n003j319J10K963N216M045O467J1002J2649R565N158k278j0173
$$ y = [64072, 61707, 60636, 59695, 59111, 58255, 62029, 64453, 68774, 69459, 65860, 62612, 60727, 60751, 60659, 59530, 59914, 57819, 58588, 59097, 57994, 58594, 55136, 51542, 51123, 53755, 55419, 55869, 58222, 59302, 59891, 61874, 63917, 65145, 62462, 57515, 58355, 62111, 60405, 59192, 59603, 58099, 55877, 55196, 55782, 53560, 53665, 57272, 57428, 56210, 54256, 55234, 55508, 54682, 55438, 55521, 57763, 60748, 61513, 59165, 55255, 52345, 51890, 49483, 50551, 53445, 52508, 51029, 48307, 49074, 49796, 52546, 56829, 59745, 58867, 58893, 63056, 68038, 70380, 72902, 80058, 81066, 78612, 74681, 72572, 71852, 66332, 59529, 55771, 55731, 51994, 45838, 45191, 50974, 55709, 52732, 52634, 53174, 53428, 51232, 49917, 51166, 51927, 51419, 53684, 53458, 50358, 48549, 46795, 46600, 43908, 45618, 50087, 52655, 50753, 52330, 52928, 47925, 46606, 46716, 49679, 54895, 58940, 65407, 76409, 89058, 98623, 103781, 101503, 91330]
8119I1330r025p958p754m773k965j629m088m198j96K681j9q69P12m29k573m082
8103D4165k7L183r19K983p06k619r84k053j984m03K622M34j274M325J123l361
8087D4505j348O86M01J615K097k710K825K647K683N526L036J342k008k310j751
8072E7236J584k991p381k599O0L73j383o260m19O49J101l12N53j449k289L84K099
8055C8956K351K037K953J349r11j916k781k13J756j610l44j690O51l087k589J429
8039C6341J066K547l199j296P1L451O49J267j285l74o8k162J591M351r32K62l768
8022C8512Q8j31p09M882J214o997l354J086J432K932K762K717J048j858n284p62
8006C7578K548l77k378M41k90l163j750K109K033N65J284m970k141L618K806n83
$$ y = [91330, 82305, 74347, 66593, 61820, 58855, 57226, 53138, 48940, 48744, 51425, 51406, 50537, 51249, 50820, 48247, 44165, 44138, 47321, 46402, 49385, 48679, 46060, 45076, 43023, 41039, 40636, 43258, 43692, 42418, 46743, 47866, 44505, 43157, 43843, 44244, 45859, 47956, 45246, 48071, 50718, 53401, 58927, 61963, 63305, 61297, 58987, 57236, 58820, 55829, 48448, 45849, 45909, 46282, 44899, 38639, 38220, 38869, 39970, 39658, 40211, 38762, 36473, 36857, 38956, 41307, 43344, 46297, 47646, 46735, 44819, 42038, 41825, 43581, 41971, 41627, 39937, 40588, 37501, 34912, 36341, 37407, 39954, 36755, 35459, 35530, 38981, 39630, 40897, 39612, 39238, 39170, 37008, 38599, 42950, 42018, 42280, 38512, 38600, 38469, 37760, 42642, 43856, 36859, 33505, 34591, 36023, 38955, 41717, 44434, 45482, 43624, 38340, 37578, 40126, 39749, 37371, 37812, 37522, 34359, 32609, 34718, 36751, 37316, 38600, 33630, 31489, 35107, 37913, 37330]
7990C7330m58j99j184j113k695k422J259k64K21k060j209O054J316j988k491m65
7974B9632L132K791J607j229P0k97l216j577p62J515j284L786m93n22k396j457
7958B9300j548Q11J222j5j09K053R4J051j901j349J060J497n2n47q94J817M85
7941C2975q24k573J820j700m480o84J308j96J910L423N68l943k925j479K248K146
7925B7594k514k445K554K720k32p38J994J921J027J200j908l090m473l002O96
7910B1304J47m04q43J078m25K084L11k230j033J921n52J744J372N9q15K44n17
7893B3445J143J61j876k807k81K330m61K057k027n099K288J732J625R1j376l125
7877A7820J276N050M2k117n28j729K785p20k226R26r6k171N25L049P50O11j80
$$ y = [37330, 36872, 36673, 35489, 34376, 31681, 29259, 30518, 30254, 30475, 28415, 27206, 33260, 34576, 32588, 30097, 29632, 32764, 35555, 37162, 35933, 36003, 35706, 32490, 30913, 30151, 31666, 30382, 34168, 33675, 33153, 30757, 29300, 27752, 28563, 29785, 29770, 29661, 31714, 31808, 32859, 30958, 29609, 30669, 32166, 32114, 31567, 30673, 32490, 32975, 32151, 29578, 31398, 29698, 25218, 24534, 25842, 25646, 27556, 30979, 31547, 27604, 24679, 23200, 25448, 27594, 25080, 22635, 25189, 27909, 27677, 26939, 28933, 30854, 31881, 33081, 31173, 28083, 23610, 20608, 21304, 21451, 21047, 20204, 21282, 20857, 22941, 23252, 21022, 19989, 21910, 21358, 23102, 24474, 24533, 23718, 23962, 23445, 24588, 24749, 22873, 20066, 19785, 22115, 21654, 23711, 21684, 16585, 18873, 20605, 22230, 22321, 20945, 17820, 19096, 24146, 24188, 22071, 21543, 19814, 22599, 21879, 19653, 20579, 20483, 18312, 18837, 21886, 22636, 23247, 23067]
7860B3067j947m98K321r08k674r74r42j313J655K542p18m94j464L63p61o0L109
7843B0304j467j549K015J197l069k39L81k8j172o50M088j72l87J471M49j930J565
7826B0807k886j914j529r45K803N3k564j280j058l849J508M510N165n51j041J29
7810A7358k250j238j734K014K031K171Q73j539j389J320O78l78M78j19m04l407
7794A4465j917K236J29J789J834N16K126J670j004k454l166O29K292k7J063j507
7778A8674n35j319l96K237n79K409J397J158j355q40K065J078j047n559q39J087
7762A7636l576j451l252M98j274J758L053j479r73J078K523n46j693K668L737
7747A8707J618N57j197M60P2k800k012K217K767L143J837l027K31J283n361k535
$$ y = [23067, 21120, 20622, 22943, 22035, 19361, 18387, 17445, 16132, 17787, 20329, 19611, 19117, 17653, 18016, 17255, 17195, 20304, 18837, 17288, 19303, 20500, 17431, 17192, 17573, 17545, 16373, 15723, 19811, 19639, 19252, 20723, 21172, 19242, 20807, 17921, 16007, 14478, 13533, 16336, 16389, 13825, 12545, 11487, 7638, 9146, 13656, 18821, 18270, 17229, 17358, 15108, 13870, 12136, 14150, 16181, 18352, 19225, 17686, 16297, 17617, 18295, 17917, 18395, 18276, 17872, 14465, 12548, 14784, 14913, 16702, 18536, 19052, 21178, 22848, 21844, 19390, 16224, 16853, 19145, 19118, 20181, 18674, 18139, 16820, 16424, 18661, 18082, 20491, 21888, 23046, 21691, 20851, 22916, 23994, 22947, 17388, 16549, 17636, 14060, 12609, 9357, 9855, 8581, 10339, 13392, 11913, 10940, 12018, 14541, 13995, 12302, 14970, 18707, 20325, 20882, 19685, 20145, 20217, 17417, 15405, 17622, 20389, 23532, 25369, 22342, 22573, 23856, 18495, 15960]
7731A5960L9J560P1j950l68K108M58j11l288j112l70J014n26l875o42K561M004
7714A5533p5o9k221k025q73r34K597L009M637L274m454J368m352p999k99L514
7698A0631p57K49K472L50R05L366J330j780j419J370K871j384l614k168j892J376
7682A1906R7p98J470J713J807j004L77j90M74m218j057r54l488k945M580L480
7666A1250j137J06j022K038M114J446l886l149K322J253j519o8j442k03L517J329
7650A4949k965k720p87Q21L53J395N47q83K827L647J350k370j688q28J604J624
7634A6876j480R23m23K578L52j134k38j536j261n29l900R52K292n07j069r7L48
7617A2147K09o33k42N61j65O01P35J083j657j685J415o97j980L07M53K02K54K558
$$ y = [15960, 15999, 17559, 17630, 15680, 15312, 17420, 17878, 17767, 14479, 13367, 12997, 14011, 13485, 9610, 8968, 11529, 15533, 15458, 15389, 13168, 11143, 10270, 9336, 11933, 14942, 19579, 22853, 18399, 19767, 15415, 7416, 7117, 10631, 9874, 10123, 12595, 12945, 13850, 17216, 18546, 16766, 15347, 16717, 19588, 18204, 14590, 12422, 10530, 11906, 12003, 11205, 12675, 14388, 16195, 15191, 15568, 15378, 15852, 11634, 10577, 9623, 6135, 3190, 7770, 11250, 10113, 10219, 9197, 11235, 15349, 16795, 12909, 9760, 12082, 13335, 11816, 11748, 10306, 10103, 13620, 14949, 11984, 9264, 8477, 9298, 9651, 11046, 11593, 10710, 13537, 17184, 18534, 16164, 14476, 13648, 15252, 16876, 15396, 16319, 15896, 18474, 18826, 17692, 17454, 15918, 14657, 14128, 10228, 11180, 13472, 12965, 11896, 11799, 12147, 12356, 11723, 11481, 12042, 11877, 12478, 13213, 14296, 12639, 10954, 12369, 11672, 9692, 9999, 10452, 10654, 10908, 13466]
7599A3466m37r83j083k22K646P39k173k105j907l35L39M39P08l39K157J449J545
7582A3904o42K866M9l649q00M09L69r00m86k202m88J952M14k062L38p78L485L697
7564A5476j377Q2j290j851k945j668K152J003j914J304l69p41K617K213k487j235
7548H970r33Rq08J741K397l305m333L521J552J419J98N39Q03k198m55J477L918
7531A4512k673k776K1J204N10k722k85J495J504M389L93j858j517Q05Q97M62j152
7514A3209j891o8J856k329k338j946N86MJ265K621M271n0o71k207k774j718K33
7497H053r76r17J645j96K737R64k381M2j214J10M59k936j123J732J197L59m413
7480C142p93M004J912j945r25K646K640k289Q41J378j832k027J021r80O11R41
$$ y = [13466, 13029, 12046, 10963, 10741, 13387, 14126, 11953, 9848, 7941, 7606, 7945, 8384, 9092, 8753, 10910, 12359, 13904, 13262, 16128, 16177, 12528, 11728, 12137, 12506, 11606, 11120, 8918, 8430, 10382, 10796, 8734, 9072, 8294, 11779, 15476, 14099, 14181, 12891, 11040, 8095, 6427, 8579, 9582, 7668, 8972, 8603, 7862, 10479, 12692, 10205, 8970, 8037, 8046, 7238, 8979, 11376, 8071, 3738, 7259, 8811, 10230, 10428, 10967, 11770, 9572, 9117, 10594, 14512, 11839, 9063, 9084, 10288, 10798, 8076, 7791, 9286, 10790, 15179, 15572, 13714, 12197, 13002, 13899, 14361, 13209, 11318, 11250, 13106, 10777, 8439, 6493, 7079, 7083, 8348, 10969, 15240, 15190, 14519, 12312, 9538, 7820, 8053, 7077, 6160, 7805, 7609, 10346, 11310, 8929, 8971, 7757, 7867, 8326, 5390, 4267, 5999, 7196, 7555, 3142, 2349, 6353, 8265, 6320, 5395, 8041, 10681, 8392, 9233, 10611, 8779, 6752, 7773, 6793, 7404, 8345]
7464H345Q57J047j826J906p42m839J305M298m05k075k635n83K387K234K763K890
7448A4927q28k380k755j7J954m208k918K823J893P98J708j619j683k078K20k962
7432B875L601L928j295l253p56L696K531k885m97p11k917j133M415K096m43m52
7416H800j469j227K92L392L543j444J175j462m577j330K515o24o110J137J329
7401C940L83k84L424p45N38k371j565M72j370p59K272K237J920r45k600p09J709
7384E547K150j841k371k28k43J504K60p75K262J190J582n68j55M27j60P13m317
7367D977m149n44L286N44K405L860j012l795O53O99K207l77m29O24o48j091m57
7350F753K244M578m23Q7j186m131M06Q1J064k184m453P66L396J130N29K603k086
$$ y = [8345, 9202, 10249, 8423, 10329, 9587, 4748, 6053, 10351, 9946, 7871, 5236, 4653, 7040, 9274, 12037, 14927, 14099, 11719, 8964, 8947, 10901, 6693, 3775, 6598, 8491, 9289, 10997, 9378, 7695, 5617, 5837, 2875, 6476, 10404, 9109, 5856, 5100, 8796, 11327, 8442, 7945, 7234, 4317, 3184, 7599, 9695, 9252, 8800, 7331, 6104, 6396, 9788, 13331, 11887, 13062, 11600, 7023, 5693, 8208, 7584, 1474, 2611, 3940, 4323, 4039, 7463, 6718, 7256, 4885, 3320, 3792, 2422, 1663, 3935, 6172, 8092, 7147, 4547, 3838, 5547, 7697, 5856, 3485, 3257, 3014, 4518, 4778, 4003, 6265, 7455, 9037, 8469, 8314, 8741, 8581, 9294, 4977, 828, 284, 3570, 4114, 6519, 10379, 9367, 5572, 6225, 6924, 9131, 8754, 8325, 8949, 8301, 7210, 6753, 8997, 13575, 13152, 13239, 12053, 7922, 8328, 8409, 9473, 7289, 2836, 3602, 6998, 8128, 8657, 11260, 9174]
7333I174j680K421J716r78j613r51o50k791K0L10n639R15K120J994J453j165O1
7316D717K795k95J057l02l094K75j206j883N024J173P11j311j00k432k848P20
7300C001L923n31m202j338k373N49L845O49j808J571J780J709j119n53P18j296
7284D525L145Q56l814k258r98O33j29l603Q73L65K331J725r67M50K227J906J54
7267G421j960l204j849J700j734M16L177n46l235Q58O977M75k566k21K776J029
7251I514j829j545J890K236q13J128P49k795k10m871j176L431R3n79n5k04P01
7234E665m68J443l353k671L328K349J490O60K01r94k000J838J081j533J172J070
7218I278M78J67o74p68L626p72j148k049o96l014p13L442k103N6p91O60k117k507
$$ y = [9174, 7494, 9915, 11631, 10653, 9040, 8089, 7439, 4648, 4668, 4978, -661, 254, 2374, 4368, 5821, 4656, 4717, 7512, 7217, 8274, 7972, 4878, 5153, 3947, 2064, 7088, 8261, 8972, 7661, 7561, 5129, 2281, 3001, 6924, 6393, 2191, 853, -1520, -971, 2874, 3523, 1715, 3286, 5066, 6775, 5656, 5103, 5821, 4525, 7670, 8526, 4712, 2454, 1456, 2089, 1960, -1643, -770, -405, 1926, 3651, 2684, 3134, 5361, 7267, 7421, 5461, 2257, 408, 2108, 374, 790, 3967, 3421, 186, 1044, 8021, 8496, 5930, 5709, 8485, 9514, 7685, 6140, 8030, 10266, 9453, 10581, 11330, 8535, 8325, 3454, 2278, 5709, 5802, 5223, 5168, 4964, 5665, 5197, 6640, 3287, 616, 3944, 6293, 7783, 8443, 8644, 7650, 5650, 7488, 8569, 7036, 8208, 9278, 9756, 9923, 9249, 8481, 12107, 11335, 10187, 8138, 7442, 4428, 3715, 7157, 5054, 5110, 4319, 4979, 2862, 355]
7200C55o27j68j024L746J800k323J596L65j344J875L06o29J012K254j124k737
7184C333l498l89J653J669L712l52m57L46R37N247Q20l025l320J81n07M29M493
7167A1272N72n960l672q8J53j61j422K576M65j981j245m53j153O22j899J519K761
7150A906j331j437k25K019L782L04j403j771n73M22K886l97J712J676j437J513
7134G646j345k853nJ25j37J07m55l85k481p33J997L263J040k203k254k8K478J83
7116C960N25J015J227p88k893k497L45k577j534P58q21K284K886K653J699q62
7100E380J380J168N69J104P3J45k843j731J453k02j225k516j556K181J175j098
7084C457J105k71L293L1m79l191J139J537l357J049L97J720o81j635M968j494
$$ y = [355, -272, -440, -1464, 2282, 4082, 1759, 3355, 3720, 2376, 4251, 4557, 3928, 4940, 7194, 6070, 3333, -165, -554, 1099, 2768, 6480, 6128, 5671, 6017, 6954, 12201, 13021, 9996, 6676, 6857, 6350, 6779, 11272, 11844, 5884, 2212, 2124, 2277, 2116, 694, 3270, 3735, 1754, 509, 56, -1097, -475, -2374, -855, 1906, 575, -862, -1087, 932, 4714, 5018, 3615, 1844, 1271, 1693, 4579, 4182, 5894, 7570, 6133, 7646, 6301, 3448, 3443, 3568, 3431, 3538, 3083, 2698, 217, -516, 1481, 4744, 5784, 3581, 1327, 1299, 3777, 3960, 4485, 5500, 6727, 5939, 3046, 549, 894, -1683, -3217, -2459, -3280, -996, 1890, 4543, 6242, 5380, 6760, 7928, 8497, 9601, 9674, 9819, 6976, 5245, 6698, 6496, 5271, 2755, 1199, 3380, 4555, 3457, 4562, 4291, 7584, 7615, 7136, 3945, 5084, 6621, 3264, 4313, 4710, 6430, 5749, 4114, 9082, 7588]
7068G588j094M40J318l67k176j339O25J730k71j678K99k456l973j292J127k80
7052a799K273J534j902L071L08N90J314K75p45l58l043k322q84l178j891L685
7036c072M897p64o21P09j943M39k128J542K258K451j91m29O43K09K00K439l783
7019B856o57k79J886M31k80N67J56P61j0j687k008J36J054J62k79k088m30Q62
7001A153L583m20O96L60l46j641j388m464L9K696R99J338L018J763L78r04k938
6984C922R59l859k240n12P31K495L064L856o43l752r85j30l5p23J870k44R84j213
6966C545M86n42m21k511N77K619n833j576K883L667j567J622N05j266O10k91j381
6949A126L988m48j428K717l108l558K016J818J118J893j032L63Q88k428j814Q87
$$ y = [7588, 6494, 6934, 8252, 7885, 5709, 4370, 4995, 6725, 6454, 4776, 5075, 2619, -1354, -2646, -1519, -1799, 474, 2008, 106, 3177, 3485, 4075, 5389, 5664, 4919, 4561, 1518, -804, -1688, -4866, -6757, -3072, 1825, 1061, 440, 1149, -794, -355, -2483, -941, 1317, 3768, 3577, 3148, 3791, 4000, 4200, 6639, 2856, 2199, 1920, 3806, 4237, 3957, 4524, 4680, 5441, 5431, 3744, 1736, 1872, 2926, 3088, 2809, 721, 291, 1153, 4736, 4316, 5012, 5372, 5026, 3385, 1997, -2467, -2428, 268, 1267, 2605, 5623, 7386, 7764, 6860, 3922, 4881, 1022, -1218, -1730, -999, 1496, 4560, 8416, 7773, 4021, 3036, 2906, 2871, 2148, 4018, 3774, 4758, 3545, 4031, 3489, 3068, 557, 1134, 3753, -2080, -3656, -773, 2894, 1327, 2949, 3454, 2188, 2798, 2507, 1126, 5114, 4666, 3238, 5955, 2847, -711, 1305, 3123, 4241, 6134, 5102, 5465, 6353, 3925, 2111, 2998]
6933B998J699j512k749k569l10J582j261L55n026p99M809R34j054K840L844J612
6917E393o84M29l279q62o92K124k412k892L160K843N52j448k192K839L804p47
6901E936k660j700j326p07J112o08o99j613J306J677j166k072j020J157q92R89
6885b286J275K714n20j999P81R48k73Q03j59j229J182J936J794k902m212p67M794
6868A880J785K599k376o25o58O87J944J130l882l561m9N324N372K040l402n096
6852C112L33k363k3L28l001l05K781K60j011J890p75k155P86m67k128j993J179
6835c552m09J31K442J853j061l176l717m40Q82N178K089K359j259k869n8o9k2
6818a698J294K370J186m31L582k888k776j804k472K237K818m51o274l253J990
$$ y = [2998, 4697, 3185, 436, -2133, -2443, -861, -2122, -1767, -6793, -7592, -2783, -1849, -2903, -63, 3781, 5393, 4709, 5138, 1859, 997, 305, 2429, 17, -2875, 285, 3128, 3680, 2232, 40, 2879, 6683, 5936, 3276, 1576, 250, -457, 655, 47, -652, -2265, -959, 718, -448, -2520, -3540, -2383, -3275, -2286, -1011, 1703, 1183, -816, -35, 913, 640, 1443, 1284, 55, 1237, 3173, 4967, 2065, -2147, -2914, 1880, 3665, 6264, 3888, 3263, 2605, 3292, 5236, 6366, 2484, -1077, -1126, 4198, 9570, 11610, 8208, 3112, 3445, 1082, 1059, 1387, -1614, -1919, 862, 1122, 111, 2001, 1226, -929, -143, -610, -2738, -4731, -3552, -3961, -3830, -1388, 465, -596, -3772, -7489, -7929, -7047, -1869, 220, 2579, 1320, -1549, -1607, -1676, -1698, -404, 1966, 3152, 2721, 6303, 3415, 639, -1165, -3637, -1400, 1418, 967, -5307, -8560, -6570]
6803f570L16J823J321K235J856k703R90L827J55k657l24j85j13j028j091J897
6787b51K191p53k573j078L145L890p00k526l95K614J234k123l515Q05M525j069
6771C421k59k25J32J417j44j550j148K521l803l08L253J171N29l725k131J071
6755B22K418J848j951n652J53J637K69K106L553m92M9j239O52q95j70L63o96J768
6737C943Q2O52J153O33l503j265j247k444J819K980j448k418P38L264N88j597
6721A930R10l566l51Q9l61j429l22J884Q81J036J098k35R52J705O3l765j729k968
6703d178R63L184J000J109k850o68O43L601mK88j218j425Q33K89J469K91j321
6686B006l066K354q32R2J88J727K079k525l868l294K545K510M366n75j087m9j310
$$ y = [-6570, -6254, -4431, -3110, -875, 981, -1722, -732, 3095, 3250, 593, 269, 84, -29, -1057, -2148, -251, 1940, 1187, -1386, -2464, 681, 4571, 3871, 1345, 950, 3564, 4798, 2675, -840, -35, 4490, 3421, 3162, 2937, 3069, 4486, 4342, 2792, 1644, 4165, 362, 54, 3307, 4478, 5007, 1282, -849, 222, 2640, 4488, 2537, -3115, -2962, -1325, -1056, 1050, 4603, 4111, 4160, 2921, 3573, 2678, 2508, 2871, 2175, 3943, 4025, 4677, 5830, 6463, 2960, 1695, 448, -1996, -177, 2803, 1355, -1063, -325, 2939, 3527, 1930, 2840, -726, -1077, -988, -1349, -2778, -3100, -1216, -335, 701, 1799, 1564, 2516, 4221, 4284, 519, -1210, -4178, -3215, -31, 969, 2078, -772, -1440, -797, 2804, 2800, 3088, 1870, 445, 1278, 1567, 3036, 3327, 2006, -1060, 1294, 462, 554, 742, 2469, 4548, 2023, -1845, -5139, -2594, -84, 4282, 3707, 2620, 2571, 1261]
6669A261p26J908J258K567r32l072J781k182J315R2r94j040r67j170k117k02O8
6652c152L20J378j920K531m1l705Q79J235K267j16M82j589k412R22j48k170k846
6635h085L370J809n56O96p027q03N593J488j256L076P91O53k132o3O78J380J181
6618G93J541j426n2n67k195j885r17J125K11J884j763O5j414K913K724J327j832
6601E32J452m618l947J24k337J603M691J072L48J864J670j698j174K531K806k618
6585B301l504k195r24J212j14j196m38P60k041J406K250J565p1j131j525R09J200
6568a536P34O2m69N0Q92J8l932q00R08J496M034P2k819J542Q24o90J159k198j782
6549b435M459K777l764l467K505L040K078j657j895J365q40j468j146k878l279
$$ y = [1261, 535, 2443, 3701, 6268, 5336, 2264, 4045, 1863, 3178, 3270, 2276, 1236, 269, -901, -3018, -3220, -3152, -2832, -1454, -3374, -843, -884, -4589, -3710, -2475, -208, -324, 158, -1431, -3843, -2921, -3069, -5239, -8085, -4715, -2906, -3462, -2766, -9793, -10596, -5003, -3515, -4771, -1695, -904, -251, -2383, -2446, -1768, -388, 793, 2334, 908, 856, 289, -1906, -3791, -4708, -3583, -3372, -1488, -3251, -3186, -4600, -1687, 1037, 2364, 532, 1984, -2634, -6581, -6457, -8794, -7191, -2500, -1428, -1080, 784, 2454, 756, -418, 2113, 4919, 2301, -1203, -3398, -4322, -3110, -3224, -4420, -4858, -4098, -6139, -4733, -2483, -918, -989, -2120, -3645, -2736, -1536, -802, -740, -1209, -1159, -267, -249, -4181, -4981, -4073, -2577, 1457, 1529, -1290, 252, 1076, 386, 1545, -653, -2435, 2024, 4801, 1037, -2430, 75, 3115, 5193, 3536, 1641, 3006, 2166, 698, -448, -3326, -6605]
6534f605o93L963J026o93j288M71j15j315J935L507o11l542J706J150o99k325
6518d128n67L85L866J34k564J022K911j539j634j557j208r26J476K904J664k39
6502@r09j483K765R27O14J737J029K97j619m753m015J826P69k899J37L681K490
6485E94l679K427K671M77l203o95o19K306K6k116j015j057n00J173Q43K87j467
6468c547Q12K560J798M34n15L057K34k535n70K233j679l83J475k626m12K444k104
6451F76j466J408M650J526l053k738Q3P67L924R08l014n636j053L431j418j724
6435b729K209K073L196j699M45J028k1O9j246N125q84o218k295k26J950J914L402
6418F093J401j756l604l214J808O51j806k999j4J292K322M22m078q61L21K995
$$ y = [-6605, -7298, -3335, -2309, -3002, -4290, -3819, -3934, -5249, -3314, 193, -418, -3960, -2254, -1104, -1803, -4128, -4695, -4310, -444, -310, -2874, -1852, 1059, -480, -2114, -3671, -4879, -5805, -4329, -1425, 239, 0, -909, -2392, 373, 1300, 1914, 3651, 4680, 4977, 3358, -1395, -5410, -3584, -2815, -5714, -5577, -1896, 594, -3085, -658, 2013, 2490, -713, -1408, -2027, 279, 305, -1811, -2826, -3883, -4383, -3210, -2367, -2080, -3547, -2735, -175, 1623, 2057, 1542, 4599, 4833, 2298, 1728, 3961, 2282, 1899, 3374, 748, 336, 2780, 676, -790, 618, 5268, 6794, 3741, 1003, 1086, 1853, 5777, 6685, 3671, -1965, -3018, 413, -1005, -2729, -520, 1553, 4749, 3050, 3495, 4523, 4502, 4571, 3325, 8450, 7566, 1348, -947, -1173, 777, 2691, 6093, 7494, 5738, 2134, -1080, 728, 1379, -427, -3426, -3440, -2148, 174, 596, -3482, -4343, -4022, -1027]
6402a027L93n64K576l008M40o16j293LK622K395P30j759N40Q5P96j677q70j530
6384a764K243K934k020j025J31q71l517O26J568K576k54k349j087L26q74J764
6368a593K282K142R62j570k040P17k070J720M611K023k298P43K472j552k267j882
6352B400p08L25j366n53J36O32O97j550j056o90R30J230q2L508J3K014p25k624
6334B531m70K637j019o81k012j232j192Q28K329o79R03P98Q92j119k034m296j862
6317e678L850L92K2J271J684J33O12j03k00o77n05J411K380O90m74n83k870l415
6299b060o53q75j134N297L217l217l450J155K855j105m302k915l60J644K71M62
6283e170L867J274j699J125P99j570q09j549j643O39M255K609m241r19N98J084
$$ y = [-1027, -634, -1198, 1378, -1630, -1190, -1806, -3099, -3096, -474, 1921, 2651, 892, 1432, 1517, 2313, 636, -234, -1764, 479, 3413, 1393, 368, 499, -372, -3889, -3263, -1695, 881, 627, -1722, -2809, -2483, -3357, -1593, 689, 2831, 3793, 2223, 183, 900, -1170, 550, 5161, 7184, 4886, 5629, 8101, 6549, 4282, 2400, 1692, 2017, 651, 98, 234, 866, 1563, 13, -1043, -1733, -803, 427, 345, 3853, 3866, 5880, 5155, 2531, 2061, 4698, 3679, 2998, 986, -246, -1438, -610, 1719, 1040, 1943, 2741, 3633, 2514, 480, -3816, -5678, -1828, -1436, -1414, -143, 1541, 1674, 2286, 2183, 1983, 1306, 801, 2212, 4592, 5282, 4808, 4225, 1355, -2060, -2713, -3588, -4722, 575, 3792, 575, -2875, -1720, 1135, 30, -4272, -7187, -7547, -5903, -5632, -5170, -1303, -29, -1728, -603, 196, -1374, -2183, -3732, -5375, -4736, -481, 2128, -2113, -3032, -2434, -1350]
6267a350j909j229j651j492N42L183K216R69l251J565J115J42n59K85k682k031
6251f137M079l29k32K14o44J097K593P53m735m135J375Q32N74j907J730K910J459
6234e03L090P07j903p29n17k648m024K171L56r13r71K58L5M2L789L628J680K635
6216F183k079k430l687l90K389J574j690Q29j799l61R82m09j138K272J904k592
6200d42k129k17J213M85J31j835k17J543K016Q02J80K004r52P98l308j587R68
6183e47j321j280k039K364K809p96N94J026l6n708j310K425L115K542l229m204
6167e595r57K034M717J655j238l257n284p57K036K159J30L837M26L31j606l273
6151d642J647K031J160m60J38o22j886J764Q01L842L98r75P43n98k754j638q02
$$ y = [-1350, -3259, -4488, -6139, -7631, -7089, -3906, -1690, -721, -3972, -2407, -1292, -1150, -1709, -1424, -4106, -6137, -2058, -2387, -2619, -2405, -3049, -1952, 641, 1394, -3341, -7476, -6101, -5269, -4695, -6602, -4872, -1962, -503, 2587, 3294, 1391, 662, 145, -2503, -6527, -4356, -4000, -4913, -5884, -5626, -5591, -5549, -1760, 1868, 3548, 6183, 4104, 1674, -2013, -2403, -14, 1560, -130, 699, -1100, -1461, -479, -888, -2026, 246, 2150, -442, -2571, -2788, -1575, -1090, -959, -2794, -3011, -1468, 548, 1350, 1530, 3534, 2582, 3380, 72, -1515, -547, -1868, -3148, -5187, -2823, -14, -810, -216, 810, 774, -4934, -6244, -3819, -704, 1838, -1391, -5595, -6552, -4518, 199, 1854, 616, -2641, -7925, -8682, -6646, -4487, -4357, -520, -94, 237, -1369, -4642, -2995, -964, 196, -264, -126, -748, -2634, -870, -69, 3773, 4171, 3196, 3939, 3341, 587, -1051, -1853]
6134a853J560J082J873m393k807r33Q08R4k976j748K675L535J095k500p57j115
6118f360M81j048j10L472m80m96k61M376J039P49J405n84q01k738k279J779q35
6101b691M20k820k776n42K265P45J90M31j056R93l00K565l89j35j478k416m6K551
6083d489J71m82L118L272R09k936O34J924L295k896j576K550m70j820l363R78
6067a181k298q98Q70r66n33K27L049q33L702O65K301m48j030k422Q95K313N26
6050C939k151l292j166M85J698k08m828r10M47J77J728L941Q88L160k835j436
6034c63l49N83j640Q94K236J710K035k383l791L176J369j850l860j940j84L64
6018c993J314K028K376k835j077M41L419O69N64J110M45J168j466j679j473K785
$$ y = [-1853, -293, 789, 2662, -1731, -4538, -5471, -4663, -4569, -7545, -9293, -6618, -3083, -1988, -4488, -5245, -6360, -5879, -6927, -7037, -3565, -4045, -4541, -4802, -426, 613, 1362, 2767, 2183, 1382, -1356, -3635, -1856, -2691, -2271, -5091, -7867, -8409, -6144, -5399, -5209, -4778, -5834, -4841, -5141, -2576, -2965, -3100, -4578, -6994, -7040, -4489, -4318, -4800, -1682, 1590, 2499, -437, 197, 2121, 5416, 2520, 944, 3494, 3024, 1204, -2159, -1181, -3479, -4377, -3507, -4473, -5006, -4779, -1730, -2563, 1139, 1804, 4105, 3657, 2627, 205, 1100, 3413, 3939, 1788, -1504, -2670, -2185, -487, -695, -5523, -6433, -5986, -5809, -4081, -140, 748, 3908, 1073, -363, -712, -129, -1769, -875, 1361, 3071, 5106, 2723, -1068, 2108, 3477, 1627, -2233, -4173, -4357, -3993, -2679, -651, 1725, -1110, -2187, -1746, 1673, 2342, 2906, 4016, 4461, 5629, 4163, 2484, 1011, 3796]
6002C796q43j261J144K819j820o40Q48l901m42P76l0k58o89r10o13J739K888L46
5984B949m308l742P62J880K143R29J931m33j860R24P2l785k589K014J330j523
5968c306k892J932K432j568J333j945J483j373k474L756o8p61R87K957K177Q97
5952C567k762j260K379K941j792l538j241K452L966R19o143k502P87J09J516P88
5936A86j379j94o79l29k251J334R1L76L82P75j766j047j189J634K268K409o08
5919A3K74J145J389K172K417j90m729k141o08j046K064J57R30N31m402j766K305
5902a485K489J654J238j585k009k790n76l13p76k328j320j733K224L286J455N0
5886b519o61k672N32K042J99m44j07j437L5J472L813J626k548m94J43j289O00
$$ y = [3796, 2953, 1692, 2836, 5655, 3835, 3195, 4043, 142, -300, 476, 446, 188, -501, -1411, -2024, -285, 2603, 2949, -1359, -5101, -4339, -2459, -316, 613, 2544, 2111, 251, 1175, 1247, -2538, -5127, -3113, -1783, -3306, -6198, -4266, -1834, -3402, -2069, -4014, -2531, -3904, -6378, -2622, -2690, -3451, -2464, 493, 2670, 3567, 805, -455, 1924, 4865, 3073, -465, -1706, 746, 4712, 5631, -512, -3014, -2227, -2118, -602, 186, -1193, -1387, -2066, -2395, -4646, -3312, -3221, -2845, -2463, -1688, -3454, -4501, -5690, -4056, -1788, 621, 13, 287, 1432, 2821, 4993, 7410, 7220, 2491, 350, -258, -1304, 760, 917, 1847, 2378, -2024, -3790, -1485, 1004, 2658, 3896, 2311, 302, -2488, -3064, -3377, -4153, -6481, -7801, -9534, -7310, -4024, -2569, -2519, -3180, -5852, -5320, -3278, -3079, -3523, -3630, -5067, -5032, -3560, 253, 1879, -669, -1163, -1020, -2309, -1709]
5869a709j241k59M024K221L68r78j405k107K37j646l83Q03q88J563j839J825M686
5852C272m66m238m737O26K515Q42o18m39J068k737J741K006J253J640J389l569
5836d52j929M85k24L21M09J064j878k885K795N626K316k349R50j926k237l254
5820c168j583K146M440P80J033j277k460l798k411J964K118j591j137K239K598
5805a07K877l153j651J728L558l26m964J876J075j330r92L96j824k487J310N20
5789c494J657l658p56L144K305L737J047m932J051K989M34n93m181k021M0j231
5773d462Q72K265k73k21l13J092J352J045j669k28n79N1J652J174j760J790J013
5756B801J72l066Q9Q86j949j573L43J952q31K95L606O72Q03l383m245o5K058k711
$$ y = [-1709, -2950, -3209, 815, 3036, 3404, 2426, 1021, -1086, -849, -2495, -2878, -2075, -2963, -1400, -3239, -1414, 3272, 2806, -1432, -6169, -5543, -3028, -2186, -2804, -3243, -2175, -4912, -3171, -1165, 88, 1728, 3117, -452, -2381, -1896, -2120, -1799, -1390, -326, -2204, -5089, -2294, 3332, 5648, 3299, 4249, 2323, 86, -3168, -4751, -2605, 1835, 2615, 3648, 2371, -89, -3887, -6298, -4334, -2216, -3807, -4944, -2705, -107, 2770, -383, -2034, -306, 3252, 2926, -2038, -162, 913, -417, -1409, -1013, -2837, -5324, -4014, -3494, -1837, -5495, -6251, -3107, -802, 2935, 3982, -950, 101, 3090, 3524, 2931, -1250, -3271, -3231, -4462, -3590, -1325, -1598, -1819, -2132, -1040, 312, 1357, -312, -540, -1119, -1068, 584, 1758, -2, 1788, 2801, 2973, -93, -4, 882, -1067, -2640, -2297, -345, -1176, -881, 2725, 3397, 4200, 817, -3428, -3493, -1435, -4146]
5738d146j735M552M32m0J768L147j84m559M25J373J104O13j125l426q33RK303
5721c22K318k215k501j889K67l296r82J055k378K317J838M583l128j800l87J597
5705d923M47j533j175n75j95K291j225o70P26J894K298J246P86n63M257M662r50
5688F798n862k226K483K84L35l152L10J763n22k883O71L362j466J89l054o189
5672i159J707K575k197k421j056L729K572J699J73o87P5q0j413J059J897Q78j920
5655b569k941J143J640r60j490J173M520K884j927K485K279O78l624k494j7k82
5639D98k730j359J737k236k963J487J655L490J359p96o11m004l331k63O80K031
5623e356J867q66m453L61N126N041k455j672N043Q07m001l696K284n63l99L869
$$ y = [-4146, -5881, -1329, -897, -937, 831, 3978, 3794, -765, -340, 1033, 2137, 2750, 1625, -1801, -2634, -2625, -322, 1996, -219, -2720, -4609, -4342, -7638, -8620, -7565, -9943, -7626, -5788, -1205, -4333, -6133, -6520, -4923, -4476, -6009, -7184, -7759, -7954, -5663, -6888, -7558, -6832, -4938, -2640, -1394, -608, -1171, 3086, 7748, 6798, 936, -1290, 1193, 1477, 1812, -1340, -1030, 733, 211, -2672, -2001, 1361, -105, 84, -2970, -9159, -7452, -4877, -7074, -9495, -10551, -6822, -4250, -2551, -2378, -3065, -2990, -3070, -4483, -3424, -1527, -649, -2569, -5510, -4367, -2727, -3687, -5177, -4004, 516, 3400, 1473, 3958, 6237, 6915, 3291, 797, 780, 498, -2232, -3591, -1854, -4090, -7053, -5566, -3911, -421, 938, 142, -469, -4473, -7804, -8067, -7387, -5356, -3489, -4355, -8808, -8447, -3321, 1720, -735, -2407, 2636, 3443, -558, -4254, -1970, -2533, -2932, 937]
5607I37j423j598k062m03P0K621r44J069j016k49J043p01k126K656J849r74J207
5590d4P95J442k146k55r93j150j969O26J460M108l027j694o51m86J04L161J478
5573G59J392O91j957K433J127n289R27L068j526k712K109j592k181K201K654n65
5557A539Q98J451m053l350P66j377j370j94p25O41L580p88N99p26j896L322r99
5540b682k750K421J747J21k0j584j230j54K480n85j955m93P30n56k747k084J595
5523g746L095k67r31J000j2o80K934j300P75K012j626J26K960J872p28l04R91
5506B171l574J099o80n85J894P80K80o65N7K504J702k397m154l50L71k379p23
5489d649J575l94j982L05j917n6N39o61J903J477j009n96J08J825J577j310m87
$$ y = [937, -486, -2084, -4146, -4549, -4479, -1858, -2802, -1733, -2749, -2998, -1955, -2656, -4782, -2126, -277, -1251, -44, 751, 2193, 47, -208, -1201, -2351, -4320, -3694, -2234, 1874, -1153, -2847, -3498, -3984, -3880, -719, 759, 2151, 2842, 885, 3318, 4445, -844, 83, 3151, 1625, -1087, 1022, -570, -2751, -550, 2104, 1539, 2437, 3888, -165, -3515, -2749, -4126, -5496, -5690, -6415, -5774, -2194, -2982, -2383, -3109, -5005, -1683, -2682, -5432, -3011, -1264, -1143, -1163, -2747, -3977, -4131, -1651, -2236, -4191, -4684, -3954, -4510, -7257, -9341, -7746, -4651, -4918, -5849, -4849, -4861, -5541, -2607, -3907, -3132, -1120, -2746, -2620, 340, 2212, 1484, 1180, 2171, -1403, -304, -984, -1569, 325, 1105, 1385, 720, 777, 3281, 4983, 2586, -1568, -1918, -1547, -3926, -4649, -3074, -3468, -5450, -5145, -7062, -7118, -6579, -7240, -5337, -3860, -4869, -5465, -5357, -3532, -1955, -3265, -3752]
5472c752O38k09P8k775J44K86r7k88J093p0m39K016J43R41J704j780j880l79J3
5453d613K754K118L16n36j380m052j007K616J448K589k0J16J960n021l170j117
5437f999k08K344K885j673L001L412N66l457j820l98p64j585j82J312M67j196
5421d295j185j45K093J759O38p36P51K081M94R78n4r06j953j177j894j246k398
5404g195k25R94L191M531J311j898n77j637j193J806j187Q17J455k250l752K71
$$ y = [-3752, -3114, -3323, -3245, -6020, -5876, -5590, -5687, -5975, -4882, -4952, -5391, -3375, -3232, -2291, -587, -2367, -4247, -4626, -4613, -1859, 259, 575, 39, -1341, -5393, -6400, -3784, -2336, 253, 233, 349, 2309, -2712, -5882, -6999, -7207, -4863, -1978, -3651, -650, 2762, 3328, -129, -1949, -2347, -3111, -4696, -4878, -3566, -3099, -4295, -5480, -5625, -3532, -1773, -1135, -1871, -1120, 961, 1455, 2433, 2379, 1473, -480, -1657, -3551, -4797, -7195, -7420, -6426, -3235, 1296, 2607, 709, 132, -1505, -2698, -892, -2079, -1262, 193, -2057, -5809, -5538]
$$ [...]
##END NTUPLES=NMR SPECTRUM
##END=
