##TITLE=Analysis number 327784
Compound Code cc 03858
Book Reference 504/114
Project Code adrs
Chemist Name howarde
##JCAMPDX= 6.0         $$ Bruker NMR JCAMP-DX V2.0
##DATA TYPE= NMR SPECTRUM
##DATA CLASS= NTUPLES
##ORIGIN= Bruker BioSpin GmbH
##OWNER= nmr
$$ XWIN-NMR		Version 3.5
$$ Thu Apr  5 12:24:40 2007 GMT Daylight Time (UT+1h)  MAYBRIDGE\nmr@NMR_250MHZ
##.OBSERVE FREQUENCY= 250.131544655141
##.OBSERVE NUCLEUS= ^1H
##.ACQUISITION MODE= SIMULTANEOUS (DQD)
##.ACQUISITION SCHEME= undefined
##.AVERAGES= 16
##.DIGITISER RES= 18
##SPECTROMETER/DATA SYSTEM= dpx250
##.PULSE SEQUENCE= zg30
##.SOLVENT NAME= TFA
##.SHIFT REFERENCE= (INTERNAL, TFA, 0, 15.6664)
##AUDIT TRAIL= $$ (NUMBER, WHEN, WHO, WHERE, WHAT)
$$ ##TITLE= Audit trail, XWIN-NMR		Version 3.5
$$ ##JCAMPDX= 5.01
$$ ##ORIGIN= Bruker BioSpin GmbH
$$ ##OWNER= nmr
$$ C:\u/data/dgb/nmr/ADRS/660/pdata/1/auditp.txt
$$ ##AUDIT TRAIL=  $$ (NUMBER, WHEN, WHO, WHERE, WHAT)
(   1,<2007-04-05 12:24:22.21 +100>,<MAYBRIDGE\nmr>,<NMR_250MHZ>,
      <created by zg, POWCHK disabled, PULCHK disabled
       configuration hash MD5:
       49 4B E0 1D 92 C2 6B 37 9F E6 65 BC 52 41 86 1D
       data hash MD5: 64K
       56 9C B8 08 C6 AA 47 88 4D E9 2A 3E C1 AE 23 B0>)
(   2,<2007-04-05 12:24:33.45 +100>,<MAYBRIDGE\nmr>,<NMR_250MHZ>,
      <Start of raw data processing
       ef LB = 0.3 FT_mod = 6 PKNL = 1 SI = 32K 
       data hash MD5: 32K
       D6 61 40 44 DF 4A 33 B4 04 62 DD A0 61 02 76 8E>)
(   3,<2007-04-05 12:24:35.10 +100>,<MAYBRIDGE\nmr>,<NMR_250MHZ>,
      <apk 
       data hash MD5: 32K
       BA 7D 74 D5 10 9A AF 25 7A 22 09 E0 FB 8A EB 43>)
(   4,<2007-04-05 12:24:35.81 +100>,<MAYBRIDGE\nmr>,<NMR_250MHZ>,
      <abs ABSG = 5 
       data hash MD5: 32K
       8D 99 0F 19 D5 1F E5 C4 6C A8 74 96 E0 43 AE 25>)
$$ ##END=
$$ 
$$ hash MD5
$$ 56 B9 FD DD 58 5A 98 C5 61 B5 B9 ED BE 28 24 66
##$RELAX= 
##$RELAX= 
##$RELAX= 
##$RELAX= 
##$RELAX= 
##$RELAX= 
##$RELAX= 
$$ Bruker specific parameters
$$ --------------------------
##$DU= <C:\u>
##$EXPNO= 660
##$NAME= <ADRS>
##$PROCNO= 1
##$TYPE= <nmr>
##$USER= <dgb>
##$AMP= (0..31)
100 100 100 100 100 100 100 100 100 100 100 100 100 100 100 100 100 100 
100 100 100 100 100 100 100 100 100 100 100 100 100 100 
##$AQSEQ= 0
##$AQ_mod= 3
##$AUNM= <au_zg>
##$AUTOPOS= <27 >
##$BF1= 250.13
##$BF2= 250.13
##$BF3= 250.13
##$BF4= 250.13
##$BF5= 500.13
##$BF6= 500.13
##$BF7= 500.13
##$BF8= 500.13
##$BYTORDA= 1
##$CFDGTYP= 0
##$CFRGTYP= 5
##$CHEMSTR= <none>
##$CNST= (0..31)
1 1 145 1 1 1 1 1 1 1 1 1 1 1 1 1 1 1 1 1 1 1 1 1 1 1 1 1 1 1 1 1 
##$CPDPRG= <>
##$CPDPRG1= <>
##$CPDPRG2= <>
##$CPDPRG3= <>
##$CPDPRG4= <mlev>
##$CPDPRG5= <mlev>
##$CPDPRG6= <mlev>
##$CPDPRG7= <mlev>
##$CPDPRG8= <mlev>
##$CPDPRGB= <>
##$CPDPRGT= <>
##$D= (0..31)
0 1 0 0 0 0 0 0 0 0.06 0 0 0 0 0 0 0.0002 0 0 0 0 0 0 0 0 0 0 0 0 0 0 
0 
##$DATE= 1175772261
##$DBL= (0..7)
120 120 120 120 120 120 120 120 
##$DBP= (0..7)
150 150 150 150 150 150 150 150 
##$DBP07= 0
##$DBPNAM0= <>
##$DBPNAM1= <>
$$ [...]
##$SUBNAM7= <"">
##$SUBNAM8= <"">
##$SUBNAM9= <"">
##$SW= 20.6930455092707
##$SWIBOX= (0..15)
0 0 3 0 0 0 0 0 0 0 0 0 0 0 0 0 
##$SW_h= 5175.983436853
##$TD= 65536
##$TD0= 1
##$TE= 683.16
##$TE2= 300
##$TE3= 300
##$TEG= 300
##$TL= (0..7)
0 120 120 120 120 120 120 120 
##$TP= (0..7)
150 150 150 150 150 150 150 150 
##$TP07= 0
##$TPNAME0= <>
##$TPNAME1= <>
##$TPNAME2= <>
##$TPNAME3= <>
##$TPNAME4= <>
##$TPNAME5= <>
##$TPNAME6= <>
##$TPNAME7= <>
##$TPOAL= (0..7)
0.5 0.5 0.5 0.5 0.5 0.5 0.5 0.5 
##$TPOFFS= (0..7)
0 0 0 0 0 0 0 0 
##$TUNHIN= 0
##$TUNHOUT= 0
##$TUNXOUT= 0
##$USERA1= <user>
##$USERA2= <user>
##$USERA3= <user>
##$USERA4= <user>
##$USERA5= <user>
##$V9= 5
##$VALIST= <valist>
##$VCLIST= <CCCCCCCCCCCCCCC>
##$VD= 0
##$VDLIST= <DDDDDDDDDDDDDDD>
##$VPLIST= <PPPPPPPPPPPPPPP>
##$VTLIST= <TTTTTTTTTTTTTTT>
##$WBST= 1024
##$WBSW= 4
##$XGAIN= (0..3)
0 0 0 0 
##$XL= 0
##$YL= 0
##$YMAX_a= 304107
##$YMIN_a= -316234
##$ZGOPTNS= <>
##$ZL1= 120
##$ZL2= 120
##$ZL3= 120
##$ZL4= 120
##$ABSF1= 15.66645
##$ABSF2= -5.026706
##$ABSG= 5
##$ABSL= 3
##$ALPHA= 0
##$AQORDER= 0
##$ASSFAC= 0
##$ASSFACI= 0
##$ASSFACX= 0
##$ASSWID= 0
##$AUNMP= <proc_1d>
##$AZFE= 0.1
##$AZFW= 0.1
##$BCFW= 0
##$BC_mod= 0
##$BYTORDP= 0
##$COROFFS= 0
##$CY= 12.5
##$DATMOD= 1
##$DC= 0
##$DFILT= <>
##$DTYPP= 0
##$F1P= 14.0000005364418
##$F2P= -0.99999901652339
##$FCOR= 0.5
##$FTSIZE= 32768
##$FT_mod= 6
##$GAMMA= 0
##$GB= 0
##$INTBC= 1
##$INTSCL= 1
##$ISEN= 128
##$LB= 0.3
##$LEV0= 0
##$LPBIN= 0
##$MAXI= 10000
##$MC2= 0
##$MEAN= 0
##$ME_mod= 0
##$MI= 0
##$NCOEF= 0
##$NC_proc= -5
##$NLEV= 6
##$NOISF1= 0
##$NOISF2= 0
##$NSP= 0
##$NTH_PI= 0
##$NZP= 0
##$OFFSET= 15.66645
##$PC= 1
##$PHC0= 233.923
##$PHC1= 6.172776
##$PH_mod= 1
##$PKNL= yes
##$PPARMOD= 0
##$PSCAL= 4
##$PSIGN= 0
##$REVERSE= no
##$SF= 250.130213994213
##$SI= 32768
##$SIGF1= 0
##$SIGF2= 0
##$SINO= 400
##$SIOLD= 32768
##$SREGLST= <1H.TFA>
##$SSB= 0
##$STSI= 32768
##$STSR= 0
##$SW_p= 5175.98343685301
##$SYMM= 0
##$S_DEV= 0
##$TDeff= 65536
##$TDoff= 0
##$TI= <Analysis number 999999
Compound Code 99
Book Reference 9
Project Code 9>
##$TILT= no
##$TM1= 0
##$TM2= 0
##$TOPLEV= 0
##$USERP1= <user>
##$USERP2= <user>
##$USERP3= <user>
##$USERP4= <user>
##$USERP5= <user>
##$WDW= 1
##$XDIM= 32768
##$YMAX_p= 506004347
##$YMIN_p= -780813
$$ End of Bruker specific parameters
$$ ---------------------------------
##NTUPLES= NMR SPECTRUM
##VAR_NAME=  FREQUENCY,     SPECTRUM/REAL,   SPECTRUM/IMAG
##SYMBOL=    X,             R,               I
##VAR_TYPE=  INDEPENDENT,   DEPENDENT,       DEPENDENT
##VAR_FORM=  AFFN,          ASDF,            ASDF
##VAR_DIM=   32768,         32768,           32768
##UNITS=     HZ,            ARBITRARY UNITS, ARBITRARY UNITS
##FACTOR=    0.157963299565203, 1,           1
##FIRST=     3918.65237767412, 0,            0
##LAST=      -1257.33105917889, 0,           0
##MIN=       -1257.33105917889, -780813,     0
##MAX=       3918.65237767412, 506004347,    0
$$ Real data points
##PAGE= N=1
##DATA TABLE= (X++(R..R)), XYDATA
$$ [...]
30154b30962K18598Q0387o9833R4675j31288j15968j2158k59182j16067J40400
30144d01398Q3722n5710J0676o3785J62119p9350L0153j6424L3621j58789J2123
30133d43042J22028R9421n0344J96094N6128m3187O1680O1542j48810K9667K58237
30122A99414n3338k23175j57197P4348O7915J05385Q6038r193r1450m0367m4378
30111h5998O0905K05999m7468r9843p8123K03403J49940k53277J31919j9838j10955
30100E6664l0870J02689J53576j6163j25513k08184J08529j0397l429K1381r7923
30089d9640M9160q6902J1274l0366M3713j21723j30414O06p9047O5842K30503
30078i6994L81457P1370Q4916J10914j17172k43403j69591L44084J19727j11440
$$ plain form
30154 -230962 -12364 68023 -1810 92865 -38423 -154391 -166549 -425731 -541798 -401398
30144 -401398 -317676 -373386 -362710 -426495 -264376 -343726 -313573 -329997 -296376 -455165 -443042
30133 -443042 -321014 -221593 -271937 -75843 -19715 -62902 -1222 60320 -88490 -58823 199414
30122 199414 146076 -77099 -234296 -159948 -92033 13352 99390 90197 -1253 -41620 -85998
30111 -85998 -25093 180906 133438 33595 -44528 158875 308815 55538 187457 167619 56664
30100 56664 25794 128483 282059 265896 140383 -67801 40728 30331 26902 48283 -49640
30089 -49640 -480 -87382 -76108 -106474 -62761 -184484 -314898 -314292 -393339 -327497 -96994
30078 -96994 284463 355833 440749 551663 434491 191088 21497 365581 485308 373868
30068C73868k16563j00588j47062k39829J39416P3141k59833J8545K81784O6688
30058a0433m6150r7394r3283R3998j3042L1120J19226L2602K31004R7495o0630
30047B84513k43622l0553L66M6935M3367r7045M6185k5614N8993K76621Q4652
30036D44798j17673k45577j11896N6652J90999K25758q4218j12185P34p1532j43746
30025C2114p9944m2616J06744O5172j11156l3739J79996r8990J7763J83160o8767
30014A49737k16408r0358J39064K2826r9802N657J89821O9075j70489j61183L0817
30003a31243P1990K9254q973j24348N4624j779K59925M8748p4359k7773j95659
29992i9593j76212m3905J66588o987l2955J90830L02610N3866j11787K6976n4180
$$ plain form
30068 373868 157305 56717 -90345 -330174 -190758 -117617 -377450 -358905 -77121 -10433
30058 -10433 -56583 -153977 -247260 -153262 -166304 -135184 -15958 16644 247648 345143 284513
30047 284513 40891 10338 10704 57639 101006 3961 50146 24532 83525 360146 444798
30036 444798 327125 81548 -30348 26304 217303 443061 358843 246658 247392 175860 32114
30025 32114 -47830 -90446 16298 81470 -29686 -63425 116571 17581 35344 218504 149737
30014 149737 -66671 -157029 -17965 4861 -94941 -89284 100537 169612 -877 -162060 -131243
30003 -131243 -59253 -29999 -38972 -163320 -108696 -110475 149450 198198 123839 96066 -99593
29992 -99593 -275805 -319710 -153122 -160109 -193064 -2234 300376 354242 242455 269431 215251
29981B15251j55783N7127J04928j60633r3871R0586P9386N9667K4847l38897k58738
29970c76130j7715K27731J96227Q100j73556j35699M3217J00667J58012O0418
29960I1272P5382j45789p0684r661K52612n5744j82408P1686J25481J3608R746
29949A75501K67255j89866j84602n1851m0812j50323j409J70265J80751L8640
29939B13549k81053r0314K02200j24327p2276N5872j41839N2538P5869p73n4281
29928a64835O6978M7220J3959o7041J9698R8894j22063m7351J43874Q9934L550
29917H2817j02432k31754j33939J70758n4350l8424J52545K57351N7244j66009
29907f193r8148j4612J7650J28706n4436K2187L5843j5069K0395L5874r6231J83683
$$ plain form
29981 215251 59468 116595 221523 60890 -32981 57605 136991 196658 221505 -117392 -376130
29970 -376130 -393845 -166114 30113 38213 -135343 -271042 -227825 -127158 30854 91272
29960 91272 166654 20865 -49819 -59480 193132 137388 -45020 26666 152147 165755 175501
29949 175501 442756 252890 68288 16437 -24375 -174698 -176107 -5842 174909 213549
29939 213549 -67504 -157818 44382 -79945 -152221 -96349 -238188 -185650 -109781 -110554 -164835
29928 -164835 -97857 -50637 -36678 -103719 -84021 14873 -107190 -154541 -10667 79267 82817
29917 82817 -19615 -251369 -385308 -214550 -268900 -307324 -154779 102572 159816 -6193
29907 -6193 -104341 -118953 -101303 27403 -27033 -4846 30997 15928 36323 72197 -24034 159649
29895A59649L03255l49883j88507J17852L7054q4943j70212M141R6900J87855
29885A13161J51740Q0172p3663J1232l9558j52197j70631L9596J66547j72268
29875d5869n9592P5070J11985J32811J3776q0835r743j9373J84141L3986j75557
29864A60800p1110P5774q2043r9829m3081J8006R3467j55495k3398M0488o0084
29853a46505J39510J02930k45854L280M56395J21490L6786k42680k81893k1512
29843g8053j07368J49972K07713q6150j29309k50705M5141P8201P1706J0814R7770
29832I732J0942k11888n3493K6072q9621j80768K4423J4277M2308J62263k3082
29821b68835J9967J25907J56471J27516L6917J20312j08944l39179J48806K26268
$$ plain form
29895 159649 462904 113021 -75486 42366 79420 -5523 -175735 -171594 -74694 113161
29885 113161 264901 345073 271410 282642 243084 90887 -79744 -40148 126399 -45869
29875 -45869 -105461 -30391 81594 214405 228181 147346 137603 118230 302371 336357 160800
29864 160800 89690 165464 83421 -16408 -59489 -41483 51984 -103511 -126909 -86421 -146505
29853 -146505 -6995 95935 -149919 -146639 309756 431246 468032 225352 -56541 -78053
29843 -78053 -185421 -35449 172264 86114 -43195 -293900 -248759 -170558 -98852 -88038 9732
29832 9732 20674 -191214 -244707 -218635 -308256 -489024 -464601 -450324 -408016 -245753 -268835
29821 -268835 -248868 -122961 33510 161026 197943 318255 209311 -129868 18938 245206
29811B45206J47378R8939j3497j08731M7219n6569j34585o6586J13027R0036J9498
29800C81335j55882q7560L2509k9503n3033J4080j20745L0717j08416q5782K18257
29789C5977j7353m1131o8570k23487K827J22560j77765P4976K27378L48988j41716
29778A42684j0063n372k1535o6358j59806K18237K13447J83949j88647l02047
29768D489r208o3714j87913L7934L9435K04898J56476o7225n0223J6827O599j98959
29756a10584N3246K8793k6249j16055j18832M7480J41021K2774O9207o8402o3357
29745a40958K35746o7097j9247q1368o41J12433P7503j91502q1288J87987L727
29734C5295l3927m4259j6082J80681M5030r531j8110l7775O0727j23953L4552
$$ plain form
29811 245206 392584 491523 478026 369295 416514 359945 225360 158774 271801 361837 381335
29800 381335 225453 137893 170402 140899 87866 101946 -18799 11918 -96498 -182280 35977
29789 35977 18624 -22507 -91077 -314564 -311737 -189177 -366942 -291966 -64588 284400 142684
29778 142684 132621 127249 105714 39356 -120450 97787 311234 495183 306536 4489
29768 4489 -4719 -68433 -256346 -218412 -178977 25921 182397 115172 64949 81776 88375 -110584
29756 -110584 -57338 -28545 -54794 -170849 -289681 -242201 -101180 -78406 -9199 -77601 -140958
29745 -140958 94788 27691 8444 -72924 -73565 38868 116371 -75131 -156419 31568 35295
29734 35295 1368 -42891 -58973 121708 166738 157207 139097 101322 162049 38096 72648
29723G2648n0403r3491J38490k5541L830o9982m3403J2657l8841J31006J71741
29712B08711m9937j0661P5288m2687q5804l3831q1695R1863K7320j36220j05836
29701a43489k0959j10324Q9228J51974n5894O1960J51565P111k61072j22990O276
29690b46614J2950K19114Q2542j77540J0647j57166J60563n1194q8789J45176
29680i0311m9600J54562R4567P7601L7864p7113j69611L4135K08202p2357p4163
29669G3776l0808J37012Q1645p792k29852n8436r2096P3199O2804j6307j63735
29658a70590m7872J33986n3651o873Q2239R6035n759m8305J55813r804l1171q8088
29646E960j8290L2123r0727k939J94899J0948j0895O4955J09367j00540j03116
$$ plain form
29723 72648 22245 -71246 67244 41703 45533 -24449 -67852 -55195 -94036 36970 208711
29712 208711 158774 148113 223401 180714 94910 61079 -20616 71247 98567 -37653 -143489
29701 -143489 -164448 -274772 -185544 -33570 -89464 -27504 124061 131172 -129900 -252890 -246614
29690 -246614 -233664 -14550 67992 -109548 -98901 -256067 -95504 -146698 -235487 -90311
29680 -90311 -139911 14651 109218 186819 224683 147570 -22041 12094 220296 147939 73776
29669 73776 42968 179980 261625 253833 23981 -34455 -126551 -53352 9452 -6855 -170590
29658 -170590 -218462 -84476 -138127 -145000 -62761 33274 27515 -20790 135023 125219 94048 5960
29646 5960 -12330 19793 -70934 -73873 121026 131974 121079 186034 295401 194861 91745
29635I1745l57301J8294K35035N5163L8882N5188M149j62994l05710K15322R1072
29624b1155k5855j62844K12420L0619q9160M2573K40535k4843l9300j76092k64868
29613b77970k1744J93953J36692K72259J4159k91812j05474K5628k7367j6989
29603i8665r9080j17164L9003Q0634l3531Q9614K18070J52410p5054o4716p2265
29592A9256o73J19099J2704q4749k45566k46390j54750P4615K44246l9710j95868
29581d97786K05027m3280P4034O173J04132M6886j38177M8000k1437J6826L0033
29570a69569R9757J3054k57961q5546J03783L1055m1015J18539Q8382q6364o1281
29559b47166j08490p4808m0155j6840Q2311k06940J99356L33025l650j95310O2337
$$ plain form
29635 91745 -265556 -247262 -12227 42936 81818 137006 141155 -21839 -327549 -112227 -21155
29624 -21155 -47010 -209854 2566 33185 -55975 -13402 227133 202290 162990 -13102 -277970
29613 -277970 -299714 -105761 30931 303190 317349 25537 -79937 -54309 -81676 -98665
29603 -98665 -197745 -314909 -275906 -195272 -228803 -139189 78881 231291 156237 91521 19256
29592 19256 18583 137682 150386 65637 -179929 -426319 -581069 -506454 -262208 -301918 -497786
29581 -497786 -292759 -336039 -262005 -255832 -151700 -104814 -242991 -194991 -216428 -199602 -169569
29570 -169569 -69812 -56758 -314719 -400265 -296482 -265427 -306442 -187903 -99521 -185885 -247166
29559 -247166 -355656 -430464 -470619 -487459 -405148 -612088 -412732 -79707 -83357 -278667 -216330
29548b16330N8315J63116K61993o2540j47683k0712m2407K23798j44457r8911
29538b5818O1081j04590j99404j54652P4892J80526J36202j76798l4108k509l1043
29527b76221M5510P8111P2462o5208k15265J18298K87126M6609l3387n8790M9635
29516D8880K2861r9856j07890J19857Q5652k0435P7242q2390k20924J846R4933
29505h0224J09257N8767J614j00993r6879M0749q9886j17817j17508M3276J28027
29494b21617Q0400p989j07258K7556N2644J19377p4061J98517P6374r2208j68129
29483a16394q3362K27497j0587P3304J45537q0792j9089k2680j29627P9011l0731
29472C2087r2473K3765k8061J40349J66420O294j60985j06031L7202K42308j24056
$$ plain form
29548 -216330 -158015 5101 267094 204554 56871 36159 -6248 217550 73093 -25818
29538 -25818 35263 -69327 -268731 -423383 -348491 -167965 -31763 -208561 -242669 -245178 -276221
29527 -276221 -230711 -152600 -80138 -145346 -360611 -242313 44813 91422 58035 -755 48880
29516 48880 71741 -28115 -136005 -16148 69504 49069 126311 43921 -177003 -175157 -80224
29505 -80224 29033 87800 89414 -11579 -108458 -67709 -157595 -275412 -392920 -349644 -221617
29494 -221617 -141217 -149206 -256464 -228908 -176264 -56887 -130948 67569 143943 51735 -116394
29483 -116394 -199756 27741 17154 90458 235995 155203 136114 113434 -16193 62818 32087
29472 32087 -60386 -36621 -64682 75667 242087 248381 87396 -18635 18567 260875 136819
29461A36819j21995j55228J79172k8408k54684n2701J03449K15209Q0983J0035
29451A12651J27497P5409J10931j23266k25771j03973k107n5927n3098o644K26474
29440H2176J37021o7562m5258O9742J92125R8660k76119l0966j24533m034J96436
29429B27688n8081j47198L0648K63941P0037q8723m6855j7456j44957j36016l3722
29418h0694J53158L7897R1145M6928r90J2177M0662J52658n7685j92041j67438
29407C5777j54162q7178j2699J45479O2044k22459p7047m6234K66012J53074k23695
29396a61088j25797O5871L6516k1473Q9611J11554m5047P3250K5708L9286q0287
29385H104r3110n1169J70101R6244l4254j35870K3329j8562R9567N2393k30973
$$ plain form
29461 136819 14824 -140404 38768 10360 -244324 -297025 -193576 21633 102616 112651
29451 112651 240148 315557 426488 303222 77451 -26522 -28629 -84556 -137654 -144298 82176
29440 82176 219197 151635 106377 176119 368244 466904 190785 159819 35286 31252 227688
29429 227688 169607 22409 53057 316998 387035 298312 251457 234001 89044 -46972 -80694
29418 -80694 72464 110361 201506 248434 247444 259621 300283 452941 395256 203215 35777
29407 35777 -118385 -205563 -218262 -72783 -10739 -233198 -310245 -356479 -90467 62607 -161088
29396 -161088 -286885 -221014 -184498 -205971 -116360 -4806 -49853 23397 49105 88391 8104
29385 8104 -85006 -136175 33926 130170 95916 -39954 -16625 -35187 64380 116773 -114200
29374a14200j53083J8327J69944Q8726k50367l10379m3949N709J93168J86035
29364b10069J27856J14519R0403j36144J18736J72178p0711j44285j62231L2426
29354f7322J28274P0204k45385J42407K70486Q0837J35588O2770q3516k22826
29344B71517q2231q2156R5255l3281L4600J9576j32465j29277j50548L47841J7377
29333A76208j0095n3208m9009j22241O7768O1942l01754j27039N7071P9938l4308
29322b54727j8272J03663j7692N5104j00940q0482J41741N7578n084L548j37549
29311b53112N4788J19638K18590n982l7367J63286j56865j68049k9910j52149
29301b47132k6316K27624K54453J02465N0311K8815l04691l30234Q2784K40550
$$ plain form
29374 -114200 -267283 -248956 -79012 9714 -240653 -551032 -594981 -589272 -396104 -210069
29364 -210069 -82213 32306 122709 -13435 105301 277479 206768 62483 -99748 -67322
29354 -67322 60952 131156 -114229 28178 298664 379501 515089 577859 494343 271517
29344 271517 189286 107130 202385 169104 203704 223280 90815 -38462 -189010 158831 176208
29333 176208 166113 112905 63896 -58345 9423 71365 -230389 -357428 -300357 -220419 -254727
29322 -254727 -272999 -169336 -187028 -131924 -232864 -313346 -171605 -114027 -119111 -115563 -253112
29311 -253112 -198324 -78686 139904 133922 96555 259841 102976 -65073 -94983 -247132
29301 -247132 -273448 -45824 208629 311094 361405 390220 85529 -244705 -161921 78629
29291G8629J93178M1582k6675k14638p559R8352k98178K28887K87886m1876J54219
29280D93807l24414l86722j6354L31953J71642J037j12280j2821J26745Q4864
29270C57457J9176j59019l43269r2988K8488o3929k2093m9507M6776K82198M7465
29259E0755n7843N4640J735M2144M1479q2445J19667k83957j64432J00803K51634
29248G4180j07275k2432K56588J08730j8670k46696P6859K47267m0354j75377
29238A52820j68865k25638N2560P3374K4249M7979N2598p6798J8578J79684r9816
29227C0725j18163j46779p4937P0176K37473K05768J40744o5781o6268J7205n9419
29216A70744k5837j26061j71341L9750L6586Q5517j45138j6834K31230N7974J06209
$$ plain form
29291 78629 271807 313389 286714 72076 64517 162869 -135309 93578 381464 339588 493807
29280 493807 169393 -217329 -233683 98270 269912 270949 158669 145848 272593 357457
29270 357457 376633 217614 -125655 -218643 -190155 -254084 -276177 -325684 -278908 3290 50755
29259 50755 -7088 47552 49287 91431 132910 50465 170132 -113825 -278257 -177454 74180
29248 74180 -33095 -55527 201061 309791 291121 44425 121284 368551 328197 152820
29238 152820 -16045 -241683 -189123 -115749 -91500 -43521 9077 -67721 -49143 130541 30725
29227 30725 -87438 -234217 -309154 -238978 -1505 204263 345007 279226 212958 230163 170744
29216 170744 144907 18846 -152495 -112745 -76159 9358 -135780 -152614 78616 136590 242799
29205B42799j14724j41874q8441j93484K40774K02790m7026j24662j45080L278
29195a65650L6726j10541N3635J37258N7044M9457j43552J09725n656r2244q4307
29184a58105m1395J20777K31463K05894j48662k03104j05175j23375q8827K17020
29174i3489Q3609J00378m9537Q4189J19436J32006j32464k12081R3121j7540j80344
29163g2716j57511j36195j7646m627m8546J38296J72530K30294L363k54248j56524
29152c03530k4797K78892r4299m1728O8045p8822l7900K9597K5903J49128j14729
29141a44240P3844k5005M036J13411q7106P0740j03364r7509j10858j35019N2537
29130c88533P5042J00527P7106K48031J48689N4006r7078k9019Q6602j41949k91616
$$ plain form
29205 242799 128075 -13799 -102240 -295724 -54950 147840 100814 -23848 -168928 -165650
29195 -165650 -128924 -239465 -185830 -48572 8472 57929 -85623 24102 18446 -73798 -158105
29184 -158105 -199500 -78723 152740 358634 209972 6868 -98307 -221682 -310509 -93489
29174 -93489 -9880 90498 40961 125150 244586 376592 244128 32047 125168 107628 -72716
29163 -72716 -230227 -366422 -384068 -388695 -437241 -298945 -126415 103879 107242 -147006 -303530
29152 -303530 -328327 -49435 -143734 -185462 -117417 -196239 -234139 -204542 -178639 -29511 -144240
29141 -144240 -70396 -95401 -91365 22046 -65060 5680 -97684 -195193 -306051 -441070 -388533
29130 -388533 -313491 -212964 -135858 112173 260862 314868 217790 188771 275373 133424 -158192
29119a58192J1536J27684N4515M4215k38590M0774K70690j29971j96360l1854
29109b05553l0814k5060l046K4962l8722k3906K18645l2745M3628J3425J73403
29098A14217j7982l06307k8529L9738K07933O7677j9684R8371K51232j1283l0651
29087C64732p2021k75039o1714J51144j51868j86908r0534N9557J10464J23442
29077b8745J42582j5777K7766j4943k38503n1698J4175J25539J00436k2830k5799
29066A2203j10754l3905k32480n5728J47714p7256q2458J18322J29390R5367J58293
29055F8708j37525N0972r4959p6971j13984p3147k7540L9586J10833J16089J59287
29044B1349L6637K6883K4262j1692j9397n4342q381R4563N9772k3090r1652j27130
$$ plain form
29119 -158192 -146656 -18972 35543 79758 -158832 -118058 152632 22661 -173699 -205553
29109 -205553 -236367 -261427 -264473 -239511 -278233 -302139 -83494 -116239 -72611 -59186 114217
29098 114217 96235 -210072 -238601 -198863 9070 76747 57063 155434 406666 395383 364732
29087 364732 292711 17672 -44042 107102 -44766 -231674 -322208 -262651 -152187 -28745
29077 -28745 113837 98060 125826 110883 -127620 -179318 -165143 -39604 60832 38002 12203
29066 12203 -98551 -132456 -364936 -420664 -272950 -350206 -432664 -314342 -184952 -89585 68708
29055 68708 -68817 -17845 -112804 -189775 -303759 -376906 -404446 -364860 -254027 -137938 21349
29044 21349 57986 84869 109131 97439 78042 23700 15319 109882 169654 146564 54912 -72218
29032g2218j61505J90230K02554K5051M78l8675j2824k099R2675J43751K3270
29021C90688O0763k2858k06992k30937N6012r1389L0871J15802J46108n6261j38820
29010E2987L9385J16615J8334J01064j98329j43989Q9100m2675k15177M8827r976
28999a43834l2809K033J4835P4964Q9680L4024J99584k124M1336l1823k23762
28988B2104q3398J22358Q7068K65577K7716l57475k74675J20677k0429K01244
28978A10767K09417j9207j63804L7937n4222j29284P1603R3128l8348J15341L2572
28967B65900R5496Q3744k91787l08330m5226J5844p2017K19459J09866j5089P6736
28956A34596q4784j04044N6257M3135O5701K7790j65874r5439J501K80398o542
$$ plain form
29032 -72218 -233723 -43493 159061 184112 184590 145915 133091 130992 223667 367418 390688
29021 390688 451451 428593 221601 -9336 46676 -44713 -13842 101960 248068 191807 52987
29010 52987 92372 208987 227321 328385 130056 -13933 75167 32492 -182685 -133858 -143834
28999 -143834 -176643 -174610 -159775 -84811 4869 38893 238477 236353 277689 245866 22104
28988 22104 -61294 61064 148132 413709 441425 83950 -190725 -70048 -90477 110767
28978 110767 320184 300977 137173 175110 120888 -8396 63207 156335 117987 233328 265900
28967 265900 361396 445140 153353 -154977 -200203 -184359 -256376 -36917 72949 57860 134596
28956 134596 49812 -54232 2025 45160 110861 138651 -27223 -122662 -121161 159237 152695
28945A52695J22862Q4032J45979J46818j02934k99921m0122K360l45588l1658
28935a65477J22300O0733J20393q6429K2077r3285K30625N1465k26426r073J14019
28924A40922J38691j99420K1841l8378p6284N9954j98046n8782J68962Q074j02390
28913a34856Q9635m2847J02822R6516j18746J8637p6M2401j23357o8558P6370
28902f2059P7004j00858j26375p5908J9116K39838l564r0484j3423J498j5017
28891a50232J09417Q4183N305r240Q1282R9756R7727l4068q3017j05555j11780
28880a6222j15964l3665L6682K09896J23277j72169q3270j19018j05356Q5699
28870a90110J5895k398L6524K6807k1806J8185j12849J01358m9183m005j33976
$$ plain form
28945 152695 275557 359589 505568 652386 549452 249531 209409 211769 -133819 -165477
28935 -165477 -43177 17556 137949 51520 73597 -19688 210937 262402 35976 26903 140922
28924 140922 279613 80193 102034 63656 -12628 47326 -150720 -209502 -40540 -32466 -134856
28913 -134856 -45221 -88068 14754 111270 -7476 11161 11085 53486 -69871 -138429 -62059
28902 -62059 14945 -85913 -212288 -288196 -269080 -29242 -32806 -123290 -136713 -135215 -150232
28891 -150232 -40815 43368 48673 39433 120715 220471 318198 284130 201113 95558 -16222
28880 -16222 -132186 -165851 -129169 80727 204004 31835 -51435 -170453 -275809 -190110
28870 -190110 -174215 -176613 -140089 -113282 -135088 -116903 -229752 -128394 -177577 -181582 -315558
28859c15558k0610K41588J53942j04303j70372j26400p1116J11801J46820j20219
28849b74427k36157k6169L5131M6507N5103K70169N0750k71171K3244J81953j23999
28838b69066J93546J65252n5343J57142J01080j07368j49685m9080K9131K369
28828A7978k60294k15338J73355L29972R7291Q6940j41484j62909K9534J11985
28818F7030p792o8092j00329J64761j67750p1919j8924r7114K58836J94712l7745
28807A15674j09585J92090N7917R9400o4346k34645N359J17504L8934k22460q6897
28796i1055J10759R1335O157M8316L1037k7874p056j56266o7301M2259O2770L625
28784D6706o1260k25622k04554j22496J35271K28809M5715R2567o449k17958j76466
$$ plain form
28859 -315558 -336168 -94580 59362 -44941 -215313 -341713 -412829 -301028 -154208 -274427
28849 -274427 -510584 -536753 -501622 -455115 -400012 -129843 -79093 -350264 -327020 -145067 -269066
28838 -269066 -75520 89732 34389 191531 292611 185243 35558 -13522 15609 17978
28828 17978 -242316 -457654 -284299 45673 142964 229904 88420 -74489 -44955 67030
28818 67030 59238 -8854 -109183 55578 -112172 -184091 -203015 -300129 -41293 153419 115674
28807 115674 6089 198179 256096 355496 291150 56505 61864 179368 218302 -4158 -91055
28796 -91055 19704 111039 117196 165512 196549 168675 161619 5353 -61948 -19689 43081 46706
28784 46706 -14554 -240176 -444730 -567226 -431955 -203146 -157431 -64864 -71313 -289271 -465737
28773d65737R5716r7874M6146K05162N4502K4312N8983n2415K0406K5509N0376
28762c4914J442j47672k14837K5704q871J28106K26822K17414k80495j56481r8192
28751c41974K8902O5466R5027m8914p9974K45307K51938J66488j46494l5599j28847
28740G1326m9944p4858O1122m1731j38533P7671J58946m6679r4247q8501o7624
28729b33052p198J8094L6526J33561k4759j99168J24713J4801k02873q9881J97243
28718b31993R4749J37240J6318P7919j38192L9586J6002o8450j02730m7147K85717
28707G9019K51141l19775j77811R2774L1629j44649j80417m5717J29043J12493
28697a72270O7031J68579O0894k64498l2456J57995R7469J19847o4274k86579
$$ plain form
28773 -465737 -370021 -467895 -421749 -216587 -162085 -137773 -78790 -131205 -110799 -85290 -34914
28762 -34914 -33472 -181144 -395981 -370277 -379148 -251042 -24220 193194 -87301 -243782 -341974
28751 -341974 -313072 -247606 -152579 -201493 -281467 -36160 215778 382266 235772 200173 71326
28740 71326 21382 -53476 7646 -34085 -172618 -94947 63999 17320 -76927 -165428 -233052
28729 -233052 -240250 -222156 -185630 -52069 -76828 -275996 -151283 -136482 -339355 -429236 -231993
28718 -231993 -137244 -4 16314 94233 -43959 -4373 11629 -56821 -159551 -206698 79019
28707 79019 330160 10385 -167426 -74652 -43023 -187672 -368089 -413806 -284763 -172270
28697 -172270 -105239 63340 124234 -140264 -172720 -14725 82744 202591 138317 -148262
28687a48262J18072J82492p1062q0173M0900K9973j69521Q3957j6473j55037k34780
28676d19914r8107J49923J85147q7954j40403K33305N4339k2669q5595P6032K5453
28665a30443K74570K2746j79362j44706J35145P9806o1148k49987j80466q4490
28655e18335J57416J0571J73781J923M8867m3332Q2892J74383R1438j21646P252
28644F5210R6472j41990k10386j07182p5938R028j32553J36126K76907n0397N883
28633a28820N7408j64316j78918M7983J58652K84427N8625j20130P900O200j725
28622B7286o0437M0206J21013r7007j5686k4610J04358K1830J59687q2536n3844
28611A40260o0071j15035o2837N72J22274J04601j60737k68777j64932J83595
$$ plain form
28687 -148262 -30190 152302 81240 1067 41967 71940 -97581 -13624 -30097 -185134 -419914
28676 -419914 -518021 -368098 -182951 -270905 -411308 -178003 -123664 -146333 -231928 -155896 -130443
28665 -130443 144127 166873 -12489 -157195 -22050 57756 -3392 -253379 -433845 -518335
28655 -518335 -360919 -350348 -176567 -174644 -125777 -169109 -86217 88166 179604 57958 65210
28644 65210 161682 19692 -190694 -297876 -373814 -364786 -497339 -361213 -84306 -134703 -128820
28633 -128820 -71412 -235728 -414646 -366663 -208011 76416 135041 14911 22811 29011 27286
28622 27286 -33151 7055 128068 31061 15375 -9235 95123 116953 276640 194104 140260
28611 140260 80189 -34846 -97683 -97111 25163 129764 -30973 -299750 -464682 -281087
28601b81087M7391r884r338P9254O7027K5793P1886J53991o2551k18397Q6656
28590d9259J35828l5999O7260O5919o7320q5781n847M4937j10122j30138p3934
28579b44456Q1754J7199k3707Q5052J52954J2169j26057K9168R1806r31o7072
28568G879k6785j1177J26903m326j39570j04093k14737k8012J85393J04528O7601
28557c6396j0140j20574J36961J14178o4716K6529Q3350j58160q3924J82001K42092
28546C11201j27223L9154j01516j40843n0286n4319r3410o8324Q9175J66127m333
28535c4597J48969L8295j40289J19153l3389q9365l0288j25131o4540J04468K20351
28524A13637Q0419R0940j7882k7492L248j24035J2479J8038l3418N7728q1925
$$ plain form
28601 -281087 -233696 -243580 -252918 -173664 -106637 -80844 -8958 145033 82482 -135915 -49259
28590 -49259 86569 50570 117830 183749 116429 30648 24801 69738 -40384 -170522 -244456
28579 -244456 -162702 -145503 -169210 -84158 68796 80965 -45092 -15924 75882 74951 7879
28568 7879 -18906 -30083 96820 92494 -47076 -151169 -365906 -393918 -208525 -103997 -36396
28557 -36396 -46536 -167110 -30149 84029 19313 45842 129192 -28968 -112892 69109 311201
28546 311201 183978 223132 121616 -19227 -69513 -123832 -217242 -285566 -196391 -30264 -34597
28535 -34597 114372 152667 12378 131531 98142 8777 -21511 -146642 -211182 -106714 113637
28524 113637 194056 284996 267114 239622 242870 118835 131314 149352 115934 173662 91737
28513I1737r8504j29804n124J98433J91661q9952j13992j97780J64664J38324
28503A49663j26120n4155k6668j14033R9132J06368O653k5956K0258K4107j5051
28492D4198j37385l0843K28224K0042m9097j8772j03390j92226j25812K2659L45478
28481C076K97006j00363p8083o4595j57766j13120N9304J04857K7792k24p0904
28470i3020O6947J94058M7476R755p3332m7790P2737j94399k37557j4466J33974
28459a35617k3181L8798m6645P9646K11783M3968M4172M9423l000j41546J58592
28448B76393p0033j08310j15046O9968J04489n5015p0348J07060j12422r4234
28438f7498k6116R0482O4174p0251K9700J63475l633L5360R3060l682j38555j03129
$$ plain form
28513 91737 -6767 -136571 -141695 56738 248399 158447 44455 -153325 11339 149663
28503 149663 23543 -30612 -57280 -171313 -72181 34187 40840 14884 35142 59249 44198
28492 44198 -93187 -124030 104194 124236 75139 56367 -47023 -239249 -365061 -342402 3076
28481 3076 300082 199719 121636 57041 -100725 -213845 -154541 -49684 -21892 -22116 -93020
28470 -93020 -26073 167985 215461 225216 151884 104094 176831 -17568 -255125 -269591 -135617
28459 -135617 -158798 -120000 -166645 -86999 124784 168752 212924 262347 259347 117801 276393
28448 276393 206360 98050 -16996 52972 157461 102446 32098 139158 26736 -67498
28438 -67498 -93614 -3132 61042 -9209 20491 183966 180333 215693 308753 305071 166516 63387
28426F3387m6663J09987j01729m2851K04740J87754K00119j7510k27585l9157
28416B90492r3734j52011j66011k35106m5461J18601m6906J11673M0421k81929
28406d59971J45984J35335J17540K05297J40432K7504j3384j0067j69732k08288
28396h9350J40975r2661Q414o4402p155J05389J70892k9792j68514j59094J95324
28385A0026N2363l1076K25548J71855m0225j43757j45971m0032n393k56290k76451
28374d79403J50811L45671j56410k56032K942j0842K303n3847K70519J15519O637
28363f2132J80990M9923j50109K253J82321k45298p6253p5135J22358J6881N9231
28352E030R603J7842R3355L4999J0611j14259R938J0946J20002J35044j32427
$$ plain form
28426 63387 16724 126711 24982 -17869 186871 374625 574744 557234 329649 290492
28416 290492 196758 44747 -121264 -356370 -401831 -283230 -330136 -218463 -178042 -459971
28406 -459971 -313987 -178652 -61112 144185 284617 312121 298737 288670 118938 -89350
28396 -89350 51625 -41036 -32622 -97024 -104179 1210 172102 142310 -26204 -185298 10026
28385 10026 62389 31313 256861 428716 388491 244734 98763 58731 53338 -202952 -479403
28374 -479403 -328592 17079 -139331 -395363 -392421 -403263 -400960 -454807 -184288 -68769 -62132
28363 -62132 118858 168781 18672 20925 203246 -42052 -118305 -193440 -71082 -54201 5030
28352 5030 14633 32475 125830 160829 171440 57181 67119 78065 198067 333111 200684
28341B00684j28929N0140j77232j64071J07171P0860J47930r2661j29450j610
28331a17168J75692M1016k19049o7407j11623j06535K23982K62933j1855j20034
28321e0048R0283p9631J9088J7493j5934N7919j1194l5618J8952j07219J88632
28310I2723R4236o4791R7378R7142O5786j96193K817O0649o7153J01129M0102
28299C23825L2833k62120j63854o8506m1386K40703J44018Q911j31357j58740
28289g5673p4786M7949J43704J18436j786n996J31170N3277J33498N61j01373
28278C68981j02929m49302J50102K323J5775K22377p7898j5747J56633j7888k66948
28267a4521J4265L5381Q8420j36341q4346L29441J35234j61509k67636l2629J33280
$$ plain form
28341 200684 71755 121895 -55337 -219408 -112237 -41377 106553 13892 -115558 -117168
28331 -117168 58524 99540 -119509 -186916 -298539 -405074 -181092 81841 69986 -50048
28321 -50048 40235 -39396 -20308 -2815 -18749 39170 27976 -7642 11310 -95909 92723
28310 92723 186959 122168 219546 316688 382474 186281 189098 249747 182594 283723 323825
28299 323825 356658 94538 -69316 -137822 -179208 61495 205513 214424 83067 -75673
28289 -75673 -150459 -102510 41194 159630 157844 151848 283018 336295 469793 470354 368981
28278 368981 266052 -183250 -33148 -30825 -15050 207327 129429 113682 270315 252427 -14521
28267 -14521 -256 35125 123545 -12796 -97142 232299 367533 206024 -61612 -94241 39039
28256C9039J35454N2885J5932j36706j70961q7979k796K35771R4100q6414r7491
28245i166k78283J03858L01932J66578o034J9884m3007l06306m1653J9186p9011
28234a52022j32029O8818J09142K3912n5143o7735K3195K06114J48244r631j31453
28223C1412m2675j11727n6802J7359J35094K8374K0438m1704J66546J71021k26085
28212I1251J29512o3455j2441P2829K8675j88190p3841K14326P2845o0177r4011
28201A17323r8720J47547J25369k20256k3012P5614j17418p4569J32239N574j219
28190F8472j67671O4823J53726j42180R0371J76700M0508k06129m0849j9149J22855
28179A41477O3473k1547k1456j54169n5611j18432l5614m4543J57245J66409J914
$$ plain form
28256 39039 174493 227378 243310 106604 -64357 -152336 -155132 80639 174739 88325 -9166
28245 -9166 -287449 -183591 118341 284919 278885 298769 255762 -50544 -92197 -73011 -152022
28234 -152022 -284051 -215233 -106091 -82179 -137322 -205057 -181862 24252 172496 162865 31412
28223 31412 -11263 -122990 -179792 -162433 -27339 1035 21473 -20231 146315 317336 91251
28212 91251 220763 157308 144867 217696 246371 58181 -15660 198666 271511 211334 117323
28201 117323 18603 166150 291519 71263 48251 123865 6447 -68122 64117 69691 68472
28190 68472 -99199 -34376 119350 -22830 67541 244241 284749 78620 37771 18622 141477
28179 141477 204950 183403 161947 7778 -47833 -166265 -201879 -246422 -89177 77232 79146
28168G9146K04383J16744l38752j07471M3298o6805J95982l4061k39915L8788
28158a08663M7172M2648J03302j52618m8916l1079K2453J12599K9394j54707Q3306
28147e5109O6621q5699l4103J04564Q8859q455M5591o3810J00539Q0636j22744
28136A16890j22549Q7190r1644j77052M4219J31763l7943j11231J7814K31628
28126H9085J41656j1227O6632J29877j93933j34128j5019k45003l5958K00956
28116g062K5926j33844l407Q1195r1865n5267Q8034O7261K78872o9896j9080Q1967
28104B42834K7400p3657n0830j92956j00459n9118K2379J83351N0966j7299q5334
28093e2723K79163J78019j00574k21611l69728K006J41088n7673J76958J03450
$$ plain form
28168 79146 283529 400273 61521 -45950 -2652 -69457 126525 92464 -147451 -108663
28158 -108663 -61491 -18843 84459 -68159 -117075 -148154 -125701 -13102 16292 -138415 -55109
28147 -55109 11512 -74187 -108290 -3726 85133 76678 122269 58459 158998 239634 116890
28136 116890 -5659 81531 -10113 -187165 -142946 -11183 -49126 -160357 -142543 89085
28126 89085 230741 219514 286146 416023 222090 87962 72943 -172060 -208018 -7062
28116 -7062 18864 -114980 -118387 -37192 -129057 -184324 -96290 -29029 249843 179947 160867 242834
28104 242834 270234 196577 145747 -47209 -147668 -206786 -184407 -1056 49910 32611 -52723
28093 -52723 226440 404459 303885 82274 -287454 -285448 -144360 -202033 -25075 78375
28083G8375J30666k5569l16802r052m5833J19419J13547r6757j9548K6995k667
28072d7226j99007j4234l1027J12179N7511K2789N3486J1047q2728O5234j6116
28061f8092q8308J61428O5287J04774M0140J3549j67541q8378M3045J79760k38878
28050d3214Q8471O2276K3597j18436j27363j8305K08074N3481m6174j00181Q9839
28039G2065N6013k74013j21107q682Q5304P477P2960J15473J05932o6100K76189
28028C21511o8078j89853k9779k11634j58037K4802n0670J67280K77112P1234
28018A53888j50478j00290O0235Q0452n3953O0681j16247j69129k0327K41733
28008a3435Q2969J04459K70034r7281j74503o3004J01288Q8702K64026J04517
$$ plain form
28083 78375 209041 183472 -133330 -142382 -188215 -68796 44751 -52006 -71554 -44559 -47226
28072 -47226 -246233 -260467 -291494 -179315 -121804 -99015 -45529 -34482 -117210 -51976 -68092
28061 -68092 -156400 5028 70315 175089 215229 228778 61237 -27141 15904 195664 -43214
28050 -43214 45257 107533 131130 12694 -114669 -132974 75100 128581 82407 -17774 72065
28039 72065 128078 -145935 -267042 -275724 -190420 -182943 -109983 5490 111422 45322 321511
28028 321511 253433 63580 33801 -177833 -335870 -311068 -361738 -194458 82654 153888
28018 153888 3410 -96880 -36645 43807 -10146 50535 -65712 -234841 -255168 -13435
28008 -13435 69534 173993 444027 346746 172243 109239 210527 299229 563255 667772
27998F67772l07987k69590p9133O8253j54007M8719K18610N9100J37186K2347
27988D11270j17728k76100j15821n457Q5155K6372r9156q2431R8059R393R2846
27977B6402J57937j34474k00475J73312K24169L3224n5291J01593J34300o8064
27967C92633k15510j89077j24114k6139k9670O881K57693M9239K4011l4125o1800
27956E0022K3280J2232k4000P0820K22466n585k93301j78965M3211J68496J72001
27945B60677o6874j21135J12416j49895l11404J37613K77810N2579k70576l5545
27935a14334J01792k1907j2524J76054L0685J1301O3010r6981m8907m1695Q8651
27924A35145K07775N8595j33083r2698j86978j28439J77378J07529M7594J115
$$ plain form
27998 667772 359785 90195 11062 79315 -74692 -25973 192637 251737 388923 411270
27988 411270 293542 17442 -98379 -103836 -18681 7691 -91465 -173896 -75837 -66444 26402
27977 26402 184339 49865 -150610 22702 246871 280095 224804 326397 460697 392633
27967 392633 177123 -11954 -136068 -162207 -191877 -184996 72697 121936 145947 111822 50022
27956 50022 73302 85534 61534 132354 354820 349235 55934 -123031 -79820 88676 260677
27945 260677 193803 72668 185084 35189 -276215 -138602 139208 191787 -78789 -114334
27935 -114334 -12542 -34449 -46973 129081 159766 171067 234077 137096 88189 46494 135145
27924 135145 342920 401515 268432 175734 -11244 -139683 37695 145224 192818 193933
27914A93933j56412j86151M4659N3318K6507J75349n3170j67690j02559J85917
27904A3701K02810q4838k40184j14750K11886R8451P7862J30993m4693j21384
27894A29854l8653M3726Q857q3971O8571j49430M9889n3946j17950K13201J65670
27883B35818j49028j83704j03793R7451M7371J85525N8658n0132M9016k55600
27873f8418k2872o6424l5616l3273j4009L5340J15780K6183J21099j46859k22174
27862c11243M3862J85240J54243K1494j17953o3176M9281j58634K55433J5822
27852G4369k5292l5442k47915J12807K38891j3913j63292J00041j31192L4915
27842e6023Q4118r7120p386m5023Q7336r9715n0998j4844O9367J21716j5019j26687
$$ plain form
27914 193933 37521 -148630 -103971 -50653 -24146 151203 98033 -69657 -172216 13701
27904 13701 216511 131673 -108511 -223261 -11375 87076 164938 295931 251238 129854
27894 129854 91201 134927 143784 59813 128384 -21046 28843 -25103 -143053 70148 235818
27883 235818 86790 -96914 -200707 -103256 -55885 129640 188298 138166 187182 -68418
27873 -68418 -91290 -157714 -193330 -226603 -240612 -205272 -89492 -63309 57790 -89069 -311243
27862 -311243 -267381 -82141 72102 93596 -24357 -87533 -38252 -196886 58547 74369
27852 74369 49077 13635 -234280 -121473 117418 103505 -59787 40254 -90938 -56023
27842 -56023 28095 -69025 -76411 -121434 -34098 -133813 -184811 -199655 -130288 -8572 -23591 -150278
27830a50278Q050k7536M5509J89859L6348M1640p7530n8998L2717j1758j60009
27819a31986p545m8076K38679J40894j97059r0481l4421j3660n0954R0707J25992
27808B2090J74200P693k0535j08731o2553L6889M6552N3236o6838j32660j33790
27797a84447m1160K2490j40676J43375J17385m9777O9978m8192j52312q2803j2261
27786c58400K61000J35850M3869q6249M8233k0881j86286P0919K007n8156N7703
27775i0391r82J07640O0185k89188j39814J85116J76677j06547o7048P6588M753
27764h3011K24910J38247l9135l38542p1696j10093j10664O7699K14358M6475
27754f1452J96720o2857o5245J7253P1216j33812j3745J14373O715J229p3827
$$ plain form
27830 -150278 -142228 -169764 -124255 65604 101952 143592 66062 7064 39781 28023 -131986
27819 -131986 -139531 -187607 51072 191966 -5093 -95574 -129995 -143655 -194609 -103902 22090
27808 22090 196290 203983 183448 74717 12164 49053 95605 148841 82003 -50657 -184447
27797 -184447 -225607 -203117 -343793 -200418 -83033 -132810 -62832 -111024 -263336 -346139 -358400
27786 -358400 -97400 38450 82319 -3930 44303 23422 -162864 -91945 -89938 -148094 -90391
27775 -90391 -91373 16267 76452 -212736 -352550 -167434 9243 -97304 -164352 -87764 -83011
27764 -83011 141899 280146 241011 -97531 -169227 -279320 -389984 -322285 -107927 -61452
27754 -61452 135268 72411 7166 24419 95635 -38177 -51922 62451 69166 70395 -3432
27743c432j33114j46396P6747n1752N0071J58888r7621j6408J47303Q2207o0761
27732E732j0921Q8600M0250n9063J06212N0167r4769o2388O0659l05266l6289
27721b17076j8813M430j04103J02234J50537J3060p1594M771J69865J35976J12635
27710B81922j83310K5890L20925j10474k28643j19218j05603k25433Q2459J98512
27700f2973J97945M0160j71156r6292J44052O3187P7838R778n4025n6629J13188
27689B05073J12047O465Q157k43456m7946J31802O9367J05726k4389k37831J1502
27678I6517M1379O305M1730M6249N1290j85598k39221J39526k3740K42037l4944
27667A81530q2397M3271N1429k4941k27498m6609K52649j01823P7553O7844j27081
$$ plain form
27743 -3432 -136546 -282942 -206195 -257947 -207876 -48988 -146609 -163017 -15714 66493 5732
27732 5732 -5189 83411 123661 64598 170810 220977 126208 63820 124479 -180787 -217076
27721 -217076 -235889 -231459 -335562 -233328 -82791 -69731 -141325 -136554 33311 169287 281922
27710 281922 98612 124502 445427 334953 106310 -12908 -118511 -343944 -261485 -62973
27700 -62973 134972 175132 3976 -92316 51736 114923 192761 202539 148514 91885 205073
27689 205073 317120 323585 331742 88286 40340 172142 241509 347235 322846 85015 96517
27678 96517 137896 144201 185931 232180 283470 97872 -141349 -1823 -25563 216474 181530
27667 181530 99133 142404 193833 168892 -58606 -105215 147434 45611 123164 191008 63927
27656F3927k15218J1300J3255K14814J35934Q3347j44484l65427r9671P4234l6164
27645b64153J84135J1661p3161Q4799o8119n1400J19278J59090J6500M2478Q382
27634A69490j53269j78296J45457l8251j20904j1972j29044K16817J38251P827
27624D6106j13425j59194l7824J3580J38393J70871J61521k4893l14326o5527
27614a84718N5752P1075P0277l0488j93650J26380K59790k0744j08177K5812R4376
27603A65685J06408P5770N9571o1342m1466j53759k18707K65550K07731l27052
27593G8389k45884K25740J70152j55565k26172m4285O6745J29495L911J14740
27583A17266J18914K0123l1200j47977j08906j04029n3191K36349J58015J0060
$$ plain form
27656 63927 -151291 -139991 -126736 88078 224012 307359 162875 -202552 -302223 -227989 -264153
27645 -264153 -80018 -68357 -141518 -56719 -124838 -176238 -56960 102130 118630 161108 169490
27634 169490 16221 -162075 -16618 -54869 -175773 -187745 -316789 -99972 38279 46106
27624 46106 -67319 -226513 -264337 -250757 -112364 58507 220028 195135 -119191 -184718
27614 -184718 -128966 -57891 12386 -18102 -211752 -85372 174418 153674 45497 71309 165685
27603 165685 272093 347863 407434 346092 304626 150867 -67840 197710 405441 78389
27593 78389 -167495 58245 228397 72832 -153340 -197625 -130880 -1385 2526 117266
27583 117266 236180 256303 225103 77126 -31780 -135809 -189000 47349 205364 215424
27573B15424j14505q2518k04989J3633N4032L9238j12025l9101J87669K72448
27563B29306K18923o968o3982q3233k29619p8879K3907r9495K5628j17141p6077
27552b57630P1770l9448q2037l8214K7354J73066J49924j35533l1983L3039j8788
27541a48480J53832J59155J28553J29842m0740R1256q8093j7550j0741q7349j29564
27530A40121j18445N7811m7213j10284J22327K99516j95710l6699K6285J01850
27520B39559Q6544N5397J44780k22733n3645l4775k62772q790k5292O54j7370
27509i8443J16998R7132Q3528O3438O4057M6801j46783Q1376Q2525j89961q6571
27498A14097p9177N0919o5695j91562N3460Q1884J7330P3114j360O2481R5346
$$ plain form
27573 215424 100919 18401 -186588 -172955 -118923 -79685 -191710 -230811 -43142 229306
27563 229306 448229 441261 377279 294046 64427 -14452 9455 -90040 -64412 -181553 -257630
27552 -257630 -185860 -225308 -307345 -345559 -318205 -145139 4785 -130748 -162731 -129692 -148480
27541 -148480 5352 164507 293060 422902 382162 473418 385325 367775 357034 269685 140121
27530 140121 21676 79487 32274 -78010 44317 343833 148123 111424 137709 239559
27520 239559 326103 381500 526280 303547 249902 215127 -47645 -56435 -81727 -81073 -98443
27509 -98443 18555 115687 199215 262653 326710 373511 226728 308104 390629 200668 114097
27498 114097 34920 85839 20144 -171418 -117958 -36074 -18744 54370 53010 115491 210837
27487B10837M3015K1076n9860k8742l3887o9915o7367j274O7808L5435l4307r0607
27475g788K51593j75005r0962j86899j78358l1484K79815R0670r3248p8352p439
27464b27457K10561m2436o7605l6960J29239J05604J1249l8762J9917r7837j01350
27453a35837l495J87067m3663J49360R4854k5713j89100K5035J32933R5354j76690
27442A10105j47400j8262j625O5315n9948P797j12538P544k1473l4995J33410
27431g2070P8513j6605k24267m7381L81518P0230R7481J13484M132q5437K2887
27420C22485M9864l00185o8919J7570j01119P8796J75370K31379O1186j94021
27410B72406j854L5512j16579l16382O0824J06077j25085k19848K36333q809q35
$$ plain form
27487 210837 253852 274928 215068 186326 152439 82524 15157 13883 81691 117126 82819 -7788
27475 -7788 243805 68800 -22162 -209061 -387419 -418903 -139088 -48418 -141666 -220018 -227457
27464 -227457 -16896 -59332 -126937 -163897 -34658 70946 82195 43433 63350 -34487 -135837
27453 -135837 -139332 47735 4072 153432 248286 222573 33473 58508 191441 286795 110105
27442 110105 -37295 -55557 -57182 8133 -51815 -44018 -156556 -149012 -170485 -205480 -72070
27431 -72070 6443 -10162 -234429 -281810 99708 169938 267419 380903 385035 299598 322485
27420 322485 372349 72164 3245 20815 -80304 -1508 173862 405241 466427 272406
27410 272406 270552 306064 189485 -126897 -66073 40004 -85081 -304929 -68596 -77405 -78240
27399g8240M1331l5066K3319O3168j33716j0444Q0891M3419m9704O8496J96957
27388B10411O7597R107j03492j22905j00052j32333k60047J04691O8003J19720
27378a39300K51792N4622r2891k01128j3465J06079q8448q7076K0399K08911P4266
27367I3761K53544j8998j37747n9388j47535p6030k9496q6724N6995q1532K12256
27356b0894J62186R1920q8792K00980J49725n5472k13698l0252N314J52695k6737
27345C26975o8597j93023l0601R3933L4724K7936l17719q3263J15999R3047M0105
27334C9516O0298L7883J58544R0800l37023o6932M0976m2634p9762o3252J08896
27323e2690P3043j8492j76847q2100J39566J00354j34957l9029k8348J25032k8339
$$ plain form
27399 -78240 -36909 -71975 -48656 14512 -119204 -129648 -48757 -5338 -55042 13454 210411
27388 210411 278008 287115 183623 60718 -39334 -171667 -431714 -327023 -259020 -139300
27378 -139300 112492 167114 74223 -126905 -140370 -34291 -122739 -209815 -189416 19495 93761
27367 93761 347305 328307 190560 131172 -16363 -92393 -121889 -208613 -151618 -233150 -20894
27356 -20894 141292 233212 144420 345400 495125 439653 225955 195703 201017 353712 326975
27345 326975 258378 65355 34754 128687 163411 191347 -126372 -209635 -93636 -589 39516
27334 39516 99814 137697 296241 387041 50018 -16914 24062 -18572 -98334 -161586 -52690
27323 -52690 20353 1861 -174986 -257086 -117520 -17166 -152123 -191152 -219500 -94468 -122807
27312a22807l3346J11703J05860p5404j71993j33801N2257Q2070J59490P1566
27302D5595O0297n9868J05501j0227j25311K0007j25705j2978J64548J47218J08703
27291C17780q4163m4216J14368q531k23570k90792K3587J97830n5518P5585j32030
27280a09670p9997J72836K961p1671K18976J00630K5421n7943k03089n2787N4443
27269A10n3055r7371j11497L7265K13427n9714m03405j1714K15181n3670J0995
27258c13448N5914l0902J43139K69939O4850o4486k13342j17192n2531J44417
27248a13642J3705J11509K12428J15393k7172m53490k74313l5093K23827K5468
27238b01380j1020K32637J30149p8479l53771j10502K22581L3444j21758l5354
$$ plain form
27312 -122807 -156153 -44450 61410 -13994 -185987 -319788 -267531 -185461 -25971 45595
27302 45595 105892 46024 151525 141298 15987 35994 -89711 -102689 61859 209077 317780
27291 317780 233617 189401 303769 295238 71668 -219124 -195537 2293 -53225 22360 -109670
27280 -109670 -189667 -16831 -13870 -85541 133435 234065 259486 201543 -1546 -54333 110
27269 110 -52945 -150316 -261813 -224548 -11121 -70835 -474240 -485954 -270773 -324443 -313448
27258 -313448 -257534 -288436 -145297 124642 189492 125006 -88336 -205528 -258059 -113642
27248 -113642 -99937 11572 224000 339393 312221 -141269 -415582 -450675 -226848 -201380
27238 -201380 -212400 20237 150386 71907 -281864 -392366 -169785 -136341 -258099 -293453
27228b93453J8220R100n329k8210J53826K66928J45713M8310R2966q0507j14206
27217B13358k78313k47590J22646J54326J62547l2629j21776Q2573p3864k70050
27207b88772p0490P0473m4593O9199J29760J97976Q1633k33835l9236K93722O6011
27196B31848L358J76483j65142k82018M2871q205p1915L3855J31121J93117J5954
27185C01327j82191j83002J43405o7071l3179R499P2312o6655N3248P6527N415
27174A29635j6841O0348L2055q7737n4291M767K58869l1466q8894J11852p3124
27163B45173j4751j94455j09270K07702J09522j47544K7051O3456p5292P2771
27153A84363J8537j67255n8437r7849r0231J17380M9558j8049R0710J19644n6401
$$ plain form
27228 -293453 -275233 -266133 -271462 -299672 -145846 121082 266795 315105 408071 327564 213358
27217 213358 -64955 -312545 -189899 -35573 126974 94345 -27431 55142 -18722 -288772
27207 -288772 -359262 -288789 -333382 -264183 -134423 63553 145186 -88649 -127885 165837 231848
27196 231848 235206 411689 246547 -35471 7400 -805 -72720 -38865 92256 285373 301327
27185 301327 119136 -63866 79539 12468 -20711 -11212 61100 -5555 47693 124220 129635
27174 129635 112794 173142 205197 117460 63169 67936 326805 295339 206445 318297 245173
27163 245173 230422 35967 -73303 134399 243921 96377 123428 186884 111592 184363
27153 184363 202900 35645 -22792 -120641 -210872 -93492 -43934 -61983 28727 148371 91970
27142I1970j27144J04484P195j04346k9213K13p0505J4493j0940j41978K9763
27131b36008k0038j18511q4409N9899L37855J87825n0505n9609n7760l2747Q2824
27120H816Q8710q758n3118j5590J19552R1419Q8362n9503n0266l08345j68058
27109b66779L6592L6763J52123R8454J73136J54231m8167n0861K2614k0041j27480
27098A60585O7966j29627R805L20307j0728j51795l75594j73016Q6059j19293
27088c15331L3024K13701J26665M2991m4937J7378j60440Q3566J34840Q1623j41786
27077G1294k1108K9568J07116k8350k15576k23690J4976L2357L20992K85270k0287
27066C52562p7869m9256p3232l4079Q080n1026o803j78240j61828J47628P2874
$$ plain form
27142 91970 -35174 69310 76505 -27841 -57054 -56841 -127346 -112853 -123793 -265771 -236008
27131 -236008 -256046 -374557 -458966 -399067 -61212 126613 76108 16499 -41261 -74008 8816
27120 8816 97526 88768 35650 20060 139612 231031 319393 259890 209624 -98721 -266779
27109 -266779 -230187 -193424 -41301 57153 230289 384520 336353 285492 308106 288065 160585
27098 160585 228551 98924 108729 429036 418308 266513 -109081 -282097 -196038 -315331
27088 -315331 -282307 -68606 58059 101050 56113 73491 -86949 -3383 131457 213080 71294
27077 71294 50186 79754 186870 158520 -57056 -280746 -265770 -233413 87579 372849 352562
27066 352562 274693 225437 152205 118126 126206 75180 68377 -109863 -271691 -124063 -51189
27055e1189J30498K44549N7353j38335Q1206j03106j42218k13562J04168J05037
27045G4401J0706M4289J24155k04533r9224J29132K23606J73597j46662Q2541
27035D12008J32050j88713l31514j27628J4106Q0883K2763O581k7061j9364r5070
27024a20959K8772K5729k0421J04959k32166m6051J41771Q3523j18120o8381Q4762
27013a36582M7758r4823L0544R6226o9373M9018n0350m8872P953K19277R8549
27002A49325j17573j43618J07476n6478k19792r1004L3854K62671j77314Q7372
26992a65081L84500J95513k23945j85132J20110j18234k09694q3679j71423J67736
26982b89329K32582K6247Q1939l8213j66633j54937j32638k47108J58032J84574
$$ plain form
27055 -51189 79309 323858 381211 242876 324082 220976 78758 -134804 -30636 74401
27045 74401 85107 129396 253551 49018 -50206 78926 302532 476129 329467 412008
27035 412008 544058 355345 23831 -103797 -89691 -8808 13955 20536 -6525 -25889 -120959
27024 -120959 -92187 -66458 -86879 18080 -214086 -260137 -118366 -34843 -152963 -221344 -136582
27013 -136582 -88824 -183647 -153103 -56877 -126250 -77232 -127582 -176454 -168501 50776 149325
27002 149325 31752 -111866 -4390 -60868 -280660 -371664 -337810 -75139 -252453 -165081
26992 -165081 219419 414932 190987 5855 125965 7731 -201963 -285642 -457065 -289329
26982 -289329 -56747 -30500 51439 13226 -153407 -308344 -440982 -688090 -530058 -345484
26972c45484J48390O3043K56020N8681J37240n0728k68286r6884N9945k2080K2235
26961c7908j22570j61889r800J91618Q1535j51598M3576J62994R7456j27943J07951
26950G3422J08845r915m7111Q0887J52101j51878j88677k3003n0264l1622p8978
26939a66193L9995J6987k6100J71650M9848k48139N5346P4357K9036O2552j06167
26928d6828j31125P0101j14879k0827L1040L23743L01350j5118k4036k56965o3090
26917E3366J5825j4441j16970q1330j02952K77546Q6176j75931j51483J23373
26907h6821K9895k17271K211K74966O3654N7511Q3102l2624j02325j04318j86854
26896b18874P9336M2003q5199l8204L3085j62805J04416J46011Q4200m6847P2284
$$ plain form
26972 -345484 -197094 -134051 121969 180650 317890 267162 -1124 -98008 -38063 -60143 -37908
26961 -37908 -160478 -322367 -332167 -140549 -59014 -210612 -167036 -4042 93414 -34529 73422
26950 73422 182267 172352 125241 206128 358229 206351 17674 -5329 -55593 -87215 -166193
26939 -166193 -126198 -109211 -135311 36339 86187 -161952 -106606 -32249 -3213 59339 -46828
26928 -46828 -177953 -107852 -222731 -243558 -212518 111225 412575 397457 373421 116456 53366
26917 53366 69191 54750 -62220 -143550 -246502 31044 117220 -58711 -210194 -86821
26907 -86821 -56926 -274197 -271986 2980 66634 124145 207247 174623 72298 -32020 -218874
26896 -218874 -139538 -97535 -182734 -220938 -187853 -350658 -246242 -100231 -16031 -62878 9406
26885I406k37195o0311J94564M1611j55983K5846J03998j29971J07975K44192
26875A44132k5050p0032k6076J85982K7158l0137j02012p4369j35478q8269j17875
26864c12026q5108J12706q9748K312J98743J89929J07959Q227R0357n9520k20323
26853e6492J25944m7747J03327N7637m5098k4243p967m185r9439j41082k8947
26842a68292L4561K85844k0270j73827m0040J42626j29158J34777L8286J15711
26832B20218k635j31762r8157J14653r8260j88599n6859Q9839q3386p901Q2011
26821a60838o7739k7838J38545J80841Q7215l1586k02416j49344J32328k01214
26811c02046o2310p7105J1851J76240K17487J01407K6622j8362p1239j71903j02068
$$ plain form
26885 9406 -227789 -288100 -93536 -51925 -207908 -182062 -78064 -208035 -100060 144132
26875 144132 119082 49050 22974 208956 236114 205977 103965 29596 -105882 -194151 -312026
26864 -312026 -397134 -284428 -374176 -371864 -173121 16808 124767 132994 223351 163831 -56492
26853 -56492 69452 21705 125032 182669 137571 113328 105361 101176 1737 -139345 -168292
26842 -168292 -133731 152113 131843 -41984 -82024 60602 -68556 66221 104507 220218
26832 220218 217583 85821 -12336 102317 4057 -184542 -241401 -151562 -234948 -242849 -160838
26821 -160838 -228577 -256415 -117870 62971 150186 118600 -83816 -233160 -100832 -302046
26811 -302046 -364356 -441461 -429610 -253370 -35883 65524 92146 73784 2545 -169358 -271426
26800b71426K66647J58096o3884j42233K9336j3438l6031L2912O6914P023Q5338
26789A19254j03978j72467k86545R5635J45205J80145J53303M7560l4770O8921
26779B12263Q4140j0553J7385j3347R0472K1570k49587o4389j65264o0449J2017
26768a25742j86875J18121o763J45796N7297J5319k1187j04290k14307L1357J37384
26757a53890J40556o5836M296p6642q1179R08J60593Q6155n7771n3123K51679
26746A55746J13494Q9062L5764O1108o9522q7062j17114P3653j17378k35289k0873
26735a18411M03596O2976l30408q7950j07170O6516L0297j96090o8647K35162
26725a10129J5815q0678j68651j3844O1348k7597K8863K6855J7887O440j03171
$$ plain form
26800 -271426 -4779 153317 89433 -52800 -23464 -36902 -72933 -40021 26893 33916 119254
26789 119254 15276 -157191 -443736 -348101 -202896 -22751 130552 178112 143342 212263
26779 212263 296403 285850 303235 289888 380360 401930 152343 87954 -77310 -137759 -125742
26768 -125742 -312617 -194496 -201259 -55463 1834 17153 -4034 -108324 -322631 -291274 -153890
26757 -153890 -13334 -79170 -74874 -151516 -232695 -231787 -71194 14961 -42810 -95933 155746
26746 155746 269240 358302 394066 455174 385652 298590 181476 255129 137751 -97538 -118411
26735 -118411 285185 348161 17753 -70197 -177367 -110851 -80554 -276644 -345291 -110129
26725 -110129 -94314 -174992 -343643 -357487 -296139 -323736 -294873 -268018 -250131 -243691 -346862
26714c46862J60363k08187n2735J63033J04601J74192J14418m9561j18364O0698
26704A596J00273l8758j04122O1524J52388p0221j21610N2234r2983N226J59476
26693A05023p4980q8035j6374q0378k6545N0j61506R1207K03515J80000J43763
26682B75740j48363l8766O4196Q8960j40000q8233Q464P0180J75889l2907l02406
26671f7246n6030K1227L4175J18003o220k49683p3847J0105J14602P9292j03709
26660a79331l4605M1296J38713L4197l6727M4211K78873K5140k52718j55197j75809
26649b71957J42753K05876J67732k00831k99273l2764M09298L2882p8733q187
26639F6796n8409j06076O3465Q7974O0731q6007J1967K3481N8858L6139K5071
$$ plain form
26714 -346862 -186499 -394686 -447421 -284388 -179787 -5595 108823 59262 -59102 1596
26704 1596 101869 63111 -41011 20513 172901 102680 -18930 33304 -59679 -54453 105023
26693 105023 30043 -57992 -74366 -154744 -181289 -181239 -342745 -251538 -48023 131977 275740
26682 275740 127377 88611 152807 241767 101767 13534 21998 92178 268067 235160 -67246
26671 -67246 -123276 -102049 -67874 50129 43909 -205774 -279621 -269516 -154914 -75622 -179331
26660 -179331 -213936 -172640 -33927 270 -36457 7754 286627 311767 59049 -96148 -271957
26649 -271957 -129204 76672 244404 43573 -255700 -288464 120834 153716 74983 66796
26639 66796 8387 -97689 -34224 53750 114481 28474 40441 63922 122780 158919 183990
26628A83990P4242j39070m9987l124r2868P4099O8380J59535O7560R8254P9467
26617E20478j85115l2763M6276j92784l83724j52689M8271J05062K93928j1901
26607E5039O307O7022K9486J25713q4139j6600l26543J00057J34862K81823p9538
26596B93489l37593J68609M1914r506l1908J1637J12626k4120r6548n7567j83917
26585a12884o8334K36515Q8953K4500o7721J43492n5014j21885L9968J39698L6986
26574B84274j80350k3580l9859k9145O8672J49136m2369M7448j37229m9097O9218
26563A17119n2061n1349J52226J22268o8378n4396J7601q0036k7842N587r9758
26552a9019J8458J40796J70733L071j27408k34320j46142J29596q9532N8123N6753
$$ plain form
26628 183990 258232 119162 69175 66051 -26817 47282 115662 275197 342757 441011 520478
26617 520478 335363 302600 348876 156092 -227632 -380321 -332050 -226988 66940 55039
26607 55039 61346 128368 157854 283567 199428 182828 -143715 -43658 91204 373027 293489
26596 293489 -44104 124505 166419 156913 125005 136642 249268 225148 128600 71033 -112884
26585 -112884 -181218 55297 144250 168750 101029 244521 189507 67622 107590 247288 284274
26574 284274 103924 80344 40485 11340 80012 229148 186779 234227 96998 47901 117119
26563 117119 65058 13709 165935 288203 219825 165429 183030 102994 75152 80739 -19019
26552 -19019 -561 140235 310968 314039 186631 -47689 -193831 -64235 -153767 -95644 -38891
26541c8891K5456Q6150R4528L0298q5732J939m8060J94515m6779k25506j78443
26530a90525j01309p9040K42802K74252Q6520K6888J05371o5041j89317q0856
26520B9745Q7148J47088M9701j79754j60592j7725K26934J37223J3942J33391
26510D67101p5025q1537j31339j34887j13061j00792J9370l4331J59600J18951
26500I4050o0467j12978J40270J22157J51106j17220J26081l2989r9728J29831
26490C40113k6593j0213j2995m4187j20712J23991O0289K3045M2072p045K3862
26479C91627k1693l44453m0300R4210K8624J82552O1554k01408j52661J08701
26469A06753J45382K7603k9809L5751p5845j93457k27136q7897J19171K01824
$$ plain form
26541 -38891 -13435 72715 167243 197541 111809 113748 65688 260203 213424 -12082 -190525
26530 -190525 -291834 -370874 -128072 146180 232700 259588 364959 299918 110601 29745
26520 29745 116893 263981 313682 133928 -26664 -44389 182545 319768 333710 467101
26510 467101 392076 310539 179200 44313 -68748 -169540 -150170 -184501 -24901 94050
26500 94050 33583 -79395 60875 183032 334138 216918 342999 310010 210282 340113
26490 340113 313520 303307 290312 246125 125413 249404 309693 332738 374810 367765 391627
26479 391627 369934 25481 -14819 79391 108015 290567 352121 150713 -1948 106753
26469 106753 252135 279738 249929 285680 209835 16378 -210758 -298655 -179484 22340
26459B2340O8568R1146J009j981K29545J55838J05564j56713k91360J70597J28049
26448E22602j14110k15538j48496J03283n8051k93171P6043j11924K50508M6953
26438E8099k42404p7741K15432J11464k83970R9078K40466K32143J76445j43768
26428C85244k0198j59515j92897j82435l5672J54307o4377L2388K19865K57388
26418C94098q8280j17285k25932o7860N2519Q2078J81342M3900r3628q3316J50901
26407B28537J16200l9198j49033L1983l3461K601n4355J5509J31371k2869N663
26396B32948l1906J69287j84238j41414m0872l7555K63146q6408j21710o7805
26386d6527P4081j2280R7170M8619r5285k7954L4951J63905J68556J9376J8331
$$ plain form
26459 22340 90908 182054 183063 181082 410627 566465 672029 515316 223956 394553 522602
26448 522602 408492 192954 44458 147741 89690 -203481 -127438 -239362 11146 58099
26438 58099 -184305 -262046 -46614 64850 -219120 -120042 120424 352567 529012 385244
26428 385244 365046 205531 12634 -169801 -205473 -51166 -115543 -83155 136710 394098
26418 394098 305818 188533 -37399 -105259 -52740 29338 210680 254580 160952 77636 228537
26407 228537 344737 305539 156506 188489 155028 157629 103274 118783 250154 227285 232948
26396 232948 201042 370329 186091 44677 3805 -33750 229396 142988 21278 -46527
26386 -46527 27554 15274 112444 161063 65778 37824 72775 236680 405236 424612 442943
26375D42943j04068n5940m0506l15628R8570R9044n5126m2702q2847n6729J49222
26364C6233J11576J24725Q3193k00034j34963k5552L4177K185O7150o6837j32403
26353a00550N0395J69442J6912j79961j81296n5705J24633r148J09066J25784
26343F9572N9069M4602O5538q9087J35999J37792N9228j61868m9152k0690p2706
26332A78297J34804J28694o2298O9470J85766J43972k17473k05026o3717P3674
26322C66163j15908j06509N2686m6492j16532o4684Q6031L9740J46713o2908j26847
26311E1453k46381j13548J50394J18673M0403J88969j1066p8477Q1967O4304k00230
26300D6461k12627j9164r4696l788m6413K04523R4583R4473J07482q6563k18361
$$ plain form
26375 442943 338875 282935 242429 -73199 25371 124415 69289 26587 -56260 -112989 36233
26364 36233 147809 272534 355727 155693 20730 -4822 29355 31540 98690 31853 -100550
26353 -100550 -50155 119287 136199 -43762 -225058 -280763 -156130 -165278 -56212 69572
26343 69572 128641 173243 238781 149694 285693 423485 482713 320845 271693 251003 178297
26332 178297 313101 441795 379497 448967 634733 778705 561232 356206 292489 366163
26322 366163 250255 143746 196432 149940 33408 -31276 54755 94495 241208 178300 51453
26311 51453 -194928 -308476 -158082 -39409 994 189963 178897 100420 182387 246691 46461
26300 46461 -166166 -185330 -280026 -283814 -330227 -125704 -31121 63352 170834 84271 -134090
26289a34090j57492K61909K39087l40846j6751J57906O7447J39274J503K7921
26279B45868R5239j33875k36927p0588J38043j08995j01170K8452M1285J06196
26269C528P1785J59285J40947J63989k45173j08095n5312M2421J27279M0613l9693
26258C01574M2643j41395j80936N1682L7776j28832l722L38456K5745j90472P2314
26247B24833m5825j26418J18627n6202j23639R3004R0261j48466P0220J22143
26237B18538L0122j34344P6461r8200j09363O045K3753K7617K1942m2143j53165
26226a32737j7793J78592L11558J21458j50477j92552l05683l0303J64567J8576
26216c4794Q0411l0493l2987o7160q2991M9674r6979J31831K44780o1271p2590
$$ plain form
26289 -134090 -291582 -29673 209414 -131432 -148183 9723 77170 216444 217947 245868
26279 245868 341107 207232 -29695 -100283 37760 -71235 -172405 -143953 -102668 3528
26269 3528 75313 234598 375545 539534 294361 186266 130954 173375 300654 341267 301574
26258 301574 344217 202822 21886 73568 111344 -17488 -21210 317246 342991 152519 224833
26247 224833 179008 52590 171217 115015 -8624 84380 174641 26175 96395 218538
26237 218538 248660 114316 190777 92577 -16786 -10741 13012 40629 62571 20428 -132737
26226 -132737 -150530 28062 339620 461078 310601 118049 -187634 -217937 -53370 -34794
26216 -34794 45617 15124 -17863 -85023 -168014 -118340 -215319 -83488 161292 100021 27431
26205B7431p0988p1246J31511P4051J7443l6980k92543o2178R0067M0406j4684
26194a67710k9845K18332J11955j5833R64n5618M5492J0161o9301k3955J03322
26183A27964J32137L4863r7944j57642j29460l4404r0528K84259L06393n7982
26173C17656p5124j44068J6306K35222L1071j08613j26284k7691j0319K734Q8278
26162A99168l1792j92883l464o3482J63249M4986J0979P9770M527j03067k31030
26151a23039p4068l6315j8700n3025k9875J46112K05773Q3929L1980J5305J1488
26140A59565J1367J45107o5190j59872J895J57383j78317j07119O1145J16919
26130A42883j85342p7853n2024Q1995Q4891p1736k05990j80416q3867N0273J80954
$$ plain form
26205 27431 -43557 -114803 16708 90759 108202 71222 -221321 -283499 -193432 -153026 -167710
26194 -167710 -197555 20777 132732 116899 117863 62245 107737 117898 48597 24642 127964
26183 127964 260101 294964 197020 39378 -90082 -124486 -215014 69245 375638 317656
26173 317656 242532 98464 114770 349992 381063 272450 146166 118475 108156 110890 199168
26162 199168 167376 -25507 -28971 -92453 70796 115782 126761 206531 211058 107991 -123039
26151 -123039 -197107 -233422 -252122 -305147 -335022 -188910 16863 100792 132772 148077 159565
26140 159565 170932 316039 250849 90977 92872 250255 71938 -35181 25964 142883
26130 142883 -42459 -120312 -172336 -90341 -5450 -77186 -283176 -463592 -547459 -497186 -316232
26119c16232J45666P0436J41319J08555j15423j26188J61118Q7170J55292L0436
26109C42149j25475L011P9039j17719r3991J03422L2878r3651p1712j2140m1977
26098C834J57053Q9271J30645l36433k00890o1460J18478Q9750K03176R3084q9745
26087A96763L8574o7304n5247Q0062M0252k02034j57656J2085J0067P1135j1620
26076d4923k21797J70113R867M871J79489j86316J37529P2444j11902k8116L5866
26065A7125Q9526j03979N4963J08646j31838r9935j59386J15055J93072m1611
26055D1638p3575j3542j0465J29880j21916n4062J20833M9445J09707J18550p4586
26044B21907j83327l11406q9566k3849J08530J84887J23115P7997J08209l2834
$$ plain form
26119 -316232 -170566 -100130 41189 149744 34321 -91867 69251 156421 311713 342149
26109 342149 216674 219685 298724 181005 87014 190436 223314 129663 57951 45811 3834
26098 3834 160887 250158 380803 44370 -156520 -217980 -99502 -9752 193424 286508 196763
26087 196763 235337 168033 112786 192848 233100 31066 -126590 -114505 -104438 -33303 -44923
26076 -44923 -266720 -96607 -86740 -81869 97620 -88696 48833 121277 9375 -18741 17125
26065 17125 106651 2672 57635 166281 34443 -65492 -224878 -109823 83249 41638
26055 41638 -31937 -45479 -55944 73936 -47980 -102042 18791 68236 177943 296493 221907
26044 221907 38580 -272826 -362392 -386241 -277711 -92824 30291 108288 216497 183663
26034A83663j83241j07158q321R6663J7896O7581J10834m958j24444k1653M1231
26023F8093K4273j16882j369J46895J00884L5493j43201j48905n1028o4102J5628
26012a34221K51462Q6072k32188J9609p649J06500O4122m3461k01339k59965P9673
26001b71385K23707q3161j23271M7341J82645Q6876n1949o092p6648k26204r202
25990c07343J77050J97031J79233K67342K1804n4391j33756q7442j48288k00542
25980h9302l06522o1098J17845J45036K43635l0778j87175J59473K18905j67035
25970D2984j63782j14754J00661K13663J3984o5262j43381q5096O7743o6245j05582
25959c05067l0898j22211N3794J49553L31457J15271r4356j21245k05012J44431
$$ plain form
26034 183663 422 -106736 -115057 -18394 -498 67083 177917 172959 48515 26862 68093
26023 68093 92366 -24516 -25885 121010 221894 257387 114186 -34719 -85747 -149849 -134221
26012 -134221 117241 203313 -28875 -9266 -16915 89585 153707 110246 -91093 -351058 -271385
26001 -271385 -47678 -130839 -254110 -206769 -24124 62752 10803 4711 -71937 -298141 -307343
25990 -307343 -130293 66738 245971 513313 535117 480726 346970 259528 111240 -89302
25980 -89302 -395824 -456922 -339077 -194041 49594 18816 -168359 -8886 210019 42984
25970 42984 -120798 -235552 -134891 78772 92756 27494 -115887 -200983 -133240 -199485 -305067
25959 -305067 -335965 -458176 -404382 -254829 76628 191899 97543 -23702 -228714 -84283
25949h4283J68177K3319k5806o6391j1378J1276r0375j42969q7487J44208r3402
25938b55111l0459J91411J24110J84226p5579j38976o0645k0765J17973o0977
25928b4792k3823P4939j52707M342J28709l5066j07251J9645M1084j39692J58450
25917e6162n1402k53231M4327M02971J61490o6965k37427j1860p4814j7374J02752
25906e7695r7250r2898M601j73333k03361J25968R9915K09227L42038Q6831q0048
25895A63995K1025J27288r2121R9622K42502j99082j58690l37J24602j48324k28082
25884d7602R2765j00914j1536L4360J387j4132K9172P1664L0324m5624M6433q7788
25872a491j46923K85556Q6780j31258j10202l3079K36082j9918k00793r036K74499
$$ plain form
25949 -84283 83894 107213 81407 15016 3638 14914 -75461 -218430 -305917 -161709 -255111
25938 -255111 -285570 -94159 29951 214177 138598 -378 -61023 -81788 36185 -24792
25928 -24792 -48615 26324 -126383 -122041 6668 -28398 -135649 -116004 -74920 -214612 -56162
25917 -56162 -107564 -360795 -316468 86503 247993 181028 -56399 -68259 -143073 -160447 -57695
25906 -57695 -154945 -247843 -243242 -416575 -619936 -493968 -394053 -184826 157212 244043 163995
25895 163995 185020 312308 220187 319809 562311 363229 204539 204202 328804 180480 -47602
25884 -47602 45163 -55751 -67287 -32927 -31540 -45672 -16500 55164 85488 39864 86297 -1491
25872 -1491 -148414 137142 223922 92664 -17538 -50617 185465 165547 -35246 -44282 230217
25861B30217R1527K2120j37500q640K6962j81054J13611J40m3438O3670L2241
25850B09856j93952j18192J38536J85488m4064j90037J1545L17L0136J30089J89709
25839C49431l8155k7808l14948k840K64588P6121j36435n0777P3639j93644J51617
25828A50789j28450O543P5991Q3787M3905j16383q7220J9801j9400M6982J28513
25817B04858N9380m171j56088K56J94157J34698O5858O40j34387R353l4211M0071
25805C80414P6065n2487j57713j27289R9298l3682j28992l932P6200J065N223
25794A34170K3587j41776J32573q9500j3012K28205R0820o3197j02453k09139
25784i722k43014m2137J51567K22375J05409j08703j88346j75204L575K40736
$$ plain form
25861 230217 321744 343864 206364 197724 224686 43632 157243 157383 113945 177615 209856
25850 209856 15904 -102288 36248 221736 177672 -12365 -820 -503 29633 159722 349431
25839 349431 311276 283468 -31480 -34320 230268 306389 169954 119177 192816 -828 150789
25828 150789 22339 28882 104873 188660 232565 116182 28962 48763 29363 76345 204858
25817 204858 264238 260067 103979 104235 298392 433090 498948 499588 365201 374554 340343 380414
25805 380414 456479 403992 246279 118990 218288 184606 55614 51682 127882 128947 134170
25794 134170 157757 15981 148554 59054 46042 274247 365067 301870 199417 -9722
25784 -9722 -252736 -294873 -143306 79069 184478 75775 -112571 -287775 -284200 -43464
25774d3464O7539j57262p3435N1291j97668k9918J67308Q2696M2184M5001n5747
25763a01475n0603n1217j71572R2442J65758j1165q0003p3534K11259p0827O7485
25752g3452J36976J74911O3842L1204l86875k74013J63758J14344J88817j3386
25742A26126j13368O4880o5305q3892k65510J04433J51638J635j29087j53835
25732c62285J19967J93450M5153N9124K6655m350L4654L1882r5103J16302R4324
25721B59773k8064j40075j19608j11821j31587m1454N4501J79635K02457K27883
25711C51640k5607r7775j59547M7787o7555j31225j40480p7609L5619Q0382P2250
25700a12120j35417P0301J92475p5336q6934l9077J54933J60122L0957j07319
$$ plain form
25774 -43464 24075 -133187 -206622 -155331 -352999 -382917 -215609 -132913 -90729 -45728 -101475
25763 -101475 -152078 -203295 -374867 -282425 -116667 -127832 -207835 -281369 -70110 -140937 -73452
25752 -73452 63524 238435 302277 333481 -53394 -327407 -163649 -49305 139512 126126
25742 126126 12758 77638 12333 -71559 -337069 -232636 -80998 -79363 -208450 -362285
25732 -362285 -242318 -48868 -3715 55409 82064 77714 112368 144250 49147 165449 259773
25721 259773 231709 91634 -27974 -139795 -271382 -312836 -258335 -78700 123757 351640
25711 351640 326033 228258 68711 116498 48943 -82282 -222762 -300371 -264752 -184370 -112120
25700 -112120 -247537 -177236 15239 -60097 -147031 -186108 -31175 128947 159904 52585
25690E2585p3013K27606K18082j1657j81134j50826j61901J0139J1646k0385l329
25679h2187j17510J11752j17895o4957O6997j08484o1179R6697L0678q2963J16314
25668b12737j32055J17191M3183J0030k9789K19708Q5129q6470n2003k9465o1288
25657a28566N0217J24008q509L920l7136o4994j6077L2949m7136J48312l3718
25646B3270O638J04638R6644J29168l6224k12354j69440l1362J05922n2955j15151
25635a51206j35508l8633J58014J00113J67721k6080J4672Q0L26838Q7242l1750
25624D71503j78490j66584K3156j08075j20362j01230M7421K00868o0508l2018
25614b4319p1684n6561J75372J40608R0263j18104j65525k05806n5573j58313
$$ plain form
25690 52585 -20428 207178 425260 413603 232469 81643 -80258 -70119 -58473 -78858 -82187
25679 -82187 -199697 -87945 -205840 -270797 -203800 -312284 -373463 -276766 -246088 -329051 -212737
25668 -212737 -344792 -227601 -184418 -174388 -204177 15531 100660 14190 -37813 -67278 -128566
25657 -128566 -78349 45659 37150 41070 3934 -61060 -77137 -44188 -91324 56988 23270
25646 23270 29908 134546 231190 360358 324134 111780 -57660 -89022 16900 -36055 -151206
25635 -151206 -286714 -325347 -167333 -67220 100501 74421 89093 89173 416011 503253 471503
25624 471503 293013 126429 149585 41510 -78852 -180082 -132661 68207 7699 -24319
25614 -24319 -96003 -152564 22808 163416 253679 135575 -29950 -235756 -291329 -449642
25604d49642j5321L57647K50656o1475O6424j69213L9595l2414r6143R0609J20739
25593A01462j24057j14923J12567K04704j7417j12980k54434o6458j4848J01529
25583a84855J25154J88099l2095k28842j88138l5161R3888K22382k0420o2126
25573a22114R0566L9979o2626N7908k6900k11555N9293N0690l8320O2925N3123
25562d7031k8426J65041J2877L176p9355o0328j19406J48065M7048l42278m4340
25551c44957K16892J01325o3675j61209L6544J76199J5688O6516R5643m8358j09078
25540a8470L5070L4594m9904r2074q7678J27476m9878k2874m7645O2365J76214
25529F7196j19442l2087j84921l9308O9302o4793p7945J4565L0281L4672p3160
$$ plain form
25604 -449642 -464963 -107316 143340 81865 148289 -20924 18671 -13743 -109886 -19277 101462
25593 101462 -22595 -137518 -24951 179753 162336 49356 -205078 -271536 -286384 -184855
25583 -184855 -59701 128398 96303 -132539 -320677 -355838 -261950 -39568 -59988 -122114
25573 -122114 -31548 8431 -54195 3713 -23187 -234742 -175449 -124759 -163079 -100154 -47031
25562 -47031 -75457 89584 102461 105637 26282 -34046 -153452 -5387 41661 -300617 -344957
25551 -344957 -128065 -26740 -90415 -251624 -215080 -38881 -23193 43323 138966 90608 -18470
25540 -18470 16600 51194 1290 -90784 -178462 -50986 -100864 -123738 -171383 -109018 67196
25529 67196 -52246 -84333 -269254 -308562 -239260 -304053 -381998 -367433 -337152 -302480 -375640
25518c75640k574o2284J00741J59769J9374m9058r5629p6405p5719J24954L40510
25507H039R6303J7767P2713j50243l7436M5880N1281J11887o8226r089K47350
25496C86226L7578P9301j40318n0995J40276p6966J6661J39050k2493j13311j14623
25485B80386o3843N1066m7147M7928J54245j84075o2013J29086p1919j26519r046
25474I8149m8440o2779K2754K99777l6364r6927j25881j51027m2964m1591K61625
25463G6332K46615O1952k59823j36453j67216j98110O3456j8809q6408O930K06202
25452b05332K155r8253K09986J36194r7901m1626P538O8304j04433j20686J25097
25441a18957J13096p2324p0891M6875m5274K32995J01245K6836J6185j62555M0135
$$ plain form
25518 -375640 -378214 -440498 -339757 -179988 -160614 -209672 -305301 -381706 -457425 -332471 8039
25507 8039 104342 122109 194822 44579 7143 53023 104304 216191 147965 138876 386226
25496 386226 423804 503105 362787 311792 452068 375102 391763 530813 508320 395009 280386
25485 280386 216543 267609 220462 268390 422635 238560 176547 305633 233714 107195 98149
25474 98149 49709 -13070 9684 309461 273097 176170 50289 -100738 -143702 -185293 76332
25463 76332 322947 384899 125076 -11377 -178593 -376703 -313247 -332056 -418464 -411534 -205332
25452 -205332 -203177 -301430 -91444 44750 -53151 -94777 -87239 -18935 -123368 -244054 -118957
25441 -118957 -5861 -78185 -149076 -102201 -147475 85520 186765 213601 229786 67231 107366
25430A07366m5482o2139j07941l3465J04225m9867j62931J28164R2541j2998J5008
25419b7519L05750j7164q5010k0836m2431n4685n0870k4202K5347m8653Q9777
25408D9504L8371J97548J6974j40657k6976l0874k17317j27304K14634J90726
25398A64629L5387o2975j04700O5232j85409j45828q8203R0620J66738j50287
25388b14796j1705j6181K8361N0109J7183p6040N8802J00432j7355N1780Q8320
25377E8910P6860k43712j61148J90725L16441j4503q3797o2200j93271j96626
25367c12321L2305J27152R8536k1796J63026J7320R8642m3742n5480J40488m6308
25356A97822r8177k05963J1547K43374L8463n9642m3704j83440K26954O7133L0575
$$ plain form
25430 107366 61884 -255 -108196 -141661 -37436 -87303 -250234 -122070 -29529 -42527 -27519
25419 -27519 278231 261067 176057 155221 112790 58105 7235 -16967 8380 -40273 49504
25408 49504 87875 285423 302397 161740 134764 103890 -113427 -240731 -26097 164629
25398 164629 200016 137041 32341 97573 -87836 -233664 -321867 -231247 -64509 -214796
25388 -214796 -226501 -242682 -214321 -164212 -147029 -223069 -164267 -63835 -81190 -29410 58910
25377 58910 135770 -107942 -269090 -78365 238076 223573 139776 77576 -115695 -312321
25367 -312321 -280016 -152864 -54328 -76124 86902 104222 202864 159122 103642 244130 197822
25356 197822 99645 -106318 -94771 148603 187066 127424 83720 -99720 127234 194367 224942
25345B24942K25187p3239l78573k20837O3005N312k9732J44206K67960o9190j77295
25334a8254j30916Q673J26178Q974R2359O8916L2871L5471m3192k31187O131L6590
25322g386r869j37086M0164n4433N6721N2259P5927M2550k09153j26977K09336
25311f7947J07909J3509J05630J0837m9061r4857l613j3456o4586K0924n8326
25300i3037k93923j79367K44817N5238j2587o401k3234K40692J73031r2049p959
25289E221J730o7116l5258J59647q098j25869j28835J59169J19433j76525P2626
25278b3875J07809J87572J8555j21939N480J58504l17087j52680J02890M9296
25268A4525m9960J66822m0217J5337j15873J502m0705J01874l5232J43556J26626
$$ plain form
25345 224942 450129 376890 -1683 -222520 -159515 -154203 -183935 -39729 228231 159041 -18254
25334 -18254 -149170 -140497 -14319 -5345 87014 155930 188801 224272 181080 -50107 -43976 -7386
25322 -7386 -17255 -154341 -114177 -168610 -111889 -59630 16297 58847 -150306 -277283 -67947
25311 -67947 39962 53471 159101 169938 120877 26020 22407 8951 -55635 -34711 -93037
25300 -93037 -386960 -566327 -321510 -266272 -278859 -285260 -308494 -67802 105229 13180 5221
25289 5221 6951 -60165 -95423 64224 56126 -69743 -198578 -39409 80024 -96501 -23875
25278 -23875 83934 271506 290061 168122 173602 332106 15019 -137661 -34771 14525
25268 14525 -35435 131387 91170 106507 -9366 -7864 -48569 53305 18073 161629 288255
25257B88255J67054L7361k76096p8604M3730J33313J92941Q1666j75916j52999
25247B60705J62986Q5875k92100J54831K80881J74146J84792j00697J29659r0510
25237I50568J39183r2776j68917M433J04973J01117J58870L2360L7582j55869
25227A111524p4752j39772J8227J94999r9929n9850L63094K2265j33266J03030
25217A305570j80045j51018j57868k13729J02406p493P7795Q1816J39243Q0811
25207A077488k13228j86919j36770q1386j11788p8549k09176j35910j03469N9917
25197a19790J68523K17249J4020j87213k19306N0381K62347J41562N7243J68835
25187E53851O5484j01584j05634l067K78492O6976m5836j4726j47364j32726J61868
$$ plain form
25257 288255 455309 492670 216574 137970 181700 315013 507954 589620 413704 260705
25247 260705 423691 509566 217466 372297 653178 827324 1012116 911419 1041078 950568
25237 950568 1089751 996975 828058 832491 937464 1038581 1197451 1229811 1267393 1111524
25227 1111524 1036772 897000 915227 1110226 1010297 950447 1313541 1335806 1202540 1305570
25217 1305570 1125525 974507 816639 602910 705316 697823 775618 857434 996677 1077488
25207 1077488 864260 677341 540571 459185 347397 268848 59672 -76238 -179707 -119790
25197 -119790 48733 265982 280002 92789 -126517 -76136 186211 327773 385016 553851
25187 553851 619335 517751 412117 409050 687542 754518 708682 693956 546592 413866 575734
25176E75734l9784m1515j57555J05257Q6775O5225N9904j35713p6309J16302J14001
25165F72322p2921m4938J412J28012r21j52898q9954m7681J75064m225r0300K6712
25153D99684R5074J33847P6358L0403j43690o5695j19274m4407P8686l29228m3077
25142A68681l9784p8571j4338m7667J1488k6787Q2367o8199n9572p40j7867P5205
25130a5784K05476J72847J38711J43639J32299J08740R0495n8135r573J74207
25120A082922O6793m5941J86344m3063j61818r4048j96282q3587J03424n8317
25110G56427l65803l95198j47314j36560j99822K30104L78771j81311j10274J24448
25100d6532J31085j24541L96287O35758K13433J02641l1334l8489N455J35715
$$ plain form
25176 575734 535950 494435 336880 442137 528912 594137 654041 518328 442019 558321 672322
25165 672322 599401 554463 555875 683887 682966 530068 440114 392433 567497 563272 472972 499684
25153 499684 594758 728605 804963 835366 691676 625981 506707 462300 540986 211758 168681
25142 168681 128897 50326 35988 -11679 -191 -26978 55389 -12810 -72382 -73122 -90989 -15784
25130 -15784 189692 362539 501250 644889 777188 885928 976423 918288 908715 1082922
25120 1082922 1149715 1103774 1290118 1247055 1085237 991189 794907 711320 814744 756427
25110 756427 390624 -4574 -151888 -288448 -488270 -258166 120605 -60706 -170980 -46532
25100 -46532 84553 -39988 356299 992057 1205490 1308131 1276797 1238308 1243763 1379478
25090A379478J74689m8937l1332j78376l86453k47794k75751k37406J30836j3761
25080B65193j65845M4197j62540n5157K5793J7194K32471l9594k23291J00644
25070C9065J09493p9387J37805R134p6376l2566K01635k6226o8524q1444K2984
25059A55593q3050k87770J60993K18629l5002J19223K73906K12942J557l92531
25049C44490l29197n1509L21716L10477M237k58563p518M52994M01466P9984K98195
25038A566772N0189L76478K71774j33085q8130J84458L43652L07258K93225J61059
25028C333650n9930j18748q2609p9239j79643r3818K67421O46981M38748K33630
25018D306443P564k10437K06787M64100M06273L08175K65518N55756M95117M30778
$$ plain form
25090 1379478 1554167 1505230 1473898 1295522 909069 661275 385524 148118 278954 265193
25080 265193 99348 143545 -18995 -74152 -48359 -31165 201306 161712 -61579 39065
25070 39065 148558 69171 206976 216110 139734 107168 308803 282577 214053 132609 155593
25059 155593 72543 -215227 -54234 164395 129393 248616 522522 735464 737021 344490
25049 344490 15293 -36216 285500 595977 600214 341651 334133 787127 1188593 1268577 1566772
25038 1566772 1616961 1993439 2265213 2132128 2043998 2228456 2572108 2879366 3172591 3333650
25028 3333650 3273720 3154972 3072363 2993124 2813481 2719663 2987084 3634065 4072813 4306443
25018 4306443 4314007 4103570 4310357 4774457 5180730 5488905 5754423 6310179 6805296 7236074
25008G236074M29812N67426R31295Q78452N28623J50515K76693M10392R35788
24999A2345070R69478P59688O99121J040178J616951J599569J931008K717455
24991B3678518L847821M765249P599326J1119320J6365998K3983611L3362419
24984A24722262L9489239M1185996L6677647K7509635J8756905J6341746K0029870
24977C24713300K7479023L9016176N0248322M6317658J8229868j2670955k3442817
24970D69890575j5511201n470249l32491L440337O018323m148196m4018321q2251797
24962C27616980q4596368o7796684m4288025k7689505j8936983j3664661j0383782
24955F0260972r303412q184323n928117m128118l747974l922759m048049m220644
$$ plain form
25008 7236074 7665886 8233312 9164607 10043059 10571682 10722197 10998890 11409282 12345070
24999 12345070 13314548 14074236 14773357 15813535 17430486 19030055 20961063 23678518
24991 23678518 27526339 32291588 39890914 51010234 67376232 91359843 124722262
24984 124722262 164211501 205397497 242075144 269584779 288341684 304683430 324713300
24977 324713300 352192323 391208499 441456821 487774479 506004347 493333392 469890575
24970 469890575 454379374 448909125 448576634 452016971 458035294 453887098 409868777 327616980
24962 327616980 243020612 175223928 130935903 103246398 84309415 70644754 60260972
24955 60260972 50957560 42773237 36845120 32717002 28969028 25046269 20998220 16777576
24947A6777576l307250k370437j871674j487031j345066j162362q36110p47209
24939C650437p64042m044K38585j0099m16237p17532l27256Q9948L02852M02726
24929B445338N53503J79354l51929o23337o02519j37238k40020m2919M01193R1469
24919A672895K6401M9188p9224j26345J681K20680P8790N1483P7137J76495L01671
24908B450852O7396k92515J83921L41042M65270K616k00133q3151P3392j15775
24898B892915k53957l20566k68582k61176j75578J74292K11910Q2545j52948j44970
24888A783885l49549j58126j71239o5146K84026L91747l551l21523K6147L1652
24878A448323k58755j66668L02892K21623M4195M1962K59632O0088M6083j71455
$$ plain form
24947 16777576 13470326 11099889 9228215 7741184 6396118 5233756 4397646 3650437
24939 3650437 2886395 2882351 3120936 3110837 2694600 1977068 1649812 1739760 2042612 2445338
24929 2445338 2998841 3178195 2826266 2202929 1600410 1463172 1223152 1180233 1581426 1672895
24919 1672895 1699296 1748484 1669260 1542915 1544596 1765276 1844066 1895549 1972686 2149181 2450852
24908 2450852 2518248 2225733 2409654 2750696 3215966 3218582 3018449 2935298 3008690 2892915
24898 2892915 2638958 2318392 2049810 1788634 1613056 1787348 1999258 2081803 1928855 1783885
24888 1783885 1434336 1276210 1104971 1039825 1323851 1715598 1712047 1390524 1416671 1448323
24878 1448323 1189568 1022900 1325792 1547415 1591610 1633572 1893204 1953292 1999375 1827920
24868A827920j97651j00783Q6769K67818k2695k10293j8707n4325l09980j00176
24858A167897q1994n3097j5526k11836l8792R7882L2971j11714k67790j14168
24848D03833n6124N8375P9292J38804K67457J33988o6373r749M927j42095l5700
24837G76635n3283K52580K91781k3037j59609j94859n0217j90351m53583m86049
24827b89992n210J81179J54794l4622k45505j22496J7218M2691n7608K70706L49356
24816B60511J85141L5616O6237j7216q3134q1765J02528l3229r7288k05625j40612
24805h836k08164J47J11987L67149K63635j02311k86823L6464P3544l22283J598
24794g3893O5189R1148j55660k48368N8602J00686J51029K92757Q3344k61898
$$ plain form
24868 1827920 1630269 1529486 1616255 1884073 1861378 1651085 1632378 1578053 1268073 1167897
24858 1167897 1085903 1032806 1017280 805444 766652 864534 897505 785791 518001 403833
24848 403833 347709 406084 485376 624180 891637 1025625 959252 949503 954430 812335 776635
24837 776635 723352 975932 1267713 1244676 1085067 890208 839991 649640 196057 -289992
24827 -289992 -295202 -114023 40771 6149 -239356 -361852 -344634 -301943 -359551 -88845 260511
24816 260511 445652 481268 547505 530289 447155 365390 467918 434689 337401 131776 -8836
24805 -8836 -217000 -216853 -104866 262283 525918 423607 136784 173248 246792 -75491 -73893
24794 -73893 -8704 82444 -73216 -321584 -262982 -162296 -11267 281490 364834 102936
24784A02936j06798J3129M3470o9433J39341J52161J76727O122j75770l40728
24774e8843o4629L09569J92085o9297O6592r2774j28524j66213j57938M8495n0772
24763a72249p8174K8070J14081J36327k963P694L6826n9421o9300J22572Q6902
24752A50365J86447q3389q62J1382q6580l6483N3675k29782K6164J762m220K86326
24740B74805Q9352l00265j10239M4035j0961Q9394j57699k32391K28955k9361
24730a14375k8844J2184R6043O8442o3111j29401J30789J34225Q3980r2904k23473
24719a26445l7759j06793k2234j91291N6976R2230n9107M3571q9774k554R8307
24708c44873j01911k29599M688r0263J05901K59811k4687K5563R2930K0025Q0536
$$ plain form
24784 102936 -3862 9267 52737 -16696 122645 274806 451533 457655 281885 -58843
24774 -58843 -123472 186097 378182 308885 375477 282703 154179 -12034 -169972 -121477 -172249
24763 -172249 -250423 -222353 -108272 28055 25092 32786 69612 10191 -59109 63463 150365
24752 150365 336812 253423 252561 263943 177363 140880 194555 -35227 -9063 -7301 -11521 274805
24740 274805 364157 63892 -46347 -2312 -13273 76121 -81578 -313969 -85014 -114375
24730 -114375 -143219 -131035 -34992 33450 -29661 -159062 -28273 105952 189932 97028 -126445
24719 -126445 -164204 -270997 -293231 -484522 -427546 -335316 -394423 -350852 -440626 -443180 -344873
24708 -344873 -446784 -676383 -671695 -761958 -656057 -396246 -420933 -395370 -302440 -282415 -201879
24697b01879k3976j08998k6016n4618j08618k8714K59776K14771K06837k3433
24687A05132o4840l7320K0854O740O1313M361J88527N2307Q3512J23663k54659
24676B89590k13257m2310j32775P8967L5331p2606L874m0632K47054r8966J8420
24665G2690J04784J4111j16971o4949k7240J15902K31734K19206j58954k23005
24655A67308o4207L44777J0767K7347k98073Q822K3347P3549J92715n4952l4287
24644C97113j71429j0491n9545J21768N3628l09595j182K24789L6618M0551K4023
24633C46248m3792k6903L5130K2849R9436n5247J08554q1035j41815j15382J51499
24622B99542Q3099M6274j64965k5742J40869p2957j21651J73317N4646k8115j07800
$$ plain form
24697 -201879 -225855 -334853 -360869 -415487 -524105 -552819 -293043 -78272 128565 105132
24687 105132 40292 2972 23826 30566 91879 96240 284767 337074 420586 544249 289590
24676 289590 76333 34023 -98752 -19785 15546 -57060 -53186 -93818 153236 54270 72690
24665 72690 177474 191585 74614 9665 -17575 98327 330061 549267 390313 167308
24655 167308 103101 447878 458645 485992 187919 196741 220088 293637 486352 431400 397113
24644 397113 225684 215193 155648 277416 331044 21449 20267 245056 281674 322225 346248
24633 346248 302456 275553 310683 333532 432968 377721 486275 405240 263425 148043 299542
24622 299542 382641 428915 263950 238208 379077 306120 184469 357786 412432 384317 276517
24611B76517o5319Q4695L05864m4523k57950k25500j28750J17893N843J61272
24601B30042k24378j65046l357j21750J28041N0090K6504j16029N8040J40598
24591B755J0688j72588p5615P600p4365J59054J14864r556o5780j25263K6373
24580b01833O6242P9153j06648K2507J45414J41061J0448o7539l0886N3847J11433
24569B23199R643k4553K7710N6407r396k43827J43585M0151l8110J0374R2613
24558B87796j52730m438J22475J11405n0372O8981p9922j16045O9572J90955L6684
24547D84361q8105k83250o68J46398m3521l11238q0350n0618O4107K16773o0041
24536f152l2414N66M1552R7195P7027k6177j07189o724J37553J17990J84619k9359
$$ plain form
24611 276517 211198 295893 601757 557234 299284 73784 -54966 62927 68770 230042
24601 230042 5664 -159382 -162739 -284489 -156448 -106358 -79854 -195883 -137843 2755
24591 2755 13443 -159145 -234760 -227160 -301525 -142471 -27607 -37163 -102943 -228206 -201833
24580 -201833 -135591 -56438 -163086 -140579 4835 145896 156344 88805 57919 111766 223199
24569 223199 232842 208289 235999 292406 283010 39183 182768 222919 184809 195183 287796
24558 287796 135066 130628 253103 364508 314136 383117 303195 187150 256722 447677 484361
24547 484361 396256 113006 112338 258736 215215 -96023 -176373 -226991 -162884 53889 -6152
24536 -6152 -38566 -38000 3552 100747 177774 151597 44408 37684 175237 293227 477846 448487
24524D48487k34268j55552r7449j11410K9419M4016m5340K6471N367o310p8223
24513a74792k49519R2639K91399J27348j54869j519J84466R477K5177l6108l8342
24502G5357r8834j16623j39220P3926J75049J01138J06084J64257M3682j66305
24492B18511j450N3088j33950K18720K45235k35120l1523L7273J84601j31507
24482D23878j27192J3723j00390k9915r7586j18756J35359J59053O3941r5361
24472B26754o4974R3627m0336k19491o3578j06042J53675K23053K21623P411n4158
24461C77564j82480k01518M1122j1668l114k86522k01008P4502K00629q1631M8531
24450b25593j71473l5580P1691L1982J0990O2370N8208J67200J85830k05632o4813
$$ plain form
24524 448487 214219 58667 -38782 -150192 -120773 -76757 -122097 -95626 -90259 -96569 -174792
24513 -174792 -424311 -331672 -40273 87075 -67794 -69313 115153 124630 149807 113699 75357
24502 75357 -23477 -140100 -279320 -205394 -30345 70793 176877 341134 384816 218511
24492 218511 217061 270149 136199 354919 600154 365034 333511 370784 555385 423878
24482 423878 296686 310409 210019 180104 82518 -36238 99121 258174 322115 226754
24472 226754 161780 255407 215071 -4420 -67998 -174040 -20365 202688 424311 431722 377564
24461 377564 195084 -6434 34688 23020 19906 -266616 -467624 -393122 -192493 -274124 -225593
24450 -225593 -397066 -432646 -360955 -328973 -317983 -255613 -197405 -30205 155625 -50007 -114820
24439a14820K05519J50567m5478r3628k1927J881J47061j9040j51476N736r3422
24428b9027P6255K00945M2059j31438j20055k9506k1994k9526L9916R6879O1056
24417A55564J97550J26579j04580k84078p4608J77810l5365J02378J3837n04775
24407b29688k24262j64065K33875M13636N4190j332j54075k9090o2044J7113N9981
24396h5761P0385J08863r1577n2584K62377J39385J30292p1353k53798J08901
24386B65130J8805p2565N6630k7961l7967q1531r8690r8482J65398L58852K13848
24375F61467j4177k79901k19536K36451L5817N1768r4375o236q9184j53593k3931
24364A04570R4565k8384k804k61861j39715P1644k7345K39750R3873Q4827L3596
$$ plain form
24439 -114820 90699 241266 195788 102160 80233 82114 229175 210135 58659 64395 -29027
24428 -29027 47228 248173 290232 158794 38739 9233 -12761 -42287 -2371 94508 155564
24417 155564 353114 479693 375113 91035 16427 194237 158872 261250 275087 -229688
24407 -229688 -453950 -618015 -384140 29496 83686 82354 -71721 -100811 -162855 -145742 -85761
24396 -85761 -15376 93487 1910 -50674 211703 351088 481380 410027 156229 265130
24386 265130 283935 211370 268000 240039 202072 120541 21851 -76631 88767 447619 661467
24375 661467 647290 367389 147853 384304 420121 471889 377514 371278 282094 128501 104570
24364 104570 199135 170751 167947 -93914 -233629 -161985 -189330 50420 144293 229120 262716
24353B62716j42131J1646o7906r0770J5716J5445l4441j48245N7957J84344k19166
24342a54835n3828r5266K00205J08249j97752m8102K37303J0159N0056k55004
24332a98815j2921K7133j05170j00600P8379J38114K65412K9297q2088J49524
24322A88265J45907k12872j08663j11734j15829k1224j0864K88985j44529Q8851
24312a3707P4832M6878j45800o9625J22820m7541k59289L141R2562J18536j39150
24301b16343p8239p870O2682K27010K70030J83565O614j16487q7892k95407n1898
24290a04235J93753N9020J11857J48098p4170j81224k34591n976j64696J3282
24280b38882J21879K26414R6783L2040q5553j33688m9192K63369P5731J09681
$$ plain form
24353 262716 120585 132231 64325 -26445 -10729 4716 -29725 -177970 -120013 64331 -154835
24342 -154835 -208663 -303929 -103724 4525 -193227 -241329 -4026 6133 56189 -198815
24332 -198815 -211736 -184603 -289773 -390373 -311994 -173880 91532 120829 38741 188265
24322 188265 334172 121300 12637 -99097 -214926 -236150 -247014 41971 -102558 -13707
24312 -13707 61125 108003 -37797 -107422 15398 -32143 -291432 -288291 -195729 -77193 -216343
24301 -216343 -294582 -302452 -239770 -12760 257270 440835 447449 330962 243070 -52337 -104235
24290 -104235 89518 148538 260395 408493 334323 153099 -81492 -87468 -252164 -238882
24280 -238882 -117003 109411 206194 238234 152681 18993 -30199 233170 308901 418582
24270D18582j13470j21633r7484n8550O9997O2030J71314m8126k05296j52336
24260g4972r1726Q4542M2123n8216j9980Q6821j44226P3659J01068j94124R6452
24249i8579J50129k1822O1455J06614M0247m1922j32695L3422j01444K8873N9841
24238H4119k07035K4932o0686j0952j12448J06677K5129p6041o3941P2927j1790
24227b29109Q783k372j83445k61454k4923J82704J25385J28135J871K11515K51261
24216B08351r7859j746P9971M1297J26923j29294l22900k26385J53256J6335K6961
24205a25090q6415K50398J2494p3903N0614K31106Q4014n7680j45072j06945K4965
24194E8486o2101j17677Q8581k5882l5543j4763J84067N4414j90201j14263K5389
$$ plain form
24270 418582 305112 183479 85995 27445 97442 159472 330786 282660 77364 -74972
24260 -74972 -166698 -82156 -40033 -98249 -118229 -31408 -175634 -101975 -907 -195031 -98579
24249 -98579 51550 29728 91183 197797 238044 196122 63427 96849 -4595 24278 84119
24238 84119 -122916 -97984 -158670 -169622 -282070 -175393 -150264 -226305 -290246 -217319 -229109
24227 -229109 -220326 -222698 -406143 -667597 -692520 -509816 -384431 -256296 -254425 -42910 208351
24216 208351 110492 108746 188717 230014 356937 227643 -95257 -321642 -168386 -152051 -125090
24205 -125090 -211505 38893 51387 -22516 28098 259204 343218 285538 140466 33521 58486
24194 58486 -3615 -121292 -32711 -58593 -94136 -108899 75168 129582 -60619 -174882 -149493
24183a49493M7791O8696J75813J93491J77856o730k43153k46127r1426J64770
24173I1488j703j05055Q299Q6792J15628L2732K4839K1049j3582j43636j36087
24162a9236J21895P908j10654R560j5382j63187R6038O4219j11579k05664K6983
24151b99099O2902N156J51822l8089r4771P1042L9565o2658J97867J57485n6032
24140A35190p5393o3875j61017J40366M6517m9778o238J82345O42r8091q2389
24129c1721J04033o4511j6994J01090r4451j29030K0727J49672p2771j64283j0786
24118b09025J26363K5328k3726K17255l0827k01717o8685n3823r7365J08537K07288
24107c97L3801j1434J87744J4772j93352J17448O6493j06924p8888p6878j2635
$$ plain form
24183 -149493 -101702 -33006 142807 336298 514154 507424 264271 18144 -73282 91488
24173 91488 89785 -15270 -6971 79821 195449 228181 253020 274069 260487 116851 -19236
24162 -19236 102659 110567 -87 9473 -5909 -169096 -73058 -8839 -120418 -326082 -299099
24151 -299099 -236197 -231041 -79219 -117308 -212079 -141037 -101472 -164130 33737 191222 135190
24140 135190 59797 -4078 -165095 -24729 21788 -27990 -34228 148117 148759 50668 -31721
24129 -31721 72312 7801 -9193 91897 -2554 -131584 -110857 38815 -33956 -198239 -209025
24118 -209025 -82662 -57334 -81060 136195 105368 -96349 -165034 -218857 -316222 -207685 -397
24107 -397 33404 21970 209714 224486 31134 148582 215075 108151 29263 -47615 -60250
24096f0250K30837j088o7254K3457m0355k20296l0952J31834O1604Q6936o7488
24085D6985o6466K49120l6917j56721K77730M2291n1792k25022j42477K50777
24075A87508L8781K09176m02j12350Q8011k67990q9795J07973n7497j60588k3451
24064h0624J66841M5347j10412p7237J06666m27P4625k31473j77953J00379J5907
24053a68361n3368P7832J74357O2794k08233k43679L8867N0915J46270p6635k20051
24042d19292J2989K15104J21912J93206j252O1474R6723r3321o3449k18710L5452
24031e9164K7548J30206O1042j29625j01537p9057q2993K54151J25326m7914k33507
24020a35524l6417k3504Q2681r5720n8503J04649K04757M23032j35641k26524
$$ plain form
24096 -60250 170587 169499 102245 125702 85347 -134949 -165901 -34067 27537 114473 46985
24085 46985 -19481 229639 192722 36001 313731 356022 304230 79208 -63269 187508
24075 187508 226289 435465 435063 322713 410724 142734 52939 160912 103415 -57173 -80624
24064 -80624 86217 131564 21152 -56085 50581 50154 124779 -106694 -284647 -184268 -168361
24053 -168361 -221729 -143897 30460 93254 -114979 -358658 -319791 -268876 -122606 -199241 -419292
24042 -419292 -406303 -191199 -69287 123919 122667 184141 280864 187543 124094 -94616 -59164
24031 -59164 -31616 98590 159632 30007 -71530 -150587 -233580 20571 145897 97983 -135524
24020 -135524 -171941 -195445 -112764 -208484 -266987 -162338 42419 465451 329810 103286
24010A03286j8496J88991P0219M1976j73140r9434p3454p4997J56370J53415n3182
23999B21554n4517j43816q8059o2712l7909J62939J78505O9858K22214j38921
23989C29136l51998k4675J69851J11882j21893q4559j34086l2064o2966P1582
23979a29790Q3946K868o9604M1474O0533q0101j5861P9569L7267p9772J22537
23968E3066J25660K9383j40485p4872L1201o500k6594J77165j49014j08215K09231
23957A20026J23692j41776j76577l2825m8015k0699K90718N7173J72028n3688
23947B90057j3851L1319q3735j38363k13778j30230K4837K24756Q0345R0894M4988
23936B07239k81948k09441J34549K87654K10741p0898k00477j60083N6963J18872
$$ plain form
24010 103286 84790 273781 344000 385976 212836 113402 39948 -35049 121321 274736 221554
23999 221554 167037 23221 -64838 -127550 -165459 -2520 175985 245843 468057 329136
23989 329136 -22862 -47537 122314 234196 112303 27744 -106342 -138406 -201372 -129790
23979 -129790 -45844 -42976 -112580 -71106 -10573 -90674 -106535 -26966 10301 -69471 53066
23968 53066 178726 208109 67624 -7248 23953 17453 -9141 168024 19010 -89205 120026
23957 120026 243718 101942 -74635 -107460 -155475 -176174 114544 171717 343745 290057
23947 290057 276206 307525 223790 85427 -128351 -258581 -233744 -8988 71357 162251 207239
23936 207239 -74709 -284150 -149601 138053 348794 277896 77419 -82664 -25701 93171
23926I3171N7945J45803o3306k01676j60054K5356P6402j07396K62120R6451j38900
23915H5916k39266o8124N0739J01044Q2769L5938k2426K16351J09087j31665J51722
23904C72085l3790j78040J98447p2213j58427j28533L7781L0164L1835k08182
23894a08873r7679j749J14766L32810J8039k3448r6495n6937p3909k176j05072
23883a00723J63899Q6473J43249k8073O8428J71983n4392k43015j60249j63386
23873a15806k43249J81460K37230K48025Q8601k49632j49622J54540O9737K5302
23863B46586l096j22250K0311j51297p0336K105O5606R6213l28272q9176Q2189
23852b51417M043M4672O0488Q7040J12994j06804q7180k9405N4371j0417j34100
$$ plain form
23926 93171 151116 296919 233613 31937 -128117 -102761 -26359 -133755 128365 224816 85916
23915 85916 -153350 -221474 -170735 -69691 13078 49016 26590 242941 352028 220363 372085
23904 372085 338295 160255 358702 286489 128062 -471 37310 67474 99309 -108873
23894 -108873 -206552 -208301 -93535 239275 257314 233866 137371 80434 6525 4349 -100723
23883 -100723 63176 149649 292898 264825 333253 505236 450844 207829 47580 -115806
23873 -115806 -359055 -177595 59635 307660 396261 146629 -2993 151547 221284 246586
23863 246586 243490 121240 141551 -9746 -80082 -77977 -12371 83842 -244430 -333606 -251417
23852 -251417 -247374 -202702 -142214 -55174 57820 -48984 -136164 -165569 -111198 -121615 -255715
23841b55715k4323J01641Q8059M3659j24481J12483l6607k9558K11294J83502
23831B69954P3035j85846k27994q1737m2691n902k14151j20909J15348L97142
23821b3751K22720p2475p2651J26263O2393j08731P7109r0008l6744j21284p9968
23810a17127n4704l5018J39760L7834k031n3247l0126j1450l507j85422J79820
23799a35218n3675k46710J4971J46445j98740m1300L69693L9520J03624L2392
23789C1002J28698n5531j43458k16825N2142J40562P9901J01433J08219l4220
23779A91923n9842m1262k50089L213K45161l1454m7108N5778J66436j9877k95022
23768h2143k07851J33643K80633O8637j26584O2145M3382o1598j44767m88K5471
$$ plain form
23841 -255715 -280038 -178397 -90338 -46679 -171160 -58677 -95284 -124842 86452 269954
23831 269954 342989 157143 -70851 -152588 -195279 -201181 -415332 -536241 -420893 -23751
23821 -23751 198969 126494 53843 180106 242499 133768 210877 120869 84125 -37159 -117127
23810 -117127 -171831 -206849 -67089 -29255 -31286 -84533 -114659 -126109 -129616 -315038 -135218
23799 -135218 -188893 -435603 -420632 -274187 -472927 -514227 -144534 -105014 -1390 31002
23789 31002 159700 104169 -39289 -256114 -203972 -63410 16491 117924 226143 191923
23779 191923 132081 90819 -159270 -156057 89104 57650 10542 66320 232756 212879 -82143
23768 -82143 -289994 -156351 124282 192919 66335 128480 171862 110264 -34503 -34991 -9520
23757i520J07157O1737j65229J77836J44390M385j80742j38812p2391O3220j7098
23746b5067L7978J79057J78748n5859o7521k10571m3979n9818o5461o7148N0478
23735a49163J12925J40139k15686j52168R9148J03105k6511o7207k60176j29882
23725e45476J88194L04040R3446j70833k15730J73441J75840J01148r9594k82422
23715b77946j73032K61393K83945P6020J0245j3235L0733j36778k57118L9998
23705a55775L36214l6254k68553q8L6014n2130Q0564J75311J21903j34406n9978
23694D2822J45435j6292j05546k94680M8448L09172N7415K611j84926q8945J9924
23683f4562o9790r4679K01228O4550j37803j37774r7370K03963J25641j9156J68182
$$ plain form
23757 -9520 97637 159374 -5855 171981 316371 320756 140014 1202 -71189 -7969 -25067
23746 -25067 12911 191968 370716 314857 247336 36765 -7214 -67032 -132493 -199641 -149163
23735 -149163 -36238 103901 -111785 -263953 -164805 -61700 -88211 -155418 -415594 -545476
23725 -545476 -357282 -53242 40204 -130629 -346359 -172918 2922 104070 4476 -277946
23715 -277946 -450978 -189585 94360 170380 180625 167390 198123 61345 -195773 -155775
23705 -155775 180439 144185 -124368 -124456 -88442 -140572 -60008 115303 237206 102800 42822
23694 42822 188257 171965 66419 -228261 -179813 129359 186774 189385 4459 -84486 -64562
23683 -64562 -134352 -229031 -27803 36747 -101056 -238830 -336200 -132237 -6596 -25752 142430
23672A42430K7993J9613j09239j22534J37663n1296r0475n009L379M0981J9041
23661A2547P1597j63525P0577J35838p1648k07560J16699J70941J25291J40978
23651D01735k7388k94465r4872j2371L3206K6852J9176m8424j72619K0367L43319
23640A94516K83339L7729k41482j69202q1980O1812O9535K4804M3591l14895l9699
23629a31932r1110R4278J9374J5447J92694M0395j62103j65339m5968J08880J30200
23618D816n744J84918K18218j38252k99600j52570r6014r0380J73966K60273K15423
23607B75054n0784j29315o428m3663J50864n5611J32644J66287J52341j11831
23597D79558k85446l04664j13023J72633K53302l3815K1067K6449k05221q6990
$$ plain form
23672 142430 170423 190036 80797 -41737 95926 44630 -45845 -50854 -47475 -6494 12547
23661 12547 84144 -79381 -8804 127034 55386 -152174 -35475 135466 260757 401735
23651 401735 374347 79882 -14990 -27361 5845 32697 51873 3449 -169170 -148803 194516
23640 194516 477855 515584 274102 104900 22920 84732 154267 179071 222662 -92233 -131932
23629 -131932 -223042 -128764 -109390 -93943 98751 139146 -22957 -188296 -234264 -125384 4816
23618 4816 -928 183990 402208 263956 -35644 -188214 -284228 -374608 -200642 59631 275054
23607 275054 224270 94955 88527 44864 195728 140117 272761 439048 591389 479558
23597 479558 194112 -110552 -223575 -50942 202360 168545 189612 216061 10840 -76150
23587g6150o1715P4424J8020o5667K253O61K99663P7349L3479O245j56626P6106
23575B28042J34279K9736j79569j2587j08820j39796p6914R5873Q2812o2785q4013
23564i3742l8616m2358o3074J26810m7644j78884P0861J2388J9597n7353P4148
23553b17867m2233o7869J03309J90597l5523m2429r429O037M467J53989j33479
23542i0430j86895l1450J68809o5617O3345L01814R520j52314J319O1221K7700
23531A07022m2379K2305j22324m2478K00387j26187k976K5287R7646R2706k9282
23520A79727n4640M3422M4981O6600j00859r6692q7273J09189j60625k47744o1283
23509c65197o65J95217J24594r4485N6076j46674r8664N5970m0921J7038N5921
$$ plain form
23587 -76150 -137865 -63441 -45421 -111088 -108835 -108174 191489 268838 302317 308562 151936 228042
23575 228042 362321 392057 212488 199901 91081 -48715 -125629 -29756 53056 -9729 -93742
23564 -93742 -132358 -174716 -237790 -110980 -158624 -337508 -266647 -254259 -234662 -292015 -217867
23553 -217867 -260100 -327969 -224660 -34063 -69586 -112015 -121444 -115407 -110940 43049 -90430
23542 -90430 -277325 -308775 -139966 -205583 -142238 159576 169096 16782 18101 79322 107022
23531 107022 64643 86948 -35376 -77854 122533 -3654 -6630 18657 116303 209009 179727
23520 179727 125087 168509 213490 280090 179231 82539 -4734 104455 -56170 -303914 -365197
23509 -365197 -365862 -170645 -46051 -140536 -84460 -231134 -329798 -273828 -314749 -297711 -241790
23498b41790O6848j62392P2881K04121J90168k00105l412Q3145q314n03786j8684
23487e21320K9012M973J53188K03119j59408o0675k01p5507M772R5694J47330
23476a79023J24738J13536m7090R8625Q4742p8384j33053k07710j36406m6048
23466d06073o5444p3966m2123K42395k3545q6551J74368P2279Q3786J19980J747
23455c147k8598K3846m6645o8566O1715j683p1817N4774j50240K14548K04076
23444A88263J08944L1645l05810j88031k62931M2321J97650m152R6016R1127j27115
23433a32073K9116L263J01693j16868m4449K07861K010l82216J8362P0563J09381
23422a33357M1315J0470j10868N4121K30922l2044J25366j9890K2000l503j6442
$$ plain form
23498 -241790 -174942 -337334 -264453 -60332 129836 -70269 -73681 9464 1150 -502636 -521320
23487 -521320 -492308 -487335 -334147 -131028 -290436 -351111 -351312 -426819 -422047 -326353 -179023
23476 -179023 -54285 59251 12161 110786 195528 117144 -15909 -223619 -360025 -406073
23466 -406073 -471517 -545483 -587606 -345211 -368756 -455307 -280939 -208660 -124874 -4894 -3147
23455 -3147 -31745 -7899 -54544 -123110 -61395 -63078 -134895 -80121 -230361 -15813 188263
23444 188263 297207 328852 23042 -164989 -427920 -385599 -187949 -192101 -96085 -4958 -132073
23433 -132073 -102957 -99694 1999 -114869 -159318 48543 50553 -331663 -313301 -242738 -133357
23422 -133357 -92042 -81572 -192440 -138319 92603 60559 185925 166035 188035 184532 168090
23411A68090l9010j61820q6528P2082j80427K317j18337J71285K04814j90040
23401a57574L5076L50541n7907l06740j54446P3100J96919K93130L4908k24376
23391H2631l8737j41584j01106J32878M0507K9781M311j08779j03181l4612n9475
23380b97366L8356J64557N6803J49750Q3113o9955k6031j92233k40861R5485R6793
23369a41589M9889L36598R7361N4734J7883j76866l64727O1557N4799k08288r789
23358b28438J54547J40736q3248J10598K75222R853k94170j539N5916j99462m9263
23347a09248Q4280Q8808o3527L8170J14528Q4685j21241k08092m859O7329j77161
23336b06328j3641J33149k1210j31434j53150J33953L56925J07133n7993q0543
$$ plain form
23411 168090 129080 -32740 -119268 -47186 -227613 -225296 -343633 -172348 32466 -157574
23401 -157574 -122498 228043 170136 -136604 -291050 -217950 -21031 272099 307007 82631
23391 82631 43894 -97690 -198796 -65918 -25411 4370 8681 -100098 -203279 -237891 -297366
23380 -297366 -259010 -94453 -37650 112100 195213 125258 99227 -93006 -333867 -238382 -141589
23369 -141589 -91700 244898 342259 396993 414876 238010 -126717 -65160 -10361 -218649 -228438
23358 -228438 -73891 66845 -16403 94195 369417 379270 85100 83561 139477 -59985 -109248
23347 -109248 -24968 63840 313 38483 153011 237696 116455 -91637 -96496 -29167 -206328
23336 -206328 -219969 -86820 -108030 -239464 -392614 -258661 98264 205397 147404 66861
23326F6861M160J62117J39887n1288j72959j24166M9018K66408n6644j57495o7915
23315E7984R4820J57795J59794m1896J0809n8685m7515l43568j48203K43367M1166
23304A25868q4136l0646J4889j20106j59909J2913L0903J54398J8839n0143m7767
23293a34897k659L2198M1835j08800k14027j01677J62236K66569n9855L0721J10161
23282B1805P1476k5888q1754j64323J66770J69806J22435o2940q6056k74545q0488
23271b23702M2428J88595k2570j66067J48487R8181p2543r1873j85825q5180j09608
23260d79677J7633R9882J23894J02003M6302m0203j1221J7389j74733k08195k08859
23249g15785M5355J76919J74383J11257M8409n5254J04101J4249J10179J36045
$$ plain form
23326 66861 71021 233138 373025 321737 148778 24612 73630 340038 283394 125899 57984
23315 57984 152804 310599 470393 428497 439306 380621 333106 -10462 -158665 84702 125868
23304 125868 41732 11086 25975 -94131 -254040 -241127 -210224 -55826 -36987 -87130 -134897
23293 -134897 -137556 -105358 -63523 -172323 -386350 -488027 -325791 -59222 -119077 -88356 21805
23282 21805 93281 67393 -14361 -178684 -11914 157892 280327 217387 131331 -143214 -223702
23271 -223702 -181274 7321 -15249 -181316 -32829 65352 -7191 -99064 -284889 -370069 -479677
23260 -479677 -462044 -362162 -238268 -136265 -89963 -130166 -141387 -123998 -298731 -506926 -715785
23249 -715785 -670430 -493511 -319128 -207871 -159462 -214716 -110615 -96366 13813 149858
23239A49858L16P5764L1805R4134Q9664P2531j7707k09897p8069j790j41556j47775
23227h2722J39797K53184l608k07588j51506j25200P0924J68119Q8839j25958
23217B4281j14183P7279n9832j30285j0510L861l4774r1605J9834L6124N3367
23206b26443J09277j15286k5332l2710J82585J49916n2895K6000r9009q6511Q2178
23195h8230J23531J89455j03523M8890N9874k5622K8421k14953k17020p3466K9275
23184b43368N9037l3796n122K30359K39491p925j21421j95434m9183N7951K65691
23173A96280L7289k11047J15861J36946j29035o2544k5164j26844j88049M5228
23163b11079J03161J08624J41289k00268j19045J95461Q7592k48021j32676Q3096
$$ plain form
23239 149858 150174 225938 257743 351877 441541 514072 496365 286468 208399 206609 65053 -82722
23227 -82722 57075 310259 306651 99063 -52443 -177643 -106719 61400 150239 24281
23217 24281 -89902 -12623 -72455 -202740 -213250 -209389 -244163 -335768 -315934 -279810 -226443
23206 -226443 -117166 -232452 -257784 -290494 -107909 42007 -10888 15112 -83897 -170408 -88230
23195 -88230 35301 224756 121233 170123 229997 204375 232796 17843 -199177 -272643 -243368
23184 -243368 -184331 -218127 -223249 7110 246601 238676 117255 -78179 -127362 -69411 196280
23173 196280 233569 22522 138383 275329 146294 83750 58586 -68258 -256307 -211079
23163 -211079 -107918 706 141995 -58273 -177318 18143 105735 -142286 -274962 -191866
23153a91866n77j04573n6882Q2850J84108R5131j79380j2615J9068J27158j24602
23142a62180J298P0702K85535J8494M8301k23169m5262J8277R4273L2827K1370
23131A60466m7132n2551j78670j23159J08815K13213n2950n2518j14073P7232
23121f1327j0840J02297J19232r8634l0339k3222k2171L8390m4887P944J34726
23110A11169J17466J78284J55002k23345k55292j07461j403J82172P7724j54306
23100H0010n2806J5861j01384K6846n6664L2017J67303K002o1129j24014J45448
23089G3490j0997j2081j84850k3891p5821Q559N8842o4550K55163L036l913q6705
23077f3718j19104n211L10784K4137j27466j2121k71012R9499M7410l6579o123
$$ plain form
23153 -191866 -192443 -297016 -353898 -271048 -86940 8191 -171189 -183804 -164736 -37578 -162180
23142 -162180 -160882 -90180 195355 213849 262150 38981 -6281 11996 106269 139096 160466
23131 160466 113334 60783 -117887 -241046 -132231 80982 28032 -24486 -138559 -61327
23121 -61327 -72167 30130 149362 50728 20389 -2833 -25004 13386 -31501 -23557 111169
23110 111169 228635 406919 561921 338576 83284 -24177 -25580 156592 234316 80010
23100 80010 27204 43065 -58319 -31473 -88137 -56120 111183 113185 52056 -71958 73490
23089 73490 62493 50412 -134438 -158329 -234150 -225591 -166749 -231299 23864 26900 22987 -63718
23077 -63718 -182822 -188033 122751 146888 19422 7301 -263711 -164212 -116802 -153381 -159504
23066a59504K4635K04691p655R6125J27598j18654j86882n3264L6465P0520M6822
23055H0897j32183P45m2375q3822J15477j50205n1887j9395P322K22125J47332
23044I4031j74070j51825n25j61275P458J94599K76915J04536j9449p8015J15403
23033B07783M7504j2152Q512j88334O575K66871J54247j07366o8727q168m1264
23022B65481j31023K5345j5627j72748n659Q0760m0370j60560J4227J19029J54786
23011A33641j80794j02824Q2764n9686K9890P8179J52886k537j31077J63049J32097
23000B95588j7917l1276j07785k437j28534K19L9074p9747P2335M2381n6737l4669
22988i505m6472J12430K15237J159j42405k06589k21037P7765J36431k5449j21328
$$ plain form
23066 -159504 -134869 69822 62167 158292 285890 167236 -19646 -72910 -36445 34075 80897
23055 80897 -51286 -50541 -92916 -176738 -61261 -211466 -263353 -282748 -275426 -53301 94031
23044 94031 -80039 -231864 -232389 -393664 -386206 -191607 85308 189844 170395 92380 207783
23033 207783 255287 243135 251647 63313 69888 336759 491006 383640 314913 306745 265481
23022 265481 134458 159803 144176 -28572 -34231 46529 6159 -154401 -140174 -21145 133641
23011 133641 -47153 -149977 -67213 -126899 -97009 -18830 134056 131519 442 163491 295588
23000 295588 277671 246395 138610 136173 7639 7858 46932 -32815 39520 81901 25164 -9505
22988 -9505 -55977 56453 271690 272849 130444 -76145 -297182 -219417 -82986 -108435 -229763
22977b29763Q3851L26531J42517m4906j3325q3427k79785J1078K24675k1392j62927
22966d6873P602j95950J04641R2047r5550j49173q9488K0034Q1015L03884K2144
22955E4333l35354l9825Q4373l9010K34529P2381Q1389J68043J21967j41622j80937
22944H0267m1811m194m2176q0356j41801J76930N2234O6952J16604J34447L5440
22933C52536k13076r9797j03068k99921o714J34990k31164r1020J25847J35368
22923b96019J30694j827j21353j06480K56338J30724R0134m2051j6027q304j2968
22912B861j63673M3920k5296o4516k0021J87160N8607l906K17363N9443j48016
22901A43926j28460j44080p3457M7067J56726j8101M7267P2951J07661o6122j23057
$$ plain form
22977 -229763 -145912 180619 323136 278230 264905 181478 -98307 -87229 137446 116054 -46873
22966 -46873 -39271 -235221 -130580 -38533 -134083 -283256 -372744 -352710 -271695 32189 54333
22955 54333 -281021 -320846 -236473 -275483 -40954 31427 112816 280859 402826 261204 80267
22944 80267 38456 34262 -7914 -88270 -230071 -53141 -907 66045 182649 317096 352536
22933 352536 139460 39663 -63405 -363326 -370040 -235050 -466214 -557234 -431387 -296019
22923 -296019 -165325 -167152 -288505 -394985 -138647 -7923 82211 40160 24133 15829 2861
22912 2861 -160812 -116892 -142188 -206704 -226725 -39565 19042 15136 232499 291942 143926
22901 143926 15466 -128614 -202071 -155004 1722 -16379 30888 103839 211500 145378 22321
22890B2321k4937k17042K9880J30798K4927J12504j49385p1570p7447j84694l0870
22879d35515Q8498R5919Q4430j12241n0473n6368K49785J96043p7889R5897J34996
22868B13082j4270q6221J77499N0999k14566r6966q5073P5601p4830j95650Q281
22857b42114Q1150K1364L921k02614P8298J82564Q3079P2442k2704k5752l8847
22846i213J90876J68806K9467k68396k75091J27073N2478J25363Q1764M8411k05585
22835F5953j02507J25980J12995j55525m9569o4636N2602J23152K29571k46532
22825I1484l56781J1955J21708N5661K01239l3947k28227o6651K2310K52389M7021
22814A18161r2912J99907J90467k13843j40454J08368j90896k38237r913j81387
$$ plain form
22890 22321 -2616 -219658 -189778 -58980 -34053 78451 -70934 -142504 -219951 -404645 -435515
22879 -435515 -347017 -251098 -166668 -278909 -329382 -385750 -135965 60078 -17811 78086 213082
22868 213082 198812 112591 290090 341089 126523 29557 -55516 20085 -54745 -250395 -242114
22857 -242114 -160964 -139600 -135679 -338293 -259995 -77431 5648 78090 55386 29634 -9213
22846 -9213 181663 350469 379936 111540 -163551 -36478 16000 141363 223127 271538 65953
22835 65953 -36554 89426 202421 46896 -2673 -67309 -14707 108445 338016 91484
22825 91484 -265297 -253342 -131634 -75973 125266 91319 -136908 -203559 -181249 71140 118161
22814 118161 25249 225156 415623 201780 61326 169694 -21202 -259439 -269352 -450739
22804d50739Q4255K80476K02069j70455k0416K3774J08253n9908l2316R471J72455
22793A46919j8707j49237j16500J1157O6214L2316q319j5687j23488O8653P9190
22782b7489Q104k17348P5484J63756p0800j23327p618Q1169J100J10027r295R3195
22770G6958Q8543j61062k42705o6382J26012o6850N7592J65749m1036j44807l1016
22759b39004J94288N9735K2801N7142J96889j76971j23211R2083j61627j30777
22749b08652M0017k71186l8330J52596L6985K79830O2475k01156q5697J46193
22739h6925l3565J93784k8509m3201j3593K0606M3516m9533j83174L8760J64666
22728B2832m4033j30758Q9639K35220j23683k05937L3011j6909K49101K96836
$$ plain form
22804 -450739 -366484 -86008 116061 -54394 -74810 -51036 57217 -2691 -35007 -25536 146919
22793 146919 128212 -21025 -137525 -126368 -60154 -27838 -36157 -51844 -175332 -106679 -27489
22782 -27489 -19385 -236733 -161249 2507 -68293 -191620 -199238 -118069 -116969 -6942 -16237 76958
22770 76958 165501 4439 -238266 -304648 -178636 -245486 -187894 -22145 -63181 -207988 -239004
22759 -239004 -44716 15019 37820 94962 291851 114880 -8331 83752 -77875 -208652
22749 -208652 -168635 -439821 -478151 -325555 -288570 -8740 53735 -147421 -233118 -86925
22739 -86925 -120490 73294 44785 1584 -12009 8597 52113 2580 -180594 -141834 22832
22728 22832 -21201 -151959 -62320 172900 49217 -156720 -123709 -140618 108483 405319
22718D05319j49773R7061j64448j16325o5645k4370j4851M8633k8882k00527k71830
22707d85638P6284O5153J4032Q0892P8638j7512N8623J00178L6388J5175m1143
22696a8930J46829P0991j83658k3395N174j22792J11450O402M2657K17710K15023
22685D67461j05153l72237j90406M3965J30471R0715l1235k22741m9069o3309
22675c01538n500O3650J1956J13553j1319R561L990K71776K7437j66906j16564
22664i9904K97486R2650j86039r4830j19804K72383R142o6943j08480n6365J58291
22653I7587K69404o5253n6444n2095j47081k26890O7495l0581J2485M2002j22078
22642b11449J13365J34112Q8661j33778j40093K8434Q7022L4306O3116R9594n4986
$$ plain form
22718 405319 255546 352607 188159 71834 6189 -18181 -33032 15601 -13281 -213808 -485638
22707 -485638 -409354 -344201 -330169 -249277 -170639 -188151 -129528 -29350 7038 22213 -18930
22696 -18930 127899 198890 15232 -8163 -2989 -125781 -14331 -7929 34728 252438 467461
22685 467461 362308 -9929 -200335 -156370 -25899 64816 33581 -189160 -238229 -301538
22675 -301538 -307038 -243388 -231432 -117879 -129198 -119637 -115647 156129 183566 16660 -99904
22664 -99904 197582 290232 104193 9363 -110441 161942 171084 104141 -4339 -60704 97587
22653 97587 366991 301738 245294 193199 46118 -180772 -113277 -143858 -131373 -89371 -211449
22642 -211449 -98084 36028 124689 -9089 -149182 -120748 -33726 580 63696 163290 108304
22631A08304k6805O0500O2920N7955k9241o8452Q4046O0028n7637j97146p5741
22620b1269O893q9602J552J80261M6819N2411J89202M1322j98172j34526k0218
22609E4673l6151J557M8622L7056l4749k39016M7593J67493k9231l8087Q0233
22598E9993k32587O610o2139J8432J2523R6084N9058j14548j8105J53409P670
22587a3600p507k3277P6714M6672Q9202j74030j59690j8842q250O5646K10851
22576H3889J20879j40351q9787N1281L8009N5574O9410q0561k7290r9599k73056
22565b91602N7755K72357o0925J49548m6766j08712k2411J78713r0814J9933r2630
22554c5554k25463p2490J49465J78342J68068l7242j49525L5420j8674p8967k24453
$$ plain form
22631 108304 81499 141999 204919 262874 233633 165181 249227 309255 251618 54472 -21269
22620 -21269 -14376 -103978 -102426 77835 124654 177065 366267 407589 209417 74891 54673
22609 54673 18522 20079 68701 105757 71008 -168008 -120415 47078 17847 -20240 59993
22598 59993 -172594 -165984 -228123 -209691 -197168 -101084 -42026 -156574 -174679 -21270 -13600
22587 -13600 -21107 -44384 32330 79002 168204 -5826 -165516 -184358 -192608 -126962 83889
22576 83889 204768 64417 -25370 25911 63920 119494 188904 108343 81053 -18546 -291602
22565 -291602 -233847 38510 -22415 127133 80367 -28345 -50756 127957 37143 57076 -35554
22554 -35554 -261017 -333507 -184042 -5700 162368 125126 -24399 11021 -7653 -86620 -311073
22543c11073P6433J92522Q0570K11746J16268k15443m9620j04832p1885l3664
22533a08978P2519J07804N4463j17779O1631l5042j7888J5596k16168k66173r8159
22522e48174N4147L70137K37232J12866n1085n7929R6702q9388J9145r0178m6393
22511G082j25127j54774K8126L09320J17062K8735j49874j29278m1995p3579q4783
22500b69085m2447n4004N8926Q6523J0312J03054j67755j52294J00632R6371r3977
22489c23744k28703J93736j020l676J38081K757J54k6654J70440K16097J37912
22478B75380o5796j53684j90898K5146j71235q7918J25584M9975P5706J40912
22468B3172j69019r9563J7375J27841J13052J3305j7956N5652K18277j5345r9750
$$ plain form
22543 -311073 -234640 -42118 38452 250198 366466 151023 101403 -3429 -75314 -108978
22533 -108978 -36459 71345 125808 8029 69660 34618 16730 32326 -183842 -450015 -548174
22522 -548174 -494027 -123890 113342 226208 175123 117194 213896 124508 143653 53475 7082
22511 7082 -118045 -272819 -244693 64627 181689 210424 60550 -68728 -110723 -184302 -269085
22500 -269085 -311532 -365536 -306610 -220087 -209775 -106721 -274476 -426770 -326138 -229767 -323744
22489 -323744 -552447 -358711 -359731 -363407 -225326 -222569 -222415 -249069 -78629 137468 275380
22478 275380 209584 55900 -134998 -109852 -281087 -369005 -243421 -193446 -117740 23172
22468 23172 -145847 -245410 -228035 -100194 12858 26163 8207 63859 282136 266791 167041
22457A67041q1483L0146l06534j81186J63021l011l05915L8828J30139R9814O3925
22446a85215k1630R0684R5401J01986N7634k50186k22124r578O8885K07806P5847
22435I510j07466J7301J5318q2577P5327m7487q8191j27119M5009K7910J03029
22424a59436O8562L4325J0947k8615K5087q7356j77157J6321j19050L4366J7843
22413c64163p470J64254j68401p0242J24290L9216P2743O6199j14021J32984p5097
22402a99708r0123P2566J68811K56501M8843j73233o0881M4097o7369j07201o0520
22391a68217l6818Q5661O9612j78422k99O2449K77417O4197q8295j06992R8118
22380G8411P2439M4843P6061j62326j28522R4444J6033K770k60526j93347Q3988
$$ plain form
22457 167041 85558 115704 -190830 -372016 -208995 -212006 -517921 -479093 -348954 -249140 -185215
22446 -185215 -206845 -116161 -20760 81226 138860 -111326 -333450 -343028 -274143 -66337 9510
22435 9510 -97956 -80655 -65337 -147914 -72587 -120074 -208265 -335384 -290375 -262465 -159436
22424 -159436 -90874 -56549 -45602 -74217 -49130 -136486 -313643 -297322 -416372 -382006 -364163
22413 -364163 -371633 -207379 -375780 -446022 -321732 -282516 -209773 -143574 -257595 -124611 -199708
22402 -199708 -289831 -217265 -48454 208047 256890 83657 22776 66873 -496 -107697 -168217
22391 -168217 -205035 -119374 -49762 -228184 -228483 -166034 111383 175580 87285 -19707 78411
22380 78411 150850 195693 271754 109428 -19094 75350 91383 94153 -166373 -359720 -275732
22369b75732N6610N5996m334j18836R1442K26301q1158k42102j7090J06528k7428
22358b29803J30894N143j17019j21795J06841o0969J12583O1137N1101m0848j2213
22347a14948J59890J39811j3513o7804r3540O8229K35102J06006r2734o2933j02080
22336A61486l24268J01580O8476J62728l6607N9444k49106j63033K43595O7240
22326I1535k3508j64682l2798R8225j29611N0629O8281j35411L7760J89404j17072
22315f7248r8359j7428K1222r5034O9694J54507O4676l6628l035n7616j37321
22304b02570J71884Q5863M0511L653j07645L0719J633K73m8741l9305M9271l1021
22292d5475k27409j24229K82050K16174q096J01232J4910J21141N3553j36764
$$ plain form
22369 -275732 -219122 -163126 -167460 -286296 -194854 31447 -49711 -291813 -308903 -202375 -229803
22358 -229803 -98909 -93766 -210785 -332580 -225739 -286708 -174125 -112988 -61887 -102735 -114948
22347 -114948 44942 184753 171240 103436 9896 78125 313227 419233 326499 263566 161486
22336 161486 -162782 -61202 7274 170002 133395 192839 -56267 -219300 24295 91535
22326 91535 68027 -96655 -129453 -31228 -160839 -110210 -41929 -177340 -139580 49824 -67248
22315 -67248 -165607 -183035 -161813 -256847 -187153 -32646 32030 -4598 -7633 -65249 -202570
22304 -202570 -30686 55177 95688 99341 -8304 22415 24048 24321 -24420 -63725 -14454 -45475
22292 -45475 -272884 -397113 -115063 101111 93015 194247 209157 330298 383851 247087
22282B47087Q8421J15749l28488j22765J01958L3557j94457j5586J90595J9610
22272A35681n7636p307J3281J68641J9571j14322n6047J54847j59187k25080N6497
22261g1061K36898k25872Q5090K21295k07006k37431J4989L5683l6292n2771J75015
22250f1463N9709m6619N1124k6624j0353R7034j94989j33857j592l6935K08399
22239i6166J52247j90259r736J35056P5805o8767m4621O325J04201j5413k27309
22228a78637P2776J87341j85742J85161o3756m789m5823m5876L2278k03639l1727
22217b82433J79979O8709J05298q274n9360k20832j21691J78259J33748J73980
22207A47383k36080j28295R8345j10031l6020K13271K01485L7512l9728j55602
$$ plain form
22282 247087 335508 451257 122769 4 101962 135519 -58938 -74524 116071 135681
22272 135681 78045 70738 84019 252660 272231 157909 101862 256709 97522 -127558 -71061
22261 -71061 165837 -60035 25055 246350 39344 -198087 -183098 -147415 -183707 -236478 -61463
22250 -61463 -1754 -48373 2751 -23873 -34226 62808 -132181 -266038 -267630 -304565 -96166
22239 -96166 56081 -134178 -143914 -8858 66947 -1820 -46441 -40116 64085 48672 -178637
22228 -178637 -105861 81480 -104262 80899 17143 12354 -33469 -79345 -47067 -250706 -282433
22217 -282433 -102454 -33745 71553 63279 3919 -216913 -338604 -160345 -26597 147383
22207 147383 -88697 -216992 -118647 -228678 -264698 -51427 150058 187570 147842 -7760
22197g760j86124K6803l1540J95061Q7116Q5755R7391j11931j31609O73j72056
22186a48221K57840J81096m2865j28716m1192J40748m5834l2907P1574r9550k34229
22175a22256j07423J76630j03391o8045q1539R2166j7365Q4027P3414j7661K04165
22164A12722J96671j9378j77126L4778J95383k606j30129j53446j84194n8573
22154a85898l8859j25058J20221l2552o179n661K15646M6793q5507K5075J9639
22143e2340j57496K33625K25312J18487r7813k3361m9429n3658p6346M2958r4329
22132A5610j4319n0676j28840j06686N8195K07019J5310K3731L1936M4916P541
22121A03737j45349J26343r8601J9290O6148j03196k232K3510J05890j47135l8296
$$ plain form
22197 -7760 -193884 -167081 -198621 -3560 83556 169311 266702 154771 23162 23835 -148221
22186 -148221 109619 290715 247850 119134 77942 218690 172856 139949 211523 111973 -122256
22175 -122256 -229679 -53049 -156440 -224485 -306024 -213858 -231223 -147196 -73782 -91443 112722
22164 112722 309393 290015 112889 147667 343050 340444 210315 56869 -127325 -185898
22154 -185898 -224757 -349815 -229594 -262146 -268325 -273986 -58340 -11547 -97054 -71979 -52340
22143 -52340 -209836 23789 249101 367588 269775 246414 196985 143327 66981 109939 15610
22132 15610 1291 -49385 -178225 -284911 -226716 -19697 -4387 19344 51280 96196 103737
22121 103737 -41612 84731 -13870 5420 71568 -31628 -33860 -10350 95540 -51595 -89891
22110h9891J42215j8429l3733K2418p6577j34512k00996L4143O9774M282P0334
22099b10972J81741J17085j30148j03027j50792m0453K10081O7428j28287m7550
22089b34894J57266J77743m2938M553K84716L4053j93572M7521q5991k19647L7137
22078c4053J07748l746k03838j45509n0871Q5314j7211j83808j21077K23430J95724
22067a47897J7885N5643K05206n0862j71714k46493Q6069K08683J23960J43481
22057B23961j15140p1585O0041Q6606P8068j54348l6315M0611p2658K3079l9315
22046B3005j5580K9415j28431L7191n5137q2553J02084J48044M8004J09000M42
22035B15484j14521k2283K2916p7311o4788o6597o280J67516p9902m832R9799
$$ plain form
22110 -89891 52324 33895 162 22580 -53997 -188509 -389505 -355362 -285588 -281306 -210972
22099 -210972 -29231 87854 -42294 -145321 -296113 -336566 -126485 -59057 -187344 -234894
22089 -234894 -77628 100115 57177 61730 346446 380499 186927 234448 148457 -71190 -34053
22078 -34053 73695 69949 -133889 -279398 -330269 -244955 -262166 -445974 -567051 -343621 -147897
22067 -147897 -130012 -74369 130837 79975 -91739 -338232 -252163 -43480 80480 223961
22057 223961 108821 37236 97277 183883 261951 107603 71288 111899 39241 62320 23005
22046 23005 7425 36840 -91591 -54400 -109537 -192090 -90006 58038 106042 215042 215484
22035 215484 100963 78680 101596 24285 -40503 -107100 -113380 54136 -25766 -30598 69201
22024F9201k4462J8378O1832J7592J10971P1218k37448k50423J7778R874K09681
22013G4192K08944n6677K5085k86221j42395K13538J35357k22764j8303p412J20879
22002D4223q6453M7329P2177N2324q4935K17450J29433j93904j18738l6774P8146
21991A20278O6006j30401j74420L1646K46365K9041j71439K1933N1502j68443
21981g7932j06130J88432J09053M6321k7159j09882J6537j9283o7084L7497R7250
21970H7620J87816J0892q9979M2797m6366r2386j73100L6993M0589O4529m6534
21959B2871r8416K4446J04206k6315j86669o7999q0343K048K00520J4779r5000
21948a85872K10400j17897j81174k47458J35864M02097K02635k9464m581K0618
$$ plain form
22024 69201 44739 63117 124949 142541 253512 324730 87282 -163141 -145363 -135489 74192
22013 74192 283136 226459 251544 -34677 -177072 36466 171823 -50941 -69244 -76656 44223
22002 44223 -42230 5099 77276 129600 44665 262115 391548 197644 78906 42132 120278
21991 120278 186284 55883 -118537 -86891 159474 188515 17076 39009 90511 -77932
21981 -77932 -184062 4370 113423 159744 132585 22703 39240 19957 -47127 -9630 87620
21970 87620 275436 286328 196349 239146 192780 100394 -72706 -35713 4876 69405 22871
21959 22871 -75545 -51099 53107 26792 -159877 -227876 -308219 -306171 -105651 -90872 -185872
21948 -185872 24528 -93369 -274543 -522001 -386137 15960 218595 189131 184550 205168
21938B05168l10423n5576K24374J0822k11868o6086L0930P0230j0715N8242N9236
21927D334j32327J0316J6386m9136j26250J42031J11469n6435n5289L3307M334
21916i7260K3711N9306q6079n7904j46572j82082K27508R1076J8946M1112L0212
21905g8026J57730j36744j29402K3918L03799j2262j97953j53339j37458p7125
21895d36862n7794O8550J35950J90768J52003j4097j54164P406q9384m1055J47889
21884i0790Q0597K2098M7742l9216m4401J6816K1513l5390J53351Q0706k04838
21873H188J8464M3362q3903j6159m2476l4386M8035J02643k00181j39239J83262
21862a12390K76542j17780j70432Q3818N7947p0227k72583P1209O7787J66589
$$ plain form
21938 205168 -105255 -160831 63543 74365 -137503 -203589 -172659 -102429 -113144 -54902 4334
21927 4334 -127993 -117677 -101291 -150427 -276677 -134646 -23177 -79612 -134901 -101594 -97260
21916 -97260 -73549 -14243 -100322 -158226 -304798 -486880 -259372 -168296 -149350 -108238 -78026
21905 -78026 79704 -57040 -186442 -162524 141275 129013 -68940 -222279 -359737 -436862
21895 -436862 -494656 -426106 -290156 -99388 52615 38518 -115646 -108240 -197624 -238679 -90790
21884 -90790 -10193 11905 59647 20431 -23970 -7154 14359 -21031 132320 213026 8188
21873 8188 26652 70014 -13889 -30048 -72524 -106910 -58875 43768 -156413 -295652 -112390
21862 -112390 164152 46372 -124060 -40242 17705 -52522 -325105 -253896 -186109 -19520
21852a9520L2455J5429K27767k716l4071J53912J17187j14785m10662k15647J03913
21841a46738J37747n7763k43121m3443O7751j20853J88595K39245J01736n0295
21831G2861k0901n5125K8922j58939k40966M6079J28720J07285N9640j26432J70904
21820A2048M70273q2989l49625j43383n3948j6614J4534J91184l9033l6642q7886
21809a22081l2311M5653R3451q2117m7767l8271L7693J04457R3531k21701j37235
21798c06698J33629J98030J324l3301o6759p746K8804K05916P8194L467K4051
21787B58911M6820q9799J7776p5146j31409J01087J65390j00811J299j67081j62321
21776a35284o825k13783M3898M7010P9856L38642L15622j81588P5803k1217k5385
$$ plain form
21852 -19520 12935 28364 256131 253415 219344 373256 490443 375658 -35004 -250651 -146738
21841 -146738 -8991 -66754 -309875 -353318 -285567 -406420 -217825 21420 123156 72861
21831 72861 51960 -3165 25757 -133182 -374148 -328069 -199349 -92064 -32424 -158856 12048
21820 12048 482321 399332 49707 -93676 -147624 -164238 -149704 41480 2447 -34195 -122081
21809 -122081 -154392 -108739 -15288 -97405 -145172 -183443 -145750 -41293 52238 -169463 -306698
21798 -306698 -173069 24961 26285 -7016 -73775 -81521 -52717 153199 231393 234860 258911
21787 258911 305731 215932 233708 158562 27153 128240 293630 192819 194118 27037 -135284
21776 -135284 -142109 -355892 -311994 -264984 -185128 153514 469136 287548 363351 342134 316749
21765C16749o404J35832k525p9863q6505j77783p9252J0735J792L2606o4659j41634
21753a40911L0164K5479R1611j71850k08914J02639K45728K7011j27274j83715
21743c10032j23214J75939J45748J39298P3174j81799j40895J39734K03018m0829
21733H0142K2651k0085n6748n6130j20152m1640J0073J22182J92698R937k28586
21722h5658j73453L7057J50895P7089O2565k1449p9404K6291M6323Q2591J81055
21711C03902P100j16060O8129l3271j09586j91910J00211K7605q1886J02785R1915
21700A68934p6091p2189J956Q9094l1677j9862j33901n5208O7321n7898m5979
21689a65500o6173j51362n687P0295R9645O164O3216J41515j68191K4774K919
$$ plain form
21765 316749 310345 446177 443652 363789 277284 99501 20249 30984 32776 65382 723 -140911
21753 -140911 -110747 -85268 6343 -165507 -374421 -271782 -26054 957 -126317 -310032
21743 -310032 -433246 -257307 -111559 27739 100913 -80886 -221781 -82047 120971 80142
21733 80142 102793 82708 25960 -30170 -150322 -191962 -181889 -59707 132991 142928 -85658
21722 -85658 -259111 -222054 -71159 5930 68495 47046 -32358 -6067 40256 122847 303902
21711 303902 311002 194942 263071 229800 120214 -71696 28515 56120 -25766 77019 168934
21700 168934 92843 20654 22610 111704 80027 60165 -73736 -128944 -61623 -119521 -165500
21689 -165500 -231673 -383035 -388722 -318427 -218782 -212618 -149402 -7887 -176078 -151304 -148385
21678a48385O1388P737R5287J6949j94930J62780N5674J10941j44043k9692j48075
21667a54369o0290K07656m6529j75110r6012K1178m5881k5575R9600P9845O2371
21656a33116Q1423j2448J30468n8046n0557q8291j27809O3023J37801J54687K088
21645I9223O3383j32494k06241q7193R0374j57117K0138J01775J05439K15062
21635A12349J04932j77406P7631J30217p2317j6951O9181j8851j78841O9734J96743
21624B96421j04453k18686j76800J9967P7983K33131l4030N35k24828n2154J77015
21613e899Q9359k15608n2843K37693j60599m2771k6053L7744J75084j5478k6333
21602e704j49972j95804k5073J25758J41619J42157J69494K24510L8964q8458
$$ plain form
21678 -148385 -86997 -79260 16027 32976 -161954 826 56500 167441 23398 -6294 -154369
21667 -154369 -214659 -7003 -53532 -228642 -324654 -303476 -349357 -374932 -275332 -195487 -133116
21656 -133116 -51693 -64141 66327 8281 -42276 -130567 -258376 -195353 -57552 97135 99223
21645 99223 162606 30112 -176129 -263322 -172948 -330065 -309927 -208152 -102713 112349
21635 112349 217281 39875 117506 247723 175406 158455 227636 208785 29944 99678 296421
21624 296421 191968 -26718 -203518 -183551 -105568 127563 93533 94068 -130760 -182914 -5899
21613 -5899 83460 -132148 -184991 52702 -107897 -150668 -176721 -138977 36107 20629 -5704
21602 -5704 -155676 -351480 -376553 -250795 -109176 32981 202475 426985 465949 377491
21592C77491K4574n8790o8601K4123N6373L665n2461j07803m5900j12N250L2078
21580A89887j61563j80720j00964J12888K09786R5383k4814j47593j01677m2334
21570a51721J544J44680P854K3622j01356J01530K79046M9346j73455p6992M0007
21559A44105o1150p8872m6050p4243q138k160m8753K92771K31461q6319k89521
21548b6869j07970J50781O4274j45935N5911j15656q9334J71100m957o6287J3070
21537a01872K48933K27885K2050m0391m1786p6200j06614J7804K9316o6731k05543
21526i3149n0875j66024j7694r1685n426K93242J74874J78987M8993N7004r9341
21515B28906p7794j38497j71832j50810k126K61674J91612K86469j43666j99492
$$ plain form
21592 377491 402065 343275 274674 298797 355170 358835 306374 198571 152671 152559 157809 189887
21580 189887 28324 -152396 -253360 -140472 69314 164697 139883 -7710 -109387 -151721
21570 -151721 -150177 -5497 2357 25979 -75377 26153 305199 354545 181090 104098 144105
21559 144105 82955 4083 -41967 -116210 -124348 -126508 -175261 117510 348971 262652 -26869
21548 -26869 -134839 15942 80216 -65719 -9808 -125464 -214798 -43698 -48655 -114942 -101872
21537 -101872 147061 374946 396996 356605 314819 238619 132005 149809 179125 112394 -93149
21526 -93149 -144024 -310048 -327742 -419427 -424853 -131611 43263 222250 271243 328247 228906
21515 228906 151112 12615 -159217 -310027 -312153 -50479 141133 427602 283936 84444
21505H4444p8938j74248j19227K81279J66947j78737j10993k721n1596Q5613P6133
21494b2044q2284k6009J02348R5351K0204j23582J29435M2498J87719k1193l7891
21483B64552j36679q3872J0379L4061J34451k12020m0075k5898q3945k07659l6664
21472c83369J63344k056l3777j06701J2615m7766q7528o33j25446L0145K8614
21461e52558Q7331L2921r7378J37619L54623j3944k23219n0869L9210o3806p359
21450c57429r7591K58999L11527k04828j15546j94820J9523K2937K06921o2967
21440b13274j26285o7067J1858K69190J52394j7210P7859j59008j91740J95092
21430f8191r0498j9955K2700j1739j52265j02073j8859K1236o5173P041J14243
$$ plain form
21505 84444 5506 -168742 -287969 -6690 160257 -18480 -129473 -132194 -183790 -98177 -22044
21494 -22044 -104328 -130337 -27989 67362 87566 -36016 93419 135917 323636 302443 264552
21483 264552 127873 44001 54380 88441 222892 10872 -29203 -55101 -139046 -346705 -383369
21472 -383369 -220025 -222081 -255858 -362559 -349944 -397710 -485238 -485871 -611317 -581172 -552558
21461 -552558 -465227 -432306 -529684 -392065 -37442 -51386 -274605 -325474 -286264 -350070 -357429
21450 -357429 -455020 -196021 115506 -89322 -204868 -399688 -380165 -357228 -150307 -213274
21440 -213274 -339559 -406626 -394768 -125578 26816 9606 87465 -71543 -263283 -68191
21430 -68191 -158689 -178644 -155944 -167683 -319948 -422021 -440880 -419644 -484817 -477776 -363533
21419c63533L02837n2103k77439K8242M44670J76833M0433M2808o9175j8786l1746
21408B23041l1058o958q9454j45481j32940j5946J81396K18276o9789r8528o6857
21397c4298J40196J54354J5958L5828r6066J64048j7650k37821k99283p7105K8685
21386b23154J08271r06J61548K0768L3596O2173J1945M6310P1550K02048j85223
21375C08926j84166k13007j28583J29959M7421K2223L9868N0618m9637j53265
21365a29643p782p3128k2722K7073j4038J73656J62752j3857q4124j56827p038
21354a45678K6034j07086r703R4021J35832J32028J96901K7556p3751j50778m5424
21343G9952P1066j2166p3102n0502J21663j07997q3765J41539N4222K2890L5223
$$ plain form
21419 -363533 -60696 -112799 -390238 -361996 82674 259507 299940 342748 273573 254787 223041
21408 223041 191983 185025 95571 -49910 -182850 -198796 -17400 200876 131087 32559 -34298
21397 -34298 105898 260252 276210 312038 215972 380020 362370 124549 -174734 -251839 -223154
21386 -223154 -114883 -115789 45759 66527 100123 162296 174241 220551 292101 494149 308926
21375 308926 124760 -88247 -216830 -86871 -39450 -17227 22641 73259 23622 -129643
21365 -129643 -137425 -210553 -233275 -206202 -220240 -46584 116168 102311 18187 -138640 -145678
21354 -145678 -119644 -226730 -236433 -142412 -6580 125448 322349 349905 276154 125376 79952
21343 79952 151018 138852 65750 15248 136911 28914 -54851 86688 140910 163800 199023
21332A99023j02559k91067J46583P4886N1314Q9145M6330j71470o3269M8804l9395
21321a1675n0862k9925J8983j24316J65869N1564j59003o7541K48367J30582J52786
21310C24829R5568l36431j38789K85869l9754j47762J05171J47887K4233l0579
21300B90242l7717K8714j01073j24982q7510K9879p7007m1650J8788K48749P4765
21289B21198J22957q5135k23002o8971l4448M2508L3792j09062n2540Q8034J66020
21278A01351n4732r9300P9356l2437l55759K3386M1204O7472l9523K04831J34036
21267F9885r2235j92178k618J85176p3216k82665J66105J45432R3960l50693m7164
21256c80211J5008k278R7547J71423N3810P4107r2339L9206O390k34402k4878
$$ plain form
21332 199023 96464 -194603 -48020 26866 78180 167325 213655 42185 -21084 27720 -11675
21321 -11675 -62537 -92462 -73479 -197795 -31926 19638 -139365 -206906 41461 172043 324829
21310 324829 420397 83966 -54823 231046 191292 43530 148701 296588 320821 290242
21300 290242 252525 281239 180166 55184 -32326 -2447 -79454 -121104 -102316 146433 221198
21289 221198 344155 259020 36018 -32953 -67401 -24893 8899 -100163 -152703 -64669 101351
21278 101351 46619 -52681 26675 -5762 -361521 -338135 -296931 -229459 -268982 -64151 69885
21267 69885 -22350 -214528 -217146 -31970 -105186 -387851 -221746 -76314 17646 -333047 -380211
21256 -380211 -365203 -367481 -269934 -98511 -44701 29406 -62933 -23727 -17337 -251739 -276617
21245b76617k6449j32588J08778M5911J85395M1481L4809R5804J7611j18874J31554
21234A06815K21549j99067m6643j24914q2382J4646j83197J8377j01414n7935
21224d34165M3665P4649P7408J48907J35443J20763K2237j23405j91987L1990
21214i4495J35570o5161j5656J31489j45914j26621J17331L9229N5404r3876j3028
21203g5728O8723q6447M3044K14643J71749j50601j94951k30244j47733k7522
21193d15067Q3854J49295J0308K4429o1843k6629Q4795k1982N3490R0113M88j1001
21181c9750j08052l3330M8060O1228J1430N1032k8126K33885M17117Q9812j66778
21170E36528k40051j38357N5282j22778J5531j07522n5295l2321J74448p5089
$$ plain form
21245 -276617 -303066 -435654 -326876 -280965 -95570 -54089 -19280 76524 94135 -24739 106815
21234 106815 328364 129297 82654 -42260 -124642 -109996 -293193 -274816 -376230 -434165
21224 -434165 -390500 -315851 -238443 -89536 45907 166670 188907 65502 -126485 -94495
21214 -94495 41075 -24086 -39742 91747 -54167 -180788 -63457 -24228 31176 -62700 -75728
21203 -75728 -7005 -93452 -50408 164235 335984 185383 -9568 -239812 -387545 -415067
21193 -415067 -331213 -181918 -171610 -147181 -209024 -235653 -150858 -172840 -119350 -29237 -28749 -39750
21181 -39750 -147802 -181132 -133072 -71844 -60414 -9382 -37508 196377 613494 703306 536528
21170 536528 296477 158120 213402 90624 106155 -1367 -56662 -88983 85465 10376
21160A0376Q4861J20211m4711n3838j27840j05484j03975k6272M2766k9323j1548
21149b44777q8297p5020P0654m9365L616R1062M2269N6556l5996n0934M0481J92167
21137d7584N4721j65876j40971L7894J26222J50681k3959k11115q8543j14755
21127d23285r8713J17288K65554J52632k04421k64300J62573J76930J83539L0102
21117I7899N7583J90327k0854k46644J7521P1819r1538J78139P2658j53711k84711
21106a11512q3556K6862l53497J22681K31691K36552M6354j95324K445J7561j34702
21095a94445M5014m902m5032O7251m6909j23804K1319J85982L35763M6444k52796
21084C3885O0410m4964K4412j68125p6787J33559O340O5529J05598k8873n2648
$$ plain form
21160 10376 95237 215448 170737 116899 -10941 -116425 -220400 -246672 -203906 -233229 -244777
21149 -244777 -333074 -408094 -337440 -386805 -383189 -292127 -249858 -193302 -229298 -280232 -239751 -47584
21137 -47584 7137 -158739 -299710 -261816 -135594 15087 -8872 -219987 -308530 -423285
21127 -423285 -521998 -404710 -139156 13476 -190945 -455245 -292672 -115742 67797 97899
21117 97899 155482 345809 324955 78311 95832 167651 76113 254252 326910 173199 -111512
21106 -111512 -195068 -168206 -521703 -399022 -167331 69221 115575 -79749 -77304 -59743 -194445
21095 -194445 -149431 -154333 -199365 -132114 -179023 -302827 -281508 -95526 240237 286681 33885
21084 33885 94295 49331 73743 -94382 -171169 -37610 -31270 34259 139857 110984 58336
21073E8336j68103n5975J16320m7440q247P7250l3598j14312m7873K38083Q5291
21062I9732Q2112J8161r002r1691k23685K5172j50878J38699N6050L421n3327
21051a05236n7342j16044j7353K34295J79696j2052O945k80845j20597j48121
21041d36654L4779Q3794R5580J03265J17511M8001n9611R905R5042M2787p3778
21030F0621j01537j22829J75822k9234j59345n008M1965m1497j37191K71922M3317
21019b994p404P3700n0482j72312Q0924l878J22847j00624J6737J63393k53176
21008a33269k5644K0353N8666P2584k5311O9255q8773K2162j0362p1699J1427
20997a00611J43629R1889J2341j48207j22228m9997R4822K0k13363j02410L3904
$$ plain form
21073 58336 -109767 -165742 -49422 -96862 -105109 -27859 -61457 -175769 -223642 14441 99732
21062 99732 181844 200005 191003 99312 -124373 -99201 -250079 -111380 -55330 -51909 -105236
21051 -105236 -162578 -278622 -295975 -61680 118016 105964 112909 -167936 -288533 -436654
21041 -436654 -401875 -318081 -222501 -119236 -1725 46276 -13335 -3430 91612 134399 60621
21030 60621 -40916 -163745 12077 -17157 -176502 -181510 -139545 -181042 -318233 -46311 -2994
21019 -2994 -10398 63302 12820 -159492 -78568 -82446 40401 -60223 -43486 119907 -133269
21008 -133269 -158913 -138560 -79894 -7310 -32621 36634 -52139 -29977 -40339 -112038 -100611
20997 -100611 43018 134907 147248 -959 -123187 -173184 -78362 -78342 -291705 -394115 -360211
20986c60211K44502K84362J4439o3757k29260j46797J59920J52854l680p9776
20976b7404j71244L05616k12295r7209J19558J87794K655j72014l4303O6898R8268
20965F6320j90208J73781r3946M9545k73887k50666k6853L8152M8517R4069J57661
20954b07515K23307J38531m8522r2096j08617K6568J31096n7867p7642j96939
20944b69696J50234J81673n0675j4244J7849j2548m7272R663K8536J38013J48993
20933B80526q9797j07337j55660j02674l7602J38991K22602L7334j40239n3837
20923g693K919J38354J08819j19708j43761j41140J35380J2952j28217j09908
20913b52003J80211K6245j71085K1950J89182J77342P7313J9162n7751j74433
$$ plain form
20986 -360211 -115709 168653 183092 119335 -109925 -256722 -96802 56052 52372 -27404
20976 -27404 -198648 106968 -105327 -202536 -82978 104816 107471 -64543 -98846 -31948 66320
20965 66320 -123888 49893 -44053 5492 -268395 -519061 -545914 -507762 -459245 -365176 -207515
20954 -207515 15792 154323 105801 13705 -94912 -68344 62752 4885 -72757 -269696
20944 -269696 -119462 62211 11536 -2708 15141 2593 -44679 -35016 -6480 131533 280526
20933 280526 190729 83392 -72268 -174942 -212544 -73553 149049 186383 46144 -7693
20923 -7693 -4774 133580 242399 122691 -21070 -162210 -26830 -13878 -142095 -252003
20913 -252003 -71792 -45547 -216632 -194682 -5500 171842 249155 268317 210566 36133
20903C6133j01313j4699M9095K9832N8733j07037k2555R2640K28463l11980k88117
20892c50805j5375J58886J1411J95493K1828K5721J15765N3153q6402R0543q1951
20881A38267l258N8136j2962j47259j63851R1353r697o6446J68308N6117p8918
20870B9790l8473j16869o7288J47730Q4756J9529k00580r1298J82533j23470K27411
20859E3771L050m6073k5032n3041j7776N4214m1903n5401j32568Q351n5642N3330
20847b54720j0726j2650J9423K57861j9493L1627n6915n8301l2955j20721O6209
20836a91361j10112J5384K5053o5892l723J55125J52796K8601o4304l6889J2570
20825h2752l5353L6997n7785M6015N4710p2363j9486J46071J58516P5229l0092
$$ plain form
20903 36133 -65180 -79879 -30784 -952 57781 -49256 -71811 20829 249292 -62688 -350805
20892 -350805 -366180 -207294 -195883 -390 21438 47159 162924 216077 129675 220218 138267
20881 138267 135009 193145 180183 32924 -130927 -39574 -49271 -115717 52591 108708 29790
20870 29790 -8683 -125552 -192840 -45110 39646 59175 -141405 -232703 -50170 -173640 53771
20859 53771 56821 10748 -14284 -67325 -85101 -30887 -72790 -128191 -260759 -252408 -308050 -254720
20847 -254720 -265446 -278096 -258673 -812 -20305 11322 -45593 -103894 -136849 -257570 -191361
20836 -191361 -301473 -286089 -261036 -326928 -330651 -175526 -22730 5871 -58433 -95322 -82752
20825 -82752 -118105 -81108 -138893 -92878 -38168 -110531 -130017 16054 174570 249799 219707
20814B19707k97455k30547Q316O1992R4438R154P6091j7614K1692o0612j18885
20803b33723m1396J57440N8901n6117K8599J12482q9885j0901M8625J22388Q4165
20792A80578Q1216j30730j68089j89855j01416n2833j8835k7188R4310k3553N3282
20781c03113k9759j07671N4551j34469J95058J25946J3400J61793p7523r452J27472
20770A6233j07724M7372K7280k4964N516Q9666R9582j45598q5934j02298R4086
20759h6783L7651j35054M2896R6271q9519N6670L7803n4570r3713N1096O926N0139
20747h0187J17205J03435j7908j34551K5358R6466K970q4452j64091l384P0713
20736f8426n3686o5271j34748J46148J2273O0919J46407L8962O3864l6841j51062
$$ plain form
20814 219707 -77748 -308295 -299979 -237987 -143549 -134395 -58304 -75918 -54226 -114838 -233723
20803 -233723 -275119 -117679 -58778 -114895 -86296 26186 -63699 -74600 -25975 96413 180578
20792 180578 261794 131064 -37025 -226880 -328296 -381129 -399964 -427152 -332842 -356395 -303113
20781 -303113 -332872 -440543 -385992 -520461 -325403 -199457 -186057 -24264 -101787 -111239 16233
20770 16233 -91491 -44119 -16839 -41803 -36287 53379 152961 7363 -78571 -180869 -86783
20759 -86783 -49132 -184186 -141290 -45019 -134538 -77868 -40065 -94635 -188348 -137252 -130326 -80187
20747 -80187 37018 140453 122545 -12006 13352 109818 112788 28336 -135755 -139139 -68426
20736 -68426 -122112 -187383 -322131 -175983 -163710 -102791 43616 82578 146442 109601 -41461
20725d1461L3713m7517j22381m7264M7974P5061J731N2630R4844J13058Q5516
20714B45904m6223k41670j75822p1103R2Q5653J52141N8976l946o729n3285L1256
20702b4756q8094K0401N9162N400p1525O8048J06673K16125M8849L5943k92837
20691H3389l70446j45295J0137J81811Q5881k8545R0583J98629j39073J24292
20681I1363M1J64009J16090n0629j21527j81153k96515j33242K06887K85615K4442
20670A05381K1282l4303j2096K6200j20599K9827r9619l2866R2327P905j14653
20659a31214n8462O4805K9417J00410J17972J3498r243l7013m742N0230K5549
20648A61207r9609j90080j55499p4218K36334J72603l02795k50517r1249j86990
$$ plain form
20725 -41461 -7748 -55265 -177646 -224910 -176936 -101875 -100144 -47514 47330 160388 245904
20714 245904 199681 -41989 -217811 -288914 -288822 -203169 -51028 7948 4002 -2727 -56012 -24756
20702 -24756 -112850 -92449 -33287 -27887 -99412 -31364 75309 291434 340283 376226 83389
20691 83389 -287057 -432352 -422215 -240404 -154523 -183068 -92485 106144 -32929 91363
20681 91363 91404 255413 371503 320874 199347 18194 -278321 -411563 -204676 80939 105381
20670 105381 126663 92360 80264 106464 -14135 15692 -83927 -116793 -24466 -16561 -131214
20659 -131214 -189676 -124871 -95454 4956 122928 136426 127183 90170 85428 135658 161207
20648 161207 61598 -128482 -283981 -358199 -121865 50738 -252057 -502574 -593823 -780813
20638g80813Q0222J64297L47241L70096k4809j5654P4460j13230K2018O3769Q8997
20627B76594j16907m9826j7960O0804m6347K04084J13436k04518j43537j6113
20617E9710j86023j31194J53759o0399j25125N6215j45425K60884K18963m840
20607I6525p1226N4107n9201J0095q4415m3891j32413j33720J58376J27450j06822
20596a85135r9862J43982J95915M6324m0861M2272p456j59459j17890k28036j1785
20585d21991L0030K88017K64080j99068k48062m1J10950M6959Q3446k30521n9410
20574c35611J69266J86600K2400j48930J7563K19962N5885k7658J20737L5299
20564C15513j62112j60309l9513k0746l045p060K51381Q7225m2812L5013P8519
$$ plain form
20638 -780813 -700591 -536294 -189053 181043 156234 140580 215040 101810 123828 187597 276594
20627 276594 159687 109861 91901 152705 106358 310442 423878 219360 75823 59710
20617 59710 -126313 -257507 -103748 -164147 -289272 -233057 -378482 -117598 101365 96525
20607 96525 25299 79406 20205 30300 -54115 -98006 -230419 -364139 -205763 -78313 -185135
20596 -185135 -284997 -141015 54900 101224 60363 102635 95179 -64280 -182170 -410206 -421991
20585 -421991 -391961 -103944 160136 -38932 -286994 -287035 -176085 -129126 -45680 -276201 -335611
20574 -335611 -166345 20255 42655 -106275 -88712 131250 187135 159477 280214 315513
20564 315513 153401 -6908 -46421 -67167 -70212 -77272 174109 261334 218522 253535 332054
20553C32054m069j92052j12539j9787j64343l87M6228k18685j59847J76056J89273
20542a28098R6538j6318L1438J09463j33507r1844O7419j51202q3595J90546N924
20531a03236r0941L07624K30667k49893p2998K33219p702q2884j47937k18425
20521b02506J31529k646L5600J56568j97269k09459k12844J18667J80485J57888
20511d3987j97692o1123P6269R6171m3128J43771L7317j33755o2452J29183J66347
20500A06921Q453j76789j52154J83151J31650Q3144p5342j81848o5124k7644q0072
20489b45654J38282Q6588j08488l6130M9433j36347j38552M1033J64512J76480
20479h843j59848l4584n8230J31942J96433J43497j46317j33964K34428J42554
$$ plain form
20553 332054 327985 135933 23394 3607 -160736 -161123 -114895 -333580 -493427 -317371 -128098
20542 -128098 -31560 -47878 -16440 93023 -40484 -132328 -64909 -216111 -299706 -109160 -103236
20531 -103236 -194177 113447 344114 94221 21223 254442 246740 163856 15919 -202506
20521 -202506 -70977 -73623 -38023 118545 -78724 -288183 -501027 -382360 -201875 -43987
20511 -43987 -241679 -302802 -226533 -130362 -173490 -29719 7598 -126157 -188609 -59426 106921
20500 106921 115374 -61415 -213569 -30418 101232 184376 109034 -72814 -137938 -165582 -245654
20489 -245654 -107372 -20784 -129272 -165402 -115969 -252316 -390868 -349835 -185323 -8843
20479 -8843 -168691 -203275 -261505 -129563 66870 210367 64050 -69914 164514 307068
20469C07068j23204j61293m4628O1715N2217Q4014j4662m6884o1952P8806m1902
20458H9295j16550m6641n6330k43481K50689J81941j07444Q6234j7077r9269J28302
20447D9669K20437p8154n0812n4280K9500j26573l3731J73497j5900p7358k41116
20436b04821k94993J03343k8026K41338K49537J16224j30149k0894P2063j12766
20426i144j2048j22753Q7629J00514k8057J8608q6692p1906J73716N2356j75475
20415g3252j34182Q5402J13868N7687j8911j04995N3402J8101J7795R7141k24013
20404a11957j78414J64896M60M8598J58108M5429j09048o7958J26278J67650J2831
20393B56873j94631k32687k7560R777J7038o810p5622N4572J43226j4732k9608
$$ plain form
20469 307068 183864 22571 -22057 39658 91875 175889 161227 114343 52391 131197 89295
20458 89295 -27255 -73896 -130226 -373707 -123018 58923 -48521 37713 20636 -78633 49669
20447 49669 270106 191952 141140 86860 116360 -10213 -43944 129553 113653 36295 -204821
20436 -204821 -499814 -396471 -424497 -183159 66378 182602 52453 31559 103622 -9144
20426 -9144 -21192 -143945 -56316 44198 16141 34749 -51943 -123849 49867 102223 -73252
20415 -73252 -207434 -122032 -8164 49523 30612 -74383 -20981 -2880 14915 112056 -111957
20404 -111957 -290371 -125475 -125015 -76417 81691 127120 18072 -49886 76392 244042 256873
20393 256873 62242 -170445 -198005 -188228 -171190 -178000 -253622 -199050 -55824 -70556 -100164
20382a00164n1257k8178J23057J32807L8275K8857q6239P1717Q6371J49670j22237
20371B42679j20685n8072j10070q395O8986J06961o1502j30891N1843O9281p6871
20360b6736j51002j12530Q5090L3688k70561j38995L94067L07663Q0514l3419
20350A67779r4433j14087K62118J6911q4249k159k5620K6182N200J39338n9600
20339B37380p7817n6618j75278j65159O644N9488L15J41433Q8062j44626O9346
20328a6830l9658L2970J48387k9058J7091n8262q5267o233j03172j18123j29501
20317c87656n6858J01661J7242N5768J65278J04869L9567p843Q6321K4399m4701
20306I8047J1255L46k9270j18449j7800K61007O1424j34355n1738O7232J718j32563
$$ plain form
20382 -100164 -151421 -179599 -56542 76265 114540 143397 57158 128875 215246 364916 242679
20371 242679 121994 63922 -46148 -54543 14443 121404 59902 -70989 -19146 50135 -26736
20360 -26736 -177738 -290268 -205178 -171490 -442051 -581046 -186979 120684 201198 167779
20350 167779 73346 -40741 221377 238288 154039 151880 126260 152442 157642 296980 237380
20339 237380 159563 102945 -72333 -237492 -230848 -171360 -171045 -29612 58450 -86176 -16830
20328 -16830 -56488 -23518 124869 95811 112902 54640 -30627 -36860 -140032 -258155 -387656
20317 -387656 -444514 -342853 -325611 -269843 -104565 304 39871 32028 118349 142748 98047
20306 98047 109302 109648 80378 -38071 -55871 205136 266560 132205 80467 147699 149417 16854
20294A6854K2661j36919j11218j34007O0081J82426J24395R0537m9959K96761
20284C61612J24445q5019q6289j42008R6653k8023j46153j43262k31387m4936
20274c24367K08374N7707K9702r6113J23543J34769k42382j7376K80192K7211
20264A81260j14981n5894P0106j11380l6334Q9788J9957R4697O6157r0853l8297
20253G4226P6971k609j36284k8599J27081J55343j1520j43323j79231j52129J00229
20242a19845K63887K92189P1916j39871p1644k18003m5985k13715j5547p49r8573
20231b95940J26938M0865M7583j3296J13575K25214n1266k16012l6489J05720
20221D6892J04385k14366m8800j54990n9224K69837j56750j31019J91504J0298
$$ plain form
20294 16854 39515 -97404 -208622 -342629 -282548 -100122 24273 114810 64851 361612
20284 361612 486057 401038 314749 172741 269394 241371 95218 -48044 -279431 -324367
20274 -324367 -115993 -58286 -28584 -124697 -1154 133615 -108767 -126143 154049 181260
20264 181260 66279 10385 80491 -30889 -67223 22565 42522 137219 203376 112523 74226
20253 74226 151197 148588 12304 -16295 110786 266129 254609 111286 -67945 -220074 -119845
20242 -119845 144042 436231 508147 368276 296632 78629 32644 -181071 -196618 -197367 -295940
20231 -295940 -169002 -128137 -80554 -93850 19725 244939 193673 -22339 -58828 46892
20221 46892 151277 -63089 -111889 -266879 -326103 -56266 -213016 -344035 -152531 -142233
20211a42233K5828K8855k220j8656j944j20131O3870o936N9014p1176l0917K80243
20199F3597K42106o4625P3217j74049l3392r9670j22642j20718J83418R9668k6770
20188B0140m6162p6541M3802M0378l434p1013Q581j28771k35797j07877r684M6433
20176e19945K62153R7949J67701P9748k8393N3028k791j26726M016L0707r0629
20165g3182q0865n2664K45934J9431L7157J5668j70264j1835J84686J97959l02212
20154I813k86907O4117P0055J11930l4001M7828m4575j16358o0230j0206K48587
20143E3m7920j07004J49688J55301o157q4796j30460j83874k0311J27441J15387
20132c2652q4574L0575P267p7089k20446m2034J18765J08968R5720k5484m6499
$$ plain form
20211 -142233 -116405 -87550 -89770 -108426 -110370 -230501 -166631 -173567 -114553 -185729 -216646 63597
20199 63597 305703 241078 314295 140246 106854 7184 -115458 -236176 -52758 46910 20140
20188 20140 -26022 -102563 -58761 -18383 -21817 -92830 -84249 -213020 -448817 -556694 -566378 -519945
20176 -519945 -257792 -159843 7858 87606 59213 112241 109450 -17276 -13260 17447 -73182
20165 -73182 -154047 -206711 39223 58654 95811 111479 -58785 -70620 114066 312025 9813
20154 9813 -277094 -212977 -142922 -30992 -64993 -17165 -61740 -178098 -238328 -248534 53
20143 53 -47867 -154871 -5183 150118 143961 59165 -71295 -255169 -275480 -148039 -32652
20132 -32652 -117226 -86651 -79384 -156473 -376919 -418953 -300188 -191220 -95500 -120984 -167483
20121a67483M4750o0010J60030Q1566O7794N7162l1576Q7602O8652N1658J18338
20110D78483J86540p3000l15911k34803p9811R6154m9019o4487J35293j57605
20100g8166m3125K10093M6700K4483j91365o6560m6612j50168n0609J47887J70990
20089b6452J66178j4076j92661J0760J50834j00286r5645M5995j25795K664J956
20078a76528k8874P2084n8135j79108R7922P9082K32340r6524L0557J28420O815
20067A08051j17017M3099J46263L723j51465J32K0379j70754n8165J28500q3282
20056a30536M8099J69697L9081j19730J0490J13311N9284L6821j04765l6004l37025
20045b51277k8576K24043J73459l3706j33097j2022K68267J03819m197j55875
$$ plain form
20121 -167483 -122733 -182743 -22713 58853 126647 183809 152233 239835 308487 360145 478483
20110 478483 665023 592023 276112 41309 -38502 57652 8633 -55854 79439 -78166
20100 -78166 -121291 88802 135502 159985 -31380 -97940 -144552 -294720 -345329 -197442 -26452
20089 -26452 139726 125650 -67011 -56251 94583 -5703 -101348 -55353 -181148 -178484 -176528
20078 -176528 -205402 -133318 -191453 -370561 -272639 -193557 38783 -57741 -27184 101236 108051
20067 108051 -8966 34133 180396 184119 32654 32786 53165 -117589 -175754 -47254 -130536
20056 -130536 -82437 87260 126341 6611 17101 130412 189696 226517 121752 85748 -251277
20045 -251277 -279853 -55810 117649 83943 -49154 -61176 207091 310910 306713 150838
20035A50838k74587k15611J37202N0124k7874j49136J14782J01830q2065o234
20025b00731k4467j1338P082j01421J24780J85390K34618j24828r7280K1632j45154
20014a31717K2828M8175m4577L1692Q9600l64j08344j4284n0280J8712J19936
20003a8623J13558o1541l5521k4676n3105q95P3120o3279j72913K3534R0916n8049
19991a87474j06122L7482K05308R1416r1660l7602P0369M5657j18575M9215J33535
19980I1549J05037l73775j89752J812L25340M1403K5841k48476N2756J8223N8502
19969i1540N0219K8746J8498j3902O7436J27951J0399j01436j12624j10192n6268
19958a82713L9703O6807K22889j52640j84161J15769J51022q549J7477o9518P0011
$$ plain form
20035 150838 -123749 -339360 -202158 -152034 -179908 -329044 -214262 -112432 -194497 -200731
20025 -200731 -225198 -236536 -229454 -330875 -206095 -20705 213913 89085 -8195 13437 -131717
20014 -131717 -108889 -60714 -105291 -73599 16001 15637 -92707 -106991 -157271 -138559 -18623
20003 -18623 94935 33394 -2127 -26803 -79908 -80803 -7683 -70962 -243875 -220341 -129425 -187474
19991 -187474 -293596 -256114 -50806 40610 -51050 -88652 -18283 27374 -91201 -41986 91549
19980 91549 196586 -177189 -366941 -365129 -39789 1614 27455 -221021 -168265 -150042 -91540
19969 -91540 -41321 -12575 5923 -7979 59457 187408 197807 96371 -16253 -126445 -182713
19958 -182713 -143010 -76203 146686 -5954 -190115 -74346 76676 68127 85604 16086 86097
19947H6097J01817k45332j84995J62197J37578j72468j81526J4794q3723P745
19937c57816J36871J56673L3247m0363J60874p5621j59746J02441m4063k75359
19927c62862R8919J80915J99048J13520J78540J53754J737r1815j05285l2750
19917C33721m8543j67342m7933j61456j44600j71754J76253J44405o7558j08022
19907b62829p2534P0489J12866L1124k3728J10126K60246q7909j51655j44755
19897a58559m2184J48789M5456j45617N3713K12764J2937J1072j68007O4320L6762
19886G1446K11087o7773j92746q5952O180j48909L6245J39813m9199K1895K3746
19875c4167j30562j1690K14405j04729l16347j22740J91303K9473J33554r044
$$ plain form
19947 86097 187914 -57418 -242413 -80216 57362 -115106 -296632 -281838 -365561 -357816
19937 -357816 -220945 -64272 -31025 -71388 89486 13865 -145881 -43440 -87503 -362862
19927 -362862 -263943 -83028 116020 229540 408080 561834 563571 471756 366471 333721
19917 333721 285178 117836 69903 -91553 -236153 -407907 -231654 -87249 -154807 -262829
19907 -262829 -335363 -264874 -152008 -120884 -144612 -34486 225760 137851 -13804 -158559
19897 -158559 -200743 -51954 -6498 -152115 -98402 114362 127299 138371 -29636 34684 71446
19886 71446 282533 214760 22014 -63938 -57758 -206667 -170422 -30609 -79808 -57913 -34167
19875 -34167 -164729 -176419 37986 -66743 -383090 -505830 -314527 -285054 -151500 -160544
19865a60544n2541O6182K17170Q2909j87683P31l7924Q2826J18464l20861r8415
19854b89686L22978R7023J57225L9897r5588j66207k4534L6442J19863J8069J5051
19843B30533j50875j35266L3655j02174p9921O4473R2245j86247J08388Q7339
19833c7850r7955q62R7956K84190p6638k42595n1100l0108K2990q789J70279j00324
19821g0806m1230J14548O2643j48439o7272L6908j81111J20739J49028J37398
19811A12406J39338J52712l3509j85046k18537j22340n2526J7873J25734K3903
19801c9992M5095K72685m2378j80264j99772j4505O8589k5171K2717J70701k940
19790G4765j4660J22485j68833p7455k53363l11965J23889J33324J15319K05500
$$ plain form
19865 -160544 -213085 -146903 70267 153176 -34507 -33776 -71700 11126 129590 -191271 -289686
19854 -289686 33292 130315 287540 327437 231849 65642 41108 77550 197413 215482 230533
19843 230533 79658 -55608 -21953 -124127 -204048 -139575 -47330 -233577 -125189 -37850
19833 -37850 -135805 -136667 -38711 245479 168841 -73754 -124854 -154962 -131972 -140761 29518 -70806
19821 -70806 -112036 2512 65155 -83284 -150556 -113648 -294759 -174020 -24992 112406
19811 112406 251744 404456 370947 185901 -32636 -154976 -207502 -189629 -63895 -39992
19801 -39992 5103 277788 235410 55146 -144626 -159131 -90542 -115713 -92996 77705 74765
19790 74765 60105 182590 13757 -63698 -317061 -629026 -505137 -371813 -256494 -50994
19780e0994J20759j93536K1569K14350j11337k68861j11286P1230L0229P5920
19770b01957m4876j00092J49997P455m6308J14142r6347J78812R8441l8069l8820
19759a7622L7888J2999j62550j89850q0933J03555M7489r6642q7554R0431N1136
19748b91653n4088J83831J42240P4119p4908p4789j414K2955j8473p1304K04136
$$ plain form
19780 -50994 69765 -123771 -102202 112148 811 -268050 -379336 -308106 -277877 -201957
19770 -201957 -246833 -346925 -196928 -189473 -235781 -121639 -217986 -39174 59267 21198 -17622
19759 -17622 20266 33265 -129285 -319135 -400068 -296513 -249024 -345666 -433220 -342789 -291653
19748 -291653 -345741 -161910 -19670 54449 -20459 -95248 -96662 -73707 -92180 -163484 40652
$$ [...]
##END NTUPLES=NMR SPECTRUM
##END=
