##TITLE=Analysis number 328188
Compound Code cc 04001
Book Reference lab3
Project Code adrs
Chemist Name stores
##JCAMPDX= 6.0         $$ Bruker NMR JCAMP-DX V2.0
##DATA TYPE= NMR SPECTRUM
##DATA CLASS= NTUPLES
##ORIGIN= Bruker BioSpin GmbH
##OWNER= nmr
$$ XWIN-NMR		Version 3.5
$$ Fri May 11 09:28:24 2007 GMT Daylight Time (UT+1h)  MAYBRIDGE\nmr@NMR_250MHZ
##.OBSERVE FREQUENCY= 250.131544655141
##.OBSERVE NUCLEUS= ^1H
##.ACQUISITION MODE= SIMULTANEOUS (DQD)
##.ACQUISITION SCHEME= undefined
##.AVERAGES= 16
##.DIGITISER RES= 18
##SPECTROMETER/DATA SYSTEM= dpx250
##.PULSE SEQUENCE= zg30
##.SOLVENT NAME= DMSO
##.SHIFT REFERENCE= (INTERNAL, DMSO, 0, 16.522)
##AUDIT TRAIL= $$ (NUMBER, WHEN, WHO, WHERE, WHAT)
$$ ##TITLE= Audit trail, XWIN-NMR		Version 3.5
$$ ##JCAMPDX= 5.01
$$ ##ORIGIN= Bruker BioSpin GmbH
$$ ##OWNER= nmr
$$ C:\u/data/dgb/nmr/ADRS/850/pdata/1/auditp.txt
$$ ##AUDIT TRAIL=  $$ (NUMBER, WHEN, WHO, WHERE, WHAT)
(   1,<2007-05-11 09:27:59.43 +100>,<MAYBRIDGE\nmr>,<NMR_250MHZ>,
      <created by zg, POWCHK disabled, PULCHK disabled
       configuration hash MD5:
       76 6E 9A 78 1E 09 19 81 EC 84 63 8F B0 6A 59 2D
       data hash MD5: 64K
       92 FD 05 00 B4 A5 4B 99 F8 59 70 59 98 BF 28 71>)
(   2,<2007-05-11 09:28:14.86 +100>,<MAYBRIDGE\nmr>,<NMR_250MHZ>,
      <Start of raw data processing
       ef LB = 0.3 FT_mod = 6 PKNL = 1 SI = 32K 
       data hash MD5: 32K
       71 74 EB EF 78 6F 9E AD A1 BA 88 5D DD 91 E6 95>)
(   3,<2007-05-11 09:28:16.58 +100>,<MAYBRIDGE\nmr>,<NMR_250MHZ>,
      <apk 
       data hash MD5: 32K
       4A B4 53 16 8A 25 24 80 32 53 98 B6 08 81 F5 C7>)
(   4,<2007-05-11 09:28:17.32 +100>,<MAYBRIDGE\nmr>,<NMR_250MHZ>,
      <abs ABSG = 5 
       data hash MD5: 32K
       C2 1C 89 DE 34 E9 EC D1 F7 11 49 C1 A0 6C B4 8F>)
$$ ##END=
$$ 
$$ hash MD5
$$ FB 71 E3 67 83 32 36 EB 78 66 61 54 62 AF 9B 95
##$RELAX= 
##$RELAX= 
##$RELAX= 
##$RELAX= 
##$RELAX= 
##$RELAX= 
##$RELAX= 
$$ Bruker specific parameters
$$ --------------------------
##$DU= <C:\u>
##$EXPNO= 850
##$NAME= <ADRS>
##$PROCNO= 1
##$TYPE= <nmr>
##$USER= <dgb>
##$AMP= (0..31)
100 100 100 100 100 100 100 100 100 100 100 100 100 100 100 100 100 100 
100 100 100 100 100 100 100 100 100 100 100 100 100 100 
##$AQSEQ= 0
##$AQ_mod= 3
##$AUNM= <au_zg>
##$AUTOPOS= <5 >
##$BF1= 250.13
##$BF2= 250.13
##$BF3= 250.13
##$BF4= 250.13
##$BF5= 500.13
##$BF6= 500.13
##$BF7= 500.13
##$BF8= 500.13
##$BYTORDA= 1
##$CFDGTYP= 0
##$CFRGTYP= 5
##$CHEMSTR= <none>
##$CNST= (0..31)
1 1 145 1 1 1 1 1 1 1 1 1 1 1 1 1 1 1 1 1 1 1 1 1 1 1 1 1 1 1 1 1 
##$CPDPRG= <>
##$CPDPRG1= <>
##$CPDPRG2= <>
##$CPDPRG3= <>
##$CPDPRG4= <mlev>
##$CPDPRG5= <mlev>
##$CPDPRG6= <mlev>
##$CPDPRG7= <mlev>
##$CPDPRG8= <mlev>
##$CPDPRGB= <>
##$CPDPRGT= <>
##$D= (0..31)
0 1 0 0 0 0 0 0 0 0.06 0 0 0 0 0 0 0.0002 0 0 0 0 0 0 0 0 0 0 0 0 0 0 
0 
##$DATE= 1178872074
##$DBL= (0..7)
120 120 120 120 120 120 120 120 
##$DBP= (0..7)
150 150 150 150 150 150 150 150 
##$DBP07= 0
##$DBPNAM0= <>
##$DBPNAM1= <>
$$ [...]
##$SUBNAM7= <"">
##$SUBNAM8= <"">
##$SUBNAM9= <"">
##$SW= 20.6930455092707
##$SWIBOX= (0..15)
0 0 3 0 0 0 0 0 0 0 0 0 0 0 0 0 
##$SW_h= 5175.983436853
##$TD= 65536
##$TD0= 1
##$TE= 683.16
##$TE2= 300
##$TE3= 300
##$TEG= 300
##$TL= (0..7)
0 120 120 120 120 120 120 120 
##$TP= (0..7)
150 150 150 150 150 150 150 150 
##$TP07= 0
##$TPNAME0= <>
##$TPNAME1= <>
##$TPNAME2= <>
##$TPNAME3= <>
##$TPNAME4= <>
##$TPNAME5= <>
##$TPNAME6= <>
##$TPNAME7= <>
##$TPOAL= (0..7)
0.5 0.5 0.5 0.5 0.5 0.5 0.5 0.5 
##$TPOFFS= (0..7)
0 0 0 0 0 0 0 0 
##$TUNHIN= 0
##$TUNHOUT= 0
##$TUNXOUT= 0
##$USERA1= <user>
##$USERA2= <user>
##$USERA3= <user>
##$USERA4= <user>
##$USERA5= <user>
##$V9= 5
##$VALIST= <valist>
##$VCLIST= <CCCCCCCCCCCCCCC>
##$VD= 0
##$VDLIST= <DDDDDDDDDDDDDDD>
##$VPLIST= <PPPPPPPPPPPPPPP>
##$VTLIST= <TTTTTTTTTTTTTTT>
##$WBST= 1024
##$WBSW= 4
##$XGAIN= (0..3)
0 0 0 0 
##$XL= 0
##$YL= 0
##$YMAX_a= 372462
##$YMIN_a= -215707
##$ZGOPTNS= <>
##$ZL1= 120
##$ZL2= 120
##$ZL3= 120
##$ZL4= 120
##$ABSF1= 16.522
##$ABSF2= -4.171173
##$ABSG= 5
##$ABSL= 3
##$ALPHA= 0
##$AQORDER= 0
##$ASSFAC= 0
##$ASSFACI= 0
##$ASSFACX= 0
##$ASSWID= 0
##$AUNMP= <proc_1d>
##$AZFE= 0.1
##$AZFW= 0.1
##$BCFW= 0
##$BC_mod= 0
##$BYTORDP= 0
##$COROFFS= 0
##$CY= 12.5
##$DATMOD= 1
##$DC= 0
##$DFILT= <>
##$DTYPP= 0
##$F1P= 14.0000005364418
##$F2P= -0.99999901652339
##$FCOR= 0.5
##$FTSIZE= 32768
##$FT_mod= 6
##$GAMMA= 0
##$GB= 0
##$INTBC= 1
##$INTSCL= 1
##$ISEN= 128
##$LB= 0.3
##$LEV0= 0
##$LPBIN= 0
##$MAXI= 10000
##$MC2= 0
##$MEAN= 0
##$ME_mod= 0
##$MI= 0
##$NCOEF= 0
##$NC_proc= -5
##$NLEV= 6
##$NOISF1= 0
##$NOISF2= 0
##$NSP= 0
##$NTH_PI= 0
##$NZP= 0
##$OFFSET= 16.522
##$PC= 1
##$PHC0= -68.03999
##$PHC1= 13.86942
##$PH_mod= 1
##$PKNL= yes
##$PPARMOD= 0
##$PSCAL= 4
##$PSIGN= 0
##$REVERSE= no
##$SF= 250.13
##$SI= 32768
##$SIGF1= 0
##$SIGF2= 0
##$SINO= 400
##$SIOLD= 32768
##$SREGLST= <1H.DMSO>
##$SSB= 0
##$STSI= 32768
##$STSR= 0
##$SW_p= 5175.98343685301
##$SYMM= 0
##$S_DEV= 0
##$TDeff= 65536
##$TDoff= 0
##$TI= <Analysis number 999999
Compound Code 99
Book Reference 9
Project Code 9>
##$TILT= no
##$TM1= 0
##$TM2= 0
##$TOPLEV= 0
##$USERP1= <user>
##$USERP2= <user>
##$USERP3= <user>
##$USERP4= <user>
##$USERP5= <user>
##$WDW= 1
##$XDIM= 32768
##$YMAX_p= 359973158
##$YMIN_p= -439846
$$ End of Bruker specific parameters
$$ ---------------------------------
##NTUPLES= NMR SPECTRUM
##VAR_NAME=  FREQUENCY,     SPECTRUM/REAL,   SPECTRUM/IMAG
##SYMBOL=    X,             R,               I
##VAR_TYPE=  INDEPENDENT,   DEPENDENT,       DEPENDENT
##VAR_FORM=  AFFN,          ASDF,            ASDF
##VAR_DIM=   32768,         32768,           32768
##UNITS=     HZ,            ARBITRARY UNITS, ARBITRARY UNITS
##FACTOR=    0.157963299565203, 1,           1
##FIRST=     4132.6476996994, 0,             0
##LAST=      -1043.33573715361, 0,           0
##MIN=       -1043.33573715361, -439846,     0
##MAX=       4132.6476996994, 359973158,     0
$$ Real data points
##PAGE= N=1
##DATA TABLE= (X++(R..R)), XYDATA
$$ [...]
24717A71750l198K4089j12709j10213J0546N7167Q3020m1162j34446O4070O137
24706A5051n4657m3042Q4849P7609o1257l7558J9325m2114K5154n767k7418n8847
24694a08672L7561J02886k6722K6907k9747R909j6801n1982l3929l301L8695O5516
24682A0320K5018K8807j6584Q136r6170o1925Q4034J10306R9352k4416j41226
24671B5652n3227J3721Q626K9036O743j17944o2925P2873P5151k6133m820k8499
24659f1746o3945p235N0290m5477k0076J20263R2875m5889j19016R0097Q9835
24648G9976J6893q361j7534m4019K6982o2976L5790L2820L6364j7230M9404j8627
24636A09482n1500j46510m851K5173J07892K578J38O1040J1494q0092k141j1616
$$ plain form
24717 171750 168552 192641 79932 -30281 -19735 37432 120452 79290 -55156 8914 15051
24706 15051 -39606 -82648 2201 79810 18553 -19005 320 -41794 -16640 -22407 -49825 -108672
24694 -108672 -71111 31775 5053 31960 2213 12122 -4679 -56661 -90590 -93891 -55196 10320
24682 10320 35338 64145 47561 55697 -40473 -102398 -18364 91942 191294 166878 25652
24671 25652 -27575 -13854 -5228 23808 30551 -87393 -150318 -77445 -2294 -28427 -33247 -61746
24659 -61746 -125691 -132926 -82636 -128113 -148189 -27926 64949 19060 -99956 -9859 79976
24648 79976 96869 88508 70974 26955 53937 -9039 26751 59571 95935 78705 128109 109482
24636 109482 57982 -88528 -93379 -68206 39686 42264 42402 103442 114936 34844 32703 21087
24624B1087j788r261m9529p1314j2340N4660J76185R5931j17787o1011K7009j0539
24612D1303k1809P5241o5847r8406j2440J04518j091K381M0871q4276j22291l7047
24600a78893P5996K1650k9234l4745L3N1565J7217q125K7485m6366L7981K1647
24588d3789K8137l8117l9854N022p0457l9724R4779K6111n8716J09336k2501J8328
24576c1445N5403j6988p0834r363L2083m8421p9784N6864r949M9171J19354k6898
24564A9193r2131L1243L2719L4586N6685p888n6455Q6679L9341n3808k5006l6017
24552B9141q067n5819K316R4753O8413m6024j28860l213K6952q361M9363M0126
24540F0720J6497j07335j0471l6554j04749J11196L1047J3977J8755l9495O0785
$$ plain form
24624 21087 19299 10038 -39491 -110805 -123145 -68485 107700 203631 85844 24833 51842 41303
24612 41303 19494 94735 28888 -69518 -81958 22560 21469 23850 64721 -19555 -141846 -178893
24600 -178893 -102897 -81247 -110481 -145226 -145193 -93628 -76411 -84536 -57051 -103417 -65436 -43789
24588 -43789 -15652 -53769 -93623 -88601 -159058 -198782 -104003 -77892 -136608 -27272 -49773 -31445
24576 -31445 23958 6970 -63864 -73227 -41144 -89565 -169349 -112485 -122434 -73263 46091 19193
24564 19193 -72938 -41695 -8976 25610 82295 74407 17952 104631 143972 90164 65158 29141
24552 29141 21074 -34745 -32429 62324 130737 84713 -44147 -47360 -20408 -28769 20594 60720
24540 60720 77217 -30118 -40589 -77143 -181892 -70696 -39649 -25672 -6917 -46412 14373
24529A4373L495n7555O4519l6822n2686M909m7663j74705J13920L7601J2301J09420
24517h893J2799K2705j1740k6982l9795l5357M1657l8208m9188M7064Q1955k1966
24505b5949k7759l025r654M4297L5201K9207j1678R1786J45124j4616k0341N957
24493B38550l3892j47508j26817j8864N7779o6865N2005Q2812q0337J10768K8597
24482I6228m6763p1636O5209q0355O650M8481r9125J3184J05438K1187q03K8844
24470H6539n72l4573j9819J2951j26747m5654Q8333Q9576J9654j01615P3121l2385
24458H809j2581L1380M755j03879J211K6316o5285k3520P7077L4448n2766r779
24446h3814n2801m4656K7287J8290N4551J1560k3208J3574Q6716P4417j2468j78827
$$ plain form
24529 14373 17868 -39687 24832 -11990 -64676 -59767 -107430 -282135 -168215 -130614 -118313 -8893
24517 -8893 3906 26611 14871 -12111 -51906 -87263 -45606 -83814 -133002 -85938 -3983 -25949
24505 -25949 -53708 -56733 -66387 -22090 13111 42318 30640 122426 267550 252934 232593 238550
24493 238550 204658 57150 -69667 -88531 -30752 -97617 -45612 37200 -43137 67631 96228
24482 96228 49465 -22171 43038 -37317 -30667 17814 -81311 -68127 37311 58498 57695 86539
24470 86539 85967 51394 31575 44526 -82221 -127875 -39542 50034 69688 -31927 41194 8809
24458 8809 -3772 27608 32363 -71516 -70305 -43989 -109274 -132794 -55717 -21269 -74035 -83814
24446 -83814 -136615 -181271 -153984 -135694 -81143 -69583 -92791 -79217 7499 81916 69448 -109379
24434a09379j16938J09233P7118j29837K059Q6646l1296M6677J20360N839n3757
24423F725L5776M4873m8984m0710P3178j9968k8280L7228r7980P6858P6822k3970
24411I1568p8661j1365m2412n181L7229J1825N165m5212m6666n7547J47469k3312
24399a7100p6372p4697M1557N6503M7886m7613J08683K7596o3248K5264m2716
24388a4257j4016K7712q5147J4057M0751m7332O6572k063q1703P4800J36964Q42
24376A17180m5180M2618q8034q1366o9499k3736j0541p6843j3349Q4291P2566
24365i1893K2887M1393r0278j69069j2931J00989R7847J21652N1507k1751k2075
24354B8278r817n650j13366R5978K2658K7521J17617k345n6708O6239k7731j16381
$$ plain form
24434 -109379 -226317 -117084 -39966 -169803 -167744 -81098 -112394 -65717 54643 60482 6725
24423 6725 42501 87374 38390 -2320 70858 50890 22610 59838 -38142 38716 115538 91568
24411 91568 12907 1542 -40870 -46051 -8822 3003 8168 -37044 -83710 -141257 6212 -17100
24399 -17100 -93472 -168169 -126612 -70109 -22223 -69836 38847 66443 3195 28459 -14257
24388 -14257 -28273 -561 -85708 -71651 -30900 -78232 -11660 -13723 -95426 -20626 116338 117180
24376 117180 72000 114618 26584 -54782 -124281 -148017 -158558 -235401 -248750 -164459 -91893
24365 -91893 -69006 -27613 -117891 -286960 -299891 -198902 -101055 20597 72104 50353 28278
24354 28278 18461 12811 -100555 -4577 18081 45602 163219 160874 104166 170405 142674 26293
24342B6293j45847q9535R7798N1331R3143J2052L9027m1878n0476J32871k2516
24331A02263j40589o4139L9024J27078R2665j81745j49616J6718j8239l6133J11328
24320a01385R5470M6216j15899P6847O0213j6630j24905K0664l1017j3918N0951
24309e3393Q6753K9077r4465k0954l4639j8635N7348k8898J7972l795J05568O5195
24297A07134o9562l3508j18181K8233J9537j31095o750K6208J07442Q4207p7344
24286f3679l0538o7386j17247P6169J29410O3233J06616K1740j36139o4228R0721
24275H672R0172l8244k3578N5547L2696n098K190J2563l1411k3073K8990k1082
24263H8344n9512q2320o3629k0625O1402r301K5834j17547m882R7393Q099n4654
$$ plain form
24342 26293 -119554 -209089 -111291 -59960 33183 45235 84262 42384 -8092 124779 102263
24331 102263 -38326 -102465 -63441 63637 156302 -25443 -175059 -158341 -176580 -212713 -101385
24320 -101385 -5915 40301 -75598 1249 61462 44832 -80073 -59409 -90426 -104344 -53393
24309 -53393 33360 62437 -32028 -52982 -87621 -106256 -48908 -77806 -59834 -63629 41939 107134
24297 107134 37572 4064 -114117 -85884 -66347 -197442 -204192 -177984 -70542 13665 -63679
24286 -63679 -94217 -161603 -278850 -202681 -73271 -10038 96578 118318 -17821 -82049 8672
24275 8672 98844 60600 37022 92569 125265 120167 122357 134920 103509 80436 109426 88344
24263 88344 28832 -53488 -117117 -137742 -76340 -85641 -59807 -177354 -182236 -84843 -76744 -131398
24251a31398Q0616L3320K0126L680p6482K210k8050K4679N7897k5568p2066j8650
24239a29686L9613l7543k5325J19766M5234L0308J4243P4117n3159r9964L1869
24228I473P6712L1112J3663l8035p3937n1042P8562P0628J8594l427j52303j7259
24216c7259Q2568J2450l2728n0169l5783l6509j4266R295j0858N2503J8379O6084
24204B3707j8211q0973j9241K137j8838M1795K9604J00187O2119O1571j37720
24193D6137p6903J1264K9895N6674P8181J15484n6386j20447o7289J8606j0139
24182B5077R2306o0747j04415K5777o4948m51O9889l0474l1333Q58n82j1319M690
24169h5672L9544K6218j3577J9072L5568K0371k7319J0445l3696L4599L5169k0397
$$ plain form
24251 -131398 -50782 -17462 2664 6344 -70138 -67928 -95978 -71299 -13402 -38970 -111036 -129686
24239 -129686 -90073 -127616 -152941 -33175 12059 42367 56610 130727 77568 -22396 9473
24228 9473 86185 117297 130960 92925 18988 -32054 46508 117136 135730 132303 -20000 -37259
24216 -37259 45309 57759 25031 -25138 -60921 -97430 -111696 -102401 -113259 -60756 -42377 23707
24204 23707 5496 -75477 -94718 -92581 -111419 -69624 -40020 60167 122286 183857 46137
24193 46137 -30766 -19502 10393 67067 145248 260732 204346 83899 16610 35216 25077
24182 25077 117383 56636 -47779 -22002 -86950 -87401 -17512 -47986 -79319 -78461 -79043 -90362 -85672
24169 -85672 -46128 -19910 -33487 -14415 21153 41524 14205 24650 -9046 25553 60722 40325
24157D0325p5017j8786r1954j9011Q8916K6751j29596n1476J10764J01096L1229
24146A3241M966L7902L7748P9467p5279j77658j11689p8591N8755M1542J03657
24135f5939M4577k3671k2847m177L5313N4905p315n6863M2450R5168J8482l4992
24123G5091q676r3021o4244M5125J00461K7643p4624N9396m7753j06481j4009
24112a01092P732N6189J8357q6111Q9868M5664j4127N80k3726j1430q9240k8688
24100a36024N8927R051J4908L5217R6400P5796o9120l9682L4658j760o7303j2857
24088a789p3014L7178n1786J8378j8200p0770j4794P1886N6022q7061N249O4030
24076f4671J2315K2280Q833q1692P4799N4118L5827n3565J7102J8840o7903l9153
$$ plain form
24157 40325 -34692 -53478 -145432 -164443 -75527 -48776 -178372 -229848 -119084 -17988 13241
24146 13241 18207 56109 93857 173324 98045 -79613 -191302 -269893 -211138 -169596 -65939
24135 -65939 -21362 -45033 -67880 -72057 -36744 18161 10846 -46017 -3567 91601 110083 75091
24123 75091 66415 -26606 -90850 -45725 54736 82379 7755 67151 19398 -87083 -101092
24112 -101092 -93360 -37171 -18814 -104925 -15057 30607 16480 17060 -6666 -18096 -107336 -136024
24100 -136024 -77097 -68046 -53138 -17921 78479 154275 85155 45473 80131 78371 11068 -1789
24088 -1789 -74803 -37625 -89411 -71033 -89233 -160003 -174797 -102911 -46889 -133950 -128701 -64671
24076 -64671 -52356 -30076 -21243 -102935 -28136 25982 61809 8244 25346 44186 -23717 -62870
24064f2870L8274J25234N6941K8920j41927j47142N0678L4518K4806J7753j08463
24053h3278q0587L2272P1703O1859K8366n7717p5726m2453k2866O9315Q268M3901
24041d6943K536J6994r2688m1729k069P4016K9271k3918L364l1257l5858J31390
24029a6891Q2533J5007m9084q7032m6005l3967O1659L7739q1078l6739o3921P7570
24017a40209J09935J6250K3158N8061m2483r5115K891O0593K4023n906o3020N3800
24005A978m2397p6834n8884l446O3959P9819O3759L9734K5739q6911q7619j30648
23993b11751J17933R5409k5438Q2708O762L4673n5156k9709j1713R620p981o6810
23981f1453j1733P2413N9898m011o4418l3918N7763k1903J1223q3328r0640P1117
$$ plain form
24064 -62870 -24596 100638 157579 186499 44572 -102570 -51892 -17374 7432 25185 -83278
24053 -83278 -163865 -131593 -59890 1969 30335 -27382 -103108 -145561 -168427 -99112 -90844 -46943
24041 -46943 -44407 -27413 -120101 -161830 -163899 -89883 -60612 -84530 -81166 -112423 -148281 -16891
24029 -16891 65642 80649 31565 -55467 -101472 -135439 -73780 -36041 -117119 -153858 -217779 -140209
24017 -140209 -30274 -14024 9134 67195 24712 -70403 -67512 -6919 17104 11198 -51822 1978
24005 1978 -40419 -117253 -176137 -179583 -115624 -35805 27954 67688 93427 6516 -81103 -211751
23993 -211751 -93818 1591 -23847 58861 65623 100296 45140 15431 3718 13338 5357 -61453
23981 -61453 -73186 -773 59125 55114 -9304 -43222 14541 -7362 3861 -79467 -170107 -98990
23969i8990J39926j3812n7450l6772L889J14712N6235P7784N5634r3656L565m3321
23957A07744n1582j09085J11039n155L0762j8153m722n5713j3161j4196N6890
23946C4668o0660L8295M5527j9110L2585O5428k5422K766j8457m5571N2663N0368
23934A53080q5334j13643j2014L8818J2630K5289R202M5089M2798k2613o6013
23923B7289j42088j7119M1749l9278M6661M3528m1488L0558k549q7806l558J900
23911a42201L3185j28423m6131P4950J61774J73089j00582j95159q9749P6381
23901a82866L6371L8989q5510J1767R7463P296j5435j13434O2471L4984K1347
23890h6557p8955j32304n6975J37693P3115L3781j44742J5238J40309p2787K9298
$$ plain form
23969 -98990 40936 27124 -30326 -67098 -63209 51503 107738 185522 241156 147500 151065 107744
23957 107744 56162 -52923 58116 52961 83723 65570 60848 5135 -8026 -22222 34668
23946 34668 -25992 12303 57830 38720 71305 136733 111311 114077 95620 50049 102712 153080
23934 153080 67746 -45897 -57911 -19093 -6463 18826 28028 73117 115915 93302 27289
23923 27289 -114799 -131918 -90169 -129447 -82786 -39258 -80746 -50188 -52737 -140543 -144101 -142201
23911 -142201 -109016 -237439 -283570 -208620 -46846 126243 25661 -169498 -259247 -182866
23901 -182866 -146495 -107506 -193016 -181249 -83786 -76490 -91925 -205359 -142888 -107904 -86557
23890 -86557 -165512 -297816 -354791 -217098 -143983 -110202 -254944 -239706 -99397 -172184 -142886
23879a42886Q4866P6912J01975l5868L821M0769J3063j35172O1963j3799o136
23868D9508O0720q8429r3524O7186L4339M7806p0317m8144M233m67k8802o7157
23856a33048n485J5857k1424r820n1940N2906P4374J7488K9764Q1222j8673n3304
23844b2083r6706j3691M5724n0460L2150N8787L4711K9047r012J7442n0843j5846
23832d0780M6472J10325r7395n7726J7579L7520R6757K0697n0984o3172k2928
23821c635j41457o9444J17496R9604n8416M2389m0698m0377Q1713r9532K2224
23810i0133Q3142N0728Q2277q9087r2637o714L1856J4393N8995k0476o4358q9098
23798a31112k002N496Q16M3553K3102J356J1333j22M1087p6657o2673J03628k7132
$$ plain form
23879 -142886 -58020 18892 120867 84999 88820 129589 142652 7480 69443 55644 49508
23868 49508 110228 21799 -71725 -4539 29800 77606 7289 -40855 -36622 -37089 -65891 -133048
23856 -133048 -138533 -122676 -144100 -153920 -205860 -152954 -78580 -61092 -31328 49894 31221 -22083
23844 -22083 -118789 -132480 -86756 -137216 -105066 -46279 -11568 17479 8467 25909 -24934 -40780
23832 -40780 5692 116017 18622 -39104 -21525 15995 112752 133449 82465 19293 -3635
23821 -3635 -145092 -214536 -97040 2564 -55852 -13463 -54161 -94538 -12825 -112357 -90133
23810 -90133 -6991 43737 126014 36927 -55710 -62424 -30568 -16175 42820 22344 -42014 -131112
23798 -131112 -133114 -127618 -126802 -83249 -60147 -58791 -47458 -47580 -6493 -83150 -145823 -42195 -69327
23785f9327p3083J059J4588m144K6348J80321k2646n7715j061P3541n6274j3678
23773b071Q870l623k4609j1790N1146k0263r934N2509Q478J2844J4362K6584j01873
23760F30q5628o3435K047o5070R125J03548P157j1440j8185L1675n888k9071m5561
23747a70096j7457J34088R1017J5415n7794j00964O9629J45882r1947q8090R1536
23736B1219q182N7093m4089j2319j04456K8491P9177l190o5240K2450M1118N9256
23724G1328M4498N027o6537n8487j64626n1375J7735K2023P2373J08000P2068
23713G2027M0154k1082l9370L4668J05337o9824j40911n4125P6080J1426n6906
23702d2526J3026M1230N1121K1431n0452l5929n2727q1991O3547Q4044M7241J6024
$$ plain form
23785 -69327 -142410 -141351 -126763 -130907 -104559 75762 53116 -4599 -5660 67881 11607 -2071
23773 -2071 6799 3176 -21433 -33223 17923 -2340 -12274 40235 48713 61557 75919 102503 630
23760 630 -84998 -148433 -146386 -211456 -202331 -98783 -91626 -103066 -121251 -89576 -95464 -124535 -170096
23747 -170096 -187553 -53465 37552 52967 -4827 -105791 -36162 109720 17773 -70317 21219
23736 21219 13037 70130 26041 13722 -90734 -62243 16934 13744 -51496 -29046 12072 71328
23724 71328 115826 120853 54316 -4171 -168797 -220172 -202437 -180414 -108041 -41 72027
23713 72027 112181 91099 51729 86397 191734 121910 -19001 -73126 2954 14380 -42526
23702 -42526 -29500 11730 62851 84282 33830 -2099 -54826 -136817 -73270 10774 58015 74039
23690G4039J9013k3423L1930k6116o3854L030L6279r2837j8588J50854J2735n188
23678I7874N272j864j18496o5944K3854N6827L3912n0010j0375j4991O3870O3329
23666H3258M955P1457n5615q2692K622j9334r1517j1213K2268m3285L8221j03599
23654a84474j1384L2225l3660J11019J15716L7540r4621j01308l9720J47280J91481
23643A70094q3897r0951k289L8644l3946j4410q9103j00452J5190J23850J55777
23632H8507J03151O1922N757j52587m3472k5088p0551j11498J830P2976j6927
23621h5980N4349R1104j0493Q567m1819o6736L643m4563q6841n2837M4836n8258
23609b45028K7990K4731M4526J7331m74Q0862J7217N2596k7429j12017M0787Q9766
$$ plain form
23690 74039 93052 69629 101559 75443 11589 14619 50898 -41939 -60527 90327 103062 97874
23678 97874 103146 101282 -17214 -83158 -59304 -2477 31435 -18575 -28950 -43941 19929 83258
23666 83258 88213 159670 104055 21363 23985 4651 -86866 -98079 -75811 -119096 -80875 -184474
23654 -184474 -195858 -163633 -197293 -86274 29442 66982 -27639 -128947 -168667 -21387 170094
23643 170094 86197 -4754 -7043 31601 -2345 -16755 -105858 -206310 -191120 -67270 88507
23632 88507 191658 253580 259337 106750 63278 38190 -32361 -143859 -142029 -69053 -85980
23621 -85980 -31631 59473 48980 57547 15728 -51008 -47365 -91928 -178769 -231606 -186770 -245028
23609 -245028 -217038 -192307 -147781 -130450 -130924 -50062 -32845 19751 -7678 -119695 -78908 10858
23597A0858j3060l8517R2482Q000j25962m4959k9088m5544o2894J8372Q4380l5724
23585a81656O7965p9124r0019L5745J87827M3789k2536k0545m7537L4127K5863
23574d6101M3980J20807j2129m3696l8860o5588K3270J36015m9087j27461m7063
23563a05913P4853M324q0901L1164Q9651K4019J9807o1950Q020J5584l839J8931
23551C3750k4157j53588n9226R656l5250K4814L0132L6552N5153N4427L5200K6017
23539C3480k278k2998n1836P0053J07678j29095j20374K7329j22831l974J52941
23528f1905K7854N589Q8411K8643l1076J2561O3311o9854n2087m8950j2726J4610
23516c5619J222J7454q6017j0304K6985j19169j7639O9060P1950q6191r9752J05691
$$ plain form
23597 10858 -2202 -40719 51763 59763 -66199 -111158 -140246 -185790 -248684 -230312 -145932 -181656
23585 -181656 -113691 -192815 -282834 -247089 -59262 -15473 -38009 -58554 -106091 -71964 -46101
23574 -46101 -2121 118686 106557 62861 24001 -41587 -18317 117698 68611 -58850 -105913
23563 -105913 -31060 -26736 -107637 -76473 13178 37197 57004 -4946 3074 18658 14819 33750
23551 33750 9593 -143995 -203221 -193565 -228815 -204001 -173869 -137317 -82164 -27737 7463 33480
23539 33480 31202 8204 -43632 26421 134099 5004 -115370 -88041 -210872 -214846 -61905
23528 -61905 -34051 -28462 59949 88592 57516 70077 133388 63534 11447 -37503 -50229 -35619
23516 -35619 -34397 -16943 -102960 -113264 -86279 -205448 -223087 -154027 -82077 -168268 -268020 -162329
23504a62329J02576M0414N0614M381O8892l1361r206q0172o0540l5063n84Q1437
23492c0941L9068Q062j04098K1328J94659M4688l8952k7724M1486j2348p6023
23481E9205q2592j10562J24580Q8782q549n6153l1405p5793R2405M5125N3149
23470I8192J20428m0967j08546j54184q3907J0831l5575J25896J7736K714o202
23459e3584n7548n454L672J1888J3670R117J9062k9730J10469J501j7683q0637
23447g5257m6138L7649N5019N8593l4160j33916M7604P3325K5419m7947n0378
23436i0187n6811M4871M5036j2817k0184p7442K919J13672J2262j497N8976R851
23424B8649L2297j1738m9089m9237n8035p4483j5554j1012P2094J03324j8256
$$ plain form
23504 -162329 -59753 -19339 31275 35656 104548 73187 63981 -16191 -76731 -111794 -112378 -30941
23492 -30941 8127 16189 -87909 -66581 128078 172766 133814 106090 147576 135228 59205
23481 59205 -23387 -133949 -9369 79413 70864 14711 -16694 -92487 -82 45043 98192
23470 98192 218620 177653 69107 -85077 -168984 -158153 -193728 -67832 -50096 -47382 -53584
23459 -53584 -111132 -116586 -112914 -101026 -87356 -78239 -59177 -88907 21562 23063 5380 -75257
23447 -75257 -121395 -83746 -28727 29866 -4294 -138210 -90606 -17281 8138 -39809 -90187
23436 -90187 -146998 -102127 -57091 -69908 -90092 -167534 -164615 -50943 -38681 -40178 18798 28649
23424 28649 60946 49208 119 -49118 -107153 -181636 -197190 -208202 -136108 -32784 -51040
23413e1040P6699M5597m3764L2198L5125k4440l5694l1007n7640M9057P1404N14
23401F7009j88046j00440O7686M2395P623O3482M0610j9505j02666P2210J25482
23390G5840O9749Q855l6117j31647p0334o0136j0585j0486P2577J15493Q9535
23379A12744p1446j5746M7675l9852J7733m4706q3803L5382J17458o9733j45502
23368a39796O2183P1370r103L860k0517n2639k6286J35425j318j71262l7353K31575
23356D6139M5961p5740m1573n4311p9626M835J16295J0382J9406j43701j40462
23345b92395N2532R3589J0316L173O7362K819R510p9818K4175Q2680L0487L382
23333G812j07220K5414J04768M040K474k4204j0805r7647m7852K831L0292M876
$$ plain form
23413 -51040 25659 71256 27492 59690 94815 70375 34681 3674 -53966 -4909 66495 67009
23401 67009 -121037 -221477 -153791 -111396 -103773 -40291 319 -19186 -121852 -49642 75840
23390 75840 145589 154444 118327 -13320 -83654 -143790 -154375 -164861 -92284 23209 112744
23379 112744 41298 25552 73227 33375 51108 6402 -77401 -42019 75439 5706 -139796
23368 -139796 -77613 -6243 -15346 -11486 -32003 -84642 -110928 24497 23179 -148083 -185436 46139
23356 46139 92100 16360 -25213 -79524 -159150 -154315 -38020 -27638 -8232 -151933 -292395
23345 -292395 -239863 -146274 -135958 -132785 -65423 -62604 -53094 -132912 -108737 -26057 4430 7812
23333 7812 -99408 -73994 30774 34814 37288 13084 2279 -95368 -143220 -140389 -110097 -105221
23321a05221k5624P8830R2892M8274o7969O4727O7587j7702k5900J5017r1584
23310C3327r5662j7811Q4117l0437j7477O1516r6665m2277N8305J7669r5033n2360
23298a92788J09017Q2311N3199P2594l760j30044j29568M7641N7707j1117j0003
23287e4811K8836l119M4152J7307L0415L355L796J1288Q8586R0680n3404p4431
23275A32650n7496j32592j01656J26995L3153m6062r1983M212q5461n2612J60980
23264a09872M4200J4657Q26k9208o881l1807l1020N6779N1563J9576P5529L9262
23252I3604r2287N3137j7794J3280n6568o2411j8161J17874M0646k3339k9493
23241A8488k7113n6224l4032N2496k0498j13095J7868P0710J02683n3484K0524
$$ plain form
23321 -105221 -130845 -52015 40877 89151 21182 85909 153496 135794 109894 124911 33327
23310 33327 -62335 -80146 3971 -26466 -43943 17573 -79092 -121369 -63064 -45395 -140428 -192788
23298 -192788 -83771 -1460 51739 124333 120573 -9471 -139039 -91398 -33691 -44808 -54811
23287 -54811 -25975 -29094 15058 32365 62780 66135 69931 81219 169805 260485 207081 132650
23275 132650 75154 -57438 -159094 -32099 1054 -45008 -136991 -132779 -218240 -270852 -109872
23264 -109872 -65672 -51015 -50189 -79397 -86278 -118085 -149105 -92326 -40763 -21187 54342 93604
23252 93604 1317 54454 36660 49940 -6628 -69039 -87200 30674 71320 47981 18488
23241 18488 -8625 -64849 -98881 -46385 -66883 -179978 -162110 -91400 11283 -42201 -21677
23230b1677n6969m4385L0847r087n5451J07714o9440q9010O4661L8850n7373k8533
23218a89853M5256J13415j144k3456P3859j112m49M0603p3308l3946L0264L4691
23206A4820O735O936O6591Q8609N8503o8056k6307l1915k377j5222m1830N1795
23194A08282L9461j33329j6394N9286j4605P4339O2214j44882n7675j5231j789
23183d0323R078n0562l8338q8202O5558O1354P4456m807k9323L8719R634r711
23171b467n1442k4136l6271J0108p973N3760R2099K1766m8884j2576J06110o170
23159I3924m8980K3720N9027M3925o2114J4539n4384l0525r5648p2499N605L1521
23147i1889l2709p4137Q4344N7173O1061K7595L0641o7554j36284O0956o5280
$$ plain form
23230 -21677 -78646 -123031 -92184 -101271 -156722 -49008 -118448 -207458 -142797 -103947 -161320 -189853
23218 -189853 -144597 -31182 -32326 -55782 18077 16965 16516 57119 -16189 -50135 -19871 14820
23206 14820 21555 28491 95082 183691 242194 174138 147831 115916 113539 98317 56487 108282
23194 108282 147743 14414 -1980 57306 42701 117040 179254 34372 -23303 -38534 -40323
23183 -40323 -31245 -81807 -120145 -208347 -142789 -81435 -6979 -11786 -41109 -2390 7244 -2467
23171 -2467 -53909 -78045 -114316 -104208 -112181 -58421 33678 55444 6560 -6016 100094 93924
23159 93924 44944 68664 127691 171616 109502 124041 69657 39132 -56516 -129015 -123410 -91889
23147 -91889 -124598 -198735 -114391 -57218 3843 31438 62079 -5475 -141759 -80803 -146083
23136a46083o691N1833o941R0316O1485l3740N0041N7561r9320K930L1983N7318
23124A10692n2549j02339m7741K2995K7419l9241J08226J9005j15765k3401m6844
23113a39543j21482O9173J11763J1909K6969m2621r496L9618m465Q9828J15689
23102A47342p9475j28748l2420p6490n2800M9834Q0780N2413J07839n4402p2844
23091e8971K9408l1739m3637L9595m4315M6987n916J4773N8253L8746j0107j19297
23079h6220O3658N0672j3517o6984o1300K385K9279R4728L8886L0008M9243M4930
23067A75768K475r5689j15437N962L8377J20069j35121j02188j9328J19833J3423
23056H144L655M0659j415o7408o5916k9756k189M7594k0218j1678j0496P9855
$$ plain form
23136 -146083 -152774 -100941 -107882 -17566 43919 10179 60220 117781 18461 21391 53374 110692
23124 110692 58143 -44196 -91937 -68942 -41523 -80764 27462 46467 -69298 -92699 -139543
23113 -139543 -261025 -191852 -80089 -68180 -41211 -83832 -93328 -53710 -58175 31653 147342
23102 147342 67867 -60881 -93301 -169791 -222591 -172757 -91977 -39564 68275 13873 -58971
23091 -58971 -29563 -61302 -104939 -65344 -109659 -62672 -68588 -53815 4438 43184 33077 -86220
23079 -86220 -22562 28110 14593 -52391 -113691 -111306 -82027 12701 51587 81595 130838 175768
23067 175768 178243 82554 -32883 -26921 11456 131525 -3596 -105784 -125112 -5279 8144
23056 8144 11799 52458 51043 -16365 -82281 -112037 -114226 -66632 -86850 -98528 -109024 -29169
23044b9169k7881k9626N4087M5538N3184k1394j48784j7495L7405P15o3631j4853
23032a61904M0585k03426p4353R7676R2232J95360J08888p5077j74410p5541k0948
23021b50918N1555J11978O7023j8739K8109P7235l2431N4497k5998j67752p8979
23010a84420J1527L5809m9105o1226l8875P14K2252R9750M5169j9227M4518J7811
22998g5303P767K5457N3413J2649m2639r1211k3930M0453R2575N1799p267q8954
22986d5191m8653q2218q075K8811L0218p3792K6126J76665J48165m68p9761r003
22974F2824j89985o7557J38268L0225j03201n5816l6101P0370J37347o5568J0641
22963f8553J28390l8644N3457O8928j10507l0900J0082j6089J9758L6931O4422
$$ plain form
23044 -29169 -57050 -86676 -32589 12949 66133 44739 -104045 -121540 -84135 -83420 -147051 -161904
23032 -161904 -121319 -324745 -399098 -301422 -209190 -13830 95058 19981 -154429 -229970 -250918
23021 -250918 -199363 -87385 -20362 -39101 -10992 66243 33812 88309 62311 -105441 -184420
23010 -184420 -172893 -137084 -186189 -247415 -286290 -285576 -263324 -163574 -118405 -137632 -93114 -75303
22998 -75303 -67536 -42079 11334 23983 -18656 -109867 -133797 -93344 -769 51030 43763 -45191
22986 -45191 -93844 -176062 -184137 -155326 -125108 -198900 -172774 3891 152056 151588 71827 62824
22974 62824 -127161 -194718 -56450 -26225 -129426 -185242 -221343 -150973 -13626 -79194 -68553
22963 -68553 59837 21193 74650 143578 33071 2171 12253 -3836 15922 52853 117275
22952A17275p2317j71075l627m48j2678L5910J5354m200O518o0493K0057J0357
22940a19367k2069j6913n2711j2407O5531J42006p8907k5352n009k8416J01850
22929e1764J8127k6280N1142P77k0878L8098p2093m4825j44279j43673J36613
22918b59035J01495j5040K8951K3714N934l3284O402J04023Q8071j7284j1238
22907B2709o5685j18245Q0004J01766j4021o8952q860K0750j26966n6104r716
22896b43320J8254J50055K4056K2749o6622j19388L2525J10323n1817n5331k3149
22885b01665J17454N4320j1060J1612k3214q629p03j22037n1199q7488M1324P8101
22873b03184q185k8813q745R5691L1432K6800L3516K1265j01158l1578L5935P1814
$$ plain form
22952 117275 44958 -126117 -129744 -130192 -142870 -106960 -91606 -95806 -89288 -149781 -129724 -119367
22940 -119367 -141436 -158349 -211060 -223467 -157936 -15930 -94837 -120189 -125198 -153614 -51764
22929 -51764 -33637 -59917 -8775 -7998 -28876 9222 -62871 -107696 -251975 -395648 -259035
22918 -259035 -157540 -172580 -143629 -119915 -113981 -147265 -140863 -36840 51231 33947 22709
22907 22709 -42976 -161221 -81217 20549 6528 -62424 -71284 -50534 -177500 -233604 -243320
22896 -243320 -225066 -75011 -50955 -28206 -94828 -214216 -181691 -71368 -123185 -178516 -201665
22885 -201665 -84211 -29891 -40951 -29339 -52553 -61182 -61885 -183922 -235121 -322609 -281285 -203184
22873 -203184 -211369 -240182 -248927 -153236 -121804 -95004 -61488 -40223 -141381 -172959 -137024 -65210
22861f5210K3313J1648l7155j11219o2900N2765m8040l0338J28415J23892j9015
22850c3844M2759l2894K5751N1685m1779j07928p1783j3248Q4946J16566l7711
22839a7480o8067J6564K5327m3004L3820K7886K7233n0945p6594N2383P385n7845
22827a23337J977N3468P8644l6940n9905M3993K4192k3781o9086P0760J4170o9805
22815i5650n5344p3085j3061R256O6183J4998l2105J13630o609k7548O2156q390
22803d5569l9850n6743m4566O6343K2038q3065j08439M4407O6428P3617Q3408
22792b1991q939r3206P0303N410o0070l017k5937m2658q0477j7962J7286N5764
22780b05494O4687J45685l7321r1808P8542J36486k6053j33575r2437J4990P6247
$$ plain form
22861 -65210 -41897 -30249 -67404 -178623 -241523 -188758 -236798 -267136 -138721 -14829 -33844
22850 -33844 8915 -23979 1772 53457 11678 -96250 -168033 -181281 -96335 20231 -17480
22839 -17480 -85547 -68983 -43656 -86660 -52840 -24954 2279 -48666 -125260 -72877 -65492 -123337
22827 -123337 -121360 -67892 10752 -26188 -86093 -42100 -17908 -41689 -110775 -40015 -25845 -95650
22815 -95650 -150994 -224079 -237140 -227884 -161701 -146703 -178808 -65178 -71787 -99335 -37179 -45569
22803 -45569 -85419 -142162 -186728 -120385 -98347 -181412 -289851 -245444 -179016 -105399 -21991
22792 -21991 -30930 -124136 -53833 -48423 -108493 -111510 -137447 -180105 -260582 -278544 -261258 -205494
22780 -205494 -140807 4878 -32443 -124251 -45709 90777 64724 -68851 -161288 -146298 -70051
22769g0051j2339p0503q1011k2833J34759j2724o0584M4215M4483J1470o2134
22758a57252J3290K7824L0567M7914J42079J39082M8697L525j09874o3848j16319
22747E685o0935P4831L0920N039p7271r3888K5983K7638J03143l6466m4600l0484
22735g0405J1782K362N1061q2532P636o254j07215m365m4403J3430L092N0163
22723a75648N3911k551O2438l952P4877m8103l2040O5836J4443j16723L3765J21794
22711D8047J03467J2229j31738j41344q6805L1567k3085k460J03322N0608Q6770
22700E0578k9440j11031K7753P3397O907N0464R9864o2308j57412m551J01397
22689D5618O6615n7796j5480n5783o061P0437J3288j8918L438o0721l5080k1301
$$ plain form
22769 -70051 -82390 -152893 -233904 -256737 -121978 -134702 -195286 -151071 -106588 -95118 -157252
22758 -157252 -143962 -116138 -85571 -37657 104422 243504 292201 295726 185852 122004 5685
22747 5685 -55250 19581 50501 55540 -21731 -115619 -89636 -61998 41145 4679 -39921 -70405
22735 -70405 -58623 -56261 -5200 -87732 -80096 -86350 -193565 -197930 -242333 -228903 -225811 -175648
22723 -175648 -121737 -124288 -61850 -65802 9075 -39028 -71068 -5232 9211 -107512 -73747 48047
22711 48047 151514 163743 32005 -109339 -196144 -164577 -187662 -190122 -86800 -36192 50578
22700 50578 21138 -89893 -62140 11257 18164 68628 168492 106184 -51228 -55779 45618
22689 45618 112233 54437 38957 -16826 -22887 47550 60838 41920 45358 -15363 -50443 -71744
22677g1744M8464j12263j95201J8273J49914J1315J07595J0990j1226J0020n2118
22666h5981o681q429q2750k0888Q9775Q408M2847M8018q9279J6024j9677j26252
22654b34865o3003J9955J5005Q9652J11849L780m2130k8856j451P3084R358o1637
22642a09259m074P1163o7423R1928K7897n4846p1517N9695j4287J6974O4642q5928
22630g5035K971J0132J03863L824j31571o3333M6493J25547m4086n2813K3936
22619e0072Q0209J278l6784R8474k5102k7875k1703j82071M4538O5387O7128j74252
22607a60845r5119R9678J28809J7735j5818o8594m6134m1644R7305J14044K4976
22596E4393j12544q2115o8896P3447n7691J2860j9715j0506O2707M039K5384L1699
$$ plain form
22677 -71744 -23280 -135543 -330744 -312471 -162557 -151242 -43647 -32657 -43883 -33863 -85981
22666 -85981 -92662 -101091 -183841 -204729 -114954 -106546 -63699 -15681 -104960 -88936 -108613 -234865
22654 -234865 -297868 -277913 -262908 -173256 -61407 -57627 -99757 -128613 -130064 -56980 -47622 -109259
22642 -109259 -113333 -42170 -109593 -17665 10232 -44614 -116131 -56436 -70723 -53749 10893 -75035
22630 -75035 -72064 -61932 41931 45755 -85816 -149149 -102656 22891 -21195 -74008 -50072
22619 -50072 30137 31415 -5369 93105 68003 40128 18425 -163646 -119108 -53721 13407 -160845
22607 -160845 -255964 -156286 -27477 -9742 -25560 -94154 -140288 -181932 -84627 29417 54393
22596 54393 -58151 -140266 -209162 -135715 -193406 -180546 -200261 -210767 -148060 -144021 -118637 -86938
22584h6938M9152L9604k0273N1631j30823K6391J5885J3561J5598L1357L1272
22573C6417N2810J11445J05617j08040k16159O0931M2394J3905M7335K1906q164
22562A60397j79995p4246l9062l2037J04045l0683o4219L3343J7478K4065J02345
22551B1431l4800m0151J69649K684q8960L5296m166n8845L321J7048J1365j4532
22539A9340p1327r7986L2898M4243l2228j0344m3719M4005P2995L4096j1719O332
22527a3414l1314k0825K5068J01003J76464o0637j80267l2296J5187k5089m1714
22516h7834j20951j7756J07127N0648L1339p7066l1310q483O7307n431K8467k2084
22504h6027o5468m6317L5366j4151R5481Q1615l8360J9641q6817o9394J09124
$$ plain form
22584 -86938 -37786 1818 -18455 33176 -97647 -71256 -55371 -41810 -26212 5145 36417
22573 36417 89227 200672 306289 198249 -17910 43021 85415 99320 146655 168561 160397
22562 160397 -19598 -93844 -132906 -164943 -60898 -91581 -155800 -122457 -104979 -80914 21431
22551 21431 -13369 -53520 116129 118813 29853 65149 60983 2138 5459 22507 33872 19340
22539 19340 -51987 -149973 -117075 -72832 -105060 -115404 -159123 -115118 -42123 -8027 -19746 -13414
22527 -13414 -44728 -65553 -40485 60518 236982 176345 -3922 -36218 -21031 -46120 -87834
22516 -87834 -208785 -226541 -119414 -68766 -37427 -114493 -145803 -154286 -86979 -92410 -63943 -86027
22504 -86027 -151495 -197812 -162446 -176597 -81116 499 -37861 -18220 -105037 -174431 -65307
22493f5307J24997K2022m4191j41552m8449P057N1554k0417n6483N593m0372J2242
22481a93306J06845k0484J5569M8607k9155o5103Q3927M2899p7602q5794j2578
22470a86175j1622M9657J36705o9810m0265J46875r5211o3276L7200J04744J3469
22459B2291Q235L2027p0407l8064o0499p808k3558M7725J55434M4710j14394j33794
22447a38102K875l6068r6569M3793J04358o6471J7691N2247K0647m9127k5492
22436a70218R7443L4818p1121J6042K5710n939M8400P3748q0509q5808K5696P929
22424h3809k1423j2667j7583k4110n0820m0293J9511J08932M6010l7855k7926
22413a42033m6658R78J2160L2515r8013r1936L2623Q6422N1177J11735J12024
$$ plain form
22493 -65307 59690 81712 37521 -104031 -152480 -145423 -93869 -114286 -170769 -165176 -205548 -193306
22481 -193306 -86461 -106945 -91376 -42769 -71924 -137027 -53100 -10201 -87803 -173597 -186175
22470 -186175 -197797 -148140 -11435 -81245 -121510 25365 -69846 -133122 -95922 8822 22291
22459 22291 30526 62553 -7854 -45918 -106417 -114225 -137783 -90058 65376 110086 -4308 -138102
22447 -138102 -135227 -171295 -267864 -224071 -119713 -186184 -168493 -116246 -95599 -144726 -170218
22436 -170218 -72775 -37957 -109078 -93036 -67326 -73265 -24865 48883 -31626 -117434 -91738 -83809
22424 -83809 -105232 -117899 -135482 -159592 -210412 -250705 -231194 -122262 -76252 -114107 -142033
22413 -142033 -188691 -187713 -175553 -143038 -241051 -332987 -300364 -213942 -162765 -51030 60994
22402F0994j2040r1405o8916K7971Q8353n1030j6286M0360j05261l3687k730k460
22390a66137k4607k4906j6020J3545Q7652K2869j9065j113R9063J52536J935K8958
22378A54710N9433j9507j41319r9290m1233k8813J7460N1204L8803o3629n0N2351
22366a9880p3538M3806k5690p9970J2041J41784l8045N5429k2603l3888r6301
22355a36855q81M4760l5006q6147J53957Q7911k2632L6138L7043m2566j67844
22344a32122j37864k5885O6866M7334j4902o9330R9927N3659K7315K2588J4651
22333d7763Q5739K4265K0232k2933m9329j6672q1963k7705M1454R5052Q401j10519
22321h1741k6338l2839p0280J7195K5502j25972J8663K04497L0505q0501m6613
$$ plain form
22402 60994 48954 -42451 -111367 -83396 4957 -46073 -62359 -21999 -127260 -160947 -163677 -166137
22390 -166137 -190744 -215650 -231670 -218125 -130473 -107604 -126669 -127782 -28719 123817 125752 154710
22378 154710 214143 194636 53317 -45973 -87206 -116019 -98559 -47355 -8552 -72181 -72231 -19880
22366 -19880 -93418 -49612 -75302 -155272 -143231 -1447 -39492 15937 -6666 -40554 -136855
22355 -136855 -137736 -92976 -127982 -214129 -60172 27739 5107 41245 78288 35722 -132122
22344 -132122 -269986 -295871 -229005 -181671 -196573 -265903 -165976 -112317 -85002 -62414 -47763
22333 -47763 37976 62241 82473 59540 10211 -6461 -88424 -116129 -74675 20377 28778 -81741
22321 -81741 -108079 -140918 -211198 -194003 -168501 -294473 -275810 -71313 -40808 -121309 -167922
22310a67922K6691j14294q306P1480N5218M1956J03183m9084r7973l5619N6881
22299a17789J2897r8278K9487N004K9984K950o8167L418p054m0539N6716R390
22287a81981O9297N0755P223j05963L1825M8929R3481P5421L0494q5445l9372
22276e336l278j6465k0218p841j087n3078M5431J8787j676J2207N4046r806L1325
22263D3011l3776o9333k6394p680J21426q514L2820j4526j32556O5269Q7732J5108
22251G2587r4389n1912K7983K8357l0682o0557O088k2009P7935O9623j7247l9076
22239c3299O1800o476m7500n7274K4481l9517J1586O7810k1358m6870N5516L0102
22227i99l1541M4752n8408M925l39o7939j29901m1923J24404J00831r053n1495
$$ plain form
22310 -167922 -141231 -255525 -263831 -192351 -137133 -95177 8006 -41078 -139051 -174670 -117789
22299 -117789 -104892 -203170 -173683 -168679 -138695 -135745 -203912 -200494 -207548 -248087 -191371 -181981
22287 -181981 -112684 -61929 -54706 -160669 -128844 -79915 13566 88987 119481 34036 -5336
22276 -5336 -8614 -25079 -45297 -53138 -54225 -107303 -61872 -43085 -44761 -32554 21492 11686 43011
22263 43011 9235 -60098 -86492 -94172 27254 18740 51560 37034 -95522 -30253 57479 72587
22251 72587 -21802 -73714 -45731 -17374 -48056 -108613 -102525 -124534 -46599 23024 5777 -33299
22239 -33299 28501 22025 -25475 -82749 -58268 -97785 -86199 -18389 -39747 -86617 -31101 -999
22227 -999 -32540 12212 -46196 -41271 -41610 -109549 -239450 -281373 -156969 -56138 -65191 -116686
22215a16686J40631Q0834j99089k06698L1388J58951O3902L2064m9446q2708l0172
22204a77029K6862O9912K6519k1057q691k928j4577P1912J05j0502M2381J6991
22192A9898N3931N171M3286j4503L1990n6912n3700n0469j00178K2770P3113R303
22180a6300p0831r0801q259J17581N2454p5496j05654n7899Q2462R0391K7381
22169e4971K6210o2218k665J6330j53731n5455K2648O9020L6483o6411m0181Q7455
22157a77486J21801K6445j288k1359k5985P5337N8946n8985q7091j35543O053
22146b19155L7965P8122P7677K7744L9798N5271J12876r5319j18005P5912p8405
22135e519k6709L9037l5129j8418r0877n4633J1281J20218j462n5161M000O0423
$$ plain form
22215 -116686 23945 104779 -94310 -301008 -269620 -110669 -46767 -14703 -64149 -146857 -177029
22204 -177029 -150167 -80255 -53736 -74793 -83484 -86412 -100989 -29077 -28972 -39474 2907 19898
22192 19898 73829 79000 122286 107783 139773 82861 29161 -21308 -121486 -98716 -25603 -16300
22180 -16300 -87131 -177932 -186191 -68610 -16156 -91652 -197306 -255205 -172743 -82352 -54971
22169 -54971 -28761 -90979 -93644 -77314 -231045 -286500 -263852 -194832 -158349 -224760 -264941 -177486
22157 -177486 -55685 -29240 -30528 -51887 -77872 -2535 56411 -2574 -89665 -225208 -219155
22146 -219155 -181190 -103068 -25391 2353 42151 97422 210298 114979 -3026 72886 -5519
22135 -5519 -32228 6809 -28320 -46738 -137615 -192248 -180967 -60749 -62211 -117372 -113372 -52949
22123e2949P5394j4070m9365Q3011J07526P7379j07701l1741n0323p5831N535
22112c3135k2177q3658O995Q2263L3152J7742P5458J0621j09011m0743k4327K821
22100h3999N3975M4109L6586J8609J924m7292Q7048j4621L6023L0580k4453k7321
22088A11168o0117l6585n739l8160J3720j0130L0342L2427k4047n6180M4254o3771
22076f2818j2726Q5302r3450k5083L5457M1533J9885j20009o2268P645N6372O9077
22064f1083n8470p323j0678j04892N5459k3120o5532J29023J59475Q6774j43915
22053d4282n1543P3371j0917l4605p2621M1229P5323Q7413l0440j24166l1781
22042a23019j6230k482J08431O8210m827J4201k2181j0305j40763K0325O9216
$$ plain form
22123 -52949 22445 8375 -40990 42021 149547 226926 119225 87484 37161 -38670 -33135
22112 -33135 -55312 -138970 -131975 -49712 -16560 1182 76640 87261 -21750 -62493 -86820 -83999
22100 -83999 -30024 14085 50671 69280 71204 23912 110960 96339 132362 162942 138489 111168
22088 111168 51051 14466 8727 -29433 -15713 -25843 4499 36926 12879 -43301 953 -62818
22076 -62818 -75544 9758 -83692 -108775 -73318 -31785 -11900 -131909 -194177 -186532 -130160 -61083
22064 -61083 -119553 -126876 -137554 -242446 -186987 -210107 -275639 -146616 12859 99633 -44282
22053 -44282 -95825 -22454 -33371 -67976 -140597 -99368 -24045 63368 32928 -91238 -123019
22042 -123019 -139249 -141731 -33300 34910 30083 44284 22103 11798 -128965 -108640 -39424
22031c9424l6675m9606o7935Q9997J35886n691J2316p9496m9898j2305k2069J7049
22019a07851K2840o5395J4544p2527J19436L6143o2184k2072J5252Q7718K5681
22008h415N9950l9249k2499k466n5621m8312P348K2846o8726L4470M6540P7883
21996C749O9546n6958k3851p014J9771n6614j3021j7898Q3159J952k6611O2885
21984C9095j8137j07625k321r194k6906N6409L2977l2062j48072K5692P7771l8925
21972a51298M3493Q0701P3207N7855l4968j07681k748K1358K8077L4703Q5411
21961A28110K0173j19692Q601L1254j23886p9925O590m241L182R4464M8716M7335
21949F0681j0473J3545m568j28069j01798J1175J52512k6029m5924L5102J3466
$$ plain form
22031 -39424 -76099 -125705 -193640 -103643 32243 26552 38868 -40628 -90526 -102831 -124900 -107851
22019 -107851 -85011 -150406 -135862 -208389 -88953 -52810 -114994 -137066 -121814 -34096 -8415
22008 -8415 51535 12286 -10213 -12679 -68300 -116612 -109264 -86418 -155144 -120674 -74134 3749
21996 3749 73295 16337 -7514 -14528 5243 -51371 -64392 -82290 869 2821 -23790 39095
21984 39095 20958 -86667 -88988 -98182 -125088 -68679 -35702 -67764 -215836 -190144 -112373 -151298
21972 -151298 -107805 -27104 46103 103958 68990 -38691 -41439 -20081 7996 42699 128110
21961 128110 148283 28591 37192 68446 -55440 -135365 -128775 -133016 -129834 -35370 13346 60681
21949 60681 50208 63753 59185 -68884 -170682 -159507 -6995 -33024 -78948 -43846 -30380
21938c0380N2784Q7381m1011j58733j4462m4658q831K2142j01021J8791O5950
21927a52048O9412J9512L3062J581q510l0205o7494o7883N6921Q8975K3450R638
21915b3589j9790j2861r1454r9012M8647N1413j5971N2848Q0096O7942k0446m9341
21903c1518k1116p9613K0904o8662l5581L0553o1514q9795k435R6283K9394J2553
21891b00547J5582J3722m6931n5483K7555Q2221l4997O8885O302l1744O2359O9520
21879b3556P4118L3475j1540l0782R058P6589j05389j59319P2490N9998l4854
21868c9712k1797l2182n5465N6915Q1599M3388j0065J2868p7456k8421r8665M3334
21856a25659J50528M2279n343l3970r3124N0064o8366m5108m0416K4691J5325
$$ plain form
21938 -30380 22404 109785 68774 -89959 -104421 -149079 -157910 -135768 -236789 -217998 -152048
21927 -152048 -82636 -63124 -30062 -28481 -36991 -67196 -134690 -202573 -145652 -56677 -33227 -23589
21915 -23589 -43379 -56240 -147694 -246706 -198059 -146646 -162617 -109769 -29673 38269 17823 -31518
21903 -31518 -52634 -132247 -111343 -180005 -215586 -185033 -246547 -336342 -338777 -242494 -213100 -200547
21891 -200547 -184965 -171243 -218174 -273657 -246102 -163881 -198878 -129993 -123691 -155435 -93076 -23556
21879 -23556 50562 84037 72497 41715 50773 127362 21973 -137346 -64856 -4858 -39712
21868 -39712 -61509 -93691 -149156 -92241 -10642 32746 22681 35549 -41907 -70328 -168993 -125659
21856 -125659 24869 67148 61805 27835 -65289 -15225 -83591 -128699 -169115 -144424 -129099
21845a29099o0147j21652Q1869J2071N8788j5965Q3084k0710o3011l0905p9055
21834b84732l8454J0310L6299N6125j8028k6977N3139N5683R2211L5978j16486
21823a44932j01070M7309Q588r2640k4574J41152J31913m4507n6415k503P0002
21812f7677Q5263k0852k4374O7979j6347L196J5530r1870q35O2225j1743K8686
21800B9181K429N877J7072p1805M0168J06995j3593r4222J4011O9750k6396L0227
21788A09694J2331j02357n3656n3411N3220j955q7250J1029j396k468r05N3682
21776f3442J7786N8163J4p8268j29545l8215O4649Q6619k0404l718p4414j05117
21764b85892N0220J49794L6120n8015n792n6423r5831J90260N4715m6631O6402
$$ plain form
21845 -129099 -189246 -310898 -229029 -216958 -158170 -174135 -91051 -111761 -174772 -205677 -284732
21834 -284732 -323186 -312876 -276577 -220452 -238480 -265457 -212318 -156635 -64424 -28446 -144932
21823 -144932 -246002 -198693 -190105 -282745 -307319 -166167 -34254 -78761 -135176 -137679 -67677
21812 -67677 17586 -3266 -27640 40339 23992 27188 42718 -49152 -49987 12238 495 29181
21800 29181 31610 37487 54559 -17246 22922 129917 116324 22102 36113 105863 79467 109694
21788 109694 122025 19668 -33988 -87399 -34179 -36134 -123384 -112355 -113751 -116219 -117124 -63442
21776 -63442 -45656 12507 12521 -65747 -195292 -233507 -168858 -82239 -102643 -106361 -180775 -285892
21764 -285892 -235672 -85878 -49758 -107773 -113565 -169988 -265819 -75559 -20844 -67475 -1073
21753a073K259p3637N4377N4184L231o8712o7386r8759J2047O431l3401P8106
21741a32333q2764j15251k5779M0321q63K01135J43246j7411O67j5934R2126m9954
21729C7206m8537k06P1952L953j12133j11093M1896J15940K3412P7228j8133p6458
21717E027K5504m8935q6359r6123l4218M7820N7744R4649O8969Q259k1409O4675
21705H5603N3061O5325r8593r4534k9764l8739J0683R4128M1532q5358k6807N6012
21693C2549m1957n9943m6932Q9532J8136l8584l4160j9145k5324J7722K8526m1432
21681a21012J17954P1040j22689K4263O5264m1120J3167K2346K4768m7288n6139
21670d9446K4535k6048L9030L3675M6039m8076J7761K3031L8204M8008M6514j69982
$$ plain form
21753 -1073 1186 -72451 -18074 36110 39341 -29371 -96757 -195516 -183469 -177038 -210439 -132333
21741 -132333 -215097 -330348 -356127 -315806 -316669 -115534 27712 10301 10968 -4966 87160 37206
21729 37206 -11331 -11537 60415 64368 -47765 -158858 -116962 -1022 22390 99618 81485 5027
21717 5027 30531 -18404 -104763 -200886 -235104 -187284 -129540 -34891 34078 42337 20928 85603
21705 85603 138664 203989 105396 10862 -18902 -57641 -46958 47170 88702 3344 -23463 32549
21693 32549 -9408 -69351 -116283 -26751 -8615 -47199 -81359 -100504 -125828 -108106 -79580 -121012
21681 -121012 -3058 67982 -54707 -30444 34820 -6300 6867 29213 53981 6693 -49446
21670 -49446 -24911 -50959 -11929 21746 67785 19709 37470 60501 98705 146713 193227 23245
21658B3245k44608O4587M5076J7623j07836o4152J18223Q6371j1388r2278N5977
21647a09160L2646o3249L3141K7320R7201Q8649N433p9941k5627J8080K2668P3590
21635A20751n3091j21087j7450p901m0723K4798L4347R1468o3502j36330P8803
21624h9917k4519L467j292q470L9230L0021j1047N3333N5590q6722j27210l9075
21612b06611M7794o189k9557J4206P2175Q286R7147J03079M1167j19547o5147
21601d3197o4190L4721R0032n8626P479L0932p7060j19448R1833J48694k138o1936
21589b2904p5830K6312M3718l8240l3209P8097J08968r6486N146Q5501k8397o4266
21577a1590q8966n7341M9135R18o9011R3856L5939n0487L8850K6640n8850k1484
$$ plain form
21658 23245 -221363 -156776 -111700 -94077 -201913 -266065 -147842 -61471 -72859 -165137 -109160
21647 -109160 -76514 -139763 -106622 -79302 17899 106548 111981 32040 6413 24493 47161 120751
21635 120751 67660 -53427 -70877 -78778 -119501 -94703 -60356 31112 -32390 -168720 -89917
21624 -89917 -114436 -110969 -112261 -120731 -81501 -51480 -62527 -9194 46396 -40326 -167536 -206611
21612 -206611 -158817 -165006 -194563 -180357 -108182 -99896 -2749 100330 141497 21950 -43197
21601 -43197 -107387 -72666 17366 -41260 -33781 -2849 -79909 -199357 -107524 41170 39032 -22904
21589 -22904 -98734 -72422 -28704 -66944 -100153 -22056 86912 -9574 -4428 81073 52676 -11590
21577 -11590 -100556 -157897 -108762 -107844 -176855 -82999 -47060 -97547 -58697 -32057 -90907 -112391
21565a12391M1151K5300Q911K9974q7308J1337L7089j1338r728l4636J15804K072
21553A6237K1287m2850r857q065N2245l9191M9500N5697n2812q045l2260o401
21541d515j44072j125N6007J4336r716J08602N3617n9477J7277K7231Q1675p100
21529A32740o7133M921l5090l9145o0913K4623K203k6981P3250P6897j17511J6084
21517a6055O3103R564N5517o3249J8765P2018J0681R2825p7177j13009j12248
21506e9265L9353P515l3359l1871J74754n6718j02609n2402M7674O9373k7720
21495b5275m4327o4685l2190L5341K1766N7467P785o3465K7366L8095k4165P1941
21483E654K0190L8923J47072J8905k9164p6125k1725m6754q0410J2389n7538o7620
$$ plain form
21565 -112391 -71240 -45940 -37029 -7055 -94363 -83026 -45937 -57275 -67003 -101639 14165 16237
21553 16237 37524 -5326 -15183 -23248 28997 -10194 39306 95003 42191 34146 1886 -4515
21541 -4515 -148587 -149712 -93705 -79369 -89085 19517 73134 13657 30934 58165 139840 132740
21529 132740 65607 70528 35438 -3707 -64620 -39997 -37794 -64775 8475 85372 -32139 -16055
21517 -16055 47048 56612 112129 48880 67645 139663 150344 243169 165992 52983 -59265
21506 -59265 -19912 -12397 -45756 -77627 97127 40409 -62200 -114602 -66928 2445 -25275
21495 -25275 -69602 -134287 -166477 -131136 -109370 -51903 -44118 -107583 -80217 -42122 -66287 5654
21483 5654 25844 64767 211839 230744 201580 125455 103730 56976 -23434 -11045 -68583 -136203
21471a36203j6542K0575M2543J44527R9481o0498q7401M34L8795m0130N4100p7523
21459a7842j1998o9933R0810N2418k1036j45341k1416J00011N1915P8193P8138
21448A63919l4771R214j17816j21373l091L8419l4697N526K9713K6217N2675k1716
21436g781K8095M3679j31469P4243N5418j26780j21458m3869J8220L0409K2814
21425a58479k1487K94Q9801n2202j9903J13297L771L415j27827j2428J74860l9891
21413d6779n9878j1630J0772n3074R4946L9821J12856j3468j66932o7495N6889
21402a03972N7706K5930J1836k2324p9887l546o803J182o202N3122N8060J00919
21390H6021r6920j24448m5773N0855J15656k2757m5377O7991l5566j07686M7027
$$ plain form
21471 -136203 -152745 -132170 -89627 54900 154381 93883 6482 6916 45711 5581 59681 -17842
21459 -17842 -29840 -99773 -8963 43455 22419 -122922 -144338 -44327 7588 85781 163919
21448 163919 129148 138362 20546 -100827 -103918 -65499 -100196 -94670 -64957 -38740 13935 -7781
21436 -7781 20314 63993 -67476 6767 62185 -64595 -186053 -229922 -211702 -181293 -158479
21425 -158479 -179966 -179672 -89871 -142073 -161976 -48679 -44908 -41493 -169320 -181748 -6888 -46779
21413 -46779 -106657 -118287 -107515 -160589 -65643 -25822 87034 73566 -93366 -160861 -103972
21402 -103972 -46266 -20336 -8500 -30824 -110711 -114257 -121060 -119878 -126080 -72958 -14898 86021
21390 86021 -10899 -135347 -181120 -130265 -14609 -37366 -82743 -14752 -50318 -158004 -110977
21379a10977O3859M424k3167K5883R5212J5037j4804Q341J3943k484j9088K1438
21367G7617j11274l788M6414q948Q5790P6458p4994m0897p0050n6217N113M6411
21355b8365M6153l2219J6232L1749q0637R362l8870M1317M6191R199p6267K72
21343e5883Q1742m9576r5027k2929p8538K9387Q2233J35928N1005m9625n910p5427
21331e2620J14073O7628j0779j07274j10888m1245l4032l3445p5211R1049M1173
21320a51571J43582M6273j3852q4727j5967N7206M8917j2559l6507J5895q8989
21309i2299j0170N4743M0012j3347l7116O9716j3403m0410L9820J7536M8364k1277
21297D2169k5353p4363P2611O6783k0637n1945k0235N2306j9377j49736m1292
$$ plain form
21379 -110977 -47118 -42694 -65861 -39978 55234 70271 55467 63808 77751 75267 56179 77617
21367 77617 -33657 -37445 8969 21 85811 162269 87275 46378 -23672 -79889 -74776 -28365
21355 -28365 17788 -14431 1801 33550 -47087 -37725 -76595 -35278 10913 20112 -56155 -55883
21343 -55883 25859 -23717 -118744 -141673 -220211 -190824 -108591 27337 78342 28717 22807 -52620
21331 -52620 61453 129081 118302 11028 -99860 -141105 -175137 -208582 -283793 -192744 -151571
21320 -151571 -7989 38284 24432 -60295 -76262 -19056 29861 17302 -19205 -3310 -92299
21309 -92299 -102469 -47726 -7714 -21061 -58177 11539 -1864 -42274 -2454 15082 63446 42169
21297 42169 16816 -57547 15064 81847 61210 9265 -10970 41336 21959 -127777 -169069
21286a69069l4567j14187k3926N610J258O0963J44016J29963o7910q141P5975
21275a5O4189M5339l3605k9498J04611n8319j14807l4520O4243j4176q574p329
21263b2461L7610M1519L9468p9859m6360r1706l8232J46772N8246j17846K0237
21252e2612O6549j09268q1971O2693P0476J0858o4853l33P7330O3101o3541k4393
21240d5964L9933P185j2494m2766o218o8647j23490J09632J07298p0779p7296
21229a83606l478L9501J0187p1037L1319J57336P695p783j6504k8981K5474J68295
21217A28418N6503J1316m8761J1500m3280k3400q2905m5488L1825j4292j5835
21206c4399J9171j8834o3783M3310R3243N7635J5338L5548n8514l9321j13102
$$ plain form
21286 -169069 -203636 -317823 -341749 -336139 -334881 -273918 -129902 61 -67849 -75990 -15
21275 -15 64174 109513 75908 46410 151021 92702 -22105 -56625 7618 -6558 -15132 -22461
21263 -22461 15149 56668 96136 16277 -30083 -121789 -160021 -13249 44997 -72849 -52612
21252 -52612 13937 -95331 -177302 -114609 -44133 -33275 -98128 -98461 -21131 41970 -21571 -45964
21240 -45964 -6031 1154 -11340 -54106 -60324 -128971 -252461 -142829 -35531 -106310 -183606
21229 -183606 -187084 -147583 -137396 -208433 -177114 -19778 -12083 -19866 -36370 -65351 -39877 128418
21217 128418 184921 196237 147476 158976 115696 92296 9391 -36097 -4272 -18564 -34399
21206 -34399 -15228 -34062 -97845 -54535 38708 96343 111681 147229 88715 49394 -63708
21195f3708j6884J40601J1262o5786r065N9971q80K464q9878k4825l3556J6403
21183g3881L8489J7479N5643K958O3832M1778o9102j02799j37835M0278J04008
21172a9152L3398m5460n7508j4280m0196m9459M8144O8890j30416L4477R9183
21161g2379K8386p3893Q7793K9706j19084k7190O1746l5293o5053r096n329N0713
21149a48973J38767L2432j1385N1499j5838K7663l5907p8493q3386n4379K5686
21138a52314K5114J2019P7688j4862j03950j01876O6150L1647K7903Q8981k171
21127d5671n2441O2745m8963M0383M7682m6370J9071l0127o046J4604L0199P0532
21115E5598q4435k391J13187l4511m2914L1474l1366p169m6543M2184Q116K8153
$$ plain form
21195 -63708 -80592 60009 71271 5485 -3580 56391 55511 57975 -31903 -56728 -90284 -73881
21183 -73881 -35392 -17913 37730 40688 104520 146298 77196 -25603 -163438 -123160 -19152
21172 -19152 14246 -31214 -88722 -103002 -143198 -192657 -144513 -75623 -206039 -171562 -72379
21161 -72379 -43993 -117886 -30093 -387 -119471 -146661 -84915 -120208 -185261 -194357 -199686 -148973
21149 -148973 -10206 22226 10841 62340 46502 74165 38258 -40235 -123621 -178000 -152314
21138 -152314 -127200 -115181 -37493 -52355 -156305 -258181 -192031 -160384 -132481 -43500 -45671
21127 -45671 -98112 -35367 -84330 -43947 3735 -42635 -23564 -53691 -59737 -45133 -14934 55598
21115 55598 -28837 -31228 81959 47448 4534 36008 4642 -2527 -49070 -6886 1230 29383
21103B9383K2251j8247P2963o1553p2062R5170J46337q2293j17546j16678k9139
21092a31414m2677N5427k339N8250Q3937K1284K6618o1785q7406N2625J7792Q3472
21080G3784R1720m0110p2335j13608o8376J45679N9m5094j7041L9648P335k6324
21068b4663l9798p3350K7293Q5158l6553J8497M6953J1744l3535o786J4414N9019
21056D8393L9466Q350l126l597l221j08046n71n5156k1029k092O8037K4127j6340
21043b4805J13059p407k8758L9061P676L4741l1738m6353K6910M234n6989l9813
21031a0182l4976n2899k941j6204q604Q0269O6078M6043K4165M68j42602L212
21019d8173P1242J7995K1658J2928O792K6565K2868O3650J20634J69401M6635
$$ plain form
21103 29383 51634 33387 106350 44797 -27265 67905 214242 131949 14403 -102275 -131414
21092 -131414 -174091 -118664 -121003 -62753 21184 42468 69086 7301 -80105 -27480 -9688 73784
21080 73784 165504 125394 53059 -60549 -128925 16754 16813 -28281 -45322 -5674 1661 -24663
21068 -24663 -64461 -137811 -110518 -25360 -61913 -43416 3537 15281 -18254 -25040 -10626 48393
21056 48393 87859 96209 93083 89486 86265 -21781 -22352 -77508 -98537 -100629 -32592 -8465 -24805
21043 -24805 88254 80847 52089 91150 98826 133567 101829 55476 82386 86620 29631 -10182
21031 -10182 -45158 -98057 -100998 -117202 -125806 -45537 20541 66584 90749 91217 -51385 -48173
21019 -48173 23069 41064 62722 75650 82442 109007 131875 195525 316159 485560 532195
21008E32195O7375J41435P4650O4036J25820O7327M160M9998k2646j4132J8328
20997A108546O6820K1951j40438j3070j7645J8410k8305n0197j1623j02434j73898
20986F78117k69650q0996q1024q4624r326Q5486j0915J19375L3151J75119K58500
20975H13213J00057J39007m869J7766L4632P8069R7967p296n1902n7176R385L3306
20963A202159j29986j78180j22738J9649Q693l5953q7438p4304J1877k3745j49925
20952D40109j67699j11513J8098J9512j84131j62693M2037P5298R9940l4956l262
20941C0740J0465J8852R3575j0407N2534k8332j26874r2034M591M232o996J9753
20929b9901j3273M9339n0910n0488o2472l5608P6790P9841o4062N7922J6100r8050
$$ plain form
21008 532195 599570 741005 815655 879691 1005511 1072838 1076998 1126996 1104350 1090218 1108546
20997 1108546 1175366 1197317 1056879 1043809 1026164 1044574 1016269 966072 954449 852015 678117
20986 678117 408467 327471 246447 161823 152497 237983 227068 346443 379594 554713 813213
20975 813213 913270 1052277 1047408 1065174 1099806 1177875 1275842 1268546 1216644 1159468 1168853 1202159
20963 1202159 1072173 893993 771255 790904 799597 763644 676206 601902 613779 590034 440109
20952 440109 272410 160897 178995 198507 14376 -148317 -106280 -30982 68958 34002 30740
20941 30740 41205 60057 153632 143225 195759 167427 40553 -51481 -46890 -42658 -49654 -29901
20929 -29901 -43174 6165 -44745 -95233 -157705 -193313 -116523 -36682 -100744 -42822 -26722 -124772
20917a24772P2895Q4906p6637j8211J22069R5002Q541r9499J5713L9243k5229
20906I4021N3213k0601M9002k4474j61970j40502J04923J25640Q4085J4160n4851
20895A22646j67523j3147J10840N3191k6803j348K6868J04977R971M884q2756
20884A41800k7174j9364j3969j4726l4975M31P7906k8541j00770L1255L9770K0650
20872G2293j2411O036j3705J7351m5612n1748p3039j0676j2387m2178K3500M0602
20860a01974J19354P8674Q0065Q4837l8373j46145p1100j22600n0535J7789J15036
20849c4972P3126l9157q1572j24323j7972K00437J23706r9021J1367K1206M169
20838C6994k4876N8853K2365m6461l3540l0972K1466R8254P3479m3578q5634p8046
$$ plain form
20917 -124772 -51877 33029 -43608 -61819 60250 155252 163793 64294 80007 119250 94021
20906 94021 147234 126633 175635 151161 -10809 -151311 -46388 79252 163337 177497 122646
20895 122646 -44877 -58024 52816 106007 79204 77856 104724 209701 219672 224556 141800
20884 141800 114626 95262 81293 66567 31592 32023 109929 81388 -19382 11873 51643 72293
20872 72293 59882 65918 52213 69564 23952 -27796 -100835 -111511 -123898 -166076 -142576 -101974
20860 -101974 17380 96054 176119 260956 222583 76438 5338 -117262 -167797 -150008 -34972
20849 -34972 38154 -1003 -82575 -206898 -224870 -24433 99273 252 11619 32825 36994
20838 36994 12118 70971 93336 46875 13335 -17637 3829 102083 175562 131984 46350 -31696
20826c1696k8687P0667j7350l9161k3408K8655O6033J09533Q7267q751k8768l5753
20814A48581K0378R745j27611j15731J26778l9062j3547J9191L5705N0970K0027
20803A35424p5953l8898N4017R3636p6683j3491Q7204l9753J2656J74464O976
20792C19599M134m6376r4222J0151j8372l3467j0557k7403l9048q1858o598J8983
20780e034R452O7561J04178l8838J2566L2097l6662l0035o5223p7324r5078j5134
20768a37474J01695J04929J18274O9677r9785q3600P9008j3579l8890K1233O439
20757A27927L108m8274n2061P2146O5280M0271L3056j3382o5777L9145K1657N0437
20745B73533K9829l5787j41789r1752R7177j0647N6686J7690p137j7848j3504
$$ plain form
20826 -31696 -60383 10284 -7066 -46227 -69635 -40980 25053 134586 221853 213102 184334 148581
20814 148581 168959 178704 51093 -64638 62140 23078 9531 28722 64427 115397 135424
20803 135424 59471 20573 74590 168226 91543 78052 165256 125503 138159 312623 319599
20792 319599 323733 277357 183135 193286 174914 141447 130890 103487 64439 -17419 -24017 -5034
20780 -5034 4418 71979 176157 137319 149885 181982 145320 115285 50062 -27262 -122340 -137474
20768 -137474 -35779 69150 187424 257101 157316 73716 152724 139145 100255 121488 127927
20757 127927 131035 82761 30700 102846 168126 208397 241453 228071 162294 201439 223096 273533
20745 273533 303362 267575 125786 34034 131211 120564 177250 194940 187803 169955 156451
20734A56451j463k2464n2203m5523k4098J09622Q8737l2674K7240N9257j18980
20723A43902j29958N8731O0106l8464m135M5187l551l59J9685J75329M853m8378
20711B82948J8360K4508j42474n7128N3484K125k00928r5008M340M210N0313P8730
20699B3480L2084J31070m844k44531N5450K494j09258J5329J49098M2485p6808
20688A6049k1775R6285L0369Q9023J57316k069o8391n4566j9700R9234m9959j6595
20676B55221j9354R92M3576J8192N0374K6867j6323P43R9773m5674m5681k3280
20664C45426r2634p7195K9209J03490N271L0083k5722p8754L7144M2929p9549
20653B39698L787J3583J7601O364L3969J1354m9063m4050P290l3858o1109k795
$$ plain form
20734 156451 154988 132524 80321 34798 10700 120322 209059 176385 203625 262882 143902
20723 143902 13944 72675 132781 94317 90182 135369 131818 131459 151144 326473 331326 282948
20711 282948 301308 325816 183342 126214 179698 181823 -19105 -114113 -109773 -105563 -55250 23480
20699 23480 55564 186634 181790 -62741 -7291 -4797 -114055 -98726 50372 92857 16049
20688 16049 -5726 90559 120928 209951 367267 365198 296807 242241 222541 321775 271816 255221
20676 255221 235867 236859 280435 298627 349001 375868 359545 360288 460061 414387 368706 345426
20664 345426 252792 175597 204806 308296 313567 343650 317928 239174 276318 319247 239698
20653 239698 243485 257068 274669 281033 315002 326356 277293 233243 240533 206675 145566 142771
20641A42771J1677J9921j9350O5207J3392k432l0225q9646L9521K2510q9854O703
20629I0195J9435M8240J5225n6766N7683R3230M639K9332m4250Q867j79655l0377
20617E5798M5o2363N983M6200j1062N4552J39308O904P3182j4168k9531N635n8081
20604B12402k7976L1336o710Q2245J0267j9012j0734m9661l6531J05667J78244
20593D69537l0783k15993m6484K1410O2673O8109o642k4812q0569j13904M8239
20582A50781O2922M267j1021m2234j2181p6966k7282P9397N1083r0690n4677p8833
20570d5434P1623K21571Q4372Q815o2679j873Q394n4499l4880J25575J88705k2911
20558D86779j16913K2053K21376N2892q6088o8265n8419O5066L4220J26246Q4136
$$ plain form
20641 142771 154448 174369 155019 220226 233618 231186 200961 111315 150836 173346 83492 90195
20629 90195 109630 157870 173095 116329 174012 267242 271881 301213 256963 265830 86175 55798
20617 55798 55843 -6520 -537 45663 34601 89153 228461 235365 308547 294379 264848 270483 212402
20604 212402 184426 215762 209052 291297 301564 282552 271818 222157 185626 291293 469537
20593 469537 438754 222761 176277 197687 260360 328469 321827 297015 216446 102542 150781
20582 150781 213703 217970 206949 164715 152534 75568 48286 127683 178766 88076 33399 -45434
20570 -45434 26189 247760 332132 340947 278268 276395 284789 230290 195410 320985 509690 486779
20558 486779 369866 391919 613295 666187 580099 511834 453415 518481 552701 678947 763083
20547G63083l2215r8716r0588n3917N5974N1449o4389p8454k7553m2686k80M5847
20535D27555J37745N8259P920J54960M120j5397K5504J8999P0713l7082M7494
20524I00790Q1788p7140o7298J29152O3074P4939m1957n075j23474k6666q158
20513H99975J55162R0646j7478p1022k0751o348j10390J4840P5195q808p9124
20502I21897L5212N3710K8752n6577l2690P8788N0761L4878J19915L3352K3187
20491A291185j3880P788l7335Q1460J20552J2974K886Q9579Q7230o9118K5401
20480A598722J9676J42224K10371J13056M0614K18847L23628K74229P4336J84935
20470C200638P6002P7098J51576L70652M84089M29130L65652J41081K40615K63818
$$ plain form
20547 763083 730868 632152 541564 487647 543621 595070 530681 452227 424674 381988 381708 427555
20535 427555 565300 623559 631479 786439 790559 775162 800666 819665 890378 853296 900790
20524 900790 982578 905438 838140 967292 1030366 1105305 1063348 1058273 934799 908133 899975
20513 899975 1055137 1145783 1128305 1057283 1036532 1030184 919794 934634 1009829 1001021 921897
20502 921897 957109 1010819 1039571 982994 950304 1029092 1079853 1114731 1234646 1267998 1291185
20491 1291185 1277305 1285093 1247758 1329218 1449770 1462744 1465630 1555209 1642439 1573321 1598722
20480 1598722 1618398 1760622 1970993 2084049 2124663 2343510 2667138 2941367 3015703 3200638
20470 3200638 3276640 3353738 3505314 3875966 4360055 4789185 5154837 5295918 5536533 5800351
20460E800351K24645J51716L08951L40008M85208M92744M23485L92009L27013
20451H946130N33587P09399Q67423J100502J532722K170878K991639M476869O522064
20442B9851213R260898J3162757J9387903K6677227L1095007K5051578Q826906
20435A63313489l407262o442514L332477J7151990K2875498J1877296K559940
20428B11260914j473983J165453k096172j1860299j7856067j5897740l736505
20421A59505601P934062P449472q318770k2350783l0317444k7150588j8379856
20414F8371694r292212j817934M151424J0184255J8050870K6302377L0927309
20407A46877783K3485892O743959m744698n861425N529499J8669860J8763341
$$ plain form
20460 5800351 6024996 6176712 6485663 6825671 7310879 7803623 8227108 8619117 8946130
20451 8946130 9479717 10189116 11056539 12157041 13689763 15860641 18852280 23329149 29851213
20442 29851213 39112111 52274868 71662771 98339998 129435005 154486583 163313489
20435 163313489 159906227 153463713 156796190 173948180 196823678 208700974 211260914
20428 211260914 209786931 210952384 208856212 196995913 179139846 163242106 159505601
20421 159505601 167439663 174889135 166570365 144219582 113902138 86751550 68371694
20414 68371694 59079482 57261548 61412972 71597227 89648097 115950474 146877783
20407 146877783 170363675 177107634 172362936 166501511 172031010 190700870 209464211
20400B09464211M235891m147817n479854K143411J963329q253275j5489391j5156999
20392A69279506m284859O578643M124889j2283849k6276716l3601743k9858496
20385G3677375k1735228j3894797q702711n769464m158880k832506k019106j573852
20377A2990831j297969j079859q94283n98182m20534l23290k19627n16292n69099
20368G071696n38428l85179l03631k68686j38839j58177j33513k86628k25114
20359D633501m14369l74483l01311k07052n7820k43796l43743k74933k11194k78855
20349A925945l40080j69593j17172j05955q1120m6444j41230q3089K4169o967
20339H58464j1759n7989j07209j02995n1435K913l2161J7390k2645l9633P0529
$$ plain form
20400 209464211 213700102 209552285 204072431 206215842 208179171 199925896 184436505 169279506
20392 169279506 164994647 171573290 175698179 163414330 137137614 103535871 73677375
20385 73677375 51942147 38047350 29344639 23575175 19416295 16583789 14564683 12990831
20377 12990831 11692862 10613003 9718720 9120538 8700004 8376714 8157087 7640795 7071696
20368 7071696 6533268 6148089 5844458 5575772 5436933 5278756 5145243 4858615 4633501
20359 4633501 4219132 3844649 3543338 3336286 3278466 3034670 2690927 2415994 2204800 1925945
20349 1925945 1585865 1416272 1299100 1193145 1112025 1065581 924351 841262 865431 858464
20339 858464 846705 788716 681507 578512 527077 529990 497829 515219 492574 452941 523470
20328E23470M9227l6290K5600p2620P0510Q8694L0608o2545r3246J2252n4090
20317D81570o5694K395k0070p6944r8184J1594n7173o2785j40467l510Q5953O536
20305F3221J9096o7490P5221o3185j5766P9256P7164K3388j03591N3353J01028
20294B41695P2519l2079l3304L193L6146N2144l0010r0561m6548O856J56378r8786
20282B37643o7102O0699L4970l1575m4362l3071j14360N9379M7996l0626O5908
20271A85499J7874l449o688P8573m9420o011N116J1035Q0688R2237J3948K1237
20259D40639q819j53076k8325O3168N3343j1008r7543P1563R4631j35451m6236
20248B42886m5149k7673j6705n1513J3523N1936j3815j8679j2235L1904N635O7287
$$ plain form
20328 523470 572697 536407 562007 489387 559897 648591 679199 616654 523408 535660 481570
20317 481570 415876 418271 398201 321257 223073 234667 177494 114709 -25758 -29268 56685 63221
20305 63221 82317 14827 90048 26863 11097 90353 167517 190905 87314 140667 241695
20294 241695 314214 282135 248831 252024 288170 340314 310304 219743 173195 180051 336429 237643
20282 237643 170541 231240 266210 234635 190273 157202 42842 102221 150217 119591 185499
20271 185499 203373 199924 193236 271809 222389 216378 221494 232529 313217 405454 419402 440639
20259 440639 431820 278744 250419 313587 366930 355922 258379 329942 424573 289122 242886
20248 242886 197737 170064 153359 101846 115369 167305 153490 134811 122576 154480 160115 227402
20236B27402k5863j5799j3777L9100m5349K9515N7521j3977N136l7896K3165M0386
20224B69564j08501k9326j6937l3670J0814J17822R6349j02268q2752R2924l7525
20213A76494P604N5256j32533j12407o159K7865O4818J5776m7383k2401j181k3468
20201B281n4064L7153J1536j1142m9632l7504Q2242J04655P0883j23707j08406
20190g5705N2689J3041P0072j7538o5503J08072k9623j22325m8772n4677Q9587
20179h0682J0371L9194J78417L932k22002r6144Q2862M4769O3942r337K1655m7044
20167a0067K639K8712N3682K4201l6760j18178j9439J2267M9931J696j7358k4959
20155e3633k9111N4943R5650l9931p9665n032P4434n5146J4856O5239J4563L7028
$$ plain form
20236 227402 201539 185740 171963 211063 165714 195229 252750 238773 243909 206013 229178 269564
20224 269564 161063 131737 114800 81130 91944 209766 306115 203847 121095 214019 176494
20213 176494 184098 239354 106821 -5586 -11745 16120 80938 96714 49331 26930 25749 2281
20201 2281 -51783 -14630 -3094 -14236 -63868 -101372 -19130 85525 156408 32701 -75705
20190 -75705 -23016 -9975 60097 42559 -22944 85128 55505 -66820 -115592 -170269 -80682
20179 -80682 -70311 -31117 147300 151232 -70770 -166914 -84052 -39283 24659 15322 36977 -10067
20167 -10067 -7428 21284 74966 99167 62407 -55771 -75210 -62943 -13012 -11316 -28674 -53633
20155 -53633 -82744 -27801 67849 27918 -51747 -56779 17655 -37491 -22635 42604 57167 94195
20143I4195k5635K293J13050j9495p2818R503k1075k9448p2379O9018m5679J5618
20131A7148R4086O7867l0817j18k9770P6548N1123n1721l9180j0036j01829j27611
20119h4310r3733M8233M2237K5352Q4380N8680l7258k2262m0263K7546o4886j4822
20107g1106J8405R499p2154j603R7119L4091r7785N617J44729l8315j44651k8574
20095a44728P619M8399k3883p5465j04891J5416L0150J96929k8247p0211J7950
20084a30962m2659k9389l9323Q351L9109Q0467J4911M9406N7424N7645m3425q6764
20072f5209J2853j0012O5686l9747j0251j5805M9568j4979k6250p0165k2307N0524
20060i6094j7769n9091L2686J60770L4043p6194P746R542m2444J4468L3575k4105
$$ plain form
20143 94195 68560 70853 183903 164408 91590 101093 80018 50570 -21809 47209 1530 17148
20131 17148 111234 179101 148284 148166 118396 194944 246067 194346 155166 145130 43301 -84310
20119 -84310 -178043 -129810 -87573 -62221 22159 80839 43581 21319 -18944 8602 -56284 -71106
20107 -71106 -52701 -43202 -115356 -116959 -19840 14251 -83534 -77917 66812 28497 -116154 -144728
20095 -144728 -137109 -88710 -112593 -188058 -292949 -277533 -247383 -50454 -78701 -148912 -130962
20084 -130962 -173621 -203010 -242333 -233982 -194873 -114406 -99495 -50089 7335 64980 21555 -65209
20072 -65209 -52356 -62368 3318 -36429 -46680 -62485 -12917 -27896 -54146 -124311 -146618 -96094
20060 -96094 -113863 -172954 -140268 20502 54545 -21649 -13903 -4361 -46805 -32337 1238 -22867
20048b2867p5344k7538M4797j0447M5979k2407k6982r6828M1648n3692Q39J14709
20036h8133P1135j9817J09398J11594q9444j74053m2116K7721O3118O5514N1332
20025H6249l1792l1551n8862o2879K7199P8378L668K8222r0709o5265N2676J33070
20013F8404m0787j30593n2090j306L4572R8510N5351J12263q9266r0768P6798
20002D1088p881l2900j3586P590n8949j2958l303m3009m6968M0057J1460J2229
19990a07130m5226j12691N7898N7263M7417J7150n9946j01296Q973P1571R7317
19979f8700O6887m5245L5234l0537K4898O2465K1912M0029r9652R7471p9166j47063
19967a21467p9809l3213L4608J28385K3317J082K1795P0763l0395m2992l1204
$$ plain form
20048 -22867 -98211 -125749 -80952 -91399 -45420 -67827 -94809 -191637 -149989 -203681 -202842 -88133
20036 -88133 -16998 -36815 72583 184177 94733 -79320 -121436 -93715 -30597 34917 86249
20025 86249 54457 22906 -35956 -98835 -71636 6742 10410 38632 -52077 -117342 -64666 68404
20013 68404 27617 -102976 -155066 -156372 -121800 -23290 32061 144324 55058 -35710 41088
20002 41088 33207 307 -13279 -5689 -64638 -77596 -80899 -123908 -170876 -130819 -119359 -107130
19990 -107130 -152356 -265047 -207149 -149886 -102469 -85319 -145265 -246561 -237588 -166017 -68700
19979 -68700 -1813 -47058 -11824 -42361 -17463 45002 66914 106943 7291 104762 25596 -121467
19967 -121467 -201276 -234489 -199881 -71496 -48179 -47097 -25302 45461 15066 -27926 -59130
19956e9130J226J7499J31206J13115N157o2937k992q8780J2456k7847n5546k9835
19944d6408j5945M1094j2751k0995Q4842J67675L0884q1989o3641P534o738K7795
19932A11357J37168Q8993J7674p173M5707J43336K79062J55281M1513m64M4140
19921A056594J23582J57349J75715j12938k10078j30841n0224M6184p2846j01187
19911H81310n8586j06529j80160m6751r7726j48726l1497m971m7886P2883R309
19900B40670m9892l5091j31791J0135M3448M7208O874p233j1150N033r4390M7294
19888G1115P849j08610K8090K05286n39o3901O7956J47302K02465J75978O8419
19877H01410J64655J92283P1123N3003P234J80911J20860J26702K12909O692k55611
$$ plain form
19956 -59130 -57904 -40405 90801 203916 209073 146136 143144 54364 66820 38973 -16573 -46408
19944 -46408 -62353 -21259 -34010 -55005 29837 197512 228396 146407 82766 90300 83562 111357
19932 111357 248525 337518 355192 348019 393726 537062 816124 971405 1012918 1012454 1056594
19921 1056594 1180176 1337525 1513240 1400302 1190224 1059383 1009159 1055343 982497 881310
19911 881310 822724 716195 536035 489284 391558 242832 211335 206364 158478 231361 240670
19900 240670 190778 155687 23896 34031 77479 124687 131561 124328 113178 118211 23821 71115
19888 71115 78964 -29646 -1556 203730 203191 139290 207246 354548 557013 732991 801410
19877 801410 966065 1158348 1229471 1282474 1289708 1470619 1591479 1718181 1931090 1937782 1682171
19866A682171j44298O5255j9859N4899M5093j9062j75017j68526p4151o6983J42511
19855A322033J12310k8450L348L3000O3711J2647J37045J92751n8744j46077j40506
19844A503068j57137k22003j42201j45523l3518n0706N7201J30248J63156P4814
19834A177399m5783K7222J27912l1203n974q7487P900K9462Q1193M395N6391l9908
19822A301519N6306P730j19817j06247l1537k7847q1550Q9693R1602j32376k57287
19811G90189k59207j86003j11323l9566L7794K4797J9603O535J73207K79257J91899
19800I27182J59440J32486J74687N9193j13157l87639k96778L7258J13194R7091
19790I02957P2440K00253J77609J08119m6241j06736k44888l11049k00646j69779
$$ plain form
19866 1682171 1537873 1603128 1583269 1638168 1683261 1664199 1489182 1320656 1246505 1179522 1322033
19855 1322033 1434343 1405893 1409241 1442241 1505952 1518599 1655644 1848395 1789651 1643574 1503068
19844 1503068 1345931 1123928 981727 836204 802686 751980 809181 939429 1102585 1177399
19834 1177399 1131616 1158838 1286750 1255547 1249573 1162086 1169986 1199448 1280641 1285036 1341427 1301519
19822 1301519 1357825 1365555 1245738 1139491 1107954 1080107 998557 1088250 1179852 1047476 790189
19811 790189 530982 344979 233656 194090 231884 256681 276284 282819 456026 735283 927182
19800 927182 1086622 1219108 1393795 1452988 1339831 952192 655414 692672 805866 902957
19790 902957 975397 1175650 1353259 1461378 1415137 1308401 1063513 752464 551818 382039
19780C82039j05511o9765j16985o4637P3344o9886j51754p421J60766N1379M5707
19769A27276L7427q8666k2204M157P2873K2487K0173L3841M3441n9160n3628Q6135
19757B24152j2303l382j8356J17754J166K655L01062K70775M3067o5445j14364
19746G46781j59093j54782K380J22901M6399J16182P4625N2200J34529o896j82670
19735G92556j86562n5086j57751r2454n2876n6620j2317N172r2112J2135r7417
19724F668j28957q681J46561R1597N9327m2741O0670r2649j20361p267M6454J73817
19712A84438l1779n9564o1099k6633K4308l8235p5688n5066N9801N1299K4209
19701d009J02971k1408p7723m5998M6056n542L1445l6033J34629J43175J72j19858
$$ plain form
19780 382039 276528 206763 89778 25141 98485 28599 -123155 -130576 30190 81569 127276
19769 127276 164703 76037 53833 57990 130863 153350 173523 207364 250805 191645 138017 224152
19757 224152 211849 208467 190111 307865 309031 311686 612748 883523 926590 861145 746781
19746 746781 587688 432906 435286 558187 604586 720768 795393 847593 982122 975226 792556
19735 792556 605994 550908 393157 300703 247827 191207 178890 184062 91950 104085 6668
19724 6668 -122289 -130970 15591 107188 166515 123774 184444 91795 -28566 -35833 10621 184438
19712 184438 152659 93095 31996 5363 29671 -8564 -84252 -139318 -79517 -28218 -4009
19701 -4009 98962 77554 -169 -46167 -111 -5653 25792 -10241 124388 267563 267735 147877
19689A47877q7571O5755l5481n4937l8786M5250n7902q9538j7326L6874L1413
19678e4372l8887L3296q3747Q8867J16201K1418J5459M2852L278o2205Q2999O851
19666A72010k6174M8036L2873j34390n3731J9945P4833J24281Q3858p3266m0720
19655B27555n433o1711m0651o4272j4866P111J8023J8462J6367O6659o7151k3681
19643G6412r5945l6003Q3017l5923K0897J17725J58819N915p6314m712J877j8465
19631A97300J8815p3673K2844L7732p0024l3405L6487n621K5379l3869J5113N4035
19619A91113m3150o5870p6667L8781K17667L4741p5093j4568J0555m1543n5804
19608A20162L4736P1248O9576p9048N91J15698J52628j53647r8636L8992l9734
$$ plain form
19689 147877 60306 126061 90580 35643 -3143 42107 -15795 -105333 -122659 -85785 -54372
19678 -54372 -93259 -59963 -143710 -54843 61358 82776 98235 141087 144365 82160 165159 172010
19666 172010 145836 193872 226745 92355 38624 58569 133402 257683 341541 268275 227555
19655 227555 222122 160411 119760 55488 40622 47733 65756 84218 100585 167244 100093 76412
19643 76412 -19533 -55536 27481 -8442 12455 130180 288999 294914 218600 213888 215765 197300
19631 197300 216115 142442 165286 203018 132994 99589 136076 130455 155834 121965 137078 191113
19619 191113 147963 82093 5426 44207 261874 296615 221522 206954 217509 175966 120162
19608 120162 154898 226146 295722 216674 217265 332963 485591 331944 233308 272300 232566
19597B32566l3998M2035L5384m9772l3305M8463j1848Q9551L949L1932j1717j40509
19585B02731q8397J57725Q2564m5587o9794J0944L4013L0478p7231r5339K7695
19574A69802r7113r5888P621M5696m1714R6861J69865R3653o8769j11938l548
19563A64528R2582M2811M0267m3049l9568k8419J23149J66019J18433q5977j40148
19552D10628L0531n1240o7662j22327O2186N534m6860o3605J1126M7572p3693
19541A42190Q2697J45248R495o8711j60586j19081M5849J55053k1333L0580m7851
19530A93550K9622O7862J3409M3673M5630n9033J2777O7159K3099J2624O4001
19519E14373N8109P8608J6215K43J02788K1425j49196o8945k8813P402r3143m8093
$$ plain form
19597 232566 198568 240603 275987 226215 192910 241373 229525 319076 323025 354957 343240 202731
19585 202731 114334 272059 354623 309036 239242 250186 284199 314677 237446 142107 169802
19574 169802 72689 -23199 -15578 30118 -11596 85265 255130 348783 280014 168076 164528
19563 164528 257110 299921 340188 297139 257571 229152 352301 518320 636753 550776 410628
19552 410628 441159 389919 322257 199930 262116 267650 220790 157185 168311 215883 142190
19541 142190 224887 370135 379630 310919 150333 31252 77101 232154 210821 241401 193550
19530 193550 223172 291034 304443 348116 393746 334713 347490 414649 437748 450372 514373
19519 514373 572482 651090 667305 667548 770336 791761 642565 573620 544807 552209 459066 410973
19507D10973O1556J32421m7163j46802j03727K5935o829k3783M6849L351l4189
19496C18592K3073j537p9629j37282Q4525M5419L728P2043k8357m0370J2688J49898
19484D22791J33038j9937P4614j1377J06909R3168K4041J62087N2865J03350j14413
19473A027136j05059q7293P748R2943J46263k7880N7444R4751m5863o9150q0583
19462A010457k8921j03097j44843J1234J58039Q7950n1989k9928l4795K2882J2611
19451I09600l4407O2646K2251J50996J94433J77726J00343O507n5470K8365j79741
19440A383249j64856J32668K14335J87678J64145K9373J25483Q7384J46880R9828
19430B406167J81282J70618K06520M8854K3127O8681K20550K05457J50352L56950
$$ plain form
19507 410973 472529 604950 557787 410985 307258 333193 326364 302581 349430 352781 318592
19496 318592 341665 340128 260499 123217 207742 253161 256889 328932 300575 260205 272893 422791
19484 422791 555829 535892 610506 599129 706038 799206 823247 985334 1038199 1141549 1027136
19473 1027136 922077 834784 842532 935475 1081738 1053858 1111302 1206053 1160190 1091040 1010457
19462 1010457 981536 878439 733596 744830 902869 990819 938830 908902 874107 896989 909600
19451 909600 875193 937839 960090 1111086 1305519 1483245 1583588 1590095 1534625 1562990 1383249
19440 1383249 1218393 1351061 1565396 1753074 1917219 1946592 2072075 2159459 2306339 2406167
19430 2406167 2587449 2758067 2964587 3013441 3036568 3105249 3325799 3531256 3681608 4038558
19420D038558N30130L42923K90245O19083P39040J000079J504819K349770L379145
19411A4793792M796971P040484J0970540J5301471J7875596J2375473K392075
19404H5546402l501746l263598M777225J3616127J6438900J0846461Q233126O733255
19396A39426152P51026r498630j3471692j1891759k025706P002223M975943q138839
19388A07128718j7783330k2985874j9256515j3203525p650126m473241l010183
19381A8765924k085590j448185q82645o97368n67920m54708k03718r6423J55165
19372A2484532L55301N29419O97166R84580J576847K268143K904837L881371N837272
19363C1519468Q899190J2963294J8292650K7575962M1427598N3794683N3112936
$$ plain form
19420 4038558 4568688 4911611 5201856 5820939 6559979 7560058 9064877 11414647 14793792
19411 14793792 19590763 26631247 37601787 52903258 70778854 83154327 85546402
19404 85546402 82044656 78781058 83558283 97174410 113613310 124459771 132692897 139426152
19396 139426152 140177178 130678548 117206856 105315097 103289391 110291614 115267557 107128718
19388 107128718 89345388 66359514 47102999 33899474 26249348 21776107 18765924
19381 18765924 16680334 15232149 14349504 13652136 13084216 12629508 12425790 12329367 12484532
19372 12484532 12839833 13369252 14066418 15050998 16627845 18895988 21800825 25682196 31519468
19363 31519468 40418658 53381952 71674602 99250564 140678162 194472845 247585781
19356B47585781K3189809l722199j7677929n793280K1167805M2883991L4013727
19349C41647705J4736979L588474m304838k1200760l3581348l5960420k1878145
19342B43047647J446546J4936230k899169k8403221m6468339m9512359l8169645
19335I3977690k4994945j4865000r346295o286695m416828k953039j676310m45997
19327B8992581M67217J153988K131276M218110P930338J2632754J9169866L0041698
19319A06737828M1664369M7182768K8128003o849753l1343647m2971318l3709762
19312A08838488j7845343k333578J1143250K5404858L7465803M0617015J5814869
19305B19105362j6816788l9365356m6710736l6990831k4316906j3913878q220253
$$ plain form
19356 247585781 270775590 267053391 249375462 243582182 264749987 307633978 341647705
19349 341647705 356384684 359973158 355668320 334467560 300886212 264925792 243047647
19342 243047647 244494193 259430423 256531254 228128033 181659694 132147335 93977690
19335 93977690 68982745 54117745 44771450 38484755 34067927 31114888 29438578 28992581
19327 28992581 29459798 30613786 32745062 36963172 44893510 57526264 76696130 106737828
19319 106737828 148402197 195584965 223712968 216863215 185519568 142548250 108838488
19312 108838488 90993145 88659567 99802817 125207675 162673478 203290493 219105362
19305 219105362 202288574 162923218 116212482 79221651 54904745 40990867 32770614
19298C2770614n256913l409657k520870j907801j557077j097427r69389p49618
19290A5301862o49575m99078N5456M41532N59360P13837R26269J180324J660704
19281A9690691K014677K557767L855098N920432R426457J4082805K0866216L2609749
19273A11023892M6019399N4130144L8968276N375205j8113078l2012551l2711309
19266A72679978k5674060j5657479k853379J4920275L2614755M3047795L0822288
19259B49900173J067893k0756009l5781722m0729592l6970790l1529292k3797982
19252F1402679j6031898r985363o080466m383345l441791k778371k181434j645113
19244A4874898j057000n65230l18920j22714l1709p9510l69923o40199p61752
$$ plain form
19298 32770614 27513701 24104044 21583174 19675373 18118296 17020869 16051480 15301862
19290 15301862 14652287 14153209 14208665 14650197 15209557 15923394 16849663 18029987 19690691
19281 19690691 21705368 24263135 28118233 34038665 43465122 57547927 78414143 111023892
19273 111023892 157043291 211173435 250141711 255516916 237403838 205391287 172679978
19266 172679978 147005918 131348439 128495060 143415335 176030090 219077885 249900173
19259 249900173 250968066 230212057 194430335 153700743 116729953 85200661 61402679
19252 61402679 45370781 35385418 29304952 24921607 21479816 18701445 16520011 14874898
19244 14874898 13817898 13252668 12933748 12811034 12779325 12699815 12329892 11689693 10927941
19235A0927941p09246m24386J6301N42360Q36400J224209J839313L087246M850746
19226B2190884O887799J0742220J6711436K1937749K2276163P141889q589808
19219I9298332j9074183k0501992j3793464n824296Q43525O867906J3770871J9716546
19211H1303245K0238193N248094j0495730k1133416k3077966j7453967j1126853
19204B3501600o278325l739099k309076j504734j209506j074057r90445q51232
19196E545126p22723o15127m27580k21402j54176j12038k2464j20993j18530k51310
19186B778783l45112j13459p4577j52737k47748j89876j21430r8432n790L9539
19176A469161j21373q2244n9853M4174N1637p7311j40719J229P4458l5407o730
$$ plain form
19235 10927941 10218695 9794309 9810610 10352970 11189370 12413579 14252892 17340138 22190884
19226 22190884 29078683 39820903 56532339 78470088 100746251 107888140 99298332
19219 99298332 80224149 59722157 45928693 40104397 40947922 47815828 61586699 81303245
19211 81303245 101541438 106789532 96293802 75160386 52082420 34628453 23501600
19204 23501600 17223275 13484176 11175100 9670366 8460860 7386803 6396358 5545126
19196 5545126 4822403 4207276 3779696 3558294 3404118 3292080 3269616 3148623 3030093 2778783
19186 2778783 2433671 2320212 2245635 2092898 1845150 1655274 1533844 1435412 1429622 1469161
19176 1469161 1347788 1265544 1205691 1249865 1301502 1224191 1083472 1084701 1159159 1123752 1117022
19165A117022r9245j27201j12849p0427O7214q9077j03288j21464M7506J741k9839
19154D80093j7519j1239l6287J6446j8034j49628j33346n7919O2027L1046J3924
19143A79564J7478j0441P1157J05694J09929Q3048J18464J9862o3482j4956j39836
19132D76481l4676M7629m4108p064M9673R2295J32764q8934o2820n0673l6453
19121D74114M5093J6496r4594j45480N2332M4535k1531o6088j47845j06120o327
19110D4585N7459Q4474J56436J0088J42m992n9996j23499l7233J8909O2080L2569
19098B41022J8368L7257P8684R0271p4559m5399l7873l1165m9321n5157M6651
19087B18779K4578J5262k4205j3191m8516q0627l983J04887J26727q356j4634
$$ plain form
19165 1117022 1017777 890576 777727 707300 774514 685437 582149 460685 508191 509932 480093
19154 480093 462574 451335 415048 431494 413460 263832 130486 72567 134594 165640 179564
19143 179564 197042 186601 257758 363452 473381 556429 674893 694755 631273 616317 476481
19132 476481 441805 489434 445326 438262 487935 580230 712994 624060 561240 510567 474114
19121 474114 519207 535703 441109 295629 347961 392496 370965 304877 157032 50912 44585
19110 44585 102044 186518 342954 353042 353184 348192 288196 164697 127464 146373 208453 241022
19098 241022 259390 296647 375331 465602 391043 345644 307771 276606 227285 172128 218779
19087 218779 243357 258619 234414 221223 172707 92080 88097 192984 319711 311355 296721
19076B96721N5263J260j9164N512q9616j09580J5840R3370n1173q6907J7294L3609
19064A62429p1791J34514J08710m9708K3907n9531j7514O8241m4677m2157l9506
19053A72917q0817N3247O4691J0212j27698r2160Q7133J06206O2134o152l5690
19042B14023Q3841K0166j63207L2395Q3600m712j17527n3170o8992o0681l6014
19031g0278P9790J43482M1401n5210q4047m6310l0561N2230K18J02954Q1825k5378
19019A90116K7336r6462j7274l5606N3227M5989J13017j23729p0088r7417j1117
19008b2008o2401n584Q0082O7359J01910j07163j05363J27001P4304L508K922
18997A54567j36138p1407j0810Q711J21651J23145N0731l8175j09973r5181L4777
$$ plain form
19076 296721 351984 353244 334080 339592 249976 140396 156236 249606 198433 111526 128820 162429
19064 162429 90638 225152 333862 284154 308061 248530 231016 299257 254580 212423 172917
19053 172917 92100 145347 210038 220250 92552 392 87525 193731 255865 249713 214023
19042 214023 297864 318030 154823 187218 270818 266106 148579 95409 26417 -34264 -70278
19031 -70278 9512 152994 194395 139185 55138 8828 -21733 30497 30715 133669 215494 190116
19019 190116 217452 120990 103716 68110 121337 167326 280343 156614 86526 -10891 -22008
19008 -22008 -84409 -89993 -9911 57448 159358 52195 -53168 73833 148137 151645 154567
18997 154567 18429 -52978 -63788 -55077 66574 189719 240450 202275 92302 -2879 31898
18986C1898R6039n3707q4499l4914K737j0848K9084L9640L1810L4269m4055j16034
18974g8580j136j9855N6809M6157l1252L0480R7910K1129p1133j1236K640q434
18962C3499j09400o3753J26709K8324o077q109L1432J51565O7576j17030k4776
18951A09960L5280p3872L4131M9330J5558q2119J1875n8961m719Q9747P112O1949
18939A95271J9855n8669p5728n9175j4310J14986P8096p6112m3279j3251o8700
18928a016q7518l8862k2838q4500R4394N2470N2489K6083N403J5652n2018l0055
18916g0316j2126N271M4903j0392M4630r622pM50J04440k7904L017J843J08554
18903A82741L9438O591O4636q8453l0384j45422K3159J48665M4010n1152j439
$$ plain form
18986 31898 127937 74230 -10269 -45183 -42446 -53294 -24210 15430 47240 81509 37454 -78580
18974 -78580 -79716 -99571 -42762 3395 -27857 2623 100533 121662 50529 39293 41933 33499
18962 33499 -75901 -139654 -12945 15379 9302 1193 32625 184190 251766 134736 109960
18951 109960 145240 71368 105499 154829 170387 88268 100143 41182 36463 126210 133322 195271
18939 195271 215126 156457 80729 21554 7244 122230 200326 124214 80935 67684 -1016
18928 -1016 -88534 -127396 -150234 -234734 -140340 -87870 -35381 -9298 -3895 11757 -40261 -70316
18916 -70316 -82442 -77171 -32268 -42660 1970 -7652 -7659 -7209 97231 69327 72344 74187 182741
18903 182741 222179 228770 293406 204953 174569 29147 52306 200971 244981 193829 192390
18892A92390L7013L5903l3226k1423J443j63430p7074m629P6938r276l3780N1707
18880E2556j1133K3958m8941j00933J8767P4194K4668J51949J90795L6841k1248
18869C91473J28552K9363J01287K41439J50716J17017J44867Q4065Q7221J37033
18859A613033J04123Q7544j09339m8116o2801r9967n9503m7694K6032j31636k20862
18848A050814j94941j05447k52440j39313j0425J7879P817k1221k2231p2021j13799
18837A44672L5697J73886P0890k629P6790M6355k9569j2016L93J21606K51253
18826H77328L01150L67507L83975L71803R5748j14442k60879k73577j90908M5262
18816A602967J10167q64M6015j03794o1262K9943K22350J82348p842j2511m5826
$$ plain form
18892 192390 229403 265306 232080 210657 212100 48670 -28404 -33033 43905 34629 849 52556
18880 52556 41423 65381 16440 -84493 -65726 8468 33136 185085 375880 412721 391473
18869 391473 520025 549388 650675 892114 1042830 1159847 1304714 1388779 1476000 1613033
18859 1613033 1717156 1804700 1695361 1647245 1584444 1484477 1424974 1377280 1403312 1271676 1050814
18848 1050814 855873 750426 497986 358673 348248 366127 373944 352723 330492 258471 144672
18837 144672 180369 354255 425145 422516 499306 545661 516092 504076 504469 626075 877328
18826 877328 1178478 1545985 1929960 2301763 2397511 2283069 2022190 1748613 1557705 1602967
18816 1602967 1713134 1712270 1758285 1654491 1593229 1623172 1845522 2027870 2020028 2007517 1961691
18805A961691j28232M6714P3571m0718q5635R5116J44389J56357K21016o0089
18795B384180l05510j49207p9973k48326j57852n5087P6147j56k488r0265q6243
18784A285220q1619l1061O5983J18015K5805k3488o3226l0171P9162J14501J10747
18773A569868J32329L9465L4054J67255K84066K22816K57978M30860J88503J54807
18763C482001K04072K11756K38178M14693N74597P22284Q92881Q55480J123783
18754H719725J259282J363143J897540L000231M835090P752175J1245681J6914601
18746E6987468K5878470L4221328L6468671J7133697q348301k5706507l0997956
18739A05636870k1671981q999298M152342J7711881K8889352L3996121J5028496
$$ plain form
18805 1961691 1833459 1880173 1953744 1913026 1827391 1922507 2066896 2223253 2444269 2384180
18795 2384180 2078670 1929463 1849490 1601164 1443312 1388225 1464372 1464216 1461728 1371463 1285220
18784 1285220 1203601 1172540 1238523 1356538 1382343 1358855 1295629 1265458 1344620 1459121 1569868
18773 1569868 1702197 1741662 1775716 1942971 2227037 2449853 2707831 3138691 3327194 3482001
18763 3482001 3686073 3897829 4136007 4550700 5125297 5847581 6740462 7595942 8719725
18754 8719725 9979007 11342150 13239690 16239921 21075011 28827186 40072867 56987468
18746 56987468 82865938 117087266 153555937 170689634 162341333 136634826 105636870
18739 105636870 83964889 74965591 79117933 96829814 125719166 159715287 174743783
18732A74743783j2072172l0167236l7358127k9714637j9532401j0971670o166265
18725B8761275l450491j629551p7380J182681K337107M197858O945018J0727896
18717D8994413J6893152K5521666L3049187L3288291J3076077r941504k5408876
18710A35472406k8107697j8314935n938805P636776K1304145L2012521L3523546
18703A77587957J0915542q796151j9967595j3809711K493704J5049001O942597
18696A70415344j1583382k4700553k8848242k0596742r365782K219583J3030911
18689I0571137K1652332K5099585J1758938r577562k4158014l0460567k5284423
18682E9601426j7256029j0069833n865609l356379j890528r78750R0876J287393
$$ plain form
18732 174743783 162671611 132504375 95146248 65431611 45899210 34927540 28761275
18725 28761275 25310784 23681233 23603853 24786534 27123641 31321499 38266517 48994413
18717 48994413 65887565 91409231 124458418 157746709 170822786 160881282 135472406
18710 135472406 107364709 89049774 83110969 90747745 112051890 144064411 177587957
18703 177587957 188503499 179707348 159739753 145930042 148423746 163472747 170415344
18696 170415344 158831962 134131409 105283167 84686425 75320643 77540226 90571137
18689 90571137 112223469 137323054 149081992 139504430 115346416 84885849 59601426
18682 59601426 42345397 32275564 26409955 23053576 21163048 20184298 20275174 21562567
18674B1562567K832234M954977P532751J1876164J9015810K6711649L0458687
18667A24944839J8250630m176668j9386445k6193880j9487568q894066K534060
18660F7590902J3892979K2455976K5267125J0046213j0896735k5041639l0132780
18653G3182041k4329260j6271453r364188n595778l563387k310051j605043j164652
18645H978229q08160p49855p83236o88946o78763n68043l69092k78014j97249
18636C856871j40818l50188l21703l74387l25579j95024k40512j45197o8522j22350
18626A572591m8559o5420k2532k2834k1197m4693n9092p7251k6071j06409j35083
18615I43450q388M9183Q9198J04941N2760N0712J28685K9110m1660j69615k32257
$$ plain form
18674 21562567 24394801 29349778 36882529 48758693 67774503 94486152 124944839
18667 124944839 143195469 139018801 119632356 93438476 73950908 65056842 67590902
18660 67590902 81483881 103939857 129206982 139253195 128356460 103314821 73182041
18653 73182041 48852781 32581328 23217140 17621362 14057975 11747924 10142881 8978229
18645 8978229 8170069 7420214 6636978 5948032 5269269 4701226 4332134 4054120 3856871
18636 3856871 3716053 3365865 3044162 2669775 2344196 2149172 1908660 1763463 1694941 1572591
18626 1572591 1524032 1458612 1436080 1413246 1392049 1347356 1288264 1211013 1184942 1078533 943450
18615 943450 935062 984245 1073443 1178384 1231144 1281856 1410541 1439651 1397991 1228376 996119
18604I96119j69396J6539j35214j02833p8357p9278P5755J46685r9115l4119K0865
18593E57651r0982L0765M8865j66012m5838o9261N3745o739m1543R7705J10678
18582D79034Q943K3503L4315J23554o8490o7592M4835P2138K67174J41899n6000
18571A003313j01217k50240j90535q5925o6319o598K2396L2315J3055j03981j17696
18560A48568K8950J49264j4849O1788O2294m3442k4114n2040p8605J3779Q2519
18549C34112K1276p7310J7423N5752o6174j66437r0514R410k2589K0737J3705
18538D9391R746N2199r956M1344n359j5297J2689Q8294p7282o4956j1347J16561
18526A86027J18783M1527j17836n5392O8732M9283O4521j2629N389j57830q6950
$$ plain form
18604 996119 826723 843262 708048 605215 526858 447580 523335 670020 570905 536786 557651
18593 557651 466669 497434 546299 380287 334449 265188 318933 312194 270651 368356 479034
18582 479034 487977 511480 545795 669349 600859 533267 578102 650240 917414 1059313 1003313
18571 1003313 902096 651856 461321 375396 309077 302479 324875 357190 370245 266264 148568
18560 148568 177518 326782 311933 373721 436015 392573 368459 316419 237814 251593 334112
18549 334112 355388 278078 295501 351253 285079 118642 28128 37538 14949 35686 49391
18538 49391 59137 111336 101380 142724 137365 122068 134757 223051 145769 80813 69466 186027
18526 186027 304810 346337 228501 173109 241841 291124 355645 343016 348405 190575 103625
18515A03625k044Q5931k7703p0449J5030j07447K9907N8200R7060K027K0143m8519
18503A55761n5311j06766p3647K1500k578J27788M4785l5181n209j1888j85573
18492a26319m8439N2227J00590J51954L3268j45714j28814j9238R4954P2960J08447
18481A45876p0418j12036j8193J2037l1246L7294P500M9998n011p4284m3774K4103
18469g8154L0860Q2929P3776J04194k8530N1069K2324p2231j9623m5168j20334
18458A112l4749j5685J0828M4756Q3141o108L0624l8334n2954p2106m661J7656
18446c6480n625p908L4193J31504M1268q2111P735K7590J3665M1096k3066m0115
18434A01746M0164L3386k8958p2941n5789r4768P511R9040M429m6066k8869k9940
$$ plain form
18515 103625 101581 187512 159809 89360 104390 -3057 26850 85050 182110 184137 204280 155761
18503 155761 100450 -6316 -79963 -58463 -61041 66747 111532 76351 71142 59254 -126319
18492 -126319 -174758 -122531 -21941 130013 163281 17567 -111247 -130485 -35531 37429 145876
18481 145876 75458 -36578 -54771 -42734 -73980 -36686 -29186 20812 15801 -58483 -102257 -78154
18469 -78154 -47294 35635 109411 213605 185075 236144 258468 186237 166614 121446 1112
18458 1112 -33637 -49322 -38494 6262 89403 83295 113919 75585 22631 -49475 -54136 -36480
18446 -36480 -42105 -50013 -15820 115684 156952 74841 82576 110166 123831 164927 141861 101746
18434 101746 141910 175296 146338 73397 17608 -77160 -69649 29391 33820 -12246 -41115 -71055
18422g1055L0116L5694N8882j62408L2407J84652j9242j45932o6724J889K6337
18411i5384R8857Q905N2156Q4075l4535p9237j27011k9540Q9482K1326l3646L0776
18399a3776J9270q7780l8828M7652r0799N897Q5438L2651J07970O4718m5573r8574
18387a1734k0850N1919k5777k4820k3541J2326Q0372j44860j35713L6418P0758
18376a35502P2377Q2786k4364j9062j0687J0488L6362N4843q8141l0423p817q6298
18364a45438k5944P6099Q8969O8438j09472l2795j243J6575j09538j29228O4426
18353b39151M5575K291J03756J38749q0352j06686r0611K5753J30417n9913J9279
18342a10893K8340q1519o6993j13986r4795R9632Q3155j4256J02125j5816L8019
$$ plain form
18422 -71055 -40939 -5245 53637 -108771 -76364 108288 89046 -56886 -123610 -121721 -95384
18411 -95384 3473 12378 64534 148609 114074 34837 -92174 -121714 -32232 -10906 -44552 -13776
18399 -13776 5494 -82286 -121114 -73462 -164261 -158364 -72926 -40275 67695 132413 86840 -11734
18387 -11734 -32584 19335 -6442 -31262 -54803 -42477 37895 -106965 -242678 -206260 -135502
18376 -135502 -63125 19661 -4703 -23765 -34452 -23964 12398 67241 -20900 -51323 -59140 -145438
18364 -145438 -171382 -95283 -6314 62124 -47348 -80143 -81386 -64811 -174349 -303577 -239151
18353 -239151 -193576 -191285 -87529 51220 -29132 -135818 -226429 -200676 -70259 -130172 -110893
18342 -110893 -82553 -164072 -231065 -345051 -439846 -340214 -257059 -271315 -169190 -185006 -146987
18331a46987J04770R8624l3063q7078m9698O3137P1667n8204p8K7209q2252m4762
18319a36715L1777R6879l3716j24742r2959n2341m1553K13705R9074j13396o9597
18308b23584l1770N8190Q5804m2351k4162J0810Q697n8096m7513M1746J27864
18297i4365m1957M6037P0856j4186o9516M5258K3571l5108l9781J8085l5494O9300
18285e7300J70909J3601k6961j15889q1395K5779P652M359K9816l1576L869O7410
18273A0274k7312j06354j6369N2929J64738J3455R577J9068l4963l3850n2163
18262i70J3308q3679k3828j9339o9265M1046K8048J06930L5009Q687n0095q9493
18250a03641j4422R7296L4923n5630m7266l5179j12346k9948J21776m7877j13000
$$ plain form
18331 -146987 -42217 56407 23344 -63734 -113432 -50295 21372 -36832 -36910 -9701 -91953 -136715
18319 -136715 -104938 -8059 -41775 -166517 -259476 -311817 -353370 -139665 -40591 -153987 -223584
18308 -223584 -255354 -197164 -111360 -153711 -177873 -167063 -158366 -216462 -263975 -222229 -94365
18297 -94365 -136322 -90285 -19429 -33615 -103131 -57873 -34302 -69410 -109191 -91106 -126600 -57300
18285 -57300 113609 127210 100249 -15640 -97035 -71256 -63604 -59245 -29429 -61005 -57136 10274
18273 10274 -17038 -123392 -139761 -86832 77906 91361 100938 120006 85043 51193 -970
18262 -970 12338 -71341 -95169 -114508 -183773 -142727 -114679 -7749 27260 35947 -14148 -103641
18250 -103641 -118063 -20767 14156 -41474 -88740 -123919 -236265 -266213 -144437 -192314 -305314
18239c05314o6980J00032O2928P5216P2570M0842O9904J1608j05676l8901p9980
18228a63751l6421J1688J07318K4451K6020p7233J9194P4495J66884J35722J63712
18217D52079J11079l6641j3221N7872l5589j16820p7316k3025P183J11176J32207
18206E68984N8715J6843P9058N8573k1210j17485j87696j54429q7180O2621n9693
18195B17101m4560P8881P9697l0406K777Q4070J43463O4825J79036J1726j11301
18184F75309j29662n9146l2646q6526N5514J07130J23465M5986O4648M6738M6907
18173H57717J14676L9764n2952j02006r4509j02307j31964j26603l6148N6614
18163D22282r956J23203Q5222P2778p6556j04278r0208n2747j229j13598J6920
$$ plain form
18239 -305314 -372294 -272262 -209334 -134118 -61548 -20706 49198 60806 -44870 -83771 -163751
18228 -163751 -200172 -188484 -81166 -56715 -30695 -107928 -88734 -14239 152645 288367 452079
18217 452079 563158 526517 513296 571168 535579 418759 341443 318418 325601 436777 568984
18206 568984 627699 644542 723600 782173 760963 643478 455782 301353 214173 276794 217101
18195 217101 172541 251422 331119 300713 303490 387560 531023 595848 774884 786610 675309
18184 675309 545647 486501 453855 367329 422843 529973 653438 699424 764072 810810 857717
18173 857717 972393 1012157 959205 857199 762690 660383 528419 401816 365668 422282
18163 422282 412326 535529 620751 693529 616973 512695 422487 369740 368511 254913 271833
18152B71833K8963j28437j09977j8967N1168K87j9247n71P0583p237Q1527K67650
18140D87575J00586k7655p7978q4292j08994j7838q0584L6067K13006K02527P7096
18129G19516j02846o7626j75872j51139N6361n6669p7927N1559m6777j24917K9474
18118E3137p199j00512p3481J14471M8527j03147L5431R1980k3928J9244R510
18107F4033J3298n0837j8869p5550n9270j489N8713J13801p6963N148n994p2503
18095a06482O1402N0725j1872n0221m039k250q4972j03530m3721k137J28928J43367
18083b4802r4247m4580O8264J17171n4859r28K8252M0070o9084m8121P2377o3610
18071g4097J0871N9851R1880j1876k5206j8565L8572K9972M8255p3327j12720
$$ plain form
18152 271833 300796 172359 62382 43415 94583 94870 75623 75052 145635 138398 219925 487575
18140 487575 588161 560506 482528 398236 289242 271404 190820 226887 439893 642420 719516
18129 719516 616670 549044 373172 222033 278394 221725 143798 195357 148580 23663 53137
18118 53137 45938 -54574 -128055 -13584 34943 -68204 -32773 59207 35279 54523 64033
18107 64033 77331 26494 7625 -67925 -127195 -128684 -69971 43830 -33133 -27985 -33979 -106482
18095 -106482 -45080 5645 -6227 -56448 -60487 -62737 -147709 -251239 -294960 -297097 -168169 -24802
18083 -24802 -119049 -163629 -95365 21806 -33053 -33981 -5729 34341 -34743 -82864 -10487 -74097
18071 -74097 -63226 -3375 88505 76629 51423 32858 71430 101402 149657 76330 -36390
18060c6390n790K1081r1447r7189M8303P3224J5447p2299l0377j3348L6449M0538
18048a11798o558l6293k8937Q8351l4373l5361j0389R512O5793M5307M1152N2156
18036C8562p95O7529O858k4386m9560J796K3071m3337Q984p2646j46734p9294
18024b69952j700M253K9616Q8727N8856P3661M7712n4661r6507o9546Q6708K8690
18012g4143j2799J1484O5871O542o8633j00115J8177O8004r4159Q9801N8699k1238
18000e2509k6038N9193m6705j0850o5193P4090N8634K1256k8492j47022j322K0375
17988a44583l3801l9957K9515J00265J9255K2080m798q3155n0090q745l4973o5528
17976b94515J32138J12113R762M4819Q7322q5126K4731k0604r7727P5718R781
$$ plain form
18060 -36390 -42180 -21099 -112546 -209735 -161432 -88208 -72761 -145060 -175437 -188785 -152336 -111798
18048 -111798 -118356 -154649 -183586 -95235 -129608 -164969 -175358 -165846 -100053 -54746 -13594 38562
18036 38562 37767 105296 112154 87768 38208 40004 63075 19738 28722 -43924 -190658 -269952
18024 -269952 -271652 -267399 -237783 -149056 -90200 -16539 31173 -23488 -119995 -189541 -102833 -74143
18012 -74143 -86942 -75458 -9587 -3045 -71678 -171793 -153616 -85612 -179771 -89970 -31271 -52509
18000 -52509 -78547 -19354 -66059 -76909 -142102 -68012 -9378 11878 -16614 -163636 -164958 -144583
17988 -144583 -178384 -218341 -188826 -88561 -69306 -47226 -52024 -135179 -185269 -194014 -228987 -294515
17976 -294515 -162377 -50264 -40502 4317 91639 6513 31244 10640 -87087 -11369 -1588
17965a588p8596L5920k0625m988j77692K2109P0938l2526p9203M0111o3262K0331
17953b69071J83444J35815k0330q7297l4228N726m8705N6990K7219j15468l5485
17942b01390N7840P2293O3138N1566L6570m0708j24593k7571j83P9705j5367l1458
17930h0158q9939m1952K7012j4895q033K9752n1757Q7257J42404j24488r7529
17919b22326o0981J1974K7377J04433k6354L6970J057L1449O3694K8484l9118
17908d3341N3252o4716l4340M0328K4617N3358m5945n7754o0669J0745k513n6521
17896a83499j5420n5754j0869J0484q8844K5973K20346M1701j22464k4850M5414
17885a57782q3715R179L9130n5608M305r92K1808K5192n379J4229L3057J17255
$$ plain form
17965 -1588 -80184 -44264 -64889 -69877 -247569 -225460 -154522 -187048 -266251 -226140 -289402 -269071
17953 -269071 -85627 50188 29858 -57439 -91667 -85941 -134646 -77656 -50437 -165905 -201390
17942 -201390 -143550 -71257 -8119 43447 80017 39309 -85284 -112855 -113038 -33333 -48700 -80158
17930 -80158 -170097 -212049 -185037 -199932 -207965 -178213 -229970 -142713 -309 -124797 -222326
17919 -222326 -283307 -271333 -243956 -139523 -165877 -128907 -127850 -96401 -32707 -4223 -43341
17908 -43341 9911 -54805 -89145 -48817 -24200 29158 -16787 -74541 -135210 -124465 -126978 -183499
17896 -183499 -198919 -254673 -265542 -255058 -343902 -317929 -97583 -55882 -178346 -203196 -157782
17885 -157782 -241497 -232318 -193188 -248796 -244491 -245483 -223675 -198483 -203862 -189633 -156576 -39321
17873c9321k2860M5813M3170o8063n3805K6771m5841j17989L2282P006j2047P4065
17861a30819j4063k8439m7906k610l7997L2709O0595k5851M8442J1381p7752M5384
17849a66926R4480O787M3733j093J0655m523L0881k7249k8227l2147r251p4843
17837a57723M1231J0935j0554L418J9547P5735p7970K7581K2771j08104l5005
17826a88138K403J35446R5662q6247n2638M1385r2943q2651L6569L1706K4764
17815a34682m8501Q2235N5923M2263n0516K1004N3275O1512r2755j70227m4353
17804b24822m8150O6583J04178K6363J28828o172M1806m4813r0530j12402o4962
17793b24093J4435P1399Q4198J31352p206o1570j3761J0612r8801j23265J22028
$$ plain form
17873 -39321 -62181 -16368 26802 -41261 -95066 -68295 -114136 -232125 -199843 -192837 -204884 -130819
17861 -130819 -144882 -173321 -221227 -223837 -261834 -229125 -168530 -194381 -145939 -134558 -212310 -166926
17849 -166926 -72446 -65659 -21926 -23019 -12364 -16887 13994 -13255 -41482 -73629 -82880 -157723
17837 -157723 -116492 -105557 -116111 -112693 -93146 -17411 -95381 -67800 -45029 -153133 -188138
17826 -188138 -185735 -50289 45373 -40874 -93512 -52127 -145070 -227721 -191152 -159446 -134682
17815 -134682 -183183 -100948 -45025 -2762 -53278 -32274 21001 82513 -10242 -180469 -224822
17804 -224822 -272972 -206389 -102211 -75848 52980 46808 88614 43801 -46729 -159131 -224093
17793 -224093 -209658 -138259 -54061 77291 70085 8515 -5246 5366 -93435 -216700 -94672
17782i4672O9395J6029j9670k1901R486j23023Q9163K9613o975M1737q2389o686
17770i9893n1139k5209n4829q441J04519k2630q601N1602n7723J08427R5063n1657
17758b0511k6373n3052j08771P242k3125N009O6484K0911m4979j0102N8215J23603
17746e449r1942j07078n2574J4699N2509K2993l1317K6249J8648m1945N8598l3483
17734a70092K907N537n1025p8950L4656J25966R2343L2675J6265M6775j21891
17723f4834j3954O4977J16886K0514j2920j65137j4648M0930K1218j6506k2702
17712d6176K1944j7536R819j06508l2897k3157J31727O8148p5455m4478p6175
17701a90744j13589L0218Q9145J7359K558K5136Q3991l7687Q4142Q0976j6876
$$ plain form
17782 -94672 -25277 -9248 -28918 -50819 -41333 -164356 -75193 -45580 -52555 -10818 -93207 -99893
17770 -99893 -151032 -176241 -231070 -239511 -134992 -157622 -166223 -114621 -172344 -63917 31146 -20511
17758 -20511 -46884 -99936 -208707 -201465 -224590 -219581 -153097 -132186 -177165 -187267 -129052 -5449
17746 -5449 -97391 -204469 -257043 -242344 -189835 -166842 -198159 -171910 -153262 -195207 -136609 -170092
17734 -170092 -167185 -161648 -212673 -291623 -256967 -131001 -38658 -5983 10282 57057 -64834
17723 -64834 -78788 -13811 103075 123589 110669 -54468 -69116 -28186 -6968 -23474 -46176
17712 -46176 -24232 -41768 -31949 -138457 -171354 -194511 -62784 5364 -70091 -114569 -190744
17701 -190744 -304333 -274115 -184970 -167611 -165053 -139917 -55926 -93613 -9471 71505 54629
17690E4629k9350N9251m3733o8703j6288j890N5063k4185j13711K981p1236o0592
17678b57764M6072J2383m5137M1886M3990M3818P567K6625R6122J2803j00415
17667g2050j4134k5538J11214K53429j06138k2837p5597L44l7264k3773P8460
17656F6116N3425n1949K354k2768q5082l5223k3304m0901N5398L9797L0672l4383
17644d5848j24833o9349Q0540J01581r5947N6630N3682N5842M824m1174j0204
17633c4256Q611R6367L9281o5009j18322J3804r79k3250m0287k9933o6041q070
17621b28084l7681j07314J12260N8213k307n560p6855R2997P8754k708N3115Q0903
17609A5733r8126M5692J18736N6709r804m1125j00849o8769r965m588l115O2012
$$ plain form
17690 54629 25279 84530 40797 -27906 -44194 -46084 8979 -15206 -128917 -125936 -197172 -257764
17678 -257764 -211692 -199309 -244446 -202560 -158570 -114752 -107185 -80560 15562 28365 -72050
17667 -72050 -86184 -111722 -508 252921 146783 123946 48349 48693 11429 -12344 66116
17656 66116 119541 67592 69946 47178 -37904 -73127 -96431 -137332 -81934 -42137 -11465 -45848
17644 -45848 -170681 -240030 -159490 -57909 -153856 -97226 -43544 12298 17122 -24052 -34256
17633 -34256 -25645 70722 110003 44994 -73328 -59524 -60503 -83753 -124040 -153973 -220014 -228084
17621 -228084 -265765 -373079 -260819 -202606 -204913 -210473 -287328 -194331 -115577 -118285 -65170 15733
17609 15733 -82393 -36701 82035 138744 128940 87815 -13034 -81803 -91768 -96356 -99471 -37459
17597c7459l8525n9867l1365l1205o0693M6628J28345n2908o2343m479o095K4258
17585a85708M4982N3820j7730n411J9792J78033J3798j8290J12590L750r1039
17574A08587r2817q7501p5613P5044R3881Q8925j04221m8967N4570l7336l4847
17563f0295l2814J1402J160j9725l0574k1926Q1757P9935q090k023n828q6326
17551i3347j7565N2625j8358J06453L5521m8182j827P9274K0739n9391j03176
17540d7234l7710l754j03985Q0330Q200l1438O591J5438K911m2417m3214M8893
17528a47389O3743J0032J1496J0314P3702O420j02174k2239o3072J4695N1758
17517i2714m866j3186p0874k3832O7509O2451P316R7915M4267j8433q6342Q6822
$$ plain form
17597 -37459 -75984 -135851 -167216 -198421 -259114 -212486 -84141 -137049 -199392 -203871 -209966 -185708
17585 -185708 -140726 -86906 -104636 -110047 -90255 87778 101576 83286 195876 199626 108587
17574 108587 15770 -71731 -147344 -72300 21581 110506 6285 -42682 11888 -25448 -60295
17563 -60295 -93109 -81707 -80547 -100272 -130846 -152772 -71015 8920 830 -1193 -7021 -93347
17551 -93347 -110912 -58287 -76645 29808 65329 17147 15320 94594 115333 55942 -47234
17540 -47234 -84944 -88698 -192683 -112353 -104153 -135591 -129000 -113562 -110651 -153068 -196282 -147389
17528 -147389 -83646 -73614 -62118 -51804 21898 28318 -73856 -96095 -159167 -144472 -92714
17517 -92714 -97580 -110766 -181640 -205472 -137963 -75512 -68196 29719 73986 55553 -30789 56033
17505E6033J98328j7581j15182o0625R969j71903n1713j3383M5154k6844n9053
17494b06800p5888o288Q7161Q3415R6064M5397M431j7863m0948o5860n480n7719
17482a60378l5563l7863N6576M0233L415p0468k0071q056k0284l7776J690P1697
17470b16848N6449o7294K8457J48890N0488l1060p2759k012R487K7958j1192M4613
17458c4823m159j18250k5060r335j60508J11510N9985R857J39607j179L2549M8728
17446D8922P726j944J00380J3447L0673p6116j46947n4008o0737r6327k2217R2341
17434a64807q603M1508M7186J7821L5857q1744k6676n1153M74J0725M3069L5583
17422a00760P531j561j5402J8033P9226n0907p2439j9510P7357J4686k7379J26821
$$ plain form
17505 56033 254361 236780 121598 60973 70942 -100961 -152674 -166057 -120903 -147747 -206800
17494 -206800 -282688 -288976 -201815 -118400 -22336 23061 27492 9629 -31319 -97179 -102659 -160378
17482 -160378 -195941 -233804 -177228 -136995 -133580 -204048 -224119 -232175 -252459 -290235 -288545 -216848
17470 -216848 -160399 -227693 -199236 -50346 142 -30918 -103677 -105689 -96202 -68244 -79436 -34823
17458 -34823 -38982 -157232 -182292 -191627 -352135 -240625 -180640 -170783 -31176 -32355 194 48922
17446 48922 56648 54704 155084 168531 199204 123088 -23859 -77867 -138604 -234931 -257148 -164807
17434 -164807 -173410 -131902 -84716 -66895 -31038 -112782 -139458 -190611 -190137 -179412 -136343 -100760
17422 -100760 -93229 -94790 -110192 -92159 -12933 -63840 -136279 -155789 -78432 -63746 -91125 35696
17410C5696k666m0339J9824j6895q2104r3734J7738n8738P7837P7009l2620M0362
17398e8630J44365P0053k1486j22972j69547m4237J5775j780P2933Q1197m5231
17387g9560l9811J2409K747J3097l284q3701O885o8379M546P5097J19681L5239
17375e034J7166R3380J01506M6869m4432k18739j23096J03487J2488p950J06863
17364H2508K0443r0088j01190j17455O7082R8230L5455O4516o4171j78434p0069
17353b53173O8842N2504K1351L9400K4769l9376q378O8310l9081k6649o6561q0402
17341b38444K8475P323q3937L4518N412J02243J09378j9568P126P1290k799o0801
17329c9784j07721J604L9449L6573p4051J2072K3769j06609k419J39560L8708
$$ plain form
17410 35696 33030 -7309 12515 -4380 -86484 -180218 -162480 -221218 -143381 -66372 -98992 -58630
17398 -58630 85735 155788 134302 11330 -158217 -202454 -186679 -188459 -115526 -34329 -79560
17387 -79560 -119371 -106962 -104215 -91118 -94402 -178103 -171218 -239597 -235051 -159954 -40273 -5034
17375 -5034 12132 105512 207018 253887 209455 -9284 -132380 -28893 -16405 -24355 82508
17364 82508 102951 12863 -88327 -205782 -138700 -40470 -5015 59501 -4670 -183104 -253173
17353 -253173 -184331 -131827 -110476 -71076 -46307 -85683 -94061 -25751 -64832 -91481 -158042 -238444
17341 -238444 -209969 -202646 -286583 -252065 -246653 -144410 -35032 -54600 -47474 23816 21017 -39784
17329 -39784 -147505 -145901 -106452 -69879 -143930 -131858 -108089 -214698 -217117 -77557 -38849
17318c8849o9386o0286P3932P4319j2943l1691k8793N0392k3859O965l67m929
17306f5495o3335N642O169r9279J7013m1640r6430J9693q343J06879l1955j2888
17294b63969o8977R4490N3266n5414j627R1608K8928n6372J9871L9388O9555K7866
17282b1387j04925p5276N4303J6917n4501l105R4781n481m0182M9126M5594J3915
17270c0221k9537J5695k8969J6051k6273j7449R38M4406P9607r9299m6146N8306
17258f2891J5229n4014l0236R9688Q0346l017k3506r907N348p8880r6940o2120
17246b20900P0553K2327j9836j1082M9765J57491K1108j20814o0606r4847J171
17235b05670N7061J6274j1834O2377l4951n9937m0280k1173l6026M7932o531k639
$$ plain form
17318 -38849 -108235 -168521 -94589 -20270 -33213 -64904 -93697 -43305 -67164 -60199 -60566 -65495
17306 -65495 -128830 -123188 -117019 -216298 -199285 -240925 -337355 -317662 -326005 -219126 -251081 -263969
17294 -263969 -332946 -238456 -185190 -240604 -242231 -150623 -121695 -178067 -158196 -118808 -49253 -21387
17282 -21387 -126312 -201588 -147285 -130368 -184869 -187974 -93193 -98674 -138856 -89730 -44136 -30221
17270 -30221 -59758 -44063 -73032 -56981 -83254 -100703 -99765 -55359 24248 -75051 -121197 -62891
17258 -62891 -47662 -101676 -131912 -32224 48122 45105 21599 11692 17040 -61840 -158780 -220900
17246 -220900 -150347 -128020 -147856 -158938 -109173 48318 69426 -51388 -111994 -206841 -205670
17235 -205670 -148609 -132335 -144169 -81792 -116743 -176680 -216960 -238133 -274159 -226227 -232758 -235397
17223b35397j748m5766L2037J15524m9326j15210R121l9151k6422J57599L5467
17212a63272k433n1301P460K8950N900O198k7471o4995M5694O3609L5988J32590
17200A6917L8218q625l5195l5108J2194p0097j16643J15314J59427q613k6084
17189D1705o4954L1764M0534K4203j355q3683q3285n009k6364l070l7498L2868
17177a34144N0402J5742l942J6203P3914M7208l4386r353n6465j09471J7956P6653
17165d9683m0643J5176q663o436O2851O8591M5465m9583J9883n1847N8950l5404
17153B8657n5667N1929O7704j14918j28352n1315j7420M4813L2537q5284o2929
17142b90245J17648L2033L693N0397o2404N3358J19955M6393j19702j8930o9381
$$ plain form
17223 -235397 -237145 -282911 -250874 -135350 -184676 -299886 -290765 -329916 -356338 -198739 -163272
17212 -163272 -165705 -217006 -209546 -180596 -174696 -168498 -195969 -260964 -215270 -151661 -115673 16917
17200 16917 55135 46510 11315 -23793 -11599 -81696 -198339 -83025 76402 67789 41705
17189 41705 -23249 8515 49049 73252 71897 -11786 -95071 -100080 -126444 -129514 -167012 -134144
17177 -134144 -83742 -68000 -71942 -55739 18175 65383 30997 21644 -34821 -144292 -126336 -49683
17165 -49683 -90326 -75150 -83813 -90249 -27398 41193 86658 37075 56958 5111 64061 28657
17153 28657 -27010 24919 92623 -22295 -150647 -201962 -219382 -174569 -142032 -227316 -290245
17142 -290245 -172597 -140564 -136871 -86474 -148878 -95520 24435 70828 -48874 -67804 -137185
17131a37185o2227K4349M4727j87212l4751J43327O6262O984j7078k8542Q7681
17120i3665n6231L6371J2110L3960N2216j5105j3758p2444k7940j45133p341J4619
17108b82341M3931L8218L9680n3216o868J14472N8310o2825l159J208l7323M5557
17096a04356R0535o485N7770k3769l9001m2589P0741O620o3530k4245m0643K7235
17084i1717P8120j3048j9859R0391K1536j04530j48755n2493j9531L8492O708
17073b14686O7050P8072P8362n005m6306j1844K0000K2297k7393j13537Q2277
17062g0713J6578n9497J5880k2560K5831O1603o015P6643o3058l4821N770J4392
17050c9967J9175o4384K5294l9347j09225q1257o1387Q0013J55879N3441r839
$$ plain form
17131 -137185 -199412 -175063 -130336 -317548 -352299 -208972 -142710 -135726 -152804 -181346 -93665
17120 -93665 -149896 -113525 -101415 -67455 -15239 -30344 -44102 -116546 -144486 -289619 -296960 -282341
17108 -282341 -238410 -200192 -160512 -213728 -220596 -106124 -47814 -110639 -113798 -112590 -149913 -104356
17096 -104356 -13821 -20306 37464 13695 -25306 -67895 2846 9466 -54064 -78309 -118952 -91717
17084 -91717 -13597 -26645 -46504 43887 65423 -39107 -187862 -240355 -259886 -221394 -214686
17073 -214686 -147636 -69564 8798 3793 -42513 -54357 -34357 -12060 -39453 -152990 -70713
17062 -70713 -54135 -113632 -97752 -120312 -94481 -32878 -38893 37750 -25308 -60129 -54359 -39967
17050 -39967 -20792 -85176 -59882 -99229 -208454 -289711 -351098 -271085 -115206 -61765 -71604
17039g1604m9190j2638O307M1237M0529j15253R4580M7973j33137j5357j00494
17028b67047k5810j7005j6935L30Q7408K8753J44623n416j25550j9034L1682J63518
17016b0483k2880J4911l897o2195o838o722K8174L011M2839q870n7067j01442
17004b01459p6897M0710P3279P5514M863L046M2595K503M9707L8660L0023j9048
16992F3496r2111o9892k4796k9196J2991j5099k1971m798J07733J13531O409o6934
16980b0637p7198j17014J3661P0221k7020M4657k6786o1738m130O1745K4503q5150
16968b04886J1074J81267J47251o2206o7432j08739n2718o1431N5022L438p3580
16957b32940L3117J30657l9092j72839n1045R6528J70087J0614j442N6727O1218
$$ plain form
17039 -71604 -120794 -133432 -127125 -85888 -45359 -160612 -66032 -18059 -151196 -166553 -267047
17028 -267047 -292857 -309862 -326797 -326467 -239059 -210306 -65683 -71099 -196649 -215683 -184001 -20483
17016 -20483 -43363 -28452 -32349 -94544 -101382 -108104 -79930 -76919 -34080 -42950 -100017 -201459
17004 -201459 -278356 -237646 -164367 -88853 -83990 -80944 -38349 -35846 13861 52521 82544 63496
16992 63496 -28615 -98507 -123303 -152499 -139508 -154607 -176578 -181376 -73643 39888 46297 -20637
16980 -20637 -97835 -214849 -201188 -130967 -157987 -113330 -140116 -201854 -205984 -144239 -119736 -204886
16968 -204886 -193812 -12545 134706 72500 5068 -103671 -156389 -217820 -162798 -159360 -232940
16957 -232940 -199823 -69166 -108258 -281097 -332142 -235614 -65527 -54913 -56355 372 61590
16946F1590p0878o0293k3766j0181n3222J41730R6340n6030k3369J189j58944
16935a55834K0608R4540Q0413l3521q5868m3259k9024M0396R8877J7444l3009
16924b8237p0667j04419M8128J42907k6284j09270l1301j07386J836R8267O8301
16913a18125M0205k4408K3266L3559L4371M6339m3127r3032p9198j19024n888
16902c05062J28330R1029k7434p802m9758p379O6965m576l7654J6216M4114k1732
16890a14743l7868k58l9562r152J20490Q4362K3961p7917j19160M190M3657m2423
16878a64423J50865L7340r5610O2519j0411l5488m672k4342k8264Q8052j1336
16867c5770k4033J4550P2178l165n1902m3824k6733j7881m420R3364K3177p30
$$ plain form
16946 61590 -9288 -69581 -93347 -103528 -156750 -15020 81320 25290 1921 3110 -155834
16935 -155834 -135226 -40686 39727 6206 -79662 -122921 -151945 -111549 -12672 4772 -28237
16924 -28237 -98904 -203323 -155195 -12288 -38572 -147842 -179143 -286529 -284693 -186426 -118125
16913 -118125 -77920 -102328 -79062 -45503 -11132 35207 -7920 -100952 -180150 -299174 -305062
16902 -305062 -176732 -85703 -113137 -120939 -170697 -178076 -111111 -115687 -153341 -137125 -93011 -114743
16890 -114743 -152611 -152869 -192431 -201583 -81093 3269 27230 -50687 -169847 -165657 -122000 -164423
16878 -164423 -13558 23782 -71828 -9309 -19720 -55208 -59880 -84222 -112486 -24434 -35770
16867 -35770 -59803 -45253 26925 23760 -28142 -71966 -98699 -116580 -121000 -27636 -4459 -5189
16855e189J1676Q359j06711n3418o6292R0721R4198J9518m6200o7477p211J4885
16843a13141l9058k6618M4617J14586j8790j08968l0202j7450k3524K6819o6095
16832b57824p7713O0592J08109P7789k5706j3288n8963k3836L1491n6265j8370
16821b53984k0456N2391O5189P8355q7225L9911J1292n5087l9383J20727L1883
16810e6387Q6778N8652q2387m0865j77646R59J14569J41546k4316Q4883j7429
16799H8357M353o162j14399N1879J1719M3863k5940P9458N3375j01360q6376j27165
16787a28398l2402R7171K6404j0875j3548J2850j09726r269J0226j03422O0596
16776b00393M3860J13958m0688n9584P416Q0440n4108m2122n0061Q2180K722l2810
$$ plain form
16855 -5189 6487 14846 -91865 -145283 -211575 -120854 -26656 -7138 -53338 -120815 -128026 -113141
16843 -113141 -152199 -178817 -134200 -19614 -38404 -147372 -177574 -195024 -218548 -191729 -257824
16832 -257824 -335537 -274945 -166836 -89047 -114753 -128041 -187004 -210840 -179349 -235614 -253984
16821 -253984 -274440 -222049 -156860 -78505 -165730 -125819 -114527 -169614 -208997 -88270 -56387
16810 -56387 30391 89043 6656 -34209 -211855 -210896 -96327 45219 20903 105786 88357
16799 88357 92710 86548 -27851 24028 35747 79610 53670 133128 186503 85143 -1233 -128398
16787 -128398 -160800 -63629 -37225 -48100 -61648 -48798 -158524 -167793 -157567 -260989 -200393
16776 -200393 -156533 -42575 -83263 -142847 -135431 -54991 -109099 -151221 -201282 -119102 -116380 -149190
16764a49190n5413n4874q210Q6680P9284M0541m5969q1631l1608l7235K2142J72270
16752f3213J4604L2727k7480n1600J484k8425p6676o7029o2666k5730J07275O4820
16740a81909J04790N3098q0696L592r97j3649J9174q4510K9510q6105O5525N139
16728a67038K4499J03557P5268Q1726j00058q9669P1424R3359P629j03954l8469
16717d1726j9354l8649P3588J24954l8022j08070P6517K2527p4941j3183k5992
16706f2351q1266j4485o3186J893M9364P9909Q7882n0446j6429M2339q8272M4149
16694g0899J9335J6875O311O29J2335j03631j10467M7999J15638j1044M1721Q058
16682b7140n6021m242m4356J0678M467O9233P7015q697n6624j65350r162O3029
$$ plain form
16764 -149190 -204603 -259477 -267687 -181007 -101723 -61182 -107151 -188782 -220390 -257625 -235483 -63213
16752 -63213 -48609 -15882 -43362 -94962 -93478 -121903 -198579 -265608 -328274 -354004 -246729 -181909
16740 -181909 -77119 -24021 -104717 -101125 -102122 -115771 -96597 -181107 -151597 -237702 -172177 -167038
16728 -167038 -142539 -38982 36286 118012 17954 -71715 -291 93068 100697 -3257 -41726
16717 -41726 -61080 -99729 -26141 98813 60791 -47279 29238 51765 -23176 -36359 -62351
16706 -62351 -143617 -158102 -221288 -219395 -170031 -90122 -2240 -52686 -69115 -26776 -115048 -70899
16694 -70899 -51564 -34689 -28378 -27749 -15414 -119045 -229512 -181513 -65875 -76919 -35198 -27140
16682 -27140 -83161 -87403 -131759 -121081 -116614 -47381 29634 20937 -35687 -201037 -210199 -147170
16670a47170N1246l3315M1861N633j1733j4535J161q006L5272O2742q777m8800
16658g4421K3880J7611j09084q6886o7200Q153P1498r352L2267J09603K434K8986
16646e2511O0031j8584n814l5713r8699o2k5823K6006J01671J9287n2396L0210
16634e2397l5846j648J07475n4351m9633l8268M1566J4585p1835j6633J30398
16623b6587N1431N2441l3057M445j6309m0900m6458l9181J4563o962q3153j28016
16611b97743O7885J6108L0483K7309R931P098L6445J5636l9207k1194Q913j7849
16599a56185l3144J10533N843r1884j01154o7736k8097K8558M8067K3606Q3954
16588a77639k0488K7017Q7981N7482J0953j08747j6810m1382l4252M5134n9239
$$ plain form
16670 -147170 -95924 -129239 -87378 -81745 -93478 -108013 -106852 -114858 -79586 -16844 -25621 -74421
16658 -74421 -50541 -32930 -142014 -228900 -296100 -287947 -216449 -225801 -193534 -83931 -81497 -52511
16646 -52511 7520 -11064 -16878 -52591 -151290 -151352 -177175 -151169 -49498 -30211 -82607 -52397
16634 -52397 -88243 -89891 17584 -36767 -86400 -124668 -83102 -68517 -140352 -156985 -26587
16623 -26587 24844 77285 44228 48673 32364 -8536 -54994 -94175 -79612 -86574 -169727 -297743
16611 -297743 -229858 -213750 -183267 -155958 -146027 -138929 -102484 -86848 -126055 -147249 -138336 -156185
16599 -156185 -189329 -78796 -72953 -164837 -265991 -333727 -361824 -333266 -285199 -261593 -177639
16588 -177639 -198127 -171110 -83129 -25647 -14694 -123441 -140251 -181633 -215885 -170751 -229990
16577b29990j05163R9908K6127q8389K3107M5821R0588k728m3301k2401r192J2193
16565b03420R2920L1292n8355o5760J0488M5086M7583L7272K6396L7000J0020
16554A0522M1068l7511p7005r843J17918j41707j83184n0562J58445J3008K6645
16543a32206N2969n5541k4568K0112J0707m8630l0870m3375O8249K7635O6675
16532h8843J13915n1644l3738O875p75M4226r786j9558P3516o0560j17543j9052
16520a62967J2050j00437j0727j08201k3989J92918J90148K2828l9570n0367k829
16509h1143P4517n1597j09758L3305J36226J3149m9367o0499J5938o1964k3353
16498a64546J28420Q6942M9204j40949j57520K3473J47316Q4181k080l9639o9064
$$ plain form
16577 -229990 -335153 -235245 -209118 -297507 -274400 -228579 -137991 -140719 -184020 -206421 -215613 -203420
16565 -203420 -110500 -79208 -137563 -203323 -192835 -147749 -100166 -62894 -36498 502 10522
16554 10522 51590 14079 -62926 -72769 45149 -96558 -279742 -330304 -171859 -158851 -132206
16543 -132206 -79237 -134778 -159346 -139234 -128527 -177157 -208027 -251402 -183153 -155518 -88843
16532 -88843 25072 -26572 -60310 -53435 -54210 -9984 -19770 -39328 34188 -26372 -143915 -162967
16520 -162967 -150917 -251354 -262081 -370282 -394271 -201353 -11205 11623 -27947 -78314 -81143
16509 -81143 -6626 -58223 -167981 -134676 1550 14699 -34668 -95167 -79229 -141193 -164546
16498 -164546 -36126 50816 100020 -40929 -198449 -174976 -27660 56521 54441 14802 -54262
16487e4262r3853p4464j04465o2663J09335K6948M4734P3611O4284n066m4062
16476a19923N0829J25224p6166L012j6786O3051L608j7487M0346Q7199j55747
16465a2840m6017m6018N014p3736j77813L8492J50985o021K4695J2524L1224O0185
16453c9326M3855l9884O1604n4981q196J6084K9345O6800K5912l4967r0083k4281
16441d8118k5566q9747j13600l7311J01242J20991O8586J0701q1503J8143O5224
16430a0958O7207O2517Q528j3647k4165j8445j3039J311M970j12132k2983n7998
16418a28834m1719k012k8267L0204N6113n6920J9872p669j17352j62008K7096
16407d11496K3670K6954P8189K8773p419R4957J09160M5560k4001k7905n8598
$$ plain form
16487 -54262 -148115 -222579 -327044 -389707 -280372 -253424 -208690 -135079 -70795 -75861 -119923
16476 -119923 -69094 56130 -20036 -17024 -33810 29241 32849 15362 55708 142907 -12840
16465 -12840 -58857 -104875 -99861 -173597 -351410 -312918 -161933 -167954 -143259 -130735 -99511 -39326
16453 -39326 4529 -35355 26249 -28732 -36928 -20844 8501 75301 101213 66246 -23837 -48118
16441 -48118 -73684 -163431 -277031 -314342 -213100 -92109 -23523 -12822 -94325 -76182 -10958
16430 -10958 56249 118766 127294 113647 89482 71037 57998 59309 64279 -47853 -70836 -128834
16418 -128834 -170553 -172565 -200832 -170628 -114515 -171435 -151563 -159232 -276584 -438592 -411496
16407 -411496 -387826 -360872 -282683 -253910 -261329 -166372 -57212 -11652 -35653 -63558 -122156
16396a22156N9605j5628M6165K7226K2059j37402k9760K8269n058J6946K1315
16385h8419n4234k4417n4595N6604R5700k6756k5020K9214j4489L5211m4163J0191
16373a05173l4285O7715q9523r1769L1603J40883J05136l0323j16276j00501N9406
16362a63107l0680N9766m6775m3635J6360O3957J01261o178p3596k733N107o023
16350a26276Q3255L2373l3187P7565m1713J15726m5711m8169j7772j5014M7615
16339B8692N3008L4574j23944j41564J0398n6458n7205J27813R0308L012r5702
16328a27068m7819J2641R1165J888n0249l9646l7115K8721n2544O6974L9840N7767
16316e5445J07340m2253j7198J5430m8411o3865K3212P2119N0264k7747j23061
$$ plain form
16396 -122156 -62551 -78179 -32014 -4788 17271 -120131 -149891 -121622 -126680 -109734 -88419
16385 -88419 -142653 -167070 -221665 -165061 -69361 -96117 -121137 -91923 -106412 -71201 -115364 -105173
16373 -105173 -139458 -71743 -161266 -253035 -221432 -80549 24587 -5736 -122012 -222513 -163107
16362 -163107 -193787 -134021 -180796 -224431 -208071 -144114 -42853 -49031 -122627 -125360 -120253 -126276
16350 -126276 -43021 -10648 -43835 33730 -7983 107743 62032 13863 -3909 -18923 28692
16339 28692 81700 116274 -7670 -149234 -138836 -195294 -252499 -124686 -34378 -31366 -127068
16328 -127068 -174887 -162246 -71081 -69193 -119442 -159088 -196203 -167482 -220026 -153052 -113212 -55445
16316 -55445 51895 9642 -7556 7874 -40537 -104402 -81190 -9071 41193 13446 -109615
16305a09615N1095K3259O128O0802j6758o6652L7855J2715q9491o600j07103J8174
16293a86191O4892J5105k0442N8039J7938o5541L2319m5063m504m3362J7451J02049
16281e7310k4504k8843l4550M6755J03328J04268l7052o356q719j03736j85399
16270b32118j12953L3709Q3221M0543N1138O8561K9740l10O5363J03696O518m0995
16258I6113p5483j16746j4155L1479m19j8825o1639r9172k8804K7788Q2788J05050
16246g2025O8797p8029j74364l7411N2494j3696j16437J7144K0229Q1900J06069
16235a45329J45646O0175m8114L946q8895J6404Q0978k8039j24884l3610R9664
16224f2058L8344M9010q5001L9848P085J03829j32339q8433J05345P0006m9109
$$ plain form
16305 -109615 -58520 -35261 -29133 31669 14911 -51741 -13886 -1171 -90662 -97262 -204365 -186191
16293 -186191 -121299 -106194 -126636 -68597 -50659 -116200 -83881 -128944 -133448 -176810 -159359 -57310
16281 -57310 -81814 -110657 -145207 -98452 4876 109144 72092 65736 57017 -46719 -232118
16270 -232118 -345071 -311362 -228141 -187598 -136460 -67899 -38159 -38469 26894 130590 137108 96113
16258 96113 20630 -96116 -110271 -78792 -79211 -98036 -159675 -258847 -287651 -259863 -177075 -72025
16246 -72025 -3228 -81257 -255621 -293032 -240538 -254234 -370671 -353527 -333298 -251398 -145329
16235 -145329 317 60492 12378 16324 -72571 -56167 24811 -3228 -128112 -161722 -62058
16224 -62058 -23714 25296 -59705 -19857 -12772 91057 -41282 -129715 -24370 45636 -3473
16213c473j13954L2760m8534j8734j467o7101j3689P4556M6780N9765L8272R5348
16201H0529o3595r7964Q4683M8819q8388N829J490l6631o7611J275l4035l5604
16189b01203O3568M9532P2465j7122J36768N0368j65783l1459o1982J2294L7218
16178e5336O1537n8631p1981M734J01272J2492p5473q0344O0936R8617m269o7779
16166g4225m0477k3384N428j5572l3257Q7923R5876K3284o0422L1437j8856j7381
16154c9626o1036r0994k9277J12414K4488k40k0910k968J15574N8339n6326j11498
16142a02060k3414l8429p0438m2051P2347J13586M6158m1279k8589k302k3351
16131a39822J41627L3075l3904j2286L2635L9232j27969j08817L2070L228J05345
$$ plain form
16213 -3473 -117427 -84667 -133201 -151935 -153402 -220503 -234192 -159636 -112856 -53091 -14819 80529
16201 80529 16934 -81030 3653 52472 -35916 -30087 -28597 -65228 -132839 -131564 -165599 -201203
16189 -201203 -137635 -88103 -15638 -32760 104008 154376 -11407 -42866 -104848 -92554 -55336
16178 -55336 6201 -52430 -124411 -119677 -18405 -5913 -81386 -161730 -100794 -2177 -6446 -74225
16166 -74225 -114702 -138086 -132658 -148230 -181487 -93564 2312 25596 -34826 -3389 -22245 -39626
16154 -39626 -100662 -191656 -220933 -108519 -84031 -84271 -105181 -108149 7425 65764 9438 -102060
16142 -102060 -125474 -163903 -234341 -276392 -204045 -90459 -44301 -85580 -114169 -116471 -139822
16131 -139822 1805 34880 976 -11310 21325 60557 -67412 -176229 -144159 -140931 -35586
16120c5586N054q3265J6744k0502m7959n5185l0711k1639R3194J26232L5202J9456
16108A035j08586n5323K2511K7720N5186P9293o6251n3377K3919J7025J6633p0978
16096a11193k591M9854M7161l1566n5245k4219J57249r4989j04440l3200k9698
16085b32877J9002l8674N5178Q5184R036n2487j287J5723J50325r262j40114K9604
16073a10649J10372L8354K5099J5281j19345k9127K4097Q0983m7418m8729J5657
16062d5425n4914m7404l7027J00277j1910o486M4104p0617J8235J08317M7056
16051D4206M6238N987p733k3339L4146j04894p052K9570o36n4302j7972q4836
16039a40617M968R1526N2493j0351p8983K5823l3871K7976l8000O1108N7751o5087
$$ plain form
16120 -35586 -30532 -113797 -97053 -117555 -165514 -220699 -251410 -273049 -179855 -53623 -18421 1035
16108 1035 -107551 -162874 -140363 -112643 -57457 21836 -44415 -97792 -73873 -56848 -40215 -111193
16096 -111193 -113784 -63930 -16769 -48335 -103580 -127799 29450 -65539 -169979 -203179 -232877
16085 -232877 -213875 -252549 -197371 -112187 -103151 -155638 -156925 -141202 9123 -139 -140253 -110649
16073 -110649 -277 38077 63176 78457 -40888 -70015 -45918 35065 -12353 -61082 -45425
16062 -45425 -100339 -147743 -184770 -84493 -96403 -102889 -58785 -129402 -111167 -2850 44206
16051 44206 90444 96431 88698 65359 99505 -5389 -12441 17129 16493 -37809 -55781 -140617
16039 -140617 -135649 -44123 8370 -1981 -80964 -55141 -89012 -61036 -99036 -37928 19823 -45264
16027d5264j35071L3406j3745J2082j6357p0651K4163L6926o841J04995J890o089
16015h0556l334J8785M7416L2291p0970j6364k4092P182O2711J3457O8773Q704
16003F4003N596N4046l7370j7313q0092m201o5952j46516N141J0498p3142J40025
15991a45277O8567l6436K2051n9486m9820o841o3544N7885L8337m0653L0416R0159
15979i4642j9393N6798J98042m4890o1167o3412j22306J24673M5526j27391j34716
15968b42878R8440Q9451Q472J04679N2023j45988m3917K6134l7535k3316M9813
15957f4622O623r4510N4251K2461o9948m5186j1323K1279J4126p6634n5919o6562
15945c65964J06589R2943k7301P2529o6950j8591q3609P3070K05893O2776k7592
$$ plain form
16027 -45264 -180335 -146929 -160674 -148592 -164949 -235600 -211437 -174511 -181352 -76357 -74467 -80556
16015 -80556 -83890 -65105 -17689 14602 -56368 -72732 -96824 -89642 -26931 -13474 55299 64003
16003 64003 69599 123645 86275 68962 -11130 -15331 -81283 -227799 -222658 -212160 -285302 -145277
15991 -145277 -76710 -113146 -91095 -150581 -200401 -207242 -270786 -212901 -174564 -215217 -184801 -94642
15979 -94642 -114035 -57237 140805 95915 34748 -28664 -150970 -26297 19229 -108162 -242878
15968 -242878 -144438 -54987 -46515 58164 110187 -35801 -79718 -53584 -91119 -114435 -64622
15957 -64622 -57999 -152509 -98258 -75797 -145745 -190931 -202254 -180975 -166849 -243483 -299402 -365964
15945 -365964 -259375 -166432 -193733 -121204 -188154 -206745 -290354 -217284 -11391 51385 23793
15934B3793k8246o5048n2185j9397J9277M0761L5326j55835n159M6970m9334r9456
15922c08533J04076O0670k4095o0987O11R3979O4547N7189O4993k6300j85894
15911a59744M2897J00832j47986j68346P3527J80780K1644j09463N756N1135M4261
15900f4707m5904k388O5073P333N3754n2233K3577M2762p0042n0742r6110n7304
15888b46931Q0357J48425l9496j17051l4030Q7118J0939J5637j883k8172m5006
15877a70093j9162O9587L8278k7388R705Q6866J17264N879j10212l1185J5917
15866a4544p3659k4169O659j6386k1690P3370K5132l9822o4479N9340R7534J866
15854I152n7463l8484m7180R0885q9312k0901P8687O466K6435j5698J7433J8383
$$ plain form
15934 23793 -4453 -69501 -121686 -141083 -121806 -81045 -45719 -201554 -206713 -159743 -209077 -308533
15922 -308533 -204457 -143787 -167882 -228869 -228258 -134279 -69732 -12543 52450 26150 -159744
15911 -159744 -116847 -16015 -164001 -332347 -258820 -78040 -56396 -165859 -160103 -108968 -64707
15900 -64707 -110611 -112999 -47926 -40593 13161 -39072 -15495 27267 -42775 -93517 -189627 -246931
15888 -246931 -166574 -18149 -57645 -174696 -208726 -121608 -110669 -95032 -96915 -125087 -170093
15877 -170093 -189255 -119668 -81390 -108778 -99073 -12207 105057 110936 724 -30461 -14544
15866 -14544 -88203 -112372 -105713 -122099 -143789 -70419 -45287 -85109 -149588 -90248 7286 9152
15854 9152 -48311 -86795 -133975 -43090 -132402 -153303 -74616 -68150 -41715 -57413 -39980 -21597
15842b1597O2289n5750m7455l1493Q328K5193M3143j08576l2351j19717J36375
15831a41611M6999M6085K1866J6440N0446k614r9553m475K895n75J5252J7694
15819c1151o1833l8674N1288R0101o0622o6559J20906O4514j794n6589n7295M9347
15807A639n4582M4851k1520q0032n8420K269o3093l7794k1876k2558J45619J28039
15795c7458l1617j28281j12461L5197J52511N9278M7263P434m1691K7903l3403
15784e5325j05429L2503K4989l7951N8157R364j6856K3051j9607l3737k0686l3120
15772a74647k1329M0438K4224l2493o7238N2673N2622M2897O509J9600l0542j09248
15760a96534j1490N1918N0874M2002O8809k3161l6562p2146n1597p1036P1194
$$ plain form
15842 -21597 40692 -15058 -62513 -94006 -85678 -60485 -17342 -125918 -158269 -277986 -141611
15831 -141611 -94612 -48527 -26661 -10221 40225 37611 -61942 -66417 -63522 -64097 -48845 -31151
15819 -31151 -92984 -131658 -80370 9731 -50891 -117450 3456 67970 66176 9587 -47708 1639
15807 1639 -52943 -8092 -29612 -109644 -168064 -165795 -228888 -266682 -288558 -311116 -165497 -37458
15795 -37458 -69075 -197356 -309817 -274620 -122109 -62831 -15568 -8134 -49825 -21922 -55325
15784 -55325 -160754 -128251 -103262 -141213 -83056 -73692 -90548 -67497 -87104 -120841 -141527 -174647
15772 -174647 -195976 -155538 -131314 -163807 -231045 -178372 -125750 -82853 -76344 -56744 -87286 -196534
15760 -196534 -208024 -156106 -105232 -63230 5579 -17582 -54144 -126290 -177887 -248923 -177729
15749a77729N2088P289K9177L5973o5392l8253p6722n765p484J4953N5183k5159
15737b01841k0721J68445O2207Q764m2130k298r18r7560j44388J4J72880O2714
15725c4832K1667L0162M0835j14606J4038K3390l6531k5030m293q771j12671q7454
15713b94096P9850k6855K5972R8791J23564O9189N6216n2679q6493K0422Q655
15702B2536l5791p5815N3610k1699L0649P813J3875L7023L5334N4001j57094j29501
15690a65059L1513q0071j6672L5435m2377J0074K7093O8798N2144o7802j06403
15679b53327P2689J4515n8077K0299P5435M029j1019K2094j0775k2137q9495o4673
15667c00442R0002R7542n6124L2552m0205M4422Q0737J09537O444o3766o9225
$$ plain form
15749 -177729 -125641 -118352 -89175 -53202 -118594 -156847 -233569 -239334 -246818 -231865 -176682 -201841
15737 -201841 -222562 -54117 8090 16854 -25276 -27574 -28492 -126052 -270440 -270426 -97546 -34832
15725 -34832 -13165 16997 57832 -56774 -42736 -19346 -55877 -80907 -85200 -93971 -206642 -294096
15713 -294096 -214246 -241101 -215129 -116338 7226 76415 132631 79952 -6541 13881 22536
15702 22536 -13255 -89070 -35460 -57159 -26510 -18697 -4822 32201 67535 121536 -35558 -165059
15690 -165059 -133546 -213617 -230289 -194854 -237231 -227157 -200064 -131266 -79122 -146924 -253327
15679 -253327 -180638 -166123 -224200 -203901 -128466 -124437 -135456 -113362 -124137 -146274 -235769 -300442
15667 -300442 -210440 -112898 -169022 -136470 -176675 -132253 -51516 58021 64465 699 -68526
15656f8526r3491O6329J52951q397j06086n452J3178J668j05742j6493k4775M504
15644a90332o744k6763R2428m8376N917l7395l3828J32541p050k7906L5264j9842
15632a32086n9402K2511R3487J09772m077K4092K3732j06735j27816J24J06870
15621d9528J29279p545p2614m382r3704n1593k0275M0600L2586l7330j0914L4817
15609a10603M820K3363M0502k5373L0872R1405L6538M3682k3084j06776j09181
15598a03835R0747P2773q9934m7699n403k6852m7881O0401L9029o0121j06321
15587b25096k5415M0157N1589Q1546l7749j00208l9275J0447l1678Q6499J22806
15576f6377o8225m7536Q3112L2588R1472o2300j7226O0541J899j38602j48964
$$ plain form
15656 -68526 -162017 -95688 57263 48866 -57220 -62672 -49494 -47826 -153568 -170061 -194836 -190332
15644 -190332 -197076 -223839 -131411 -179787 -173870 -211265 -245093 -112552 -119602 -147508 -112244 -132086
15632 -132086 -191488 -168977 -75490 34282 30205 54297 78029 -28706 -156522 -156398 -49528
15621 -49528 79751 72206 -408 -4790 -98494 -150087 -170362 -129762 -97176 -134506 -145420 -110603
15609 -110603 -105783 -82420 -41918 -67291 -36419 54986 91524 135206 112122 5346 -103835
15598 -103835 -13088 59685 -30249 -77948 -83351 -110203 -158084 -97683 -58654 -118775 -225096
15587 -225096 -250511 -210354 -158765 -77219 -114968 -215176 -254451 -244004 -275682 -189183 -66377
15576 -66377 -134602 -182138 -99026 -66438 25034 -37266 -54492 6049 7948 -130654 -279618
15565b79618R102K1809l5376q281l8549P3645J29326J2286m884n515m7075J5392
15553a57738O2727J8301R4843m3645k2296K6386J30483N9187O191l7440k9914
15542A07085m7118q0682m7324j0557R1087R3483o6629j23784L3348O3394p8882
15531f6579j29864o2327N9759L4096O1975O9229q6547l6667N4059K993M3112m1029
15519i7790L2244O7075m4432m6556R707K0627J4630j07805J756J14983n247r4795
15507a35603L0648J11266k8489j63291p2867K9493P2671P0452k9703N8695Q6013
15496B9285n640o2407j32352m0514O4847K3673M1930J5777K6688n7506K6392J1168
15484e8659q9710M7026J8595k125J9326L9280o3587J0537k8179J1278j4570k3247
$$ plain form
15565 -279618 -270516 -248707 -284083 -292364 -330913 -257268 -127942 -115656 -120540 -126055 -173130 -157738
15553 -157738 -95011 -76710 18133 -25512 -47808 -21422 109061 168248 174439 136999 107085
15542 107085 59967 -20715 -68039 -78596 12491 105974 39345 -84439 -51091 12303 -66579
15531 -66579 -196443 -258770 -199011 -164915 -102940 -33711 -120258 -156925 -102866 -99873 -56761 -97790
15519 -97790 -65546 1529 -42903 -89459 -79752 -59125 -44495 -152300 -150544 -35561 -40808 -135603
15507 -135603 -104955 6311 -22178 -185469 -258336 -228843 -156172 -85720 -115423 -56728 29285
15496 29285 23645 -38762 -171114 -211628 -146781 -123108 -81178 -65401 -38713 -96219 -69827 -58659
15484 -58659 -148369 -101343 -82748 -84873 -65547 -26267 -89854 -79317 -107496 -96218 -110788 -134035
15472a34035M612P7803O3254o7694l7253j4705O0217K0911l8027l1702L1403l4704
15460i9920K8992K4317L7532n737k6683N9039o0545m9876O4699r2178n1095K047
15448a69408J3453J0117k1770m1288k9192j42770N0618R9562o8514P1765J09200
15437a18227j8108Q0027q230r1584N2809j24921q7964P8643J25356R0492l6644
15426e8351n1782j7673n9882R9361q819n9042n4824J01930J18046o2544r3617
15415a47197K3090L7364M3690J0526J0837j8474J7674j5033J07810K3605j40854
15404d6962q7810r7643O006J5980K1768P8750j39322j5072j7903Q5314J43161
15393e3733O6226M2237l7758n3039N8701k3514j03115M9044l690k3275l6709K4746
$$ plain form
15472 -134035 -129423 -51620 11634 -56060 -93313 -108018 -47801 -26890 -64917 -96619 -65216 -99920
15460 -99920 -70928 -46611 -9079 -14816 -41499 17540 -43005 -92881 -28182 -120360 -171455 -169408
15448 -169408 -155955 -145838 -167608 -208896 -238088 -380858 -330240 -230678 -299192 -227427 -118227
15437 -118227 -136335 -56308 -64538 -156122 -103313 -228234 -316198 -237555 -112199 -21707 -58351
15426 -58351 -110133 -127806 -187688 -88327 -97146 -156188 -211012 -109082 8964 -53580 -147197
15415 -147197 -124107 -86743 -43053 -32527 -21690 -40164 -22490 -37523 70287 93892 -46962
15404 -46962 -134772 -232415 -226409 -210429 -188661 -109911 -249233 -264305 -282208 -196894 -53733
15393 -53733 12493 54730 16972 -36067 22634 -880 -103995 -54951 -58641 -81916 -118625 -93879
15381i3879n667m6524J21338Q4478l5251J0090K92M3263N4585j18088j33786j703
15369a20852L9821j01083k1826O6905Q9302N1944m5942M9292l2433L7497K7794
15358D0419L6985r4071M7071M24J2929j35058k6526J60533O9783p2039l8937j2167
15346a0654j02159q8180J97477J8882r8377j3314k292p2577N4200N8532l3130
15335i1592O2714l9459j23817j10640J12813K1006q9187P5584O9352L7494N1449
15324b4283j10954p4178L5928O9271J30260j201o3746N1644l818o4860m0226q1904
15312a78067n7691J406R0174J16736P61J9733k942p568m7445o1611k5410j9351
15300a71275O0553J14139L4227j0724j0354q1138L0844M0188k1439p27m0911Q98
$$ plain form
15381 -93879 -99546 -146070 -24732 59746 24495 34585 34877 78140 132725 14637 -119149 -120852
15369 -120852 -81031 -182114 -203940 -137035 -47733 4211 -41731 7561 -24872 12625 40419
15358 40419 77404 -16667 30404 30828 43757 -91301 -117827 42706 112489 40450 1513 -10654
15346 -10654 -112813 -200993 -3516 15366 -83011 -96325 -98617 -171194 -116994 -58462 -91592
15335 -91592 -28878 -68337 -192154 -302794 -189981 -168975 -258162 -182578 -113226 -75732 -24283
15324 -24283 -135237 -209415 -173487 -104216 26044 24843 -38903 12741 8923 -55937 -96163 -178067
15312 -178067 -235758 -234352 -144178 -27442 -26681 -6948 -9890 -17458 -64903 -126514 -151924 -171275
15300 -171275 -110722 3417 37644 26920 16566 -64572 -33728 6460 -14979 -15706 -56617 -55719
15288e5719r461r2387K712N1821m2270L2781M8796K8978m616j06080M6677r3932
15276a92700K436J4589L5987M1169p5371J4558J08843l3393o2939k7429J66708
15265g542N2115j66645m0208M7261J06747L1116m678k2537n6014J3199J9657k6771
15253e4300k1944N9545l7415q9449Q735j27368o0251M8372Q3759K3787K5468J6006
15241a25055m6936l5928N917P5718R749J6955j8411M5292l871N969L7683j4436
15229d7354n9204L2392L0359j12389l4745J16528K309J5776M4378q7847J8948
15218h0849J51327K8093j23204q0734L3465r1084m4422P3008M551r747K5182m6622
15206a61036l0399M0756j2679k5916K2757P1777n858j38257o8828l9346L6303
$$ plain form
15288 -55719 -65180 -157567 -154855 -103034 -145304 -112523 -63727 -34749 -39365 -145445 -98768 -192700
15276 -192700 -190264 -175675 -139688 -98519 -173890 -159332 -50489 -83882 -146821 -174250 -7542
15265 -7542 44573 -122072 -162280 -115019 -8272 22844 18166 -4371 -60385 -47186 -27529 -54300
15253 -54300 -76244 -16699 -54114 -143563 -134828 -262196 -322447 -274075 -190316 -166529 -141061 -125055
15241 -125055 -171991 -207919 -202002 -126284 -116535 -99580 -117991 -72699 -76570 -70601 -32918 -47354
15229 -47354 -106558 -74166 -43807 -156196 -190941 -74413 -72104 -56328 -11950 -99797 -80849
15218 -80849 70478 98571 -24633 -105367 -71902 -162986 -207408 -134400 -129849 -139596 -114414 -161036
15206 -161036 -191435 -150679 -163358 -189274 -166517 -94740 -100598 -238855 -307683 -347029 -310726
15195c10726j9117L402K6609J01591J23704K5734p2498r1924Q4907K5507n3444
15184a56255K4808j1621J3798n1228k4379O4891n1723L65J1774J8395M8920L0817
15172h1438O2748Q1599p2049m6329M0036R374j20084l6002Q5845K2581Q6064p2695
15160d0350l6374N094J853p1982K1130P7046m3196k6691L8948K9814q3790j624
15148a30122k7551O7103J02050M8252q2963r0509k4531n9666J1119m293R5323
15137i5788N4423N6259K5212m67N9725j17250q5886r30j6450K5825o246O0794
15125d0779N7316K37l7426m7918J1495M5038K6014o710j06549k06035J1802R4140
15113a99375k1116L829J3723J4096J39311N9091q9042k6241j25776J0121J61425
$$ plain form
15195 -310726 -329843 -326441 -299832 -198241 -74537 -48803 -121301 -213225 -128318 -102811 -156255
15184 -156255 -131447 -143068 -129270 -180498 -204877 -139986 -191709 -191344 -179570 -161175 -112255 -81438
15172 -81438 -18690 62909 -9140 -55469 -15433 -6059 -126143 -162145 -76300 -53719 32345 -40350
15160 -40350 -76724 -71630 -69777 -141759 -120629 -43583 -86779 -113470 -74522 -44708 -128498 -130122
15148 -130122 -157673 -90570 11480 59732 -23231 -113740 -138271 -197937 -186818 -191111 -95788
15137 -95788 -41365 14894 40106 39639 99364 -17886 -103772 -104702 -121152 -95327 -101573 -40779
15125 -40779 16537 16774 -20652 -68570 -57075 -12037 13977 7267 -99282 -305317 -293515 -199375
15113 -199375 -220491 -216662 -202939 -188843 -49532 9559 -79483 -105724 -231500 -221379 -59954
15102e9954M9546M7698k6410n6561l6007R1498N345j22844j8827Q9908Q1875N7122
15090A02389j32091j59136N7563L7027j37806o4298L5395Q1398J26260J6039K1104
15079a6156j07122l1915l5491j03524N7177J15672J08494L8358j175P8298j698
15068A00918K8809q838M11m5359j01442N2078K2110j102j2455j17266q0204J28830
15056c3510K6554q3731n0172j28852j36690O0068K08989P9229J5315J76478M2789
15045A76467j4424l1990l9758K9424K6965j51133j30565N4807L60l1606K5919
15034h5534P6005M631l8914L0037M8365r403p3779K5035J01K5923J17335n9643
15022F0159l6199n4237Q5276N3416m5933r8602j08904r2040N8515J12248J9530
$$ plain form
15102 -59954 -10408 37290 10880 -45681 -81688 9810 15155 -107689 -126516 -36608 45267 102389
15090 102389 -29702 -188838 -131275 -94248 -232054 -296352 -260957 -179559 -53299 -37260 -16156
15079 -16156 -123278 -155193 -190684 -294208 -237031 -121359 -12865 25493 24318 102616 100918
15068 100918 129727 120889 121300 75941 -25501 26577 48687 47585 35130 -82136 -162340 -33510
15056 -33510 -6956 -90687 -140859 -269711 -406401 -346333 -137344 -58115 -42800 133678 176467
15045 176467 162043 130053 90295 119719 146684 -4449 -135014 -80207 -79847 -111453 -85534
15034 -85534 -9529 -4898 -43812 -13775 34590 25187 -48592 -23557 -23456 2467 119802 60159
15022 60159 23960 -30277 54999 108415 62482 -36120 -145024 -237064 -178549 -66301 -46771
15011d6771K2312Q1357L7383l9838m7690Q4884N6398q1447l263j1249j03j39354
14999h7381P076O5082l0351J1810k3096n1447O3591J7713P8414L0914o7279o2287
14987d7241R7639l3523j72147m0740J19215Q6457m3689K3433l7420n3217M6055
14976e5178K5605Q5462P9210J2034j9322j2778m2708j18659J6488L1495l2629
14965c0980m5113K338M9055O1865M1780l5604Q965J69776J5995k10573j56806
14954a29302l0917J24243k9583j8501N1317P5414k93k2788P1474M8167Q1028N514
14942B25773n8419Q55q244L9777j31646j35270k6260m6916j5178P3356J1258m9071
14930a19985n966N7112k1019P254J27988N5517K7318o8581o0962N6288J3187k8814
$$ plain form
15011 -46771 -24459 56898 94281 54443 6753 91637 148035 66588 63325 52076 51973 -87381
14999 -87381 -80305 -15223 -45574 -33764 -56860 -108307 -44716 -27003 51411 82325 15046 -47241
14987 -47241 50398 16875 -155272 -196012 -76797 9660 -34029 -10596 -48016 -101233 -55178
14976 -55178 -29573 55889 135099 147133 127811 115033 72325 -46334 -29846 1649 -30980
14965 -30980 -76093 -73755 -24700 37165 78945 43341 52306 222082 238077 27504 -129302
14954 -129302 -160219 -35976 -65559 -84060 -32743 42671 42378 19590 91064 139231 220259 225773
14942 225773 167354 168209 159965 199742 68096 -67174 -93434 -140350 -155528 -82172 -70914 -119985
14930 -119985 -125951 -68839 -89858 -82604 45384 100901 128219 59638 -1324 54964 68151 39337
14918C9337m3700K9303r299o8457j7131J68807l966n489p8127K1991P4765j11010
14906b976l1152Q3386j2403r7620l9373n8283R071M5793P5559L9193J10418r532
14894A12081m5138j3404L2491o645q3701j88503r833K6965N1530j3541j4184k3951
14882a75833J1468R55J9649l4406l317Q8633P001n8102p8208R6293J0463K0580
14870i4824L6207Q502m551q0423q1400J06133J2281K2259K526l2727R9899J17059
14858A10941J2854j5366k7998j7783j44419k3174j2652q0230m7487J6776R4594
14847a33944j1122k5667M8755J22204O5739J0779N893k5663p3637M228o2966o9325
14835a44726K6053J74325l1480m6363R0338J3299n3543l71k0690k5596L7243P7962
$$ plain form
14918 39337 -4363 24940 15641 -52816 -69947 98860 94894 89405 11278 33269 108034 -2976
14906 -2976 -34128 49258 36855 -60765 -100138 -158421 -149350 -103557 -27998 11195 121613 112081
14894 112081 66943 53539 86030 79385 -4316 -192819 -202652 -175687 -124157 -137698 -151882 -175833
14882 -175833 -164365 -163410 -143761 -178167 -181484 -92851 -85850 -143952 -222160 -125867 -115404 -94824
14870 -94824 -58617 -50115 -54666 -135089 -216489 -110356 -98075 -75816 -73290 -106017 -6118 110941
14858 110941 123795 108429 80431 62648 -81771 -104945 -117597 -197827 -245314 -228538 -133944
14847 -133944 -145066 -170733 -121978 226 65965 76744 82637 56974 -16663 -12435 -75401 -144726
14835 -144726 -118673 55652 24172 -22191 68147 81446 27903 27532 6842 -18754 18489 96451
14823I6451r5361k8325N2256o5199k0098R8892N648o147m8677M60m9761m6152
14811a06013J33417J92866j6623q2931j00634q1282O157N0467m9385k38406N6096
14800b36271O4370o8796M8871O1983L3436J6774M2571Q413p5517J7494k6436l3224
14788a46332o390J4349N7626K3608M5746K7056m7390m3298O9205l2361J208m4831
14776h1804j4293m6762k7700K8181k265L7087N6283P4956Q9186o764k2065j19666
14764c5626r6916l6617M3691R6887J43708l7871M22j2183j3380j23933o4640j28394
14752b64852j10726k9853Q3642R4189J15271N001J17008L3998M7462M4218j03348
14741C2010k7836M8697J1692l1607j8375R304p0251l2939L8400N8614M1492q53
$$ plain form
14823 96451 1090 -27235 25021 -40178 -60276 38616 44264 38117 -10560 -10100 -59861 -106013
14811 -106013 27404 220270 203647 120716 20082 -61200 -55043 -4576 -53961 -292367 -236271
14800 -236271 -171901 -240697 -191826 -129843 -96407 -79633 -37062 -28649 -104166 -86672 -113108 -146332
14788 -146332 -152722 -138373 -80747 -57139 -11393 15663 -31727 -75025 -5820 -38181 -36973 -81804
14776 -81804 -96097 -142859 -170559 -142378 -144643 -107556 -51273 23683 112869 106105 84040 -35626
14764 -35626 -132542 -169159 -125468 -28581 115127 77256 77678 65495 52115 -71818 -136458 -264852
14752 -264852 -375578 -405431 -321789 -227600 -112329 -107328 9680 43678 91140 135358 32010
14741 32010 4174 52871 64563 32956 14581 23885 -46366 -79305 -40905 17709 59201 58348
14729E8348m2618P1691l9221j06618j3361M6830l3803K7431p55N2082L9112k1399
14717C7719N455K0827J8339K294L995N61o0630J1195N5347M6083L52j3681L3090
14704A60946M1805m8410r1619J731r051l966j3054K1000L1309n5330j08534q9682
14692a62855o3934R7377J61604O2364n5576j7884L6882n2190o3119P3918K4064
14681D0651L5824O1882N005j793J53530k8098j17232n1276l4070J0739k5001q6290
14669c6129J303J05153M1495J0989l4369l774O7420m8070j1362q680r1454r2342
14657i9820N3594q729Q884L5008j02700j8785J2886M5154j15839J4400J03869
14646g2078Q2905J508m9530q766k6272l4289q83K1893M6059l7606k0140M2039
$$ plain form
14729 58348 15730 87421 48200 -58418 -71779 -24949 -58752 -31321 -32076 20006 59118 37719
14717 37719 43174 64001 82340 84634 88629 89190 28560 39755 95102 141185 141537 127856 160946
14704 160946 202751 154341 62722 64453 55402 51436 38382 59382 90691 35361 -73173 -162855
14692 -162855 -226789 -129412 32192 94556 38980 21096 57978 5788 -57331 16587 40651
14681 40651 76475 138357 143362 141569 295099 267001 149769 98493 64423 75162 50161 -36129
14669 -36129 -34826 70327 111822 122811 88442 84668 152088 104018 92656 83976 -7478 -99820
14657 -99820 -46226 -54955 -46071 -11063 -113763 -132548 -119662 -74508 -190347 -175947 -72078
14646 -72078 10827 12335 -37195 -45961 -72233 -106522 -107405 -85512 -39453 -77059 -97199 -55160
14634e5160l044J02503J0104k9944n6958P6636J63645o7363p1915l8916n279R3060
14622A17369m0238j05202j2359Q2629J1480M2459L0865j6032n857k2928k29o4876
14610A7081L2732K7646K2819j00639p9377O4779Q4732l1563O65Q0061M9958j03071
14598F5823j47759k0739j4597k5429K8601J61434L0424O773m145l5465l3031k4614
14586a2724j47261o480J29434j6927j16176Q3520N6995j1626p466J1210k1245
14575e8746p5225K8848K9446K830j76881N9938J81785P2085O61m3360j2730o237
14563B414r627j5406n3457k3921M5315O5936Q3095M9154o5038j08835N1368M6871
14551F7869K0959J9968m3209o5608J2976n8887J03464O8589J0233p8982K8308
$$ plain form
14634 -55160 -58204 44299 54403 24459 -32499 44137 207782 140419 68504 29588 24309 117369
14622 117369 77131 -28071 -40430 42199 53679 96138 127003 110971 105114 82186 81957 17081
14610 17081 49813 77459 100278 -361 -79738 -14959 69773 38210 38875 118936 168894 65823
14598 65823 -81936 -102675 -117272 -142701 -114100 47334 77758 84531 80386 44921 11890 -12724
14586 -12724 -159985 -166465 -37031 -53958 -170134 -86614 -29619 -41245 -48711 -37501 -58746
14575 -58746 -133971 -105123 -75677 -72847 -249728 -189790 -8005 64080 64741 21381 8651 2414
14563 2414 -7213 -22619 -76076 -99997 -54682 11254 94349 143503 78465 -30370 20998 67869
14551 67869 88828 108796 65587 -21 12955 -45932 57532 126121 136354 57372 85680
14540H5680K4508r05K6066j2007j97103q287J10236P5476k0478Q9826J9133J03827
14528B95972l8627l0598l6159j02088j5199q9617n4747r1246j2527O4670L8612
14517g1554L4789J9816j0039J6852R0249l7337l981n5290r7119r2282o4235l9140
14505c09271P5758J26217N617k0642J18j16848M5338J29848j6464j05634n6666
14494b42629P8101J42600k9170J7966r10J2502M5330q110o3333m250p4635L7091
14482h9447m887m5369Q7641o174J14763j2981j42193n6297K8022J52261O6982
14471I2321q9703o9806M0751K7236L7780K0825l2603j7880m7607P7188N8713l0574
14459F6641l5450Q0973l5217J7422N6235K5072j71255m1902J00302P9874j0794
$$ plain form
14540 85680 110188 109283 135349 123342 -73761 -82048 28188 103664 83186 173012 192145 295972
14528 295972 257345 226747 190588 88500 73301 -16316 -71063 -162309 -174836 -110166 -71554
14517 -71554 -36765 -16949 -26988 -10136 80113 42776 38795 -16495 -113614 -205896 -270131 -309271
14505 -309271 -233513 -107296 -101679 -122321 -122203 -239051 -193713 -63865 -80329 -185963 -242629
14494 -242629 -164528 -21928 -51098 -33132 -34042 -21540 23790 15680 -47653 -51903 -126538 -89447
14482 -89447 -94334 -139703 -52062 -58236 56527 43546 -98647 -154944 -126922 25339 92321
14471 92321 2618 -67188 -26437 799 38579 59404 26801 8921 -38686 38502 97215 66641
14459 66641 31191 112164 76947 94369 150604 175676 4421 -37481 62821 142695 131901
14448A31901p13L0719m6575J2841L4125o7670q5524K0272j6003p54k433L8927
14436D9113N8415o3041p151o2506j1480J0617J0197k0846P5061K6860J7034m3866
14424C8407l4252m1633K4576J46090M8570r9101m7291k3867n8109P7889J14774
14413A46053q4264O9939q7832j15130L3987n0278M1552K6301O163q2447n4276
14402a50232J50996N3049l7028p3910K3852m2821L3328Q9027l1486p1783m5480
14391a02488L996J2262L6166R1770n8584p1800N5416k4914j9370J9947j6506M5242
14379b8863l4972M2041M1244J9834R8228j3188j0186l1182p5101k2170M4810P2692
14367A03187P7330o0903j99474q4783j3935Q1460J36474j1295m2049J03073R037
$$ plain form
14448 131901 131188 161907 115332 128173 162298 94628 9104 29376 13373 12619 10186 49113
14436 49113 107528 44487 37336 -25170 -36650 -26033 -15836 -36682 38379 65239 82273 38407
14424 38407 4155 -37478 -12902 133188 181758 82657 35366 11499 -46610 31279 146053
14413 146053 61789 131728 43896 -71234 -37247 -87525 -45973 -19672 -13509 -95956 -150232
14402 -150232 764 53813 16785 -57125 -33273 -76094 -42766 46261 14775 -57008 -102488
14391 -102488 -98492 -86230 -50064 41706 -16878 -88678 -33262 -58176 -77546 -57599 -74105 -28863
14379 -28863 -63835 -21794 19450 39284 137512 124324 114138 82956 7855 -14315 30495 103187
14367 103187 180517 119614 -79860 -164643 -178578 -97118 39356 28061 -13988 89085 98122
14356I8122K3681o34j8064p5575K4471R4333K4531j7606q643j63097j75423k3366
14344b17270J22029J35764l6194J27298K5187n0479j69728p2951P762J43623J19955
14333A34996j8126j9723L4136L0671l87m1395J9788L9704m9979j18350K9044o554
14321C3825O431k086l9176j38829p3375K6645N2934J08984K1529p260l7759m9652
14309i7789Q6997J00198l2822n8555Q7514O2740k1195k3797M6199O6526N6005
14298B72021l2663k03198m2255n6424P1161R5185K1453P5338j679j22700j98079
14287a21840J190O6904R8096K1264k419O7178O3426p3245j5491p0666J9402N2932
14275A06731n2259j27422Q4784P0917k44J17508l360j19317O762L8898r1721l1934
$$ plain form
14356 98122 121803 121169 103105 27530 52001 146334 170865 153259 144616 -18481 -193904 -217270
14344 -217270 -95241 40523 4329 131627 156814 106335 -63393 -136344 -128582 15041 134996
14333 134996 116870 97147 131283 161954 161567 120172 139960 179664 129685 11335 40379 33825
14321 33825 40256 38170 -1006 -139835 -213210 -186565 -133631 -24647 -3118 -10378 -48137 -97789
14309 -97789 -10792 89406 56584 -1971 85543 148283 127088 103291 149490 216016 272021
14298 272021 239358 36160 -6095 -62519 8642 103827 125280 200618 198939 76239 -121840
14287 -121840 -120650 -53746 44350 65614 63195 130373 193799 120554 105063 34397 53799 106731
14275 106731 54472 -72950 11834 82751 82507 200015 196655 77338 84100 122998 31277 -657
14263f57P6190Q913n208m9259P8200k0593n2257l7342M901j6659k0449o8800J527
14250a01493L6824J08996Q7860K6869K4930o5143N2496r470p3359j35137n464
14239e2091Q3953M0886K4092J8151k1226p2855j23136R068L1297L6310R8923M5182
14227A18554q7170L2549k5749l4807j22305q4921k3691L5986M5210P2598k6593
14216a00339p2307n7792P6639J39085N0550K9647J4236J0212p0198k6650O9082
14205F2165K9228j15631o5408j7980J3611O9140j09552l7031Q4141R1665J26120
14194A30468N1043j0155l7069k6792p3458K6408J21282M0854n4453q9174j03681
14183b4727N3924Q0680o3535m4977l0184m1277J12832M4577j05334L2862K7530
$$ plain form
14263 -657 75533 84446 79238 29979 108179 87586 35329 -2013 2888 -13771 -34220 -103020 -101493
14250 -101493 -64669 44327 132187 159056 183986 118843 171339 161869 88510 -46627 -52091
14239 -52091 31862 72748 96840 114991 93765 20910 -102226 -93158 -61861 -25551 73372 118554
14227 118554 31384 63933 38184 3377 -118928 -203849 -227540 -191554 -146344 -73746 -100339
14216 -100339 -172646 -230438 -153799 -14714 35836 65483 79719 89931 19733 -6917 62165
14205 62165 91393 -24238 -89646 -107626 -94015 -24875 -134427 -171458 -87317 4348 130468
14194 130468 181511 171356 134287 107495 34037 60445 181727 222581 168128 78954 -24727
14183 -24727 29197 109877 46342 1365 -28819 -70096 42736 87313 -18021 14841 42371
14172D2371j163m5497k2572m6700o04M928m0082J4622N5552M8082N5907J8467
14160H3311n7273o2247O905O2424M2714l4317K571j7880j6860j7926r2937l1311
14148a32826J29097J04653r6524j9824P244p756j0181M1008l4573J8300L0725
14137B9343j0385r3065q446N577J44937M1783K4383m6953O1999L9318j95226q4576
14125i1311R606N7612N9810l7927k3462J2581l3515q632O413M7518L5673j20247
14113h5881N6961L5429n2890K9890J9486M8607j1757K2476k8345O0757L6056K1319
14101A52108R739L8754o3096p8543k6955P9177j8440p3185j7915p6857k3467L4719
14089f3961M6392l3252J15662n3815l6211Q3120r4435q9055k4291N8909J53452
$$ plain form
14172 42371 41208 -4289 -26861 -73561 -74165 -69237 -109319 -94697 -39145 8937 64844 83311
14160 83311 26038 -36209 -29304 33120 75834 41517 44088 26208 9348 -8578 -101515 -132826
14148 -132826 -3729 100924 4400 -15424 -8180 -15936 -26117 14891 -19682 -1382 29343
14137 29343 18958 -74107 -82553 -76976 67961 109744 134127 87174 149173 188491 -6735 -91311
14125 -91311 -81705 -24093 35717 -2210 -25672 -13091 -46606 -55238 -48825 -1307 34366 -85881
14113 -85881 -28920 6509 -46381 -16491 2995 51602 39845 62321 33976 94733 130789 152108
14101 152108 161847 200601 137505 58962 32007 111184 92744 19559 1644 -75213 -98680 -63961
14089 -63961 -17569 -50821 64841 11026 -25185 57935 -36500 -125555 -149846 -90937 62515
14078F2515J7598r7035K7150N0061R8402R5245n5967j13095m5943p5628J3365
14067b3332J5664O1762J23140K924l1676N341m0022o2810j6078l2978O8291J66243
14055B36469O001j10385o9148M5307O1052k708j27754Q6763n0762k352R779K404
$$ plain form
14078 62515 80113 -16922 10228 60289 158691 253936 197969 84874 38931 -36697 -23332
14067 -23332 -7668 54094 177234 180158 148482 153823 113801 50991 34913 1935 70226 236469
14055 236469 242470 132085 62937 108244 169296 166588 38834 125597 74835 72483 82262 84666
$$ [...]
##END NTUPLES=NMR SPECTRUM
##END=
