##TITLE=Analysis number 328120
Compound Code cc 08904
Project Code adrs
Chemist Name molekula
##JCAMPDX= 6.0         $$ Bruker NMR JCAMP-DX V2.0
##DATA TYPE= NMR SPECTRUM
##DATA CLASS= NTUPLES
##ORIGIN= Bruker BioSpin GmbH
##OWNER= nmr
$$ XWIN-NMR		Version 3.5
$$ Fri May  4 08:56:55 2007 GMT Daylight Time (UT+1h)  MAYBRIDGE\nmr@NMR_250MHZ
##.OBSERVE FREQUENCY= 250.131544655141
##.OBSERVE NUCLEUS= ^1H
##.ACQUISITION MODE= SIMULTANEOUS (DQD)
##.ACQUISITION SCHEME= undefined
##.AVERAGES= 16
##.DIGITISER RES= 18
##SPECTROMETER/DATA SYSTEM= dpx250
##.PULSE SEQUENCE= zg30
##.SOLVENT NAME= DMSO
##.SHIFT REFERENCE= (INTERNAL, DMSO, 0, 16.522)
##AUDIT TRAIL= $$ (NUMBER, WHEN, WHO, WHERE, WHAT)
$$ ##TITLE= Audit trail, XWIN-NMR		Version 3.5
$$ ##JCAMPDX= 5.01
$$ ##ORIGIN= Bruker BioSpin GmbH
$$ ##OWNER= nmr
$$ C:\u/data/dgb/nmr/ADRS/390/pdata/1/auditp.txt
$$ ##AUDIT TRAIL=  $$ (NUMBER, WHEN, WHO, WHERE, WHAT)
(   1,<2007-05-04 08:56:35.63 +100>,<MAYBRIDGE\nmr>,<NMR_250MHZ>,
      <created by zg, POWCHK disabled, PULCHK disabled
       configuration hash MD5:
       76 6E 9A 78 1E 09 19 81 EC 84 63 8F B0 6A 59 2D
       data hash MD5: 64K
       E3 86 A1 82 63 95 D7 88 40 3B E9 BA 85 18 EA 66>)
(   2,<2007-05-04 08:56:46.80 +100>,<MAYBRIDGE\nmr>,<NMR_250MHZ>,
      <Start of raw data processing
       ef LB = 0.3 FT_mod = 6 PKNL = 1 SI = 32K 
       data hash MD5: 32K
       B3 77 56 96 E9 59 69 47 D8 44 71 27 31 12 0C 71>)
(   3,<2007-05-04 08:56:48.68 +100>,<MAYBRIDGE\nmr>,<NMR_250MHZ>,
      <apk 
       data hash MD5: 32K
       04 47 AA 0B 15 7C 39 70 03 FB CF A5 5B A6 3A A2>)
(   4,<2007-05-04 08:56:49.38 +100>,<MAYBRIDGE\nmr>,<NMR_250MHZ>,
      <abs ABSG = 5 
       data hash MD5: 32K
       7E A4 38 70 22 3A 51 92 62 F6 94 E2 E0 51 04 25>)
$$ ##END=
$$ 
$$ hash MD5
$$ 98 0E C9 B1 A6 A9 39 E7 72 0B C2 36 12 A2 BB 54
##$RELAX= 
##$RELAX= 
##$RELAX= 
##$RELAX= 
##$RELAX= 
##$RELAX= 
##$RELAX= 
$$ Bruker specific parameters
$$ --------------------------
##$DU= <C:\u>
##$EXPNO= 390
##$NAME= <ADRS>
##$PROCNO= 1
##$TYPE= <nmr>
##$USER= <dgb>
##$AMP= (0..31)
100 100 100 100 100 100 100 100 100 100 100 100 100 100 100 100 100 100 
100 100 100 100 100 100 100 100 100 100 100 100 100 100 
##$AQSEQ= 0
##$AQ_mod= 3
##$AUNM= <au_zg>
##$AUTOPOS= <15 >
##$BF1= 250.13
##$BF2= 250.13
##$BF3= 250.13
##$BF4= 250.13
##$BF5= 500.13
##$BF6= 500.13
##$BF7= 500.13
##$BF8= 500.13
##$BYTORDA= 1
##$CFDGTYP= 0
##$CFRGTYP= 5
##$CHEMSTR= <none>
##$CNST= (0..31)
1 1 145 1 1 1 1 1 1 1 1 1 1 1 1 1 1 1 1 1 1 1 1 1 1 1 1 1 1 1 1 1 
##$CPDPRG= <>
##$CPDPRG1= <>
##$CPDPRG2= <>
##$CPDPRG3= <>
##$CPDPRG4= <mlev>
##$CPDPRG5= <mlev>
##$CPDPRG6= <mlev>
##$CPDPRG7= <mlev>
##$CPDPRG8= <mlev>
##$CPDPRGB= <>
##$CPDPRGT= <>
##$D= (0..31)
0 1 0 0 0 0 0 0 0 0.06 0 0 0 0 0 0 0.0002 0 0 0 0 0 0 0 0 0 0 0 0 0 0 
0 
##$DATE= 1178265394
##$DBL= (0..7)
120 120 120 120 120 120 120 120 
##$DBP= (0..7)
150 150 150 150 150 150 150 150 
##$DBP07= 0
##$DBPNAM0= <>
##$DBPNAM1= <>
##$DBPNAM2= <>
##$DBPNAM3= <>
$$ [...]
##$SUBNAM7= <"">
##$SUBNAM8= <"">
##$SUBNAM9= <"">
##$SW= 20.6930455092707
##$SWIBOX= (0..15)
0 0 3 0 0 0 0 0 0 0 0 0 0 0 0 0 
##$SW_h= 5175.983436853
##$TD= 65536
##$TD0= 1
##$TE= 683.16
##$TE2= 300
##$TE3= 300
##$TEG= 300
##$TL= (0..7)
0 120 120 120 120 120 120 120 
##$TP= (0..7)
150 150 150 150 150 150 150 150 
##$TP07= 0
##$TPNAME0= <>
##$TPNAME1= <>
##$TPNAME2= <>
##$TPNAME3= <>
##$TPNAME4= <>
##$TPNAME5= <>
##$TPNAME6= <>
##$TPNAME7= <>
##$TPOAL= (0..7)
0.5 0.5 0.5 0.5 0.5 0.5 0.5 0.5 
##$TPOFFS= (0..7)
0 0 0 0 0 0 0 0 
##$TUNHIN= 0
##$TUNHOUT= 0
##$TUNXOUT= 0
##$USERA1= <user>
##$USERA2= <user>
##$USERA3= <user>
##$USERA4= <user>
##$USERA5= <user>
##$V9= 5
##$VALIST= <valist>
##$VCLIST= <CCCCCCCCCCCCCCC>
##$VD= 0
##$VDLIST= <DDDDDDDDDDDDDDD>
##$VPLIST= <PPPPPPPPPPPPPPP>
##$VTLIST= <TTTTTTTTTTTTTTT>
##$WBST= 1024
##$WBSW= 4
##$XGAIN= (0..3)
0 0 0 0 
##$XL= 0
##$YL= 0
##$YMAX_a= 352228
##$YMIN_a= -323187
##$ZGOPTNS= <>
##$ZL1= 120
##$ZL2= 120
##$ZL3= 120
##$ZL4= 120
##$ABSF1= 16.522
##$ABSF2= -4.171173
##$ABSG= 5
##$ABSL= 3
##$ALPHA= 0
##$AQORDER= 0
##$ASSFAC= 0
##$ASSFACI= 0
##$ASSFACX= 0
##$ASSWID= 0
##$AUNMP= <proc_1d>
##$AZFE= 0.1
##$AZFW= 0.1
##$BCFW= 0
##$BC_mod= 0
##$BYTORDP= 0
##$COROFFS= 0
##$CY= 12.5
##$DATMOD= 1
##$DC= 0
##$DFILT= <>
##$DTYPP= 0
##$F1P= 14.0000005364418
##$F2P= -0.99999901652339
##$FCOR= 0.5
##$FTSIZE= 32768
##$FT_mod= 6
##$GAMMA= 0
##$GB= 0
##$INTBC= 1
##$INTSCL= 1
##$ISEN= 128
##$LB= 0.3
##$LEV0= 0
##$LPBIN= 0
##$MAXI= 10000
##$MC2= 0
##$MEAN= 0
##$ME_mod= 0
##$MI= 0
##$NCOEF= 0
##$NC_proc= -7
##$NLEV= 6
##$NOISF1= 0
##$NOISF2= 0
##$NSP= 0
##$NTH_PI= 0
##$NZP= 0
##$OFFSET= 16.522
##$PC= 1
##$PHC0= -66.29022
##$PHC1= 9.18089
##$PH_mod= 1
##$PKNL= yes
##$PPARMOD= 0
##$PSCAL= 4
##$PSIGN= 0
##$REVERSE= no
##$SF= 250.13
##$SI= 32768
##$SIGF1= 0
##$SIGF2= 0
##$SINO= 400
##$SIOLD= 32768
##$SREGLST= <1H.DMSO>
##$SSB= 0
##$STSI= 32768
##$STSR= 0
##$SW_p= 5175.98343685301
##$SYMM= 0
##$S_DEV= 0
##$TDeff= 65536
##$TDoff= 0
##$TI= <Analysis number 999999
Compound Code 99
Book Reference 9
Project Code 9>
##$TILT= no
##$TM1= 0
##$TM2= 0
##$TOPLEV= 0
##$USERP1= <user>
##$USERP2= <user>
##$USERP3= <user>
##$USERP4= <user>
##$USERP5= <user>
##$WDW= 1
##$XDIM= 32768
##$YMAX_p= 395458027
##$YMIN_p= -1699134
$$ End of Bruker specific parameters
$$ ---------------------------------
##NTUPLES= NMR SPECTRUM
##VAR_NAME=  FREQUENCY,     SPECTRUM/REAL,   SPECTRUM/IMAG
##SYMBOL=    X,             R,               I
##VAR_TYPE=  INDEPENDENT,   DEPENDENT,       DEPENDENT
##VAR_FORM=  AFFN,          ASDF,            ASDF
##VAR_DIM=   32768,         32768,           32768
##UNITS=     HZ,            ARBITRARY UNITS, ARBITRARY UNITS
##FACTOR=    0.157963299565203, 1,           1
##FIRST=     4132.6476996994, 0,             0
##LAST=      -1043.33573715361, 0,           0
##MIN=       -1043.33573715361, -1699134,    0
##MAX=       4132.6476996994, 395458027,     0
$$ Real data points
##PAGE= N=1
##DATA TABLE= (X++(R..R)), XYDATA
$$ [...]
26680A034445L7292M0022j74582J62553J21445j86703M0014L75131J85891l1650
$$ 1034445 1071737 1111759 937177 1099730 1221175 1034472 1074486 1449617 1635508 1603858
26670A603858o00378n96641k01708M42351M72351n8706j67703j38347k62215m26268
$$ 1603858 1003480 406839 205131 647482 1119833 1061127 893424 755077 492862 66594
26660F6594J15575L63254M90284m0301p55729p7945J26687L83140j09877k07420
$$ 66594 182169 545423 1035707 995406 239677 161732 288419 671559 561682 354262
26650C54262r6408N8814k2863l47373j22091K7943N05934N11901J09674m3395
$$ 354262 257854 316668 293805 -53568 -175659 -147716 358218 870119 979793 936398
26640I36398j3071q9165R6817J54815J47312J54937n75907J65027j84620O5335
$$ 936398 923327 834162 930979 1085794 1233106 1388043 812136 977163 792543 857878
26630H57878J31040k29893k11763r5586L4534K46422o0432k19761k55247L255
$$ 857878 988918 759025 547262 451676 486210 732632 672200 452439 197192 200447
26620B00447k33324J63218J58415k22588k25035N32768M24340k67778o11959L9131
$$ 200447 -32877 130341 288756 66168 -158867 373901 798241 530463 -81496 -42365
26610d2365K42481M66886K12199M6252L15133l36100k42648P8089J07048K67537
$$ -42365 200116 667002 879201 925453 1240586 904486 661838 739927 846975 1114512
26600A114512k00535j72439k16434j10872M11350j8309l63771j90161J24670J71872
$$ 1114512 913977 741538 525104 414232 825582 807273 443502 253341 378011 549883
26590E49883M56765j20678M1554n3165l80762j54849L27205k17308l10755J64679
$$ 549883 1006648 885970 927524 874359 493597 338748 665953 448645 137890 302569
26580C02569Q0020j91826k31762j56564J799K9911k21842n8776J16943J07681
$$ 302569 382589 190763 -40999 -197563 -195764 -165853 -387695 -446471 -329528 -221847
26570b21847M31110j41932L31372J46072j08721K46033K38396J15036j21994k69038
$$ -221847 209263 67331 398703 544775 436054 682087 920483 1035519 913525 644487
26560F44487k64067n11168n0567J40447M96316j2912K02984j36912K56135O13937
$$ 644487 380420 -130748 -181315 -40868 455448 442536 645520 508608 764743 1378680
26550A378680j08584p03362k90430k22313k25998n0572J75800M21703N22889j24458
$$ 1378680 1270096 566734 276304 53991 -172007 -222579 -46779 374924 897813 773355
26540G73355m03233k86437M6558L0949N60724J51915m96324j12265M29393L22057
$$ 773355 370122 83685 130243 161192 721916 873831 377507 265242 694635 1016692
26530A016692r3052j45814k84404j7478k74335j18713K54346K20377j17116n29896
$$ 1016692 923640 777826 493422 475944 201609 82896 337242 557619 440503 -89393
26520h9393k7547k48796K32613o6331J58994J32229j74217J78477K07925K55803
$$ -89393 -116940 -365736 -133123 -199454 -40460 91769 -82448 96029 303954 559757
26510E59757l6320m75483J7607j79811j75234M20588M96598m22304k99423J47603
$$ 559757 523437 47954 65561 -114250 -289484 131104 627702 205398 -94025 53578
26500E3578N8278l68610K0870P5053J52337l3255K1066R4254J32922K3910k62795
$$ 53578 111856 -256754 -235884 -160831 -8494 -41749 -20683 73571 206493 230403 -32392
26489c2392n10033K27126M32605O36087k8345m10163j39433j83735J46878J73926
$$ -32392 -542425 -315299 117306 753393 725048 314885 175452 -8283 138595 312521
26479C12521r3782j41292k9921l9008k1889j6081l74593j68563J43559J62014
$$ 312521 218739 77447 47526 8518 -13371 -29452 -404045 -572608 -429049 -267035
26469b67035P5149l03031R0118J62811M53907P22745j46738m10126l0308j6693
$$ -267035 -191886 -494917 -404799 -241988 211919 934664 787926 377800 347492 330799
26459C30799K36276n6597m03838j53022o9652k85717J70246o8965L2179j80212
$$ 330799 567075 510478 106640 -46382 -116034 -401751 -231505 -300470 -268291 -448503
26449d48503L25207J27024K21232J22637N1653J40444K05150o37237j65475J1942
$$ -448503 -123296 3728 224960 347597 399250 539694 744844 107607 -57868 -45926
26439d5926J63337K65782O7478n4948J34606k79191l32215j23849k45680J51761
$$ -45926 117411 383193 450671 395723 530329 251138 -81077 -204926 -450606 -298845
26429b98845N23486K19532m24205k0746J90545k57397K2941O9108k41060P3315
$$ -298845 224641 444173 19968 -778 189767 -67630 -44689 24419 -216641 -143326
26419a43326K26399N8863j64737n9776k20913K31516K87527O5704l8469m0384
$$ -143326 83073 141936 -22801 -82577 -303490 -71974 215553 281257 242788 202404
26409B02404p80171k65651M63241M98732n3192J34400K08010j78132l32915J77414
$$ 202404 -577767 -843418 -380177 118555 65363 199763 407773 229641 -103274 74140
26399G4140J53947m97396l19694j6692M3024L63225J87938j31445j7447N3878
$$ 74140 228087 -269309 -589003 -605695 -562671 -199446 -11508 -142953 -160400 -106522
26389a06522m1093m78315R1658K73064R0391J24084k5149j18566j34962j88288
$$ -106522 -147615 -625930 -534272 -261208 -170817 -46733 -71882 -190448 -325410 -513698
26379e13698o2708j37016K77215M79545J47464R8234J28400m97266n7224L83072
$$ -513698 -576406 -713422 -436207 43338 190802 289036 417436 -79830 -137054 246018
26369B46018K5468l57317K4396J30343j32877m44502j51924K52336K94233K94670
$$ 246018 271486 -85831 -61435 68908 -63969 -508471 -660395 -408059 -113826 180844
26359A80844k77856k43264J03088N85196O57838K48061l26781q86278n26141m42443
$$ 180844 -97012 -340276 -237188 348008 1005846 1253907 927126 40848 -485293 -927736
26349i27736m8369O22300M20516Q3955k02169L40360J7874j86208k75796K69511
$$ -927736 -976105 -353805 66711 150666 -51503 288857 306731 120523 -155273 114238
26339A14238K50285m644n52168k9509K02472O912k01005o9282J8429J51266L55765
$$ 114238 364523 359879 -192289 -221798 -19326 -12414 -213419 -282701 -264272 -113006 242759
26328B42759J81415m48235j65839M6017J83082K18047M5076l03818L09642L72378
$$ 242759 424174 -24061 -189900 -143883 39199 257246 302322 -1496 308146 680524
26318F80524k59219n89967k65952K35598K25657J12678K32037l61645k89503L60560
$$ 680524 421305 -168662 -434614 -199016 26641 139319 371356 9711 -279792 80768
26308H0768j68444k40320J28649J84224J05916O6370l07309p6382N13392J54301
$$ 80768 -87676 -327996 -199347 -15123 90793 157163 -150146 -226528 286864 441165
26298D41165j77075m88203N0095K7417j31703K47170K15780J47177k43606K2503
$$ 441165 264090 -224113 -174018 -146601 -278304 -31134 184646 331823 88217 110720
26288A10720M05810j01895L893P5182k78361j29537k80367K11691m12544K70245
$$ 110720 516530 414635 418528 493710 215349 85812 -194555 17136 -395408 -125163
26278a25163M12946J72200k80369q8883j02544m3864J74464J02941J63203J44733
$$ -125163 287783 459983 179614 90731 -11813 -55677 118787 221728 384931 529664
26268E29664j3780J61982j79726j78381j98658L6873J04938Q5151l11336j16987
$$ 529664 515884 677866 498140 319759 121101 157974 262912 348063 36727 -80260
26258h0260j12942l52154K91419K6136P5494K46263L18118k08645j35629k91509
$$ -80260 -193202 -545356 -253937 -227801 -152307 93956 412074 203429 67800 -223709
26248b23709K91380L7434q7525j14850L50943K89212l9970L6996k15702q6096
$$ -223709 67671 105105 17580 -97270 253673 542885 502915 539911 324209 238113
26238B38113Q4456j58275K1428k72466k29730K82385J92772j88539J30347K50147
$$ 238113 322569 164294 185722 -86744 -316474 -34089 158683 -29856 100491 350638
26228C50638K51049j30728l51268m86757j79285M44070J61118L60069N8340m6165
$$ 350638 601687 470959 119691 -367066 -546351 -102281 58837 418906 477246 431081
26218D31081l35426j82580j23726p8185K20446l3502j24056L81288M36768j37368
$$ 431081 95655 -86925 -210651 -288836 -68390 -101892 -225948 155340 592108 454740
26208D54740k82971L60237P5539l19043j82828n30639k08937L13383N48149m9023
$$ 454740 171769 532006 607545 288502 105674 -424965 -633902 -320519 227630 178607
26198A78607p9793J18923K52515l6588K76491j50433M9599k23827k67656k14837
$$ 178607 98814 217737 470252 433664 710155 559722 609321 385494 117838 -96999
26188i6999j7119j8996K57568p820k48369j76849k17918j72068J69275J69650
$$ -96999 -114118 -133114 124454 116634 -131735 -308584 -526502 -698570 -529295 -359645
26178c59645J01671N854m57977n66807N16259N12540l2936N4968j57626L78623
$$ -359645 -257974 -252120 -710097 -1276904 -760645 -248105 -281041 -226073 -383699 -5076
26168e076N49430q0341k84877k19122M50098R0615K28567j10207l03136n77555
$$ -5076 544354 464013 179136 -39986 410112 500727 729294 619087 315951 -261604
26158b61604k39945J51007O2904O3813K04013o6431l11115k91658m3434K30598
$$ -261604 -501549 -350542 -287638 -223825 -19812 -86243 -397358 -689016 -732450 -501852
26148e01852L92986j68857J01927L69369L3772Q2946m9971r7482l13557J97715
$$ -501852 -108866 -277723 -175796 193573 227345 310291 260320 162838 -150719 46996
26138D6996K2442k52422K47209K01452M25899o773j82763l17403m08537k36106
$$ 46996 69438 -182984 64225 265677 691576 684803 502040 184637 -223900 -460006
26128d60006j00940P7074K73193J52649J62115j12736k95343J17812L77331m5344
$$ -460006 -560946 -483872 -210679 -58030 104085 -8651 -303994 -186182 191149 145805
26118A45805j41439j53191l15445r4606l2438j28527L3333k47200K82361J20985
$$ 145805 4366 -148825 -464270 -558876 -591314 -719841 -686508 -933708 -651347 -530362
26108e30362k86882k24047P91661N98422l94984l00929N16523k25547l1543j20224
$$ -530362 -817244 -1041291 -249630 348792 -46192 -347121 169402 -56145 -87688 -207912
26098b07912k86327p3588j19474k11270n7932L73124J46277R5612K9973P12401
$$ -207912 -494239 -567827 -687301 -898571 -956503 -583379 -437102 -341490 -311517 400884
26088D00884J46182o76961j86627L42240K944J09539k5305j25483j49067J59312
$$ 400884 547066 -129895 -316522 25718 28662 138201 112896 -12587 -161654 -2342
26078b342M38745N6041m02650k74822j91600j59398K4146N07343L01746L2422
$$ -2342 436403 492444 89794 -185028 -376628 -536026 -511880 -4537 297209 329631
26068C29631n66594p2959L72249q3356m8013j94922J34690M9694k31550J00350
$$ 329631 -236963 -309922 62327 -21029 -69042 -263964 -129274 -79580 -311130 -210780
26058b10780N71622M03982k88052R0634l86997j92972M4324L33833k5498K73894
$$ -210780 360842 764824 476772 567406 180409 -12563 31761 365594 340096 613990
26048F13990K44362l14827n69109k06495k64141L10467N7506k17322J74429O3382
$$ 613990 858352 543525 -25584 -232079 -496220 -185753 -128247 -345569 -171140 -107758
26038a07758l09524j3576k32196M14927K11614K0278K19618K4580k44735j79532
$$ -107758 -417282 -430858 -663054 -248127 -36513 -16235 203383 227963 -16772 -196304
26028a96304J75410K59062m2700J28466k99160J0907K47560O3376k13641p3655
$$ -196304 -20894 238168 195468 323934 24774 35681 283241 346617 132976 59321
26018E9321j46837L34992M06164K92511j0189k77072j92605l27346j66992j0648
$$ 59321 -87516 247476 653640 946151 935962 658890 466285 138939 -28053 -38701
26008c8701j84066o72621L9644M50524n5199m12875L58336N05919J32407l38024
$$ -38701 -222767 -895388 -855744 -405220 -460419 -873294 -514958 -9039 123368 -214656
25998b14656m27569j00748K28605O40042K96390l08628m9626l08247k53302m1095
$$ -214656 -642225 -742973 -514368 125674 422064 113436 63810 -244437 -497739 -538834
25988e38834N02137L24201k83791J20323j72143k4481L447j83877l30424J34605
$$ -538834 -36697 287504 3713 124036 -48107 -72588 -69141 -253018 -583442 -448837
25978d48837J617j89198J19681J5411N05723N6305n82095j0902J08391j26236
$$ -448837 -447220 -636418 -516737 -501326 4397 60702 -521393 -532295 -423904 -550140
25968e50140J75315N17784K54200q3272L4798j85284j48608k02393k52989J23345
$$ -550140 -374825 142959 397159 313887 348685 163401 14793 -187600 -440589 -317244
25958c17244O14381K94383K7779o36230j73728m22214l22990n8216J32154L04265
$$ -317244 297137 591520 619299 -16931 -190659 -612873 -935863 -994079 -861925 -557660
25948e57660l04502j86207L8265n2307M7117r4334J98020L54256K46435K14793
$$ -557660 -862162 -1048369 -1010104 -1062411 -1015294 -1109628 -911608 -557352 -310917 -96124
25938i6124l2825p3491K6357R3522k77613m82235l25012M57877N39123L42328
$$ -96124 -128949 -202440 -176083 -82561 -360174 -842409 -1167421 -709544 -170421 171907
25928A71907J75716j82583k94485m90089k26092L9224J1320O5256o82095k87213
$$ 171907 347623 165040 -129445 -619534 -845626 -806402 -795082 -729826 -1411921 -1699134
25918a699134N34556N56805N28614o26604o30583L25409M59399K97767J41065
$$ -1699134 -1164578 -607773 -79159 -705763 -1336346 -1010937 -551538 -253771 -112706
25909a12706j87130j25508o6718j07958K84856N56249q062k54295m81059m01490
$$ -112706 -299836 -425344 -492062 -600020 -315164 241085 233023 -21272 -502331 -903821
25899i03821J36279L22013r0266m197L88729N1319l12910J06768k2895L15905
$$ -903821 -767542 -445529 -535795 -539992 -151263 -99944 -412854 -306086 -328981 -13076
25889a3076J97929m774m03078Q4175J3705o6659l8946J58181k94161n94176O2190
$$ -13076 184853 180079 -222999 -138824 -125119 -191778 -230724 -72543 -366704 -960880 -898690
25878h98690L23351j76433K33770K25455R4329j45834M5007L98243J37018M3260
$$ -898690 -575339 -751772 -518002 -292547 -198218 -344052 -299045 99198 236216 279476
25868B79476J78659J64008N22246l07790n68559k28815L89P1608l7711j71209
$$ 279476 458135 622143 1144389 836599 268040 39225 39614 111222 73511 -97698
25858i7698q76060j79832L06323M18481J57287j35446j82554l8401J15122M23022
$$ -97698 -973758 -1153590 -847267 -428786 -271499 -406945 -589499 -627900 -512778 -89756
25848h9756J71825K439l30596l61851O0297j92780N41999J64128j20018k3373
$$ -89756 82069 84508 -246088 -607939 -547642 -740422 -198423 -34295 -154313 -177686
25838a77686o3995l1857q3287k8932J57214O2579n5830J2820P22978n0210k97614
$$ -177686 -241681 -273538 -356825 -385757 -228543 -165964 -221794 -208974 514004 463794 166180
25827A66180k43911K9555J14825j42158j85092M2264J13561J54434k14234L39269
$$ 166180 -77731 -48176 66649 -75509 -260601 -218337 -104776 49658 -164576 174693
25817A74693k66558j98461n36951j85005M1652R8866K76996K04787K77609K01096
$$ 174693 -91865 -290326 -827277 -1012282 -970630 -871764 -594768 -389981 -112372 88724
25807H8724j40305j38889l28662l53018K20542L85649p7541r2179Q2378J99369
$$ 88724 -51581 -190470 -519132 -872150 -651608 -265959 -343500 -435679 -353301 -153932
25797a53932k2746R5171J08796n32750J30615J32251N2542J93169k98318k76046
$$ -153932 -176678 -81507 27289 -505461 -374846 -242595 -190053 3116 -295202 -571248
25787e71248J40259l46853k85148k25994l2325L24424M76472m39461n43911L10037
$$ -571248 -430989 -777842 -1062990 -1288984 -1321309 -996885 -520413 -959874 -1503785 -1193748
25777a193748P19765O53478j264n29532l6340J22862o21869L81534K73750q0458
$$ -1193748 -473983 179495 178231 -351301 -387641 -264779 -886648 -505114 -231364 -311822
25767c11822j79590j30089J03037O70895L48612n7963n51163o14323j1190j01337
$$ -311822 -491412 -621501 -518464 152431 501043 443080 -108083 -722406 -733596 -834933
25757h34933j93584J63563j69330j26395Q1983j2895P14114L09683J52001L18102
$$ -834933 -1028517 -864954 -1034284 -1160679 -1078696 -1091591 -377477 -67794 84207 402309
25747D02309M3723o8203l67014K74151l1058m37200N580j52258k95378r7192J60636
$$ 402309 446032 377829 10815 284966 253908 -183292 -177712 -329970 -625348 -722540 -561904
25736e61904M07621m91202k85841J67311L07632m7519K39880j23872K4312P7839
$$ -561904 -154283 -645485 -931326 -764015 -456383 -503902 -264022 -387894 -363582 -285743
25726b85743K11004M43161J35266m58914j03038O42O6761k82108j82790O03194
$$ -285743 -74739 368422 503688 44774 -58264 -57622 9139 -272969 -455759 147435
25716A47435K58113o69240j43414l9323O5909j9976O1168J5406j95846L2715M89246
$$ 147435 405548 -263692 -407106 -446429 -380520 -400496 -339328 -323922 -519768 -487053 2193
25705B193L33211p2123j29908o507j071O4760j55162L26940K13862J10404n62543
$$ 2193 335404 263281 133373 126866 125795 190555 35393 362333 576195 686599 124056
25694A24056k77920p8175J14859L1503J16107k15002j73943k04042M02492O7748
$$ 124056 -153864 -232039 -117180 -85677 30430 -184572 -358515 -562557 -160065 -92317
25684i2317k88177j42833J9615K21161J96118m40920j52228J96081J92710k53127
$$ -92317 -380494 -523327 -503712 -282551 -86433 -527353 -679581 -483500 -290790 -543917
25674e43917l87497J70395O00972M11240k36975k75185K48705J21160o22660j91557
$$ -543917 -931414 -761019 -160047 251193 14218 -260967 -12262 108898 -513762 -705319
25664g05319O36232l21249L6817L49095r5721r9432j48101L0588k45597J3544
$$ -705319 -69087 -390336 -353519 -4424 -100145 -199577 -347678 -317090 -562687 -549143
25654e49143L35316n4324K98517J60584J51019K04168N3252l5803n1884k14788
$$ -549143 -213827 -268151 30366 190950 341969 546137 599389 563586 511702 296914
25644B96914K92763K8204m54423k51106r8925j98073l50834l44517L99847N52053
$$ 296914 589677 617881 163458 -87648 -186573 -384646 -735480 -1079997 -680150 -128097
25634a28097L34599l52339n38663q1651L22496K51510K53186k17795J14294k45858
$$ -128097 206502 -145837 -684500 -766151 -443655 -192145 61041 -156754 -42460 -288318
25624b88318k71304K33141J5767N5783R5210k60746n58064J19129K37632N23942
$$ -288318 -559622 -326481 -310714 -254931 -159721 -420467 -978531 -859402 -621770 -97828
25614i7828J06472q4084K25276J8442J02637R2687J4918j31667M89889n73806
$$ -97828 8644 -75440 149836 168278 270915 363602 378520 246853 736742 162936
25604A62936o06633K33732j54120J00798N21823L84026R931m00034j41744L09363
$$ 162936 -443697 -209965 -364085 -263287 258536 642562 652493 252459 110715 420078
25594D20078M06327j98305p1018o260k43302j28902k34854l76832o3275j32088
$$ 420078 826405 628100 557082 550822 307520 178618 -56236 -433068 -496343 -628431
25584f28431P6565L9635l45534J93192M33562J99422k0870J46369L31815K41592
$$ -628431 -551866 -512231 -857765 -664573 -231011 -31589 -52459 93910 425725 667317
25574F67317j62677k26012N5758p9671l65336o0478L01567K23324l79249j11208
$$ 667317 504640 278628 334386 254715 -110621 -171099 130468 353792 -25457 -136665
25564a36665k95897M0375J17602j34670J59843J7871J89901m23192j28049m8759
$$ -136665 -432562 -392187 -274585 -409255 -249412 -231541 -41640 -464832 -592881 -641640
25554f41640Q477O09630K48076j15498l33479Q560J48028J46227j1028Q4514o9191
$$ -641640 -633163 -23533 224543 109045 -224434 -215874 -67846 78381 67353 151867 82676
25543H2676n6994K26795N4898k34680L28550k44185k8637J21927J26408q4117
$$ 82676 25682 252477 307375 72695 401245 157060 128423 250350 376758 292641
25533B92641k11839k52511q1482K11832L44919k9583o29405j4188L77034J00582
$$ 292641 80802 -171709 -253191 -41359 303560 273977 -355428 -369616 7418 108000
25523A08000j81224k1474j93711j26081P5522j10790J12022M0637k23585J11218
$$ 108000 -73224 -94698 -288409 -414490 -338968 -449758 -337736 -297099 -520684 -409466
25513d09466o2979N32799L20463R0277k46383o08662j11559J16309J35436n4778
$$ -409466 -472445 60354 380817 471094 224711 -383951 -495510 -379201 -243765 -298543
25503b98543m83880L26184L89376P2386p0241O62887K22173l26132m40987J7171
$$ -298543 -782423 -456239 -66863 5523 -64718 598169 820342 494210 53223 70394
25493G0394j83413k92344R6880r3310j18763N4042k3217p6833K43820L41525j03114
$$ 70394 -113019 -405363 -308483 -401793 -520556 -466514 -489731 -566564 -322744 18781 -84333
25482h4333o40627k7329M56779K20335L82252K81178j72266j45405l25362J46817
$$ -84333 -724960 -752289 -295510 -75175 307077 588255 415989 270584 -54778 92039
25472I2039m51911k95043M3732K15753m5122N6347K7190j8072J56362J28353L42306
$$ 92039 -359872 -654915 -611183 -395430 -440552 -384205 -357015 -375087 -218725 -90372 251934
25461B51934M85001K62442K16236m80777j161538n55522L01701M46410m6616j24290
$$ 251934 736935 999377 1215613 734836 -426702 -982224 -680523 -234113 -280729 -405019
25451d05019m48998l42P59663K11508m55840m41771J39781J45193L4821P1635
$$ -405019 -854017 -854359 -94696 116812 -339028 -780799 -641018 -495825 -461004 -389369
25441c89369J20030q4351j49237n93299n8135K21578J16022Q8406M31270m1037
$$ -389369 -269339 -353690 -502927 -1096226 -1154361 -932783 -816761 -728355 -297085 -338122
25431c38122m12721k94727j34412l00792J60857P96403J64844j82865l77354k1329
$$ -338122 -750843 -1045570 -1179982 -1480774 -1319917 -523514 -358670 -541535 -918889 -940218
25421i40218K88975J37973L70747O3861k14475P6992j23948o0021l11577K53758
$$ -940218 -651243 -513270 -142523 -78662 -293137 -216145 -340093 -400114 -711691 -457933
25411d57933O3318k07751o5970k8943M8270j40936J35068K09294J48790J45103
$$ -457933 -394615 -602366 -668336 -697279 -649009 -789945 -654877 -445583 -296793 -151690
25401a51690m114L28443j13699k8449l48885r937K63251L4946L53501K6151n03543
$$ -151690 -155804 172639 58940 30491 -318394 -328331 -65080 -30134 323367 349518 -154025
25390a54025m25248l60442M5750L37103Q58262J88072m95950j99304K03920O0012
$$ -154025 -579273 -939715 -893965 -556862 301400 489472 -6478 -205782 -1862 58150
25380E8150J65685j54119K38197P4272l13994k2971k88093k55036k6300j13197
$$ 58150 223835 69716 307913 382185 68191 45220 -242873 -497909 -524209 -637406
25370f37406N7357L12512K49216J30171k34235j4851J68205J11640l57273l18885
$$ -637406 -580049 -267537 -18321 111850 -122385 -137236 30969 142609 -214664 -533549
25360e33549j61855m4999k3644K82984j55842l40027m15756K10313N00760Q7574
$$ -533549 -695404 -740403 -764047 -481063 -636905 -976932 -1392688 -1182375 -681615 -594041
25350e94041P1007M20307J3499O7100J49424k7311m81202o19553J41032K85872
$$ -594041 -523034 -102727 -89228 -22128 127296 99985 -381217 -1000770 -859738 -573866
25340e73866j38372j67062N90750L21734O0698J25638j09711m05491k18737k92537
$$ -573866 -712238 -879300 -288550 33184 93882 219520 109809 -295682 -514419 -806956
25330h06956R9286K81077J31042R6321N97494k40085l55591l52149J94642K56219
$$ -806956 -707670 -426593 -295551 -199230 398264 158179 -197412 -549561 -354919 -98700
25320i8700K86340j13432L4113j39215r0560n53020j73280O6410r2350J52190
$$ -98700 187640 74208 108321 -30894 -121454 -674474 -847754 -781344 -873694 -721504
25310g21504L75272p6724j28222O75589J645k67823k36893k45255J10974J30946
$$ -721504 -346232 -422956 -551178 124411 126056 -141767 -378660 -623915 -512941 -381995
25300c81995M11190O42041j76837l43038n07336r0270l57945l64661L24598N43167
$$ -381995 29195 671236 494399 151361 -355975 -446245 -804190 -1168851 -844253 -301086
25290c01086M11224j15054j83061L95829q876l07952P519l39613k47779k02707
$$ -301086 110138 -4916 -187977 207852 198976 -108976 -101457 -441070 -688849 -891556
25280h91556J66924K68687K07925j07026L3261r777J96793J88713l0930l119M7074
$$ -891556 -724632 -455945 -248020 -355046 -321785 -331562 -134769 53944 23014 19895 66969
25269F6969O3275k46746j66866N2356p0263k77971l84588M89039L89345n6504
$$ 66969 130244 -116502 -283368 -231012 -301275 -579246 -963834 -474795 -85450 -141954
25259a41954N95457N0395k62616k8351j41076M603j26929J09019m29333j2127
$$ -141954 453503 503898 241282 212931 71855 76458 -50471 58548 -370785 -382912
25249c82912K79978J30896j9360k58849l37138J24770J47977r7439j13479l419
$$ -382912 -102934 27962 8602 -250247 -587385 -462615 -314638 -412077 -525556 -528975
25239e28975J37999j1296J8469k44180l50857M91671L69903J21092L95300j05311
$$ -528975 -390976 -402272 -383803 -627983 -978840 -487169 -117266 3826 399126 293815
25229B93815m57948j15109q6467k42082O0861K7738O6494K45539O2997k16656
$$ 293815 -164133 -279242 -365709 -607791 -546930 -519192 -452698 -207159 -144162 -360818
25219c60818k22295k0506j14037K55812L10328O1600L1755J95242L99327j07452
$$ -360818 -583113 -603619 -717656 -461844 -151516 -89916 -58161 137081 536408 428956
25209D28956o21872k91537k18466j58132k32927P332L62541N69897L16455J30177
$$ 428956 -192916 -484453 -702919 -861051 -1093978 -1086646 -724105 -154208 162247 292424
25199B92424k27769j35860k98060l20445J38675L29869k30911K19669L67009j62411
$$ 292424 64655 -71205 -369265 -689710 -551035 -221166 -452077 -232408 134601 -27810
25189b7810l62864j42361r7615J04913j4759p51219r8793K54292j42272J26594
$$ -27810 -390674 -533035 -630650 -525737 -540496 -1291715 -1390508 -1136216 -1278488 -1151894
25179a151894K09836K04068M75598J32589K87284q5051l72597j28673P9138M3493
$$ -1151894 -942058 -737990 -262392 -129803 157481 72430 -300167 -428840 -349702 -306209
25169c06209J94865j24830r107J81548j31485j16999j4190l60218J37039M37771
$$ -306209 -111344 -236174 -245281 -63733 -195218 -312217 -326407 -686625 -549586 -111815
25159a11815O52488q5281j08157n2715j15208l89358m66637j66927Q4745k04530
$$ -111815 540673 455392 347235 294520 179312 -210046 -676683 -843610 -758865 -963395
25149i63395k29967J26649K59649O9198K7502M67156k01142J70281k9924P0246
$$ -963395 -1193362 -1066713 -807064 -737866 -710364 -243208 -444350 -274069 -303993 -233747
25139b33747j03930K57989J23240J03069L40806n03966r8056K38387J30796k00279
$$ -233747 -337677 -79688 43552 146621 487427 -16539 -114595 123792 254588 54309
25129E4309L58110J23228M4949m02805k96431l07689J19142j54544o6483j15339
$$ 54309 412419 535647 580596 177791 -118640 -426329 -307187 -461731 -528214 -643553
25119f43553J45394J53268K37085J67723R1574j010L46850L34241p03678k99022
$$ -643553 -498159 -344891 -107806 59917 151491 150481 497331 831572 127894 -171128
25109a71128m41187n62957O27146K58176l19598K13466j66971o778l79550J18750
$$ -171128 -612315 -1175272 -548126 -289950 -609548 -396082 -563053 -569831 -949381 -830631
25099h30631L13256K5253J67203l01324k66531L39995L32904R1421L45945N5136
$$ -830631 -517375 -492122 -324919 -626243 -892774 -552779 -219875 -128454 217491 272627
25089B72627n83042r5944J88887l1402k82376j98391l1141J20992J00786j57509
$$ 272627 -310415 -406359 -217472 -248874 -531250 -729641 -760782 -639790 -539004 -696513
25079f96513j21905J08216K24828q0319J64301O7951K21231L77718n8255K24118
$$ -696513 -818418 -710202 -485374 -565693 -401392 -333441 -112210 265508 207253 431371
25069D31371M40681l92604m79106j66224m12152M6490L62240l4147J977J21905
$$ 431371 872052 479448 342 -165882 -578034 -531544 -169304 -203451 -201474 -79569
25059g9569J26021m73305N6623M6090J35204j13921j12823O3219L5183k08555
$$ -79569 46452 -426853 -370230 -324140 -188936 -302857 -415680 -352461 -317278 -525833
25049e25833l22105j29648L96127N19047m94555l73168J03318J66268R7755K92415
$$ -525833 -847938 -977586 -581459 -62412 -556967 -930135 -826817 -660549 -562794 -270379
25039b70379K52614m7514j2287l18030K38335N04120K53196j28885j48051j66398
$$ -270379 -17765 -65279 -77566 -395596 -157261 346859 600055 471170 323119 156721
25029A56721k26413k61787K50278N8734n5025r8662m82208L06128J49763o91796
$$ 156721 -69692 -331479 -81201 -22467 -77492 -176154 -658362 -352234 -202471 -894267
25019h94267k98437K94179M73689M90263K24622P9924j96486j31332r5531j63026
$$ -894267 -1192704 -898525 -424836 65427 290049 369973 173487 42155 -53376 -216402
25009b16402K09098J31801k8260l27147n11194J79108O9756R770l00466M12055
$$ -216402 -7304 124497 96237 -230910 -742104 -562996 -493240 -483470 -783936 -371881
24999c71881J03802k86893o7211l5975p8068P5580J46116Q0804o79j5492l07716
$$ -371881 -268079 -554972 -622183 -658158 -736226 -660646 -514530 -433726 -434405 -449897 -757613
24988g57613P4867L64505P9084J20037K85322M07836J95981r1463o80056k76120
$$ -757613 -682746 -318241 -239157 -119120 166202 574038 770019 678556 -1500 -277620
24978b77620J72220j08901j09494J19300k72679j06052j2287K75320L28865r9997
$$ -277620 -105400 -214301 -323795 -204495 -477174 -583226 -595513 -320193 8672 -91325
24968i1325n13482m78126K38336K59536Q6509j39678j69857m7571Q5942L9481
$$ -91325 -604807 -1082933 -844597 -585061 -498552 -638230 -808087 -855658 -769716 -730235
24958g30235j64450j77694k74962J29123K60706K66485N34466L19062J73435j17398
$$ -730235 -894685 -1072379 -1347341 -1218218 -957512 -691027 -156561 162501 335936 218538
24948B18538l26000l37201r502j04886K00164Q00549J98157p36322k69340L65246
$$ 218538 -107462 -444663 -454165 -559051 -358887 441662 639819 -96503 -365843 -597
24938e97J53624j10709M17451L57968k48439j28932k83303l47351J04002j96743
$$ -597 153027 42318 459769 817737 569298 440366 157063 -190288 -86286 -283029
24928b83029j34342M9162l78729K08450J41385L51721p5745l82900j2935j75939
$$ -283029 -417371 -368209 -746938 -538488 -397103 -45382 -121127 -504027 -516962 -692901
24918f92901k99684N04683N86940J29739l90164J06667M61454r2939L46472j84378
$$ -692901 -992585 -487902 99038 228777 -161387 -54720 406734 313795 660267 475889
24908D75889n03613l41786M922O1788L87759k70950k13862J59052L24737J4327
$$ 475889 -27724 -369510 -364588 -302800 84959 -185991 -399853 -240801 83936 98263
24898I8263J49878j98846k56401K23327K0718l22093n52821J69721K95694K17643
$$ 98263 248141 49295 -207106 16221 36939 -285154 -837975 -668254 -372560 -154917
24888a54917L11139L2441k74385m0772q2916j12554J78628j35819J10756K94848
$$ -154917 156222 188663 -85722 -126494 -209410 -321964 -143336 -279155 -168399 126449
24878A26449l84379k28687M47458M61538j69359j96170L45487J00640j84625m87507
$$ 126449 -257930 -486617 -39159 422379 253020 56850 402337 502977 318352 -169155
24868a69155k04244K91116k2530n04447j2136J66337l71004O163M88614K54831
$$ -169155 -373399 -82283 -104813 -609260 -621396 -455059 -826063 -819900 -331286 -76455
24858g6455L27197J73438k99437j77670j28379l24422l40998l01903p1809K13394
$$ -76455 250742 424180 124743 -52927 -181306 -505728 -846726 -1148629 -1220438 -1007044
24848a007044O29064M5121r9887L24720k44331K46839J81228n25208j6583K79227
$$ -1007044 -377980 -332859 -432746 -108026 -352357 -105518 75710 -449498 -466081 -186854
24838a86854j7604J53671j1082p68026J74433L12741j17709j29805j89007p3726
$$ -186854 -204458 -50787 -61869 -829895 -655462 -342721 -460430 -590235 -779242 -852968
24828h52968K13573K87598J03462O3442J0716K87305k25283j45460o2728L75881
$$ -852968 -639395 -351797 -248335 -184893 -174177 113128 -112155 -257615 -320343 55538
24818E5538q9319m21503Q2675L26977L01080m26657k45459J72885k13336j35861
$$ 55538 -33781 -455284 -372609 -45632 255448 -171209 -416668 -243783 -457119 -592980
24808e92980j25048J23799M8145L00319J83506p4666p3340l4259J90373J46040
$$ -592980 -718028 -594229 -546084 -245765 -62259 -136925 -210265 -244524 -54151 91889
24798I1889J8108J19930o3936k05514m84068l92276k01025J58893L49881L02728
$$ 91889 109997 229927 165991 -39523 -523591 -915867 -1116892 -957999 -608118 -305390
24788c05390l4331j48917J96659l64355m194j91192r3046J71972K04664J88566
$$ -305390 -339721 -488638 -291979 -656334 -660528 -851720 -944766 -772794 -568130 -379564
24778c79564K34373J27017p9112r9780k82861k32903N54226J02533l34763j46012
$$ -379564 -145191 -18174 -97286 -197066 -479927 -712830 -158604 -56071 -390834 -536846
24768e36846J35433L2718j29738j30088K30099L89425K57065j52372m81036k56341
$$ -536846 -401413 -368695 -498433 -628521 -398422 -8997 248068 95696 -385340 -641681
24758f41681K02203N1800o8012O7369P903j02605p6212j7123N7746k51769r9801
$$ -641681 -439478 -387678 -455690 -388321 -380418 -483023 -559235 -576358 -518612 -770381 -870182
24747h70182M78034K83061k53398N9850Q5316J6389L10179j038J74561l26256
$$ -870182 -392148 -109087 -362485 -302635 -217319 -200930 109249 108211 282772 -43484
24737d3484l73226l66048J66803k6418K51045k98583j92385J75160k3683m8644
$$ -43484 -416710 -782758 -615955 -642373 -391328 -689911 -882296 -707136 -730819 -779463
24727g79463q6233k3604J76682L59024L86535N1326k05931k08110J49743J42432
$$ -779463 -865696 -889300 -712618 -353594 32941 84267 -121664 -329774 -180031 -37599
24717c7599k7942R9306r8175n5551J95913l36087j49154q8524n01346l06485j13482
$$ -37599 -65541 33765 -64410 -119961 75952 -260135 -409289 -497813 -999159 -1305644 -1419126
24706a419126K03083L02679J92932M86342j50336k11559k96055M24096N36616
$$ -1419126 -1216043 -913364 -720432 -234090 -384426 -595985 -892040 -467944 68672
24697F8672m8743N825O4029m1884j79828K84753K99717k68650m10314o4586J51873
$$ 68672 19929 25754 89783 47899 -131929 152824 452541 183891 -226423 -291009 -139136
24686a39136p6116J23588J64742J70943N8080k09071n8515k9627M88892L07857
$$ -139136 -215252 -91664 73078 244021 302101 93030 34515 4888 493780 801637
24676H01637j99689k01529l11323J45259j88354J26009N02272l766k81841n00971
$$ 801637 601948 400419 89096 234355 46001 172010 674282 670516 388675 -112296
24666a12296j80972q6294O7635J66242J97341m81919q3287K32083O56782R6550
$$ -112296 -293268 -379562 -311927 -145685 51656 -430263 -513550 -281467 375315 471865
24656D71865l16627k1131J01989r4103l42535L13780l03533R3726M23845l91881
$$ 471865 155238 134107 236096 141993 -200542 113238 -190295 -96569 327276 -64605
24646f4605l68534L1741K19782k34831O027J70825J29563l88871j66889J67308
$$ -64605 -433139 -401398 -181616 -416447 -410420 -239595 -110032 -498903 -665792 -498484
24636d98484j42191m50761j48428L16835J28505K58610q833R5547Q8613k18425
$$ -498484 -640675 -1091436 -1239864 -923029 -794524 -535914 -544747 -449200 -360587 -579012
24626e79012m01887K50122J46046M53950L24487q04652o91069L8599J00990P955
$$ -579012 -980899 -730777 -584731 -130781 193706 -610946 -1302015 -1263416 -1162426 -1154471
24616a154471R8780N14682M79828k2228j81956m43738L01139L97845k67335J17514
$$ -1154471 -1055691 -541009 -61181 -83409 -265365 -709103 -407964 -10119 -277454 -159940
24606a59940N5717l07589L46835l85942p5262J07750K37617l20866k4883J37309
$$ -159940 -104223 -411812 -64977 -450919 -526181 -418431 -180814 -501680 -526563 -389254
24596c89254q9087K18907o1724k85866n47378P001j34801L17037L02168L26304
$$ -389254 -478341 -259434 -321158 -607024 -1154402 -1147401 -1282202 -965165 -662997 -336693
24586c36693J57234j89117n09854q962K73613N06939O19316q2389k63111l88814
$$ -336693 -179459 -368576 -878430 -887392 -613779 -106840 512476 430087 166976 -221838
24576b21838P430M29114N4400n40879k2622J49926K54894m26052n55115p641J44933
$$ -221838 -214408 214706 269106 -271773 -294395 -144469 110425 -315627 -870742 -878383 -733450
24565g33450M81154M08399k43059K1395J40920l22673K16163n8645m60381q1239
$$ -733450 -252296 156103 -86956 -65561 75359 -247314 -31151 -89796 -550177 -631416
24555f31416q7113P794K46907M89694O23980j26799p13111o31969M6358M73538
$$ -631416 -718529 -710735 -463828 25866 649846 523047 -190064 -822033 -775675 -302137
24545c02137Q6922L3206Q5477m6534j88566p8501l27271l22585K15698O35714
$$ -302137 -215215 -182009 -96532 -143066 -331632 -410133 -737404 -1059989 -844291 -208577
24535b08577O6362k71853o69328Q2189J23902P0434J91495L83778L326L76502
$$ -208577 -142215 -414068 -1083396 -1001207 -877305 -806871 -615376 -231598 -228272 148230
24525A48230j68913l12637L33901J93513k22702k7650j85476j11334l4998r960
$$ 148230 -20683 -333320 581 194094 -28608 -56258 -241734 -353068 -388066 -398026
24515c98026r436q7691M70060L85627m51648k22940o2677j27214K93962J04575
$$ -398026 -407462 -495153 -25093 360534 -91114 -314054 -376731 -503945 -209983 -105408
24505a05408k08596J20962j22227m3501l05551j90555J27564L40810m7577j07709
$$ -105408 -314004 -193042 -315269 -358770 -664321 -854876 -727312 -386502 -434079 -541788
24495e41788l0573K51703M41133K79374J6284k94691o5331j54743L23931L25232
$$ -541788 -572361 -320658 120475 399849 416133 121442 56111 -98632 225299 550531
24485E50531l0624l57417m98376j96368K39009L44958n53571n58449J85937Q8412
$$ 550531 519907 162490 -335886 -532254 -293245 51713 -501858 -1060307 -874370 -785958
24475g85958k48625q0993L58805K23423r0436J97739j70848k50829R5201r8106
$$ -785958 -1034583 -1115576 -756771 -533348 -623784 -426045 -596893 -847722 -752521 -850627
24465h50627J47553m4681m49240m26401k5654P15569N22345j94112l81835k31670
$$ -850627 -703074 -747755 -1196995 -1623396 -1649050 -933481 -411136 -605248 -987083 -1218753
24455a218753P6941M93979L79610P5077n29403K0665O67345j21349m41074o2793
$$ -1218753 -1141812 -647833 -268223 -193146 -722549 -701884 -34539 -155888 -596962 -659755
24445f59755m0597r0870j00549l92053l45409j5336L15258M98171K66625N10430
$$ -659755 -700352 -791222 -891771 -1283824 -1629233 -1644569 -1329311 -831140 -564515 -54085
24435e4085J96810q1111j53351n48776j69438j38541p9337J2007K8216N74236
$$ -54085 142725 61614 -91737 -640513 -809951 -948492 -1027829 -1015822 -987606 -413370
24425d13370L03788J4281n54196j25918M74555L87765J15001r0509J31164l02491
$$ -413370 -109582 -95301 -649497 -775415 -300860 86905 201906 111397 242561 -59930
24415e9930j24252K09840m15508k41584J0032L06615J05359N391j53605n7681
$$ -59930 -184182 25658 -389850 -631434 -621402 -314787 -209428 -204037 -357642 -415323
24405d15323K57607j91887N1372M95077K06088k7847j52728n1187k02258m09257
$$ -415323 -157716 -349603 -298231 196846 402934 375087 222359 171172 -31086 -440343
24395d40343Q5870J47640K24127M7738L3862j54422k56850o7116J13013K21928
$$ -440343 -354473 -206833 17294 65032 98894 -55528 -312378 -379494 -266481 -44553
24385d4553J7939n24284j07306K98119P8226l1331l7555j05197k15294K49103
$$ -44553 -26614 -550898 -658204 -360085 -281859 -313190 -350745 -455942 -671236 -422133
24375d22133q2908j72862L07685L82803M39630n7469l6609j37015m68632K3061
$$ -422133 -505041 -677903 -370218 12585 452215 394746 358137 221122 -247510 -224449
24365b24449k80172k86893J84783P36Q6778l2106r2131M73155K8041R8005J69167
$$ -224449 -504621 -791514 -606731 -605995 -519217 -551323 -643454 -170299 -142258 -44253 124914
24354A24914k09105k96414M9298m71M57273L13927k73826k9100m0790m56934J81549
$$ 124914 -84191 -380605 -331307 -331778 125495 439422 165596 136496 95706 -361228 -179679
24343a79679K27333l94039l11588J53527q6611j98842k69677L50243K13104L56888
$$ -179679 47654 -346385 -657973 -504446 -591057 -789899 -1059576 -709333 -496229 -139341
24333a39341j34473m29288r0341j00582M0035K62504N09989J60908K01917o062
$$ -139341 -273814 -703102 -793443 -894025 -853990 -591486 -81497 79411 281328 275266
24323B75266j74149l37784M725L3562l72483J79050m0821j47532o18J68873J36215
$$ 275266 101117 -236667 -231942 -198380 -570863 -391813 -432634 -580166 -580784 -411911 -275696
24312b75696J05083J38941k55378K17850l44153k5761M90453M51579m74532R6280
$$ -275696 -170613 -31672 -287050 -69200 -413353 -439114 51339 502918 28386 124666
24302A24666K79940K8273j83050n04646j04123J18645M844l1705M90968j4672
$$ 124666 404606 432879 249829 -254817 -358940 -240295 -235451 -267156 223812 209140
24292B09140l91656m4331J08956m97454j03484k21108m2077J24439O185J50630
$$ 209140 -182516 -226847 -117891 -615345 -718829 -939937 -982014 -857575 -851390 -700760
24282g00760J70644n9210J53117J70904J69774j28894j24510K24612j43746j54281
$$ -700760 -530116 -589326 -436209 -265305 -95531 -224425 -348935 -124323 -268069 -422350
24272d22350k24656l0349N67848L93173k02089l80187j71951K39851K506o5571
$$ -422350 -647006 -677355 -109507 283666 81577 -298610 -470561 -230710 -228204 -293775
24262b93775l44527k89304m796K34485N16916J48932J34079O9808L55684l57948
$$ -293775 -638302 -927606 -932402 -697917 -181001 -32069 102010 171818 527502 169554
24252A69554q2729j09759n49701n21023l08894L13362j25967M27005K99248k76192
$$ 169554 86825 -22934 -572635 -1093658 -1402552 -1089190 -1215157 -788152 -488904 -765096
24242g65096j48941l037J55878M29416n8743J8834M14333K39021j74471k88678
$$ -765096 -914037 -917074 -761196 -331780 -390523 -371689 42644 281665 107194 -181484
24232a81484j21305M8611j98429q3018N33670l8903j96831l7003K3132l8045J47151
$$ -181484 -302789 -254178 -452607 -535625 -1955 -40858 -237689 -274692 -251560 -289605 -142454
24221a42454J56512J27712M9914P4962j16852k8373j10762J49425K45835m39643
$$ -142454 14058 141770 191684 266646 149794 121421 10659 160084 405919 -33724
24211c3724k38957j14627q3450j44569l19591l6001R0725k08738K39225N83790
$$ -33724 -272681 -387308 -470758 -615327 -934918 -970919 -880194 -1088932 -849707 -265917
24201b65917j26610l51431J13390M9237J16661j59362l31690r7559J89451L31590
$$ -265917 -392527 -743958 -630568 -581331 -464670 -624032 -955722 -1053281 -863830 -532240
24191e32240O42424J55548K71187l46858M4558N21844j3564p86194l37393l62105
$$ -532240 110184 265732 536919 190061 234619 756463 742899 -43295 -380688 -742793
24181g42793p7554M59836k52060k63541j1875j41959j44369L31491J22831l8071
$$ -742793 -820347 -360511 -612571 -876112 -887987 -1029946 -1174315 -842824 -719993 -758064
24171g58064M100m217k71070P00675O40461k36189o47520J76593K09115j06191
$$ -758064 -753964 -758181 -1029251 -328576 311885 75696 -571824 -395231 -186116 -292307
24161b92307k95653m1155m9914L2090j476K79767R0073J35264N3329j47346n00406
$$ -292307 -587960 -629115 -679029 -646939 -648415 -368648 -278575 -143311 -89982 -237328 -737734
24150g37734R1013M29474M40678l9670j27079n8432k40306p1333k17559J6441
$$ -737734 -646721 -217247 223431 183761 56682 -1750 -242056 -313389 -530948 -514507
24140e14507r4923j83489n8608K97828N55225L72835O1359k34152l79340J38442
$$ -514507 -609430 -792919 -851527 -553699 1526 374361 435720 201568 -177772 -39330
24130c9330n2089o45137J99964M05659k19871o47378j41228J67774M75855K69836
$$ -39330 -91419 -736556 -536592 -130933 -350804 -998182 -1139410 -971636 -495781 -225945
24120b25945M45649r9255l36518j79651j73863M0220L17906J64362l72053j70137
$$ -225945 219704 120449 -216069 -395720 -569583 -529363 -211457 -47095 -419148 -589285
24110e89285J89699J93524K08262k36879l79620P4887J12672n6112j14717N21737
$$ -589285 -399586 -206062 2200 -234679 -614299 -539412 -426740 -482852 -597569 -75832
24100g5832K54195L2078L691k89051l5024Q4616m2126K3669k1529J3542k1340
$$ -75832 178363 210441 214132 -74919 -109943 -25327 -67453 -43784 -65313 -51771 -73111
24089g3111k36773j00498Q6825j3534j9138r4467K87332J92645l0729j65853k89484
$$ -73111 -309884 -410382 -323557 -337091 -356229 -450696 -163364 29281 -1448 -167301 -456785
24078d56785k04670K86361L28878k28185j4500l17462K78519K62721K07744L89594
$$ -456785 -661455 -375094 -46216 -274401 -288901 -606363 -327844 -65123 142621 532215
24068E32215j8276J69517M2100m10367j64803j85144l51912j0800j5646J35249
$$ 532215 513939 683456 725556 315189 150386 -34758 -386670 -397470 -413116 -277867
24058b77867j05152l37643K74837M24621k29095l18103J5433j09768J47424M160
$$ -277867 -383019 -720662 -445825 -21204 -250299 -568402 -552969 -662737 -515313 -511153
24048e11153Q0888p328k19241j41312j46850m6221L25449q9981j49409l49951
$$ -511153 -430265 -437593 -656834 -798146 -944996 -991217 -665768 -755749 -905158 -1255109
24038a255109m779K06816M17467j6445k91654M17875J05319k71715r957L42888
$$ -1255109 -1259888 -1053072 -635605 -652050 -943704 -525829 -420510 -692225 -702182 -359294
24028c59294N5970l47569m15120o2893L03846k51474m81841O20895J73532J46704
$$ -359294 -303324 -650893 -1066013 -1128906 -825060 -1076534 -1558375 -937480 -763948 -617244
24018f17244j1774l64831l1958J62722M78230j5054K78110J21929Q098j55250
$$ -617244 -629018 -993849 -1025807 -863085 -384855 -399909 -121799 130 8228 -147022
24008a47022L56330N05459o15127k98438j86961l912k89257k78634J46769j72932
$$ -147022 209308 714767 99640 -198798 -385759 -389671 -678928 -957562 -810793 -983725
23998i83725l99559R8269N55783N19501K78022N3320o69850m69598j8854k17016
$$ -983725 -1383284 -1285015 -729232 -209731 68291 121611 -548239 -1017837 -1036691 -1253707
23988a253707J74054P8059K78276K40808K54948M48977k39811j61820j89607J19288
$$ -1253707 -1079653 -1001594 -723318 -482510 -227562 221415 -18396 -180216 -369823 -250535
23978b50535K3331j69753K34586Q9267j77408j35672k34933k55820k86248L61927
$$ -250535 -227204 -396957 -162371 -73104 -250512 -386184 -621117 -876937 -1163185 -801258
23968h01258L96929l62039q5278J19897j4652l6859J00909L05172k71266K44985
$$ -801258 -404329 -766368 -851646 -731749 -746401 -783260 -682351 -377179 -648445 -403460
23958d03460l80326k79510O77277J35980j98064K76091J04291k99330J7446k17011
$$ -403460 -783786 -1063296 -386019 -250039 -448103 -172012 -67721 -367051 -349605 -566616
23948e66616J31641J05321j50383p653K88206l96269n44083J42984K56119K02517
$$ -566616 -434975 -329654 -480037 -487690 -199484 -595753 -1139836 -996852 -740733 -538216
23938e38216O53234q8039K4204J62701l9812n33719l35998R441M3279j54989Q3958
$$ -538216 115018 26979 51183 213884 174072 -359647 -695645 -686204 -642925 -797914 -713956
23927g13956L69570L41772J29602K0905M3141m49705j43798n83130r6359J69608
$$ -713956 -344386 -2614 126988 147893 191034 -258671 -402469 -985599 -1081958 -912350
23917i12350M9623J44827k00043R3208k00433K23384J48478K46700k64317m9354
$$ -912350 -862727 -717900 -917943 -824735 -1025168 -801784 -653306 -406606 -670923 -720277
23907g20277J02253L52931L48187J69574p5605j60957j69885j18271k66511j50255
$$ -720277 -618024 -265093 83094 252668 177063 16106 -153779 -272050 -538561 -688816
23897f88816j41677K69990J08493L89975m2291j97930J75244l12293k16520L30452
$$ -688816 -830493 -560503 -452010 -62035 -104326 -302256 -127012 -439305 -655825 -325373
23887c25373J63319k50131l3370O3920m4000J28720O8057K03132l01647L95990
$$ -325373 -162054 -412185 -445555 -381635 -425635 -296915 -228858 -25726 -327373 68617
23877F8617J45115q1469n23154K64705K71806j885j39435J14806j69040m52753
$$ 68617 213732 132263 -390891 -126186 145620 143735 4300 119106 -49934 -502687
23867e02687l51887M42199L60770j14412m70273k02550k11132J85796L23958L01185
$$ -502687 -854574 -412375 -51605 -166017 -636290 -838840 -1049972 -864176 -540218 -239033
23857b39033J41695l6732K73031L03095J26133j53771k64421j61598j39140k73322
$$ -239033 -97338 -134070 138961 442056 568189 414418 149997 -11601 -150741 -424063
23847d24063K26080J82872J74075k30479N9940j86078M7980K40962o8043m49327
$$ -424063 -197983 -15111 158964 -71515 -11575 -197653 -149673 91289 23246 -426081
23837d26081j14097L09213L35656J11829l14053L1733l4370j90587k13148L10836
$$ -426081 -540178 -230965 104691 216520 -97533 -65800 -100170 -290757 -503905 -193069
23827a93069k45041j8472O125j10119L5310l1938K27649J66534k15524l07091
$$ -193069 -438110 -456582 -450457 -560576 -525266 -557204 -329555 -163021 -378545 -685636
23817f85636j4795M79973J58802j29862m12349k63095k61123K57238M18310J69371
$$ -685636 -700431 -220458 -61656 -191518 -603867 -866962 -1128085 -870847 -452537 -283166
23807b83166m9685m87772j47471k5778p4396K22522K22299q1266k53883L2353
$$ -283166 -332851 -820623 -968094 -993872 -1068268 -845746 -623447 -704713 -958596 -926243
23797i26243L00267Q8431j48391J99354J02833r0085N2594J30541K54949k23737
$$ -926243 -625976 -537545 -685936 -486582 -383749 -473834 -421240 -290699 -35750 -259487
23787b59487L21725j56774p04605K73814P45524K45112m59314L44655j7006m21574
$$ -259487 62238 -94536 -799141 -525327 220197 465309 5995 350650 333644 -87930
23777h7930j5401p6201n94311l71579L09360j53979J66814K79056j61260L21346
$$ -87930 -103331 -179532 -773843 -1145422 -836062 -990041 -823227 -544171 -705431 -384085
23767c84085K18402j75336n02147Q4872J52955O0071Q278K79997K38804K4236
$$ -384085 -165683 -341019 -843166 -758294 -605339 -545268 -536990 -256993 -18189 6047
23757F047j4254k21165o22494M6651k00896L57264L73396K40276R8355j89002
$$ 6047 -8207 -229372 -851866 -805215 -1006111 -648847 -275451 -35175 63180 -125822
23747a25822r1621o1338k3846M49414R8297R4667k78915l36292L8214M22606J52487
$$ -125822 -217443 -278781 -302627 146787 245084 339751 60836 -275456 -237242 185364 337851
23736C37851k94657r6212M51466J54536O7617m77409n02138L15220L30160J41766
$$ 337851 43194 -53018 398448 552984 620601 143192 -358946 -43726 286434 428200
23726D28200j44760k44008j24210J79601j33028l32358M01103J65521m86823J49661
$$ 428200 283440 39432 -84778 94823 -38205 -370563 30540 196061 -290762 -141101
23716a41101J57441p8101P2603K24593l97835o25286k56155K00156M2902N3916
$$ -141101 16340 -61761 10842 235435 -162400 -787686 -1043841 -843685 -800783 -746867
23706g46867k73480M75017k5887l30192j4070M47574k31000J32164P25680q3211
$$ -746867 -1020347 -545330 -571217 -901409 -915479 -467905 -698905 -566741 158939 75728
23696G5728l54954k84073L39752M95867l07758J05888J48628J00463n24564k13008
$$ 75728 -279226 -563299 -223547 272320 -35438 70450 219078 319541 -205023 -418031
23686d18031K64739m00813q3822M39765J6421j33235K03193J12954k20809J85059
$$ -418031 -153292 -554105 -637927 -198162 -181741 -314976 -111783 1171 -219638 -34579
23676c4579J4400P6229j45124k55337j56491k4902k409m30285Q9446K46724r1784
$$ -34579 -20179 56050 -89074 -344411 -500902 -525804 -528213 -958498 -869052 -622328 -714112
23665g14112K06322K76390o475L89825M35462j32071j70290l53598q4296m98593
$$ -714112 -507790 -231400 -237875 151950 587412 455341 285051 -68547 -152843 -651436
23655f51436k01922o8486L11431j22440K30829J5252l12649J49956L10090K432
$$ -651436 -853358 -921844 -610413 -732853 -502024 -486772 -799421 -649465 -339375 -336943
23645c36943j06038J55677J32411J41899j6928j36528k45433L03913M75753o2739
$$ -336943 -442981 -287304 -154893 -12994 -29922 -166450 -411883 -107970 367783 305044
23635C05044l05864l88735q6884N44420M90381k1117j51063k72522l93575p2503
$$ 305044 -820 -389555 -476439 67981 558362 537245 386182 113660 -279915 -352418
23625c52418j51248k96543J35569M78727L92884r8376k69834l34420Q9094N09560
$$ -352418 -503666 -800209 -664640 -185913 206971 108595 -161239 -495659 -406565 102995
23615A02995K36705q7393j50915l43230j39250K74608J52326m88134j52315M69604
$$ 102995 339700 252307 101392 -241838 -381088 -106480 45846 -442288 -594603 -124999
23605a24999K96404J9433m78476k73707K05557J40827k07024j98792j70307j28556
$$ -124999 171405 190838 -287638 -561345 -355788 -214961 -421985 -620777 -791084 -919640
23595i19640K70903R8850K56792N52661j58467l08818o15303J95401k28346m8945
$$ -919640 -648737 -549887 -293095 259566 101099 -207719 -823022 -627621 -855967 -904912
23585i04912L40659M82102o2177k85951M8471o668P3513J92973R3087j15789r0414
$$ -904912 -564253 -82151 -144328 -430279 -381808 -388476 -314963 -121990 -28903 -144692 -235106
23574b35106k5075J04316q7606j11690L33737K69071M13978l1211j10293k80306
$$ -235106 -260181 -155865 -243471 -355161 -21424 247647 661625 630414 520121 239815
23564B39815l38423k20807q6086K6075M58341K03169j94686m73300n976K04793
$$ 239815 -98608 -319415 -405501 -379426 78915 282084 87398 -385902 -391878 -187085
23554a87085J51344K0076j11201J48455J0394k83665j45638L4914R6258K55192
$$ -187085 -35741 -15665 -126866 21589 31983 -251682 -397320 -362406 -266148 -10956
23544a0956K01230j39799k94882o8779o3973K01781l0360k29181J58250K34548
$$ -10956 190274 50475 -244407 -313186 -377159 -175378 -205738 -434919 -276669 -42121
23534d2121K9110j44189q5892m69437k8054j4345l23457J15950J05076K17545
$$ -42121 -13011 -157200 -243092 -712529 -740583 -754928 -1078385 -962435 -857359 -639814
23524f39814K5936N8694j44649L57305K12969k71919l09620j41047L06337K89898
$$ -639814 -613878 -555184 -699833 -342528 -129559 -401478 -711098 -852145 -545808 -255910
23514b55910r8414M6378L72528K333l67356j91896N70500M38140n15442l56144
$$ -255910 -354324 -307946 64582 66915 -300441 -492337 78163 516303 861 -355283
23504c55283k3868j95839n6034R2401n3852J69326j80164l15306j33097L5269
$$ -355283 -379151 -574990 -631024 -538623 -592475 -423149 -603313 -918619 -1051716 -1016447
23494a016447l28876J6238J09497M11068O13647K68239J51510l02875m56688J84
$$ -1016447 -1345323 -1329085 -1219588 -808520 -194873 73366 224876 -77999 -534687 -534503
23484e34503k50736p8217N8825N04237R8604J17623j45450k53170L46272J75128
$$ -534503 -785239 -863456 -804631 -300394 -201790 -84167 -229617 -482787 -136515 38613
23474C8613n9258k36258K86940o5676l29071l38645k05439K42999M31066J50881
$$ 38613 -20645 -256903 30037 -35639 -364710 -703355 -908794 -665795 -234729 -83848
23464h3848k7989O23180M2741l6961Q6474k53624n61697M138M16854l98976k73182
$$ -83848 -111837 511343 554084 517123 603597 349973 -211724 -207586 209268 -189708 -462890
23453d62890M04326M52423n2727m18810j49337j03576P3045j47097M7344M69661
$$ -462890 -58564 393859 341132 -77678 -227015 -330591 -257546 -404643 -357299 112362
23443A12362K21801m83072j20778k22748o37995L70926Q22479K84753n2097j69359
$$ 112362 334163 -148909 -269687 -492435 -1130430 -759504 62975 347728 295631 126272
23433A26272m12647K48196K03652l87984J11970K0920j96868j48317k17432l7449
$$ 126272 -286375 -38179 165473 -222511 -110541 -89621 -286489 -434806 -652238 -689687
23423f89687Q805o3458j89165L05369N78906l43132o6791K07091m17150k44027
$$ -689687 -680882 -744340 -933505 -628136 -49230 -392362 -459153 -252062 -669212 -913239
23413i13239N04190Q0282j43069p0062J52093l99564k92387M79904K05323J72990
$$ -913239 -409049 -328767 -471836 -541898 -389805 -789369 -1081756 -601852 -396529 -223539
23403b23539k26762j9841K77913K62121J4677m31101J5986J71297J23982J79352
$$ -223539 -450301 -470142 -192229 69892 84569 -346532 -330546 -159249 -35267 144085
23393A44085J14351K32132J9988n00258j38182k3497Q9604J58764m21220J28098
$$ 144085 258436 490568 510556 10298 -127884 -151381 -61777 96987 -324233 -196135
23383a96135J98379m20806m38646K36685J78299o2048J59717J56347k91669R7811
$$ -196135 2244 -418562 -857208 -620523 -442224 -504272 -344555 -188208 -479877 -382066
23373c82066K83152r9229j6277J8716J70156m4607q2646J20796L19304J22128
$$ -382066 -98914 -198143 -214420 -195704 -25548 -70155 -152801 -32005 287299 409427
23363D09427m0411n6853j08803l15776k27234J29095Q5793R9208O3897K08719
$$ 409427 369016 312163 203360 -112416 -339650 -210555 -124762 -25554 38343 247062
23353B47062k43973R8048j96384j03251p4002n06010k42259K0675K65503N86821
$$ 247062 3089 101137 -95247 -198498 -272500 -778510 -1020769 -1000094 -734591 -147770
23343a47770L18520L0256n15644P9955J52880p5755k75229J80206N38602O262
$$ -147770 170750 201006 -314638 -234683 -81803 -157558 -432787 -252581 286021 292283
23333B92283N6100J37965j36178j2979n6267O8943q3020J1934j06197l86534l38125
$$ 292283 348383 486348 350170 337191 280924 349867 266847 278781 172584 -213950 -552075
23322e52075j07844J13503O1605L587L5581J32906J04511n6109K13264k5088n6604
$$ -552075 -659919 -546416 -484811 -481224 -445643 -312737 -208226 -264335 -51071 -76159 -132763
23311a32763L6056J77168J65372m5856k72728l03952L83245J15948k39103M252
$$ -132763 -96707 80461 245833 199977 -72751 -376703 6542 122490 -116613 -112361
23301a12361J54221O4817m8696L07670L8798l69671j48915k26733L0900J79425
$$ -112361 41860 106677 57981 365651 404449 34778 -114137 -340870 -309970 -130545
23291a30545p4688K99032M1336L41166J28672m81822o1687J35911K18963k30995
$$ -130545 -205233 93799 135135 476301 604973 123151 61464 197375 416338 185343
23281A85343m67498p763N7330J18079J5151J06517k92803N8389K70551o2603J52040
$$ 185343 -282155 -289918 -232588 -114509 -99358 7159 -285644 -227255 43296 -19307 132733
23270A32733k15020q8534R6101M08254m7680k31970j12025j62557q0065K51589
$$ 132733 -82287 -170821 -74720 333534 285854 53884 -58141 -220698 -300763 -49174
23260d9174L2726j05548j04670N76443p8794k85994j24389N1063J1801L56292
$$ -49174 -16448 -121996 -226666 349777 270983 -15011 -139400 -88337 -76536 279756
23250B79756J05659j95972R4723k50513J36856k06172J72439j55731m39437l58875
$$ 279756 385415 189443 284166 33653 170509 -35663 136776 -18955 -458392 -817267
23240h17267n251J21836k62892J86323j16542q0621k7358J27279M64944N36304
$$ -817267 -822518 -700682 -963574 -777251 -893793 -974414 -1001772 -874493 -409549 126755
23230A26755M31046j65368p24681m37577j29732k84073J73911K05132L10766J2198
$$ 126755 557801 392433 -332248 -769825 -899557 -1183630 -1009719 -804587 -493821 -481623
23220d81623l8207J94680J74207Q4092J16998J58797J79697J92806o5629l5819
$$ -481623 -519830 -325150 -150943 -66851 50147 208944 388641 581447 515818 479999
23210D79999K17676l73411Q9527J9164k78331m6503j1883o5633K8878j38991L8225
$$ 479999 697675 324264 413791 432955 154624 108121 96238 30605 59483 -79508 -41283
23199d1283J74103J36822k55806l30833l05474j3117L09902J22452k52969k20401
$$ -41283 132820 269642 13836 -316997 -622471 -635588 -325686 -203234 -456203 -676604
23189f76604R6969K30835j07966l93090K79951J7603J54818J12061K2135k49583
$$ -676604 -579635 -348800 -456766 -849856 -569905 -552302 -397484 -285423 -263288 -512871
23179e12871J13881K14969J29166Q8493M45670q3483n66494j69346J44464j50165
$$ -512871 -398990 -184021 -54855 33638 479308 395825 -170669 -340015 -195551 -345716
23169c45716r9008j823K722L67316L59986j83840j08906J3825k2576k89246P2844
$$ -345716 -444724 -446547 -443825 -76509 283477 99637 -9269 4556 -18020 -307266 -234422
23158b34422O01594L57027J06602m46455l27336j49367m2603M84989P926j11816
$$ -234422 367172 724199 830801 384346 57010 -92357 -134960 350029 357955 246139
23148B46139k47345n8711k36063J87502M81239N51730j56744p09043l2656n4320
$$ 246139 -1206 -59917 -295980 -108478 372761 924491 767747 58704 26048 -28272
23138b8272l48733p79983J06410M62202M88619N80985o08803o12633M95912L02470
$$ -28272 -377005 -1156988 -1050578 -588376 -99757 481228 -127575 -740208 -244296 58174
23128E8174j28763L10240j92782o47910k77470n7177N22716N20557n4166j4405
$$ 58174 -70589 239651 46869 -601041 -878511 -935688 -412972 107585 53419 39014
23118C9014J61504J69533m00272r8262O56M1318K42489L29598J11175l36373l77712
$$ 39014 200518 370051 -30221 -128483 -127827 -86509 155980 485578 596753 260380 -117332
23107a17332j69356R1285M55334j546j67458l85129K83257J61837J16231K67749
$$ -117332 -286688 -195403 259931 258385 90927 -294202 -10945 150892 267123 534872
23097E34872k30352m58478k10822K75838N8298L17664M45597j96850l52965j87118
$$ 534872 304520 -153958 -364780 -88942 -30644 287020 732617 535767 182802 -4316
23087d316N0596O902L38963M3603J9043P6448J30338k30100n22077J16430M51658
$$ -4316 46280 53182 392145 435748 454791 531239 661577 431477 -90600 25830 477488
23076D77488J28386m22125m44368l16514k25298L14991j6229j32595j80708k18412
$$ 477488 605874 183749 -260619 -577133 -802431 -487440 -503669 -636264 -816972 -1035384
23066a035384K04795O98553K91184J38168L20400k29065l97665L3003K69332J90254
$$ -1035384 -830589 -132036 159148 297316 617716 388651 -9014 23989 293321 483575
23056D83575R713n42297J12211M36646J1519L71499j30518j87494l10121o2013
$$ 483575 493288 -49009 63202 499848 511367 882866 752348 564854 254733 192720
23046A92720l10188N1483L03021j84588j43940K74461J70520m10126j45832J68880
$$ 192720 -117468 -65985 237036 52448 -91492 182969 353489 -56637 -202469 -33589
23036c3589J44625o8741j70654r2852L2618L48500J13184Q8093J03l27969j76694
$$ -33589 111036 42295 -128359 -221211 -188593 159907 273091 361184 361287 33318 -143376
23025a43376j29296K10535j52647P723K86070j98338k93045k093L96082m3416
$$ -143376 -272672 -62137 -214784 -207061 79009 -119329 -412374 -414467 -18385 -61801
23015f1801L23203o7362j08547l04976J6688L2248L51477m144j94003k77911M4902
$$ -61801 261402 194040 85493 -219483 -202795 -170547 180930 176786 -17217 -295128 -250226
23004b50226K25913P833q8877K27469K616j92561K2570j69119r8422k21752J39667
$$ -250226 -24313 -16480 -105357 122112 124728 -67833 -45263 -214382 -312804 -534556 -394889
22993c94889Q1039M28905n16161M98260N32544L922l54493o2134j22317k56984
$$ -394889 -313850 115055 -401106 97154 629698 633620 279127 216993 94676 -162308
22983a62308j80590M7305K62611M37580K0852l22291R2869Q3056K84132n57956
$$ -162308 -342898 -295593 -32982 404598 425450 103159 196028 279084 563216 5260
22973E260n83302L60364M85890K41866j37327L29164j79054l51809K26572j4719
$$ 5260 -578042 -217678 268212 510078 372751 701915 522861 171052 397624 382905
22963C82905k16814j04282K08410q6109K29968L01733J00383k14556l2979N8875
$$ 382905 166091 61809 270219 184110 414078 715811 816194 601638 568659 627534
22953F27534k84192L335j0021l92932k54615J3138n2823L71433L91810N5142j49210
$$ 627534 343342 346677 336656 -56276 -310891 -297753 -350576 20857 412667 467809 318599
22942C18599R3540k37430J7517l00752l75739M72725K55246r5977l55412K5036
$$ 318599 412139 174709 192226 -108526 -484265 -11540 243706 147729 -207683 -182647
22932a82647L83705K28647m70330m37820L85527K55463R7821J12180K61863M2190
$$ -182647 201058 429705 -40625 -478445 -92918 162545 260366 372546 634409 676599
22922F76599j21427M7537K27669O0703m4027O4902M7513o38663p2995L65220J7862
$$ 676599 555172 602709 830378 891081 847054 911956 959469 320806 247811 613031 630893
22911F30893j90971p9637R0732J83090K0131l67866j47172k54565K04578L47950
$$ 630893 439922 360285 451017 634107 654238 286372 139200 -115365 89213 437163
22901D37163m66011l35631R1788J09948L16527J96649l47078j85413K18960M84431
$$ 437163 -28848 -364479 -272691 -162743 153784 350433 3355 -182058 36902 521333
22891E21333k55755j22722J26049J60445l07733j06790K08982L75000n26042k94043
$$ 521333 265578 142856 268905 429350 121617 14827 223809 598809 72767 -221276
22881b21276R8486L71643K5601L26504K05761m75763o3192j35853j2221k04321
$$ -221276 -122790 248853 274454 600958 806719 330956 267764 131911 119690 -84631
22871h4631k9352K27068K30258L78921q8147m18184j56151K31891J82819L14175
$$ -84631 -113983 113085 343343 722264 634117 215933 59782 291673 474492 788667
22861G88667J58621r0857J33847J33235K09420l43296o04869n70887K09446J81854
$$ 788667 947288 856431 990278 1123513 1332933 989637 384768 -186119 23327 205181
22851B05181k94604o6606M0202L30558k06630j46431l02958L88146M66432M31031
$$ 205181 -89423 -156029 -115827 214731 8101 -138330 -441288 -53142 413290 844321
22841H44321l7340r4459o3665j32296Q5277P2042P8515m11710J70930l09785k79791
$$ 844321 806981 712522 648857 516561 601838 673880 752395 340685 511615 201830 -77961
22830g7961R4452J87869j01966j26587k32655O1692K27192L68804P18378q7311
$$ -77961 16491 204360 102394 -24193 -256848 -195156 32036 400840 1119218 1031907
22820A031907p05539n21216N19845J56203K32877J38942j51315K39284O2367m36955
$$ 1031907 326368 -194848 324997 481200 714077 853019 701704 940988 1003355 566400
22810E66400o6338Q8552j92135L16498j36749n044q5662J425j5824n04457l89480
$$ 566400 500062 588614 396479 712977 576228 571184 485522 486947 471123 -33334 -422814
22799d22814Q9479K44227J64092M04675k59294J4391J77582K91727K4239m52236
$$ -422814 -333335 -89108 74984 479659 220365 234756 412338 704065 728304 276068
22789B76068j81632L83982O92080J74821l71541n28723p4192L79102M15704l58659
$$ 276068 94436 478418 1170498 1345319 973778 445055 370863 749965 1165669 807010
22779H07010n80566j12521K12803L22915m5766N8689p5569L3427J21047k44348
$$ 807010 226444 113923 326726 649641 603875 662564 586995 620422 741469 497121
22769D97121l74692M2381K27439k90721N8717j65577k48309r3248J37258m7670
$$ 497121 122429 164810 392249 101528 160245 -5332 -253641 -346889 -209631 -257301
22759b57301p9778L93612L66920k52573Q30161J64439k40958o59539j04040L15269
$$ -257301 -337079 56533 423453 170880 1001041 1165480 924522 264983 160943 476212
22749D76212o9320p3990J44600K83772p3433j24799L80209k09281n8566O8450
$$ 476212 406892 332902 477502 761274 687841 563042 943251 733970 675404 743854
22739G43854L16587r5771n15151k52079L06485k00133j47942K57613O6127k35036
$$ 743854 1060441 964670 449519 197440 503925 303792 155850 413463 479590 244554
22729B44554l26532l66642L57514M52764R6303M3054j49659m82193J5757L26868
$$ 244554 -81978 -448620 -91106 361658 457961 501015 351356 -130837 -115080 211788
22719B11788O5883k46533m77766N21428L02912K49699k10572N9055L25591k36508
$$ 211788 277671 31138 -446628 74800 377712 627411 416839 475894 801485 564977
22709E64977j54831K52693J65047l05354M18637N028m45704l44348j44375K00884
$$ 564977 410146 662839 827886 522532 941169 946197 500493 156145 11770 212654
22699B12654J75128J43936p992R7365P4611q9836L3862M26878O7090m72468k41875
$$ 212654 387782 531718 523726 621091 695702 605866 639728 1066606 1133696 661228 419353
22688D19353l07738K87514l9894J18594K45898J41111J63431k24752o5758r6157
$$ 419353 111615 399129 359235 477829 723727 864838 1028269 803517 737759 641602
22678F41602r2280l65712L32746K31629k98710o8548M42227Q224o4145j5114K4314
$$ 641602 549322 183610 516356 747985 449275 380727 822954 831178 767033 751919 776233
22667G76233k21308J29909K37524P8378j02814m32795o7240l72481r647P3378
$$ 776233 554925 684834 922358 1000736 897922 465127 397887 25406 15759 89137
22657H9137n3401P0107L4120L78905L54538j44285j70411j27686k3004J35827
$$ 89137 35736 105843 139963 518868 873406 729121 558710 431024 408020 543847
22647E43847M35911O16158k30189j32381k52712L052l44984J30163L79277K05405
$$ 543847 979758 1595916 1365727 1233346 980634 983686 638702 768865 1148142 1353547
22637A353547M00129K8934m33734K89364K44664J15013l60354o72216R6202J10054
$$ 1353547 1753676 1782610 1348876 1638240 1882904 1997917 1637563 965347 1061549 1171603
22627A171603j00586J82133n763N9647k47392k87314n54201L44368J72910N5480
$$ 1171603 1071017 1253150 1247387 1307034 1059642 772328 218127 562495 735405 790885
22617G90885M13514K02039P0570R9393J29491J1549N5549O8844k06599j67056
$$ 790885 1204399 1406438 1477008 1576401 1705892 1717441 1772990 1841834 1635235 1468179
22607A468179j66762k90891p5941L11969M3383j59771L36879m0653k07083j62996
$$ 1468179 1301417 1010526 934585 1246554 1289937 1130166 1467045 1426392 1219309 1056313
22597A056313L84113Q6305q5092o37610j59776M5661R8847Q1193m6006J42638
$$ 1056313 1440426 1526731 1441639 804029 644253 689914 788761 869954 823948 966586
22587I66586K73812q4287j33636K86596j53442K08274m5548L15729l8167n69598
$$ 966586 1240398 1156111 1022475 1309071 1155629 1363903 1318355 1634084 1595917 1026319
22577A026319q4824n5576L22915k6769r6663o9354M59149n6339K0264J34606K56319
$$ 1026319 941495 885919 1208834 1182065 1085402 1016048 1475197 1418858 1439122 1573728 1830047
22566A830047O5150M40337L8259k81095k43795j3625j99961l28024k15816k0058
$$ 1830047 1895197 2335534 2373793 2092698 1848903 1835278 1635317 1307293 1091477 1071419
22556A071419j3454J62636J45060K10847J2633J9002j13643j06036j65596K56813
$$ 1071419 1057965 1220601 1365661 1576508 1589141 1608143 1494500 1388464 1222868 1479681
22546A479681M50862L4484K97575K12068m14503K87688J14228J33286j93889j22473
$$ 1479681 1930543 1965027 2262602 2474670 2060167 2347855 2462083 2595369 2401480 2279007
22536B279007O9327L06486j00339l42583q5274J55536k39686j84271R8754R6654
$$ 2279007 2348334 2654820 2554481 2211898 2126624 2282160 2042474 1858203 1956957 2053611
22526B053611L17668m1745L26543Q3721k1462j29370J03246j13305Q9886j38060
$$ 2053611 2371279 2329534 2656077 2739798 2718336 2588966 2692212 2578907 2668793 2530733
22516B530733k61411l82398K01116K23962l1396R6609J25263k00864k38848N61901
$$ 2530733 2269322 1886924 2088040 2312002 2280606 2377215 2502478 2301614 2062766 2624667
22506B624667L79290n27566J77367J49761J9449j72584M03939L0595R7992m4545
$$ 2624667 3003957 2476391 2653758 2803519 2822968 2650384 3054323 3084918 3182910 3138365
22496C138365n2754Q170l20095k96487k88346r4732N95599N77959j48399j2943
$$ 3138365 3085611 3093781 2773686 2477199 2188853 2094121 2689720 3267679 3119280 3106337
22486C106337j31226N66910M19774k31666R2640j77088k96740J3554k80443j64927
$$ 3106337 2975111 3542021 3961795 3730129 3822769 3645681 3348941 3362495 3082052 2917125
22476B917125L6800M20449M07652l45066J7713N15029J29608N8187l8099o2710
$$ 2917125 2953925 3374374 3782026 3436960 3454673 3969702 4099310 4157497 4119398 4056688
22466D056688p9640j15688N4614R755K95467l52391k80772p1553K8728J6940k49571
$$ 4056688 3977048 3861360 3915974 3925729 4221196 3868805 3588033 3516480 3545208 3562148 3312577
22455C312577j94346K81653M28958K41218l4443q34278l10938K87992P2597K06199
$$ 3312577 3118231 3399884 3828842 4070060 4035617 3201339 2890401 3178393 3250990 3457189
22445C457189J35123n41076Q0131L20937j65250k03688m23806r2599M73204J95061
$$ 3457189 3592312 3051236 3131367 3452304 3287054 3083366 2659560 2566961 3040165 3235226
22435C235226k797L02559Q9624p58640j95894J44979L31909J82423J91014l48318
$$ 3235226 3232429 3534988 3624612 2865972 2670078 2815057 3146966 3329389 3520403 3172085
22425C172085k06858R2321K02720m8660M23860J6670l07552m84249l95238j88896
$$ 3172085 2965227 3057548 3260268 3211608 3635468 3652138 3344586 2860337 2465099 2276203
22415B276203O9698L37991l18444m0251K04157j87159n22180m03044p6353J05950
$$ 2276203 2345901 2683892 2365448 2325197 2529354 2342195 1820015 1416971 1340618 1446568
22405A446568M62780L96860j9607K46965K90988n05301Q2293N66511J89068k12780
$$ 1446568 1909348 2306208 2286601 2533566 2824554 2319253 2401546 2968057 3157125 2944345
22395B944345l42814J47975l71682j15067N9603K46078K10485R7462o60408K50139
$$ 2944345 2601531 2749506 2377824 2262757 2322360 2568438 2778923 2876385 2215977 2466116
22385B466116K91908Q6609J0081K7191O8243P6207l15261n56369R6646L12072
$$ 2466116 2758024 2844633 2854714 2881905 2950148 3026355 2711094 2154725 2251371 2563443
22375B563443K25766J0181j8110l43295j93277K05654j11203L51007L98634K233
$$ 2563443 2789209 2799390 2781280 2437985 2244708 2450362 2339159 2690166 3088800 3091033
22365C091033K249M7045k71902M2307o2042J47432N49360J74745m25206m71717
$$ 3091033 3093282 3140327 2868425 2910732 2848690 2996122 3545482 3720227 3295021 2823304
22355B823304r8781K16092L35692P9355L8667k75022k52284L60387M0092q6189
$$ 2823304 2724523 2940615 3276307 3355662 3394329 3119307 2867023 3227410 3267502 3181313
22345C181313J94158m80720k54986M94915J86520k40552j38489O1030l2299K39693
$$ 3181313 3375471 2894751 2639765 3134680 3321200 3080648 2942159 3003189 2970890 3210583
22335C210583R0255J41757L21043l76248k9570K31038J5681J79436k85366o0009
$$ 3210583 3300838 3442595 3763638 3387390 3357820 3588858 3604539 3783975 3498609 3438600
22325C438600K8491j48968n8037K76088L39118J7077l98952J01840N5377n35532
$$ 3438600 3467091 3318123 3260086 3536174 3875292 3892369 3493417 3595257 3650634 3115102
22315C115102L78007M03370k4810k20981L593L3711p4917j34192L58758m0288
$$ 3115102 3493109 3896479 3871669 3650688 3654281 3687992 3613075 3478883 3837641 3797353
22305C797353K42394r6376n37153k80836K22358K20789K34390L75292K90620K6913
$$ 3797353 4039747 3943371 3406218 3125382 3347740 3568529 3802919 4178211 4468831 4495744
22295D495744j80162l1029j7581Q9950R4897J64818n7467k21319l73529P2228
$$ 4495744 4315582 4284553 4266972 4356922 4451819 4616637 4559170 4337851 3964322 4036550
22285D036550J19174K4517k96690q5134K98912K93827q3667p4994J8618N1405
$$ 4036550 4155724 4180241 3883551 3798417 4097329 4391156 4307489 4232495 4251113 4302518
22275D302518K86667M64000o4969R8866k12750j35428N5988L2112Q5917k11750
$$ 4302518 4589185 5053185 4988216 5087082 4874332 4738904 4794892 4827004 4912921 4701171
22265D701171j08950R3572j37520j48880j33076P715J87065M84167N51574K21363
$$ 4701171 4592221 4685793 4548273 4399393 4266317 4274032 4461097 4945264 5496838 5718201
22255E718201k97083q0730k97474j73648K68489k70374L81758M25160P1151O8792
$$ 5718201 5421118 5340388 5042914 4869266 5137755 4867381 5249139 5674299 5745450 5814242
22245E814242r9496l72146L6896J98926j92056o6008Q6092J21508k58164k34614
$$ 5814242 5714746 5342600 5379496 5578422 5386366 5320358 5406450 5527958 5269794 5035180
22235E035180M29722L38338j47699j66020K23113J38256l87411q2526p9107J84431
$$ 5035180 5464902 5803240 5655541 5489521 5712634 5850890 5463479 5380953 5301846 5486277
22225E486277K87635Q7594J40328K24582P1471R7661j16712r8435j36443J13100
$$ 5486277 5773912 5861506 6001834 6226416 6297887 6395548 6278836 6180401 6043958 6157058
22215F157058L55785L21771k32180l77273L11861K74361j59481j58293O7085K94882
$$ 6157058 6512843 6834614 6602434 6225161 6537022 6811383 6651902 6493609 6560694 6855576
22205F855576L34103L72762k82876l5898o3594N6225M1900m0962O0004l57045
$$ 6855576 7189679 7562441 7279565 7243667 7180073 7236298 7278198 7237236 7297240 6940195
22195F940195j58029j60967O86615N00049j06122J70710R2918O56462P7206q91151
$$ 6940195 6782166 6621199 7307814 7807863 7701741 7872451 7965369 8621831 8699037 7807886
22185G807886K393J18643Q112j43662l4704N24595M82241m86474l18342J35551
$$ 7807886 7810279 7928922 7937034 7793372 7758668 8283263 8765504 8279030 7960688 8096239
22175H096239j54182j8482M31886L41588o305l4343J92174J72286k05146m70422
$$ 8096239 7942057 7923575 8355461 8697049 8690744 8656401 8848575 9020861 8815715 8345293
22165H345293r9976K00553J1580J19693K08889M45738L82075j1585J77310j87675
$$ 8345293 8245317 8445870 8457450 8577143 8786032 9231770 9613845 9602260 9779570 9591895
22155I591895j91957K73181L51041K15162n98939J82244N14151O19304P2226j13669
$$ 9591895 9399938 9673119 10024160 10239322 9640383 9822627 10336778 10956082 11028308 10914639
22145A0914639m30408R0423Q5255N04269M42135n9570m10754m25645K01789J75893
$$ 10914639 10484231 10574654 10659909 11164178 11606313 11546743 11135989 10710344 10912133 11088026
22135A1088026K16951Q1001j74004j20939q7703J26569J39433L26442O1054n3460
$$ 11088026 11304977 11385978 11211974 11091035 11003332 11129901 11269334 11595776 11656830 11603370
22125A1603370j08822J45346k9073l5800M38839O2483K20731K16254J11440L10271
$$ 11603370 11494548 11639894 11610821 11575021 12013860 12076343 12297074 12513328 12624768 12935039
22115A2935039N59671K79389j43674k32230Q4660J06285L22284J62963J39557
$$ 12935039 13494710 13774099 13630425 13398195 13482855 13589140 13911424 14074387 14213944
22106A4213944j64122K21746L93991M37480K23277K80381J08931j83653j32641
$$ 14213944 14049822 14271568 14665559 15103039 15326316 15606697 15715628 15531975 15399334
22097A5399334P5571J07704K70904M1289J1255J24146N41108M89829L0710K09745
$$ 15399334 15474905 15582609 15853513 15894802 15906057 16030203 16571311 17061140 17091850 17301595
22087A7301595R0665k6628J12047J83419L43854r6710j00127o9197J28709M37625
$$ 17301595 17392260 17365632 17477679 17661098 18004952 17908242 17808115 17738918 17867627 18305252
22077A8305252Q56102j5179l16482P4163N07685L29973L58992M27784j20850L10738
$$ 18305252 19161354 19146175 18829693 18903856 19411541 19741514 20100506 20528290 20407440 20718178
22067B0718178N56153K13001L31388L68704J05747K44252M71433o8258j02374
$$ 20718178 21274331 21487332 21818720 22187424 22293171 22537423 23008856 22940598 22838224
22058B2838224k91135J28387K75602N60511Q04200K11813L75767M62362J81098
$$ 22838224 22547089 22675476 22951078 23511589 24315789 24527602 24903369 25365731 25546829
22049B5546829J89153O31057M36269N85025J3968M12848Q74695J9084L52966J36536
$$ 25546829 25735982 26367039 26803308 27388333 27402301 27815149 28689844 28708928 29061894 29198430
22039B9198430j95170Q43919Q36041P35925O98259L34023N01681n7472M38273
$$ 29198430 29003260 29847179 30683220 31419145 32117404 32451427 32953108 32895636 33333909
22030C3333909P64666M05642n125M869O34991O80092P32136P69243Q35457N84533
$$ 33333909 34098575 34504217 34499092 34503961 35138952 35819044 36551180 37320423 38155880 38740413
22020C8740413N28150P11009J75073M45310O37609O62986J066429M85847N13261
$$ 38740413 39268563 39979572 40154645 40599955 41237564 41900550 42966979 43452826 43966087
22011D3966087P13226N65257Q68032R96577Q13963Q98525J032833P01034O65519
$$ 43966087 44679313 45244570 46112602 47109179 47923142 48821667 49854500 50555534 51221053
22002E1221053J028782J093593P97316J036145J157276J124287J186384Q89684
$$ 51221053 52249835 53343428 54140744 55176889 56334165 57458452 58644836 59534520
21994E9534520O14351R25480J147339J184620J469088P28498J011489J368273
$$ 59534520 60148871 61074351 62221690 63406310 64875398 65603896 66615385 67983658
21986F7983658J047465P91164J689870J343434J671226J381874J495281J465093
$$ 67983658 69031123 69822287 71512157 72855591 74526817 75908691 77403972 78869065
21978G8869065J329230J506777J559611J907321J895372J529782J525386K420747
$$ 78869065 80198295 81705072 83264683 85172004 87067376 88597158 90122544 92543291
21970I2543291K294725J847921J905408K034655J942639K293564K699151K324223
$$ 92543291 94838016 96685937 98591345 100626000 102568639 104862203 107561354 109885577
21962A09885577K471482K738898K809690K691444K774964K816651K865445L566917
$$ 109885577 112357059 115095957 117905647 120597091 123372055 126188706 129054151 132621068
21954A32621068L575528L559339L422652L359352L475531L332062L907066M054654
$$ 132621068 136196596 139755935 143178587 146537939 150013470 153345532 157252598 161307252
21946A61307252L656331M321039M636938M401239M508626M348688N128577N372411
$$ 161307252 164963583 169284622 173921560 178322799 182831425 187180113 192308690 197681101
21938A97681101M884442N256469N615238N824455O066948N795961O004947O392355
$$ 197681101 202565543 207822012 213437250 219261705 225328653 231124614 237129561 243521916
21930B43521916O341503O111630O503749O429366N881096O374355P039740P158019
$$ 243521916 249863419 255975049 262478798 268908164 274789260 281163615 288203355 295361374
21922B95361374O983624O228327O712924O744790O674339O370685O264616O493710
$$ 295361374 302344998 308573325 315286249 322031039 328705378 335076063 341340679 347834389
21914C47834389N503615N148974N062228N047492M811191M176092L656366L440110
$$ 347834389 353338004 358486978 363549206 368596698 373407889 377583981 381240347 384680457
21906C84680457L089735K296233K582922J948037P72468Q8175p661k11699j020255
$$ 384680457 387770192 390066425 392649347 394597384 395369852 395458027 395450366 395238667 394218412
21897C94218412j310256j931224k288576k649450l190170m330760m742281m196046
$$ 394218412 392908156 390976932 388688356 386038906 382848736 378517976 373775695 369579649
21889C69579649m703346m988853n652505n750176o026847o072453o025019o117012
$$ 369579649 364876303 359887450 354234945 348484769 342457922 336385469 330360450 324243438
21881C24243438o309911o664773o418305o430485o715394o701632o413692o154319
$$ 324243438 317933527 311268754 304850449 298419964 291704570 285002938 278589246 272434927
21873B72434927n787120o398868o757609o149217o275918n739968n254068n130864
$$ 272434927 266647807 260248939 253491330 247342113 241066195 235326227 230072159 224941295
21865B24941295n411426n501144n362430n256140n193647m906897n026019m706093
$$ 224941295 219529869 214028725 208666295 203410155 198216508 193309611 188283592 183577499
21857A83577499m815160m299937m221731m186937m629923l780354l390469l461933
$$ 183577499 178762339 174462402 170240671 166053734 161423811 157643457 154252988 150791055
21849A50791055l306983l743044l636803k998784k926612k772651l278209l504723
$$ 150791055 147484072 143741028 140104225 137105441 134178829 131406178 128127969 124623246
21841A24623246l150031k751425k402925k720103k243714k172326k648995k347173
$$ 124623246 121473215 118721790 116318865 113598762 111355048 109182722 106533727 104186554
21833A04186554k015928k110785k029707k003229j787932k212366k133468j609215
$$ 104186554 102170626 100059841 98030134 96026905 94238973 92026607 89893139 88283924
21825H8283924j261518k110090j998726j804124j841177j083038j495691j582294
$$ 88283924 87022406 84912316 82913590 81109466 79268289 78185251 76689560 75107266
21817G5107266j382585j235710j415225r03795r77021j168629j539686j280438
$$ 75107266 73724681 72488971 71073746 70169951 69192930 68024301 66484615 65204177
21809F5204177r30742j009769j180852j099326j035462j037003j191572j058839
$$ 65204177 64273435 63263666 62082814 60983488 59948026 58911023 57719451 56660612
21801E6660612p39860o20297j082091p41779q85263j031182l82817j049738j054924
$$ 56660612 55920752 55300455 54218364 53476585 52591322 51560140 51177323 50127585 49072661
21792D9072661q68318j132632j123791n30527j17938p90580p97507l68503p64818
$$ 49072661 48204343 47071711 45947920 45417393 45299455 44508875 43711368 43342865 42578047
21783D2578047p43571q65754q16093m77923n78837n76854k22771k43667m47477
$$ 42578047 41834476 40968722 40152629 39674706 39095869 38519015 38296244 38052577 37605100
21774C7605100r39973j044600n04098n81640m43774k42166l84421j74058n00933
$$ 37605100 36665127 35620527 35116429 34534789 34091015 33848849 33464428 33290370 32789437
21765C2789437m41320p79273n20549j51750m84776o88794l83215N0610k88900
$$ 32789437 32348117 31568844 31048295 30896545 30411769 29722975 29339760 29390370 29101470
21756B9101470r0735k51340n93707l61972n57555l90720n93637k71312l13671
$$ 29101470 29010735 28759395 28165688 27803716 27246161 26855441 26261804 25990492 25676821
21747B5676821p66364k10086j8678j53022k88546m5335k0699m04419m27107k42828
$$ 25676821 24910457 24700371 24681693 24528671 24240125 24194790 24174091 23769672 23342565 23099737
21737B3099737j5872k46033o07936n48138m34537o68641l81012J90168M27620
$$ 23099737 23083865 22837832 22229896 21681758 21247221 20578580 20197568 20387736 20815356
21728B0815356L36124r83228q82212p707L73293r7537o74347o5941j4706J23123
$$ 20815356 21151480 20168252 19286040 19278333 19651626 19554089 18879742 18813801 18799095 18922218
21718A8922218j76979l72455J30990l1806j55323k79570l83839n24092m89257
$$ 18922218 18745239 18372784 18503774 18471968 18316645 18037075 17653236 17129144 16639887
21709A6639887l96280K73904N8820k73674p50514o01287k18669M9570L4104k52162
$$ 16639887 16243607 16517511 16576331 16302657 15552143 14950856 14732187 14781757 14815861 14563699
21699A4563699l11475J69652M28625N9433r7131m44179n67580p100J98914K12723
$$ 14563699 14252224 14421876 14850501 14909934 14812803 14368624 13801044 13793944 13992858 14205581
21689A4205581j48294J54537N0547J47120k94264q20646o18243m54455p2326J84507
$$ 14205581 14057287 14211824 14262371 14409491 14115227 13294581 12676338 12221883 12149557 12334064
21679A2334064o9905q3061K86756M31241M5770k68634m00018P1678L7677k85016
$$ 12334064 12264159 12181098 12467854 12899095 12944865 12676231 12276213 12347891 12385568 12100552
21669A2100552n25156k56788L0198K9006j28249k08395M922J16963k3815Q4179
$$ 12100552 11575396 11318608 11348806 11377812 11249563 11041168 11046090 11163053 11139238 11223417
21659A1223417j45879O7802K71029n4876m07284l54799m05312m41531L59366n47201
$$ 11223417 11077538 11145340 11416369 11361493 10954209 10599410 10194098 9752567 10111933 9564732
21649I564732l84929L27829K95728R7808l63588q9963l36868j28214K65849j02080
$$ 9564732 9179803 9507632 9803360 9901168 9537580 9447617 9110749 8982535 9248384 9146304
21639I146304k75671L6929m54855K77313L12375k77999j87939j78157j05890j82707
$$ 9146304 8870633 8907562 8452707 8730020 9042395 8764396 8576457 8398300 8292410 8109703
21629H109703k2828L4260k12960k68807j79571l33635J72480M41218J05433K395
$$ 8109703 8086875 8121135 7908175 7639368 7459797 7126162 7298642 7739860 7845293 7847688
21619G847688n216J29688m9639j39487k90504R389K2605L38986K29195k87804
$$ 7847688 7842472 7972160 7922521 7783034 7492530 7501919 7524524 7863510 8092705 7804901
21609G804901l5233j12866K0846p87710m29710j11505O86787k26205k09010l67310
$$ 7804901 7769668 7656802 7677648 6889938 6460228 6348723 7035510 6809305 6600295 6232985
21599F232985k43958N22542J34887N2776l07689o0753N7736l78558n95911K105
$$ 6232985 5989027 6511569 6646456 6699232 6391543 6330790 6388526 6009968 5414057 5416162
21589E416162K48982J92229k79373O163K93521k73787k22849J5389L91544j40368
$$ 5416162 5665144 5857373 5578000 5584163 5877684 5603897 5381048 5396437 5787981 5647613
21579E647613K23070M0421j77722k69443K67129J33857o80k48963K78586l82345
$$ 5647613 5870683 5911104 5733382 5463939 5731068 5864925 5864245 5615282 5893868 5511523
21569E511523k72810K60906J29217k69257n08308K69419J24558k96368M54517
$$ 5511523 5238713 5499619 5628836 5359579 4851271 5120690 5245248 4948880 5403397
21560E403397L41548j74704p6991M25418n6763l28379j52009m7555k49764j74970
$$ 5403397 5744945 5570241 5493250 5918668 5861905 5533526 5381517 5333962 5084198 4909228
21550D909228j09409J26009m56925j35355r760J26336R157r8177k91743L9482
$$ 4909228 4799819 4925828 4468903 4333548 4323788 4450124 4459281 4361104 4069361 4108843
21540D108843K98414O42640M284j92831j00773l54177L27432M405m52507k37156
$$ 4108843 4407257 5049897 5054181 4861350 4760577 4406400 4733832 4738237 4285730 4048574
21530D048574J3975J36907J87030M31540j86690Q8473J9322k49488k63822K13579
$$ 4048574 4062549 4199456 4386486 4818026 4631336 4719809 4739131 4489643 4225821 4439400
21520D439400m277J86795l48656k59674J09684j12713k87780m31991m9554N53
$$ 4439400 4435123 4621918 4273262 4013588 4123272 4010559 3722779 3290788 3241234 3241787
21510C241787L02961L04835L5949j4965j90925O4692J39914n46387j63680K119
$$ 3241787 3544748 3849583 3885532 3870567 3679642 3744334 3884248 3337861 3174181 3176300
21500C176300M67070J49552Q5558J87739m11192l72926K45983K96056r6435K02836
$$ 3176300 3643370 3792922 3878480 4066219 3655027 3282101 3528084 3824140 3727705 3930541
21490C930541K10644N103m67179l60651J65662l19496L4621O8016l89042m9748
$$ 3930541 4141185 4146288 3679109 3318458 3484120 3164624 3199245 3267261 2878219 2828471
21480B828471j31825O5232q3042l2691p8935M99288L49220L70622j68902k03840
$$ 2828471 2696646 2761878 2678836 2646145 2567210 3066498 3415718 3786340 3617438 3413598
21470C413598m44773l92039j6725J12095J13156K17260j1699j51013k00347J02773
$$ 3413598 2968825 2576786 2560061 2672156 2785312 3002572 2990873 2839860 2639513 2742286
21460B742286l097K3242J46617J33915J40098J24337l44372m3116K01348j33155
$$ 2742286 2739189 2762431 2909048 3042963 3183061 3307398 2963026 2919910 3121258 2988103
21450B988103j52778L5426k97095K4042L53691j70916K12353K99042K27147n58684
$$ 2988103 2835325 2870751 2573656 2597698 2951389 2780473 2992826 3291868 3519015 2960331
21440B960331l26521L00063J12141K45744p4485J60728Q5033j25676j18190o7557
$$ 2960331 2633810 2933873 3046014 3291758 3217273 3378001 3463034 3337358 3219168 3151611
21430C151611l04492o38919K64196L90903l08491l067K28489j0375k91984k98476
$$ 3151611 2847119 2208200 2472396 2863299 2554808 2551741 2780230 2769855 2477871 2179395
21420B179395R7275M14382R7301k98805k44598Q2258L94595k8416r6230l6285
$$ 2179395 2276670 2691052 2788353 2489548 2244950 2327208 2721803 2693387 2597157 2560872
21410B560872R9107p7169k89460k00707J0469J20407L4353k27471k46786n7659
$$ 2560872 2659979 2582810 2293350 2092643 2103112 2223519 2257872 2030401 1783615 1725956
21400A725956k65971k73301L79297M80024L34527M23360M9277j87751m86651M82716
$$ 1725956 1459985 1186684 1565981 2046005 2380532 2803892 2853169 2665418 2178767 2661483
21390B661483O5052j70794j18104J18725l87942P3930K49811K07426o6414J11354
$$ 2661483 2726535 2555741 2437637 2556362 2168420 2242350 2492161 2699587 2633173 2744527
21380B744527K37701k11980l77273L69523N24310n2635m86041M79247K04542j77547
$$ 2744527 2982228 2770248 2392975 2762498 3286808 3234173 2748132 3227379 3431921 3254374
21370C254374m23514p4476M17290L75662J80167l67968l0651q531n6755j46297
$$ 3254374 2830860 2756384 3173674 3549336 3729503 3361535 3330884 3322353 3265598 3119301
21360C119301L50491j25444l06460J83098m238j81741l13137N33014M39895k1962
$$ 3119301 3469792 3344348 3037888 3220986 3216748 3035007 2721870 3254884 3694779 3672817
21350C672817j19889j61051k25208m09603L2978L48399J29024J07057O3589k7175
$$ 3672817 3552928 3391877 3166669 2757066 2790044 3138443 3267467 3374524 3438113 3410938
21340C410938j7567J18801P06163P07948l22567n90839m13494K18175k9059j14389
$$ 3410938 3393371 3512172 4218335 4926283 4603716 4012877 3599383 3817558 3788499 3674110
21330C674110J86128J8230J42030J85386K80562j36137l41104J63949l00384n26773
$$ 3674110 3860238 3878468 4020498 4205884 4486446 4350309 4009205 4173154 3872770 3345997
21320C345997N75915l07516o9420k36354l9972O05498J28815m75438j73124r5076
$$ 3345997 3921912 3614396 3544976 3308622 3268650 3874148 4002963 3527525 3354401 3259325
21310C259325K33837j67396k67725k02602k09794l29954J67052J42060J32140
$$ 3259325 3493162 3325766 3058041 2855439 2645645 2315691 2482743 2624803 2756943
21301B756943M22524L38594M7532m1513l81507k20875k84225O5147K23166k78669
$$ 2756943 3179467 3518061 3565593 3524080 3142573 2921698 2637473 2702620 2925786 2647117
21291B647117J26465r3119P4249j44312l44596j39819Q1874K14055k64858l15679
$$ 2647117 2773582 2680463 2754712 2610400 2265804 2125985 2207859 2421914 2157056 1841377
21281A841377k24550K52225q6362J62435L01326o1024J12299J37030k53762N5194
$$ 1841377 1616827 1869052 1782690 1945125 2246451 2185427 2297726 2434756 2180994 2236188
21271B236188j14181P0555J47511j31349l54088j16376l12550l02252K66867L19783
$$ 2236188 2122007 2192562 2340073 2208724 1854636 1738260 1425710 1123458 1390325 1710108
21261A710108l250M61164L28386Q2205j02000o63680j79658M79285m13503l35125
$$ 1710108 1706858 2168022 2496408 2578613 2476613 1812933 1633275 2112560 1699057 1363932
21251A363932L86485L51676K26387k49652n64741j54459O1991J14509K87937K4832
$$ 1363932 1750417 2102093 2328480 2078828 1514087 1359628 1421619 1536128 1824065 1848897
21241A848897J19714k85986m74201L36339J42446j52434R1165M47279L28324N9012
$$ 1848897 1968611 1682625 1208424 1544763 1687209 1534775 1625940 2073219 2401543 2460555
21231B460555j43221m95743m39837m18222r4099j510r658N3561j30651J17832
$$ 2460555 2317334 1821591 1381754 963532 869433 867923 858265 911826 781175 899007
21221H99007K07341k13696j92971k704P8580j6116Q4904L05305O7357l41294L8136
$$ 899007 1106348 892652 699681 696977 775557 759441 844345 1149650 1217007 875713 913849
21210I13849L20368j55736j7947p0337j57470K50754K08804m85399l43588n9025
$$ 913849 1234217 1078481 1060534 990197 832727 1083481 1292285 806886 463298 404273
21200D04273L12686j89524R1369N10646J08625L16291K92451k3849j09126m36558
$$ 404273 716959 527435 618804 1129450 1238075 1554366 1846817 1822968 1713842 1277284
21190A277284l91090J25253K66431m45308p7628N01928L57555l73892n974K89887
$$ 1277284 886194 1011447 1277878 832570 754942 1256870 1614425 1240533 1234559 1524446
21180A524446j68144q17348l98725k53718M00577Q8117L87849J68184l38572J19932
$$ 1524446 1356302 538954 140229 -113489 287088 375205 763054 931238 592666 712598
21170G12598M6533m07666N2465J26310K57807K27711R5593l65838k58999p6161
$$ 712598 759131 351465 403930 530240 788047 1015758 1111351 745513 486514 410353
21160D10353j2215J73381K95792l38005J19294K74799J71397k33868O9036k0794
$$ 410353 398138 571519 867311 529306 648600 923399 1094796 860928 929964 909170
21150I09170l8651J54045l6333l75296r5428k83742K6487L72136j11525j85726
$$ 909170 870519 1024564 988231 612935 517507 233765 260252 632388 520863 335137
21140C35137J92019O20344K98933n76444l9474j17230j46669n4113O7545j92196
$$ 335137 527156 1147500 1446433 869989 830515 713285 566616 512503 580048 387852
21130C87852j43401M03565M4469n1583r2503L56920N52098j25080k15830J67171
$$ 387852 244451 648016 692485 640902 548399 905319 1457417 1332337 1116507 1283678
21120A283678o6491m50682j30630J23690K17742p0987j34980k08469m57336N49956
$$ 1283678 1217187 766505 635875 759565 977307 906320 771340 562871 105535 655491
21110F55491O8486k83043m80864q567O46381k9583k7677M06352M9858J61110l79700
$$ 655491 723977 440934 -39930 -48497 597884 568301 540624 946976 996834 1157944 778244
21099G78244m34393L16622L21904Q9598m79997J15429L54338K06280m78973j93774
$$ 778244 343851 660473 982377 1071975 591978 707407 1061745 1268025 789052 595278
21089E95278N4672j6931k2328j24252L820L99896J67795L94991l83544o69696
$$ 595278 649950 633019 610691 486439 490259 890155 1057950 1452941 1069397 399701
21079C99701k4620r0060L0312P29685j89721j62659l77717l11593l37925K21967
$$ 399701 375081 285021 315333 1045018 855297 692638 314921 3328 -334597 -112630
21069a12630J78095J52850j5844n06010J99544N63373R83j8569J97382Q0289J52608
$$ -112630 65465 218315 202471 -303539 -103995 459378 460361 441792 639174 719463 872071
21058H72071K26030O4712l28617k04333m74622k94694M2687K21471M27297j45233
$$ 872071 1098101 1162813 834196 629863 155241 -139453 -96766 124705 552002 406769
21048D06769o6035j2854K86451K06618j16867J72580K0329l36357k16408j60428
$$ 406769 340734 327880 614331 820949 704082 876662 896991 560634 344226 183798
21038A83798K11279O10246j00068k63612k5615P0872l13633o1616j24392P969
$$ 183798 395077 1005323 905255 641643 616028 686900 373267 311651 187259 195228
21028A95228N67554L04436j10691j47116j82528K40885L36658N4923m38218J01350
$$ 195228 762782 1067218 956527 809411 626883 867768 1204426 1259349 821131 922481
21018I22481K52451p8928j37229j76045M7306L3859k84962k88599o2752J42723
$$ 922481 1174932 1096004 958775 782730 830036 863895 578933 290334 227582 370305
21008C70305N0167l56146K36560K17510k12672K71539O3193m6903J20487j15022
$$ 370305 420472 64326 300886 518396 305724 577263 640456 593553 714040 599018
20998E99018m0746j28218R1805K16914O2734m70844k06997j54555n9779Q801K13661
$$ 599018 558272 430054 521859 738773 801507 330663 123666 -30889 -90668 -81867 131794
20987A31794L3197N51452j54139k13307n3594j15944M06540L37227K32132J12527
$$ 131794 164991 716443 562304 348997 295403 179459 585999 923226 1155358 1267885
20977A267885r03137k72008M43361K20991J14405q3187j26482l46470l49106k07829
$$ 1267885 364748 92740 536101 757092 871497 788310 661828 315358 -33748 -241577
20967b41577k2830k3526J06521L12539R2613k1175j94732J05867p2420q4294K45951
$$ -241577 -264407 -287933 -181412 131127 223740 202565 7833 113700 41280 -43014 202937
20956B02937j40684j3944O6200J27185L71587j31849o0249j22808K90950K70268
$$ 202937 62253 48309 114509 241694 613281 481432 421183 298375 589325 859593
20946H59593j29979m65807o40106J35618K86524k1528J71133K17160K24898M5697
$$ 859593 729614 263807 -376299 -240681 45843 24315 195448 412608 637506 683203
20936F83203K8746k37981K80190J41282j92801J09964J12219j98716k11197Q600
$$ 683203 711949 473968 754158 895440 702639 812603 924822 726106 514909 523509
20926E23509M04064J07135J20163K9096l13687l99666j18891l14664N4581K11267
$$ 523509 927573 1034708 1154871 1183967 870280 470614 351723 37059 91640 302907
20916C02907l72869N738N52738K76314k55519j85381J38942L37021j7717P0124
$$ 302907 -69962 -64224 488514 764828 509309 323928 462870 799891 782174 852298
20906H52298k53926k50403j44672J15560K98201k98670k51465K0245K81868j4604
$$ 852298 598372 347969 203297 318857 617058 318388 66923 87168 369036 354432
20896C54432J76575j92189o22164m40975J78331N74523K32617J9940N7341M2321
$$ 354432 531007 338818 -283346 -724321 -545990 28533 261150 281090 338431 380752
20886C80752J19311R8160r0318R7932j78580o96903l99643N47868M48237j40271
$$ 380752 500063 598223 507905 605837 427257 -269646 -669289 -121421 326816 186545
20876A86545L8647j23465k80762K19389J96968K02634K26483o5084l43245j43108
$$ 186545 225192 101727 -179035 40354 237322 439956 666439 601355 258110 115002
20866A15002l16288k12130K18575M50584L55987J79688L604n03142l24267Q4620
$$ 115002 -201286 -413416 -194841 255743 611730 791418 795022 291880 -32387 52233
20856E2233k02582k45084K17291P0311j9799K96386L25879J49055J44724K31854
$$ 52233 -150349 -395433 -178142 -107831 -127630 168756 494635 643690 788414 1020268
20846A020268n8003m83640m33338J9042L98863L18771l13028k42587j15654j23822
$$ 1020268 962265 478625 45287 64329 463192 781963 468935 226348 110694 -13128
20836a3128m12701L45844K4118J58976k98608j28381L00592M25435K54217K1050
$$ -13128 -425829 -79985 -55867 103109 -195499 -323880 -23288 402147 656364 677414
20826F77414J14941k31474k01745Q8929J31810O1286k2954O2325R6673j19541
$$ 677414 792355 560881 359136 448065 579875 641161 618207 680532 777205 657664
20816F57664l18634R714j59346L4252j40394j66334J04812j29773j12908J25458
$$ 657664 339030 348744 189398 223650 83256 -83078 21734 -108039 -220947 -95489
20806i5489m15140L25023J18564K90355j95141n83573l39400M09520L10440L46708
$$ -95489 -510629 -185606 -67042 223313 28172 -555401 -894801 -485281 -174841 171867
20796A71867L17246r9679J82676K2403k43697k0717o9181J09875l86376R167L03327
$$ 171867 489113 389434 572110 594513 350816 330099 260918 370793 -15583 -6416 296911
20785B96911K15005K49016m19158k5399R5524o3027k79056K9915P6047J60062
$$ 296911 511916 760932 341774 316375 411899 348872 69816 99731 175778 335840
20775C35840L27503l40528r1475o6372k75186J07025k26095p56461L22016O97735
$$ 335840 663343 322815 231340 164968 -110218 -3193 -229288 -985749 -663733 34002
20765C4002K94949k9657l97145N7552N7851j36082j7126o354J53939l05932J14105
$$ 34002 328951 299294 -97851 -40299 17552 -118530 -135656 -142010 11929 -294003 -179898
20754a79898L88258L62171J27359N33222n02482o06891K6518O4083M4909K21439
$$ -179898 208360 570531 697890 1231112 728630 121739 148257 212340 257249 478688
20744D78688l97231K77143L71179k18442l03639l44045K52944L3900J51894m38052
$$ 478688 81457 358600 729779 511337 207698 -136347 116597 150497 302391 -135661
20734a35661l62189k65879J69833K66384R4678J19847J22312M6570j67607Q5933
$$ -135661 -497850 -763729 -593896 -327512 -232834 -112987 9325 55895 -111712 -25779
20724b5779K94985k68095k18343K33467m0081l16794J58290L15576L8088j094
$$ -25779 269206 1111 -217232 16235 -23846 -340640 -182350 133226 171314 170220
20714A70220J30467m92402k82107L82809n879l36697J12884L98317J82146j50508
$$ 170220 300687 -191715 -473822 -91013 -96892 -433589 -320705 77612 259758 109250
20704A09250k62923J64j54572j68841K59636M52600O4991k84443J43346J98611
$$ 109250 -153673 -153509 -308081 -476922 -217286 235314 300305 15862 159208 357819
20694C57819N2881M9638K80486K04248P7892j28442l23173j19136M01108J00224
$$ 357819 410700 460338 740824 945072 1022964 894522 571349 452213 853321 953545
20684I53545o22207j98921J18049j5145j78958k85126m8486j23925k20723N30697
$$ 953545 331338 132417 250466 235321 56363 -228763 -277249 -401174 -621897 -91200
20674i1200J21981o8118M4007j37276j38767L04656J33973j00296K54901j6875
$$ -91200 30781 -37337 6670 -130606 -269373 35283 169256 68960 323861 306986
20664C06986l95825o4054j60996J7209K27354o2505M0340r6329k52059Q8324O03971
$$ 306986 -88839 -152893 -313889 -296680 -69326 -131831 -91491 -187820 -439879 -351555 252416
20653B52416J65716m05925l67817K48517M75286O8996r9210J6570K98397l69422
$$ 252416 418132 12207 -355610 -107093 368193 437189 337979 354549 652946 283524
20643B83524n24615k08313r4723K40664m4200k22118L83125J76631m95066K62475
$$ 283524 -241091 -449404 -544127 -303463 -347663 -569781 -186656 -10025 -505091 -242616
20633b42616J52376K20837j33348l66874j40126K79850J78824J50167K2370L8122
$$ -242616 -90240 130597 -2751 -369625 -509751 -229901 -51077 99090 121460 159582
20623A59582n45710j49358M20902L1980L843J42855k00087p08j32309j99406J82496
$$ 159582 -386128 -535486 -114584 -82604 -78761 64094 -135993 -136701 -269010 -468416 -285920
20612b85920L36837k37018k51350J16407J03271k53097L88165J39140N49290j76806
$$ -285920 50917 -186101 -437451 -321044 -217773 -470870 -82705 56435 605725 428919
20602D28919o02871l5728K10611R3649P3732l8332k58276m1445R8829k6708K75770
$$ 428919 -173952 -209680 931 94580 168312 129980 -128296 -169741 -70912 -97620 178150
20591A78150p0193r8065n504l06376K63065P55590J36679k35291L5183K55033
$$ 178150 107957 9892 4388 -301988 -38923 716667 853346 618055 653238 908271
20581I08271j11201n0693p11238R8715n1125k29768m48219j47927J26840J614
$$ 908271 797070 746377 35139 133854 82729 -147039 -595258 -743185 -616345 -614731
20571f14731j23657L82267L31762j71478k70576j8598j51695J43877N99241N16847
$$ -614731 -738388 -356121 -24359 -195837 -466413 -485011 -636706 -492829 106412 623259
20561F23259R2820n23757l19097N7115k05266k3543J78809K44867J15330j72269
$$ 623259 716079 192322 -126775 -69660 -274926 -298469 -119660 125207 240537 68268
20551F8268j54399J80508m27782J69179K50143O5355k47252J51302n7937n9893
$$ 68268 -86131 94377 -333405 -164226 85917 151272 -95980 55322 -2615 -62508
20541f2508K65589O4206r4756K56262J26441j63960J9054m9356m6023k5877l37839
$$ -62508 203081 267287 172531 428793 555234 391274 410328 360972 314949 289072 -48767
20530d8767k68826r3849K57415L29539p6586m73548P4123q0455j38383o6868K77721
$$ -48767 -317593 -411442 -154027 175512 98926 -374622 -300499 -380954 -519337 -586205 -308484
20519c08484K75908M74877k17825r6003j20880j99862k07573j13975N0594L9850
$$ -308484 -32576 442301 224476 128473 7593 -192269 -399842 -513817 -463223 -423373
20509d23373L16718L80730k40653l17111k43675K4931J97021K07083L09327M5871
$$ -423373 -106655 274075 33422 -283689 -527364 -502433 -305412 -98329 210998 256869
20499B56869n50872o26615J13023K49591N06396L90680N9936r9053M84569K03472
$$ 256869 -294003 -920618 -807595 -558004 -51608 339072 399008 299955 784524 987996
20489I87996m13221l42066l90636N62556M67343l6176J09237n02050l93370L03102
$$ 987996 574775 232709 -157927 404629 871972 835796 945033 442983 49613 352715
20479C52715K0019M57107n07139j14899k89538k06046j84110R0485J93688P8124
$$ 352715 372734 829841 322702 207803 -81735 -287781 -471891 -381406 -187718 -109594
20469a09594P0748Q0607j22418k6179K43090J37875p45004J29908L07390P2599
$$ -109594 -38846 41761 -80657 -106836 136254 274129 -470875 -340967 -33577 39022
20459C9022l5955Q0223k00139l05721j21874K60935K55552O0445n05641q5183
$$ 39022 3067 83290 -116849 -422570 -544444 -283509 -27957 32488 -473153 -558336
20449e58336L01389P1789o7032p4544k54558M10084K65500P9406J79178K39037
$$ -558336 -256947 -185158 -252190 -326734 -581292 -171208 94292 173698 352876 591913
20439E91913L06839m10879l25112m96216L7129P36517j2807Q1819J09167j04819
$$ 591913 898752 487873 162761 -333455 -296326 440191 427384 509203 618370 513551
20429E13551q390j40956m2007j1172j51780l31958K55241K07369J23808k42193
$$ 513551 505161 364205 322198 311026 159246 -172712 82529 289898 413706 171513
20419A71513n08620l60819P4577m7137k87828N1042J17591N65470M00762M70085
$$ 171513 -337107 -697926 -623349 -670486 -958314 -907272 -789681 -224211 176551 646636
20409F46636l32305N4942n0814m73846j39210J64251k3005J91146L43415K4997
$$ 646636 314331 369273 318459 -155387 -294597 -130346 -153351 37795 381210 406207
20399D06207m64006k96280J67567J39193N9234j4157k3656J84122l06421n2569
$$ 406207 -57799 -354079 -186512 -47319 11915 -2242 -25898 158224 -148197 -200766
20389b00766J38252j09312M32298J1169Q2477j82229n28215L0393L33723j61979
$$ -200766 -62514 -171826 260472 271641 354118 171889 -356326 -325933 7790 -154189
20379a54189R4637J79389l28324m98810P1956M63192O79855J04217J08681o0235
$$ -154189 -59552 119837 -208487 -707297 -635341 -172149 507706 611923 720604 660369
20369F60369k01892n23142m34734J36899J98255K7826k4040R3167K04071N7352
$$ 660369 458477 -64665 -499399 -362500 -164245 -136419 -160459 -67292 136779 194131
20359A94131J0323p2202k29826l53476Q9540K49881K35500L15560J43147j25041
$$ 194131 204454 132252 -97574 -451050 -361510 -111629 123871 439431 582578 457537
20349D57537l00871j70253j07762l61836k52142L89845K84290m9390q0591l74108
$$ 457537 156666 -13587 -121349 -483185 -735327 -345482 -61192 -110582 -191173 -565281
20339e65281k31249K65004M40394P1962k05775j13076L4994n9539O5234K45531
$$ -565281 -796530 -531526 -91132 -19170 -224945 -338021 -303027 -362566 -297332 -51801
20329e1801J98456M08428J45431l08882k68146O3976j36670K8905j03499J71735
$$ -51801 146655 555083 700514 391632 123486 187462 50792 79697 -23802 147933
20319A47933K3766r9862j82514J84272L3919l55803L2060J11639J92735M7750
$$ 147933 171699 71837 -110677 73595 107514 -248289 -216229 -104590 88145 135895
20309A35895Q2697j85440l46171M3104j8293J90679K13044m9777j13451K07618
$$ 135895 218592 33152 -313019 -269915 -288208 -97529 115515 65738 -47713 159905
20299A59905O5476J88361k8103K66801n2497m677j65907k44171K34845J55938
$$ 159905 225381 413742 385639 652440 599943 595266 429359 185188 420033 575971
20289E75971j39597k8804m18074m11897L44308P24194Q3052p14968o02594j85031
$$ 575971 436374 407570 -10504 -422401 -78093 646101 729153 14185 -588409 -773440
20279g73440J10518J17436M19932L34014J97564J65925o5211l19622j17939M8815
$$ -773440 -662922 -545486 -125554 208460 406024 571949 506738 187116 69177 117992
20269A17992J05127N62186L6575n87724m15418K45300k56232m38824J58922N27059
$$ 117992 223119 785305 821880 234156 -181262 64038 -192194 -631018 -472096 54963
20259E4963l32799m12665P2494K94893j53604j14838J68019j03394Q0759Q4826
$$ 54963 -277836 -690501 -618007 -323114 -476718 -591556 -423537 -526931 -446172 -361346
20249c61346L94454j28635m03144j38389l97846J28525K30692Q7923J03189j34314
$$ -361346 33108 -95527 -498671 -637060 -1034906 -906381 -675689 -587766 -484577 -618891
20239f18891j58189L85858K17986Q6177l98125k01023N68904M07279j33891M85534
$$ -618891 -777080 -391222 -173236 -87059 -485184 -686207 -117303 289976 156085 641619
20229F41619J58045n09127l74302J3995J77819j88902k57533M14849O9513J39656
$$ 641619 799664 290537 -83765 -69770 108049 -80853 -338386 76463 145976 285632
20219B85632j12546p19966n67625M79714K40638l33354l49642K04411N35763N28877
$$ 285632 173086 -546880 -1114505 -634791 -394153 -727507 -1077149 -872738 -336975 191902
20209A91902M03974k20239o22077k24813Q4989J69656j00416k68067L07733J11608
$$ 191902 595876 375637 -246440 -471253 -386264 -216608 -317024 -585091 -277358 -165750
20199a65750q3693N0752k17561l89027K10688P33268L65091j89949k35420k85410
$$ -165750 -249443 -198691 -416252 -805279 -594591 138677 503768 313819 78399 -207011
20189b07011j25580J63864p4577K40193K98884N23095q4415j71343k26949j9196
$$ -207011 -332591 -168727 -243304 -3111 295773 818868 734453 563110 336161 316965
20179C16965m46525l44416J85168K24674L51280K80164l8702j06113j77450O0205
$$ 316965 -129560 -473976 -288808 -64134 287146 567310 528608 422495 245045 305250
20169C05250k43545J88849J55030l6380j55804n4645j16314j74386L12909K28814
$$ 305250 61705 250554 405584 369204 213400 158755 42441 -131945 180964 409778
20159D09778K83657L5674l64757j16552j69329r2088J82267L54143k00913j18750
$$ 409778 693435 729109 364352 247800 78471 -13617 168650 522793 321880 203130
20149B03130K01695K76174L68642k49953l80171L28893K23058K31502P741k14006
$$ 203130 404825 680999 1049641 799688 419517 748410 971468 1202970 1210711 996705
20139I96705o11588q13898l62488n3255O90881L37979J84315R1057k24144l44963
$$ 996705 385117 -428781 -791269 -844524 -153643 184336 368651 459708 235564 -109399
20129a09399N59390K43176l80248l262l74411k20282m70245K88024L45057K89749
$$ -109399 449991 693167 312919 309657 -64754 -285036 -755281 -467257 -122200 167549
20119A67549m55573j5185N49100K45801J35671m6049J51296L383j00185j89388
$$ 167549 -288024 -303209 245891 491692 627363 581314 732610 735993 635808 446420
20109D46420k777J80706k05602l62670l04643M10450O1246j36421l2788J91174
$$ 446420 443643 624349 418747 56077 -248566 161884 223130 86709 53921 245095
20099B45095P7410j60028L8727l12861k55607L2807K2750N42375J00890m28037
$$ 245095 322505 162477 201204 -111657 -367264 -334457 -311707 230668 331558 -96479
20089i6479j20358J91295o4301l82890O2252K5554L86571K55765k74890m01326
$$ -96479 -216837 -25542 -89843 -472733 -410481 -384927 1644 257409 -17481 -418807
20079d18807J17586J52822R1975K97965j11724K18345k91471k25880l89043m6096
$$ -418807 -301221 -148399 -56424 241541 129817 348162 56691 -169189 -558232 -604328
20069f04328L45909K58488j26629M66011j38983j73836l777J85053O5103l61507
$$ -604328 -258419 69 -126560 339451 200468 26632 22855 207908 273011 -88496
20059h8496j72248P8763M34479L13969O2003j79969l38462K2603j6377j85796
$$ -88496 -260744 -181981 252498 566467 628470 448501 110039 132642 116265 -69531
20049f9531o8379J64826l54256j4261K13349j67377N7917k74554K4639M66607
$$ -69531 -137910 26916 -327340 -341601 -128252 -295629 -237712 -512266 -487627 -21020
20039b1020N48706j63785l26561J43171J23400R2352j11819m7103k5127k70221
$$ -21020 527686 363901 37340 180511 303911 396263 284444 237341 212214 -58007
20029e8007k199N7568N25905M45353l36355j64054j00500j9586j05866L72429
$$ -58007 -60206 -2638 523267 968620 632265 468211 367711 348125 242259 614688
20019F14688P1639J14165q5711N0028k03676n54986J10050l58403m87453L75387
$$ 614688 686327 800492 714781 764809 561133 6147 116197 -242206 -729659 -354272
20009c54272N52892L07698K8910J58778l10943K3834l59595l78158j97043J70142
$$ -354272 198620 506318 535228 694006 383063 406897 47302 -330856 -527899 -357757
19999c57757K36640K35955L27180j18950n1146J79166K53009L4656r7306l95921
$$ -357757 -121117 114838 442018 323068 271922 451088 704097 738753 641447 245526
19989B45526j73355O1716Q682l24452J35135K69056m0218K4444l49004L98694
$$ 245526 72171 133887 142569 -181883 -46748 222308 182090 206534 -142470 256224
19979B56224L44360j87318R2640m6477J98258j46429l24070r410m778k10687j04844
$$ 256224 600584 413266 505906 459429 657687 511258 187188 177778 173000 -37687 -142531
19968a42531L12726J66538n9593j45902J95243n4415l87988j23379M7575K15894
$$ -142531 170195 336733 277140 131238 326481 272066 -115922 -239301 -191726 24168
19958B4168J79127J30536k48392j29706J9787L90978J55383n3468j30686L3794
$$ 24168 203295 333831 85439 -44267 -24480 366498 521881 468413 337727 371521
19948C71521L3639q3496n92288l487k94306k36658j0297N5197O76301N1597l24212
$$ 371521 405160 321664 -270624 -274111 -568417 -805075 -815372 -760175 -83874 -32277 -356489
19937c56489J88763P2751k87697J44429O0506M60231R6580P4118J68338J39010
$$ -356489 -167726 -94975 -382672 -238243 -177737 282494 379074 453192 621530 760540
19927G60540j78279k35632l26278O2416R142N40284N57351l652k58001q7282j48175
$$ 760540 582261 346629 20351 82767 91909 632193 1189544 1185892 927891 840609 692434
19916F92434j95764k17131q1476K53709K12802K6709J6216l36119K37127k95014
$$ 692434 496670 279539 198063 451772 664574 691283 707499 371380 608507 313493
19906C13493k48868J41442J79615j42649L27707J90860N0207L458p4256k91636
$$ 313493 64625 206067 385682 243033 570740 761600 811807 815265 741009 449373
19896D49373j64518j55229m63731N9074K10377J6706j7728K6149j496l7998M59743
$$ 449373 284855 129626 -334105 -275031 -64654 -47948 -65676 -39527 -41023 -79021 380722
19885C80722O00477L5551n02217j56262j52455J6154l70060J21441M35432M08543
$$ 380722 981199 1016750 514533 358271 205816 221970 -148090 -26649 408783 817326
19875H17326q6844n01117l81836k19535K43718L08956m0849l93277K85906M73203
$$ 817326 730482 229365 -152471 -372006 -128288 180668 139819 -253458 32448 505651
19865E05651k50871l30170K30324N76931n5154M8037K66931k46726n10563K74542
$$ 505651 254780 -75390 154934 731865 676711 724748 991679 744953 234390 508932
19855E08932L65740L6911k02231n6924p9751k25368K55037K21084n69194m56811
$$ 508932 874672 911583 709352 652428 572677 347309 602346 823430 254236 -202575
19845b02575J41518n8971O6586J48620J68382J2720j23239K80930M95197J31484
$$ -202575 -61057 -120028 -53442 95178 263560 276280 153041 433971 929168 1060652
19835A060652k46198m68610j63720n8401J47615J97773L86594J91432n53929n5502
$$ 1060652 814454 345844 182124 123723 271338 469111 855705 1047137 493208 437706
19825D37706J63678j27l11496r6061K99634N048j94330Q1616p2275p1374Q03030
$$ 437706 601384 601257 289761 193700 493334 498382 304052 385668 313393 242019 1045049
19814A045049O68161j88926n22700l17280k33740k3502j00734k54758k7992J11670
$$ 1045049 1713210 1524284 1001584 684304 450564 427062 326328 71570 43578 155248
19804A55248l6937l8258J17496P9982k80863j15259j54048j2491J75330l84012
$$ 155248 118311 80053 197549 277531 -3332 -118591 -272639 -285130 -109800 -493812
19794d93812k72314L69266L22122N65568N3307l09994j31858k80181M4372K24999
$$ -493812 -766126 -396860 -74738 490830 544137 234143 102285 -177896 -133524 91475
19784I1475J69970M12159Q7334L8091l5363l7611N2314j22686O5729J92976P3111
$$ 91475 261445 673604 760938 799029 763666 726055 778369 655683 721412 914388 987499
19773I87499k7137M4360q1895n50825o09049k75799J84438K06097P05412L39606
$$ 987499 960362 1004722 922827 372002 -237047 -512846 -328408 -122311 583101 922707
19763I22707j82550l44975l49478J43717J71480L71983l34384k45188K97254J97027
$$ 922707 740157 395182 45704 189421 360901 732884 398500 153312 450566 647593
19753F47593J04066L44372m50971l70037L42203r6705q4409J19605p43413j56790
$$ 647593 751659 1096031 645060 275023 617226 520521 436112 555717 -187696 -344486
19743c44486L58200J55107M6892O917K64052m00667m02209j30323K44707K31598
$$ -344486 13714 168821 215713 222630 486682 86015 -316194 -446517 -201810 29788
19733B9788J64849K79677N25216N37761l2268m88927k45756J36241O313j68892
$$ 29788 194637 474314 999530 1537291 1505023 1016096 770340 906581 912894 744002
19723G44002l0232k965J484J61689P9911l03098j31844Q9065L5981n5361l22562
$$ 744002 713770 710805 712289 873978 953889 650791 518947 608012 643993 588632 266070
19712B66070j20831l75837O5807j41771L88339J81163K27405k10423j04619K90526
$$ 266070 145239 -230598 -164791 -306562 81777 262940 490345 279922 175303 465829
19702D65829J97560J78756k78788K06697j34632k13611j26717J95594J26689J87782
$$ 465829 663389 842145 563357 770054 635422 421811 295094 490688 617377 805159
19692H05159K48784l42J22580j55120k38720j48952j92062j08190l211n9324j16705
$$ 805159 1053943 1053601 1176181 1021061 782341 633389 441327 333137 329926 270602 153897
19681A53897K55621K69935L9075J26501k08990m11619K60281M140O6036N39595
$$ 153897 409518 679453 718528 845029 636039 224420 484701 488841 554877 1094472
19671A094472j05160l15153K19551K73333o1738n3850n63103k11053O2972J90514
$$ 1094472 989312 674159 893710 1167043 1105305 1051455 488352 277299 340271 530785
19661E30785l23748K710L55592j52301K29656j76385K16080K66710j40850j28036
$$ 530785 207037 209747 565339 413038 642694 466309 682389 949099 808249 680213
19651F80213J66279r1872j47369l01371R118K16594k16841j55353K60836k6629
$$ 680213 846492 754620 607251 305880 314998 531592 314751 159398 420234 393605
19641C93605q5975M5329K8170Q1180M26527J94095q4821L69840K96179j73510
$$ 393605 307630 352959 381129 462309 888836 1082931 998110 1367950 1664129 1490619
19631A490619l72674n81131k24256L08387K66852L02179n14221k34478P2502L53132
$$ 1490619 1117945 536814 312558 620945 887797 1189976 675755 441277 513779 866911
19621H66911K66439L13575j61125o08562r4214j3584K33333k8817k71367k74060
$$ 866911 1133350 1446925 1285800 677238 583024 569440 802773 773956 502589 228529
19611B28529o6542O59610J76596m64454Q534R2882J19405J73034j96534k69313
$$ 228529 161987 821597 998193 533739 542273 635155 754560 927594 731060 461747
19601D61747j22186k67268L62418L61297L39303N24229k84831m93926j64900O3801
$$ 461747 339561 72293 434711 796008 1135311 1659540 1374709 880783 715883 779684
19591G79684L21112L80270O2581J12752J22529n08947l25429N35557P9283o67090
$$ 779684 1100796 1481066 1543647 1656399 1778928 1269981 944552 1480109 1559392 892302
19581H92302j31067M51409J99527l51583j32118J83795J34611l52519l30115L13632
$$ 892302 761235 1212644 1412171 1060588 928470 1112265 1246876 894357 564242 877874
19571H77874K80751j38687J20537r7825L70188N98793L00634o88210m80792M99994
$$ 877874 1158625 1019938 1140475 1042650 1412838 2011631 2312265 1624055 1143263 1643257
19561A643257j42392l33605l71075P0934N2046J7271K08077M05874L22268j32086
$$ 1643257 1500865 1167260 796185 867119 919165 936436 1144513 1550387 1872655 1740569
19551A740569j89060p5641l80070o65174m8108K22758M29938P4460k79771n37383
$$ 1740569 1551509 1475868 1095798 430624 382516 605274 1035212 1109672 829901 292518
19541B92518M3468L29509J05807o02907r2430J53992K67471Q3510p3007l1438
$$ 292518 335986 665495 771302 168395 75965 229957 497428 580938 507931 476493
19531D76493K7251J14702J08516K04812l73683n4800K15553j85104P5931M53596
$$ 476493 503744 618446 726962 931774 558091 503291 718844 533740 609671 1063267
19521A063267K29247J05732l03745k27860K02728j06484k02422l70930k7758K80988
$$ 1063267 1292514 1398246 1094501 866641 1069369 962885 760463 389533 361775 642763
19511F42763J69084P0892M28197K75842l97739j54137L93878N0041m44508j54722
$$ 642763 811847 882739 1310936 1586778 1189039 1034902 1428780 1478821 1034313 879591
19501H79591M08862L6294k8829k66420K27368L96544l4444N862J89404m4549l65469
$$ 879591 1288453 1324747 1295918 1029498 1256866 1653410 1618966 1624828 1814232 1769683 1404214
19490A404214m68327J88904k091k27508J90066L68428M440k00144M02839J36621
$$ 1404214 935887 1124791 1122700 895192 1085258 1453686 1458126 1257982 1660821 1797442
19480A797442l56278l29756J54086R5467K69606k90005k32974l25744k24981N42360
$$ 1797442 1441164 1111408 1265494 1360961 1630567 1340562 1107588 781844 556863 1099223
19470A099223P97763K82341L60088j68650l57090k63011K49326l01492j33226
$$ 1099223 1896986 2179327 2539415 2370765 2013675 1750664 1999990 1698498 1565272
19461A565272j37326r1493n30705K53819M14271j8936k29791q1836n05305J72945
$$ 1565272 1427946 1336453 805748 1059567 1473838 1454902 1225111 1143275 637970 810915
19451H10915M96998M2918O2848K14804j17304m7023L08851k95833l43280k87976
$$ 810915 1307913 1350831 1413679 1628483 1511179 1464156 1773007 1477174 1133894 845918
19441H45918J29759M93222K48295k53626m13263K04266K72377L64410K26298k28873
$$ 845918 975677 1468899 1717194 1463568 1050305 1254571 1526948 1891358 2117656 1888783
19431A888783m06211o28613M5874M98795J8355m2906K01713Q1680k54325J46427
$$ 1888783 1482572 853959 899833 1398628 1416983 1374077 1575790 1657470 1403145 1549572
19421A549572K0122k7015o76651k22660M1440J83106k83588L36926K79193k07511
$$ 1549572 1569694 1542679 866028 643368 684808 867914 584326 921252 1200445 992934
19411I92934J9776M08901K26519j70280l79814M8815L74832J59080m5488k61792
$$ 992934 1012710 1421611 1648130 1477850 1098036 1146851 1521683 1680763 1635275 1373483
19401A373483N0572j46902N169p3935j12868N2078L9343L11885K50868L09340
$$ 1373483 1424055 1277153 1282322 1208387 1095519 1147597 1186940 1498825 1749693 2059033
19391B059033l02011n16856j24418K34613j288O7340n5903K48235L23803L65025
$$ 2059033 1757022 1240166 1115748 1350361 1349073 1416413 1360510 1608745 1932548 2297573
19381B297573m21610k35113j6633J04592K43158k43194o5160J25085l47551k20378
$$ 2297573 1875963 1640850 1624217 1728809 1971967 1728773 1663613 1788698 1441147 1220769
19371A220769J44652P8046K61135K84742L33697M39227l07104n24885r8969J96446
$$ 1220769 1365421 1443467 1704602 1989344 2323041 2762268 2455164 1930279 1831310 2027756
19361B027756p7427J85441k33348l46666k67593P30295K67736k81996n80763m14352
$$ 2027756 1950329 2135770 1902422 1555756 1288163 2018458 2286194 2004198 1423435 1009083
19351A009083L10291L49535L03525j33532J68057k25770n43929k47733N13417
$$ 1009083 1319374 1668909 1972434 1838902 2006959 1781189 1237260 989527 1502944
19342A502944K4048J71083l62643o997N13965k61157o354M99436M75353K80271
$$ 1502944 1526992 1698075 1335432 1328435 1842400 1581243 1574889 2074325 2549678 2829949
19332B829949p43465o50512j30679k97002j84100K21250k0475K4061M93366K55741
$$ 2829949 2086484 1435972 1305293 1008291 824191 1045441 1024966 1049027 1542393 1798134
19322A798134K37129q3283l29421o253R2125j19642J47122Q1716O16964J30370
$$ 1798134 2035263 1951980 1622559 1616306 1708431 1588789 1735911 1817627 2434591 2564961
19312B564961l89966l45203J13667J99085m46964k0676L36301J66170J6397J03038
$$ 2564961 2174995 1829792 1943459 2142544 1695580 1674904 2011205 2177375 2193772 2296810
19302B296810J62185j10616M042L851m92267j24426N3316K61740j24503Q5478
$$ 2296810 2458995 2348379 2352421 2356272 1864005 1739579 1792895 2054635 1930132 2015610
19292B015610M66753k3064l80623m39184P3760M46515K2023m7087m92642R4729
$$ 2015610 2482363 2459299 2078676 1639492 1713252 2159767 2181790 2134703 1642061 1736790
19282A736790M84509j2804K59637J60481M63855j28334m05190j75530J01232K00679
$$ 1736790 2221299 2208495 2468132 2628613 3092468 2964134 2558944 2383414 2484646 2685325
19272B685325j48494l10512Q7362J87338L83381L78430k00600k34558n8523J24338
$$ 2685325 2536831 2226319 2313681 2501019 2884400 3262830 3062230 2827672 2769149 2893487
19262B893487m12878k65154p8253l8355J59636J68008k32305j24045J12775K72555
$$ 2893487 2480609 2215455 2137202 2098847 2258483 2426491 2194186 2070141 2182916 2455471
19252B455471k37368l1006M62134N4501k29221K75250L22561J94924q8678l55991
$$ 2455471 2218103 2187097 2649231 2703732 2474511 2749761 3072322 3267246 3178568 2822577
19242B822577k3480J44565l3657Q1054K27170p0066k9685j94000l02985m05730
$$ 2822577 2799097 2943662 2910005 2991059 3218229 3148163 3118478 2924478 2621493 2215763
19232B215763j13291o6526M27440J94538j14097J14777j81088J82582k6777l34621
$$ 2215763 2102472 2035946 2463386 2657924 2543827 2658604 2477516 2660098 2633321 2298700
19222B298700l4745K10273k10477k93558L73991N34062K02862n4053j53617k42225
$$ 2298700 2263955 2474228 2263751 1970193 2344184 2878246 3081108 3027055 2873438 2631213
19212B631213J90994K08964j26390k20619j02250K59263O06872L33677Q5176l54251
$$ 2631213 2822207 3031171 2904781 2684162 2581912 2841175 3448047 3781724 3866900 3512649
19202C512649l91131J2388O39671O73070k99248m54946J08989p6871O9324M26611
$$ 3512649 3121518 3133906 3773577 4446647 4147399 3692453 3801442 3724571 3793895 4220506
19192D220506k42808l74313J60645k15170l40682K59852L49345m3339j16758K65102
$$ 4220506 3977698 3603385 3764030 3548860 3208178 3468030 3817375 3774036 3657278 3922380
19182C922380K68262l79186L66524K91044m23017j25670k69527p7320j47369j3212
$$ 3922380 4190642 3811456 4177980 4469024 4046007 3920337 3650810 3573490 3426121 3412909
19172C412909j72459J14068j3307j46604K50609j6079l13988P0783L10704J73720
$$ 3412909 3240450 3354518 3341211 3194607 3445216 3429137 3115149 3185932 3496636 3670356
19162C670356m43957p9938J03540J1463L38229K97036K84075M4679j05370j78819
$$ 3670356 3226399 3146461 3250001 3261464 3599693 3896729 4180804 4225483 4120113 3941294
19152C941294j8910k3917Q9265J23736n36058r0286K31371j84881M19886K28529
$$ 3941294 3922384 3898467 3987732 4111468 3575410 3485124 3716495 3531614 3951500 4180029
19142D180029j06528o9340k76826J54425J21338j24516j46108m7932K72196K36159
$$ 4180029 4073501 4004161 3727335 3881760 4003098 3878582 3732474 3684542 3956738 4192897
19132D192897J83002L12487j66070k45388P5276l4959l65812K11164O93067n6022
$$ 4192897 4375899 4688386 4522316 4276928 4352204 4317245 3951433 4162597 4855664 4799642
19122D799642n05151J83171P7072j20477k86K67423K3678K16991l1241p4674o20932
$$ 4799642 4294491 4477662 4554734 4434257 4433971 4701394 4725072 4942063 4910822 4836148 4215216
19111D215216m5375L06020J02724J24783J81748k2729J52095N5387K03848l01116
$$ 4215216 4169841 4475861 4578585 4703368 4885116 4862387 5014482 5069869 5273717 4972601
19101D972601m19668j00333L87414M05714R9980O3015L12899m196k31018j91663
$$ 4972601 4552933 4452600 4840014 5245728 5345708 5408723 5721622 5717426 5486408 5294745
19091E294745L76227J78499j49250j14005k34359j34975J68159L08964K99971
$$ 5294745 5670972 5849471 5700221 5586216 5351857 5216882 5385041 5694005 5993976
19082E993976P3456k59334l0273k73875l5023K83633M54875o3311j40121l20138
$$ 5993976 6067432 5808098 5777825 5503950 5468927 5752560 6207435 6144124 6004003 5683865
19072E683865K4942m66255J35951P91428J42845j13475l95091J35487n5286j20893
$$ 5683865 5708807 5242552 5378503 6169931 6312776 6199301 5804210 5939697 5884411 5763518
19062E763518O792n6171N61767K70151M39314j14504J8548N2072m07436M3715
$$ 5763518 5770310 5714139 6275906 6546057 6985371 6870867 6889415 6941487 6534051 6577766
19052F577766O52646J49754q7162l47758l19128o30237M0848M35392l3497J2994
$$ 6577766 7230412 7380166 7293004 6945246 6626118 5995881 6036729 6472121 6438624 6451618
19042F451618L6451n2081j11217j08118M33702J40537m36255q885M30294K7883
$$ 6451618 6488069 6435988 6324771 6216653 6650355 6790892 6354637 6345752 6776046 6803929
19032F803929m2826j84119j57020n7973l9038K01440R8460k86557K36439M06043
$$ 6803929 6761103 6576984 6419964 6361991 6322953 6524393 6622853 6336296 6572735 6978778
19022F978778P2655j44712l23280n0395J51761l1119L3691r1692j41538O139J81315
$$ 6978778 7051433 6906721 6583441 6533046 6684807 6653688 6687379 6595687 6454149 6460288 6641603
19011F641603K93L17520N25113L32586J4069n0395n29790l85140l40903j69464
$$ 6641603 6641896 6959416 7484529 7817115 7831184 7780789 7250999 6865859 6524956 6355492
19001F355492L19517J35222q4143J99022J12909K44482K21303J71367L51362j0414
$$ 6355492 6675009 6810231 6726088 6925110 7038019 7282501 7503804 7675171 8026533 8016119
18991H016119k90365m9192Q0683j830j8634K09142K77487J67334J67109m77307
$$ 8016119 7725754 7676562 7757245 7755415 7736781 7945923 8223410 8390744 8557853 8080546
18981H080546n81242j37638J14458N0609O33200M47373J24836L71144J93247j38311
$$ 8080546 7499304 7361666 7476124 7526733 8159933 8607306 8732142 9103286 9296533 9158222
18971I158222m4902n5439l59986l09609r5661M30262L86602J0265L16859l91365
$$ 9158222 9113320 9057881 8697895 8388286 8292625 8722887 9109489 9119754 9436613 9045248
18961I045248o65600J6221K80229K72095L26615J30386j37666m21544K49918L50331
$$ 9045248 8379648 8395869 8676098 8948193 9274808 9405194 9267528 8845984 9095902 9446233
18951I446233J78482j00638m8524j75199k21471L79586J85196j81599k28325O75033
$$ 9446233 9624715 9524077 9475553 9300354 9078883 9458469 9643665 9462066 9233741 9908774
18941I908774N31558J21815j43316j69489M3870j55961l74227P8538j30792l32195
$$ 9908774 10440332 10562147 10418831 10249342 10293212 10137251 9763024 9841562 9710770 9378575
18931I378575J87378K75099J09027R1732J78742L28232K56850j1854k67184J1374
$$ 9378575 9565953 9841052 9950079 10041811 10220553 10548785 10805635 10793781 10526597 10537971
18921A0537971M70781j02554n09784o5343j60068j7220j12355K73134O0385L54098
$$ 10537971 11008752 10906198 10396414 10331071 10171003 10153783 10041428 10314562 10374947 10729045
18911A0729045L2155j38105J66212J95734r393P6465M877L86059O18758l41790
$$ 10729045 10761200 10623095 10789307 10985041 10975648 11052113 11056990 11443049 12061807 11720017
18901A1720017m22707J35833k09437j28226k8667L49654M84315J47985K5358K52391
$$ 11720017 11297310 11433143 11223706 11095480 11066813 11416467 11900782 12048767 12074125 12326516
18891A2326516J56462K02785K48416j06420l25453m89717K15960K44812L15125
$$ 12326516 12482978 12685763 12934179 12827759 12502306 12012589 12228549 12473361 12788486
18882A2788486L81056L33974k57391l31818J78314J00289J71210j05325j32459
$$ 12788486 13169542 13503516 13246125 12914307 13092621 13192910 13364120 13258795 13126336
18873A3126336J38088K75653k78147l12017L41909L86365K37805j44744k42170
$$ 13126336 13264424 13540077 13261930 12949913 13291822 13678187 13915992 13771248 13529078
18864A3529078P6282m38498k07883J44405P91777L35499L56328l1491o1287k01873
$$ 13529078 13605360 13166862 12958979 13103384 13895161 14230660 14586988 14555497 14494210 14292337
18854A4292337j35512q7974p4135J89112p4959j78108L36815o832M7514L12637
$$ 14292337 14156825 14068851 13994716 14183828 14108869 13930761 14267576 14260744 14308258 14620895
18844A4620895J24622N34754J58200k30992n4776L2706J74580K24605R5026J76442
$$ 14620895 14745517 15280271 15438471 15207479 15152703 15185409 15359989 15584594 15679620 15856062
18834A5856062N20821M37001J497L01884o14934m93585N375L29193K17340l40208
$$ 15856062 16376883 16813884 16815381 17117265 16502331 16008746 16014121 16343314 16560654 16220446
18824A6220446j95555J17868K31240M29423K39166L6242N1295L97231o3766L50349
$$ 16220446 16024891 16142759 16373999 16803422 17042588 17078830 17130125 17527356 17463590 17813939
18814A7813939Q56513j48386k70917r0337M06458J25279R1771O0051L34251N28054
$$ 17813939 18670452 18522066 18251149 18160812 18567270 18692549 18784320 18844371 19178622 19706676
18804A9706676J93392n88901k44032k06396J77171N35550M86816L51o43591K66876
$$ 19706676 19900068 19311167 19067135 18860739 19037910 19573460 20060276 20060627 19417036 19683912
18794A9683912K67509p961J8794r1434j30805J64614M96986R97336J91472R8752
$$ 19683912 19951421 19943460 19962254 19870820 19740015 19904629 20401615 21398951 21590423 21689175
18784B1689175J68086l10680k37862j4820L20762M3947L83888M81584M5461j17513
$$ 21689175 21857261 21546581 21308719 21293899 21614661 21658608 22042496 22524080 22569541 22452028
18774B2452028J46778L17020O5608M67329L57579N3627K04892K78371L21032j10598
$$ 22452028 22598806 22915826 22981434 23448763 23806342 23859969 24064861 24343232 24664264 24553666
18764B4553666N9018l3741k24347J27110L15951M39100N12852N35955K70444j83472
$$ 24553666 24612684 24578943 24354596 24481706 24797657 25236757 25749609 26285564 26556008 26372536
18754B6372536m8249j29954j08128J6087M48949K05076K72452J9964J68311P1105
$$ 26372536 26324287 26194333 26086205 26102292 26551241 26756317 27028769 27048733 27217044 27288149
18744B7288149L44178J47621K47042J50534K42242O27808J41458J83690m5552
$$ 27288149 27632327 27779948 28026990 28177524 28419766 29047574 29189032 29372722 29327170
18735B9327170O1959J71517K62117J05068K7045K48273M46088K41706K98058N77395
$$ 29327170 29389129 29560646 29822763 29927831 29954876 30203149 30649237 30890943 31189001 31766396
18725C1766396J15645j72385L22714L69203K54233O47886L84166K41969j67264
$$ 31766396 31882041 31709656 32032370 32401573 32655806 33303692 33687858 33929827 33762563
18716C3762563k69715r868L25472L56030L42990M43086L51129L47880k38363q9487
$$ 33762563 33492848 33482980 33808452 34164482 34507472 34950558 35301687 35649567 35411204 35321717
18706C5321717K53874O72552Q60671J49697j42550J76379N35781K46651L24330
$$ 35321717 35575591 36248143 37108814 37258511 37115961 37292340 37828121 38074772 38399102
18697C8399102L18485O27159k0363k96258J73633j16937L93319O51917O90092
$$ 38399102 38717587 39344746 39324383 39028125 39201758 39084821 39478140 40130057 40820149
18688D0820149Q89402M60849K843K97675k24751L63419P78104R01955K44843k85126
$$ 40820149 41709551 42170400 42173243 42470918 42246167 42609586 43387690 44289645 44534488 44249362
18678D4249362L8001K35740R58533N14468M17158O44136L76824k42375J85812
$$ 44249362 44287363 44523103 45481636 45996104 46413262 47057398 47434222 47191847 47377659
18669D7377659j05661L88096O23842K81585J94621P31648K57171J70813L05316
$$ 47377659 47271998 47660094 48283936 48565521 48760142 49491790 49748961 49919774 50225090
18660E0225090R23518P51551K09342J10630N24770K23275J70175K82026J075603
$$ 50225090 51148608 51900159 52109501 52220131 52744901 52968176 53138351 53420377 54495980
18651E4495980N35981N82058N30293K36141K04883Q10506J001351J61908K88656
$$ 54495980 55031961 55614019 56144312 56380453 56585336 57395842 58397193 58559101 58847757
18642E8847757L57719O78991L93473M32277K74916J78579K27990Q23023R45031
$$ 58847757 59205476 59884467 60277940 60710217 60985133 61163712 61391702 62214725 63159756
18633F3159756N78942O68095M08530M41552J40124R3169J15531M77600P89462
$$ 63159756 63738698 64406793 64815323 65256875 65396999 65490168 65605699 66083299 66872761
18624F6872761K10539Q11504J048159N82013P68843M02072K26746M28887K56923
$$ 66872761 67083300 67894804 68942963 69524976 70293819 70695891 70922637 71351524 71608447
18615G1608447M85160O22339Q98262Q39062M28700N32782O73253P04473L18233
$$ 71608447 72093607 72715946 73614208 74453270 74881970 75414752 76088005 76792478 77110711
18606G7110711P21956P87335P44755P01665N22520N67070P86221N81997P98314
$$ 77110711 77832667 78620002 79364757 80066422 80588942 81156012 81942233 82524230 83322544
18597H3322544P24986Q96007M58521P16104P88625P29109Q31535P63035K97274
$$ 83322544 84047530 84943537 85402058 86118162 86906787 87635896 88467431 89230466 89527740
18588H9527740N23113Q71853N43173K77368M86601O30070R65289Q90989Q03999
$$ 89527740 90050853 90922706 91465879 91743247 92229848 92859918 93825207 94716196 95520195
18579I5520195M61120N69718P50128R36390J050172Q83450P37244N59207P67183
$$ 95520195 95981315 96551033 97301161 98237551 99287723 100171173 100908417 101467624 102234807
18570A02234807Q21169R17221J073555N38674N96002O89432Q61416N73137P51624
$$ 102234807 103055976 103973197 105046752 105585426 106181428 106870860 107732276 108305413 109057037
18561A09057037J244198Q03593Q38921Q12824J123425Q40088O16953R86159J027091
$$ 109057037 110301235 111104828 111943749 112756573 113879998 114720086 115337039 116323198 117350289
18552A17350289O09023J090179P71723M46373Q34166R49009Q42756P80614J022294
$$ 117350289 117959312 119049491 119821214 120267587 121101753 122050762 122893518 123674132 124696426
18543A24696426J310039J488567P02449Q18551N48514Q33987J363462P70580Q11694
$$ 124696426 126006465 127495032 128197481 129016032 129564546 130398533 131761995 132532575 133344269
18534A33344269Q65799R36414P41566O12190J235882J308100J102572J043810
$$ 133344269 134210068 135146482 135888048 136500238 137736120 139044220 140146792 141190602
18526A41190602J092911P53047P59610N80844J210693R99220Q05103R44656J059457
$$ 141190602 142283513 143036560 143796170 144377014 145587707 146586927 147392030 148336686 149396143
18517A49396143J173585J170750Q66378J143315Q82381J093654J201363R64579
$$ 149396143 150569728 151740478 152606856 153750171 154632552 155726206 156927569 157892148
18509A57892148N42952R68531R13186J199218J098827R13516J429330J248151
$$ 157892148 158435100 159403631 160316817 161516035 162614862 163528378 164957708 166205859
18501A66205859J123289R96137Q19316P16890J100591Q74630N59119J184421R88712
$$ 166205859 167329148 168325285 169144601 169861491 170962082 171836712 172395831 173580252 174568964
18492A74568964R03428J158043R92642R78678R60851N64740M93165O96659R69068
$$ 174568964 175472392 176630435 177623077 178601755 179562606 180127346 180620511 181317170 182286238
18483A82286238J230738R54851Q06703Q49173J293609R13664R82456J066338R42231
$$ 182286238 183516976 184471827 185278530 186127703 187421312 188334976 189317432 190383770 191326001
18474A91326001Q35642Q90842J072753P99349O75507R78644P82577Q72147R69085
$$ 191326001 192161643 193052485 194125238 194924587 195600094 196578738 197361315 198233462 199202547
18465A99202547J029851J152008R97032O81203Q33435R25832O64589L00283N64816
$$ 199202547 200232398 201384406 202381438 203062641 203896076 204821908 205486497 205786780 206351596
18456B06351596J140201J053250P20021J077766R28649L53289L17042R27902J113126
$$ 206351596 207491797 208545047 209265068 210342834 211271483 211624772 211941814 212869716 213982842
18447B13982842J029068N47202O77816J116364P18182P98873O73942L33545Q19792
$$ 213982842 215011910 215559112 216236928 217353292 218071474 218870347 219544289 219877834 220697626
18438B20697626J249361O57769M67958O34694Q29868O74557O71792M16037M69895
$$ 220697626 221946987 222604756 223072714 223707408 224537276 225211833 225883625 226299662 226769557
18429B26769557L78806j4216Q18268Q78190P32806N82035P66343M61412J72572
$$ 226769557 227148363 227134147 227952415 228830605 229563411 230145446 230911789 231373201 231545773
18420B31545773M45214K36214J81393P43769P35010N05857M50515K48907j41489
$$ 231545773 231990987 232227201 232408594 233152363 233887373 234393230 234843745 235092652 234951163
18411B34951163j63113L73514O24176M51127R0826K19410N29370J33568k01265
$$ 234951163 234788050 235161564 235785740 236236867 236327693 236547103 237076473 237210041 237008776
18402B37008776k9538j87468M91273K80543N50326M1265k93496j21848P73449
$$ 237008776 236979238 236791770 237283043 237563586 238113912 238155177 237861681 237739833 238513282
18393B38513282M85640J77255J74706k69513J96917q1131j03392m97144k96165
$$ 238513282 238998922 239176177 239350883 239081370 239278287 239197156 239093764 238596620 238300455
18384B38300455L15806J99559m07593J05399n1053k01918M72886N57589m42248
$$ 238300455 238616261 238815820 238408227 238513626 238462573 238260655 238733541 239291130 238848882
18375B38848882k16261p28964k50078l1255j84001k07292R863k28770p42980o82730
$$ 238848882 238632621 237903657 237653579 237622324 237438323 237231031 237240894 237012124 236269144 235586414
18365B35586414K76034m24937j14491p05979p45332k89388K22732n87430j094412
$$ 235586414 235862448 235437511 235323020 234617041 233871709 233582321 233805053 233217623 232123211
18356B32123211n71392J98585K78293o04120p10185q71396m70278j534l36763
$$ 232123211 231551819 231750404 232028697 231424577 230714392 229842996 229372718 229371184 229034421
18347B29034421p62402n89820k69539q76370o47669l81491l10382j01779q93249
$$ 229034421 228272019 227682199 227412660 226536290 225888621 225507130 225196748 225094969 224201720
18338B24201720r39181r94943j094953m85834o47734j70716m33090p43352q81010
$$ 224201720 223262539 222267596 221172643 220686809 220039075 219868359 219435269 218691917 217810907
18329B17810907o64496n05894n4267r56870j126500l72514j210699j423327o39510
$$ 217810907 217146411 216640517 216586250 215629380 214502880 214130366 212919667 211496340 210856830
18320B10856830l55663j054878r11664r87595j072972p51491n31318o43492o43628
$$ 210856830 210501167 209446289 208534625 207547030 206474058 205722567 205191249 204547757 203904129
18311B03904129n48806j319724j264441r20767n76373n50062j212162r85376o04421
$$ 203904129 203355323 202035599 200771158 199850391 199274018 198723956 197511794 196526418 195921997
18302A95921997r06564q50638r08934j369041j200943r94792q70399r55835n77543
$$ 195921997 195015433 194164795 193255861 191886820 190685877 189691085 188820686 187864851 187287308
18293A87287308n53527j290245j278571q00182n58732j140465j154914q60851
$$ 187287308 186733781 185443536 184164965 183364783 182806051 181665586 180510672 179649821
18285A79649821j027966o15494q48984j051453r35656o23783j004490j357575
$$ 179649821 178621855 178006361 177157377 176105924 175170268 174546485 173541995 172184420
18277A72184420j387670r14806j132700p16953l04342r58978j049032j211899
$$ 172184420 170796750 169881944 168749244 168032291 167727949 166768971 165719939 164508040
18269A64508040q95447j142455q15684j157304r89836j217733j108622j334750
$$ 164508040 163612593 162470138 161654454 160497150 159507314 158289581 157180959 155846209
18261A55846209j457736n49520q14926r46630p68592r88915o93637j064431j091378
$$ 155846209 154388473 153838953 153024027 152077397 151308805 150319890 149626253 148561822 147470444
18252A47470444j029302p66372o67961q74838q33543j159018r31288r09351p71210
$$ 147470444 146441142 145674770 145006809 144131971 143298428 142139410 141208122 140298771 139527561
18243A39527561j068921q26175p62368j079842j051651p68016r62194p59066r28185
$$ 139527561 138458640 137632465 136870097 135790255 134738604 133970588 133008394 132249328 131321143
18234A31321143q59135q15040j029002j023245q54408m02562p45183j434613r63630
$$ 131321143 130462008 129646968 128617966 127594721 126740313 126337751 125592568 124157955 123194325
18225A23194325j142844p53027m91155r41207p56700o97859r59736j548920j119289
$$ 123194325 122051481 121298454 120807299 119866092 119109392 118411533 117451797 115902877 114783588
18216A14783588m32178j4315j017456q96960j197959q27339j42223p59131j034990
$$ 114783588 114351410 114337095 113319639 112422679 111224720 110397381 110255158 109496027 108461037
18207A08461037r45145n83740p34399j229336q85620l14660p59817j147433q71426
$$ 108461037 107515892 106932152 106197753 104968417 104082797 103768137 103008320 101860887 100989461
18198A00989461r39145o75042l94175n46982n36820p93338o41235q27094n89391
$$ 100989461 100050316 99375274 98981099 98434117 97897297 97103959 96462724 95635630 95046239
18189I5046239o60474o02176p06093p05106j151389r57160r50937j001503m09650
$$ 95046239 94385765 93783589 93077496 92372390 91221001 90263841 89312904 88311401 87901751
18180H7901751k33094J59784p30829q67754m20878q02749j086766n80244n03820
$$ 87901751 87668657 87828441 87097612 86229858 85808980 85006231 83919465 83339221 82835401
18171H2835401n84865r14452p56188k36798o39258q97139n37662k69621n19625
$$ 82835401 82250536 81336084 80579896 80343098 79703840 78806701 78269039 77999418 77479793
18162G7479793o61853m36611o74064r58870p52146l19565n30232p70764k77761
$$ 77479793 76817940 76381329 75707265 74748395 73996249 73676684 73146452 72375688 72097927
18153G2097927p84358m56810k46694l61386l11533p23511r99497o08838m11098
$$ 72097927 71313569 70856759 70610065 70248679 69937146 69213635 68214138 67605300 67194202
18144F7194202l10169p48700m83530Q5477m08904l20167o29646o75140n77223
$$ 67194202 66884033 66135333 65651803 65737280 65328376 65008209 64378563 63703423 63126200
18135F3126200m75173k3646n24634l95107p04150n26948m13534j56579p47844
$$ 63126200 62651027 62627381 62102747 61707640 61003490 60476542 60063008 59906429 59158585
18126E9158585j083241n73890m56237l98092n15407K2769n5320q24681m13211
$$ 59158585 58075344 57501454 57045217 56647125 56131718 56154487 56099167 55274486 54861275
18117E4861275n10881L7287j88079l95867k14831o29243j143416m69735q0142
$$ 54861275 54350394 54387681 54199602 53803735 53588904 52959661 51816245 51346510 51266368
18108E1266368J54798l98430m62338l60599k34005k72124k70279m22835m93572
$$ 51266368 51421166 51022736 50560398 50199799 49965794 49693670 49423391 49000556 48506984
18099D8506984o28792j56127l63281k31987l42637n79930n32501n18664j96927
$$ 48506984 47878192 47722065 47358784 47126797 46784160 46204230 45671729 45153065 44956138
18090D4956138k39971j83712o2203n91422m67470j37392K35963k59868m41114
$$ 44956138 44716167 44532455 44470252 43878830 43411360 43273968 43509931 43250063 42808949
18081D2808949n67138o68731L8797k34561l43675k89784j15038l59133k69812
$$ 42808949 42241811 41573080 41611877 41377316 41033641 40743857 40628819 40269686 39999874
18072C9999874n64678j73344j98309j97279K34590j34493q69795p43070m07781
$$ 39999874 39435196 39261852 39063543 38866264 39100854 38966361 38096566 37353496 36945715
18063C6945715k84133J74429j87078r0434m88446q1789l51427k18474m28331l21626
$$ 36945715 36661582 36836011 36648933 36558499 36070053 35988264 35636837 35418363 34990032 34668406
18053C4668406m17485L613j68059j40461p1891m99163k35634J95168n3935j1439
$$ 34668406 34250921 34254534 34086475 33946014 33874123 33374960 33139326 33334494 33280559 33269120
18043C3269120O2552K98996j66124o84829q67026o27295M44181L27146k94058
$$ 33269120 33331672 33630668 33464544 32779715 31912689 31285394 31729575 32056721 31762663
18034C1762663m55930j34500m21665o33705l77107o879l38790n42178j83592J09333
$$ 31762663 31306733 31172233 30750568 30116863 29739756 29732877 29394087 28851909 28668317 28777650
18024B8777650j17758n4401n34236j48897j5953N4403J06936p05688n32747r1671
$$ 28777650 28659892 28605491 28071255 27922358 27906405 27960808 28067744 27362056 26829309 26737638
18014B6737638J79992l588o8161l49055k64068j78905k95167j42699J65328O8174
$$ 26737638 26917630 26914042 26845881 26496826 26232758 26053853 25758686 25615987 25781315 25849489
18004B5849489l13496l09622J03313l95120n55886k79443n6148K81701n27673
$$ 25849489 25535993 25226371 25329684 24934564 24378678 24099235 24043087 24324788 23797115
17995B3797115m79555r5962l9017k47951M51010K27340k20560j73669m66177j49089
$$ 23797115 23317560 23221598 23182581 22934630 23385640 23612980 23392420 23218751 22752574 22603485
17985B2603485j95110K75850K31884j68776q18567j64571J40655q9306n08819
$$ 22603485 22408375 22684225 22916109 22747333 21928766 21764195 21904850 21815544 21306725
17976B1306725l97399P1783j19824Q1742N4930l30708J35306j09685j77636K22626
$$ 21306725 20909326 20981109 20861285 20943027 20997957 20667249 20802555 20692870 20515234 20737860
17966B0737860k40464o55423l41079L17327J23484j09392l81772l39100j44129
$$ 20737860 20497396 19841973 19500894 19818221 19941705 19832313 19450541 19111441 18967312
17957A8967312R2900N01402m90757M791j6950J62142j77660l50537m22709P1745
$$ 18967312 19060212 19561614 19070857 19075648 19058698 19220840 19043180 18692643 18269934 18341679
17947A8341679L90199o1611K55095j53086K4693j38776k44695o73085m12344J90014
$$ 18341679 18731878 18670267 18925362 18772276 18796969 18658193 18413498 17740413 17328069 17518083
17937A7518083J07746l02644j60644j0539L68005L51617l60108n95k70144l97317
$$ 17518083 17625829 17323185 17162541 17152002 17520007 17871624 17511516 17510921 17240777 16843460
17927A6843460k24416n3861J67294K27212k37448R0416Q1786m21876o09847n00715
$$ 16843460 16619044 16565183 16732477 16959689 16722241 16812657 16894443 16472567 15862720 15362005
17917A5362005m08911K96138N39555M00555k35582l65276n24019k34284K41932
$$ 15362005 14953094 15249232 15788787 16189342 15953760 15588484 15064465 14830181 15072113
17908A5072113L74050J61140j43413N7974j07496l9968L22676j12401r0585j18214
$$ 15072113 15446163 15607303 15463890 15521864 15414368 15374400 15697076 15584675 15494090 15375876
17898A5375876o3368l60685l92757J55318j39107O3013L10208j34145j56876l26728
$$ 15375876 15312508 14951823 14559066 14714384 14575277 14638290 14948498 14814353 14657477 14330749
17888A4330749o55661l11784J15862K05987l49860k47085N47322L84924n706l79538
$$ 14330749 13675088 13363304 13479166 13685153 13335293 13088208 13635530 14020454 14014748 13635210
17878A3635210j7441J46286l43894o8147P1203k84776k7203K48041K925k73915
$$ 13635210 13617769 13764055 13420161 13352014 13423217 13138441 13111238 13359279 13362204 13088289
17868A3088289n13418m38129m00824J39796M30522J80417q6360j21771m15639
$$ 13088289 12574871 12136742 11735918 11875714 12306236 12486653 12400293 12278522 11862883
17859A1862883j4442p360N03628J76463j64475l31643j55072k6572K15163J6244
$$ 11862883 11848441 11841081 12344709 12521172 12356697 12025054 11869982 11843410 12058573 12074817
17849A2074817r6979J23656j36438l87640L2267M41259o1726j23849j62054L91010
$$ 12074817 11977838 12101494 11965056 11577416 11609683 12050942 11989216 11865367 11703313 12094323
17839A2094323J71554n45474k20555L0303K97525J87015k13500m40338J40110
$$ 12094323 12265877 11720403 11499848 11530151 11827676 12014691 11801191 11360853 11500963
17830A1500963O15426k64462k45572l43425J28441Q0883j07111k37604q6753l2627
$$ 11500963 12116389 11851927 11606355 11262930 11391371 11472254 11365143 11127539 11040786 11008159
17820A1008159K89579R5222n01091j63235j57503J04371J46726j1497o5266K4969
$$ 11008159 11297738 11392960 10891869 10728634 10571131 10675502 10822228 10810731 10745465 10770434
17810A0770434n33106l64602K78580L71349J93869n62443k92076p2442j20419
$$ 10770434 10237328 9872726 10151306 10522655 10716524 10154081 9862005 9789563 9669144
17801I669144K598J4629L24262O3997R7284N1496j84827k67751k29440L7459o9735
$$ 9669144 9671742 9686371 10010633 10074630 10171914 10223410 10038583 9770832 9541392 9578851 9509116
17790I509116K99207p0792r3066q4917l0053q6772J3110J18034k04804o91448
$$ 9509116 9808323 9737531 9644465 9559548 9529495 9442723 9455833 9573867 9369063 8677615
17780H677615k48484P34025j53738n36568J37232L05904K73349j56874j66198
$$ 8677615 8429131 9163156 9009418 8472850 8610082 8915986 9189335 9032461 8866263
17771H866263M31392J06461j55536j71760j81736J79664l20231p6520P2075k9938
$$ 8866263 9297655 9404116 9248580 9076820 8895084 9074748 8754517 8677997 8750072 8720134
17761H720134k22358l99684K64880L61861K13027l05469m76791J35223L06002
$$ 8720134 8497776 8098092 8362972 8724833 8937860 8632391 8155600 8290823 8596825
17752H596825k71047m06219j6592p40344l63442L22703K51801K33778M20148j96369
$$ 8596825 8325778 7919559 7902967 7162623 6799181 7121884 7373685 7607463 8027611 7831242
17742G831242j09491j40159j73141J4603J631k6894Q342l4929K85645M52868m41984
$$ 7831242 7721751 7581592 7408451 7423054 7424685 7397791 7406133 7371204 7656849 8109717 7667733
17731G667733l21997M37766j43888M2925J85507l2824N6772k17248k71285n93791
$$ 7667733 7345736 7783502 7639614 7682539 7868046 7835222 7891994 7674746 7403461 6809670
17721F809670J59750O77976R0946o77683o4971J92208k43800J03479q5639Q6799
$$ 6809670 6969420 7647396 7738342 7060659 6995688 7187896 6944096 7047575 6961936 7048735
17711G048735N91m93614O30588L83144q45971l59572J87146R1770L8403N45293
$$ 7048735 7049326 6555712 7186300 7569444 6723473 6363901 6551047 6642817 6681220 7226513
17701G226513o47836j13276L88774j08498L4315j38041k02411k06455l20409L63488
$$ 7226513 6578677 6465401 6854175 6745677 6779992 6641951 6439540 6233085 5912676 6276164
17691F276164j3116j99853N8745K9352J46390L59410J02992o3468n9536n22115
$$ 6276164 6263048 6063195 6121940 6151292 6297682 6657092 6760084 6696616 6637080 6114965
17681F114965r2731Q3662K41974J84556r0989m8461J10119r1501j9289K85151
$$ 6114965 6022234 6105896 6347870 6532426 6441437 6392976 6503095 6411594 6392305 6677456
17671F677456j64023m11584M7030O7384j2824n23329J7527L28983J512L11249
$$ 6677456 6513433 6101849 6148879 6216263 6203439 5680110 5697637 6026620 6028132 6339381
17661F339381k57198j20809m81611k38421K77630n2834j69349L69196k7368Q0758
$$ 6339381 6082183 5961374 5479763 5241342 5518972 5466138 5296789 5665985 5638617 5719375
17651E719375M22802m83739k93511j43488L24824P3041j58609k11852k47k24563
$$ 5719375 6142177 5658438 5364927 5221439 5546263 5619304 5460695 5248843 5248596 5024033
17641E024033k34528K53975J84549J72392K72409q4614l73019j96375j56394K03845
$$ 5024033 4789505 5043480 5228029 5400421 5672830 5588216 5215197 5018822 4862428 5066273
17631E066273k80889L92P7955p8760P841J80740k89592J54632J42884k30127k96615
$$ 5066273 4785384 4785776 4863731 4784971 4792812 4973552 4683960 4838592 4981476 4751349 4454734
17620D454734l6640L30667J30476k5672m5105m59129O1046K47281J30716j17397
$$ 4454734 4418094 4748761 4879237 4853565 4808460 4349331 4410377 4657658 4788374 4670977
17610D670977k35340J75325l3056K78395r2401L78124R2690n93919K01J2909J28288
$$ 4670977 4435637 4610962 4577906 4856301 4763900 5142024 5234714 4640795 4640996 4653905 4782193
17599D782193Q2163L27102k57665k80928R8918q3901j65045n5976P560K48072
$$ 4782193 4864356 5191458 4933793 4652865 4751783 4667882 4502837 4446861 4454421 4702493
17589D702493l21000k93675L86305J30536n21745p8566K99846o4731j20963q4735
$$ 4702493 4381493 4087818 4474123 4604659 4082914 4004348 4304194 4239463 4118500 4033765
17579D033765J91194j23330J25416L09639J5665K14992J88715n91506R1679J03628
$$ 4033765 4224959 4101629 4227045 4536684 4552349 4767341 4956056 4364550 4456229 4559857
17569D559857j25247j04833r5697m35015L51723L57091Q7001l06345J03322J91560
$$ 4559857 4434610 4329777 4234080 3799065 4150788 4507879 4594880 4288535 4391857 4583417
17559D583417J17302j81932N9460j78563l57032l95808j64069j25859K82011M05983
$$ 4583417 4700719 4518787 4578247 4399684 4042652 3646844 3482775 3356916 3638927 4044910
17549D044910n1698k1966k55033l4509K21908K59898L09844j24880k59414k64400
$$ 4044910 3993212 3971246 3716213 3681704 3903612 4163510 4473354 4348474 4089060 3824660
17539C824660J34447n457j54718m3584M10860j54266k95553j53786O4339J07743
$$ 3824660 3959107 3953650 3798932 3755348 4166208 4011942 3716389 3562603 3626942 3734685
17529C734685O8560L6394m09076k11340J30285j97323k35338J41753j1302o9544
$$ 3734685 3803245 3839639 3430563 3219223 3349508 3152185 2916847 3058600 3047298 2977754
17519B977754M24865K2666J96686k0282l9855n9448k83578l19226p98j49480K55665
$$ 2977754 3402619 3425285 3621971 3601689 3561834 3502386 3218808 2899582 2898784 2749304 3004969
17508C004969Q9855n23638L49349J02671J67165N23925k95575j51552l72894l97588
$$ 3004969 3094824 2571186 2920535 3023206 3190371 3714296 3418721 3267169 2894275 2496687
17498B496687j7996j1860M08712L00804n33167k30412L00891N44788K76421K48213
$$ 2496687 2478691 2466831 2875543 3176347 2643180 2412768 2713659 3258447 3534868 3783081
17488C783081j46332k27961k9756j45951n28698j20834N8565J94662L37850J33476
$$ 3783081 3636749 3408788 3379032 3233081 2704383 2583549 2642114 2836776 3174626 3308102
17478C308102p33477j71211J00701j11551n5768M38893K80796K29161j50619o9397
$$ 3308102 2574625 2403414 2504115 2392564 2336796 2775689 3056485 3285646 3135027 3065630
17468C065630k81200Q6809J43172K57088P9527K89635m17749j45199M24758q6019
$$ 3065630 2784430 2871239 3014411 3271499 3351026 3640661 3222912 3077713 3502471 3416452
17458C416452q7897k59197j39593k70042q7912M70202Q5154p8138m13452q9090
$$ 3416452 3328555 3069358 2929765 2659723 2571811 3042013 3127167 3049029 2635577 2546487
17448B546487K74434J54937j91105N3016J68934q7077r8494L57935k66107Q9922
$$ 2546487 2820921 2975858 2784753 2837769 3006703 2919626 2821132 3179067 2912960 3002882
17438C002882m193j81728o03978L6508j35982k94588K15981K25361k56797k62467
$$ 3002882 2998689 2816961 2212983 2249491 2113509 1818921 2034902 2260263 2003466 1740999
17428A740999M08672N98422p559m26557j25836n1697J3902J23341k98671k00370
$$ 1740999 2149671 2748093 2740534 2313977 2188141 2136444 2150346 2273687 1975016 1774646
17418A774646L0688j04036r1870L08371J9371K30579j09080j8870J66215J87703
$$ 1774646 1805334 1701298 1609428 1917799 1937170 2167749 2058669 2039799 2206014 2393717
17408B393717o2604j1984L4727J42178j35411l62897k94578k6954j80962L37944
$$ 2393717 2331113 2319129 2353856 2496034 2360623 1997726 1703148 1676194 1495232 1833176
17398A833176J13783M4110j58898J52025N12409l04171m22452j46463k10158R7012
$$ 1833176 1946959 1991069 1832171 1984196 2496605 2192434 1769982 1623519 1413361 1510373
17388A510373J60472j26611j90247k23167L2738N18511K03479L02514k95950k60408
$$ 1510373 1670845 1544234 1353987 1130820 1163558 1682069 1885548 2188062 1892112 1631704
17378A631704l03400J05015M49552k96583m04419J9990N97434L41358Q256k63621
$$ 1631704 1328304 1433319 1882871 1586288 1181869 1201859 1799293 2140651 2148907 1885286
17368A885286k16082k82237N4371j88612j34613K59157K75810M07924K04850l51782
$$ 1885286 1669204 1386967 1441338 1252726 1118113 1377270 1653080 2061004 2265854 1914072
17358A914072j19733N375j03009J67424j09756j42776k20391k42076K10866L1279
$$ 1914072 1794339 1799714 1696705 1864129 1754373 1611597 1391206 1149130 1359996 1391275
17348A391275k282k02024J48841k05199p9891K02145M90659j90189j92190J17330
$$ 1391275 1388993 1186969 1335810 1130611 1050720 1252865 1743524 1553335 1361145 1478475
17338A478475K29235K48606n5421m8085l61148Q6381K72801O2035K93070l67243
$$ 1478475 1707710 1956316 1900895 1852810 1491662 1578043 1850844 1912879 2205949 1838706
17328A838706l14679q3620l15194L65820K76817j70049o51413J45653M71521M29147
$$ 1838706 1524027 1440407 1125213 1491033 1767850 1597801 946388 1092041 1563562 1992709
17318A992709K56976k89851m82373J3582N44219J8961m57048q8401l02628k42193
$$ 1992709 2249685 1959834 1477461 1491043 2035262 2054223 1597175 1508774 1206146 963953
17308I63953L37229K5749J73731R8282J40044j15818o2785L09494K59126J50512
$$ 963953 1301182 1326931 1500662 1598944 1738988 1623170 1560385 1869879 2129005 2279517
17298B279517k56785K42923r116m96150m36212l70806j86386K14492Q9733j75787
$$ 2279517 2022732 2265655 2256539 1760389 1324177 953371 766985 981477 1071210 895423
17288H95423K65531L2354K22927k54049k15350J09873L19799J58262j37575K98348
$$ 895423 1160954 1193308 1416235 1162186 946836 1056709 1376508 1534770 1397195 1695543
17278A695543K95819j99523m19388n09111J97731L51817j88285p969L5824j56578
$$ 1695543 1991362 1791839 1372451 863340 1061071 1412888 1224603 1216634 1252458 1095880
17268A095880J75729K65219J0285n2000J79210Q319n3689K59313o0941K49859
$$ 1095880 1271609 1536828 1547113 1495113 1674323 1682642 1628953 1888266 1827325 2077184
17258B077184n52215m37583L85466Q3837k42699k80471K05741j960j16670M08606
$$ 2077184 1524969 1087386 1472852 1556689 1313990 1033519 1239260 1237300 1120630 1529236
17248A529236L76481m29450m64530l57077J04488M70074K31224j71264k71781
$$ 1529236 1905717 1476267 1011737 654660 759148 1229222 1460446 1289182 1017401
17239A017401j00850K65354Q5732M5655J24497P7256J57191j53860j48411l06779
$$ 1017401 916551 1181905 1267637 1313292 1437789 1515045 1672236 1518376 1369965 1063186
17229A063186K44843p8995j43352p0369J25081L72639J13331J11465n4273k20371
$$ 1063186 1308029 1229034 1085682 1015313 1140394 1513033 1626364 1737829 1683556 1463185
$$ [...]
##END NTUPLES=NMR SPECTRUM
##END=
