##TITLE=Analysis number 328038
Compound Code cc 21126
Book Reference 511/116
Project Code adrs
Chemist Name stevem
##JCAMPDX= 6.0         $$ Bruker NMR JCAMP-DX V2.0
##DATA TYPE= NMR SPECTRUM
##DATA CLASS= NTUPLES
##ORIGIN= Bruker BioSpin GmbH
##OWNER= nmr
$$ XWIN-NMR		Version 3.5
$$ Fri Apr 27 09:13:53 2007 GMT Daylight Time (UT+1h)  MAYBRIDGE\nmr@NMR_250MHZ
##.OBSERVE FREQUENCY= 250.131544655141
##.OBSERVE NUCLEUS= ^1H
##.ACQUISITION MODE= SIMULTANEOUS (DQD)
##.ACQUISITION SCHEME= undefined
##.AVERAGES= 16
##.DIGITISER RES= 18
##SPECTROMETER/DATA SYSTEM= dpx250
##.PULSE SEQUENCE= zg30
##.SOLVENT NAME= CDCl3
##.SHIFT REFERENCE= (INTERNAL, CDCl3, 0, 16.4436)
##AUDIT TRAIL= $$ (NUMBER, WHEN, WHO, WHERE, WHAT)
$$ ##TITLE= Audit trail, XWIN-NMR		Version 3.5
$$ ##JCAMPDX= 5.01
$$ ##ORIGIN= Bruker BioSpin GmbH
$$ ##OWNER= nmr
$$ C:\u/data/dgb/nmr/ADRS/3180/pdata/1/auditp.txt
$$ ##AUDIT TRAIL=  $$ (NUMBER, WHEN, WHO, WHERE, WHAT)
(   1,<2007-04-27 09:13:30.36 +100>,<MAYBRIDGE\nmr>,<NMR_250MHZ>,
      <created by zg, POWCHK disabled, PULCHK disabled
       configuration hash MD5:
       76 6E 9A 78 1E 09 19 81 EC 84 63 8F B0 6A 59 2D
       data hash MD5: 64K
       0F 79 B2 59 B1 DF 72 00 46 92 98 8B A1 24 B1 FC>)
(   2,<2007-04-27 09:13:43.83 +100>,<MAYBRIDGE\nmr>,<NMR_250MHZ>,
      <Start of raw data processing
       ef LB = 0.3 FT_mod = 6 PKNL = 1 SI = 32K 
       data hash MD5: 32K
       E7 4E 3D 6F 48 A7 33 0B E3 6A B6 E2 5E 63 12 B2>)
(   3,<2007-04-27 09:13:45.46 +100>,<MAYBRIDGE\nmr>,<NMR_250MHZ>,
      <apk 
       data hash MD5: 32K
       8A 0A 4D B3 D6 C3 3E 50 0B 97 88 CF 1F 51 3B 50>)
(   4,<2007-04-27 09:13:46.16 +100>,<MAYBRIDGE\nmr>,<NMR_250MHZ>,
      <abs ABSG = 5 
       data hash MD5: 32K
       5A 39 3C 8D 5F 1D 48 A6 A5 78 AF B4 AA 0F ED 03>)
$$ ##END=
$$ 
$$ hash MD5
$$ 6A B3 64 EC 98 24 14 8C A9 33 B2 99 AE 27 30 F8
##$RELAX= 
##$RELAX= 
##$RELAX= 
##$RELAX= 
##$RELAX= 
##$RELAX= 
##$RELAX= 
$$ Bruker specific parameters
$$ --------------------------
##$DU= <C:\u>
##$EXPNO= 3180
##$NAME= <ADRS>
##$PROCNO= 1
##$TYPE= <nmr>
##$USER= <dgb>
##$AMP= (0..31)
100 100 100 100 100 100 100 100 100 100 100 100 100 100 100 100 100 100 
100 100 100 100 100 100 100 100 100 100 100 100 100 100 
##$AQSEQ= 0
##$AQ_mod= 3
##$AUNM= <au_zg>
##$AUTOPOS= <4 >
##$BF1= 250.13
##$BF2= 250.13
##$BF3= 250.13
##$BF4= 250.13
##$BF5= 500.13
##$BF6= 500.13
##$BF7= 500.13
##$BF8= 500.13
##$BYTORDA= 1
##$CFDGTYP= 0
##$CFRGTYP= 5
##$CHEMSTR= <none>
##$CNST= (0..31)
1 1 145 1 1 1 1 1 1 1 1 1 1 1 1 1 1 1 1 1 1 1 1 1 1 1 1 1 1 1 1 1 
##$CPDPRG= <>
##$CPDPRG1= <>
##$CPDPRG2= <>
##$CPDPRG3= <>
##$CPDPRG4= <mlev>
##$CPDPRG5= <mlev>
##$CPDPRG6= <mlev>
##$CPDPRG7= <mlev>
##$CPDPRG8= <mlev>
##$CPDPRGB= <>
##$CPDPRGT= <>
##$D= (0..31)
0 1 0 0 0 0 0 0 0 0.06 0 0 0 0 0 0 0.0002 0 0 0 0 0 0 0 0 0 0 0 0 0 0 
0 
##$DATE= 1177661609
##$DBL= (0..7)
120 120 120 120 120 120 120 120 
##$DBP= (0..7)
150 150 150 150 150 150 150 150 
##$DBP07= 0
##$DBPNAM0= <>
##$DBPNAM1= <>
$$ [...]
##$SUBNAM7= <"">
##$SUBNAM8= <"">
##$SUBNAM9= <"">
##$SW= 20.6930455092707
##$SWIBOX= (0..15)
0 0 3 0 0 0 0 0 0 0 0 0 0 0 0 0 
##$SW_h= 5175.983436853
##$TD= 65536
##$TD0= 1
##$TE= 683.16
##$TE2= 300
##$TE3= 300
##$TEG= 300
##$TL= (0..7)
0 120 120 120 120 120 120 120 
##$TP= (0..7)
150 150 150 150 150 150 150 150 
##$TP07= 0
##$TPNAME0= <>
##$TPNAME1= <>
##$TPNAME2= <>
##$TPNAME3= <>
##$TPNAME4= <>
##$TPNAME5= <>
##$TPNAME6= <>
##$TPNAME7= <>
##$TPOAL= (0..7)
0.5 0.5 0.5 0.5 0.5 0.5 0.5 0.5 
##$TPOFFS= (0..7)
0 0 0 0 0 0 0 0 
##$TUNHIN= 0
##$TUNHOUT= 0
##$TUNXOUT= 0
##$USERA1= <user>
##$USERA2= <user>
##$USERA3= <user>
##$USERA4= <user>
##$USERA5= <user>
##$V9= 5
##$VALIST= <valist>
##$VCLIST= <CCCCCCCCCCCCCCC>
##$VD= 0
##$VDLIST= <DDDDDDDDDDDDDDD>
##$VPLIST= <PPPPPPPPPPPPPPP>
##$VTLIST= <TTTTTTTTTTTTTTT>
##$WBST= 1024
##$WBSW= 4
##$XGAIN= (0..3)
0 0 0 0 
##$XL= 0
##$YL= 0
##$YMAX_a= 386489
##$YMIN_a= -217302
##$ZGOPTNS= <>
##$ZL1= 120
##$ZL2= 120
##$ZL3= 120
##$ZL4= 120
##$ABSF1= 16.44357
##$ABSF2= -4.249603
##$ABSG= 5
##$ABSL= 3
##$ALPHA= 0
##$AQORDER= 0
##$ASSFAC= 0
##$ASSFACI= 0
##$ASSFACX= 0
##$ASSWID= 0
##$AUNMP= <proc_1d>
##$AZFE= 0.1
##$AZFW= 0.1
##$BCFW= 0
##$BC_mod= 0
##$BYTORDP= 0
##$COROFFS= 0
##$CY= 12.5
##$DATMOD= 1
##$DC= 0
##$DFILT= <>
##$DTYPP= 0
##$F1P= 14.0000005364418
##$F2P= -0.99999901652339
##$FCOR= 0.5
##$FTSIZE= 32768
##$FT_mod= 6
##$GAMMA= 0
##$GB= 0
##$INTBC= 1
##$INTSCL= 1
##$ISEN= 128
##$LB= 0.3
##$LEV0= 0
##$LPBIN= 0
##$MAXI= 10000
##$MC2= 0
##$MEAN= 0
##$ME_mod= 0
##$MI= 0
##$NCOEF= 0
##$NC_proc= -5
##$NLEV= 6
##$NOISF1= 0
##$NOISF2= 0
##$NSP= 0
##$NTH_PI= 0
##$NZP= 0
##$OFFSET= 16.44357
##$PC= 1
##$PHC0= -49.58865
##$PHC1= 14.57985
##$PH_mod= 1
##$PKNL= yes
##$PPARMOD= 0
##$PSCAL= 4
##$PSIGN= 0
##$REVERSE= no
##$SF= 250.130019616509
##$SI= 32768
##$SIGF1= 0
##$SIGF2= 0
##$SINO= 400
##$SIOLD= 32768
##$SREGLST= <1H.CDCl3>
##$SSB= 0
##$STSI= 32768
##$STSR= 0
##$SW_p= 5175.98343685301
##$SYMM= 0
##$S_DEV= 0
##$TDeff= 65536
##$TDoff= 0
##$TI= <Analysis number 999999
Compound Code 99
Book Reference 9
Project Code 9>
##$TILT= no
##$TM1= 0
##$TM2= 0
##$TOPLEV= 0
##$USERP1= <user>
##$USERP2= <user>
##$USERP3= <user>
##$USERP4= <user>
##$USERP5= <user>
##$WDW= 1
##$XDIM= 32768
##$YMAX_p= 388719090
##$YMIN_p= -639388
$$ End of Bruker specific parameters
$$ ---------------------------------
##NTUPLES= NMR SPECTRUM
##VAR_NAME=  FREQUENCY,     SPECTRUM/REAL,   SPECTRUM/IMAG
##SYMBOL=    X,             R,               I
##VAR_TYPE=  INDEPENDENT,   DEPENDENT,       DEPENDENT
##VAR_FORM=  AFFN,          ASDF,            ASDF
##VAR_DIM=   32768,         32768,           32768
##UNITS=     HZ,            ARBITRARY UNITS, ARBITRARY UNITS
##FACTOR=    0.157963299565203, 1,           1
##FIRST=     4113.03028239666, 0,            0
##LAST=      -1062.95315445635, 0,           0
##MIN=       -1062.95315445635, -639388,     0
##MAX=       4113.03028239666, 388719090,    0
$$ Real data points
##PAGE= N=1
##DATA TABLE= (X++(R..R)), XYDATA
$$ [...]
27674 118348 53236 125768 119830 200635 59534 -65405 58961 -24597 -43196 116011 261928
27663 261928 279844 250171 133952 198522 118393 75008 140803 198222 83224 77440 206779
27652 206779 18558 113688 189000 -20106 94184 234095 261679 72347 36799 140909
27642 140909 180885 128389 51004 8217 3997 24590 73720 27255 228441 188679 -52809
27631 -52809 -130939 -63379 -184369 -137773 33839 60796 -53473 -136174 -101244 95522 195410
27620 195410 -14327 80597 200219 -10144 25614 227305 281244 151868 21698 -57832
27610 -57832 -109176 -145089 53622 -100627 18168 116527 62561 187685 211792 267267 237183
27599 237183 75888 -84479 43377 110715 202963 243144 220585 151768 133999 288779 381150
27588 381150 437285 551592 374503 90794 64510 215026 281185 201315 109780 11839 -199647
27577 -199647 -77018 -78866 -129957 -110818 -5338 114467 150162 28339 131301 182171 145114
27566 145114 161999 11871 -46611 -22099 65606 115653 94045 135522 136202 75133 192817
27555 192817 161166 271856 446095 421773 246009 153367 129524 34534 29685 109029 117837
27544 117837 156408 144170 -41300 6289 169300 205798 83801 -116832 -147429 -133041 21811
27533 21811 -91798 -113988 -25268 17036 -212229 -264427 -76684 22939 45202 -48869 50192
27522 50192 294698 285783 180124 -12264 -19666 63078 -79219 -126087 -58242 -80436 -122400
27511 -122400 -29354 12424 67199 163973 144210 81646 128952 -131889 -163187 -170421 -97992
27500 -97992 -81421 -206874 -210650 -160625 -184791 -185415 -159958 -240950 -296842 -63395 -68629 -216895
27488 -216895 -65495 267561 361730 264499 200263 139611 36630 -3877 -55342 -16773 160639
27477 160639 267654 360207 436768 389961 166758 142261 143512 94285 211427 117561 -83289
27466 -83289 -208453 -79643 -61409 -93534 53806 212928 195434 87534 -111739 -154456
27456 -154456 33170 -9786 116320 256966 327921 131295 54580 263709 157146 -66275
27446 -66275 -15093 89401 123384 73940 -17416 -18662 -44863 23237 91872 -180808 -193292
27435 -193292 13188 48265 65228 -59187 -22202 10970 28370 35082 25128 -27591 -124862
27424 -124862 -134530 -111051 -78582 -50907 -177005 -134937 -112995 -128968 -75972 62029 139841
27413 139841 238814 290982 159645 -6749 -10857 -74307 -11454 -14116 -130288 -207482 -135161
27402 -135161 77392 147881 95000 179661 153018 5354 49041 107184 174617 114828 108102
27391 108102 217431 134825 208733 89314 41411 80018 809 -58558 -41861 -136441 -85815
27380 -85815 -14835 99661 28837 -26928 53165 -86443 -189221 -222179 -249452 -201935 -147286
27369 -147286 -51188 -75354 -18782 81382 72965 200740 264360 217323 195318 100129 152157
27358 152157 145046 64126 -1439 -44162 69734 150356 67957 -59713 -225002 -157309 -86882
27347 -86882 143177 336983 263630 94894 126067 181359 28701 -30927 -124103 -53629 -214983
27336 -214983 -394957 -293551 -150059 50558 58067 46943 -4283 19678 48333 -78461 -159900
27325 -159900 -81753 -604 86828 235647 191538 133836 6916 -153573 -183811 -180415 -55273
27314 -55273 -38448 44011 40306 -43159 -135101 -99844 -119046 -12552 181343 167919 107776
27303 107776 204692 214216 63100 200646 271874 98234 -20953 -147790 82522 261646
27293 261646 269277 115711 -116812 -63350 22154 -91592 30167 102870 -78393 -69520 2753
27282 2753 -4265 -141536 -234887 -72116 54733 -20464 -19545 -93782 -203945 -111599 110312
27271 110312 -30630 7520 86304 50429 -214591 -279867 -249971 -58794 224206 212638 98401
27260 98401 -16467 67189 20333 24635 209231 326828 345240 289651 186350 183970 11269
27249 11269 69668 199995 115095 122230 69222 -123023 -21000 -83812 -154229 -136808 -158319
27238 -158319 -182694 -125976 -129619 1294 119524 97040 78061 178013 83449 -18890 -50686
27227 -50686 -37295 -17545 -27881 -27252 54383 168610 185303 221958 130617 2302 -107535
27216 -107535 -122368 -37296 54593 272899 367642 242713 243594 196434 73883 129718 144569
27205 144569 -16031 -52488 98873 -115844 -192484 -26951 101004 259867 222624 303420
27195 303420 330572 247020 134550 291645 351274 205863 340394 349066 243766 268148 199861
27184 199861 94014 106289 90099 100653 -21277 -78093 -124489 -52209 -88312 -69721 -37429
27173 -37429 -36104 -133019 -98342 -118669 -25153 163045 205039 155046 61351 18264 50609 -52908
27161 -52908 -267781 -265300 -221926 -185378 -187120 -197318 -55387 -68694 -14832 -76472 75054
27150 75054 92722 -28601 16808 155586 151600 168355 240703 227715 206133 127350 261541
27139 261541 362361 442792 423006 137798 -6162 51510 111659 187869 685 -107542
27129 -107542 -173679 -161353 -43444 -45569 -57251 -96961 -29870 70154 154462 123036 146960
27118 146960 75314 176359 184638 116039 6177 -124614 -105946 -92298 -15410 -85773 -128113
27107 -128113 -129076 -251867 -249057 -156336 -82151 56490 270033 220548 70088 12961 -53330
27096 -53330 -30173 -48785 -13317 81447 152688 202130 219075 272168 339422 292888 292592 234614
27084 234614 105334 -128608 -123304 -81421 -17844 161979 190791 144892 102758 99888 59166
27073 59166 -105949 -108651 -71061 112593 9700 -29995 42912 96926 227475 251047 220269
27062 220269 309693 305366 99529 82298 55013 -9145 -159314 -245701 -126924 -79747 -36757
27051 -36757 -40019 -16795 16449 13094 18798 35917 72646 200341 297336 208548 49797 -44979
27039 -44979 -168855 -219674 -66849 -3914 110026 130252 -55940 -178265 -141422 -73467 54566
27028 54566 26681 -96236 -92563 -23864 110283 132219 260427 149733 -50086 4550 -10864
27017 -10864 12360 235361 215780 -97720 -82421 78065 298688 307253 156909 56473 84603
27006 84603 84381 80220 62102 185112 170392 192269 117762 46716 63983 -93892 -112895 10669
26994 10669 -62995 -152325 -31022 51496 54225 180767 54181 -45250 -91037 -166994 -182767
26983 -182767 -267378 -338672 -286950 -214340 -88059 93301 111278 80238 54699 124346 229653
26972 229653 172456 181586 185860 93902 96661 27382 -24286 -1378 -63777 -118303 2213 156391
26960 156391 7811 -99838 -35401 -1410 -45276 -104417 46014 13497 110974 -47422 -52320
26949 -52320 65054 -14779 -12560 -18837 -109926 -12826 -20526 -126104 -278449 -297618 -255480 -280657
26937 -280657 -133959 -218554 -149321 93380 98430 144581 352855 159777 99571 84247 7160
26926 7160 42744 -82222 -187349 -155289 -59484 -57896 32537 6846 -31544 -100446 -114687 -19527
26914 -19527 21468 49385 128841 230893 254288 360114 366251 241109 129643 -63240 18568
26903 18568 32395 -98517 -72195 -131261 -2952 40691 -162177 -194704 -239695 -166852 -48258
26892 -48258 42551 73733 -9258 -147309 -219530 -180070 -142327 -15083 126635 116615 56517
26881 56517 115104 49207 -40729 3442 -62209 -195311 -128468 -113056 -247613 -386813 -195511
26870 -195511 94184 93284 -41140 48129 85897 -164576 -277710 -274931 -253857 -207753 7448
26859 7448 39070 -39597 -166936 -31747 -14151 18932 211098 275629 144996 148463 108531
26848 108531 10139 65946 162994 129749 54567 -4386 -123190 -73440 -90302 -152260 -133325
26837 -133325 -10447 141695 124486 192249 64009 -71617 -109350 643 15161 -47955
26827 -47955 -92239 -180052 -293132 -157742 -106046 -199350 -134531 -179066 -103776 -180529 -176912
26816 -176912 -246647 -152522 -163990 -168475 -136726 29544 16780 -122217 -68955 -107161 -158929
26805 -158929 -149548 -41181 12916 -80780 -155487 39418 64000 131839 157322 53471 61049
26794 61049 -1037 17064 -76426 -38495 137320 40728 -175225 -139758 -64815 -9675 72299
26783 72299 -8948 -149630 -131582 -191139 -153448 59938 -16556 -57414 -52882 -171329 -283415
26772 -283415 -250515 -214937 -212809 -218753 -139292 -146009 -115592 -21510 -41325 -197830 -177442 -167654
26760 -167654 -145680 -171719 -113833 -11917 13158 30853 110048 272363 199507 -19752 -71319
26749 -71319 -24043 -19048 56071 -44606 -21827 41871 127230 132578 63627 115584 175452 196557
26737 196557 202415 171998 65198 100750 318255 271369 190178 179999 209596 4029 -103243
26726 -103243 -85681 101051 20890 -25104 -40283 41343 175437 263641 384454 242564 249436
26715 249436 255471 216646 96216 52041 3730 -150248 -43245 118330 185996 115913 90772
26704 90772 93490 252969 213892 78083 70365 -6651 234533 249437 228657 212335 35804
26693 35804 -43468 155233 93412 -9874 1874 16771 -55674 -62769 -28581 -90781 -92201 -35172
26681 -35172 -48932 -58979 -36228 27286 85896 -19463 -57743 15001 25072 19625 -54191 -72116
26669 -72116 -66702 -92166 -158368 -138020 -242289 -141049 -5208 72385 35738 174479 242483
26658 242483 136646 118247 186194 335969 518917 467889 441643 447737 234066 121212 48771
26647 48771 -48222 56694 48989 32186 9788 -65267 67791 473154 525509 257352 15876
26636 15876 -246534 -316384 -161113 -58661 40527 -95746 2717 -93375 -198517 -16592
26626 -16592 -7626 -6395 -128072 -49453 -125793 -214909 -179729 -156807 -179122 -268318 -142733 -34285
26614 -34285 -92909 -74988 -45680 11437 -51345 -43721 -249090 -221748 -176264 7272 -89299
26603 -89299 -79984 -109409 -69203 82831 116259 134382 230629 218517 155566 204298 148037 95504
26591 95504 167918 -23527 132138 156351 180176 -15379 31093 98101 142314 78631 9829
26580 9829 80995 76340 -8371 -38774 -131343 40666 -36678 -119607 89019 207174 225227
26569 225227 148565 57834 20485 34079 -7394 -16917 115059 47918 -106049 -123158 -171111
26558 -171111 -57575 50307 249703 299887 166643 28042 -25465 -30212 135649 80400
26548 80400 102101 39553 -29895 62311 100743 -57899 -153127 -77650 37518 232442 466445
26537 466445 491299 212045 -11496 -36071 -97501 -119399 -63657 -108794 -126821 -96586 -7955
26526 -7955 77892 -51625 -118189 -194612 -88643 13623 51954 -17811 -186637 -303793 -143882
26515 -143882 -86886 -187053 -257103 -232579 -167874 -209382 -308707 -429363 -318205 -250787 -277845
26504 -277845 -318822 -261362 -192546 -170364 38959 188648 164993 183677 38495 -17597 81740
26493 81740 -34207 -21897 85350 167820 229946 10061 -3882 150278 240639 135595 55106
26482 55106 90009 15509 73744 75890 149169 -81200 -135978 -86437 -16603 12985 28003 96390
26470 96390 69777 117209 85248 165553 -22488 2625 2429 106483 132332 62004 77731 32722
26458 32722 6974 -75584 -69217 -71228 -97867 -55712 -153060 -86250 17318 134438 -48165
26447 -48165 -223892 -387379 -310195 -86593 -15098 -123018 -154529 -80291 -72706 -28023 -102159
26436 -102159 -181078 -68157 59690 4199 -39918 -65714 64598 275326 397654 329720
26426 329720 213340 63499 -293806 -269269 -81214 -15369 20345 -29944 -61797 -52513 23881
26415 23881 93994 93703 -68100 -246527 -178573 -55916 -184484 -252142 -70835 31519 143446
26404 143446 227867 202328 145796 177284 335188 412693 316566 98462 -115700 -106209 -30160
26393 -30160 57890 92093 27235 -38061 68787 70731 32855 -139097 -139784 -62432 57639 128145
26381 128145 201662 295443 235716 300042 115776 21650 -62409 -52513 38982 -179050 -103419
26370 -103419 -2405 101496 217673 267495 61313 -186123 -214762 -255031 -161646 -7436
26360 -7436 104832 139264 60422 -54932 84360 158622 180476 192187 221700 37978 160472
26349 160472 167731 188742 222009 100519 -83612 -75316 -99680 -38995 -115394 -57435 -32186
26338 -32186 -105954 -141315 -85781 68369 97989 72788 -66655 1882 -122846 -130535 15171
26327 15171 -66140 -105196 -278461 -356444 -118213 -144920 -219903 -273219 -170158 133795 86402
26316 86402 114262 58335 94623 96266 104851 37467 15768 89682 60261 2070 121703 315611
26304 315611 221515 102322 48208 233860 241079 12862 -33565 153334 166902 352106 222366
26293 222366 120083 110803 148850 143983 148651 14943 -68952 -169936 -74388 -239514 -422612
26282 -422612 -329300 -189094 -1419 61655 -42391 -61995 17323 43914 12643 -19554 -124484
26271 -124484 -340268 -361166 -280916 -230752 -14117 326673 400690 295523 299806 283301 107511
26260 107511 -169514 -49665 40947 -33002 94949 199740 81216 112645 55065 128606
26250 128606 166535 200972 331185 347702 234447 167402 10260 -39948 -147742 -173257 5240
26239 5240 -20437 -107779 -213818 -287541 -135605 -122266 -133284 21917 120481 21676 -19861
26228 -19861 -80339 -211102 -257658 -174256 -17644 -69870 -3014 -48503 -128604 17969 103594
26217 103594 -35921 -203237 -192328 -305740 -535871 -372743 -135004 -161320 -149184 -115568
26207 -115568 -190253 -283982 -284640 -309162 -264470 -281909 -228827 56578 381296 471724 325660
26196 325660 73827 -55731 -39034 -36452 -43163 -30164 -59500 -104570 -90084 -8203 94109
26185 94109 -39163 -95803 -86071 2321 54962 -2480 -111825 -87302 -55214 -61629 85388
26174 85388 1393 -59057 -24138 63769 75220 235478 164823 -50138 -124253 -27709 -28465 -45524
26162 -45524 -50170 -76711 34477 37456 20199 -64937 -103239 -215177 -327658 -304609 -238560
26151 -238560 -113858 -203760 -105698 99709 87270 -16721 -152543 -123693 118322 227992
26141 227992 141608 245106 310888 194184 184586 196252 89571 98479 46338 26800 7144
26130 7144 -168333 -130922 -39014 69284 163059 312397 290360 214416 -21861 -41433 -78267
26119 -78267 -158364 -50144 102455 152010 243269 418750 431104 380622 87701 14570 34000
26108 34000 42253 -6150 -139882 -223036 -180923 -56251 38410 11604 -55166 8996 119264
26097 119264 230026 206493 74459 -3258 -81889 -147758 -90488 -21962 99211 147769 156977
26086 156977 67512 14692 8917 -15744 44564 -142185 -291482 -188630 12698 125259 278146
26075 278146 265329 183869 239011 136399 67685 92123 175726 154646 113945 54491 -6312
26064 -6312 -188838 -97700 -144659 -224639 -73559 53185 55765 43200 99970 99234 4868 -134691
26052 -134691 -198217 -173692 -148211 -108951 -122043 -110849 -118383 -78548 28718 -89316 -116088
26041 -116088 4202 -87556 -113984 -79820 -24068 18297 115185 126489 -61966 -266771 -218778
26030 -218778 -109651 -70085 -110967 -203156 -285223 -358147 884 183610 106990 133481 265625
26019 265625 168043 -29451 -109751 -271225 -401029 -316450 -322806 -116121 -21006 52563 71597
26008 71597 209421 172303 176664 208392 173205 52701 24057 103278 176906 206963 144244
25997 144244 35879 77662 -91391 -59865 191496 420388 313951 115142 50766 -78857
25987 -78857 -165690 19882 59532 -16920 56702 22007 63160 -39159 -162155 -275862 -158923
25976 -158923 -183085 -249781 -67459 197169 210937 130021 29881 -145151 -65955 -20450 -21826
25965 -21826 -208408 -480005 -452530 -307949 -139286 -37116 33966 -69776 -100705 -116880
25955 -116880 -108316 46117 123114 137753 26847 -78833 72061 163966 27468 -41749 -8788
25944 -8788 31775 4333 52715 74950 112542 82322 -42052 43249 83348 -15441 -24347 -5675
25932 -5675 208959 179678 150537 84216 95131 55819 -112460 23076 189426 223119 66636
25921 66636 -52101 -97771 -138589 -162679 -108353 -199571 -313672 -436472 -294354 -275451 -289941
25910 -289941 -108851 -90154 -277271 -274348 -176279 -296331 -302434 -201757 -199675 -265391 -265009 -33091
25898 -33091 284803 197350 -16304 -83036 -152718 -151328 -104353 -37424 -105983 -262716 -138459
25887 -138459 -142497 -216612 -74980 85146 -12367 33413 -45075 -86569 -83116 -121901 -116612 6195
25875 6195 14951 -72759 -191840 -160151 161069 309867 145771 -32737 -95820 -91114 -190360
25864 -190360 -210347 -73440 -11836 111400 -80973 -196869 -278366 -169055 -171902 -80284 -272753
25853 -272753 -282763 -267193 -205675 -110022 -175925 -194019 -144333 -22573 -55600 -63623 -145584
25842 -145584 -256743 -224459 -384006 -391223 -318816 -140691 -146441 -214685 26249 129931 -39546
25831 -39546 -216873 -148111 26933 43384 -24842 -23760 -197434 -246456 -446970 -376508 -293848
25820 -293848 -76502 -61176 -106996 39665 80141 98669 178375 170582 68200 -80810 -137704
25809 -137704 -299707 -185095 -82460 54175 81405 81430 -41447 25549 -3427 93465 144939
25798 144939 231360 280426 208218 -24122 -4468 -42237 3151 185004 380511 267301 341725
25787 341725 343939 344297 141777 -132957 -237092 -210978 23888 121799 131937 178740 137866
25776 137866 105418 154961 161063 131444 83092 -55420 -167414 -219207 79668 253781 293421
25765 293421 315329 156819 -14947 -99502 68853 169247 66998 -40320 -67090 -305221
25755 -305221 -324366 -187094 -105596 69826 132579 62724 196949 286614 28839 -49547 -58351
25744 -58351 -5970 10456 111963 46683 6688 -142335 -181229 -137565 -314433 -184942 -193132
25733 -193132 -172928 -66517 36787 18735 68260 122890 -5626 58770 113884 58565 -102237
25722 -102237 -93787 -12979 -148041 -213362 -197197 -204009 -132211 -124852 85707 399593 493911
25711 493911 260051 100597 -39902 -228740 -357321 -214360 -186699 -111546 -61357 -170597
25701 -170597 -167307 -110738 2384 87725 -137594 -195426 -307406 -202665 -145853 -42157 113167
25690 113167 44124 23240 -60099 -131492 -36299 -108353 -135568 -200626 -88652 -164542 -176281
25679 -176281 -140319 -50833 -175396 -300158 -179363 -3662 24469 30424 -14205 -62826 -211760
25668 -211760 -353743 -336345 -389134 -317243 -77852 123926 49569 -770 14815 -167831 -119657
25657 -119657 139844 79772 -136833 -254999 -240675 -159556 -129014 -74882 -273905 -194422 -164246
25646 -164246 -45160 97284 158687 203734 104271 -129918 -165908 -69716 -82784 -344241 -438799
25635 -438799 -349862 -129306 -98267 -30225 -14040 -160508 -124872 -1594 37421 -105108 -78605
25624 -78605 -4766 129382 262237 288726 160672 223170 132961 53105 -122891 -316645 -270003
25613 -270003 -279313 -187554 -34818 -34142 -62010 -179400 -357285 -314261 -189736 -201640 -100458
25602 -100458 -85194 67900 130691 -88712 -165221 -153555 -267763 -379124 -232163 -143814
25592 -143814 -95037 -73602 -18633 56522 19543 -112769 -286646 -235745 -146964 -36890 41411
25581 41411 108344 84108 151490 164466 93901 98557 150759 112428 93878 14058 -88111 -162452
25569 -162452 -86894 123074 186918 -33135 -100598 -94889 72944 226786 69793 46390 -82429
25558 -82429 -244371 -266187 -305817 -177616 -209305 -302247 -185073 99042 233805 156756 254404
25547 254404 272806 184179 88747 9466 -9870 -235819 -11505 200821 70272 -529 127015
25536 127015 301595 388678 417684 196837 196015 231045 14521 -89950 59376 194514 -8216
25525 -8216 -291691 -214179 -80415 -65896 53087 -11770 -133280 -78582 -161272 -121916 -4181
25514 -4181 191169 156492 193461 138638 82914 121520 228130 272553 191692 38024 -31537
25503 -31537 -78960 87080 117064 4246 -171253 -98716 -80883 -95856 -77039 -42038 64887
25492 64887 143015 140892 178492 142702 83395 88134 51926 -66564 -35932 46025 24289 25150
25480 25150 88717 149297 7231 -139992 -193563 -33489 181092 217944 67371 -27974 184335
25469 184335 335111 203342 91907 1910 -151366 3255 189309 218919 353639 340301
25459 340301 189665 134433 -24649 79712 58657 65275 4318 -201426 -252681 -183492 -188679
25448 -188679 -36825 -80538 -53438 3270 2219 56395 222376 256780 1047 -215575 -177525
25437 -177525 -106298 -192190 -137513 128195 108877 -79859 -174064 -176852 16378 207884 168325
25426 168325 146719 1659 -118835 -63321 -185006 -245475 -153514 -206574 -286851 -360302 -300085
25415 -300085 -151581 -248478 -310512 -141731 -15796 -64951 -161057 -131399 112418 147178 88285
25404 88285 -22045 -96490 -53204 43721 -22095 -97918 -76525 40587 2419 -74051 -80116
25393 -80116 -216931 -166537 -252414 -313813 -348704 -271850 -249962 -356400 -313099 -222879 -258452
25382 -258452 -281834 -377279 -143122 -61905 -134651 -314032 -305616 -95543 159227 212532 269521
25371 269521 161540 -15933 30879 60560 69496 78733 140138 183358 222304 148924 30019
25360 30019 -36517 63869 170285 79650 -33527 14418 103286 154258 161448 86209 -13577
25349 -13577 171258 150554 19284 -86758 -171739 -89756 -58507 -92219 -218307 -214452 -150831
25338 -150831 35171 90946 -33435 -107789 -154785 -178347 -17353 -12310 81479 175864 -44773
25327 -44773 -93997 38250 56247 -52527 -123002 -133342 -24354 43615 35792 -85115 14767
25316 14767 -97404 -184706 -161303 -24166 77135 -4537 -131992 -171859 -235520 -229039 -101793
25305 -101793 -47741 -222814 -343577 -244925 -56709 -2004 102518 164691 217720 227099 -251
25294 -251 -23013 -31215 -503 265925 358399 277129 170784 53889 79065 180668 136790
25283 136790 -124948 -102765 -106250 -108604 -37251 -98547 8390 120996 124593 -78551 -230995
25272 -230995 -133496 -24070 93055 204211 160284 9322 29112 104038 79297 71110 56241
25261 56241 -159108 -135807 -38389 -97611 -115063 -169085 -294438 -233372 -198960 -263018 -69533
25250 -69533 22608 -223549 -228677 -107686 45841 149951 348711 317442 -3330 -223090
25240 -223090 -214108 -141433 -195806 -182227 -266933 -192919 31370 42518 -140345 -290761 -264426
25229 -264426 -80328 -11450 38871 63103 73537 81510 88674 -46472 -169608 -105514 -128876
25218 -128876 -77474 -28426 -35000 34707 99333 -44745 -97719 5366 45401 61930 190294
25207 190294 183484 107693 121772 136175 106958 -72923 -221906 -155471 -133027 117011 257746
25196 257746 50441 -77579 -69448 85841 186428 173839 173926 108104 50494 -91908 6685
25185 6685 96144 -50933 -183395 -36250 62796 138120 100830 39040 34168 110274 200988
25174 200988 315784 268547 14455 -31707 -100325 -99440 -88824 -24211 143408 159514 74955
25163 74955 100527 52721 195243 405447 483482 325237 165609 90275 38811 99051 192728
25152 192728 147261 78820 -62484 -56763 45699 58738 -66329 -145875 -93482 -33498 -32171
25141 -32171 -111314 -131152 431 155553 157016 66183 101024 170135 282825 227980 17473
25130 17473 -120118 -729 -28672 -13554 32580 41076 -69044 -7680 -197751 -365482 -266237
25119 -266237 -175831 -144444 -181394 -168243 -132769 -92097 56879 44655 -93148 -308025 -357121
25108 -357121 -169412 -166533 3575 30118 -44066 208616 244862 211602 192026 119214 -18667
25097 -18667 -90801 -79162 -64801 122469 200293 124589 -36853 -30431 62305 21254 -107924
25086 -107924 -20899 113297 161542 68357 168504 306234 239790 144578 60158 -217607 -252623
25075 -252623 -269502 -101331 21475 40355 201119 241865 131830 46694 16094 -57698 -24980
25064 -24980 -184979 -141371 50701 225834 317453 361264 424075 460765 277914 13670 -10727
25053 -10727 30395 188505 160263 -58812 -100826 26224 196294 237733 152409 39828 -92082
25042 -92082 -188814 -271542 -150623 43643 190871 125302 6212 87539 272141 230969 148627
25031 148627 191113 212755 208778 199736 243991 198153 112220 -9822 22397 109072 30810 126052
25019 126052 -23415 -152566 -20961 -63664 -215768 -331225 -446643 -273928 -311740 -328904
25009 -328904 -117510 -56873 -156138 -121837 -65407 85969 68216 72742 178703 114801 50922
24998 50922 68858 40871 4797 -146665 -208675 -220877 -154252 -185047 -195045 -157305 -110449 -37389
24986 -37389 -66434 -213745 -316711 -356747 -322597 -256862 -112428 67971 -7346 -144415 -39047
24975 -39047 -17065 -95704 -150366 -93610 -27938 -136206 -56344 62096 125840 -36692 -173434
24964 -173434 -350935 -194333 43889 161922 275515 99593 -81718 -118733 -153429 -192818
24954 -192818 -283791 -84253 37397 -44330 -145321 -156492 -133944 -68228 -132845 -133041 -111606
24943 -111606 -67143 38803 12214 -4859 504 -24301 -131533 -113145 -142601 -89706 -187739
24932 -187739 -152786 -15390 58359 -24341 68241 49398 -56831 -96286 -192710 -214692 -120001
24921 -120001 -66138 -10316 134997 77167 50082 24459 -58740 -65109 -3401 11173 24076
24910 24076 63179 56693 173508 99841 180748 284723 119047 73408 -111008 -310473 -219327
24899 -219327 61583 337675 219132 174998 168113 178609 130224 -64981 -18291 102732 178540
24888 178540 328706 228129 133538 128098 108715 97402 171928 143181 96532 12099 99285
24877 99285 115664 60853 -5116 -53225 92115 173710 223413 306739 425206 251120 163928
24866 163928 99215 20710 -103355 12264 181819 52615 -43167 -83023 -155213 -184718 -280959
24855 -280959 -274171 -205659 -179248 -71690 172730 278234 135368 91487 289355 205555 56443
24844 56443 31442 160768 170531 -95749 -28010 47250 41415 -177853 -196444 -114428 -205848
24833 -205848 -84300 153375 177838 156065 15661 -126744 -31602 52801 231536 111174
24823 111174 -155228 27278 155972 12664 -144220 -166052 -54065 58348 114086 -132771
24813 -132771 -155812 -2415 -8007 -48147 -162899 -101675 -297040 -294438 -257969 -18374 77261
24802 77261 -2930 -197245 -298453 -162839 9704 154323 128102 35359 -93699 -171862
24792 -171862 -47785 117225 114855 11436 53423 45835 -48121 39484 148240 119848 114617
24781 114617 154158 97154 154740 287942 15175 -215665 -163254 -70873 -44236 -46069 -133866
24770 -133866 -228599 -149528 -67139 -125904 -111091 -90332 -42546 -4874 -137773 -174601 -21618
24759 -21618 90485 -18921 -117879 -95109 16713 104041 123422 62822 176903 265757 26943
24748 26943 -63388 -120394 -58458 -60229 -188937 -214553 -37892 156542 152964 251343 -49623
24737 -49623 -189029 -183902 116537 380250 501759 351320 398365 382737 339868 318038 3826
24726 3826 -161211 -62966 9759 -99890 -4598 188519 101190 99340 15975 -20005 -81827
24715 -81827 8565 23103 1885 33945 134799 9422 -145515 -91388 -141119 -93381 -64435
24704 -64435 -28609 125976 224472 215037 184177 -98412 -101233 -33603 -1143 -71087 33752
24693 33752 -34039 -106440 -93536 -38528 -43977 57249 -21297 -70944 -38653 -119885 -31821 38420
24681 38420 191019 130729 14228 -173009 -238733 -144510 -59481 -47585 -182280 -264547 -235065
24670 -235065 -28880 63241 -67990 -148040 -249725 -216354 -73334 -120178 -160731 -309499
24660 -309499 -209512 59600 153605 198302 65640 86586 98463 3910 -125141 -86738 -108303
24649 -108303 -215676 -390595 -394969 -442647 -342652 -8142 51626 -187214 -318030 -207949
24639 -207949 -2882 97576 233800 171789 69725 164232 474004 406624 250199 138997
24629 138997 110292 105117 121991 19806 -37624 48785 59354 3694 119743 197213 226994
24618 226994 200425 243190 164738 97262 12508 30112 -46154 30998 112248 54592 13770
24607 13770 -30438 -93310 -118653 58028 124183 171799 29386 -40379 85530 153803 159374
24596 159374 89146 74061 -103978 -239913 -248921 -333833 -237649 -110784 22996 74483 -101146
24585 -101146 -171824 -136169 -55633 -141870 -276152 -309342 -246150 -277180 -250616 -72193 -60945
24574 -60945 -260305 -324048 -417193 -527392 -281952 -88219 -90254 -87141 -178362 -161772 -51212
24563 -51212 89872 141439 -28724 -76779 12144 193570 169685 -69379 -7621 50037 -11014
24552 -11014 29732 -17165 278895 347901 192033 128541 -41193 -171328 -244125 -212841 -143703
24541 -143703 3984 45305 -16956 -40840 -96853 -133604 -161161 -115763 -15786 -59622 -174133
24530 -174133 -116293 -129227 -120885 31355 94439 35353 -95530 -169167 58877 239013 305408
24519 305408 205282 134705 -14994 -61503 22191 -77549 -117943 -38059 100374 107553 43969
24508 43969 -29584 -141058 -200540 -256177 -217437 -203544 -175259 -159008 -60243 -93076 -25066
24497 -25066 -102165 -133111 -50205 189790 146389 60447 -46996 11972 2947 -9467 -69725
24486 -69725 27314 31997 12423 -24291 -99505 -120238 -118920 -54102 -163329 -147393 -127082 -140161
24474 -140161 8321 25027 -67771 -137709 -234222 -72326 -83849 78134 198781 125195 27879
24463 27879 -50469 -240035 -305813 -104963 30945 61579 77048 42950 43253 56749 124636
24452 124636 219701 132914 156246 -21998 -128328 -1586 116501 41811 -127782 -62493
24442 -62493 41629 74014 8128 98181 197722 118903 83030 157640 237829 278737 276721 193772
24430 193772 130675 19843 -126914 -46264 1208 65741 12589 -63918 -50093 5976 -23215
24419 -23215 -62269 -114156 -39713 -97545 -142269 -88422 43498 1596 45923 47142 90359 87134
24407 87134 123351 177697 256431 205444 158954 152737 218874 178038 134738 296523 222502 -30667
24395 -30667 -171742 -165813 -180918 -171283 -36346 25647 90333 70723 41316 62011 132282 1096
24383 1096 -117137 -128221 -68139 -88055 8819 60101 161530 153646 142104 44249 -50352 -82721
24371 -82721 55067 99086 21220 141344 266985 128151 63002 -130112 -150398 -115283 -62272
24360 -62272 244059 304542 99898 33482 -44399 -23687 84348 260839 170657 16999 -73871
24349 -73871 97557 163695 119658 90872 21025 111498 213940 180037 85741 164836 140891
24338 140891 123347 91969 112982 54884 165659 178046 172978 39291 -110912 -74852 -52810
24327 -52810 -147817 -29459 162170 155265 80800 37954 15165 -120805 -225949 -253100 -195197
24316 -195197 -214053 -132309 -92413 -94624 -25850 -77478 -239111 -116426 -4535 84595 10186
24305 10186 88638 119967 200442 283742 247156 279375 233211 43065 -25326 -108120 -214260
24294 -214260 -139924 -219661 -203411 -107477 40807 -2409 -247247 -267769 -186186 -174029 -95579
24283 -95579 80396 -17440 -151879 -105098 -23252 37230 55665 14363 -13201 -151511 -194057
24272 -194057 -64225 -36771 47721 25608 63222 113109 163559 132032 43047 100817 186770
24261 186770 221298 263560 217916 142081 147094 152890 9397 -156652 -107709 -47487 13215
24250 13215 -24206 -76827 -235351 -222888 -152419 -116962 -115011 -144054 -136685 -98263 -44442 -127856
24238 -127856 -150134 -101205 -24349 -2087 177335 274111 125895 -3965 -18103 46727 247078
24227 247078 100540 28533 104310 37178 -161957 -149413 -20497 -88381 8956 -59045 -46104
24216 -46104 -4197 -80187 -131936 -213688 -361751 -306137 -197385 -243963 -143128 -56292 -32997
24205 -32997 108971 -91256 -117151 -147387 -137758 -40225 107969 265389 289370 296652 203787
24194 203787 117464 -15592 -76158 -161829 -286634 -246522 -118357 -127271 -148871 -166484 -36190
24183 -36190 -101001 36929 120501 17257 -133474 -191201 -89704 -10582 185115 154538 313102
24172 313102 343854 94392 21260 117147 190246 234473 155857 93901 123070 200426 60170
24161 60170 -57994 -53961 -84986 -47516 119018 151993 172737 67705 -84674 -100140 -116197
24150 -116197 -53403 -106113 -63016 -39034 10550 49540 109151 102066 55133 62890 173813 144204
24138 144204 -30217 -90565 -191544 -288251 -253805 -4523 211131 244354 195296 32208
24128 32208 206115 371168 330254 266352 47347 33637 116085 220051 191213 117189 209045
24117 209045 252729 316938 285123 103340 -37874 103503 -16950 -81243 13337 87444 59716
24106 59716 -33847 -88711 58128 97942 21185 -26786 38668 114490 142901 145411 157283 209289
24094 209289 170360 198264 62449 34585 -56439 -199697 -181308 -175130 -49458 -136277 -61262
24083 -61262 7048 -19558 64256 174872 264746 325093 277948 247146 132549 125404 154780
24072 154780 294598 306767 257146 26474 -79305 -61715 56572 66985 78791 241393
24062 241393 418612 377897 189814 101473 -19359 -8746 109975 -71198 -123170 -232971
24052 -232971 -335089 -212510 -194439 -75532 56746 121708 -43175 -28920 -41307 -41580 -10652
24041 -10652 -49864 -34654 23753 26002 -115938 -302080 -228930 -13290 115432 154960 -74236
24030 -74236 -223394 -288877 -181645 -87534 -174261 -155136 -129587 -127010 -74467 -98053 34771
24019 34771 241206 153733 170699 125977 23337 100613 86966 91942 26146 -64937 -305024
24008 -305024 -291512 -103239 12737 1010 -143881 -388969 -328093 -152985 -23789 -161675
23998 -161675 -219990 -199121 -62757 -37655 -103542 -110897 -104691 -248695 -167359 -140795 -49197
23987 -49197 -19611 -69974 148331 352309 215830 72759 -45614 -18392 58744 72382 -130728
23976 -130728 -199802 -125662 -14989 -111755 -38038 43056 -116505 -276193 -96693 -74840 -1583
23965 -1583 12726 -67776 -99919 -154158 -220505 -174413 -127103 38601 21268 -16155 50019 10389
23953 10389 -135404 -215068 -78810 136557 245593 426213 406099 386783 315382 -44672
23943 -44672 -30572 13679 70225 13445 6548 84374 72369 -54562 -112215 -172051 -2633
23932 -2633 55929 121814 126122 133252 108374 -19257 -229176 -280064 -191666 -367140 -461272 -522258
23920 -522258 -280703 -207662 -222169 41906 154447 -6003 -150685 -288035 -330277 -275757
23910 -275757 -282859 -329613 -301381 -416489 -187196 -69898 -85423 -63476 -213921 -263594 -221500
23899 -221500 -259313 -81150 165275 86971 -54616 -53753 20697 2192 22655 6513 -83656
23888 -83656 -64158 68478 85727 50374 19324 200881 386948 283025 258406 152353 63930
23877 63930 52110 70053 88947 -53207 -137336 -121989 -144406 -195833 -77393 -180152 -206071
23866 -206071 -158245 -250982 -220702 -278687 -159144 -115012 -154939 -76440 159493 158360 77797
23855 77797 40268 66200 24445 209524 233655 106673 -16044 -105092 -138942 -74909 -23970
23844 -23970 -196464 -154305 -187106 -175655 -392999 -340673 -163552 -104826 -192645 -110908 -37710
23833 -37710 22060 60162 63623 107636 -91272 -158824 14942 8549 89413 118890 130481 226262
23821 226262 209118 109046 161088 306601 160650 122853 12126 -172247 -43889 43337
23811 43337 94699 84636 219715 178550 -20404 -143393 -170424 -151886 -185666 -79786 -93375
23800 -93375 -84463 -50185 6653 14362 173638 223393 267199 255231 164927 104057 -21897 87314
23788 87314 114245 61726 37796 56743 44310 -161707 -269711 -206754 -108926 -59621 -68215
23777 -68215 -78381 -90606 -70073 -26206 37049 -158756 -224282 -217836 -158859 -1200 88763
23766 88763 147110 45812 -33800 -21414 -55365 114694 166115 167460 113708 53301 30414
23755 30414 -148467 -224853 -110765 -16711 85753 131322 -45121 -228205 -233950 -220541 -207474
23744 -207474 -98934 50286 51381 65265 -49390 -31925 1377 -17430 -157158 -144869 -31844
23733 -31844 -38965 -25124 -19450 -139198 -299942 -99757 -92181 -214058 -169504 -23462 -107823
23722 -107823 3391 52429 -22480 -87803 -110277 -110433 -14730 6099 -5194 -76410 -249742
23711 -249742 -334065 -212596 -113900 -119359 -44998 34279 -96259 -232442 -122302 29499 86404
23700 86404 24876 23011 -9953 -152942 -313015 -319902 -239044 -200610 -134681 -155914 -236144 -101052
23688 -101052 -44453 -74025 -296263 -355512 -185465 -39303 176482 243652 237303 150052 109904
23677 109904 -88776 -225182 -286350 -174588 -56690 -57569 -35851 78916 97267 -123820 78779
23666 78779 282049 277166 235867 211354 206570 105770 249750 218909 57419 127739 80808
23655 80808 -73483 -146326 -157429 -176859 -7330 66328 81217 26043 -3750 -77138 -160596
23644 -160596 -113171 -196142 -255760 -140500 -104764 -84685 -147075 -187867 -280071 -315299 -311633
23633 -311633 -352570 -222076 -101712 -38662 23227 28539 -29504 -128312 -135829 -127794 -170804 82311
23621 82311 152691 179845 209578 166632 133922 75363 64020 -24846 -164974 -113652 -120758 -123251
23609 -123251 -116915 -71761 -70910 -131969 -250519 -160801 -73911 35415 -40514 -9433 7570 -258602
23597 -258602 -270849 -47341 -411 224130 186564 -151237 -262744 -162513 -142942 -255469
23587 -255469 -138110 26791 133534 111470 75890 92445 114264 -33562 5839 77978 95656
23576 95656 301921 244072 172190 243884 92269 -88059 -139533 -1405 -83745 -199268 -115302
23565 -115302 47839 -64521 -290602 -341065 -197469 -147427 -145568 -148593 -8381 48463 38974
23554 38974 -97126 -30246 -10707 107887 113341 45504 8998 -127079 -107905 -38190 -24469
23543 -24469 -67254 -218598 -350265 -358391 -60915 -77867 -109518 -128259 -155650 -2119 122404
23532 122404 11315 -9114 55342 39522 123335 160298 138684 194574 129139 40962 -62235
23521 -62235 -131452 -126076 -93531 -215667 -278930 -189142 -13015 80812 181831 78237 -31833
23510 -31833 -143196 -193250 -87888 -1127 97364 11426 -5995 155122 317281 168170 55733
23499 55733 -56747 -40480 -197007 -360041 -343886 -303387 -301706 -143389 -77152 -141740 -114468
23488 -114468 -5668 -32765 -4014 175743 150439 123425 64326 -30014 -225278 -370627 -161055
23477 -161055 -213871 -218484 -142201 -233541 -10978 -18260 -207555 -234498 -81820 -30062 26739
23466 26739 245736 95302 -61909 -20823 -137094 9258 36794 94034 226062 112946
23456 112946 -151338 -242936 -152538 -94677 -107936 -187493 -233426 -188343 -59889 41925 1068
23445 1068 -111321 -170325 -196356 -212878 -222466 -133949 1797 -6934 -58754 -82973 33738 70867
23433 70867 82692 99530 -81667 -194034 -153949 -104664 73127 88911 66151 29102 -38152
23422 -38152 44492 164926 189550 20158 52475 120976 84603 108463 -342 -234099 -112073
23411 -112073 127757 37607 -37077 180865 210621 200515 247267 193815 148722 193224 119166
23400 119166 37938 -24756 115761 246871 219935 -32791 -221856 -147320 -73693 72186
23390 72186 53722 41800 -39752 -68369 -16406 -9028 -28282 26090 83020 180221 278991 227063
23378 227063 156403 195062 166123 91237 -14602 -50534 -268376 -326272 -303940 -82825 9767
23367 9767 -146349 -322622 -226292 -76863 -101055 -33433 59684 -12957 -61785 -77894 34337
23356 34337 -7807 -92314 -158993 -42458 31773 -50061 -112908 -113252 -56523 -18634 -16012 -21800
23344 -21800 -83473 -25389 -114480 -151982 -77472 60764 9566 55523 180812 334882 108679
23333 108679 -85200 -51160 53173 65895 208873 366099 266736 120658 -16995 -41208
23323 -41208 103371 142783 98696 -28974 5950 66457 41934 54703 -103858 -118093 55725
23312 55725 111451 17520 -134275 -122612 33615 81931 60181 173784 241720 316599 323794
23301 323794 397071 473109 356844 304170 203743 174814 224548 46549 62012 168285 167548
23290 167548 101930 53000 -112086 47214 99518 102801 125592 -33465 -13597 -95080 -174971
23279 -174971 -76803 8513 -11310 -21347 -1721 -16716 -75476 19104 40495 124812 53133
23268 53133 -43739 -212043 -154098 -82250 -103984 -240283 -240193 -94765 -43325 -58692 78841
23257 78841 143279 175568 154321 300475 273329 243647 396272 153306 -118502 -31013 -67917
23246 -67917 -28303 161112 154132 -28121 -179628 -29471 -13588 -115842 13092 660 110962
23235 110962 240190 371653 207086 87170 -162847 -150250 38182 32844 -16768 -40228
23225 -40228 112306 98300 -32603 -86093 -73822 -26789 -11087 -28569 -1473 -157912 -178762
23214 -178762 -122332 2372 -2943 -190289 -116097 -212117 -325837 -206995 -80140 86413
23204 86413 42983 -40591 -52658 -10191 -88827 -137149 -5772 2758 26123 53216 -2000 79634
23192 79634 -6790 -216198 -225859 -5720 46912 29422 62243 55473 94768 231035 415178
23181 415178 514099 310568 237674 342213 215249 -60925 -16838 218992 164757 114834
23171 114834 18614 -130623 -183928 -19377 71883 -35534 -116208 -12087 57240 136975 68944
23160 68944 49895 -23875 -3233 -51900 -76730 -81835 -177302 -108472 -99401 -23320 54240 10066
23148 10066 72628 285614 313698 215347 134554 116574 87159 26781 -95219 -138979 76862
23137 76862 75708 -25572 -164508 -159484 -44219 -13708 -92398 -159644 -184806 -172382 -116998
23126 -116998 -86936 -85058 -167260 -211666 -140140 47820 203321 76784 96209 121788 23874
23115 23874 -113168 -49793 -14340 5816 -26023 31619 161694 54 -168773 -179953 58138
23104 58138 252135 371080 303481 136190 -47550 -131006 -29461 -70096 29414 22407 1823
23093 1823 -33225 -190222 -18128 5337 -41566 -49509 115461 16996 -39953 -32776 88669
23082 88669 87104 2305 -32975 -56232 -118990 -130544 -175956 -222957 -280526 -311923 -118374 -32562
23070 -32562 -90050 -20428 -92545 -242324 -217269 -63746 36640 139858 232289 163152 249453
23059 249453 205529 178201 312673 243005 86429 161434 161068 56963 183404 98681 -162423
23048 -162423 -232315 -177533 -18466 169413 60921 33232 113825 86910 -33926 -5655 119757
23037 119757 131652 173792 64736 102471 151604 213718 118410 199185 269188 128452 52406
23026 52406 -22637 -83708 -62603 79941 234413 281951 255090 195710 262446 54239 79962
23015 79962 306445 153745 -48547 116068 88373 -19436 -51892 -188473 -296420 -282934
23005 -282934 -271916 -208902 17321 179439 223952 102101 16224 48186 125357 117253 145586
22994 145586 59416 179978 353349 382401 179812 124557 18947 -132591 -141715 -99584 -38129
22983 -38129 -13055 -27742 21147 28904 -49103 29239 86007 71846 153487 193393 247316 173890
22971 173890 33852 92985 107887 72889 -19512 7400 44501 -60195 -97269 -126446 -103521
22960 -103521 -153082 -109291 -132142 -78171 -18904 108525 83269 151022 -18195 -162304 -155801
22949 -155801 -171055 -94325 48914 -73613 -121663 -64917 -23502 3931 -45481 569 10623
22938 10623 -91362 -223043 -268686 -228625 -63907 123707 228662 307802 226809 46879
22928 46879 91527 140362 76482 -136542 -295359 -272162 -135591 46556 13135 -71080 -57358
22917 -57358 -174383 -295296 -215648 -161186 -133098 -3717 -73865 -32350 6290 -116927 -167230
22906 -167230 -174634 -95130 -72363 -180030 -229591 -198518 -120651 37748 238300 293833 308605
22895 308605 310377 228541 187484 106588 76670 71515 -97312 -224570 -300792 -268079 -214181
22884 -214181 -175775 25235 -37946 -135599 11646 -166636 -251362 -195750 -158238 -95875 -126127
22873 -126127 -102567 -134759 -91437 -49959 8695 45275 2132 -35500 -182239 -131080 -47360
22862 -47360 -45966 -125973 -158345 19695 82221 205878 383970 360426 232661 207077 257460
22851 257460 220367 91137 39730 138300 85358 -133260 -313986 -326484 -151712 -11524
22841 -11524 103826 -66582 -314970 -112561 68400 3686 -115769 -122484 -153108 -97462 -76075
22830 -76075 -162555 -46382 99031 96323 63087 85631 -98325 -299522 -216829 -47110 -5552
22819 -5552 -60340 -188049 -178734 -103673 -121040 44869 131969 67944 101706 -69946 -48044
22808 -48044 138 123900 -25954 -117114 -129385 141955 122687 -74538 -185315 -26381
22798 -26381 152343 162501 208856 376596 289566 147234 107274 94974 -101076 -131695 -106391
22787 -106391 2947 -34862 -132415 -116513 92199 323851 171657 125432 52224 -41908 -47658
22776 -47658 21152 -12162 -228865 -192944 -103866 -115486 -66267 27964 -65297 -95924 -123543
22765 -123543 -10289 196969 257364 249 -130494 -44138 -35132 -72119 32579 -11052 -139303
22754 -139303 -165532 17222 157790 210041 172132 140068 -48609 -47822 2818 -129054 -154253
22743 -154253 -105985 -39621 -4595 -130478 -219647 -333947 -371205 -320004 -215758 -149926 -90715
22732 -90715 -101767 -106635 -112701 -93823 -12517 -44826 -81581 43522 137324 16781 34684 -90668
22720 -90668 -59113 -34650 -90609 -55246 -83058 -92787 -70609 -92018 -98165 -63416 -26473 -22875
22708 -22875 -37184 -32194 -180389 -186890 -47205 -77454 -193454 -28901 12483 -79307 -266754
22697 -266754 -251293 -280260 -309909 -190746 -34937 -71594 -109533 -155878 -231213 -326268 -160581
22686 -160581 -50022 -3946 59935 14612 10219 -50149 -93030 -42300 11194 -81172 -122894
22675 -122894 -123162 -331065 -492737 -498038 -410793 -324516 -257444 -315305 -440539 -370290 -175744
22664 -175744 -121360 -114982 5401 164021 88485 -56214 -53743 22162 34142 -73571 -145658
22653 -145658 -162970 -83622 -252687 -302124 -294515 -205904 5073 -7237 -29143 39750 -10530
22642 -10530 -23116 29841 210406 256703 165710 88913 349 -74439 -51660 -75285 -180158
22631 -180158 -239239 -153055 121233 143243 20186 -284576 -533058 -334344 -41175 7526
22621 7526 -57356 -121313 -242425 -249368 -86672 -74278 -107733 -244800 -274859 -397372 -329924
22610 -329924 -162746 40220 161082 101707 104175 -58677 -45711 -25906 -3573 132978 123592
22599 123592 144424 14362 -37265 41561 -5993 -48881 -175402 -115026 152316 297287 220310
22588 220310 -25386 -86090 -49013 -32222 -69590 -59480 10970 -37550 -11629 156386 183827
22577 183827 35396 -10729 22417 -30775 -48839 -138834 -145703 -92990 -116950 -71471 -81541
22566 -81541 63948 161028 104329 62259 98069 149186 49418 -219541 -144718 61844 109937
22555 109937 61629 -47597 79722 -36575 -244753 -176831 -116891 -58313 61120 47432
22545 47432 19067 41965 -51879 -69703 -44216 63438 -73995 -224266 -274972 -149389 -76065
22534 -76065 -58949 -13546 11523 -128521 -91597 -215181 -151978 -59948 -234745 -264351 -231336
22523 -231336 -177347 -221079 -188646 -187115 -154784 -114285 -205285 -233396 -297134 -359454 -384862 -248165
22511 -248165 -164196 -143521 -73682 -166400 -157386 -140326 -255707 -180190 82211 203344 265115
22500 265115 290295 179140 74922 -20796 1100 -67679 -74552 112522 37204 -48671 60410
22489 60410 169405 93555 165289 174767 137385 -89820 -170183 -139473 -1693 79003 57356
22478 57356 125979 61426 -103475 -80811 14052 81332 188814 125826 112539 44520 -118775
22467 -118775 -183605 -86249 -24869 -24218 -117366 -268393 -106527 89914 -1058 8863 -82240
22456 -82240 94462 175557 101674 76883 56776 284905 257772 105284 100643 14277 45084
22445 45084 158047 38 28925 181749 -3360 -91311 70104 151191 82043 18020 -7376
22434 -7376 6362 15643 114580 316301 180029 -92787 -168474 -167586 -159981 -7004 146002 318653
22422 318653 395183 367578 225882 88185 13194 -72282 -145085 -301474 -275459 -179742 -196144
22411 -196144 -322213 -114939 2856 -30055 -104725 -93068 -652 -34344 -38837 -24058 -217584
22400 -217584 -215578 -252962 -258411 -93422 10010 16673 242324 259858 153017 30232 -42494
22389 -42494 -132596 -118673 27575 70524 116966 117389 38839 3091 53577 -53879 -140257 -70707
22377 -70707 -56503 -18490 -64571 -54326 84901 60847 11191 32882 4667 -73908 -85884
22366 -85884 -118699 -68562 -176933 -87359 2909 12590 52318 74429 -70589 -185251 -164435
22355 -164435 -118613 84176 167094 55013 -102895 -873 76236 142720 88143 -1026 253115
22344 253115 154333 110605 64410 17315 36611 25920 59476 74033 120633 24346 -213068
22333 -213068 -120246 -72470 -213298 -176570 -128426 104232 35182 41099 58338 -24817 -96405
22322 -96405 76192 267139 244541 156327 54845 33225 -169382 -345560 -311441 -349531 -276867
22311 -276867 -87412 120199 61540 -37013 -86718 2203 -46669 -103214 -79199 -357986 -378919
22300 -378919 -226544 -284239 -270549 -133179 -193075 -229146 -302054 -332742 -347536 -157842 -93246
22289 -93246 -148545 -212296 -26944 -71916 -5217 136776 190544 146166 75228 -46896 -180387
22278 -180387 -60055 60511 201931 194995 32109 -67456 -70610 6973 20268 -181106 -208683
22267 -208683 -128330 -140416 -15437 -52245 -18033 4568 107532 19119 -6133 228535 173333
22256 173333 159300 179735 120084 113381 47016 6291 61519 104620 161484 147223 66584 -16781
22244 -16781 -3342 64578 209798 194742 13903 -175619 -101583 20046 153030 158239 131995
22233 131995 -58228 -175491 -102897 -213250 -231343 -191007 -61340 -118453 -182533 -212149 -393918
22222 -393918 -351995 -334464 -287006 -236182 -181498 -288343 -308107 -137783 68248 44657 169315
22211 169315 302214 213386 225456 259504 310260 321476 214331 114299 136875 22253 -73440
22200 -73440 -120220 -136383 -57358 -40812 56238 155400 77842 -46939 -12043 57374 2478
22189 2478 -7127 70051 112124 140899 18912 -160291 -193366 -157934 -271665 -288224 -49592
22178 -49592 -12237 147536 249055 284591 224463 149444 138387 -4907 -51053 21221 276825
22167 276825 427222 502061 727275 960380 1134145 1118965 1062359 795394 691701 842637
22157 842637 835531 659891 482003 421928 490397 636858 734434 881321 1046130 1258067
22147 1258067 1128515 958299 914230 926061 785461 669349 391538 160107 243360 332535
22137 332535 261288 249629 223244 150756 254494 278024 229458 166919 275448 454108 249910
22126 249910 178151 252745 609501 627115 395036 162270 68273 -1021 75087 113711 5597
22115 5597 -87086 -251691 -302703 -214235 -307172 -275164 -119590 30170 96302 29795 -148522
22104 -148522 -189064 -97373 60630 139425 222471 328157 240001 50827 -127704 -16838
22094 -16838 9013 133632 320439 409339 275585 157526 13504 -18466 -47293 -145778 -72678
22083 -72678 -39887 6058 55321 -2128 -41987 149675 220575 106290 -70121 -184133 -178213
22072 -178213 -125507 80201 48530 510 49166 2437 87159 151221 51486 -114887 8444
22061 8444 -21272 -114234 -12371 -36377 72170 166869 29565 -222502 -308734 -57162 166114
22050 166114 132014 48822 35895 -90 -26467 -5985 -28815 -20756 179540 205202 95869
22039 95869 9306 116706 68712 14863 114889 -12891 -24994 19813 64744 -36585 43285
22028 43285 126193 120714 42859 -80416 -139425 -115352 -125837 -68424 37567 131198 107603
22017 107603 186979 150889 40101 190059 167888 102566 64018 -112361 -57667 6143 -10353
22006 -10353 69649 33711 129440 123374 103884 191206 182451 245809 180041 29452 73001 186118
21994 186118 77523 37409 -134791 -251948 24636 252247 290323 361667 282258 67658
21984 67658 79297 139157 182444 176018 190131 269054 303597 366148 322255 1562 32965 197005
21972 197005 361608 385494 62421 -87956 151282 178156 -45097 -220788 -224364 -65170
21962 -65170 123341 72896 182152 99915 -4111 60470 225237 269401 144653 81299 -136154
21951 -136154 -66824 17075 41363 7840 103263 107588 -50017 27743 -16602 -94356 -75511
21940 -75511 -155490 -240500 -126830 9856 -14038 100645 153938 280391 299533 169749 68133
21929 68133 37444 76226 139478 60764 173526 408757 469964 394933 332519 337511 237056
21918 237056 337578 170852 172302 212734 109701 193000 221945 72717 -71623 -96313 3529
21907 3529 17610 56016 91962 197283 141492 100178 111522 65718 179184 353429 290615
21896 290615 202433 17602 -25872 43873 -15545 -40083 -92692 -124428 -57910 12667 62804
21885 62804 166674 96294 47925 -29523 20541 -27822 -90561 13939 67661 136920 51540
21874 51540 -135995 -251188 -315129 -333583 -267168 -88331 11423 84870 105994 14425 -26723
21863 -26723 -31748 82148 271145 251074 147249 105958 84319 30010 -27932 -49056 -248695
21852 -248695 -281769 -137434 -75197 -68029 79873 160811 112174 220368 272951 217335 234006
21841 234006 284160 132406 13137 22573 195048 355957 407896 474228 272006 110079
21831 110079 116619 180257 225766 264471 353692 392226 405666 111487 -22781 11332 58417
21820 58417 126012 208393 255930 404263 350043 247391 102808 81755 110277 238290 117622
21809 117622 276414 226000 86384 -28850 25705 21303 -89364 -72088 14962 124292 224744
21798 224744 177577 118027 80342 54636 -33173 50019 118663 67739 14543 -27773 -16743
21787 -16743 30309 147955 147998 196612 128355 -13334 -8130 31248 132216 82735 -59959 38456
21775 38456 37132 36225 70144 135740 114195 321890 433881 437310 311443 262130 190723 125739
21763 125739 126491 91920 -52451 -13739 -24522 62679 182091 290970 275108 295843 131638
21752 131638 195323 350530 272499 102211 -70817 -276003 -333741 -182646 54907 127043
21742 127043 169846 212391 148952 -21230 -193415 -243890 -227517 -25528 245391 251350 190808
21731 190808 227887 313076 178769 221727 231034 173785 98144 125384 169151 109518 40136
21720 40136 165136 320951 330749 424353 634282 740334 612983 575652 491570 481121 579412
21709 579412 686247 601506 423574 537928 581743 486679 608694 828528 808095 707790
21699 707790 650405 662832 617765 424704 327410 379520 431425 306773 152004 274983 371432
21688 371432 549729 603883 660670 583818 582047 672767 737426 533099 460472 599384 635878
21677 635878 872937 704332 598257 489931 361393 511118 781331 949611 970309 786871
21667 786871 758441 833720 833617 792002 797096 765419 704698 813621 903790 759774 594980
21656 594980 809844 1011860 1135591 1076738 1086853 973474 914662 671425 657439 723761
21646 723761 792003 967860 1239008 1296418 1097160 875735 935454 1159455 1196644 1142379
21636 1142379 861324 1040119 1180204 964294 799168 941104 1202180 1261624 1328887 1418410
21626 1418410 1472218 1538001 1587698 1802507 2094934 2199892 2272944 2644879 3050981 3133350
21616 3133350 2997162 3116628 3393358 3417687 3363632 3454160 3258772 3251786 3463056 3816564
21606 3816564 4348673 5010689 5764853 6303254 6726827 7185854 7714931 8358048 9158074
21597 9158074 9698977 10035434 10905614 12053722 13580031 15925330 19279422 23880101 30248208
21588 30248208 39977765 54939844 77972171 108711794 137795101 149696309 142487768
21581 142487768 133804485 139348726 155338699 163057716 148808240 119772154 96791643
21574 96791643 87234665 89077057 101707822 125566633 154887415 172709433 167772041
21567 167772041 151179172 145583185 155000391 165142173 157582477 128967203 96466883
21560 96466883 73869739 60278306 51685617 45874663 41968063 39378156 38351794 39147770
21552 39147770 40719680 41097461 39693203 38006581 37525045 38036611 37973351 35775220 31748321
21543 31748321 28205992 25860308 24493497 24211808 25134825 27105501 28606147 28098240
21535 28098240 25839773 24300937 24494541 25053371 24157950 21280414 17445179 14319404
21527 14319404 12139033 10736971 9682008 8650397 7770812 7165229 6603306 6045665 5731265
21518 5731265 5442679 5220121 4928418 4830033 4630293 4305390 4005886 3780625 3585982 3397467
21508 3397467 3016669 2694581 2550647 2307811 2104288 2030616 1942911 1867864 1748438 1618084
21498 1618084 1440411 1507983 1497577 1270367 1226500 1049566 1025567 897107 833018 846906
21488 846906 772160 559548 416514 398024 335417 318319 442527 533027 662138 628204 482857
21477 482857 312672 112401 29111 97676 95178 105154 -56438 -58949 -48415 87510 228528
21466 228528 331773 279382 208100 185709 315241 314489 340057 373639 367332 334706 251275 186017
21454 186017 276080 63795 16433 201405 106369 -50500 -13752 -2953 129760 300841
21444 300841 298579 150935 -20193 5340 62892 -2739 56347 -42006 -114767 -171884 -208954
21433 -208954 -289373 -293339 -177873 -164669 -115771 56282 -2763 105894 62938 -113953 -66589
21422 -66589 40559 -18446 -63394 -96447 -140094 -7735 127040 156310 176181 154130 22970
21411 22970 -25280 -92784 -129557 -15484 5289 78051 90713 336842 340333 548442 501237
21400 501237 642006 629359 483446 340648 243868 243318 192020 169173 154269 160987 144003
21389 144003 119808 97280 234166 330560 312227 220826 130805 139516 354452 395471 285471
21378 285471 7469 -32964 -29284 79189 235274 275074 216122 144333 -80292 -56801 48434
21367 48434 10116 52023 27747 -78349 -206192 -232497 -201340 -16556 101215 87787 -116755
21356 -116755 -207724 -227133 -300215 -199504 -219146 -189565 -56811 36897 159199 80565 59821
21345 59821 65333 173333 304971 293475 156359 64740 175239 311915 250752 234246 345292
21334 345292 319245 182399 -13738 -95872 59055 218490 277042 127631 -34695 -25708
21324 -25708 208498 327785 289526 146075 9605 37697 90450 52127 115651 132266 100771
21313 100771 -33243 -40373 17219 122220 -141868 -278190 -202932 -91070 -119221 51689
21303 51689 155340 158392 102909 -14705 -102994 -51515 -115293 -219492 -320132 -190209 -143407
21292 -143407 -184274 -379240 -321477 -344778 -367727 -183486 30028 49820 -111655 -223949
21282 -223949 -104830 -246686 -266945 -191172 -121557 -93215 -3258 40219 42050 74896 -7817
21271 -7817 51285 130898 -133718 -220712 -254731 -288313 -250464 -143900 -90491 -90707 -46932 -33038
21259 -33038 58853 83924 -42048 -188860 -127097 -60650 -14952 -65759 -155261 -200233 -388145
21248 -388145 -338694 -172029 -97826 -93777 -163881 -129508 -47815 80524 -43182 -159906 -192264
21237 -192264 -304072 -441323 -449305 -262588 -104492 -260713 -342444 -352832 -389335 -376339 -279362
21226 -279362 -134475 -123370 -118477 -55332 -91957 -186206 -205656 -44179 -43611 108325 110190 -43345
21214 -43345 -33919 -65516 26758 196343 308650 210697 62137 -130409 -188897 -183246 -127409
21203 -127409 29058 33351 -140404 -72611 -44581 49427 149180 133127 17720 -61842 33645
21192 33645 135674 14391 -158632 -138875 119781 426410 486304 406280 201571 275985
21182 275985 239509 243847 157445 -45563 -45346 206897 320711 172694 -46857 20428 -1962
21171 -1962 -36988 -46508 -11646 -17535 -156594 -125364 42044 119105 124793 165989 33298 -139206
21159 -139206 -204942 -284722 -276576 -221581 -208913 -209410 -131440 -177160 -138310 -155940 -226573 -243118
21147 -243118 -234295 -133445 74718 289630 404626 232384 45952 -102981 -149642 -164225
21137 -164225 -108842 -24339 -106593 -73669 55055 180538 114885 63217 -112908 -114183 -136872
21126 -136872 -352872 -515738 -405305 -174300 -162020 -259466 -15425 72434 55485 178332
21116 178332 229658 239703 62617 -1379 154276 70232 18666 53351 89414 39825 -153281
21105 -153281 -210590 -388430 -378525 -120325 11820 4697 64686 59680 256191 141056 133135
21094 133135 108824 31890 -33112 64867 48966 92016 74621 -38276 -9422 80049 28021
21083 28021 101137 232048 45567 -160981 -218788 1694 100852 30009 42381 37370 75011
21072 75011 58240 21701 -78918 -133883 -78141 140161 221306 217459 75840 -38853 -124964
21061 -124964 -150661 -1910 -2501 -154684 -13765 163871 128166 24323 59036 -10915 -215716
21050 -215716 -63722 -66668 -60585 -102076 -44483 -48298 -27934 -80767 -46808 -174959 -241211 -117269
21038 -117269 -75737 -84242 -11269 74935 245390 438832 406406 272713 -17455 -84584 -49375
21027 -49375 -66345 -32442 -128614 -176810 -132281 -250067 -169488 -59556 78665 69053 172806
21016 172806 25524 20705 207373 89135 38724 1188 117593 147527 182676 273146 134631
21005 134631 -35033 70269 211801 278956 185228 136189 284040 503331 491380 592674
20995 592674 736573 721996 813241 835547 762268 652516 682469 765758 640236 548693 577280
20984 577280 639638 638905 623469 688990 638438 620866 564737 521593 663013 543049 362495
20973 362495 148884 -7206 -123248 16019 68419 125942 299260 316629 150552 210995
20963 210995 301566 188274 186835 308686 209310 172172 132478 99143 47689 39299 -23941
20952 -23941 65225 108343 180952 162196 85827 44825 -53481 155826 295492 231130 57880
20941 57880 33313 -92929 -280200 -320278 -279421 -145407 30824 -48264 -51479 24119 157747
20930 157747 82019 -55661 86066 56218 1561 67073 331818 508630 465538 423123 497156
20919 497156 425934 397045 287833 202321 210554 182045 181189 153297 -14791 -326841 -292875
20908 -292875 -232101 -182398 -141826 -62467 -15306 85962 173824 61699 78390 64455 92274
20897 92274 32068 56433 117041 50928 -17284 -184459 -250367 -241488 -134271 -115865 14172
20886 14172 98865 46756 -9967 -12303 -134361 -171471 -43919 67860 132648 158885 287545
20875 287545 276631 122313 -22805 8282 57730 157120 115455 51131 101382 252974 325223
20864 325223 267148 157915 105693 -55822 -125117 -255616 -400389 -242246 -70949 -173089
20854 -173089 -136466 139422 150195 148908 68284 -68119 -196790 -155523 -137742 20626 50497
20843 50497 11868 80920 46107 40872 -114659 -197296 -193163 -262788 -299427 -258992 -203562 -154823
20831 -154823 -145496 -200862 -148499 -118725 -191704 -332664 -274967 -274774 -264189 -40447 94655
20820 94655 97429 64010 37679 2244 -16112 28971 15832 103947 115760 54305 8719 -145121
20808 -145121 -80527 -13626 -123250 -176738 -4673 -40900 -15065 -170095 -214549 4280 185496
20797 185496 88893 58127 156715 60403 -93265 -252897 -323399 -243243 -183935 -11017 159161
20786 159161 37716 -117021 -93738 -75074 -226421 -93812 -268162 -450352 -272655 -33899
20776 -33899 -226686 -233382 -340905 -162469 32211 -37255 -24933 -108602 -101541 -163804 -97063
20765 -97063 51974 -13350 -100015 72751 84317 62420 84905 34192 -25338 78542 -50182
20754 -50182 -223785 -120537 107182 217220 48868 -63138 -144695 -105184 59076 28717
20744 28717 108656 97122 5779 49520 89781 -50863 -272808 -194018 69444 115827 30151
20733 30151 -40748 -84525 -128127 -119872 -69222 25465 172780 134295 220547 128614 -45861
20722 -45861 -140404 -156393 -77031 109218 -7796 -11776 -83481 -3910 -107082 -117193 6343
20711 6343 -83982 -104390 -122684 -187536 -261287 -86373 121216 60539 -130798 -70897 59093
20700 59093 187659 145100 -95644 -75991 -130076 -214229 -143033 -156679 -66805 16946 -52348
20689 -52348 22714 16696 32302 180364 338295 159872 -70584 -65428 -56487 -4819 35070
20678 35070 73604 25742 -28872 -30452 -64162 -121583 -321294 -231726 -182649 -155178 -28729
20667 -28729 48079 -41546 -109505 -163319 -179044 -242924 -153083 -186830 -123693 -184436 -250403 -149701
20655 -149701 -53024 161178 212001 24987 27285 -17077 -38970 1428 100488 123684 88579
20644 88579 125026 -149 -59524 -31241 -14678 7919 74545 44570 20448 -4879 -135778
20633 -135778 -105537 -69936 -11119 184844 323074 284763 291756 409876 609749 735012 853806
20622 853806 853420 694153 529815 330410 154505 248520 369055 322935 144164 182634 247655
20611 247655 473965 555420 745111 772808 683573 520401 463502 413887 451135 236803 131506
20600 131506 251562 314883 251921 259477 72182 110081 91803 -7921 70010 87530 85838
20589 85838 103868 111848 74971 326957 295279 43204 -151343 -70933 281134 418649 347815
20578 347815 354643 231269 83355 157996 357356 528211 482353 480661 723287 818332 804829
20567 804829 666181 493475 403662 467685 382622 174845 161538 139260 8978 70715 235136
20556 235136 308897 401986 268523 239972 183996 159808 66191 10643 175932 196162 227956
20545 227956 143638 125252 94096 47313 220687 64478 45913 -659 -11013 33130 -43566
20534 -43566 49857 118454 94533 -20184 -56003 146669 265946 245555 284896 339708 412311
20523 412311 448533 245098 148787 147272 158113 -43671 -235929 -15095 109859 30245 74598
20512 74598 -20141 -77525 -69560 -35603 -48241 -31524 -45338 -40345 56152 136266 149715 91403
20500 91403 -27734 -4186 118841 255747 200947 202685 352726 300324 285059 138821 174881
20489 174881 195437 214191 176942 133035 141990 32773 -164630 -11821 132761 223022 142139
20478 142139 211218 277623 309338 243355 73217 76285 199462 136164 127526 29427 87844
20467 87844 30913 12347 -66541 -19037 93966 86192 220909 205367 132958 8565 -28655
20456 -28655 -116200 -169039 -193920 -275295 -223651 -199834 -30899 82425 200286 205661 91401
20445 91401 114257 213846 203742 142741 179623 104509 57629 97563 156116 93084 -6770 169327
20433 169327 125144 67049 152152 169145 135582 -63533 -40092 -6081 -14635 -90740 -178349
20422 -178349 -52396 -72157 -119297 -160201 -148626 -80065 -59340 51829 71417 53308 -30903
20411 -30903 -30396 118183 218015 171741 17726 -84575 22070 158984 82219 -196445 -183642
20400 -183642 28601 32797 47669 -88825 -197066 -126853 -103823 -45151 -3003 -87611 -195699
20389 -195699 -227174 -141875 12101 -1368 -96277 -23971 100876 247544 202667 -62813 -246501
20378 -246501 -71653 -5619 86103 138752 135555 93104 6368 -119921 -6818 30332 -126179
20367 -126179 -281650 -4707 41228 -43901 -113013 -176511 -92531 59523 52839 89450 7869
20356 7869 -19383 103461 81948 1574 -42544 48610 47169 -20523 65671 166355 132154 -152019
20344 -152019 -318802 -123108 -53128 -154757 -83489 -6121 -80795 78298 140830 119671 117245
20333 117245 148837 130445 40436 -44721 -28122 191187 314596 340923 118400 90669 132214
20322 132214 133191 23263 149571 -1643 -217703 -381523 -351305 -17124 55835 -23709 -37216
20311 -37216 63762 160196 287369 257677 174546 210319 278733 341912 387911 287602 162447
20300 162447 -115427 -81961 105055 116321 -41747 -44396 221359 149299 69131 33393 93908
20289 93908 134985 258128 328001 194689 197328 65663 98147 11339 -108030 -92130 156064
20278 156064 401835 457908 379309 222775 180813 219753 42312 31932 103323 -28383 -92423
20267 -92423 -54252 -1300 -162441 -329558 -244058 -87790 44133 124902 156663 314762 396089
20256 396089 290813 175481 117201 46744 105400 94225 8403 -100706 -131490 11416 69843
20245 69843 48508 -174788 -70535 -114019 -104159 -140782 -9409 176978 301637 273838 228796
20234 228796 157217 -60726 -91583 116955 137461 173179 291851 397998 586052 628320
20224 628320 629111 440882 270405 234753 142675 99891 137991 185059 194894 224021 310177 154305
20212 154305 156838 4359 24671 -14778 27586 145392 218601 239377 223754 369632 272642
20201 272642 193756 225058 261630 273625 310531 326962 420211 361779 468770 552847 445810
20190 445810 276914 342835 265932 250976 319357 407362 433376 370462 377947 381851 524689
20179 524689 635204 579238 427229 358928 315648 427602 622520 470164 205241 165333
20169 165333 194726 301009 353420 444189 477197 354354 448061 658349 662103 658872 893668
20158 893668 819810 715281 660741 588081 619615 508968 626243 737962 839789 1050590
20148 1050590 1055056 975081 926059 808669 760888 842381 1090230 1112448 1215733 1159261 1199721
20137 1199721 982227 816681 861513 1116309 1247847 1338973 1446271 1440081 1505141 1615942
20127 1615942 1666671 1605000 1624898 1793357 2011897 2182610 2542005 2747148 2893652 3046584
20117 3046584 3350778 3906711 4097876 4418049 4903790 5415080 5806043 6258040 6877644
20108 6877644 7760628 9193621 11253593 14041768 17889434 23954220 33845574 49420874
20100 49420874 73035166 103405170 126380263 123579657 96186079 67523233 49544249
20093 49544249 39473856 34103544 31795614 31824361 34625778 40863967 52166259 70386995
20085 70386995 96473100 123235664 131195699 111880275 80874922 58486920 45633287
20078 45633287 38636301 35057447 33683619 33794060 33663555 31471287 27513079 23666495
20070 23666495 21292175 19811972 18865739 18393041 18027955 18045315 18560975 19751505 21535600
20061 21535600 23766176 26102650 26810131 24854381 21751593 19628014 18809612 18983614
20053 18983614 20270834 22516570 25837288 31638911 41615997 57880490 82540830 115431396
20045 115431396 142898915 143645004 115244110 81873408 60092953 47902425 41325057
20038 41325057 38337986 38083799 40567405 46583150 57898254 77023553 105520141 137046321
20030 137046321 149970177 131564962 96019733 68663055 52777676 43806300 39262816
20023 39262816 37281791 37113774 37060307 34927673 30266957 25463474 22075683 20175854
20015 20175854 18796610 17729644 17119901 16775123 16977178 17789204 19254348 21557783 23980789
20006 23980789 24600466 21955755 17514028 14096222 12030344 10718293 9458590 8797241
19998 8797241 8073951 7321521 6830986 6301426 5832123 5353783 5210978 4891796 4575158
19989 4575158 4425813 4495813 4335507 4135267 3811099 3502086 3305658 3151547 2953560 2916856
19979 2916856 2768440 2775581 2889870 2852480 2837561 2761548 2516692 2325067 2150312 1926353
19969 1926353 1833118 1816949 1582317 1551852 1573464 1599354 1610874 1606515 1363662 1223005 1519194
19958 1519194 1765132 1664435 1443228 1318751 1326143 1280771 1269637 1240766 1292186 1157846
19948 1157846 946496 804415 872611 944375 860152 757184 826746 817467 875907 996484 1037421
19937 1037421 1072640 1148452 1233202 1062037 885854 1048573 974306 978127 1136549 1042585 888894
19926 888894 710560 660591 759935 742653 656244 800711 936043 1120576 1139534 1018745
19916 1018745 895609 955100 957737 871110 687309 465194 248662 30405 20399 151608
19906 151608 218234 324632 461801 416626 263263 336904 403228 510468 414149 390307 277566
19895 277566 133091 268571 276014 316446 223307 43508 40077 136484 70582 107557 194852
19884 194852 181371 274996 244691 82567 79490 308730 260961 377612 478642 579534 540100
19873 540100 386019 331491 243349 209917 148225 135062 202878 285071 398701 393526 386476
19862 386476 418341 496452 431119 209326 139400 30978 -25408 182189 323146 331934 148937
19851 148937 87120 175991 501865 585173 571781 434975 385261 371594 351073 241377 277276
19840 277276 275836 386476 285642 237556 212830 307607 329581 302913 207710 250480 220643
19829 220643 139174 13343 -115648 -73437 -62572 11345 92620 84540 57347 -54810 -302455
19818 -302455 -143634 182663 263521 224466 277312 398965 324910 122848 157529 271536
19808 271536 58791 -156602 -155025 -114949 136663 356471 373335 321621 319947 248131 209271
19797 209271 308846 141504 19146 22509 80377 187672 244217 210147 199943 202957 165755
19786 165755 167047 184059 150488 195576 275282 245596 347506 319850 339785 322777 352166
19775 352166 338823 215364 -83359 -10888 181069 303521 351541 237994 230170 241305 179587
19764 179587 131364 69572 241945 294420 244378 153337 141752 68908 52362 101859 28913
19753 28913 52282 -19005 923 191320 406874 353374 193539 99364 44213 136229 295781
19742 295781 290645 333857 406974 346469 364589 407389 438196 427938 384590 346852 338571 321013
19730 321013 238207 189681 182788 427760 539932 335076 247039 279981 424972 515433 451824
19719 451824 368532 518107 661151 760615 802281 836086 1018237 943380 951290 1052751 1153303
19708 1153303 1127923 1230855 1104488 1016391 1022181 816168 731123 558176 401798 430587
19698 430587 468092 271228 160004 26475 33476 197124 421064 640481 675783 602059
19688 602059 504887 443423 309140 421376 481195 524323 312990 202936 173128 79840 -8011
19677 -8011 146810 261351 265384 162643 55713 65215 306645 460170 271467 192208 484399
19666 484399 715680 705802 687063 643148 721396 799237 748743 671208 786712 896327 822124
19655 822124 690469 649209 672026 758466 687270 573631 515449 399398 286433 323456 380418
19644 380418 334000 313347 381809 516816 447966 201645 141723 212697 94360 71236 245615
19633 245615 422201 403355 229565 48008 27297 47622 120061 108596 216614 460645
19623 460645 476677 432873 476623 504566 536849 532705 530551 386885 602218 804181 624501
19612 624501 418749 427613 420379 628713 579563 506819 450378 291331 269178 430700 423405
19601 423405 576755 649902 653804 613619 536848 584329 648143 733573 709670 667687 688662
19590 688662 629214 550913 492001 557013 747452 861838 764632 899595 1025907 940501 657588
19579 657588 634129 805626 964822 923675 770780 725743 1011743 1308548 1342658 1199657
19569 1199657 1122699 1306626 1599384 1628254 1670161 1615334 1508878 1445612 1574296 1581912 1446366
19558 1446366 1418641 1653133 1925936 2082233 2259970 2239509 2322621 2208246 2302901 2328474
19548 2328474 2273068 2228788 2357438 2634169 2803826 2877432 3049599 3285166 3370949 3633850
19538 3633850 3742760 3832650 3770022 3822657 4036330 4327653 4470094 4474810 4423550 4625990
19528 4625990 4980225 5687469 6496970 7368667 7967700 8165026 7814932 7482792 7656879
19519 7656879 8140108 8578789 8830666 9027923 9205276 9432204 9898724 10623953 11807232
19510 11807232 13279335 15486961 18947554 24042576 31121399 38950186 43514675 42819270
19502 42819270 38883345 36068699 36034272 38245913 41659334 45389376 50596953 59414024
19494 59414024 75013200 99341778 130320250 158044143 167184648 154023133 132442743
19487 132442743 118854110 113814377 110461908 104508558 96428629 88904472 84455314 85091316
19479 85091316 91176059 100304197 108614779 113191154 114734005 117614951 124310201 132037495
19471 132037495 134987899 129305659 118454213 110288823 110167864 116952917 125687176 132691151
19463 132691151 138660336 144378651 144215982 135432440 124294117 116931437 110615065 102595190
19455 102595190 95351257 91840318 91077365 90647734 88050264 82899473 77940293 76982098
19447 76982098 81422171 91847664 108981358 132922955 161652813 190100898 209718591
19440 209718591 212654871 197745819 171316323 141300110 115810488 99883972 93080378
19433 93080378 94446887 104504629 124480005 153164100 180477413 187540034 167052018
19426 167052018 133892974 107440237 91762116 82735835 74994748 65988132 56664893
19419 56664893 49327807 44207450 40583180 37456844 35089021 33232847 31800167 30879711
19411 30879711 30522517 30877621 31832381 33061457 33392157 31905897 28710723 25399698 22732962
19402 22732962 20739676 19605303 18975471 18659157 18199197 17363029 16327978 15024634 13804574
19393 13804574 13030434 12825206 12805580 12252304 11020756 9727836 8774643 8127727 7445191
19384 7445191 7012539 6478397 6049595 5944824 5967505 6157321 6096584 5560383 5061693 4500612
19374 4500612 4032939 3837676 3747756 3367661 2949375 2885009 2748600 2501073 2530073 2517775
19364 2517775 2525397 2603930 2445322 2397802 2207223 1912126 1762517 1740855 1644887 1606712 1593485
19353 1593485 1475601 1345554 1164657 1195373 1218124 1190388 1197366 1234796 1230116 1239895 1266053
19342 1266053 1255821 1264370 1312565 1295116 1234873 1182843 1070620 1023457 909008 779785 806805
19331 806805 988857 884635 1035277 1155552 967711 929408 975827 909665 833832 883532
19321 883532 751071 669128 666808 785030 869390 893684 910145 924760 900740 844616 619435
19310 619435 576442 683444 788394 1025239 1155716 1024876 883743 829964 777167 666053
19300 666053 619686 683246 774973 911180 1067798 951162 939643 955985 971325 966865 824821
19289 824821 873232 895642 963808 1151499 1015005 917450 940815 858061 847341 889533 907281
19278 907281 868975 836634 727022 723811 817435 832089 894910 924194 1131097 1050831 950061
19267 950061 995496 1038743 893410 667600 696748 867009 1111142 1118157 1064387 1188856 1189187
19256 1189187 1068566 1127546 1065279 1085567 1128686 984790 995791 1053525 1090401 1063550 1025793
19245 1025793 1175328 1491397 1448888 1283540 1390954 1568830 1572498 1559478 1486036 1454107
19235 1454107 1427038 1497510 1739742 1713560 1695588 1852244 1828940 1865190 1874724 1890060 1899264
19224 1899264 2082779 2174681 2299981 2638519 2820349 2933141 3368708 3827270 4301193 4725748
19214 4725748 5223221 5639605 6296328 7403585 8713944 10661112 13469157 17351677 21801716
19205 21801716 25257869 26783331 27974687 30967734 36801097 44680371 54085091 66963032
19197 66963032 87549699 118244005 150494984 165629572 157144031 142609993 142798388
19190 142798388 157356521 168099261 156196279 123379552 90182467 67554029 53493883
19183 53493883 44164684 37889159 33409232 29953715 27300234 25302086 23735939 22603107
19175 22603107 21930237 21285741 20781076 20052632 19178083 18472867 18058365 17644668 17152953
19166 17152953 16307583 15549124 14998953 14374448 13867851 13410141 13160554 13184578 13455687
19157 13455687 14260630 15489267 17289198 20075444 23573966 26571006 27944456 28622570
19149 28622570 30640298 35101665 41761205 49881776 60369698 76852706 102736363 132425772
19141 132425772 149736755 145220206 130525424 126722350 137870789 150261707 144500079
19134 144500079 116949146 84977108 62710400 48916557 40140017 34267625 29998646
19127 29998646 26810971 24356734 22361607 20814301 19666868 18944266 18426606 17860548
19119 17860548 17247369 16358817 15560027 14933185 14449032 13879042 12904445 11934598 10978636
19110 10978636 10011529 9226867 8571779 7755991 7115358 6584665 6268294 5951323 5583880
19101 5583880 5381001 4997114 4491756 4223860 3986455 3796283 3575915 3286289 3146913
19092 3146913 2882874 2729872 2560064 2518588 2469779 2494754 2392994 2319450 2182303 2062127
19082 2062127 2016238 2043853 1829514 1581125 1241834 1129683 1532411 1793210 1743221 1651631
19072 1651631 1677489 1620732 1662531 1630066 1664122 1785329 1610105 1549347 1443587 1226347
19062 1226347 1197652 1224525 1393548 1594719 1580878 1557284 1603083 1582069 1569480 1554743 1610795
19051 1610795 1544339 1418310 1415597 1428142 1338364 1172877 1221329 1447093 1548750 1492482 1240633
19040 1240633 1130570 1163066 1098335 947178 861262 709078 689703 823073 942382 912699
19030 912699 892428 849252 759269 934963 1096860 1015301 1070500 1182064 1218344 1363302 1552173
19019 1552173 1644795 1637930 1469943 1429055 1237010 1143452 1110915 949016 840819 917786 841510
19008 841510 782038 782574 765623 730933 812179 861358 788641 875898 839966 678269 761812 860163
18996 860163 984389 1066945 1069714 938827 894714 951515 1162026 1217221 1269019 1175244 1172710
18985 1172710 1167329 1246426 1216462 1161117 1166001 1224518 1470432 1620417 1642267 1733075 1744700
18974 1744700 1636979 1586097 1635244 1565420 1538731 1471766 1385385 1309734 1175721 966498 932768
18963 932768 983476 911941 895073 855309 910286 1010005 1029598 973973 753879 541634 430592
18952 430592 455009 454680 563006 692162 818455 911118 1152433 1089685 938120 893303 774513
18941 774513 771876 787122 1001408 1138834 1176322 1078237 1057012 831170 864133 904486 699427
18930 699427 578611 514863 505640 776609 987886 1085429 1092304 1057176 854143 599205 596227
18919 596227 719777 702373 678560 668779 769592 781619 775794 771325 712517 692955 665637 591308
18907 591308 396243 284684 163260 -22015 -10714 155367 57199 101504 69662 208406
18897 208406 402016 330806 354853 383063 380078 377426 423396 304633 185037 262456 407944
18886 407944 345463 293396 149626 42783 282880 415668 244604 189249 200196 192340 104634
18875 104634 99785 164420 289583 499993 472360 460669 218064 127924 241559 157797 119207
18864 119207 165721 36421 85562 66240 -12300 -116855 -40938 18588 18891 38581 116969
18853 116969 226320 325528 509826 355754 237146 252075 284097 134636 57381 130807
18843 130807 243704 335485 291249 102011 94233 -39272 -147946 -94215 -40921 -53782 -7734
18832 -7734 -3045 37528 -115312 -117667 -77198 3987 64558 156239 434007 548114 500881 364603
18820 364603 158262 235728 419765 560658 902209 964306 905183 759272 592351 580367
18810 580367 408529 173867 149751 121589 132171 109654 52668 83589 86786 50239 123975
18799 123975 276626 154587 239556 242293 113172 49807 229999 430429 445554 314251
18789 314251 284874 266205 290976 315491 290167 439382 415549 436613 548419 647135 698917
18778 698917 608084 442986 496479 614655 550392 428687 547891 641760 731695 976778
18768 976778 1216129 1611988 1816264 1574957 1172200 652886 340046 351905 550149 591483
18758 591483 375495 350196 384295 262309 103271 9854 9306 -9678 55649 206749 377826
18747 377826 476078 429186 246275 163175 186141 96901 59090 -88776 -185121 -130395 -150059
18736 -150059 -193705 -14548 170205 169540 237976 172850 187818 134630 65611 163530 64087
18725 64087 -162421 -152624 48390 199908 253788 277486 212010 349733 355028 406950 553556
18714 553556 473222 393745 375259 430361 577108 606023 555232 305912 160493 151810 108849
18703 108849 86251 266777 265664 392966 544300 445097 281324 182969 352087 460983
18693 460983 547063 577391 753520 827369 834912 789739 786012 756093 926530 973961 1033298
18682 1033298 836759 701871 779928 803254 778750 870616 942099 957110 973572 996041 1241352
18671 1241352 1473008 1813349 1955667 2030267 2085908 2266806 2323988 2179812 2046271 1863380
18661 1863380 1812649 1646518 1493625 1505363 1438578 1414257 1388526 1440918 1492513 1419737 1564591
18650 1564591 1618340 1780853 1888401 1997904 2189489 2262665 2236209 2204384 2361142 2660374
18640 2660374 2920188 3052824 3411783 3897796 4185456 4334978 4464041 4483664 4571520 4898210
18630 4898210 5255018 6001172 7538839 9606348 12380469 15784925 18802136 20003370
18622 20003370 19269550 18080982 17746577 17776639 17217388 15539700 14094726 13828266 14610211
18613 14610211 15986345 16883104 16321928 14268628 12227870 10970080 10269457 10190468 10380665
18604 10380665 10928855 11669773 12750901 14403999 16958229 20365510 24461735 28728127
18596 28728127 32932906 37525194 44261008 53217149 59893089 59548517 53145162 46073375
18588 46073375 40676442 37045283 35540992 35804009 37591969 40359363 42476903 42030900
18580 42030900 39295306 37027766 37101421 39816622 44902552 51946169 59391303 65855002
18572 65855002 72476524 83174229 100527810 124824811 153964526 180527094 197261010
18565 197261010 203872018 203511382 194401540 177825789 162943682 155559538 151499536 146237648
18557 146237648 142369762 146376341 159406987 177646520 194682486 204599887 202412234
18550 202412234 185898550 161042798 137749615 120488016 107814540 98541755 93019845
18543 93019845 91136696 93018223 99053132 110264133 128229484 154424691 188883471
18536 188883471 229066625 268761385 301737187 326760377 346229224 355466942 344067341
18529 344067341 311683151 271244873 238034935 216338815 205440374 206413180 224864811
18522 224864811 263523922 318653931 372564686 388719090 348934351 280012712 221977670
18515 221977670 181311802 152905265 135415987 126645198 122480194 117739432 109462696
18508 109462696 99087264 91004464 87126316 86432898 87258710 87570527 84862027 79883007
18500 79883007 75461860 72968733 70787727 66950133 62093925 58238281 56691978 56792304
18492 56792304 56234445 53009544 47063251 40524261 35221154 31229932 28038855 25367658
18484 25367658 23405269 21940520 20635422 19427653 18167911 17032608 16052460 15214185
18476 15214185 14623813 14047225 13455927 12981528 12675174 12640417 12605627 12794916 13325881 14036991
18466 14036991 14573433 13829752 12219485 10734113 9504289 8592241 7990708 7539783 7278465
18457 7278465 7595226 8018780 8642405 9000151 8785660 7901115 6768749 5876535 5277075
18448 5277075 5137883 4848903 4523842 4506566 4182004 3926415 3775149 3434185 3162662 2853532
18438 2853532 2631674 2511918 2574192 2735435 2781338 2588730 2342094 2028671 1792379 1571724
18428 1571724 1542325 1476077 1603197 1593511 1493927 1438197 1486041 1378560 1364191 1265536 1288123
18417 1288123 1249460 1318226 1195950 1313276 1380748 1296498 1281968 1330056 1414042 1357176 1283548
18406 1283548 1271550 1267353 1204687 1292866 1229449 1120649 1087004 1011767 964615 903324 779295
18395 779295 782297 1005389 1192047 1295888 1145726 974713 913183 865683 830011 948600
18385 948600 912803 837955 677122 628169 693933 794363 854608 731032 708182 724114 848049
18374 848049 1030881 1147004 1067672 957887 1132535 1192440 1073927 844396 887796 846605
18364 846605 793807 797145 785649 887099 945358 888348 968286 1044068 1198160 1191838 1005718
18353 1005718 948977 1019772 935137 780171 805005 815902 838871 880690 924835 767125 662452
18342 662452 655942 608075 406270 530469 647673 728952 840010 854206 743844 655312 647939
18331 647939 798696 829922 583889 619249 670920 541618 551269 508417 378658 356754 334246
18320 334246 488800 438439 530648 522723 403297 515226 554699 660066 476190 478625 597436
18309 597436 695561 611225 507043 401160 342207 478466 443043 373951 193993 165676 395986
18298 395986 487091 295149 230723 84879 151851 371781 287590 225788 259430 180359 98478
18287 98478 191505 346585 405770 471383 445929 241695 232952 194080 220841 217656 309815 406493
18275 406493 253853 243514 210951 339720 454779 505691 471029 475141 370312 158303 159087
18264 159087 171362 178617 81130 132234 164014 255629 213534 87050 80566 145614 262628
18253 262628 455851 649132 555258 305654 237928 236851 268748 377454 401815 285364 222395
18242 222395 202058 126851 195458 310416 358754 281022 324952 474476 432221 311891 304255
18231 304255 174174 157831 222511 363511 605448 524748 518605 445822 434637 385501 273592
18220 273592 423640 360428 235790 240439 345685 494636 485476 344162 233136 217526 363445
18209 363445 510813 438796 316358 313084 164055 57505 180318 309561 340194 352089
18199 352089 473254 472362 429088 248054 201048 256145 351646 345612 419249 570189 561323 717902
18187 717902 572069 395570 274449 390184 496480 397043 359913 421448 344148 392334
18177 392334 574208 444811 440670 402906 577486 600391 556983 479195 450817 575551 551343
18166 551343 374043 337885 569499 473386 505668 687631 700790 785735 626141 501660
18156 501660 426945 367047 302094 389770 465198 445743 419643 529257 685067 677635 646512
18145 646512 648537 523962 519990 761167 910538 907432 1076659 1193136 1041455 1233534 1349031
18134 1349031 1299364 1370892 1583619 1921198 2025527 1998716 1988635 2160267 2491614 2916648
18124 2916648 3500558 4204423 5030710 5779539 6418491 7524691 9473188 11854384 15506102
18115 15506102 20386506 27805215 40244829 61770197 98520388 159397385 241742423
18108 241742423 289675756 256961452 167213933 102946181 70146842 52159379 41072691
18101 41072691 33857837 28881187 25486520 22911070 20894376 19135029 17754779 16815213
18093 16815213 16202649 15667099 15169553 14883093 14773360 14885913 14894175 14222101 13158225
18084 13158225 11993577 10803975 9934025 9186723 8657249 8022131 7316968 6758695 6232323
18075 6232323 5730561 5118717 4715337 4479050 4242269 3987026 3803030 3682214 3486709
18066 3486709 3250326 3049381 3019686 2942678 2743515 2542865 2418688 2391489 2336486 2321584
18056 2321584 2276527 2257268 2228428 2215344 2187657 2038776 1931504 1837313 1778780 1825160 1696161
18045 1696161 1618491 1657633 1680360 1549227 1601087 1718541 1729039 1569295 1327722 1083549
18035 1083549 930720 882902 1038752 1013820 870506 638217 691112 782685 707025 583574
18025 583574 649754 702789 649465 858165 965527 746456 545664 512646 480503 717438
18015 717438 866917 941676 998385 1111107 1107879 1081879 1154933 1117527 1149359 1140981 1082113
18004 1082113 1022504 1014414 1074355 995629 826279 559924 652913 852804 873898 862337 796601
17993 796601 680712 531449 535570 506992 425747 493871 631303 605411 600982 614996 869959
17982 869959 889624 562406 461347 572920 622011 622506 648149 641754 588300 588656 384049 276488
17970 276488 293325 566908 693857 579697 651082 601736 449522 334765 409200 340968
17960 340968 417084 412434 332584 406854 530610 617017 631817 505264 385281 282146 291589
17949 291589 388299 390665 316363 351313 327898 236397 153501 238357 258145 131704 -22782
17938 -22782 92984 366671 564943 474425 367502 480512 472993 331264 367455 383059 408531
17927 408531 400515 430902 196586 99110 175933 305711 315547 288198 258748 188939 241741
17916 241741 200893 207384 109036 90469 151852 -5611 -76717 36288 149793 205344 178553
17905 178553 133216 71528 118927 122301 185644 266235 325615 274335 274248 180346 98560 95605
17893 95605 40154 67585 25331 9687 -34004 53320 84980 163795 55252 52390 159931
17882 159931 35502 88295 75354 110114 65293 -17381 -103946 -43974 115423 171401 136555
17871 136555 236234 162330 197610 18545 6175 124445 317878 397253 422561 371911 226445
17860 226445 139301 214953 321904 306218 270562 379602 420500 332808 73626 -100378 -77492
17849 -77492 -19804 -127944 -168061 -109114 -122873 -68723 184367 189482 115984 57822 5454
17838 5454 37142 -119141 -226084 -195810 -3247 -59523 -132200 -155455 -109442 2697 25785
17827 25785 71826 121440 401814 396683 185223 112737 78764 50077 -25723 -2821 -72644
17816 -72644 -14343 219841 314539 231023 173720 120434 96767 228128 418716 442194 121305
17805 121305 8907 65110 77536 47500 -22854 105928 216580 342347 236581 -52609
17795 -52609 -113182 3090 7651 -18662 -41378 -48359 -82616 -36546 69118 252122 347694
17784 347694 105549 -478 228748 401758 273971 -3078 -14880 -115478 -106841 -138682
17774 -138682 -37107 -28580 66055 188050 121337 52058 120685 43430 30459 -38690 -25129
17763 -25129 -117959 -135220 46358 196394 311176 236710 162090 90219 34732 107433 25757
17752 25757 20636 -99474 -183599 -240128 -193418 -87936 -67748 -223322 -148222 -68558 176022
17741 176022 118875 210451 215529 113968 115770 134269 124249 -7365 -200720 -309392 -240203
17730 -240203 -75892 -9814 -43402 -56677 -17895 -49985 104518 221815 113906 115677 215035
17719 215035 454550 543252 367757 140062 58901 -57616 -186535 -120984 -57736 -218531
17709 -218531 -277439 -419674 -423469 -250660 131207 77349 -34684 125438 173525 96620 -55503
17698 -55503 -260918 -342079 -472624 -292622 -324340 -249821 -110689 -115468 -109165 -114492 -116005 -38839
17686 -38839 -121974 -266493 -188384 -120056 -79610 -85123 106861 121866 20451 89826 -50558
17675 -50558 -331518 -224971 -248011 -204616 -77367 -16421 138662 33963 -78148 35653
17665 35653 102436 5452 8190 7612 -16075 -49883 82481 90491 98518 103876 114651 53287 36727
17652 36727 75952 1400 -176033 -191168 -87079 -72238 -52993 48898 127445 92273 -30822
17641 -30822 -66476 -113892 -262807 -291013 -223473 -154501 -234225 -413325 -388777 -255862 -58415
17630 -58415 -91548 -86222 -68802 -42864 -68452 -21447 52850 1728 -41756 -65144 -80546 56150
17618 56150 110839 119959 79654 10613 -2367 -110115 -51805 29326 84128 159791 272488
17607 272488 296885 223702 229046 161009 189059 176095 135917 270053 215606 231617 329797
17596 329797 321096 100616 -30488 -97341 -75164 36129 57266 219613 158465 74928 62182
17585 62182 -163999 2884 29647 -47869 -123909 -113950 43606 138777 129031 81876 -218520
17574 -218520 -432088 -262829 -126669 -161055 -195049 -144549 -38774 13383 51521 76742 92314
17563 92314 43919 4717 -21473 -182737 -144269 -104212 -71888 -219702 -227573 -112610 -64674
17552 -64674 -17539 -83829 -47872 163620 175092 239428 114749 14733 115857 151586 189513
17541 189513 198931 -145713 -180764 -101158 -69778 9022 76228 -23927 -128099 -40651 3186
17530 3186 50082 76689 -82217 -136482 2426 -78528 -179452 -222887 -150253 -262595 -276993
17519 -276993 -156374 -225107 -100036 -118780 14499 40050 73122 168201 216003 245728 308365
17508 308365 207675 148230 244499 270284 382966 244852 170940 6244 -94183 29374
17498 29374 31795 -107887 -230649 -219375 -277037 -259271 30877 178845 39417 -115801 -229238
17487 -229238 -252648 -56796 54094 -43933 39005 53922 104940 -6508 -44249 -20553 -35134
17476 -35134 -83334 -173900 -149528 -56456 -196979 -171564 -67023 -176250 -4208 -36391 70143
17465 70143 174000 256230 190715 309701 333741 206430 20975 -159347 -115663 35361
17455 35361 33436 104806 159908 141425 126541 135900 136222 226669 297053 330756 447395 686145
17443 686145 1134799 1612306 1729899 1157934 535964 411899 131579 -73311 59551 167424
17433 167424 70948 31431 114868 213218 331993 242712 116111 -10811 -59046 115265 164167
17422 164167 13978 -93669 35444 158581 100439 131281 247696 386934 496455 530374
17412 530374 461691 290991 192561 2347 -104313 -13885 59417 57735 166844 77199 -134022
17401 -134022 -39154 100433 -8793 34022 206741 257665 284135 160455 31765 28720 80823
17390 80823 65287 -113203 -188497 -276889 -360093 -203252 -2524 19802 76567 -76043 -87481
17379 -87481 -18515 -97630 -217896 -309639 -256993 -32661 205057 2361 -128129 -94355 -40121
17368 -40121 5283 -42526 11766 158701 220928 186554 4285 -3 54347 -114961 -36193
17357 -36193 92192 -46504 -156496 -110388 -7206 109541 201743 266061 211819 -3756
17347 -3756 -60803 -27335 -276583 -418686 -262263 -108569 -152548 -196252 -235878 -185355 -194893
17336 -194893 -53817 31579 -75270 -137196 -163757 -109047 84424 -22323 41989 27922 -68444
17325 -68444 -156983 -274859 -252300 -174778 -264694 -103354 -17387 -58420 -307365 -271260 -119611
17314 -119611 -94984 42630 -7432 40753 77359 5714 -200304 -111471 58985 134373 66497
17303 66497 12227 -69957 -255344 -71497 88985 118646 50901 -84261 -104862 -126611 -281035
17292 -281035 -240652 -84769 -109506 -216107 -166888 -126337 -136165 -4402 115460 203153 133789
17281 133789 21174 -53686 -117100 -141170 -36193 -46168 23545 205616 115221 27463 63912
17270 63912 15603 157684 104356 50361 -197047 -332074 -241049 -14206 93601 154545 263339
17259 263339 252599 75601 -91707 -47307 128946 86857 -125659 -91859 -145824 -175120 -131104
17248 -131104 -47077 -33079 -35263 -75185 -34346 -108071 -208110 -142923 -66521 -63140 -114550 -199393
17236 -199393 -65679 190422 261759 162198 56264 -106728 -257368 -385424 -360948 -373910
17226 -373910 -302457 -100628 -21874 -93037 -213842 -193613 -124316 -160613 -201429 -161941 -82694
17215 -82694 -28364 -8503 126184 187311 81904 3133 8803 21038 136101 69681 234845
17204 234845 247566 189683 120768 315375 250709 168050 198772 3576 -174822 -327271 -424687
17193 -424687 -296787 -332518 -376855 -336401 -344428 -286637 -204696 -113801 -114549 -228036 -230828 -238356
17181 -238356 -149165 37161 24258 -70883 191851 351258 414691 435695 189320 136981 172021
17170 172021 67939 26535 -12151 -51822 110843 330228 197673 44164 -37713 -137592
17160 -137592 -156777 -140529 -172185 -271415 -167993 -267410 -377662 -383549 -475480 -441312 -360916
17149 -360916 -292341 -221759 -129657 -117492 -184240 -384307 -297155 -63009 88437 87474 53513
17138 53513 149457 131203 22074 -86045 16296 -292670 -473991 -489263 -384320 -421405
17128 -421405 -325049 -197717 -231439 -116959 79739 54674 44167 -15402 -16345 86067 240659
17117 240659 378518 424677 319737 112461 -249890 -296925 -44985 142467 101253 -25858
17107 -25858 -169848 -136564 -49174 120875 113337 203609 37460 -200711 -205415 -165013 -28306
17096 -28306 37651 -95463 -194751 -173506 -181761 -41089 165832 135240 -11386 -81404 -189718
17085 -189718 -148792 -228400 -257314 -144193 -39103 6016 -17322 -55127 -86457 -92136 -50662
17074 -50662 129907 305230 30457 -65655 -167747 -98001 7555 111412 233237 317592
17064 317592 275921 241174 17000 -106235 -92379 -154935 -124935 -122314 -2983 291752 327921
17053 327921 338505 394443 151440 2841 -241000 -483316 -369701 -217339 -189555 -166202
17043 -166202 -154260 -145154 -87735 -64567 -130143 -139226 -151250 -77270 -25247 -61967 -74622 73723
17031 73723 235374 178426 83192 -122721 -201270 -182089 -208554 -96700 163118 204457 166519
17020 166519 156879 146534 156423 163068 225599 104907 -87055 -141513 -282175 -252974 -264725
17009 -264725 -410401 -562077 -460132 -351783 -354825 -364992 -300830 -145799 -145216 -127324 -169933
16998 -169933 -210708 -133188 -32347 136063 159492 116830 86000 72553 -78921 26366 49672
16987 49672 115953 152928 155679 36608 -22089 -105638 -320292 -546405 -638841 -570056 -370067
16976 -370067 -227889 -237993 -86414 -30345 101546 175149 236168 179453 -71179 -100983 -37485
16965 -37485 -170845 -296856 -340367 -181461 -149044 -156220 -180107 -93621 -22792 5112 39645
16954 39645 26039 83029 222439 83399 -38874 73558 144016 55078 73728 48766 73148
16943 73148 71423 -12698 -47028 -53036 52495 75519 84360 60157 -5212 38262 59723 142709
16931 142709 114181 -12677 -110040 -258873 -295796 -239595 -199556 -196827 -174286 -126358 -91674
16920 -91674 26962 145412 216202 78954 6045 -89581 -104892 -78230 -126781 -108780 -142045
16909 -142045 -254233 -237958 -67242 84115 46224 26338 -50755 -42019 -54673 -1241 -9565
16898 -9565 18015 11649 -61590 -5218 -35616 35609 50685 -45479 -93573 46523 165067 53982
16886 53982 288094 388020 106204 9090 -180822 -293132 -143258 702 -13229 -25358
16876 -25358 -67081 -103961 -10001 36517 161799 74776 -212575 -366723 -303107 -204463 -159425
16865 -159425 -65371 52569 -40749 -131252 -79591 -110648 -146825 -144717 -65513 -54024 -239917
16854 -239917 -306502 -167141 -106340 -143320 -364673 -465941 -482082 -347052 -290752 -234437 -123240
16843 -123240 -135325 -81669 110352 154473 101407 -57153 -61395 3019 39391 -41157 -199983
16832 -199983 -296302 -234862 -173203 -183277 -12683 6607 159508 205908 109658 71508 117204
16821 117204 182128 49373 -70003 -102537 22002 159989 20705 66139 156240 54379
16811 54379 109258 266931 369711 408709 376206 302590 157884 192208 339501 359661 174196
16800 174196 56049 2188 40423 88984 95219 36282 178111 157743 247901 173452 293744
16789 293744 366859 173156 107426 4856 -27105 -87424 -201780 -272594 -179672 62237 134712
16778 134712 183102 113398 40597 -166824 -207234 -166331 -156164 -223489 -231368 -172985 -291092
16767 -291092 -264588 -92258 -6185 -32552 -234736 -53239 68677 117645 159636 147174 174568
16756 174568 81109 -135908 -260222 -163695 -173166 -370342 -375085 -79785 158315 94447 23761
16745 23761 -118160 -179396 -166737 -22813 78907 -25835 -60392 77534 -66138 -206635
16735 -206635 -151340 -67887 -94172 -42423 -50278 -36994 84046 122100 103743 106948 129370 31496
16723 31496 38913 124919 39756 -143381 -165095 -222204 -119885 -23596 119073 225334 279422
16712 279422 277589 189374 -25764 -42463 69901 143885 54551 62948 42471 -133016 -122926
16701 -122926 -317586 -434828 -388871 -224701 -81507 111785 -114009 -259649 -199441 -178902
16691 -178902 17347 -1013 -39538 317 16943 73651 42889 178234 281246 204214 259800
16680 259800 245801 123755 -53226 -47179 -139216 -210852 -195910 -43794 -86955 -116044 18948
16669 18948 -2308 -110063 -33970 -90256 -117317 -88896 -123726 -13590 188375 184883 73584
16658 73584 18800 2392 89998 248159 167378 -74297 -280898 -34267 72794 93215 146196
16647 146196 144384 35805 -100488 -143334 -176216 -196922 -211283 -176842 -67810 -12375 -108389
16636 -108389 -245014 -337096 -162384 164360 257547 179879 100687 -72393 -121765 -33962 67604
16625 67604 101109 78448 -33475 2033 106338 -10649 -200119 -198015 -80284 -126169 -163290
16614 -163290 -159404 -32911 49955 -64669 -142405 -189983 -73126 32448 26985 -109254 -96647
16603 -96647 48929 90323 198108 268356 338916 168938 187141 93041 49750 -89779 -212712
16592 -212712 -176977 -93566 -44902 -74471 -34473 90908 18973 10466 140501 136202 63340
16581 63340 -2974 -19879 59820 -28602 -81921 -37966 -90915 -29374 -106066 -162268 -95048 -5041
16569 -5041 60584 231129 159785 11194 -9677 -127277 -116680 21880 -8152 -53608 -41200
16558 -41200 8712 -120100 -64928 -122883 -245308 -130825 45547 -66320 -197535 -71950
16548 -71950 121432 70779 19387 -48897 -88676 37014 -26648 -67526 -189448 -274594 -230428
16537 -230428 -293229 -266708 -89873 131342 24447 -50866 -170917 -215553 -137910 -9479
16527 -9479 130602 111455 291221 385707 230331 -320 -128455 -54709 24867 119776 84511
16516 84511 103178 89575 59517 232633 375546 399222 333963 307669 182181 120484 157966
16505 157966 115460 -45698 -122162 -178429 -55199 -71474 -28296 49038 -24542 98295 268201
16494 268201 281605 302427 166200 -29849 12411 4307 -70707 -59791 12869 -102156 -43508
16483 -43508 63902 338340 402073 229225 254630 244649 53380 -78120 -138496 -289082 -132444
16472 -132444 146225 297895 418343 349562 91349 -46395 -82325 -79467 -174106 -187436 -167110
16461 -167110 -147836 120271 193540 84143 159232 225824 202815 45705 223170 277604 143359
16450 143359 221177 132695 -77752 -101956 68700 1742 -128679 -193440 5940 48129 274865
16439 274865 333327 338995 280319 299972 223090 167403 16053 12585 45154 -52919 -134086 -41648
16427 -41648 29171 12334 158239 116094 73578 62416 -71340 -154039 -200869 -179945 -130843
16416 -130843 -27412 8706 72826 144388 138033 309057 131078 80850 130919 5484 -15151
16405 -15151 40709 50890 -7055 130321 118302 -6088 24543 -45824 -76801 -122332 -318710
16394 -318710 -401126 -338234 -254543 -292536 -180614 -197158 -154763 -86301 -118442 -248710 -511702
16383 -511702 -476980 -250698 -60507 43846 142430 46180 32305 -143440 -186148 -162561 -134231
16372 -134231 -199992 -175054 -115221 27292 -47654 -184838 -141999 -102766 -58269 -3799 -169190
16361 -169190 -197125 -187542 -267952 -116921 -124165 -53435 6888 -10873 -112914 -90437 -120373
16350 -120373 -97817 -91512 -4758 94770 147844 18209 62704 -126510 -236585 -202364 -211738
16339 -211738 -219610 -143110 -63767 -86603 108989 61151 -116312 -170883 -13384 1229 -125842
16328 -125842 18935 84044 33564 -38084 -4904 -16557 -75355 -194205 -86974 39406 8840
16317 8840 -41656 -57864 -66361 -137254 -141172 1626 -39531 -62407 29483 111196 117874 180754
16305 180754 40268 -78212 -85039 15047 125365 127686 174420 31816 -154760 -64668 -73138
16294 -73138 -48440 14711 59061 -42756 -104627 -100619 48408 105747 -43329 -66761 66292
16283 66292 9102 -91547 -100456 -41522 -46749 -8610 -55189 -145579 -79672 15610 -69644 -185351
16271 -185351 -300253 -219172 -50607 26123 9555 -128171 -234454 -180386 -41567 29453
16261 29453 -65253 -80649 -96133 172254 270341 47044 -109408 -53771 -118560 -255126 -143893
16250 -143893 4351 6655 5902 -37012 59824 243599 121193 -101077 -123706 -101481 -19362
16239 -19362 -52800 -157071 -181722 -159049 -253138 -238201 -184473 -39180 110129 134525 126946
16228 126946 261664 167009 132053 124778 -17447 -226057 -272215 -190436 -113143 161581 98127
16217 98127 31482 82097 2657 -160630 -183628 -368340 -423733 -287179 76806 87157 -14587
16206 -14587 -183392 -178378 -222939 -225963 -156409 -119435 -124684 35070 165593 160473 178257 42445
16194 42445 -141600 -35231 94201 42985 26600 26711 35025 -97433 -259369 -309489 -181165
16183 -181165 4093 24590 -69306 158868 245045 65975 -44619 76836 229861 235928
16173 235928 154409 -21339 -73963 5291 82366 19248 30046 -127212 -111432 -120497 -201689
16162 -201689 -253939 -103008 -169169 -103300 82448 174115 224002 257449 251080 183533 72116
16151 72116 56855 -63136 -243417 -227551 -175908 86886 102499 -38505 -118783 -71898 -39282
16140 -39282 70580 159468 269257 210583 249041 214816 74584 35680 210 -16969 127636
16129 127636 242186 206771 126377 186355 144250 82775 114609 78165 92015 165328 165188 147827
16117 147827 140318 149381 96509 -126496 -64836 11665 -195862 -197466 -142 201658 41548
16106 41548 93774 166793 58403 22271 -211058 -365960 -252197 -94896 44742 126065
16096 126065 198960 223377 144778 -13613 -88750 24771 -541 20773 94036 83802 -44201
16085 -44201 -44692 -29872 36327 -51232 44417 205511 109038 91388 176662 108977 -178816 -132753
16073 -132753 32977 88367 78520 -54531 -125611 -206351 -284020 -244816 -182867 -93213 -54676
16062 -54676 -66766 12821 71592 123144 61489 57813 36368 -24525 95921 26270 -92146
16051 -92146 -93974 68717 34361 -67630 -188344 -165176 47908 269661 247316 32310 -15743
16040 -15743 -21699 65169 65818 -8549 117600 149596 62596 -101383 -103220 8888 28752 9248
16028 9248 22533 -108521 -235803 -123332 -232940 -328341 -180596 67804 11134 -7275 -33111
16017 -33111 -20329 -70534 -101926 -86959 -97344 -33930 21320 46870 36951 -73026 -114691 -31866
16005 -31866 -15478 -41980 -87022 -148672 -151885 -223737 -106581 -64874 7121 -20811 94234
15994 94234 166044 192533 65337 87017 121606 181973 74987 -80037 -48707 -80119 -99015
15983 -99015 -30435 -211335 -210663 1245 155563 270833 164763 43677 130110 155606 103401
15972 103401 109727 -49239 -186041 -309424 -345854 -88958 17575 33907 -7350 76001 110636
15961 110636 253789 189549 -88759 -4566 -53590 -20655 116600 182655 198836 37213 -42566
15950 -42566 -74279 -54782 -34474 4952 120566 57985 15670 79307 238728 148027 -37558
15939 -37558 36406 231751 256845 201363 126519 106385 -31568 -50723 -106657 -28841 10659
15928 10659 1188 4277 -76603 -55765 -260173 -408388 -381981 -233325 -127273 -179302 -276265
15917 -276265 -133163 -2299 -99611 -186271 -122501 -75513 -5555 24451 -1096 -81569 -65801
15906 -65801 169384 58481 -136442 -4136 223808 269876 341511 282896 149644 90746
15896 90746 136835 242530 239410 216097 169134 37506 -32657 -91310 -125740 -73430 58254
15885 58254 -7830 25304 108983 -62726 -100204 -75999 -112019 133010 367487 441353 375375
15874 375375 297657 257861 310298 348983 268081 200184 94356 800 12579 26205 -30404
15863 -30404 -109637 -164133 -77936 44702 46928 201389 155531 20467 74171 263305 313968
15852 313968 305413 300663 177299 -72240 45740 55971 -64834 -230741 -216714 -220267 -240877
15841 -240877 -234675 -290804 -357698 -279694 -142698 -79135 -163162 -139195 -49542 -125967 -238885
15830 -238885 -431478 -443959 -297994 -207717 -153834 -48635 69633 142697 10786 -94599
15820 -94599 -126986 -85005 -166445 -218429 -289848 -346013 -85261 -20031 -126429 -135356 3772
15809 3772 -78971 -69096 7657 44195 158582 192389 217982 266337 168968 33248 -25808 -155053
15797 -155053 10193 41831 -99618 -61490 23370 -131847 -133869 -61280 -81496 -25898 -2064
15786 -2064 538 22255 143541 48725 -30883 5332 74925 241562 249396 123200 57537 109778
15774 109778 264314 219173 148037 192943 238099 250280 272826 399672 422603 363898 256426
15763 256426 254099 134188 -55284 -83719 -120127 -162000 -134135 -282165 -324092 -286945 -212896
15752 -212896 -179649 -49467 242727 134186 89004 115625 42691 -77422 20623 17494 1645
15741 1645 109512 181000 105754 2802 10453 -6402 69662 72214 42079 62265 -27008 -187283
15729 -187283 -284298 -248921 -110849 30493 814 -25862 54759 25521 -122087 -233520 -303420
15718 -303420 -255053 -185988 -120497 -64479 -19751 -126884 -47918 20366 63090 6066 58456
15707 58456 62771 -36677 -24035 -204088 -213401 -24040 54044 28277 -60629 -136024 -32432
15696 -32432 -52712 -100512 -18066 -250717 -376051 -263892 -98658 -2732 -121945 -147056 104815
15685 104815 16171 -111887 -159555 -192203 -242052 -136665 -116979 -115614 -212157 -282943 -334209
15674 -334209 -325948 -186156 -276793 -353003 -220391 71259 27229 -92104 11051 -40786 108483
15663 108483 117453 22435 74377 82785 22756 75024 53337 -36474 -104796 -13144 205110 267802
15651 267802 15730 -261111 -266563 -1624 -64834 17803 125745 -20986 -87575 -32897 120383
15640 120383 110129 57993 -124618 -114710 19891 149323 27241 -35652 -114979 -284040 -389341
15629 -389341 -302931 -103404 -107727 -145081 -125312 -491 -10566 19357 -106613 -149947 -63302
15618 -63302 -25451 55378 157395 230329 209125 79228 94467 -31050 45 10850 167315
15607 167315 176823 -57351 -142855 -33753 -38560 -25878 -33775 -19816 42326 -25311 11547 -163267
15595 -163267 -228517 -150463 -212619 -116010 -18605 -13015 -29063 -135896 46356 66521 29034
15584 29034 67297 10531 -68873 36162 190076 231219 197450 192001 54492 87478 160443
15573 160443 157016 162909 121041 102311 98222 273934 358556 381747 420874 253793 145453
15562 145453 239592 294030 218294 -42732 -141011 -171993 -148884 -237 27161 -25808 -99699
15551 -99699 -301090 -316477 -110711 138596 157848 160771 196795 10179 -162038 -105121 -101041
15540 -101041 -106283 -45017 362 99210 190881 128839 54929 36401 166368 96941 12983
15529 12983 66356 116192 161880 258997 175496 -33720 -1589 142652 265875 124875 29711
15518 29711 31889 -64953 -35633 117862 163475 85167 18220 -104635 -175978 -100870 -151293
15507 -151293 -139512 -140577 -237856 -162616 6309 25211 23822 73873 -81651 -107066 -99648 -127078
15495 -127078 -95861 -45241 -115664 -174076 -166872 -157112 -74298 -111089 -105295 -252140 -239828 -91326
15483 -91326 97841 62049 -2295 61716 40160 -73140 -96455 -22729 135862 151525 184610
15472 184610 221436 224784 250972 149694 167855 239864 183049 186662 104034 54538 37947 43053
15460 43053 75748 84567 -197070 -424849 -475202 -227685 -55070 -80967 -161285 -181984 -183092
15449 -183092 -199543 -161926 -158013 -50560 114159 -99668 -148008 -153298 -22716 184141 198261
15438 198261 289523 241045 176708 191388 120953 182062 219173 237741 66382 -96663 -102993
15427 -102993 -148083 -135674 -33762 47776 206681 160361 136155 247005 146284 11708
15417 11708 -167920 -54765 24368 7274 -99989 -200250 -127985 -34898 115407 163243 68110
15406 68110 214274 177126 142055 -5539 -144491 -21110 95195 154933 324796 -14942
15396 -14942 -194774 -114851 -3881 11670 -60072 -88273 -121131 -28940 137162 253927 8480
15385 8480 -107942 45739 257666 129240 89313 -1370 33856 249824 243351 -28203 -55626
15374 -55626 -72987 -99369 80565 88314 95557 -33277 -83487 -146162 3858 -3961 1021 -33518
15362 -33518 18118 -52536 -154811 -194980 -270726 -308824 -169146 -199979 -194895 -99958 -139316
15351 -139316 -206353 -229123 -142149 -51438 -54123 23173 138964 97748 -3896 -195714 -166359
15340 -166359 -74620 -114847 -57876 14625 73080 57999 110514 200440 212821 162376 77195
15329 77195 44590 -72729 -231839 -386996 -267878 -220135 59911 225283 -9596 -116499
15319 -116499 -160974 -168908 -28128 67780 -7931 -203523 -272825 -191201 -218969 -55803 86900
15308 86900 83814 65279 54899 -62900 -20383 34869 38240 25697 -85635 -129740 -9649
15297 -9649 -20029 -116734 -10151 151178 200767 107200 14914 126969 131778 -51960 38317
15286 38317 3403 -8264 75685 210622 196401 235193 72737 -138291 -157377 -189381 -138345
15275 -138345 79904 103936 -105989 -233973 -211042 -74589 33606 100742 169400 157228
15265 157228 79894 40407 -3068 -24932 -70181 -75186 -18741 -55384 -64338 -226984 -87475
15254 -87475 179349 254924 82573 3884 91673 -7452 -163032 -146422 -64368 -51115 46600
15243 46600 -27028 -58475 -160234 -122087 30020 -75118 -31512 -133026 -234439 -130988
15233 -130988 -51481 57535 139733 125854 34556 -181372 -292418 -106756 -143928 -143521 -205099
15222 -205099 -174565 -160951 -127205 -37802 112275 145032 99437 103433 -70327 -145172 -155304
15211 -155304 -226424 -221777 -144428 -101140 -147368 -107998 -135697 -153147 -303628 -256409 -30695
15200 -30695 204703 250130 136243 30373 123400 149809 271830 235385 92923 -159986
15190 -159986 -111171 100361 156098 -11181 -140644 -157431 -36640 59583 -64780 -168776
15180 -168776 -241643 -164523 73481 163459 -33945 -75955 4462 168487 120866 -55574 -65864
15169 -65864 -70564 -82342 -116483 -88497 -94883 -59203 33558 -11499 90622 293570 323444 297369
15157 297369 246275 81206 79515 94988 33240 -27793 42606 -28959 -81380 -52256 37260
15146 37260 -3054 106755 42507 67160 116129 -26154 -27981 4463 -229756 -124342 -99094
15135 -99094 -85920 84764 163417 147609 211375 280839 302848 290982 46350 -250533 -186135
15124 -186135 -145258 4062 98434 41607 7620 71102 142654 83521 50982 -68077 -184218
15113 -184218 -241854 -281659 -99623 -128440 -44476 37431 42986 -47562 -65497 -117094 -170146
15102 -170146 -114139 -58068 98072 214539 207533 90711 48613 -45826 -150144 -74781 130186
15091 130186 187095 74367 -78859 -28080 -66629 -192501 -121371 -121353 -178585 -200899 -146830
15080 -146830 -220009 -202871 -250787 -129609 -73671 -50438 49697 168009 218785 205711 144239
15069 144239 108959 -106594 -365825 -333062 -243715 20056 121997 46001 -52913 -63811 72084
15058 72084 141176 135184 274125 195183 67314 131709 5583 -169135 -171414 -74841 26900
15047 26900 -41513 -20857 13033 -3304 170 113652 113956 -90039 -81561 -143277 -176600 -222926
15035 -222926 -168025 -26018 -57495 -179503 -70342 -70107 -159538 -183936 -158802 -165276 47077
15024 47077 168340 163207 -711 -76350 -129904 -114730 39178 -55500 -87238 104120 151199
15013 151199 121990 281782 397094 513527 627641 654769 744149 1109283 2060210 3232810
15003 3232810 4530508 4701373 3748065 2387048 1502903 919227 586093 479012 297242
14994 297242 189234 134210 10425 -45626 189259 192281 100934 144964 235137 170971 226530
14983 226530 230916 132766 241579 437821 396567 85324 -126930 -112480 48135 50417 23317
14972 23317 112016 294680 294578 198104 107351 216936 225434 301237 227261 200111 347599 178924
14960 178924 -40894 -84547 -72356 -195184 -36909 -98283 -271726 -244987 -237935 -72640 1389
14949 1389 -14289 -34010 70787 170246 106202 -8408 25085 -14407 -102252 8626 74032
14938 74032 -23667 -150486 -137229 -115375 -149090 -93641 -97709 -120199 -131415 -38457 -107802 -34644
14926 -34644 -23129 -151156 32423 190375 124636 133346 195051 125382 -58574 -129097 -81462
14915 -81462 141154 201051 3038 -45185 -140684 -19446 154008 209579 122988 174006 383901
14904 383901 443221 264834 219693 138303 44931 59734 186107 295283 240190 142633 98917
14893 98917 197619 334573 134729 16104 126272 209704 322076 239662 125961 77556
14883 77556 70970 12057 28830 -24565 -18866 195736 225751 129652 102735 87185 115554 705
14871 705 -102492 -102963 -107286 -165780 -174528 -250984 -145825 -147643 -123877 -230947 -380464 -431113
14859 -431113 -264559 -41104 50302 34107 123046 -26768 -215204 -19535 180917 63433
14849 63433 -40261 -126833 18058 191648 105712 111463 44306 113822 148567 191422 119226
14838 119226 99188 95867 -21150 -81334 -49981 -39690 -139839 -141669 -163482 -222877 -118374
14827 -118374 -113103 -112159 -3722 10256 780 15388 16645 -42293 -191568 -182884 -230941 -268091
14815 -268091 -344044 -339883 -265886 -173526 -110635 12933 97671 -27886 -220345 -51153 -28073
14804 -28073 75616 155734 199222 323272 159019 20736 96027 59997 -100268 -93505 -133339
14793 -133339 -118588 -75851 -104682 -36150 29136 19080 -86908 -48608 225577 220661 142288
14782 142288 -53142 -113348 -180620 -159127 -225634 -224975 -90488 -180697 -101556 -35948 -36498 -109047
14770 -109047 -149133 -122712 73917 206864 307498 362498 320661 330081 528805 518987 464229
14759 464229 239773 84309 194745 197238 218929 219525 122156 -4654 155326 266031 291707
14748 291707 227139 268986 108126 121780 142237 142626 94706 174594 221563 136816 89992 -70404
14736 -70404 -305606 -184959 -198024 -198707 111930 149956 198474 151994 66116 61474 17358 37265
14724 37265 213926 357576 334788 324713 334449 368124 255627 250890 131600 -14339 10655
14713 10655 98978 -67124 -51774 14813 -73817 -75387 2487 79400 51062 -4617 -49026 -262094
14701 -262094 -220942 -88027 -164476 -354750 -277757 -142825 -94044 -137876 -82365 -164539 -134422
14690 -134422 -117929 -20496 -64633 -114259 -79626 -32453 14879 15770 37874 -67714 -203182
14679 -203182 -124300 98080 193708 178038 155827 -59576 -7593 247819 233338 12152 -100565
14668 -100565 -88107 -14080 -76352 -169056 -154806 -78899 -92088 -145341 -137632 -61386 39115
14657 39115 -55132 -14904 200240 171766 106444 151162 76957 93630 22803 -189141 -186029
14646 -186029 -30966 15935 -78530 -8214 137682 55060 65601 119855 175256 -16079 -320210
14635 -320210 -232988 -205523 -204636 -68077 44988 93898 62054 25393 -118227 -225946 -222186
14624 -222186 -188708 -105407 -63765 -68423 49386 227776 194614 304596 267846 58225 -163901
14613 -163901 -140413 50565 -24561 -50907 125712 291494 250968 169799 116129 -31340 -57609
14602 -57609 -39568 22430 146147 170048 143479 209693 95793 -157625 -178673 -67000 106287
14591 106287 41640 -150121 -139467 59251 141041 13659 -180035 -208801 -85202 -57357
14581 -57357 -117265 -94621 -141910 -71192 41769 -27313 -78472 104490 88608 100061 -4211
14570 -4211 -62593 -119390 -49732 79749 78733 172760 48890 -107201 -140785 149349 273373
14559 273373 280032 175759 81165 160315 272538 191707 -2189 -255509 -340548 -131582 -56900
14548 -56900 -40217 -55448 -159951 -242107 -92834 137268 177919 106148 140821 194405 183065
14537 183065 56954 -32455 18114 145934 34185 106935 199114 266745 161690 249087 229903
14526 229903 152638 125536 83018 -18008 -48388 70251 7716 112109 207949 217525 86640
14515 86640 118538 291645 219504 142345 164166 167088 158410 121046 74358 105196 47360 -109712
14503 -109712 -157104 -77436 -26008 -5842 78333 51067 63919 -65118 -65833 -14779 -66687 372
14491 372 284374 275948 186726 130446 75651 -4308 -159002 -379858 -276121 -192109 73987
14480 73987 93520 -105514 -263976 -274179 -86311 -53011 -94256 -27449 33998 34154 -32220
14469 -32220 -75006 -149889 -273953 -207358 -11697 149001 254631 181929 119461 113422 170307
14458 170307 180939 199657 303325 233394 28147 11952 -147562 -223281 -223513 -214410 -109847
14447 -109847 14868 70355 -65141 -154206 -52896 137126 -3196 -30831 -16205 64136
14437 64136 296575 265357 255397 156784 -174709 -229177 -159009 -93742 -27468 -9178 -188597
14426 -188597 -200816 -205390 -207457 -143219 -89003 13057 25865 19637 -133406 -107888 14269
14415 14269 166692 376094 301571 177541 363791 380406 61345 -71211 -4588 116648
14405 116648 178105 -28897 -73924 -19361 -96202 -104449 -15187 147081 205580 66782 -96042
14394 -96042 -180994 -148759 56448 85566 -78626 -58244 51088 219532 256786 205110 239284
14383 239284 430651 314752 272063 59906 -134900 -25642 120213 136560 64444 -140586
14373 -140586 -102705 -233786 -235906 -24850 76730 -75295 50272 36680 -71098 -140119
14363 -140119 123220 142912 90048 177761 131964 196720 135335 46926 -19219 145994 266796
14352 266796 163795 142243 110800 76091 89782 136990 90170 6151 -11110 113840 -51663
14341 -51663 -250369 -12569 192759 239621 329123 324933 155442 210792 218411 133131 128724
14330 128724 88687 5876 -62259 -2504 204348 206552 148984 112057 39679 -76944 -248127
14319 -248127 -126288 33987 78715 30891 156760 99922 -39918 -162462 -140714 -80523
14309 -80523 22063 34629 88672 144668 8656 73274 28215 -10926 3109 -1417 -166403
14298 -166403 -202995 -150391 -4898 36502 -70617 18748 5414 63898 254363 345375 372966
14287 372966 336288 336918 133982 11833 94887 209750 127262 -2700 -64492 -68116 102372
14276 102372 99101 23690 -54986 -255200 -195119 -233366 -140371 65308 104378 38903 -39484
14265 -39484 -29668 28609 36470 46362 57951 -60031 30980 169968 106766 -150304 -262912
14254 -262912 -25247 68083 101615 83848 185456 137858 167514 167551 49370 -110114 -86527
14243 -86527 58315 -27977 -155412 -190963 -99473 -25762 35308 -109276 -52222 117886 196614
14232 196614 271497 253611 265246 68505 -71078 -103059 -115305 -29461 -85384 54642 138824
14221 138824 42783 30095 124705 -30519 5414 -21361 5575 67884 43871 -3212 -92923
14210 -92923 -8345 140285 105379 88866 37706 -25028 51513 254832 263596 272256 146619
14199 146619 119170 152227 128696 -13318 -45447 -171656 -173733 -127725 -157289 -28401 22233
14188 22233 -49420 -115063 -49163 -226308 -309228 -253220 -92436 -41249 38248 -1377 171044
14177 171044 212508 152429 23569 -95298 -24099 10326 28100 109429 45481 -92250 -198992
14166 -198992 -129051 -79361 45917 218962 254650 209028 133054 7971 -131211 -157337 -281004
14155 -281004 -242074 -121058 -219803 -40128 125765 164999 -13674 -123242 23174 64663
14145 64663 62749 58130 86975 154498 39630 -143 41020 74552 10206 12889 -109384 -119427
14133 -119427 964 236899 256449 191043 107213 73572 8840 -50316 -161833 -189814 -91692
14122 -91692 -130428 -127367 4545 -30633 -128829 -189121 -238527 -149867 -182884 -239632 -214854 -159181
14110 -159181 -110411 -123360 -105881 -139691 -77478 -15817 -68454 -199980 -286786 -247382 -247425 -45230
14098 -45230 -11679 -10464 102898 161717 292766 136051 -93819 -123063 -16110 72757 157906
14087 157906 288754 206146 296268 278371 208497 158884 271192 187905 11209 -4329 -85627
14076 -85627 -194858 -1571 9219 5934 67181 103831 145923 9651 -183740 -224892 -121353
14065 -121353 -104031 -136984 -109860 -71012 -90040 -65348 -56291 -127280 -308650 -258533 -173140
14054 -173140 -39362 105264 55850 19992 71185 132608 223084 84809 -56056 -140490 9418
14043 9418 187578 231500 93563 20342 92437 132651 155357 200516 231875 157428 -30664
14032 -30664 -118651 -236538 -139765 -55629 -139950 -94401 19193 36392 188298 388616 278912
14021 278912 68255 146528 166169 134239 220695 181828 317319 446389 400363 296952 48928
14010 48928 -52776 -164594 -155866 -44152 -47802 -35734 155055 107875 56907 11219 59677
13999 59677 118802 160455 209966 212395 149778 111414 95474 161250 135751 20887 -114660
13988 -114660 -218860 -247470 -122682 -32945 132644 110578 133973 68063 74006 226224 195167
13977 195167 141107 424286 469293 327293 368776 438966 249409 60631 -121014 -121998 -62762
13966 -62762 -83308 -80155 89032 72875 -65272 -76558 94515 78559 -26587 59548 35829
13955 35829 5424 -159473 -177261 -246018 -352948 -250279 -84038 25224 -96931 -179548
13945 -179548 -157905 -153844 37888 114819 8672 11463 -5738 36923 234612 340620 417260
13934 417260 253217 288231 417362 477297 405559 269249 176104 94684 57392 120589 22525
13923 22525 104297 173466 302023 441789 262504 124114 66674 -127410 -246970 -322642
13913 -322642 -230329 33447 185405 232197 122758 119428 80897 -64195 -222131 -300671 -426724
13902 -426724 -494698 -384548 -512840 -453886 -381574 -214312 -78966 -136749 -96570 9662
13892 9662 13436 95608 93389 77052 -9782 -143153 -59644 231153 159436 61223 -47308 114258
13880 114258 233995 158137 8253 1884 27315 147828 154508 119656 162373 100449 -244238
13869 -244238 -443618 -210645 -64967 138958 228164 86067 -20965 -84393 26206 -40411
13859 -40411 -283660 -204726 -115295 -68267 -65106 -26279 -10221 -19478 114795 58672 -50946
13848 -50946 -53201 -12850 71649 177904 220702 220513 248431 157053 -118948 -114624 -123143 -27873
13836 -27873 333988 230554 50920 82161 94060 63320 155136 79992 20998 36895 -31535
13825 -31535 47868 42335 59131 206365 -68122 -140904 -34552 180410 134460 -82129 -60901
13814 -60901 82385 15764 -37985 15112 21899 25212 88163 15613 -104344 -32805 22476 29191
13802 29191 73958 112040 -29411 -203409 -83120 -56058 -92681 -190605 -92074 40268 95173
13791 95173 163933 220473 112059 29827 -217927 -129649 28760 162018 191427 90770 59029
13780 59029 52646 292539 264438 64714 159656 176547 154466 72273 -15185 -56173 -19373
13769 -19373 -338 145574 182137 2210 -87165 -2997 116613 228587 143282 -16191 -122152
13758 -122152 -44537 -117278 -127616 -21019 48763 104374 12854 -104326 -174126 -52640 123727
13747 123727 117423 -106105 -45025 10412 -207689 -266858 -289171 -320084 -181424 -78427 -24117
13736 -24117 149336 212628 223680 171167 106307 131805 122615 -30640 2825 166628 226229
13725 226229 232314 151014 -83011 -180732 -131036 14829 12486 60167 149554 185051 143643
13714 143643 198531 221710 183471 23425 -2964 3642 -116145 -256407 -113009 127002 115602
13703 115602 90423 29187 -92451 -294955 -171830 -69338 95094 186788 253038 334554
13693 334554 282844 59635 -185351 -186035 -126679 3934 41482 -32249 23561 54070 61108
13682 61108 52634 55464 -33373 77155 98493 94390 127578 150830 17266 -83386 -129813 -220085
13670 -220085 -229891 -212360 -135810 -65192 49923 68459 49338 196801 195099 63388 -103385
13659 -103385 -32261 14880 -15853 16019 -95641 -126609 -75185 56429 90633 8968 134411
13648 134411 237241 69892 45491 -76109 -192270 -97622 -182729 -82748 -14383 -94941 -120466
13637 -120466 -181304 -86521 60614 103037 8556 -77142 -2752 -151306 -126054 -96853 -152035
13626 -152035 -27677 -57701 76925 173002 173340 104612 9712 -3373 19966 65039 24859
13615 24859 -22529 30780 39279 -87914 -279202 -210201 -124524 -284263 -443743 -238399 94229
13604 94229 251920 258968 -883 -79138 -226212 -10227 36832 103904 36218 -16027 125806
13593 125806 89758 134971 74044 -153099 -182069 -123672 -69611 -78522 -110843 -109852 -194332 -307909
13581 -307909 -266249 -259117 29226 61445 -145295 -136916 41037 149876 216507 216697 188118
13570 188118 250979 81117 87834 98874 -23667 -161372 -126444 -56442 -129205 -83298 31720
13559 31720 67276 -69471 -40106 140095 191402 102867 37563 70285 -94303 -168332 -11136
13548 -11136 88965 -248 -59884 -71760 -136813 -221588 -167541 -258478 -146046 14182 106014
13537 106014 97296 161584 234708 168374 150696 206088 258763 222530 93328 79791 -5123
13526 -5123 68511 227417 232750 -16248 -129746 -79588 47376 -8166 -173153 -334109 -452793
13515 -452793 -313898 -116911 -113720 -112520 -162320 -114524 -144772 -244750 -188100 14711 234767
13504 234767 120730 -73934 12563 117891 -15111 -145774 119619 244198 131630 -50236
13494 -50236 -228225 -241874 7800 402746 330810 279653 56830 -130169 -141599 -27362
13484 -27362 -116923 -110806 13316 -22397 87413 112329 119979 34344 35797 129391 75796 57227
13472 57227 139297 242234 49008 -90691 32247 252033 315696 134101 -125287 -141557
13462 -141557 149839 75386 150395 218975 98900 -69334 -277329 -160932 43053 79250
13452 79250 24872 91510 77895 -68530 -234019 -79408 222079 344265 227457 137089
13442 137089 194273 217274 109289 78577 -52436 -72675 -36139 -87719 -109141 -242466 -383915
13431 -383915 -262548 -64993 93533 70400 -23116 -101057 -106515 -74266 -108908 -217871 -350949
13420 -350949 -239890 -134160 -137643 -234643 -200810 -96290 -104403 -207362 -144048 -67137 25811
13409 25811 220250 324443 226756 -15190 -137467 -137375 -6429 -89604 -80603 -72376 -131724 -26256
13397 -26256 238479 256381 23650 -23249 -85604 -42123 81203 -52401 -365935 -434831 -274403
13386 -274403 -350788 -425681 -462430 -319848 -154469 -111312 -227831 -192593 -185748 -71931 126790
13375 126790 183659 248823 117959 -16685 33838 -2223 32840 173597 250784 196976 222265
13364 222265 163044 -20260 -110278 13917 -21545 15497 53960 116284 75107 -116086 7221
13353 7221 33662 -23250 -10829 -72003 33063 52771 -3557 -158374 -178321 -150395 51643
13342 51643 63634 90964 75012 129622 53244 -74635 -98149 -42858 -45625 -67161 -159955 -147459
13330 -147459 -331908 -193408 -111730 -88842 38795 21399 -83487 -112375 -193628 -195644 -156980
13319 -156980 -55673 22639 128164 62379 89746 140772 48049 -85674 -48498 120967 100452
13308 100452 27751 56955 136814 -20962 -21760 199534 311703 244903 -73474 -283830 -297578
13297 -297578 -232471 -101345 -80402 -59830 -59177 -166390 -145697 81561 228440 188507 -57091
13286 -57091 -70115 4271 106732 69006 118126 84127 37115 157733 40270 -221487 -116738
13275 -116738 -93146 -168397 -140572 -169829 -161693 -206575 -61612 -52304 -146556 -110032 -191261 -263703
13263 -263703 -526214 -613788 -506066 -391504 -239500 5580 96256 160233 132593 -60819
13253 -60819 -114115 -197382 -225849 -198818 -84478 13968 106894 72263 -38041 -105389 -233276
13242 -233276 -256887 -193131 -111973 -133647 25937 185527 119139 -53455 -118164 89546 34472
13231 34472 134473 122157 113992 -25960 -99986 -88335 -68370 -79827 -35065 -144554 -135561
13220 -135561 -146168 -46915 63626 -3830 -78134 -65743 -10423 7563 -89587 -85204 29832
13209 29832 -18964 -9788 -41619 -42557 123782 162075 35867 -47310 11533 -32362 -169622 -109195
13197 -109195 99162 178491 190215 195975 86605 104205 265167 309880 338190 462545 333526
13186 333526 262438 172908 -62945 1235 211074 142134 196032 185167 -9912 26646 71189
13175 71189 35154 -53977 -161973 -115588 -89463 -93557 14362 53915 -38942 -193398 -215893
13164 -215893 -193636 -340158 -454659 -227803 -114950 31828 141645 231088 173484 -114589
13154 -114589 -212571 -105931 -250002 -70029 145348 245675 279043 263311 156460 82484
13144 82484 -43776 -195816 -4529 38526 -139348 -173581 -192024 -164274 56748 25417 114567
13133 114567 209417 177921 184626 73678 -71847 -58367 110945 191336 208504 219356 56419
13122 56419 -53021 -45919 -760 43473 140400 117835 62439 74246 -33289 -660 -72601
13111 -72601 21392 78737 44094 32439 113695 80859 -35877 -173383 -91646 -118001 -100084
13100 -100084 -160218 -262335 -322311 -213547 -129774 -97549 -117514 -187848 -164399 -180196 -214975
13089 -214975 -171598 6949 33370 -123969 1496 81286 -179110 -228121 -120311 -18775
13079 -18775 -105888 -115481 8181 -2901 78562 68498 85940 101523 70969 105716 152309 29054
13067 29054 -147102 -283318 -284955 -123702 -119215 -51712 145326 152783 168972 176253 -43328
13056 -43328 -132222 -14108 -36378 -9287 58253 -159552 -272943 -66884 96711 125370 123148
13045 123148 117350 244395 320781 296868 182803 -12710 -54560 -83995 104418 -38038 -59658
13034 -59658 -28550 -30999 115680 150981 140414 215722 294492 123893 -14666 -35660 187129
13023 187129 -35109 -174031 -203292 -134234 155484 -9526 -286882 -245596 -66282 90562
13013 90562 22332 -31659 -50389 -69628 40635 98987 73744 27067 24495 122179 267677
13002 267677 164804 32665 59609 41440 -25860 75055 205282 308215 156922 -28142
12992 -28142 55054 -64111 -31388 102446 83385 174821 110356 -38296 -109371 -96653 -249609
12981 -249609 -273872 -69253 84865 163488 226589 126894 -113359 -153325 -43960 200148
12971 200148 225054 180412 92436 -60937 -152025 -69473 33053 -35666 -184687 -132488 -184047
12960 -184047 -237282 -201570 -145094 -22519 76974 15483 -106351 -200141 -111541 -2164 4055
12949 4055 -90742 -55445 2854 9153 68600 -52939 -82047 113510 165564 77176 -8696 -51164
12937 -51164 48970 176827 237041 236898 207962 287276 359426 357420 219304 109394 49687
12926 49687 -38302 21987 68419 -57855 -125702 -84592 -110051 -117789 109663 216198 166566
12915 166566 111167 74428 299992 302955 280133 219479 141664 58930 42638 303366 377600
12904 377600 197516 112234 82551 140222 137076 246094 237831 133836 -33401 248597 252752
12893 252752 146865 130393 267850 398433 406338 361074 231922 217439 331851 309393 131873
12882 131873 20994 28672 11934 98251 186154 178319 99507 56183 55706 55121 221132 101563
12870 101563 19221 -19699 -131032 -264014 -189348 40253 8821 -75957 -35193 -138144 -105493
12859 -105493 -10672 -14840 -164007 -157700 -83147 39950 22114 -38535 -177869 -385495 -368114
12848 -368114 -159532 223602 228849 86868 -144621 34508 162874 315952 385619 362259
12838 362259 144048 93709 61784 5175 -68994 49703 99693 47285 -156278 -193536 -123378
12827 -123378 -96911 14386 -28416 40627 184956 163320 155365 280819 267376 290335 76140
12816 76140 -232772 -365123 -291261 -125505 13434 126300 171902 81085 14606 8278 43588
12805 43588 131950 274723 226707 19733 -122579 -18107 165127 227358 157898 141263 234333
12794 234333 160566 -58626 -169607 -192911 -184832 -197789 -170271 -77252 -38928 -13592 48238
12783 48238 163779 245584 58184 -57482 85404 229527 184655 118516 79527 -100520
12773 -100520 -31229 170494 30984 -43360 24714 112023 -56324 -205297 -82340 -66475
12763 -66475 -139320 -147287 -184467 -163367 -46216 -51152 51775 167168 157518 208779 247770 262456
12751 262456 221881 229935 268059 217268 221762 213157 56043 48480 131009 68641 113799 254647
12739 254647 378963 199644 56097 54849 137254 63583 68309 36878 -140436 -197354 -110653
12728 -110653 -118781 -20869 -11522 -127741 -77746 -153135 -168363 -78017 142847 294461 270737
12717 270737 249172 90308 -39698 24818 35608 97908 200504 108943 48354 200387 244764
12706 244764 168552 175512 239859 161219 43664 51949 262451 226916 60988 -803 -146037
12695 -146037 24656 184402 171275 270451 349244 177372 173287 83330 5008 148855 185531
12684 185531 135336 43771 101209 211015 30804 -119360 -55863 100011 31107 -9123 -80002
12673 -80002 -214625 -185980 -116089 -143470 -6324 -4587 -62475 -178113 -160844 -225380 -48490
12662 -48490 69233 -4562 73004 95159 23186 -37341 -86828 -91523 -27009 -3085 39176 28555
12650 28555 -46009 -122459 -116559 -54616 96742 -28523 -62290 -65095 -59218 -73672 -56281 -53121
12638 -53121 -112136 -37370 163714 149471 85062 53572 85652 69420 91 -2518 -70896 -100107
12626 -100107 -120204 45949 113562 92060 76708 236476 247555 106740 -88075 -182034 -198080
12615 -198080 -301413 -190745 12635 89947 -108456 -261108 -265077 -106043 -207591 -164438
12605 -164438 5705 25474 -85082 -180548 -304402 -47258 95841 258509 205325 198950
12595 198950 194895 26342 -243729 -231838 -72966 38346 -7660 -2129 100417 53441 78954
12584 78954 -40979 -141806 -248029 -269125 -166715 -73988 -91503 -197470 -95465 34187
12574 34187 -43136 -162159 -199295 -230865 -123965 -101730 -57729 103108 316196 377414 427333
12563 427333 306329 129243 50479 -82827 -57317 -149379 -7487 135849 104197 129206
12553 129206 -76924 -210756 -163891 -25291 -70701 -57644 -230260 -205139 -178603 -35120
12543 -35120 -38552 54527 154753 92958 73189 69716 58212 63 -96713 -164298 -87902 -5498
12531 -5498 -68531 -80564 -65236 161795 325112 275929 239879 222729 110515 19917 -89501
12520 -89501 -94127 -42835 50337 144689 8633 -10633 224532 215384 112827 79504 7160
12509 7160 -196523 -345037 -260123 -62389 -5032 -110795 -221787 -207931 -102008 -34520 145285
12498 145285 34252 160797 174283 40331 -141479 -218478 -286248 -252867 -171113 -8942
12488 -8942 18546 -34931 -126546 -308113 -287654 -168379 -8623 -20852 -69885 8538 127396
12477 127396 100249 344134 493494 289304 324894 228931 73303 -4188 -88743 -39129 107318
12466 107318 51185 -79250 -109729 53923 85072 -41019 -115399 -60829 135509 126653 44762
12455 44762 -108168 -196731 -260181 -239108 -14825 1661 -81142 -34306 -62019 -62169 91981
12444 91981 33385 -43133 37023 92034 43286 -6575 38507 -8220 21424 3276 38299 136183
12432 136183 59048 83479 -4483 -136632 -163721 -258019 -277619 -50663 -38061 -140871 -94866
12421 -94866 -98972 -82272 -98296 25671 141894 296410 175134 55639 50465 20703 -164919
12410 -164919 -126048 -90418 -5510 14852 -136873 -326992 -433915 -356866 -217849 -209378 -153339
12399 -153339 -159439 -122543 -58611 -47800 -19086 -184429 -165307 -317347 -215170 -269008 -325115
12388 -325115 -268885 -31552 -7234 -73639 -118113 -65946 -213965 -184437 -37970 -159486 -201519
12377 -201519 -276175 -382731 -361678 -313660 -418045 -244388 -49885 -164528 -290164 -25125
12367 -25125 49457 -86277 -236558 -94339 65096 28969 -169937 -232091 -239039 -104733 -65228
12356 -65228 -24083 -45937 -10669 65462 176619 316255 160145 15876 74531 -39891 -102061
12345 -102061 -125634 -195018 -105674 23925 -15697 -22191 137794 79258 48750 -9890 -450
12334 -450 -3553 -40612 -40184 -48048 16173 147679 -65086 -158124 -143221 -44212 -98387 -76390
12322 -76390 152895 175151 137065 -76011 -277921 -319417 -117615 67695 134592 293617
12312 293617 370450 105014 88352 151337 -4299 -236761 -123010 -71368 -137843 -105201 5236
12301 5236 -58011 -203791 -246792 -267661 -232461 -128757 10532 -259681 -207464 -11242 65789
12290 65789 83923 -8485 -30615 -44435 32451 17577 44507 -36464 -140335 -203490 -229272
12279 -229272 -211010 -232742 -181165 -61060 2123 -29789 74461 -41413 -142624 -72186 19330
12268 19330 -69484 -92554 -154149 -33625 -68857 -69906 8545 178813 83528 -352 -55984
12257 -55984 -121033 -283607 -238826 -5953 128867 92902 133668 191470 18433 -55486 -38023
12246 -38023 7187 -39980 -131189 -104444 -148235 -235393 -129626 -21755 -70538 -87962 -202111
12235 -202111 -255089 -185734 -106796 -160246 -172801 -195270 -224960 -137296 22376 30018 -27708
12224 -27708 102518 160149 259307 342745 239563 115946 104731 -32624 -81624 -41693 39215
12213 39215 86095 130550 138088 67422 119100 293352 353401 364867 337811 306629 272837 376023
12201 376023 246288 120019 136652 45956 75334 95929 215917 333211 72157 14764
12191 14764 31135 -23891 -62233 -83288 -42238 -69686 -134474 25772 -81949 -211146 -277348
12180 -277348 -159184 -144026 -214690 -189565 -270651 -350785 -188139 13609 -2266 -42794 -167067
12169 -167067 -109600 -12211 -3618 46550 10808 76513 176650 71860 203922 317859 191456
12158 191456 160156 120601 -105396 -107314 49048 60037 -10392 -182013 -58143 34071 -18537
12147 -18537 63501 189995 202314 66448 8840 -70149 -123689 -143312 -135633 -56058 -22126
12136 -22126 105358 258561 391460 443338 377770 78034 -92753 -228852 -197839 -69262
12126 -69262 167704 151697 68732 -169838 -376783 -211689 -42737 -163545 -190981 -133046
12116 -133046 65927 122809 147843 -104054 -288017 -129565 -137692 -193769 -102271 -64720 -78432
12105 -78432 -53539 2188 110951 95972 28894 48709 33877 62491 103320 104423 195723 225198
12093 225198 188287 162865 72911 145297 134685 70571 26765 -179415 -24427 107004 87465
12082 87465 -26429 -71684 107711 196903 216486 29470 -162869 -115639 -33693 28928 -34442
12071 -34442 17053 -23483 -123769 -122540 -77694 -52454 -123451 -32228 -51069 -34274 34075 55621
12059 55621 -115108 -134145 -81910 71842 241913 216572 121774 206069 205517 120175 84275
12048 84275 98462 113094 29940 -66700 115158 355975 262801 76519 -19633 -58953 6088
12037 6088 155646 228393 73315 -77679 77686 111086 120282 242127 113079 -86391 -92600
12026 -92600 -51083 151554 273297 313619 354017 283439 173239 67428 49787 -51567 -177375
12015 -177375 -337179 -351967 -366764 -385062 -370799 -200639 63623 126598 -64281 -154920 -263155
12004 -263155 -139911 13537 3462 -21020 -16390 -220678 -260048 -242666 -193113 -182141 -109978
11993 -109978 -77498 -58916 -208451 -244097 -200686 -159466 -22774 -93392 79192 185602 87628
11982 87628 -34356 -125738 -32108 102127 200120 77516 -14908 52682 82900 226275 301444
11971 301444 158804 119051 32766 86437 -97382 -185731 -93320 -166115 -10712 54414 81070
11960 81070 -124959 -106769 9405 -10719 32985 -288 1187 28964 46373 62855 150888
11949 150888 130510 83470 -150663 -231349 -200475 45562 110351 32654 -79387 -181281 -120150
11938 -120150 145112 189261 59024 -42123 -160188 9198 127164 92458 -27271 -42006
11928 -42006 -106001 -71901 -30522 -35299 -31073 -25175 13096 -29636 -81620 -122814 126117 210642
11916 210642 188170 206720 320121 212890 42116 -58128 -46788 149320 133493 -96396
11906 -96396 -207135 -94795 10367 100782 228685 99533 -21356 168626 253901 7475
11896 7475 -370802 -311604 -102282 14480 -41192 -51128 27884 5273 -150925 -227376 -295274
11885 -295274 -91620 -101033 -220637 -235107 -224555 -274611 -189263 -68388 61925 46300 125569
11874 125569 163338 155371 209962 36793 -39150 39104 46305 102896 10066 -61332 -137473 -258089
11862 -258089 -171871 -101761 -131730 -77846 80843 201294 238133 84659 96238 103390 26558
11851 26558 233861 152202 80781 13739 -29077 -12178 53502 110302 201328 230391 138199
11840 138199 63635 48761 4755 -36627 -87581 -103937 -29353 94018 -19791 -31616 266650
11829 266650 519838 395228 212703 83232 131338 121634 179577 110589 25308 40241 26844
11818 26844 50947 153909 7030 -52740 24288 3224 57617 127635 194019 290040 136514
11807 136514 -47961 -95640 -79861 46004 124904 67212 145344 260407 220247 260919 255115
11796 255115 246437 163008 55907 25747 15321 131832 166178 12141 98585 73486 48612
11785 48612 93282 -6503 -167110 -194044 -63155 -13794 60486 137608 172132 49352 -25260
11774 -25260 -237257 -376421 -207966 -124225 -200471 -13222 -71085 -127424 -331049 -240897 -115650
11763 -115650 -291077 -269949 -241873 -211395 -139871 -212075 -138778 80453 87475 75565 182139
11752 182139 40428 -28813 -46478 136184 -41231 -142425 -175903 -82152 -2304 -1274 -88216
11741 -88216 62872 97721 188509 90021 84704 88004 175612 67355 82874 236863 161829
11730 161829 172993 198944 112867 -116672 -212769 -283506 -240374 -99178 44362 76307 78788
11719 78788 157714 61425 -44219 -5858 29759 72420 53388 -71224 -106253 -77267 23330
11708 23330 31392 -153411 -287490 -238069 -118980 -174802 -299835 -292128 -131130 -204579 -314432
11697 -314432 -128002 -140702 -128424 -92461 34410 184253 249141 132034 116761 50618 69689
11686 69689 63487 -70506 -47414 7910 -22268 23831 206202 77542 151865 227363 129691
11675 129691 32644 31086 381421 339817 100138 13644 -92974 -96396 59887 3498 -69532
11664 -69532 78594 154111 103655 56193 -13895 -170084 -68279 125591 107793 86074 140662
11653 140662 246382 152326 53713 88727 93777 202678 117676 55503 -47801 -82290 -175350
11642 -175350 -64967 14944 -18379 -88500 -21856 -128856 -94356 94277 -58050 -40768 98608
11631 98608 62076 40271 171730 152984 -19231 -62725 -46617 77089 -19173 -187912 -178292
11620 -178292 -171196 -173777 -255842 -143363 -72086 -63697 -115300 -35344 58277 71442 70542 4924
11608 4924 -40871 -32823 60248 129079 -1094 -203590 -198034 -250804 -303290 -267288 -121753 9362
11596 9362 97306 -5126 6342 119170 80249 172953 71393 -13821 -55525 53983 50472
11585 50472 -9239 -49281 -168418 -98110 -59985 -52218 -93534 -123561 -63352 84051 96555
11574 96555 -4775 -195505 -243308 -107208 63542 3513 14090 107573 154726 73721 222393
11563 222393 172409 156904 117509 85845 222075 210081 150200 128949 86786 30938 -31022
11552 -31022 -106980 28122 -17728 79737 15640 -70770 -66364 -37987 50181 87368 -120928
11541 -120928 -81741 38062 -53814 69812 188705 94012 154013 140258 241632 169320 -17462
11530 -17462 12003 -44325 -50941 -158702 -235392 -166468 -48262 116391 35403 -86751 -45171
11519 -45171 -88719 -237884 -365845 -281489 -119942 -48534 -123932 -156354 -71505 15279 -180499
11508 -180499 -314711 -234719 -135871 -135348 -221273 -121125 299210 326472 164014 125153 178752
11497 178752 93239 21202 -283417 -388358 -218712 -133934 -106965 35503 18326 47587 205794
11486 205794 166288 81372 -55269 -75251 -149082 -73445 -76741 -106372 -285166 -395201 -307178
11475 -307178 -247250 -132021 -33338 2961 -5575 14227 32117 -71505 -136609 -33779 221438
11464 221438 193254 201160 186524 153774 36330 141092 203297 252340 346485 311783 255079
11453 255079 245033 292762 230193 127122 16667 -18205 -74138 -87079 -196370 -120166 -2651
11442 -2651 -69367 82035 149137 135042 225517 199606 136135 72598 125051 166390 167340 42780
11430 42780 -2059 107311 73564 -143229 -296213 -385483 -357073 -229182 -72323 -207788
11420 -207788 -217556 -37148 230401 233858 248390 289950 372624 303679 76098 -243443 -422990
11409 -422990 -368763 -240057 -52555 140313 -85646 -185926 -251731 51090 107796 127617
11399 127617 46603 60882 -119210 -139611 -54761 -61706 -112895 -348839 -292556 -177029 -213773
11388 -213773 -246877 -301395 -228811 -105052 19336 26005 -151039 -14998 34065 -36324 -45443
11377 -45443 -145604 -141441 14688 212973 -8020 -107700 -86917 -61451 -86397 2442 53110
11366 53110 134395 51478 92032 -35717 -171683 -257314 -267181 -153425 -27230 -179174 -116899
11355 -116899 97840 241651 159087 333612 125747 64783 51008 27165 -49195 -148408 -218130
11344 -218130 -209401 -297148 -390394 -322127 -99145 -6470 -119309 -309719 -364836 -404061 -322037
11333 -322037 -198142 -61757 -32615 -69758 -92731 10377 -95371 -31806 51678 -3701 4516
11322 4516 -48100 -47668 -69377 141246 271101 445732 551431 493143 136850 4414 42044
11311 42044 143977 122754 122463 64105 73042 134503 170505 217936 253258 94582 -39744 40116
11299 40116 -125046 -93634 -36107 28769 668 10385 -32985 -20232 33489 93012 151583 32614
11287 32614 -1960 -130029 -208296 -283579 -153374 -112029 -218964 -331049 -328450 -339730 -320303
11276 -320303 -279361 -49226 63051 54924 -37595 -269630 -317288 -239162 -236226 -180308 -142474
11265 -142474 -296354 -213838 -179242 -166994 -49693 -62893 -85686 -28726 -92061 -72605 156772
11254 156772 116809 108119 -82533 -275091 -75328 10444 75729 202261 -64672 -288786
11244 -288786 -260789 -118334 -204308 -349396 -266114 -225877 -196984 -86652 -184135 -288424 -234804
11233 -234804 -159062 -117826 -165593 -201506 -40704 3504 44771 59894 125450 132491 -113621
11222 -113621 -215437 -231488 -136914 -6316 126831 136543 195030 155978 156354 166204 337359
11211 337359 269606 120549 62023 152887 188339 224168 134313 19454 171068 204919 264443
11200 264443 102022 -34062 48265 128310 126264 -943 -137159 -158919 -27897 217669
11190 217669 107751 -23314 -1406 -68227 -73378 21847 79993 173395 123732 71174 30722
11179 30722 -36759 -1958 140737 43333 -83705 -162913 -150661 -37597 -81820 -152852 -173594
11168 -173594 -102774 -21998 33449 -74936 -215152 -311684 -228322 -283283 -119108 -102675 -96278
11157 -96278 -78860 -173290 -110730 -89663 -106552 -62075 179701 160572 63529 -1108 -10357 -79698
11145 -79698 -92462 -23331 -22522 -2629 -50401 -189695 -201883 -279007 -362567 -266088 -227944 -244851
11133 -244851 -143263 -87288 -216217 -339997 -346071 -311926 -308713 -281878 -338893 -260611 -217877
11122 -217877 -116356 -1819 48308 -181338 -333602 -300608 -292902 -220116 -137127 -205625 -283432
11111 -283432 -198999 -53971 -13970 -49443 -105882 -102128 -26525 60863 77637 179170 165121
11100 165121 96281 66248 140308 44046 -102913 -307539 -305476 -171132 -20170 -155602 -298181
11089 -298181 -252224 -89434 -35585 -105979 -288611 -287958 -200465 -174975 -12743 -72561 36089
11078 36089 114395 -41396 -113296 -12225 -13537 -195430 -150512 -4729 92803 687 -105569
11067 -105569 -116129 -84458 4230 -74270 -251551 -139732 75507 96242 199043 71153
11057 71153 -375 -4064 100131 38993 9576 16974 -7062 188308 273152 254147 236172 266226
11045 266226 110777 66269 133988 181325 90021 31124 -61744 -55118 -123802 -114533 -35801 -41780
11033 -41780 -34633 4635 141571 183990 -174407 -316081 -180314 -63261 90541 202092
11023 202092 -1296 -114802 -138898 -282618 -359026 -276862 -213699 -235248 -206487 -138358 -66309
11012 -66309 -12562 44554 -34491 -21887 -161807 56771 290374 163967 -88828 -269781
11002 -269781 -324876 -182736 -81381 -241049 -204950 57158 136674 244913 188889 120493
10992 120493 169256 45138 54211 115716 102763 -31669 38300 178071 34762 -60104 -129361
10981 -129361 -172160 -209295 -263170 -274217 -366706 -289634 -273299 -330724 -163387 -55730 7219
10970 7219 123877 101058 186220 199438 208103 156081 50389 -84833 -93253 80416 163978
10959 163978 218408 245082 41723 -38418 64626 97202 93198 16676 9593 136534 216341
10948 216341 282399 265842 177580 73096 54051 -34804 -71665 -88609 -121712 -25221 -58111
10937 -58111 -8497 -85067 -213273 -262862 -11983 157198 193384 121402 145915 -74409 -166158
10926 -166158 -124168 -108196 -170294 -102717 -89157 -78791 -154637 -57779 -105385 -31607 -138485
10915 -138485 -184048 -135028 78123 242519 226271 103839 113963 131409 36113 -119234 -133514
10904 -133514 3240 75708 89413 18031 -43339 -145838 -203535 -130217 -139215 -76126 -86610
10893 -86610 88209 64036 64484 77222 43221 113298 12668 -81147 -211553 -328245 -302287
10882 -302287 -64611 4334 3555 23249 2533 -99557 -94839 -33744 -26515 5505 22577 -75624
10870 -75624 -230761 -225444 -113504 -61665 -4716 -51916 19666 -119389 -49668 11505 -239163
10859 -239163 -475547 -458246 -427635 -298315 -24004 60023 39848 108069 154270 298114 435031
10848 435031 259243 147077 284083 314648 293953 131545 -18743 55773 35103 25059
10838 25059 -38311 -154434 -16269 -56380 -40190 -629 -10600 70966 140136 228494 111805
10827 111805 16554 111664 225140 155366 176888 161605 57508 1125 -34534 -20203 14543
10816 14543 105020 40760 -82642 -165010 -232283 -146787 -41759 68441 128897 112557 139354
10805 139354 203123 100296 -96195 -120067 -10989 -58419 -34130 -40371 129443 47625 -53523
10794 -53523 -174722 -58030 14604 50519 176705 125165 174834 287377 264499 165408 110341
10783 110341 97311 -7171 -89987 -42263 86042 181119 123544 60738 -46956 -98403 -253552
10772 -253552 -356270 -239840 -214932 -306675 -372163 -371201 -398316 -213279 71987 114571 112588
10761 112588 54012 50137 22581 24438 -33211 -195678 -209976 -228174 -313832 -289342 -319395 -265517
10749 -265517 -148283 -142153 -9883 142182 40909 144079 128951 -96692 -72561 101584
10739 101584 104409 53122 -8035 103001 284520 320370 172184 157624 163686 52710 90318
10728 90318 208586 34435 -130511 -175801 -120736 101745 187915 72849 -78707 -4316
10718 -4316 77628 56969 66484 21511 -166008 -227421 -131283 -8895 100423 16694 9471 234090
10706 234090 134352 8990 87450 71737 -97012 -172692 -128395 -352869 -228880 -144854 -85277
10695 -85277 -48133 164526 201455 62273 -125022 -224703 -180265 -7393 10730 -78398 -106096
10684 -106096 94501 65799 -2928 -157891 -241877 -333917 -231597 -64117 43796 -78611
10674 -78611 -219113 -161713 -76570 -80728 -146872 -116161 112945 94650 -86097 27665 5194
10663 5194 -14793 -45208 -92402 -112054 -115074 -56227 -74607 -174713 -248367 -143332 -136466 13605
10651 13605 97072 97305 -342 119907 90267 50629 -19263 -59360 -91587 -60516 93850 171503
10639 171503 242228 15534 -19024 -163492 -136232 -96069 -83911 -78032 73590 75265 5230
10628 5230 -12229 112328 109397 95712 107756 104962 -20718 -37246 -167577 -238666 -195806 -179274
10616 -179274 -94991 -84912 -106726 -30445 110152 149842 71535 -34699 -43071 61941 85103
10605 85103 -59294 -201631 -293661 -276976 -287747 -385201 -239717 -322974 -266756 -137891 -245482
10594 -245482 -379661 -370278 -267170 -150259 -72223 -68722 -1285 63119 112161 -91187 -328217
10583 -328217 -376142 -268111 -241815 -272004 -160733 -37740 114348 -49939 -123192 -130926 -132206
10572 -132206 -141664 -101750 -43048 88117 211804 359558 437442 413662 220086 10955 -159909
10561 -159909 -53355 218 -25880 -120565 13928 262854 138136 -105554 -201656 -61790
10551 -61790 -189483 -303908 -315959 -289011 -210225 -90159 -90811 77706 83129 2503 14632
10540 14632 116992 -28934 -23244 -83039 -83245 75676 15699 -110746 -64480 -84544 -355735
10529 -355735 -464513 -180464 85401 229424 91553 -26192 139044 80043 19664 -76214
10519 -76214 -39830 -8271 24764 115938 308525 309901 134546 96864 2829 123007 87088
10508 87088 147487 -51102 -230625 -162388 -237856 -332962 -176164 -278895 -131423 -34667 23647
10497 23647 31708 71656 186318 139193 50 -27120 -118093 -153132 -165353 -164274 -153837 -137853
10485 -137853 -65197 -1430 74658 181252 128107 -41275 -157402 -225308 -287409 -126549 81078
10474 81078 17420 -79254 15750 -93476 -262654 -277951 -273095 -185506 -122871 30675 28326
10463 28326 31780 -106553 -156898 -194855 -187730 -86937 -131921 -281451 -103036 -32447 49593
10452 49593 218592 110373 41924 -45632 -37290 -177888 -244507 -61305 50736 -5407 -32464
10441 -32464 -174552 -314801 -266727 -301150 -209401 -77640 29289 -67790 -85427 -27062 9538
10430 9538 -130672 43329 49229 25423 -34565 -139494 -89830 -23011 -28246 105910 128123
10419 128123 2447 -29044 116969 170266 -10600 -118782 -74909 -33062 -90286 -35767 33380
10408 33380 65551 30789 240941 137173 -38029 -127204 39366 37235 17345 46190 62480
10397 62480 61890 31311 80368 19030 -69130 77601 62951 -47827 -46607 -150021 -137489 -165681
10385 -165681 -163014 -101866 125631 95485 36987 -7283 -71652 -66152 -32979 -53243 83281
10374 83281 166274 214435 94613 -32157 -65628 -61192 -104672 -194283 -264031 -228037 -94532
10363 -94532 69244 220249 210102 166286 196361 172104 101105 107781 85111 -30824 -59445
10352 -59445 86929 35032 -56801 -318808 -221815 -80728 -116557 -106019 -136538 -20724 24422
10341 24422 108051 92116 -35132 -199152 -229104 -333772 -360613 -401985 -399471 -318754 -294946
10330 -294946 -359929 -401223 -259847 3848 106778 127799 126818 24381 7209 -50104 -200169
10319 -200169 -133818 -123472 -51143 -95124 -152471 -79841 19568 -8360 -71696 -8164 -95585
10308 -95585 -102088 65130 45652 -64266 -190391 -153955 -59884 23820 42633 84081 148194
10297 148194 294660 130564 -140405 -185971 -137922 -104912 -36867 42844 14069 74957 -1261
10286 -1261 -268067 -310223 -213226 -123544 -43036 -48498 -191772 -180157 -131439 -272921 -318736
10275 -318736 -278071 -120553 -25242 154789 148533 81986 -209971 -98773 2887 171793
10265 171793 219277 39897 -166199 -104417 82853 -50250 -319803 -238363 -237502 -116391 -60664
10254 -60664 -39727 -97653 -229125 -263063 -161115 -96958 -192499 -88490 -163229 -85885 121776
10243 121776 145159 5185 -35703 62518 -11918 61337 66067 11849 213239 -14301 -262948
10232 -262948 -266343 -45065 -1710 -33096 -100771 -102741 53181 88621 -32925 -18173 -1158
10221 -1158 113358 15977 120535 -115421 -283550 -270608 437 10942 -169748 -196196 -125996
10210 -125996 -24911 41115 -234165 -197676 -53538 -69528 -180405 -90334 116500 94922
10200 94922 -6360 -183 93146 264545 261305 224622 115486 114602 169507 279778 237688 218859
10188 218859 170161 217556 179778 89971 16054 14564 25374 -64641 -90687 -24918 -139777
10177 -139777 -189574 -50811 -34479 -167138 -384551 -150354 -95531 -160072 -150398 -76939 -33733
10166 -33733 93003 50210 -11935 -40725 -22505 132810 234926 211002 382715 254914 32789
10155 32789 -10370 125558 64730 -104383 -145859 -152660 -16746 -35542 -214313 -240685 -247211
10144 -247211 -135113 -1941 27108 -164614 -197901 -61656 -119104 -380372 -345740 -283689
10134 -283689 -80234 41264 182854 230759 141928 52161 27190 -92085 -207915 -299528
10124 -299528 -328334 -355784 -323909 -255061 -153881 11292 143373 218803 43303 -213071
10114 -213071 -18434 188466 88267 180922 278573 307861 193627 140453 238154 343684
10104 343684 377409 158185 46728 -83294 -101437 -47393 38730 35157 31297 93562 179543
10093 179543 138355 12420 169874 392915 176019 72495 90219 196596 66694 43480
10083 43480 47904 -137251 -270838 -133020 -33370 -142010 -284647 -214448 -60426 142433
10073 142433 224510 173880 50537 -5261 -37298 -46637 -34396 -175334 -203214 -63181 -14502
10062 -14502 50655 100539 7536 -76670 -148143 -104448 -197993 -291231 -218565 -162684 -17752
10051 -17752 37280 -39586 -120824 -146757 -141515 -260118 -124496 -8314 120218 251347 284559
10040 284559 178401 105491 77103 18870 -16996 -66792 -215432 -233055 -9455 41992 -74947
10029 -74947 -51404 -45406 -5277 -32447 -153966 -18196 -110788 -47276 -150413 -72687 -15259
10018 -15259 -88333 -148324 -178901 -269300 -208671 -25963 -37345 53156 53739 -42069 -85616 -122288
10006 -122288 -104062 -32594 -78452 -141300 -229801 -226404 -233662 -239354 -262749 -219529 -185629 -51587
9994 -51587 129991 316485 243248 162664 216172 303113 198425 14206 -35759 -50505 -76996
9983 -76996 -109333 -73448 -97892 -328336 -116359 77768 44808 146100 316379 190773 -16939
9972 -16939 -74121 -97789 -43451 158598 312025 235430 -10632 -286745 -306056 -268233 -10650
9961 -10650 208889 105513 -6221 -71312 12288 108533 72044 -8849 -113381 -247992 -234681
9950 -234681 -39243 112308 55057 171305 261010 210037 -1447 -18500 -101858 -7007 191028
9939 191028 119935 -137568 -139870 18486 -38964 -60662 16274 106753 67186 160201 279229
9928 279229 87011 -70523 -126907 -69834 -137394 -15205 36586 -186306 -96653 -81628 -165352
9917 -165352 -46661 110150 142324 120041 146494 27480 -45680 199951 256546 198838 40408
9906 40408 -83462 -74423 -72381 -36308 -128329 -108117 10598 131950 268847 302739 187207
9895 187207 215985 199894 39463 -106710 -4167 53721 43402 145493 286571 381439 255480
9884 255480 166331 56699 21671 -36145 -163877 -122436 59096 143315 165470 22288 -41958
9873 -41958 27871 90812 -50777 -228785 -249832 -34911 -107545 -176259 -272744 -276357 -219415
9862 -219415 -89111 232914 302222 322131 356185 255997 32461 -78050 -206767 -216033 -181182
9851 -181182 -118382 -5312 58655 98359 -7068 -12955 97730 141003 210554 237074 220762
9840 220762 18505 115917 242977 125786 30925 232585 340786 341485 145046 176152 103625
9829 103625 -35203 -99036 -126716 -113200 -102698 -10067 124800 120380 48621 56918 38972 -164992
9817 -164992 -225273 -181349 49714 195010 142243 100135 103673 117287 279339 165718 -55881
9806 -55881 -54407 -50060 -146184 -162506 63227 165268 212674 122720 66175 80893 121509 160629
9794 160629 207883 251455 217345 164782 35736 156701 206248 134111 -26851 -15307 -9291
9783 -9291 -183594 -160729 -212766 -249767 -123881 18395 7183 -144544 -129423 -119385 -109161
9772 -109161 -77476 -88361 -122079 36061 24245 -39490 -195767 26379 101068 -18555 126515
9761 126515 146960 -82644 -179135 -72752 -121644 -178067 -197049 -95429 -91168 -58583 -64906
9750 -64906 -86575 74891 71236 -41818 -24294 -42449 -184300 -110244 -121638 -254947 -134826
9739 -134826 -107660 -151515 -16820 48469 56707 254509 171692 73216 147372 131968 115168
9728 115168 211973 30487 39632 -40167 18740 -7552 -146099 -30987 -45032 7797 160456
9717 160456 133285 24899 84131 105392 -43038 -132353 23324 -56298 -244545 -219669 11604
9706 11604 11250 -34380 -36703 -187390 -190466 -200739 -141445 -217337 -237289 -114318 247858 197087
9694 197087 -82994 -98560 -89871 -115187 -68879 -157748 -149280 -5060 104510 -38251 -118474
9683 -118474 -73974 -125432 -93914 -238231 -138617 24147 10954 16989 -68850 -52551 103419
9672 103419 96342 49657 59041 -92245 -196798 -257174 -290813 -164922 -1075 -19698 -169919
9661 -169919 -161600 -172790 -95231 164731 195537 48597 -127437 -214951 -121823 -30303 -58960
9650 -58960 -48973 -36960 -108240 27431 132452 208694 146708 18677 -128759 -260857 -191976
9639 -191976 -210081 -148781 -228306 -158327 24418 86594 -32566 -217838 -330623 -286966 -212163
9628 -212163 -137597 -79600 -131614 -169646 -25317 -47493 -308968 -283729 -68165 2993 -114440
9617 -114440 -228485 -343267 -356575 -193725 -118072 -146136 -152738 29431 272783 240005 31062
9606 31062 65395 13080 90986 395829 358875 32226 -26159 -20422 -116392 -104511 -116024 -121322
9594 -121322 -144421 -75321 -69466 -43595 -91794 1728 -89115 -139788 -155061 -58872 -25061 75815
9582 75815 138531 227991 172929 168234 306219 399068 390991 381840 382631 453324 323529 92346
9570 92346 125171 243639 59435 -135253 -174640 -86995 156386 258051 237570 123348 107257
9559 107257 -28846 184262 329982 386555 315305 101039 -12235 -57876 134 38092 -138235
9548 -138235 -109939 -115718 -94232 127179 275770 284577 295457 82100 -121019 -208747 -181737
9537 -181737 -75434 67275 34120 94250 174022 116628 36858 -52148 -187210 -142574 -74635
9526 -74635 -57286 30614 -33484 -133096 -108244 -41761 -105589 -58084 25398 15807 -51986 75951
9514 75951 185148 54610 -85508 -20206 79323 -33415 -212509 -115611 31572 70620 -127972
9503 -127972 -211251 -46614 86596 -18526 -32856 -115740 -63433 -187579 -239789 -193192 -88675
9492 -88675 -23339 129214 154852 243166 227733 265994 411654 326876 134181 -57620 124876
9481 124876 347961 440041 394749 382101 361462 223287 171894 175010 103536 -35824 13223
9470 13223 10167 -2952 -36115 -18276 -24714 80797 103140 -133884 -203882 -209233 -250532 -287813
9458 -287813 -335361 -392714 -269046 -47490 12109 60954 210099 242150 173110 244649 74726
9447 74726 32958 -81129 -229850 -187139 105254 225454 81851 -62307 -119606 -44643 -79014
9436 -79014 -91176 -113312 -40547 -104437 96581 105443 132260 101617 3926 3978 -43349 -35874 -214039
9423 -214039 -119498 -130241 -170095 19738 121087 157757 279347 55117 -90407 -68292 5107
9412 5107 -34673 29048 -21159 -62422 -1026 88711 41062 58360 116750 113302 214755 395721
9400 395721 80435 -128993 110356 391843 230197 219561 211330 77561 -238940 -234767 59988
9389 59988 -21897 -149633 -56307 -76381 -177902 -258032 -432738 -416816 -236062 2199 7377
9378 7377 -83970 -127379 49189 -14771 -244272 -212640 -316654 -290995 -166536 -17212 84903
9367 84903 89336 31595 -191433 -74260 -143748 -134912 -80620 109877 96934 164420 291489
9356 291489 255769 200946 210284 -12568 -228782 -303999 -310707 -177027 39909 162834 104843
9345 104843 -25086 118754 144711 39981 158494 205704 178709 -18635 -80176 -102099 -98541
9334 -98541 -91479 -93569 -23537 -14878 -24996 65081 180775 222606 335775 407083 179506 -22829
9322 -22829 -22029 -8974 106514 133257 162286 66252 131512 18364 -130366 -226882 -159543 -5932
9310 -5932 -4748 -1235 -49616 86342 244309 162166 15243 -120592 -209115 -66666 54054
9299 54054 19816 -56219 -21747 2937 -13474 -12450 -82750 -151611 -145945 -202479 -273777 -198044
9287 -198044 -122419 -123050 8763 165600 90121 93192 294406 379597 284551 141656 121365
9276 121365 226550 106116 51072 65615 79662 152419 248327 327572 412339 431906 401910
9265 401910 160795 157464 327808 384487 230398 140713 249315 317992 218280 165687 191834
9254 191834 217167 188106 98794 296859 487921 486970 442659 377334 384223 371266 342918 356621
9242 356621 464163 588451 597699 476705 206069 263770 442946 575444 457559 306293
9232 306293 173028 281757 415395 376087 410379 472662 265204 251652 468764 569606
9222 569606 542830 447668 429908 406921 447519 415674 384012 470687 582851 587268 641272 673439
9210 673439 690547 649778 589018 568155 754264 736830 802470 905534 885872 830324 768071
9199 768071 797685 865254 831382 764061 800323 855998 907080 942412 1213006 1041944 982137
9188 982137 1083458 1160435 1214620 1210599 1142981 1106677 1098160 1090133 1173838 1250639 1437753 1504690
9176 1504690 1561665 1774037 1849021 1791346 1707929 1800088 1849990 2017991 2141024 2168899 2308102
9165 2308102 2312467 2305377 2514877 2740336 2805070 2898715 3095391 3262689 3391586 3602343 3753886
$$ [...]
##END NTUPLES=NMR SPECTRUM
##END=
