##TITLE=Analysis number 327972
Compound Code cc 23846
Book Reference 486/142
Project Code adrs
Chemist Name simons
##JCAMPDX= 6.0         $$ Bruker NMR JCAMP-DX V2.0
##DATA TYPE= NMR SPECTRUM
##DATA CLASS= NTUPLES
##ORIGIN= Bruker BioSpin GmbH
##OWNER= nmr
$$ XWIN-NMR		Version 3.5
$$ Mon Apr 23 13:16:07 2007 GMT Daylight Time (UT+1h)  MAYBRIDGE\nmr@NMR_250MHZ
##.OBSERVE FREQUENCY= 250.131544655141
##.OBSERVE NUCLEUS= ^1H
##.ACQUISITION MODE= SIMULTANEOUS (DQD)
##.ACQUISITION SCHEME= undefined
##.AVERAGES= 16
##.DIGITISER RES= 18
##SPECTROMETER/DATA SYSTEM= dpx250
##.PULSE SEQUENCE= zg30
##.SOLVENT NAME= DMSO
##.SHIFT REFERENCE= (INTERNAL, DMSO, 0, 16.522)
##AUDIT TRAIL= $$ (NUMBER, WHEN, WHO, WHERE, WHAT)
$$ ##TITLE= Audit trail, XWIN-NMR		Version 3.5
$$ ##JCAMPDX= 5.01
$$ ##ORIGIN= Bruker BioSpin GmbH
$$ ##OWNER= nmr
$$ C:\u/data/dgb/nmr/ADRS/2820/pdata/1/auditp.txt
$$ ##AUDIT TRAIL=  $$ (NUMBER, WHEN, WHO, WHERE, WHAT)
(   1,<2007-04-23 13:15:44.22 +100>,<MAYBRIDGE\nmr>,<NMR_250MHZ>,
      <created by zg, POWCHK disabled, PULCHK disabled
       configuration hash MD5:
       49 4B E0 1D 92 C2 6B 37 9F E6 65 BC 52 41 86 1D
       data hash MD5: 64K
       F2 C0 4F A6 F0 0E 16 FA D9 C4 AE 33 3C B4 97 11>)
(   2,<2007-04-23 13:15:57.53 +100>,<MAYBRIDGE\nmr>,<NMR_250MHZ>,
      <Start of raw data processing
       ef LB = 0.3 FT_mod = 6 PKNL = 1 SI = 32K 
       data hash MD5: 32K
       13 66 FC AD B5 C1 35 58 90 98 C4 71 C7 1C 7D 4E>)
(   3,<2007-04-23 13:15:59.36 +100>,<MAYBRIDGE\nmr>,<NMR_250MHZ>,
      <apk 
       data hash MD5: 32K
       B1 C7 EF FC 51 C1 BE BC C2 B7 B3 E8 79 5B 3B 7B>)
(   4,<2007-04-23 13:16:00.12 +100>,<MAYBRIDGE\nmr>,<NMR_250MHZ>,
      <abs ABSG = 5 
       data hash MD5: 32K
       07 9B B0 EB CA A1 9B D8 AC 45 1B 3F 4C 0B 6B AA>)
$$ ##END=
$$ 
$$ hash MD5
$$ C9 E8 2E DE 90 41 C2 A2 07 78 2E 47 5A 9F 4A 7B
##$RELAX= 
##$RELAX= 
##$RELAX= 
##$RELAX= 
##$RELAX= 
##$RELAX= 
##$RELAX= 
$$ Bruker specific parameters
$$ --------------------------
##$DU= <C:\u>
##$EXPNO= 2820
##$NAME= <ADRS>
##$PROCNO= 1
##$TYPE= <nmr>
##$USER= <dgb>
##$AMP= (0..31)
100 100 100 100 100 100 100 100 100 100 100 100 100 100 100 100 100 100 
100 100 100 100 100 100 100 100 100 100 100 100 100 100 
##$AQSEQ= 0
##$AQ_mod= 3
##$AUNM= <au_zg>
##$AUTOPOS= <29 >
##$BF1= 250.13
##$BF2= 250.13
##$BF3= 250.13
##$BF4= 250.13
##$BF5= 500.13
##$BF6= 500.13
##$BF7= 500.13
##$BF8= 500.13
##$BYTORDA= 1
##$CFDGTYP= 0
##$CFRGTYP= 5
##$CHEMSTR= <none>
##$CNST= (0..31)
1 1 145 1 1 1 1 1 1 1 1 1 1 1 1 1 1 1 1 1 1 1 1 1 1 1 1 1 1 1 1 1 
##$CPDPRG= <>
##$CPDPRG1= <>
##$CPDPRG2= <>
##$CPDPRG3= <>
##$CPDPRG4= <mlev>
##$CPDPRG5= <mlev>
##$CPDPRG6= <mlev>
##$CPDPRG7= <mlev>
##$CPDPRG8= <mlev>
##$CPDPRGB= <>
##$CPDPRGT= <>
##$D= (0..31)
0 1 0 0 0 0 0 0 0 0.06 0 0 0 0 0 0 0.0002 0 0 0 0 0 0 0 0 0 0 0 0 0 0 
0 
##$DATE= 1177330543
##$DBL= (0..7)
120 120 120 120 120 120 120 120 
##$DBP= (0..7)
150 150 150 150 150 150 150 150 
##$DBP07= 0
##$DBPNAM0= <>
##$DBPNAM1= <>
$$ [...]
##$SUBNAM6= <"">
##$SUBNAM7= <"">
##$SUBNAM8= <"">
##$SUBNAM9= <"">
##$SW= 20.6930455092707
##$SWIBOX= (0..15)
0 0 3 0 0 0 0 0 0 0 0 0 0 0 0 0 
##$SW_h= 5175.983436853
##$TD= 65536
##$TD0= 1
##$TE= 683.16
##$TE2= 300
##$TE3= 300
##$TEG= 300
##$TL= (0..7)
0 120 120 120 120 120 120 120 
##$TP= (0..7)
150 150 150 150 150 150 150 150 
##$TP07= 0
##$TPNAME0= <>
##$TPNAME1= <>
##$TPNAME2= <>
##$TPNAME3= <>
##$TPNAME4= <>
##$TPNAME5= <>
##$TPNAME6= <>
##$TPNAME7= <>
##$TPOAL= (0..7)
0.5 0.5 0.5 0.5 0.5 0.5 0.5 0.5 
##$TPOFFS= (0..7)
0 0 0 0 0 0 0 0 
##$TUNHIN= 0
##$TUNHOUT= 0
##$TUNXOUT= 0
##$USERA1= <user>
##$USERA2= <user>
##$USERA3= <user>
##$USERA4= <user>
##$USERA5= <user>
##$V9= 5
##$VALIST= <valist>
##$VCLIST= <CCCCCCCCCCCCCCC>
##$VD= 0
##$VDLIST= <DDDDDDDDDDDDDDD>
##$VPLIST= <PPPPPPPPPPPPPPP>
##$VTLIST= <TTTTTTTTTTTTTTT>
##$WBST= 1024
##$WBSW= 4
##$XGAIN= (0..3)
0 0 0 0 
##$XL= 0
##$YL= 0
##$YMAX_a= 562902
##$YMIN_a= -354940
##$ZGOPTNS= <>
##$ZL1= 120
##$ZL2= 120
##$ZL3= 120
##$ZL4= 120
##$ABSF1= 16.522
##$ABSF2= -4.171173
##$ABSG= 5
##$ABSL= 3
##$ALPHA= 0
##$AQORDER= 0
##$ASSFAC= 0
##$ASSFACI= 0
##$ASSFACX= 0
##$ASSWID= 0
##$AUNMP= <proc_1d>
##$AZFE= 0.1
##$AZFW= 0.1
##$BCFW= 0
##$BC_mod= 0
##$BYTORDP= 0
##$COROFFS= 0
##$CY= 12.5
##$DATMOD= 1
##$DC= 0
##$DFILT= <>
##$DTYPP= 0
##$F1P= 14.0000005364418
##$F2P= -0.99999901652339
##$FCOR= 0.5
##$FTSIZE= 32768
##$FT_mod= 6
##$GAMMA= 0
##$GB= 0
##$INTBC= 1
##$INTSCL= 1
##$ISEN= 128
##$LB= 0.3
##$LEV0= 0
##$LPBIN= 0
##$MAXI= 10000
##$MC2= 0
##$MEAN= 0
##$ME_mod= 0
##$MI= 0
##$NCOEF= 0
##$NC_proc= -3
##$NLEV= 6
##$NOISF1= 0
##$NOISF2= 0
##$NSP= 0
##$NTH_PI= 0
##$NZP= 0
##$OFFSET= 16.522
##$PC= 1
##$PHC0= 68.02878
##$PHC1= 5.274149
##$PH_mod= 1
##$PKNL= yes
##$PPARMOD= 0
##$PSCAL= 4
##$PSIGN= 0
##$REVERSE= no
##$SF= 250.13
##$SI= 32768
##$SIGF1= 0
##$SIGF2= 0
##$SINO= 400
##$SIOLD= 32768
##$SREGLST= <1H.DMSO>
##$SSB= 0
##$STSI= 32768
##$STSR= 0
##$SW_p= 5175.98343685301
##$SYMM= 0
##$S_DEV= 0
##$TDeff= 65536
##$TDoff= 0
##$TI= <Analysis number 999999
Compound Code 99
Book Reference 9
Project Code 9>
##$TILT= no
##$TM1= 0
##$TM2= 0
##$TOPLEV= 0
##$USERP1= <user>
##$USERP2= <user>
##$USERP3= <user>
##$USERP4= <user>
##$USERP5= <user>
##$WDW= 1
##$XDIM= 32768
##$YMAX_p= 364104392
##$YMIN_p= -28674
$$ End of Bruker specific parameters
$$ ---------------------------------
##NTUPLES= NMR SPECTRUM
##VAR_NAME=  FREQUENCY,     SPECTRUM/REAL,   SPECTRUM/IMAG
##SYMBOL=    X,             R,               I
##VAR_TYPE=  INDEPENDENT,   DEPENDENT,       DEPENDENT
##VAR_FORM=  AFFN,          ASDF,            ASDF
##VAR_DIM=   32768,         32768,           32768
##UNITS=     HZ,            ARBITRARY UNITS, ARBITRARY UNITS
##FACTOR=    0.157963299565203, 1,           1
##FIRST=     4132.6476996994, 0,             0
##LAST=      -1043.33573715361, 0,           0
##MIN=       -1043.33573715361, -28674,      0
##MAX=       4132.6476996994, 364104392,     0
$$ Real data points
##PAGE= N=1
##DATA TABLE= (X++(R..R)), XYDATA
$$ [...]
19083A01965j316K385O059R531J3849J7786K8728L1194K0086l014q249j5518k2914
19070A80572k1276j8515j5849r411m736l93N617M800k775O74p647j5796o593q568
19056H0104r335j843j347j779M601O006q17O19Q379P402k020m175l293l464J700
19041H0738l148q586m945k169m72k889J5426K5781K1145J8611J6453J2583J1529
19028A80057J0319J5917J0435P017K295m714l218J2922Q258j9228k7167k0124
19016A72769j7201q738k385p317l562j681n570r091p587o406n069K554O828M632
19002A12176R293J184L300O056M51R157K0239J9020K5204J8656J9387J7388R290
18989B70801j477J4P099L466N876J445L789J2961K0972L6106M8873O0497P1456
$$ y = [101965, 100649, 103034, 109093, 118624, 132473, 150259, 178987, 210181, 230267, 227253, 219004, 203486, 180572, 159296, 140781, 124932, 115521, 110785, 110392, 116009, 120809, 118034, 118708, 111061, 95265, 88672, 80104, 70769, 68926, 67579, 65800, 70401, 76407, 75590, 76209, 84588, 91990, 89970, 85795, 82502, 79038, 80738, 77590, 69004, 64059, 61890, 61418, 58529, 73955, 99736, 120881, 139492, 155945, 168528, 180057, 190376, 206293, 216728, 223745, 226040, 221326, 218108, 231030, 239288, 220060, 192893, 172769, 155568, 146830, 144445, 137128, 133566, 131885, 126315, 117224, 109637, 103231, 98162, 100716, 107544, 112176, 121469, 122653, 125953, 132009, 132460, 141617, 161856, 180876, 206080, 224736, 244123, 261511, 270801, 269324, 269338, 276437, 279903, 285779, 287224, 291013, 303974, 324946, 361052, 409925, 470422, 541878]
18976E41878P1666P2191P3373P3004N6558J6482l1294n1454o3088o4260o9096
18965F25960n7312l6090j4052M497J4794K3403K723m038m908j3536j3126L445
18953E31760M111J4149J6382O809J2412J5385K1836K4792L1222O1462R0303J13173
18941I43796J33416J45280J49365J19979O1034L3659N1206R7645J73132K79755
18931B188267M09304N46747O49965O84701N60154K25001n1448j53776k16943k70054
18921D571918k38433j42171k9138N7021R6530J23399J44560J77449K47670L95673
18911E404478O33877R18083J213169J417595J376814R53559L98278K13466N72508
18902A3101827J431720K678080M288067O246805Q491531J0626106J1707903R990824
$$ y = [541878, 613544, 685735, 759108, 832112, 888670, 905152, 873858, 822404, 759316, 695056, 625960, 568648, 532558, 518506, 523003, 537797, 561200, 563923, 559885, 554977, 541441, 528315, 531760, 535871, 550020, 566402, 573211, 585623, 601008, 622844, 647636, 678858, 740320, 830623, 943796, 1077212, 1222492, 1371857, 1491836, 1552870, 1586529, 1637735, 1735380, 1908512, 2188267, 2597571, 3144318, 3794283, 4478984, 5039138, 5264139, 5212691, 5058915, 4841972, 4571918, 4333485, 4191314, 4162176, 4219197, 4315727, 4439126, 4583686, 4761135, 5008805, 5404478, 6038355, 6956438, 8169607, 9587202, 10964016, 11917575, 12315853, 12529319, 13101827, 14533547, 17211627, 21499694, 27746499, 36238030, 46864136, 58572039, 68562863]
18894F8562863M147386k120240n258597o723528q180574q371697o908759m688934
18886C0457920k476665p67027K11039K73601p10386k203239l114734l076903k454875
18877A6138731j672321j073017o93671m98318n48971q07743r61274q92302o80403
18868H310711m31388k22599o8956O0897K03456L40599N60203Q81148J298718J810402
18858A2743191K420241L069481L624508L829767L234232J751897L42943P2158
18850C1088418J132866L231491O084662R481341J3005816J5856581J6774912J5741681
18842A12397768J4208488R826860j308172j1778980j6632543j9547832j8836167
18835F8329422j4570010r605865n158927j460151J519073L974806N751215P023930
$$ y = [68562863, 72710249, 70590009, 65331412, 58607884, 50427310, 42055613, 35146854, 30457920, 27981255, 27214228, 27425267, 27698868, 26988482, 24785243, 21670509, 18593606, 16138731, 14466410, 13393393, 12699722, 12201404, 11652433, 10844690, 9883416, 8991114, 8310711, 7879323, 7656724, 7587768, 7648665, 7852121, 8192720, 8752923, 9634071, 10932789, 12743191, 15163432, 18232913, 21857421, 25687188, 28921420, 30673317, 31016260, 31088418, 32221284, 35452775, 41537437, 51018778, 64024594, 79881175, 96656087, 112397768, 126606256, 136433116, 135124944, 123345964, 106713421, 87165589, 68329422, 53759412, 44153547, 38994620, 37534469, 39053542, 43028348, 48779563, 55803493]
18827E5803493Q088459O155950N51634l715166q592984j2033610j1489193q959340
18819B5809243o392164m358228k985369k101004j507587j127896q66417o84485
18811E786093n67220n04304m40175l88254l61584l22367k56964k01105j56116
18802B588004j13080p7415p0556q7546r9663j19770j33958j40119j28832j22429
18792A494636j10203j01612q5973o7974m9612m6983n2398m4254l4502l2970l0426
18781H37729k9022k6567j9985k4328j6994j3029j3661q228n362p855l930m88k177
18768F66103k295Q501J9221K2189J2996R567Q186K39q386k0849j1768j4162j4997
18755F74545q351m544j926l983k306J179j092k337j4213j9844j6110j8386k1196
$$ y = [55803493, 63891952, 70047902, 70599536, 66884370, 58291386, 46257776, 34768583, 25809243, 19417079, 15058851, 12073482, 9972478, 8464891, 7336995, 6470578, 5786093, 5218873, 4714569, 4274394, 3886140, 3524556, 3202189, 2945225, 2744120, 2588004, 2474924, 2397509, 2326953, 2239407, 2139744, 2019974, 1886016, 1745897, 1617065, 1494636, 1384433, 1282821, 1196848, 1128874, 1079262, 1032279, 979881, 935627, 901125, 868155, 837729, 808707, 782140, 762155, 737827, 720833, 707804, 694143, 685915, 680553, 672698, 668768, 668280, 666103, 663808, 672309, 691530, 713719, 726715, 736282, 744468, 744707, 736321, 715472, 703704, 689542, 674545, 666194, 661650, 659724, 655741, 653435, 654614, 653522, 651185, 636972, 617128, 601018, 582632, 561436]
18742E61436j7153k6777k6831k1808j8864k0910j8531k4575k0542j5928p182N09
18730C42844N172q82j283k376k737n52P11n642n021n732r518j2701J552O905J770
18715C12510l783n44l812k324n13j99J861K739N272P606J2106J4744R802J0509
18701C65974J609j1444r170q039j3123j4870j5179j9309k3967j5609j4682j3728
18689B08463l426l446M719k065n26k226N362q27o001q490p377q190r992m251K75
18674A62002k014j095m520l463m452p999o233J490L061L87n116k480j122L199
18660A31645P7l78k813n513k100p477r623j910J998j845j438N972L703N531P766
18645A23595L209J080O03n805j719k711j0191m416o416o138k15l114K582K254
$$ y = [561436, 544283, 517506, 490675, 468867, 450003, 429093, 410562, 385987, 365445, 349517, 342335, 342844, 348016, 347134, 345851, 343475, 340738, 340186, 340897, 335255, 330234, 324502, 314984, 302283, 303835, 310740, 312510, 308727, 308183, 304371, 302047, 301534, 301335, 303196, 305935, 311207, 318813, 330919, 345663, 355465, 365974, 367583, 356139, 346969, 338930, 325807, 310937, 295758, 276449, 252482, 236873, 222191, 208463, 205037, 201591, 206310, 204245, 203719, 201493, 206855, 206028, 200027, 191537, 184160, 175970, 165978, 161727, 162002, 159988, 158893, 154373, 150910, 146458, 138459, 132226, 133716, 136777, 137164, 132048, 129568, 128446, 131645, 131722, 131344, 128531, 123018, 120918, 113441, 103818, 101908, 103906, 102061, 100623, 106595, 110298, 115829, 123595, 126804, 127884, 128487, 122682, 120963, 118252, 108061, 103645, 97229, 91091, 90876, 87762, 90344, 92598]
18631I2598L537L91n448O906L144J894k508n298M485j360j2614j0936r00L641
18617G7532p267K921j087n406p51k202J007P556J0590J73k692Q53K631j840m265
18602G7753J999j184j785p333l685j248J495L842M076k329j850N428l41O70O067
18587H1575L492J914p711r113k192L048M874m67K277j164l907M141O783K236L298
18572H9084l229K849K983j763m811p952q339p151j660K341J2492K83N54Q641o32
18557H3690l634l311J612J1841M594p797k823N223J90l601l905M044L380Q34l273
18542H7064L640O104K08M369L859K941O130L419K452k466l910k014m162l286n888
18527I8460j1908j508J0292L433o47j086Q444l78r084j364L835K944M649J594
$$ y = [92598, 96135, 96526, 91078, 97984, 101128, 103022, 100514, 95216, 99701, 98341, 85727, 74791, 73891, 77532, 70265, 73186, 72099, 66693, 65942, 63740, 64747, 72303, 82893, 83066, 80374, 81227, 83858, 82018, 77753, 79752, 78568, 76783, 69450, 65765, 64517, 66012, 69854, 73930, 71601, 69751, 75179, 74838, 75508, 81575, 85067, 86981, 79270, 70157, 67965, 71013, 75887, 75420, 77697, 76533, 72626, 76767, 83550, 85786, 89084, 85855, 88704, 91687, 89924, 85113, 77161, 68822, 61671, 60011, 62352, 74844, 75127, 75681, 84322, 83690, 80056, 76745, 78357, 90198, 94792, 86995, 84172, 89395, 89585, 85984, 82079, 86123, 89503, 90337, 87064, 90704, 96808, 97016, 101385, 105244, 108185, 114315, 117734, 120186, 117720, 113810, 111796, 107634, 104348, 98460, 86552, 85044, 95336, 98769, 98122, 97036, 105480, 105102, 96018, 94654, 98489, 101433, 106082, 107676]
18513A07676j961O241J717m928l369O476M952P04M489M269k041M9l01K090N261
18498A31324J501k966o006o786k284k846k101N475K454J476J981Q406m919j956
18484A22753O3L54K078k093J293N543m25n217l271j0211j006n45M23L840L227
18469A16806l838n726N137j41L811m187p681j695k873J890R261Q265N283J2496
18455A36808K7216K9104J5874j6982k3986k0886r270j081j067M841J0034J6511
18443A67116J7278K5401J7611q684j9079p510K790J7019K6720K9087L2484J4875
18431C15108L665j1490k1693k9953j7506j4642j2275j0675J73J1993J2074J7829
18419B42608K4882L1176L6005L0246K4677J8723J4078m92p945k5689k4863j4981
$$ y = [107676, 105715, 111956, 113673, 108745, 105376, 111852, 116804, 117508, 121997, 126266, 124225, 124274, 123973, 126063, 131324, 132825, 129859, 123853, 117067, 114783, 111937, 109836, 115311, 117765, 119241, 121222, 129628, 124709, 122753, 122816, 123170, 125248, 123155, 124448, 129991, 129566, 124349, 121078, 110867, 109861, 109316, 109739, 113579, 116806, 112968, 107242, 112379, 112238, 116049, 111862, 104181, 102486, 99613, 101503, 110764, 119029, 124312, 136808, 164024, 193128, 209002, 192020, 168034, 147148, 137878, 136797, 135730, 140571, 150605, 167116, 184394, 209795, 227406, 218722, 199643, 192133, 194923, 211942, 238662, 267749, 300233, 315108, 318773, 307283, 285590, 255637, 238131, 223489, 211214, 200539, 200712, 212705, 224779, 242608, 267490, 298666, 334671, 364917, 389594, 408317, 422395, 421903, 413958, 388269, 363406, 348425]
18407C48425j2780M926K5984M4932O8112Q2334R3133J01551Q4654O2540J9430
18396I23241k1596l1549n1298o5382o1999m6493l6006j6718j2486j8124l3340
18385E28250l8265m0671m0701m2767l6964l2328k5818j8159q505r692j3009n395
18373B15976O291M285M243N566P179M020J0983N277Q808R391J7214K2132J8696
18360C40061K9827K8194K3791L4478K7684K8473L5631M5545N3720N5879O4720
18349G68003O7842N9602M4494L8964J6489l0709o5888q1748p2603n8609m2683
18338F43154j2066J4808K9984J9311J2937j4165l8122n4564n0262m0572l5163
18327D75280k3511j0430O214O447J3728J2897K5292L2509M2130N2061M4128L1742
$$ y = [348425, 335645, 340571, 366555, 411487, 479599, 561933, 655066, 756617, 841271, 903811, 923241, 901645, 870096, 818798, 753416, 691417, 644924, 608918, 592200, 579714, 561590, 528250, 489985, 449314, 408613, 365846, 328882, 296554, 270736, 252577, 244072, 234380, 221371, 215976, 222267, 226552, 230795, 236361, 243540, 247560, 258543, 263820, 272628, 282019, 299233, 321365, 340061, 369888, 398082, 421873, 456351, 484035, 512508, 548139, 593684, 647404, 703283, 768003, 835845, 895447, 939941, 978905, 995394, 964685, 898797, 817049, 744446, 685837, 643154, 631088, 645896, 675880, 695191, 708128, 693963, 655841, 601277, 551015, 510443, 475280, 451769, 441339, 447553, 454000, 467728, 480625, 505917, 538426, 580556, 632617, 676745, 708487]
18315G08487J5093R537m036j4439k0410j0770q50l914l958N593J9856K9642L2234
18302G62065L1166L3265M1896N5066O4477P5628R8935J12527J43600J64129J78514
18291A761268J93198K30627K57541K67481K64694L12889M24575N80718P65419
18282E058410R37770J114026J311880J503592J580869J451812J279510J211589
18274A5449458J016070Q89276J300312K264437L596618N163306O479088O966757
18266D3125322P219503Q031800P755690L706998j236941k889379l424132n521471
18258E6767390p108727o616868n230699m113336l271391k382046j513783j147178
18250B5383362j619714k301211k487801k311643k123949j967559j719526j378704
$$ y = [708487, 723580, 733117, 729081, 714642, 694232, 683462, 682612, 678698, 674740, 680333, 700189, 729831, 762065, 793231, 826496, 868392, 923458, 987935, 1063563, 1162498, 1275025, 1418625, 1582754, 1761268, 1954466, 2185093, 2442634, 2710115, 2974809, 3287698, 3712273, 4292991, 5058410, 5996180, 7110206, 8422086, 9925678, 11506547, 12958359, 14237869, 15449458, 16465528, 17354804, 18655116, 20919553, 24516171, 29679477, 36158565, 43125322, 50344825, 58376625, 66132315, 69839313, 68602372, 65712993, 62288861, 56767390, 49658663, 43041795, 37811096, 33697760, 30426369, 28044323, 26530540, 25383362, 23763648, 21462437, 18974636, 16662993, 14539044, 12571485, 10851959, 9473255]
18242I473255j019659p09098m70251k99484j59246m1205N2677R6207J76005L17365
18232G416566N32701P92992J107816J517834J956975K231691K253136K263764
18224B0073475K410174K310796J613783Q00559O92608J378319K270156K951352
18216C4501222L735366N019715N974129M747370K344772J694566J482714j897097
18208E7602757o191162p362572o426149n805270n535491m751180l531458k392811
18200A5606664j507394q89077o79681q61136j080428j114044j036718r84233r54131
18191F499822q59188o89243n27291m04080l07086k14133j69577j53675j40954
18182C034595j45599j43958j21046q8568m8424R64N1455Q9968R3789P0878L3043
$$ y = [9473255, 8453596, 7744498, 7274247, 6974763, 6815517, 6774312, 6826989, 6923196, 7099201, 7416566, 7949267, 8742259, 9850075, 11367909, 13324884, 15556575, 17809711, 20073475, 22483649, 24794445, 26408228, 27208787, 27901395, 29279714, 31549870, 34501222, 38236588, 43256303, 49230432, 53977802, 56322574, 58017140, 59499854, 57602757, 51411595, 44049023, 37622874, 31817604, 26282113, 21530933, 17999475, 15606664, 14099270, 13210193, 12530512, 11669376, 10588948, 9474904, 8438186, 7453953, 6499822, 5640634, 4951391, 4424100, 4020020, 3712934, 3498801, 3329224, 3175549, 3034595, 2888996, 2745038, 2623992, 2535424, 2487000, 2487964, 2539419, 2629387, 2723176, 2794054, 2827097]
18171B827097j4105q1841j71874k38106k45418k25512j99702j62341j23681r4236
18161A270281n8520l2887k3912j7858j0359j1445j3588k3119k9979j5246J1496
18150A044864L6765N5580P7067J00517Q8532M9598K5091J5921k6564j07442j51966
18139A207963j40713j30849j23775r7447p2679n5236m8719l0873k6363k1227k4401
18128D35681k4314k4613k1342j3337j2202j3803j0471n972m897j1986j1051j0456
18116B71237r166n289q900K68M283O98r629m262k824n200n894k231j0704p162
18102B05225j384n618n838j183k327j352N911o10J745j243l000m516l566m288
18088A77956r023l108o453n182o29o064r127o19k569j1606p793r501L833N826
$$ y = [2827097, 2812992, 2731151, 2559277, 2321171, 2075753, 1850241, 1650539, 1488198, 1364517, 1270281, 1211761, 1178874, 1154962, 1137104, 1126745, 1115300, 1101712, 1078593, 1048614, 1033368, 1044864, 1081629, 1137209, 1214276, 1314793, 1403325, 1452923, 1478014, 1493935, 1467371, 1359929, 1207963, 1067250, 936401, 812626, 715179, 642500, 587264, 538545, 507672, 481309, 460082, 435681, 411367, 386754, 365412, 352075, 339873, 326070, 315599, 309627, 304730, 292744, 281693, 271237, 262071, 256782, 247882, 248150, 252433, 253131, 243502, 239240, 236416, 231216, 225322, 223091, 212387, 205225, 203841, 198223, 192385, 191202, 188875, 187523, 193434, 192824, 194569, 193326, 190326, 185810, 182244, 177956, 168933, 165825, 159372, 154190, 153561, 147497, 138370, 137751, 135182, 123576, 115783, 106282, 110115, 115941]
18074A15941L946P498K724L502K782L362l653J929K425l600K698j49j621r695
18060A28089j2515m046J952L972N61q75K828j456l928m369K315p96j156j341K990
18045A12225K37K090p220n903M474J443k849j3185j512L256L170N557l808k652
18031I5323J971j281n492l056l812j598J07k062m60P209N513k059n552o794M737
18016H2694Q653k651p73L20l472n445K35j724k30r959m173O014M503n361n686
18001F2945k705j076k560q18j453K075Q084m596q02N834J172L08K191l220k139
17986F3240k565n725j399k76N506K985m864n415j067j40l37Q301L948k784m355
17971E5053K572J081j0363J500J472n199O18O477J172l15O49K285K190J75k123
$$ y = [115941, 119887, 127385, 130109, 133611, 136393, 139755, 136102, 138031, 140456, 136856, 139554, 139405, 137784, 128089, 115574, 111528, 113480, 117452, 118013, 117138, 119966, 118510, 114582, 110213, 112528, 111732, 110576, 109235, 112225, 112462, 114552, 107332, 101429, 105903, 107346, 104497, 91312, 89800, 93056, 96226, 101783, 97975, 95323, 97294, 96013, 90521, 87465, 83653, 82055, 82162, 80100, 79640, 86849, 92362, 90303, 84751, 77957, 82694, 91347, 88696, 87923, 88243, 84771, 79326, 79561, 77837, 77607, 67648, 63475, 69489, 73992, 68631, 62945, 60240, 59164, 56604, 55786, 54333, 56408, 64492, 59896, 59094, 64928, 66100, 66408, 68599, 65379, 63240, 60675, 54950, 53551, 53275, 58781, 61766, 56902, 51487, 50420, 50280, 49943, 58244, 62192, 59408, 55053, 57625, 58706, 48343, 49843, 51315, 46116, 46734, 53211, 54383, 54068, 54717, 57002, 59192, 59367, 57244]
17956E7244j662lj090j511J787J88k431m064J13l921m268L954o50M10L70L942
17940D8408M436m46m518j101j924M940o05l37j082N9k13k827k483N413K989p447
17924D3262k283j99j353M552o730k368J0911M575o110q034J955m41K949K9j340
17909C9375k881L306N264m065n300J742j965K865N276l401l864j546j1202M745
17895B8349N694r88L223J960k431N648l025L314P070j404K514j859m698q407L010
17880C7970k57K252Q74Q82M952kM27K933J20p858o866o017k401K185p755k553
17864A8886N412K721K119N359M647M19K224k179o548L532O564J874K474r228p704
17849C0572J045l925j979J640K17k324m98k17M049L303K094J194J491l219N483
$$ y = [57244, 55582, 55579, 54489, 52978, 54765, 54953, 52522, 48458, 48571, 44650, 40382, 44336, 43686, 44096, 44466, 48408, 52844, 52398, 47880, 46779, 44855, 49795, 49190, 48853, 47771, 47830, 47617, 44790, 42307, 47720, 50709, 43262, 40979, 40780, 39427, 43979, 37249, 34881, 45792, 50367, 44257, 36223, 38178, 37737, 40686, 40715, 39375, 36494, 39800, 45064, 40999, 35699, 37441, 35476, 38341, 43617, 40216, 36352, 34806, 23604, 28349, 34043, 33055, 36278, 38238, 35807, 41455, 38430, 41744, 48814, 47410, 49924, 48065, 43367, 34960, 37970, 37713, 39965, 40839, 41721, 46673, 46671, 47098, 50031, 50151, 42293, 35427, 29410, 27009, 29194, 21439, 18886, 24298, 27019, 29138, 34497, 39144, 39563, 41787, 39608, 33060, 36592, 43156, 45030, 47504, 38276, 30572, 31617, 27692, 25713, 27353, 27570, 25246, 24748, 24531, 28580, 31883, 33977, 35171, 36662, 33443, 38926]
17834C8926J995l125j212N794j536r443m992J058O072J995J739j78J976J02m84
17819C8687j564o892J595L040L171m01n47L820J387k23q951p745m031m034P77
17804A8089N492L860Q285R112j439p518q073o942n732P713J1870l630n646O335
17790C1776J401q932m193O15o72K114J1692J6372Q440M462K80R16R616N816J3111
17775I2814J0530J9394J4431J0806J8073J4441K2327J2529O707N816R648O799
17763B44315Q951O575R057R04l51K39m877q193j1726k0781k2606k0935k6238k4212
17749A30122j7784o368q703m936l613K179K143L864J046J681j547K246K474M440
17735A07244J0706O119K772J5785J8391K5424L5909N7919O7985O8999M2562q094
$$ y = [38926, 40921, 37796, 36584, 42378, 40842, 31399, 26407, 27465, 33537, 35532, 37271, 37093, 39069, 39171, 38687, 37123, 30231, 31826, 34866, 38037, 37636, 37089, 40909, 42296, 42073, 33122, 25377, 21346, 17312, 18089, 23581, 27441, 35726, 44838, 43399, 35881, 27808, 20866, 15134, 22847, 34717, 31087, 25441, 31776, 33177, 24245, 20052, 20667, 19995, 22109, 33801, 50173, 58613, 63075, 63355, 64271, 73887, 79703, 92814, 103344, 122738, 137169, 147975, 166048, 180489, 202816, 215345, 222052, 227868, 237516, 244315, 253266, 259841, 268898, 269802, 269451, 269690, 264813, 256620, 244894, 224113, 201507, 180572, 154334, 130122, 112338, 105970, 97267, 92331, 88718, 90897, 93040, 96904, 97950, 99631, 98084, 100330, 102804, 107244, 117950, 124069, 126841, 142626, 161017, 186441, 222350, 280269, 348254, 417253, 459815, 451721]
17723D51721m3886l7412j2807o477l033K858J1870J0987K2498L3350L8186L8406
17711E06261K1451j9431o0691o3515n1252l3029k0433j3029n213j1289p884j4570
17699B27376k0649k6446k2118j8996j9497j7446j1545p589p748k494j483k581
17687F8784o423m042n457k708k129k334k990n862N328M675k757k019o778k676
17673C2612K013J732K476M786m38p892k117J105j486j977K53m466M810P337m744
17658C4004m04k157K188j009p180N66J784J797Q441K873p928l295L615K400j236
17643C4459J74j964M795j576j046P266J912q391j2763l001K562l898K978K925
17629B4432O768O696k177k042j554r76m766o570k377p027p190m600k762Q212N451
$$ y = [451721, 407835, 370423, 357616, 351139, 348106, 350964, 362834, 373821, 396319, 429669, 467855, 506261, 527712, 508281, 447590, 384075, 332823, 299794, 279361, 266332, 261119, 249830, 241946, 227376, 206727, 180281, 158163, 139167, 119670, 102224, 90679, 83090, 75342, 72848, 71365, 68784, 62361, 58319, 52862, 50154, 48025, 45691, 42701, 36839, 42167, 46842, 44085, 42066, 35288, 32612, 34625, 36357, 38833, 43619, 43181, 35289, 33172, 34277, 32791, 30814, 31067, 26601, 31411, 38748, 34004, 33600, 31443, 33631, 32622, 25442, 26008, 27792, 29589, 38030, 40903, 32975, 29680, 33295, 35695, 34459, 34633, 32669, 37464, 35888, 34842, 42108, 44020, 35629, 22866, 19865, 22427, 18529, 21507, 24432, 31200, 37896, 35719, 33677, 32123, 31147, 26381, 19811, 17434, 10407, 3217, -1383, -4145, 4067, 9518]
17614I518N44N27N90o35M284Nj0218m57L582O286l144l602L861L025m743J593
17598A1016j38j102K40j286Q177L635n00p059o201m518J521k015O953K911L976
17583A5610j301j740K190J158J236J499m320k881o33k388M040P79m105K018L907
17568A5069L668J095k571k291m705n869O41R086Q841k043L181k613m436J830o085
17553A2798k10k752j264j549l89Q43L350K008M07M254m801k499n122j579J326
17538D821L400J365K649m63P715L666J043j805p268l972k15L115K390k515K746
17523A6672l230o44k61M051K425K753M071K110N64j356l503n243J999K723N533
17508B8664R552J6589J4521R049K2673K7783j242k7111k7041k3507j0604m44n956
$$ y = [9518, 10062, 10589, 11179, 10544, 14828, 14833, 4615, 4158, 7740, 14026, 10882, 7280, 11141, 14166, 9423, 11016, 10878, 9776, 10016, 8730, 16907, 20542, 20042, 12983, 6782, 2264, 3785, 1770, 8723, 11634, 15610, 14309, 12569, 14759, 15917, 17153, 18652, 14332, 11451, 10818, 8430, 12470, 13249, 9144, 11162, 15069, 18737, 19832, 17261, 14970, 10265, 4396, 5037, 14123, 22964, 20921, 24102, 21489, 17053, 18883, 12798, 12588, 9836, 8572, 7023, 6634, 7477, 10827, 12835, 13242, 17496, 12695, 10196, 5074, 3495, 4821, 8221, 9586, 12235, 11772, 19487, 23153, 24196, 22391, 15123, 11151, 10936, 14051, 16441, 13926, 16672, 13442, 12798, 12537, 16588, 19013, 21766, 25837, 27947, 28511, 27155, 23652, 18409, 20408, 23131, 28664, 38216, 54805, 69326, 78375, 101048, 128831, 127589, 100478, 73437, 49930, 39326, 38882, 32926]
17495C2926n173J590K102R857K0304K5925K7886R567j3547k6152k5251j7626j0504
17482C1904o203k183K097n9K257J835o394j622m631l409m545l990J281J534N914
17467A3786N935j167n722n944j4338J67n08N71L339P590O387J920M947M227L815
17452B5005K600M99l276J899P980P921O10n489J416j622k327j830j29k868P326
17437C7715O08J950O652K699N689O619J961j533k027j564n854m116n585m24k764
17422D0026k992K974o59N199l067J828K096m908o17n015p034l687M93j887q644
17407A4106m159R35J872L241P716N805j699j50p922l329M947J484Q11r48J5n34
17391B2191J304Q983L134l788l324J293k131J352O333M274O693l315J746q88M71
$$ y = [32926, 27753, 29343, 31445, 41302, 61606, 87531, 115417, 124984, 111437, 85285, 60034, 42408, 31904, 25701, 23518, 25615, 25556, 27813, 29648, 23254, 21632, 17001, 13592, 9047, 5057, 6338, 7872, 13786, 19721, 18554, 12832, 6888, -7450, -7283, -7791, -7220, -3881, 3709, 10096, 12016, 16963, 21190, 25005, 27605, 28104, 24828, 26727, 34707, 42628, 43238, 37749, 39165, 37543, 35216, 33386, 33257, 30389, 37715, 38323, 40273, 46925, 49624, 55313, 61932, 63893, 62360, 60333, 58769, 52915, 48799, 43214, 42790, 40026, 37034, 40008, 39349, 44548, 41481, 43309, 45405, 40497, 39880, 34865, 27831, 24144, 24637, 22750, 14106, 9947, 10882, 12754, 15995, 23711, 29516, 27817, 27667, 19745, 16416, 21363, 22847, 23658, 22710, 22725, 22191, 23495, 32478, 35612, 31824, 28500, 29793, 27662, 29014, 35347, 39621, 46314, 42999, 44745, 43857, 44328]
17376D4328M847J005R47N344N046k238j1598j1277O93N126P84p99n09J596Q44
17361D4139m377l668K391M341O861p884j7794n598j361l43J720K951L528N829
17347C0735J16m29n151m630k63Q06r40q216k982L951L054M352P313r57k005N97
17331B5351m312l948L398P31J672k087R154P115M733R2L996k972m978M995J348
17316D4288M70j805k926M903J168R829K9060L1109J7849J019r211j0612j2026
17303A03115n759J737k36j1238j4900o909L599K4599K2659J0133J0270m55m510
17290A32105r572j3225m683K694q897j3160j5640j1795j794m20K485j44M157j293
17276F0818M971k181l433N748J0033L462k227m37Q52N194Q227Q7Q447J4577K9585
$$ y = [44328, 49175, 50180, 51127, 56471, 61517, 59279, 47681, 36404, 37097, 42223, 43007, 42208, 41699, 43295, 44139, 39762, 36094, 38485, 42826, 49687, 41803, 24009, 18411, 17050, 16707, 18427, 21378, 24906, 30735, 30851, 30422, 25271, 20641, 20378, 21184, 20244, 12028, 9046, 12997, 16051, 20403, 27716, 26759, 24754, 25351, 21039, 17091, 20489, 21220, 22892, 20805, 29959, 37074, 41807, 41899, 45895, 42923, 37945, 42940, 44288, 44758, 42953, 40027, 44930, 46098, 55927, 84987, 116096, 133945, 134964, 125753, 115141, 103115, 97356, 99093, 98857, 87619, 72719, 65810, 69409, 94008, 116667, 126800, 137070, 136615, 132105, 122533, 109308, 104625, 107319, 98422, 85262, 69622, 57827, 56033, 55613, 58098, 57954, 62111, 60818, 65789, 63608, 60175, 65923, 75956, 79418, 77191, 76754, 77606, 82800, 91027, 91114, 99561, 114138, 143723]
17261A43723M4999N3606P5513J20909J45031O9269p4362j31903j03679o8316m1592
17250B33198j9397j1513N901K3493M3866P0279R6180J26006J11284k0821j27374
17239E31102j26293r0517n3011k6105k3153j5407j175K908j126n90J459J603M430
17226B04125P138Q299O771J0004J2955J8299J3293J1890K1683J9666R757Q617
17214C52497R414J8471K6711L4530K7018K4426K5935K5141L8421M3809O0197P2458
17202G59028P7658P8298P3647O1989N6685O6211P7068J06813J22474J23866J36808
17191A740545J85366K66994L57973M60522N23023O28298Q54108J173188J666636
17182G856653K199183K082779J834666K964582N454953Q634585J2836104J7940483
$$ y = [143723, 188722, 242328, 317841, 438750, 583781, 653050, 578688, 446785, 343106, 274790, 233198, 213801, 202288, 208189, 231682, 275548, 345827, 442007, 568013, 679297, 658476, 531102, 404809, 314292, 261281, 235176, 212023, 196616, 195441, 198349, 197223, 196633, 198092, 199695, 204125, 211263, 219562, 226333, 236337, 249292, 267591, 280884, 292774, 314457, 334123, 343880, 352497, 361911, 380382, 407093, 441623, 468641, 493067, 519002, 544143, 582564, 626373, 686570, 759028, 836686, 914984, 988631, 1050620, 1107305, 1173516, 1250584, 1357397, 1479871, 1603737, 1740545, 1925911, 2192905, 2550878, 3011400, 3534423, 4162721, 5016829, 6190017, 7856653, 10055836, 12138615, 13973281, 16937863, 22392816, 31027401, 43863505, 61803988]
17174F1803988J5602736k364586j7234508j7146755j1054340o023731k686177
17167B0896627q97544k96075R01173L424919O651207J0560541J5794828J7815358
17159G4851034M331502j4476941j9497600j4571482r231206n761832l729188k514455
17151I399832j705444j160639p54228m30432j44380J22205K04013j21937n95655
17142D813335p86332o79928m94710l83548l35749k71876k01212j47379j12253
17133A400348p9052n8379o1208o7573q0715q8564q8777q3465o9554m6152l8728
17122F38181k9753k3044k2403k5201k9600l7676l2755k4457j8292k4350j8411
17111C52239p326j2273o067j0667j5417o854p237j1695j5333o307m884O92l601
$$ y = [61803988, 77406724, 75042138, 57807630, 40660875, 29606535, 23582804, 20896627, 19999083, 19703008, 20604181, 24029100, 30680307, 41240848, 57035676, 74851034, 79182536, 64705595, 45207995, 30636513, 21405307, 15643475, 11914287, 9399832, 7694388, 6533749, 5779521, 5349089, 5204709, 5326914, 5530927, 5408990, 4813335, 4027003, 3347075, 2852365, 2468817, 2133068, 1861192, 1659980, 1512601, 1400348, 1321296, 1262917, 1201709, 1134136, 1053421, 964857, 876080, 792615, 723061, 676909, 638181, 608428, 585384, 562981, 537780, 508180, 470504, 437749, 413292, 395000, 370650, 352239, 344913, 332640, 326573, 315906, 300489, 293635, 286398, 274703, 259370, 253063, 248179, 248871, 245270]
17098B45270k175j0548j2423p857l48n153j508n124m366k546n426q479j532J864
17084A79649R03p655q265l616l194R87l039o84K254K185l165k606k830l478j0951
17069A36495n421N215n032k121J539L112r23P59n647n844n568P37r46J444m56
17054A17343O048P935j281k501j678j0501q917O08M3N445q9j1559j6726q955m839
17039G0376O682J5044J2778R197m384q618r729O55O567p05j2928j9893j8903o063
17025D0076rQ591J0302J4071P442k007m89j155l151m507m03K143l688n689n459
17010E6068p87O507R67l8k702r87Q18L810K213K536k877m468l80K562m127M43
16994E9558k885p636J971L613j734m670m494l438m778J084O099O061j231R17L402
$$ y = [245270, 243095, 232547, 220124, 212267, 211919, 206766, 205258, 200134, 195768, 193222, 187796, 179317, 177785, 179649, 180552, 172897, 164632, 161016, 157822, 158809, 155770, 155086, 157340, 159525, 156360, 153754, 150924, 147446, 136495, 131074, 136289, 131257, 129136, 130675, 133787, 132864, 133623, 127976, 122132, 116564, 117301, 116355, 117799, 117343, 123391, 131326, 130045, 127544, 125866, 115365, 106448, 107056, 107099, 112544, 112455, 100896, 84170, 75215, 70376, 77058, 92102, 104880, 114077, 109693, 101075, 91346, 92001, 98568, 97863, 84935, 65042, 46139, 40076, 40067, 48658, 58960, 73031, 80473, 78466, 77977, 76822, 73671, 69164, 68761, 70904, 67216, 61527, 56068, 55281, 61788, 62755, 62717, 60015, 59028, 59846, 63656, 65869, 68405, 65528, 61060, 60680, 63242, 59115, 59558, 56673, 49037, 51008, 54621, 52887, 48217, 43723, 40285, 35507, 36591, 42690, 48751, 47520, 48437, 51839]
16979E1839N211P11j052K29n014j0119l293L457l241l322k736L876j20M454k330
16964C8550l859j456L055m03O06l66J446k666p558k291l326l754n67J1569R719
16949C8699K842q133L289L875m33L874L187o844k117M953O301L476J94m265k333
16934D6565k556m159K369N932j790Q3L87o99j583k821p985k010J469Q43J046J354
16918C6445l19J050J00n337n208N890k450l940J341J537P39N460K451k217k705
16903C2837j0060m343r90N056m588j983m282m295R44Q912P817O839K006j164r99
16888C1707k704o356j739N523j530j968Q41j735Q37k418j539q27l380J268K540
16873A8520L301J66M619r16J280r024P06n784j943Q74k693q62L828M591M158O670
$$ y = [51839, 57050, 57761, 56709, 56938, 51924, 41805, 38512, 41969, 38728, 35406, 32670, 36546, 36426, 40880, 38550, 34691, 33235, 36290, 35887, 36493, 36127, 37573, 34907, 27349, 25058, 21732, 17978, 17411, 28980, 38699, 41541, 33408, 36697, 40572, 40139, 44013, 47200, 40356, 38239, 43192, 49493, 52969, 53163, 48898, 46565, 44009, 39850, 42219, 48151, 46361, 46444, 46831, 46132, 44549, 41728, 33743, 31733, 33202, 34045, 35091, 36445, 36126, 37176, 37276, 31939, 26731, 32621, 30171, 26231, 27572, 29109, 29848, 35308, 37759, 35542, 32837, 22777, 18434, 17444, 22500, 17912, 15929, 11647, 7352, 8296, 17208, 25025, 31864, 33870, 32706, 31707, 29003, 22647, 20908, 26431, 24901, 22933, 23774, 22039, 22876, 20458, 18919, 18092, 14712, 15980, 18520, 21821, 21987, 26606, 25690, 26970, 17946, 18652, 12868, 10925, 11799, 9106, 8244, 12072, 16663, 20821, 27491]
16857B7491O809l513K825k130m818n083j431J905p31M102L550l923l923l146K598
16842B0582N38o43L839p13L05K015n43L617j720N155m342o478q50K118m309M505
16826B3076R09M141j099o511k748k043k237m094l77K169N116q03K848M158j822
16811B0683K371P129l74m642L88j102k874j387O65j061n050l308L939M964K347
16796B2688L695L831J337p506J663O203J029j894q280n646n89O867J889o166j011
16781A8110M339j495l96k74k342K546J1760L875k180K371K419n246o273M698L907
16766C5819k72k866M262J76j669N466L866k212o465j460N198Q567j312j641L053
16751D8510j233j418M480O876J031k772L347O783N361j117m239K076J0375J5221
$$ y = [27491, 34300, 30787, 33612, 31482, 26664, 21581, 20150, 22055, 21324, 25426, 28976, 25053, 21130, 17984, 20582, 21120, 20477, 24316, 23603, 23908, 25923, 25380, 28997, 27277, 32432, 28090, 21612, 20762, 22880, 18571, 23076, 23985, 28126, 27027, 20516, 17768, 15725, 13488, 9394, 9017, 11186, 16302, 15499, 18347, 22505, 20683, 23054, 30183, 29809, 25167, 25555, 24453, 21579, 20192, 20857, 19796, 14746, 11438, 15377, 20341, 22688, 26383, 30214, 31551, 24045, 25708, 31911, 32940, 31046, 22766, 17120, 16531, 23398, 25287, 19121, 18110, 22449, 20954, 20558, 20284, 17942, 20488, 32248, 36123, 33943, 36314, 38733, 33487, 27214, 31912, 35819, 35547, 32681, 36943, 37119, 35450, 40916, 44782, 42570, 36105, 34645, 39843, 48410, 47098, 45457, 48510, 47277, 45859, 50339, 57215, 58246, 55474, 58821, 65604, 70965, 69848, 65609, 67685, 78060, 93281]
16737I3281J4864K5900L0315m097k3656j8848j9216j0459j691P821J2078J5894
16725A22186K0639K2527J5915j917k2048l6884k0739p258p643k870M21j320J842
16712H2851n767j3966k020Q003M538P44l669j378O527P669J0622K038n125n292
16698H5775q579k846p10M61p599j24J20l461R36m87o151K041K621N901L762J709
16682G3369n356J728k055m428N51J047k96j278l908K953L750L551J177K911p30
16667G2986J1918M071J720O701J881m860j1454p527j170l067L11q140k98j31j296
16652F1645n386P050M156p58j765r09m232j249L000j052l702J689L148K113J525
16637F5273p44q532l503M350m26m971N470L585r88K229O902R329J8408J5665Q193
$$ y = [93281, 108145, 134045, 164360, 160263, 136607, 117759, 98543, 88084, 86393, 94214, 106292, 122186, 142825, 165352, 181267, 179350, 157302, 120418, 99679, 92421, 84778, 81908, 82329, 81009, 82851, 77084, 63118, 61098, 69101, 73639, 74383, 70714, 69336, 75863, 83532, 94154, 96192, 91067, 85775, 77196, 74350, 73640, 74101, 66502, 66378, 66498, 63037, 63973, 63486, 57335, 59376, 61997, 67898, 71660, 73369, 68013, 69741, 67686, 63258, 63809, 64856, 64560, 63282, 59374, 62327, 66077, 69628, 70805, 73716, 72986, 84904, 88975, 90695, 97396, 99277, 94417, 82963, 75436, 74266, 71199, 71510, 63370, 63072, 62941, 61645, 56259, 63309, 67465, 66707, 64942, 64033, 59801, 58552, 61552, 60500, 56798, 58487, 61635, 63748, 65273, 64529, 55997, 52494, 56844, 56418, 51447, 56917, 60502, 59514, 61743, 68645, 77974, 96382, 112047, 120240]
16622A20240O156J5698L0488M2905N2983M8880K7990j4880m9466n1011l4494k6834
16610A68655j4753m525L418J0583K0685L1932M2085N0556M8949r08n4465o9297
16598B32915n6272l6878l7261j9643r604j6149r325k934j443k55J934M001j723
16585D7363q937n958j658o942J22N860j0938o561L415K376n22O493L470j870k673
16570B3040M794k15n327o904l005Q277Q687J401p431J130K854n556M03J555m584
16555A9119j059j023l98o473K985N020L72k631l649O04J476l120m673j968k023
16540B559M4Q01L394M24J50N332j735j088O02j093j189q87O241L039J150j078
16524A6666k4m772l088L073K758L749l296k920K227J553L659k839j0713m398k101
$$ y = [120240, 126396, 142094, 172582, 215487, 268470, 317350, 345340, 330460, 280994, 229983, 195489, 168655, 153902, 149377, 152795, 163378, 184063, 215995, 258080, 308636, 357585, 356677, 302212, 232915, 176643, 139765, 102504, 82861, 73257, 57108, 47783, 44849, 43406, 43151, 45085, 49086, 47363, 38426, 32468, 30810, 23868, 23990, 29850, 18912, 12351, 15766, 18142, 17620, 24113, 27583, 25713, 23040, 27834, 27619, 22292, 15388, 12383, 20660, 29347, 30748, 23317, 24447, 27301, 21745, 22148, 23703, 19119, 18060, 17037, 16639, 10166, 13151, 18171, 18543, 15912, 12263, 12867, 14343, 11223, 6550, 4582, 2559, 2603, 3404, 6798, 7222, 7372, 12704, 10969, 9881, 10483, 9390, 8201, 7314, 13555, 16594, 17744, 16666, 16642, 11870, 8782, 11855, 14613, 18362, 15066, 12146, 14373, 15926, 19585, 16746, 6033, 1635, -466]
16509d66J332K464j487L230N847K442M70K988m869q875K115K061L889J315j045
16494A1411m340j120l692j145L000N028K452K128m156k299J678k991L364N71m729
16479E160n72p47k300n24J60l308J012l341M908K426j094n384l710R083Q122l007
16463F884n005j521J442k449n175k51J0671l73m885m88q83J185k360j549J647
16448c110p77l268m250O191N008m72m714j379q28m119J995O394R365l63q156L780
16432A297L722m383j153l35J652K751L707K377p021m135Q174P486l400o780J10
16417D069L234J424L078k670R57j200n452n301r36L709K972l83k732k723K071
16402A17l211m11N022M962L414q548j0520j059P33O503J460L366n358m490J780
$$ y = [-466, 866, 3330, 1843, 5073, 10920, 13362, 13832, 16820, 11951, 3076, 5191, 7252, 11141, 12456, 11411, 7071, 5951, 2259, 1114, 4114, 9142, 11594, 13722, 9566, 7267, 8945, 5954, 9318, 9889, 5160, 4588, 3841, 1541, 1017, 1177, -2131, -1119, -4460, 448, 2874, 1780, -3604, -7314, 1769, 9891, 6884, 1879, 358, 1800, -649, -5824, -6075, 4596, 4223, -662, -1150, -2033, -848, -3208, -4757, -3110, -3887, -7155, -11405, -5214, -206, -678, -5392, -6771, -7599, -11718, -9723, -3329, 6036, 5673, -2483, 1297, 5019, 636, -517, -852, 800, 3551, 7258, 9635, 2614, -1521, 6653, 14139, 10739, 3959, 4069, 7303, 8727, 11805, 9135, 10092, 8892, 3440, -1861, -2797, 912, 3884, 3501, 769, -1954, 117, -3094, -3505, 1517, 6479, 9893, 1345, -9175, -10234, -9501, -2998, -1538, 1828, -3530, -8020, -6240]
16387f240L423l423l311K25N218N86J785N276r67p8l34m47Q248R862N217n591
16371A9449k873k909j863l536p621m790m120L157O102P967K015n164o202J854
16357A466N194K680N372J933k877k921j1380p792J555l949j36K016Q62N242K695
16342d0K400m241j640M101M45l761j08O830j864m182j802N384J2028Q279m369
16327A7460o023p818m673k760M43J1316P273P555J1987N178j1093r606j1171j2306
16313d238n296l437l743P196j72J342M009K507Q294J1513L503n513o443n506m567
16298e51n197O94J53J7l305J721l02j041o17j042N992k842O787N086J712n745
16282A520m222m20j168j919q00M709M335L75J885J447J211o126m158j695Q851
$$ y = [-6240, -2817, -6240, -9551, -9326, -4108, -3522, -1737, 3539, 2572, 2494, 2160, 1713, 9961, 19823, 25040, 19449, 16576, 13667, 11804, 8268, 647, -4143, -8263, -5106, 996, 8963, 10978, 5814, -388, 1466, 6660, 9340, 14712, 16645, 13768, 10847, -533, -8325, -6770, -10719, -10855, -8839, -7977, -2735, -40, 2360, -1881, -3521, 580, 1025, -2736, -2844, 3986, 2122, -2060, -3862, 1522, 13550, 21829, 17460, 11437, 3619, -1054, -3814, -3371, 7945, 15218, 22773, 34760, 39938, 28845, 19239, 8068, -4238, -9534, -12971, -16714, -9518, -9690, -8348, -4339, -1832, 6462, 17975, 21478, 15965, 9522, 4016, -551, -5748, -5054, -4901, -4884, -8189, -6468, -6770, -7811, -8428, -9470, -3478, -6320, 467, 5553, 7265, 1520, -2702, -3122, -4290, -6209, -7009, -2300, 2035, 2410, 4295, 5742, 6953, 827, -3331, -5026, 3825]
16267C825O212q036p436N902r15j848M001jJ60j872N592L59p319k955P253P383
16251A0305l353q214n285K498K810j592N145L030L0n590l289k931K073n833Q6
16236a0110m09j44k164L143R97L634O69n418J855M328M75J276j814K100K011n20
16220i1L582J804K447J465n284o647N8N619j06l70o59K075k899l32k578n796m877
16203a2589P98m858M559M414q22M831k797l171J780N338o648m619J525R30M171
16188g158k814l554O987O511L100l227p726k634R55K776r23K389j852r37n47L813
16172d841m379O65J783K498j738K65k32P02K909P66m503p899L264Q511K573j746
16156a402n867j440L935N18o613M752K300n685m153J485K917N643R657M197p93
$$ y = [3825, 10037, 2001, -5435, 467, -448, -2296, 1705, 1704, 1864, -8, 5584, 5943, -1376, -4331, 2922, 10305, 6952, -1262, -6547, -4049, -1239, -2831, 2314, 5344, 5374, -216, -3505, -6436, -4363, -10196, -10110, -10519, -10663, -12827, -9684, -8687, -5053, -4384, -9802, -7947, -3619, -3144, -1868, -3682, -1582, 429, -91, 3491, 5295, 7742, 9207, 3923, -2724, -2666, 2953, 2847, 2477, 1818, 3893, 994, 662, -1916, -7712, -12589, -11791, -16649, -12090, -7676, -8498, -3667, -6464, -9635, -7855, -2517, -9165, -13784, -12259, -11329, -7158, -9972, -13526, -6539, -28, 3072, -155, -7881, -10515, -9560, -6784, -7707, -5318, -7170, -8107, -8654, -4841, -9220, -8555, -6772, -4274, -6012, -5747, -5979, -5277, -2368, -1602, -6105, -14004, -10740, -2229, 344, -1402, -7269, -8709, -4774, -4256, -10869, -6117, -3817, -9502, -13655, -12170, -9253, -3610, 6047, 10244, 9451]
16141I451l754j1725j567M543J275k091o890k080O518P663k620J372l40l996p063
16126a1304j064J0541Q951r23n322j484j01J837m392k850l419N189N380o64J064
16111A439k197k147j862k58L159j396j235J133M242K342r15K204N627k00m042
16096E894p095K054J889j147N509l14m347j0180j163N028R245K619l527m492J289
16081A262k286k643J827K142o2l161J585L415J718j078L51O313J881o644p533
16066b913j170L486O121L858J003O641J427q114j69n144k941K033J989J585j696
16051E996l680J109k021n775m137J337M397k258n208q82K981K314Q255p39l272
16036a583j028l820m630M09L810m47j448o39K26k821J039M506o620J283J0361
$$ y = [9451, 5697, -6028, -7595, -3052, -1777, -3868, -10758, -12838, -6320, 1343, -1277, 95, -245, -4241, -11304, -12368, -1827, 7124, 6201, 879, -605, -706, 1131, -3261, -6111, -9530, -4341, 1039, 375, 1439, -758, -2905, -4767, -5025, -1866, -3262, -4497, -3364, 878, 3220, 2305, 4509, 10136, 9936, 5894, -1201, 853, 2742, 1595, 7104, 6790, 2443, -7737, -8900, -3872, 5373, 7992, 4465, -27, 1262, -1024, -3667, -1840, 302, 240, -2921, -1336, 2079, 3797, 2719, 3070, 9383, 11264, 4620, -2913, -4083, -597, 5524, 9382, 10385, 17026, 18453, 10339, 10170, 5026, 2085, 4118, 6107, 7692, 5996, 2316, 3425, 1404, -4371, -8508, -7171, -2774, -5032, -10240, -11122, -8141, -5827, 2428, 1689, -1583, -2611, -6431, -11061, -10652, -6842, -7289, -8737, -9376, -9150, -11971, -10932, -6426, -13046, -11763, -1402]
16021a402J657n471j723k585J54j052n502j257N517N721J323K840j267L10N899
16006C162l41j558n620o462k156K127K915n32J824L136P15j66J863K288J849l008
15990C6k779o9n26J075n541k462K589k252j82O707J323J956n965j096K80j276
15974h182k846k434k598M327R425J115l53L484P86q04K810L716m115m618k414
15959b701O37J246k454o410k407K979Q059P132m778k472j454k689M141O134J166
15944F129k184J294j216n065l542L46L423J981k290n139M226j456L094K67l016
15929c148J096k09j092J489O945j485k366p63r078k969J002M469q93K886L295
15914h21k923N162Q6l179l46J693n41J297K867n233q367J817N684J571J429l258
$$ y = [-1402, 255, -5216, -6939, -9524, -9370, -10422, -15924, -17181, -11664, -5943, -4620, -1780, -3047, -2737, 3162, 2821, 1263, -4357, -10819, -12975, -10848, -7933, -8465, -6641, -3505, -2790, -2956, -1093, 1195, 3044, 36, -2743, -2812, -3338, -2263, -7804, -10266, -7677, -9929, -10111, -3404, -2081, -125, -6090, -7186, -6906, -8182, -11028, -13462, -16060, -11733, -2308, -1193, -1546, 1938, 2724, 1920, 4730, 8446, 4331, -287, -2701, -2064, -818, -3272, -9682, -12089, -9110, -1051, 6081, 1303, -1169, -2623, -5312, -1171, 4963, 6129, 3945, 5239, 4023, -1042, -4584, -4238, -815, 1166, -1124, -6263, -2037, -3493, -399, -132, -3148, -2052, -2261, -3353, -1864, 5081, 3596, 1230, 467, -8611, -11580, -10578, -6109, -7002, -4116, -821, -3744, 1418, 1504, -1675, -2021, -328, -869, 428, 3295, -1938, -10305, -8488, -2804, -1233, 196, -3062]
15898c062J1P002N588n209m709o051k455K276k702j229J172O455J37o385L460
15883e701O125M728r22o156j398p858l914J276L291L518Q655l246n637J901q30
15868f168q75m749m943j785Q780O301o30n658n168J265K885k974K147J532J751
15853h289J153p971j342L667J374M43L093N191L152l293L12M571j778J62M297
15838D742J945L249n522q399N126K500K57Rl797o416m507J679n376L801O275K840
15822a594k852j715k543L088N295J861K687l283l373m679n297o173K923j259L754
15807a3160J514L789l702l066Q992Q478J902J20j849K682j40o68n737M52J405
15792A012J111M995J27K544k49k160q393k080k68K72K965l131R54K668O605M462
$$ y = [-3062, -3051, 3951, 9539, 4330, -379, -6430, -8885, -6609, -9311, -10540, -9368, -2913, -2776, -9161, -5701, 424, 5152, 4230, -1926, -3324, -11182, -15096, -13820, -10529, -7011, 1644, -1602, -7239, -5338, -6168, -7043, -11792, -16735, -18520, -9740, -3439, -4069, -9727, -14895, -13630, -10745, -13719, -11572, -10040, -8289, -7136, -15107, -16449, -12782, -11408, -10965, -7872, -2681, 471, -2822, -2510, 2061, 283, 445, 4742, 6687, 9936, 4414, -3985, 1141, 3641, 3898, 3907, 110, -6306, -10813, -9134, -14510, -10709, -4434, -1594, -4446, -6161, -8704, -5616, -321, 1540, 4227, 944, -2429, -7108, -12405, -18578, -15655, -16914, -13160, -11646, -7857, -11559, -14625, -5633, 2845, 4747, 4867, 3018, 5700, 5560, 4892, -845, -393, 1012, 2123, 7118, 7245, 9789, 9540, 7380, -1013, -3093, -3361, -3089, -124, -3255, -2301, 367, 6972, 11434]
15776A1434M656L67o07N04O000R844P643J5318J6762K6466O1676J04842J50357
15763D15262K22691L76600O17411K66878m67340n82227l43403j75993j02580o6517
15753A60782m1789k8470k3563j5462j1511n439k533m675m857M193m674k444O344
15740B5902j920l893q595r207r54J656M51j840k189M094K720J152P03N685L246
15725A7011J469L93j810j783l671p745j2121l935J623Q02l660P39J456O969J942
15710b321L283j585l778l797K941j900L132j029m438R56O003J68O33K772K863
15695C903J18K244k783N34J960K018J987k831k787P5l294K602l042p661m469J845
15679i581L531j215j229L36L003K594o464l784l635N649j638J433K327j536j884
$$ y = [11434, 16090, 16457, 15850, 16354, 22354, 32198, 39841, 55159, 71921, 98387, 160063, 264905, 415262, 637953, 1014553, 1631964, 1898842, 1431502, 849275, 505872, 329879, 227299, 160782, 118993, 90523, 66960, 51498, 39987, 34548, 32015, 27340, 22483, 26676, 22002, 19558, 25902, 23982, 20089, 11494, 2287, 1333, 2989, 3440, 1600, -589, 3505, 6225, 7377, 8080, 13765, 17011, 18480, 18873, 17063, 15280, 11609, 3864, -8257, -12192, -10569, -9767, -13427, -12688, -11232, -4263, -2321, 962, -623, -4401, -8198, -5257, -7157, -4025, -5054, -9492, -8536, -2533, -2365, -1732, 1040, 3903, 4021, 6265, 3482, 4016, 5976, 7994, 9981, 7150, 4363, 4438, 1144, 3746, 704, -6957, -11426, -9581, -6050, -7265, -8494, -8158, -5155, -2561, -9025, -12809, -16444, -10795, -12433, -11000, -8673, -10209, -12093]
15664a2093K874N030j647O382L41j668o552r4N063l047o488M271P805j773k253
15649c849N985K243n601j0330m186K834O299K462o6l360n758o851j59K705J066
15634a6566m292O664J0335J967o156m165p512J8M484J62j364L040L786J767q063
15619a5895M899K853M365L777K39o635K132k050J069j869n291j21L190J634o10
15604h313k149j474L642k233k046J585k250M059M576l682j846O162K092l899o55
15589f431L52K619Q31J538J326K771k975K700m712q01l7n9k441l514O955K356
15573D78m587n394j011k367o325N585N012M134l842k688j017k104M490Q061q08
15558b383L080L764m62k391K469J650j103k969m560K681k964J508j733L314j572
$$ y = [-12093, -9219, -4189, -5836, 546, 887, -781, -7333, -7427, -2364, -5411, -11899, -7628, 177, -1596, -3849, 2136, 4379, -1222, -11552, -15738, -12904, -6605, -4143, -4209, -7569, -13327, -20178, -20337, -17632, -16566, -20858, -14194, -3859, -1892, -8048, -12213, -19725, -19707, -15223, -15061, -16425, -13385, -9599, -7832, -15895, -10996, -8143, -3778, -1, 238, -6397, -4265, -6315, -5246, -7115, -12406, -12527, -9337, -7703, -8313, -10462, -11936, -8294, -10527, -12573, -10988, -13238, -9179, -4603, -8285, -10131, -3969, -1877, -5776, -6431, -6079, -3460, -2629, -1091, 235, 3006, 31, 2731, -1981, -2782, -2819, -2878, -5319, -8833, -1878, 478, -4109, -9503, -10514, -12881, -19206, -13621, -8609, -4475, -8317, -11005, -12022, -14126, -9636, -1575, -2383, 697, 4461, 3999, 1608, 4077, 5727, 4624, 1655, -2905, -224, -3188, -1680, -3413, -99, -1671]
15543a671m648O698K089P33j607l02o31k710l527p980l510R22J305J017R122n10
15527e210j901j639N812P775O74l284L604j681n767o796n242Q85J0450j907j343
15512e570r00j847o80K260k018n106q99J0212K707j292k884j608O145R45K84L875
15496C624o50N845k154m498o158K193L815J766m211j389k564l54N926j866k167
15481b842Q28P677J997q96o108k811m473n68k326L98M105o828J193K070k347P368
15465c563R956J578m136o24k150J846p23l219n87K041j849j311L073n629O39L475
15449a183M379m021n730j013o71p71N219L231k497l123p448q94M527K312J446
15434f237J174n932m532m324R15M210N328N288k222o528p698L960R042P164M087
$$ y = [-1671, -6319, 379, 2468, 3201, 1594, 1292, 661, -2049, -5576, -13556, -17066, -16144, -14839, -13822, -4700, -5210, -7111, -8750, -2938, 4837, 5511, 2227, 5831, 4150, -1617, -8413, -13655, -12770, -2320, -4227, -5570, -6470, -8317, -8997, -6737, -8755, -13861, -14760, -4548, -1841, -3133, -6017, -7625, -1480, -535, -251, 3624, 2974, 8819, 6665, 2167, -3991, -1798, 2017, 3783, -428, -1817, -4381, -4735, 1191, -675, -2842, -2014, 5663, 7660, 6764, 656, -2155, -6628, -7196, -9522, -9124, -5019, -11847, -10654, -8584, -10931, -3563, 6393, 7971, 3835, 3211, 1061, 2907, 2184, -1035, -1622, 419, -1430, -2741, 332, -5297, -4658, -1183, 3196, -825, -6555, -7568, -8239, -9010, -3791, -560, -3057, -6180, -13628, -14522, -9995, -7683, -6237, -5063, -10995, -15527, -19851, -18936, -14726, -9398, -4110, -6332, -12860, -20558, -16598, -7556, -392, 3695]
15419C695K6l261k510L648o89m888m269R79P05k531L445r49M385O189k361o672
15403e058j01K942J90M1N947R115k627r836r543K266r68l075K767m72l703q16
15387a2931J832L226P324M334J0703M141j239j0160p741n118k638Q35j883k215
15373a1530m147L210M393K916l32l947n644J019M525j30P40L105k720n384J218
15358a2708J0147L835O05P19J64o267j283n52J864m055J60r18L59L314Q369l262
15342D91j4697L179J826k382j657J094K643M32M811N313J32j610L155L76K411
15327E517L400j484p93k823K320L138K477N846O715m404p237r041q006k11K11
15312d375Q255O155l777o346l535k062j59k617l696M155J436j39L166M387Q82
$$ y = [3695, 3721, 460, -2050, 1598, 909, -3979, -8248, -7269, -6564, -9095, -5650, -6599, -2214, 3975, 1614, -5058, -5159, -2217, -2027, -1986, 3961, 13076, 10449, 613, -8930, -6664, -7632, -10707, -7940, -8412, -12115, -12931, -11099, -7873, -549, 3785, 14488, 18629, 17390, 7230, -511, -5629, -8267, -7432, -9315, -11530, -15677, -12467, -8074, -5158, -5490, -9437, -15081, -14062, -9537, -9667, -8927, -5822, -8542, -13926, -12708, -2561, 1274, 1879, 2598, 2762, -3505, -4788, -5340, -3476, -7531, -7371, -8289, -7930, -4616, 3753, 491, -14206, -11027, -9201, -11583, -13240, -12146, -9503, -9071, -4260, 1053, 1185, -425, 2730, 3106, 5517, 8917, 7433, 6640, 3817, 6137, 9275, 11752, 17598, 24313, 19909, 12672, 3631, -4375, -4586, -4375, 3880, 10035, 6258, -88, -3623, -5685, -5844, -8461, -12157, -8002, -6566, -6705, -3539, 848, 1730]
15297A730m777m642L6J892l456o247k726J415j453J0017Q638J8560K3245J3122
15283E5354l606k1596k5025j2407r588M96O096P956M309J326K800r841m700o909
15269a5335Q63L607K480M48j555o63N189J644K240l608n703N65N567k958n192
15254a2411Q694N059n40L66m389k824M483J215k500j903n27n36J117N864P62O05
15238B535k168l021p38L763l587J303R60m859m905J461K544P603j950l527j275
15223e861M494j453n074J374Q16n963n560j644K404J125j308P785J576J011n25
15208f803n104l214O53q8L981N613M458K457n885m362J251o544N774L916K82l959
15192g574L017O562j302k725n902J937Q413K942p664k41Q838J377m582n41k082
$$ y = [1730, -3047, -7689, -7653, -5761, -9217, -15464, -18190, -16775, -18228, -8211, 427, 18987, 42232, 55354, 51748, 30152, 5127, -7280, -16868, -16372, -10276, -2320, 1989, 3315, 6115, -3726, -8426, -15335, -14472, -10865, -8385, -7937, -9492, -10155, -4966, -3322, -1082, -4690, -10393, -9828, -4261, -7219, -12411, -3717, 1342, 802, 1168, -3221, -6045, -1562, -347, -2847, -4750, -5277, -5813, -4696, 1168, 1930, 2535, 367, -2654, -3392, 371, -3216, -1913, -953, -5812, -10717, -9256, -6712, 891, -1059, -4586, -5861, -1367, -2820, -7894, -6520, -5704, -11667, -17227, -18871, -16467, -15342, -16650, -8865, -7289, -6278, -6803, -11907, -15121, -14468, -14556, -10575, -4962, -504, 1953, -3932, -8294, -7043, -13587, -7813, -3897, -3615, -7574, -4557, 2005, 703, -2022, -7924, -5987, 2426, 5368, -2296, -2537, 6301, 7678, 3096, 2555, 473]
15177D73l246o544J480J577k231N468J950j605l051m585J732N362O966o139q618
15162a1011J112O013M071k849o789k513L11j424M50l519k804M057M643P068K150
15147a034l997m924J618M699L450N36k955l705k608o69N594P110o692p212j065
15132a1854j030j320P97K557L930J384N972l27K265K370m827j2946J568N152L256
15117c053k629l97j787l359k192J877J649J936k052L23k163j886j454q49N241
15102a0795K711p77N62M502j367l391j519o956J527O683L369j026j836j992P236
15087c069J0455p87q146m354L24K820m229m947J467j063n82N433J575k345K894
15072d554N824m162j034O11o26k126m553j993N05L57J274L896k282k492N110J789
$$ y = [473, -2773, -9317, -7837, -6260, -8491, -3023, -1073, -2678, -5729, -10314, -8582, -3220, 3746, -2393, -11011, -9899, -3886, 185, -2664, -9453, -11966, -11655, -13079, -12629, -16148, -18952, -14895, -10252, -3184, -1034, -5031, -9955, -8337, -3638, -188, 348, -2607, -6312, -8920, -9589, -3995, 3115, -3577, -10789, -11854, -12884, -14204, -13407, -10850, -6920, -5536, 436, 109, 2374, 4744, -83, -13029, -11461, -6309, -3053, -5682, -6079, -7866, -11225, -13417, -11540, -9891, -7955, -10007, -9684, -11847, -13733, -15187, -16036, -10795, -8084, -8861, -8299, -3797, -5164, -8555, -10074, -17030, -15503, -8820, -5451, -6477, -8313, -10305, -3069, 7386, 6599, -1547, -5901, -5577, -2757, -6986, -11933, -10466, -11529, -12111, -6678, -5103, -7448, -4554, 1270, -2892, -3926, -3315, -3941, -6067, -10620, -12613, -12108, -11751, -10477, -6581, -8863, -11355, -6245, -4456]
15056d456j13j154k962J479O454L295j075p123n575p541M37O730P518O223p64
15041A373P77J38l847k735l140o98j583L172K336k513J277n585j860L981L370
15026e537j353m70k840K507J050p364m284L502O881P10j953m08L298l922M932
15011e251M816k090j006k556L599p71k671J04M829L545K904j88l619J562r44K429
14995D692j169p904j736J425K930n9J021l663l74p46j228K500J283p943k858J096
14979a2733M071N537J616p67m17N68m04L432O595o871j653k36J453k044J499O031
14963E677K298l847j355l027m266J109q872L009R9p591K732J0802q69j080o484
14948a1665J683L42J453P50L823L429L620M330M327N871K287j602J057o812r734
$$ y = [-4456, -4569, -5723, -8685, -7206, -752, 2543, 1468, -5655, -11230, -18771, -18334, -11604, -4086, 2137, 1373, 2150, 2288, -1559, -4294, -7434, -8132, -9715, -6543, -4207, -6720, -5443, -11028, -12888, -8907, -5537, -6890, -7360, -10200, -7693, -6643, -14007, -18291, -14789, -7908, -7198, -9151, -9559, -6261, -10183, -5251, -435, -2525, -3531, -6087, -2488, -3259, -5930, -5826, -997, 2548, 5452, 5264, 1645, 3207, 2263, 4692, 3523, -4381, -6117, -4692, -1762, -1821, -800, -4463, -4837, -5583, -6811, -4311, -3028, -10971, -13829, -12733, -8662, -3125, -1509, -2276, -2693, -2125, -2529, 903, 7498, 627, -1026, -1262, 191, -1853, -354, 5677, 7975, 4128, 2773, -254, -4520, -3411, -12283, -9274, -9175, -16766, -14034, -3232, -4101, -5181, -11665, -9982, -9640, -8187, -7437, -3614, -185, 3435, 7765, 12092, 17963, 20250, 18648, 19705, 12893, 3159]
14933C159k77j753p631P78l33j564n887k371J953M89J07m469n918l73R953M106
14917a0031N37L880J063o06L525R0J96n65P62j363p39J03n060J673O466L411o98
14900B644o919k529N80j235m123J999M033K927k109q008L06L892P080k725m065
14885h252j945m199m316L078M943k407K981J092J882L849K32o312o145K569P249
14870e701M703M432q57n511O58o6k400j203J321p631l260j748L940O034m037M91
14854a0835K787J79p54R9j149n99o036Q484O866j692q94N856L582j456o312j388
14838c262N001M813L122o069k233n750k884j600j452m75K36L253Q92K455J839
14823b114k575K351j695L999M796m914L944J417n234J872J266q827L074N499j781
$$ y = [3159, 2882, 1129, -6502, -5724, -6057, -7621, -13508, -15879, -13926, -13437, -13330, -17799, -23717, -24090, -14137, -10031, -9494, -5614, -4551, -5157, -1632, -1542, -1346, -1911, -1149, -2512, -3251, -3148, -8208, -6535, -69, 3342, 2644, -4275, -6804, -6224, -7459, -11582, -9583, -5550, -2623, -4732, -12740, -12434, -8542, -1462, -4187, -8252, -10197, -14396, -18712, -15634, -10691, -13098, -10117, -9025, -7143, -3294, -3062, -9374, -15519, -12950, -5701, -998, 3434, 2577, -2934, -2276, -2342, -4742, -5945, -4624, -12255, -15515, -17263, -13323, -7289, -11326, -10835, -8048, -7869, -8623, -8524, -9673, -10272, -16308, -7824, -958, -2650, -3544, 2312, 5894, 4438, -1874, -3262, 1739, 6552, 9674, 3605, 1372, -4378, -7262, -8862, -10314, -10789, -10553, -7300, -6408, -3953, -2114, -4689, -2338, -4033, -34, 4762, -152, 3792, 5209, -25, 1847, 3113, -5714, -2640, 2859, 1078]
14808A078J776l868k371l060k695L335Q58l785m89k551n454j301O032M175j067
14793i387l722K273L129R74o110K613M884j403m35K512N89N51J904j865q783k321
14777a4597J2647j60k43j184m303j769L82k826M721M020k371k02n208m95j0j766
14761a3364k902L055M69k721j651L713K597m42l844j350m45J459J63N329N478
14746d456J0k808q39k543p5L903l39m002K381N290J263j561r3l024k484K806k794
14729i365q221M4M034L112j451k778L293O462J353o089r938o044J0754P715L289
14714c830j603k216l934M215M920N045j47k059l62l554k952j733N727M118m097
14699b462L31K87o622n935l985L613K118n71k664k68J0910N364l236j940l527
$$ y = [1078, 2854, -1014, -3385, -6445, -9140, -5805, -4947, -8732, -9221, -11772, -17226, -18527, -12495, -8320, -9387, -13109, -10836, -7707, -6733, -12843, -10230, -5346, -6749, -7184, -4672, -4083, -3532, -1628, -3493, -12276, -14597, -1950, -2110, -2353, -3537, -7840, -9609, -9227, -12053, -7332, -3312, -5683, -5885, -11093, -11588, -11598, -13364, -16266, -13211, -12742, -15463, -17114, -13401, -10804, -11246, -15090, -16440, -16885, -15426, -15263, -9934, -4456, -4446, -7254, -8093, -10636, -10711, -6808, -7147, -11149, -8768, -3478, -2215, -3776, -3869, -6893, -9377, -6571, -9365, -17586, -17542, -13508, -10396, -11847, -14625, -11332, -4870, -3517, -9606, -19544, -25588, -14834, -7119, -3830, -5433, -7649, -11583, -7368, -2448, 2597, 2450, 391, 29, -3525, -6477, -8210, -2483, 1635, -2462, -2131, -1844, -8466, -14401, -18386, -14773, -12655, -13226, -15890, -16158, -5248, 116, -3120, -5060, -8587]
14684h587l876J107N798J148j902j0681p97N659R793M398p78q002q505J282M019
14669i924k353K215M388O541l155k440k594o211j870J015m155J463K8p054R43
14654b3163Q654J9423J6667k944j5111j4098j0388l643Q981J2432J652r810n748
14641a7096o22M510J2204J5651O275n467j0909j0403r290l343M624J1574Q83m258
14627e667j90R58m36m374q97J74N721P291M05n966J493M219k647n235O583O998
14611H430k954k873k282l175M07R40m998j0557l656K516J678L429Q556J793p92
14596c538j178n45N976k156l314R786K108m495k748l875n376M476L000O877q565
14581c567l222L580p64R19M202L688o42l522j319M697l084j923p900n40p98j414
$$ y = [-8587, -12463, -11356, -5558, -4410, -6312, -16993, -17790, -12131, -2338, 2060, 1282, -6720, -15225, -13943, -9924, -12277, -10062, -5674, 867, -2288, -4728, -7322, -13533, -15403, -14388, -18543, -17080, -17052, -24106, -23163, -14509, 4914, 21581, 18637, 3526, -10572, -20960, -24603, -15622, -3190, -1538, -11348, -17096, -17718, -13208, -1004, 14647, 20922, 15455, 4546, -5857, -15147, -18490, -13866, -2292, -1409, -5667, -5857, -4899, -5335, -9709, -10606, -10432, -4711, 2580, 2985, -2981, -1488, 2731, 84, -5151, 1432, 8430, 5476, 2603, 321, -2854, -2447, -1507, -6505, -17062, -20718, -18202, -16524, -13095, -4539, -2746, -3538, -4716, -5261, 715, -1441, -4755, 5031, 7139, 2644, -104, -3979, -9355, -4879, -1879, 4998, -3567, -6789, -3209, -3973, -3054, 1148, 4836, 4194, 672, -647, 4050, 966, -957, -8857, -9397, -10195, -11609]
14565a1609J0727N46j185l710o139J677N737N789r25o30k059k050j937K651j378
14550d495M444Q153j22l645p766j613K47m116k330K170N896q87k882p55o214j371
14534a5286j107K119M333k105k087J172J399J830L443l453l23K463O252J714l676
14519c312K430j125j793k905K160k802p083Q151L909k524R24k818K073p04m681
14504a0100L270O538J331J85N504j842q157M429M78o097r37L23P57M90m38n231
14488i497k507p98N937M213K710K240M440k506j3161J001O055Q989n234k199k243
14473b560m312j071O30P00J573M941J626L315o667j0712k043o99K881p78K293
14458a0883L720j979l769O199M176k829m909n204K035N310j353L995P995l148
$$ y = [-11609, -882, -336, -1521, -5231, -11370, -9693, -3956, 1833, 908, 278, -1781, -3831, -5768, -3117, -4495, -51, 8102, 7980, 4335, -3431, -5044, -4797, -8913, -11243, -9073, -3177, -4064, -6946, -7701, -13915, -15286, -16393, -14274, -9941, -12046, -14133, -12961, -11562, -9732, -6289, -9742, -10065, -7602, -1350, 364, -3312, -882, -2007, -3800, -6705, -4545, -7347, -14430, -6279, -2370, -4894, -3970, -6788, -4715, -5419, -10100, -6830, -292, 1039, 1224, 6728, 4886, -3271, 1158, 1636, -4461, -5398, -5075, -4318, -3828, -4266, -9497, -12004, -12802, -6865, -2652, 58, 2298, 6738, 4232, -8929, -7928, -1873, 7116, 1882, -317, -2560, -6872, -7943, -7313, -6613, -5040, -99, 1527, 4842, -1825, -12537, -14580, -15279, -12398, -13176, -10883, -7163, -9142, -12911, -6712, -2536, -5365, -10274, -15478, -13443, -8133, -9486, -5491, 2504, -644]
14444f44Q60K515L979l242o619J059K113m612k107J41P435k256o255j682L907
14429e408p66r3L874j826J97J92N261L708p065l325P77Q94M456J775n216l787
14413f352m125L332K567p10l055K178N805O044l089k308J431K866l69J886j0883
14398d782r559j431L718M791J704L128p67n474j709R962M863l071m098m41K809
14383c57j728n192o312k718j036K421K182M033K90j501P794Q29m16l590r509R38
14367a3872L175M82P531J085k773K799J522l449r103R5K681M063L887K662n1j310
14351e76l858m345m77j60o61l822M241O820P08k07k425l77RR464o20p075J519
14334a842P02P48j088O59O270L35j51o427n077K416N193k331M110P124N944m398
$$ y = [-644, 216, 2731, 6710, 3468, -3151, -2092, 21, -4591, -6698, -6557, 878, -1378, -7633, -9315, -5408, -6174, -6267, -2393, -4219, -4022, -3830, 1431, 5139, -1926, -5251, -4474, -3580, 876, 2651, -2565, -6352, -10477, -7145, -4578, -5288, -8343, -6165, -360, 5684, 2595, 287, 1718, 4584, 4215, 6101, -4782, -14341, -15772, -12054, -7263, -5559, -2431, -3198, -8672, -10381, -419, 4444, 1373, -2725, -3166, -357, -2085, -7277, -13589, -16307, -17343, -14922, -12740, -8707, -8417, -9918, -2124, -1295, -1711, -5301, -14810, -13872, -10697, -10215, -2684, -1599, -4372, -1573, -51, -3500, -12603, -12508, -9827, -5764, -1877, 785, 734, -576, -4434, -8779, -9256, -9416, -10077, -13899, -9658, -2838, -2130, -2337, -4762, -5139, -5130, 4334, 3714, -3361, -1842, -1140, -392, -1480, -821, 5449, 5784, 5633, -794, -5871, -3455, 1738, -593, 3517, 10641, 16585, 12187]
14318A2187q724o84l210o377K380N513K730j67R85j763l343L147m666M97M461
14303B966J394K743K419P224j323j814k140k290j0299O25P629P559K353N359L180
14288B5585n69k268r605J298R981L819n052P897M679k365k759P311J830K438p925
14273C4295R85M114L957K730j01l768k312L668L86M503J060K157k833J189Q447
14258E8477Q149P515J1300Q741M529M545M319J0811l94m288k270m330l054k287
14244A01763q907p146r413j2855o148m85n19k511L910M082Q25R037Q295P60K91
14229H0979l973L08N175P084J548m399o476p395p198k575l721k809j1106q285
14215C7157q641p139p248P315r932J190O044o25m175j668l799J350l724q612N390
$$ y = [12187, 3463, 2779, -431, -6808, -4428, 1085, 3815, 3648, 4633, 2870, -473, 2674, -1992, -1495, 2966, 4360, 7103, 9522, 16746, 15423, 13609, 11469, 9179, -1120, -495, 7134, 14693, 17046, 22405, 25585, 25016, 22748, 13143, 14441, 24422, 28241, 23189, 31086, 35765, 33400, 30641, 37952, 39782, 42220, 34295, 35280, 39394, 43351, 46081, 45980, 42212, 39900, 43568, 43954, 48457, 49517, 51674, 48841, 50030, 58477, 66626, 74141, 85441, 94182, 98711, 103256, 107575, 118386, 117992, 113704, 111434, 107104, 104050, 101763, 92856, 85710, 76297, 63442, 57294, 56809, 56290, 53779, 57689, 61771, 62596, 71633, 79928, 80688, 80979, 77006, 77314, 82489, 89573, 91121, 86722, 80246, 72851, 65653, 63078, 59357, 56548, 45442, 37157, 28516, 21377, 14129, 21444, 11512, 12702, 18746, 18121, 13946, 12278, 8479, 9829, 6105, -2507, 2883]
14200B883J0792L086l719m792j1056j801J887j596M137J094L184j00k670r95q73
14185e39j002p61Q679m33k051n561K382N765O737J933l211p610l554J684J258
14170C716j0489j1482M032Q26K736P683L930k257j893L633Q516L959j979m583
14156F348m571L733p93j259L1n208K181J408l953q402k858N697L48p20L053K691
14140b274r43J620k54l388j734l883L850R979N846M30O56m693j069k04k388N580
14124G131P496k160o639j2446J160K273J837j195j953N048N72O140k91l808m398
14109a233q86k256O497j13l794K057K857J0657k85m751n037K243J254r67k479
14094C764q896J38L090k708j399K680L512k382n90P709O913Q39m065m860n556
$$ y = [2883, 13675, 16761, 13042, 8250, -2806, -4607, -2720, -4316, -179, 915, 4099, 3999, 1329, 334, -539, -1541, -2302, 6377, 5944, 3893, -1668, 714, 6479, 13216, 15149, 11938, 4328, 774, 2458, 3716, -6773, -18255, -14223, -13397, -10661, -2978, 952, -1305, -3198, 435, 8951, 12910, 10931, 6348, 1777, 5510, 4717, 3458, 3489, -1719, 462, 1870, -2083, -10485, -13343, -7646, -7298, -8018, -4965, -2274, -3217, -1597, -1851, -5239, -6973, -10856, -7006, 2973, 8819, 9249, 9905, 5212, 4143, 3939, 1551, 7131, 14627, 12467, 5828, -6618, -5458, -3185, -1348, -2543, -4496, 552, 1124, 7264, 6973, 3165, -1233, -2119, -4375, 2122, 2009, -1785, 272, 3129, 13786, 13501, 8750, 3713, 5956, 7210, 6243, 3764, -5132, -4994, -1904, -4612, -6011, -3331, 181, -2201, -2791, 4918, 11831, 12670, 8605, 3745, -1811]
14079a811K073N876m671J195M038P44j100M992l014j394O337J336J75k976p700
14064D100q38N333J725k601L017K055m544k939P047o7n529l11N230L81J351K332
14048A5742J33k433q232k160J090M330J775O39P46K547n180L70J261K951q36m928
14032G815j9l903l410l0M00k066l09j003M854J899K766l173J966M339k607J836
14016I355p67j924r93q66k347M132O815k422j170m998l291K474Q63L673k674n183
14000F77l923K927K948L511l352r41k452m368o106l245J662n577N676L698K63
13985h602K338L616j650o727k097K786L521N886n902K35M631L508j567k808q74
13970c706j939k548M662N99R77p64M642P818J587k923n876o722L186j061L828
$$ y = [-1811, 262, 6138, 1467, 2662, 6700, 7444, 6344, 11336, 8322, 6928, 13265, 14601, 14776, 11800, 4100, 3262, 8595, 10320, 7719, 10736, 12791, 8247, 5308, 12355, 12288, 6759, 6448, 11678, 12059, 13410, 15742, 15875, 13442, 5210, 3050, 4140, 8470, 10245, 10884, 11630, 14177, 8997, 9367, 10628, 13579, 12743, 7815, 7796, 3893, 483, 453, 853, -1213, -1522, -2525, 2329, 4228, 6994, 3821, 5787, 10126, 7519, 9355, 8588, 6664, 5671, 4805, 2458, 6590, 13405, 10983, 9813, 4815, 1524, 3998, 4861, 8534, 5860, 677, -3246, -319, 2629, 6140, 2788, 1847, -605, -4973, -11079, -14324, -12662, -18239, -12563, -8865, -8602, -6264, -2648, -4298, -11025, -13122, -10336, -6815, -929, -6831, -6596, -1965, 1543, -24, -2832, -3706, -5645, -8193, -3531, -2932, -1955, -2719, 1923, 9741, 11328, 8405, 2529, -4193, -1007, -2068, 1760]
13955A760Q243P098j639o277P97m00n53p631M479Q18l81p48o03r17L545K927K960
13938A3478l674Q11O693N205R231k082m948j4805o545o10N154K610j426L964j288
13923A1768k651o148J79J2560R751M48k867J168k612o339M58J334L101j975l254
13908A4921m587j085n696j660l87M370L27J334J413k059L766O638J054L121K808
13893B4278m190k569j798j5N496M153L225j209j608K470J313O86m720k524n046
13878A7942K78Q25K446l87R87K872N667k244J663n69j676L61P945M467n051n913
13862B9613l945r5K115p123m679N258K132j960k90n636o722k069p78M25k443J459
13846E262Q642M148O861P005n404L441L465K700k126K578Q055J647k340K127M553
$$ y = [1760, 10003, 17101, 15462, 9185, 9982, 9582, 9029, 1398, 5877, 6695, 6314, 5566, 4963, 4046, 7591, 10518, 13478, 9804, 10615, 17308, 22513, 31744, 29662, 24714, 9909, 3364, 2754, 7908, 10518, 9092, 13056, 11768, 9117, 2969, 3148, 15708, 25459, 25907, 23040, 24208, 21596, 15257, 15715, 17049, 20150, 18175, 14921, 10334, 9249, 3553, 1893, 1506, 5876, 6203, 7537, 8950, 6891, 10657, 17295, 18349, 21470, 24278, 20088, 17519, 15721, 15706, 21202, 25355, 28580, 27371, 25763, 28233, 29546, 30232, 25512, 22988, 17942, 18220, 19045, 21491, 21104, 22091, 24963, 30630, 28386, 30049, 29480, 27804, 28165, 36110, 40577, 35526, 29613, 25668, 25573, 27688, 20565, 15886, 21144, 23276, 21316, 21026, 15390, 8668, 6599, 5821, 6246, 3803, 5262, 13904, 18052, 24913, 31918, 26514, 29955, 33420, 36120, 33994, 36572, 44627, 46274, 43934, 46061, 50614]
13831E0614J6M40O922q20K368k51O30J859L08M317J326O023P741N617J0361J2343
13815A09814O489L314K825M663L294J2363J5951J5323J9346K0266K3827L4214
13803B71689M1638M7571N1023N8161P3105R4420J21907J53638K06680K90350L82796
13792A792978N03779O49431P64698Q21223Q24700P80336O93426N51333L38064
13783G719968O2908k32894m75491o47105p49570p91967q05825p64632o75273n53586
13773B086533m26397l13427k29970j72861j31791j05159r1988p4177o2798n2612
13763D25353m5772m2179l9530l1184l1232k5838k0932j4939p706j5449j6089o884
13751A27619o372n218q37o861j1116o615J21j588k173o396n328j638n021l130
$$ y = [50614, 50630, 51070, 57992, 57172, 59540, 59289, 59919, 61778, 62086, 66403, 67729, 73752, 81493, 87110, 97471, 109814, 116303, 119617, 122442, 127105, 130399, 142762, 158713, 174036, 193382, 213648, 237475, 271689, 313327, 360898, 411921, 470082, 543187, 637607, 759514, 913152, 1119832, 1410182, 1792978, 2296757, 2946188, 3710886, 4532109, 5356809, 6137145, 6830571, 7381904, 7719968, 7782876, 7549982, 7074491, 6427386, 5677816, 4885849, 4080024, 3315392, 2640119, 2086533, 1660136, 1346709, 1116739, 943878, 812087, 706928, 614940, 540763, 477965, 425353, 379581, 337402, 297872, 266688, 235456, 209618, 188686, 173747, 166041, 150592, 134503, 127619, 121247, 116029, 115192, 108331, 97215, 90600, 90721, 89133, 86960, 80564, 75236, 73598, 68577, 65447]
13737F5447m704l993j131m788o934n395k871M14jo1k3K261M436N127L768j656
13721D9896r873p335k007Q79K215J658J17l939n072K450K384k984K07n180j807
13706B1609M038O529K113l72m00k302m809k150J742J2907k274m819l73J57m627
13691B6969j896k838M562K247P27l313Q34J756K140m418m933j814n25j293L714
13676B1919j448j637J201M634q67p996n348J780k75n104M651J661j241J640l195
13661A0375P72L941K59p56K044N454k907L021O60m408k667m613q887N798L407
13646A1493n303L594O917l14M157J003l884l088L980J272j694n614m821j692K260
13631H266L979O59k083J532Q83J387N358j646m227k644O282l991n456p32m4L513
$$ y = [65447, 60743, 56750, 55619, 50831, 43897, 38502, 35631, 36045, 36044, 35983, 35960, 38221, 42657, 47784, 51552, 49896, 40023, 32688, 30681, 31560, 33775, 35433, 35550, 31611, 26539, 28989, 31373, 28389, 28596, 23416, 21609, 25647, 32176, 34289, 33917, 33517, 31215, 26406, 24256, 25998, 38905, 36631, 31812, 31439, 31596, 26969, 25073, 22235, 26797, 29044, 29771, 26458, 27292, 29048, 31188, 26770, 21837, 20023, 19498, 18205, 21919, 20471, 18834, 20035, 24669, 23802, 15806, 10458, 12238, 11963, 6859, 11510, 13171, 11930, 13570, 10375, 11147, 15088, 15347, 14591, 16635, 22089, 19182, 22203, 22863, 18455, 15788, 11175, 2288, 8086, 11493, 6190, 9784, 16701, 16387, 20544, 21547, 17663, 14575, 18555, 19827, 18133, 12519, 7698, 6006, 8266, 12245, 12904, 10821, 12353, 13236, 14623, 19981, 18335, 14108, 11464, 17746, 13755, 8299, 7567, 7523, 11036]
13615A1036P38k354J974q18J559M365J575o50O0k074J054m303m427k940L525J312
13599I632m706j229K602N535M857J569M184K6q719m446K981K968P098K272k531
13584B2093n899q22N078k21K718j965k043l8p880m759N76M80K354R578Q348q152
13568A9446J319k763n698m840M731M574l968j971L795l707m294M500K768K876
13554A6768K448n129p290m256J047M534N869M734L156J005n529m114k473K100
13540A2870N928j525J13j894q741M662K954o17j381m225J087k988P91P585J43
13525A4762o755o372J024N30K531N069J871j005Q24M125M540N340n78m697n540
13510A5669n25R227n78n709J836m523l644L006K490k480l98J721L82j091j785
$$ y = [11036, 11774, 9420, 11394, 10576, 12135, 16500, 18075, 17425, 17485, 15411, 16465, 12162, 7735, 4795, 8320, 9632, 4926, 3697, 6299, 11834, 16691, 18260, 22444, 22470, 13751, 9305, 12286, 15254, 22352, 24624, 22093, 16194, 15372, 20450, 20229, 22947, 20982, 18939, 18901, 11021, 6262, 6838, 7318, 9672, 19250, 27598, 19446, 20765, 18002, 12304, 7464, 12195, 16769, 12801, 10830, 14625, 10918, 6624, 11124, 13892, 16768, 19216, 14087, 6797, 2541, 3588, 8122, 13991, 18725, 21881, 22886, 17357, 13243, 10770, 12870, 18798, 17273, 17386, 15492, 6751, 11413, 14367, 13750, 12369, 8144, 9231, 6243, 7034, 14619, 14762, 8007, 1635, 2659, 3189, 5720, 10789, 12660, 11655, 12479, 16604, 21144, 26484, 25906, 21209, 15669, 15144, 24371, 23793, 18084, 19920, 15397, 11753, 14759, 17249, 14769, 14371, 16092, 16474, 15383, 13598]
13495A3598j851N670M189N0m141j222j965m795m023l838N320J1647K375p040j116
13480A2858P024O540k983l001l561n060L784O36l801K138N402K233L504n218M46
13465B0941m369p490m430N906Q386j715j26o025q490K786M029L685Q076j929k864
13450A6371L691j821m379j867j211K758L75M124L41o847l558m283M180O454m917
13435I411j388K823K400M542o3k801o735k365P053J261R75K922j485J064J42Q37
13419A8593K607k231J179J040O7n744N49M572l918k956M214l350n627N10J724
13404A1229n89L177L513m44M334Q177k995q458m352O457O56R48j218m330j812
13389A4293J278K409K837l879l515Q441Q77n231k66m468l121m40k364L767L101
$$ y = [13598, 11747, 17417, 21606, 21656, 17515, 16293, 14328, 9533, 5510, 1672, 6992, 18639, 21014, 13974, 12858, 19882, 26422, 23439, 20438, 16877, 11817, 15601, 16237, 12436, 14574, 19976, 22209, 25713, 20495, 20941, 16572, 9082, 4652, 10558, 18944, 17229, 17103, 11078, 2588, 5374, 9403, 13088, 21164, 19235, 16371, 20062, 18241, 13862, 11995, 10784, 13542, 13917, 18041, 18382, 11535, 7977, 3694, 7874, 14328, 9411, 8023, 10846, 13246, 17788, 17725, 14924, 8189, 5824, 12877, 14138, 15113, 18035, 16550, 17614, 17756, 18593, 21200, 18969, 20148, 21188, 21255, 15511, 16060, 20632, 16714, 13758, 17972, 14622, 8995, 9505, 11229, 10640, 13817, 17330, 16886, 21220, 29397, 26402, 17944, 13592, 20049, 20705, 21653, 20435, 16105, 14293, 15571, 17980, 20817, 16938, 13423, 21864, 22741, 17510, 17244, 12776, 9655, 9215, 6851, 10618, 13719]
13374A3719M488L293J911n301p206l261r56M038P302K946J884k327o10j37L706
13359B3489Q10n616M15O08M93Q94l920J562M563j540n484R71J382J674M862O826
13343C1989L826J992L530J0547L469J07k791k902k086K265r33n575j66J050q093
13328C6229o078n125K45O751q58m952k8L249N01k121Q9k80K582M377k085n728
13312B6768k886o27p530J271O014N18m39k714L746N035M366J028K325l103p766
13297B6006J574O88l41j937j497q251J497M514J409m676o467J911O046k45N504
13282B5735R342J0288l851l871L102j835n126l019k886L424Q017k65p330k115
13268B9610R80j137J548R57K442L270J097J461j486p412n155p39O521O18K25O26
$$ y = [13719, 18207, 21500, 23411, 18110, 10904, 7643, 6687, 10725, 18027, 20973, 22857, 20530, 19920, 19783, 23489, 24299, 18683, 19098, 19706, 20199, 21093, 17173, 18735, 23298, 21758, 16274, 17245, 18627, 20301, 25163, 31989, 35815, 37807, 41337, 51884, 55353, 55460, 52669, 49767, 47681, 49946, 49013, 43438, 43272, 44322, 36229, 30151, 25026, 25271, 32022, 31164, 26212, 26184, 29433, 29934, 27813, 27902, 27622, 30204, 34581, 32496, 26768, 23882, 23255, 15725, 16996, 23010, 23528, 23089, 20375, 24121, 29156, 33522, 34550, 36875, 33772, 26006, 27580, 28268, 27927, 25990, 24493, 16242, 17739, 22253, 23662, 18986, 12519, 14430, 20476, 20231, 25735, 35077, 45365, 41514, 37643, 40745, 38910, 33784, 30765, 27879, 31303, 39320, 39055, 31725, 29610, 30590, 29453, 31001, 31958, 34400, 37670, 38767, 40228, 38742, 31330, 26175, 25436, 31957, 32575, 32800, 33426]
13252C3426j72J457K610N039O058k975J515Q540R275L687j865n334p42l354P5
13237E7240o76K130j59N83K391M911j9N499J0879Q368L352L047k1j5359j9344
13222F2822k4045k7104j0901J3088J5583J4695J6689J7691K2453J4852K0728K0788
13210A57339K9669M5017N4607P7250J07683J53692K10961K77857L28150L03346
13200A745571J52370m1113k30297l54808l27020k48729j76023j24608r0845n5676
13190B48822l9209l3511k5668k0773j1086j382q638j0632m289j744j335l905j938
13177H4712m155j3056l010O522J059n051o420j2120k28m956j688L73n7K503j690
13162D2738L371P689j112n644K668N350P98k185P522m871m445k743l803o95o263
$$ y = [33426, 33254, 34711, 37321, 42360, 48418, 45443, 46958, 55498, 64773, 68460, 66595, 61261, 60519, 57165, 57240, 56564, 58694, 58535, 59118, 61509, 66420, 66401, 71900, 82779, 91147, 94499, 97546, 97525, 82166, 62822, 38777, 11673, 772, 13860, 29443, 44138, 60827, 78518, 100971, 115823, 136551, 157339, 187008, 232025, 286632, 363882, 471565, 625257, 836218, 1114075, 1442225, 1745571, 1897941, 1856828, 1626531, 1271723, 944703, 695974, 519951, 395343, 304498, 248822, 209613, 176102, 150434, 129661, 118575, 117193, 108555, 97923, 93634, 91890, 90555, 86650, 84712, 80557, 67501, 64491, 71013, 72072, 67021, 60601, 48481, 48253, 43297, 41609, 41982, 41925, 44428, 42738, 46109, 53798, 52686, 47042, 49710, 55060, 55858, 53673, 61195, 56324, 51879, 49136, 45333, 44638, 38375]
13147C8375n249j360j414j893n044K450P21O212M155K870K13L582M284l349k192
13132D2361n588m264M056k254p542j232k440q36M033P310J714n854L235M379M463
13117D1541J71L191J664j453k001K819k324j431k642L536M67j0730q371m509K884
13102B2812K288J89l748n38O195l737n971L026Q500j673j198M350J085l18n93
13087C0669O707n054p96k657M443N814K746M986p31J863J791r18k421l810m634
13072C7998k970l543l126m241n063K784k852J129N46M349P856J3581P013K083
13058E5544Q0m35k346M158J2647J455m958r787j212N304J879j815K71M681J1687
13043G7153K927J2614J5224O825L765R365R904J4087J8773O483j287o179o299
$$ y = [38375, 33126, 31766, 30352, 28459, 23415, 25865, 26586, 32798, 36953, 39823, 40036, 43618, 47902, 44553, 42361, 36773, 32509, 36565, 34311, 26769, 25537, 23097, 22261, 26294, 33604, 35318, 29464, 32699, 37078, 41541, 41712, 44903, 46567, 45114, 43113, 45932, 43608, 42177, 39535, 43071, 43538, 32808, 24437, 19928, 22812, 25100, 25289, 21541, 21003, 27198, 23461, 17490, 20516, 29016, 27343, 26145, 30495, 31580, 31262, 30669, 37376, 32322, 31526, 28869, 33312, 39126, 41872, 46858, 46127, 47990, 49781, 48863, 46442, 42632, 37998, 35028, 31485, 28359, 24118, 19055, 21839, 18987, 20116, 20662, 25011, 32867, 46448, 53461, 55544, 55624, 55189, 52843, 57001, 69648, 71103, 66145, 56358, 55146, 60450, 62329, 60514, 60785, 65466, 77153, 80080, 92694, 107918, 114743, 118508, 127873, 137777, 151864, 170637, 177120, 175833, 169654, 163355]
13030A63355j768j059l956j802n027K831M684k912K64J149J1366J2389k685l226
13016A73603p879j2374j3113j8262j6087j2128m181m195p613j932M86k799J33
13003G3659L817n66J483n194l952k32K098k217L210L160M911K428J549Q269j327
12988I1096K602N154j836J159J984l309n528m255l779K4m606P04P796O213J09
12973I3528J54m00n143j850O694J0463Q937P9j1759n663q595r697r724p630q415
12958E0979o854r834N76O074J6224J7217J4594J4878R604K823N90M527l667m887
12944A12844p88r31j454L306R615J3698J0443J4522J4142J1943P539p5K12J679
12930A96695j066n697k019j154r387n625o150j0622j0039n495L329Q60r91O344
$$ y = [163355, 161587, 160528, 156572, 154770, 149743, 152574, 157258, 154346, 154610, 155759, 167125, 179514, 176829, 173603, 165724, 153350, 140237, 121975, 105888, 93760, 89579, 85384, 77771, 75839, 76325, 73526, 73659, 77476, 76910, 78393, 73199, 69247, 69015, 71113, 68896, 72106, 75266, 80177, 82605, 84154, 92423, 91096, 93698, 98852, 97016, 98175, 100159, 96850, 91322, 87067, 83288, 83312, 78706, 79410, 87206, 93419, 93528, 93682, 93282, 88139, 86289, 92983, 103446, 112383, 112462, 100703, 95040, 86445, 76748, 67024, 59394, 50979, 44125, 34291, 34867, 40941, 57165, 74382, 88976, 103854, 113458, 116281, 116871, 121398, 117731, 112844, 112056, 111125, 109671, 112977, 122592, 136290, 146733, 161255, 175397, 187340, 194879, 194804, 195016, 196695, 195629, 189932, 187913, 186759, 177372, 171747, 165597, 154975, 144936, 139441, 142770, 143630, 142639, 148983]
12916A48983J5063J3716J1618P024J0707J6553J8244J2222J2720O262m22n584
12904B67106N73m311K521K0351L0266N5047P7765Q3367Q2381N1737J2445j5900
12892F63348m5030m7250l4801l9004l4679m2943n6104m7329l2824j3823j1658
12881B57903j5581n694q94L92m697n411p013j725L397J2177P638K098l3J10N1
12866B42718K649L820L541R556J2449J0244J2408M881R175K1419K0935K3146J6089
12853C93030J7975J7082J2449K1107K6964K7016K3807K3173L5813M1081M7789
12842F87286N5542N6739N2178N0479O2115P4820P7922P6568O9977M1244K6875
12831A331745J3903k358l096Q007L7505O4277R2642P3248J9873l7008q2540r6954
$$ y = [148983, 164046, 177762, 189380, 196404, 207111, 223664, 241908, 254130, 266850, 273112, 272690, 267106, 267679, 263368, 265889, 286240, 316506, 371553, 449318, 532685, 615066, 666803, 679248, 663348, 618318, 571068, 536267, 497263, 462584, 419641, 363537, 316208, 283384, 269561, 257903, 242322, 236628, 235734, 236126, 231429, 226018, 219005, 217280, 220677, 232854, 240492, 242590, 242557, 242667, 242718, 245367, 249187, 252728, 262284, 274733, 284977, 297385, 302266, 311441, 332860, 353795, 376941, 393030, 411005, 428087, 440536, 461643, 488607, 515623, 539430, 562603, 598416, 639497, 687286, 742828, 799567, 851745, 902224, 964339, 1039159, 1117081, 1193649, 1263626, 1304870, 1331745, 1345648, 1343290, 1340194, 1348201, 1385706, 1449983, 1542625, 1615873, 1635746, 1598738, 1516198, 1419244]
12819A419244q2371n7089l5389k1370r527J428J3006K0224L2616M5213M8173N6140
12807A430298N4466N3542O1034O2211O9550P7795P2005P7906P5678P8291Q9221
12796B201997J14725J24999J37461J45453J54998J74054K02101K35891K58005
12787C749684K90781L46274M00616M65245N54808O59099P84750R41594J153367
12778I346218J419137J748196K124040K419377K688510L173312L962770N356465
12770C2238025P557239J0732727J5395050K2305819L1825489M3551443N6303901
12763B19909693O6201851N6747850K1244998j4793582m9979148p0138144o3237635
12756A65955883m5453151l0644700k0781832j4506991j0520720p890257o071447
$$ y = [1419244, 1336873, 1279784, 1244395, 1223025, 1213498, 1214926, 1227932, 1248156, 1280772, 1325985, 1374158, 1430298, 1484764, 1538306, 1599340, 1661551, 1731101, 1808896, 1880901, 1958807, 2034485, 2112776, 2201997, 2316722, 2441721, 2579182, 2724635, 2879633, 3053687, 3255788, 3491679, 3749684, 4040465, 4386739, 4787355, 5252600, 5807408, 6466507, 7251257, 8192851, 9346218, 10765355, 12513551, 14637591, 17056968, 19745478, 22918790, 26881560, 32238025, 39795264, 50527991, 65923041, 88228860, 120054349, 163605792, 219909693, 286111544, 342859394, 364104392, 349310810, 299331662, 229193518, 165955883, 120502732, 89858032, 69076200, 54569209, 44048489, 36158232, 30086785]
12749C0086785m721016l692209k926504k384005j979991j648555j408708j204041
12741A0121756j022616q67328p55317o65254n90593n25260m57735m12253l67057
12732D458343l38407l02062k67652k32763k00277j65851j37525j16905r0257p0954
12722B535690n0267l5774q356L2061L7252r5519k35695k42288j81769j20096p5727
12711A559512n7048n0925m4815m5384n9937o3068n1039n2878m0334l4497k6023
12700A033564j9656j4417j0653j4212j5347j5195k5691l3586k7886k3400k3382
12689H10139j6071j7395r735R64m731r692k6233k3268k0477j5297M64L013J784
12676F73465J685n713p546j1746j0621j0014j0265r874j0139j3919j3125j0806
$$ y = [30086785, 25365769, 21673560, 18747056, 16363051, 14383060, 12734505, 11325797, 10121756, 9099140, 8231812, 7476495, 6811241, 6220648, 5695388, 5237653, 4825400, 4458343, 4119936, 3817874, 3550222, 3317459, 3117182, 2951331, 2813806, 2696901, 2606644, 2535690, 2485423, 2449649, 2441293, 2473354, 2510606, 2415087, 2179392, 1937104, 1755335, 1635239, 1559512, 1502464, 1451539, 1406724, 1361340, 1301403, 1238335, 1187296, 1134418, 1094084, 1059587, 1033564, 1013908, 999491, 988838, 974626, 959279, 944084, 918393, 884807, 856921, 833521, 810139, 794068, 776673, 766938, 767902, 763171, 753479, 727246, 703978, 683501, 668204, 668668, 671681, 673465, 675150, 669437, 661891, 650145, 639524, 629510, 619245, 609371, 599232, 585313, 572188, 561382]
12664E61382r750j3154j9657j6272o625p648k023L988k805j37p506j0885j4466
12651D54442j7397o343L710J321r205n254P36K077n53K381L170Q28K504J346j0588
12636D23175l1112l3098k3468p359r538j7730l1110m2334m2339k1242J1120K8759
12624B03724L4568L4439K7269J1121Q24m612p339o572j1340j3621j0270l052j906
12611B53233j571k268n339k915M169O66M954J1440J066j23J613R85l141l708Q84
12596B59945j3K31O504l82l671l929m907j8350j9293l420n09j590j125J210n086
12581B05615N99N308k681J532r280p209k379j0264k679P344J0690J6772J4782
12568B28150J1788J2575J5991j549l633l544o122j2341l559n604k833n180Q521
$$ y = [561382, 551632, 538478, 518821, 502549, 495924, 488276, 486253, 490241, 487436, 487299, 479793, 468908, 454442, 437045, 430702, 434412, 435733, 426528, 421274, 422010, 424087, 423534, 425915, 429085, 429913, 432417, 433763, 423175, 392063, 358965, 335497, 328138, 318600, 300870, 269760, 227426, 185087, 163845, 174965, 203724, 238292, 272731, 300000, 311121, 311945, 307333, 299994, 293422, 282082, 268461, 258191, 255139, 253233, 251662, 249394, 244055, 241140, 245309, 245975, 250929, 262369, 263435, 263312, 264925, 265910, 262769, 259061, 259945, 259932, 260163, 266667, 266285, 262614, 258685, 253778, 235428, 216135, 212715, 212206, 210616, 209491, 210701, 205615, 206214, 211522, 208841, 210373, 201093, 193884, 191505, 181241, 178562, 185906, 196596, 213368, 228150, 239938, 252513, 268504, 266955, 263322, 259778, 253656, 241315, 237756, 232152, 229319, 224139, 232660]
12555B32660J6985K1257K6567L2148L0189K1441J6245Q352j752m642r447j3886
12543C76117j7217j6706j8724j9093j5124k2199k0038j5789j1277k650L860o470
12531B14690m728P930N613Q936J5175M526M88l834j838j739l516N164J700M632
12517B53199N659K941j120Q631J1335P352L895K911J0074N140M36l341j963l419
12503C01730r7J694J894q66N405O330J0848J4664J8004J6604J6130J4607J5736
12490D22683R358J5786J2579J3078J9803K0905K7783L9788L5596M0565M2024L1425
12478G31373K0222Q897L593m571n952k956j892k280M285J8836J7219K4832K2037
12465H33643K3764K2477K9965M2738M7272M8312N0247N0902O2217N1099N0965
$$ y = [232660, 249645, 270902, 297469, 329617, 359806, 381247, 397492, 405844, 404092, 399450, 390003, 376117, 358900, 342194, 323470, 304377, 289253, 267054, 247016, 231227, 219950, 217300, 221160, 214690, 209962, 217892, 223505, 232441, 247616, 252142, 252630, 248796, 246958, 245219, 241703, 246867, 248567, 253199, 258858, 261799, 260679, 269310, 280645, 287997, 291892, 294803, 304877, 310017, 310453, 307112, 305149, 301730, 301633, 303327, 305221, 304355, 309760, 316090, 326938, 341602, 359606, 376210, 392340, 406947, 422683, 432041, 447827, 460406, 473484, 493287, 514192, 541975, 581763, 617359, 657924, 699948, 731373, 751595, 760492, 764085, 759514, 753562, 750606, 748714, 746434, 750719, 769555, 786774, 811606, 833643, 857407, 879884, 909849, 952587, 999859, 1048171, 1098418, 1149320, 1211537, 1262636, 1313601]
12454A313601O3271O7284P6968R4186J00095J05346J12942J25029J41737J62813
12444B363272J84421K03629K40853K78555L29491L91081M60170N58083O63705
12435E673260P86751R01666J023510J169305J338122J538232J826631K250502
12427A6507979K881430L821314N148835O933927R098211J1398986J3387155J4580239
12419H3758076J4663647J3568773J1320520P981072L710001j079629n707366r545431
12411A18669663j2258575j3821595j4276089j3693968j2212422j0154085p948898
12404C4304031o004721m488806l394446k637082k117658j771557j533641j360086
12396A0996034j219183j094665r75075q63166p44201o39110n53357m66377l90830
$$ y = [1313601, 1376872, 1444156, 1521124, 1615310, 1715405, 1820751, 1933693, 2058722, 2200459, 2363272, 2547693, 2751322, 2992175, 3270730, 3600221, 3991302, 4451472, 5009555, 5673260, 6460011, 7361677, 8385187, 9554492, 10892614, 12430846, 14257477, 16507979, 19389409, 23210723, 28359558, 35293485, 44391696, 55790682, 69177837, 83758076, 98421723, 111990496, 123311016, 131292088, 135002089, 133922460, 128215094, 118669663, 106411088, 92589493, 78313404, 64619436, 52407014, 42252929, 34304031, 28299310, 23810504, 20416058, 17778976, 15661318, 13889761, 12356120, 10996034, 9776851, 8682186, 7707111, 6843945, 6099744, 5460634, 4907277, 4440900, 4050070]
12387D050070l39549k94076k57430k29132k00019j71927j54539j39645j19674
12378B144079j17528j09623r3858p9901q0822q0930p1755o6785o8268n8729n9722
12367A256158n3120m3488m3848l8009m1856m1731k6996k5868j9685k5646k3601
12356H72310k3455k2599k0189j8379j7043j9419j6206p074o498j3212k3678j1559
12344F72999j0970r473k548n291o108k009J033j123Q416Q241M277J1678J1748
12331F80870Q164J2077J7751J8944K0729K8791L4490M4354O8589R1270J33472
12320A159501J93780K54503L20370L65648L11679J38397m4167k22030k88317k33213
12310A956151j39181n3536J0984O3580R8898J23720J60113J69863J69338J59436
$$ y = [4050070, 3710521, 3416445, 3159015, 2929883, 2729864, 2557937, 2403398, 2263753, 2144079, 2026551, 1916928, 1823070, 1743169, 1662347, 1581417, 1509662, 1442877, 1374609, 1315880, 1256158, 1203038, 1159550, 1115702, 1077693, 1035837, 994106, 967110, 941242, 921557, 895911, 872310, 848855, 826256, 806067, 787688, 770645, 751226, 735020, 727946, 721448, 708236, 684558, 672999, 662029, 652556, 650008, 644717, 638609, 636600, 637633, 636510, 644926, 653167, 657444, 669122, 680870, 689034, 701111, 718862, 737806, 758535, 787326, 821816, 866170, 934759, 1026029, 1159501, 1353281, 1607784, 1928154, 2293802, 2605481, 2743878, 2699711, 2477681, 2189364, 1956151, 1816970, 1763434, 1774418, 1837998, 1936896, 2060616, 2220729, 2390592, 2559930, 2719366]
12300B719366J44008J10336Q4978L8814m989n5368r2517j31416j75652j92985
12290B444575k02310k05228j92112j76814j64415j52476j36364j21474j06650
12281I86732q9193o5521n0706m7902m2395l0627k6960k9472k9497k8740k3657
12270E22062k5911k7851k9678j9217j4195j3318j0700j0876r108j0962r571k829
12258C37846m095k300n169r467r749j9328j5892j593l693j2680o449p36j553n323
12244B39819p394J604m121l736p55m948K113N52l161j090j365m527p193o937l973
12229A94888N592L72J976k102m895l710O204M152M513M575J872K260j945R68l045
12214B11675p857j1495l742L612l96r059L699M643J0154K977M362R009Q208N341
$$ y = [2719366, 2863374, 2973710, 3058688, 3097502, 3092513, 3037145, 2944628, 2813212, 2637560, 2444575, 2242265, 2037037, 1844925, 1668111, 1503696, 1351220, 1214856, 1093382, 986732, 897539, 832018, 781312, 733410, 691015, 660388, 633428, 603956, 574459, 545719, 522062, 496151, 468300, 438622, 419405, 405210, 391892, 381192, 370316, 361208, 350246, 340675, 337846, 333751, 331451, 326282, 316815, 307066, 287738, 271846, 270253, 266560, 253880, 247431, 246695, 245142, 239819, 232425, 234029, 229908, 226172, 225417, 220469, 222582, 223134, 219973, 218883, 217518, 212991, 205798, 198861, 194888, 200480, 200852, 202828, 200726, 195831, 192121, 198325, 202477, 206990, 211565, 213437, 215697, 213752, 214720, 211675, 203818, 192323, 188581, 192193, 191797, 182738, 186437, 191080, 201234, 204211, 208573, 217582, 225790, 231131]
12200B31131J1931J5397K1958J4604J5439R349J1039M008q239j6706j0045r074
12188B90792k871R41O590J2138J6674J1602P215K3180K6218J9662K7996L3100
12176D73237L5742L6547L6197K6333K4523J6432L229q193k2745k2951k8832l8791
12164E30728m4485m1227l4047k8384k5687k7109j7474j3046j7681j7534j8360
12153B45694j4151m301R21J533J964L679qK707N049J470O647P358K274J700O442
12138B68978M661K362m971j3520o498q165j5103j0089k122p779j0624k163L728
12125A98695q95J663J0258J5009J6234J3447J3274J8561K3520J8985K3046J9605
12113C71402J7552J1376Q265K23n756k2096j8389k5663l3383k8130k2369j7679
$$ y = [231131, 243062, 258459, 280417, 295021, 310460, 319809, 330848, 334856, 326617, 309911, 299866, 290792, 287921, 288862, 295452, 307590, 324264, 335866, 343081, 366261, 392479, 412141, 440137, 473237, 508979, 545526, 581723, 608056, 632579, 649011, 652240, 644047, 621302, 598351, 569519, 530728, 486243, 445016, 410969, 382585, 356898, 329789, 312315, 299269, 281588, 264054, 245694, 231543, 227242, 228163, 229696, 231660, 235339, 235331, 238038, 243087, 244557, 251204, 258562, 260836, 262536, 268978, 273639, 276001, 271030, 257510, 251012, 242847, 227744, 217655, 215533, 207754, 197130, 194967, 198695, 197800, 199463, 209721, 224730, 240964, 254411, 267685, 286246, 309766, 328751, 351797, 371402, 388954, 400330, 408595, 408818, 403062, 380966, 362577, 336914, 303531, 275401, 253032, 235353]
12101B35353j1607k0261j3347j1089r131p505n643j495M942k840k655o109n90
12088A48023L376Q1j3389m356N786j902l662k315p697M439O968O861M877l851
12074A43239m994p826N450K735k140j965k093j508K958M407K398M439J396J741
12060A48237L044K944N486Q341J2834J4708N205Q634O783k092J180M36m324p312
12046B04104j3210j0747j1455j3729j3280j434J866m111j441l334q65k886p76
12033A28702o041l714L124M523K835J871K237r371j425J269J426P26Q877P169
12019A42208p81o352m107J183J232O539Q358N331L884Q652O302P642P120P250
12005A94461K508J8005K0631K5619L1037L5713M6147N3621O7015P2674O6684N8771
$$ y = [235353, 223746, 203485, 190138, 179049, 169918, 162413, 156770, 155275, 160217, 157377, 154722, 148613, 148023, 151399, 151480, 138091, 133735, 139521, 137619, 133957, 131642, 123945, 128384, 135352, 142213, 147090, 143239, 138245, 130419, 135869, 138604, 136464, 134499, 132406, 130898, 133856, 138263, 140661, 145100, 146496, 148237, 151281, 154225, 159711, 168052, 180886, 195594, 200799, 209433, 216216, 214124, 215304, 215740, 211416, 204104, 190894, 180147, 168692, 154963, 141683, 140249, 142115, 138004, 136563, 133229, 132364, 129478, 128702, 122661, 118947, 122071, 126594, 129429, 131300, 133537, 124166, 122741, 124010, 125436, 126162, 135039, 142208, 141427, 135075, 130968, 132151, 133383, 139922, 148280, 153611, 157495, 166147, 172449, 180091, 187211, 194461, 196969, 214974, 235605, 261224, 292261, 327974, 374121, 427742, 494757, 567431, 634115, 692886]
11993F92886N4843L3399J4518K218k1314l8971m9207m9197n0173n2017l8433l0210
11981D68342k3643j5224n480k98J1528J4783K4217M1372O1508P9788J13495J44274
11969I14662J80808K20245K40329K46519K38368K08965J57243Q4812N447p8560
11959B418838j52066k07797k48016k57042k36436k13973j84560j57141j20045
11950F41762r1733o9481n4610m4285k6877l4604k7953k0934k4056k1510j6631
11939B09088p682j0279j2243m644p01o615r478q770m221L58J313J452m57o989
11925A40132J355O39J823n173J482J080M103n188p599m345j595l328m296J177
11911A20267m717O693N115n47K643q046k861R630L171m327l192j312Q89L730l6
$$ y = [692886, 747729, 781128, 795646, 797864, 776550, 737579, 688372, 639175, 589002, 536985, 498552, 468342, 444699, 429475, 423995, 423697, 435225, 450008, 474225, 515597, 577105, 656893, 770388, 914662, 1095470, 1315715, 1556044, 1802563, 2040931, 2249896, 2407139, 2491951, 2497398, 2418838, 2266772, 2058975, 1810959, 1553917, 1317481, 1103508, 918948, 761807, 641762, 550029, 480548, 425938, 381653, 354776, 320172, 292219, 271285, 247229, 225719, 209088, 201406, 191127, 178884, 174240, 173539, 166924, 157446, 148676, 144455, 144813, 146126, 147578, 147121, 140132, 141487, 142126, 143949, 138776, 140258, 141338, 145441, 140253, 132654, 128309, 126714, 123386, 119090, 120267, 115550, 122243, 127358, 126811, 129454, 121408, 118547, 128177, 131348, 127021, 123829, 122517, 123406, 127136, 127100]
11896A27100j69k909l26k189k37K874P243L22m69J724L899k283j197J614J688
11881A36685l563m389J39k80M53k671K179P502K115k363M257N513K224n09M00
11866A47692L46M873N194N368L964O450P597l243Q27k374J307Q004j07p469m26
11851A78003n424l565k096l409n580m74N003J250k701l219j277k164n041L098
11837A52404j375k690M051K976j078K361J753k141m811L070Q919K82j211R127
11823A71637J257K005K552K150L009L078K244k55p774q026l097j440M780K853
11809A74973n723o594j741J993n751k202q90l95K08J025k882l006J156Q38l116
11794A47893L465O440N417m417k58m110K417l018q426N384L146k622M006J563
$$ y = [127100, 126931, 124022, 123696, 121507, 121270, 124144, 131387, 131709, 131240, 132964, 136863, 134580, 133383, 134997, 136685, 133122, 128733, 128872, 128592, 129045, 126374, 128553, 136055, 138170, 135807, 140064, 145577, 147801, 147292, 147692, 148038, 152911, 158105, 163473, 167437, 173887, 181484, 178241, 179068, 176694, 178001, 186005, 185898, 178429, 178003, 172579, 169014, 166918, 163509, 157929, 157455, 162458, 163708, 161007, 157788, 156511, 154347, 149306, 152404, 151029, 148339, 152390, 155366, 154288, 156649, 158402, 156261, 151450, 154520, 163439, 163721, 162510, 171637, 172894, 174899, 177451, 179601, 182610, 185688, 187932, 187677, 179903, 171877, 168780, 167340, 172120, 174973, 169250, 162656, 160915, 162908, 157157, 154955, 154065, 153670, 153878, 154903, 152021, 149015, 150171, 151009, 147893, 151358, 157798, 163215, 158798, 158540, 154430, 156847, 153829, 145403, 150787, 153933, 151311, 155317, 156880]
11780A56880L53K98q07k661J1300L622q196l207J381j660M117N574o163m091L769
11765A60509K550j546R77R74k175l132J803j92n71L016R561P104l144k200k669
11750A70865K107J365K133K39l289L265J906J24o04j195n75Q13l40m753m319L554
11734A71296N539R80M888J703P341L089l705q594m555J427m846j0964n83J0786
11720A73802O632K596L98M980n230j343l948J078O377L133N079M191J161k985
11706A95921l844M232N879O102m89p283o939N852K953M63K14l170K834O730K043
11691B11498m836K140J0431m637r61P526J455o117k975K439L482K459O750J081
11677B29735l745K330L657J676k049l357J374j09J034J378k33K834n23p413k864
$$ y = [156880, 157233, 157531, 156724, 154063, 165363, 168985, 160789, 157582, 158963, 157303, 161420, 166994, 160831, 156740, 160509, 163059, 161513, 162490, 163464, 161289, 158157, 159960, 159768, 159197, 162213, 171774, 178878, 175734, 173534, 170865, 172972, 174337, 176470, 176709, 173420, 176685, 178591, 178715, 178111, 176916, 176341, 177154, 176814, 172061, 167742, 171296, 176835, 177815, 182703, 184406, 191747, 194836, 191131, 182537, 177982, 179409, 174563, 163599, 163016, 173802, 180434, 183030, 183428, 188408, 183178, 181835, 177887, 178965, 185342, 188475, 193554, 197745, 198906, 195921, 192077, 196309, 202188, 208290, 207801, 200518, 193579, 199431, 202384, 202847, 203061, 199891, 202725, 209455, 211498, 206662, 208802, 219233, 214596, 213635, 221161, 222616, 216499, 213524, 215963, 219445, 221904, 228654, 229735, 225990, 228320, 231977, 233653, 231604, 228247, 229621, 229512, 230546, 231924, 231691, 234525, 234002, 226589, 223725]
11662B23725J413L084J700L468K940K838Q216N451p591n049k464K181J877k515
11648B39274J946K686K707m597M913J484j867J175q49K159n7K833k817m025J924
11633B46889J227P806R248J935l274n580L664M464J372J74J649R674Q298Q38k744
11618B85640K527j427m375k910K846j403N330R480N018N240M930L505n542n489
11604C03370R52k072p61M648O423l974P14n245n129K849L178L476M553M720k944
11589C14758l37K087n411l298R126n007n91J719K194J972l339J885M315N549J012
11574C26634J725K570K143M12L781P266M657j961J851J349Q3M353K586M864k371
11559C59942l327j650J793K937M035N954J1963L263J925R13j355J491j630N197
$$ y = [223725, 225138, 228222, 229922, 233390, 236330, 239168, 247384, 252835, 245244, 240195, 237731, 239912, 241789, 239274, 241220, 243906, 246613, 242016, 246929, 248413, 246546, 247721, 246872, 249031, 248974, 251807, 248990, 244965, 246889, 248116, 255922, 265170, 267105, 263831, 258251, 261915, 266379, 267751, 267925, 269574, 279248, 287546, 288384, 285640, 288167, 286740, 282365, 279455, 282301, 280898, 286228, 295708, 300726, 305966, 310896, 314401, 308859, 303370, 304322, 302250, 301489, 306137, 312560, 308586, 309300, 304055, 298926, 301775, 304953, 308429, 312982, 317702, 314758, 314421, 316508, 311097, 307799, 316925, 311918, 311327, 313046, 315240, 317212, 313873, 315758, 320073, 325622, 326634, 328359, 330929, 333072, 333484, 337265, 344531, 349188, 347227, 349078, 350427, 350510, 354863, 357449, 362313, 359942, 356615, 354965, 356758, 359695, 363730, 369684, 381647, 384910, 386835, 387748, 386393, 387884, 386254, 391451]
11545C91451N420P453J955M088P06L127K703J475M18N946L592R66l926k457l20
11530D22597l46N905J1753J590J78l59p913j761O234J1747M466P85Q481K527N040
11515D70924K11n172o818K808M798J0404K395m741R22K503M089O814P392J592
11501D98121K820L095L281M989k753k274K326K666K425O648P215P119P023J013
11487E43714m407Q757k639m953L099P435N915O722L849K225N568M896m457K871
11473E78595P146M452J783M295M436P074O56q84J274K874Q238O238Q310Q386L67
11458F43240M23J0018O998M74j324N545M830K767O126P600P838K498k786K198
11444F96445J0981J4275R893P701J306J107L19L742M797N598J3910J1429M21Q532
$$ y = [391451, 396871, 404324, 406279, 410367, 411073, 414200, 416903, 418378, 418796, 424742, 428334, 429300, 425374, 422917, 422597, 422251, 428156, 439909, 441499, 441677, 441318, 433405, 431644, 437878, 449625, 454091, 454876, 463357, 465884, 470924, 471135, 465963, 459145, 461953, 466751, 477155, 479550, 474809, 475731, 478234, 482323, 489137, 496529, 498121, 500941, 504036, 507317, 512306, 509553, 507279, 509605, 512271, 514696, 521344, 528559, 535678, 542701, 543714, 539307, 548064, 545425, 540472, 543571, 551006, 556921, 563643, 567492, 569717, 575285, 580181, 575724, 578595, 585741, 590193, 591976, 596271, 600707, 607781, 608437, 607553, 608827, 611701, 619939, 626177, 634487, 642873, 643240, 643663, 653681, 660679, 661153, 659829, 665374, 670204, 672971, 679097, 686697, 694535, 697033, 694247, 696445, 707426, 721701, 731594, 739295, 740601, 741708, 742027, 745769, 750566, 756164, 770074, 781503, 781924, 790456]
11430G90456L176J974l391P672J2357J2540Q117n48N790J3051R194k982O977J3885
11416H78268R556N789R136O439M024J0589J2805R449P399P098P209O899J4541
11403I89201J0186P492J0685J2206J0962O084M569M924J1187J6132J2043J1660
11391A107331J2774K0037J4586J5040J8392J7105J9078J6574J5912K8494K5461
11380A310784J9793K5239K8766K8326K2529L0190M4758M2179N0389M9584N6485
11369A709022P2253Q9903R3979R7085J11740J23039J33672J36919J25814J11105
11359B804531P9758L6811q363n2103q1425r6663j04446j05923j01206r1289p3488
11348B206194n5310n4909m6707l7561k6475k8360r695p798j3397p460m662l900
$$ y = [790456, 793632, 795606, 792215, 799887, 812244, 824784, 832901, 832353, 838143, 851194, 860388, 857406, 864383, 878268, 887824, 893613, 902749, 909188, 913212, 923801, 936606, 946055, 953454, 960552, 967761, 974660, 989201, 999387, 1006879, 1017564, 1029770, 1040732, 1046816, 1051385, 1056309, 1067496, 1083628, 1095671, 1107331, 1120105, 1140142, 1154728, 1169768, 1188160, 1205265, 1224343, 1240917, 1256829, 1285323, 1310784, 1330577, 1355816, 1384582, 1412908, 1435437, 1465627, 1510385, 1552564, 1602953, 1652537, 1709022, 1781275, 1871178, 1965157, 2062242, 2173982, 2297021, 2430693, 2567612, 2693426, 2804531, 2884289, 2921100, 2912737, 2860634, 2779209, 2682546, 2578100, 2472177, 2370971, 2279682, 2206194, 2150884, 2095975, 2049268, 2011707, 1985232, 1956872, 1947177, 1939379, 1925982, 1918522, 1913860, 1909960]
11336A909960j2169n601J887J0329Q390R380R596J2170Q998Q964J4384J2740J2050
11323B001078Q616J0355J6466J3774K3233J7098P360J9132J7373J8267J4587J4382
11311B181721J4067J8034K8122K5245K5493J8826J9068K3357J7953K3210K4611
11300B419707K0084K2337K3382K2690K1506K6672K7814K5223J9174K8111K8726
11289B685426K6320K7728K4045J5492K1468K5849K9930K9732K8125K6588K5199
11278B965902K9710K7788K9384L2658L2287K9812K5835J9676K7758K8356L2043
11267C281209K5339K9869L4776L5725K7706K3955K7377L1693K5046K3613K8839
11256C595147L2278L4011K8599K7503K7414L3623L1263L1854L1506K5130K2420
$$ y = [1909960, 1897791, 1892190, 1894077, 1904406, 1912796, 1922176, 1931772, 1943942, 1952940, 1961904, 1976288, 1989028, 2001078, 2009694, 2020049, 2036515, 2050289, 2073522, 2090620, 2097980, 2117112, 2134485, 2152752, 2167339, 2181721, 2195788, 2213822, 2241944, 2267189, 2292682, 2311508, 2330576, 2353933, 2371886, 2395096, 2419707, 2439791, 2462128, 2485510, 2508200, 2529706, 2556378, 2584192, 2609415, 2628589, 2656700, 2685426, 2711746, 2739474, 2763519, 2779011, 2800479, 2826328, 2856258, 2885990, 2914115, 2940703, 2965902, 2995612, 3023400, 3052784, 3085442, 3117729, 3147541, 3173376, 3193052, 3220810, 3249166, 3281209, 3306548, 3336417, 3371193, 3406918, 3434624, 3458579, 3485956, 3517649, 3542695, 3566308, 3595147, 3627425, 3661436, 3690035, 3717538, 3744952, 3778575, 3809838, 3841692, 3873198, 3898328, 3920748]
11245C920748K6877K7494K0906K4884K8095K3595K3608K4690L1004K9302J8797
11234D200000K4648K6890K4355J6974J8677K2546K4202K2479J5611J3837O621
11223D416840J2401J8046K1260J9563K0344J9951J2531J1138J1659K655O532P493
11211D580413J0652J0804L098l652N671M769M656Q041p85K279o141r474J930m355
11197D607906q617r43n586o117r257j6416q259q803j8865j6088j0181j1140p519
11184D480115j7860j8353j9072k1557j8954j9900j7793j2390j8101k1154j7223
11173D277758j8506k5602k6237k9929k9617l0303k5693k4100k1747k5759k0821
11162C999444j8712k1083k8963k5162k6694k9059l4103l1175k7139k8066k4364
$$ y = [3920748, 3947625, 3975119, 3996025, 4020909, 4049004, 4072599, 4096207, 4120897, 4151901, 4181203, 4200000, 4224648, 4251538, 4275893, 4292867, 4311544, 4334090, 4358292, 4380771, 4396382, 4410219, 4416840, 4429241, 4447287, 4468547, 4488110, 4508454, 4528405, 4540936, 4552074, 4563733, 4566388, 4572920, 4580413, 4591065, 4601869, 4604967, 4601315, 4606986, 4611755, 4616411, 4624452, 4623667, 4625946, 4619805, 4610331, 4612261, 4607906, 4599289, 4598346, 4592760, 4586643, 4577386, 4560970, 4552711, 4543908, 4525043, 4508955, 4498774, 4487634, 4480115, 4462255, 4443902, 4424830, 4403273, 4384319, 4364419, 4346626, 4334236, 4316135, 4294981, 4277758, 4259252, 4233650, 4207413, 4177484, 4147867, 4117564, 4091871, 4067771, 4046024, 4020265, 3999444, 3980732, 3959649, 3930686, 3905524, 3878830, 3849771, 3815668, 3784493, 3757354, 3729288, 3704924]
11151C704924k2885k7459k7013k7462k0792k3864l2009l8151l7539l1571l1685
11140C384494l1566l6110l0541k4432l9873m0604k2690k4477k5923k5807k9196
11129C053275l2864k7353k8620k2336j7774k3511k2964k0776j9593j9885j2686
11118B804913j2954j4511l0898m1858m2846l1587k8026l0908k6374l2226l4012
11107B478713l0554k1460k7396k1463j9860l1610k9686j5536j9054k2224j5728
11096B224142k2899k1716k2522j8103k3316j3489j1243j6887r953p988j5497j6340
11084B024189k4785j8622j9375k2374j5144j5559k0113j8782k2112k3469k1546
11073A802308k0675k2547k1370k0294j7883j4423j9639j1961j5506r879j0241
$$ y = [3704924, 3682039, 3654580, 3627567, 3600105, 3579313, 3555449, 3523440, 3485289, 3447750, 3416179, 3384494, 3352928, 3316818, 3286277, 3261845, 3221972, 3181368, 3158678, 3134201, 3108278, 3082471, 3053275, 3020411, 2993058, 2964438, 2942102, 2924328, 2900817, 2877853, 2857077, 2837484, 2817599, 2804913, 2791959, 2777448, 2746550, 2704692, 2661846, 2630259, 2602233, 2571325, 2544951, 2512725, 2478713, 2448159, 2426699, 2399303, 2377840, 2357980, 2326370, 2296684, 2281148, 2262094, 2239870, 2224142, 2201243, 2179527, 2157005, 2138902, 2115586, 2102097, 2090854, 2073967, 2064014, 2056026, 2040529, 2024189, 1999404, 1980782, 1961407, 1939033, 1923889, 1908330, 1888217, 1869435, 1847323, 1823854, 1802308, 1781633, 1759086, 1737716, 1717422, 1699539, 1685116, 1665477, 1653516, 1638010, 1628131, 1617890]
11062A617890p173r216o331q04l990q155j5502k0556k3976k1247j9746j8367k0724
11049A442103j8739r995j1834j2669j0297o956j2965j4065j3875j1514j0198j4142
11037A294854j0656o425o297j0564p354p437j2913j1985j3461j7158r813n372
11025A175419n264j3949j2469J072q92p569j0600j7755k0499j8354j3573p910
11013A047657n760q624m791M038j744j0987j8620j1553n343j2626j6818j5511
11001I39318n177j671j394m716j0679j0837j549m314j2707p323m221m197q285
10988H62248n918n923n139p424r067j1255m666n760p206q444m837n819r992j2336
10974G58462p062j456Q33n392m712J437q485m379n592l978j788j4137j3221n027
$$ y = [1617890, 1610717, 1601501, 1595170, 1594366, 1590376, 1582221, 1566719, 1546163, 1522187, 1500940, 1481194, 1462827, 1442103, 1423364, 1413369, 1401535, 1388866, 1378569, 1371613, 1358648, 1344583, 1330708, 1319194, 1308996, 1294854, 1284198, 1277773, 1271476, 1260912, 1253558, 1246121, 1233208, 1221223, 1207762, 1190604, 1180791, 1175419, 1170155, 1156206, 1143737, 1144809, 1143917, 1136348, 1125748, 1107993, 1087494, 1069140, 1055567, 1047657, 1041897, 1033273, 1028482, 1032520, 1030776, 1019789, 1001169, 989616, 984273, 971647, 954829, 939318, 934141, 932470, 931076, 926360, 915681, 904844, 903295, 898981, 886274, 878951, 874730, 870533, 862248, 856330, 850407, 845268, 837844, 828777, 817522, 812856, 807096, 799890, 791446, 786609, 780790, 770798, 758462, 751400, 749944, 750777, 745385, 740673, 742110, 733625, 729246, 723654, 719676, 717888, 703751, 690530, 685503]
10960F85503m478n2k037n847q942r169J500j208q761l326J256o01J352p118q305
10945F29767l810n145o609o848k158o632q170L54o119l337n206o658L922O79p794
10930E66236r161q775m555j05J528k175q09j043j925K791r80o005m836m082k347
10915E23757q176o797p043j90L287l549n389j1409o930L511L657J967j130p617
10901D77949n830m577J701J776n628p925o673j136n022k120J459j417p220Q03
10887D36140J188j0198p289o567J932Q008J860j1389j3127m080N633P382N375
10874D14868M34k619m517n343m251p678N769L382l684p284m155K648L443l963
10860C87050l670p987j0007m18J1059j306q807j93K656m229o898l508N206p334
$$ y = [685503, 681025, 680973, 678936, 673089, 664147, 654978, 656478, 655270, 646509, 643183, 644439, 643838, 645190, 638072, 629767, 625957, 620812, 614203, 607355, 605197, 598565, 590395, 590749, 584630, 581293, 576087, 569429, 573351, 574030, 566236, 557075, 548300, 543745, 543640, 545168, 542993, 542184, 541141, 539216, 542007, 541027, 535022, 530186, 526104, 523757, 515581, 508784, 501741, 501551, 504838, 501289, 495900, 484491, 477561, 481072, 484729, 486696, 485566, 477949, 472119, 467542, 469243, 471019, 465391, 457466, 450793, 449657, 444635, 442515, 443974, 442557, 435337, 436140, 437328, 427130, 419841, 413274, 415206, 423214, 425074, 413685, 400558, 396478, 402111, 409493, 414868, 415302, 412683, 408166, 402823, 398572, 390894, 396663, 400045, 396361, 389077, 384922, 387570, 391013, 387050, 383380, 375393, 365386, 364968, 376027, 374721, 365914, 365721, 368377, 364148, 357250, 353742, 358948, 351614]
10846C51614J258k228n528M72k419m039l540l299j197k491n119J240L153m640
10832C23237o393j277M84m829K318n807l443n187k190K002M655j075N849j140
10818C07204k983m541J927q96P43j19l080j474n082J307o455j1790j048M335M23
10803B78471m972l70R74K289j780m74q6Q680R717n013q808K252P93l080n329K828
10787B76092j953k440J524k528q018l869j581K58Q124J400m946l592m725n826
10773B47920m565M223R46J256k669j423J128J249o789o428l983j342L59N937N966
10758B41785q21l378L510L378L22J60J30K095p84k526l606J302k384q90m103k042
10742B32148K834M337l69k704n087p449l596p49J939J660o72k854L291Q542N47
$$ y = [351614, 352872, 350644, 345116, 345588, 343169, 339130, 335590, 332291, 331094, 328603, 323484, 324724, 327877, 323237, 316844, 315567, 316051, 311222, 313540, 307733, 304290, 299103, 296913, 298915, 303570, 302495, 308344, 307204, 304221, 299680, 301607, 300711, 301454, 301335, 298255, 296781, 291699, 293006, 286551, 274761, 273713, 278048, 278471, 273499, 273129, 274103, 276392, 274612, 274138, 274052, 282732, 292449, 287436, 278628, 280880, 281673, 278593, 273264, 276092, 274139, 271699, 273223, 270695, 262677, 258808, 257227, 257485, 265609, 267009, 262063, 258471, 253746, 247920, 243355, 247578, 248524, 249780, 247111, 245688, 246816, 248065, 241276, 234848, 230865, 229523, 229882, 235819, 241785, 240964, 237586, 241096, 244474, 244796, 244956, 245086, 247181, 246397, 243871, 240265, 241567, 239183, 238293, 234190, 232148, 234982, 239319, 238950, 236246, 231159, 223710, 220114, 219365, 221304, 222964, 222292, 219438, 222729, 231271, 231818]
10727B31818K346P096l196o671J595M031j598n601o11ml98M675j13k521J380M730
10711B36958N069l494j322M282Q987N161j682k73l080j484q416k3653l2667j8818
10697A65568j0406k182Q004N415K3n218M148J1115N696j809r35R56R089R763O777
10682B06004R991l259m500L471N676K679j79k87r84l084M111N656N373O058J1668
10667B48394J4832R275J8687L4389M8345O4968R3050J38162J99003K67434L38319
10656A474858L65830K41402p0162l35472l84651l04749k09624j45985j07226p5061
10646D49160n1090k4765k5556k2295j3437o763o490r961q749J013L708O986K567
10633B94328P897J0490J1107K534O113Q477P758K3105K9226M4900N6401P2450
$$ y = [231818, 234164, 241260, 238064, 231393, 232988, 237019, 235421, 229820, 229209, 229205, 228807, 233482, 233369, 230848, 232228, 236958, 242027, 238533, 237211, 241493, 250480, 255641, 253959, 253686, 250606, 249122, 240706, 217053, 184386, 165568, 155162, 152980, 160984, 166399, 166422, 161204, 165352, 176467, 182163, 180354, 179419, 180375, 189464, 199227, 206004, 215995, 212736, 208236, 211707, 217383, 220062, 219883, 219596, 218612, 215528, 219639, 225295, 230668, 236726, 248394, 263226, 272501, 291188, 325577, 373922, 438890, 531940, 670102, 869105, 1136539, 1474858, 1840688, 2082090, 2011928, 1676456, 1291805, 987056, 777432, 631447, 524221, 449160, 398070, 373305, 347749, 325454, 312017, 305254, 298764, 288803, 280054, 281067, 284775, 291761, 294328, 302225, 312715, 323822, 326356, 332469, 340946, 348704, 371809, 401035, 445935, 502336, 574786]
10621E74786R9787J46050K07403K71375L38759M01143M13526L14724J18220n8599
10611B827174j48355j17966l1978R6313K69283M49659O36786Q01669Q30498N55588
10601F168671J9258m31954n80116m67622k47372J2950K96428N77668Q42906J035116
10591G225933R89365N03551l10865r32742j077463q96294o02623l02541l6433
10582D559888K06535M14227N38881M63474R1522m47296q13517q55424o88702m73841
10572B995747k77990j08655J8062R8648J26079Q3081p5482k77474m12927m22337
10562A746752l53343k73946k07678j54682j14866q6985o2290m5605l3045l0562
10552C83750k5735k7364k1899j9720k3002k2151j5660j0334j2306j1217j2480
$$ y = [574786, 674573, 820623, 1028026, 1299401, 1638160, 2039303, 2452829, 2767553, 2885773, 2827174, 2678819, 2560853, 2528875, 2625188, 2894471, 3344130, 3980916, 4782585, 5613083, 6168671, 6187929, 5755975, 5175859, 4708237, 4460865, 4473815, 4770243, 5347911, 6190817, 7225933, 8215298, 8718849, 8407984, 7475242, 6397779, 5501485, 4898862, 4596321, 4559888, 4766423, 5180650, 5719531, 6183005, 6274527, 5827231, 5013714, 4158290, 3469588, 2995747, 2717757, 2609102, 2627164, 2725812, 2851891, 2934972, 2859490, 2582016, 2169089, 1746752, 1393409, 1119463, 911785, 757103, 642237, 555252, 492962, 447357, 414312, 383750, 358015, 330651, 308752, 289032, 266030, 243879, 228219, 217885, 205579, 194362, 181882]
10541A81882r162M129Q112R645L539J687m105m952o464o42m658l232k195j373
10527A72211m399J305N707k235M382K11J465M754J1996J3490N714K003J4442J3940
10513B44986J5273J7528L634o999j8349j5049p135J226M239P191K430m072J8r23
10499B43998n819L73J6833J2766Q752q646k3834j6719j0713l426o951p693j0300
10486A88621m999L210O79j966l453M52J394k666q586p078M544n383j1284j196
10472A52289P492M759j373K12N295L056M436J834J00j477j155j19q410K835n205
10457A64569o229m438j562N45j302n514j999N886J293l615K563J3860J2356J251
10443A77664j5497j3109l198k922r109m297l264l73M15j691R277J5139Q362Q680
$$ y = [181882, 172720, 176849, 184961, 194606, 198145, 199832, 195727, 190775, 184311, 183669, 179011, 175779, 173584, 172211, 167812, 169117, 174824, 172589, 176971, 177182, 178647, 183401, 195397, 208887, 214601, 216604, 231046, 244986, 260259, 277787, 281421, 274422, 256073, 241024, 233889, 235115, 239354, 246545, 248975, 244903, 244921, 243998, 238179, 238552, 255385, 268151, 276903, 268257, 244423, 227704, 216991, 213565, 206614, 198921, 188621, 183622, 186832, 187511, 185545, 182092, 182544, 183938, 181272, 172686, 165608, 170152, 164769, 153485, 152289, 159781, 164540, 163167, 163379, 168674, 171730, 176166, 178000, 178100, 176623, 175468, 175349, 166939, 169774, 164569, 158340, 153902, 152340, 152885, 151583, 146069, 144070, 149956, 151249, 147634, 150197, 164057, 176413, 177664, 162167, 149058, 145860, 142938, 133829, 129532, 126268, 125895, 126310, 124619, 133896, 149035, 157397, 166077]
10429A66077N755j82J879O010q450j7130j1372n410N319K964o421l942j702K842
10415A36237O652P059Q754k718p984n060n275m265n23p350n492k265P245J055
10401A26070m725J384J255J841P487j253k866N188J4481J5346M600O388L601R762
10387A88559L015j068M77j650q039r227r18J554J0386K8547M4355P0595R2105
10374D18691J00203Q1202K8279n776l4015n0662m8028j9656j4218l7171n4895
10363C63954n6676l9564j3227l621p99J93k122J695O09l723p96k614M72J967N56
10348B46304o580m500M851j576J974N245N165K656J492K557O371L647O180N894
10334B79680N844J0722L863L056J878K34K240L562L052M706R989J0129J2398J5522
$$ y = [166077, 171832, 171650, 173529, 179539, 171089, 153959, 142587, 137177, 142496, 145460, 139039, 135097, 133395, 136237, 142889, 149948, 158702, 155984, 148000, 142940, 137665, 133400, 132877, 125527, 120035, 117770, 125015, 126070, 121345, 122729, 123984, 125825, 133312, 132059, 129193, 134381, 148862, 164208, 168808, 175196, 178797, 188559, 191574, 190506, 190983, 189333, 181294, 172067, 171149, 172703, 183089, 211636, 255991, 326586, 418691, 518894, 600096, 628375, 622599, 588584, 537922, 489894, 470238, 456020, 418849, 363954, 307278, 267714, 254487, 250866, 250067, 250260, 248138, 249833, 250442, 246719, 245923, 243309, 243781, 245748, 246304, 239724, 235224, 240075, 238499, 240473, 245718, 250883, 253539, 255031, 257588, 263959, 267606, 273786, 279680, 285524, 296246, 300109, 303165, 305043, 305277, 307517, 311079, 314131, 318837, 328826, 338955, 351353, 366875]
10320C66875J7372K1625J4071K243n147O422J3919J6319K2758K5376J3168J2760
10308E27761J6027J4412J3823J9332K9285M4920O3420Q0170R3963Q0390K8219
10297A011722k1458l7053l4100l1627k0081R253K8586L6107L4220M9076O1972
10286A086617N4662M2707L7625M0501M0228L6009M2052O4904Q0261Q9818J08190
10275A723574J12488J06520J22274J26664J33833J37417J50115J71050J96101
10266B980036K25715K63949L07456L63845M37162N45049O82389Q20705R75957
10257G602263J107853J096017Q79993P50323R56155J403227J978503K692396L673366
10248B2140096N034715P017067J0104828J4968688K2460756L2905544M5698433
$$ y = [366875, 384247, 405872, 419943, 422186, 417039, 423461, 437380, 453699, 476457, 501833, 515001, 527761, 543788, 558200, 572023, 591355, 620640, 665560, 728980, 809150, 903113, 983503, 1011722, 990264, 953211, 919111, 887484, 867403, 876656, 905242, 941349, 975569, 1024645, 1086617, 1141279, 1183986, 1221611, 1262112, 1302340, 1338349, 1380401, 1445305, 1525566, 1615384, 1723574, 1836062, 1942582, 2064856, 2191520, 2325353, 2462770, 2612885, 2783935, 2980036, 3205751, 3469700, 3777156, 4141001, 4578163, 5123212, 5805601, 6626306, 7602263, 8710116, 9806133, 10686126, 11436449, 12392604, 13795831, 15774334, 18466730, 22140096, 27174811, 34191878, 44296706, 59265394, 81726150, 114631694, 160330127]
10241A60330127O0527692P3493569O2644118P043566n4859583p7376133o5908791
10234A65894565m6783928l1650436k1438523j4780632j0440389p568438n588580
10227B7643639m195349l198365k462273j894969j457113j187047j077317j110723
10219A1060483j181027j134343r85165q20335o87847n93542n15981m50916l91743
10210D299584l38061k94025k59638k29293k06097j79522j52866j31798j14105
10201B394179r9798r9791r2785q4380r1699j01955j13186r7779p8606p3414p1361
10190A389425m3943k8517k9689l2632m1479l1878l6077n1638n1559l2882j9118
10179I90013j3249j0477j0111j3603j7344k1310k9623l0484k9324k0399k3448
$$ y = [160330127, 220857819, 294351388, 356995506, 364039072, 309179489, 231803356, 165894565, 119110637, 87460201, 66021678, 51241046, 40800657, 33232219, 27643639, 23448290, 20249925, 17787652, 15892683, 14435570, 13248523, 12171206, 11060483, 9879456, 8745113, 7759948, 6939613, 6251766, 5658224, 5142243, 4691327, 4299584, 3961523, 3667498, 3407860, 3178567, 2972470, 2792948, 2640082, 2508284, 2394179, 2294381, 2194590, 2101805, 2017425, 1925726, 1823771, 1710585, 1612806, 1534200, 1460786, 1389425, 1345482, 1316965, 1287276, 1254644, 1213165, 1181287, 1145210, 1093572, 1042013, 1009131, 990013, 976764, 966287, 956176, 942573, 925229, 903919, 874296, 843812, 814488, 794089, 770641]
10168G70641k0974j6982j0235q074q043M32j0058k1427k7204k6710j3053K913
10156F11226J1869J6171J3400M852l337j5161l0126k3228j7956j2147n977r157
10144E40429k297j8n882r661j4405j7323j2579p530j0620l880K186j983o081o077
10130D44279k335k147o442n739M41o883k14L399l753l49K086N927O149P221J2024
10115D53664N60j8191l8190l3156p872J6660m36l7280n2516m4406j4688J4248
10103B38397L5613N4487N3836M4844L0992J6357J8093K1305J0012N674M245J5622
10091E49477J7840J6822K5953M5965N6372N0138N1925O2950Q4813R8389J05892
10080A166536J25703J56472J78975K24352K86664L52666M32145N25882O32550
$$ y = [770641, 749667, 732685, 722450, 714376, 706333, 706765, 696707, 675280, 648076, 621366, 608313, 611226, 623095, 639266, 652666, 657518, 654181, 639020, 608894, 585666, 567710, 555563, 549586, 540429, 538132, 538114, 532232, 522571, 508166, 490843, 478264, 470734, 460114, 456234, 458420, 456437, 450356, 444279, 441944, 439797, 433355, 427616, 428057, 421174, 420960, 424359, 420606, 420257, 422343, 428270, 434419, 441640, 453664, 454224, 436033, 397843, 364687, 356815, 373475, 373039, 335759, 283243, 238837, 224149, 238397, 274010, 328497, 382333, 427177, 458169, 474526, 492619, 513924, 523936, 529610, 533855, 549477, 567317, 584139, 610092, 656057, 712429, 762567, 814492, 877442, 962255, 1060644, 1166536, 1292239, 1448711, 1627686, 1852038, 2138702, 2491368, 2923513, 3449395, 4081945]
10071D081945P14847P54860P41921O17700L91387M3136l48620o46500p74505p73711
10061D802460o95302n98833m99485m07215l33743k70832k22303j84533j52945
10052A437269j21007r0873q2942n9886m0041l0857k0549q675M636K3370K3041
10041A033486K7270N0715P9137Q7159Q3030P8270M9338J4945j6053m3741n0490
10030A393066l4030p046P757M6055J12616J84455K81259M21403O11171Q68053
10020C884759J197425J540513J812551J727173R32696m26306j539490j895247
10012G234074j692757j308740r54124o83089m89183l62290k69659k02499j57025
10003A114708j20796q5631p6372o6199n3729n1568m9079m3627m2596m3005l2089
$$ y = [4081945, 4796792, 5551652, 6293573, 6911273, 7302660, 7345796, 6997176, 6350676, 5576171, 4802460, 4107158, 3508325, 3008840, 2601625, 2267882, 1997050, 1774747, 1590214, 1437269, 1316262, 1225389, 1142447, 1082561, 1042520, 1011663, 991114, 982439, 987075, 1010445, 1033486, 1060756, 1111471, 1190608, 1277767, 1360797, 1439067, 1488405, 1503350, 1487297, 1443556, 1393066, 1359036, 1351990, 1359747, 1405802, 1518418, 1702873, 1984132, 2405535, 3016706, 3884759, 5082184, 6622697, 8435248, 10162421, 11095117, 10668811, 9129321, 7234074, 5541317, 4232577, 3278453, 2595364, 2106181, 1743891, 1474232, 1271733, 1114708, 993912, 908281, 831909, 765710, 711981, 660413, 611334, 567707, 525111, 482106, 450017]
9992D50017k6864k6985k7221j7359j9720j8173p484j626o244j1245j7541r873
9980B59682j2990j6945n546k33q87k3K962N603L171N515K051Q134O697Q366L388
9965B68945R4J1530J7704K0769K9350L8130M3339N4815N1293N6868M9459K6313
9953F68609p895l8559n0476n5298n7250m7457l5681l2918l0764k3433k2410k4234
9941B42234j9969j3405j1256L676M989P433N327j662j2095j0384n288J836O427
9928A97863J6402J3926k4931l4508j7319j2841j338O14j333l952L167j690o910
9915A27150m154J066J042R078k222J685q69l286l299O83n997k932R1O331m024
9900A20343q316J964M294K857N974l341m76m671j271j285o061n438K75K528J386
$$ y = [450017, 423153, 396168, 368947, 351588, 331868, 313695, 306211, 304585, 298341, 287096, 269555, 259682, 246692, 229747, 224201, 223968, 223081, 223058, 226020, 231623, 234794, 240309, 242360, 250494, 257191, 265557, 268945, 269039, 280569, 298273, 319042, 348392, 386522, 429861, 484676, 535969, 592837, 642296, 668609, 660714, 622155, 571679, 516381, 459131, 411674, 375993, 343075, 312311, 288878, 266468, 242234, 222265, 208860, 197604, 201280, 206269, 213702, 219029, 217367, 205272, 194888, 189600, 191436, 197863, 214265, 228191, 203260, 168752, 151433, 138592, 137254, 137868, 136535, 132583, 135750, 134060, 127150, 122996, 124062, 125104, 134182, 131960, 133645, 132776, 129490, 126191, 126874, 120877, 117945, 118036, 124367, 120343, 112027, 113991, 118285, 121142, 127116, 123775, 123299, 118628, 117357, 116072, 110011, 104573, 104848, 107376, 108762]
9885A08762m223q462K509P867M125J2915J2405J6270K4494K9464L5313N3946P1847
9872C67232P6261N7631M0977r353n1209p7467p6627o4606n2429l0792k1062j4428
9860A44128n782o261k473m291o216k777k035p299l300m432l147p802p349q613
9846G2351K947j253K578L001J257j875K80O23J568L396N636J2105R040J675N084
9831A18413K404J1417J1721P427J2559K1154L4986M7450O2312Q6607J34217J92529
9819G43196K55998L41546L74761K34809q1569l36007l78583k98971k17136j44580
9809D93464r9743o8349m8480l7880k8597k3433j6675k1949r740r855r711q518
9797A10534j3047j0673K004R96n90J966L828O07r68q49l275l624M585M759L334
$$ y = [108762, 104539, 96077, 98586, 106453, 110578, 123493, 135898, 152168, 176662, 206126, 241439, 295385, 367232, 443493, 501124, 542101, 532748, 481539, 404072, 327445, 262839, 210410, 179618, 158556, 144128, 138346, 132085, 129612, 125321, 119105, 116328, 114293, 106994, 103694, 99262, 96115, 88313, 80964, 72351, 75298, 74045, 76623, 79624, 80881, 79006, 79286, 79909, 81477, 84873, 90509, 102614, 111654, 113329, 118413, 120817, 132234, 143955, 151382, 163941, 185095, 220081, 267531, 329843, 416450, 550667, 743196, 999194, 1340740, 1715501, 1950310, 1868741, 1532734, 1154151, 855180, 638044, 493464, 393721, 325372, 276892, 239012, 210415, 186982, 170307, 148358, 138618, 128763, 119052, 110534, 97487, 86814, 88818, 89814, 89224, 91190, 95018, 95625, 94657, 93808, 90533, 86909, 91494, 96253, 99587]
9782I9587O441J651k034o386k0291k3712k1584j1482q247m876Q411P517l110O25
9768B2510J46k602N970O363k305n132P978n004O92J311Q52j514l463O236J0476
9753D2514K46N73n76k827L212O48P85K608J235j228p7j394M950J184o135p879
9737C7839q80m593k327M927J423M394L723P089K40l465m298o059L631L93l159
9722C8878K280L246L55j733m919J610J25Q93k041J42J619J063P712p15o393m258
9706C7864L68J23J095J616K65K02k436m486m131J462m492L361L307m435N50L535
9690C3768l679n605L557L694N461J938K494j339k506o170k210N971P657k754K807
9675D3084K650Q71l231P35o21l434K968M106Q52L424N959l595j3296m809M778
$$ y = [99587, 106028, 107679, 105645, 99259, 78968, 55256, 33672, 22190, 13943, 9067, 17478, 24995, 21885, 22510, 22656, 20054, 26024, 32387, 30082, 24950, 32928, 27924, 28616, 29927, 30779, 29265, 25802, 32038, 42514, 42760, 43333, 42757, 39930, 43142, 43790, 44575, 47183, 48418, 47190, 47113, 45719, 50669, 51853, 45718, 37839, 36959, 32366, 30039, 34966, 36389, 40783, 44506, 51595, 51835, 48370, 44072, 38013, 41644, 42037, 38878, 41158, 44404, 44759, 43026, 38107, 39717, 39842, 40735, 38694, 38836, 40455, 41518, 49230, 48515, 42122, 37864, 38232, 38355, 39450, 41066, 41331, 41533, 39097, 34611, 30480, 31942, 27450, 30811, 34118, 29683, 30233, 33768, 30089, 24484, 28041, 31735, 37196, 39134, 41628, 40289, 37783, 31613, 29403, 35374, 43031, 40277, 43084, 45734, 46605, 43374, 44109, 43488, 40054, 43022, 47128, 47980, 51404, 57363, 53768, 40472, 35663, 40441]
9660D0441K193J718l636J623N926J557O035K24j88N003j618K809R2r028n729J268
9644D8690N156M128O437n057j24l839k081L029L026K607L242k980j997J92J106
9629F1535l752n270k970n03q55K006l230m672m426M201j859J831J926m716K367
9614D1613n237M12M623K964l680L386L145K528j483N02j303k112P56k44N323K866
9598E4059N000O691K667O320N008k164k385m446q762o742J693q195l742j87J487
9583D6302L436k435k242r94m773r48P361N322p259j728q372j206O399M211p22
9568D2352L068M544P426Q991J3370M737m324m127n767m499l952l466n251o999
9554D6103o134j427N364k931o332m884Q988N74k652j99O75j357M560j158K434
$$ y = [40441, 42634, 44352, 40716, 42339, 48265, 49822, 55857, 56081, 55893, 60896, 59278, 62087, 62179, 53151, 47422, 48690, 53846, 57974, 64411, 59354, 59230, 55391, 53310, 56339, 59365, 61972, 65214, 62234, 60237, 60429, 61535, 57783, 52513, 49543, 49040, 48185, 50191, 46961, 42289, 37863, 42064, 40205, 42036, 43962, 39246, 41613, 36376, 36788, 41411, 44375, 40695, 44081, 47226, 49754, 48271, 48773, 47470, 45358, 46114, 45870, 51193, 54059, 59059, 65750, 68417, 74737, 79745, 77581, 75196, 70750, 61988, 55246, 56939, 48744, 45002, 44815, 46302, 49738, 47303, 45061, 44067, 39294, 38346, 45707, 51029, 43770, 42042, 33670, 32464, 38863, 43074, 42352, 45420, 49964, 57390, 66381, 79751, 84488, 80164, 76037, 70270, 65771, 61819, 58353, 53102, 46103, 39969, 38542, 43906, 40975, 34643, 29759, 38747, 39321, 36669, 36470, 37145, 35788, 40348, 39190, 41624]
9539D1624p82j145o665p06L020j564O322M498K55r73L65K284O605M877n632k610
9523D9773n049o200n942J221K903Q220M391M622K926n920n409l186m019k117l45
9508C5869K082O19L72L90k729j019n561l109k209M159n11j478l729N236N283j009
9492C2656L01M822M702m476l069k37j952n006O52M37m578P33J0101L004n359j521
9476C1210l529K808L040l629q714m77M949K223K030L249p6K444j720L244l620
9461C3432k810K106J771O48K852m851n096n543K528L202R96k098k216O58J808
9446B7387O072P007l283k776J557m047m37m565m609L403L087M812L40o54j379
9431C1915j582K239M379l018k344L752j378k417L829M631k203o160l015j534K657
$$ y = [41624, 40842, 39697, 33032, 32326, 35346, 33782, 40104, 44602, 44857, 43884, 44249, 46533, 53138, 58015, 52383, 49773, 44724, 38524, 32582, 33803, 36706, 44926, 49317, 53939, 56865, 50945, 45536, 42350, 38331, 36214, 35869, 37951, 38570, 38942, 39332, 36603, 35584, 30023, 26914, 24705, 28864, 28353, 26875, 23146, 28382, 33665, 32656, 32957, 37779, 42481, 38005, 34936, 34699, 32747, 27741, 28393, 28830, 24252, 24985, 35086, 38090, 32731, 31210, 27681, 30489, 33529, 29900, 21186, 20709, 25658, 27881, 29911, 33160, 33084, 35528, 33808, 37052, 33432, 30622, 32728, 34499, 35147, 37999, 33148, 28052, 22509, 25037, 28239, 29235, 27137, 24921, 25579, 27387, 33459, 40466, 37183, 34407, 35964, 31917, 31480, 26915, 22306, 25709, 28796, 33608, 33948, 33294, 31915, 30333, 32572, 36951, 33933, 31589, 35341, 33963, 31546, 35375, 40006, 37803, 31643, 28628, 27094, 29751]
9416B9751J238P782L367j970N320K190M548r68j905n301O11L771K531k262l109
9401D5594k291r284o259M804M373M817n96n046P294R680l620o156j0080k485N191
9386C5936K669L70j376J291j337n717j478j791P977M367M48o497l105m634J551
9371B8674j613k331m43r83k105P492K988J240N472J571J287j823l570j63j66J503
9355C7030n154l47J952N939Q95j770M597m257L84n953j559N163M228k862j068
9340C7218N41M12r61j0178q78n251K77L928l96M621L614j85m426l557J221N383
9324C1383l236K229K057P23l710o184Q56O739R627J441p144K66O853M806m168
9309D2538n017l908o659R97N314j76k736J60p64q673K243K673K023L39M270k846
$$ y = [29751, 30989, 38771, 42138, 40168, 45488, 47678, 52226, 51258, 49353, 44052, 44663, 48434, 50965, 48703, 45594, 43303, 34019, 27760, 32564, 36937, 41754, 41158, 36112, 43406, 53086, 49466, 43310, 33230, 30745, 35936, 38605, 38975, 37599, 38890, 37553, 31836, 30358, 28567, 36544, 40911, 41359, 34862, 31757, 27123, 28674, 27061, 24730, 24287, 23304, 21199, 28691, 31679, 32919, 38391, 39962, 41249, 39426, 35856, 35693, 35527, 37030, 31876, 31529, 33481, 39420, 40315, 38545, 43142, 38885, 39269, 33316, 31757, 36920, 41148, 38286, 37218, 37759, 38171, 37210, 27032, 26154, 20903, 21180, 25108, 24712, 29333, 32947, 32762, 28336, 24779, 26000, 31383, 28147, 30376, 32433, 33156, 29446, 23262, 24118, 30857, 40484, 41925, 34781, 35047, 41900, 46706, 42538, 37521, 33613, 26954, 27951, 33265, 33089, 30353, 30513, 29749, 21076, 23319, 25992, 28015, 28354, 32624, 29778]
9293B9778l889l455J391O335n481j903R279J861n794O407K498l860N056j632n113
9278C1478j804L58m781L246N48L301O346K78j126o295k456l986M358L160q105
9263B4520l443J35P673L7j068L219r93J683L241j071j432l066M641M306K919m449
9247C6852j668k07j373k48k616j914L535N731J790o678m430J38L307J831L720
9232C7770j715l185M471J047M104M987m022n773r89L602m21N177R77q159k938
9217C4933k281o037N468N726R943L092o148j428L800p208o725J78p48q465j347
9202B2753Q774J0083k512k778l130Q67l248k558N645L157k973K544q48J958J259
9187C8993o708K53P31j288j662O219J208K895l198m889k81j307L077J448j804
$$ y = [29778, 25889, 22434, 23825, 30160, 24679, 22776, 32055, 33916, 28122, 34529, 37027, 33167, 38223, 36591, 31478, 29674, 30032, 25251, 28497, 29045, 32346, 38692, 38970, 37844, 31549, 29093, 25107, 29465, 32625, 24520, 21077, 21212, 28885, 28922, 27854, 31073, 30080, 31763, 35004, 33933, 32501, 29435, 34076, 38382, 41301, 36852, 35184, 34977, 33604, 33356, 30740, 28826, 32361, 38092, 39882, 33204, 28774, 28912, 32219, 34050, 37770, 36055, 32870, 37341, 38388, 42492, 47479, 43457, 37684, 36695, 40297, 39876, 45053, 46030, 37871, 34933, 32652, 26615, 32083, 37809, 47752, 50844, 44696, 43268, 47068, 39860, 33135, 33313, 32565, 24100, 22753, 31527, 41610, 39098, 36320, 33190, 34057, 30809, 28251, 33896, 37053, 34080, 36624, 35776, 37734, 38993, 32285, 32538, 33269, 31981, 30319, 36538, 37746, 40641, 37443, 32554, 32273, 30966, 34043, 35491, 33687]
9172C3687K573R88L756j642l033K756k955k67J340k394J481R169M268l547J070
9157D7250l556r27m308m372K02L643K192l783l036kJ334j384N494R829L073l311
9141D8338k297j640j957K89M711k119p902M437M187l399l110K106L526l958l060
9126C8152M08K301j148P499J0880j155r010j0736k050j259L852K24J468P678k409
9111D4695o713j19J372J662J064M919k289m434L072k515k683o144o4j472K165
9096C2516N846j636N249L431P72n5m428j095m32K704K16l340j158o330K74N071
9080C7605K63n37N829L323m874k369K51M529j607N01P072N577k751K83O8n522
9064D7641J770K489p168j385K169J134J233L795N264o750l650k051k060r18o95
$$ y = [33687, 36260, 37248, 41004, 39362, 36329, 39085, 36130, 35863, 37203, 34809, 36290, 45459, 49727, 46180, 47250, 43694, 42767, 38459, 34087, 34289, 37932, 40124, 36341, 33305, 33303, 34637, 33253, 38747, 48576, 51649, 48338, 46041, 44401, 42444, 42733, 47444, 45325, 37423, 41860, 46047, 42648, 39538, 41644, 45170, 41212, 38152, 38560, 40861, 39713, 47212, 58092, 56937, 47927, 37191, 35141, 33882, 37734, 37958, 39426, 47104, 44695, 37982, 37863, 39235, 40897, 41961, 46880, 44591, 40157, 43229, 40714, 38031, 31887, 31823, 30351, 32516, 38362, 36726, 41975, 45406, 46178, 46123, 41695, 40600, 40168, 42872, 43088, 39748, 38590, 32260, 32534, 37605, 37868, 37331, 43160, 46483, 41609, 39240, 39491, 44020, 42413, 42914, 49986, 55563, 52812, 53095, 53163, 47641, 49411, 51900, 44732, 43347, 45516, 46650, 47883, 51678, 56942, 50192, 46542, 44491, 42431, 41513, 40818]
9049D0818O581R72j088k1p45J985k555J258M17M286L294o962J482M08M239m15
9033E3954q382j105J616K881Q48k542L73l487j985K425J000l872P861K074n147
9018D6512J056Q221k190J932o830J911K928l887K168L67k786n757n567j32J466
9003C9412K451P05o284k401l014p66J90J592J0403J060j616o72L729j354j352
8988D2083m008q345L955M345p464p151N042N664O84J732m065q75N077L260m00
8973C9534j180M457J855n223L052O387M86m099o339j292R10O826J915K614M697
8958E4600l29j31J062k839o651p70k999n048l410p796M963J460n860J85N918L167
8942C5522O441L187k061k404K220N64p10l679p030l456K850m35M550N781k834
$$ y = [40818, 47399, 48371, 47283, 47262, 46517, 48502, 45947, 47205, 47622, 51908, 55202, 48240, 49722, 50130, 54369, 53954, 45572, 44467, 46083, 48964, 49812, 47270, 47643, 44156, 42171, 44596, 45596, 41724, 49585, 51659, 46512, 47568, 55789, 53599, 55531, 48701, 50612, 53540, 49653, 51821, 52188, 49402, 43645, 38078, 37946, 39412, 41863, 42568, 36284, 33883, 30869, 30103, 30293, 31885, 42288, 43348, 41732, 41060, 44789, 43435, 42083, 38075, 29730, 33685, 38030, 30566, 23415, 28457, 34121, 34805, 36537, 32472, 31597, 36674, 39934, 39534, 38354, 42811, 44666, 39443, 42495, 48882, 49368, 45269, 38930, 37638, 38548, 45374, 47289, 49903, 54600, 54271, 54140, 55202, 52363, 45712, 44942, 41943, 36895, 33485, 25689, 30652, 32112, 26252, 26437, 32355, 35522, 41963, 45150, 43089, 40685, 42905, 43469, 42759, 39080, 32050, 28594, 31444, 31009, 35559, 41340, 38506]
8927C8506O938J115l102n483p20K282l75l045K68m989k422O651O453Q25l626o492
8911C2784M547L988k477m132j263L208N334O40N5M787L046l186l071j783j933
8896D0544R998l333q57J67k977n679n75M725j697l81n145J395R93j003L49j508
8880C5016p811M765K476Q3L317K778L179l131o368j222L538j67J325k265j548
8865C3965q7L072K077k610p006J470j539j624k97k79K037M149K380L184K19m578
8849C4533L129N586k236k710k28L900O393j36o762l649m48J820k115L569K466
8834D3112p301m440l437K260P275l130m72N936L008l089j062K233K838k305n172
8819C6254J702O906j176o747n449J36l677N181P606p62p829j212m683k729k408
$$ y = [38506, 45444, 46559, 43457, 37974, 37254, 39536, 39161, 36116, 36384, 31395, 28973, 35624, 42077, 42902, 39276, 32784, 37331, 41319, 38842, 34710, 33447, 36655, 41989, 42629, 42684, 47471, 50517, 47331, 44260, 42477, 40544, 50542, 47209, 46352, 46519, 43542, 37863, 37288, 42013, 40316, 39935, 34790, 36185, 37178, 36175, 36524, 35016, 27205, 31970, 34446, 34529, 37846, 40624, 43803, 40672, 34304, 33082, 36620, 36453, 37778, 35513, 33965, 33878, 36950, 39027, 36417, 29411, 30881, 29342, 27718, 27421, 27142, 29179, 33328, 35708, 38892, 39111, 34533, 37662, 43248, 41012, 38302, 38074, 41974, 48367, 48231, 41469, 37820, 37372, 39192, 37077, 40646, 43112, 35811, 31371, 27934, 30194, 37469, 34339, 33867, 39803, 42811, 39722, 38660, 40893, 43731, 41426, 36254, 37956, 44862, 43686, 36939, 31490, 31626, 27949, 33130, 40736, 39974, 32145, 30933, 26250, 23521, 21113]
8804B1113L807O372j137l093n17J947R262N580k051o71O36l311n022j396N367
8789C6886L737n27l007J50K541J162j946k18m950o57L67j001J644L403L267J22
8773D0973n05m341K669J146l928n700M8n46J344K4K858M704N088M267J234M90
8757D9825m5k269j0808m614l024k983k174j862N63K777l552l44N602j252k195
8742B3645p333j151M969l965j897M009L787j555M631P81M420P197M276k807k959
8727C6048J202l155n564o095J549J2065M94j921L403q87n90o820k342k80J278
8712B8385o03l348k451k066l391M614J091L858R1k178k664j085O729j065o32Q06
8696B6091p188l487l956Q166M954l864J13l46O548K013j534M18L219k668o496
$$ y = [21113, 24920, 31292, 30155, 27062, 26545, 28492, 37754, 43334, 41283, 40612, 41248, 37937, 32915, 31519, 36886, 40623, 40096, 37089, 37239, 39780, 40942, 38996, 38778, 33828, 33171, 33538, 32537, 34181, 37584, 40851, 40973, 40468, 36127, 38796, 39942, 36014, 30314, 30362, 29816, 31160, 31184, 34042, 38746, 43834, 48101, 49335, 49825, 49780, 47511, 36703, 32089, 29065, 26082, 23908, 22046, 22609, 25386, 21834, 21490, 27092, 25840, 23645, 16312, 15161, 20130, 16165, 14268, 18277, 22064, 20509, 25140, 25921, 30341, 37538, 41814, 39007, 36048, 37250, 34095, 28531, 22436, 23985, 36050, 36544, 34623, 38026, 37139, 36549, 29729, 27387, 27107, 28385, 27782, 24434, 21983, 19917, 16526, 21140, 22231, 26089, 26180, 24002, 21338, 20253, 26982, 25917, 25285, 26091, 18903, 15416, 11460, 19626, 24580, 20716, 20829, 20483, 27031, 29044, 27510, 27928, 31147, 28479, 21983]
8681B1983L79Q931M697j300l194K338J169j0136p916R890O087k92k557o234r89
8666B2856j181M138l84l267M644L442K559n462o535k487L130N536N322k519q52
8651B8940n4j980J924J2420M467q951o220J687O258L048P40j215l931k254N3j940
8635C2992k663N056o76q56n44k844L85M177L213J131m304j050P421K581J515j865
8619D3669n516j045N137J621K9j655J593M424q17k723q2k794p188P478L52l277
8603C9206k591K589k735K397m686j424P816K477L542K452m41n223k584Q95K190
8588D3880l18k256O89K580j354m453K042R649R289M382J24O019K767j081O652
8573G8611P040j717j115K302n309R54K198K662K717L386O37k363n636l210L632
$$ y = [21983, 22362, 31293, 35990, 34690, 31496, 33834, 35003, 24867, 16951, 26841, 32928, 32636, 30079, 23845, 22856, 21675, 25813, 25429, 22162, 26806, 30248, 32807, 27345, 20810, 18323, 21453, 26989, 32311, 29792, 28940, 28886, 26906, 28830, 41250, 45717, 36766, 30546, 32233, 38491, 41539, 42279, 41064, 37133, 34879, 34932, 32992, 30329, 35385, 34709, 33853, 33309, 30465, 30850, 35027, 38240, 39371, 35067, 34017, 41438, 44019, 45534, 43669, 38153, 37108, 42245, 43866, 43895, 42240, 43833, 48257, 47440, 44717, 44635, 41841, 34653, 42131, 42483, 39206, 36615, 39204, 36469, 38866, 34180, 32756, 40572, 43049, 46591, 49043, 48602, 43379, 40795, 41690, 43880, 43562, 41306, 41995, 44575, 43221, 38768, 40810, 50459, 59748, 64130, 64254, 70273, 73040, 71959, 78611, 85651, 83934, 82819, 85121, 79812, 80766, 82964, 85626, 88343, 91729, 92366, 90003, 84367, 81157, 84789]
8558H4789k096j892r298q290r270r73L74p706o837J156j874j225M693M234l150
8543D2635n150p142k09J420m955K181M976m809p832P48L854N722P911J538n574
8528C5314r25j346m028k768k290m192k662j478k901L586O647N444n70k880j052
8513B3899L953m880r566k390L973K165P278Q396Q771j849l508J078N776R80J0129
8498E4205R020m016o899o697j0598n981J02m975l786L780N937M316M005m368o736
8483B7309m880l233K444Q04J832J826K02L335Q11M098K029M870n417n187k581
8468B8262r452m305L025N436L056l21P68M228J0786K222N491O175J5213J6996
8454H7580J1242N717j1955j6862j2919j6237j4096p354Q31N766l454p268n752
$$ y = [84789, 82693, 80801, 71503, 63213, 53943, 52970, 53344, 45638, 38801, 39957, 38083, 36858, 41551, 45785, 42635, 37485, 30343, 30134, 31554, 26599, 28780, 33756, 28947, 21115, 21863, 25717, 31439, 39350, 40888, 35314, 34389, 33043, 29015, 26247, 23957, 19765, 17103, 15625, 12724, 16310, 22957, 28401, 27831, 24951, 23899, 27852, 22972, 13406, 11016, 14989, 17154, 24432, 32828, 41599, 39750, 36242, 37320, 43096, 44076, 54205, 63225, 59209, 52310, 45613, 35015, 29034, 29136, 24161, 20375, 24155, 30092, 34408, 38413, 34045, 27309, 22429, 19196, 21640, 22444, 24276, 26102, 26304, 29639, 30450, 34548, 36577, 41447, 36030, 30843, 28262, 18810, 14505, 17530, 22966, 26022, 25701, 26469, 30697, 41483, 43705, 49196, 55371, 70584, 87580, 98822, 104539, 92584, 75722, 62803, 46566, 32470, 25116, 25947, 31713, 28259, 20991, 15239]
8441A5239l021P216P475j162k579K259k948p807L813N522N027j389m56m746k324
8426B0119j903k578J140K913O635K484k287k89o1K285k650j99l124Q78P342Q102
8410C8807R654N917n225r323m426n849k179k009l657j617m47k912J693k968J151
8395A6610K183j392k970n57k947K158j354j341Q68N759N33j165l632PM811N685
8379B3256m275l738L47Q052R39n421l506L091j101p31o421j244J914p346N73K767
8363G156p04J820k546l475n81N265O266K059N7R09M439k875L135O378n556j473
8347B0274r21k112M129k204n841K004p58k525J742j433j324N03M545J059m450
8332A2688k879J181P499m42p320M351L910k193K087p4R564L824J247P44K320J3508
$$ y = [15239, 12218, 19434, 26909, 25747, 23168, 25427, 22479, 14672, 18485, 24007, 29034, 27645, 27189, 22443, 20119, 18216, 15638, 16778, 19691, 26326, 28810, 26523, 26234, 26173, 28458, 25808, 25609, 22485, 23363, 30705, 38807, 48461, 54378, 49153, 39830, 35404, 29555, 27376, 25367, 21710, 20093, 19646, 16734, 18427, 15459, 16610, 18793, 17401, 14431, 13874, 10927, 13085, 11731, 10390, 11258, 17017, 17550, 16385, 12753, 12760, 17571, 23256, 18981, 15243, 15590, 23642, 24581, 19160, 15654, 18745, 17644, 16913, 10492, 9248, 11162, 3816, 4389, 7156, 6452, 8272, 5726, 2251, 1670, 6935, 13201, 15260, 15317, 16226, 20665, 17790, 20925, 27303, 21747, 20274, 19353, 17241, 21370, 19166, 13325, 15329, 14571, 12046, 13788, 12355, 11031, 11534, 16079, 17138, 12688, 9809, 10990, 18489, 18047, 10727, 15078, 18988, 16795, 18882, 18808, 28372, 32196, 33443, 34187, 36507, 50015]
8316E0015J4824K4220M2726O0196R3813Q3626l9558j06023p7638m7714l1918j9416
8304D7153j4835p171n244K666J427l784m261n15J773L395K968n268k131k193O742
8289B0722j349J963L939L071J177Q07K760Q27M307J2317M178P903K2323L0652
8275A15597L6225O6573J00523L9489q4125j02652n6218l5227k0979q279m071n437
8263D1419K030M774n343r212k751k455l854m605N347O283O245R104J0691L072
8249F0745J0752J3570K0821K6717L5459M4202N7021P7940R0962O8831R869n3966
8237D62923r5389q8714o4487m5445l5960k2761j7698j3528p847p27k147p695m504
8224E6021k74m489n980j655J887M493l920m175l427r3L716l051J256J73K984Q173
$$ y = [50015, 64839, 89059, 131785, 191981, 285794, 369420, 329862, 223839, 146201, 98487, 66569, 47153, 32318, 25147, 19903, 22569, 23996, 20212, 15951, 15436, 17209, 20604, 23572, 18304, 16173, 13980, 20722, 19373, 21336, 25275, 28346, 29523, 30330, 33090, 33917, 38224, 50541, 54719, 62622, 84945, 115597, 151822, 218395, 318918, 358407, 274282, 171630, 115412, 80185, 59206, 50927, 46856, 41419, 43449, 48223, 42880, 33668, 30917, 28462, 24608, 20003, 25350, 31633, 37878, 46982, 57673, 60745, 71497, 85067, 105888, 132605, 168064, 212266, 269287, 347227, 438189, 507020, 516889, 462923, 367534, 278820, 214333, 168888, 132928, 110167, 92469, 78941, 71094, 70367, 68220, 60525, 56021, 55747, 51258, 45278, 43623, 45510, 50003, 46083, 41908, 38481, 38388, 42104, 39053, 40309, 40482, 43466, 51639]
8208E1639J1871R647J6292J5975K8577L8754N1248O5401Q1670P9945M7730j7969
8196D80780p4317q3305p5648n7983m8116k3582j6126k3709j0325m497r779j0731
8184D2662J98q232o184P47k166p843k418N925l182J664L496q229o998M897J505
8169A5842L531m800m611q459k866M668J289N578K529m347J520P815mk623o12J777
8153A6227M30n510N06k668l572N381J87m310k949n5j840k693N864K422N7j124
8137F353l348l089O168J0714R14m399K623l74k14L80l282k184k135K049m816m740
8121F20m369K214M539k74K232J898k132n315L276O194M643j844q393n193J687
8106b17l508k638K555O088K645j792L219n21J098K883K316k467n178j33O742K206
$$ y = [51639, 63510, 73157, 89449, 105424, 134001, 172755, 224003, 289404, 371074, 451019, 498749, 480780, 406463, 323158, 247510, 189527, 141411, 117829, 101703, 77994, 67669, 63172, 53393, 42662, 42860, 34628, 28444, 29191, 27025, 19182, 16764, 22689, 19507, 21171, 24667, 16438, 9440, 14337, 15842, 19373, 14573, 9962, 1503, -1363, 3305, 4594, 10172, 12701, 8354, 9874, 17689, 17685, 15062, 14450, 16227, 16657, 11147, 11653, 8985, 5413, 10794, 10981, 6671, 3722, 3667, 1827, -866, 4998, 7420, 7477, 6353, 3005, -84, 6084, 16798, 17712, 13313, 15936, 15562, 15348, 15728, 12446, 10262, 8127, 10176, 5360, 620, -3749, -1535, 3004, 2730, 4962, 6860, 4728, -587, 2689, 8883, 13526, 11682, 3289, -1904, -217, -3725, -6363, -3808, 2280, 4925, 3133, 6352, 5831, 6929, 9812, 12128, 9661, 4483, 4350, 11092, 13298]
8090A3298J51o479l597L078J548m389p223J9R369M353L352k657l58j486K947j792
8074A0134m193Q36L694ML581N87k488l355K594M423R18q049n838j079K714K049
8058F532p095l60L650O733M877k492m01k185k586m570K722M481J574l635k265
8043D980k075N068J600K741l23K748L567l605j883l561p10K165p326l706L736
8028C416M706K670K438j623q920J146J735Q988O800o339o410j070k763p47O50
8013D677M104K09m42P169N42k500K968N385j527l723p49J512K212N034kq965p06
7996A5198M806O377k405p849j256j712j33K953k811L257O53k234k927K886L035
7981A7838L791j168P92L335L568J638j19m95n87q36K16L81m169o8j94L233m348
$$ y = [13298, 13449, 6970, 3373, 6451, 7999, 3610, -3613, -3594, 5775, 10128, 13480, 10823, 10465, 8979, 11926, 10134, 5941, 6777, 10471, 10475, 14056, 14643, 12155, 8800, 11394, 15817, 16735, 8686, 2848, 1769, 4483, 6532, -563, -923, 2727, 9460, 14337, 11845, 11444, 9259, 6673, 2103, 4825, 9306, 10880, 7245, 4980, 2905, 7973, 9573, 12314, 11991, 14739, 18306, 14701, 12818, 9257, 8547, 10712, 3386, -320, 3416, 8122, 10792, 13230, 11607, 2687, 3833, 5568, 14556, 21356, 15017, 8607, 7537, 4774, 4027, 4677, 8781, 8990, 8548, 15717, 16259, 13759, 16727, 22112, 20585, 16862, 16113, 17625, 19837, 24871, 24869, 15904, 15198, 20004, 26381, 23976, 16127, 14871, 13159, 13026, 15979, 13168, 16425, 17078, 14844, 11917, 14803, 17838, 21629, 20461, 21253, 24588, 28156, 29794, 29675, 29180, 28593, 27757, 27973, 28354, 24185, 24117, 23923, 27156, 22808]
7964B2808m462l754j560K477K499n887K201N423j284J688j409m193n373k592O139
7949A2721Q058j09J979j783L47J081J19p454k051O158R2l185r13L549L321K369
7933B4299j412J003M200l733K16K52l463n279n238L019M78m677k28o21J479O394
7917A6689O446K875r491l999J065m838l002M806K353P5R81L451L534n00q32j12
7901A9501m171n472m189l0K76N487M573q38m329J871j97k939M184M287J468N100
7885B4582J339l34q349k334m635l000k52K33Q9O518P193r724j0973j281J307J154
7869A533L502q47n20l23j645L147O966j271k064J563o276n516Q043L860l988J560
7853G724M133M878L51p729K6J388P34m412j489R586Q22l795n430k719L289M056
$$ y = [22808, 18346, 14592, 13032, 15509, 18008, 12121, 14322, 19745, 18461, 20149, 18740, 14547, 9174, 6582, 12721, 20779, 20670, 22649, 20866, 21213, 22294, 22413, 14959, 12908, 19066, 19158, 15973, 15060, 18609, 21930, 24299, 22887, 23890, 28090, 24357, 24573, 24825, 21362, 16083, 10845, 13864, 14342, 9665, 9437, 8816, 10295, 16689, 23135, 26010, 16519, 12520, 13585, 8747, 5745, 10551, 12904, 12979, 13960, 17411, 20945, 20445, 19613, 19501, 15330, 9858, 5669, 5639, 5915, 11402, 15975, 15137, 10808, 12679, 12482, 9543, 13727, 18014, 19482, 24582, 25921, 25587, 17238, 14904, 10269, 7269, 7017, 7250, 7339, 13857, 21050, 11326, 353, -928, 379, 1533, 5035, 4188, 3668, 3345, 1700, 4847, 11813, 10542, 8478, 10041, 3765, -1751, 6292, 10152, 6164, 7724, 11857, 16735, 17086, 9357, 9383, 10771, 11505, 7093, 5604, 15190, 16012, 12217, 6787, 4068, 7357, 11413]
7837A1413M460O13j310m458j108K804o04j097j045k602L864N279J581k630k312
7822A2848k077j181j19K507M688M954j89p912q131m265K369M67k8K519K8M954
7806A1432L818J271p373K188P489m176m794l35k197l03n83M507k539k009K051
7791H447P50J753k263n393l457k103J017J574M267J83J619l431K21N012M465J797
7775A4458p575p039m925N319j284j40q31j097r651L822O628K996l663N237Q759
7760A1014K171m351m931N31K333r085l777O71j328M617O73N561q75M615J036J650
7744A0525k790k235k346J805L432N60K851J861j592l784l036n246n743k784j84
7729h706J082J965L204n49L786p380o889o320O84J4996K1769K7099K3296K207
$$ y = [11413, 15873, 16486, 15176, 10718, 9610, 12414, 11810, 10713, 9668, 7066, 10930, 16209, 17790, 15160, 12848, 10771, 9590, 9471, 11978, 16666, 21620, 21431, 13519, 5388, 1123, 3492, 3959, 3931, 6450, 6478, 11432, 15250, 16521, 9148, 11336, 18825, 14649, 9855, 9520, 7323, 7020, 6437, 10944, 8405, 6396, 8447, 9197, 10950, 8687, 3294, -163, -2266, -1249, 325, 4592, 4775, 6394, 2963, 3184, 8196, 12661, 14458, 6883, -156, -5081, 238, -1046, -1186, -2017, -3114, -12765, -8943, -2315, 681, -2982, 2255, 11014, 13185, 8834, 3903, 4434, 6767, -2318, -6095, -5424, -6752, -2135, -1462, 4099, 3224, 7839, 8875, 10525, 7735, 5500, 3154, 4959, 8391, 8951, 11802, 13663, 12071, 8287, 5251, 5, -5738, -8522, -8706, -7624, -5659, -2455, -3004, 782, -6598, -13487, -19807, -19123, -4127, 17642, 44741, 68037, 70244]
7715G0244j7384k3899k2034j9553q082M543J0453j436n884L669K245K029k484
7702g573m450N084Q53j89O37k33K553k211k283k195P38J497M230Q002O318r01
7686I877j1059J224L666p83l919p06K334K555J249L15q087J286j852J381L568
7671A049l055M22K884P00j072o01r29o318L522M456J222J372m123m977L94j240
7655f294J428J87L661O704k374q088r61O508J924k981k43r83L519m8k044r10K251
7638A256R59N604N39k790p24n583o76o16J282j397j984m416J644j436m451j600
7622a4389L46O497N676k445m880k510R22Q185j310k513J932N82J119j736K546
7607a978l395j583K607J723j880n466j183j565L406O069K622K497N72o628l003
$$ y = [70244, 52860, 28961, 6927, -12626, -20708, -16165, -5712, -7148, -13032, -9363, -7118, -5089, -7573, -12023, -6939, -6086, -6275, -5638, -5871, -3318, -5529, -7812, -10007, -9269, -7772, -3542, 4460, 10778, 9877, -1182, 42, 3708, 2925, -994, -1700, 634, 3189, 4438, 4753, -3334, -2048, -3900, -2519, 1049, -2006, -1584, 1300, 2000, 928, 327, -602, -6920, -3398, 1058, 2280, 3652, -471, -5448, -5054, -6294, -4866, -4679, -1018, 5686, 3312, -4776, -5737, 771, 2695, -286, -529, -1512, 2007, 1959, -85, -995, 1256, 2215, 7819, 8358, 5568, 4844, -739, -1415, -2031, -749, -2146, -4130, -8546, -6902, -8338, -12789, -14389, -14043, -7546, -1870, -4315, -9195, -11705, -10783, -2598, -3908, -6421, -4489, -3907, -2788, -4524, -1978, -5373, -6956, -4349, -2626, -4506, -9972, -11155, -12720, -9314, -3245, -623, 1874, 2446, -4182, -7185]
7592g185J570l728R35p93L443K108L262K70k360M441M031l967O22M023p579J600
7576F93J978K520l089o723j757l008J176n967L493L752K280k852J852J633R464
7561E445N166n220l025j156j441m587m459j882Q36r61j464r07M413K744N325Q304
7545G131k025o004J944P716O388m099k323J837n094l852k468K007R46N4l354K115
7529I19k149n482n044l346J55N870j201M500k080k653j877M612M220K685n993
7514f864m57K78r04q18N871M783m299Q32L879K634N43o560n133r16M261K189M927
7497D246P549j333J106J437n905q783k232k743j844M992L179m881m634M050L775
7482b021J795j67J765k189l480l825n36R254K322k706m095j993J081K784R45j536
$$ y = [-7185, -5615, -9343, -8408, -9201, -5758, -3650, -388, -118, -2478, 1963, 5994, 2027, 2649, 6672, -907, 693, 2671, 5191, 2102, -4621, -6378, -9386, -8210, -14177, -10684, -6932, -4652, -7504, -5652, -4019, 5445, 10611, 5391, 2366, 1210, -231, -4818, -9277, -11159, -10323, -11284, -12748, -13655, -9242, -6498, -1173, 7131, 5106, -898, 1046, 8762, 15150, 11051, 8728, 10565, 5471, 1619, -849, 1158, 2104, 2158, -1196, 919, -1230, -6712, -11756, -15102, -14947, -9077, -10278, -5778, -7858, -10511, -12388, -7776, -3556, -871, -6864, -7321, -7043, -7947, -8765, -2894, 1889, -2410, -1578, 2301, 4935, 5478, -1082, -6215, -7131, -2870, -681, 4246, 11795, 10462, 11568, 13005, 7100, -1683, -3915, -6658, -8502, -3510, -331, -5212, -9846, -5796, -2021, -226, -393, 1372, -817, -4297, -8122, -8658, 596, 2918, 212, -3883, -5876, -4795, -2011, -1066, -2602]
7466b602l28J318j806j32m689L596O059N22k889P4l485L502O96m136l45P518k887
7449a4P57m742Q65k497N148M20M783K121k153j844l301l243J410j568O96k507
7433e669q769k38N705l716l760M352O009J211M469M325k554o207qk619k466K093
7417g842J089J825k220j153k032j586N031k279j0222L988R322K716j556p21o57
7402f297N591l103J839P131n359l061k856K655K554M491K010J283Q574l73p157
7387G922l23N26R17k252Q09q69m665m445k457K387l010k075k859J875J81k046
7371a0384l47j841R85N60j112O451K711J666p16m812J772P525M930N632j091q888
7355C041j096j465l371K002L207J32J343j871o317R62j416k076j888M71N769L433
$$ y = [-2602, -2930, -1612, -3418, -3550, -8239, -4643, 1416, 1938, -951, -877, -4362, -860, -164, -4300, -4645, 2873, -14, 743, -3999, -3134, -5631, -483, -63, 4720, 6841, 4688, 2844, -457, -3700, -2290, -3858, -3162, -5669, -14438, -14676, -8971, -12687, -16447, -12095, -6086, -4875, -406, 3919, 1365, -4842, -4850, -7469, -9935, -7842, -6753, -4928, -7148, -8301, -10333, -11919, -6888, -9167, -19389, -15401, -6079, -3363, -4919, -5640, -6297, -706, -3809, -1970, 5161, -198, -3259, -6115, -3460, -906, 3585, 5595, 6878, 15452, 15079, 7922, 7599, 8125, 9042, 6790, 7599, 6730, 2065, -2380, -4837, -2450, -5460, -7535, -10394, -8519, -8338, -10384, -10731, -12572, -11587, -11027, -12139, -5688, -2977, -1311, -2027, -6839, -5067, 2458, 7388, 13020, 11929, 3041, 1945, 480, -2891, -889, 2318, 2450, 3793, 1922, -4395, -3433, -4849, -6925, -8813, -8342, -2573, 860]
7339H60p088o615k259l719K404M656R223k856l374R66O037K472K28p462M569J230
7323g28K810Q551m429m43l824m819p00O475p45j0K710q337k817L253J022N977
7307C946M711J12R57K265n760j067k462p20n396n895M192K002K64m41p188J397
7291i083j833J129K018k920l554J493J2654n81n208L881O672o52n314l995L204
7276b089L882L573k309J800k33o409J987M756J753n43J199n621k759K570j67J509
7260B899k407l265n15k977m321N037L290l338o545j645K996M251l525l142Q3O635
7244f489O861n598oJ692J361P14k110p474K537P130O502M222k769l465l53j751
7228A004L962n012j0892j216R091M362o89o251l891J206P588o024n37n628l222
$$ y = [860, -6228, -12843, -15102, -18821, -16417, -11761, -2538, -5394, -8768, -7802, -1765, 707, 935, -6527, -1958, -728, 2082, 10633, 6204, 5761, 1937, -2882, -3582, 2893, 2148, 2138, 4848, -3489, -6306, -3053, -2031, 3946, 8657, 8769, 9726, 11991, 6231, 5164, 2702, 1982, -3414, -9309, -5117, -3115, -2851, -3292, -10480, -9083, -10916, -9787, -7769, -10689, -14243, -12750, -96, -677, -5885, -2004, 4668, 4016, -1298, -5293, -2089, 1793, 5366, 3057, 4857, 4624, -1785, 202, 4958, 6711, 6168, 7367, 1746, -1013, 1557, 1390, 2899, 492, -2773, -3288, -6265, -10586, -5549, -2259, -5597, -12142, -13787, -10791, -6540, -10065, -13207, -13124, -6489, 372, -5226, -5232, -3540, -2179, -1465, -3575, -11049, -8512, -1382, 5120, 9342, 6573, 3108, 2755, 1004, 4966, -46, -10938, -12154, -3063, 1299, 610, -5641, -9532, -8326, -738, -6762, -7299, -12927, -16149]
7213a6149K180K874P056o459n222J546N03k161J0016K870M19J255o574K21M477
7198c148J018Q726j161j402N267M414l592q175j24N07m590M958N86l037J553j668
7182A32K601k428o124j267J613l962J698J1368P42o282o305k620N034O098n276
7167d978q27M117N249J936k448k773k931N184l539J430P00l894m553l663o25N952
7151e663N427l788j883L751L09L241k519m295O120O070j1045j0702j26K727M508
7136g868L40o16K319l856m521l103M814Q396N509L463m001m253q70J659K696K136
7120B244q3k28J329j356m811o671n03J319M299q23k57K168K868P362J410k174
7104F093k216k349k90K067j981l67j943l550P93l334l826N814O395k350k778J05
$$ y = [-16149, -13969, -11095, -4039, -10498, -15720, -14174, -13671, -15832, -5816, -2946, -2527, -1272, -7846, -7625, -3148, -2130, 6596, 5435, 4033, 9300, 13714, 10122, 1947, 1823, 2330, -2260, 2698, 3284, 247, 1800, 132, 2733, 305, -5819, -7086, -5473, -9435, -7737, 3631, 4373, -1909, -8214, -10834, -5800, 298, -4978, -5805, -1688, 3561, 5497, 3049, 276, -2655, 2529, -1010, 420, 1120, -2774, -7327, -10990, -11615, -5663, -236, -4024, -5907, -2156, -1847, 1394, -1125, -5420, 700, 6770, -4275, -14977, -15103, -12376, -7868, -7528, -8144, -5825, -9681, -14202, -17305, -12491, -4095, 1414, 4877, 876, -3377, -4247, -2588, 108, 2244, 2161, 1933, 3262, 1906, -2905, -9576, -10079, -8760, -4461, -5284, -5541, -3373, -505, 6857, 8267, 6093, 3877, 1528, 1238, 3305, 1324, 957, -986, -4536, -3743, -7077, -10903, -5089, 1306, -1044, -3822, -3717]
7088c717L514O48K265K148p9O50k163n042M57M149O99K806o758P64M93k214m99
7071a879J04l230n202K721L875j876m315K206K060k852q36M827N823p546j24L069
7055c175k299j02N506n568l722j575k623L897P747o75l239j171j869j753m267
7040a4888m541N839P219L781m572n559N671m72k432N153P395M478O48O13r72q863
7024a502m556j515K475J493P76j194m689k935N994L690j662j288l999K223N433
7009a256J160L36j680j295n85K896m916R51L288l261k560P522K171K208K035n169
6993A845J982O160o55n256N53L937o119j3517l151Q84L073m689l854m06P15M657
6977a3841P143O952k932j626q35J196j285p8l117q95J656P222O590O68J913l770
$$ y = [-3717, -203, 445, 2710, 4858, 4779, 5429, 3266, -1776, -1319, 2830, 3529, 6335, -423, 341, 834, -1380, -1879, -1775, -5005, -10207, -7486, -3611, -5487, -9802, -7596, -5536, -8388, -9224, -4397, 1426, -6120, -6244, -3175, -5474, -5576, -70, -5638, -9360, -10935, -13558, -9661, -1914, -2589, -5828, -6999, -8868, -10621, -14888, -19429, -13590, -6371, -2590, -7162, -12721, -7050, -7522, -9954, -4801, 2594, 7072, 7720, 8333, 7361, -1502, -6058, -7573, -5098, -3605, -2829, -4023, -8712, -11647, -5653, -1963, -3625, -4913, -8912, -6689, -1256, -96, 240, -1440, -2735, -3320, -424, -5340, -4389, -1101, -4362, -6922, 600, 2771, 4979, 7014, 1845, 3827, 9987, 9332, 4076, 4629, 8566, 2447, -11070, -14221, -13337, -10264, -14953, -18807, -19213, -18498, -13841, -6698, 254, -2678, -4304, -5139, -3943, -5228, -5306, -8423, -9318, -7662, -440, 6150, 6818, 8731, 4961]
6961D961p90n280j0006K622M204L078M526R56Q75k259j215J50L920J696o160k99
6945I79L82l121o180j44L6L588L585P57k635m399L14q20L983J0626p327O57P642
6928G923n500l488J27l348K06k674m279k04o06K824K209K977L026K093j58k24
6912I04k051k185j38j63j66J257j042r991N51J090K771N796P96m554R40J91J964
6895d030M838L605l901q957k207K284J024m437N25P509K894l411o5r53K131J862
6879a289j150M87K201j208k235r74m240k759o992K437J556j114N66l760L013O525
6863h936L951K20K982N966k372n034o016r074K804M764J267K244J714K879L038
6848C97m859k274P231L890q012l718L984Q277k860N84j628Q85P052j223l103m250
$$ y = [4961, 4171, -1109, -11115, -8493, -4289, -1211, 3315, 4271, 5146, 2887, 1672, 1822, 5742, 7438, 1278, 979, 1361, -1760, -7940, -8084, -8048, -4460, -875, -118, -2753, -7152, -6838, -7658, -3675, 6951, -376, 281, 7923, 2423, -1065, -938, -4286, -4080, -6754, -11033, -11237, -11843, -9019, -6810, -3833, -807, 1286, 1128, 904, -1147, -3332, -3470, -3633, -3799, -2542, -3584, -13575, -13024, -11934, -9163, -3367, -2571, -7125, -6185, -5994, -4030, 808, 4413, 512, -8445, -10652, -8368, -7344, -11781, -11256, -3747, -853, -4264, -4329, -5282, -3151, -1289, -2439, -1952, 249, -959, -3194, -4168, -8408, -11167, -18159, -15722, -14166, -15280, -14714, -18474, -15461, -8936, -4985, -4765, -1783, 4183, 1811, -3223, -9239, -18313, -15509, -10745, -9478, -7234, -5520, -2641, 397, -4462, -6736, 495, 4385, -3627, -7345, -3361, 4916, 2056, 2640, 1012, 1897, 8949, 7726, 4623, 373]
6832C73j102M671N170n471J415j974m582j682M969j897p777o201N951M904P374
6817D141K362k774o223Q63M140P73L72l204j704k803L610j628n408q798OP691
6801h584L713k343m754M213J656p064J554j778l603L998M859M408q3k225K168
6786c865L996M012N905j397l292j721m123m981M285J497j522k493K592K460N00
6771A853n670l607l434m072N730Q848j121J459N599o561j765K123M491K909L801
6756A0583N32p590l572n138l083J496J2910J882M629O661l60l942K98K64o362
6741I208k79m217K333K244L021k799j0621j193k608M272k731n141P959O756l452
6726B752m405q232L255J1628R33r33l880k747k879o216K309p38M51Q396L365L782
$$ y = [373, -729, 3942, 9112, 3641, 5056, 3082, -1500, -3182, 1787, -110, -7887, -14088, -8137, -3233, 4141, 6503, 3729, -2494, -1631, 2509, 3282, 3654, 450, -1254, -4057, -447, -2075, -7483, -16281, -16275, -8584, -4871, -7214, -11968, -7755, -6099, -13163, -11609, -13387, -16990, -12992, -8133, -3725, -3808, -6033, -3865, 131, 4143, 10048, 8651, 5359, 3638, -485, -5466, -1181, 316, -1206, -3699, -1107, 1353, 1853, -3817, -7424, -10858, -14930, -9200, -352, -1473, -14, 5585, -976, -2741, -618, 3873, 6782, 10583, 11115, 3525, -47, -5185, -8268, -6772, 6138, 8020, 12649, 19310, 18950, 15008, 15306, 15570, 9208, 8929, 4712, 7045, 9289, 12310, 9511, -1110, -2303, -4911, -639, -3370, -8511, -552, 6204, 2752, -1653, -9885, -6630, 4998, 5931, 4998, 1118, -1629, -4508, -10724, -8415, -9153, -8702, -306, 3059, 6841]
6710F841m542J40M00l097r08n429K000L172j970L634J0023N61k636J259J875p97
6694A0526J022p762j578K076l593J551R61l602K355K153K928l103k387K613q28
6679C332k54p529K833L592j108m085l709J557n22N624M267L188l132m211k230
6664b387o61k937k535m32O365K197j05K99J300L229l60m295J094n815j713k183
6648h939m069J055L102o33J0122O327o039q945L26J44m018K823L363j751J80L177
6632c775J270l126o29L325q53K332M204J952l512L272J022n707L023O340j516
6617G622m186o008o829R02j368K002M190J515k949k088L047M245L652o694Q3J405
6601a459L638M161m47M86j942k692N77l249n89K994k072m552m529N516M587l788
$$ y = [6841, 2299, 2439, 2839, -258, -1166, -6595, -4595, -1423, -3393, 241, 10264, 10825, 8189, 9448, 11323, 10526, 11548, 3786, 2208, 4284, 691, 2242, 3203, -399, 1956, 4109, 7037, 3934, 1547, 4160, 3332, 3078, -4451, -1618, 1974, 866, -3219, -6928, -5371, -5893, -269, 3998, 7186, 4054, -157, -2387, -3048, -5985, -8520, -8952, -2587, -390, -495, -196, 1104, 4333, 3973, -322, 772, -5043, -6756, -8939, -13008, -11953, -8851, -9484, 638, 6965, 926, -8019, -7693, -7549, -11567, -8744, -5381, -7132, -6952, -3775, -2505, -5631, -6260, -2935, -3788, -1456, 2748, 4700, 1188, 4460, 5482, -225, 2798, 9138, 7622, 3436, -2572, -9401, -8499, -9867, -7865, -3675, -2160, -5109, -7197, -4150, 95, 3747, -2947, -2864, -1459, 2179, 6340, 5893, 6379, 4437, 1745, 2322, -927, -1516, 1478, -594, -5146, -9675, -4159, 428, -3360]
6585c360J245j567k687L493K053M126j177m470K706O651l18j624n233n848k659
6570h669m82P27r80K669L953L493l994n270N446J623L25O32k849m132n278J529
6554a1257n04J418J2648J350p291k044J597M468r05k814l58R2L732L418j032p422
6538d904l825O26O05L724K101l858j002k174l214L548M959K028L11Q70L938k89
6522C444m205m243K618p671p267K063K536K298J96o549O294Q220j050l242J632
$$ y = [-3360, -2115, -3682, -6369, -2876, -823, 3303, 2126, -2344, 362, 7013, 6695, 5071, -162, -6010, -8669, -9151, -8424, -9404, -6735, -2782, 711, -3283, -8553, -3107, -1484, -1159, -527, -3376, -7508, -12786, -11257, -11761, -10343, 2305, 3655, -3636, -5680, -4083, 385, -520, -3334, -3692, -3600, 132, 3550, 2518, -4904, -8729, -8103, -7498, -3774, -1673, -5531, -6533, -8707, -11921, -8373, -3414, -1386, -1075, -205, 3733, 3444, -761, -5004, -2386, -10057, -17324, -15261, -12725, -10427, -10231, -16780, -10486, -2266, -3316, -6558, -4926]
$$ [...]
##END NTUPLES=NMR SPECTRUM
##END=
