##TITLE=Analysis number 328650
Compound Code cc 26523
Book Reference 510/58
Project Code adrs
Chemist Name jimp
##JCAMPDX= 6.0         $$ Bruker NMR JCAMP-DX V2.0
##DATA TYPE= NMR SPECTRUM
##DATA CLASS= NTUPLES
##ORIGIN= Bruker BioSpin GmbH
##OWNER= nmr
$$ XWIN-NMR		Version 3.5
$$ Fri Jun 22 11:12:47 2007 GMT Daylight Time (UT+1h)  MAYBRIDGE\nmr@NMR_250MHZ
##.OBSERVE FREQUENCY= 250.131544655141
##.OBSERVE NUCLEUS= ^1H
##.ACQUISITION MODE= SIMULTANEOUS (DQD)
##.ACQUISITION SCHEME= undefined
##.AVERAGES= 16
##.DIGITISER RES= 18
##SPECTROMETER/DATA SYSTEM= dpx250
##.PULSE SEQUENCE= zg30
##.SOLVENT NAME= CDCl3
##.SHIFT REFERENCE= (INTERNAL, CDCl3, 0, 16.522)
##AUDIT TRAIL= $$ (NUMBER, WHEN, WHO, WHERE, WHAT)
$$ ##TITLE= Audit trail, XWIN-NMR		Version 3.5
$$ ##JCAMPDX= 5.01
$$ ##ORIGIN= Bruker BioSpin GmbH
$$ ##OWNER= nmr
$$ C:\u/data/dgb/nmr/ADRS/1810/pdata/1/auditp.txt
$$ ##AUDIT TRAIL=  $$ (NUMBER, WHEN, WHO, WHERE, WHAT)
(   1,<2007-06-22 11:12:22.47 +100>,<MAYBRIDGE\nmr>,<NMR_250MHZ>,
      <created by zg, POWCHK disabled, PULCHK disabled
       configuration hash MD5:
       76 6E 9A 78 1E 09 19 81 EC 84 63 8F B0 6A 59 2D
       data hash MD5: 64K
       13 A8 56 61 9E 01 CC 80 8F 2E C7 5E DF 3D 38 BC>)
(   2,<2007-06-22 11:12:35.88 +100>,<MAYBRIDGE\nmr>,<NMR_250MHZ>,
      <Start of raw data processing
       ef LB = 0.3 FT_mod = 6 PKNL = 1 SI = 32K 
       data hash MD5: 32K
       ED 98 39 FA 98 A3 76 7D F1 89 C2 09 55 4E 05 E0>)
(   3,<2007-06-22 11:12:37.94 +100>,<MAYBRIDGE\nmr>,<NMR_250MHZ>,
      <apk 
       data hash MD5: 32K
       B8 84 99 18 D8 43 79 EA 9B CD 8F F6 84 8A D7 13>)
(   4,<2007-06-22 11:12:39.00 +100>,<MAYBRIDGE\nmr>,<NMR_250MHZ>,
      <abs ABSG = 5 
       data hash MD5: 32K
       3A 45 13 D8 34 75 1C FE 7B D3 AC C7 9B 07 09 96>)
$$ ##END=
$$ 
$$ hash MD5
$$ 5C 3F BD CF 6D 74 BA E4 55 5B 71 58 CE 33 8B CF
##$RELAX= 
##$RELAX= 
##$RELAX= 
##$RELAX= 
##$RELAX= 
##$RELAX= 
##$RELAX= 
$$ Bruker specific parameters
$$ --------------------------
##$DU= <C:\u>
##$EXPNO= 1810
##$NAME= <ADRS>
##$PROCNO= 1
##$TYPE= <nmr>
##$USER= <dgb>
##$AMP= (0..31)
100 100 100 100 100 100 100 100 100 100 100 100 100 100 100 100 100 100 
100 100 100 100 100 100 100 100 100 100 100 100 100 100 
##$AQSEQ= 0
##$AQ_mod= 3
##$AUNM= <au_zg>
##$AUTOPOS= <11 >
##$BF1= 250.13
##$BF2= 250.13
##$BF3= 250.13
##$BF4= 250.13
##$BF5= 500.13
##$BF6= 500.13
##$BF7= 500.13
##$BF8= 500.13
##$BYTORDA= 1
##$CFDGTYP= 0
##$CFRGTYP= 5
##$CHEMSTR= <none>
##$CNST= (0..31)
1 1 145 1 1 1 1 1 1 1 1 1 1 1 1 1 1 1 1 1 1 1 1 1 1 1 1 1 1 1 1 1 
##$CPDPRG= <>
##$CPDPRG1= <>
##$CPDPRG2= <>
##$CPDPRG3= <>
##$CPDPRG4= <mlev>
##$CPDPRG5= <mlev>
##$CPDPRG6= <mlev>
##$CPDPRG7= <mlev>
##$CPDPRG8= <mlev>
##$CPDPRGB= <>
##$CPDPRGT= <>
##$D= (0..31)
0 1 0 0 0 0 0 0 0 0.06 0 0 0 0 0 0 0.0002 0 0 0 0 0 0 0 0 0 0 0 0 0 0 
0 
##$DATE= 1182507141
##$DBL= (0..7)
120 120 120 120 120 120 120 120 
##$DBP= (0..7)
150 150 150 150 150 150 150 150 
##$DBP07= 0
##$DBPNAM0= <>
##$DBPNAM1= <>
$$ [...]
##$SUBNAM7= <"">
##$SUBNAM8= <"">
##$SUBNAM9= <"">
##$SW= 20.6930455092707
##$SWIBOX= (0..15)
0 0 3 0 0 0 0 0 0 0 0 0 0 0 0 0 
##$SW_h= 5175.983436853
##$TD= 65536
##$TD0= 1
##$TE= 296.16
##$TE2= 300
##$TE3= 300
##$TEG= 300
##$TL= (0..7)
0 120 120 120 120 120 120 120 
##$TP= (0..7)
150 150 150 150 150 150 150 150 
##$TP07= 0
##$TPNAME0= <>
##$TPNAME1= <>
##$TPNAME2= <>
##$TPNAME3= <>
##$TPNAME4= <>
##$TPNAME5= <>
##$TPNAME6= <>
##$TPNAME7= <>
##$TPOAL= (0..7)
0.5 0.5 0.5 0.5 0.5 0.5 0.5 0.5 
##$TPOFFS= (0..7)
0 0 0 0 0 0 0 0 
##$TUNHIN= 0
##$TUNHOUT= 0
##$TUNXOUT= 0
##$USERA1= <user>
##$USERA2= <user>
##$USERA3= <user>
##$USERA4= <user>
##$USERA5= <user>
##$V9= 5
##$VALIST= <valist>
##$VCLIST= <CCCCCCCCCCCCCCC>
##$VD= 0
##$VDLIST= <DDDDDDDDDDDDDDD>
##$VPLIST= <PPPPPPPPPPPPPPP>
##$VTLIST= <TTTTTTTTTTTTTTT>
##$WBST= 1024
##$WBSW= 4
##$XGAIN= (0..3)
0 0 0 0 
##$XL= 0
##$YL= 0
##$YMAX_a= 239021
##$YMIN_a= -196672
##$ZGOPTNS= <>
##$ZL1= 120
##$ZL2= 120
##$ZL3= 120
##$ZL4= 120
##$ABSF1= 16.522
##$ABSF2= -4.171173
##$ABSG= 5
##$ABSL= 3
##$ALPHA= 0
##$AQORDER= 0
##$ASSFAC= 0
##$ASSFACI= 0
##$ASSFACX= 0
##$ASSWID= 0
##$AUNMP= <proc_1d>
##$AZFE= 0.1
##$AZFW= 0.1
##$BCFW= 0
##$BC_mod= 0
##$BYTORDP= 0
##$COROFFS= 0
##$CY= 12.5
##$DATMOD= 1
##$DC= 0
##$DFILT= <>
##$DTYPP= 0
##$F1P= 14.0000005364418
##$F2P= -0.99999901652339
##$FCOR= 0.5
##$FTSIZE= 32768
##$FT_mod= 6
##$GAMMA= 0
##$GB= 0
##$INTBC= 1
##$INTSCL= 1
##$ISEN= 128
##$LB= 0.3
##$LEV0= 0
##$LPBIN= 0
##$MAXI= 10000
##$MC2= 0
##$MEAN= 0
##$ME_mod= 0
##$MI= 0
##$NCOEF= 0
##$NC_proc= -4
##$NLEV= 6
##$NOISF1= 0
##$NOISF2= 0
##$NSP= 0
##$NTH_PI= 0
##$NZP= 0
##$OFFSET= 16.522
##$PC= 1
##$PHC0= -54.20583
##$PHC1= 8.596018
##$PH_mod= 1
##$PKNL= yes
##$PPARMOD= 0
##$PSCAL= 4
##$PSIGN= 0
##$REVERSE= no
##$SF= 250.13
##$SI= 32768
##$SIGF1= 0
##$SIGF2= 0
##$SINO= 400
##$SIOLD= 32768
##$SREGLST= <1H.CDCl3>
##$SSB= 0
##$STSI= 32768
##$STSR= 0
##$SW_p= 5175.98343685301
##$SYMM= 0
##$S_DEV= 0
##$TDeff= 65536
##$TDoff= 0
##$TI= <Analysis number 999999
Compound Code 99
Book Reference 9
Project Code 9>
##$TILT= no
##$TM1= 0
##$TM2= 0
##$TOPLEV= 0
##$USERP1= <user>
##$USERP2= <user>
##$USERP3= <user>
##$USERP4= <user>
##$USERP5= <user>
##$WDW= 1
##$XDIM= 32768
##$YMAX_p= 390873140
##$YMIN_p= -242417
$$ End of Bruker specific parameters
$$ ---------------------------------
##NTUPLES= NMR SPECTRUM
##VAR_NAME=  FREQUENCY,     SPECTRUM/REAL,   SPECTRUM/IMAG
##SYMBOL=    X,             R,               I
##VAR_TYPE=  INDEPENDENT,   DEPENDENT,       DEPENDENT
##VAR_FORM=  AFFN,          ASDF,            ASDF
##VAR_DIM=   32768,         32768,           32768
##UNITS=     HZ,            ARBITRARY UNITS, ARBITRARY UNITS
##FACTOR=    0.157963299565203, 1,           1
##FIRST=     4132.6476996994, 0,             0
##LAST=      -1043.33573715361, 0,           0
##MIN=       -1043.33573715361, -242417,     0
##MAX=       4132.6476996994, 390873140,     0
$$ Real data points
##PAGE= N=1
##DATA TABLE= (X++(R..R)), XYDATA
$$ [...]
14470f7097k5246l3077J1260L6281M1420j6662L676L3048P085p7755o1966p977
14458a57010M8212N7781J7085K0755L1382k8481j1138J5273j796N0892J4478r8845
14446d1412q0169m7442L7285O6576p618l3451J6395l7317k1376P8891R6787J08474
14434A35623O4570k4599p7866j5057l7839j5267k9188K9226N1920j6129n0510
14423A4884l2928l4P7024p849j8156M5503J10830k4460j21789P082j3206O017
14411D2918J9872K7589l2487j2890j8182M776n0479k7269j9764P3164M7100m0916
14399A3432k5525m0934J196M6995M787l3192N408n194K7141k769J0704Q922q986
14386A985l7522K7066j04395o2589K1418M0431P7978J31728L6725o3946q8876
$$ y = [-67097, -92343, -125420, -114160, -77879, -36459, -53121, -49445, -16397, -9312, -87067, -149033, -157010, -108798, -51017, -33932, -13177, 18205, -10276, -21414, -6141, -7937, 42955, 57433, -41412, -121581, -169023, -131738, -65162, -72780, -106231, -89836, -127153, -148529, -69638, 27149, 135623, 200193, 175594, 97728, 82671, 44832, 29565, 377, 29603, 81523, 65394, 14884, -18044, -18078, 58946, 51097, 32941, 78444, 189274, 164814, 43025, 50107, 36901, 42918, 62790, 90379, 57892, 45002, 26820, 31596, -18883, -46152, -65916, 7248, 54348, 13432, -12093, -53027, -51831, -4836, -49, -33241, -27833, -33027, -5886, -8655, 2049, 10971, 1985, -35537, -8471, -112866, -175455, -154037, -113606, -35628, 96100, 132825, 68879, -19997]
14375a9997l9280Q9258j3210j8770o6728L5688J3711K1630J6309L6466L180k6364
14363C1893J8863L4922o1989l2155N0608M557k5624m056j0217n556M405J6791
14351B2442j5420o7347k9507j991J8302K4988J8316K5937M5573j9727M8513M2230
14339A12309m8759l7273j6849l147l6103k4945j6688O3536L2691o567L5537R177
14327F2919K646l2705J2908j2843K957l1154L3880k1120n5533l4654l9441O435
14315a05705r120O5693m2712k340N4697l6040K168N7889L4296k515r380l6661
14303b9730l4467p63p080K3922K0235l6198J681R1877j9934J2938O1807K4072
14291A08360j7750m9312k9177L5435j2187k9189K8888k5612m3564n225L9512Q950
$$ y = [-19997, -59277, 29981, 16771, -1999, -68727, -33039, -19328, 2302, 18611, 55077, 58257, 31893, 50756, 85678, 23689, -8466, 42142, 46699, 21075, 17019, 6802, 1246, 5651, 22442, 7022, -60325, -89832, -91823, -73521, -48533, -30217, -4280, 41293, 21566, 70079, 112309, 63550, 26277, 9428, 6281, -29822, -54767, -71455, -7919, 24772, 18205, 53742, 62919, 65565, 32860, 45768, 32925, 35882, 4728, 38608, 17488, -38045, -72699, -112140, -105705, -114825, -49132, -91844, -94184, -39487, -75527, -73359, -15470, 18826, 16311, 6931, -29730, -64197, -64960, -72040, -48118, -27883, -64081, -62400, 29477, 9543, 22481, 84288, 108360, 90610, 41298, 12121, 47556, 35369, 6180, 35068, 9456, -34108, -39333, 179, 9129]
14279I129K4019o810n2321j11857n6344K6168M4051N4476k2837K8789L2591J1216
14267a9730J6310m4075o772K2560L2611j3689O4092M4051n576o3744m8230m0167
14255f2359Q9559J4547K0870M338K8826q3893l3862K183l0908l5891m6648o997
14243a40235R9532O8754n6896P816R5502K3327r7785k1191m5782k3242K0677J06079
14231C6556N0603k4483p9583k266k2844n0776p5489j383L3707K6417O3230j1137
14219e7448l6206Q107Q86M5263M837K7110M7312K4590k8630o7380l386L9278K4501
14206B8834J150M5103k3017m7449m9207n703K8744O4629k1032o5381k7469L5128
14194c5670N1526J5113P63L8153j5044L5104K6102n3105J2705n3776J0014q621
$$ y = [9129, 33148, 26338, -25983, -137840, -194184, -168016, -123965, -69489, -92326, -63537, -30946, -19730, -3420, -47495, -54267, -31707, 904, -12785, 51307, 95358, 89782, 26038, -22192, -62359, 27200, 41747, 62617, 66955, 95781, 11888, -21974, -19791, -50699, -86590, -133238, -140235, -40703, 28051, -28845, -21029, 74473, 97800, 15, -21176, -66958, -90200, -69523, 36556, 87159, 62676, -16907, -19173, -42017, -92793, -168282, -169665, -135958, -109541, -46311, -57448, -93654, -85547, -84661, -39398, -34561, -7451, 39861, 64451, 35821, -31559, -34945, 4333, 28834, 29984, 75087, 52070, 4621, -44586, -50289, -21545, 43084, 22052, -43329, -70798, -35670, 15856, 30969, 31732, 69885, 54841, 89945, 116047, 62942, 75647, 21871, 31885, 23264]
14182B3264o738l8619r8774l926K0306J2595J03897K8765r7342n973q785k7685
14170i9015k0095J1140K2629k4102r4889O8223J01710Q8867j3856l5440M6969
14159E2141L2336j9511l8657J2519N4851L8103o9975p9743L5016l1924k5100M6687
14147F743J09512p174l3593j1144k7289l8497N762m691k4911M713l814k1871J6847
14134b9407r550j0072M5437M3553L2432L9034l8649r56P4217Q541k2306j3231
14122A19043L6827l2233k7616p6238l4673N6199K6543q6262J947P3803O9076J5005
14110A41421o0804p776L930K3904m8045k4642J07100K5566o7099k8778n8048k5830
14098a9101M9756J30p625M9281L0979k728K5572P4421K5301M688L8025K2432k342
$$ y = [23264, 16526, -22093, -120867, -124793, -104487, -91892, 12005, 40770, -56572, -62545, -71330, -99015, -119110, -107970, -85341, -109443, -204332, -136109, -34399, 54468, 40612, 5172, 52141, 84477, 64966, 26309, 38828, 93679, 131782, 61807, -17936, 17080, -14844, -39944, 6743, 116255, 109081, 75488, 64344, 37055, -1442, 4320, -371, -25282, -20569, -24383, -46254, -29407, -38957, -49029, -3592, 39961, 72393, 111427, 72778, 71822, 146039, 154580, 132274, 119043, 155870, 123637, 96021, 19783, -14890, 41309, 67852, -18410, -16463, 57340, 126416, 141421, 80617, 72841, 76771, 100675, 52630, 27988, 135088, 160654, 93555, 64777, 6729, -19101, 30655, 30785, 23160, 72441, 103420, 100692, 126264, 200685, 225986, 230674, 268699, 291131, 288789]
14085B88789m013k9161o2902q6579m1603j4131m9094j5615m6607k0268J16260
14074C5076N9943N6055j7613K392L8470j399k5327l6007k4255J6604k2642k746
14062G8551K0404M2558k3350j01343K0284K6887N6672O2240j8490j6435j1871
14051A36107L0526N1157p3980j7580M4671O3705J06293M7965P9636J24864K05894
14040G99258J51366M2172j64903j82273j47787r0423j01437r3008o7170j3429
14030A32366l1801m6536J5110M6064k9809m8419k0802l7583J6987K3411l3240
14019a4252P4603O1255R477L952m8420l8297k8401J5005J2722K0051j8048K0719
14007G0366P262n0647J1914J8267k1488k7974p70K8183O9975Q6702J68635K40935
$$ y = [288789, 284776, 255615, 192713, 106134, 64531, 50400, 1306, -14309, -60916, -81184, 35076, 95019, 151074, 133461, 135853, 174323, 172924, 147597, 111590, 87335, 103939, 81297, 78551, 98955, 141513, 118163, 16820, 37104, 63991, 120663, 182903, 164413, 147978, 136107, 166633, 217790, 143810, 126230, 170901, 234606, 340899, 388864, 468500, 593364, 799258, 950624, 992796, 827893, 645620, 497833, 407410, 305973, 212965, 145795, 132366, 100565, 54029, 69139, 115203, 85394, 36975, 16173, -21410, -4423, 18988, -14252, 60351, 121606, 131083, 135035, 86615, 48318, 19917, 34922, 47644, 67695, 49647, 70366, 77628, 26981, 38895, 57162, 35674, 7700, 6930, 35113, 105088, 191790, 360425, 601360]
13995F01360K31518P8934j61288k33187j05921o3367j12359p6495k2428n0660
13985H6107j4896M2266k372j476L1489j1093J6029J7521m5645o0446J9266M0061
13973A16811r3023k8475j8627J5670M553n7806r382L4233L2648k4651j4206m0178
13961h2433o382L3930M7366L3766k2219k7580n2882j7678R8169J16566J24330
13950B44953O3784J2951p7535j22081p3324k3984J2206M9334k8664r9946k5764
13939f8070L7128R395l8773K4244J0087N60K1362j5846r548L4420M5578N587N2413
13926A08537O178p4456j5198N0732l0947j6513K7844k6734r649K4212L8788j3715
13914F9079o1663j657L1479j8020K6191K3835k3416k0419q57K0025p6770n2567
$$ y = [601360, 832878, 911812, 750524, 517337, 411416, 348049, 235690, 159195, 136767, 86107, 71211, 113477, 111105, 109629, 141118, 130025, 146054, 163575, 117930, 57484, 76750, 116811, 23788, -4687, -23314, -7644, -3091, -60897, -70279, -36046, -3398, -28049, -42255, -82433, -88815, -54885, -7519, 26247, 4028, -23552, -76434, -94112, 4057, 120623, 244953, 308737, 321688, 244153, 122072, 48748, 24764, 36970, 86304, 57640, -42306, -68070, -30942, -21547, -60320, -36076, -25989, -25429, -4067, -19913, -29461, 4959, 50537, 56124, 108537, 114715, 40259, 25061, 75793, 44846, 28333, 56177, 29443, 19794, 44006, 82794, 69079, 7416, 5759, 37238, 19218, 45409, 69244, 45828, 25409, 24552, 44577, -32193, -84760]
13902h4760L5154n0212m6090L9366J05529n826J2654O8315K7075n3401p7767o233
13890c6196N8256K9231l4118J6505J7629m6917j5658M8344J2626O006r110m10
13878D6188M1303j4014j2382J7391m0937j15382n4007K650L6896L0668K5551N4811
13866A8736J8835k6942k7055k2022L9497j8042J0245K2741k6329j8788J5897P5645
13854F2418n1005j7225K3151N3385N6652k6170k7533m819l092K1075n5720o0003
13842b8886n5510n838J9727L81L3069k4142o9645N0109R8176M5924N9931k0499
13830A02797M360K1789n285j3934L8258J2691M2207l1481n3786o7024j8273O1898
13818I4217K121j6271L8612n6404l6795J07m3178k0351j0907O7733Q057j2235
$$ y = [-84760, -49606, -99818, -145908, -106542, -1013, -6839, 5815, 74130, 101205, 47804, -29963, -36196, 22060, 51291, 17173, 33678, 51307, 4390, -11268, 37076, 49702, 55708, 46598, 46188, 87491, 73477, 61095, 78486, 37549, -77833, -131840, -129190, -92294, -61626, -36075, 18736, 37571, 10629, -16426, -38448, 1049, -16993, -6748, 15993, -10336, -29124, -13227, 62418, 11413, -5812, 17339, 70724, 127376, 101206, 73673, 68854, 65762, 86837, 31117, -28886, -84396, -90234, -70507, -70126, -37057, -61199, -130844, -80735, 17441, 63365, 123296, 102797, 107157, 128946, 123661, 109727, 147985, 160676, 202883, 171402, 117616, 50592, 32319, 94217, 96338, 80067, 118679, 62275, 25480, 25587, -17591, -37942, -48849, 18884, 26941, 14706]
13806A4706J1541L1080N1837o743j2318l1667n5587m9383L9156K0012o3478j1635
13794f2479M9580l322K579L0970j0229K019P3841J6576P2177j6026j03898l4838
13782A6950N3624L1995m1449o9938J615p299O7596M5075M3727q7713r1029m108
13770d0954K6198M1736j5426p124k1151k8601J5414q153j0443j7242J0130P0714
13758A5098l690M175N4824P2450l4241k2525K8544J7849J0344L3595p7676r0130
13746H617P305K9442J0999n1505r015P6778M3133j5240o0637l6157j3644M377
13734e547O197j1936N9344M3548j2056K7950j4321k8619k3239J7613j3444m54
13722D5036M3535j8306l7559l0546L7268M5476Q6646K6784p9268n6465K6193K1614
$$ y = [14706, 26247, 57327, 109164, 102421, 90103, 58436, 2849, -46534, -7378, 12634, -50844, -62479, -12899, -16221, -13642, 17328, 7099, 9118, 82959, 99535, 171712, 155686, 51788, 16950, 70574, 102569, 61120, -8818, -7203, -14502, 53094, 98169, 141896, 54183, -36846, -40954, -14756, 26980, 11554, 4430, -16721, -45322, -29908, -38061, -48504, -65746, -55616, 15098, 11408, 15583, 70407, 142857, 108616, 86091, 114635, 132484, 142828, 176423, 98747, 8617, 15922, 45364, 56363, 4858, -4157, 72621, 115754, 100514, 39877, 3720, -9924, -5547, 650, -11286, 48058, 91606, 79550, 107500, 93179, 64560, 41321, 58934, 45490, 45036, 88571, 70265, 32706, 2160, 39428, 84904, 171550, 198334, 119066, 62601, 88794, 110408]
13710A10408P3111J21318N4959l6009o3948M3247K6658K5611l3692o8945p6065
13699A76653K4313Q322l2944n8767j9892O211k0716J6178l6733m6645M4871m1304
13687A9547j5742k2064N631M4771L5596K7442J7884Q0848P5982j5174o7711L5150
13675B22160P7094J6128Q104k510k4247j5730L9032j5173q9582K6394O9776L9110
13663C50556k7142K2715K4533J9328Q2123L2347j1584l6683L9757J3825J814n5141
13651D56448J7527M1722M2053Q0175M4705J8333K3973k0327R1340P5638M5173
13640I16760J03465J60311J47886J75358J69213L48446M96059O11417P64852Q39749
13630D733516J102966J586222K422480L945734O929745J1409405J4939571J0501468
$$ y = [110408, 183519, 304837, 359796, 323787, 259839, 303086, 329744, 355355, 321663, 252718, 176653, 200966, 209288, 176344, 117577, 97685, 103896, 83180, 99358, 62625, 15980, 60851, 19547, 3805, -18259, -12628, 32143, 67739, 95181, 113065, 193913, 269895, 254721, 187010, 222160, 299254, 315382, 323486, 320976, 296729, 280999, 320031, 304858, 215276, 241670, 311446, 350556, 323414, 346129, 370662, 389990, 472113, 504460, 492876, 456193, 495950, 509775, 511589, 456448, 473975, 515697, 557750, 637925, 682630, 700963, 724936, 704609, 795949, 871587, 916760, 1020225, 1180536, 1328422, 1503780, 1672993, 2021439, 2517498, 3128915, 3893767, 4733516, 5836482, 7422704, 9845184, 13790918, 20720663, 32130068, 47069639, 57571107]
13622E7571107l886979j4298629j3083098q453780n154220l145517j980331j220797
13614F347756q76283o46371n45955n34904m71737l02568k16502k35900q7848p8346
13604B351342n9946l7975L2829R1665L4391J2490J88914K46467K51823L02290
13594C414290L53174L86871M93076P06158R21287J228731J659789K000778K422167
13585A3586321L117482M300791O767142J1158969J9405992L2846731M7126338
13578A38309766M1652286k846616m7537331m6301929k8911345j6733204j0065182
13571B7566445o326658m061029k630693j938535j654721j680565j425593j045597
13563F803054p79045n88285m51999l77299k72576k37135o6786j16411o0422q778
$$ y = [57571107, 53684128, 39385499, 26302401, 17848621, 12694401, 9548884, 7568553, 6347756, 5471473, 4825102, 4279147, 3744243, 3272506, 2969938, 2753436, 2517536, 2429688, 2351342, 2291396, 2253421, 2286250, 2377915, 2412306, 2424796, 2613710, 2860177, 3112000, 3414290, 3767464, 4154335, 4647411, 5353569, 6274856, 7503587, 9163376, 11164154, 13586321, 16703803, 21004594, 27771736, 38930705, 58336697, 91183428, 138309766, 179962052, 177115436, 129578105, 83276176, 54364831, 37631627, 27566445, 21239787, 17178758, 14548065, 12609530, 10954809, 9274244, 7848651, 6803054, 6024009, 5435724, 4983725, 4606426, 4333850, 4096715, 4029929, 3913518, 3853096, 3844318]
13553C844318J03525J86180J36352K23187K96642M18798M64483O24237Q66177
13544G163899J162875J641753J967429K324660L119235M257624O383004J0683392
13536C8703871J8390448L1105591M6416549M5583897M787099m5722918m9821708
13529H9442829l1800518j8377019j0947571o803886m282947k738512j922586j768748
13521A0801042j677630j484662j247515q86334o02981m88859l86791l02659k73276
13512C450335j59963j80740j96160r4049r5381r6372l6661l6018J16316R4886
13502B766193R5497J91499K79491L73924M98813O85707P44757R70593J380416
13493G986890K127179L482649N959904R945628J4677012J4497875K487296j3000255
$$ y = [3844318, 3947843, 4134023, 4270375, 4493562, 4790204, 5209002, 5673485, 6297722, 7163899, 8326774, 9968527, 11935956, 14260616, 17379851, 21637475, 28020479, 38703871, 57094319, 88199910, 134616459, 180200356, 184987455, 139264537, 89442829, 57642311, 39265292, 28317721, 21513835, 17230888, 14492376, 12569790, 10801042, 9123412, 7638750, 6391235, 5504901, 4901920, 4413061, 4026270, 3723611, 3450335, 3290372, 3109632, 2913472, 2819423, 2724042, 2627670, 2591009, 2554991, 2671307, 2766193, 2861690, 3053189, 3332680, 3706604, 4205417, 4891124, 5635881, 6606474, 7986890, 10114069, 13596718, 19556622, 29502250, 44179262, 58677137, 61164433, 48164178]
13485D8164178j5942998j1046337o624957m024888k505248j595837j078262p26252
13477D619399o09466n84609o09506m44005k72007k02508k55408j46665p8696j50162
13467A266367j05628n8247n2962r7026m8512p0970k1325m4281j7445m183k0115
13456G25673k6689r0881k3955P366J8971O0409k0107n9825j701K2444q6445r1064
13444D34196k0882j0887K397p54k1399m8873k6217K6338L1042j9779K7811L9880
13432D12873l7277n577Q2371J7922r1265p5257r0894N0742J13606J34608J51729
13421F63581J9449r6182q7106o4985j11088q0268m4430k7615L376M0721J7975
13410B33428Q0857K6236M866L8018J4029J2245m4409m5032p7024J1013M2978r797
$$ y = [48164178, 32221180, 21174843, 14549886, 10524998, 8019750, 6423913, 5345651, 4619399, 4009933, 3425324, 2815818, 2371813, 2099806, 1897298, 1641890, 1495225, 1416529, 1266367, 1160739, 1102492, 1049530, 952504, 903992, 833022, 811697, 767416, 749971, 745788, 725673, 698984, 608103, 584148, 591514, 610485, 670894, 650787, 590962, 589261, 611705, 525260, 434196, 413314, 402427, 404824, 404070, 382671, 333798, 307581, 333919, 364961, 345182, 372993, 412873, 375596, 370019, 452390, 470312, 379047, 303790, 212896, 263638, 377244, 511852, 663581, 683030, 586848, 499742, 434757, 323669, 243401, 198971, 171356, 174732, 215453, 233428, 314285, 340521, 345387, 383405, 397434, 409679, 365270, 320238, 243214, 254227, 297205, 287408]
13398B87408o8036J4558J3752j7033n0054L2375M6734Q0694R7193R1389n211k2733
13386E01036q421j6928m8260J5286L555P9845J25052K08659K82140L47468P5726
13375A565158j51992l10576k91632k36468o9840J6097J1071j08701j55824p2575
13365A94718J5105K3840M5466N4729j6193l9177m6638r15n2871j6207L2220o0063
13353A34014K9110Q1130p6949l9879L6372Q2505J9979J8302M9865L8967O1910
13342D35326P895J2301k2679L0270J15126R1303J74458K58615M95879Q11463P85805
13331C195762L51577k98960q65377p69828m93465k70877j09555o4317l5944q8372
13321E50644j38870o5912j02933m3891O3302O3872M8490J8986m7826q9116n8002
$$ y = [287408, 219372, 233930, 247682, 230649, 180595, 212970, 259704, 340398, 437591, 528980, 523769, 501036, 492615, 475687, 427427, 442713, 446268, 526113, 651165, 859824, 1141964, 1489432, 1565158, 1413166, 1102590, 810958, 574490, 504650, 520747, 531818, 423117, 267293, 194718, 209823, 233663, 279129, 333858, 317665, 278488, 231850, 230935, 178064, 161857, 194077, 134014, 163124, 244254, 167305, 127426, 163798, 246303, 266282, 284584, 334449, 373416, 435326, 443221, 455522, 432843, 463113, 578239, 669542, 844000, 1102615, 1598494, 2409957, 3195762, 3547339, 3248379, 2383002, 1613174, 1119709, 848832, 739277, 674960, 639016, 550644, 411774, 345862, 242929, 199038, 262340, 326212, 374702, 393688, 345862, 256746, 198744]
13310A98744j1708n6673Q776R8434J23228j7748Q349L0150N748J1455q1948p6349
13298B40458N563k0106Q1529J41415J06250N4809J57646J50236K25186L88727
13288A531713O76320Q68658N32401k50122p67047q54729n52637l15882j69619
13279F99056j91795j14598L7004L7121r4619n8878m5161q3722N1460J5313j7522
13268B33659N2689J1541O0165m0896n6552m5309l8011K227N9128o655L6141P5710
13256C43837j5432m5964m0898N7339N393K148M0649M9776N5403M6943N3395M2447
13244E95036J64157K48712K51948Q8914k4581j80805l10693k66583j28294n2139
13234C85672J7810l2565p5175j8997k6079q1256q8499M5201P6060P5420K5680
$$ y = [198744, 187036, 130363, 139139, 237573, 360801, 343053, 351402, 381552, 387300, 398755, 316807, 240458, 246021, 225915, 307444, 448859, 555109, 609918, 767564, 917800, 1142986, 1531713, 2208033, 3076691, 3609092, 3358970, 2591923, 1737194, 1184557, 868675, 699056, 507261, 392663, 429667, 466788, 372169, 313291, 268130, 184408, 235868, 251181, 233659, 286348, 297889, 358054, 317158, 260606, 215297, 177286, 179513, 238641, 231986, 268127, 343837, 328405, 282441, 241543, 298882, 304275, 306423, 347072, 396848, 452251, 499194, 552589, 595036, 759193, 1007905, 1259853, 1348767, 1324186, 1143381, 832688, 566105, 437811, 385672, 403482, 370917, 295742, 276745, 250666, 169410, 80911, 126112, 202172, 277592, 303272]
13223C03272m3770p5868K164N673j9752o3301K581K0357M5763R5292L5149J13832
13211D21392K0710p2221p7735k8758j7933K6277L3011J1630J969K9461k1808j9647
13199C06348N2692K9910k6686j6159J6208K5374j5776L9072R7705k1172M422p0814
13187D21124m8420M436L8086J0644m4619j285q84M4943J1163o4565K0807M5618
13175D37048M9110j3626n1687N5234J4133Q4333J3227k0982r78k0581q177k0340
13163E16714J0028o2576l2623n3898q2652J00963L6139L1401N7243P0203J14347
13152G05289m9340j58440m8535k7376q709K5813J759l9170p5539n7667l0435m3239
13140A94411j177m8116J8356N3257K6266j7266j6608Q542m0467N2771N1054q6028
$$ y = [303272, 259502, 183634, 185798, 191471, 171719, 108418, 110999, 131356, 177119, 272411, 307560, 421392, 442102, 369881, 292146, 263388, 245455, 271732, 304743, 316373, 318342, 347803, 325995, 306348, 359040, 388950, 362264, 346105, 362313, 387687, 371911, 410983, 508688, 487516, 491938, 421124, 372704, 377140, 415226, 425870, 381251, 379966, 379082, 424025, 435188, 370623, 391430, 437048, 486158, 472532, 420845, 476079, 490212, 574545, 587772, 566790, 565812, 545231, 537054, 516714, 526742, 464166, 431543, 377645, 294993, 395956, 432095, 463496, 520739, 590942, 705289, 655949, 497509, 448974, 421598, 412889, 438702, 440461, 401291, 325752, 268085, 237650, 194411, 193234, 145118, 163474, 216731, 242997, 225731, 209123, 217665, 177198, 229969, 281023, 194995]
13128A94995m8361K6804q100j02828m7732K1434m752L725L4552R807k73K2957
13116A02228J0378N5688K6821J16333P6557O3733J01551K15591J75933O3355j54476
13105H53692k64567k28405p6972j1048O6024n724q9647m5267j8198Q428M5569
13094B33885J7101K2597M4672L4409N9821k3286k9380M0655K1430r0105j202n1547
13082B79050K1626k360J5819J5040J0409k3440L2170J18958O8419j3579n014l2501
13070D84597R200l2773M5090J41464K11745K17302K28072J78536j6060k21436
13060A245737k82753k37469j04460o5688m9270r3772p6775M3303L8390P6077M896
13049D98216q9149j25181j02899k8173L0173K4923m0095p4222K835n2026q4914
$$ y = [194995, 146634, 173438, 165338, 62510, 14778, 36212, 31460, 35185, 69737, 79544, 79271, 102228, 112606, 168294, 195115, 311448, 388005, 451738, 553289, 768880, 944813, 1008168, 853692, 589125, 360720, 283748, 272700, 338724, 333000, 243353, 198086, 179888, 188316, 233885, 250986, 273583, 318255, 352664, 412485, 389199, 359819, 400474, 421904, 331799, 330597, 279050, 300676, 298316, 314135, 329175, 339584, 316144, 348314, 467272, 535691, 522112, 517098, 484597, 493797, 461024, 506114, 647578, 859323, 1076625, 1304697, 1483233, 1467173, 1245737, 962984, 725515, 621055, 555367, 506097, 412325, 335550, 378853, 417243, 493320, 498216, 409067, 283886, 180987, 152814, 182987, 207910, 167815, 93593, 96428, 44402, -40512]
13038d0512Q4007K5342L6106J0875k7092n1060j4522O2413p4959o3702Q1813R6885
13026A25594l5737p1420k9152M1814J15068L8670M4272R3679J0360K1637p4953
13015B79832j33213n1081m6789k7813j6312K8371M4181K0361K2087K0642J0000
13004A50266o2203j04426l7691O2905j5007k4948k9950l945P4549K6277k4048
12993A1779J602L0359o8327o4027k8656L3881O4941j1649K231K2593l222l5826
12981d4321m2891L0540j5447l4663j3639O4250Q7658k9874j9586m592P879M9093
12969C4407j3324n694n9441q4933L2495R6509K594O0572k2430r666R764k1522
12957A9331n2197l5023l4045M7004J03336l2646n5853l2806n041K8815M8077K9806
$$ y = [-40512, 43495, 68837, 104943, 115818, 88726, 37666, 23144, 85557, 10598, -53104, 28709, 125594, 89857, 18437, -10715, 31099, 146167, 184837, 229109, 322788, 333148, 354785, 279832, 146619, 95538, 48749, 20936, 4624, 32995, 77176, 97537, 119624, 140266, 150266, 88063, -16363, -54054, 8851, -6156, -31104, -61054, -64999, 9550, 35827, 11779, 13381, 43740, -24587, -88614, -117270, -83389, -18448, -30097, -27866, -5273, -8495, -44321, -87212, -56672, -72119, -106782, -120421, -56171, 31487, 1613, -17973, -22565, -14686, 34407, 21083, 15389, -44052, -128985, -96490, 19, 2613, 63185, 40755, 31089, 40853, 19331, -32866, -67889, -101934, -54930, 48406, 15760, -40093, -72899, -77940, -49125, -1048, 28758]
12945B8758p4853J5787R5533P1830l445j7143l738j6407l9193j06282j1134K2382
12933c7905M83J9457J2455l4311M3254L4251l2154O458j7165l5597k2098P4024
12921A1152N1097P216o3334m7682J0768Q6077K7206j0756j03388p0082o885L0579
12909g8032R7093O6370K0725j5818j346m4293p8414J8888O8375k5395k0869k889
12897D395J2562J0637q2621K3940O8380n2710k1713J5386M6590L4989j8148m6304
12885d617K1439L1336J4437j2797r4854j9644J8442l7370J069L8598P5305M983
12873C6327k3940k7603J5246M0041M7980m3595p8562j4388O1368L1773k8254m956
12861A1437J493l8324K2633q683j0370k8943J2438m655N148k3884l6634j2979
$$ y = [28758, -46095, -30308, 65225, 137055, 133610, 116467, 112729, 96322, 57129, -49153, -60287, -37905, -37422, -17965, -5510, -39821, 3433, 37684, 5530, 11988, -5177, -40774, -62872, 11152, 62249, 69465, 6131, -41551, -30783, 55294, 82500, 71744, -31644, -101726, -108611, -78032, 19061, 85431, 106156, 90338, 88992, 44699, -33715, -14827, 53548, 28153, 7284, 4395, 16957, 27594, -55027, -31087, 37293, -15417, -37130, -21744, 24846, 59835, 41687, -4617, 16822, 48158, 62595, 49798, -45056, -64700, -46258, -83628, -82559, -43961, 31344, 36327, 12387, -15216, 30, 40071, 88051, 44456, -34106, -48494, 12874, 44647, 16393, 11437, 12930, -25394, -2761, -11444, -21814, -50757, -38319, -42974, -37826, -61710, -98344, -111323]
12849a11323N5827K2213p1435n4035j0522J9595P3695P077o1826L6281M3664l8652
12837h9441m7756Q157n078M5676K5366j5944L8509L9887n2425j7846M7392J8728
12825d775n8277P26K4381N7033k987o7506O953L0161N2814L0413n2776J2303N2798
12812H1261L490M1738M166l0510q1226p2762M7823K2638M0102N0487L4653l8565
12800A03295n0561o8183k8284L786k7741K1560J4036L5129K5585n4249j3077j1132
12788d9836J8898j4860k1163j2583j0989J04137L4252k6267l312k8884j7286j8676
12776d6569J0467j3122J2K8620J474l4280p7526l0378N9441N3501J3389M4280
12764I309J9958P022m7722j3318K6024N8016J9588j0405M2722l9959l5531j3516
$$ y = [-111323, -55496, -33283, -104718, -158753, -169275, -149680, -75985, -68908, -130734, -94453, -50789, -89441, -137197, -129040, -134118, -88442, -63076, -79020, -40511, -624, -53049, -70895, -23503, -4775, -63052, -62326, -37945, 19088, 16101, -51405, -44452, -14291, 38523, 68936, 16160, 28463, 81261, 84751, 126489, 130655, 100145, 18919, -53843, -6020, 16618, 56720, 107207, 141860, 103295, 52734, -15449, -43733, -39947, -67688, -46128, -32092, 3037, 28622, -25627, -38704, -49836, -30938, -45798, -66961, -79544, -90533, 13604, 47856, 21589, 18277, -10607, -27893, -46569, -36102, -49224, -49212, -20592, -19118, -53398, -130924, -161302, -101861, -48360, -34971, 9309, 29267, 36289, -11433, -24751, 1273, 59289, 78877, 68472, 111194, 71235, 35704, 22188]
12752B2188n8606m4628M9481J4712l7416M012K6000k2588O1194j5531L1446M6149
12740G6413K9650m3071j6286J054K0006r392o6755K1579J3750r089J0607J2633
12728D1099L6290m8495n3149K664N2381L9404k3633j3687k6770n3874l765L9291
12716a2244j9693l9389K1795O7720j4781n8084l7775m981R522m7561r226L6576
12704a08121J9004N2113J14347k1661J5992L8631m1349n8908l2302N539J1517
12693e198L6511j6702P9174J55968j9596j29290j11152m3010k9265j172J08410
12682B4678j6196K2504L7183l2109J025n2758r3790Q1334M9724K9413m0695k6955
12670a6642j2257j0730L3664J3413O741O968l2048O0280l0659q2775k7104M2729
$$ y = [22188, -36418, -81046, -31565, -16853, -54269, -50257, -24257, -46845, 14349, -1182, 30264, 76413, 106063, 62992, 46706, 47760, 67766, 58374, -8381, 13198, 26948, 17859, 28466, 41099, 77389, 28894, -24255, -21591, 30790, 70194, 46561, 32874, 6104, -47770, -51535, -12244, -31937, -71326, -49531, 18189, 3408, -54676, -92451, -97432, -87910, -135471, -144697, -108121, -89117, -37004, 77343, 55682, 71674, 110305, 68956, 10048, -22254, -16715, -5198, 31313, 14611, 93785, 249753, 230157, 100867, -10285, -53295, -82560, -83732, 24678, 8482, 30986, 68169, 36060, 37085, -15673, -109463, -28129, 21595, 51008, 10313, -16642, -28899, -39629, -5965, 7448, 14189, 21157, -10891, 49389, 18730, -64045, -91149, -48420]
12658d8420p876J7812j2839L4259n7787l8255J718M0430M4038J2015J113j4202
12646b7994m000L939l8695l38R741M479K6217J0270l7493M1487K9872J8228L4336
12633G0049L2430k7542j4506l6351l3970l6981L7434j809M6018l2098l9910J1258
12621b5978R7413M4413J4486l1637k1301j2657K4450l3310j9366L9802O18l3583
12609D3350j7000m5828n6908Q679M3276K0640M4530K6876o224O0151L3695k1561
12597A33676O110m4234j0321m0943N4328O314m8242k771L534o8664M365K7492
12585B0644n2890l9209K3156p645K575P5308Q1807K1823o5713j23773k6185N0471
12573c9631M6742J0132L3535L7382n4483n2684l1766P4603M9253K1506P0071l1219
$$ y = [-48420, -56296, -38484, -51323, -17064, -74851, -113106, -111388, -70958, -26920, -14905, -13792, -27994, -31994, -28055, -66750, -67088, -57347, -52868, -26651, -16381, -53874, -12387, 17485, 35713, 70049, 102479, 74937, 60431, 24080, -9890, -46871, -9437, -11246, 34772, 2674, -37236, -25978, 71435, 115848, 130334, 98697, 77396, 64739, 89189, 55879, 36513, 76315, 76933, 43350, 26350, -19478, -76386, -67707, -24431, -3791, 40739, 67615, 61391, 121542, 155237, 133676, 139786, 95552, 85231, 44288, 98616, 104930, 56688, 53917, 57451, -11213, -6848, 20644, -32246, -71455, -48299, -55944, -53369, 21939, 103746, 125569, 59856, -63917, -90102, -39631, 7111, 17243, 50778, 88160, 33677, -19007, -50773, 23830, 73083, 94589, 164660, 133441]
12561A33441q7305o2280N5410Q941p0830n2387l7042Q701J18445J12910k2099
12550A05905o741k0857j6316J766J5468m0581J9050P4869K9593l5565r0952K4364
12538F0003P1943k8930J2273j07901l3643M7828J9511o06L6277j0921j1555o0901
12526f622m70R3123N293L973l2620l3548l0678O5751M743o5858k5796M5523J0825
12513C3639o7397k7577K2948J1185k2400L9979J01583K2898J9860o285n7471k3960
12501D7002N9455n1154n0646R6065J18814o1765p7729J509L6508j7266l9750j7960
12489D3083m4391N2413J7220J7036N3724k3043o1392l6589l4542J5896L6742J1740
12477D7897L6207K4973K069J9244N8793n127o1682M5048K9006j3216O296O101
$$ y = [133441, 46136, -16144, 39266, 48207, -22623, -75010, -112052, -103351, 15094, 128004, 105905, 99164, 78307, 61991, 63757, 79225, 38644, 57694, 132563, 162156, 126591, 35639, 60003, 131946, 103016, 115289, 7388, -26255, 21573, 41084, 40478, 76755, 65834, 54279, -6622, -7092, 86031, 91324, 95297, 62677, 29129, -1549, 64202, 68945, 3087, -22709, 22814, 33639, -33758, -61335, -38387, -27202, -49602, -9623, 91960, 114858, 134718, 128433, 70962, 47002, 106457, 55303, 4657, 100722, 219536, 157771, 80042, 81551, 118059, 100793, 61043, 43083, -1308, 51105, 68325, 85361, 139085, 116042, 54650, 18061, -16481, -585, 36157, 47897, 84104, 109077, 111146, 130390, 189183, 184056, 122374, 167422, 196428, 183212, 189508, 195609]
12465A95609o0276j2945j7850j01031q0453J8784L7483k2127k237O38q52J57684
12453A12427J52594m7940r7936q0778m338j1108j3234L2317m2624l3478M3422
12442I324q240n9763j1043L4326M7474M1192k2679M0526o2674l7033J2364Q746
12430g480K2823O4464K6364K7990J815J2022J6885j1938n8615K7878l4937j0811
12418G6460N718O4730J325m4516j5615k7561o906K4713L1252k6183k9848J0671
12406F4240m7209J2545J6256r3837Q4509R4516m8553l2650n9787m7091R970O7354
12394B0263M6098K9854M792o9877q479N7096m358o5868k3338L3423k2231j5744
12382a8369K8117k523l2602o484J9807K9222j7763K266q1617N6313P2255N1363
$$ y = [195609, 135333, 122388, 104538, 3507, -76946, -58162, -20679, -42806, -45043, -44405, -45257, 112427, 265021, 217081, 119145, 38367, 34029, 22921, 9687, 42004, -620, -34098, 9324, 1084, -58679, -69722, -35396, 12078, 53270, 30591, 71117, 8443, -28590, -16226, -7480, 15343, 79807, 106171, 134161, 135976, 147998, 164883, 152945, 94330, 122208, 87271, 76460, 82178, 146908, 148233, 103717, 88102, 60541, 53635, 78348, 109600, 83417, 53569, 64240, 17031, 29576, 45832, -48005, 36504, 131020, 82467, 49817, -9970, -57061, -47091, 20263, 66361, 96215, 101007, 31130, 22651, 79747, 75389, 9521, -13817, 19606, -2625, -18369, 9748, 7225, -25377, -31861, -12054, 17168, -595, 1671, -79946, -23633, 48622, 99985]
12370I9985n30q9395K442l843k2884l1519O9721P6325k1453n1747K4140k4890
12358B6352r3608M753J16753N5865o0797j8496K1360J2064p5927r9237N953K6158
12346g8807J2820J3014j1790K2987J3027k6605M9808k0145n5776l226L3142J0226
12334d1325J09451J14859l3706o8522k3742J6428P8560l9748r437M3495k582q426
12322A35305m4153o2327n1126l7092Q4276M9961r1116m221j970N2767L2652k2850
12310D0106q4001m6136L6693O8622M5172J8002K5508j0794k0786o8136N2049m559
12298E1740N9772N7273j8677q9119j3094K6484k2460q530m2517K6904L2925K1884
12286H2585l7923L1490q518J1100m170L1447R0199J27804J34429R8633J52778
$$ y = [99985, 99455, 10060, 12502, 8659, -14225, -45744, 23977, 100302, 78849, 27102, 51242, 26352, -67256, -62503, 54250, 110115, 49318, 30822, 52182, 64246, -11681, -110918, -104965, -78807, -65987, -52973, -64763, -41776, -28749, -55354, -5546, -25691, -81467, -84693, -51551, -41325, 68126, 182985, 149279, 80757, 57015, 73443, 152003, 112255, 102818, 146313, 143731, 135305, 91152, 28825, -22301, -59393, 24883, 74844, -16272, -20493, -22463, 30304, 62956, 40106, -43895, -90031, -53338, 15284, 60456, 78458, 103966, 93172, 72386, 4250, 56299, 51740, 111512, 168785, 150108, 60989, 47895, 74379, 51919, 43389, 872, 27776, 60701, 82585, 44662, 76152, 67634, 78734, 74564, 106011, 196210, 324014, 458443, 557076, 709854]
12275G09854J81064L4826M1122p7041j58010j11797m2367K9888N7468J45345J39431
12264I49783j8552j71025k00950k30385j44703l3471k4258k2187p8188k3192k8929
12253b6057l9453K7201L5106M19Q2l0393R373l2047K6410L1975l058M0990l7266
12240C282m1012n1392M9878R7613O1567L9202n093o8171k0131l0472m2822r2566
12228a00117J4090K437O979M6591J5203p858K6715k4684n237J9245O4542M0743
12216I8649k3623o2758L9828K5838N5050j7170k8725M951K106L0317l7961j7577
12204F8925l8136J5236J5109j7294o6151P2609J27730K3367M918L7874M8455L4461
12192C27103j3852p7820n9175P2380J7175l3914R1903J86617K53873K88578K13923
$$ y = [709854, 890918, 925744, 966866, 889825, 731815, 620018, 577651, 607539, 665007, 810352, 949783, 931231, 760206, 559256, 328871, 184168, 150697, 126439, 104252, 26064, 2872, -26057, -65510, -38309, -3203, -2784, -2702, -33095, -23722, -55769, -29359, 2616, -442, 40548, 3282, -37730, -89122, -39244, 58369, 119936, 159138, 154045, 85874, 65743, 35271, -7551, -100117, -86027, -83590, -76611, -30020, -14817, -22675, 4040, -20644, -25881, -6636, 57906, 98649, 75026, 12268, 52096, 77934, 132984, 115814, 87089, 92040, 94146, 124463, 86502, 68925, 30789, 46025, 61134, 43840, -22311, 50298, 178028, 201395, 206313, 244187, 292642, 327103, 313251, 235431, 176256, 248636, 265811, 231897, 323800, 510417, 764290, 1052868, 1266791]
12181A266791J25158j725j39042j14271j23285q6843J42071J85325K03197J0982
12171A468358r2903j12922j01233k72238j84486q1948K7965K4788p5393o3973
12161E36015r2882j06952n0525K4511K5757K7712L7189J2120n3340n575M6532
12150D00562M4489n3670j24511j00401N0140O4764O6700M959K0350L573k1857
12139C55098p9061j9046M8455K997n8881o9520L5529L8558P788N0259j5614q513
12127B88049L3630k7111j4775K38o3935j03216q5909L1211L2256M6386J1035j02017
12115D5842p0615L6749j4077j8553k1757N557q646K4650k5108j352P4596l1177
12103c891r2744q2833m3245J07808P9732O3884N3259j0840r832L3312q879k8156
$$ y = [1266791, 1391949, 1390224, 1251182, 1136911, 1013626, 926783, 1068854, 1254179, 1457376, 1468358, 1375455, 1262533, 1161300, 889062, 704576, 622628, 650593, 675381, 599988, 536015, 443133, 336181, 285656, 310167, 335924, 363636, 400825, 412945, 359605, 354030, 400562, 445051, 391381, 266870, 166469, 216609, 281373, 348073, 353032, 373382, 376955, 355098, 276037, 256991, 305446, 308443, 249562, 180042, 215571, 254129, 261917, 312176, 296562, 288049, 321679, 294568, 279793, 280031, 216096, 112880, 26971, 58182, 90438, 136824, 147859, 45842, -24773, 11976, -2101, -20654, -42411, -36854, -45500, -20850, -45958, -47310, 27286, -3891, -96635, -179468, -222713, -114905, -35173, 28711, 81970, 71130, 61298, 94610, 85731, 57575]
12091E7575L1181k1602l8166j0774k155m463L1631O8945Q8189L3171j8894l4615
12079A80023J3070K2957Q37o2245l357L0728j9892N0746L0687k1390o2335k0698
12067A39131P7574j8328M5493P9799O4033j3858k4257K9142j9246n1866o8007
12056B39610r467N3800L0167l8783R678J3083n1235n4163n7150k9076N1112M4904
12044B02480j3211L5992q455j5319l1522l1528L9470M6362K0211N213j9263n807
12032B24623o587O3376M9864m9844o6131j7661l377j9276o0895R179o676n6001
12020F0594l2050Q036r258o3543m8330l2870K7331J110J1461m2200O6796N8638
12008E715r3996m2237P8600j0601P7137k1124j3263L1871J9663O406O6802j5214
$$ y = [57575, 88756, 67154, 28988, 18214, 16059, 11596, 43227, 112172, 200361, 233532, 214638, 180023, 193093, 216050, 216887, 154642, 151285, 182013, 162121, 212867, 243554, 222164, 159829, 139131, 216705, 198377, 243870, 323669, 387702, 373844, 349587, 378729, 359483, 307617, 239610, 230143, 283943, 314110, 275327, 285005, 298088, 246853, 192690, 135540, 106464, 157576, 202480, 189269, 225261, 216806, 201487, 169965, 138437, 177907, 224269, 244480, 249693, 230430, 224623, 218036, 281412, 331276, 281432, 215301, 197640, 194263, 174987, 114092, 123271, 116595, 60594, 28544, 36580, 27322, -36221, -84551, -117421, -90090, -88980, -77519, -119719, -52923, 5715, -88281, -130518, -51918, -62519, 14618, -6506, -19769, 12102, 31765, 38171, 104973, 89759]
11996H9759n8572p3375r992O4404P1949l3990m8059n2810p2350R220L0680O3155
11984a9981P503k8674K9986O633J5958M3792K0021k2526n8443n8103m6988j635
11972a12457P8881O7531m9754l4069M244m1338N1154J07320j1195K524p3707l8810
11960d9676k3931M6444K4122m906j4630P703K6898m2129m6838L1964K2603j0095
11948c2471m7168N3865P4176J6832o2489n3623J06122M4143n7670N937K8744l0420
11936D5978M342j6837l68o433O998L9627n0645l0749Q8735J967j7183O2064j7556
11923A09940n40J9135q0729Q303j1870o3585M8075K0325P166k5267p0355k162
11911d1564K3255M7229N4173k754o27q356Q826J1394j29j0177n3956m1366J4472
$$ y = [89759, 31187, -42188, -52180, 12224, 84173, 50183, 2124, -50686, -123036, -113816, -83136, -19981, -12478, -41152, -11166, -4533, 11425, 55217, 75238, 52712, -5731, -63834, -110822, -112457, -33576, 33955, -15799, -49868, -45624, -86962, -35808, 71512, 60317, 62841, -10866, -49676, -73607, -27163, -3041, -7947, -22577, -14874, 12024, -30105, -76943, -44979, -22376, -32471, -79639, -25774, 48402, 65234, 2745, -50878, 55244, 99387, 41717, 47654, 76398, 45978, 50320, 33483, 33115, 26682, 33680, 73307, 22662, -8087, 80648, 82615, 65432, 127496, 109940, 109400, 128535, 47806, 56109, 44239, -19346, 28729, 49054, 56220, 30953, -39402, -41564, -18309, 28920, 83093, 80339, 79712, 71356, 80182, 91576, 91447, 81270, 27314, -14052, 420]
11898D20K0256r21j6823q6181j524P2404Q5876o1645l3443o269K364j8933L9755
11885d664L6842K886N288j06210p1414m0249N768R9740J22846k785o0039j1457
11873b3448K2388Q900M5709J13275J2107m0289p8009q6929K1941j7428m1863P6116
11861A2470O5117k3495q6901k6323N1196N5455n2766j7352K2231k3459j1319O0759
11849B5613l1675j586j192N8803M290j0564K5729N43J1402o1286m1934l5041M9998
11836f900J2635r040j2274r80M3521J4087l6310k8357m5871n1322L7730N5946
11824b7135K9823j7767l8142o330N1875k716J1863k2672K616J5049n8776L3214
11812b9098L7764K4025N6931k5581K2725o52j9349O339j3445k9913k1170k0832
$$ y = [420, 20676, 19755, 2932, -83249, -84773, -12369, 73507, 11862, -21581, -27850, -25486, -44419, -4664, 32178, 35064, 40352, -65858, -137272, -177521, -171753, -72013, 50833, 48048, -11991, -23448, -1060, 7840, 53549, 166824, 178931, 138642, 60633, -26296, -4355, -21783, -63646, 12470, 77587, 54092, -32809, -59132, -7936, 47519, -5247, -22599, -368, -23827, -35146, 25613, -6062, -7648, -8840, 49963, 54253, 43689, 69418, 69961, 81363, 20077, -21857, -56898, -6900, 5735, -3305, -15579, -16559, 26962, 41049, 4739, -23618, -69489, -120811, -83081, -27135, 2688, -15079, -53221, -59551, -7676, -10392, 1471, -21201, -18585, -3536, -62312, -29098, 8666, 32691, 89622, 64041, 86766, 86114, 66765, 73104, 59659, 29746, 8576, -12256]
11800a2256P082j1633K399q70J4735Q877j8759N176J829l1510j1493M1765P5542
11787G0884o5440j3954L3698N6671p77O8205K4342n5070P351n5074q9307m2233
11775f0704O7442O7050L398M443J3586j9523p6565q5270o983K5199K1611l6033
11763h2349K6156K1738p355J9164o3644L4175P7742M4674l4872j09916Q454M1171
11751b4862j4466l6027o002n2850k6595L0021Q4967J6892j01604M7224P5757O671
11739h74K925j2L4978N5591J980j1861K2632J2955m6503l9739m8871n0893q7692
11726a55384K2933N6845L1359L3694o681k1185J801L6993K3731j7707k7690j3443
11714c4734k4635R8981J1892p498L8387M2331j9666o3077j14259k4110j5209M4004
$$ y = [-12256, -5174, -16807, -14408, -15278, -543, 8334, -10425, -5249, -3420, -34930, -46423, -4658, 70884, 5444, -8510, 25188, 81859, 81082, 149287, 173629, 118559, 125910, 70836, -18471, -60704, 6738, 73788, 77186, 81629, 95215, 75692, -873, -86143, -93126, -67927, -46316, -82349, -56193, -34455, -41810, -22646, -86290, -52115, 25627, 70301, 35429, -74487, -66033, -24862, -39328, -75355, -81357, -134207, -160802, -130781, -45814, -28922, -130526, -83302, -7545, -874, 2051, 2039, 37017, 92608, 94588, 82727, 105359, 118314, 71811, 32072, -16799, -67692, -155384, -132451, -75606, -44247, -10553, -17234, -38419, -36618, 375, 24106, 6399, -21291, -34734, -59369, 39612, 51504, 44006, 82393, 124724, 105058, 41981, -72278, -96388, -111597, -67593]
11702f7593N7801K5623k5546l1258p577r737l5044j0394R603J3346N1417J433
11690b7926l9179M142M1830L6401K9292o529o877J7542K743j2587K6674j1486
11678E4040p1416l82M5046k97j5038l654M7476N4347l0639l2557m1349L777O1928
11665G1282K6027M2601l910j6568M4176J4404m9437J8315J8958J5444N7131R0082
11653C28505R900M5926L4185k199n9052o7283j02118n2420r1258J7104M6975n5602
11641E2663Q687K5462j2217j7037M4050N974k0584J5333O760k0830J8760J54O0251
11628A67426N4588K1846K9439L36j2823j6039P414m1617j27704j0358M2507n2708
11616F2307q4211l1227K4845K5655J8345l3402J8819M5515k3128K1564M14j4932
$$ y = [-67593, -9792, 15831, -9715, -40973, -48550, -58287, -93331, -103725, -94122, -80776, -29359, -27926, -67105, -62963, -21133, 15268, 44560, 38031, 31154, 48696, 51439, 38852, 65526, 54040, -17376, -17758, 27288, 26991, 11953, 8299, 55775, 110122, 79483, 46926, 5577, 9354, 71282, 97309, 139910, 136000, 119432, 163608, 178012, 128575, 146890, 165848, 181292, 238423, 328505, 338405, 384331, 418516, 416317, 357265, 289982, 187864, 135444, 44186, 61290, 108265, 52663, 61350, 86812, 74595, 57558, 101608, 107582, 86998, 102331, 109091, 88261, 107021, 107175, 167426, 222014, 243860, 273299, 273635, 260812, 244773, 252187, 210570, 82866, 72508, 115015, 62307, -21904, -53131, -28286, -2631, 15714, -17688, 1131, 46646, 23518, 45082, 45496, 30564]
11604C0564L523L2505j0359O63n283l9453p4378j0181L4966J5743m6243J579L7501
11591b8853J76999J43486L5617J04861L0185n1357l2545q2627q0588k5044J7k6704
11579A63447n6529q7986M3654N8731N5452L3465O930n2390j6107n6742l142Q3193
11567A71976M4016L1443J14616Q1005N3729P2003O2855M9149p907r7005j58709
11556D17171q6470j8934m1944p8124j01647o7229o5112q103J7145K0581j3654
11545b6320K1738K1316n7668j9628j1461M8281O4290Q5137J0222L1872K0545j3059
11533A75265M1653R2150o6179m3200o552n4348j6201q7947p2557J772O037m5343
11521g5450m173L0185j9961K760K5075q740l7418L7730J1719j5410M7395J0698
$$ y = [30564, 34087, 66592, 56233, 56896, 51613, 12160, -62218, -72399, -37433, -21690, -67933, -66354, -28853, 148146, 291632, 327249, 432110, 462295, 410938, 378393, 295766, 215178, 190134, 190151, 163447, 106918, 18932, 62586, 121317, 176769, 210234, 217164, 164774, 148667, 91925, 88783, 171976, 215992, 247435, 362051, 443056, 496785, 568788, 631643, 680792, 672885, 575880, 417171, 330701, 311767, 269823, 191699, 90052, 22823, -42289, -50392, -33247, -12666, -26320, -4582, 16734, -40934, -60562, -72023, -23742, 40548, 125685, 135907, 167779, 188324, 175265, 216918, 309068, 242889, 199689, 193137, 138789, 122588, 34641, -37916, -36144, -30107, -75450, -79623, -49438, -69399, -66639, -41564, -50304, -87722, -49992, -38273, -53683, -6288, 4410]
11509D410K8165L7905p395k2635K4726M7533o4697k249J1568k280l5843k8512
11497i304J03798J30677Q0091L2300l0754q9733j3387J6409K1193p1496m8711
11486A21083o0352j9484j5250m362L8266N8973o563o283j4503N7792L0604J8127
11474A98048j1258M6224O377L4250l5548J33M8438J15210M5594l8295m5527j38513
11462B25133o5117Q025l913k0790k9670n7605j05371j2115L2530j4600p4556M8299
11450f9750J14294L2722L1819j8598n9499k5834M2252l9737K8253L5705j7853
11439E3774l2073l995L4930J0410q4573r4164j7687P4292P1917O4060P72k9928
11427D7735j1936p8346l316O0843l9212m0594J3835o4701J6289J0032j4319j0321
$$ y = [4410, 32575, 70480, 63085, 40450, 65176, 112709, 48012, 45763, 57331, 55051, 19208, -9304, 94494, 225171, 305262, 337562, 306808, 217075, 203688, 220097, 241290, 169794, 121083, 60731, 41247, 25997, 21635, 59901, 118874, 112311, 106028, 91525, 149317, 179921, 198048, 186790, 233014, 239391, 273641, 238093, 238226, 286664, 401874, 447468, 409173, 363646, 225133, 160016, 168041, 164128, 143338, 113668, 56063, -49308, -61423, -28893, -43493, -118049, -69750, 44544, 77266, 109085, 90487, 30988, 5154, 47406, 7669, 35922, 71627, 53774, 21701, 17706, 52636, 63046, -21527, -115691, -133378, -59086, 12831, 76891, 77663, 47735, 35799, -42547, -45863, 14980, -24232, -64826, -50991, -115692, -99403, -89371, -103690, -114011]
11415a14011k8897M3150O3966O5167M2742j0699j6127k0723r072O0591l4954l7267
11403C866j4223O3348L6088j8969k7877p544J3683p9715n9251O5237j82r9406
11391a24945R959j1249j896m6730N9353N3248P774K150K4661J6699L6697j1905
11379A3816N23k0835N2830r784n2642m4378j5028J3534p5402j3105N4745M5595
11367e0131j7417j5705O4704J8791l0680J8780M6438Q050J7050M5841n3858m8297
11355C566q5644k2975m9678J8084M1360j1075j141N8111K1032n2646N3844J6966
11343a0196l7244M3703J1727j1210L6720K5068l9244L598J317M724J1740L4375
11331G5078k2779n2767J5790J3751k4605Q810p3597M1025P843O461J0607J8485
$$ y = [-114011, -142908, -99758, -35792, 29375, 72117, 61418, 45291, 24568, 15496, 76087, 41133, 3866, -10357, 52991, 89079, 70110, 42233, 34689, 48372, -31343, -90594, -25357, -25539, -124945, -114986, -126235, -128131, -174861, -115508, -62260, -54486, -52336, -27675, -10976, 25721, 13816, 14339, -6496, 46334, 36550, -16092, -60470, -75498, -61964, -137366, -150471, -95726, -50131, -67548, -83253, -18549, 242, -30438, -11658, 34780, 42830, 59880, 105721, 51863, 3566, -82078, -105053, -154731, -136647, -95287, -106362, -107503, -49392, -28360, -81006, -27162, -10196, -47440, -3737, 7990, -3220, 33500, 58568, 19324, 22922, 24239, 28963, 40703, 75078, 52299, -468, 15322, 29073, 4468, 13278, -60319, -19294, -11451, -4990, 5617, 24102]
11319B4102k9976r7438o8979M0328K6016m2590K8329m770K4761O9392O6323l6968
11307a470j6872M0312o7205k7595M708k1652K1354K7682J4663J4103L3314l3182
11295a1840N8941q044r6866l5121O4145M4249j2353j3514n2027M96r333j8290
11283h9557K7691N450l0463R428l6461J0261N4261N1780j4307k5303J0865j64
11271b6519k3075J8974J0189L5472M3522K7452p534o8671O3262M3980K02O130
11259A23384k9950l78j5722n1113k5454m3112P672N4058K5291M850k600k6197
11247B0729O036M6047L9321K5793j3341j08490m8365N5360n9392p8019J5361K9239
11235f9721j7357J2618L3327L028M1643k1932l7675k0037J6735N6544L8491N1806
$$ y = [24102, -5874, -103312, -172291, -131963, -105947, -148537, -120208, -124978, -100217, -30825, 35498, -1470, -18342, 21970, -45235, -72830, -68122, -89774, -68420, -40738, -26075, -11972, 21342, -11840, 47101, 39057, -57809, -92930, -28785, 15464, 3111, -10403, -62430, -61934, -71267, -89557, -61866, -56416, -86879, -77451, -113912, -103651, -49390, 2390, -11917, -37220, -26355, -26519, -49594, -30620, -20431, 15041, 58563, 86015, 78481, 9810, 73072, 117052, 117254, 123384, 93434, 93056, 77334, 26221, 767, -42345, -34673, 19385, 44676, 49526, 46926, 20729, 26765, 72812, 112133, 137926, 124585, 16095, -32270, 23090, -36302, -114321, -98960, -69721, -87078, -74460, -41133, -38105, 3538, -18394, -56069, -76106, -59371, -2827, 35664, 87470]
11223H7470M2620o0748o7722j2263J8610j7951n5967m4729L6496K3065L0491L7934
11211A7306L1121l7557l54K5170M6715p5729m9488M3348K8523J487p7277j1983
11199e8718P703L1289N3493r232n5242r607o516K9586k0047R673J5570n430l9983
11186e7461m3015l9336L3396L3673K9242J10515N9254k723n5434k9036O0846Q258
11174A08179j3451m5064k6218o6846N5440l081l8382N6676k3307K6316N636m0200
11162d302o3046q3091M109R5239K7869L8584O7975k8117n2273k5468o700l1712
11150f0933O028j8112J2398N90R014J311L558M5337o3896m1216K9346K9447M7746
11137F18Q688o347k3814M296J1200p883m9973k2601n47p470k702L1357k1875j8549
$$ y = [87470, 130090, 69342, 1620, -10643, 7967, -9984, -65951, -110680, -74184, -51119, -20628, 17306, 48427, 10870, 10516, 35686, 82401, 6672, -42816, 532, 29055, 30542, -46735, -58718, -51015, -19726, 33767, 24535, -30707, -40314, -46830, -17244, -37291, -27618, -12048, -17478, -57461, -100476, -139812, -106416, -72743, -43501, 67014, 126268, 123545, 68111, 39075, 99921, 108179, 94728, 49664, 23446, -43400, 12040, 8959, -29423, 27253, 3946, 30262, 35898, -4302, -67348, -150439, -146330, -51091, -23222, 15362, 83337, 55220, 2947, -22521, -29221, -60933, -54905, -73017, -60619, -60029, -51015, -49704, -46146, -809, -64705, -105921, -76575, -47128, 618, 9306, 2959, -20855, -16559, -5359, -13242, -63215, -85816, -86363, -93833, -96535, -65178, -87053, -105602]
11123a05602K5455N3923J0838j20242l394L9876L0138N9193L478m6739p017n031
11111f5124J2411R5146N0261o4604j5392K2092o636p0946n4903j7851j1233Q344
11099a18435J5519K0350M942k0293o0545l0823O2995R0025L2865j0194N64k9625
11087d2655j9504N3353j5362l2872M5208J162j0665J7822j6923O0838M5783k1909
11075F4276p4757J1873K4469n3989J0984q853l1336Q424L5295M2535P813p1878
11063c5144M7527p290n7484k5654L7616K7351j1009M2413Q132o3340o9865J6531
11051i0216L0896O3824Q484M177K1408j9363j1326m4516L5015L270q009q5708
11039i2064J1659L137m785M365k7323L0824r528J5348n746j4577J9980r148m8351
$$ y = [-105602, -80147, -26224, -15386, -135628, -139022, -99146, -69008, -9815, -6337, -53076, -60093, -65124, -52713, 42433, 92694, 28090, 12698, 34790, 28154, -42792, -97695, -115546, -126779, -118435, -102916, -82566, -77624, -97917, -158462, -189285, -126290, -36265, -3400, -13594, -13030, -42655, -62159, -8806, -24168, -57040, -11832, -10670, -21335, -3513, -20436, 40402, 86185, 64276, -10481, 1392, 25861, -28128, -17144, -25997, -57333, -48909, -13614, 28921, 36734, -35144, 12383, 5093, -52391, -78045, -40429, -13078, -24087, 18326, 26458, -36882, -106747, -90216, -59320, 4504, 12988, 17165, 38573, 19210, 7884, -36632, -1617, 1653, -6356, -92064, -80405, -77268, -82053, -77688, -105011, -74187, -83715, -68367, -74113, -88690, -68710, -77858, -126209]
11026a26209j1273P7066J7186q0027j6615K1962L7531J4675N428K5875o787L8239
11014b949K0784J1493n20o6773l2084L4692O1399k2725k6821K0925k2023m8362
11002g2964r823J8988K7044J5524M4183j416k1047n8970J1765j3737j724N834
10990e6343j1670J3126N606M9271K2116J6575n1254p3782m424K6847J3004j1297
10978f2225K973l9256P1937R8332k3922j7719M1484l9762m9432N1678o0911j5335
10966d2158r4526k4345M1969P362J0905O2262M7853N6247M01k6396j3558R540
10954C5556l1807k3861O9140N964m9297m6377O2008o772o8085l3832k3857R753
10942a01467n150M4765k7198m749P837r891m1263L2438K984M135l3195L4780O8313
$$ y = [-126209, -137482, -60416, -43230, -123257, -139872, -117910, -80379, -65704, -60276, -34401, -41188, -2949, 17835, 29328, 28808, -37965, -70049, -35357, 26042, 3317, -23504, -2579, -24602, -72964, -82787, -63799, -36755, -21231, 22952, 21536, 489, -58481, -46716, -60453, -62177, -56343, -68013, -54887, -49281, -10, 22106, 38681, -12573, -86355, -90779, -63932, -50928, -62225, -59252, -98508, -26571, 71761, 47839, 30120, 71604, 31842, -17590, 34088, -26823, -42158, -136684, -161029, -119060, -111698, -100793, -38531, 9322, 65569, 65970, 39574, 26016, 35556, 3749, -20112, 49028, 54992, 5695, -40682, 21326, 14554, -53531, -87363, -111220, -101467, -106617, -61852, -89050, -93799, -85962, -95853, -137116, -104678, -101694, -97559, -130754, -95974, -27661]
10929b7661k5859R79p9627K0058j7992M8202P6861j4896j3868k4702j4245k0250
10917i3000J02583k470l9562m6931O43K4392J3634N192n0438k1292N4887O8738
10905A6376j420l0527O9807m5746l3792j8691j663n4480p920l6520J1603J24608
10893h365O6007l8891n4153K5682j9190R2206P0033q1j3246m1289k1427K3056
10881H0342j3182l3322q6222m3844p897N2303N433R576j2403p118K7500L492N215
10868b0127k2242n210O1158n2896k3789L85P2474L6798j7028j3494o6257j20611
10856a70839k9713K6499M1218k3382j1249Q9924J08798K2084n0684m5303l1376
10845g4023m2816l8156O6889M2997k512M9453J1838r194M5569O3675k0931k6618
$$ y = [-27661, -53520, -52541, -132168, -112110, -130102, -81900, -5039, -19935, -33803, -58505, -72750, -93000, 9583, 7113, -32449, -79380, -78737, -54345, -40711, -35519, -85957, -107249, -52362, 16376, 14956, -15571, 54236, 8490, -25302, -43993, -45656, -100136, -108056, -144576, -132973, -8365, 57642, 18751, -35402, -9720, -28910, 63296, 133329, 133248, 120002, 78713, 57286, 80342, 67160, 33838, -52384, -96228, -104125, -51822, -46389, -36813, -49216, -56334, -28834, -25342, -20127, -42369, -47579, 13579, -39317, -63106, -62721, 9753, 46551, 29523, 16029, -50228, -170839, -200552, -174053, -132835, -156217, -167466, -77542, 31256, 53340, 2656, -42647, -74023, -116839, -154995, -88106, -45109, -47621, 1832, 13670, 4476, 50045, 113720, 92789, 66171]
10833F6171K0915R032q37j10098l5219k3979m5870L1791M0122O8572J8811J6655
10821E6066J5454m906m0770o5645m4092j3197n1068N9250q209J2995K4962M1413
10809a7747j5883n2045K597J3139k6464l6227q597M6319P6091O7448p553l8501
10797B577Q426j0p1153o0192O1404L1733o0070P1818O5897j3087j2792M3693l3390
10784C4854N5893j6784k2969j8400L7101M0035k8147l4728l6367m108k9824Q91
10772b2553O5487j9258p9362L0013P790o2887L9220N1827k3419j16692o7042R7424
10760i9452O5633M7772L0369L9961k8571k3191k0002n4311k0084k7343o812P5029
10748b1002Q2727j2282J6113P6822J0132K0731K4736n1038o0859o0545j9340K4859
$$ y = [66171, 87086, 96118, 95281, -14817, -50036, -74015, -119885, -88094, -47972, 20600, 39411, 56066, 71520, 66614, 25844, -39801, -83893, -97090, -148158, -88908, -97117, -84122, -59160, -17747, -33630, -85675, -83078, -69939, -96403, -132630, -141227, -94908, -18817, 48631, 41078, 2577, 11003, 10993, -60160, -120352, -58948, -27215, -87285, -15467, 50430, 37343, 24551, 68244, 34854, 90747, 73963, 50994, 32594, 69695, 109730, 81583, 46855, 10488, 6380, -23444, -22553, 42934, 23676, -55686, -25673, -17883, -80770, -41550, 10277, -13142, -129834, -196876, -99452, -33819, 13953, 44322, 84283, 55712, 32521, 12519, -41792, -61876, -89219, -96031, -21002, 61725, 49443, 65556, 142378, 152510, 173241, 197977, 146939, 86080, 25535, 6195, 31054]
10736C1054l3812j8320K0757l6315N181K955n2412j7380R145K6935M7197p975
10724b2990n1528K4319J0443p6708O4913J03324k2719m5990J9149j0207Q100M0566
10712D0672m0805r7436K9906o917N4360M6610j4278K2570R655n0254p8629O3305
10700b1241j9487K8238L4594k5821m5462L4593m1986Q7856J3195n9873m5926N9636
10688a684L965m1259k7838n310J3710r032J2456J0551k6061N12j2361j0976l623
10675i6950n0972j4422N7056L5212N2132K5839j4849M5736J3573j8435J0960p686
10663C7194l4160M4381L8517M1574o6876p5071p6698k9615R2794J5177P1056M2463
10651A00736L648J4613k8025k0626J2899O6365j2673r880k7617N1153O3699N7917
$$ y = [31054, -2758, -21078, -321, -36636, -31455, -28500, -80912, -98292, -89147, -62212, -15015, -22990, -74518, -50199, -39756, -116464, -51551, 51773, 29054, -16936, 2213, -7994, 106, 40672, -133, -97569, -67663, -74580, -20220, 26390, 12112, 34682, 44337, -5917, -84546, -21241, -40728, -12490, 22104, -3717, -49179, -14586, -56572, 31284, 44479, -15394, -61320, -1684, 2281, -38978, -66816, -72126, -58416, -67448, -54992, -44441, -70502, -69990, -82351, -93327, -96950, -147922, -162344, -105288, -70076, -17944, 7895, -6954, 38782, 52355, 33920, 44880, 37194, 3034, 47415, 85932, 127506, 60630, -14441, -91139, -120754, -27960, -12783, 58273, 100736, 104384, 118997, 90972, 70346, 83245, 149610, 136937, 127057, 99440, 150593, 214292, 272209]
10639B72209k8942o4875m4548l9966k850K011j1978N748N111k4991j4800K1740
10627G3869l0501j8558k8236P4058R3253J9755K0001n1394j0952O5278J5169J9310
10615B41052k1776m715n764l7055l6413J9257J3173j0300n496J9886l8233K800
10603A36416k1054l6223Q047q612k8781L4455L3152L2095m289o8878k573J544
10591G5299P3004J8381m3128p4507j6547j1492J8348N0966l9591m8897k5912k2809
10579d6885K3418r752Q294J364j7909J120j4841N0663k7865k3201L1366J3498
10567a0730k6150L251J24374J16089P1241K9922K2271p6802o7741m4773K2989
10556A63941r609N2524m6451j3533M2663l4185j6699N0545p5659j9205K5744K9639
$$ y = [272209, 243267, 178392, 133844, 93878, 91028, 93039, 81061, 86809, 91920, 66929, 52129, 73869, 43368, 24810, -3426, 70632, 163885, 183640, 203641, 152247, 141295, 206573, 221742, 241052, 219276, 214561, 208797, 171742, 135329, 154586, 167759, 157459, 151963, 171849, 133616, 136416, 115362, 79139, 87186, 78574, 49793, 84248, 117400, 149495, 145206, 76328, 73755, 75299, 148303, 166684, 123556, 49049, 32502, 21010, 39358, 90324, 50733, 1836, -24076, -46885, -23467, -33219, -24925, -23561, -41470, -40350, -55191, -4528, -32393, -55594, -24228, -10730, -36880, -33629, 90745, 206834, 278075, 307997, 330268, 253466, 185725, 140952, 163941, 154332, 206856, 160405, 146872, 189535, 155350, 138651, 189196, 113537, 94332, 120076, 149715]
10544A49715N2971L7446P2650M4497M57K0803K1138L4908l1114j5134J653m4222
10532C45768K1016J1702m8291k301k1326j03423k5522J6551j290M4491J5824L2357
10520B85556J9453R4510j2969k8123M4758L5129J165L713j9955J8379k8308j04551
10508C08757J1376P917r8247k1362J4477J4m912N254N652j3389k0715l9011j3433
10495A42378J7026j4725J0476m6213k9722M0592J1707K3137L5412q287r3567l7800
10483E0414j2445K7684O3224o1198k1369j9010K3212M3652q782L7266Q3964o8010
10471A38602p4076k9435p979p3083q765M78J4145L5752K1837m3803o0072Q6133
10459b66K8529l7606l5647j1987j3867K5643M6614j3050J944K1482N4375k840
$$ y = [149715, 202686, 240132, 312782, 357279, 357736, 378539, 399677, 434585, 403471, 388337, 389990, 345768, 366784, 378486, 330195, 327894, 306568, 203145, 177623, 194174, 192884, 237375, 253199, 285556, 305009, 399519, 386550, 358427, 403185, 438314, 439479, 443192, 423237, 441616, 413308, 308757, 320133, 328050, 229803, 208441, 222918, 222932, 218020, 223274, 228926, 215537, 194822, 155811, 142378, 159404, 144679, 155155, 108942, 79220, 119812, 131519, 154656, 190068, 181781, 88214, 50414, 37969, 65653, 128877, 67679, 46310, 27300, 50512, 94164, 85382, 122648, 206612, 138602, 64526, 35091, 27112, -45971, -54736, -54258, -40113, -4361, 17476, -26327, -86399, -266, 28263, -9343, -44990, -56977, -70844, -45201, 1413, -11637, -9693, 11789, 66164, 63324]
10447F3324k3886l3922n6234m173N6185j1147l4039j9202L001N206J2776J8903
10435b3208q3632l1569J44617K9773M126P2519l0471N0275L2601m1390L2346Q2043
10423B38030j0897p5697K1476K5237m9002J5144m968K5575M5904k4921k8380m5023
10411A32478o8331l0733L2525L4379P2150O2588M3056L3277m9114j5573J270p688
10399B40284j7858O634k832M2140k0043n7895M14l5013M9396j2151j7944r387
10387A65745l0684k4948M344j3329P1880j0527l156O712m7153l1141N4331Q280
10375A50354j603k9187O149L3767N581j9919J0967l9014n7465L2082P4908M2384
10363B09004N2681J731q9631j5039P5473J6961k6118K8096k127p9199l3297J9029
$$ y = [63324, 39438, 5516, -50718, -54891, 1294, -9853, -43892, -63094, -60093, -54887, -42111, -23208, -106840, -138409, 6208, 35981, 40107, 112626, 82155, 132430, 165031, 123641, 155987, 238030, 227133, 151436, 172912, 198149, 149147, 164291, 159323, 184898, 230802, 205881, 177501, 132478, 64147, 33414, 65939, 100318, 172468, 235056, 278112, 311389, 262275, 246702, 247972, 240284, 222426, 229060, 226228, 268368, 248325, 190430, 190844, 155831, 205227, 193076, 175132, 165745, 135061, 110113, 114457, 101128, 173008, 162481, 159325, 166037, 118884, 87743, 142074, 150354, 148751, 119564, 125713, 159480, 165061, 145142, 156109, 117095, 59630, 91712, 166620, 209004, 261685, 263416, 173785, 158746, 234219, 251180, 225062, 253158, 251031, 171832, 138535, 157564]
10351A57564J646K491o2779J58P3389L3694j5859n7737k1797L1453N7732K9866
10339B29821K6874l6161j6964m2849q9978R994O1438K2067l2755L6612R1535k830
10327B56804K5571J9634o233o0070n9732L343J9929N5676N1354p6922p3318j7903
10315A38133P0887L4300k7685k2094J1667k9308l8266j7801K5058j6185p5292
10304E3414j2449m0594P4363J22592P4056Q0352j3301M6847p5933j07496o9682
10293A32169l2704O197M4821j3460n441p483Q6730q62k3168p1266L1940j268l5205
10280A11000Q167L3455k5210o4599o2676p4222L2144P8468M0722K1485M2439L976
10268A45149m7577N4195P8670m7031r1231j3377J137m763l3222k0014J652M3208
$$ y = [157564, 159210, 161701, 98922, 99080, 172469, 206163, 190304, 132567, 110770, 142223, 199955, 229821, 256695, 220534, 203570, 160721, 70743, 80737, 142175, 164242, 131487, 168099, 259634, 256804, 282375, 302009, 295776, 235706, 175974, 179317, 199246, 254922, 306276, 229354, 156036, 138133, 209020, 243320, 215635, 193541, 205208, 175900, 137634, 119833, 144891, 128706, 53414, 40965, 371, 74734, 197326, 271382, 351734, 338433, 385280, 309347, 201851, 132169, 99465, 105662, 150483, 137023, 131582, 124099, 210829, 209967, 186799, 115533, 147473, 146205, 111000, 119167, 152622, 127412, 62813, 137, -74085, -41941, 36527, 77249, 98734, 141173, 145149, 97572, 151767, 230437, 183406, 92175, 78798, 79935, 75172, 41950, 21936, 23588, 66796]
10256F6796Q8199Q0759N8051n5327p5247j0834m3930k1108J797j8184j8786J5219
10244F7405J8462k4781o2406M5227J2965N7906l0694l6597O8042L9627k3385k9285
10232A02486l5774o7816k726O9449M0715o1403j4161M6141j168o4572m3718j8279
10220e0826K5247L9418J4135j3702j5187L2085J6546q7715l1278m1137n464J20297
10208B419O6593K3773m4019n4115p011j2523n8851K2844k0274J9098J730K7509
10196c2827N7562m342L3026L3694M9693k8900o3643L9629K614j1014K9467k8358
10184G6601l0218K6920o1396n495Q403r227k0391L2664J3543Q3296j498n6606
10172E6596k9413M1613J977j2862k0233R234J1845K6385L7501m2841m3010N320
$$ y = [66796, 154995, 235754, 293805, 238478, 163231, 152397, 108467, 87359, 89156, 70972, 52186, 67405, 85867, 61086, -1320, 43907, 56872, 114778, 84084, 47487, 115529, 155156, 131771, 102486, 66712, -1104, -3830, 65619, 106334, 44931, 30770, 76911, 75743, 11171, -32547, -50826, -25579, 13839, 27974, 14272, -915, 31170, 47716, -39999, -71277, -112414, -117878, 2419, 69012, 92785, 48766, -5349, -12360, -24883, -83734, -60890, -81164, -62066, -60336, -32827, 24735, 20393, 53419, 87113, 136806, 107906, 44263, 83892, 86506, 75492, 104959, 76601, 46383, 73303, 11907, 6412, 14815, 5588, -14803, 17861, 31404, 114700, 113202, 56596, 27183, 68796, 70773, 57911, 37678, 46912, 58757, 85142, 122643, 79802, 36792, 42112]
10160D2112m6716m1314O9218J0656n0916q977L9184l508l5162J806L4358k7861
10148a7120M3990L0270J7896r923j6811p0955K616l80N3318M7681M3551J9460
10136A43593j0556p238l1707r6272j1154n3R905L2912p5801M0635K6641M2496
10124F3401n1658M2645j1622J5063N8513m5648P160j5009m6276Q752k5635k2897
10112b3211l9033N7428R7505o5855j33148N493K3967J9537m783M0520Q5830j1695
10100E2555j8166K4279j5983o5402K211O2673J399P533n3144m3193j6068K2825
10088c8481J8954K868M856L4598P9126n803m440k4447j7582m5516l5060m1038
10076g1965K7898K5163m3742l3991j7756k0688L7665P8586k8243m329K5542J6604
$$ y = [42112, -4604, -45918, 23300, 33956, -16960, -25937, 13247, 9739, -25423, -23617, 10741, -17120, 26870, 57140, 75036, 65113, 48302, -22653, -20037, -20417, 32901, 80582, 124133, 143593, 133037, 125799, 94092, -2180, -13334, -13387, -3482, 29430, -46371, -5736, 20905, 63401, 11743, 54388, 42766, 57829, 116342, 70694, 77854, 62845, 16569, 25321, -314, -23211, -62244, -4816, 92689, 26834, -106314, -100821, -76854, -57317, -62100, -21580, 64250, 52555, 34389, 58668, 42685, -22717, -20506, 42167, 43566, 51099, -2045, -45238, -61306, -38481, -19527, -16659, -11803, 22795, 101921, 96118, 91678, 67231, 49649, 4133, -30927, -71965, -44067, -18904, -62646, -96637, -114393, -135081, -97416, -18830, -47073, -51402, -25860, -9256]
10064i256O2156M9397n9805o3939m908j0884m7469m3779K2455O2033L2441K306
10052i252l4271J2752Q3540J4206q4463k5255M2050k4627L3353m5936K0953L4728
10040A7778p6142K77n5000j2640N4136J2400k6163j7399k6345J9814L6237L7187
10028c5860K3132K8874j1869j9904j992O4463J6377q5190o4215O1294K4736j9746
10016a9900q588o4513j92j0164J1200O0530L1644M5364K9453j16915k0R8476n0611
10003E764m6252k5064K5330J2503L8513J1245r9495q7074J0241K9455L4102r684
9991a00416k7143k103J4478o268J380K1933K4524J8007l327k5599K215L6525K6665
9978a9129M8003J5311J8437k7240m5750L9611L0487n3449n9126j8623J3680J2171
$$ y = [-9256, 52900, 102297, 42492, -21447, -26355, -37239, -84708, -128487, -106032, -43999, -11558, -9252, -43523, -30771, 52769, 66975, -17488, -42743, -693, -25320, 8033, -37903, -16950, 17778, -58364, -58087, -113087, -125727, -71591, -59191, -85354, -102753, -129098, -109284, -73047, -35860, -12728, 16146, 4277, -15627, -17619, 46844, 63221, -21969, -86184, -24890, -154, -19900, -28488, -93001, -93193, -103357, -92157, -31627, 17, 45381, 74834, -42081, -42101, 56375, 5764, -40488, -65552, -40222, -27719, 10794, 22039, -77456, -164530, -154289, -124834, -90732, -100416, -127559, -129662, -115184, -121452, -120072, -98139, -73615, -55608, -58935, -84534, -82319, -45794, -19129, 28874, 44185, 62622, 35382, -10368, 29243, 59730, 6281, -52845, -71468, -57788, -45617]
9966d5617M9100k4290O3581k5658k8542K5754L6694K5080n104j04279r6181J0812
9954a18650J1711K2444L6028o0502J6989N4190M750l2940j1068K9905k1563J0105
9942e8601l4409j4032O4276J5757j5803n0294n0650L942O0715N5043m0235l3839
9930i8130l1771L4764J1719l4501k91L5648J7980L7164k082Q975l430l4533K0461
9917c8027l23J7693L6978j0616k7554k2264k982K7556j2761K0363J07299M9860
9905A45222n3871j06510q0879l5128k6172L0620Q8204L110J4488k4181K2966K3465
9893A334O878O7989M7155M8275j8753M70o146p5385m4633q34m843p0557p2188
9880a21238J0394K7444k4123r6j2710K6018Q7880M4382l6305o6766J5067J06971
$$ y = [-45617, 3483, -20807, 42774, 17116, -11426, 14328, 51022, 76102, 70998, -33281, -129462, -118650, -106939, -84495, -48467, -108969, -91980, -37790, -33040, -65980, -77048, -47143, -68706, -58601, -93010, -107042, -42766, -27009, -42812, -93106, -143756, -139814, -79099, -24056, -64291, -98130, -129901, -95137, -83418, -117919, -118210, -82562, -64582, -27418, -29500, -20525, -23955, -58488, -38027, -38350, -20657, 16321, 5705, -21849, -44113, -47095, -19539, -32300, -11937, 95362, 145222, 91351, -15159, -96038, -131166, -157338, -126718, -38514, -35404, -20916, -45097, -22131, 1334, 8212, 76201, 123356, 171631, 152878, 153348, 147202, 71817, 27184, 26350, 21507, -49050, -121238, -110844, -83400, -107523, -107619, -120329, -94311, -6431, 37951, 1646, -65120, -50053, 56918]
9868E6918P4065n8328n6214j319r509o8534k811K7378m3944p838l5813L2143K7944
9855f5862N2224M9960M3932K1650m8786j8472l2564l6776Q821J28j2080K493j7101
9842e2433M4472L7880l0074m503O3549n9030m4764K043k4887l582L1955J4173
9830b5201J3414M6736M7161K9589j2886r6744j9070m0136j5897k3216O9238R513
9818a7499m0876M4450o1715l9123M2402m697M7940O5116J9697k5473n9862o3404
9806i3044J75M7411N1227K879J8099k4529j3549J4354K8957p233j682l0883n0710
9793e8528l1526K0205M1147r417P544L3314l7707l8558j7893K3086J9044r537
9781e8826r1733j144J1767K6138J9056j8357K1983M0303N6107J6288l1511n4926
$$ y = [56918, 130983, 72655, 16441, 15122, 5613, -62921, -65732, -38354, -82298, -90136, -125949, -93806, -65862, -13638, 36322, 80254, 101904, 53118, 34646, 2082, -34694, -25873, -25745, -37825, -35332, -52433, -7961, 29919, -155, -4658, 58891, -139, -44903, -42860, -67747, -71329, -39374, -25201, -11787, 34949, 82110, 111699, 98813, 2069, -17001, -57137, -73034, -96250, -27012, -17499, -58375, -13925, -75640, -114763, -72361, -77058, -29118, 35998, 55695, 30222, -29640, -93044, -92869, -45458, 5769, 8648, 26747, 2218, -11331, 3023, 31980, 24747, 23065, -7818, -58528, -90054, -69849, -28702, -38119, -30575, 2739, -34968, -73526, -91419, -68333, -49289, -58826, -150559, -151703, -139936, -113798, -94742, -113099, -91116, -50813, 5294, 21582, -9929, -64855]
9769f4855K60M1344O7597M4860k1667n7571p1974J6958L4248j2357R098R168j7797
9756b2688o804L7317j8331n457K8777K9730K2792O196r017O3314m4909q8504j4064
9743b1648N072O33k5030K9985l232Q2562M7557j03204o9222m0552l0213k5357
9731a52649k4561M2507L2381J7704J2798l602J6968p848K9556O9137o0329p0681
9719i8619O0682J1643j03408R168O1187J1142m89J6250L1294O451J2394k763j15416
9706a00484k6944N3563m4592N7623K2286L3263k5301J766o0722q472p571J4405
9694i1180P5862o625q020m8461K2543O5731J2398M925m0573m5845L4558L0472
9682E785p729m2130k9615l9935k1121J2270M6265K4740j8066r384k0323K4075
$$ y = [-64855, -64595, -23251, 44346, 89206, 67539, 9968, -62006, -45048, -10800, -23157, -14059, -4891, -22688, -29492, 7825, -10506, -15963, 12814, 42544, 65336, 71532, 62515, 125829, 80920, -7584, -21648, -16576, -15943, -40973, -10988, -14220, 68342, 115899, 12695, -56527, -97079, -127292, -152649, -177210, -134703, -102322, -84618, -71820, -75422, -58454, -66302, -36746, 32391, -27938, -98619, -37937, -26294, -129702, -120534, -59347, -48205, -48694, -32444, -1150, 5301, 17695, 14932, -100484, -127428, -73865, -118457, -60834, -38548, -5285, -30586, -28820, -89542, -98014, -105585, -91180, -15318, -21943, -29963, -78424, -55881, 9850, 22248, 27173, -13400, -59245, -24687, 5785, -1944, -44074, -73689, -113624, -134745, -122475, -76210, -51470, -69536, -78920, -99243, -75168]
9670g5168R1227L3581L6624m7887k2175J8411j0531j1632J8044K6581M490O7803
9658A29368M2438M5285j9763n7414l5906l6520l3895k608j3953L390r093J2299
9646B3628K2887J6769J5483j3639p4733j5492O6504L1797N1567Q969p847j8000
9634A07893k5524m9497l1280J0175p680m8261q398M0558M5833k195m4560m4504
9622e7440j9494n6148m2944P9094J13928L618p1049j0325J5961K201m7870J2391
9610g8077M24K3973J04787J687q571k874K0813l1190o4622K3527N9378k3683p5118
9597d9546l1814M1383L9530n6173k4152m2492n9142L4569m3953K5281Q6280n1951
9585a32180L0488Q3724n1741k0899M5980j4205q1606m4811Q9268j899L8701K8082
$$ y = [-75168, 16059, 49640, 86264, 38377, 16202, 34613, 24082, 12450, 30494, 57075, 61565, 129368, 171806, 217091, 197328, 139914, 104008, 67488, 33593, 30985, 17032, 20422, 11329, 23628, 46515, 63284, 78767, 65128, -9605, -25097, 41407, 73204, 124771, 133740, 125893, 107893, 82369, 32872, 1592, 11767, 4087, -44174, -52572, -12014, 33819, 31624, -12936, -57440, -76934, -133082, -176026, -96932, 16996, 20614, -50435, -60760, -44799, -42598, -90468, -78077, -77653, -53680, 51107, 52794, 44223, 41349, 62162, 30972, -33650, -10123, 49255, 25572, -49546, -81360, -39977, -447, -56620, -80772, -123264, -182406, -147837, -191790, -166509, -80229, -132180, -101692, -17968, -69709, -90608, -44628, -58833, -140439, -185250, -95982, -97881, -59180, -31098]
9573c1098l4795j1449Q044m940m2819n583M2541L7263L5381M1561k4786m7050
9561c7730k2152r5209l1869Q6215M8508M8542J9503k5738l2336j3795o805M1832
9549b1034K4081n1445Q1473L0609L373j2841r081k290m9423k8180k0084n006j1817
9536g1665L4479j6346k5291L3055P2556K2169J6931p7695q7585m2981L2745L2288
9524g7340n3016j4304L0152M7320J02247M8661M1890q0249r5591l3364M1208k7072
9512f9458k0967J0630J14775q684m7707J824j3523K50L3507p1841m8552K342L6364
9499h1040j1769L406j266o292p693K8988l6629j2017K991p012k4584m4484O2645
9486a34756M3728q301k956N0945K2741q734K6232J4810m8076l6162Q529L9301
$$ y = [-31098, -65893, -77342, -69298, -74238, -117057, -122640, -80099, -42836, -7455, 34106, 9320, -37730, -59882, -155091, -186960, -100745, -52237, -3695, 15808, -9930, -42266, -56061, -62866, -21034, 3047, -48398, 33075, 63684, 67057, 54216, 45135, 42845, -6578, -34758, -54842, -59848, -71665, -37186, -53532, -78823, -45768, 26788, 48957, 65888, -11807, -99392, -142373, -109628, -77340, -130356, -144660, -114508, -67188, 35059, 83720, 125610, 45361, -50230, -83594, -42386, -69458, -90425, -79795, 34980, 26296, -21411, -19587, -33110, -32860, 647, -71194, -119746, -117404, -81040, -92809, -89403, -90669, -96961, -104654, -75666, -112295, -124312, -121321, -128333, -152917, -197401, -134756, -91028, -99329, -102285, -51340, -28599, -37333, -11101, 3709, -44367, -80529, -72000, -32699]
9474c2699Q6070K9907r6136p1361P393K2423K0848K6995M4724j7323M1691Q6825
9462A49357R04q9717p9116m1482l3151M3228N3805K6728J9410l5326p2645q4797
9450a42802l8265j4202O4810K7352n750l7452L802K9735Q8475K5654n9504K4260
9438c3887M8409k5820J385j0047l2814J2168L1429n7630r292k1530J67k4328Q219
9425a13571J0219l0326K4472M0839j0617m2706P3004Q7081J7783o0429n6501l6696
9413i7448N2925J8565j4991N161j1964M1836L1371j3146j6224l2295j8312k191
9401e6713K7960o0163m4059k210O7457K4284k2375N4320J8268M0393j5661o55
9389C0846m8979l3318J8677N732M7333l5228j8170k76N840J4862M538L0568J2682
$$ y = [-32699, 53371, 83278, -12858, -84219, -76826, -54403, -33555, -6560, 38164, 20841, 62532, 149357, 150261, 60544, -18572, -60054, -93205, -49977, 3828, 30556, 49966, 14640, -58005, -142802, -181067, -195269, -130459, -103107, -108857, -146309, -142507, -112772, -24297, 1357, -58147, -33887, 14522, -11298, -9913, -19960, -52774, -40606, -9177, -66807, -76099, -97629, -97462, -121790, -113571, -103352, -133678, -109206, -68367, -78984, -121690, -48686, 38395, 56178, -4251, -60752, -97448, -44523, -25958, -40949, -35788, -47752, -5916, 25455, 12309, -3915, -36210, -54522, -56713, -28753, -88916, -132975, -135185, -67728, -43444, -65819, -11499, 6769, 47162, 31501, 30846, -18133, -51451, -32774, -27042, 20291, -14937, -33107, -33383, -27543, -12681, -8143, 22425, 35107]
9376C5107J73l6047o4544j7860j2640p482j8681M7887L7345j0137k6617J265k3958
9363i6189k2274Q5071Q1001k6533K507m1000K7050j7038P9712q477p8519m6241
9351f0930K709N1033N9253K7015K9213p5277o4904L4744N2563K4137N8715k1149
9339A17122o1569k3419O0409R703N8307M5182j09738q4428K0044j2023o554p5012
9327f1976k3917K6085R207L0468M3595J4560m9301j02494N2631k7448K2856L7857
9315b7877o1432l7827O9446P7342L1986m3364J3471K7252J2343P106K4646k1219
9303G1873N8807L645J9248N9848J62656K40039K40090J16920k8241j23171j62056
9292F59658j46423j37081o1059n5250j02604k8183n1765j04454j6505O6527L7829
$$ y = [35107, 35280, -767, -65311, -83171, -95811, -103293, -121974, -74087, -36742, -46879, -73496, -72231, -96189, -118463, -33392, 47609, 21076, 23583, -17417, 9633, -7405, 72307, 63830, -14689, -60930, -58221, -7188, 52065, 79080, 108293, 33016, -31888, 2856, 55419, 79556, 138271, 117122, 55553, 32134, 92543, 102246, 160553, 205735, 95997, 11569, 31613, 19590, 13036, -61976, -85893, -59808, -50601, -20133, 23462, 38022, -11279, -113773, -61142, -88590, -65734, -27877, -89309, -127136, -57690, 19652, 51638, 8274, 21745, 48997, 61340, 68446, 93092, 71873, 130680, 134325, 153573, 213421, 376077, 616116, 856206, 973126, 944885, 821714, 659658, 513235, 376154, 315095, 259845, 157241, 129058, 77293, -27161, -43666, 22861, 60690]
9281F0690k1414l3685m7635j5714J0753J8061l6905J6459K8783l4685k644K1677
9269c6259L8738K9109M5843L2179j4689N209l2428j368M0343L4007l9637L4446
9257A35493O2709O7439J04260K00122M14917N91243M80224q4738m90227m34363
9247A047079k70704k16752j52026j18970q0918k734n5532J577M6997j7090o3790
9236A17137l7131o1056p9364m0352R1453J01145j8064L3485J0202n4562O5086
9225A27979k9011p7852K0722j0759K2899L1935J5491K3581j5605O574P4383q298
9213A82039j2781J8130J07867Q0308J09381J59784J89636K04158L3785j73274
9203H99033k23339j26871o3417l5752n4100l8565k6604o2250n253P7285k1333
$$ y = [60690, 39276, 5591, -42044, -57758, -47005, -28944, -65849, -49390, -20607, -55292, -57936, -36259, 2479, 31588, 77431, 109610, 94921, 100130, 67702, 66334, 106677, 140684, 101047, 135493, 198202, 265641, 369901, 570023, 984940, 1576183, 2056407, 1971669, 1481442, 1047079, 776375, 559623, 407597, 288627, 207709, 204975, 149443, 151020, 198017, 180927, 117137, 80006, 18950, -60414, -100766, -9313, 91832, 73768, 107253, 117455, 62893, 127979, 98968, 21116, 41838, 31079, 53978, 85913, 101404, 124985, 109380, 115954, 190337, 182039, 169258, 187388, 295255, 375563, 484944, 644728, 834364, 1038522, 1072307, 899033, 675694, 548823, 485406, 449654, 395554, 356989, 330385, 268135, 262882, 340167, 318834]
9192C18834K1174R1292J23131Q8117j0252j0694m3559L1841N2820J32001J11746
9181I06451J01117J25659K00530J85007J69070K34100L68444N40538O87013R83511
9171D501440J207912J806847K757519M429582P327010J2016231J6695583J3585183
9163F4327307j979009j5638327j5460692j0291859o328695m005568k610456j707613
9155F305088j207465q52815o94716n77116m41700l18507k20690k09471j70156
9146A612452k04204j47177j05120r3640j04782j39878o1953n1932p2854p1266
9136E59646p4993k0481k2420j3322L766p0979n5752Q372K0464l1532j1802j2473
9124B78494K909M3790N9624n6308k8334L3078m483k1503K1504j02927j12479p3829
$$ y = [318834, 340008, 431300, 554431, 642548, 632296, 621602, 578043, 609884, 662704, 794705, 906451, 1007568, 1133227, 1333757, 1518764, 1687834, 1921934, 2290378, 2830916, 3517929, 4501440, 5709352, 7516199, 10273718, 14703300, 22030310, 34046541, 50742124, 64327307, 62348298, 46709971, 31249279, 20957420, 14628725, 10623157, 8012701, 6305088, 5097623, 4244808, 3550092, 2972976, 2531276, 2212769, 1992079, 1782608, 1612452, 1408248, 1261071, 1155951, 1062311, 957529, 817651, 755698, 703766, 630912, 559646, 484653, 464172, 441752, 428430, 432196, 361217, 305465, 313837, 334301, 302769, 290967, 278494, 281403, 325193, 384817, 328509, 300175, 333253, 328770, 307267, 328771, 225844, 113365, 39536]
9112C9536O0984P6319N6769o4621K9355R7589Q7216l0680k7783j342K6966o9329
9100B80979k4513J567l6138j3509p0100n8540k3024J4837L5955J035m8856m4480
9088A5213j0392M4533K0756M86m8775k3954L5621O5793J81k330m6150k6761J6852
9075D1073J6537M8867j490J8429p966m9375o5791J8367r004J6917j8148K6582
9063C4998O8989K0126l3407p669M7874Q5366Q0512l2249p4822m7793j6382n9975
9051F5568l9404N2220J3264k5266q5888K5565R8261K0295m3178o748P81p598p481
9038F0391P813K3809O3549p2855k3235J6253M265k6965J900j9381M38L0968P1533
9025A38483J27857O2662K5862l7099n5710o4400q4986n6251l4919j9036L4126
$$ y = [39536, 100520, 176839, 233608, 168987, 198342, 295931, 383147, 352467, 324684, 323342, 350308, 280979, 256466, 258033, 221895, 208386, 138286, 79746, 56722, 71559, 107514, 108549, 59693, 15213, 4821, 49354, 70110, 70596, 21821, -2133, 33488, 99281, 99462, 97132, 50982, 24221, 41073, 57610, 106477, 104987, 123416, 115450, 66075, 284, 18651, 9647, 26564, 8416, 34998, 103987, 124113, 90706, 83037, 130911, 216277, 296789, 264540, 189718, 141925, 125543, 65568, 26164, 78384, 91648, 66382, -19506, 6059, 104320, 124615, 81437, 74689, 75470, 67872, 60391, 68204, 92013, 155562, 82707, 59472, 75725, 79990, 53025, 54925, 35544, 35982, 66950, 138483, 266340, 329002, 354864, 317765, 262055, 197655, 112669, 56418, 21499, 2463, 36589]
9014C6589R2258j1932j18937K7584N939j7226n929L9235j2358K6294N1672j9410
9002I3779m3661O864k1039m1407J3518K9087p563k1918P8785M8999l7225l8026
8990F0193j5581J480j8407o129M9021k5222r40R6609K7258N3692J44217J13034
8978D79225J30619K2387m2495r6382j21868j32327k3012k2532k3600J9736j1573
8967A78178j2924Q787n6281M9190m9357j8721K4227o3324J7490N8375N0205R851
8955A95696K8684K5365L3984J02867J7681K8376j3563n6504j6150L5256K9321
8944D11013O170L7339l5112K3825K0458P2378j0538L468L0565L7560J0771Q5070
8932F92967Q5365M291J8706M3790O5650N3686J32434N1793q533K2583O3971J17441
$$ y = [36589, 128847, 116915, -2022, 25562, 31501, 14275, 8346, 47581, 35223, 61517, 113189, 93779, 50118, 56982, 35943, -5464, 8054, 37141, 29578, 7660, 86445, 135444, 98219, 60193, 44612, 46092, 27685, 21556, 70577, 45355, 44415, 141024, 168282, 221974, 366191, 479225, 609844, 632231, 589736, 493354, 371486, 239159, 216147, 193615, 170015, 189751, 178178, 165254, 174041, 117760, 166950, 117593, 98872, 123099, 59775, 77265, 135640, 185845, 195696, 224380, 249745, 283729, 386596, 404277, 432653, 419090, 362586, 346436, 381692, 411013, 417183, 454522, 419410, 443235, 463693, 536071, 525533, 529001, 559566, 597126, 607897, 692967, 778332, 782623, 801329, 845119, 910769, 964455, 1096889, 1148682, 1140149, 1162732, 1226703, 1344144]
8920A344144Q4546J02871K33361K37813J99721K22459L26355M97038O04079P60849
8910D613236Q80059P06369P06313J139853J699138K398732L448132M951933P617076
8901B8160841J2751986K2395372L8126700N2728519L9220684j3912226n2041701
8894A27430175m5172091k7884377j6407604j0101216o536191m426225k995578
8887A3906893k082826j502833j166686q13768n22789l85111m79449n74757m07880
8878E970794l06183k55203j40944p1675J4620J84419K44105K64542L64791N65586
8868F834852P47987J058421J333934J448913J299401J306184J958916K967241
8860A8955849M342286O102724Q746834J3558609K2810679M0623971P2310977J09544383
$$ y = [1344144, 1428690, 1531561, 1764922, 2002735, 2202456, 2424915, 2751270, 3248308, 3852387, 4613236, 5493295, 6199664, 6905977, 8045830, 9744968, 12143700, 15591832, 20543765, 28160841, 40912827, 63308199, 101434899, 154163418, 193384102, 179471876, 127430175, 82258084, 54373707, 37966103, 27864887, 21328696, 16902471, 13906893, 11824067, 10321234, 9154548, 8340780, 7817991, 7432880, 6953431, 6378674, 5970794, 5664611, 5409408, 5268464, 5196789, 5211409, 5395828, 5639933, 5904475, 6269266, 6834852, 7582839, 8641260, 9975194, 11424107, 12723508, 14029692, 15988608, 18955849, 23298135, 29400859, 38147693, 51706302, 74516981, 115140952, 187451929, 296996312]
8852B96996312R3876828j9066586j09610845r5699155n8296477l3959967k0656004
8845E3584106j3302102q819892o039183m208218l073214k254253j578929j026971
8837A3281344q36574j049702j263874j097284r30399o67337m70649m20951l40092
8828F204482k58228j32442M426M6656P3287K20986M09189N01779O09846N53082
8818H233063O07774R72803J340500J989659K917106M252980O485594J0628983
8810C7428462J8411012L1822707M7923088M5550037J972667m6055289m8516333
8803H8536351l1210337j8233234j0984543o980665m611317l144237k158714j538353
8795I674951j192061r34934o44479l49869l35224o90840q12616o49927n28313
$$ y = [296996312, 390873140, 371806554, 262195709, 166496554, 108200077, 74240110, 53584106, 40282004, 31462112, 25422929, 21214711, 18141497, 15887244, 14308315, 13281344, 12444770, 11395068, 10131194, 9033910, 8103511, 7436174, 6965525, 6544574, 6204482, 5946254, 5813812, 5818238, 5864894, 5938181, 6159167, 6568356, 7070135, 7679981, 8233063, 8840837, 9813640, 11154140, 13143799, 16060905, 20313885, 26799479, 37428462, 55839474, 87662181, 135585269, 181135306, 183107973, 137052684, 88536351, 57326014, 39092780, 28108237, 21127572, 16516255, 13372018, 11213304, 9674951, 8482890, 7547956, 6903477, 6553608, 6218384, 5527544, 4714928, 4065001, 3536688]
8786C536688k69884k35547k37932j82070j64039k19063k52873j76603J1412m9060
8776A761029q0371q3063o2899n7635m0032l4449J5570M2855j59745j42260J459
8765A160459M6919N8537k9129n1451n9617r5377q5450q7475o0939M4158Q5387
8754I26022P7597J12243P7354J00887J1222q3301N933O3408K00751J17244j70946
8743A438414k67936j50325j19531p279J0739m7116K505N5451J5874q3598m5495
8732H01703L4306R7231J64216K20078L01836N90346R70500J081949L89156q54912
8722C796409j167518p53495m86795k78595j80352n5769J8571J6145q2710q4611
8712G41280J8528L9991O5068J21679Q149J2435J8113j9189p0144k6846P0482J9004
$$ y = [3536688, 3266804, 3031257, 2793325, 2611255, 2447216, 2228153, 1975280, 1798677, 1810089, 1761029, 1680658, 1597595, 1534696, 1477061, 1437029, 1402580, 1418150, 1461005, 1301260, 1159000, 1160459, 1207378, 1265915, 1236786, 1185335, 1125718, 1030341, 944891, 857416, 796477, 840635, 926022, 1003619, 1115862, 1193216, 1294103, 1305325, 1222024, 1227957, 1291365, 1492116, 1609360, 1438414, 1170478, 1020153, 900622, 893343, 904082, 856966, 859471, 914922, 930796, 847198, 801703, 836009, 933240, 1097456, 1317534, 1619370, 2209716, 3180216, 4262165, 4651321, 3796409, 2628891, 1875396, 1388601, 1110006, 929654, 873885, 892456, 908601, 825891, 741280, 759808, 799799, 864867, 986546, 994695, 1007130, 1025243, 1006054, 935910, 909064, 979546, 998550]
8700I98550O36o0783p9369p0639j11434O960J27927K7922j8899M803J5809P4611
8688I16094J06843J95924J74860J79350L71006O08765R83594J673796K342100
8679G552332J176772j449517k300573j615219q88024n87455l38308j67965j96956
8670A185087j25692l7359q2440k3572J1050m1650K0726J4593j8708m304o380L3044
8658I24395j8946o1739q0188j8240K8689j8914n9249O601N214j6440O2897P9893
8646H33973R9292P3621N1757M4104K7017J14072K46845L01242K03630K41456N60315
8635B797324J011389P61537l31014j093625r71966n56493l41150k38518l6814
8626A000670N496j1558p0685q8919r7921j9781N7777j9845K0N303J2928M4780
$$ y = [998550, 999186, 938403, 859034, 788395, 676961, 683921, 811848, 839770, 820871, 825674, 841483, 916094, 1022937, 1218861, 1393721, 1573071, 1944077, 2552842, 3536436, 5210232, 7552332, 8729104, 7279587, 4979014, 3363795, 2475771, 1888316, 1550008, 1382043, 1185087, 1059395, 1022036, 939596, 916024, 927074, 885424, 906150, 920743, 902035, 897731, 891351, 924395, 905449, 843710, 763522, 745282, 773971, 755057, 695808, 702409, 707623, 691183, 754080, 833973, 933265, 1006886, 1058643, 1102747, 1129764, 1243836, 1490681, 1791923, 1995553, 2237009, 2797324, 3808713, 4570250, 4239236, 3145611, 2173645, 1617152, 1276002, 1037484, 1000670, 1006166, 994608, 923923, 835004, 737083, 717302, 775079, 755234, 755254, 760557, 773485, 818265]
8614H18265L6383L9581M8029O7425j2011N458j072n6k821l3271o9901p009J77345
8601A066345K42889J01564O4632J61188J48109J48475K87667J86592J04897N8002
8591B570360J10524J71888J01545k6459k65819m38538l72033k85998k49196k12682
8581A103592j23942m6688r0674m8919q326m2412n3142j03219k9074j9762n5860
8570D81574m200J3054r161J7468m1119n215K1479n2833l6266k5214j8700K5525
8558C66392j6254M782l7793j28194o757N7509N2097J7401j7773J1833Q137k9510
8546B81870K0522M8260m9234q972K694R3N2680K9103K2259j7207P055J0657k9305
8533C70475j24000m5296m9911l4788J4789K3199L3243J7905k6080J399j5917r964
$$ y = [818265, 854648, 894229, 942258, 1009683, 997672, 1003130, 1002058, 1002002, 999181, 965910, 896009, 889000, 1066345, 1309234, 1410798, 1475430, 1636618, 1784727, 1933202, 2220869, 2407461, 2512358, 2570360, 2680884, 2852772, 2954317, 2927858, 2662039, 2223501, 1851468, 1565470, 1316274, 1103592, 979650, 932962, 842288, 793369, 785043, 742631, 689489, 586270, 557196, 537434, 481574, 477374, 490428, 481267, 498735, 457616, 452401, 473880, 421047, 384781, 359567, 340867, 366392, 350138, 354920, 317127, 188933, 182176, 239685, 291782, 309183, 291410, 303243, 311380, 281870, 302392, 350652, 301418, 292446, 295140, 295233, 347913, 377016, 399275, 382068, 389123, 399780, 370475, 246475, 201179, 151268, 116480, 131269, 154468, 187711, 205616, 179536, 180935, 165018, 155054]
8521A55054L6631j5533j8028n8K8516M8551J03873l2792r2030k4709j2524l6988
8509A39963J0187M4925j5202m946n7256k1355M169J10273N3531j9410L0615N9149
8497C34643J02842J07745J35235J96547K44544M9539k39196l01709j68234j21949
8487C40007o4760o8684k8169k788K2771l8490n5334N9439K4420P3841q680k6206
8475B27367m3527L5836M4509o1838o6756k7570L7787j9548L7504J3149J5177O232
8463A98322M0379l2281n3287l0887L8461R0445M0353n9101K5961J06623L3574
8452C98562O1196J27709L52447N03551N00997K60868l17173n49832m64995k91940
8442E81390k15040r3663j5297q3960n3611m7402r7121K9098Q3372O4480j1966
$$ y = [155054, 191685, 176152, 158124, 158066, 186582, 235133, 339006, 306214, 214184, 189475, 176951, 139963, 150150, 195075, 179873, 174927, 117671, 96316, 100485, 210758, 264289, 244879, 275494, 334643, 437485, 545230, 680465, 877012, 1121556, 1171095, 931899, 630190, 461956, 340007, 275247, 206563, 178394, 175606, 198377, 159887, 104553, 163992, 188412, 262253, 253573, 227367, 183840, 219676, 264185, 202347, 135591, 108021, 145808, 126260, 163764, 176913, 192090, 198322, 238701, 206420, 153133, 122246, 160707, 251152, 291505, 232404, 258365, 364988, 398562, 459758, 587467, 939914, 1443465, 1944462, 2205330, 1888157, 1338325, 873330, 581390, 366350, 272687, 257390, 173430, 119819, 72417, -24704, 4394, 87766, 152246, 140280]
8431A40280j3914k9922m5503j791Q5244N1470J3043o8544m424M1114l2835j0159
8419A24059k4135k7755J6646R5647L9440l4040q707j05620p2805P8072J17555
8408A98357J09794M4400P7935J50874J06287J89478J27418j37181k69870j81805
8398D15687j38483n0747l4365O827j9862p2959m1481O3027L3595l592j0767K3948
8386A70828k0728j9932J0256j5391N4170k0029k9175j5610o4211k933Q2387j0837
8374A18795q0853L916M4199P9736m4034n5208M4641l7808M125L2587l9932n8611
8362A1553K4066Q8088J2089j0057P2508n8759p9517O0879J5378n6108k1515K4997
8350H3602K6063L5097k0335q1252o4920j9194M4180R6038L2031j3551K8954l1332
$$ y = [140280, 126366, 96444, 50941, 49150, 134394, 185864, 198907, 130363, 125939, 167053, 134218, 124059, 99924, 72169, 88815, 184462, 223902, 189862, 181155, 75535, 2730, 80802, 198357, 308151, 352551, 430486, 581360, 687647, 877125, 1004543, 867362, 597492, 415687, 277204, 226457, 192092, 198919, 179057, 106098, 64617, 127644, 161239, 157647, 146880, 170828, 150100, 130168, 140424, 125033, 179203, 159174, 129999, 114389, 50178, 47245, 129632, 118795, 37942, 41858, 86057, 165793, 121759, 66551, 111192, 73384, 77509, 110096, 70164, 11553, 35619, 123707, 135796, 125739, 198247, 139488, 59971, 120850, 136228, 80120, 58605, 83602, 109665, 144762, 124427, 43175, -21745, -40939, 3241, 99279, 131310, 117759, 146713, 115381]
8338A15381K5396l1051o0838n3361p702M4260K3550j3146j5687K766L0290j6284
8326D3574l5095M2565L0080q240k6157J0785N8203n7475m5718j2519Q620J8855
8314B7478L6156m1002l5946Q3694J6127J01528j724n2833o471k3435q1138L6094
8302E8528J4430j241l1322j523J8958O4888O668n3121k6587J7988O1975j7983
8290A11658K9949K4383l9209j30664j09651J0223P2166M4412j1796L3632p697
8279B7406j90M7770P6786N1217O7803L1621n8224J4209k1601n5878j12014m6851
8267B2054J287O5946K3541j6444j6977J112K7656K2119j12663n8080K4597O9772
8255E3920l9164l4662R745j5337O0687K3914k4300m1038n3482L5218k119K0057
$$ y = [115381, 140777, 109726, 48888, -4473, -12175, 32085, 55635, 42489, 26802, 29568, 59858, 43574, 8479, 51044, 81124, 72884, 46727, 57512, 115715, 58240, 12522, 3, 8623, 27478, 63634, 22632, -13314, 70380, 86507, 188035, 186311, 133478, 127007, 103572, 22434, 58528, 72958, 71717, 40395, 38872, 57830, 122718, 129386, 76265, 49678, 67666, 129641, 111658, 141607, 165990, 126781, -3883, -113534, -103311, -31145, 13267, 1471, 35103, 27406, 27216, 74986, 151772, 202989, 270792, 302413, 244189, 258398, 236797, 180919, 68905, 22054, 23341, 89287, 112828, 96384, 79407, 80519, 108175, 130294, 17631, -40449, -15852, 53920, 14756, -19906, -10161, -25498, 35189, 59103, 34803, -6235, -59717, -24499, -26618, -6561]
8243f561L3367R786P733K9300j5435J3729K3416j4541P740L0302p7516p0399J23276
8230I4197P8765J0889k9493J1227L6612l9437K3565j5497n4452k7615P312n6850
8218C9223L60j2501K0243j2303j8365n2761k5647o264l5125M8254N9149j6012
8206a1749l8651r146o1470L9048J03331K5060j263r5412n3558N3879O6863L7273
8194E4205q192l5235l1774k9N9133J9836J331q9112n8355J2258N3778l2265j7935
8181g2356N6821j557j383L3338K6826n8417l8021K4625K2125j0511K3008L1964
8169C6462j9185m201N5543k7850O126K2336K8523l9502l4557J6998L4202j7324
8157E7571k3551k6576K6905L0704n2959q4322K922L5296L4997j3600N047J0692
$$ y = [-6561, 26806, 36592, 44325, 73625, 58190, 71919, 95335, 80794, 88534, 118836, 41320, -29079, 94197, 172962, 183851, 154358, 165585, 202197, 162760, 186325, 170828, 116376, 88761, 96073, 39223, 39583, 27082, 47325, 35022, 16657, -36104, -61751, -68015, -103140, -54886, 4263, -11749, -50400, -59546, -121016, -81968, 21363, 46423, 45160, -50252, -103810, -49931, 16932, 54205, 46013, 10778, -20996, -21025, 38108, 57944, 59275, -29837, -88192, -75934, -22156, -54421, -72356, -15535, -17092, -18475, 14863, 41689, -16728, -54749, -30124, -7999, -18510, 4498, 36462, 17277, 13076, 68619, 40769, 46895, 69231, 97754, 58252, 23695, 40693, 74895, 57571, 34020, 7444, 34349, 65053, 12094, -72228, -69306, -34010, 987, -12613, -7566, 3126]
8145C126M4990L898q2059j7357J8128N897Q6818J3759n7750M237n644n244K3044
8132C5843M7673j9251m631j6733o760m7245m3011K9881m5386R129M2611J7600
8120b80Q2893O6488K1537r6305r8557L5350k431o398K3848K3542M5160J6168m3276
8107F7739j7381L1206L5216m0035K3752R424o8262k8998Q238L0085R44K1445k4251
8094D9122L1279p712j8602k5590j7127m2688p750Q6820M4806K6793j6796K1321
8082A23876k1775p4838k2499M7016O0712l161l9675k4148o562j6082n386j9345
8070a867p510M2795q150j5080l7826P7983l3359j780J7818L1370j2796k3907j1615
8057A6076j4730n0105N1035N3911j7827K0007M7989J5285l4670K2180n4450k2912
$$ y = [3126, 48116, 52014, -30045, -47402, -29274, -23377, 63441, 77200, 19450, 23687, 18043, 12799, 35843, 83516, 64265, 59634, 42901, 36141, -11104, -54115, -24234, -69620, -60491, -17880, -280, 82613, 149101, 170638, 74333, -24224, 11126, 8695, 2297, 26145, 49687, 94847, 111015, 67739, 50358, 81564, 116780, 76745, 100497, 109921, 41659, 12661, 20899, 50984, 51928, 73373, 49122, 80401, 72689, 54087, 28497, 11370, -31318, -39068, 47752, 92558, 119351, 102555, 123876, 102101, 27263, 4764, 51780, 112492, 109331, 69656, 45508, 38946, 22864, 17478, -1867, -9377, 33418, 25268, 10188, -27638, 50345, 16986, 15206, 33024, 64394, 51598, 27691, 16076, 1346, -48759, 2276, 56187, 38360, 58367, 106356, 121641, 86971, 109151, 54701, 31789]
8045C1789M4774L4822o9369m4366K7459m517M1593L5182o088Q260l3756Q462J7141
8032I1386K8181L991l6223N1347R1170K7023m5709m7363l7756n7169l138k7393
8020C8347N1937J18325N431o8784k3479K089L7089M1822j5086n1659l1012p9081
8008B5939J4402M8901O2797P9517R812M9720m010o3665J5367L6452k8004k7054
7996B20174M9923j7868o8055K0612N274m7548k8803P9391J1502q1824o3781n7657
7984B1340n216L2693N189M3903K6803N9678J8105q7884j1819K5377k208p9367
7972D6594J4505J6697N7822M4006J5572j2591L0722l2378k8583M3519o6703o8833
7960F0349N6772N3399o5652K3792L1009n326J6448J1793p7411l752M1078o794
$$ y = [31789, 76563, 111385, 42016, -2350, 25109, 20592, 62185, 97367, 91279, 99539, 65783, 74245, 91386, 119567, 123558, 87335, 138682, 229852, 256875, 211166, 163803, 126047, 68878, 65740, 38347, 90284, 208609, 214040, 145256, 121777, 123866, 160955, 202777, 187691, 136032, 105020, 25939, 40341, 89242, 152039, 231556, 241368, 291088, 287078, 223413, 238780, 275232, 247228, 220174, 270097, 252229, 184174, 204786, 210060, 162512, 133709, 213100, 224602, 142778, 78997, 21340, 16124, 48817, 54006, 97909, 124712, 184390, 202495, 114611, 102792, 128169, 125961, 46594, 61099, 77796, 135618, 179624, 195196, 182605, 213327, 180949, 152366, 195885, 129182, 60349, 117121, 170520, 104868, 128660, 159669, 154343, 170791, 182584, 105173, 101421, 142499, 135705]
7948A35705p5463k8968M494O5949P3319m24l4650R101m4395N3060m8180k2578
7936H6970O2266j0736m5007l0150K6654k6616N0929N1497N4037M0712j8336r3268
7924A48952j2997J3487J095n0470l9522p807O6206L3910k8996m851m5901j463
7912G1643K6960p110K1006j4918k9317J0322L5239k2676J6513j3407K9324r698
7900A13881j2609J0752n1294J406J15006P20M174p846m8748p7074p0034k5280
7888d6946R9918J0324J167q4143N9216Q1219o8903n2112Q4592M0861J7958J4425
7876A57576j4277p868L6821k1524n2123n2586m1557n4005M3908K7903O563L8972
7864F7803L1040k3001l0437m6688m0542k3163J0778L0659J9995J5670J0117m7342
$$ y = [135705, 60242, 31274, 35768, 101717, 175036, 174612, 139962, 149063, 104668, 157728, 109548, 86970, 149236, 138500, 93493, 63343, 89997, 63381, 114310, 165807, 219844, 260556, 242220, 148952, 135955, 149442, 150537, 100067, 60545, 52738, 118944, 152854, 123858, 119007, 73106, 71643, 98603, 91493, 112499, 97581, 68264, 78586, 113825, 91149, 107662, 94255, 123579, 113881, 101272, 112024, 60730, 62136, 177142, 177862, 182036, 174190, 125442, 48368, -21666, -46946, 52972, 63296, 64463, -19680, 39536, 120755, 51852, -260, 84332, 125193, 143151, 157576, 143299, 135431, 172252, 150728, 98605, 46019, 4462, -49543, -5635, 22268, 28831, 67803, 98843, 75842, 45405, -1283, -41825, -64988, -54210, -23551, -3556, 12114, 22231, -25111]
7852b5111m8714P4487N6670K6734m4629k5590l969R5843k4059n3990j8281j134
7840H257Q171j4377J3450k9154n7120J9253o360J5166M715k6531M7093O460N718
7827e259M0983J2017N3574M975p7446k3972J2793k5586k5267K7369j0452k8454
7815d4725l0006k2894K7172M6915J2343m4261k3623L6735P3565k2300j2559l2615
7803c6253J2841O284j6985m4779l5905j6507Q5795M2388M7944l288n972J7691
7791E3254J2852o301n4943l8837J5415J3368M6226P0336J6072l8849m3195K6462
7779G1860o932n2512j31045K1365R0818O1242L2095M1190k9939o1411J5557L3054
7767H5342J9104k5646K8000M0023l1407n2503l7052l6214J5281j4433N789O2534
$$ y = [-25111, -73825, 662, 57332, 84066, 39437, 13847, 9878, 105721, 81662, 27672, 9391, 8257, 16428, 2051, 15501, -13653, -70773, -51520, -57880, -42714, -37999, -64530, -17437, -10977, -5259, 35724, 47741, 101315, 106290, 28844, 4872, 17665, -7921, -33188, -5819, -16271, -44725, -74731, -97625, -70453, -23538, -11195, -55456, -79079, -42344, 31221, 8921, -3638, -36253, -23412, -17128, -34113, -78892, -114797, -131304, -45509, -3121, 44823, 41535, 35563, 53254, 66106, 59805, 4862, -33975, -18560, -5192, 41034, 111370, 127442, 88593, 45398, 71860, 64928, 12416, -118629, -97264, -6446, 54796, 86891, 128081, 98142, 36731, 52288, 85342, 104446, 78800, 106800, 146823, 115416, 62913, 25861, -10353, 4928, -9505, -3716, 58818]
7755E8818L9073o9788l7549J485k3743L0307K0631K8519J8067j3959n0566o5098
7743f3803J5441P726l4385k3123N9703N1628J8992p8244l825Q7835K7705j4235
7731E1415m3057K0058k31q710k2385j3686l7372k9173N0790P5347p77m333l2228
7718E658R325L5405R788K3456N7842j1223j563k0147N5111n8247j6917l3596o2036
7705g144J6594j2445J4236P08J6519k1796k5540K4681J743k1820l4809j5568O5383
7692G42k6920j7359r255O5960K1578M899K0438r831n3587k7355l0561N427q6949
7679a42773J7619P0987L1026m2476m2172M8207K1358L0143M3397L275k5929M985
7667A7647K5300n3136K0160k9937k0831k5715m2069K9018M2067J1794M2869r507
$$ y = [58818, 97891, 28103, -9446, -7961, -31704, -1397, 19234, 47753, 65820, 51861, 1295, -63803, -48362, -40636, -75021, -98144, -38441, 13187, 32179, -46065, -49890, 37945, 65650, 51415, 8358, 28416, 28185, 19475, -2910, -16596, -53968, -83141, -32351, 42996, 42219, 37886, 5658, 14983, 50388, 60176, 83632, 141474, 130251, 128688, 108541, 163652, 105405, 88488, 54892, -7144, 9450, -2995, 11241, 11949, 28468, 6672, -18868, 5813, 7556, -14264, -49073, -64641, 742, -26178, -43537, -52792, 13168, 34746, 39645, 60083, 50252, -3335, -30690, -61251, -55824, -142773, -125154, -54167, -23141, -65617, -107789, -59582, -38224, -8081, 35316, 38591, 12662, 17647, 42947, -10189, 9971, -19966, -40797, -66512, -108581, -79563, -37496, -25702, 17167, 7660]
7655G660M290M5746l038p1639m3818J1998L4354P407r7495N593J8820j6774n2153
7642a49049N2129O4972O9748O1534j1279L419k1948j14633n0442R3547k2934k6965
7630e1901k1434K8990O7616O8845J6964j18888m9621L6084K4744l9602m2322J1683
7618f8842R0001K7268n6442N577L5358N173L060O7210m9883r403J9340k0949k9276
7605A8192m5889j5912k3700L7019P314P9610k0819m5039l4823m571M8991n478
7593e105M534l1490o767J290J840m199M7326p901k7860m5371L88J2054l7790l504
7579a02555N879J3319L4121j1346O2059L9148j6077R549m7986l1718l8963N5676
7567b8894K2989j2405K7159L6944N0154j2418o4118l1833l459l3073j2482m7972
$$ y = [7660, 11950, 57696, 54658, -16981, -60799, -48801, -14447, -7040, -104535, -98942, -80122, -96896, -149049, -96920, -31948, 37800, 99334, 88055, 91474, 69526, -45107, -95549, -2002, -24936, -51901, -73335, -44345, 23271, 92116, 109080, -9808, -59429, -23345, 1399, -38203, -80525, -68842, 21159, 48427, -8015, -2438, 32920, 38093, 41153, 108363, 58480, 49077, 68417, 47468, 18192, -27697, -43609, -67309, -30290, -22976, 56634, 35815, -9224, -44047, -48618, 373, -5105, -571, -32061, -38828, -37538, -35698, -39897, 7429, -472, -28332, -73703, -73315, -61261, -99051, -102555, -96676, -83357, -49236, -60582, 1477, 40625, 24548, 34097, -13889, -45607, -84570, -28894, -5905, -18310, 8849, 45793, 95947, 83529, 19411, -12422, -15881, -48954, -61436, -109408]
7555a09408k356M2891k6744L0479l4274n302r440K0011K1184j6164O3991N938
7543a9194P0713J8793J9968j4786n4915J0041o0343L3299k92n7903M0956M8959
7531C5296m069N255N4629K8915l4294l0154q9661p1062J8182K3953J6381k1738
7519f8367L3667P6661L4893j0828M2n1677N085p0826n2865K438L8280O700k898
7506e9695K1871j0000L3166J26844j3509p2820M008O489p2590l8263O8562J9403
7494A3466J2122m062J6943k7792L9924Q500n9131O27J5037N6384N2234l218q0360
7481D0674p374o2120k2833L6803N5795M2599p3809j08024o275P1323K3317n7563
7469f7487J4938O8098M3920q670o2197M2674P9684J8573k4238o1588n7864k1739
$$ y = [-109408, -111764, -68873, -95617, -65138, -99412, -104714, -114154, -94143, -72959, -89123, -25132, -19194, 51519, 70312, 90280, 75494, 20579, 30620, -29723, 3576, 3284, -54619, -13663, 35296, 31227, 36482, 91111, 120026, 85732, 55578, -34083, -105145, -86963, -63010, -46629, -68367, -34700, 41961, 76854, 66026, 66068, 14391, 19476, -51350, -104215, -101777, -63497, -56797, -59695, -37824, -47824, -14658, 112186, 98677, 25857, 29865, 36354, -36236, -74499, -5937, 13466, 25588, 21526, 38469, 10677, 50601, 59101, -30, 597, 15634, 72018, 124252, 121034, 40674, 33300, -28820, -51653, -14850, 40945, 83544, 9735, -98289, -104564, -33241, -9924, -67487, -52549, 15549, 59469, 50799, -11398, 31276, 110960, 129533, 105295, 43707, -14157, -35896]
7457c5896J84J858j6315O960L3367n261k0470N5086L9772n6096O3552j3280O915
7444F0376l5529l6428J4689O2359K8454M607M5641M4582k9803n5594p2086K5461
7432E6729L793P3931Q6222L3864r9531j30561l576J6090j4978m2052j4027o310
7420d0406L2942J0244k2347K735Q5801L3019n5456n7663N5356O295p133k9583
7408A3804M1968N9657n2412j2887k1115J9602Q865k1859k0075P208o835k1317
7396e396n831J5112k1975l6165l0303O9653p260m5599l1379K8127M4605N8076
7384C1665Q9k7759Q053M410m591l0607m2264K318M1362k6398N0799O085l5864
7371b2702O2446K7920k5725p1098l9680N086K931K5886M1643J05624J3072K5772
$$ y = [-35896, -35712, -33854, -50169, -43209, -9842, -15103, -35573, 19513, 59285, 3189, 66741, 53461, 60376, 24847, -11581, 3108, 65467, 93921, 98528, 144169, 188751, 158948, 103354, 31268, 56729, 60522, 134453, 220675, 254539, 155008, 24447, 20871, 36961, 21983, -20069, -34096, -40406, -7464, 2780, -19567, -16832, 68969, 101988, 46532, -11131, 44225, 50520, 43387, 13804, 55772, 115429, 63017, 50130, 29015, 48617, 57482, 35623, 15548, 22756, 15921, -5396, -11227, 3885, -18090, -54255, -84558, -14905, -22165, -67764, -99143, -71016, -26411, 31665, 31754, 3995, 12048, 16458, 11867, -18740, -61004, -58686, -17324, -43722, 7077, 13162, -22702, 39744, 67664, 41939, -29159, -68839, -63753, -60822, -34936, 6707, 112331, 125403, 151175]
7359A51175k2544j1220l6696p898k4484k2825K810O016N553l0692n9266k5189
7347g5260K9973N0666J4198N518m7018K7101L9443K1388n1063m3570L0154o988
7335e458N264j7153j1003j6103J7436P814j6547j5560K9780M2555O2666p831m8631
7322B7229n9703K1342L1426j0440O1948m6822k5111M0514l967J5284J698J232
7310E4630N7950k7948j25219r4563K0599M5576J3502J1416k0892J1146p633j1317
7298g2753L4845K2631L5012k8737L2713r64n8850l6121L720J4125K6268R204M873
7285a4034N4954L5885j7919N0338J7451l1627l2611j913N179m5419n8753L498
7273c4971M8331n1159j7098J8330J484l0898m8563j140Q2413N0203M3533l0309
$$ y = [151175, 128631, 117411, 80715, 72817, 48333, 25508, 28318, 34334, 39887, 9195, -50071, -75260, -45287, 5379, 19577, 25095, -21923, 5178, 44621, 66009, 14946, -28624, 1530, -5458, -194, -17347, -28350, -44453, -27017, -19203, -35750, -51310, -21530, 21025, 83691, 75860, 27229, -32474, -11132, 20294, 9854, 71802, 24980, -131, 40383, 36416, 51700, 53398, 54630, 112580, 84632, -40587, -135150, -114551, -68975, -55473, -44057, -64949, -53803, -61436, -72753, -37908, -15277, 19735, -9002, 23711, 22747, -36103, -72224, -68504, -54379, -28111, -18907, -14034, 40920, 76805, 58886, 109224, 126675, 95048, 62437, 60524, 65703, 20284, -38469, -34971, 13360, -37799, -54897, -36567, -35083, -65981, -114544, -115684, -33271, 16932, 60465, 30156]
7261C0156r7374k7386L8932K5715M0429k3497L6654m0601n1056O0114m9224K3120
7249c4018Q131M992J6812m4615j8489j8802K3873R0863O6276k9193r8892o6435
7237i9497J3965l1725k3809M6509J3684o6753K1542M9457Q2212j9486q3133N2175
7225d4859N5315l6382l5185J0774Q2639N1755r912p5676o7267k8085K574J2160
7213h2149K857N8017K7258L0247n6488o8081p725M1914n942n548J3556j9209r068
7200h0361N3289M3123j8379m0615o0903K2169L5394J3035L1183K7451k0974l0001
7188b5589J7840M737J0761n2766l6639k6860L1649N1307k469N5267j0027n0026
7176c2815J9425J00509q0765k0120j5080M7620m4615q5821k4894O917N4512N3361
$$ y = [30156, -67218, -94604, -55672, -29957, 10472, -13025, 23629, -16972, -68028, -7914, -57138, -34018, -25887, -20895, -4083, -48698, -67187, -85989, -62116, 28747, 95023, 65830, -33062, -99497, -85532, -117257, -141066, -94557, -80873, -147626, -126084, -76627, 5585, -13901, -97034, -44859, 10456, -25926, -61111, -50337, 32302, 84057, 74145, -1531, -68798, -96883, -94309, -82149, -79292, -21275, 5983, 36230, -20258, -88339, -96064, -54150, -60092, -65640, -52084, -71293, -80361, -27072, 16051, -2328, -42943, -103846, -81677, -46283, -33248, -2065, 25386, 4412, -25589, -7749, -3012, 7749, -45017, -81656, -108516, -76867, -25560, -28029, 27238, 17211, -32815, -13390, 87119, 6354, -13766, -28846, 18774, -25841, -111662, -136556, -129639, -75127, -21766]
7164b1766O0P339J8802l2453L2237n1703l2529P7014M250L3876l823r669K0596
7151D2231j0743j5121n952n4710j5860J7443O9530R684p4652k3519J7876N807
7139c7986O1995n680l7890l2984L0123M6540K8228Q550l1721O662p4947m4042
7127h3152N194j2467L2657N5372J0906l0675L50k064J1660j950o8691p195J04166
7114A4111O3786l6302l624o3877J9031J3058m9134K414O2672M6631j5596l5910
7102A7260j8644m790m9470o650J1626M1898J3552l6382K1185J5260J1687m0681
7090b4149K3971P1170m1622q2623L789K2062l8465k9733J6909O9054j5228m1054
7078f5919R607P3321M0054J6309k78o3813j00426j0461k9192O2960L6856l8628
$$ y = [-21766, -21706, -14367, 4435, -28018, 4219, -47484, -80013, -2999, 1251, 35127, 31304, 21635, 42231, 31488, 16367, 10415, -44295, -60155, -42712, 26818, 36502, -38150, -61669, -43793, -37986, 24009, 18329, -19561, -52545, -22422, 24118, 52346, 60896, 29175, 35837, -39110, -83152, -77958, -90425, -57768, -2396, 8510, -22165, -21815, -23879, -12219, -14169, -82860, -90055, 14111, 77897, 41595, 37971, -25906, -6875, 6183, -42951, -40537, 22135, 68766, 53170, 17260, -1384, -6174, -55644, -62294, -50668, -8770, 4782, -31600, -10415, 4845, 16532, -24149, -178, 70992, 29370, -53253, -49464, -27402, -65867, -95600, -78691, -9637, -24865, -65919, -56312, 17009, 57063, 73372, 73094, 9281, -91145, -101606, -130798, -67838, -30982, -69610]
7066f9610k1671J0956K6780L0646K1012L1594Q898j22821K8851K4032M4963R517
7054B3147j9163j4351k9454L986J2740J412p176N7396R1809k8017q1543p4189
7042f3403P15M8029L3336M5821j1547M8647K7727P113o0230q6142l7912O212L112
7029c8522j7706l2826N5772N8421Q621J188k427l6979k3304m6481O776M9601N8145
7016D0279m1685k0529K8382p628M7033J7669O2314k1175m0153J6225k8247j3284
7004C9201J586j6914l7610p667j2203K5183N298j0181N4070M5529K250K575O229
6991I7346j15434n0136O6919N3212q876k9198l2310j6133M656k1848j2066J6694
6979d7174O7528j1166m5123m8528K558J1382Q177k610J1891L0881p212Q606J4483
$$ y = [-69610, -91281, -80325, -53545, -22899, -1887, 29707, 38605, -84216, -55365, -31333, 13630, 23147, 3984, -10367, -39821, -35835, -23095, -21683, -28859, 28537, 120346, 92329, 10786, -63403, -62688, -14659, 18677, 64498, 52951, 101598, 129325, 136438, 76208, -9934, -47846, -41634, -38522, -56228, -89054, -33282, 25139, 33760, 34948, 32521, -4458, -27762, -74243, -67467, -17866, 40279, -1406, -21935, 6447, -1181, 45852, 63521, 125835, 104660, 64507, 80732, 52485, 39201, 40787, 23873, -13737, -21404, -33607, -8424, -3126, -13307, 40763, 86292, 88542, 91117, 97346, -18088, -68224, -1305, 51907, 43031, 13833, -18477, -34610, -29954, -51802, -63868, -47174, 20354, 9188, -35935, -84463, -81905, -70523, -62346, -64956, -53065, -22184, -29396, -20790, -6307]
6966f307n963J0768l2764l173K912r793R5393j7490L2916Q6838n3231o8911k5590
6953E605M223Q947j8601J3464Q040j4585j6950M3709J1945O8443p365p4465l9639
6940g229M7075j1520J5021l9706K6136k683r4050j8127O5586O5834N8621l6684
6928F8274k6460j4238n087q612L769L3132L6512q7058o8656l8240K9645Q8473
6916A1454n1102n2380K3095k9950L9613Q4898k3766j3132k2355N6434L4534m1080
6904A6263M486j2337m2211M0643L7910n0672l25l1555j23686n8705Q6152J9331
6892a14706k7405N3063L1509l9171k6939J6163L1473P8583K490j9836K5290J9647
6880C0161K3315K7927l6100m3397N323K1327J9691J5459j9740j3349q3577O858
$$ y = [-6307, -12270, -1502, -34266, -37439, -34527, -44320, 51073, 33583, 66499, 153337, 100106, 31195, 5605, 9828, 18775, 174, 13638, 21678, 7093, -9857, 33852, 45797, 114240, 106875, 32410, -7229, 39846, 28326, 43347, 3641, 29777, 27094, -66956, -85083, -19497, 46337, 104958, 68274, 41814, 27576, 22489, 13877, 17646, 50778, 87290, 232, -68424, -106664, -77019, 11454, -39648, -92028, -68933, -98883, -59270, 25628, 1862, -11270, -33625, 22809, 57343, 16263, 20749, 8412, -33799, 6844, 44754, -5918, -6243, -37798, -161484, -220189, -134037, -114706, -142111, -89048, -57539, -96710, -123649, -107486, -76013, 2570, 5060, -14776, 10514, 30161, 53476, 81403, 45303, 1906, 7229, 28556, 48247, 63706, 43966, 30617, -52960, -46102]
6868d6102J3864k0028q0629q638K0331k4727P129K3780M8901L9018j1065k0076
6856e8242J5423L515J6845q153N3295L859j5613k9428k0541k398k4051M1830j1314
6843c4973n4930k5442M2980P8059N4743p0114l5584J8877q167j0503k2421o6570
6831a34045l0627L7505Q7863J29514k6397k1913M4877k558o3815j4698l795M0673
6819D2584P843n3593j8206N1569M5293O3994m9254m0626o6714l4488O8832j5203
6807B031m7098j1788k7002l4637O3892P08r671L5483k8651j4378K9974K967N9272
6794B1102O0933K621j7429n6839p963O5946O0612l0950q9880k3324J7426j1463
6782i208L360N0941J3613o8263m1376M9503l263l4839m6310L9993M5304K7140
$$ y = [-46102, -32238, -52266, -132895, -141533, -121202, -145929, -138800, -115020, -66119, -27101, -38166, -58242, -42819, -39304, -22459, -30612, 22683, 26542, 10929, -18499, -39040, -41438, -65489, -23659, -34973, -89903, -115345, -72365, 5694, 60437, -9677, -45261, -26384, -34551, -45054, -67475, -134045, -164672, -127167, -39304, 90210, 63813, 41900, 86777, 84219, 20404, 5706, 1911, 42584, 50427, -3166, -21372, 30197, 75490, 139484, 90230, 49604, -17110, -51598, 17234, 2031, -45067, -56855, -83857, -118494, -54602, -53894, -63565, -28082, -56733, -71111, -41137, -38170, 21102, 82035, 84656, 67227, 10388, 2425, 68371, 128983, 98033, 8153, -15171, 2255, -9208, -5848, 45093, 58706, -9557, -50933, -1430, -4693, -39532, -85842, -45849, -545, 26595]
6770B6595J7817M1483M3261P278k6684m5016K2247J5637q3387q348k6307m0804
6758e6228J8066L6837L5046o8343m8730M299L7300m281o716r77K9704K7220k2155
6745a8958K891k0518J5167M5433O1852P156M662O022p092n2673n0219k1278K5052
6732b503l58j02113n1166O5825O9325k5745j8872l4907O8674M4015Q852Q5562
6720A06589K4255j203M7110J4535M0398O4925n2984j41253k4001j8228m7389q6028
6708g3274m526K9817k3079N6192J9050j5877o8986m7973P4071L0723l345K2267
6696d940N2062M3476j0876m0521k2752N3735J9093J554q629j07181m0942j8931
6684h4852L9724k5592J8193j2891J9001j2816L105J7699l521n1221P367L4268
$$ y = [26595, 44412, 85895, 129156, 136434, 109750, 64734, 86981, 102618, 19231, 10883, -15424, -56228, -38162, -1325, 33721, -34622, -83352, -79053, -41753, -46034, -52750, -53727, -24023, 3197, -18958, -16067, -36585, -21418, 24015, 85867, 93023, 97685, 103707, 96615, 43942, -6277, -27555, -2503, -2861, -104974, -156140, -90315, -20990, -46735, -65607, -100514, -31840, 12175, 21027, 106589, 130844, 129641, 176751, 191286, 231684, 296609, 243625, 102372, 78371, 60143, 12754, -73274, -77800, -47983, -71062, -14870, 4180, -11697, -80683, -128656, -54585, -23862, -27207, -4940, 47122, 90598, 79722, 39201, 16449, 70184, 89277, 90831, 82202, -24979, -65921, -84852, -45128, -70720, -52527, -65418, -46417, -59233, -56128, -38429, -41950, -93171, -85804, -51536]
6672e1536l3374q713j8096J7327N935K1090J3565K420Q5085N676k1038K7502r448
6659C6395L4780P955j9798n5862j27722p6949l667M9224J09632J9639K4956J2232
6647A0815M596O5620k4175j2769l0168p4716M3727K2837J56J0350k5763o0333
6635f9823K7473J5646j8861k4685R517M0662J3237m5159n0742k0099o316L904
6623a25246J2047N9003M7787K4972J5799l8245p990M9137L7596k6871J2067j5372
6611D4684m6735n4093p757L4336L533n2185j8937R9382P889j7623j3395L8134
6599A7233J9237j5014l7264K6079q522p1764m619M9252N45k5743Q235K8400J3894
6586e1k6271j8693N5330N3519n8010n3409k2036k9329l2969P89J5441M8196k551
$$ y = [-51536, -84910, -93623, -111719, -94392, -88457, -67367, -53802, -51382, 33703, 39379, 18341, 45843, 36395, 71175, 79130, 59332, 3470, -124252, -201201, -204868, -155644, -46012, -26373, -1417, 10815, 15411, 81031, 56856, 44087, 13919, -60797, -17070, 5767, 5923, 16273, -9490, -69823, -42350, -26704, -45565, -70250, -60733, -20071, -6834, -51993, -102735, -122834, -129150, -125246, -113199, -54196, -6409, 18563, 34362, -3883, -11873, 37264, 74860, 47989, 60056, 44684, -2051, -56144, -63901, -29565, -26032, -78217, -97154, 2228, 10117, -7506, -20901, 17233, 36470, 21456, -15808, 10271, 1749, -70015, -74634, -25382, -24837, -50580, -42345, -13945, -51, -26322, -45015, 10315, 63834, 5824, -47585, -69621, -98950, -131919, -131130, -115689, -67493, -70044]
6573g0044L1200J7048p2452N4466L5538L5939l8234m7164R100j5607N0899k2449
6561c1760l8150J9903K4085j8650k5574M1313J8653l696M8421J9547m0194K0898
6549C4796q7574j1160L1219k29p663M104R2317P8880o5945j267k7936j11761n9330
6536a31549M0704j1056O502P2880R7736k5486l7660M0401j5463j4016O437k150
6524B7280m439j5352p8907K2881N0983J3306J2220o2436J8022m802o3488M8319
6512c6413P6855M244o9495n9945o492M7561M8160k5608k2311K4559k39j9681N4861
6499A6056J9625M125j9893K9303k6631m1907J1987N3345j1470J0965p315M8736
6487H6926K3102j09768k5012L7959l6211L7171M8955L2845k5907O4059l4834l0619
$$ y = [-70044, -38844, -21796, -94248, -39782, -4244, 31695, -6539, -53703, -44603, -60210, -9311, -31760, -69910, -50007, -25922, -44572, -70146, -28833, -10180, -13876, 34545, 54092, 13898, 34796, -52778, -63938, -32719, -32948, -40611, -36507, 55810, 134690, 68745, 67478, 39542, -72219, -131549, -90845, -101901, -95399, -22519, 75217, 49731, 12071, 52472, 37009, 22993, 29430, 27280, 22841, 7489, -71418, -48537, 2446, 15752, 27972, -34464, -16442, -21244, -84732, -36413, 40442, 44686, -24809, -84754, -91246, -43685, 4475, -21133, -43444, -18885, -19124, -38805, 16056, 35681, 39806, 19913, 49216, 22585, -19322, -7335, 46010, 34540, 45505, 38190, 86926, 110028, 260, -24752, 13207, -23004, 14167, 63122, 95967, 70060, 134119, 99285, 68666]
6475F8666k1800q6804o8108M1592J4990K7372L4093m7328j1757N35k3977N964
6463f6562J04684L0247l1001n012J5057k4513o2063k7768j9229L8087R1058M299
6451D7284m8297N1006Q1397p0804o1907m1183K7733N7554l0821P098l2593l5659
6439d9192J7019Q9056K0722p4110j2261o9657j03550k7868M4653O3947M9629R2161
6427D0549J09669J576k0322m4918m866k0845j3919j1294k7179M2548O649l1707
6415B5941l4058j8546J6118p536M7028Q733m3910l5532l5929J4961l7657L4832
6403f5555O5151m7547K256J9379K7884N4564L2638L0725p1455N62j7722l1654
6391g74l9656K0251Q0096Q7414m5475p1579k7501p270K1580R64N85M9463p76K100
$$ y = [68666, 46866, -39938, -108046, -66454, -51464, -24092, 10001, -37327, -49084, -48549, -72526, -66562, 38122, 68369, 37368, 32356, 47413, 22900, -39163, -66931, -86160, -48073, 42985, 47284, -1013, 49993, 131390, 60586, -1321, -42504, -14771, 42783, 11962, 19060, -13533, -49192, -32173, 56883, 77605, 3495, -8766, -78423, -181973, -209841, -165188, -101241, -51612, 40549, 150218, 151794, 131472, 86554, 81688, 60843, 46924, 35630, 8451, 50999, 57648, 25941, -8117, -26663, -10545, -18081, 28947, 37680, -6230, -41762, -77691, -62730, -100387, -65555, -404, -47951, -45695, -26316, 1568, 56132, 88770, 119495, 48040, 48602, 30880, -774, -40430, -20179, 59917, 147331, 101856, 30277, 2776, -4494, 17086, 18050, 18635, 68098, 67322, 69422]
6377F9422r351j1357l4894p0583L0762N6617P0753o489k0716l6345l636O147j0264
6364C0066o7565K0789J2173j3794J419J1759J9737K4808p8459k7027j1860P2588
6352e366P63K2593M7169K1046m0628o5112j4609L3272K6058N7043l5177n9199
6340a2147o403n899L2266J9432n5829M971j5849K0923N380k6143P6268P1565n996
6327A02539q274j01984q6863N5921K5868L572N197R2830o354q7273o5588l4447
6315a04856L9355L7968J9638M3365K6360P439n3851M6673N2103j0550j3695k1627
6303F8322n1136k5985J1675k4454l9108P008J4759k8181q453L9971Q660N760K8322
6290G160l4252k7053J9177r952l2975N6098j7153J9093M871O624m8712k585P563
$$ y = [69422, 60071, 48714, 13820, -56763, -26001, 30616, 101369, 94880, 74164, 37819, 34183, 40330, 30066, -37499, -16710, -4537, -18331, -16912, -5153, 14584, 39392, -39067, -66094, -77954, -5366, -4603, 17990, 65159, 86205, 45577, -19535, -34144, -872, 25186, 82229, 47052, -12147, -18550, -24449, 7817, 27249, -28580, -23609, -39458, -18535, -13155, -39298, 36970, 108535, 102539, 94265, -7719, -94582, -38661, -12793, -9221, -4024, 88806, 82452, -4821, -70409, -104856, -65501, -27533, -7895, 35470, 61830, 69269, 15418, 62091, 114194, 103644, 89949, 68322, 17186, -8799, 2876, -21578, -60686, -53678, -38919, -67100, -75553, -35582, -26922, -21162, 7160, -27092, -54145, -34968, -44920, -77895, -21797, -38950, -19857, -14986, -8362, -57074, -59659, -52096]
6277e2096N2984Q8218j6028n0948N193j3204K2433k4569l56K287l0784m7365p16
6264f4951N3366O0517l1197q683j4700q171m771l801k4029k6152n6581o7091R6821
6251i9423J15309n59l7470l1819K0183M5669j6448j2851o1765K9575J4221k1331
6239e6709n6388p0849P685K7623P4301J32801j6343n9936o785j3945L2287J34
6227f124q626M3280k486J0240m2319J2709Q373k9190n755j5650L9785j411n0047
6214d7221m2879R516J0149O1382P0358j4649l3615K7341p7448j429L8043J1494
6202A1042n6821j3914N3223J1040J0401j5604k0176N4818L1166l7010J3382k7633
6190A3914p1590k5423j6655l4502M3411M1902N0103k2656K1044N6573K0837j5835
$$ y = [-52096, 888, 89106, 73078, 22130, 27323, 14119, 36552, 11983, 11627, 13914, -16870, -64235, -64951, -11585, 48932, 17735, 9052, -5648, -13819, -18590, -22391, -46420, -72572, -129153, -196244, -99423, 15886, 15327, -22143, -53962, -33779, 11890, -4558, -17409, -79174, -49599, -35378, -56709, -113097, -183946, -176261, -148638, -74337, 58464, 42121, -17815, -24600, -38545, -6258, -6124, -14750, 28530, 26044, 36284, -6035, 6674, 15047, -14143, -19898, -35548, 4237, 2826, -47221, -90100, -80584, -70435, -9053, 61305, 46656, 13041, 40382, -37066, -38495, -452, 11042, -45779, -59693, -6470, 4570, 14971, -633, -20809, 34009, 65175, 28165, 41547, 13914, -57676, -83099, -99754, -134256, -90845, -48943, 1160, -21496, -452, 56121, 76958, 61123]
6178F1123o239P501K8712n098j6254j1483O514l5946m0827n5885j5447o947J1285
6165g8991J8990j9221J0973Q2105M9892q1395n0450j9809l615j8141K8997N0685
6153b9980J540r830n1213J2630M7874q908l2820P977O513P0945L2133L857o3746
6140a3028J4343l5572o42P7545L1793m2936M3003l413p2849j7364L7983K8578
6128D7441l779j9519n7972j1127M3101n56j2352k5598l140M250K5723O0426M5104
6115I2002l2780p3533p5978M5910N7583J4205P4048l7783n1531m0074l0267m11
6103e8609P1932l5420j7931j9760R5492k9203K1752n0308N438L8292j6162p9851
6091g4338m4505K610j4877K7811Q2808M120q0086p703R8343n4599J5451J8187
$$ y = [61123, 54884, 62385, 91097, 85999, 69745, 58262, 64776, 28830, -11997, -67882, -83329, -90276, -78991, -60001, -79222, -68249, 13856, 63748, -17647, -68097, -87906, -91521, -109662, -80665, -29980, -28440, -38270, -89483, -76853, -28979, -37887, -70707, -62730, -56217, 14728, 46861, 50718, -13028, 1315, -34257, -34899, 42646, 74439, 31503, 74506, 71093, -1756, -19120, 18863, 47441, 43662, 24143, -33829, -44956, -1855, -2411, -14763, -40361, -43501, -39251, -13528, 46898, 92002, 59222, -14311, -90289, -44379, 13204, 27409, 101457, 63674, 12143, -27931, -58198, -58609, 13323, -22097, -40028, -59788, 35704, 6501, 28253, -22055, -16617, 21675, 5513, -74338, -118843, -116233, -131110, -103299, -20491, -16371, -96457, -104160, -5817, -60416, -44965, -26778]
6079b6778l0708J3711Q905l387J1671J9706l788M3156j6976k3173p6572k718O7286
6066a9665M9835m2792k2281m7685O586l9963M152k4297K7604K2080J1820J5222
6054e9384J599j220J7984J4888j8045n0681p0335j4510O7203M5030L6667P9070
6042D8266o9375r8332K5379K9134k7970n418O9448M8340k9628K863j1984o0720
6030g9997l6978p630L6391J24158P1324K9834m2350o4923p6783r5239J145R8216
6018d2832M6129l0731K9765l016K7043k9556j7722L0858J9497j399k4052l7075
6006c3091n5563o7315o762P2242P0001r478O11L7596k9079n03O456l7214M3845
5993h254M3301L4550n1189m3362j4821K637p4256K5580L0745L9681R900k2271
$$ y = [-26778, -57486, -43775, -34870, -38257, -26586, -6880, -10668, 32488, 15512, -7661, -84233, -86951, -19665, 30170, -12622, -34903, -82588, -76002, -115965, -111813, -136110, -108506, -86426, -74606, -59384, -57785, -59005, -41021, -26133, -44178, -94859, -165194, -179704, -112501, -67471, -30804, 48266, -21109, -119441, -94062, -64928, -92898, -98316, -28868, 19472, -10156, -7293, -19277, -79997, -116975, -124605, -88214, 35944, 107268, 137102, 94752, 29829, -46954, -142193, -141048, -42832, 3297, -27434, 2331, -685, 26358, -3198, -20920, 9938, 29435, 28036, 3984, -33091, -88654, -155969, -162731, -90489, -20488, -29966, -29355, 8241, -20838, -21341, -14885, -52099, -8254, 35047, 69597, 18408, -24954, -39775, -37138, -111394, -85814, -55069, -15388, -5488, -27759]
5981b7759k7083K185O7392k1567r3796k5436J5055J6035M1167J9289M5225j9016
5969h309l0574n0774O5151Q877R690o260p034K1530n2970k7n1626k2885K1136
5956a04075L0352q206N708j8228m1587n8708L9236P6277o29K8827J390K2178J2361
5943a5104J7346M3108j9292l5115o214J2024J8497K0101K8017o016k3655O908
5931D0605N077k2415p8159l1917K8500O1266N6244l219l9274l5477j8370j2247
5919d9386M2802k01n2743M0727O3869J8176l1531l9574N532J3449J4950N6401
5907H2471o277q0629P35N8995n5882j6377L7655j9668N9643N1973p1329r4508
5895e3198M273M1045O085K7084j1147L8098j4428j0908m6179J5143J6038Q538
$$ y = [-27759, -54842, -52657, 14735, -6832, -100628, -126064, -111009, -94974, -53807, -34518, 10707, -8309, -38883, -89657, -24506, -15629, -5939, -12199, -19233, 2297, -50673, -50700, -102326, -125211, -104075, -73723, -81929, -76221, -94449, -136036, -194744, -155508, -79231, -79860, -51033, -49643, -27465, -15104, 2242, 45350, 26058, -9057, -15271, -3247, 15250, 35351, 63368, 57352, 33697, 40605, 45682, 23267, -54892, -86809, -58309, 2957, 59201, 55982, 16708, -18769, -37139, -49386, -6584, -6785, -59528, -18801, 45068, 63244, 31713, -7861, -2329, 11120, 26070, 82471, 76194, -4435, -3700, 55295, -587, -16964, 20691, 1023, 60666, 112639, 41310, -53198, -48925, -7880, -1795, 25289, 14142, 52240, 37812, 26904, -19275, -4132, 11906, 20444]
5883B0444j8681j5905R705M2932m500L8795J8013j0899k4263M46l1802k6186p4753
5870g6654l8745J0703L232M2336P0754M6113J4702l9997K0899K672n5739J0558
5858A0834m108k7797N3729J9537P898j5681n3228k017p2329n7000L9564Q3580
5846a7018N2477k516K1567r81J9508j6305o9449m665k0757N4138N1967n1846J7878
5833C3998K58N853J8184j7479j1491j1910n0962m6291M033j1941J3866O3190L2407
5820B1715m270K9903r326m7774J1896K1503l2300m8528l9526j6814N0140O1504
5808a877m6691j1420j9821o1240j4364M6309R8248j4624p248R273n043L1712K8741
5795C1955J0334N507l1630O2767J1392r1254j19557J7251Q4235M7772K1421M2663
$$ y = [20444, 1763, -14142, -4437, 38495, 33995, 72790, 90803, 79904, 55641, 56087, 24285, -1901, -76654, -115399, -104696, -101464, -59128, 11626, 57739, 72441, 32444, 53343, 56015, 276, 10834, 6726, -21071, 32658, 52195, 60093, 44412, -8816, -10833, -83162, -140162, -100598, -17018, 35459, 32943, 54510, 53529, 73037, 56732, -12717, -17382, -38139, 15999, 67966, 16120, 33998, 34256, 40109, 58293, 40814, 29323, 17413, -33549, -79840, -75807, -87748, -73882, -10692, 21715, 17445, 47348, 38022, -9752, 2144, 23647, -8653, -57181, -96707, -113521, -63381, -1877, -48568, -59988, -79809, -141049, -155413, -109104, -10856, -25480, -32728, -23455, -28498, 3214, 31955, 42289, 47796, 16166, 78933, 90325, -929, -120486, -103235, -19000, 28772, 50193, 92856]
5783I2856j6303p5187l6592m0733K1732L2200k5932J1846M7715M5969k6044k8308
5771C219L1147P454j5231k2584m6089O273O831L8743R281n7518p956Q759J0667
5758b7004Q706M229P6955n8986j7956M0936M1567j2956o8802j2761L8213O4160
5746G6301K8525p1949m6255j2307K0971K7477n1327k8728j7794P2845K7797q864
5734A6692M727O6908j012r1289p8684J14475J21638l3229m310m1562l6059r247
5722B9048M2297N5690J6996p2322J5874K9154l1215o8302j4410k0679P173M5606
5710C4910j0846n7427J144j2314M029J02384k2721N449j5785j0130l8044K3265
5698C914N3375k5312R579M6047Q174l1191O3681l7637N6273j6464q1863l5431
$$ y = [92856, 76553, 1366, -35226, -75959, -54227, -22027, -47959, -36113, 11602, 57571, 31527, 3219, 34366, 41820, 26589, 4005, -42084, -35811, -28980, 9763, 19044, -38474, -46430, -37671, -27004, -18298, -14069, 62886, 3900, -14056, 26880, 68447, 55491, -13311, -26072, 12141, 76301, 104826, 32877, -13378, -25685, -4714, 22763, -28564, -57292, -75086, -2241, 25556, 16692, 21419, 88327, 87315, -3974, -82658, 31817, 153455, 120226, 115916, 74354, 38295, 29048, 71345, 127035, 144031, 71709, 87583, 116737, 85522, 17220, 2810, -17869, -10696, 34910, 24064, -33363, -32219, -44533, -40504, 61880, 39159, 44608, 28823, 18693, -19351, 3914, 57289, 31977, 41556, 87603, 95777, 64586, 128267, 90630, 146903, 130439, 48576, 13145]
5686A3145m5092n8523M7919P3831M5081M9295m6180j0201q978j6992j7090M2118
5674F8333k0654J8950m4737m0708l2853L4957k52L992K5850k4531l4207O1596
5662A5736j7014m3727K8159k5047j4404K7706k0476J8403q233j8128J7891k9221
5650f8355o0832J4163O0347J0791j5546Q172l6718M8943J28556J4390K7881p71
5638A31021l5998L3607j6575p8023m395J0298j5788n3327l4192L6692L6585N2608
5626F2513J8815j9866m7841n5537J8051K6097L7494n5365j0948M566K6419L7676
5614D2074O386p0421M8344J50630K6551p6333n4013o5993j04914j7092O8235M3524
5602c022k7607l0629j9272n4610j1397K1388J04650M4880N27p924L0477j6280
$$ y = [13145, -31947, -90470, -42551, 31280, 76361, 125656, 79476, 69275, 60297, 43305, 26215, 68333, 47679, 66629, 21892, -18816, -51669, -16712, -16964, -12972, 12878, -11653, -45860, 15736, -1278, -45005, -16846, -41893, -56297, -28591, -49067, -30664, -38897, -57025, -39134, -68355, -129187, -115024, -54677, -43886, -59432, -51260, -87978, -39035, 89521, 103911, 131792, 131021, 95023, 128630, 112055, 34032, 29637, 39935, 24147, -29180, -63372, -26680, 9905, 62513, 81328, 61462, 13621, -41916, -23865, 2232, 39726, -15639, -26587, -22021, 4398, 42074, 48460, -21961, 26383, 177013, 203564, 127231, 73218, 7225, -97689, -114781, -46546, -3022, -30629, -61258, -80530, -135140, -146537, -125149, -20499, 24381, 24908, 16984, 47461, 31181]
5590C1181m6305l6761j6558M3906m5316l5180M2292r876K407J3555J7721J01212
5578F2278l0729n7266J8577K8596P7849o9095l3948P512M5188m5777p2502L158
5566f6159M0987L8975l0529m5918J9338o60K702k8707n6940R313K2107Q9826K9366
5553B3701j8441L7661l972k7647m109K6558k1156p6579M764m7126R102M6556Q9512
5540C8824q364k9990j5020J8434n111o6269o0928k575M5064O7018j0966J145r6
5527b8834L967m4137J5730j56j5420K6259J4851m8682J8809M8410J0249j2432
5515a1386n332J9343j6209K2060l2262m3759N3756N1221q713m8895j5065J9319
5503a5922Q2119N469k237p4802N129K3266j0053o5097K0367P3215O472p0633l5412
$$ y = [31181, -15124, -51885, -68443, -24537, -69853, -105033, -62741, -72617, -70210, -56655, -38934, 62278, 31549, -25717, -7140, 21456, 99305, 30210, -3738, 3774, 48962, 3185, -69317, -66159, -25172, 13803, -16726, -62644, -43306, -43966, -41264, -69971, -126911, -117598, -95491, -5665, 23701, 5260, 42921, 38949, 11302, 7193, 33751, 12595, -63984, -59220, -106346, -97244, -50688, 38824, 30460, 470, -14550, 3884, -1227, -67496, -128424, -130999, -85935, -18917, -29883, -28738, -28834, -24867, -69004, -53274, -53430, -68850, -42591, -27740, -76422, -57613, -9203, 1046, -11386, -16718, 2625, -13584, 8476, -23786, -67545, -13789, 37432, 28719, -20176, -35241, -15922, 66197, 71666, 69429, -5373, -244, 23022, 12969, -52128, -31761, 41454, 47926, -22707, -58119]
5490e8119M0597K1344L2015j7334k6441m0024L3922L8534k472l4503m3233l218
5478e8932L3839J7800l7423K4106L6698n836N2895O7436K5176j06092j21461j585
5466g3379L1078R040m666N276m1513m6616Q45Q6O6632P1043J379l5087j4912P1366
5452D0572j5697k9333K6876K1609j2087J1760j0675J7037p5634J5987K5929m163
5440A2181K680l9444O6292l6851n0043K2096j3848p844N679m1184n1152J4536
5428a16902J1822r00L3461K5114N2062O9061J6776K7870o0948n4181k6468J5450
5416g783K8966Q8338R483k0601o9647j3033L0744M8204m1658m2246K1926K1233
5404E3926R739m7480L1252Q856m1070j9098n0960M7245j0053M8049Q2392K3815
$$ y = [-58119, -17522, 3822, 35837, 18503, -7938, -47962, -14040, 24494, 22022, -12481, -55714, -58932, -25093, -7293, -44716, -20610, 16088, 10252, 63147, 130583, 155759, 49667, -71794, -73379, -42301, -33261, -37927, -32651, -74164, -120780, -119935, -119849, -53217, 17826, 19205, -15882, -30794, 40572, 24875, -4458, 22418, 44027, 31940, 43700, 33025, 50062, -25572, -9585, 16344, 12181, 14861, -24583, 41709, 4858, -45185, -23089, -36937, -44781, -39102, -80286, -131438, -116902, -105080, -105980, -72519, -47405, 4657, 73718, 90494, 118364, 57416, 3235, -23233, -7783, 21183, 109521, 119004, 98403, 28756, 15723, 46467, 94671, 53013, 10767, 32693, 53926, 63665, 16185, 47437, 56293, 15223, -3875, -54835, -7590, -17643, 30406, 112798, 136613]
5392A36613k2122p3743m9601r024J9522M674M5168k0370l6818m5494k1403P8541
5380E943P8040k4073k6374L0947k3480n0830j8096K6785P355L264P208K6644J7717
5367F1050l482N098q0195q2432M3634Q6318Q349k3620J3498n0601l8351n3516
5355a14250K4367K1404j4244l0693r813O6342j0354R342n844j515K527L0303l6350
5342f8778L2497M0022j243P054n4719r666K2738N3863l9352k6628o873J7712J757
5329c1616m9858n391P1990k5800m900q308K1618K7159p7725o0794K6238M9648
5317f7739q137j7497k3384K5930P1039r90J2033r600J2983p0671L160L7851P9584
5304D4562L6329o3763q7764j4722L9935K084Q2298L689l0041P945o9818l0292
$$ y = [136613, 114491, 40748, -8853, -17877, 1645, 6319, 51487, 31117, -5701, -51195, -72598, 5943, 83983, 59910, 33536, 64483, 41003, -9827, -27923, -1138, 6217, 9481, 16689, 43333, 61050, 57568, 62666, -17529, -99961, -56327, 29991, 38340, 14720, 28218, -22383, -60734, -114250, -89883, -68479, -82723, -113416, -123229, -56887, -67241, -57899, -63743, -65258, -62731, -32428, -68778, -36281, 3741, 2498, 9552, -45167, -54833, -32095, 21768, -17584, -44212, -51085, -33373, -31616, -81474, -86865, -14875, -40675, -45575, -53883, -32265, -5106, -82831, -143625, -117387, -67739, -75876, -93373, -116757, -90827, -19788, -20778, -8745, -18345, -5362, -76033, -72873, -35022, 44562, 80891, 17128, -70636, -85358, -45423, -43339, 38959, 42648, 12607, 20552, -49266, -79558]
5292g9558k6861L2351N6253p149L8847L1276l2756j7064k432m8866K0476M5093
5280I610L1560m6761n5852J9799K1147N722J116N1488Q779k7941n4824R1285K1629
5267G6757j4152j328L1726m7348K6525J6119j2360M0872j5444o0378k4244j7058
5255c13K0746P2639L1209l3624m9862l3358L8305j8036o7359M0007Q7031k2157
5243F5228j19097r989O0265m9194l9199J5085K7765J2141O811N8556l305J4819
5231C9886j1876n1303o1103p8244K0234K0560n705K9574k912L3614O4109N6503
5219E3337P727p5801J3802L3460k9844K351Q4329L0273j19361l586P1085p8242
5207a0470j01254n0859j6344J7461K8365K0317K4040q379l136L3246L4139L6745
$$ y = [-79558, -106419, -74068, -17815, -24964, 13883, 45159, 12403, -4661, -7093, -55959, -35483, 9610, 41170, -5591, -61443, -41644, -20497, -14775, -13659, 37829, 46608, 18667, -36157, 55128, 76757, 62605, 61277, 93003, 45655, 72180, 88299, 75939, 116811, 101367, 40989, 16745, -313, 20433, 93072, 124281, 90657, 40795, 7437, 45742, 27706, -39653, 354, 87385, 65228, -53869, -63858, -3593, -52787, -91986, -76901, -49136, -36995, -30184, 28372, 25067, 39886, 28010, -23293, -84396, -162640, -142406, -121846, -127551, -97977, -100889, -67275, -3166, 53337, 61064, -14737, -935, 32525, 2681, 5032, 89361, 119634, 273, -3313, 67772, -10470, -111724, -162583, -178927, -161466, -133101, -112784, -88744, -97123, -100259, -67013, -32874, 3871]
5195C871p2909j5732M7276J2391L5137p329j7423M7029K0713n6768p8323J3295
5183f8772k024o757L8434M7555k1069o8783K5995O1312q82P934K1829l4209J5890
5170A6453m9183k7975J3583M0690N4896L2035l8169o3193O595P467k5255o828
5158c8884L8477L0363j797l2916M3436M9628L297r0996k6819R414M704p8392m0296
5145a30781L4903M1724M1305j077K2874l01J4815J1088J1662j4534m5874j4194
5133b8390K942K087L3017J4079l3223m204k683L7718O4827J7233q377m8640j9966
5120B6420j3398k4660j4553Q537n4065o8238J40199Q7670j2473j9453m4491J1998
5108B3493J0329R511n01n236p555j6639o4061N194j2514o3355n6269J4058j334
$$ y = [3871, -69038, -84770, -37494, -25103, 10034, 2705, -14718, 32311, 53024, -3744, -82067, -68772, -70796, -77553, -39119, 8436, -12633, -81416, -55421, 5891, 5009, 12943, 34772, 563, 16453, -32730, -60705, -47122, -6432, 48464, 80499, 42330, -20863, -14268, -6801, -32056, -38884, -407, 29956, 28159, -4757, 38679, 88307, 91604, 608, -26211, -16797, -12093, -90485, -130781, -95878, -54154, -12849, -13926, 8948, 8647, 23462, 34550, 46212, 31678, -14196, -28390, -25448, -23361, 9656, 23735, -9488, -13692, -16375, 21343, 86170, 103403, 95026, 46386, 26420, 13022, -11638, -26191, -17654, -71719, -139957, 242, 87912, 75439, 55986, 11495, 23493, 33822, 43333, 42832, 37596, 30041, 13402, -50659, -45465, -57979, -121334, -177603, -163545, -164879]
5095a64879O8093Q4945J3910N3263l5048p63q389Q126j7866j5310j5142m6981
5083g6041K184K669J0655n5638J1537K7838P032j5398J0897N6237J6149m878k1811
5070b8568L7635O2363n4843o5178M3750k4042k3514N583l818N1730m1642R940
5058c0604j4694L3568M1137J6902j3600L5088j4943m5118m070l9277l192J3472
5046b5331J1903K8297n9730J6710L2359p118r1024m0175K6685r482K1903M1597
5034e3406J407M8842L3779L5685N7628l7645l0582K5084M298p4640l1490J2952
5022h088J3295N4239l1808n5654K5033L2129j920m4091m1216J4495K1306K3214
5010I34L0325K338J9447J2417j3115L2457q6764m9427R055p648L2781K2291J05189
$$ y = [-164879, -96786, -11841, 2069, 55332, 20284, 19521, 11132, 19258, 1392, -13918, -29060, -76041, -73857, -71188, -60533, -116171, -104634, -76796, -69764, -85162, -74265, -18028, -1879, -6757, -28568, 9067, 71430, 16587, -48591, -4841, -28883, -52397, -46814, -50632, 1098, -40544, -30604, -45298, -11730, 29407, 46309, 32709, 67797, 52854, 7736, 3666, -35611, -38803, -25331, -13428, 14869, -44861, -28151, 4208, -2910, -93934, -134109, -107424, -116906, -95003, -53406, -51999, -3157, 30622, 66307, 123935, 86290, 55708, 80792, 85090, 10450, -21040, -8088, 5207, 59446, 27638, -28016, -2983, 29146, 27226, -16865, -58081, -43586, -22280, 934, 31259, 33597, 53044, 65461, 52346, 84803, -1961, -51388, -42333, -49981, -17200, 5091, 110280]
4997A10280p443j8349p9350j3452N2563P04m8634m3460J3943O8213j1275j9510
4985D230m7397k1507N4092N5418O689N6274l997l6175k6180M0913k92R298K8784
4972A20150N3269p14k9770n3837o8863l0395L6491K9259j9440m0816k4072L8365
4960I627M6504L775L3560j9404m2840L6740K6520R716o5491L8254O9343n6932
4948H9372k6781o0205m2994L8178k8690L6603L9408J0775K8379k3611l4840q9239
4936f3645l0079P4660j4168J2311O5731J4900O019M8366l5741l8001n7036q6870
4924a03553j8245K6193J25745j6885o3487m6834k268J03375k2060O478L5635l2987
4912h893M5326O0518m1087o436K9764o4370n7398j1322m3897l7900K4254P2642
$$ y = [110280, 102837, 84488, 5138, -8314, 44249, 44953, -3681, -47141, -33198, 35015, 23740, 4230, -43167, -64674, -10582, 44836, 51525, 107799, 103802, 67627, 41447, 82360, 82068, 91366, 120150, 173419, 172705, 142935, 89098, 20235, -10160, 26331, 55590, 36150, -4666, -28738, 9627, 56131, 59906, 93466, 74062, 31222, 67962, 94482, 104198, 38707, 76961, 146304, 89372, 62591, 2386, -40608, -2430, -31120, 5483, 44891, 55666, 84045, 60434, 25594, -63645, -93724, -19064, -33232, -20921, 44810, 59710, 65729, 114095, 78354, 40353, -16683, -103553, -121798, -95605, 30140, 13255, -50232, -97066, -99334, 4041, -18019, -11541, 24094, -8893, 36433, 96951, 55864, 49428, 79192, 14822, -42576, -53898, -97795, -135695, -111441, -38799]
4900c8799j1518k8771N2468N4247r0852l8952K4509M573K7916J6287J4001J4690
4888b01k4442k360m3541M4493J09631p9386n4287M5579j7483j5906O7360L8113
4876F7570Q908r835l7681j3668k382J2092n315n4337m1199j8640k5202k1534N1814
4863h9409R2979k1570K564O5451J8803O420k0339J3436k3973r916l9121j9026
4851b3701O1810Q6814O802m4067p4452n0232m0046K7362K5886J7937M5436j4601
4839B4948k441o680k1238J901j9138k8722Q795k2231l9221q13n417O6424M6241
4826B408P7283P867p7531o9827M540M6798J4347m5409p2922j9610M7626J0138
4814g4292n1011J00029N2070j4949l3836J8789k1572L1696n2862o5056J0547m7143
$$ y = [-38799, -50317, -79088, -26620, 27627, -63225, -102177, -77668, -73095, -45179, -28892, -14891, -201, -24643, -27003, -70544, -26051, 83580, 4194, -50093, -4514, -21997, -37903, 29457, 67570, 76478, 66643, 28962, 15294, 12912, 25004, 19689, -34648, -75847, -94487, -119689, -141223, -89409, 3570, -18000, -15436, 50015, 68818, 75238, 54899, 68335, 44362, 34446, -4675, -23701, 38109, 124923, 131725, 87658, 13206, -37026, -77072, -49710, -23824, -5887, 39549, 24948, 22507, 15827, -5411, -3510, -22648, -51370, -42575, -64806, -104027, -104840, -110257, -43833, 2408, 79691, 87558, 10027, -59800, -55260, -8462, 5885, -39524, -112446, -132056, -84430, -74292, -125303, -25274, 26796, 11847, -21989, -3200, -24772, 6924, -45938, -110994, -100447, -147590]
4802a47590k806O2113j6109M8537K8891J5240J3225M7758J3182Q2699J6758q6949
4790G4949m0271J4961M5783Q242l3119p38p9670n0130l3946O9292M0052k3501
4778h096l8654k6608L5687J9624P178j03581K4356O3550m3440J8661P573M7123
4766C373R6621j8892l4373m2410m0952J6262j6964m2040R416L7514m2582R243
4754f5784N3014L3369l9597k0353K9190k3915m865O5027K9858j7069m8902n1925
4742f1952M4483O080Q84J1395m5012j5566K2420n4377K5240J45532M1771j2091
4730A08807l554k3945k9536r546K4144m8310j5832n4557r9988Q737L4191L3467
4718g5922k7204L5789J8584J4015m6243P9200N3564k329m4121M0598O6877j2397
$$ y = [-147590, -150396, -88283, -104392, -55855, -26964, -11724, 1501, 49259, 62441, 145140, 161898, 74949, 34678, 49639, 95422, 103664, 70545, 69807, -9863, -59993, -93939, -24647, 15405, -8096, -46750, -73358, -37671, -18047, -10869, -114450, -90094, -26544, -69984, -51323, -43750, 3373, 99994, 81102, 46729, 4319, -36633, -20371, -37335, -79375, -69959, -32445, -75027, -65784, -12770, 20599, -18998, -39351, -10161, -34076, -38941, 26086, 55944, 38875, -10027, -61952, -17469, -11389, -10505, 890, -44122, -59688, -37268, -91645, -66405, 79127, 120898, 108807, 105253, 81308, 51772, 42226, 66370, 18060, 2228, -52329, -152317, -143580, -109389, -75922, -103126, -67337, -48753, -34738, -80981, -1781, 51783, 49454, 5333, 45931, 112808, 100411]
4706A00411q0442K3479J3828j04669j5239O0081l9931m20K6926P8083Q280l2682
4694C7705m6031J9382L803J8154j8904j1717J242j2380M137r175K4304O1858m2806
4681B9572P034N7487k4723l0346K4437o160N2243j8800K9723j0870m4645L4615
4669I9567k805p4478j8051p522n0370m4973M2004K3824M0397K4347o2226o0028
4657i0314J5871j2409J7023k7686J7268K2239j4711M3432l2278J2471j5881k9107
4645i4082m4857M9873M4662k827o22R0684j1014j04149n880J086k0441Q2529L0172
4632A5134Q581q7841j2787M0682J8095l0577m8148m5999j0041L4581P829L8465
4620g2026N0712j305m8378r0N0843K1212K44M598L216k653M1786r495j0583j2832
$$ y = [100411, 19969, 43448, 57276, -47393, -62632, -2551, -42482, -42902, -15976, 62107, 70387, 37705, -8326, 11056, 14859, 33013, 14109, 2392, 3634, -8746, -4609, -13784, 10520, 72378, 29572, 36606, 94093, 69370, 39024, 63461, 57301, 109544, 90744, 120467, 109597, 64952, 99567, 96762, 22284, 4233, -3289, -53659, -98632, -56628, -32804, 7593, 31940, -30286, -90314, -74443, -86852, -69829, -97515, -80247, -58008, -72719, -29287, -61565, -49094, -64975, -94082, -138939, -89066, -44404, -47231, -47853, 42831, 31817, -72332, -78212, -77126, -97567, -15038, 15134, 23715, -64126, -76913, -36231, -18136, -48713, -96861, -142860, -152901, -118320, -110491, -72026, -21314, -22619, -70997, -71087, -20244, 968, 1212, 5810, 9026, 6373, 48159, 38664, 28081, 15249]
4606A5249K0815N0835j0250J0949L971m2723k0167N233o8635K9333Q0837M8291
4594A23738o5592K3496j6166K6100L0597p1803j9723J2957O5777m3366n7259l0603
4582b1847M1065j086o2973q7000N3286J9634j189K1793N6866K0309J1892m6806
4570C944o3856k0015M7646L7557Q5887L2258o447p3673k5163q232j4883J6454
4558A1477j0880k7134o7995L3299L5314L7453J3999n408m7419k7040J4139R990
4546c0205J04628o705l4504p6118o5526j2928m9959j0362N7750N3075N5248O7919
4534E2313j895l6847j702k4434k2911N4722k8243j3063K5634P2797j2404j7807
4522D6160J2547q9015m051M5919K6937K896n6959O000j705K4393J3015o042o1536
$$ y = [15249, 36064, 86899, 76649, 87598, 91569, 48846, 28679, 33912, -34723, -5390, 75447, 123738, 58146, 81642, 65476, 91576, 122173, 50370, 30647, 43604, 109381, 66015, 8756, -21847, 19218, 18132, -44841, -131841, -78555, -58921, -60110, -38317, 18549, 38858, 50750, 3944, -59912, -79927, -32281, 5276, 91163, 123421, 116974, 43301, 18138, 9906, -4977, 11477, 597, -26537, -94532, -61233, -25919, 11534, 25533, 20125, -27294, -54334, -40195, -30205, 74423, 67718, 33214, -42904, -108430, -121358, -171317, -181679, -123929, -70854, -15606, 52313, 50418, 13571, 11869, -12565, -35476, 19246, -8997, -22060, 3574, 76371, 63967, 46160, 58707, -30308, -34359, 11560, 38497, 41393, -15566, -9566, -11271, 13122, 26137, 20095, -41441]
4509d1441k9436J7094O5731Q088K791l3908M4767J7157o764K7029j7242k557j1339
4496C9970m0726k5764k8202p2007O3558P6740j736O93K0921P314k6664K1852L9128
4483G5077k961o0643q3142m9715N6415O3578K9578P8268l5495o6026K5276K2868
4471E3078j9532o2059L0253J20268J2209o4940n3999L434k4095m6520q56M3208
4459i551L0470k3894J1123k5719p797O9501O838n4962K8342M73k969O0398L2850
4446A15103j5896k3440o6452l7387L893P4849k2806l3417M423K6422m2134o9257
4434h6099M7436N3969K9065k6112L0163m725k6850k4733j7052L6376M8199l5027
4422B4610L2959j1788k3418L9872N025J6751K8584l5852m7196j3640P654J4595
$$ y = [-41441, -70877, -53783, 11948, 20036, 22827, -11081, 33686, 50843, 44079, 71108, 53866, 51309, 39970, -756, -26520, -54722, -126729, -63171, 13569, 11833, 12526, 33447, 40761, 14097, 35949, 75077, 72116, 11473, -71669, -121384, -64969, -1391, 28187, 106455, 70960, 4934, 30210, 53078, 33546, -28513, 1740, 122008, 134217, 69277, 15278, 18712, -5383, -51903, -52759, -9551, 20919, -2975, 8148, -17571, -25368, 44133, 50971, -3991, 24351, 24824, 21855, 82253, 115103, 99207, 75767, 9315, -28072, -24179, 50670, 27864, -5553, -1130, 25292, -16842, -86099, -38663, 15306, 44371, 18259, 48422, 43697, 16847, -7886, -24938, 11438, 59637, 24610, 57569, 45781, 22363, 62235, 67260, 84011, 112595, 76743, 29547, 15907, 23561, 38156]
4410C8156M3364K3551k9118o7456o598j0786n8097r281l7294M391n873J9716J4088
4397h1237L1183M1818M4371L990k0235k9037J6922j8203m6129J728L7343J8598
4385A112l759k7m7029R956P129N2849l6284k7343n4944p374q495J5037M8015L5609
4371a5548K408k7254J3703n1523m9817J7076M3729L1425J1614k5203j0815j8833
4359g9038l9260J9023Q017N1862O3391j3340l8827l0998R606j0479M0480L639
4347a5924L2815k5846m2791J6553J2688J22022k2632q0390K059N3069j9572J0673
4335D2724J2783l7624k8267K5501K4852J6272K89l960J5234m1519J5011k1328
4323A9968M532l0965n98P7942K2533m3104j2516k2774R296M1722L8868k0012j4777
$$ y = [38156, 81520, 105071, 75953, 8497, 1899, -8887, -66984, -76265, -113559, -109168, -115041, -95325, -81237, -50054, -8236, 36135, 40125, 19890, -9147, 7775, -10428, -56557, -54829, -17486, 1112, -2647, -2674, -49703, -39747, -32618, 20231, -16053, -43396, -98340, -105714, -114209, -99172, -51157, -15548, -13140, -40394, -26691, -78214, -128031, -110955, -67226, -35801, -24187, -49390, -60205, -79038, -118298, -99275, -91258, -39396, 23995, 10655, -28172, -59170, -49564, -60043, -19563, -15924, 16891, -8955, -51746, -35193, -22505, 99517, 76885, -3505, -1446, 51623, 32051, 42724, 55507, 17883, -10384, 15117, 39969, 56241, 56530, 52570, 67804, 26285, 41296, 19968, 24500, -6465, -7063, 70879, 93412, 50308, 37792, 15018, 24314, 66036, 104904, 84892, 70115]
4310G0115j6510K5272N156K630m6965p1551M3948n072k5328q3092J2695K7821
4298f0881P2991K6395r0335j6961K4255N8645l5348q937K4624P998l6984P0458
4286C5920Q6894K7087O037k2347p4238q725k7921M4093J7263j548J3192n0338
4274D5369r270k2118k6091j5696J9588l243O1020P7094o5498l3083m0844k299
4262a5071l8819o2916M4779L7687j7613m777L1651j9734L3740m216J2639k0321
4250b2971k1999m2734N447N2558P2538l43m1262l52P6853l0899L4392L571n8772
4237B6027o1348K0639j180R7380L030n5987m8219J260J7918O1896J14740q3280
4225I2876q7037r200n849M8395M7624j3126k8379L7000O3587K6887m6560j39235
$$ y = [70115, 53605, 78877, 84033, 86663, 39698, -31853, 12095, 7023, -18305, -101397, -88702, -60881, 12110, 38505, -51830, -68791, -44536, 14109, -21239, -30176, -5552, 2446, -34538, 35920, 122814, 149901, 155938, 133591, 59353, 50628, 22707, 66800, 84063, 82515, 95707, 45369, 36099, 13981, -12110, -27806, -8218, -11461, 49559, 126653, 61155, 28072, -12772, -15071, -53890, -116806, -72027, -34340, -51953, -56730, -25079, -44813, -11073, -15289, -2650, -22971, -44970, -87704, -82257, -29699, 42839, 42496, 1234, 882, 77735, 46836, 81228, 84799, 26027, -35321, -14682, -15862, 81518, 84548, 28561, -19658, -18398, -480, 61416, 176156, 92876, 5839, -3361, -9210, 39185, 86809, 73683, 45304, 82304, 145891, 172778, 126218, -13017]
4213a3017l5782L1595R8500j6894R722J0119M2317K3588l7399j8083l2231m7053
4201A5382r148j6015n2929k9115L8360J1544r651K5897J4597m4730n9848k3821
4189a39477L0874M8433N8298j0876J4026N160q3407j2475Q2807Q9215p733p6300
4177a455k1049j8118j9213R278K0879J15041K6022n5495J9843j5680l0895j1659
4165A7499k2224P619K3828k0470j4585O282m3911q2946J0126P3467K3882M5189
4153B3756J1953O7771m1756r0744k8462o5835n0346j4617R7756P9939p6303k2364
4141a09252Q4057P2402L8604j50420O423R039L67m1440j9470O5997M9074j6265
4129a0884K1563k7765K0947N5337J9124j2251J714p1231j5141l5047p9077m7877
$$ y = [-13017, -48799, -17204, 81296, 64402, 74124, 84243, 126560, 150148, 112749, 94666, 62435, 15382, 6234, -9781, -62710, -91825, -53465, -41921, -51572, -25675, -11078, -55808, -115656, -139477, -108603, -60170, -1872, -12748, 1278, 6438, -76969, -89444, -6637, 82578, 74845, -1455, -22504, -40622, -59835, -50557, -29678, 85363, 111385, 55890, 75733, 60053, 29158, 17499, -4725, 2894, 26722, 6252, -8333, -2051, -45962, -128908, -118782, -45315, -21433, 23756, 35709, 103480, 61724, -29020, -57482, -123317, -173663, -188280, -90524, -10585, -86888, -109252, -25195, 47207, 85811, -64609, -58186, -49147, -48780, -90220, -109690, -43693, 5381, -10884, 10679, -17086, 3861, 59198, 78322, 66071, 67785, -3446, -18587, -53634, -132711, -180588]
4117a80588K0020R6123O1475r10M7289J0711l2744M5993L1402j43740m5012R7528
4105G547j0904R141K4708O3958O1334K1625k5473p5762p6611j2147K4509K3053
4093C4978O3869q157M614M4603j6506K539j1773m9309r678J1746k6467m0633l6647
4080c6821L6444m9789k1152O4909K5671k8714L5699P7566O8872q8800p9977l3186
4068b9278J4154j2819n4127J2681N6786L457r770K7814K1710n9125k7752K7437
4056b8832m7916K4670L5341L0721m7543l9252j136L7169N782m7540P237J1098
4044f0201j1586j3664k1516K8118N6440J1148J6098K4703k4349o8587O735J2983
4032d3678L5754J4242m7996l9483M7791K7136m8279q062j5022M9259M1612o0532
$$ y = [-180588, -160568, -64445, -2970, -3880, 43409, 54120, 21376, 67369, 98771, -44969, -89981, 7547, -3357, 5784, 30492, 94450, 155784, 177409, 151936, 76174, -437, -12584, 11925, 34978, 98847, 90690, 95304, 139907, 123401, 125940, 114167, 64858, 55180, 66926, 40459, -174, -36821, -377, -50166, -71318, -6409, 19262, -9452, 26247, 103813, 172685, 83885, 3908, -29278, -15124, -27943, -82070, -69389, -12603, -9146, -18916, 8898, 30608, -28517, -56269, -28832, -76748, -52078, -16737, 13984, -33559, -72811, -73947, -36778, -30996, -78536, -71299, -60201, -71787, -85451, -106967, -78849, -22409, -11261, 4837, 29540, 5191, -63396, -56661, -43678, -7924, 6318, -41678, -81161, -33370, -6234, -54513, -62575, -77597, -28338, 13274, -47258]
4020d7258K99P0467K3185k5675l9137J5680J9129p4339N0254N9795p934k9977
4008A4489J1710k4214m7080K0433r589M2729M3354j4075k8589R284K4419J6482
3996E9353J7317j7635n1747k2742m541O3573R367R543J1657m5237m9652n5578
3984g6322j672L2734J1974L2949j7481j4178K2719Q7140N2948p6044J8188M6787
3972A19742L9352l1125j32764q3971j3707M2034N9718R290J454r649K1069J3466
3960C4909K1575K6476l0781m7229L1312m2203J3911M9264n8379J4628M5553n0403
3948H633m8430j0482J3930n3826m1446m140L9171K5809K881L8030o030o7238n4953
3935a58091K6770J7829j6117M963M2874O1406N2878l1781j5365K141n9768j2538
$$ y = [-47258, -46959, 23508, 46693, 21018, -18119, -2439, 16690, -57649, -7395, 52400, 44466, 14489, 26199, 1985, -45095, -24662, -34251, 8478, 51832, 37757, 9168, 18452, 42871, 59353, 76670, 59035, 7288, -15454, -19995, 43578, 52945, 62488, 74145, 28908, -20744, -76322, -77994, -45260, -33286, -337, -17818, -31996, -9277, 77863, 130811, 54767, 72955, 119742, 159094, 127969, -4795, -88766, -102473, -60439, -721, 8569, 10023, 374, 21443, 34909, 56484, 82960, 52179, 4950, 36262, -5941, 7970, 57234, -1145, 13483, 59036, 8633, -39797, -50279, -36349, -90175, -131621, -135761, -96590, -70781, -67900, -29870, -35900, -103138, -158091, -131321, -113492, -129609, -124646, -81772, -20366, 32512, 731, -14634, -12493, -72261, -84799]
3923h4799K7716K498k0248p0895j4676m3755N1587P7960L9091m529m5620p9378
3911a65048r789M8453K8429P2961k4548r190l4034m789N8401N5982K2528Q8636
3899A27992P570j20934q9559m8939P961m6425k042J17169K5650l3530O4951Q483
3887A8347M795L1233k2863m89R537j3590k7725p369n424j1463L8613J0287P2470
3874I6359K9022k6027n1895m2899O8605J935j200p6656o6832k3093J00427q753
3862a007l7817n0751o3763P9152J4433L9169j0778j9035P989Q458J134M7496p8678
3849f3998k6354P7506K1331O6197q3470n3015J5661L5165J0106m9221j2656k371
3837f5119K7639j048j7141K8326J5474m474M1576m9377o0195P311L1207P5341
$$ y = [-84799, -57083, -54585, -74833, -145728, -160404, -204159, -152572, -74612, -35521, -40050, -85670, -165048, -174837, -126384, -97955, -24994, -49542, -58732, -92766, -97555, -39154, 16828, 39356, 127992, 135562, 14628, -74931, -123870, -115909, -162334, -164376, -47207, -21557, -55087, 9864, 18347, 23142, 54375, 31512, 31023, 40560, 26970, -755, -8124, -13548, -25011, 13602, 23889, 96359, 125381, 99354, 47459, 4560, 73165, 75100, 73900, -2756, -69588, -92681, 7746, -1007, -38824, -89575, -153338, -74186, -59753, -20584, -31362, -50397, -42408, -33950, -32816, 14680, -63998, -90352, -12846, 8485, 74682, -8788, -61803, -46142, -10977, -871, -50092, -62748, -65119, -37480, -38528, -55669, -27343, -11869, -16343, 25233, -24144, -84339, -77028, -45821, 29520]
3825B9520j5399M9158j8448n3795o9424l0271k9519J137L0474l3857o9172o458
3813b16054N2942R5628O6057j3977q925J1639M342k7894Q211J9501N1814M4559
3801H7843k8621j4278k0231n658L4063l7096n5352o1912M3033r319L1742o503
3789d2289K1113O2221J2949q3696l9903j4273L5168Q945K6530J4983J7916K331
3777B1995j3267k6353m7044M3336J1193k2686n9490l9510q6701N4794M2648R3692
3765b7393N0513J2699n9382j6289K3533L7744O5816M3513q883o3678m4390R727
3753B3530Q709K3838L5195M0548o7838k232M6554m9239j7344l9179l491L8063
3741C7114K4560k673k4688K9541J2123p504Q22L7205j02693m2723P546k1073m5987
$$ y = [29520, 14121, 63279, 44831, -8964, -78388, -108659, -138178, -137041, -106567, -140424, -209596, -216054, -163112, -67484, -1427, -15404, -24329, -12690, -8348, -36242, -28031, -8530, 43284, 87843, 59222, 44944, 24713, 19055, 53118, 16022, -39330, -101242, -58209, -67528, -35786, -42289, -21176, 41045, 53994, -29702, -69605, -83878, -48710, -39765, -13235, 1748, 19664, 21995, 8728, -17625, -64669, -21333, -10140, -32826, -92316, -131826, -218527, -163733, -121085, -27393, 23120, 35819, -23563, -39852, -16319, 21425, 87241, 130754, 121871, 58193, 13803, 23530, 32239, 56077, 91272, 131820, 63982, 61750, 108304, 59065, 41721, 2542, -949, 37114, 61674, 59001, 34313, 63854, 75977, 68473, 69295, 106500, 3807, -38916, -31370, -52443, -98430]
3728i8430K7673J7649N9770N7627r6085r849J052j6498M7417j6880p0124J2174
3716h4504K7807n0014L8853O4182K4829j7661n5840O350k8512k6256m4966L5864
3704a09868N3864j7338J6614k2651j0862N0129N3056k6267j7417K2325J2015m677
3692a077J9750P4K6782j3304O684P020M511J9899p672o8682q6334m5597m796L9324
3678a03418J02976J10380L4121q4033q6280J4177L5126o3140q8514O9735M7411
3667a1459m7750J8640J5151p553l0149O4249L8241p841J4995n9297m5226Q417
3655d9582J1225r075j582m6695K7577K5910P2538O6745j6819l6024n066k0777
3643A8375j8722l6336p33K5117M7132m879r1490l8418J03810J5465J3747p801
$$ y = [-98430, -70757, -53108, 6662, 64289, -31796, -41645, -40593, -57091, -9674, -26554, -96678, -84504, -56697, -106711, -67858, -3676, 21153, 3492, -52348, -45998, -74510, -100766, -145732, -109868, -56004, -73342, -56728, -79379, -90241, -40112, 12944, -13323, -30740, -8415, 3600, -1077, 18673, 18747, 45529, 32225, 38909, 45929, 50440, 70339, 62667, -6015, -92349, -137946, -142742, -103418, -442, 109938, 144059, 60026, -26254, -12077, 23049, -40091, -128605, -58870, -11459, -59209, -40569, -25418, -32971, -63120, 1129, 39370, 31529, 46524, -12773, -57999, -49582, -38357, -47432, -49014, -95709, -68132, -42222, 30316, 97061, 80242, 44218, 39152, 18375, -347, -36683, -37416, -12299, 34833, 29954, -61536, -99954, 3856, 19321, 33068, 25267]
3631B5267r465K616j3713J7876J8212N627K9983J05117l0694n758M8825m1702
3619A52191n7376k8763j1213r31L6386l6430l6112L4352M3746M7033m0654o2865
3607C9364j8258m4476j4662N4848J4966j3753M8610k448o4279q3007l3481j1133
3595a27709N2386O6375Q9681N6078l5031n743j5104r8767J7380j636p8981q3378
3583a64449J4229q80Q585Q8536J43182j2744o6943L6321j9291l3892o065Q621
3571d790o7364R457M9933L2793k0154o6624M5892j9754n0636K6377j4135o603
3559h5608N7477P8726J2149k5989N709P11m5514j0432K797K3041K7867j8870k2449
3546c85N5930J6525J7365o7073K0364l2272n9087k9360K9381K1250k5998N2541
$$ y = [25267, 15802, 18418, 4705, 22581, 40793, 46420, 76403, 181520, 150826, 145068, 193893, 152191, 94815, 66052, 54839, 53908, 90294, 53864, 17752, 52104, 95850, 142883, 102229, 39364, 21106, -23370, -38032, 16816, 31782, 18029, 66639, 64191, -88, -83095, -116576, -127709, -75323, -8948, 80733, 136811, 101780, 96037, 80933, -17834, -454, -2090, -81071, -164449, -150220, -151100, -142515, -53979, 89203, 76459, 9516, 45837, 26546, -7346, -13411, -4790, -72154, -62697, -12764, 20029, -125, -66749, -20857, -40611, -91247, -64870, -79005, -85608, -28131, 50595, 62744, 36755, 42464, 43175, -2339, -12771, -9974, 13067, 40934, 22064, -385, 55545, 72070, 89435, 22362, 42726, 10454, -48633, -77993, -48612, -27362, -53360, -819]
3534h19J6335L8300j0032m2024r077O996j2201L5992P9140j8852q4637P2973O0507
3521A32601k3681k7335j1448k297n4325M2948N6552l0495o953o7252p825q0185
3509g9695q0698M3087N0837p615p2777l6774J31051R5575M9598K3194l4004J675
3497H3454k8319O28j1396o5400m4322N1561J2238J3179L0916r9078k5278J20665
3485C8848k9941m929j3225k4567K4787Q7289O179m2425o7347J9760K6423J5349
3473C6201k1499M275R574j4694r854o431j8810l0113J924J4665o8431n520K8068
3460h0645M952L3966L3633N363o3703j2154M4198J2744J0885J4146L0973L9560
3448G3918k1381r775j9228j4794p384O1031k0112j4334K7802K9572k157K9542
$$ y = [-819, 15516, 53816, 43784, 1760, -7317, -321, -12522, 23470, 102610, 83758, -879, 72094, 132601, 108920, 81585, 70137, 67840, 13515, 56463, 113015, 82520, 75567, 8315, 490, -79695, -160393, -117306, -66469, -74084, -146861, -183635, -52584, 42991, 92589, 115783, 81779, 83454, 55135, 55763, 44367, -21033, -65355, -13794, -1556, 11623, 42539, -56539, -81817, 38848, 8907, 3978, -9247, -33814, -9027, 78262, 84441, 42016, -25331, -5571, 20852, 36201, 14702, 18977, 28551, 13857, 4003, -2428, -21238, -51351, -49427, -34762, -103193, -108713, -80645, -75693, -41727, -8094, -2731, -66434, -78588, -34390, -21646, -10761, 3385, 34358, 73918, 52537, 42762, 23534, 8740, 1356, 62387, 42275, 27941, 55743, 85315, 83158, 112700]
3436A12700k8223m2312o422K2342m5385q5629J899N5052l1756O1187M5099j499
3424E7053m4193m0959k720Q332N1164P4172q339n0271J3704P908m2500p1025r8555
3411a46229n4821O6012N2989P6576K4711l2399K690K1904k6606j0025m0087Q7588
3399B2303l0603j1254m3652K5194L56l0794r59Q3119k1127m8417L5773l8887M1500
3386a7448L1749k5755j233l0786N0961J5496j8080n6797J6989P3395J0956o1390
3374a1943q222J675Q946m3707l44N1885K1664L5166N4828l9888r1629n1533J1381
3361f1721j0555j5365l7791P688P0287o37k6156j4702J9153P0383M985n781J2376
3348A2164K2583j281k5696k0744l0188l5898l311K5602k5100J2172K2349Q8032
$$ y = [112700, 84477, 42165, 35743, 58085, 12700, -72929, -71030, -15978, -47734, 13453, 58552, 57053, 12860, -28099, -30819, -22487, 28677, 102849, 94510, 44239, 57943, 65851, 23351, -47674, -146229, -201050, -135038, -82049, -5473, 19238, -13161, -10471, 11433, -15173, -25198, -65285, 22303, -8300, -19554, -63206, -38012, -37656, -68450, -69409, 13710, -7417, -55834, -20061, -58948, -17448, 14301, -11454, -12687, -43473, 7488, 22984, 4904, -51893, -34904, 38491, 49447, -11943, -20165, -18490, -9544, -53251, -53595, -1710, 19954, 55120, 109948, 70060, -21569, -73102, -61721, -72276, -87641, -125432, -117744, -47457, -48094, -74250, -88952, -69799, 584, 5569, -212, 12164, 34747, 33466, 7770, -12974, -43162, -79060, -82371, -56769, -81869, -69697, -47348, 40684]
3336D0684O1296K7107j771n8089j04698j7769J5530N7772k2360M546m6520n9856
3324a04128J02726O0242l4658K5249J878r6049l3748K3996j3511M0513M4837M5745
3312F3092j2787N552l457j3578j8246j8220J9037L1966p9705p3636l888L9960
3300f3910R1294o20J6775l3646m814k5122p8153N4965N6885L9326k0592q9320
3288e6932J486K6886K0399R8469n696n3683m6179K6527J8647j0023j2844l6378
3276b9321L8423R982N362j7428l9916j1204J2889K6255j7573l964L7998j1982
3264d79k4591j5982J4213m4045p3783J6170P4219k3358l5934K3819K1026m2647
3252a11372Q3593M5205n446l351m6408l130K573M9969K8636j2185o2277m2975
$$ y = [40684, 101980, 129087, 127316, 69227, -35471, -53240, -37710, 20062, -2298, 2248, -44272, -104128, -1402, 58840, 24182, 49431, 51309, -44740, -78488, -54492, -68003, -27490, 17347, 63092, 50305, 55857, 52400, 38822, 20576, 2356, 21393, 53359, -26346, -99982, -103870, -63910, 27384, 26764, 43539, 9893, 5079, -20043, -98196, -43231, 13654, 52980, 32388, -56932, -55446, -28560, -8161, 90308, 84612, 30929, -15250, 11277, 29924, 19901, 7057, -29321, 9102, 19084, 24446, 7018, -32898, -44102, -31213, -4958, -22531, -26495, 11503, -479, -25070, -41052, -26839, -70884, -144667, -128497, -54278, -77636, -113570, -89751, -68725, -111372, -27779, 17426, 11980, 8629, -37779, -40909, -38336, 11633, 40269, 28084, -34193, -77168]
3240g7168L0772j9045L1660O3094K1877K2783l0873m9186M00j410M97k2033q2850
3227a11482j1923Q6058M4044L7118j1846k8599L3019L1289m835p0753p638J6439
3215H91k7900J3735J39615R5113j07351n8426L845o6561l2450p854K1545P5692
3203D9894J3585K5314J1877l5114p1079j2916L5540N0880l034L2514L3144l7243
3191I3362L447N906N952j7778k9021j297m2050J6481l5753J0929P117O0995J4693
3178I2983l2202m6397j4505K7812o7426j03419n3039N1397J17711Q7538Q926o3113
3166F266j09911K0948K7520O3376M2615o307j6313m8758n8064k1409M6306J1089
3154d2642N8333m2464j0360O0512p888q2733k8054o4401P0095K7388M2633j1556
$$ y = [-77168, -46396, -65441, -33781, 29313, 51190, 73973, 43100, -6086, -5686, -7096, -6599, -28632, -111482, -123405, -37347, 6697, 43815, 31969, 3370, 36389, 67678, 62843, -7910, -15548, 891, -27009, -13274, 126341, 221454, 114103, 55677, 59522, -7039, -39489, -47343, -25798, 49894, 63479, 88793, 100670, 65556, -5523, -18439, 17101, 67981, 64947, 97461, 130605, 93362, 96809, 102715, 108667, 90889, 61868, 60571, 18521, 35002, -751, 10178, 17295, 78290, 92983, 60781, 14384, -121, 27691, -39735, -143154, -196193, -144796, -27085, 60453, 69379, 6266, -103645, -82697, -55177, 8199, 50814, 44507, 28194, -20564, -78628, -100037, -53731, -42642, 15691, -26773, -37133, 23379, 15491, -67242, -95296, -159697, -89602, -62214, -19581, -31137]
3142c1137O378J7674L6697P5067k0938q0231q528q099K5738m7960l1141R249k6714
3129h3945j7270L6762m2327M8165J4059p0782k9506J1576j0653L2644N4280L5826
3117b1171k7297K5289L3158P9050K8975K9523k2545l862l5620n9043n6639j9267
3105d9449L6330p101l1505J405O4964l558q082k161m4938j4851L5300l9327k7115
3092i0088L9834K3081L8997J9071Q8273q5507j15939M1411J4396M700q04L4001
3080A1426k4444K532O911N6866m4073k1283L378J3235k4974k2041M9930r057m2890
3067d4484j2043M6717j8009J3284P784J644M708m7484n807P613m821J520L347
3054d6031J250O6048l869m3260l641k1238m0505M6319P7417k0430k9653K0224
$$ y = [-31137, -24759, -7085, 29612, 104679, 83741, 3510, -5018, -13117, 12621, -35339, -66480, -57231, -83945, -101215, -64453, -106780, -58615, -44556, -115338, -144844, -133268, -143921, -111277, -56997, -21171, -48468, -23179, 9979, 89029, 118004, 147527, 124982, 121120, 85500, 26457, -30182, -49449, -13119, -20220, -51725, -50320, 14644, 11086, 3004, 843, -44095, -58946, -23646, -62973, -90088, -50254, -27173, 11824, 30895, 119168, 33661, -82278, -40867, -26471, -21771, -22575, 11426, -13018, -10486, -3575, 53291, 9218, -12065, -8687, 4548, -20426, -42467, 7463, -1594, -44484, -56527, -9810, -27819, -14535, -6751, -5107, -399, -47883, -53690, -46077, -50898, -49378, -46031, -44781, 21267, 17398, -25862, -29503, -50741, -91246, -44927, 32490, 12060, -17593, 2631]
3042B631m9052r902J7441k6714l2852l0684N4870M2198m0087m1643k1773L7932
$$ y = [2631, -46421, -56323, -38882, -65596, -98448, -129132, -74262, -32064, -72151, -113794, -135567, -97635]
$$ [...]
##END NTUPLES=NMR SPECTRUM
##END=
