##TITLE=Analysis number 328203
Compound Code cc 35401
Project Code adrs
Chemist Name endeavour
##JCAMPDX= 6.0         $$ Bruker NMR JCAMP-DX V2.0
##DATA TYPE= NMR SPECTRUM
##DATA CLASS= NTUPLES
##ORIGIN= Bruker BioSpin GmbH
##OWNER= nmr
$$ XWIN-NMR		Version 3.5
$$ Mon May 14 09:33:48 2007 GMT Daylight Time (UT+1h)  MAYBRIDGE\nmr@NMR_250MHZ
##.OBSERVE FREQUENCY= 250.131544655141
##.OBSERVE NUCLEUS= ^1H
##.ACQUISITION MODE= SIMULTANEOUS (DQD)
##.ACQUISITION SCHEME= undefined
##.AVERAGES= 16
##.DIGITISER RES= 18
##SPECTROMETER/DATA SYSTEM= dpx250
##.PULSE SEQUENCE= zg30
##.SOLVENT NAME= DMSO
##.SHIFT REFERENCE= (INTERNAL, DMSO, 0, 16.522)
##AUDIT TRAIL= $$ (NUMBER, WHEN, WHO, WHERE, WHAT)
$$ ##TITLE= Audit trail, XWIN-NMR		Version 3.5
$$ ##JCAMPDX= 5.01
$$ ##ORIGIN= Bruker BioSpin GmbH
$$ ##OWNER= nmr
$$ C:\u/data/dgb/nmr/ADRS/920/pdata/1/auditp.txt
$$ ##AUDIT TRAIL=  $$ (NUMBER, WHEN, WHO, WHERE, WHAT)
(   1,<2007-05-14 09:33:20.82 +100>,<MAYBRIDGE\nmr>,<NMR_250MHZ>,
      <created by zg, POWCHK disabled, PULCHK disabled
       configuration hash MD5:
       76 6E 9A 78 1E 09 19 81 EC 84 63 8F B0 6A 59 2D
       data hash MD5: 64K
       7E 79 3E 67 EA F5 C5 BD C6 1A BC 17 51 BD D3 3D>)
(   2,<2007-05-14 09:33:36.22 +100>,<MAYBRIDGE\nmr>,<NMR_250MHZ>,
      <Start of raw data processing
       ef LB = 0.3 FT_mod = 6 PKNL = 1 SI = 32K 
       data hash MD5: 32K
       82 67 8E EB 20 71 A1 66 14 2E B4 73 F6 CF 4C 5D>)
(   3,<2007-05-14 09:33:38.02 +100>,<MAYBRIDGE\nmr>,<NMR_250MHZ>,
      <apk 
       data hash MD5: 32K
       05 12 1C 8E 2B 91 EF 97 67 7A F1 1E 15 37 AB 5D>)
(   4,<2007-05-14 09:33:38.85 +100>,<MAYBRIDGE\nmr>,<NMR_250MHZ>,
      <abs ABSG = 5 
       data hash MD5: 32K
       C2 81 9A 62 4F 30 F2 BA 9E BF 83 14 EF 7F 2D 4C>)
$$ ##END=
$$ 
$$ hash MD5
$$ 9C BA 5E 0E A6 1A B1 A9 93 55 DD 8F 7D F7 D5 77
##$RELAX= 
##$RELAX= 
##$RELAX= 
##$RELAX= 
##$RELAX= 
##$RELAX= 
##$RELAX= 
$$ Bruker specific parameters
$$ --------------------------
##$DU= <C:\u>
##$EXPNO= 920
##$NAME= <ADRS>
##$PROCNO= 1
##$TYPE= <nmr>
##$USER= <dgb>
##$AMP= (0..31)
100 100 100 100 100 100 100 100 100 100 100 100 100 100 100 100 100 100 
100 100 100 100 100 100 100 100 100 100 100 100 100 100 
##$AQSEQ= 0
##$AQ_mod= 3
##$AUNM= <au_zg>
##$AUTOPOS= <5 >
##$BF1= 250.13
##$BF2= 250.13
##$BF3= 250.13
##$BF4= 250.13
##$BF5= 500.13
##$BF6= 500.13
##$BF7= 500.13
##$BF8= 500.13
##$BYTORDA= 1
##$CFDGTYP= 0
##$CFRGTYP= 5
##$CHEMSTR= <none>
##$CNST= (0..31)
1 1 145 1 1 1 1 1 1 1 1 1 1 1 1 1 1 1 1 1 1 1 1 1 1 1 1 1 1 1 1 1 
##$CPDPRG= <>
##$CPDPRG1= <>
##$CPDPRG2= <>
##$CPDPRG3= <>
##$CPDPRG4= <mlev>
##$CPDPRG5= <mlev>
##$CPDPRG6= <mlev>
##$CPDPRG7= <mlev>
##$CPDPRG8= <mlev>
##$CPDPRGB= <>
##$CPDPRGT= <>
##$D= (0..31)
0 1 0 0 0 0 0 0 0 0.06 0 0 0 0 0 0 0.0002 0 0 0 0 0 0 0 0 0 0 0 0 0 0 
0 
##$DATE= 1179131599
##$DBL= (0..7)
120 120 120 120 120 120 120 120 
##$DBP= (0..7)
150 150 150 150 150 150 150 150 
##$DBP07= 0
##$DBPNAM0= <>
##$DBPNAM1= <>
##$DBPNAM2= <>
##$DBPNAM3= <>
$$ [...]
##$SUBNAM7= <"">
##$SUBNAM8= <"">
##$SUBNAM9= <"">
##$SW= 20.6930455092707
##$SWIBOX= (0..15)
0 0 3 0 0 0 0 0 0 0 0 0 0 0 0 0 
##$SW_h= 5175.983436853
##$TD= 65536
##$TD0= 1
##$TE= 683.16
##$TE2= 300
##$TE3= 300
##$TEG= 300
##$TL= (0..7)
0 120 120 120 120 120 120 120 
##$TP= (0..7)
150 150 150 150 150 150 150 150 
##$TP07= 0
##$TPNAME0= <>
##$TPNAME1= <>
##$TPNAME2= <>
##$TPNAME3= <>
##$TPNAME4= <>
##$TPNAME5= <>
##$TPNAME6= <>
##$TPNAME7= <>
##$TPOAL= (0..7)
0.5 0.5 0.5 0.5 0.5 0.5 0.5 0.5 
##$TPOFFS= (0..7)
0 0 0 0 0 0 0 0 
##$TUNHIN= 0
##$TUNHOUT= 0
##$TUNXOUT= 0
##$USERA1= <user>
##$USERA2= <user>
##$USERA3= <user>
##$USERA4= <user>
##$USERA5= <user>
##$V9= 5
##$VALIST= <valist>
##$VCLIST= <CCCCCCCCCCCCCCC>
##$VD= 0
##$VDLIST= <DDDDDDDDDDDDDDD>
##$VPLIST= <PPPPPPPPPPPPPPP>
##$VTLIST= <TTTTTTTTTTTTTTT>
##$WBST= 1024
##$WBSW= 4
##$XGAIN= (0..3)
0 0 0 0 
##$XL= 0
##$YL= 0
##$YMAX_a= 273243
##$YMIN_a= -168026
##$ZGOPTNS= <>
##$ZL1= 120
##$ZL2= 120
##$ZL3= 120
##$ZL4= 120
##$ABSF1= 16.522
##$ABSF2= -4.171173
##$ABSG= 5
##$ABSL= 3
##$ALPHA= 0
##$AQORDER= 0
##$ASSFAC= 0
##$ASSFACI= 0
##$ASSFACX= 0
##$ASSWID= 0
##$AUNMP= <proc_1d>
##$AZFE= 0.1
##$AZFW= 0.1
##$BCFW= 0
##$BC_mod= 0
##$BYTORDP= 0
##$COROFFS= 0
##$CY= 12.5
##$DATMOD= 1
##$DC= 0
##$DFILT= <>
##$DTYPP= 0
##$F1P= 14.0000005364418
##$F2P= -0.99999901652339
##$FCOR= 0.5
##$FTSIZE= 32768
##$FT_mod= 6
##$GAMMA= 0
##$GB= 0
##$INTBC= 1
##$INTSCL= 1
##$ISEN= 128
##$LB= 0.3
##$LEV0= 0
##$LPBIN= 0
##$MAXI= 10000
##$MC2= 0
##$MEAN= 0
##$ME_mod= 0
##$MI= 0
##$NCOEF= 0
##$NC_proc= -6
##$NLEV= 6
##$NOISF1= 0
##$NOISF2= 0
##$NSP= 0
##$NTH_PI= 0
##$NZP= 0
##$OFFSET= 16.522
##$PC= 1
##$PHC0= -66.3848
##$PHC1= 8.940522
##$PH_mod= 1
##$PKNL= yes
##$PPARMOD= 0
##$PSCAL= 4
##$PSIGN= 0
##$REVERSE= no
##$SF= 250.13
##$SI= 32768
##$SIGF1= 0
##$SIGF2= 0
##$SINO= 400
##$SIOLD= 32768
##$SREGLST= <1H.DMSO>
##$SSB= 0
##$STSI= 32768
##$STSR= 0
##$SW_p= 5175.98343685301
##$SYMM= 0
##$S_DEV= 0
##$TDeff= 65536
##$TDoff= 0
##$TI= <Analysis number 999999
Compound Code 99
Book Reference 9
Project Code 9>
##$TILT= no
##$TM1= 0
##$TM2= 0
##$TOPLEV= 0
##$USERP1= <user>
##$USERP2= <user>
##$USERP3= <user>
##$USERP4= <user>
##$USERP5= <user>
##$WDW= 1
##$XDIM= 32768
##$YMAX_p= 525033680
##$YMIN_p= -1436399
$$ End of Bruker specific parameters
$$ ---------------------------------
##NTUPLES= NMR SPECTRUM
##VAR_NAME=  FREQUENCY,     SPECTRUM/REAL,   SPECTRUM/IMAG
##SYMBOL=    X,             R,               I
##VAR_TYPE=  INDEPENDENT,   DEPENDENT,       DEPENDENT
##VAR_FORM=  AFFN,          ASDF,            ASDF
##VAR_DIM=   32768,         32768,           32768
##UNITS=     HZ,            ARBITRARY UNITS, ARBITRARY UNITS
##FACTOR=    0.157963299565203, 1,           1
##FIRST=     4132.6476996994, 0,             0
##LAST=      -1043.33573715361, 0,           0
##MIN=       -1043.33573715361, -1436399,    0
##MAX=       4132.6476996994, 525033680,     0
$$ Real data points
##PAGE= N=1
##DATA TABLE= (X++(R..R)), XYDATA
$$ [...]
$$ plain form
24215 -570854 -413173 -289666 -262330 -134955 -125383 -207681 -174726 -10930 -103082 -338337 -484811
24204 -484811 -393274 -262018 -75978 165315 -61148 -227248 -242385 -142444 -39777 58554
24194 58554 69715 -40830 -67070 -132885 -155881 -22012 8358 -34605 178842 308752 263067
24183 263067 206189 123991 39251 -47775 81043 -60715 -64762 -156857 -227462 -109597 -53292
24172 -53292 -58483 -216075 -482570 -450967 -311230 -337222 -327738 -211474 -318721 -380128 -381904
24161 -381904 -10628 102106 153027 260240 149439 -98039 -83605 -106561 -110895 -162766 39738
24150 39738 213021 88063 -85705 -31518 -77030 21282 -178391 -263881 -429452 -572991
24140 -572991 -492625 -346475 -418406 -291270 -205677 -106098 -21882 -175662 -367393 -319736 -184735
$$ packed form
24215e70854J57681J23507K7336J27375R572q2298L2955J63796r2152k35255j46474
24204d84811R1537J31256J86040K41293k26463j66100j5137R9941J02667R8331
24194E8554J1161j10545k6240o5815k2996J33869L0370m2963K13447J29910m5685
24183B63067n6878q2198q4740q7026J28818j41758m047r2095p0605J17865N6305
24172e3292n191j57592k66495L1603J39737k5992R484J16264j07247o1407j776
24161c81904L71276J12734N0921J07213j10801k47478J4434k2956m334n1871K02504
24150C9738J73283j24958j73768N4187m5512R8312j99673q5490j65571j43539
24140e72991Q0366J46150p1931J27136Q5593R9579Q4216j53780j91731M7657J35001
$$ plain form
24129 -184735 10111 33315 -215355 -135033 -47978 -89650 -61248 -217806 -186974 -45082 -29517
24118 -29517 -196837 -456467 -356467 -269853 -147991 53917 132639 -12147 -122291 12598
24108 12598 93621 -79785 -207160 -131868 -103693 -49632 -101052 -162227 -29707 98367 12461
24097 12461 89231 220149 182489 66434 -122505 -151308 -255095 -176092 143767 324058
24087 324058 297516 162914 -87427 -96944 4441 21842 -61842 -127393 -198180 28600 -121920
24076 -121920 -62566 -71751 53635 7797 -80793 -85746 -186525 -184511 -21974 -57830 -215518
24065 -215518 -175805 -68347 17959 41962 8905 -71612 -189304 -424972 -455612 -403581 -301736
24054 -301736 -114237 7160 -40075 -109165 -10015 -94200 -179994 -196855 -190316 -124903 -153221
$$ packed form
24129a84735J94846K3204k48670Q0322Q7055m1672K8402j56558L0832J41892J5565
24118b9517j67320k59630J00000Q6614J21862K01908P8722j44786j10144J34889
24108A2598Q1023j73406j27375P5292K8175N4061n1420o1175J32520J28074q5906
24097A2461P6770J30918l7660j16055j88939k8803j03787P9003L19859J80291
24087C24058k6542j34602k50341r517J01385J7401q3684o5551p0787K26780j50520
24076a21920N9354r185J25386m5838q8590m953j00779K014J62537l5856j57688
24065b15518L9713J07458Q6306K4003l3057q0517j17692k35668l0640N2031J01845
24054c01736J87499J21397m7235o9090R9150q4185q5794j6861O539O5413k8318
$$ plain form
24043 -153221 -104034 -76899 -148615 -157822 -247084 -201193 70656 97804 -35518 71121 -108548
24032 -108548 -380583 -454332 -299072 -268702 -216989 -132763 50465 97626 117631 -90106 -278783
24021 -278783 -104039 -70809 -351746 -424678 -65680 201069 307122 261204 300863 155228
24011 155228 295650 274590 268180 372649 371679 96947 53539 19815 -113713 -159790 -146238
24000 -146238 -160934 -117515 231500 269804 195644 291117 61862 -262759 -391846 -274481
23990 -274481 -175695 -358989 -528277 -429983 -501254 -519082 -383500 -406538 -228735 -372581
23980 -372581 -184539 15273 45474 85219 -76218 -128312 -164443 -181353 -334997 -495472
23970 -495472 -524867 -554637 -526823 -394217 -138643 92451 1098 -264939 -53114 227503
$$ packed form
24043a53221M9187K7135p1716r207q9262M5891K71849K7148j33322J06639j79669
24032a08548k72035p3749J55260L0370N1713Q4226J83228M7161K0005k07737j88677
24021b78783J74744L3230k80937p2932L58998K66749J06053m5918L9659j45635
24011A55228J40422k1060o410J04469r70k74732m3408l3724j33528m6077J3552
24000a46238j4696M3419L49015L8304p4160R5473k29255l24621j29087J17365
23990b74481R8786j83294j69288R8294p1271j7828J35582k3038J77803j43846
23980c72581J88042J99812L0201L9745j61437n2094l6131j6910j53644j60475
23970d95472k9395k9770K7814J32606K55574K31094r1353k66037K11825K80617
$$ plain form
23960 227503 206009 -66144 -126955 -102544 -342822 -617041 -501523 -77431 343851 204642
23950 204642 210193 118579 20618 -130109 -77036 88507 77120 157278 111963 174794 -18515
23939 -18515 -30699 225715 192733 -90838 -198560 -151582 148327 230815 89162 -25647
23929 -25647 -80373 9659 20193 82331 -100037 -387641 -371235 -241631 -104778 -95284 -185074
23918 -185074 -279445 -171905 -323950 -256998 -267665 -58239 62993 -8220 63142 -130844
23908 -130844 -255211 -217703 -203592 -561186 -652175 -376373 -188701 -90500 71180 118366
23898 118366 117697 184701 27054 -214428 -269646 29195 14972 -22790 13875 253847 336908
23887 336908 224983 174240 56667 -122708 -233348 -474529 -544991 -563448 -554831 -374978
$$ packed form
23960B27503k1494k72153o0811K4411k40278k74219J15518M24092M21282j39209
23950B04642N551r1614r7961j50727N3073J65543j1387Q0158m5315O2831j93309
23939a8515j2184K56414l2982k83571j07722M6978K99909Q2488j41653j14809
23929b5647n4726R0032J0534O2138j82368k87604J6406J29604J36853R494q9790
23918a85074r4371J07540j52045O6952j0667K09426J21232p1213P1362j93986
23908a30844j24367L7508J4111l57594r0989K75802J87672R8201J61680M7186
23898A18366o69O7004j57647k41482n5218K98841j4223l7762L6665K39972Q3061
23887C36908j11925n0743j17573j79375j10640k41181p0462j8457Q617J79853
$$ plain form
23877 -374978 39683 264540 94405 9725 43162 1678 -31244 -45989 -162646 -106805 -256390
23866 -256390 -369914 -221881 -331730 -216613 61655 259606 111999 -94742 45127 200775
23856 200775 304373 187056 155454 342971 280555 292259 69954 -291969 -314826 49694
23846 49694 63691 -76763 -194906 -115366 14839 40086 123006 114508 143166 191153 54117
23835 54117 -188778 -242943 -174381 -105098 -35075 -92122 -209457 -422397 -567183 -632894 -607092
23824 -607092 -510168 -408697 -79586 144880 -91672 16181 88527 120278 -39562 -139812
23814 -139812 3859 -12414 177743 355662 151448 7736 -513 -65388 -188932 -320242
23804 -320242 -240873 -146108 -333276 -156387 95299 51213 -250539 -433038 -401799 -418551
$$ packed form
23877c74978M14661K24857j70135q4680L3437m1484l2922j4745j16657N5841j49585
23866b56390j13524J48033j09849J15117K78268J97951j47607k06741J39869J55648
23856B00775J03598j17317l1602J87517o2416J1704k22305l61923k2857L64520
23846D9694J3997j40454j18143P9540J30205K5247Q2920q498K8658M7987j37036
23835E4117k42895n4165O8562O9283P0023n7047j17335k12940j44786o5711K5802
23824f07092R6924J01471L29111K24466k36552J07853P2346L1751j59840j00250
23814a39812J43671j6273J90157J77919k04214j43712q249o4875j23544j31310
23804c20242P9369R4765j87168J76889K51686m4086l01752j82499L1239j6752
$$ plain form
23794 -418551 -160307 -93802 -206017 18718 127268 130011 83306 -45023 -287494 -279452 -163724
23783 -163724 -70786 -173545 -250111 -217499 -121646 125849 46629 -180130 -338482 58644
23773 58644 20156 9062 56670 250519 262852 255557 141360 48573 -199992 -313906 -392390
23762 -392390 -614623 -622152 -740536 -692877 -566683 -488865 -629263 -449352 -232367 -215928
23752 -215928 -446928 -432878 -325231 -61988 -183095 -429412 -440573 -360056 -283854 -180016
23742 -180016 27285 7307 -96855 -111214 -141449 -242952 -285845 -262900 -19212 -221617
23732 -221617 -451357 -431309 -350158 -221929 83588 332789 364089 203604 75140 281837
23722 281837 373694 226279 73838 53105 -155468 -212937 -170042 -109355 81128 188669
$$ packed form
23794d18551K58244O6505j12215K24735J08550K743m6705j28329k42471Q042J15728
23783a63724R2938j02759p6566L2612R5853K47495p9220k26759j58352L97126
23773E8644l8488j1094M7608J93849J2333p295j14197r2787k48565j13914p8484
23762c92390k22233p529j18384M7659J26194P7818j40398J79911K16985J6439
23752b15928k31000J4050J07647K63243j21107k46317j1161Q0517P6202J03838
23742a80016K07301j9978j04162j4359l0235j01503m2893K2945K43688k02405
23732b21617k29740K0048Q1151J28229L05517K49201L1300j60485j28464K06697
23722B81837R1857j47415j52441k0733k08573n7469M2895O0687J90483J07541
$$ plain form
23712 188669 -60743 -196784 -329933 -399094 -240597 -176305 -393757 -576784 -420711 -185643
23702 -185643 -226517 -34211 -5613 -108286 56618 -59080 -210126 -194285 -365662 -407052
23692 -407052 -169772 -18269 55964 -59133 -109739 -235812 -431947 -386444 -29938 87894
23682 87894 21093 -294647 -63753 199512 76689 -190075 -172950 -120458 -36734 89194
23672 89194 315137 77738 36590 -74855 -108720 -213626 -364822 -200435 -33229 89298
23662 89298 -147235 -448196 -397909 -336472 -335506 -399732 -549137 -567728 -54949 -69075 -59858
23651 -59858 15291 -169562 -202532 -99413 -152710 -193191 -372252 -428381 -207344 -45376 92028
23640 92028 158648 171619 242492 113033 -117296 -342980 -256098 -345864 -259328 -136161 -281414
$$ packed form
23712A88669k49412j36041j33149o9161J58497O4292k17452j83027J56073K35068
23702a85643m0874J92306K8598j02673J64904j15698j51046J5841j71377m1390
23692d07052K37280J51503P4233j15097n0606j26073j96135M5503L56506J17832
23682H7894o6801l15740K30894K63265j22823k66764J7125N2492Q3724J25928
23672H9194K25943k37399m1148j11445l3865j04906j51196J64387J67206J22527
23662H9298k36533l00961N0287O1437R66o4226j49405j8591N12779j4126R217
23651e9858P5149j84853l2970J03119n3297m0481j79061n6129K21037J61968J37404
23640I2028O6620J2971P0873j29459k30329k25684Q6882q9766Q6536J23167j45253
$$ plain form
23629 -281414 -469468 -420750 -330214 -334901 -358851 -386270 -312284 -425166 -492735 -436855 -585102
23618 -585102 -495404 -350073 -227993 -252600 -330561 -556008 -486398 -332548 -491304 -352197
23608 -352197 -188157 -5070 213459 250278 59882 -112621 -209914 -148731 -171743 -273158
23598 -273158 -329385 -218243 -292393 -194357 -36359 -82364 -21381 -59947 -6408 -180657 -164574
23587 -164574 -65778 -47302 -17388 65092 -71226 -336009 -485209 -449549 -135929 57558
23577 57558 26958 33207 -78167 -280629 -341379 -373760 -228486 -73155 48817 -102332 47751
23566 47751 -140222 -262464 -338510 -387419 -250367 -15276 19014 147366 172298 81361 2474
23555 2474 10280 39668 -61990 -252563 -345700 -140220 220093 303400 -40079 -333094 -261590
$$ packed form
23629b81414j88054M8718R0536m687k3950k7419P3986j12882o7569N5880j48247
23618e85102Q9698J45331J22080k4607p7961k25447O9610J53850j58756J39107
23608c52197J64040J83087K18529L6819j90396j72503r7293O1183k3012j01415
23598b73158n6227J11142p4150R8036J57998m6005O0983l8566N3539j74249J6083
23587a64574R8796J8476K9914Q2480j36318k64783j49200L5660L13620J93487
23577E7558l0600O249j11374k02462o0750l2381J45274J55331J21972j51149J50083
23566D7751j87973j22242p6046m8909J37052K35091L4290J28352K4932r0937p8887
23555B474P806K9388j01658j90573r3137K05480L60313Q3307l43479k93015P1504
$$ plain form
23544 -261590 -65947 -89220 -42190 118941 206962 137845 -213648 -384566 -227485 32293
23534 32293 197721 228972 47530 -184911 -85225 61643 -23817 -45289 -195476 -214922 -110485
23523 -110485 -203378 67772 -187489 -249714 -257046 -359381 -290189 -116409 -144131 -39083 101546
23512 101546 75704 -144612 -48871 -125505 66109 23552 -110722 -246567 -98924 -190666
23502 -190666 13571 95552 -39282 -26892 12420 -10269 -94577 -213782 -126658 39433 40741
23491 40741 -57358 -98235 73724 154093 234303 15100 -396756 -647062 -809174 -700687
23481 -700687 -538030 -292819 -239189 -139090 53958 88436 101658 106470 -97542 -241242
23471 -241242 -315337 -159734 -277231 8725 141691 16061 -149402 -5350 120277 -13634
$$ packed form
23544b61590J95643k3273M7030J61131Q8021o9117l51493j70918J57081K59778
23534C2293J65428L1251j81442k32441R9686J46868q5460k1472j50187j9446J04437
23523a10485r2893K71150k55261o2225p332j02335O9192J73780k7722J05048J40629
23512A01546k5842k20316R5741p6634J91614m2557j34274j35845J47643r1742
23502a90666K04237Q1981j34834J2390L9312k2689q4308j19205Q7124J66091J308
23491D0741r8099m0877J71959Q0369Q0210k19203m11856k50306j62112J08487
23481g00687J62657K45211N3630J00099J93048L4478J3222M812k04012j43700
23471b41242p4095J55603j17497K85956J32966j25630j65463J44052J25627j33911
$$ plain form
23461 -13634 6850 132826 109473 -414598 -763879 -671389 -93616 256416 420737 169856
23451 169856 -319053 -314474 -196034 -181871 -8418 -56306 -94514 76915 47992 -436549 -572824
23440 -572824 -460658 -284726 -225125 -342065 -378834 -291799 -231897 -283168 -271908 -244548 -189199
23429 -189199 -258751 -186348 -30628 1890 120625 170465 70242 -85152 -218851 -279212
23419 -279212 -235265 -270190 -267277 -188545 -85778 -23985 77818 -59021 -139993 -84041 -18141
23408 -18141 -58780 -198302 -173281 37281 42986 231773 154548 -126733 -224943 -230454 -218657
23397 -218657 -375338 -240966 -59127 89391 150706 -77810 -313680 -168948 -118571 -187888
23387 -187888 -95296 -165516 -167751 -316237 -248446 -146223 -159880 -217857 -181274 -264517 -287434
$$ packed form
23461a3634K0484J25976k3353n24071l49281R2490N77773L50032J64321k50881
23451A69856m88909M579J18440J4163J73453m7888l8208J71429k8923m84541j36275
23440e72824J12166J75932N9601j16940l6769Q7035N9902n1271J1260K7360N5349
23429a89199o9552P2403J55720L2518J18735M9840j00223j55394j33699o0361
23419b79212M3947l4925K913P8732J02767O1793J01803j36839q0972N5952O5900
23408a8141m0639j39522K5021K10562N705J88787p7225k81281r8210n511J1797
23397b18657j56681J34372J81839J48518O1315k28516k35870J44732N0377o9317
23387a87888R2592p0220k235j48486O7791J02223j3657n7977L6583q3243k2917
$$ plain form
23376 -287434 -5787 -3242 27083 366997 316118 -68296 -190081 -28393 -170754 -121230
23366 -121230 73602 -57294 -13592 -76645 -386138 -389228 -230472 -309394 -142093 -121960 -312367
23355 -312367 -564899 -420317 -233034 -237549 -410893 -381807 -351382 -225841 -252267 -397285
23345 -397285 -650567 -555735 -528203 -359370 -102102 -11943 94370 220062 74909 -121851
23335 -121851 -323144 -177447 -52375 -267191 -192023 -350624 -341955 -236758 -165339 -3980
23325 -3980 236637 141394 -229015 -467068 -568152 -428504 -314264 47495 194782 326397
23315 326397 338883 220245 -47910 -332948 -485289 -433339 -294859 -109529 -133918 -228269
23305 -228269 -221835 -289863 -197210 -48451 61962 277816 165964 -215661 -193177 -110169 -295631
$$ packed form
23376b87434K81647K545L0325L39914n0879l84414j21785J61688j42361M9524
23366a21230J94832j30896M3702o3053l09493l090J58756p8922J67301K0133j90407
23355c12367k52532J44582J87283m515j73344K9086L0425J25541k6426j45018
23345c97285k53282R4832K7532J68833K57268R0159J06313J25692j45153j96760
23335a21851k01293J45697J25072k14816P5168j58601Q669J05197P1419J61359
23325c980K40617r5243l70409k38053j01084J39648J14240L61759J47287J31615
23315C26397J2486j18638k68155k85038j52341N1950J38480J85330k4389r4351
23305b28269O434o8028R2653J48759J10413K15854j11852l81625K2484Q3008j85462
$$ plain form
23294 -295631 -282830 -117995 70247 210950 58532 141642 62155 -168029 -140401 -180477
23284 -180477 -58076 13670 -169396 -122708 -59837 -105328 21903 218488 201455 -102994
23274 -102994 -331954 -421666 -478289 -643708 -618672 -382907 -331026 -311386 8764 51790 -41086
23263 -41086 69822 2342 -215607 -182669 28556 293024 215516 815 -22810 -4200 -132553
23252 -132553 -267336 -293671 -351895 -443046 -449450 -272434 -186137 -261908 -294352 -221282 -361943
23241 -361943 -147371 -122476 -12680 -49615 114745 230887 134962 -88907 -136824 -273383
23231 -273383 -346016 -666873 -487755 -339316 -252787 -152602 -172436 -187066 -169827 51921
23221 51921 186961 225528 111377 137179 -38795 -92388 -259632 -224333 -298455 -330894 -375431
$$ packed form
23294b95631J2801J64835J88242J40703j52418Q3110p9487k30184K7628m0076
23284a80477J22401P1746j83066M6688O2871m5491J27231J96585j7033l04449
23274a02994k28960q9712n6623j65419K5036K35765N1881J9640L20150M3026r2876
23263d1086J10908o7480k17949L2938K11225K64468p7508k14701k3625J8610j28353
23252a32553j34783k6335n8224r1151o404J77016Q6297p5771l2444P3070j40661
23241c61943K14572K4895J09796l6935J64360J16142r5925k23869m7917j36559
23231b73383p2633l20857J79118J48439Q6529J00185j9834j4630J7239K21748
23221E1921J35040L8567j14151K5802j75974n3593j67244L5299p4122l2439m4537
$$ plain form
23210 -375431 -417470 -304066 -279593 -576600 -545149 -287318 -151928 66146 31378 -232872
23200 -232872 -287922 -38337 -155192 -317983 -254376 -33618 -134067 -224431 2850 92276
23190 92276 110915 -44074 -61565 -158556 -146626 -48105 -111820 -171753 -568269 -625034 -353460
23179 -353460 -276789 -235782 -311050 -348033 -161717 -155215 -327451 -406407 -209187 -78125 -367418
23168 -367418 -517853 -527219 -519871 -300370 -61182 -70567 50285 91475 102176 328757 342642
23157 342642 133031 -127751 -351944 -207496 -133094 -163030 -117017 -141353 -184423 -123263 182721
23146 182721 159890 54761 -35144 -123816 -173827 -390249 -489930 -394056 -326532 -360005 -283553
23135 -283553 -21648 336490 429848 47521 -65980 -22520 -100057 103010 281177 49070
$$ packed form
23210c75431m2039J13404K4473k97007L1451K57831J35390K18074l4768k64250
23200b32872n5050K49585j16855j62791O3607K20758j00449r0364K27281Q9426
23190I2276J8639j54989j7491r6991J1930R8521o3715n9933l96516n6765K71574
23179c53460P6671M1007p5268l6983J86316O502j72236p8956J97220J31062k89293
23168c67418j50435r366P348K19501K39188r385J20852M1190J0701K26581J3885
23157C42642k09611k60782k24193J44448P4402k9936M6013k4336m3070O1160L05984
23146A82721k2831j05129q9905q8672n0011k16422r9681R5874O7524l3473P6452
23135b83553K61905L58138R3358l82327j13501M3460p7537K03067J78167k32107
$$ plain form
23125 49070 -60649 -231214 -336282 -364348 -340201 -209092 -175279 -34689 7461 17974 240176
23114 240176 329022 262286 56979 -140325 -355703 -175282 -389493 -387377 -290978 -173081
23104 -173081 -129370 -175806 -182162 -77383 -127617 -282304 -252115 -422861 -278946 -265655 -400386
23093 -400386 -317122 -294775 -195186 -226659 -315256 -398859 -503899 -529380 -325923 -69147 169655
23082 169655 30079 63842 -19887 -266081 -310127 -396098 -481194 -448824 -283834 -129684 -250222
23071 -250222 -259870 -233064 -218573 -185457 -235154 -416762 -594302 -451985 -432506 -504248 -604207
23060 -604207 -476781 -383052 -277762 -232672 -183644 -134199 3939 -24116 -190367 -240806 -255457
23049 -255457 -73227 -161434 -69648 32957 107380 -62417 -379826 -454507 -329758 -378912
$$ packed form
23125D9070j09719j70565j05068k8066K4147J31109L3813J40590M2150J0513K22202
23114B40176Q8846o6736k05307j97304k15378J80421k14211K116R6399J17897
23104a73081M3711m6436o356J04779n0234j54687L0189j70746J43915J3291j34731
23093d00386Q3264K2347R9589l1473q8597q3603j05040k5481K03457K56776K38802
23082A69655j39576L3763q3729k46194m4046q5971q5096L2370J64990J54150j20538
23071b50222r648K6806J4491L3116m9697j81608j77540J42317J9479p1742r9959
23060f04207J27426R3729J05290M5090M9028M9445J38138k8055j66251n0439j4651
23049b55457J82230q8207R1786J02605P4423j69797l17409p4681J24749m9154
$$ plain form
23039 -378912 -292546 -167262 -228612 -198008 -187222 -1611 203633 254387 214170 93109 14447
23028 14447 -56238 29098 -37617 -36560 9255 -167257 -167695 -32984 -99762 -209869 -208911 -144028
23016 -144028 -216547 -152750 -351394 -352060 -27939 -12286 -211085 -281403 -368641 -306191 -478388
23005 -478388 -408397 -524429 -651608 -537584 -370244 -319543 -392859 -305699 -248163 -11146
22995 -11146 182824 209371 -1661 -247481 -160000 104400 186521 230777 226817 194849 54376
22984 54376 226639 336236 240236 204908 255254 151268 29612 -132101 -260223 -172244
22974 -172244 -28562 -123567 98567 110404 226362 283365 362916 275167 155670 -43847
22964 -43847 -27310 -20733 -166177 -17672 117985 54722 -118620 -224974 -388406 -258533
$$ packed form
23039c78912Q6366J25284o1350L0604J0786J85611K05244N0754m0217j21061p8662
23028A4447p0685Q5336o6715J057M5815j76512m38J34711o6778j10107R58O4883
23016a44028p2519O3797j98644o66L24121J5653j98799p0318q7238O2450j72197
23005d78388O9991j16032j27179J14024J67340N0701p3316Q7160N7536K37017
22995a1146J93970K6547k11032k45820Q7481K64400Q2121M4256l960l1968j40473
22984E4376J72263J09597r6000l5328N0346j03986j21656j61713j28122Q7979
22974a72244J43682r5005K22134J1837J15958N7003P9551q7749j19497j99517
22964d3847J6537O577j45444J48505J35657o3263j73342j06354j63432J29873
$$ plain form
22954 -258533 24623 138337 -105524 -371745 -230962 -130991 -194597 -381645 -375474 -287901
22944 -287901 -140594 -146566 -49814 -8132 -175327 -287726 -207234 -150931 -186692 27702 283153
22933 283153 437467 513843 411531 137732 185090 310476 94474 28425 -14689 975
22923 975 -47572 37625 -9099 -15212 -55301 -278690 -206557 -49843 121724 42573 77751 -29735
22911 -29735 -44231 -256803 -128665 -120244 -372357 -302465 -375940 -254874 -92732 -114889 -176616
22900 -176616 -383134 -341744 -210876 -199969 70942 348475 354072 262676 -1668 -210691
22890 -210691 -84820 159954 78087 13682 -87892 -135468 -19438 36102 -95098 -132524
22880 -132524 -141827 372897 660110 505845 344521 201342 306526 303928 1914 -58203
$$ packed form
22954b58533K83156J13714k43861k66221J40783R9971o3606j87048O171Q7573
22944b87901J47307n972R6752M1682j67195j12399Q0492N6303l5761K14394K55451
22933B83153J54314P6376j02312k73799M7358J25386k16002o6049m3114J5664
22923I75m8547Q5197m6724o113m0089k23389P2133J56714J71567p9151L5178j07486
22911b9735j4496k12572J28138Q421k52113O9892p3475J21066J62142k2157o1727
22900a76616k06518M1390J30868J0907K70911K77533N597r1396k64344k09023
22890b10691J25871K44774q1867o4405j01574m7576J16030N5540j31200l7426
22880a32524r303N14724K87213j54265j61324j43179J05184k598l02014o0117
$$ plain form
22870 -58203 32215 149190 53737 38570 69164 68807 -15001 -97494 -132893 50189 -77130
22859 -77130 -393872 -505431 -423238 -11601 47898 170873 160810 417932 408274 257891 294257
22848 294257 300299 200493 114337 200914 259963 96928 115397 114587 2227 79494 225626
22837 225626 80047 -350263 -384927 -73234 -6683 47287 -106044 31517 26469 -124682
22827 -124682 -5013 -135276 -319689 -472678 -687712 -475556 -375164 -450275 -430468 -194123
22817 -194123 -51135 -332037 -201462 -90383 -98123 -86484 -167181 -191263 -236205 -329352 -252187
22806 -252187 -52005 207333 15917 -55194 -89010 -24097 -47778 206267 314941 421614
22796 421614 256032 119564 -34899 -27052 131658 165434 -21247 -88476 -68907 -40522 -60413
$$ packed form
22870e8203R0418J16975r5453j5167L0594l57q3808q2493l5399J83082j27319
22859g7130l16742j11559Q2193M11637N9499J22975j0063K57122r658j50383L6366
22848B94257O042r9806q6156Q6577N9049j63035J8469q10j12360P7267J46132
22837B25626j45579m30310l4664L11693O6551N3970j53331J37561n048j51151
22827a24682J19669j30263j84413j52989k15034K12156J00392p5111J9807K36345
22817a94123J42988k80902J30575J11079p740J1639q0697k4082m4942r3147P7165
22806b52187K00182K59338j91416p1111l3816O4913k3681K54045J08674J06673
22796D21614j65582j36468j54463P847J58710L3776j86681o7229J9569K8385j9891
$$ plain form
22785 -60413 -217417 -447286 -444825 -294000 -344161 -115365 133435 254649 114432 129023
22775 129023 115290 128407 253785 144780 120928 2917 -24706 -39078 49988 -76613 -58884
22764 -58884 -46966 -60551 -224483 -117845 118022 27262 -291096 -367920 -201500 -196851 -168971
22753 -168971 79515 138007 210824 187755 172228 203990 -44952 122433 243259 122627
22743 122627 -188408 -382742 -124375 -78731 -25247 -100576 44203 -33059 -126941 -118969 -90577
22732 -90577 -208962 -376296 -261929 -270181 -364858 -334676 -398523 -230124 -140 132210 165284
22721 165284 257119 199407 -9316 -107485 -53317 55735 177343 123139 194793 139613 219600
22710 219600 302862 221338 218891 296567 85126 10867 14201 -27638 8076 23280 -203947
$$ packed form
22785f0413j57004k29869K461J50825n0161K28796K48800J21214j40217J4591
22775A29023j3733J3117J25378j09005k3852j18011k7623j4372Q9066j26601J7729
22764e8884J1918j3585j63932J06638K35867r0760l18358p6824J66420M649K7880
22753a68971K48486N8492P2817k3069j5527L1762k48942J67385J20826j20632
22743A22627l11035j94334K58367M5644N3484p5329J44779p7262r3882P972K8392
22732i0577j18385j67334J14367q252r4677L0182o3847J68399K29984J32350L3074
22721A65284R1835n7712k08723r8169N4168J09052J21608n4204P1654n5180P9987
22710B19600Q3262q1524k447P7676k11441p4259L334m1839L5714J5204k27227
$$ plain form
22699 -203947 -405264 -328610 -210569 -186776 -235767 -202303 -157334 -119131 30672 62540 20454
22688 20454 -98637 -177669 -229372 29339 -94774 -280205 -175829 -295570 -382478 -202949
22678 -202949 -168620 -257832 -291711 -206377 -11454 -20888 -96421 74402 72273 -158548 -103195
22667 -103195 -13989 -157715 -91092 -74919 124500 252818 116236 26395 -70659 -115095 -139166
22656 -139166 -129698 -258849 -261895 -112605 28800 6286 147827 118488 140638 226820 192957
22645 192957 247295 119435 -207502 -274196 -189796 -108326 -194715 -464015 -293014 -242055 -297428
22634 -297428 -273260 -72768 -12446 -246856 -270883 -316967 -156454 96343 80582 -132389
22624 -132389 -163047 -328465 -315453 -136424 50904 103028 61831 77066 -75401 -132970 -95960
$$ packed form
22699b03947k01317P6654J18041K3793m8991L3464M4969L8203J49803L1868m2086
22688B0454j19091p9032n1703K58711j24113j85431J04376j19741q6908J79529
22678b02949L4329q9212l3879Q5334J94923r434p5533J70823k129k30821N5353
22667a03195Q9206j43726O6623J6173J99419J28318j36582q9841r7054m4436k4071
22656a39166R468j29151l046J49290J41405k2514J41541k9339K2150Q6182l3863
22645A92957N4338j27860l26937o6694Q4400Q1470q6389k69300J71001N0959n5373
22634b97428K4168K00492O0322k34410k4027m6084J60513K52797j5761k12971
22624a32389l0658j65418J3012J79029J87328N2124m1197J5235j52467n7569L7010
$$ plain form
22613 -95960 -169512 -27450 197422 126021 -271338 -245862 -187168 -470388 -645493 -464682
22603 -464682 -142108 208821 276958 468076 411294 78502 -167062 -357882 -245500 -59397
22593 -59397 -309318 -326396 -305980 -165373 -265735 -332185 -443757 -346943 -109556 -124159 -430017
22582 -430017 -402026 -32075 60267 -148720 -397971 -366947 -388237 -360719 -302307 -250629 -73370
22571 -73370 -206401 -157071 -9407 -126006 -81306 102003 138174 111608 -226741 -516504
22561 -516504 -438108 -326916 -212306 116002 58959 -208001 -237250 -104026 -107476 174999
22551 174999 362426 51303 -210775 15190 232523 184984 -48568 -140392 -50049 71738
22541 71738 14366 199284 277325 237814 261846 201615 147275 -32315 18168 -129936 -211005
$$ packed form
22613i5960p3552J42062K24872p1401l97359K5476N8694k83220j75105J80811
22603d64682L22574L50929O8137J91118n6782l32792k45564j90820J12382J86103
22593e9397k49921j7078K0416J40607j00362o6450j11572R6814K37387j4603l05858
22582d30017K7991L69951R2342k08987k49251L1024k1290K7518N8412N1678J77259
22571g3370j33031M9330J47664j16599M4700J83309L6171k6566l38349k89763
22561e16504P8396J11192J14610L28308n7043k66960k9249J33224l450K82475
22551A74999J87427l11123k62078K25965K17333m7539k33552r1824R0343J21787
22541G1738n7372J84918P8041l9511K4032o0231n4340j79590N0483j48104q1069
$$ plain form
22530 -211005 -164852 -117570 105183 41945 178179 40135 -35780 -184437 10680 163706
22520 163706 155568 35151 -48273 -291063 -436304 -242885 -62580 77051 95730 313953
22510 313953 402405 383016 356585 246273 133489 -41662 -249717 -354446 -456860 -553657
22500 -553657 -538528 -556855 -504898 -282020 -241032 -324886 -193983 -257148 -258145 -143589 19531
22489 19531 105956 167359 115097 -107635 -223230 -241358 -208666 -19346 7145 -72789 -180749
22478 -180749 -168454 -222240 -216938 -177792 -31342 -13410 -71296 66964 239051 27473 -86030
22467 -86030 -182307 -150742 -170889 -366733 -262641 -322618 -266238 -196495 -113830 -212122 -336939
22456 -336939 -145595 91602 57139 -323638 -473359 -258153 -107417 -240640 -210629 16598
$$ packed form
22530b11005M6153M7282K22753o3238J36234j38044p5915j48657J95117J53026
22520A63706q138j20417q3424k42790j45241J93419J80305J39631J8679K18223
22510C13953Q8452j9389k6431j10312j12784j75151k08055j04729j02414r6797
22500e53657J5129j8327N1957K22878M0988q3854J30903o3165r97J14556J63120
22489A9531Q6425O1403n2262k22732j15595j8128L2692J89320K6491p9934j07960
22478a80749J2295n3786N302L9146J46450J7932n7886J38260J72087k11578j13503
22467h6030r6277L1565k0147j95844J04092n9977N6380O9743Q2665r8292j24817
22456c36939J91344K37197l4463l80777j49721K15206J50736j33223L0011K27227
$$ plain form
22446 16598 12629 -148245 -121007 -93796 -174800 -109467 -176516 -217950 -239381 -75221 -197894
22435 -197894 -381354 -172017 89228 87863 -36857 -67054 -13814 -41890 -147938 -125470 -104492
22424 -104492 -34562 -67570 -224870 -277024 -249940 -144317 -141638 18075 49251 -60561 -107837
22413 -107837 57529 -152038 -300262 -442926 -628624 -525790 -429037 -355532 -455179 -575725
22403 -575725 -504781 -303210 -85546 -49114 -187638 -327647 -226259 -335833 -491765 -134120
22393 -134120 26028 -86887 -99890 142029 134077 -3529 -115817 -302530 -68977 201051
22383 201051 75977 -6199 114044 274364 245127 117832 -29724 -149598 -372529 -317233
22373 -317233 -154922 -177191 -82250 74501 123730 33582 -69998 -149356 -126543 -334796 -576611
$$ packed form
22446A6598l969j60874K7238K7211q1004O5333o7049m1434k1431J64160j22673
22435a97894j83460K09337K61245j365j24720l0197N3240k8076j06048K2468K0978
22424a04492O9930l3008j57300n2154K7084J05623K679J59713L1176j09812m7276
22413a07837J65366k09567j48224j42664j85698J02834R6753P3505r9647j20546
22403e75725P0944K01571K17664L6432j38524j40009J01388j09574j55932L57645
22393a34120J60148j12915j3003K41919p952j37606j12288j86713K33553K70028
22383B01051j25074q2176J20243J60320k9237j27295j47556j19874k22931N5296
22373c17233J62311k2269R4941J56751M9229r0148j03580p9358K2813k08253k41815
$$ plain form
22362 -576611 -547164 -496412 -278905 -108744 -158837 -115942 -138584 -104341 -130905 -46573 -83481
22351 -83481 -175551 -95933 93344 4666 50681 207733 -173408 -161677 -18076 -177064 -290331
22340 -290331 -158898 -71191 -129083 -31359 -266945 -229900 23182 156640 104759 102489 71490
22329 71490 30242 -244961 -125085 143185 225383 188244 127956 167654 26297 -102535 -1320
22318 -1320 -40976 21714 54668 -101314 -190943 -332672 -402167 -237118 -56487 5730 11475
22307 11475 36540 -90534 -272621 -162630 13549 128487 5016 10019 57853 -34947 -201754
22296 -201754 -248951 -243875 -189454 -440916 -454028 -262018 -270805 -399895 -356604 -143922 43435
22285 43435 -72260 -206845 -30892 -142800 -310441 -233005 33436 -109585 -313398 -401833
$$ packed form
22362e76611K9447N0752K17507J70161n0093M2895k2642L4243k6564Q4332l6908
22351h3481r2070P9618J89277q8678M6015J57052l81141J1731J43601j58988j13267
22340b90331J31433Q7707n7892R7724k35586L7045K53082J33458n1881k270l0999
22329G1490m1248k75203J19876K68270Q2198l7139o0288L9698j41357j28832J01215
22318a320l9656O2690L2954j55982q9629j41729o9495J65049J80631O2217N745
22307A1475K5065j27074j82087J09991J76179J14938j23471N003M7834r2800j66807
22296b01754m7197N076N4421k51462j3112J92010q787j29090M3291K12682J87357
22285D3435j15695j34585J75953j11908j67641P7436K66441j43021k03813q8435
$$ plain form
22275 -401833 -198660 -240625 -190680 -20394 675 71219 67880 -32617 61008 -126329 -454664
22264 -454664 -572781 -327978 -97213 -25887 44280 30639 -46539 200673 267304 41475
22254 41475 72846 150503 68958 -36404 -78844 -116317 -114442 -70143 -110635 150645 268263
22243 268263 -35345 -293411 -123486 -54477 -135674 26061 104852 -20356 -67791 -81876
22233 -81876 -137911 63793 18875 -151306 -73845 36993 181712 26664 142170 113721
22223 113721 19731 102635 62136 27969 67635 118912 130677 135545 182783 54258 61258 119055
22211 119055 142881 -115744 -73793 42493 55815 -170279 -120325 -207415 -350816 -508165
22201 -508165 -436679 -211787 -140430 -195826 -288397 -242814 -97274 60727 206602 -39762
$$ packed form
22275d01833K03173m1965M9945J70286K1069P0544l339j00497R3625j87337l28335
22264d54664j18117K44803K30765P1326P0167j3641p7178K47212O6631k25829
22254D1475L1371P7657q1545j05362m2440l7473J875M4299m0492K61280J17618
22243B68263l03608k58066J69925O9009q1197J61735P8791j25208m7435j4085
22233h1876n6035K01704m4918j70181P7461J10838J44719j55048J15506k8449
22223A13721r3990Q2904m0499l4167L9666N1277J1765M868M7238j28525P000N7797
22211A19055K3826k58625M1951J16286J3322k26094M9954q7090j43401j57349
22201e08165P1486K24892P1357n5396r2571M5583J45540J58001J45875k46364
$$ plain form
22191 -39762 -42528 -56817 24767 -227605 -400850 -415521 -529225 -575638 -443384 -340894 -244475
22180 -244475 -43008 -96936 -294742 -558115 -417695 -205418 -354792 -391968 -342851 -311719
22170 -311719 -574782 -497716 -231618 -85011 -79825 -88260 111744 273810 197629 518 -187503
22159 -187503 -48962 53345 31569 -217551 -517707 -290040 -88204 -8113 102618 -215899
22149 -215899 -355934 -139496 249693 503880 476271 132293 -54304 -105430 -34093 -24109
22139 -24109 -252471 -327207 -414953 -510316 -338279 -345829 -249230 -216183 -350860 -203590 -142434
22128 -142434 -285476 -218207 -208077 -117525 -237242 -214081 12616 -50777 5704 100624 54426
22117 54426 -276089 -332753 -82792 -27836 -148475 -273900 -337447 -398956 -322054 -481691 -461052
$$ packed form
22191c9762k766j4289Q1584k52372j73245j4671j13704m6413J32254J02490R6419
22180b44475K01467n3928j97806k63373J40420K12277j49374l7176M9117L1132
22170c11719k63063P7066K66098J46607N186q435K00004J62066p6181j97111j88021
22159a87503J38541J02307k1776k49120l00156K27667K01836Q0091J10731l18517
22149b15899j40035K16438L89189K54187k7609l43978j86597n1126P1337R984
22139b4109k28362p4736q7746r5363J72037p550R6599L3047j34677J47270O1156
22128a42434j43042O7269J0130R0552j19717K3161K26697o3393N6481R4920m6198
22117E4426l30515n6664K49961N4956j20639j25425o3547o1509P6902j59637K0639
$$ plain form
22106 -461052 -256138 -27920 76471 -12002 -90698 -454923 -575057 -511574 -374362 -339224
22096 -339224 -22904 -23655 -198607 -274247 -380089 -477251 -651077 -387089 -38901 8784 -37223
22085 -37223 -20667 -150398 -246572 -124661 -26072 -64418 -136817 -345571 -398095 -289175 -453282
22074 -453282 -387261 -337044 -481849 -343456 -218134 -260094 -430555 -623127 -469354 -207996
22064 -207996 -172130 -257446 -288637 -335065 -341196 -291310 -155491 -205467 -239622 -348533 -129076
22053 -129076 -18812 -114748 -144370 -24430 17580 -37520 136187 155289 59250 52016 -126724
22042 -126724 -272564 -139216 -288186 -128405 108459 150797 179655 350190 498284 245851
22032 245851 14989 -32664 108851 222795 216008 185058 121929 -15814 -70357 -57908 -68016
$$ packed form
22106d61052K04914K28218J04391q8473p8696l64225j20134O3483J37212L5138
22096c39224L16320p51j74952p5640j05842r7162j73826K63988L48188M7685m6007
22085c7223J6556j29731r6174J21911R8589l8346p2399k08754n2524J08920j64107
22074d53282O6021N0217j44805J38393J25322m1960j70461j92572J53773K61358
22064b07996L5866q5316l1191m6428o131M9886J35819m9976l4155j08911K19457
22053a29076J10264r5936k9622J19940M2010n5100J73707J9102r6039p234j78740
22042a26724j45840J33348j48970J59781K36864M2338K8858J70535J48094k52433
22032B45851k30862m7653J41515J13944o787l0950o3129j37743n4543J2449j0108
$$ plain form
22021 -68016 -146305 -122957 -277613 -267755 -18741 -49687 -100321 -38547 -83323 -105026 41632
22010 41632 -6007 25678 7558 -241795 -292691 -188394 -337334 -336765 -196129 -138953 -94139
21999 -94139 21626 28769 -109115 -383234 -422779 -389393 -251591 -68755 -255793 -488448
21989 -488448 -454811 -178690 -300090 -360141 -167579 -53464 119166 -79315 -409907 -263537
21979 -263537 -205899 -165419 -74240 -106660 85688 170852 -120 168052 351089 467952
21969 467952 375685 156025 42691 -53107 -87033 69980 -8706 99109 194025 -71988
21959 -71988 -240528 -525940 -660426 -739622 -561948 -370260 -268578 -158833 -163288 -410530
21949 -410530 -251447 -263519 -171259 -57559 -308081 -161449 184685 258665 108666 -116280
$$ packed form
22021f8016p8289K3348j54656R858K49014l0946n0634O1774m4776k1703J46658
22010D1632m7639L1685j8120k49353n0896J04297j48940N69J40636N7176M4814
21999i4139J15765P143j37884k74119l9545L3386J37802J82836j87038k32655
21989d88448L3637K76121j21400o0051J92562J14115J72630j98481l30592J46370
21979b63537N7638M0480R1179l2420J92348Q5164j70972J68172J83037J16863
21969D67952r2267k19660j13334r5798l3926J57013p8686J07815R4916k66013
21959g1988j68540k85412j34486p9196J77674J91688J01682J09745m455k47242
21949d10530J59083j2072R2260J13700k50522J46632L46134P3980j49999k24946
$$ plain form
21939 -116280 -112300 -51964 -217220 -418982 -430254 -459652 -506925 -462878 -364536 -447070 -479222
21928 -479222 -387625 -238136 13275 -47027 -154178 -296127 -289651 36035 79050 -104064
21918 -104064 -96366 346380 489221 332734 90229 -93484 -351522 -71580 -81421 -145565
21908 -145565 -221053 -72483 -25145 -70053 -155888 -261978 -374679 -221556 -99091 -216975
21898 -216975 -389516 -458461 -255858 84755 290735 -45577 -314191 -557832 -590325 -515384
21888 -515384 -552690 -343746 -232542 -172582 -158340 -66154 68206 135655 131847 263059 37657
21877 37657 -136075 -53826 -11820 -309911 -555919 -211216 199103 -48595 -286323 -418739
21867 -418739 -358718 -346281 -199761 -37368 -246052 -137709 34683 33895 56902 14890 -14839
$$ packed form
21939a16280L980O0336j65256k01762j1272k9398m7273M4047R8342q2534l2152
21928d79222R1597J49489K51411o0302j07151j41949O476L25686M3015j83114
21918a04064P698M42746J42841j56487k42505j83713k58038K79942r841o4144
21908a45565p5488J48570M7338m4908q5835j06090j12701J53123J22465j17884
21898b16975j72541o8945K02603L40613K05980l36312k68614k43641l2493P4941
21888e15384l7306K08944J11204N9960J4242R2186J34360O7449l808J31212k25402
21877C7657j73732Q2249M2006k98091k46008L44703M10319k47698k37728j32416
21867d18739O0021J2437J46520J62393k08684J08343J72392p88K3007m2012k9729
$$ plain form
21856 -14839 20152 -244126 -122159 -171294 -159283 -43342 116661 35712 -58539 -165808 -984
21845 -984 158725 159946 5607 -138354 -147966 -63750 1418 -178694 132664 349838 197423
21834 197423 -54375 42432 212045 80208 -241839 -214797 -220352 -222566 -429610 -517092 -568948
21823 -568948 -376679 -299022 -487134 -319000 -189617 -131847 -43634 12402 -203549 -164188
21813 -164188 -66421 118624 -132524 -387865 -158704 -220373 -464784 -232591 40603 149417
21803 149417 158146 -7592 -16828 183322 209474 137632 43332 172220 48458 96323 395688
21792 395688 164504 59156 186372 -36138 -117427 14417 20161 233450 190903 175896
21782 175896 314697 374893 334271 75391 -131393 -253816 -52906 -231057 -376157 -240027
$$ packed form
21856a4839L4991k64278J21967m9135J2011J15941J60003q0949r4251j07269J64824
21845i84J59709J221j54339j43961r612Q4216O5168j80112L11358K17174j52415
21834A97423k51798R6807J69613j31837l22047K7042n555k214k07044q7482n1856
21823e68948J92269P7657j88112J68134J29383N7770Q8213N6036k15951L9361
21813a64188R7767J85045k51148k55341K29161o1669k44411K32193K73194J08814
21803A49417Q729j65738r236K00150K6152p1842r4300J28888j23762M7865K99365
21792C95688k31184j05348J27216k22510q1289J31844N744K13289m2547j5007
21782A75896J38801O0196m0622k58880k06784j22423K00910j78151j45100J36130
$$ plain form
21772 -240027 112104 88243 149005 315089 320192 16649 -148465 -93887 53264 -193460
21762 -193460 -61775 68311 75938 45513 -145666 -194231 -94591 -119824 -20706 -40284 -1479
21751 -1479 -17804 -291572 -266447 74840 335536 203424 -43068 22491 243752 257578 167176
21740 167176 -7548 -390582 -233624 -3480 -8155 -67967 529 140961 49002 -73362
21730 -73362 -38937 -174694 -223175 -46239 -50428 -253328 -206953 -82520 -135666 153625 430622
21719 430622 431061 140376 -240366 -436238 -304521 -165109 -169470 -186736 44706 139239 141881
21708 141881 190937 146919 234401 338883 187430 63150 294293 330319 120978 -180533
21698 -180533 -354426 -233061 168615 376226 210883 318257 327995 133306 119171 -200213
$$ packed form
21772b40027L52131k3861O0762J66084N103l03543j65114N4578J47151k46724
21762a93460J31685J30086P627l0425j91179m8565R9640k5233R9118j9578L8805
21751a479j6325k73768K5125L41287K60696j32112k46492O5559K21261J3826r0402
21740A67176j74724l83034J56958K30144m675n9812O8496J40432r1959j22364
21730g3362L4425j35757m8481J76936m189k02900M6375J24433n3146K89291K76997
21719D30622M39k90685l80742j95872J31717J39412m361j7266K31442R4533K642
21708A41881M9056m4018Q7482J04482j51453j24280K31143L6026k09341l01511
21698a80533j73893J21365M01676K07611j65343J07374R738j94689j4135l19384
$$ plain form
21688 -200213 -345924 -138373 -197296 -273522 -194288 -119573 -29771 -70296 14426 46669 -44277
21677 -44277 -19304 -85053 80588 -19966 -190526 7571 156396 71756 -32265 -79749
21667 -79749 -109859 -40627 78762 -22055 -120480 -14530 -126848 -296797 -198915 -142449 -226619
21656 -226619 -355651 -440408 -495206 -659498 -786595 -611806 -260715 11737 180432 145531
21646 145531 185336 203312 198976 67660 -126220 -170694 -170497 -120655 -140399 -169958 -254944 -495452
21634 -495452 -474518 -316572 -115050 -142342 -25037 136370 -113518 -438990 -447885 -425898
21624 -425898 -197252 4327 -316142 -512254 -489549 -288713 -109548 235249 296538 168314
21614 168314 236988 83108 145459 81323 -94184 -176336 133700 227166 299891 237660 28399
$$ packed form
21688b00213j45711K07551n8923p6226P9234P4715Q9802m0525Q4722L2243r0946
21677d4277K4973o5749J65641j00554j70560J98097J48825q4640j04021m7484
21667g9749l0110O9232J19389j00817r8425J05950j12318j69949R7882N6466q4170
21656b26619j29032q4757n4798j64292j27097J74789L51091K72452J68695l4901
21646A45531L9805J7976m336j31316j93880m4474J97M9842j9744k9559q4986k40508
21634d95452K0934J57946K01522k7292J17305J61407k49888l25472q895K1987
21624d25898K28646K01579l20469j96112K2705K00836J79165L44797O1289j28224
21614A68314O8674j53880O2351o4136j75507q2152L10036R3466P2725o2231k09261
$$ plain form
21603 28399 -151222 -259223 -13395 -87877 -168422 13893 -14117 1831 33991 -36734 -119431
21592 -119431 -329475 -310408 -181966 -193414 -136838 -187401 12211 127027 225473 344962
21582 344962 345605 352187 521428 310678 309883 212223 142548 103126 179809 -2743 -192511 -147644
21570 -147644 140868 125447 -44220 -348690 -342038 -101777 224447 96348 58128 178438
21560 178438 160209 -5178 -216238 -264436 -395781 -387350 -137857 305728 342187 173170
21550 173170 -19937 -107105 -227494 -304767 -267609 -293351 -225462 -244484 -300553 -329421 -306371
21539 -306371 -136903 -71452 70178 -151475 -300790 -233526 -267274 -102192 -23519 -78756
21529 -78756 -216198 -152746 -230243 -373727 -196502 -58322 32612 -133411 -173980 -162483 -108616
$$ packed form
21603B8399j79621j08001K45828p4482q0545J82315k8010J5948L2160p0725q2697
21592a19431k10044J9067J28442j1448N6576n0563J99612J14816R8446J19489
21582C44962O43O582J69241k10750p95r7660o9675l9422P6683j82552j89768M4867
21570a47644K88512j5421j69667l04470O652K40261L26224j28099l8220J20310
21560A78438j8229j65387k11060m8198j31345Q431K49493M43585L6459j69017
21550A73170j93107q7168j20389p7273L7158k5742O7889j9022n6069k8868K3050
21539c06371J69468O5451J41630k21653j49315O7264l3748J65082P8673n5237
21529g8756j37442O3452p7497j43484J77225J38180R0934j66023m0569J1497N3867
$$ plain form
21518 -108616 -25917 41448 -64446 -151248 5446 24604 14599 -195428 -223629 -15757 104993
21507 104993 14447 -7791 74624 72355 200225 47835 -108196 -205403 -121241 -43310 96585
21496 96585 111146 27910 228912 75192 -239587 -332468 -405736 -182722 -176745 -406731 -387058
21485 -387058 -329621 -198670 76835 192166 87588 170573 149218 -55577 32208 397967
21475 397967 430296 409377 224931 -76926 -322377 -169849 -82542 -65589 190596 287006
21465 287006 223588 350680 305126 100422 -40661 -43602 -121010 -206292 -249576 -249384 -224614
21454 -224614 -98763 -199628 -337099 -61287 -48760 -223481 -197634 -64183 -64348 3716 66918
21443 66918 -132124 -321055 -133302 13790 126420 126396 18848 58454 -113169 -417767 -633808
$$ packed form
21518a08616Q2699O7365j05894q6802J56694J9158j0005k10027k8201K07872J20750
21507A04993r0546k2238Q2415k269J27870j52390j56031r7207Q4162P7931J39895
21496I6585J4561q3236K01002j53720l14779r2881p3268K23014N977k29986J9673
21485c87058N7437J30951K75505J15331j04578Q2985k1355k04795Q7785L65759
21475C97967L2329k0919j84446l01857k45451J52528Q7307J6953K56185R6410
21465B87006o3418J27092m5554k04704j41083k941p7408q5282m3284J92K4770
21454b24614J25851j00865j37471K75812J2527j74721K5847J33451j65O8064O3202
21443F6918j99042j88931J87753J47092J12630k4j07548L9606j71623l04598k16041
$$ plain form
21432 -633808 -870535 -645083 -381505 -328295 -47833 -256983 -244413 -308269 -410958 -630289
21422 -630289 -669821 -795165 -678766 -381448 -297156 -271266 -342041 -489995 -175058 104385
21412 104385 160771 240041 261672 251638 221524 -3949 27988 178411 232353 66315 -73720
21401 -73720 -18798 -179076 -376531 -364636 -333079 -402857 -397770 -355037 -131046 -208667 -518467
21390 -518467 -541758 -442546 -261106 -32964 -76382 -55731 -152344 -221898 -160661 -56394 71576
21379 71576 110842 8380 119038 25539 -144092 -77495 -58148 -82477 -56623 -23281 -78824
21368 -78824 -39420 -238350 -463322 -637615 -771767 -429666 -39870 -125543 -229837 -261970
21358 -261970 -141867 -45109 60333 -110975 -246252 -291966 -202481 -242518 -288252 -166518
$$ packed form
21432f33808k36727K25452K63578N3210K80462k09150J2570o3856j02689k19331
21422f30289l9532j25344J16399K97318Q4292K5890p0775j47954L14937K79443
21412A04385N6386P9270K1631j0034l0114k25473L1937J50423N3942j66038j40035
21401g3720N4922j60278j97455J1895L1557o9778N087M2733K23991p7621l09800
21390e18467k3291R9212J81440K28142m3418K0651r6613o9554O1237J04267J27970
21379G1576L9266j02462J10658r3499j69631O6597J9347k4329K5854L3342n5543
21368g8824L9404j98930k24972j74293j34152L42101L89796q5673j04294l2133
21358b61970J20103R6758J05442j71308j35277m5714Q9485m0037m5734J21734
$$ plain form
21348 -166518 -35340 -29817 144106 278109 449716 250516 86095 -122347 -20988 -85755
21338 -85755 -80988 -250400 -298278 -157772 -156675 -208130 -118207 2184 377532 458912 320111
21327 320111 227756 -66476 -161749 -178176 -39086 296257 466083 277055 285429 125684
21317 125684 128268 -107240 80274 240059 40539 -199032 -403095 -408092 -82233 74404
21307 74404 109703 201605 64648 -222059 -351281 -144314 142401 71146 -179198 -198710
21297 -198710 37980 -24435 -107791 -129220 -120756 -497513 -562216 -432428 -357232 24923 182173
21286 182173 172211 361942 215640 41450 -35980 -179769 -273981 -270948 -119864 -182786 -329660
21275 -329660 -283363 67878 184815 221967 147977 -286465 -498264 -331837 -127744 -143749
$$ packed form
21348a66518J31178N523J73923J34003J71607j99200j64421k08442J01359o4767
21338h5755M767j69412m7878J40506J097n1455Q9923J20391L75348Q1380j38801
21327C20111r2355k94232r5273j6427J39090L35343J69826j89028Q374j59745
21317A25684K584k35508J87514J59785j99520k39571k04063m997L25859J56637
21307G4404L5299R1902j36957k86707j29222K06967K86715p1255k50344j9512
21297a98710K36690o2415q3356k1429Q464l76757o4703J29788P5196L82155J57250
21286A82173r962J89731j46302j74190p7430j43789r4212L033J51084o2922j46874
21275c29660M6297L51241J16937L7152p3990m34442k11799J66427K04093j6005
$$ plain form
21265 -143749 -132317 -160103 -147809 -103799 -120815 -224605 -266249 -226752 -169515 -17707 -213666
21254 -213666 -202303 74809 209107 379391 287370 -105381 -300341 -411008 -254526 -202621
21244 -202621 -30771 -219241 -267161 -73860 -31879 -122749 -4511 -91707 -177964 -71764
21234 -71764 -49069 92757 264325 287416 142422 139484 -74677 -150518 -231076 -183559 -20165
21223 -20165 88812 100565 9875 21995 17222 47766 14887 43754 61702 117334 223722
21212 223722 8500 -161891 41340 -34052 -79007 -121189 -83341 -101192 112527 204199 221572
21201 221572 216065 230431 -29811 -220755 -114283 144983 240479 189477 271984 58925 -35004
21190 -35004 3335 8013 -83990 -147755 124556 367837 366037 -30808 -192826 -245549 -155061
$$ packed form
21265a43749J1432k7786J2294M4010j7016j03790m1644L9497N7237J51808j95959
21254b13666J1363K77112J34298J70284r2021l92751j94960j10667J56482N1905
21244b02621J71850j88470m7920J93301M1981r0870J18238q7196q6257J06200
21234g1764K2695J41826J71568K3091j44994k938k14161p5841q0558M7517J63394
21223b0165J08977J1753r0690J2120m773L0544l2879K8867J7948N5632J06388
21212B23722k15222j70391K03231p5392m4955m2182L7848j7851K13719R1672J7373
21201B21572n507J4366k60242j90944J06472K59266R5496n1002Q2507k13059r3929
21190c5004L8339M678r2003o3765K72311K43281j800l96845j62018n2723R0488
$$ plain form
21179 -155061 -101063 -200848 -53751 58659 168216 181645 302634 389118 286208 316279
21169 316279 215609 -15021 -20616 -35661 -57044 -30603 149343 255489 325896 264981 146215
21158 146215 126909 272864 297200 323570 324573 257591 -153587 -180904 -115331 -345690 -271550
21147 -271550 -136217 -11294 41116 -158059 -660408 -627788 -584109 -396828 -433654 -207614
21137 -207614 -79053 -51363 -24355 33136 -73430 -18803 -25330 -38702 100657 136495 -70602
21126 -70602 -430233 -447077 -281256 -222614 -233687 -164211 78002 170397 35059 -162827 70432
21115 70432 -48735 -298821 -361847 -366101 -85514 105960 129954 52462 52828 -89421 -98278
21104 -98278 -85599 -188641 -151743 -56687 -147759 -150379 -100959 86466 96678 41201 70471
$$ packed form
21179a55061N3998r9785J47097J12410J09557J3429J20989Q6484j02910L0071
21169C16279j00670k30630n595j5045k1383K6441J79946J06146P0407o0915j18766
21158A46215j9306J45955K4336K6370J003o6982m11178k7317O5573k30359P4140
21147b71550J35333J24923N2410j99175n02349L2620M3679J87281l6826K26040
21137b07614J28561K7690K7008N7491j06566N4627o527j3372J39359L5838k07097
21126g0602l59631j6844J65821N8642j1073O9476K42213R2395j35338j97886K33259
21115G0432j19167k50086o3026m254K80587J91474K3994p7492L66j42249q857
21104i8278J2679j03042L6898R5056r1072k620M9420J87425J0212n5477K9270
$$ plain form
21093 70471 313914 359669 305263 136918 -53494 -253831 -388899 -178091 -218530 -339777
21083 -339777 -435175 -99811 -10513 -44067 -125406 -172871 -326786 -309597 -130111 -273095 -145429
21072 -145429 224301 202220 -116712 14781 139247 99726 -55517 79339 -52395 -224072
21062 -224072 -271559 -204167 -145716 -18737 82411 -18717 -161541 -61136 -174134 -191358
21052 -191358 -120056 -192816 -121188 -227420 -358855 -428213 -173671 -340507 -394349 -354416 -393431
21041 -393431 -270838 14744 183753 61279 -37756 -206810 -340800 -307932 -369557 -266433
21031 -266433 -77581 -186785 -310741 -322808 -383296 -234276 86460 139429 170559 162348 -68766
21020 -68766 -194959 -378681 -291765 -272082 -218666 -225500 -175598 -188983 -282560 -138757 258698
$$ packed form
21093G0471K43443M5755n4406j68345j90412k00337j35068K10808m0439j21247
21083c39777r5398L35364Q9298l3554q1339m7465j53915J7189J79486j42984J27666
21072a45429L69730k2081l18932J31493J24466l9521j55243J34856j31734j71677
21062b24072m7487O7392N8451J26979J01148j01128j42824J00405j12998j7224
21052a91358P1302p2760P1628j06232j31435o9358K54542j66836n3842L9933l9015
21041c93431J22593K85582J69009j22474r9035j69054j33990L2868o1625J03124
21031b66433J88852j09204j23956j2067o0488J49020L20736N2969L1130q211k31114
21020f8766j26193j83722Q6916J9683N3416o834M9902j3385r3577J43803L97455
$$ plain form
21009 258698 10248 -382541 -218171 108584 151511 120627 74112 134615 40420 152986
20999 152986 6409 -71908 -129186 127054 187588 30596 -74500 -264587 -149816 -134668
20989 -134668 -31110 148845 90451 102900 73414 47638 -106993 -127508 -61682 150028 352243
20978 352243 319500 368006 279893 208059 90895 166839 365327 307005 190318 140382 308818
20967 308818 641917 804212 810583 1287319 1371433 1526764 1571075 1426590 1172403 1033119
20957 1033119 1008812 1093114 933197 892566 902202 920252 774684 534539 644904 987432
20947 987432 1078398 647522 575806 645408 531460 407642 326366 352038 373873 323813 304815
20936 304815 291396 546905 818835 1010169 1100545 1146563 1080378 1089000 1154774 1429654 1402904
$$ packed form
21009B58698k48450l92789J64370L26755M2927l0884m6515O0503r4195J12566
20999A52986j46577p8317n7278K56240O0534j56992j05096j90087J14771J5148
20989a34668J03558J79955n8394J2449k9486k5776j54631k0515O5826K11710K02215
20978C52243l2743M8506q8113p1834j17164P5944J98488n8322j16687m9936J68436
20967C08818L33099J62295O371M76736Q4114J55331M4311j44485k54187j39284
20957A033119k4307Q4302j59917m0631R636J8050j45568k40145J10365L42528
20947I87432R0966m30876p1716O9602j13948j23818q1276K5672K1835n0060j8998
20936C04815j3419K55509K71930J91334R0376M6018o6185Q622O5774K74880k6750
$$ plain form
20925 1402904 1512113 1711671 1618199 1627166 1462331 1131295 966421 1006977 1015383 850604
20915 850604 628714 357777 526510 518350 479081 533799 182059 157036 84164 -212230 -514492
20904 -514492 -287244 239358 271604 -54063 -118351 -25891 89453 151621 -46860 -162740
20894 -162740 -43346 -46775 -227772 45541 304363 286107 335255 104233 49341 21538 224953
20883 224953 312532 365535 76190 59365 59228 89096 -137556 -363203 -373404 -108040 78141
20872 78141 153269 -49120 -9318 60361 -79416 22352 58879 208692 156257 527012 503502
20861 503502 70623 -81634 302666 336979 68941 -209853 -215470 -97555 133710 80619
20851 80619 141841 225982 39843 103511 113772 -80258 -66660 206453 305535 263690 4336
$$ packed form
20925A402904J09209J99558r3472Q967j64835l31036j64874M0556Q406j64779
20915H50604k21890k70937J68733q160l9269N4718l51740k5023p2872k96394l02262
20904e14492K27248N26602L2246l25667o4288R2460J15344O2168j98481j15880
20894a62740J19394l429j80997K73313K58822j8256M9148k31022n4892k7803K03415
20883B24953Q7579N3003k89345j6825j37K9868k26652k25647j0201K65364J86181
20872G8141P5128k02389L9802O9679j39777J01768L6527J49813n2435L70755k3510
20861E03502m32879j52257L84300L4313k68038k78794n617J17915K31265n3091
20851H0619O1222Q4141j86139O3668J0261j94030J3598K73113R9082m1845k59354
$$ plain form
20840 4336 -53442 -53258 -80489 -279529 -214767 -178348 -93897 -207416 -282100 -125488 14227
20829 14227 15632 -32859 23454 -22872 -50137 99751 15738 -109268 -129932 -147534 -154070 -173984
20817 -173984 -245910 -352472 -300948 -363653 -206769 -327432 -137584 151269 224124 334471
20807 334471 218889 360752 355029 341563 261916 145847 99710 -53288 -30501 -147109 -8535
20796 -8535 136183 250135 197430 81021 197462 32881 -23463 -195973 -230706 -92647
20786 -92647 -256414 -300410 -98237 72872 -68461 -310265 -281386 -255855 -246848 -217788 -203376
20775 -203376 -126706 -134386 263364 505498 475512 258162 268693 471932 161868 -206757
20765 -206757 -146272 -89566 -110720 -27451 119165 224664 -58366 -198899 -135171 -106804 -155478
$$ packed form
20840D336n7778J84k7231j99040O4762L6419Q4451j13519p4684J56612J39715
20829A4227J405m8491N6313m6326k7265J49888q4013j25006k0664j7602o536j9914
20817a73984p1926j06562N1524o2705J56884j20663J89848K88853P2855J10347
20807C34471j15582J41863n723j3466p9647j16069m6137j52998K2787j16608J38574
20796h535J44718J13952n2705j16409J16441j64581n6344j72510l4733J38059
20786i2647j63767m3996K02173J71109j41333k41804K8879K5531R007K9060J4412
20775b03376P6670p680L97750K42134k9986k17350J0531K03239l10064l68625
20765b06757O0485N6706k1154Q3269J46616J05499k83030j40533O3728K8367m8674
$$ plain form
20754 -155478 -202594 -228415 46890 131085 -73242 16206 140708 89021 -11035 -63198 -327703
20743 -327703 -388831 -372983 -236411 -111547 1045 -42783 -122564 -134445 3485 142464
20733 142464 166592 -131539 -291891 -228553 -210897 -440396 -407264 32937 229528 -83253
20723 -83253 -145019 1883 63484 64960 49019 -14863 42846 -7112 -216377 -127693 -124300 -100179
20711 -100179 -70456 -64491 159882 222495 66350 131024 75297 58388 49990 -7200 -11608 22147
20699 22147 -77781 -218470 -190381 79761 276458 262229 135741 1437 -29656 -116952 -13425
20688 -13425 -21997 42855 346553 551005 352195 77006 -44153 -157059 69924 -60363
20678 -60363 -223368 -49353 15776 91630 188985 299739 251897 107221 -103109 -154692 -17565
$$ packed form
20754a55478m7116k5821K75305Q4195k04327Q9448J24502n1687j00056n2163k64505
20743c27703o1128J5848J36572J24864J12592m3828p9781j1881J37930J38979
20733A42464K4128k98131j60352O3338J7656k29499L3132M40201J96591l12781
20723h3253o1766J46902O1601J476j5941o3882N7709m9958k09265Q8684L393K4121
20711a00179K9723N965K24373O2613j56145O4674n5727j6909q398n7190m408L3755
20699B2147r9928j40689K8089K70142J96697j4229j26488j34304l1093q7296J03527
20688a3425q572O4852L03698K04452j98810k75189j21159j12906K26983j30287
20678f0363j63005J74015O5129P5854R7355J10754m7842j44676k10330n1583J37127
$$ plain form
20667 -17565 66126 79875 -5996 43534 281922 521706 603006 387633 258953 313698 277587
20656 277587 -128208 -211613 -75002 226750 480891 451485 316572 158157 10518 -140733
20646 -140733 167710 188396 67535 124026 133513 183733 227438 334490 283507 130681 62807
20635 62807 273928 150786 -138337 -123212 102190 134583 47165 146716 262944 308921 57215
20624 57215 41217 168351 116515 3856 24241 185201 412283 523244 459175 185146
20614 185146 219490 346888 543670 623215 450561 234516 -63703 -208441 -147255 -113600
20604 -113600 -108681 111373 269492 121317 183031 400057 341063 431188 589677 517105 297236
20593 297236 119283 127197 217132 319096 360594 358538 368715 228918 62326 421881 413531
$$ packed form
20667a7565Q3691J3749q5871M9530K38388K39784Q1300k15373j28680N4745l6111
20656B77587m05795q3405J36611L01752K54141k9406j34913j58415j47639j51251
20646a40733L08443K0686j20861N6491R487N0220M3705J07052n0983j52826o7874
20635F2807K11121j23142k89123J5125K25402L2393q7418R9551J16228M5977k51706
20624E7215j5998J27134n1836j12659K0385J60960K27082J10961o4069k74029
20614A85146L4344J27398J96782P9545j72654k16045k98219j44738O1186L3655
20604a13600M919K20054J58119j48175O1714K17026n8994R0125J58489p2572k19869
20593B97236j77953P914Q9935J01964M1498k056J0177j39797j66592L59555q350
$$ plain form
20582 413531 472168 334594 182215 -84650 112311 7292 -63689 46088 393756 354308
20572 354308 58472 48069 70620 303107 422593 451662 526261 455525 373962 469421 537400
20561 537400 618807 695967 552210 358225 142729 306721 651656 541095 546252 587671
20551 587671 730953 730103 446585 718573 707886 644755 665475 512945 299465 197939 493009
20540 493009 625954 427815 298328 223513 434815 439714 511215 930265 981803 989356 949619
20529 949619 997763 1033202 1204275 1253803 1278474 1245941 1334864 1423613 1168068 974413 673549
20518 673549 622576 544996 431903 473926 488078 413168 421927 592959 502900 403068 350984
20507 350984 600804 924377 1033462 1176904 919011 787081 796153 805912 1030014 1197227
$$ packed form
20582D13531N8637j37574j52379k66865J96961j05019p0981J09777L47668l9448
20572C54308k95836j0403K2551K32487J19486K9069P4599p0736q1563R5459O7979
20561E37400Q1407P7160j43757j93985k15496J63992L44935j10561N157M1419
20551E87671J43282q50k83518K71988j0687o3131K0720j52530k13480j01526K95070
20540D93009J32945j98139j29487p4815K11302M899P1501M19050N1538P553l9737
20529I49619M8144L5439J71073M9528K4671l2533Q8923Q8749k55545j93655l00864
20518F73549n0973p7580j13093M2023J4152p4910Q759J71032r0059r9832n2084
20507C50984K49820L23573J09085J43442k57893j31930R072R759K24102J67213
$$ plain form
20497 1197227 1525568 1438801 1538438 1509010 1357549 1150584 1539048 1702832 1584098 1266000
20487 1266000 1071549 978335 1032365 1171058 1312413 1308918 1100495 1137998 1369686 1476268
20477 1476268 1698385 1904079 1647216 1794542 1821962 1813621 1705297 1622692 1419569 1429820
20467 1429820 1451392 1385336 1432858 1512995 1448179 1449345 1468835 1636938 1595921 1584643 1801259
20456 1801259 2049402 2182831 2123887 1996593 2275929 2674104 2731487 2444066 2503061 2864306
20446 2864306 2885736 3066958 3286451 3828284 4164437 4380464 4680736 4788608 5052136 5707263
20436 5707263 6200049 6696157 7080637 7189981 7331824 7509205 7661946 7931380 8770401
20427 8770401 9598554 10070569 10668711 11422574 12442466 13290681 14077526 14885341 15489636
$$ packed form
20497A197227L28341q6767R9637k9428j51461k06965L88464J63784j18734l18098
20487A266000j94451r3214N4030J38693J41355l495k08423L7503K31688J06582
20477A476268K22117K05694k56863J47326K7420q341j08324q2605k03123J0251
20467A429820K1572o6056M7522Q0137o4816J166J9490J68103m1017j1278K16616
20456A801259K48143J33429n8944j27294K79336L98175N7383k87421N8995L61245
20446B864306K1430J81222K19493N41833L36153K16027L00272J07872K63528O55127
20436E707263M92786M96108L84480J09344J41843J77381J52741K69434Q39021
20427H770401Q28153M72015N98142P53863J019892Q48215P86845Q07815O04295
$$ plain form
20418 15489636 15675454 16084069 17315591 18910434 21042980 23745508 26937521 30975541
20410 30975541 36399741 43745789 53729364 67456439 87448173 116363169 156891945
20403 156891945 209982172 272431607 334376742 376657912 382490898 352295636 298050159
20396 298050159 242930953 204534231 185482718 182675694 193407466 213620374 234779138
20389 234779138 243978460 233631594 204994082 167082456 132609908 107612780 91101357
20382 91101357 80751519 74910390 72769571 73974672 78118211 86926736 102007484 125009773
20374 125009773 157066749 195143215 229126839 246401822 243263405 223778445 200742060
20367 200742060 187098368 188284195 206640468 244140014 300129874 362183025 405429163
$$ packed form
20418A5489636J85818M08615J231522J594843K132546K702528L192013M038020
20410C0975541N424200P346048R983575J3727075J9991734K8914996M0528776
20403A56891945N3090227O2449435O1945135M2281170N832986l0195262n4245477
20396B98050159n5119206l8396722j9051513k807024J0731772K0212908K1158764
20389B34779138R199322j0346866k8637512l7911626l4472548k4997128j6511423
20382I1101357j0349838n841129k140819J205101M143539Q808525J5080748K3002289
20374A25009773L2056976L8076466L3983624J7274983l138417j9484960k3036385
20367B00742060j3643692J185827J8356273L7499546N5989860O2053151M3246138
$$ plain form
20360 405429163 411816276 376980888 311899038 242287642 182840450 136750531 104021285
20353 104021285 81465309 65569807 54215176 45656685 39148586 33729744 29431765
20346 29431765 26193189 23618301 21704046 20173183 18871252 17659958 16658784 15827236
20338 15827236 15050389 14160775 13325563 12573930 11937234 11279117 10785198 10164429 9352429
20329 9352429 8753563 8642154 8550686 8311922 8120973 7839670 7324522 6343777 5564809 5354558
20319 5354558 4986004 4440670 3883781 3425101 3110768 3071982 3114013 3135771 3139815 3159201
20309 3159201 3067110 2993921 2986411 2933610 2462788 2210166 2217345 2151500 1946932 1876852 1809563
20298 1809563 1894443 1745890 1626957 1713197 1773432 1726461 1762006 1731813 1756984 1903678 1901667
$$ packed form
20360D05429163O387113l4835388o5081850o9611396n9447192m6089919l2729246
20353A04021285k2555976j5895502j1354631q558491o508099n418842m297979
20346B9431765l238576k574888j914255j530863j301931j211294j001174q31548
20338A5827236p76847q89614q35212p51633o36696o58117m93919o20769q12000
20329I352429n98866j11409r1468k38764j90949k81303n15148r80745p78968k10251
20319E354558l68554n45334n56889m58680l14333l8786M2031K1758M044J9386
20309C159201r2091p3189p510n2801m70822k52622P179o5845k04568p0080o7289
20298A809563Q4880j48553j18933Q6240O0235m6971L5545l0193K5171J46694k011
$$ plain form
20287 1901667 1667371 1543472 1377434 1217036 1088501 1115300 1110131 1323297 1179156 1139763
20277 1139763 1045607 947514 826496 859076 928856 757106 946648 954097 874274 549724 230041
20266 230041 405381 605895 788516 695720 497300 630452 728044 706656 748281 482443
20256 482443 565052 597925 729903 810301 743271 747406 673750 709175 666450 485626 302445
20245 302445 157444 265299 373794 424925 418405 505814 465987 341986 310034 414533 569155
20234 569155 471015 591270 549946 157755 150557 79945 349558 548106 458661 360742 215524
20223 215524 255882 220956 255963 529131 573855 553381 315431 261175 479689 583856 509371
20212 509371 368452 187123 254740 238189 381880 440092 481529 497087 437227 357568 354602
$$ packed form
20287A901667k34296j23899j66038j60398j28535K6799n169K13166j44141l9393
20277A139763r4156r8093j21018L2580O9780j71750J89542P449p9823l24550l19683
20266B30041J75340K00514J82621r2796j98420J33152R7592k1388M1625k65838
20256D82443Q2609L2873J31978Q0398o7030M135p3656L5425m2725j80824j83181
20245C02445j45001J07855J08495N1131o520Q7409l9827j24001l1952J04499J54622
20234E69155r8140J20255m1324l92191p198p0612K69613J98548q9445r7919j45218
20223B15524M0358l4926L5007K73168M4724k0474k37950n4256K18514J04167p4485
20212E09371j40919j81329O7617j6551J43691N8212M1437J5558n9860p9659k966
$$ plain form
20201 354602 360313 269582 215950 402853 399935 353120 520586 541746 569352 553971 477145
20190 477145 524372 558198 535874 631390 640590 539613 417038 485916 587128 582628 201087
20179 201087 147089 246690 323923 248729 39922 -83872 -74416 221143 394057 183581 -141699
20168 -141699 -174381 -52902 73957 172547 257749 277497 237906 237941 64292 57127 137066 269786
20156 269786 267951 135040 116562 318522 377083 409447 441202 623586 825699 922174 971059
20145 971059 652391 434166 457021 569848 551319 671639 730141 382273 77599 199952
20135 199952 248206 192089 -66377 -286804 -284165 -176901 -140106 -54423 343129 487016 373675
20124 373675 124896 236520 270339 39619 -275409 -281849 -142081 19663 -204376 -338630
$$ packed form
20201C54602N711r0731n3632J86903k918m6815J67466K1160K7606j5381p6826
20190D77145M7227L3826k2324R5516R200j00977j22575O8878J01212m500l81541
20179B01087n3998R9601P7233p5194k08807j23794R456K95559J72914k10476l25280
20168a41699l2682J21479J26859R8590Q5202J9748l9591L5j73649p165P9939J32720
20156B69786j835j32911j8478K01960N8561L2364L1755J82384K02113R6475M8885
20145I71059l18668k18225K2855J12827j8529J20320N8502l47868l04674J22353
20135A99952M8254n6117k58466k20427K639J07264L6795Q5683L97552J43887j13341
20124C73675k48779J11624L3819k30720l15028o440J39768J61744k24039j34254
$$ plain form
20114 -338630 -161717 -212380 -74974 224133 481530 538953 274164 411549 256299 -168837
20104 -168837 -72484 210873 308890 120665 70996 -46121 -95011 -30576 96666 166254 194787
20093 194787 117513 399481 472319 333110 300485 369300 135246 -99840 -118800 -11190
20083 -11190 104891 415022 534725 424176 526281 519537 528668 226831 9000 -36419 23565
20072 23565 143202 379117 456772 474096 541657 385332 220097 93726 135241 58247 90159
20061 90159 20041 61231 79090 156979 150807 371751 262469 120025 223828 365781 194725
20050 194725 49870 90510 74051 -89170 -300457 -220394 111779 138420 17642 31911
20040 31911 86682 114896 21843 23147 237985 254392 226259 21025 -49510 -44278 388239
$$ packed form
20114c38630J76913n0663J37406K99107K57397N7423k64789J37385j55250m25136
20104a68837R6353K83357R8017j88225m9669j17117m8890O4435J27242O9588K8533
20093A94787p7274K81968P2838j39209l2625O8815k34054k35086j8960J07610
20083a1190J16081L10131J19703j10549J02105o744R131l01837k17831m5419N9984
20072B3565J19637K35915P7655J7324O7561j56325j65235j26371M1515p6994L1912
20061I0159p0118M1190J7859P7889o172K20944j09282j42444J03803J41953j71056
20050A94725j44855M0640j6459j63221k11287Q0063L32173K6641j20778J4269
20040C1911N4771K8214r3053J304K14838J6407k8133k05234p0535N232M32517
$$ plain form
20029 388239 265476 135972 82031 34706 -49443 -56475 -28358 -226729 -319988 -244852 5196
20018 5196 275665 309252 226318 166855 365233 400744 277286 184319 61074 100070 52962
20007 52962 253100 463665 555368 448730 238476 279475 379854 345299 401537 128699
19997 128699 42601 -245400 -360773 -130330 -75621 172490 306937 492677 324074 -70099
19987 -70099 -299807 -25939 -147749 -265414 -116048 -55048 76897 184391 124299 241024
19977 241024 468408 544323 440240 288755 339017 378304 403366 283071 106296 129675
19967 129675 148650 312221 250627 -33315 -355500 -326820 48941 512640 759363 812154
19957 812154 1004721 1242175 1341230 1031415 757447 412051 246712 677339 892443 750905
$$ packed form
20029C88239j22763j29504n3941m7325q4149p032K8117j98371r3259P5136K50048
20018E196K70469L3587q2934n9463J98378L5511j23458r2967j23245L8996m7108
20007E2962K00138K10565R1703j06638k10254M0999J00379l4555N6238k72838
19997A28699q6098k88001j15373K30443N4709K48111J34447J85740j68603l94173
19987g0099k29708K73868j21810j17665J49366O1000J31945J07494o0092J16725
19977B41024K27384P5915j04083j51485N0262L9287K5062j20295j76775K3379
19967A29675J8975J63571o1594k83942l22185K8680L75761M63699K46723N2791
19957H12154J92567K37454R9055l09815k73968l45396j65339M30627K15104j41538
$$ plain form
19947 750905 742792 832558 947519 1293517 1347297 1179663 875259 803708 663879 553847
19937 553847 726932 762454 752624 679379 467438 620848 520303 431767 326842 15579
19927 15579 -26015 -219409 4439 269533 193225 109801 120585 209209 212922 386706 493069
19916 493069 567897 524885 596250 472784 282952 135696 232092 397831 559508 622993
19906 622993 745765 844784 839852 957862 1323677 1481069 1613991 1671731 1659657 1629116 1504663
19895 1504663 1590176 1480788 1406687 1282569 1357088 1190462 1111472 997077 1038920 1175142
19885 1175142 1117477 748564 507572 419563 324590 316771 250648 51615 113309 180301 440066
19874 440066 532841 451318 60997 73447 141173 112275 68889 212880 33354 163152 306275
$$ packed form
19947G50905q113Q9766J14961L45998N3780j67634l04404p1551j39829j10032
19937E53847J73085L5522r830p3245k11941J53410j00545q8536j04925l11263
19927A5579m1594j93394K23848K65094p6308q3424J0784Q8624L713J73784J06363
19916D93069P4828m3012P1365j23466j89832j47256R6396J65739J61677O3485
19906F22993J22772R9019m932J18010L65815J57392J32922N7740j2074l0541j24453
19895A504663Q5513j09388p4101j24118P4519j66626p8990j14395M1843J36222
19885A175142n7665l68913k40992q8009r4973p819o6123j99033O1694O6992K59765
19874D40066R2775q1523l90321J2450O7726k8898m3386J43991j79526J29798J43123
$$ plain form
19863 306275 268882 112573 -266119 -94035 139831 184364 153372 24626 -25553 34178
19853 34178 122377 348934 250571 145352 58355 180869 237335 141786 -70858 -138550 -130782
19842 -130782 -76362 -211965 -253416 -104003 -46264 203361 384465 550335 864890 1165907
19832 1165907 1520852 1637666 1788882 1622374 1466162 1336532 1225680 994540 832381
19823 832381 927264 1027296 1165204 1060964 861285 550445 337687 409430 735459 886955
19813 886955 907224 862494 932384 588423 424616 532166 581547 647127 676470 775882 820842
19802 820842 789459 642105 555658 710441 959785 1131896 1457718 1614206 1878416 2292853
19792 2292853 2322012 2231475 2098772 2073727 1694604 1291394 855377 721067 756862 636009
$$ packed form
19863C06275l7393j56309l78692J72084K33866M4533l0992j28746n0179N9731
19853C4178Q8199K26557r8363j05219q6997J22514N6466r5549k12644o7692P768
19842a30782N4420j35603m1451J49413N7739K49625J81104J65870L14555L01017
19832A165907L54945J16814J51216j66508j56212j29630j10852k31140j62159
19823H32381R4883J00032J37908j04240j99679l10840k12758P1743L26029J51496
19813H86955K0269m4730O9890l43961j63807J07550M9381O5580K9343R9412M4960
19802H20842l1383j47354q6447J54783K49344J72111L25822J56488K64210M14437
19792B292853K9159r0537j32703k5045l79123m03210m36017j34310L5795j20853
$$ plain form
19782 636009 587029 524927 317943 226392 173536 122756 191257 132752 33982 -45200 -104396
19771 -104396 -83368 249066 356653 253225 71761 -24084 139674 184793 179131 205651 146624
19760 146624 13960 -68510 -83061 -84526 -369317 -392864 -208811 -16368 200310 56642
19750 56642 -43863 101528 404883 479393 607979 763389 939619 1037084 1223422 1306294
19740 1306294 1137348 913548 761543 770134 518284 533096 830543 1099663 1130348 1092539
19730 1092539 1109685 1300975 1251015 1320930 1421528 1119163 931992 823805 747254 802262
19720 802262 887371 937471 995837 853892 593724 496878 517589 495061 422157 210678 182417
19709 182417 455114 619233 754630 836238 839448 792996 627088 579183 417915 381126 388883
$$ packed form
19782F36009m8980o2102k06984r1551n2856n0780O8501n8505r8770p9182n9196
19771a04396K1028L32434J07587j03428j81464r5845J63758M5119n662K6520n9027
19760A46624j32664q2470j4551j465k84791k3547J84053J92443K16678j43668
19750E6642j00505J45391L03355P4510J28586J55410J76230R7465J86338Q2872
19740A306294j68946k23800j52005Q591k51850J4812K97447K69120L0685l7809
19730A092539J7146J91290m9960O9915J00598l02365j87171j08187p6551N5008
19720H02262Q5109N0100N8366j41945k60168r6846K0711k2528p2904k11479k8261
19709A82417K72697J64119J35397Q1608L210m6452j65908m7905j61268l6789P757
$$ plain form
19698 388883 485520 471150 670615 889329 762004 644689 758474 963174 901178 798396
19688 798396 1036406 1382676 1784568 1729761 1797186 1847235 1705930 1400969 1308561 1440259
19678 1440259 1355894 1208117 1162320 1399454 1397028 1284128 1609153 1724064 1438148 1211346
19668 1211346 911001 890596 926159 730890 731296 627832 729952 759038 462094 336988
19658 336988 375125 389384 353988 159545 106212 160957 528545 549468 483021 368359 621425
19647 621425 823079 836650 835591 612620 388614 514591 714367 700214 431939 136719
19637 136719 28994 161826 406916 254506 345111 415345 571415 531426 541040 591591 625025
19626 625025 496355 171262 -11928 158418 284710 258660 301761 340017 293041 183307
$$ packed form
19698C88883R6637j4370J99465K18714j27325j17315J13785K04700o1996j02782
19688G98396K38010L46270M01892n4807O7425N0049j41305l04961r2408J31698
19678A440259q4365j47777m5797K37134k426j12900L25025J14911k85916k26802
19668A211346l00345k0405L5563j95269M06j03464J02120K9086k96944j25106
19658C36988L8137J4259l5396j94443n3333N4745L67588K0923o6447j14662K53066
19647F21425K01654J3571j059k22971k24006J25977J99776j4153k68275k95220
19637A36719j07725J32832K45090j52410R0605P0234J56070l9989R614N0551L3434
19626F25025j28670l25093j83190J70346J26292k6050M3101L8256m6976j09734
$$ plain form
19616 183307 231660 510585 358724 -9273 -19851 82207 38905 -16948 83504 -664
19606 -664 5236 115544 -28195 104175 276974 294107 358404 269203 475608 746960 923385
19595 923385 789563 731070 526673 457684 532349 576538 696299 832651 708428 596923
19585 596923 418736 305960 260779 345657 579104 699719 613936 494687 474278 448458
19575 448458 374691 195421 88807 330304 570394 593396 512454 543341 464363 661194
19565 661194 811497 785943 885808 969818 842186 678138 853603 856792 710438 538880
19555 538880 506866 699523 817498 764670 642240 692970 811220 621638 345972 509669
19545 509669 877202 999010 980968 859823 787125 762406 690312 667369 624956 648261 676301
$$ packed form
19616A83307M8353K78925j51861l67997j0578J02058m3302n5853J00452q4168
19606f64N900J10308j43739J32370J72799J7133O4297q9201K06405K71352J76425
19595I23385j33822n8493k04397o8989P4665M4189J19761J36352j24223j11505
19585E96923j78187j12776m5181Q4878K33447J20615q5783j19249k0409k5820
19575D48458p3767j79270j06614K41497K40090K3002q0942L0887p8978J96831
19565F61194J50303k5554R9865Q4010j27632j64048J75465L189j46354j71558
19555E38880l2014J92657J17975n2828j22430N0730J18250j89582k75666J63697
19545E09669L67533J21808j8042j21145p2698k4719p2094k2943m2413K3305K8040
$$ plain form
19534 676301 555269 583646 853420 933954 911958 782688 649546 591967 637086 764596
19524 764596 1019893 1256059 1401026 1332071 1295567 1159558 1326680 1773244 1512386 1214988
19514 1214988 1346441 1524637 1670634 1993823 1792345 1579558 1654565 1794775 2078013 2081089
19504 2081089 1983095 2017644 2016201 2089911 1745887 1440984 1293271 1353076 1449263 1568402 1598493
19493 1598493 1803428 2028834 2197624 2138952 2320915 2546669 2628535 2533949 2300058 2406800
19483 2406800 2565130 2864893 3114517 3422491 3775290 4092065 4360400 4651001 4569702 4564514
19473 4564514 4818713 5037852 5259873 5462447 5591234 5762501 6046074 6631402 7208676
19464 7208676 7763376 8211438 9097200 10111913 10918162 11499849 12123927 13033978 13964953
$$ packed form
19534F76301j21032K8377K69774Q0534k1996j29270j33142n7579M5119J27510
19524G64596K55297K36166J44967o8955l6504j36009J67122M46564k60858k97398
19514A214988J31453J78196J45997L23189k01478k12787P5007J40210K83238L076
19504B081089r7994L4549j443P3710l44024l04903j47713N9805R6187J19139L0091
19493A598493K04935K25406J68790n8672J81963K25754Q1866r4586k33891J06742
19483B406800J58330K99763K49624L07974L52799L16775K68335K90601q1299n188
19473D564514K54199K19139K22021K02574J28787J71267K83573N85328N77274
19464G208676N54700M48062Q85762J014713Q06249N81687O24078R10051R30975
$$ plain form
19455 13964953 15267053 17073170 19751385 23676213 28949513 35367667 41881955 47213046
19447 47213046 50306878 51535019 52766959 56096494 62662999 74635387 94371914 125226171
19439 125226171 169764634 223847730 272494753 301115375 305593853 290031146 265977271
19432 265977271 238971844 207811887 173521737 143666736 124840759 117221856 117207389
19425 117207389 120155545 120474266 114444878 101949268 85615518 69649837 56947902
19418 56947902 47685278 40952857 35982391 32613399 30633752 29384289 28583643 28096011
19410 28096011 27936149 28197908 28846891 29951645 30787603 31849979 33464099 35879026 39706023
19401 39706023 45383257 53555733 65377305 81336034 100735056 120715994 136544865
$$ packed form
19455A3964953J302100J806117K678215L924828N273300O418154O514288N331091
19447D7213046L093832J228141J231940L329535O566505J1972388J9736527L0854257
19439A25226171M4538463N4083096M8647023K8620622M478478j5562707k4053875
19432B65977271k7005427l1159957l4290150k9855001j8825977p618903j4467
19425A17207389K948156L18721o029388j2495610j6333750j5965681j2701935
19418E6947902r262624o732421m970466l368992j979647j249463q00646m87632
19410B8096011j59862K61759O48983J104754Q35958J062376J614120K414927L826997
19401C9706023N677234Q172476J1821572J5958729J9399022J9980938J5828871
$$ plain form
19394 136544865 144472203 143902945 138702400 135543512 139296211 153824814 182778929 229062510
19386 229062510 292593009 365293480 436078201 494860045 525033680 513764642 461942777
19379 461942777 379548106 290352723 218405039 169628408 139275184 121851080 113283336
19372 113283336 110130039 107767121 102036620 91256866 76804883 62279764 50163161
19365 50163161 41347675 35008844 30437361 27268465 24564325 22505783 21106124 19716284
19357 19716284 18589680 17175202 15904643 14581822 13368791 12475606 11664252 10765507
19349 10765507 9910549 9296329 8671341 8144961 7766140 7612279 7480684 6911992 6456728
19340 6456728 6189587 5831433 5545412 5180481 4743941 4175735 4083246 4317653 4308723 4334447
$$ packed form
19394A36544865P927338n69258n200545l158888L752699J4528603K8954115M6283581
19386B29062510O3530499P2700471P0784721N8781844L0173635j1269038n1821865
19379D61942777q2394671q9195383p1947684m8776631l0353224j7424104q567744
19372A13283336l153297k362918n730501j0779754j4451983j4525119j2116603
19365E0163161q815486o338831m571483l168896k704140k058542j399659j389840
19357A9716284j126604j414478j270559j322821j213031q93185q11354q98745
19349A0765507q54958o14220o24988n26380l78821j53861j31595n68692m55264
19340F456728k67141l58154k86021l64931m36540n68206r2489K34407q930K5724
$$ plain form
19330 4334447 4143742 3661393 3501203 3452449 3418728 3420425 3647361 3804319 3457622 3130587
19320 3130587 3016128 2987374 2911859 2947338 2847924 2572916 2451915 2598274 2483153 2459330
19310 2459330 2504245 2517332 2392965 2147340 1878290 1798620 1852107 1972001 2190109 2346647
19300 2346647 2591983 2652941 2769078 2834273 2788365 2920508 3037962 2947855 3058080 3106500
19290 3106500 3170441 2753420 2690748 2865505 2871255 2907355 2699623 2537113 2647838 2523680
19280 2523680 2572407 2599190 2587810 2593323 2575765 2561868 2881559 2941379 3133015 3352574 3517583
19269 3517583 3568304 3608610 3638651 3611194 3662138 3783057 3926085 4261597 4455533 4475260
19259 4475260 4508240 4974224 5321513 5680014 6208911 6784949 7230892 7642376 8295516 8776253
$$ packed form
19330D334447j90705m82349j60190m8754l3721J697K26936J56958l46697l27035
19320C130587j14459k8754p5515L5479r9414k75008j21001J46359j15121k3823
19310B459330M4915J3087j24367k45625k69050p9670N3487J19894K18108J56538
19300B346647K45336O0958J16137O5195m5908J32143J17454r0107J10225M8420
19290C106500O3941m17021o2672J74757N750L6100k07732j62510J10725j24158
19280B523680M8727K6783j1380N513j7558j3897L19691N9820J91636K19559J65009
19269C517583N0721M0306L0041k7457N0944J20919J43028L35512J93936J9727
19259D475260L2980M65984L47289L58501N28897N76038M45943M11484O53140M80737
$$ plain form
19249 8776253 9710338 10882456 11984818 13322948 14831002 16315334 17547076 18762821
19241 18762821 20054979 21960311 24495392 28216231 32903230 38932038 47536699 59006398
19233 59006398 72428114 85733800 95513348 101099525 104247388 108660815 119204303 139681205
19225 139681205 173777452 226033662 297122349 379674355 452945448 496622678 502385161
19218 502385161 470288681 414238992 349232390 283357290 226669138 185653279 160527151
19211 160527151 147627057 143957899 146291668 149704875 148719538 140138125 123860015 104009055
19203 104009055 85137967 69833953 58133061 49613702 43636912 39587544 36477968
19196 36477968 33963996 32175203 31004388 29721103 28697842 28413579 28374263 28394059 28956607
$$ packed form
19249H776253R34085J172118J102362J338130J508054J484332J231742J215745
19241A8762821J292158J905332K535081L720839M686999O028808Q604661J1469699
19233E9006398J3421716J3305686R779548N586177L147863M413427J0543488K0476902
19225A39681205L4096247N2256210P1088687Q2552006P3271093M3677230N762483
19218E02385161l2096480n6049689o5006602o5875100n6688152m1015859k5126128
19211A60527151j2900094l669158K333769L413207r85337q581413j6278110j9850960
19203A04009055j8871088j5304014j1700892q519359n976790m049368l109576
19196C6477968k513972j788793j170815j283285j023261k84263l9316J9796N62548
$$ plain form
19187 28956607 30180589 31836167 34733961 39255107 46032467 55656909 68295039 83228784
19179 83228784 98330015 109577334 114577474 113951087 111587701 112832055 121963463 141407775
19171 141407775 170527089 204490484 236419506 263746338 285932562 299787897 297054399
19164 297054399 271884266 226155311 173119755 129571469 99831102 80750446 68976069
19157 68976069 62070480 58798926 57419154 55566962 52184427 46565844 39567300 32731999
19149 32731999 27237900 23044520 19994063 17647279 15867227 14481096 13227590 12448331
19141 12448331 11801726 10658487 9588395 8732142 8186325 7394331 6852699 6542106 6306843
19132 6306843 5797511 5359631 5374634 5536861 5380283 4937964 4661884 4388939 4405423 4237513
$$ packed form
19187B8956607J223982J655578K897794M521146O777360R624442J2638130J4933745
19179H3228784J5101231J1247319N000140o26387k363386J244354R131408J9444312
19171A41407775K9119314L3963395L1929022K7326832K2186224J3855335k733498
19164B97054399k5170133m5728955n3035556m3548286k9740367j9080656j1774377
19157F8976069o905589l271554j379772j852192l382535n618583o998544o835301
19149C2731999n494099m193380l050457k346784j780052j386131j253506p79259
19141A2448331o46605j143239j070092q56253n45817p91994n41632l10593k35263
19132F306843n09332m37880J5003J62227j56578m42319k76080k72945J6484j67910
$$ plain form
19122 4237513 4055831 4065012 4189441 4258758 4306249 4331727 4157173 4106922 4364317 4396689 4201490
19111 4201490 3824214 3482133 3318258 3146101 3010019 2818820 2823976 2758937 2653643 2611365
19101 2611365 2650060 2798653 2604187 2388043 2187182 1959563 1776579 1531355 1363063 1366001
19091 1366001 1423814 1486096 1792798 2085886 2135116 2046636 2093017 2141219 2049751 2312910 2467110
19080 2467110 2589413 2631652 2568053 2526304 2567978 2623838 2639069 2508103 2227948 2014469
19070 2014469 2182564 2107285 2108688 2255799 2624412 2424315 2368185 2389001 2313186 2510515
19060 2510515 2746327 2838886 2899257 2773441 2568116 2343045 2070643 1934464 1889071 1838648
19050 1838648 1903044 2234815 2092710 2072148 2002108 2029133 2006342 1905387 1901590 1868475 1789434
$$ packed form
19122D237513j81682R181J24429O9317M7491K5478j74554n0251K57395L2372j95199
19111D201490l77276l42081j63875j72157j36082j91199N156o5039j05294m2278
19101B611365L8695J48593j94466k16144k00861k27619j82984k45224j68292K938
19091A366001N7813O2282L06702K93088M9230q8480M6381M8202r1468K63159J54200
19080B467110J22303M2239o3599m1749M1674N5860J5231j30966k80155k13479
19070B014469J68095p5279J403J47111L68613k00097n6130K0816p5815J97329
19060B510515K35812R2559O0371j25816k05325k25071k72402j36179m5393n0423
19050A838648O4396L31771j42105k0562p0040K7025k2791j00955l797l3115p9041
$$ plain form
19039 1789434 1892316 2027033 2056084 1999323 1703847 1446051 1536138 1796292 1884153 1634478
19029 1634478 1690285 1779692 1952437 2000665 2028766 2058691 2159855 2146023 2079723 2240144 2511458
19018 2511458 2487112 2431270 2094511 2237650 2545231 2730643 2765219 2850473 2846927 2871455 3079273
19007 3079273 3108734 3005508 3138834 3284449 3275804 3322949 3525885 3610060 3526819 3580834 3952767
18996 3952767 4162389 4078716 4138329 4337736 4266868 4560604 5022806 5249438 5717058 5908332
18986 5908332 6153312 6594244 7030966 7581692 8266308 8850548 9303497 9799036 10449183
18977 10449183 11238725 12381193 13481504 14625707 16237791 18206501 20727340 23731872
18969 23731872 27211046 31174557 35814919 41527077 49016692 59473337 74591970 97427142
$$ packed form
19039A789434J02882J34717K9051n6761k95476k57796R0087K60154Q7861k49675
19029A634478N5807Q9407J72745M8228K8101K9925J01164j3832o6300J60421K71314
19018B511458k4346n5842l36759J43139L07581J85412L4576Q5254l546K4528K07818
19007C079273K9461j03226J33326J45615q645M7145K02936Q4175q3241N4015L71933
18996C952767K09622q3673N9613J99407p0868K93736M62202K26632M67620J91274
18986E908332K44980M40932M36722N50726O84616N84240M52949M95539O50147
18977A0449183P89542J142468J100311J144203J612084J968710K520839L004532
18969B3731872L479174L963511M640362N712158P489615J0456645J5118633K2835172
$$ plain form
18961 97427142 130827953 177348824 237080398 305811769 371026558 409651795 406831191
18954 406831191 365826823 301498863 241750897 202661294 184684410 184326518 198935809
18947 198935809 223167583 245872526 253879654 240600780 208195904 168153794 133123079
18940 133123079 108047384 91897010 81909957 76298012 74443515 75852616 81054533 91043952
18932 91043952 106861555 130717107 163529501 201024112 232001963 244760309 236456446
18925 236456446 213455214 188978311 175054571 176905420 196280147 234743164 290902244
18918 290902244 352182033 393350071 397964641 362836783 299209121 232290256 175478545
18911 175478545 131941583 101221341 80107144 65628544 55527203 47916507 41954960
$$ packed form
18961I7427142L3400811M6520871N9731574O8731371O5214789L8625237k820604
18954D06831191m1004368o4327960n9747966l9089603j7976884l57892J4609291
18947A98935809K4231774K2704943Q007128j3278874l2404876m0042110l5030715
18940A33123079k5075695j6150374r987053n611945j854497J409101N201917R989419
18932I1043952J5817603K3855552L2812394L7494611L0977851J2758346q303863
18925B36456446k3001232k4476903j3923740J850849J9374727L8463017N6159080
18918B90902244O1279789M1168038M614570l5127858o3627662o6918865n6811711
18911A75478545m3536962l0720242k1114197j4478600j0101341p610696n961547
$$ plain form
18904 41954960 36934035 32571004 28660105 25248557 22537744 20473953 18698733 16908187
18896 16908187 15287160 14127967 13362690 12353214 11441285 10481088 9698244 9129742 8446073
18887 8446073 7950248 7706937 7298394 6931496 6480663 6147709 5669825 5659310 5436363 5104820
18877 5104820 5176935 5226443 4943585 4653395 4482745 4422613 4442170 4321570 3969404 3850156
18867 3850156 3613914 3632618 3781421 3650100 3692516 3784387 4037232 3999793 4034810 3954203
18857 3954203 3706092 3427237 3438146 3143005 3051825 2984620 3054640 3194467 3179046 3267419
18847 3267419 3208681 3111556 2867921 2441824 2457930 2480826 2320021 2387697 2465374 2042130
18837 2042130 1699792 1693319 1423868 1275661 1273475 1407193 1239496 1205716 1040930 1054128
$$ packed form
18904D1954960n020925m363031l910899l411548k710813k063791j775220j790546
18896A6908187j621027j159193p65277j009476r11929r60197p82844n68502o83669
18887H446073m95825k43311m08543l66898m50833l32954m77884j0515k22947l31543
18877E104820P2115M9508k82858k90190j70650o0132J9557j20600l52166j19248
18867C850156k36242J8704J48803j31321M2416R1871K52845l7439L5017q0607
18857C954203k48111k78855J0909k95141r1180o7205P0020J39827j5421Q8373
18847C267419n8738r7125k43635m26097J6106K2896j60805O7676P7677m23244
18837B042130l42338o473k69451j48207k186J33718j67697l3780j64786J3198
$$ plain form
18827 1054128 1153481 1333989 1438011 1414033 1578015 1664921 1596397 1469486 1436229 1390412
18817 1390412 1393792 1421246 1318106 1352857 1225602 1079102 1075942 1404789 1402651 1288770 1235681
18806 1235681 1231390 1005108 878029 698740 609803 538373 460265 552552 636171 655960 696194
18795 696194 615416 758456 764579 558681 596838 625067 527952 458038 560429 568110 679436
18784 679436 748256 990129 987111 1105458 1235554 1168796 949280 878616 949024 753489 363176
18773 363176 258397 500035 585718 605340 707158 699535 557285 353861 347404 487959 880472
18762 880472 900725 587800 524806 484092 374889 394756 534573 349145 288692 479070
18752 479070 479502 345780 370049 583849 754128 911567 919813 914616 994880 925818 945681
$$ packed form
18827A054128R9353J80508J04022k3978J63982Q6906o8524j26911l3257m5817
18817A390412L380K7454j03140L4751j27255j46500l160L28847k138j13881n3089
18806A235681m291k26282j27079j79289q8937p1430p8108R2287Q3619J9789M0234
18795F96194q0778J43040O123k05898L8157K8229r7115o9914J02391P681J11326
18784F79436O8820K41873l018J18347J30096o6758k19516p0664P0408j95535l90313
18773C63176j04779K41638Q5683J9622J01818p623j42250k03424o457J40555L92513
18762H80472K0253l12925o2994m0714j09203J9867J39817j85428o0453J90378
18752D79070M32j33722K4269K13800J70279J57439Q246n197Q0264o9062J9863
$$ plain form
18741 945681 1079269 1088554 907323 858363 820652 878357 956055 687155 577697 718225 710239
18730 710239 439068 426033 549429 421759 301416 374524 631818 668874 809642 1101589
18720 1101589 1273261 1200282 1211011 1355759 1491586 1700751 1744459 1928256 1888934 1770961
18710 1770961 1675427 1844018 2103943 2134987 2145065 1947630 1832296 2062949 2118313 1947176
18700 1947176 1849693 1675869 1387534 1209346 1115447 990241 1059496 1171496 1000136 850081
18690 850081 640375 890038 987165 1048334 857170 696638 489055 547985 834799 1126239
18680 1126239 1184564 899121 819955 684794 521680 388774 393382 540738 653381 630657
18670 630657 713757 1110135 1084653 1160010 1458113 1488286 1480077 1515700 1563686 1613800 1764468
$$ packed form
18741I45681J33588R285j81231m8960l7711N7705P7698k68900j09458J40528p986
18730G10239k71171j3035J23396j27670j20343P3108K57294L7056J40768K91947
18720A101589J71672p2979J0729J44748J35827K09165M3708J83797l9322j17973
18710A770961r5534J68591K59925L1044J0078j97435j15334K30653N5364j71137
18700A947176r7483j73824k88335j78188r3899j25206O9255J12000j71360j50055
18690H50081k09706K49663R7127O1169j91164j60532k07583N8930K86814K91440
18680A126239N8325k85443p9166j35161j63114j32906M608J47356J12643k2724
18670F30657Q3100L96378k5482P5357K98103L0173q209L5623M7986N0114J50668
$$ plain form
18659 1764468 1841964 1800589 1596707 1325265 1179420 1161862 1211275 1383174 1447747 1632479
18649 1632479 1577709 1556383 1556154 1665043 1546218 1298990 1386503 1147313 1217750 1338726 1367343
18638 1367343 1205501 992663 938408 631778 605100 706920 751345 885305 607788 568443
18628 568443 780878 795432 820730 766010 784614 849053 865668 767811 865263 995258 858890
18617 858890 477458 454493 618495 726720 833704 854286 737089 705549 779835 617925
18607 617925 484447 500363 382522 382857 544192 605102 863605 949662 968524 1074681 1126622
18596 1126622 1211565 1243774 1183378 1191025 1022810 694070 890849 1093241 1029705 1043322 1002932
18585 1002932 718477 602651 568676 293556 294685 485886 646782 739665 831058 1039804
$$ packed form
18659A764468P7496m1375k03882k71442j45845j7558M9413J71899O4573J84732
18649A632479n4770k1326k29J08889j18825k47228Q7513k39190P0437J20976K8617
18638A367343j61842k12838n4255l06630k6678J01820M4425J33960k77517l9345
18628E68443K12435J4554K5298n4720J8604O4439J6615r7857R7452J29995j36368
18617H58890l81432k2965J64002J08225J06984K0582j17197l1540P4286j61910
18607F17925j33478J5916j17841L35J61335O0910K58503Q6057J8862J06157N1941
18596A126622Q4943L2209o0396P647j68215l28740J96779K02392o3536J3617m0390
18585A002932k84455j15826l3975k75120J129J91201J60896R2883R1393K08746
$$ plain form
18575 1039804 988702 839220 576835 650240 799553 838179 461798 269143 543617 791917
18565 791917 816008 596679 636685 712333 858979 721433 556672 606414 779181 838134
18555 838134 996595 1166681 1366142 1619995 1675757 1336291 1167739 1249183 1449393 1381519
18545 1381519 1064533 925548 857750 655596 659044 627338 927897 1011776 917386 1209864
18535 1209864 1409573 1407595 1303147 1050749 1059011 1028971 925749 1028746 962784 949457 970112
18524 970112 885931 835604 978434 1144715 1314183 1182717 1008812 1018791 1087058 1242349
18514 1242349 1385363 1476878 1335042 1515856 1641835 1720023 1482669 1577987 1543696 1416678
18504 1416678 1431386 1106442 1028122 946334 937630 1010607 994631 1045009 1080744 1096684 1228900
$$ packed form
18575A039804n1102j49482k62385P3405J49313L8626l76381j92655K74474K48300
18565G91917K4091k19329M0006P5648J46646j37546j64761M9742J72767N8953
18555H38134J58461J70086J99461K53853N5762l39466j68552Q1444K00210o7874
18545A381519l16986j38985o7798k02154L448l1706L00559Q3879r4390K92478
18535A209864J99709j978j04448k52398Q262l0040j03222J02997o5962j3327K0655
18524I70112q4181n0327J42830J66281J69468j31466j73905R979O8267J55291
18514A242349J43014R1515j41836J80814J25979P8188k37354R5318l4291j27018
18504A416678J4708l24944p8320q1788q704P2977j5976N0378L5735J5940J32216
$$ plain form
18493 1228900 1129626 1011057 1010363 965292 1090611 955324 1036928 1250214 1274523 1313680 1323671
18482 1323671 1153096 1010809 976142 742094 750127 879564 998072 963680 1025368 1123106
18472 1123106 1055936 964322 1292817 1446979 1455408 1357550 1277544 1165894 938427 754534
18462 754534 492761 723490 1045254 1372174 1276748 1133031 1059059 954881 836773 927356
18452 927356 781649 771673 838894 860031 534925 746392 1054158 1197115 1511685 1670177
18442 1670177 1927943 1908965 1910907 1969901 2143254 2146982 2043998 1707422 1708142 1813083 1779981
18431 1779981 1931087 2144067 2366640 2332106 2329599 2401733 2178648 1866229 1881441 1560200
18421 1560200 1408557 1488989 1227409 963912 1359310 1584953 1862704 1932379 1756466 1933050
$$ packed form
18493A228900r9274j18569o94m5071J25319j35287Q1604K13286K4309L9157R991
18482A323671j70575j42287l4667k34048Q033J29437J18508l4392O1688R7738
18472A123106o7170r1614L28495J54162Q429r7858q0006j11650k27467j83893
18462G54534k61773K30729L21764L26920r5426j43717p3972j04178j18108R0583
18452I27356j45707r976O7221K1137l25106K11467L07766J42957L14570J58492
18442A670177K57766j8978J942N8994J73353L728j02984l36576P20J04941l3102
18431A779981J51106K12980K22573l4534k507P2134k23085l12419J5212l21241
18421A560200j51643Q0432k61580k63497L95398K25643K77751O9675j75913J76584
$$ plain form
18411 1933050 1948170 1957072 2160678 2192180 2209714 2218362 2091026 1985242 1856137 1791285 1813490
18400 1813490 1930431 1921036 1833789 1981417 2506675 2416936 2012747 1817153 1867111 1755104
18390 1755104 1560868 1369989 1468964 1446819 1221901 1450240 1742626 1681110 1496710 1249379
18380 1249379 1198844 1406328 1455510 1439228 1436417 1399265 1508944 1510032 1510624 1466939 1442742 1404912
18368 1404912 1450886 1449085 1310268 1189960 1192984 1305097 1312893 1424636 1392263 1136423 1221308
18357 1221308 1137490 932948 1100929 1043146 979302 1183938 1340412 1413324 1384766 1263199
18347 1263199 1145375 1164387 1362826 1591886 1821585 1840780 2043518 1965858 1705988 1574027
18337 1574027 1647207 1811348 1564920 1566995 1813859 1961777 1903994 2066913 2004415 1743089
$$ packed form
18411A933050J5120Q902K03606L1502J7534Q648j27336j05784j29105o4852K2205
18400A813490J16941r395q7247J47628N25258q9739m04189j95594M9958j12007
18390A755104j94236j90879R8975k2145k24918K28339K92386o1516j84400k47331
18380A249379n0535K07484M9182j6282k811l7152J09679J088N92m3685k4197l7830
18368A404912M5974j801j38817j20308L024J12113P796J11743l2373k55840Q4885
18357A221308q3818k04542J67981n7783o3844K04636J56474P2912k8558j21567
18347A263199j17824J9012J98439K29060K29699J9195K02738p7660k59870j31961
18337A574027P3180J64141k46428K075K46864J47918n7783J62919o2498k61326
$$ plain form
18327 1743089 1734463 1737699 1653550 1557403 1458524 1043030 944189 944096 1230095 1511215 1532133 1354459
18315 1354459 1075037 1070322 1152696 1209718 1198777 990898 1041666 937553 790305 493655
18305 493655 557616 771708 709551 1005593 1020007 932231 803606 855240 869973 1111124 1250476
18294 1250476 1192993 1279427 1228218 919181 921750 1135761 1076704 1041864 1079513 1121559 1149316
18283 1149316 1245010 1369963 1207317 963217 1004544 950378 794018 795984 966061 975334 1008069
18272 1008069 836801 820214 856083 769893 506979 686787 907711 972712 629082 557994
18262 557994 388657 396179 489138 379084 665928 740368 763269 857783 700943 579084 495268
18251 495268 426069 323162 299893 338507 357227 515236 498863 313954 330919 396577 401623
$$ packed form
18327A743089q626L236q4149r6147r8879m15494r8841r3K85999K81120K0918j77674
18315A354459k79422m715Q2374N7022j0941k07879N0768j04113j47248k96650
18305D93655O3961K14092o2157K96042J4414q7776j28625N1634J4733K41151J39352
18294A250476n7483Q6434n1209l09037K569K14011n9057l4840L7649M2046K7757
18283A149316R5694J24953j62646k44100M1327n4166j56360J966J70077R273L2735
18272A008069j71268j6587L5869q6190k62914J79808K20924O5001l43630p1088
18262E57994j69337P522R2959j10054K86844P4440K2901R4514j56840j21859q3816
18251D95268o9199j02907k3269L8614J8720J58009j6373j84909J6965O5658N046
$$ plain form
18240 401623 393257 503428 542484 513542 452002 195303 -75828 -60665 39866 187347 199407
18229 199407 42569 177543 381313 376763 584079 641906 400954 118728 6833 -204924
18219 -204924 -146322 -342509 -419590 -295257 -353335 -99446 150635 -5216 -109154 161031
18209 161031 169414 136208 117036 311323 278903 270921 405240 533022 488704 249693 95107
18198 95107 -23073 1466 -25283 -21439 -5484 35927 318555 198464 -45877 -25969 203712
18187 203712 291689 181252 219703 53257 -56034 -11690 58590 62483 189799 300614 250774
18176 250774 84345 -75726 -220469 -159775 -346406 -411697 -420967 -227053 -199504 -201469 -297345
18165 -297345 -469384 -421799 -424642 -326709 -322949 -268832 -315955 -521808 -341205 -77936 273293
$$ packed form
18240D01623q366J10171L9056k8942o1540k56699k71131J5163J00531J47481J2060
18229A99407j56838J34974K03770m550K07316N7827k40952k82226j11895k11757
18219b04924N8602j96187p7081J24333n8078K53889K50081j55851j03938K70185
18209A61031Q383l3206j9172J94287l2420p982J34319J27782m4318k39011j54586
18198I5107j18180K4539k6749L844J5955M1411K82628j20091k44341J9908K29681
18187B03712Q7977j10437L8451j66446j09291M4344P0280L893J27316J10815m9840
18176B50774j66429j60071j44743O0694j86631o5291r270J93914K7549j965r5876
18165b97345j72039M7585k843R7933L760N4117m7123k05853J80603K63269L51229
$$ plain form
18154 273293 463862 271689 -142836 -181221 -21850 -56835 133190 -31834 -171657 -327875
18144 -327875 -290688 -108352 -112542 -199486 -77958 108856 332817 389641 179062 -69154
18134 -69154 24162 30063 9387 139719 290137 298952 310638 270336 109795 2063 -465758
18123 -465758 -396918 -52643 80347 121393 157389 354582 625682 734097 440539 447718
18113 447718 549895 509625 450131 234615 62314 -20155 185748 341880 514267 554561
18103 554561 371627 348705 297057 107872 -38332 56629 167951 31046 -14876 -98290
18093 -98290 111268 355031 367379 218079 103588 -26481 30149 88075 235234 407563
18083 407563 162826 -123917 64991 230712 268787 246667 -66908 -349709 -210206 -69851
$$ packed form
18154B73293J90569j92173m14525l8385J59371l4985J90025j65024j39823j56218
18144c27875L7187J82336m190q6944J21528J86814K23961N6824k10579k48216
18134f9154R3316N901k0676J30332J50418Q815J1686m0302j60541j07732m67821
18123d65758O8840L44275J32990M1046L5996J97193K71100J08415k93558P179
18113D47718J02177m0270n9494k15516j72301q2469K05903J56132J72387M0294
18103E54561j82934k2922n1648j89185j46204R4961J11322j36905m5922q3414
18093i8290K09558K43763J2348j49300j14491j30069N6630N7926J47159J72329
18083D07563k44737k86743J88908J65721L8075k2120l13575k82801J39503J40355
$$ plain form
18073 -69851 -82340 -167494 -187763 -161753 15346 18016 79916 139418 128466 328472 390739
18062 390739 352958 324587 229719 364867 247969 166378 301838 377588 416226 449315 277907
18051 277907 125540 174696 321899 313768 279586 147154 8128 -20466 42189 39041 17351
18040 17351 125578 249741 100963 41715 -39846 -98725 32533 265181 320708 196599
18030 196599 63363 -197132 -307721 -149063 41329 105346 200462 191488 -86252 -220889
18020 -220889 -157851 -173847 -262046 -323790 -255400 -142295 19759 -58982 -200795 -183076 -39976
18009 -39976 14005 -68121 -28998 140692 148179 -6557 -189201 -58515 -106847 -249421 -156578
17998 -156578 -43919 -297047 -181642 -21436 -97814 -124517 70525 264182 130085 -131574
$$ packed form
18073f9851j2489q5154k0269K6010J77099K670O1900N9502j0952K00006O2267
18062C90739l7781k8371r4868J35148j16898q1591J35460P5750L8638L3089j71408
18051B77907j52367M9156J47203q131l4182j32432j39026k8594O2655l148k1690
18040A7351J08227J24163j48778n9248q1561n8879J31258K32648N5527j24109
18030A96599j33236k60495j10589J58658J90392O4017R5116q974k77740j34637
18020b20889O3038j5996q8199o1744O8390J13105J62054p8741j41813J7719J43100
18009c9976N3981q2126L9123J69690P487j54736j82644J30686m8332j42574R2843
17998a56578J12659k53128J15405J60206p6378k6703J95042J93657j34097k61659
$$ plain form
17988 -131574 -214175 -124490 7265 125083 11165 42986 -25192 -143618 -136084 -212990 -163648
17977 -163648 -232963 -131326 82831 116435 62496 -2035 -163550 -271787 -208153 27582
17967 27582 48249 -114000 -179665 29006 -45930 -50142 24139 178270 1448 -58506 115378
17956 115378 74078 195899 236282 286434 27237 -120934 -186904 -364456 -369049 -93490 -198990
17945 -198990 -160373 -363152 -323890 -228048 5305 159896 -41539 -95328 96611 134541
17935 134541 161258 211973 97371 246074 213480 274689 250016 128620 52193 -34077 -134076
17924 -134076 109183 271481 391603 396620 182565 22705 14494 84620 120965 93666 -44573
17913 -44573 -94471 -169154 -60207 -62582 -113220 -259365 -222030 -121138 67710 84719 225873
$$ packed form
17988a31574q2601Q9685J31755J17818j13918L1821o8178j18426P534p6906M9342
17977a63648o9315J01637K14157L3604n3939o4531j61515j08237O3634K35735
17967B7582K0667j62249o5665K08671p4936m212P4281J54131j76822n9954J73884
17956A15378m1300J21821M0383N0152k59197j48171o5970j77552m593K75559j05500
17945a98990L8617k02779L9262R5842K33353J54591k01435n3789J91939L7930
17935A34541K6717N0715j14602J48703l2594O1209k4673j21396p6427q6270r9999
17924a34076K43259J62298J20122N017k14055j59860q211P0126L6345k7299j38239
17913d4573m9898p4683J08947k375n0638j46145L7335J00892J88848J7009J41154
$$ plain form
17902 225873 365547 314288 351683 178091 24575 158070 115229 199176 435939 77675
17892 77675 -230766 -237035 -55867 14932 -138921 -128855 -38372 40381 156311 6316 -214491
17881 -214491 -226533 67457 130159 -71083 53944 197907 188450 307277 271927 291444 396690
17870 396690 136961 97856 250672 288360 68042 -241 145683 259396 -4810 83261
17860 83261 29653 55635 406870 411408 315640 94031 143138 123279 170121 404514 314402
17849 314402 346144 339534 311320 -182076 -274151 -165608 -39738 -40206 -18553 20142 277981
17838 277981 361864 55991 -138574 -84330 5183 69813 -57980 54796 301706 194332
17828 194332 65517 -142706 -273192 -353205 -270903 -186999 -71096 -251522 -404011 -625483
$$ packed form
17902B25873J39674n1259L7395j73592j53516J33495m2841Q3947K36763l58264
17892G7675l08441o269J81168P0799j53853J0066R0483P8753J15930j49995k20807
17881b14491j2042K93990O2702k01242J25027J43963r457J18827l5350J9517J05246
17870C96690k59729l9105J52816L7688k20318o8283J45924J13713k64206Q8071
17860H3261n3608K5982L51235M538r5768k21609M9107j9859M6842K34393r0112
17849C14402L1742o610k8214m93396r2075J08543J25870m68K1653L8695K57839
17838B77981Q3883l05873j94565N4244Q9513O4630j27793J12776K46910j07374
17828A94332j28815k08223j30486q0013Q2302Q3904J15903j80426j52489k21472
$$ plain form
17818 -625483 -162949 178638 441155 220156 65980 295677 151399 -28423 -87558 -139672
17808 -139672 166579 384074 40934 14327 8001 -2097 57107 76638 40615 192626 362529
17797 362529 127468 100667 34322 -112868 -128614 95411 -30533 -90001 -102823 -184591 -270181
17786 -270181 -192779 -210374 -147133 -103204 -157783 -158575 -292946 -41172 26387 -171674 -370298
17775 -370298 -443279 -562062 -509944 -356682 12489 -10713 -95442 -113402 69666 173279
17765 173279 -53492 -230918 -268844 -343073 -207008 -256226 -153459 143672 270308 281670
17755 281670 -9188 -317459 -291234 -29739 194555 45013 -127358 22987 16273 -269458
17745 -269458 -226018 -231004 -165656 -127833 -269052 -289576 -265070 -79992 -89150 -88403 31619 91648
$$ packed form
17818f25483M62534L41587K62517k20999j54176K29697j44278j79822n9135n2114
17808a39672L06251K17495l43140k6607o326j0098N9204J9531l6023J52011J69903
17797C62529k35061k6801o6345j47190j5746K24025j25944n9468j2822q1768q5590
17786b70181P7402j7595O3241M3929n4579p92j34371K51774O7559j98061j98624
17775c70298p2981j18783N2118J53262L69171k3202q4729j7960J83068J03613
17765A73279k26771j77426l7926p4229J36065m9218J02767K97131J26636J1362
17755B81670k90858l08271K6225K61495K24294j49542j72371J50345o714k85731
17745b69458M3440m986O5348L7823j41219k0524K4506J85078r158P47J20022O0029
$$ plain form
17733 91648 -147635 -401175 -615389 -551826 -412563 -347788 -220011 -56550 -4843 -5702 -121676
17722 -121676 -284990 -292362 -262701 -218686 -139787 21321 121392 19352 -236190 -223142 -213839
17711 -213839 219449 197874 -28750 -166647 50313 372797 219737 -98951 -77792 215021
17701 215021 218496 -135495 -423475 -472453 -301392 -213052 -5823 55257 36744 31262 -39710
17690 -39710 50539 -41422 -28511 3486 114765 141862 8793 -6181 31948 90795 3010
17679 3010 63388 -83449 140726 -7954 -109771 234386 410848 200769 69052 17548
17669 17548 43243 26490 217249 58659 -119465 -218203 -344918 -448181 -298038 -260105
17659 -260105 -230199 -75084 47124 185002 80327 98400 129450 -84899 -268667 -342839
$$ packed form
17733I1648k39283k53540k14214O3563J39263O4775J27777J63461N1707q59j15974
17722a21676j63314p372K9661M4015P8899J61108J00071j02040k55542J3048R303
17711b13839M33288k1575k26624j37897K16960L22484j53060l18688K1159K92813
17701B15021L475l53991k87980m8978J71061Q8340K07229O1080j8513n482p0972
17690c9710R0249r1961J2911L1997J11279K7097j33069j4974L8129N8847q7785
17679C010O0378j46837K24175j48680j01817L44157J76462k10079j31717n1504
17669A7548K5695j6753J90759j58590j78124r8738j26715j03263J50143L7933
17659b60105K9906J55115J22208J37878j04675J8073L1050k14349j83768p4172
$$ plain form
17649 -342839 -295444 -3644 162442 -43100 -158669 -297652 -44951 -10054 -361298 -457474
17639 -457474 -153070 -80522 -173659 -212765 -165216 -150374 -86335 10972 -141120 -169874 49413
17628 49413 183929 -20923 58662 198311 126216 -102995 -28505 13320 -170868 -36399
17618 -36399 188855 162014 273999 229066 269064 117322 -101415 -146979 -387442 -781993
17608 -781993 -940364 -621785 -376886 -485966 -313067 -156468 77221 70933 43836 216110
17598 216110 175342 32573 -4518 -32986 -181392 -276930 -319543 -213322 -170041 -198500 -104048
17587 -104048 82436 -150076 -100230 5986 -25637 -199232 -228555 -296253 -46953 141166
17577 141166 -59179 68801 223612 210891 172312 158059 267690 174124 164588 335292 315731
$$ packed form
17649c42839M7395K91800J66086k05542j15569j38983K52701L4897l51244r6176
17639d57474L04404P2548r3137l9106M7549J4842O4039R7307j52092k8754K19287
17628D9413J34516k04852P9585J39649p2095k29211P4490M1825j84188J34469
17618c6399K25254k6841J11985m4933L9998j51742k18737m5564k40463l94551
17608g81993j58371L18579K44899j09080J72899J56599K33689o288k7097J72274
17598B16110m0768j42769l7091k8468j48406r5538m2613J06221M3281k8459R4452
17587a04048J86484k32512M9846J06216l1623j73595k9323o7698K49300J88119
17577A41166k00345J27980J54811j2721l8579j4253J09631r3566r536J70704j9561
$$ plain form
17566 315731 -96674 -342713 -363007 -282179 -351463 -232748 -43645 -79437 -84398 -276714 14098
17555 14098 323423 142042 -49066 190553 360702 313343 268232 271877 62443 -154511
17545 -154511 -62543 36335 13089 -142937 -222613 -294214 -565601 -413589 -303151 -270105 -424111
17534 -424111 -396556 14672 -106536 15014 -124911 -230757 -123099 5623 -140101 -298273
17524 -298273 -406533 -359414 -284416 -240563 -125134 -105172 -173416 -239429 -310915 -99293 31117
17513 31117 75207 194038 146852 128005 -16199 -39137 -121992 -12365 -102381 -194848 -295030
17502 -295030 -365815 -330120 -230357 -217234 -141021 -122113 7763 -112335 -276259 -140583 -28322
17491 -28322 -11309 -111222 -107941 202356 -37722 -449035 -570561 -276348 -237971 -171477 -129713
$$ packed form
17566C15731m12405k46039k0294Q0828o9284J18715J89103l5792m961j92316K90812
17555A4098L09325j81381j91108K39619J70149m7359m5111L645k09434k16954
17545a54511R1968R8878k3246j56026p9676p1601k71387J52012J10438L3046j54006
17534d24111K7555M11228j21208J21550j39925j05846J07658J28722j45724j58172
17524b98273j08260M7119P4998M3853J15429J9962o8244o6013p1486K11622J30410
17513C1117M4090J18831m7186j8847j44204k2938q2855J09627r0016r2467j00182
17502b95030p0785L5695R9763J3123P6213J8908J29876j20098j63924J35676J12261
17491b8322J7013r9913L281L10297k40078m11313j21526K94213L8377O6494M1764
$$ plain form
17480 -129713 -146477 -137272 -181712 -250460 -291881 -341207 -374979 -376336 -481007 -540259 -484544 -474108
17468 -474108 -329384 -491753 -371706 -79713 66115 10626 -25191 -23036 -57147 -323480
17458 -323480 -425869 -431612 -377809 -312142 -328486 -233305 -250169 -336858 -338969 -355437 -87677
17447 -87677 148131 -2138 44598 131915 176198 61509 -146236 -300570 -244151 53701
17437 53701 85775 48018 -170258 -604127 -742213 -607881 -643546 -701447 -572429 -517082 -277084
17426 -277084 39368 233320 143424 84556 -142529 -27871 94207 145581 162478 -4199
17416 -4199 -123293 -190318 -27893 -40640 -189484 -40382 -99659 -121671 -110768 -6683 36238
17405 36238 -97462 65170 171530 245065 171298 43641 -1619 -23432 -143851 -134487 89820
$$ packed form
17480a29713j6764R205m4440o8748m1421m9326l3772j357j04671n9252N5715J0436
17468d74108J44724j62369J20047K91993J45828n5489l5817K155l4111k66333
17458c23480j02389n743N3803O5667j6344R5181j6864q6689k111j6468K67760
17447h7677K35808j50269M6736Q7317M4283j14689k07745j54334N6419K97852
17437E3701L2074l7757k18276m33869j38086J34332l5665n7901J29018N5347K39998
17426b77084L16452J93952q9896n8868k27085J14658J22078N1374J6897j66677
17416d199j19094o7025J62425j2747j48844J49102n9277k2012J0903J04085M2921
17405C6238j33700J62632J06360P3535p3767j27657m5260k1813j20419R364K24307
$$ plain form
17394 89820 234817 41665 -76158 51654 -279 -47217 61853 151242 286575 361446
17384 361446 302474 125102 -120284 -299676 -508653 -593450 -533586 -316476 -277161 -231496
17374 -231496 -156648 -18490 6296 -73020 -44661 -125789 -41673 252556 298012 292210 248167
17363 248167 143255 -24335 -293990 -270903 -327405 -85195 -51163 -318927 -121913 184181
17353 184181 93274 -96508 -102871 70264 251462 19556 -106740 -49315 -2504 4885 -15453
17342 -15453 -180636 -407123 -488444 -387423 -445870 -494849 -452433 -378100 -308624 -400679 -310652
17331 -310652 -147581 -190163 -181898 29455 177313 -32626 -262838 -257496 -265249 -358962 -425950
17320 -425950 -307961 -196498 -6553 -204350 -254118 -240756 -207809 -110409 91991 -109062
$$ packed form
17394H9820J44997j93152j17823J27812n1933m6938J09070Q9389J35333P4871
17384C61446n8972j77372k45386j79392k08977q4797N9864K17110L9315M5665
17374b31496P4848J38158K4786p9316K8359q1128Q4116K94229M5456n802m4043
17363B48167j04912j67590k69655K3087n6502K42210L4032k67764J97014L06094
17353A84181r0907j89782o363J73135J81198k31906j26296N7425M6811P389k0338
17342a5453j65183k26487q1321J01021n8447m8979M2416P4333O9476r2055R0027
17331c10652J63071m2582Q265K11353J47858k09939k30212N342p753r3713o6988
17320d25950J17989J11463J89945j97797m9768J3362L2947R7400K02400k01053
$$ plain form
17310 -109062 -348285 -325169 -55374 160987 204761 262176 77186 -100524 -171639 -104868
17300 -104868 -64698 22363 94898 137498 -59245 -222494 -186220 -204546 -220169 -21123 151354
17289 151354 -44539 -187652 -246210 -549676 -411416 -130558 -67599 -189095 -343172 -389926
17279 -389926 -80934 163208 310439 33878 -254919 -485134 -279220 -192101 -195325 -201061
17269 -201061 -104682 200299 208968 77821 102077 210603 214170 154750 -84727 -145084 -139438
17258 -139438 -256835 -408542 -284346 -112192 -88512 -115763 -257037 -279896 -347605 -384890
17248 -384890 -261934 -71231 59448 153503 -77928 -265287 -353261 -333970 -535922 -238587
17238 -238587 -13596 -57058 -97059 -146099 -17119 110447 165308 111673 40062 88534 86476
$$ packed form
17310a09062k39223K3116K69795K16361M3774N7415j84990j77710p1115O6771
17300a04868M0170Q7061P2535M2600j96743j63249L6274j8326j5623J99046J72477
17289A51354j95893j43113n8558l03466J38260K80858O2959j21496j54077m6754
17279c89926L08992K44142J47231k76561k88797k30215K05914Q7119l224n736
17269b01061R6379L04981Q669j31147K4256J08526L567n9420k39477o0357N646
17258a39438j17397j51707J24196J72154K3680k7251j41274k2859o7709l7285
17248c84890J22956J90703J30679R4055k31431j87359q7974J9291k01952K97335
17238b38587K24991m3462m0001m9040J28980J27566N4861n3635p1611M8472k058
$$ plain form
17227 86476 -19453 -77344 -202899 -186565 -182991 -324460 -377351 -421536 -386077 -234832 -93343
17216 -93343 25096 194149 163775 110265 86987 -137868 -129238 -292702 -426605 -354064 -302950
17205 -302950 -382410 -274801 -23781 -207240 -379366 -432844 -473850 -504474 -419050 -228452
17195 -228452 57382 268346 585021 463843 1510 -79251 99852 50795 -102729 -131547
17185 -131547 -187604 -152573 -26005 89977 73875 165930 303001 255741 220546 219392 55129
17174 55129 -19953 265595 175812 -165407 -218317 -153106 -114651 4113 -137051 -133614 133008
17163 133008 -59561 -36523 -48159 -109142 -45881 -3962 267216 501374 563084 290937 353470
17152 353470 434405 321047 262106 -22454 49735 26938 -190317 -220170 -63027 351548
$$ packed form
17227H6476j05929n7891j25555J6334L574j41469n2891m4185L5459J51245J41489
17216i3343J18439J69053l0374n3510k3278k24855Q630j63464j33903P2541N1114
17205c02950p9460J07609K51020j83459j72126n3478m1006l0624Q5424J90598
17195b28452K85834K10964L16675j21178m62333q0761J79103m9057j53524k8818
17185a31547n6057L5031J26568J15982j6102R2055J37071m7260l5195j154j64263
17174E5129p5082K85548q9783l41219n2910O5211L8455J18764j41164L437K66622
17163A33008j92569K3038j1636o0983O3261M1919K71178K34158O1710k72147O2533
17152C53470Q0935j13358n8941k84560P2189k2797k17255k9853J57143M14575
$$ plain form
17142 351548 546553 229762 -89967 -206947 -57541 -127904 -329058 -445389 -297279 -228394
17132 -228394 -212063 44596 20326 -226313 -306534 -253991 -172957 -37374 10203 -171664 -104048
17121 -104048 -245929 -376717 -246274 22759 57488 -2482 -58936 -175745 -294243 -230428
17111 -230428 -147697 -202224 -143771 25310 125758 265662 341183 120389 244458 80290
17101 80290 -150198 -318319 -461291 -407340 -379490 -348104 -1988 -72834 -22269 56613 140
17090 140 -2853 -125162 -83793 -48725 12440 11041 68243 177004 222627 195264 182123 234156
17078 234156 216768 73891 -40341 -260591 -299062 -187265 67035 408834 389016 312277
17068 312277 309334 271980 277568 274902 242783 213689 403436 539485 227629 -172895 -239460
$$ packed form
17142C51548J95005l16791l19729j16980J49406p0363k01154j16331J48110O8885
17132b28394J6331K56659k4270k46639q0221N2543Q1034J35583M7577j81867O7616
17121a04048j41881j30788J30443K69033L4729n9970n6454j16809j18498O3815
17111b30428Q2731n4527N8453J69081J00448J39904P5521k20794J24069j64168
17101H0290k30488j68121j42972N3951K7850L1386L46116p0846N0565P8882n6473
17090A40k993j22309M1369L5068O1165j399N7202J08761M5623k7363j3141N2033
17078B34156j7388j42877j14232k20250l8471J11797K54300L41799j9818p6739
17068C12277k943l7354N588k666l2119k9094J89747J36049l11856m00524o6565
$$ plain form
17057 -239460 -305350 -238935 30933 82111 -21254 -248646 -394469 -269891 -79646 13738
17047 13738 107071 -210907 -364864 -452080 -330696 -75333 -23421 -137640 -334100 -268987
17037 -268987 -227732 -257777 86430 80570 57198 2863 23243 205063 273618 275280 133086
17026 133086 303281 260272 74437 -289457 -516508 -603760 -619228 -418892 -479385 -297123
17016 -297123 -137757 -71030 -167241 -59451 105289 -180247 -130929 -36135 -128106 -235492
17006 -235492 -18814 116865 3977 -50497 -50451 169766 284021 395836 444101 372977 73972
16995 73972 -67257 -106866 -268329 -356469 -313898 -296234 -112738 26402 -177099 -300173
16985 -300173 -220200 -171712 -79850 10050 -14487 -47054 -102351 -73169 28363 -95494 -137317
$$ packed form
17057b39460o5890O6415K69868N1178j03365k27392j45823J24578J90245R3384
17047A3738R3333l17978j53957q7216J21384K55363N1912j14219j96460O5113
17037b68987M1255l0045L44207n860k3372n4335K0380J81820O8555J662j42194
17026A33086J70195m3009j85835l63894k27051q7252j5468K00336o0493J82262
17016b97123J59366O6727r6211J07790J64740k85536M9318R4794r1971j07386
17006b35492K16678J35679j12888n4474M6K20217J14255J11815M8265p1124k99005
16995G3972j41229l9609j61463q8140M2571J7664J83496J39140k03501j23074
16985c00173P9973M8488R1862Q9900k4537l2567n5297K9182J01532j23857m1823
$$ plain form
16974 -137317 -110411 -94964 -143270 -98949 -89625 -193901 -461628 -662308 -406679 -52407 198892
16963 198892 242966 100464 -285792 -417015 -380584 -147299 32490 -8422 133371 178014
16953 178014 142858 -46144 -114093 -205691 -463115 -453216 -347507 -374743 -414480 -375549 -292367
16942 -292367 -347450 -174329 -98557 -117143 106153 28644 -50343 101956 68870 64294 45376
16931 45376 93367 126488 -50001 -78722 37424 42750 161328 271965 150985 199563 383816
16920 383816 186800 208787 225985 -14144 -280180 -239256 -145982 214970 110492 23970
16910 23970 107497 152011 163523 -11213 -177224 -147165 -145681 -69581 83834 -7608 -92619
16899 -92619 -204030 -336104 -203979 -446590 -621402 -481493 -38075 391718 461714 335659
$$ packed form
16974a37317K6906J5447m8306M4321R324j04276k67727k00680K55629L54272K51299
16963A98892M4074j42502l86256j31223L6431K33285J79789m0912J41793M4643
16953A78014l5156j89002o7949r1598k57424R899J05709k7236l9737L8931Q3182
16942b92367n5083J73121P5772j8586K23296p7509p8987J52299l3086m576j8918
16931D5376M7991L3121j76489k8721J16146N326J18578J10637j20980M8578J84253
16920C83816j97016K1987J7198k40129k66036M0924R3274L60952j04478q6522
16910B3970Q3527M4514J1512j74736j66011L0059J484P6100J53415r1442q5011
16899i2619j11411j32074J32125k42611j74812J39909M43418M29793O9996j26055
$$ plain form
16889 335659 154045 -42141 -176214 -270009 -260787 -305988 -78628 124058 107295 50313 -212420
16878 -212420 -171163 -21435 -204040 -287347 -67704 72818 69045 43029 155549 171890 48981
16867 48981 -209432 -398986 -272193 -96348 26813 145542 109832 134157 56381 -209710
16857 -209710 -248083 -185344 -90527 -89887 -359609 -472942 -365853 -367099 -265629 46164 161091
16846 161091 -96745 23789 107723 -20652 120871 -32052 -114671 -144745 -224235 -70427
16836 -70427 -118847 -171916 -272145 -319621 -366247 -179851 -212988 -285459 -198598 -206502 -43997
16825 -43997 -201812 -165250 -137006 -33637 -45518 -38382 -141053 -218008 -592712 -519625 -516305
16814 -516305 -488614 -162905 -86595 -24097 -76523 35122 78266 -109737 -133093 -82579 -127094
$$ packed form
16889C35659j81614j96186j34073r3795R222m5201K27360K02686j6763n6982k62733
16878b12420M1257J49728j82605q3307K19643J40522l773k6016J12520J6341j22909
16867D8981k58413j89554J26793J75845J23161J18729l5710K4325p7776k66091
16857b09710l8373O2739R4817O40k69722j13333J07089j246J01470L11793J14927
16846A61091k57836J20534Q3934j28375J41523j52923q2619l0074p9490J53808
16836g0427m8420n3069j00229m7476m6626J86396l3137p2471Q6861p904J62505
16825d3997j57815L6562K8244J03369j1881P136j02671p6955l74704P3087L320
16814e16305K7691L25709P6310O2498n2426J11645M3144j88003k3356N0514m4515
$$ plain form
16803 -127094 -201508 -226772 -244339 -180196 -86134 -99282 -86133 -68037 -155738 -283638 -240558
16792 -240558 -330 187247 492920 430468 18825 -3220 34734 32650 -150875 -277478
16782 -277478 -218113 -153559 -151774 22858 -71110 -45398 8330 236921 -12593 -248015 -48204
16771 -48204 -66604 -438489 -419892 -221866 -133029 -80567 -18501 87232 -25369 -62139 -164364
16760 -164364 -237933 -270662 -393554 -316667 -124455 -30248 -61672 -54022 -200051 -252045 -249531
16749 -249531 -21284 110729 -23750 -141892 103402 6489 -257947 -312133 -225637 -228529
16739 -228529 -154596 -246123 -376493 -211324 32366 358361 430021 49389 -350772 -349265
16729 -349265 -474725 -567469 -501688 -311383 -195536 -174607 -248480 -629800 -614383 -548228 -529709
$$ packed form
16803a27094p4414k5264j7567O4143R4062j3148J3149J8096q7701j27900M3080
16792b40558K40228J87577L05673o2452m11643k2045L7954k084j83525j26603
16782b77478N9365O4554J785J74632r3968K5712N3728K28591k49514k35422J99811
16771d8204j8400l71885J8597J98026Q8837N2462O2066J05733j12601l6770j02225
16760a64364p3569l2729j22892P6887J92212R4207l1424P650j46029n1994K514
16749b49531K28247J32013j34479j18142K45294r6913k64436n4186Q6496k892
16739b28529P3933r1527j30370J65169K43690L25995P1660l80632m00161J507
16729c49265j25460r2744O5781J90305J15847K0929p3873l81320J5417O6155J8519
$$ plain form
16718 -529709 -471598 -542884 -388566 -334055 -242924 -319538 -355262 -456699 -534265 -264571 -157627
16707 -157627 -107552 24559 98857 89621 97226 76225 -152952 -79386 -202241 -185575 -222725
16696 -222725 -235652 -157851 -59896 -128357 23150 79691 -40637 50413 207045 190764 14322
16685 14322 21063 -147790 -307900 -52366 -36975 -159499 -240884 -266651 -92699 -80465 -213073
16674 -213073 -158615 -19640 -21883 163295 152071 60564 38674 44784 -101787 -253513 -221954
16663 -221954 -38031 -33240 136893 173495 87440 98107 3589 94377 -14825 -124105 -376996
16652 -376996 -395401 -265443 -319116 -369493 24950 249433 24745 -88192 -41773 -166799
16642 -166799 -535630 -509286 -369145 -276016 87153 198490 111678 -34733 -119351 17272
$$ packed form
16718e29709N8111p1286J54318N4511R1131p6614l5724j01437p7566K69694J06944
16707a57627N0075J32111P4298r236P605k1001k29177P3566j22855J6666l7150
16696b22725j2927P7801R7955o8461J51507N6541j20328R1050J56632j6281j76442
16685A4322O741j68853j60110K55534J5391j22524q1385k5767J73952J2234j32608
16674b13073N4458J38975k243J85178j1224r1507k1890O110j46571j51726L1559
16663b21954J83923M791J70133L6602q6055J0667r4518R0788j09202j09280k52891
16652c76996j8405J29958n3673n0377L94443K24483k24688j12937M6419j25026
16642a66799l68831K6344J40141R3129L63169J11337q6812j46411q4618J36623
$$ plain form
16632 17272 -46650 83564 -101870 -208663 -536710 -566204 -663855 -497562 -363053 -117253
16622 -117253 133213 10389 -112281 -99534 161187 251553 267440 294107 -4987 -201845
16612 -201845 -139926 -252239 -349167 -264996 -23616 -26363 -26976 -107223 -82038 122987 270894
16601 270894 256517 191793 324929 512565 405382 512486 608265 322199 -40139 -261691
16591 -261691 -224688 -31275 -13738 -304094 -311497 -239213 -20160 38850 27066 -18805 -346152
16580 -346152 -273735 -36124 152048 207023 234318 152120 57825 166674 102473 -132958 -234295
16569 -234295 -172854 -100631 -314952 -503846 -384224 -66072 29898 -74714 -121073 -87136
16559 -87136 17923 163335 -31064 -329385 -441162 -420468 -307458 -266924 -249617 -213252
$$ packed form
16632A7272o3922J30214j85434j06793l28047k9494r7651J66293J34509K45800
16622a17253K50466j22824j22670J2747K60721R0366J5887K6667k99094j96858
16612b01845O1919j12313r6928Q4171K41380k747o13q0247K5185K05025J47907
16601B70894j4377o4724J33136J87636j07183J07104R5779k86066l62338k21552
16591b61691L7003J93413J7537k90356p403P2284K19053N9010j1784m5871l27347
16580c46152P2417K37611J88172N4975K7295q2198r4295J08849o4201k35431j01337
16569b34295O1441P2223k14321j88894J19622L18152R5970j04612m6359L3937
16559h7136J05059J45412j94399k98321j11777K0694J13010M0534J7307L6365
$$ plain form
16549 -213252 -178563 92598 255539 131579 -21262 -101515 -249560 -175765 -225751 -341506
16539 -341506 -335527 -101464 34036 -84698 37553 103223 136588 36953 -83546 125997
16529 125997 149947 264261 358121 371473 233549 104568 136906 84672 362371 526445
16519 526445 548664 306131 199038 212771 -1052 -259388 -73727 -132780 -380660 -283647
16509 -283647 -35123 123967 105789 -51825 -72010 49280 95085 5817 37561 -25801 -42657
16498 -42657 -154996 -179338 -159325 -133494 -4908 219275 288607 72570 10802 167642 458751
16487 458751 691012 466733 52546 -164152 -312035 -179703 -68976 -114891 -228883 -371526
16477 -371526 -357477 -394214 -328077 -485441 -687795 -845909 -665544 -426497 -316059 -120866
$$ packed form
16549b13252L4689K71161J62941j23960j52841q0253j48045P3795m9986j15755
16539c41506N979K34063J35500j18734J22251O5670L3365r9635j20499K09543
16529A25997K3950J14314R3860J3352j37924j28981L2338n2234K77699J64074
16519E26445K2219k42533j07093J3733k13823k58336J85661n9053k47880R7013
16509b83647K48524J59090j8178j57614k0185J21290M5805q9268L1744o3362j6856
16498d2657j12339k4342K0013K5831J28586K24183O9332k16037o1768J56840K91109
16487D58751K32261k24279m14187k16698j47883J32332J10727m5915j13992j42643
16477c71526J4049l6737O6137j57364k02354j58114J80365K39047J10438J95193
$$ plain form
16467 -120866 -90798 -207439 -377725 -403725 -52083 -54090 208660 329707 148528 -16924
16457 -16924 -73577 -119385 -214852 -244845 -251722 -58321 33002 118500 140982 -79199 -199413
16446 -199413 -159775 -212659 -180101 -58079 19466 -26063 -220859 -343612 -187559 134453
16436 134453 161255 149111 59573 -13499 -202484 -142870 -85673 -10046 -44123 -17096 -200198
16425 -200198 -305984 -344747 -266593 -293595 -221340 -394918 -396645 -33455 135082 -10398 -76778
16414 -76778 -148378 -315604 -164834 2841 113073 168059 192645 87809 71787 103185 -11024
16403 -11024 -107370 -178127 -11051 -132342 -243062 -222615 -313877 -438657 -364905 -348964 -256920
16392 -256920 -165233 -74367 -129093 -587 -40570 -123540 -215701 -156246 18206 242228 292325
$$ packed form
16467a20866L0068j16641j70286k6000L51642k007K62750J21047j81179j65452
16457a6924n6653m5808r5467k9993o877J93401R1323Q5498K2482k20181j20214
16446a99413L9638n2884L2558J22022P7545m5529j94796j22753J56053L22012
16436A34453K6802j2144q9538p3072j88985N9614N7197P5627l4077K7027j83102
16425b00198j05786l8763P8154k7002P2255j73578j727L63190J68537j45480o6380
16414g6778p1600j67226J50770J67675J10232N4986K4586j04836j6022L1398j14209
16403a1024r6346p0757J67076j21291j10720K0447r1262j24780P3752J5941R2044
16392b56920R1687R0866n4726J28506l9983q2970r2161N9455J74452K24022N0097
$$ plain form
16381 292325 164120 222430 286440 112761 -64540 -161079 -184382 -162768 -158847 -181040 -213981
16370 -213981 -162077 -298984 -443524 -229256 -242552 -358284 -257854 -313555 -216103 -239694
16360 -239694 -271820 -376175 -319313 -22190 310660 343708 316720 390678 193878 -88891
16350 -88891 -199923 -88039 -387716 -376797 -446444 -481965 -219756 -279818 -432130 -210509
16340 -210509 51094 -10817 -180447 -342623 -398103 -328632 -190490 128227 61083 87631
16330 87631 140228 300627 200026 188456 94477 41653 -120538 -200907 -308686 -259844 -242898
16319 -242898 84178 224546 322030 205705 288874 417171 291917 107799 -62615 120921
16309 120921 182149 -4989 -259260 -442049 -161997 40462 83828 -31452 -273484 -502824
$$ packed form
16381B92325j28205N8310O4010j73679j77301r6539k3303K1614L921k2193l2941
16370b13981N1904j36907j44540K14268j3296j15732J00430n5701R7452k3591
16360b39694l2126j04355N6862K97123L32850L3048k6988P3958j96800k82769
16350h8891j11032J11884k99677J0919o9647l5521K62209o0062j52312K21621
16340b10509K61603o1911j69630j62176n5480O9471J38142L18717o7144K6548
16330H7631N2597J60399j00601j1570r3979n2824j62191q0369j07779M8842J6946
16319b42898L27076J40368R7484j16325Q3169J28297j25254j84118j70414J83536
16309A20921O1228j87138k54271j82789K80052K02459M3366j15280k42032k29340
$$ plain form
16299 -502824 -356812 -368142 -267539 -211103 -266228 -226921 -162721 -329081 -378668 -300797 -46760
16288 -46760 -12062 7904 69834 121763 245868 296241 256829 102408 98194 22436 -309535
16277 -309535 -475028 -469401 -240592 -124983 -155746 -61287 146135 300309 170670 -26780
16267 -26780 2295 -103688 58188 300594 112524 -138300 -226662 -392161 -353015 -355912 -135986
16256 -135986 -129095 -178128 -136662 -175024 -243075 -194356 -329343 -388043 -441485 -181030 -151588
16245 -151588 -79376 -209290 -106582 74850 217604 160017 -101668 -337422 -213403 -225799
16235 -225799 -148843 -107773 -201624 -165634 -56509 22078 94019 -6962 888 92852 -124917
16224 -124917 -245469 -281798 -314459 -95526 -3147 80304 123981 1074 -272856 -75480
$$ packed form
16299e02824J46012j1330J00603N6436n5125L9307O4200j66360m9587P7871K54037
16288d6760L4698J9966O1930N1929J24105N0373l9412j54421m214p5758l31971
16277c09535j65493N627K28809J15609l0763R4459K07422J54174j29639j97450
16267b6780K9075j05983J61876K42406j88070k50824q8362j65499L9146k897K19926
16256a35986O891m9033M1466l8362o8051M8719j34987n8700n3442K60455K9442
16245a51588P2212j29914J02708J81432J42754n7587k61685k35754J24019j2396
16235b25799P6956M1070r3851L5990J09125P8587P1941j00981P850R1964k17769
16224a24917j20552l6329l2661K18933R2379Q3451M3677j22907k73930J97376
$$ plain form
16214 -75480 -133598 54522 -95326 -137829 20541 50873 243651 346795 298898 -165834
16204 -165834 -234302 100249 77408 -180366 -136919 9049 92309 70408 -114538 -322182
16194 -322182 -491292 -564877 -394083 -386707 -282056 -63767 216853 240254 60053 -114608
16184 -114608 -39406 207801 103846 64749 70224 -5086 7299 50271 -103621 -197554 -82074
16173 -82074 -135623 -215099 -206030 -138037 -12870 -58935 -315575 -255797 -130504 -107872 -141211
16162 -141211 -164726 -206262 -119310 51967 114569 55169 -199021 -266402 -382334 -293678 -20605
16151 -20605 -162144 -238125 -93548 -69022 -76223 -144228 -32422 84858 164570 215878 238183
16140 238183 -66802 -192616 -101499 19271 242222 372193 219316 76870 -13608 24201
$$ packed form
16214g5480n8118J88120j49848m2503J58370L0332J92778J03144m7897m64732
16204a65834o8468L34551k2841k57774M3447J45968Q3260k1901j84946k07644
16194c22182j69110p3585J70794P376J04651K18289K80620K3401j80201j74661
16184a14608P5202K47207j03955l9097N475p5310J2385M2972j53892r3933J15480
16173h2074n3549p9476R069O7993J25167m6065k56640N9778J25293K2632l3339
16162a41211k3515m1536Q6952J71277O2602n9400k54190o7381j15932Q8656K73073
16151b0605j41539p5981J44577K4526p201o8005J11806J17280P9712N1308K2305
16140B38183l04985j25814R1117J20770K22951J29971j52877j42446r0478L7809
$$ plain form
16130 24201 -91403 -288403 -309891 -244941 -466173 -662773 -598334 -373879 -444151 -600752
16120 -600752 -387856 48203 474377 475396 407606 462499 462568 344139 234437 270966 369493
16109 369493 242799 114923 -16265 78710 167202 379096 435728 445533 367850 -24263 -156265
16098 -156265 -81057 -21944 -258046 -155779 -26083 -184334 -312787 -60347 10935 84473
16088 84473 101525 190789 215123 92197 164065 99710 -237734 -194538 -395925 -118722 3475
16077 3475 -170388 -195430 -102490 -42901 -209866 -210476 -171091 -107143 -122864 -108261 -305765 -461894
16065 -461894 -353798 -215646 -247626 -289976 -215237 -252157 -137519 -14057 -137175 -167638
16055 -167638 -111874 -70528 -165893 -79240 -78901 -114771 -119488 -81463 -84186 -335242 -139281 180470
$$ packed form
16130B4201j15604j97000k1488O4950k21232j96600O4439K24455p0272j56601
16120f00752K12896M36059M26174J019o7790N4893O9j18429j09702L6529R8527
16109C69493j26694j27876j31188R4975Q8492K11894N6632R805p7683l92113j32002
16098a56265P5208N9113k36102J02267J29696j58251j28453K52440P1282P3538
16088H4473J7052Q9264K4334j22926P1868o4355l37444M3196k01387K77203J22197
16077C475j73863k5042R2940N9589j66965o10L9385O3948j5721J4603j97504j56129
16065d61894J08096J38152l1980m2350P4739l6920J14638J23462j23118l0463
16055a67638N5764M1346r5365Q6653L39l5870m717L8025k723k51056J95961L19751
$$ plain form
16043 180470 399174 230761 86706 150960 135690 -45507 -229165 -99053 -27467 82960
16033 82960 334144 126229 -50858 131132 118324 90974 -8005 -272125 -389097 -172144
16023 -172144 -70660 -92248 52277 125543 -42224 -189823 -107848 56767 -18094 31732
16013 31732 142820 141221 90279 56633 142561 292750 254334 293823 152908 145479 939
16002 939 165044 478969 483464 407293 212226 49269 -47096 -90877 21079 66787 111732
15991 111732 95519 -102078 -365298 -287678 -290585 -488396 -635048 -555107 -693626 -419999
15981 -419999 -328617 -483451 -270102 99675 199102 369189 264144 191893 -77150 -125061
15971 -125061 -303681 -381224 -272007 -118694 109471 110023 104504 48480 -121396 -178839 -47187
$$ packed form
16043A80470K18704j68413j44055O4254j5270j81197j83658J30112P1586J10427
16033H2960K51184k07915j77087J81990j2808k7350r8979k64120j16972K16953
16023a72144J01484k1588J44525P3266j67767j47599Q1975J64615p4861M9826
16013C1732J11088j599n0942l3646Q5928J50189l8416L9489j40915p429j44540
16002I39J64105L13925M495p6171j95067j62957r6365m3781J11956M5708M4945
15991A11732j6213j97597k63220P7620k907j97811j46652P9941j38519K73627
15981d19999R1382j54834K13349L69777R9427J70087j05045p2251k69043m7911
15971a25061j78620p7543J09217J53313K28165N52n519n6024j69876n7443J31652
$$ plain form
15960 -47187 -2181 -80694 -187861 -69597 88839 117483 -20959 -100953 -106931 -265761 -488501
15949 -488501 -419325 -427612 -392196 -434502 -159068 -137052 -136108 -190022 -158761 -263080 -506275
15938 -506275 -413935 -269754 -241323 -475165 -413736 -324221 -233723 -282191 27074 210707 355635
15927 355635 248314 180555 208678 157007 247927 278398 400250 376444 94674 39413 8998
15916 8998 38005 -120407 -139529 -9399 6587 -211390 -367304 -144719 76059 -47008
15906 -47008 -132482 -79467 -99722 -253809 -162926 134175 -112825 -356534 -198135 14809
15896 14809 293885 55132 -80916 -9494 28289 125161 281597 177910 104665 -91273
15886 -91273 44773 170554 236951 233163 273543 274990 343879 152466 144515 -69691 -134228
$$ packed form
15960d7187M5006p8513j07167J18264J58436K8644j38442p9994n978j58830k22740
15949d88501O9176q287L5416m2306K75434K2016R44n3914L1261j04319k43195
15938e06275R2340J44181K8431k33842O1429Q9515R0498m8468L09265J83633J44928
15927C55635j07321o7759K8123n1671R0920L0471J21852k3806k81770n5261l0415
15916H998K9007j58412j9122J30130J5986k17977j55914K22585K20778j23067
15906d7008q5474N3015k0255j54087R0883K97101k47000k43709J58399K12944
15896A4809K79076k38753j36048P1422L7783R6872J56436j03687p3245j95938
15886i1273J36046J25781O6397l788M0380J447O8889j91413p951k14206o4537
$$ plain form
15875 -134228 -50842 -68950 164882 348262 217331 -130537 -211270 -268463 -142187 22289
15865 22289 187429 -15031 -199531 -160618 -105420 -100522 -163396 -59198 -18185 237859 270532
15854 270532 -19692 68722 362690 240747 311911 380077 481281 285417 9977 138430
15844 138430 201163 -68103 -266165 -416401 -464530 -552731 -205908 202167 395102 277211
15834 277211 350940 219101 230621 -14011 -197984 -361355 -426817 -320448 -166780 -57045
15824 -57045 21710 98445 -7193 138113 -84727 -185755 -77916 122365 160336 192932
15814 192932 199882 311383 91162 -108459 -108688 -62513 -52945 99983 85235 136124 385778
15803 385778 304125 100051 143522 -132516 -183901 -151418 -232449 -117824 -74975 -205095 -262891
$$ packed form
15875a34228Q3386j8108K33832J83380j30931l47868q0733n7193J26276J64476
15865B2289J65140k02460j84500L8913N5198M898o2874J04198M1013K56044L2673
15854B70532k90224Q8414K93968j21943P1164O8166J01204j95864k75440J28453
15844A38430O2733k69266j98062j50236m8129q8201L46823M08075J92935j17891
15834B77211P3729j31839J1520k44632j83973j63371o5462J06369J53668J09735
15824e7045P8755P6735j05638J45306k22840j01028J07839K00281L7971L2596
15814A92932O950J11501k20221j99621k29M6175R568J52928j4748N0889K49654
15803C85778q1653k04074M3471k76038n1385L2483q1031J14625M2849j30120n7796
$$ plain form
15792 -262891 -158115 269188 472873 278033 178038 -93741 -315047 -85228 155434 250604
15782 250604 14810 -395899 -433292 -266200 -234175 -225905 219545 486746 386199 313713
15772 313713 66490 -246652 -373464 -205762 -53491 77023 198334 106150 -228106 -196246
15762 -196246 -93368 7004 54251 -110691 -53836 119316 127669 1473 -212450 -160610
15752 -160610 -192044 -93992 144088 45445 -7937 -277015 -159019 -250348 -253881 -115018 139821
15741 139821 282177 404529 227566 -39124 -150767 -211865 -117433 -112989 -162033 -50657
15731 -50657 -106322 10131 6000 -80641 -331497 -306712 -508471 -194732 37012 -6685 173257
15720 173257 24769 48535 -109778 -158005 34677 195391 46460 164421 -3457 -11044
$$ packed form
15792b62891J04776M27303K03685j94840r9995k71779k21306K29819K40662R5170
15782B50604k35794m10709l7393J67092L2025Q270M45450K67201j00547p2486
15772C13713k47223l13142j26812J67702J52271J30514J21311r2184l34256L1860
15762a96246J02878J00372M7247j64942N6855J73152Q353j26196k13923N1840
15752a60610l1434R8052K38080r8643n3382k69078J17996r1329l533J38863K54839
15741A39821J42356J22352j76963k66690j11643o1098R4432M444m9044J11376
15731e0657n5665J16453m131q6641k50856K4785k01759L13739K31744m3697J79942
15720A73257j48488K3766j58313m8227J92682J60714j48931J17961j67878p587
$$ plain form
15710 -11044 57489 79940 -15198 11360 -38947 -150693 -77743 10996 9534 66209 -34859
15699 -34859 -62621 -24802 -61529 -48423 94749 77384 -99679 -192976 -88635 2703 176555
15688 176555 69593 -35986 -131155 -29421 -31282 -169314 -184579 156806 214534 241940 223942
15677 223942 337870 381549 259119 86519 100022 269395 166652 196150 171476 105123
15667 105123 -10724 203448 348093 403472 291199 358532 257862 177087 225306 214312
15657 214312 330634 239039 176835 78281 174629 372625 452824 320202 351579 284509 208708
15646 208708 74426 -162418 -254653 -47277 123162 -90881 -151661 -95040 -148959 -167460
15636 -167460 -47986 141878 137152 -103800 -18362 113488 182300 82274 -136122 -153162
$$ packed form
15710a1044O8533K2451r5138K6558n0307j11746P2950Q8739j462N6675j01068
15699c4859k7762L7819l6727J3106J43172j7365j77063r3297J04341R1338J73852
15688A76555j06962j05579r5169J01734j861j38032j5265L41385N7728K7406j7998
15677B23942J13928M3679j22430j72600J3503J69373j02743K9498k4674o6353
15667A05123j15847K14172J44645N5379j12273O7333j00670q0775M8219j0994
15657B14312J16322r1595o2204r8554R6348J97996Q0199j32622L1377o7070p5801
15646B08708j34282k36844r2235K07376J70439k14043o0780N6621n3919j8501
15636a67460J19474J89864m726k40952Q5438J31850O8812j00026k18396j7040
$$ plain form
15626 -153162 -307228 -106126 68338 -10191 -250823 -9932 172533 241714 196028 161103
15616 161103 -69955 -192989 -129331 -93785 -406924 -723579 -568239 -211366 -34311 3361
15606 3361 119196 36398 -13545 131389 255206 273676 243519 2548 33222 15379 -102681
15595 -102681 -70946 128970 266977 469384 600964 604559 256474 7754 -13259 149858
15585 149858 63172 -144313 -262322 -216312 -344913 -468902 -229565 -139387 -18634 -12253
15575 -12253 -74202 -93095 -187298 -187654 -38819 59340 -84220 -190128 -277505 -333124 -190809
15564 -190809 -185382 -264327 -342430 -171950 216253 362604 325674 345110 311112 106358 -169763
15553 -169763 -25544 144770 -1378 -260482 -75817 17866 -65645 -211782 -158385 -235572
$$ packed form
15626a53162j54066K01102J74464p8529k40632K40891J82465O9181m5686l4925
15616A61103k31058j23034O3658L5546l13139l16655J55340L56873J77055L7672
15606C361J15835q2798m9943J44934J23817J8470l0157k40971L0674j7843j18060
15595a02681L1735J99916J38007K02407J31580L595l48085k48720k1013J63117
15585A49858q6686k07485j18009M6010j28601j23989K39337R0178J20753O381
15575a2253o1949j8893r4203l56J48835R8159j43560j05908q7377n5619J42315
15564a90809N427p8945p8103J70480L88203J46351l6930J9436l3998k04754k76121
15553a69763J44219J70314j46148k59104J84665R3683q3511j46137N3397p7187
$$ plain form
15543 -235572 -224008 -178926 -59998 47713 191546 4096 -152497 -173845 -207758 -324247
15533 -324247 -217199 -124927 -302131 -341464 -246225 -171869 -82879 29063 60692 117584 309690
15522 309690 321532 411121 402769 160040 -113019 -227401 -78568 18587 -151123 -205631 -150684
15511 -150684 40034 152752 111122 -209971 -114184 5183 -131336 -133792 47814 -23880
15501 -23880 -81733 -30235 32203 -45588 -95215 -19572 -95098 -147140 -85775 53938 109464
15490 109464 71493 23049 149625 10262 -307490 -708290 -577485 -255663 -180908 103144
15480 103144 195295 169627 47562 -18222 28022 213879 220953 183505 36237 -178559 -312615
15469 -312615 -359827 -206168 26338 165536 245366 192300 5717 -60316 1601 -43904 -50727
$$ packed form
15543b35572J1564M5082J18928J07711J43833j87450j56593k1348l3913j16489
15533c24247J07048R2272j77204l9333R5239P4356Q8990J11942L1629N6892J92106
15522C09690J1842Q9589q352k42729k73059j14382J48833R7155j69710n4508N4947
15511a50684J90718J12718m1630l21093R5787J19367j36519k456J81606p1694
15501b3880n7853N1498O2438p7791m9627P5643p5526n2042O1365J39713N5526
15490A09464l7971m8444J26576j39363l17752m00800J30805L21822P4755K84052
15480A03144R2151k5668j22065o5784M6244J85857P074l7448j47268k14796j34056
15469c12615m7212J53659K32506J39198P9830n3066j86583o6033O1917m5505o823
$$ plain form
15458 -50727 122397 273206 217592 51649 -163515 -162736 20653 205269 245315 198062 40191
15447 40191 -35523 -49145 -202342 -156058 -7102 190088 389764 368111 198149 337306
15437 337306 211121 275248 362586 319889 233630 120660 202398 99283 14539 -109347 -17276
15426 -17276 -132743 -209711 -162443 -229073 -158896 -24078 70609 145866 104319 27244 129643
15415 129643 158742 312193 555963 485465 310777 62025 -53238 37356 88407 226388
15405 226388 33164 -55020 -109146 -80879 95791 25597 -50189 76016 33787 -16147 -98200
15394 -98200 -41031 213878 300897 108681 -192429 -198787 -78201 -92621 61413 31384 -76172
15383 -76172 39696 190917 66643 30006 114742 15662 -108632 60198 196897 20076
$$ packed form
15458e0727J73124J50809n5614j65943k15164P79J83389J84616M0046m7253j57871
15447D0191p5714j3622j53197M6284J48956J97190J99676k1653j69962J39157
15437C37306j26185O4127Q7338m2697q6259j12970Q1738j03115q4744j23886R2071
15426a7276j15467p6968M7268o6630P0177J34818R4687P5257m1547p7075J02399
15415A29643K9099J53451K43770p0498j74688k48752j15263R0594N1051J37981
15405B26388j93224q8184n4126K8267J76670p0194p5786J26205m2229m9934q2053
15394i8200N7169K54909Q7019j92216l01110o358J20586j4420J54034l0029j07556
15383g6172J15868J51221j24274l6637Q4736r9080j24294J68830J36699j76821
$$ plain form
15373 20076 -61996 -10613 24191 117661 81281 34943 65475 85797 30383 93931 -49450
15362 -49450 -165869 -4942 -164943 -203788 -169966 -100217 -27177 -79936 -73021 28252 188731
15351 188731 250538 12255 -45404 -68175 -181841 -272703 -165126 -100799 -237002 -70262
15341 -70262 -18328 82375 30800 -19898 -33343 169193 326492 136214 32684 -57298 -192531
15330 -192531 -66050 -205814 -359950 -397211 -235667 24046 32857 287081 138004 -226212
15320 -226212 -62201 91436 -51328 -108534 -94223 112429 22929 -75479 -50775 171646
15310 171646 111061 -99424 -118706 -152239 -257841 -410697 -468460 -438131 -450117 -321696 -171868
15299 -171868 -224651 -158058 -99688 -134140 -138718 -261186 -138256 -141320 89387 176462 41970
$$ packed form
15373B0076q2072N1383L4804R3470l6380m6338L0532K0322n5414O3548j43381
15362d9450j16419J60927j60001l8845L3822O9749P3040n2759O915J01273J60479
15351A88731O1807k38283n7659k2771j13666r0862J07577O4327j36203J66740
15341g0262N1934J00703n1575n0698j3445K02536J57299j90278j03530q9982j35233
15330a92531J26481j39764j54136l7261J61544K59713Q811K54224j49077l64216
15320b26212J64011J53637j42764n7206J4311K06652q9500r8408K4704K22421
15310A71646o0585k10485j9282l3533j05602j52856n7763L0329j1986J28421J49828
15299a71868n2783O6593N8370l4452m578j22468J22930l064K30707Q7075j34492
$$ plain form
15288 41970 -163500 -284414 -267747 -420576 -424154 -561696 -618957 -520415 -318915 -298124 -345524
15277 -345524 -314572 -369707 -268662 -334431 -273419 -214692 -162991 -164721 -91874 -199340 -231921
15266 -231921 -284912 -98625 26327 89480 29627 -32097 -131482 -152938 -132957 -140223 -263588
15255 -263588 -233422 -5148 -42908 11062 39211 -236365 -348167 -274898 40115 194969
15245 194969 237179 156727 146663 155064 28543 -26733 126601 19692 -248603 -387102 -379105
15234 -379105 -238634 -351308 -155666 240214 321702 118569 -47721 -275916 -509105 -271996
15224 -271996 -43574 76700 299932 186537 -13136 3605 42321 112740 314143 274323
15214 274323 263441 263460 288212 354041 165347 346287 304330 249213 56388 -103989 18761
$$ packed form
15288D1970k05470j20914J6667j52829l578j37542n7261R8542K01500K0791m7400
15277c45524L0952n5135J01045o5769O1012N8727N1701j730P2847j07466l2581
15266b31921n2991J86287J24952O3153n9853o1724r9385k1456J9981p266j23365
15255b63588L0166K28274l7760N3970K8149k75576j11802P3269L15013J54854
15245A94969M2210q0452j0064Q401j26521n5276J53334j06909k68295j38499P997
15234c79105J40471j12674J95642L95880Q1488k03133j66290k28195k33189K37109
15224b71996K28422J20274K23232j13395j99673J6741L8716P0419K01403l9820
15214B74323j0882J9K4752O5829j88694J80940m1957n5117j92825j60377J22750
$$ plain form
15203 18761 104613 250404 343062 119930 113946 223329 60760 -166363 -297214 14769
15193 14769 4347 -282650 -157583 163899 96187 -124234 -13689 41097 92078 23086 -147371
15182 -147371 -66062 -21903 -209635 -361263 -270156 -56817 -80307 -183358 -226430 -63363
15172 -63363 -190513 -137193 980 -134042 -243526 -110149 183253 124735 -48190 -241197
15162 -241197 -354047 -127022 7937 -52472 24187 359707 555138 237004 67660 81990
15152 81990 40606 -38384 -135153 126154 371466 203241 190360 302277 252055 3658 -60298
15141 -60298 -83250 -204075 -264035 -223542 -260740 -377078 -337455 -258389 -521174 -747314 -535602
15130 -535602 -209941 58922 45654 -128963 -178331 -61984 -89491 -270884 -335587 -462232
$$ packed form
15203A8761Q5852J45791R2658k23132n984J09383j62569k27123j30851L11983
15193A4769j0422k86997J25067L21482o7712k20421J10545N4786N0981o8992j70457
15182a47371Q1309M4159j87732j51628R1107K13339k3490j03051m3072J63067
15172f3363j27150N3320J38173j35022j09484J33377K93402n8518j72925j93007
15162b41197j12850K27025J34959o0409P6659L35520J95431l18134j69344J4330
15152H1990m1384p8990r6769K61307K45312j68225j2881J11917n0222k48397o3956
15141f0298k2952j20825n9960M0493l7198j16338L9623P9066k62785k26140K11712
15130e35602L25661K68863j3268j74617m9368J16347k7507j81393o4703j26645
$$ plain form
15120 -462232 -553093 -576753 -463714 -561681 -545383 -514760 -274476 -93213 -43608 102171 239235
15109 239235 238000 223363 187206 -10309 -61472 -199483 -198830 -119378 -290656 -210329 -216659 -99819
15097 -99819 -165173 -110191 -166571 -266191 -393899 -223219 -255693 -82207 282545 545281 643614
15086 643614 835143 729081 496882 580581 661039 598817 304601 103750 232800 122640
15076 122640 -21368 -8250 7247 -38808 -9266 -232947 -222040 -91919 -54883 -290246 -242670
15065 -242670 27841 131578 21339 1161 -122572 -292732 -362601 -275878 -131376 100947
15055 100947 81064 30233 26109 345915 498222 379204 222859 268547 244208 14532 -138105
15044 -138105 -234439 -320656 -253818 -154577 -249619 -225272 -287256 -355725 -383616 -520527 -414522
$$ packed form
15120d62232r0861k3660J13039r7967J6298L0623K40284J81263M9605J45779J37064
15109B39235j235j4637l6157j97515n1163j38011O53P9452j71278Q0327o330J16840
15097i9819o5354N4982n6380r9620j27708J70680l2474J73486L64752K62736R8333
15086F43614J91529j06062k32199Q3699Q0458o2222k94216k00851J29050j10160
15076A22640j44008J3118J5497m6055K9542k23681J0907J30121L7036k35363M7576
15065b42670K70511J03737j10239k0178j23733j70160o9869Q6723J44502K32323
15055A00947j9883n0831m124L19806J52307j19018j56345M5688k4339k29676j52637
15044a38105r6334q6217O6838R9241r5042K4347o1984o8469k7891j36911J06005
$$ plain form
15033 -414522 91753 354237 439818 515082 371040 268284 54343 -269324 -425343 -453069
15023 -453069 -284593 -238403 -216595 -318934 -283708 -253705 -368837 -217732 8196 254262
15013 254262 182198 -36987 -174254 -123941 129791 109378 -39667 -32932 15919 144753 -42787
15002 -42787 -100433 -82126 46998 43010 -256824 -323044 -180434 -4729 -28062 -60034 -129940
14991 -129940 -250423 -223874 -239119 -290016 -77490 -26406 -293932 -282843 -181271 -249905 -526561
14980 -526561 -546919 -395602 -242235 -265517 -344091 -534076 -531722 -398660 -203506 -318355
14970 -318355 -286785 -283710 -196692 -17558 83655 21846 -51984 7138 104460 143743 89002
14959 89002 120581 86712 376076 128521 -57438 122006 -88582 -235449 -66178 76192
$$ packed form
15033d14522N06275K62484Q5581P5264j44042j02756k13941l23667j56019k7726
15023d53069J68476M6190K1808j02339L5226L0003j15132J51105K25928K46066
15013B54262p2064k19185j37267N0313K53732k0413j49045O735M8851J28834j87540
15002d2787n7646J8307J29124l988k99834o6220J42610J75705k3333l1972o9906
14991a29940j20483K6549j5245n0897K12526N1084k67526J1089J01572o8634k76656
14980e26561k0358J51317J53367k3282p8574j89985K354J33062J95154j14849
14970c18355L1570L075Q7018J79134J01213o1809p3830N9122R7322L9283n4741
14959H9002L1579l3869K89364k47555j85959J79444k10588j46867J69271J42370
$$ plain form
14949 76192 176715 300209 407951 181393 76052 -23489 52533 199081 218445 230837
14939 230837 32581 -185447 61354 156375 270117 440588 449010 165293 84239 111315
14929 111315 44984 14361 -77043 -147531 81582 106303 27145 -168220 -161627 -11548 17403
14918 17403 86328 59426 265704 386989 444801 547202 457163 91702 -48049 128361
14908 128361 183236 124420 -4354 -229417 -374323 -595811 -408193 -75220 78512 127493
14898 127493 97591 -56041 -205992 -422949 -483697 -148219 223071 154644 61485 101371
14888 101371 30479 -44848 158464 173118 265067 139512 100873 101729 -216282 -480639 -546419
14877 -546419 -410368 -281271 -236906 -265282 -95379 19882 228816 433558 382238 156464
$$ packed form
14949G6192J00523J23494J07742k26558j05341r9541P6022J46548J9364J2392
14939B30837j98256k18028K46801R5021J13742J70471Q422k83717q1054K7076
14929A11315o6331l0623r1404p0488K29113K4721p9158j95365O593J50079K8951
14918A7403O8925k6902K06278J21285N7812J02401r0039l65461j39751J76410
14908A28361N4875n8816j28774k25063j44906k21488J87618L32973J53732M8981
14898A27493k9902j53632j49951k16957o0748L35478L71290o8427r3159L9886
14888A01371p0892p5327K03312J4654R1949j25555l8639Q56l18011k64357o5780
14877e46419J36051J29097M4365k8376J69903J15261K08934K04742n1320k25774
$$ plain form
14867 156464 32528 18058 -162226 -471492 -544254 -280643 -226554 -202678 95972 400278
14857 400278 234578 50317 -115405 -171011 -322696 -225272 -180322 -225901 -170856 -57153
14847 -57153 4453 -155851 -4128 218823 33297 -66149 -4747 51216 -37480 -166142 -88731
14836 -88731 149262 -201848 -428886 -236297 -174196 -299485 -334072 -193866 -151454 -158146 -232899
14825 -232899 -217561 -220452 -207236 -118440 -55093 -237117 -108720 36786 -131857 -111329 -15609
14814 -15609 141866 490059 375087 47953 -44437 209606 205494 207696 160888 236589 147556
14803 147556 85636 249820 99524 128180 296669 329275 -63636 -6892 -42781 -86891 -100180
14792 -100180 209115 241242 -125276 -71098 -109865 87957 -56922 -272723 -113088 48413
$$ packed form
14867A56464j23936j4470j80284l09266p2762K63611N4089K3876K98650L04306
14857D00278j65700j84261j65722n5606j51685R7424M4950m5579N5045J13703
14847e7153O1606j60304J51723K22951j85526r9446O1402N5963q8696j28662P7411
14836h8731K37993l51110k27038J92589O2101j25289l4587J40206M2412o692p4753
14825b32899J5338k891J3216Q8796O3347j82024J28397J45506j68643K0528R5720
14814a5609J57475L48193j14972l27134r2390K54043m112K202m6808P5701q9033
14803A47556o1920J64184j50296K8656J68489L2606l92911N6744l5889m4110j3289
14792a00180L09295L2127l66518N4178l8767J97822j44879k15801J59635J61501
$$ plain form
14782 48413 -8651 58824 -231647 -288120 -337287 -472568 -365047 -328496 -295984 -26257 32522
14771 32522 -219991 -425405 -328966 -139632 154758 597266 814010 785257 289754 13596
14761 13596 102339 82961 13968 -84631 3236 -130734 9862 -73684 -165165 -295644 -468627
14750 -468627 -548996 -364070 -191730 -17065 285515 193097 -87658 47647 186916 261972
14740 261972 174927 180768 127131 124408 184905 160077 196185 56826 196088 185643 286745
14729 286745 132258 -101868 -114136 6285 -257331 -190505 -105495 -121154 -105135 -280535
14719 -280535 -344985 68936 176353 186287 296616 292212 382130 484900 308733 55710 -118090
14708 -118090 6260 391051 331777 18267 -14863 -37192 64305 179480 -97759 -390279
$$ packed form
14782D8413n7064O7475k90471n6473m9167j35281J07521L6551L2512K69727N8779
14771C2522k52513k05414R6439J89334K94390M42508K16744k8753m95503k76158
14761A3596Q8743j9378o8993r8599Q7867j33970J40596q3546r1481j30479j72983
14750d68627q0369J84926J72340J74665L02580r2418k80755J35305J39269P5056
14740B61972q7045N841n3637k723O0497k4828L6108j39359J39262j0445J01102
14729B86745j54487k34126j2268J20421k63616O6826Q5010j5659J6019j75400
14719b80535o4450M13921J07417R934J10329m404Q9918J02770j76167k53023j73800
14708a18090J24350L84791n9274l13510l3130k2329J01497J15175k77239k92520
$$ plain form
14698 -390279 -299105 -151163 -7146 -48622 -235791 -236346 -313821 -114268 176800 297272 205711
14687 205711 192688 195431 56094 4818 -53687 -150771 -172764 2436 150526 99320 46257
14676 46257 61529 215726 246503 205086 -119400 -172370 -209148 -177701 -100432 109630 274275
14665 274275 246934 207382 233818 219989 82841 28203 59547 -124802 -98343 -132411 -216217
14654 -216217 -179436 -23891 60709 -15705 -283112 -258335 -211364 -43388 86293 162360 127344
14643 127344 74020 -2341 24649 79893 127726 -14063 147328 381350 592742 357981
14633 357981 24991 27727 124811 90653 67838 147609 247910 266713 382075 254008 -44139
14622 -44139 -140346 -171150 -6962 24368 297429 301806 283919 109918 -119956 172386 155290
$$ packed form
14698c90279R1174J47942J44017m1476j87169n55p7475J99553K91068J20472r1561
14687B05711j3023K743j39337n1276n8505r7084k1993J75200J48090n1206n3063
14676D6257J5272J54197L0777m1417l24486n2970l6778L1447P7269K10062J64645
14665B74275k7341l9552K6436j3829j37148n4638L1344j84349K6459l4068q3806
14654b16217L6781J55545Q4600p6414k67407K4777M6971J67976J29681P6067l5016
14643A27344n3324p6361K6990N5244M7833j41789J61391K34022K11392k34761
14633C57981l32990K736R7084l4158k2815P9771J00301J8803J15362j28067k98147
14622d4139r6207l0804J64188L1330K73061M377j7887j74001k29874K92342j7096
$$ plain form
14611 155290 66665 79206 302143 357318 -73111 -115623 -234033 -301159 -26683 -187020
14601 -187020 -181321 -376383 -401194 -411138 -271355 -165416 -88403 -175340 -43266 147869 -60717
14590 -60717 -172674 -160477 -216102 36191 189029 105967 163492 166857 -5470 13957 -33463
14579 -33463 -128680 -253086 -95265 -121409 69440 -101414 -124363 -427147 -337720 26580
14569 26580 100411 113713 138788 90390 -97054 -89556 106712 193413 71817 12199 14125
14558 14125 -51442 -191288 -352558 -425141 -334560 -139798 -44042 70101 94066 317101 322460
14547 322460 301783 337380 409514 267442 240821 184908 247716 438002 203470 8681 -61807
14536 -61807 4231 203950 430540 396270 156995 244201 127981 86876 -23558 76670
$$ packed form
14611A55290q8625J2541K22937N5175m30429m2512j18410o7126K74476j60337
14601a87020N699j95062k4811r944J39783J05939P7013q6937J32074J91135k08586
14590f0717j11957J2197n5625K52293J52838q3062N7525L365j72327J9427m7420
14579c3463r5217j24406J57821k6144J90849j70854k2949l02784Q9427L64300
14569B6580P3831J3302K5075m8398j87444P498J96268Q6701j21596n9618J926
14558A4125o5567j39846j61270p2583R0581J94762R5756J14143K3965K23035N359
14547C22460k0677L5597P2134j42072k6621n5913O2808J90286k34532j94789p0488
14536f1807O6038J99719K26590l4270k39275Q7206j16220m1105j10434J00228
$$ plain form
14526 76670 183225 235006 90233 129061 349200 226777 188498 96247 93634 -94975 -294528
14515 -294528 -263259 -229469 -91790 -20594 -64368 140742 210501 397036 282933 173700
14505 173700 189292 278420 318800 243236 72555 72786 175517 329475 204430 191173 110792
14494 110792 22564 -30841 152221 112607 -15670 -76539 -210601 -88604 -120678 -213380 -364214
14483 -364214 -239295 -123126 -42426 229757 276855 292657 254127 133710 86816 76512 62328
14472 62328 -26286 -147290 -258715 -137994 305110 671567 350439 -111507 -294772 -189382
14462 -189382 126448 180759 188865 25499 -209890 -294705 -190896 52472 -174349 -367471
14452 -367471 -428018 -327804 -89094 72600 101087 21897 -70836 -243508 -287127 -390214
$$ packed form
14526G6670J06555N1781j44773L8828K20139j22423l8279r2251k613j88609j99553
14515b94528L1269L3790J37679P1196m3774K05110O9759J86535j14103j09233
14505A73700J5592Q9128M0380p5564j70681K31J02731J53958j25045j3257q0381
14494A10792q8228n3405J83062l9614j28277o0869j34062J21997l2074r2702j50834
14483c64214J24919J16169Q0700K72183M7098J5802l8530j20417m6894j0304j4184
14472F2328q8614j21004j11425J20721M43104L66457l21128m61946j83265J05390
14462a89382L15830N4311Q106j63366k35389q4815J03809K43368k26821j93122
14452c67471o0547J00214K38710J61694K8487p9190r2733j72672m3619j03087
$$ plain form
14442 -390214 -326461 -302934 -107217 -103065 -130337 52287 332087 328902 20261 -59002 21889
14431 21889 -76157 -9799 -68829 -135803 -114968 -15987 80233 -8447 -59760 -106550 -98205 66365
14419 66365 124818 -42685 -53500 -179022 -273173 -170690 104103 27913 -156929 -117438 -16787
14408 -16787 299797 157785 23821 -3088 27449 -128410 -310203 -352859 -108368 175912
14398 175912 293256 52418 -60761 83727 144049 57269 116121 86571 263086 283821
14388 283821 61354 -2906 -103163 21614 35403 -240545 -287788 -147229 -229650 -192968
14378 -192968 -147164 -306655 -279587 -249884 -214590 -216981 -275420 -483960 -575636 -301711 70514
14367 70514 -17982 -145407 164116 275554 271418 236230 13489 11687 38500 17607 90838
$$ packed form
14442c90214O3753K3527J95717M152k7272J82624K79800l185l08641p9263Q0891
14431B1889r8046O6358n9030o6974K0835R8981R6220q8680n1313m6790Q345J64570
14419F6365N8453j67503j0815j25522r4151J02483K74793p6190j84842L9491J00651
14408a6787L16584j42012j33964k6909L0537j55859j81793m2656K44491K84280
14398A75912J17344k40838j13179J44488O0322q6780N8852k9550J76515K0735
14388B83821k22467o4260j00257J24777J3789k75948m7243J40559q2421L6682
14378a92968M5804j59491K7068K9703L5294k391n8439k08540r1676K73925L72225
14367G0514q8496j27425L09523J11438m136l5188k22741j802K6813k0893P3231
$$ plain form
14356 90838 388945 329695 -134280 -375000 -206813 91998 153086 471784 738701 466856
14346 466856 474949 567128 364276 258249 214119 19790 -8801 113162 -66492 -129252 -75847
14335 -75847 87223 138839 449670 367378 378586 276677 96235 136115 175060 -49491 -239837
14324 -239837 -116476 -3728 -119521 -117369 -124656 -142549 -348917 -322882 -363378 -264157 -149918
14313 -149918 -163913 24786 331244 215939 378418 371233 223083 258540 145102 63198
14303 63198 -137659 -203297 67580 242376 169769 102633 16501 -390016 -215030 -97283
14293 -97283 -104129 -49766 -148670 -173334 -33349 155719 -22955 -266075 -278540 -174636 -319750
14282 -319750 -309053 -57744 25786 -41602 -14097 120904 39881 -126948 -287513 -225163 -323944
$$ packed form
14356I0838K98107n9250m63975k40720J68187K98811O1088L18698K66917k71845
14346D66856Q093R2179k02852j06027m4130j94329k8591J21963j79654o2760N3405
14335g5847J63070N1616L10831q2292J1208j01909j80442L9880L8945k24551j90346
14324b39837J23361J12748j15793K152p287j7893k06368K6035m0496R9221J14239
14313a49918j3995J88699L06458j15305J62479p185j48150L5457j13438q1904
14303F3198k00857o5638K70877J74796p2607o7136q6132m06517J74986J17747
14293i7283o846N4363r8904k4664J39985J89068j78674k43120j2465J03904j45114
14282c19750J0697K51309Q3530o7388K7505J35001q1023j66829j60565O2350r8781
$$ plain form
14271 -323944 -542720 -317578 -293096 -406176 -167909 71221 7435 -50902 -161525 -182079
14261 -182079 -70377 -95722 116388 115408 144450 149642 35856 -83939 -133680 -185279 -249473
14250 -249473 -132417 55817 31527 -270096 -552203 -412706 -354124 -285152 -202028 -186794
14240 -186794 -91954 -52483 -33975 21243 184203 180891 176531 221569 -13948 -149058 -332875
14229 -332875 -346249 -303343 -275137 -30777 12897 49557 187786 265753 145245 -44020 55193
14218 55193 -125116 -203415 -55935 238844 203783 740 -1161 64900 88751 4502 29492
14207 29492 115595 140894 112836 5197 -174868 -194989 -275843 -200317 -215412 -281556 -137826
14196 -137826 150313 74693 53031 101085 -71460 -110204 -188224 -230787 -283659 -305730 -328774
$$ packed form
14271c23944k18776K25142K4482j13080K38267K39130o3786n8337j10623k0554
14261a82079J11702k5345K12110r80K9042N192j13786j19795m9741n1599o4194
14250b49473J17056J88234k4290l01623k82107J39497N8582O8972Q3124J5234
14240a86794R4840L9471J8508N5218J62960l312m360M5038k35517j35110j83817
14229c32875j3374M2906K8206K44360M3674L6660J38229P7967j20508j89265R9213
14218E5193j80309p8299J47480K94779l5061k03043j901O6061K3851q4249K4990
14207B9492Q6103K5299k8058j07639j80065k0121q0854P5526j5095o6144J43730
14196a37826K88139p5620k1662M8054j72545l8744p8020m2563n2872k2071k3044
$$ plain form
14185 -328774 -213547 -59247 -103712 135896 131484 -15037 4815 8396 -986 -185250 -159600
$$ packed form
14185c28774J15227J54300m4465K39608m412j46521J9852L581r382j84264K5650
$$ [...]
##END NTUPLES=NMR SPECTRUM
##END=
