##TITLE=Analysis number 327958
Compound Code cc 38009
Book Reference 423/142/4
Project Code adrs
Chemist Name bruced
##JCAMPDX= 6.0         $$ Bruker NMR JCAMP-DX V2.0
##DATA TYPE= NMR SPECTRUM
##DATA CLASS= NTUPLES
##ORIGIN= Bruker BioSpin GmbH
##OWNER= nmr
$$ XWIN-NMR		Version 3.5
$$ Mon Apr 23 10:43:04 2007 GMT Daylight Time (UT+1h)  MAYBRIDGE\nmr@NMR_250MHZ
##.OBSERVE FREQUENCY= 250.131544655141
##.OBSERVE NUCLEUS= ^1H
##.ACQUISITION MODE= SIMULTANEOUS (DQD)
##.ACQUISITION SCHEME= undefined
##.AVERAGES= 16
##.DIGITISER RES= 18
##SPECTROMETER/DATA SYSTEM= dpx250
##.PULSE SEQUENCE= zg30
##.SOLVENT NAME= CDCl3
##.SHIFT REFERENCE= (INTERNAL, CDCl3, 0, 16.522)
##AUDIT TRAIL= $$ (NUMBER, WHEN, WHO, WHERE, WHAT)
$$ ##TITLE= Audit trail, XWIN-NMR		Version 3.5
$$ ##JCAMPDX= 5.01
$$ ##ORIGIN= Bruker BioSpin GmbH
$$ ##OWNER= nmr
$$ C:\u/data/dgb/nmr/ADRS/1800/pdata/1/auditp.txt
$$ ##AUDIT TRAIL=  $$ (NUMBER, WHEN, WHO, WHERE, WHAT)
(   1,<2007-04-23 10:42:10.70 +100>,<MAYBRIDGE\nmr>,<NMR_250MHZ>,
      <created by zg, POWCHK disabled, PULCHK disabled
       configuration hash MD5:
       49 4B E0 1D 92 C2 6B 37 9F E6 65 BC 52 41 86 1D
       data hash MD5: 64K
       82 84 E9 40 9F 0B DB 42 C9 8E 27 EF 65 5D DE 4B>)
(   2,<2007-04-23 10:42:29.11 +100>,<MAYBRIDGE\nmr>,<NMR_250MHZ>,
      <Start of raw data processing
       ef LB = 0.3 FT_mod = 6 PKNL = 1 SI = 32K 
       data hash MD5: 32K
       91 77 AB 9A 60 F5 DD 25 84 CE A7 30 F3 8C C6 08>)
(   3,<2007-04-23 10:42:33.47 +100>,<MAYBRIDGE\nmr>,<NMR_250MHZ>,
      <apk 
       data hash MD5: 32K
       D5 5B F7 2B 85 00 E8 2C 6A DD 9C B6 94 F6 8F 47>)
(   4,<2007-04-23 10:42:35.00 +100>,<MAYBRIDGE\nmr>,<NMR_250MHZ>,
      <abs ABSG = 5 
       data hash MD5: 32K
       80 C9 51 51 C5 DC D1 BB A5 F3 CD CC 2F 59 87 A9>)
$$ ##END=
$$ 
$$ hash MD5
$$ 99 FF 0B 07 21 A9 85 F2 49 DC F2 E7 36 EE 1D 77
##$RELAX= 
##$RELAX= 
##$RELAX= 
##$RELAX= 
##$RELAX= 
##$RELAX= 
##$RELAX= 
$$ Bruker specific parameters
$$ --------------------------
##$DU= <C:\u>
##$EXPNO= 1800
##$NAME= <ADRS>
##$PROCNO= 1
##$TYPE= <nmr>
##$USER= <dgb>
##$AMP= (0..31)
100 100 100 100 100 100 100 100 100 100 100 100 100 100 100 100 100 100 
100 100 100 100 100 100 100 100 100 100 100 100 100 100 
##$AQSEQ= 0
##$AQ_mod= 3
##$AUNM= <au_zg>
##$AUTOPOS= <9 >
##$BF1= 250.13
##$BF2= 250.13
##$BF3= 250.13
##$BF4= 250.13
##$BF5= 500.13
##$BF6= 500.13
##$BF7= 500.13
##$BF8= 500.13
##$BYTORDA= 1
##$CFDGTYP= 0
##$CFRGTYP= 5
##$CHEMSTR= <none>
##$CNST= (0..31)
1 1 145 1 1 1 1 1 1 1 1 1 1 1 1 1 1 1 1 1 1 1 1 1 1 1 1 1 1 1 1 1 
##$CPDPRG= <>
##$CPDPRG1= <>
##$CPDPRG2= <>
##$CPDPRG3= <>
##$CPDPRG4= <mlev>
##$CPDPRG5= <mlev>
##$CPDPRG6= <mlev>
##$CPDPRG7= <mlev>
##$CPDPRG8= <mlev>
##$CPDPRGB= <>
##$CPDPRGT= <>
##$D= (0..31)
0 1 0 0 0 0 0 0 0 0.06 0 0 0 0 0 0 0.0002 0 0 0 0 0 0 0 0 0 0 0 0 0 0 
0 
##$DATE= 1177321329
##$DBL= (0..7)
120 120 120 120 120 120 120 120 
##$DBP= (0..7)
150 150 150 150 150 150 150 150 
##$DBP07= 0
##$DBPNAM0= <>
##$DBPNAM1= <>
$$ [...]
##$SUBNAM7= <"">
##$SUBNAM8= <"">
##$SUBNAM9= <"">
##$SW= 20.6930455092707
##$SWIBOX= (0..15)
0 0 3 0 0 0 0 0 0 0 0 0 0 0 0 0 
##$SW_h= 5175.983436853
##$TD= 65536
##$TD0= 1
##$TE= 683.16
##$TE2= 300
##$TE3= 300
##$TEG= 300
##$TL= (0..7)
0 120 120 120 120 120 120 120 
##$TP= (0..7)
150 150 150 150 150 150 150 150 
##$TP07= 0
##$TPNAME0= <>
##$TPNAME1= <>
##$TPNAME2= <>
##$TPNAME3= <>
##$TPNAME4= <>
##$TPNAME5= <>
##$TPNAME6= <>
##$TPNAME7= <>
##$TPOAL= (0..7)
0.5 0.5 0.5 0.5 0.5 0.5 0.5 0.5 
##$TPOFFS= (0..7)
0 0 0 0 0 0 0 0 
##$TUNHIN= 0
##$TUNHOUT= 0
##$TUNXOUT= 0
##$USERA1= <user>
##$USERA2= <user>
##$USERA3= <user>
##$USERA4= <user>
##$USERA5= <user>
##$V9= 5
##$VALIST= <valist>
##$VCLIST= <CCCCCCCCCCCCCCC>
##$VD= 0
##$VDLIST= <DDDDDDDDDDDDDDD>
##$VPLIST= <PPPPPPPPPPPPPPP>
##$VTLIST= <TTTTTTTTTTTTTTT>
##$WBST= 1024
##$WBSW= 4
##$XGAIN= (0..3)
0 0 0 0 
##$XL= 0
##$YL= 0
##$YMAX_a= 189189
##$YMIN_a= -327305
##$ZGOPTNS= <>
##$ZL1= 120
##$ZL2= 120
##$ZL3= 120
##$ZL4= 120
##$ABSF1= 16.522
##$ABSF2= -4.171173
##$ABSG= 5
##$ABSL= 3
##$ALPHA= 0
##$AQORDER= 0
##$ASSFAC= 0
##$ASSFACI= 0
##$ASSFACX= 0
##$ASSWID= 0
##$AUNMP= <proc_1d>
##$AZFE= 0.1
##$AZFW= 0.1
##$BCFW= 0
##$BC_mod= 0
##$BYTORDP= 0
##$COROFFS= 0
##$CY= 12.5
##$DATMOD= 1
##$DC= 0
##$DFILT= <>
##$DTYPP= 0
##$F1P= 14.0000005364418
##$F2P= -0.99999901652339
##$FCOR= 0.5
##$FTSIZE= 32768
##$FT_mod= 6
##$GAMMA= 0
##$GB= 0
##$INTBC= 1
##$INTSCL= 1
##$ISEN= 128
##$LB= 0.3
##$LEV0= 0
##$LPBIN= 0
##$MAXI= 10000
##$MC2= 0
##$MEAN= 0
##$ME_mod= 0
##$MI= 0
##$NCOEF= 0
##$NC_proc= -5
##$NLEV= 6
##$NOISF1= 0
##$NOISF2= 0
##$NSP= 0
##$NTH_PI= 0
##$NZP= 0
##$OFFSET= 16.522
##$PC= 1
##$PHC0= 233.8034
##$PHC1= 9.145738
##$PH_mod= 1
##$PKNL= yes
##$PPARMOD= 0
##$PSCAL= 4
##$PSIGN= 0
##$REVERSE= no
##$SF= 250.13
##$SI= 32768
##$SIGF1= 0
##$SIGF2= 0
##$SINO= 400
##$SIOLD= 32768
##$SREGLST= <1H.CDCl3>
##$SSB= 0
##$STSI= 32768
##$STSR= 0
##$SW_p= 5175.98343685301
##$SYMM= 0
##$S_DEV= 0
##$TDeff= 65536
##$TDoff= 0
##$TI= <Analysis number 999999
Compound Code 99
Book Reference 9
Project Code 9>
##$TILT= no
##$TM1= 0
##$TM2= 0
##$TOPLEV= 0
##$USERP1= <user>
##$USERP2= <user>
##$USERP3= <user>
##$USERP4= <user>
##$USERP5= <user>
##$WDW= 1
##$XDIM= 32768
##$YMAX_p= 410576430
##$YMIN_p= -617630
$$ End of Bruker specific parameters
$$ ---------------------------------
##NTUPLES= NMR SPECTRUM
##VAR_NAME=  FREQUENCY,     SPECTRUM/REAL,   SPECTRUM/IMAG
##SYMBOL=    X,             R,               I
##VAR_TYPE=  INDEPENDENT,   DEPENDENT,       DEPENDENT
##VAR_FORM=  AFFN,          ASDF,            ASDF
##VAR_DIM=   32768,         32768,           32768
##UNITS=     HZ,            ARBITRARY UNITS, ARBITRARY UNITS
##FACTOR=    0.157963299565203, 1,           1
##FIRST=     4132.6476996994, 0,             0
##LAST=      -1043.33573715361, 0,           0
##MIN=       -1043.33573715361, -617630,     0
##MAX=       4132.6476996994, 410576430,     0
$$ Real data points
##PAGE= N=1
##DATA TABLE= (X++(R..R)), XYDATA
$$ [...]
14868C40912o8183j56087M60j75867m0943k9165k6569J37348j54096k14975K44467
14857a42698K09113K7650j12919O4979P342j56230m8060j13198p391N1958l7931
14846b57385O0476L3928K4234Q9584R792K9082J36036J08938P8688j09552r7466
14835A06355R7332j9665k61889n9247R5725k3350j3037m8259r8080O4614j1483
14824a70984Q6608J31430J36721j01551k7161j1829j87206k9821J19401k3069
14814g7461m6023j00057j06965J72133K00516J38336k2136L9690j53567j71744
14804a27278n6025O0758J30730K2753n2676j09878L0975O1347k1694m5370o5541
14793a71899r0918k923R8672l3497k10004j7978Q7927L4866p7859P19J69862J77092
$$ y = [340912, 272729, 116642, 117102, -58765, -99708, -128873, -155442, -18094, -172190, -387165, -142698, 66415, 94065, -18854, 46125, 53467, -102763, -150823, -264021, -271412, -219454, -257385, -196909, -162981, -138747, -49163, -39371, -10289, 125747, 234685, 313373, 203821, 106355, 203687, 184022, -77867, -137114, -41389, -64739, -77776, -126035, -224115, -159501, -170984, -84376, 47054, 183775, 82224, 55063, 43234, -143972, -173793, -54392, -77461, -123484, -223541, -330506, -158373, 42143, 180479, 158343, 198033, 44466, -127278, -183303, -122545, 8185, 30938, -21738, -131616, -100641, -39294, -60988, -106358, -171899, -262817, -265740, -167068, -200565, -410569, -428547, -340620, -305754, -383613, -382894, -213032, -35940]
14781c5940m563J2776k2360O9409J3929K9773l1644k8443k7009N0743o3606n1182
14769h8117m098j029j52958M7394J38556O9028j54264l4921L6494J22587K11110
14758A89782J80842l19852l28974K9888K19819P2866O00q4790m4377p877m0400
14747a32473j1774M7315k0646p6122m4682j22150P6935J68878r6819p3093J37410
14736a47221J7079J0512K7839J43403M6610r4183j45023p9698J55289r8694q0888
14725b44975J22493J52679L3959J1294j33108o6137J61401K8916p5247R359J9496
14714B0130O773n3497m054J52114j53366j53481J34569P2344m7933J2394J83790
14703A69783l1640l974p5247q1086J16495J32401j41617j50816Q3607O8625q7233
$$ y = [-35940, -40503, -27727, -50087, 19322, 33251, 63024, 31380, 2937, -24072, 26671, -36935, -88117, -92215, -93244, -246202, -198808, -60252, 8776, -145488, -180409, -143915, -21328, 189782, 370624, 50772, -278202, -248314, -28495, 44371, 44971, -39819, -84196, -92073, -132473, -144247, -96932, -117578, -193700, -238382, -360532, -283597, -114719, -211538, -284631, -147221, -130142, -119630, -91791, 51612, 98222, 4039, -140984, -220682, -65393, -164087, -244975, -122482, 30197, 64156, 75450, -57658, -123795, 37606, 66522, -8725, 634, 20130, 26903, -26594, -30648, 121466, -31900, -185381, -50812, 21532, -26401, -14007, 169783, 138143, 134169, 58922, -22164, 94331, 226732, 85115, -65701, 17906, 86531, -702]
14692g02j05714k5799j595O7579j66769J21308j12559p7397K46941K51431J2703
14681B09427j00716N1763p691j01127Q7879P0775J1418j14192j29600O2733l4849
14670E820j4408J37743K44806k89482j27557p4869n9413J9788P2722m9468M9330
14659h4988j1783L1058J12725j6348j80116Q4435J09440j03587J07329Q6007K9910
14648A64082J71235O5480q6962r5163J42561Q4054K21022L46354J90474L91960
14638A595097O52735P74777J159738J229888R72453O49893N19874O6896m83741
14629G137610r55080j204526r97013q48964p98460q10030n21036k42603k15565
14620E44333r9495O3058J8877k64611k13305p3203j23712r5173J93596J48942
$$ y = [-702, -106416, -132215, -133810, -66231, -233000, -111692, -224251, -301648, -54707, 196724, 209427, 108711, 160474, 152783, 51656, 139535, 210310, 221728, 107536, -22064, 40669, 5820, -8588, 129155, 373961, 84479, -43078, -117947, -177360, -157572, -84850, -134318, -84988, -96771, -65713, 47012, 30664, -149452, -65017, 44423, -59164, 48165, 134172, 164082, 335317, 400797, 313835, 218672, 361233, 445287, 666309, 1012663, 1203137, 1595097, 2247832, 3022609, 4182347, 5412235, 6384688, 7034581, 7554455, 7621351, 7137610, 6182530, 4978004, 3980991, 3132027, 2333567, 1523537, 1002501, 759898, 544333, 444838, 507896, 526773, 262162, 48857, -24346, -148058, -243231, -49635, 99307]
14610I9307k1297j4250P5250p3871j38711p5892K18122J17471m4990j79544l9003
14599g7408J39394K335k0890k15390J38109m691k08780l8193J11746N9806l0744
14588a44706M6123P0779J09090J82860j0072j71156k44841R6715J02811Q2017
14578A19620q9514j36372n3377o4592j06911j2843J23444O8642R6478M758j7183
14567f7850J37291k0804o0659M0873R1268J118k19786M0006O6989p0712P1516
14556I250L6403Q6233M8373k5293J3212o8588j38530P1413O0177K0644k03879
14545i0585N3830j6523j52427o7598J07872K91941j5071p5887L5332m2877K8571
14534E6578j8860k82181j12070m302o0310L9760J83019J6503R9807J44998j76184
$$ y = [99307, 78010, 63760, 139010, 65139, -73572, -149464, 68658, 186129, 141139, -38405, -77408, 61986, 64321, 43431, -171959, -33850, -38541, -247321, -285514, -173768, -113962, -144706, -98583, -27804, 81286, 264146, 254074, 82918, -161923, -65208, 37603, 119620, 30106, -106266, -159643, -224235, -331146, -343989, -220545, -151903, -55425, -50667, -67850, 69441, 48637, -12022, 28851, 120119, 121237, -98549, -58543, 8446, -62266, 9250, 45653, 131886, 180259, 154966, 168178, 99590, -38940, 32473, 92650, 113294, -90585, -36755, -53278, -205705, -273303, -165431, 126510, 111439, 35552, 70884, 28007, 56578, 37718, -244463, -356533, -360835, -421145, -381385, -198366, -181863, -82056, 62942, -113242]
14523a13242k0773J09603K7699J09835M3832P5027n2863j0567J6791n1151P9570
14512B13761n9365m9615L1311l5010l7462l3998j83506l5477J25937j88p9054
14501a42666L0921n7712r4345O7996Q5593j11908m5735J6938P6469O5283m580
14490a13746J34824J10901j6979j73276L3048J54247O7414q4996m8927L4193J48805
14479B45508l004o7852o522j00722j63556j82107K9526N9072J08106J58659P3859
14468A50967J4897K40322k23015j52386J9831J00726J986Q8005J72079k9535l6861
14457C47016j64266M8127N2727J59279l9496j80980j23589J87028p3603j62199
14447E0044K4417p1191J02831o1075l3441j694M6259M0802N4268K5485n1460N2962
$$ y = [-113242, -134015, -24412, 3287, 113122, 156954, 231981, 179118, 168551, 185342, 134191, 213761, 154396, 104781, 136092, 101082, 63620, 29622, -153884, -189361, -63424, -63612, -142666, -111745, -169457, -263802, -195806, -110213, -222121, -267856, -250918, -174449, -109166, -113746, 21078, 131979, 115000, -58276, -25228, 129019, 196433, 111437, 62510, 96703, 245508, 242504, 174652, 168130, 67408, -96148, -278255, -248729, -189657, -81551, 77108, 150967, 165864, 406186, 183171, 30785, 50616, 151342, 153328, 241333, 413412, 383877, 347016, 182750, 230877, 283604, 442883, 403387, 222407, 98818, 285846, 212243, 50044, 74461, 3270, 106101, 45026, 11585, 9891, 56150, 96952, 151220, 176705, 125245, 178207]
14435A78207O0797J18263j51910j54432O6251l1987j39041K3741O2398k0225j66875
14424a54813N9793L5327m5208J34111K2132j1334m1816M6789n2132Q517R5915
14413I7281J2393o4095j09540J70026p5585M1855j36852P0976k1240J00682J14433
14402B00334j10603q5550j68303Q1700K2522p745o8111n1651j2451l8670J36639
14391a01889J14978Q4627j3328j02373o1068Q4159M904p8403L6490J54745J40983
14380B63825K5865j49429j48277m2741N9602M2830j09640j20076J32378k450m4155
14369i2268n0434O4089J14745O2637q696r6284k1102M4121P3641l0770j40458
14358h0779l9561K25487J31249J14644K77631K22733K1962j13558j1469J04961
$$ y = [178207, 239004, 357267, 205357, 50925, 117176, 85189, -53852, -30111, 32287, 12062, -154813, -95020, -59693, -104901, 29210, 51342, 40008, -1808, 44981, -7151, 1366, 97281, 109674, 45579, -63961, 106065, 30480, 72335, -64517, 6459, -14781, 85901, 200334, 89731, 4181, -164122, -82422, -59900, -67645, -135756, -187407, -199858, -238528, -101889, 13089, 97716, 84388, -17985, -79053, 5106, 10010, -68393, -31903, 122842, 263825, 289690, 140261, -8016, -50757, 8845, 51675, -57965, -178041, -45663, -48113, -92268, -142702, -78613, 36132, 98769, 90073, -6211, -27313, 16808, 90449, 59679, -80779, -120340, 105147, 236396, 351040, 628671, 851404, 873366, 759808, 748339, 853300]
14348H53300K2785J31172P8996J37621J81189N3361j957O8162j50575J06265o338
14337A473981j01439l4674m9833j16352o6198j42808n8227j57999l59101j81918
14327B05432l8404p2448J25548P3482l1563M2203o1367j69023M97p3248Q346J52858
14315A62313m2490j53528r466J59059J07225K8857m9676j39757O4523j3190j77547
14304f3677k5937J00119P6627l173j97921Q0238J37513m5547n1031q017j60798
14293a61604j60560J39400J63549O6981o2771k16402K0217J09169M4359M736J7001
14282c5925n2937q8507M4990K01363J6841j49788j07038n5487j42767K7350J10338
14271b31567K01207R3439J49370J19931R9344j67712p3053n4251K507j35815L1794
$$ y = [853300, 876085, 1007257, 1086253, 1223874, 1405063, 1458424, 1456467, 1524629, 1374054, 1480319, 1473981, 1372542, 1337868, 1288035, 1171683, 1105485, 962677, 904450, 746451, 387350, 205432, 167028, 94580, 220128, 293610, 262047, 304250, 242883, 73860, 74357, 1109, 9455, 162313, 119823, -33705, -43171, 115888, 223113, 251970, 202294, 62537, 127060, 113870, -63677, -89614, 10505, 87132, 83959, -113962, -33724, 103789, 58242, 7211, -806, -161604, -322164, -182764, -19215, 47766, -15005, -231407, -211190, -102021, -57662, -52926, -35925, -88862, -177369, -132379, 68984, 85825, -63963, -171001, -226488, -369255, -341905, -231567, -30360, 63079, 212449, 332380, 431724, 264012, 190959, 136708, 139215, 3400, 35194]
14260C5194M4641M3650N1036n1836j56450q1439l3154l4905R4297O1283L9350
14249A1667M6369P9704K7084J9770R111p8814m8507J39663O959q3484j03226O5533
14237I1829R1869p0188J32916P0561J820j17963O1690K3224l02156k15846o980
14226b39224P4209J40390J40593j3566j5711k1279q4949Q9966L0334o4796L2170
14215F8137P5839p8886J2683j00788m441L0165J50153R0997M4970n9618r9320
14204A29891K8849J86630j07604o8033j00579k17369P838P3861k899Q294J58077
14193I6956j90627L6707r5708j40080O7520L8964j92720N2309J19159M0482J64589
14182b449K59445N0323L8213j12562l03767p9268o6376p5212J29248L1352P5688
$$ y = [35194, 79835, 123485, 174521, 122685, -33765, -115204, -148358, -183263, -88966, -27683, 11667, 58036, 137740, 164824, 184594, 193705, 114891, 66384, 206047, 213006, 129522, 26296, 91829, 183698, 113510, 246426, 316987, 318807, 200844, 262534, 285758, -16398, -232244, -239224, -165015, -24625, 115968, 102402, 86691, 65412, -19537, 70429, 100763, 35967, 68137, 143976, 65090, 77773, -23015, -27456, 2709, 152862, 243859, 288829, 229211, 129891, 158740, 345370, 237766, 169733, 69154, -148215, -140377, -66516, -69415, -61121, 96956, -93671, -56964, -152672, -292752, -225232, -186268, -378988, -326679, -207520, -167038, -2449, 256996, 307319, 345532, 232970, -70797, -150065, -216441, -291653, -162405, -131053, -55365]
14171e5365J39977R6754k6356Q5027P4758r9119j38849M166J13597j60953q6379
14160e2742R2145J58963j0562p2015j06863l3813J30018m1482J28261J14021O532
14149C12463p4318m0692J8862q1420k7708K06335K56263J21999l5868j65654r8824
14138C91438k7632o4297Q0323j09269O7054J53179K19489J63711J41829P2701
14128A088526N8234k54186k59002j12136l3925k4639j04680P2712j801p1645m2601
14117C14857j0080m4542O9628Q948j22957n6314M1394j9713k2594J9426K50583
14106D28636p7831j47812J5086k2689j08069P7994K4177j41759q846r009J98021
14095B27899N1070q9442j9747K4377P5575R9390j45854J9914J1815L3468O4776
$$ y = [-55365, 84612, 181366, 155010, 240037, 314795, 215676, 76827, 80993, 194590, 33637, -52742, 39403, 198366, 187804, 115789, 8926, -24887, 105131, 63649, 191910, 305931, 312463, 238145, 197453, 216315, 134895, 107187, 313522, 569785, 691784, 655916, 490262, 391438, 363806, 299509, 379832, 270563, 337617, 490796, 710285, 873996, 1015825, 1088526, 1146760, 892574, 633572, 521436, 487511, 462872, 358192, 430904, 429103, 357458, 314857, 304777, 260235, 329863, 338811, 215854, 159540, 200934, 181221, 158627, 178053, 428636, 350805, 202993, 218079, 195390, 87321, 165315, 189492, 47733, 38887, 29878, 227899, 278969, 189527, 169780, 194157, 269732, 369122, 223268, 243182, 254997, 288465, 353241]
14084C53241J31557j79r1522O9092M1370R5668M1387o7654j30849j1198J19406
14073E50319l1008j59905J00066J22958j9677J23348J29333l490j84855j26151
14063E00938L7449J72705K19126q3660J17078l2190r6597p8262k06393k16089
14053C34105k36979L6962l285o45o503m2725l0315P3198o1743k32658q0787j00481
14041c51856J3021J27110R3412J09277n4724j29962J29760K2831Q6532L1860N3324
14030A30585M3761j13415q7044N7886R2763j34652J08154j7325J05628K18025
14020D04366l9726j00471P634r2581M8048J41637J10415n8352l664K54610Q8721
14009G60637k17253k78314r1562k0694J08243R4480J46794j57078R216J45034
$$ y = [353241, 484798, 484619, 393097, 462189, 503559, 599227, 640614, 572960, 442111, 430913, 550319, 519311, 359406, 459472, 582430, 562753, 686101, 815434, 811944, 627089, 500938, 538387, 711092, 930218, 846558, 963636, 931446, 834849, 756587, 550194, 334105, 97126, 134088, 130803, 130158, 123655, 80930, 50615, 123813, 62070, -170588, -251375, -351856, -338835, -211725, -118313, -9036, -63760, -193722, -63962, -41131, 45401, 77261, 130585, 174346, 60931, -26113, 31773, 124536, -10116, 98038, 80713, 186341, 404366, 364640, 264169, 271803, 179222, 227270, 368907, 479322, 420970, 417306, 671916, 760637, 543384, 265070, 173508, 152814, 261057, 355537, 502331, 345253, 354469, 499503]
13999D99503l6758j75976n3978m2306R8499K41916L8226j45869o0833L2595q5677
13988C09342r9809j14194k039j0866J9017K34343K17233o1243r9850J1670Q7668
13977D91272k8219k3790j9825Q2922p2601k11916L226j018m284J23625M2766J05711
13965D87869J08988K3602J80315J30349n0127p8679K33964j29951j89295L1248
13955G48283k5117J20916K32183J32989j2608Q419Q6346O7694p8824m8405J53893
13944A385769J03053J26691P9064J95377J48016K36365J96249J37550j8475P4330
13934B663989J80251J43780K49771L19909J59684J68264K76565K34178M35431
13925D831822M02383M00669M55689M36018N76228N91289M94214N33081O26859
$$ y = [499503, 462745, 286769, 232791, 190485, 288984, 530900, 569126, 423257, 362424, 395019, 309342, 209533, 95339, 93300, 82434, 101451, 335794, 553027, 491784, 391934, 403604, 491272, 463053, 439263, 419438, 502360, 429759, 217843, 221069, 220051, 215767, 339392, 382158, 487869, 596857, 620459, 800774, 931123, 880996, 802317, 1036281, 906330, 717035, 748283, 723166, 844082, 1076265, 1209254, 1196646, 1205065, 1291411, 1359105, 1280281, 1231876, 1385769, 1488822, 1615513, 1694577, 1889954, 2037970, 2274335, 2470584, 2608134, 2589659, 2663989, 2844240, 2988020, 3237791, 3557700, 3717384, 3885648, 4162213, 4396391, 4831822, 5234205, 5634874, 6090563, 6526581, 7102809, 7694098, 8188312, 8721393, 9348252]
13916I348252O72812Q78733J084415J146613J535208J532379J481260J961205
13908A9640877K202340K639012L076030L627881M152753M958915N805795O809952
13900E2913555Q096495R904214J1761873J4072072J6345116J8986155K1036154
13893A53115634K2422479K2548650K1184282J8970271J5887176J1603719O043185
13886B71775396n38008o721133j2100005j6132633j8852334k1020283k1861364
13879A74549636k1606123k0346455j8188105j5973811j3609100j1195359r294224
13872F4336459p970040o570189n519143m772164m134398l485825k948817k579238
13864B6356645k314413k086558j737248j561395j327398j086494j276766j209339
$$ y = [9348252, 10021064, 10899797, 11984212, 13130825, 14666033, 16198412, 17679672, 19640877, 21843217, 24482229, 27558259, 31186140, 35338893, 40297808, 46103603, 52913555, 61010050, 70914264, 82676137, 96748209, 113093325, 132079480, 153115634, 175538113, 198086763, 219271045, 238241316, 254128492, 265732211, 271775396, 271237388, 264516255, 252416250, 236283617, 217431283, 196411000, 174549636, 152943513, 132597058, 114408953, 98435142, 84826042, 73630683, 64336459, 56366419, 49796230, 44277087, 39504923, 35370525, 31884700, 28935883, 26356645, 24042232, 21955674, 20218426, 18657031, 17329633, 16243139, 14966373, 13757034]
13856A3757034j085122r04209o37315o27508o21508n67744m89418p24721m94275
13847G605214l43416j08078k11389m23932m16181m08133m13976m12406j10716
13838D756987j370l57007k13625J2718k7041j91805k24566k44422j87355n2455
13828C270059m4590k01723j6248J49193m2307k08300r7069j55743k30757q9539
13818B332976j7884R5479J24792j01791m09434k00141Q0918p6271N7490j9318
13808A866816q979J01457l5451j98802k67254n4894N6013P940j21286k7401q1431
13797A236728j0138l5297L6915L3472k7514j85388j52222R6543N3439q5204m4333
13786I17001o3359p2116K18493k108k342J0023r2219q6199J23549N5316j37922
$$ y = [13757034, 12671912, 11767703, 11130388, 10502880, 9881372, 9313628, 8824210, 8099489, 7605214, 7261798, 7153720, 6942331, 6518399, 6102218, 5694085, 5280109, 4867703, 4756987, 4755617, 4398610, 4184985, 4197703, 4170662, 3978857, 3754291, 3509869, 3322514, 3270059, 3225469, 3023746, 3007498, 3156691, 3114384, 2906084, 2809015, 2653272, 2422515, 2332976, 2315092, 2410571, 2535363, 2433572, 2024138, 1823997, 1904915, 1828644, 1886134, 1866816, 1857837, 1959294, 1923843, 1725041, 1457787, 1402893, 1458906, 1466846, 1345560, 1318159, 1236728, 1226590, 1191293, 1228208, 1261680, 1234166, 1048778, 896556, 993099, 1046538, 961334, 917001, 853642, 781526, 1000019, 997911, 995569, 1005592, 913373, 827174, 950723, 1006039, 868117]
13775H68117q1921p525j02043k0669k984P8099O9293j03356o9222P1033R8338
13764G97160j47983R2414J98082p132j65092r1264J26105n8827j75557r4737R410
13753D82579J12717P0556K8865L9585j44304j36217l10902N2619K30965K01946
13743F28409j86717o2794J78391n6906J28798J19571P594K32123R0943l6612j95852
13732H46948M0129J14215j63594k32224k1134M36K264K40885l1689j94540j25620
13721D76076j00933J270N4919Q3787P6253N1327j49938n0732M4652m9627j11002
13710C26052q3009R885k9759o2088O3826L2114O5857q9597j07917k8061K17547
13699C14850J45100o4577l8202J47980J7885J25844J38534k03082k52127L0983
$$ y = [868117, 786196, 778671, 676628, 655959, 652975, 731074, 800367, 697011, 627789, 698822, 797160, 649177, 741591, 939673, 932541, 767449, 676185, 802290, 743463, 567906, 473169, 482579, 595296, 665852, 694717, 734302, 589998, 453781, 142879, 195498, 426463, 628409, 441692, 378898, 557289, 500383, 629181, 748752, 756346, 988469, 1079412, 1042800, 846948, 887077, 1001292, 837698, 605474, 584340, 584776, 587040, 827925, 796236, 601696, 476076, 375143, 376413, 431332, 515119, 591372, 642699, 492761, 442029, 486681, 437054, 326052, 243043, 252928, 223169, 161081, 224907, 257021, 322878, 233281, 125364, 97303, 314850, 459950, 395373, 357171, 505151, 523036, 648880, 787414, 584332, 332205, 363188]
13689C63188r0623O9038r7355j47861j1903n9056J86594J06987r8788o1284J65243
13678C24180K17246K3948q1548L743j57658j22205j9533R8769k3698j37628L9517
13667A65133J31273N5284J73273L8780j0253Q757k4861Q0657M2667m3189R2122
13656G09643j81313j22587j14927J28929J64018j57060n4345m1864j3666p982
13646C08846j6929j10686j29505R2859J22647l2126M5444R2965N7151j35798p0582
13635B24286Q847J1207k1990J33518J06774J26141r3105j00221K3699j08128O8377
13624C79405J69484p494j15878j07284L007L6687J01685L1135o9497L8469K14364
13613F74083R0353J79881m4885k32622M3617Q6973j47385r3947J86369K29865
$$ y = [363188, 272565, 341603, 244248, 96387, 84484, 25428, 212022, 319009, 220221, 158937, 324180, 541426, 565374, 483826, 487569, 329911, 207706, 188173, 286942, 263244, 125616, 165133, 296406, 351690, 524963, 563743, 553490, 562247, 537386, 618043, 660710, 617521, 709643, 528330, 405743, 290816, 419745, 583763, 426703, 372358, 330494, 316828, 308846, 291917, 181231, 51726, 144585, 267232, 235106, 280550, 373515, 430666, 294868, 224286, 233133, 244340, 222350, 355868, 462642, 588783, 495678, 395457, 419156, 311028, 379405, 548889, 541395, 425517, 318233, 321240, 357927, 459612, 490747, 421250, 459719, 674083, 764436, 944317, 899432, 666810, 710427, 797400, 650015, 556068, 742437, 972302]
13603I72302M4403m5820m8557K9654n220Q2265M3631j22686o3013j42831j9284
13592G24844J78620j3012K342M1654l3831J7331J38006K14014o1918j36753k3339
13581A047958J81989J16786J0520l8249Q3870J66517o9879j29654J644j9382m6283
13570A305837l6930L4106Q8563R6576O9051O4244K8562r2730O5349K14769K89063
13559B126460M7045j80777J9763J39678J50079Q3825O1230P2599J55166P7604
13549B752672J35643R1311K3731L2373O5468K9586K93001N1969J26514K41124
13539C843392P0888K1212P2728J30137K22592K20393L51568K35198J64319K13523
13529E545950J53661L99724K56805L07198N69081K79196L19074M37267N31066
$$ y = [972302, 1016705, 970885, 922328, 951982, 946762, 1029027, 1072658, 949972, 886959, 744128, 724844, 903464, 890452, 892794, 934448, 900617, 917948, 1055954, 1269968, 1208050, 1071297, 1047958, 1229947, 1346733, 1357253, 1319004, 1402874, 1569391, 1499512, 1369858, 1371502, 1352120, 1305837, 1268907, 1303013, 1391576, 1488152, 1557203, 1621447, 1650009, 1557279, 1622628, 1837397, 2126460, 2173505, 1992728, 2012491, 2152169, 2302248, 2386073, 2447303, 2519902, 2675068, 2752672, 2888315, 2979626, 3003357, 3035730, 3101198, 3130784, 3423785, 3475754, 3602268, 3843392, 3914280, 3935492, 4008220, 4138357, 4360949, 4581342, 4932910, 5168108, 5332427, 5545950, 5699611, 6099335, 6356140, 6663338, 7232419, 7511615, 7830689, 8267956, 8799022]
13520H799022N91433L64360L29626M04421N22865N82014O53070N26977R55761
13511A3729549J248759J034448P46274Q85990J159522J051600J207616J306605
13503B2370363J488450J776015J636194J782440J794781J968280K244704K269477
13495C7330704K505220K687511K573956K703142K862567K874915K589608K521279
13487E8648902K544822K181194J576874J130672O23893Q5761l50960p39441j290847
13478F4410870j879623k207917k349909k697653k701695k752443k793660k872240
13470D4155730k697258k628442k517073k390119k081189k002770j816894j797402
13462B6224583j742548j559109j413575j284508j146346j134742j066067r76840
$$ y = [8799022, 9390455, 9754815, 10084441, 10488862, 11011727, 11593741, 12246811, 12773788, 13729549, 14978308, 16012756, 16759030, 17645020, 18804542, 19856142, 21063758, 22370363, 23858813, 25634828, 27271022, 29053462, 30848243, 32816523, 35061227, 37330704, 39835924, 42523435, 45097391, 47800533, 50663100, 53538015, 56127623, 58648902, 61193724, 63374918, 64951792, 66082464, 66706357, 66792118, 66441158, 65701717, 64410870, 62531247, 60323330, 57973421, 55275768, 52574073, 49821630, 47027970, 44155730, 41458472, 38830030, 36312957, 33922838, 31841649, 29838879, 28021985, 26224583, 24482035, 22922926, 21509351, 20224843, 19078497, 17943755, 16877688, 15900848]
13454A5900848r16521q21448q01004p83021o66309p50301o22090n90686m40164
13445I509304l56207l47502l46724m24387l26010k12098k86562k46624k26706
13436F736484j98950j81993j5973r2833j31811l49823l02192j35094k38149k45919
13426D843747j5623N5685o5565j74020k49556k38001k28776l08617l22556o2034
13416C234684j44473j98451l3372k22397j2537Q7158j78104l16732k70918j67726
13406A777132O8298K23543N7204J22961M529j67420k10430k34148j15523K4465
13396A550611j40683j26935K06180q997k5587m8851j58652n6497Q0854q0183n0741
13385A140519K6675R1416J8879o0838j98908L0559l5831o0603N6644k5926J9851
$$ y = [15900848, 14984327, 14162879, 13361875, 12578854, 11912545, 11162244, 10540154, 9949468, 9509304, 9153097, 8805595, 8458871, 8034484, 7708474, 7496376, 7209814, 6963190, 6736484, 6537534, 6355541, 6339568, 6246735, 6114924, 5765101, 5462909, 5327815, 5089666, 4843747, 4828124, 4883809, 4818244, 4644224, 4394668, 4156667, 3927891, 3619274, 3296718, 3234684, 3090211, 2891760, 2858388, 2635991, 2623454, 2710612, 2532508, 2215776, 1944858, 1777132, 1845430, 2068973, 2126177, 2249138, 2253667, 2086247, 1875817, 1641669, 1526146, 1550611, 1409928, 1282993, 1489173, 1480176, 1454589, 1405738, 1247086, 1190589, 1271443, 1191260, 1140519, 1167194, 1258610, 1277489, 1216651, 1017743, 1048302, 1012471, 951868, 1008512, 982586, 1002437]
13374A002437L1071J44758m2792j88659j41097N2338k9583M395J45089J05250
13364A083207o3162j74433k69973m9023Q9115K10139R035N7233l4762L9230j43359
13353G53247j23648J26792j71939k57337J04689J53611L4624L4696o4850M6790
13343F36675L1720J4854P9808K8122j41540o3862k4567N2679r5883p6354R6100
13332E37752j84584P8506k3856j92741J02832R2450K26478L764j34816n4160q6213
13321C65412r0182o4669Q5337j2853L7728K01580n2028M5596k0550j27294o8459
13310B99618j5461J59674J0869M7456m8308l1338j19680p3659L1439j02603q1078
13299G6929Q7553j0604r7613J40093M105p4934L2987J50211j27470o2147l8462
$$ y = [1002437, 1033508, 1178266, 1135474, 946815, 805718, 858056, 828473, 832868, 977957, 1083207, 1020045, 845612, 575639, 526616, 615731, 825870, 834905, 892138, 857376, 896606, 753247, 629599, 756391, 584452, 327115, 431804, 585415, 620039, 654735, 589885, 636675, 668395, 683249, 763057, 791179, 649639, 585777, 561210, 613889, 518006, 441652, 537752, 353168, 431674, 407818, 215077, 317909, 410359, 636837, 640601, 505785, 451625, 365412, 275230, 210561, 295898, 283045, 320773, 522353, 470325, 515921, 495371, 368077, 299618, 284157, 443831, 454700, 502156, 453848, 422510, 302830, 229171, 260610, 158007, 76929, 164482, 153878, 56265, 196358, 200463, 125529, 158516, 308727, 181257, 119110, 80648]
13288H0648r9941o1980m5199J27738K11083K2601o6885O9651k7197j9693n8137
13277A32689J50142j38146k44680j21927K47828J81684N5284k8033Q143p929j51159
13266H3896K073J24186o4862j05366M2356Q3244L0308J3647q9996K7033N2785
13255A99304k4294k17441M3455J02302P2638M0818j07991O094j24127n4808K9157
13244c4893J33328R5447j17825j22533J58179J09731k140p4270j06917j555m9532
13233a2980k97L0361O3776l6259l2103M950j48198p4664J36776O7651N0346K13438
13221B62797k7996k27480O5606O2891n9215J52446m6069l0170l7072j6065n4958
13210D4715k21884j3063K06560K37235P541l5150P543k0058M8011m9113J4542
$$ y = [80648, -19293, -81273, -126472, 1266, 212349, 234950, 168065, 237716, 210519, 190826, 132689, 282831, 144685, -99995, -221922, 25906, 207590, 262874, 234841, 242984, 235055, 83896, 85969, 210155, 145293, 39927, 82283, 165527, 195835, 209482, 119486, 146519, 199304, 175010, -42431, 1024, 103326, 175964, 216782, 108791, 114885, -9242, -64050, -34893, 98435, 193882, 76057, -46476, 111703, 221434, 219294, 145024, 38107, 36552, -12980, -13277, 17084, 80860, 44601, 12498, 17448, -130750, -205414, -68638, -987, 49359, 262797, 234801, 7321, 72927, 135818, 76603, 229049, 182980, 152810, 115738, 99673, 44715, -177169, -190232, 16328, 253563, 261104, 225954, 233497, 213439, 261450, 212337, 226879]
13199B26879m7037j00293q3823k9801J03108Q3943M7479r497k2296o6613j30679
13188b8630j03453O9151M5135R1877M5259l9142R2221Q600j55758l6509J56646
13177A45397Q7157o7918j42809k2793J6481r3658l7043j16686K05022K01413j8277
13166A56286j61221m4304J12912K9179M4371J48369q5335J7801N3905r8529j51391
13155B2043q0751Q0853K48742P1905r7074O2316O073j39641j98507J7311N7371
13144E0641q6343j13464m1068J28014O9469R3340j57873J31925M3434k10183p1300
13133a63408n8016K6714l667P891N3047J02545K4102o9409j5492J4306J22257
13122D0870k8521n501J42950J19705J0973K701P2283L2631m3382k5931n7421j89335
$$ y = [226879, 179842, 79549, -4274, -34075, 69033, 152976, 200455, 190958, 168662, 102049, -28630, -132083, -62932, -17797, 74080, 119339, 80197, 172418, 181018, 25260, -11249, 145397, 232554, 164636, 21827, -966, 15515, -78143, -115186, -231872, -26850, 174563, 156286, -4935, -49239, 63673, 92852, 137223, 285592, 200257, 218058, 271963, 173434, 22043, -58708, 22145, 270887, 342792, 245718, 308034, 314107, 174466, -24041, -6730, 50641, -35702, -149166, -190234, -62220, 7249, 100589, -57284, 74641, 118075, -92108, -163408, -221424, -194710, -198377, -190486, -137439, -34894, -10792, -80201, -95693, -81387, 40870, 12349, 6848, 149798, 269503, 280476, 283177, 355460, 388091, 344709, 318778, 261357, 72022]
13110G2022j69086l4410o5208J41335M6834M4900J3815K99181j170j58717q1046
13099A08450j00727q6554j09832l3330o2875J05426L6336L7537J29633K23392
13089B47456m0197j09668j96560j00566q2822J45359O7694J06227k6250l1681
13079b1008j490r3009j48362K58818K38049j6279o2172k88503n6961j37463K786
13068c25594K92957O1296j7947K9970J5231O7266m9051m1793j6175j61364l2183
13057a77387k3840J05695J36354J80157L4178k76114j94813J38796J69910j59306
13047f6370p332J31717R8005j43416k46692L0402K0445R0359M8594R8639j40420
13036h6069M0801Q3025J7355P9161k2068j86460j83598O8087J0731J7143J91465
$$ y = [72022, -97064, -131474, -196682, -55347, -8513, 36387, 50202, 349383, 348213, 189496, 108450, 7723, -78831, -188663, -221993, -284868, -179442, -143106, -105569, 24064, 247456, 207259, 97591, -98969, -199535, -282357, -136998, -69304, 36923, 10673, -21008, -22498, -115507, -263869, -5051, 232998, 216719, 154547, -133956, -190917, -328380, -325594, -32637, 28659, 10712, 40682, 55913, 123179, 74128, 32335, 16160, -145204, -177387, -201227, -95532, 40822, 220979, 255157, -20957, -215770, -76974, 92936, -66370, -73702, 58015, 156020, 12604, -234088, -203686, -183241, -92882, -44288, 54351, -86069, -45268, 37757, 55112, 134273, 112205, -74255, -257853, -189766, -179035, -161892, 29573]
13025B9573J9928R7355Q3823l839o3065l3132J54086r2420K0396J6911k7463p3608
13013A28545P5600Q7676M8982m2633j81249j46226k20549r4718J89174J57953
13003B555l0746q1472q6208m0927J32251J16604l5462j79255J07619O4470r3711
12992a24282J10557R9716N4028q7637n6225k24058j21574p2467m733J2111M2167
12981c72397J13679L1644q0804n7025N7712K35449K0012j7388j25274m5731K19133
12970b0990N2597q293K33591j80935j8684P6573j65598j42882n1304K1082K75483
12959G0640r7644o6805J2965J58470o5910J44626K9871j46854l3798r0870j1871
12948i7180Q3167k6372j5477J06514Q3191r7511p4540j69986j21950o083O3042
$$ y = [29573, 49501, 146856, 230679, 226840, 163775, 130643, 284729, 192309, 212705, 229616, 202153, 128545, 204145, 291821, 340803, 298170, 116921, -29305, -249854, -344572, -155398, 2555, -28191, -109663, -195871, -236798, -104547, 12057, -23405, -202660, -95041, -30571, -124282, -13725, 85991, 140019, 52382, -3843, -227901, -349475, -421942, -426675, -414564, -372397, -258718, -227074, -307878, -364903, -307191, -71742, -51730, -69118, -194392, -240123, -20990, 31607, 23314, 256905, 75970, 57286, 133859, -31739, -174621, -225925, -204843, 70640, -27004, -93809, -80844, 77626, 11716, 156342, 186213, 39359, 5561, -85309, -97180, -14013, -40385, -55862, 50652, 133843, 36332, -38208, -208194, -330144, -336227, -273185]
12937b73185k6478l8283K9879J44508J18613O0561j83739q4994k3551R8531L0848
12926a47290J57736J18017k8076n8842j41425j03984J28378P5121M7152r1913
12916d5126K9519k9084j4058L1899m7881k255j28863k02497N1281N4392P8613
12905b24060K29831J0777j39075l860j1268K5211k0073J27043J14763P9859L5066
12894B24214N4009L2011j01817r750k6799N8345k051Q9491j31650j95105n2186
12883f1288P467M4668J16769M6302J11917k2904o5491p9458k12582o5164J13617
12872f6147J38484j25381j48699K3050n1049J81434J9223N5416K6270N159j68459
12861a10699r7488j18401J38000m9199o9962M873K13703K4971K8333K3937j36145
$$ y = [-273185, -299663, -337946, -308067, -163559, -44946, 15615, -168124, -253118, -276669, -178138, -147290, 10446, 128463, 100387, 41545, -99880, -203864, -75486, -365, 46787, -45126, -15607, -44691, -58749, -26850, -74731, -76986, -205849, -408346, -357065, -302673, -224060, 5771, 16548, -122527, -126387, -137655, -112444, -132517, -5474, 109289, 189148, 224214, 278223, 310234, 208417, 198667, 171868, 230213, 228162, 317653, 186003, -9102, -61288, -53821, -9153, 107616, 153918, 265835, 242931, 177440, 97982, -114600, -179764, -66147, 72337, -53044, -201743, -178693, -229742, -48308, -29085, 26331, 52601, 57760, -110699, -208187, -326588, -188588, -237787, -307749, -302876, -89173, -64202, -35869, -11932, -148077]
12850a48077J00517N321K6059J1095j75160j80971L39505J39602N812j42117m0392
12839e8806O2320K2565k4374k5391J9964O7110K5910o6397N9006P982N9389p8754
12827G0524j43206J55190J34922r9128j67203l628n1416O3095j02824j44288O412
12816b81550R4025p0453j45149N0044M6896J82147R0946O5052j9813K3284M6605
12805H2034N8378j27697O0412l9064Q4999q6808L6198J20430N4277r7028n5275
12794I0856J89381J12383j79638k20650K2395n5580j02931j01124R8063J16970
12784b9875L2597j6679p5917j30943j00703K07713J00902P6805l7650j95050P9197
12773h9603R2101O2155J4569m324Q7183j81679P8003N0232J3351n5361o6139K014
$$ y = [-148077, -47560, -42239, -16180, -5085, -180245, -361216, -21711, 117891, 123703, -18414, -58806, 3514, 26079, 1705, -23686, -3722, 63388, 89298, 22901, 81907, 89889, 149278, 70524, -72682, 82508, 217430, 118302, -48901, -52529, -103945, -40850, -143674, -287962, -281550, -187525, -257978, -403127, -353083, -306187, -124040, -33094, 31958, 12145, 35429, 82034, 140412, 12715, 73127, 34063, 119062, 32254, 68452, 188882, 243159, 146131, 90856, 280237, 392620, 212982, -7668, 14727, -40853, -143784, -244908, -146845, -29875, 2722, -13957, -89874, -220817, -321520, -113807, -12905, 63900, 26250, -168800, -89603, 2498, 64653, 79222, 74898, 162081, -19598, 58405, 108637, 121988, 66627, 488, 2502]
12761B502K1401R6872j64662r5916O3623J94792K36370j88291n2256r7779p0580
12750e3924j06593O389K0580J67571Q593j32344j30447O3120J47677L8604k72534
12739b43308p5256O618n849N5245K0015P2061L0485k4667N6227J59756j1990n5333
12727a5996M0353k2192J30407m3999j69591q8918o9501O8957k6603J74617O0354
12716C7888r0351n7917J0650O700L647j02490M0751R2032O7098J22870j04071
12705B6807n0596P904n1374o8221k61680L8361K14950L7289K2415K5260j26002
12694a84887R6664K45584m108j28368k07347r5525k08267j874J50289J22087M4777
12683a70975j44097J60489Q5056m5313J8208j44405K7776J4765M7390Q5078m1572
$$ y = [2502, 23903, 120775, -43887, -139803, -76180, 118612, 354982, 166691, 114435, 16656, -53924, -160517, -154128, -133548, 34023, 42616, -89728, -220175, -157055, -9378, 29226, -243308, -318564, -311946, -317795, -262550, -242535, -170474, -139989, -164656, -108429, 51327, 39337, -15996, 24357, 2165, 132572, 88573, -81018, -169936, -239437, -170480, -197083, -22466, 37888, -52463, -110380, -99730, -93030, -89383, -191873, -151122, -59090, 8008, 130878, 26807, -23789, -15885, -67259, -135480, -397160, -358799, -143849, -106560, -84145, -58885, -184887, -88223, 157361, 153253, 24885, -182462, -277987, -486254, -488128, -337839, -215752, -170975, -315072, -154583, -69527, -114840, -96632, -241037, -213261, -198496, -151106, -66028, -107600]
12672a07600K09220l0277o7817n0914j29603j10137P5259M5520K5446q9941r7994
12661c28838m7037J42406P1528K7208J2073J0032k6P4547K2951j74613j68488
12650c58257J1733Q0731n5141j3243j1800R1984J83884j601J88837J59624j06019
12639A70732k06681L861J60840k16313j02338J73829O038l9888j5603o4269R6674
12628c3118j2046l3412r3157M7608J17655p9707L8126M5751L8984J6r6993j14748
12616a75041K7958J811R9705p5662j25553Q4498J73430J78181K0926P8929P0917
12605C60099M8518j75829k90210J630K52774J78020R7621O0286M2126Q0964k00184
12594D55815j83503O2844o5458n223L3261Q7728O0168q8622m7642j11739R5224
$$ y = [-107600, 101620, 71343, 3526, -47388, -176991, -287128, -211869, -166349, -140903, -230844, -328838, -375875, -233469, -161941, -134733, -122660, -112628, -112654, -38107, -15156, -189769, -358257, -346524, -265793, -320934, -334177, -345977, -253993, -70109, -71710, 117127, 276751, 170732, -35949, -32088, 128752, -87561, -189899, -16070, -10032, -49920, -65523, -129792, -33118, -45164, -78576, -171733, -124125, -6470, -86177, -48051, -2300, 36684, 36700, -60293, -175041, -147083, -145272, -45567, -121229, -246782, -162284, 11146, 189327, 210253, 289182, 360099, 408617, 232788, -57422, -55792, 196982, 375002, 472623, 532909, 575035, 655999, 455815, 272312, 335156, 269698, 264475, 297736, 385464, 445632, 357010, 309368, 197629, 292853]
12583B92853J24533J60470J43131Q6755k31558j59072J25193R7038j01706m2840
12573D94797m8999L1579K49674k469J09209J06287m2908j47097J28497J59287
12563A037857J59661J48914j5874l5623J59272J90787J42976R3650J25423O5206
12553B072249J89185o4591l54058k31597k57491j87874k31586j72451Q634j14467
12543F55953o6200J43203P5671l7063K764k17874j06059m9299m1778J35424o1103
12532D33639l7815J25197J84787p1965j37134r0939K8198J2046J01174q7509k74159
12521A85520j43492J19772O2085N1928J21368J05596j648k154K66234J94526j9059
12510I40676q4160n157J616j24849r6190k6926m7111j08462k01324M7867L1794
$$ y = [292853, 417386, 577856, 720987, 807742, 576184, 417112, 542305, 639343, 537637, 494797, 445798, 477377, 727051, 724582, 833791, 940078, 897170, 750073, 878570, 1037857, 1197518, 1346432, 1330558, 1294935, 1454207, 1644994, 1787970, 1881620, 2007043, 2072249, 2261434, 2196843, 1842785, 1611188, 1353697, 1165823, 934237, 761786, 770420, 655953, 589753, 732956, 808627, 771564, 774328, 556454, 450395, 401096, 359318, 494742, 433639, 395824, 521021, 705808, 633843, 496709, 405770, 433968, 446014, 547188, 459679, 185520, 42028, 161800, 223885, 275813, 397181, 502777, 501129, 498975, 765209, 959735, 940676, 856516, 851359, 852975, 728126, 631936, 605010, 557899, 449437, 248113, 295980, 327774]
12499C27774O407n8749K6287j97341K330K68787L8041l0709n461j06611K5449
12488B96204R2818L2061j44780r1160N8035n918j2313o3115J22339l6354K1546
12477B69363n2728j4237o4706M926O7307j75708l8852k7547J62648j6981k42218
12466a28733j69777O2083J77686N2517P9211J2272J20Q4374n0999n988o789m4200
12454F1777o9378o8749J57379q0819N3340N0752j9492j58479r3117J15472o4989
12443a16303O0801J24744o7090L7914R2K03416J51281k27590k86702P847O7670
12432d3920J35912J57873p1698k01515K51562J46717r9942k9452R4780N8990p5839
12421C23468j79687l5889n2575j46114j93271J48827o469K0353J45524J73953
$$ y = [327774, 334181, 275432, 301719, 104378, 106708, 375495, 413536, 382827, 377366, 270755, 296204, 389022, 421083, 276303, 185143, 243178, 237260, 224947, 161832, 284171, 247817, 269363, 216635, 202398, 137692, 142618, 209925, 34217, -4635, -32182, 130466, 113485, -128733, -298510, -236427, -58741, -6224, 72987, 85259, 85379, 169753, 118754, 112766, 105977, 61777, -7601, -76350, 81029, 210, 53550, 104302, 84810, -73669, -166786, -51314, -116303, -55502, 69242, 2152, 40066, 40158, 243574, 394855, 167265, -119437, -111590, -43920, 91992, 249865, 178167, -23348, 228214, 374931, 274989, 245537, 340317, 399307, 323468, 143781, 107892, 55317, -90797, -284068, -135241, -141710, -121357, 24167, 198120]
12411A98120P4605j10421k2644M3657J6580j20793j64087q474M7332O1780J40699
12400A56354j2017j95576K3233k9081O3954K7774J2855m9706M0933m8587j39008
12389a48872L8403k18l3036K07358J32316L24K8163M1322j48669j1943J8131J329
12377A24608p652l7034J9080q1905l0478K6084K59453O5535j74566j40254P4420
12366I7291n019q361j42591k4048l3795J31038J04459R6633M0111J38000p4073
12355C19645k3166n7061O2573j6519l6556p7450J08349R3772L5613j5961j25713
12344B67526n9108R0264P4948q1857r5210j58042M768J26529j8696n6128J73130
12333B68124J12028K39417k3224j11188J1221r0230J15310L2939j04831k04419
$$ y = [198120, 272725, 162304, 139660, 183317, 199897, 79104, -84983, -93457, -46125, 15655, 156354, 144337, -51239, -28006, -57087, 6867, 34641, 47496, -2210, 38723, -9864, -148872, -110469, -110687, -143723, 63635, 195951, 196275, 224438, 265760, 117091, 105148, 123279, 124608, 116956, 79922, 99002, 17097, -13381, 12703, 272156, 337691, 163125, 22871, 97291, 92272, 83911, -58680, -82728, -116523, 14515, 118974, 215607, 255718, 393718, 319645, 296479, 239418, 301991, 285472, 248916, 171466, 279815, 373587, 409200, 393239, 267526, 208418, 298682, 373630, 291773, 196563, 38521, 43289, 169818, 151122, 94994, 268124, 380152, 619569, 596345, 485157, 496378, 406148, 521458, 554397, 449566, 245147]
12323B45147j20286K7476J03852J62341J76644j91512q1135R6978o1539k62925
12313I5041m5045R2765K17446J02593P163J12651j6591j3221J9411r4384l1459
12302D46370P8488l4061p1833o55j31258N9550J33150j1194j69488r363L4086
12291C23792J51502K1395j01377O0346K19512Q5781P1409k7104r3105k9538n1835
12280F30778j1408L2066j33652L731j21753K1439O3892r6042J91854k5827n6827
12269D98251l5076o7263n0065k657J6801M6288k35310j63721M3690R0687R6336
12258B37961J73648Q4275p5003J6668L1882j06059J2161L20572M2749K1272l3304
12247G26822R8099J80920N4777m3171O4070l2145N3959k07147j87392P1459Q2501
$$ y = [245147, 124861, 152337, 256189, 418530, 595174, 403662, 322527, 419505, 357966, 95041, 49996, 142761, 360207, 462800, 469963, 582614, 566023, 552802, 572213, 477829, 446370, 524858, 490797, 418964, 418309, 287051, 346601, 479751, 468557, 299069, 289706, 323792, 475294, 496689, 395312, 455658, 675170, 760951, 832360, 805256, 712151, 682613, 630778, 619370, 651436, 517784, 521515, 399762, 421201, 485093, 389051, 580905, 555078, 498251, 463175, 395912, 345847, 343190, 359991, 406279, 170969, 7248, 50938, 141625, 237961, 411609, 495884, 420881, 437549, 469431, 363372, 375533, 696105, 738854, 760126, 726822, 824921, 1005841, 1060618, 1017447, 1081517, 1049372, 1103331, 896184, 708792, 780251, 862752]
12236H62752P0663J05453K4941L09039K17404J42354n8240J49369J73565J48761
12226B146061K96606J50890K5873J00785k45751n1735J02859j34003j24762j82077
12216B084746j03323J57307P9246J09404K00765J23082J45101J30873P7447Q0421
12206C085069l8544n4206j55052p6645q5937j47849l525J6940J57924M6015p4191
12195B669999o6433K9905J18614J1058J86475L38082N28578O01714N80111M11490
12185E409593M01032N23726O23624M26007L80775L58347N97961P31567Q13675
12176A0266307R83591J065810R89706P27785R64759O31515N05907L07773L87955
12167A6831108K44462L84912R02365J349006J794959K730760L794457N524122
$$ y = [862752, 933415, 1038868, 1063809, 1372848, 1590252, 1732606, 1674366, 1823735, 1997300, 2146061, 2442667, 2593557, 2619430, 2720215, 2474464, 2422729, 2525588, 2391585, 2266823, 2084746, 1981423, 2138730, 2217976, 2327380, 2528145, 2651227, 2796328, 2927201, 3004648, 3085069, 3046525, 2992319, 2837267, 2760622, 2674685, 2526836, 2523311, 2540251, 2698175, 2744190, 2669999, 2603566, 2633471, 2752085, 2763143, 2949618, 3287700, 3816278, 4417992, 4998103, 5409593, 5810625, 6334351, 6957975, 7383982, 7764757, 8123104, 8721065, 9452632, 10266307, 11249898, 12315708, 13305414, 14033199, 14997958, 15629473, 16135380, 16443153, 16831108, 17075570, 17460482, 18362847, 19711853, 21506812, 24237572, 28032029, 33556151]
12159C3556151P955719J1037168J4291586J7353077J8996621J7176765J0293406
12152A30660493k00713j0227994j5730666j5647500j2827283q623153m904683
12145F2498501k184896o48805O61037J542059K654969L497285M024402L992713
12137G6037265K729789O49179o63329q31921m7892R27566K226546M127404N370818
12128I0525425N732138M699909K536485j81842j986888k609218j851308l93221
12120I6471480J552566M387259P635888J1544641J7544203K6032696L6345958
12113B01514691M6452887M9743223L9007669J4128916j5840915l8387802m6623848
12106B49994821m3421148l4611709k5195481j7419054j1560093p315591l888694
$$ y = [33556151, 41511870, 52549038, 66840624, 84193701, 103190322, 120367087, 130660493, 130459780, 120231786, 104501120, 88853620, 76026337, 67403184, 62498501, 60313605, 59664800, 60325837, 61867896, 64522865, 68020150, 72044552, 76037265, 78767054, 79416233, 78752904, 77920983, 77873091, 78800657, 81027203, 85154607, 90525425, 96257563, 100957472, 103493957, 103312115, 101325227, 98716009, 96864701, 96471480, 98024046, 102411305, 110047193, 121591834, 139136037, 165168733, 201514691, 247967578, 297710801, 336718470, 350847386, 335006471, 296618669, 249994821, 206573673, 171961964, 146766483, 129347429, 117787336, 110471745, 106583051]
12099A06583051j111570R92531K167073J789857L68197k211064m773878o207016
12091I7597181n887374m775773l123250j338101J61355J050734P12327q69779
12083H3527320k505212l678995l792461l220139k267121j125639Q832Q38630J882888
12074F9668103L952146P181726J1439921J5799508J7886744J4744165O068021
12067A46740334n624253j5249754j9763133j9595569j6995261j3261438r526755
12060D6724171o427933m023114k838836k361911k131694j942919j519670r35523
12052B4542571q22149o99875o55439p59539r61738j233744j098220j055199r19369
12043A6337299q59345j068752p35292n03709n82726q76275o91985o04747p44613
$$ y = [106583051, 105471481, 106464012, 108631085, 110420942, 110789139, 108578075, 103804197, 97597181, 91709807, 86934034, 83810784, 82472683, 82634038, 83684772, 84397099, 83527320, 81022108, 77343113, 73550652, 70330513, 68063392, 66937753, 66946585, 67785215, 69668103, 73620249, 80801975, 92241896, 108041404, 125928148, 140672313, 146740334, 141116081, 125866327, 106103194, 86507625, 69512364, 56250926, 46724171, 40296238, 36273124, 33434288, 31072377, 28940683, 26997764, 25478094, 24542571, 23720422, 23020547, 22365108, 21605569, 20643831, 19410087, 18311867, 17256668, 16337299, 15477954, 14409202, 13673910, 13170201, 12587475, 11711200, 11019215, 10414468, 9669855]
12034I669855o14067o07497m90147n69412n90634m83955l94865o9998l39308k50858
12024E259114J77057R0477l5070K0218J86572J02710N08074M86201J39630j1025
12014F923958q3506j62131l71970k70987k91519l53159l10730l17136l3117O3736
12004D793439J29894L0130Q024J14007j13700q6954J5992j33413k35056j88756
11994D333607r8992j85247k09459k29254k31514j47045k73315l63619k15447j50992
11984B228723q7904r5301M9260q2470o2886k1019r5495j55155J64395n8192M444
11973A788400R4876O4525j01247q8254J868l3185o5285L2367O1916Q3311K9716
11962A869008j29103p9362j07823l9121J61770M7835j46413j56838l02147j88868
$$ y = [9669855, 9055788, 8448291, 7958144, 7388732, 6798098, 6314143, 5919278, 5849280, 5509972, 5259114, 5436171, 5526648, 5491578, 5511796, 5698368, 5801078, 6309152, 6795353, 6934983, 6923958, 6840452, 6678321, 6306351, 6035364, 5743845, 5390686, 5079956, 4762820, 4729703, 4793439, 4923333, 4953463, 4961487, 5075494, 4961794, 4874840, 4890832, 4757419, 4522363, 4333607, 4234615, 4049368, 3839909, 3610655, 3379141, 3232096, 2958781, 2595162, 2379715, 2228723, 2140819, 2045518, 2094778, 2012308, 1949422, 1928403, 1832908, 1677753, 1842148, 1783956, 1788400, 1883276, 1947801, 1846554, 1758300, 1760168, 1726983, 1661698, 1694065, 1755981, 1839292, 1869008, 1739905, 1660543, 1552720, 1513599, 1675369, 1723204, 1576791, 1419953, 1117806, 928938]
11952I28938j37145P2333Q0555j878J80955o847J5993j04333j66294J4169l0347
11941H46099j58183J8274j10796k37682M8276j5498K5021P4480R3112j44029q6500
11930C52574J8781j27192M6974J14302K9808J9135k9035m7971O1523M5189j07392
11919C76696n2835m4174j30693J79556K51645j17175n8869m504l5119K4186J94758
11908E83472K3439m03963o8153O1610J82318n116J03139O664q9799L3385L2595
11897D59591J03318j72416M2563j10999Q7978N3773R0777J59019L7975j33955
11887F17624l3069j05425j01099j47956m0817r3966l8395J96565K6509R5766M8127
11876D23864k12167j36218O679J90592J84692j14485j65044L2690O4411J27786
$$ y = [928938, 791793, 864126, 944681, 942803, 1123758, 1116911, 1132904, 1028571, 862277, 876446, 846099, 687916, 706190, 595394, 357712, 405988, 390490, 415511, 489991, 583103, 439074, 352574, 371355, 244163, 291137, 405439, 435247, 454382, 425347, 377376, 438899, 484088, 376696, 323861, 279687, 148994, 328550, 580195, 463020, 404151, 399647, 364528, 388714, 583472, 606911, 202948, 134795, 196405, 378723, 373607, 476746, 483410, 393611, 426996, 459591, 562909, 390493, 433056, 322057, 410035, 463808, 554585, 713604, 751579, 617624, 584555, 479130, 378031, 230075, 189258, 95292, 56897, 253462, 279971, 375737, 423864, 211697, 75479, 82158, 272750, 457442, 342957, 177913, 210603, 275014, 402800]
11866D02800J11236j27978j81640j98716J13389J16440K08445J788l0434L0117
11856D45447k11342p8405L26311J54889p7011o9470N4916j6775j39686J7490q3090
11845C23274j45684n533R0181M700p7056l3940R524M6325p821J3780j1113R2088
11833B98725J18763R1933j17986o56J23713o3552k4559k1854j00091j24089m7697
11822A32650o3261N7944N5358p5082K6663K6258R7152k8737L1864O8615j39935
11811A89489o1333r7984m7341K53069j8065O887n9090L3239J21855J46569l8275
11800D29020k00036p4666j1883J2901l61M8827J59072k1533j62877k0749q1007
11789G6708O2186J13359P332j23950r8267l1123p3782O0964J20621j6633J9350
$$ y = [402800, 514036, 386058, 204418, 5702, 119091, 235531, 443976, 445764, 415330, 445447, 234105, 155700, 482011, 636900, 559889, 490419, 545335, 528560, 388874, 406364, 323274, 177590, 172057, 262238, 266938, 189882, 155942, 165466, 211791, 203970, 217750, 206637, 298725, 417488, 509421, 391435, 390779, 514492, 450940, 426381, 404527, 304436, 180347, 132650, 69389, 127333, 182691, 107609, 134272, 160530, 257682, 228945, 260809, 329424, 189489, 128156, 30172, -17169, 235900, 217835, 224722, 165632, 198871, 320726, 467295, 429020, 228984, 154318, 142435, 155336, 154975, 203802, 362874, 341341, 178464, 157715, 76708, 138894, 252253, 259585, 135635, 37368, 6245, -67537, -6573, 114048, 97415, 116765]
11778A16765l3434r171L069R6681J26856L2621k05181J00919n1477k558r5890
11767G9200j43161M2010K0435K2152J0952l9942k4262l7185k0479O1422K02615
11756A73757j5417N4686J17495j46695k26816o2413q3681o4355R9155J3195J34689
11745f400K18194j10712r6622q8392q9102J66668J50122J9627j51252j73968J38604
11734b3233J40560n2997j78364l1371m2592O0064J4747o5421L9124J67459J20467
11723A48443R9145p9854q8740m3699j3393M6790J05450j8895l8109M2295N7026
11712B16459K15708j64013k41192J21009K37826K26611J01956j19309K7600j25536
11702D97119j20976J00132Q4097m5202j89770K7702l7159L450o9305J9369K12082
$$ y = [116765, 83331, 74160, 77229, 173910, 300766, 333387, 128206, 229125, 177648, 175090, 79200, -63961, -21951, -1516, 20636, 31588, -8354, -32616, -69801, -90280, -28858, 173757, 158340, 213026, 330521, 183826, -42990, -105403, -189084, -253439, -154284, -141089, -6400, 211794, 101082, 4460, -83932, -173034, -6366, 143756, 163383, 12131, -161837, -23233, 117327, 64330, -114034, -145405, -187997, -127933, -113186, -178607, -139483, 27976, 148443, 247588, 167734, 78994, 35295, 21902, 68692, 174142, 155247, 117138, 159433, 216459, 432167, 268154, 26962, 147971, 385797, 612408, 714364, 595055, 622655, 497119, 376143, 476275, 560372, 515170, 325400, 353102, 315943, 319393, 250088, 269457, 481539]
11691D81539j5052N34q7087j4047Q3548J04382M5509J45441M3687o1367m0617
11680F86470O5182k4709O2559m2588M4973m7505L0444N386L8415r6924L5456P6190
11668H33349m6236J73452J628K15292J44837J07888O8193J16470O3993J06600
11658A785466r983m21898l14546j15907j90539j58550j5444j33013j96880K15393
11648D44099K58522Q3616j32268j14073j41036M0001J61946J47912n4828l34958
11638C58933p1218J27087L7675M8406N533n74r6424j05735Q0125j8387K6927J24620
11626E16968o339p1796r8592K5305M9874J06630J89896P7281r188j9040M369j35350
11614F30018j20088j85261j21206j09378J10010J09333q4275n1320p6891P3297
$$ y = [481539, 466487, 467021, 379934, 365887, 449435, 553817, 599326, 744767, 788454, 727087, 686470, 751652, 726943, 789502, 746914, 791887, 744382, 774826, 780212, 818627, 721703, 757159, 833349, 787113, 960565, 962193, 1177485, 1322322, 1430210, 1498403, 1614873, 1678866, 1785466, 1775483, 1353585, 1039039, 923132, 732593, 574043, 558599, 425586, 228706, 444099, 702621, 786237, 653969, 539896, 398860, 438861, 600807, 748719, 693891, 358933, 287715, 414802, 452477, 500883, 506416, 505842, 409418, 303683, 383808, 365421, 392348, 516968, 510629, 438833, 340241, 365546, 415420, 522050, 711946, 789227, 780039, 760999, 765368, 630018, 509930, 324669, 203463, 94085, 204095, 313428, 229153, 177833, 100942, 174239]
11604A74239p0833j47149o6791K1070Q0289K9483J27867N6323Q2956j30322K4708
11593A81840l6754l8828J03566k0954j15611J14005p2681o8877K8627j35005l3487
11582i4159n0249k1993R3166l3735j21386j18309o1349j06867K65300K84624j3275
11571B1768K9087j7477J00502j4526J50529L8684j8697n3280j02830j4570J7878
11560A37068j0529j93065J0132Q1384O1760l515j0988j15175j0190J19861J18996
11549A85739O1956q9609j48449p5565j53503r732J39251P3560j7570J41597n6716
11538E0959j28805n7801p0161n0108L952j89659r4854J40766J47753J04567R505
11527a33886K6264n3048P0766n2274k918J44037L8489j13846l8395O4888o170
$$ y = [174239, 103406, -43743, -110534, -89464, -9175, 20308, 148175, 204498, 287454, 157132, 181840, 145086, 106258, 209824, 188870, 73259, 187264, 114583, 45706, 74333, -60672, -94159, -144408, -166401, -73235, -106970, -228356, -346665, -408014, -514881, -249581, 35043, 21768, 50855, 33378, 133880, 119354, 269883, 308567, 289870, 236590, 133760, 119190, 137068, 126539, -66526, -56394, 24990, 86750, 83235, 72247, -42928, -53118, 66743, 185739, 247695, 158086, 9637, -65928, -219431, -229163, -89912, -16352, -33922, 107675, 50959, -77846, -135647, -205808, -255916, -251964, -441623, -536477, -395711, -247958, -143391, -133886, -107622, -160670, -89904, -142178, -145096, -1059, 37430, -76416, -114811, -49923, -56093]
11516e6093j03234o43J45970J41806J42324m6088r8878n2564K4863J0415j17286
11505i408n166M4628P5350r7268J110p9489r3708J59185N6308R400q2358m890
11493b6306l8179r1998L7719O6147Q4592l1993J47589O498p2416j99615l8374
11482a56336n0073J30822J43661o1737o0592M3169J6488J14564j8594j11461j26331
11471a36420K45758N5280j65175j96993p3084R3091j0390j11643M297J35917J46651
11460a2711Q9520j46137N7837M0285M6934K7800o5521K3498r5753l1799J46413
11449H0366M5439p9824K6236J68597l8685j57597k0041K9816m1994k2446o7677
11438g7810k8213O8095K08490q5203j01294j00832j7093N3538o3799j57506j05502
$$ y = [-56093, -159327, -159970, -14000, 127806, 270130, 224042, 125164, 72600, 97463, 107878, -9408, -14574, 30054, 105404, 8136, 9246, -70243, -163951, -4766, 51542, 60942, -21416, -26306, -64485, -156483, -118764, -52617, 31975, -18, 147571, 154069, 81653, -117962, -156336, -206409, -75587, 68074, 6337, -54255, -11086, 5402, 119966, 101372, -10089, -136420, 109338, 164618, -557, -197550, -270634, -177543, -187933, -299576, -295279, -159362, -12711, 76809, -69328, -11491, 28794, 75728, 103528, 38007, 61505, -34248, -66047, 80366, 125805, 45981, 72217, 240814, 202129, 44532, 24491, 54307, 12313, -10133, -77810, -106023, -37928, 170562, 85359, -15935, -116767, -133860, -80322, -144121, -301627, -407129]
11427d07129o0722K19170R9471L7163p6066K9801l4910J13443J01684N755j6143
11416A1517J77483k1475o2356l4665P8605n8261j6372k8941q9724M5155L0063
11405C1029o4798k0615n9045n8781o7830j2852J57529N3522K3412R4225Q5243
11394A61039r7377J35483O7354j1659j65288j24479o4310j16171k20636P4323
11384c61721K08091K84812Q7007n1685j46734j07475q7622R4279J11304P1765
11374A02021j90004j10980J13169J74799N8125n1492k50622j64759M2748J51686
11364a25309r1768l9499j2973J40447K00373q5431o7928p7029Q203J29413O3342
11353D1841O3680j10787q6026q4770J12813O8307R9922m4037j20723O6013N5228
$$ y = [-407129, -467851, -248681, -149210, -112047, -188113, -158312, -193222, -79779, 21905, 27660, 11517, 189000, 167525, 105169, 70504, 149109, 90848, 74476, 45535, -44189, 966, 31029, -33769, -54384, -113429, -172210, -240040, -252892, -95363, -41841, -18429, 75796, 161039, 63662, 199145, 266499, 254840, 89552, -34927, -99237, -215408, -436044, -361721, -153630, 131182, 218189, 166504, 19770, -87705, -175327, -81048, 30256, 102021, -87983, -198963, -85794, 89005, 147130, 95638, -154984, -319743, -276995, -125309, -217077, -256576, -269549, -129102, 71271, -14160, -82088, -159117, -150914, -21501, 41841, 105521, -5266, -91292, -176062, -63249, 5058, 104980, 60943, -59780, 6233, 61461]
11342F1461L9853j01622o8923p0122R3933L5507J30278o2372j95383j7808k4423
11331a79621L2324j3339N9256R8487j4470J9348Q5447k1824k07995r3811K7517
11320b08681J85223J12688l4840k285J04085N6235o4377l6171M1453p4838k0072
11309E8420q8585L489N410N8126p4768k23874q2510K27754L28709k8794k58217
11298g4840j35082N5649o4093P950O7863j9077N9253J51041N7288N8287j8745
11287A45494N3642j5009p3207j65435J51586l7769j15635j33856J04831J25567
11277D0209J17582n1576M7154k47283L3226J62033k04871k07038J67226K32914
11267H9576J50830K6678j43290j03619r9151J74720J04442R3195p7590j15514
$$ y = [61461, 101314, -308, -69231, -139353, -45420, -9913, 120365, 57993, -137390, -155198, -179621, -147297, -160636, -101380, -2893, -17363, 1985, 87432, 65608, -142387, -236198, -208681, -23458, 89230, 54390, 52105, 156190, 212425, 148048, 111877, 153330, 78492, 58420, -30165, -26676, -21266, 36860, -37908, -261782, -344292, -116538, 212171, 183377, -74840, -209922, -154273, -218366, -210416, -142553, -161630, -102377, 48664, 105952, 164239, 145494, 199136, 184127, 110920, -54515, 97071, 59302, -56333, -190189, -85358, 40209, 157791, 106215, 153369, -93914, -60688, 101345, -103526, -310564, -143338, 89576, 240406, 267084, 123794, 20175, -78976, 95744, 200186, 293381, 215791, 100277]
11257A00277j58110J0459n5729l4340o736J3729J9949R160m1048j35695k5811
11246c03895J13944J7432l2445J06970l647k4856n7043K3302Q9503j53065J58
11235b23642K0521J39431L10738Q9230j36746l3490J6259n447j14101m4259j03961
11224h5467j29730J72097M2397Q6970j33721r6555P4360k5700j13758N2802N1323
11213a04982p602J48230q3931j02922J81141J8753j12209j59885o6703O5001L8089
11202a87020J80868J10059N0663j61030j07421L9911M4402L2257q5830r6942M2759
11191a37324m4394Q008n7894J28079P8420n5189m4755R9026l1636M5422J16134
11180A03897K7158M1653j33813j4696k3437j11674j35619K58757L3010j0688j70139
$$ y = [100277, -57833, -47374, -103103, -137443, -144179, -130450, -110501, -101341, -142389, -278084, -303895, -189951, -172519, -204964, -97994, -101641, -126497, -183540, -160238, -70735, -223800, -223642, -203121, -63690, 247048, 336278, 199532, 166042, 182301, 176854, 62753, 18494, -85467, -215197, -43100, -703, 86267, -47454, -144009, -69649, -95349, -209107, -156305, -104982, -112584, 35646, -48285, -151207, 29934, 48687, -63522, -223407, -290110, -225109, -187020, -6152, 103907, 154570, -6460, -113881, -73970, -29568, 2689, -83141, -180083, -137324, -181718, -173710, -231604, -103525, -25105, -80294, -125049, -26023, -57659, -12237, 103897, 131055, 172708, 38895, 24199, 762, -110912, -246531, 12226, 45236, 34548, -135591]
11169a35591j7588K2804J88454M1399k09793p7949L1157P4323J24526L9418N2908
11158A34068j64520k61928j34856K41854L7332J49849L5105j86761J03671J53002
11148A06816J43660K3115P1616j38931p9984J697j7267j8444m3408k9568K3666
11137D2968J03308L5688j69245M6231J466M7482K1447j8555j77180j77022Q6329
11126a57083J32676J39678J48585L8259p4032j24541j91420m9282J55866O7024
11116H5730j34904p1554J53716m9791k60745k11165k5322K05530P0787J59617
11106g8101q6985k15201J73774J63636P3450O616L274O00k3636k6759r9102j45252
11094b53686j00972n2312P0836K5422J21951j2531q7538j92205k4129K07754R4359
$$ y = [-135591, -153179, -130375, 58079, 99478, -110315, -188264, -157107, -82784, 41742, 81160, 134068, -30452, -292380, -427236, -185382, -148050, 1799, 36904, -149857, -46186, 106816, 250476, 273591, 345207, 206276, 126292, 127989, 110722, 92278, 48870, 19302, 42968, 146276, 181964, 12719, 58950, 60416, 107898, 129345, 110790, -66390, -243412, -157083, -24407, 115271, 263856, 302115, 228083, 103542, -87878, -137160, 18706, 85730, -49174, -120728, 32988, -16803, -277548, -488713, -514035, -308505, -237718, -78101, -165086, -380287, -206513, -42877, 30573, 37189, 40463, 41063, 17427, -9332, -108434, -253686, -354658, -406970, -336134, -310712, -188761, -201292, -288830, -481035, -505164, -297410, -203051]
11083b03051Q3785R9214J65115J5969j1264j09769J2934J31405j58434q3324N5844
11072a576N8130j4625j2969M5397K155N5513K4847j12939j27855j60608O4267
11061a80263R8714J8867j61019n0772M6162J98072J16576o1412k6074m9165j591
11050e1905K9445J04478M6529M7084j37788m1920q6845j2529j13987p6154j88241
11039d81833J66863P4397N6473J26013K6367k0864m3047r2061J8983J48192j75210
11028a95727k888J95211k9018j62189N91J63040l635O3703r56j7526j20777k16365
11016c26536J02850R3230R2274K15213L5786o8119q032o0373n0187O0826Q0604
11005A67536p0554n277j01448j24312n7630L3138K3281j88798J15779J16856O3571
$$ y = [-203051, -119266, -20052, 145063, 161032, 149768, 39999, 52933, 184338, 25904, -57420, -1576, 56554, 41929, 28960, 74357, 76512, 132025, 156872, 43933, -83922, -244530, -180263, -81549, -62682, -223701, -274473, -228311, -30239, 86337, 24925, -1149, -50314, -51905, -22460, 82018, 128547, 175631, 37843, -4077, -90922, -103451, -217438, -293592, -481833, -314970, -240573, -184100, -58087, -31720, -52584, -95631, -187692, -168709, -20517, -195727, -198615, -3404, -32422, -194611, -194020, -30980, -34615, 29088, 28132, 10606, -110171, -326536, -223686, -130456, -38182, 177031, 212817, 144698, 136666, 76293, 26106, 86932, 167536, 96982, 91705, -9743, -134055, -191685, -158547, -135266, -324064, -208285, -91429, -27858]
10994b7858R6375J31927k6936J44209N3715j11669k03559k4582J01716q775k61779
10983a37216m6782j5911J11035j8165O2327N5312r3826o7439l6450J39900J25450
10972G8235j01672l5662j30293Q4564J12806P2844J30083j5455j73655j24736
10962a02941K1129p8032R5382P1956O1694p4154M9076P6782m6655p5794J2320
10951A0763k8966j84552r3030J45514j394R6908J02087j57554l5455j14761n9155
10940c19595Q5053J44922K35586O8503j91031K3415J37051m1926j26413j4490
10930A075k1409J807o316J10052N5496l558J9471J1135j7306o1539q5110m254
10918d56k8758r3975Q8337K3676P065K455J07267K10477o7620k22722j63885M668
$$ y = [-27858, 68517, 200444, 173508, 317717, 371432, 259763, 56204, 31622, 133338, 124563, -137216, -183998, -199909, -88874, -107039, -44712, 10600, -83226, -150665, -187115, -47215, 78235, -23437, -59099, -189392, -104828, 7978, 80822, 210905, 195450, 21795, -102941, -81812, -159844, -64462, 7494, 69188, -4966, 44110, 120892, 74237, -1557, 10763, -18203, -202755, -295785, -150271, -151665, -54757, 47330, -110224, -145679, -260440, -319595, -234542, -89620, 145966, 214469, 23438, 46853, 183904, 141978, 15565, 1075, -20334, -18527, -24843, 85209, 140705, 137147, 156618, 167753, 150447, 88908, 3798, -456, -29214, -123189, -34852, -11176, -4111, -1656, 105611, 316088, 248468, 25746, -138139, -133471]
10906a33471n7258p8277J84729J05760q8869Q6258J73905J9694p4274L3174q2324
10895H9047P7566j4699q1207Q7916K4325Q9974O43K8307N1608m1364j63672n6402
10883I2042K8332j22513P0602P6979j71706q7112J27986J59696J52515j56759
10873A70062k08829k90006n6529K21923L8966J4504J22789P4195n8041n9955r2564
10862a23485J01042j9784M4401j26094K4275J21290N0936Q7787j20072o9077k1036
10851d9817P2426K5264Q121m3008j37550n8169M5572Q1213n1646l5576L8138N8673
10839d6359r8343J17346P5681j48973k0415L6011J53041K0845m9031j29036j2457
10828a01690j62985j0606R4087N2845N7043J720j15160J05526P7834j05379r8694
$$ y = [-133471, -190729, -269006, -84277, 21483, -67386, 18872, 192777, 212471, 138197, 171371, 89047, 166613, 151914, 70707, 158623, 182948, 272922, 273565, 301872, 353480, 312116, 148444, 92042, 120374, -2139, 68463, 145442, -26264, -113376, 14610, 174306, 326821, 170062, -38767, -328773, -385302, -163379, -124413, -109909, 12880, 87075, 29034, -30921, -123485, -22443, -42227, 2174, -123920, -99645, 21645, 72581, 160368, 40296, -28781, -49817, 22609, 47873, 55994, 12986, -124564, -182733, -137161, -55948, -107594, -143170, -105032, -46359, -144702, -27356, 48325, -100648, -121063, -85052, 67989, 88834, 39803, -89233, -101690, -264675, -275281, -181194, -128349, -71306, -69586, -184746, -79220, -1386, -106765, -205459]
10817b05459J37234M5533O5437l8502j7657R5726J54597j11611k74110j39815
10807b88627m9228K40810k0172j8567O3953m5388K7472J52865R2549q1559j0166
10796F3942j10947j34711m0066Q6420J7653J22623J40968j06554k22092K880J71100
10785h784k5881r9843j07922J8182k0351n4537L1434L6880J55920K7406j44541
10774a92037J43774R4392R678m0398J6966j05655j027N2276o5300p6983r752N8003
10762a16063P1583J6583m4162J61301q6933m4687J73796K05748K50801L74794
10752I62761P66243M20438l72675o73290l83248j79763k14573k50849l3851J703
10742D2896L1062P0793j78640r9342L3913O936J36244J16111q932K4879j50966
$$ y = [-205459, -68225, -22692, 42745, 4243, -13414, 82312, 236909, 125298, -148812, -288627, -337855, -97045, -117217, -135784, -71831, -117219, -89747, 63118, 155667, 74108, 63942, -47005, -181716, -221782, -135362, -117709, 4914, 145882, 39328, -182764, -179884, -8784, -34665, -134508, -242430, -224248, -244599, -299136, -267702, -230822, -74902, -47496, -192037, -48263, 46129, 55807, 15409, 32375, -73280, -74307, -22031, -87331, -164314, -174066, -116063, -44480, -27897, -72059, 89242, 2309, -42378, 131418, 337166, 587967, 962761, 1729004, 2149442, 1776767, 1103477, 720229, 540466, 325893, 75044, 41193, 42896, 73958, 144751, -33889, -133231, -99318, -92382, 43862, 159973, 151041, 175920, 24954]
10731B4954L1221J53805O6233l4860j07283o5587O6856j10809j345J02177j55421
10720c0059k37736O623R4949j25453J94027O0641K7789J47057J32078j06936o1569
10709A01411p7335r626R3789m2696j13630k1460K7773J64887J18793j64091l23608
10698b45793j02151J62286R8088m5738j29985o1655L1535K20148O4186j03255
10688a12334j72898q3306P8468O5551l578J1621R2323l6748N6011p135j30341
10677b42366Q3815J28111k2343m0177J77046Q3643j37602j38726n1314K8509k5598
10666a57002n1804n3814J25988J3248P5272j44660j75858J41975q7015L1392J49454
10655a32824M5762J75607K12721J84279R3133J05790k27490k14465L5934j00595
$$ y = [24954, 56175, 209980, 276213, 241353, 134070, 68483, 135339, 24530, 23185, 125362, -30059, -267795, -261172, -166223, -291676, -97649, -37008, -9219, 137838, 269916, 162980, 101411, 24076, 14450, 108239, 65543, -48087, -69547, -41774, 123113, 241906, 77815, -245793, -347944, -185658, -87570, -133308, -263293, -324948, -293413, -73265, -9079, -112334, -285232, -368538, -290070, -224519, -228097, -216476, -124153, -160901, -104890, -112025, -242366, -158551, -30440, -52783, -92960, 84086, 167729, 30127, -108599, -159913, -131404, -157002, -208806, -262620, -136632, -123384, -48112, -192772, -368630, -226655, -313670, -282278, -132824, -87062, 88545, 301266, 485545, 578678, 684468, 456978, 242513, 278447, 177852]
10645A77852k00494l3941K3065P7470j1207o2033j08510k3290J65805j47375L74
10634a42284K2258o5518j31717P5765K56170J84873N3288j30793P64j08274k67516
10623b52984n2924Q1904M08138J25662j28704j31075m7314j42505j38251m9958
10613c28011K44232K05930K9302k629N6696m4289p2625m9039J10735Q2829j45350
10602H7781k1210n0691K33005J35051j53365k03367j84590k07773J25775J87091
10592e2293O0963R6765n6060j61233p1820Q5839N8874L0417l5569L1262q5471
10581i8326q7410r8581J22243N4076O2298o0263J48355p4335o6511J8860l3386
10570a12980o8862j33269O1223j10527J47034J37642l0219p1434n4791o0991P350
$$ y = [177852, -22642, -56583, -33518, 43952, 32745, -29288, -137798, -161088, 4717, -142658, -142284, -120026, -185544, -317261, -241496, 14674, 199547, 252835, 122042, 122806, 14532, -252984, -305908, -224004, 184134, 309796, 181092, 50017, 2703, -139802, -278053, -328011, -83779, 122151, 151453, 148824, 205520, 161231, 88606, 39567, 150302, 233131, 87781, 66571, 15880, 248885, 383936, 230571, 27204, -157386, -365159, -239384, -52293, 8670, 105435, 49375, -111858, -183678, -97839, -38965, -8548, -44117, -12855, -98326, -185736, -284317, -162074, -107998, -45700, -105963, 42392, -31943, -98454, -79594, -112980, -181842, -315111, -253888, -364415, -217381, -79739, -109958, -181392, -236183, -297174, -289824]
10559b89824O9914k6578J8278k5619K0461J31679K8182k66179p8357J14673P9614
10548b23756p0475J18886N7063J9976J40101r819K3550r6430k49262j45702J81966
10537b53902l166N3955r3175Q5358R2096J42896O1755K8868k2595j20578n7336
10526h5824o8136l9975J15430M6995O101R8027j13245Q8494N1391k3868Q0749
10515A56139m6012o1643l8931O9753j6300n9619n8246j84711J16759J63990O0613
10504A01792m6721j44390j18838k2794m015J76938Q2985o9761q5611o3640J1305
10493a82750K7131k0584J19336L4669p020j61947j29991P8607K41027K67950j74168
10482I2260k07214O0965j0961J4132j8832K8485J72636K2353J36646J01950j14171
$$ y = [-289824, -219910, -246488, -228210, -253829, -233368, -101689, -73507, -339686, -418043, -303370, -223756, -294231, -175345, -118282, -98306, 41795, 31976, 55526, -40904, -290166, -435868, -253902, -257068, -203113, -296288, -210930, -118834, 24062, 85817, 114685, 92090, -28488, -85824, -153960, -193935, -78505, -31510, -25409, 72618, -40627, 47867, 99258, 75390, 156139, 110127, 48484, 9553, 79306, 63006, 3387, -54859, -239570, -122811, 41179, 101792, 55071, -89319, -208157, -230951, -234966, -58028, 24957, -44804, -130415, -194055, -182750, -155619, -176203, -56867, -22198, -29218, -191165, -321156, -242549, -1522, 266428, 92260, -114954, -53989, -64950, -50818, -69650, -41165, 131471, 153824, 290470, 392420, 278249]
10471B78249j52923j4241J4139l9404l0974J30478j51470m3431r5147J11109K50298
10460B56683Q1125m0974n6095N3523k03374P296j081N5403j8392k3461j3685K5376
10448A22344j6863Q7269m938j47817L7206M8892j24683m6706N2581m2489n2225
10437h7429M3489O4739r7534j5124P3844N576j49618m8087j6307p475J08071k1059
10425a46914R1579m0045q1685j84514k4313K79834J38680j38295l52o3312j08963
10414b78300m8294M9582R3832Q8423O481l0598J6909j30954O7678J07165J52267
10403I4191N1096j85254K5732N9980j09070r9394n842M0107J14886K37584j9120
10392B04896j1216K055j50301j75482K4162J04335l2276r1558j22090m3305K9771
$$ y = [278249, 125326, 111085, 125224, 85820, 54846, 185324, 33854, -9577, -104724, 6385, 256683, 337808, 296834, 240739, 294262, 90888, 98184, 97103, 152506, 134114, 110653, 96968, 122344, 105481, 192750, 187812, 39995, 77201, 126093, 1410, -45296, 7285, -35204, -87429, -43940, 20799, -76735, -91859, -18015, -12439, -162057, -210144, -226451, -233926, -125855, -146914, -55335, -95380, -177065, -361579, -385892, -106058, 32622, -105673, -106025, -169337, -278300, -326594, -277012, -183180, -94757, -88276, -118874, -101965, -232919, -165241, -58076, 94191, 145287, -39967, -14235, 45745, -63325, -162719, -168561, -128454, -13568, 224016, 204896, 193680, 195735, 45434, -130048, -105886, -1551, -33827, -125385, -247475, -290780, -261009]
10381b61009k6250j3877n6697j37256K01251J59582N5354J29838L2154o2254j3713
10370G123m2768k2937p3965j38694J7272l3820M5036K04436J33603n5856j803
10359C7627p8031j49910J10561N1346l8647n6900J1432N4393l3715j1759N1401
10348e2202j4283j14373n7222o6636j01432J61323J52657J58730q3743l12626
10338c29807r1396J16416N6700j1777J22944p1229n9864J57630J30644K24085
10328B44346M7162k49435j67536N9789J35427J81263P283j19076j7303Q980l5746
10317I5154r4152j20125J03584J94602K5224j61812l1444Q0482j10552j7169m1821
10306g8029k01038j06662J49734J02601J6741M9158j25677J6935J25988J58512
$$ y = [-261009, -287259, -301136, -357833, -495089, -293838, -134256, -78902, 50936, 83090, 20836, 7123, -35645, -58582, -132547, -271241, -253969, -287789, -242753, -38317, 95286, 39430, 37627, -40404, -190314, -79753, -28407, -67054, -123954, -112522, -58129, -91844, -103603, -52202, -66485, -180858, -238080, -304716, -406148, -244825, -92168, 66562, -17181, -329807, -421203, -304787, -248087, -259864, -136920, -208149, -268013, -110383, 20261, 244346, 291508, 42073, -125463, -65674, 69753, 251016, 258299, 139223, 121920, 130900, 95154, 1002, -119123, -15539, 179063, 204287, 42475, 11031, 91513, -19039, -36208, -78029, -279067, -385729, -235995, -133394, -116653, -67495, -193172, -176237, -50249, 108263]
10296A08263K2614J20576J13217N8187n044k45338j82652J39708p730K6359N1958
10285B00118l8719O4745p9135j85154p0539j3133l8345Q0308p6690M0618K6794
10274h9132Q973M1545q806O0315m6371j58487m3553l2567J17922K61655J33790
10263B45284r1349j44826J83997K03506K8893L4800L4443J9935p2140J02984N9656
10252F05183J53782K68911K36242O9119m2971j42057j68801k09968k30262p7230
10242D61948j72378r3814n0564q7052k204M4562j07291r0020J6526J33099J1707
10231F4519J11307m0896J1776k8811Q0033k8782Q0628o5415k4467j62091o0027
10220f2226O8653J72395M1485L0940q0233r135K1234K47405K91803M56060L37822
$$ y = [108263, 130877, 251453, 364670, 422857, 417813, 172475, -10177, 129531, 121801, 148160, 200118, 161399, 226144, 147009, -38145, -108684, -121817, -160162, -79854, -156544, -115926, -89132, -80159, -38614, -47420, 12895, -33476, -191963, -235516, -268083, -150161, 111494, 245284, 153935, 9109, 193106, 396612, 425505, 460305, 494748, 514683, 442543, 545527, 605183, 758965, 1027876, 1264118, 1333237, 1290266, 1148209, 979408, 769440, 539178, 461948, 289570, 195756, 145192, 58140, 55936, 100498, -6793, -96813, -80287, 52812, 64519, 175826, 134930, 146706, 117895, 197928, 169146, 249774, 184359, 159892, -2199, -62226, 6427, 178822, 220307, 251247, 171014, 161879, 183113, 430518, 722321, 1178381, 1516203]
10209A516203J50031r7368n9163J65343J34075N3861l3782l42444m01465k33889
10199H51402j81843q8334K2076n8227j03680j02256j01804K7787r1730k1963O1611
10188B13039k9830k5755p9073Q2082n3799P9646N9713Q4045L6792r0575m6521
10177B29764q8880K8573J73474K92318J08833j77426p1112J24346J26461L421
10167G49772O4322L09938J25828K0285K0181n5276k13819j49553p9782j24762
10157F67134j36953j44961O9120M7145N044j04086j26179j00619N6745j1726R7456
10146C18120j23489j98872l4958J344M4376P5289J03676K84974j11718j81731
10136A77011J10651p88q7921J71476n5903k31387K3455p1026k02870k0402J50312
$$ y = [1516203, 1666234, 1568866, 1509703, 1675046, 1809121, 1862982, 1829200, 1486756, 1085291, 851402, 669559, 581225, 603301, 545074, 441394, 339138, 237334, 265121, 173391, 151428, 213039, 183209, 157454, 78381, 160463, 106664, 186310, 246023, 330068, 366860, 276285, 229764, 140884, 169457, 342931, 635249, 744082, 566656, 495544, 619890, 746351, 749772, 814094, 1124032, 1249860, 1270145, 1290326, 1235050, 1021231, 871678, 791896, 667134, 530181, 385220, 454340, 501485, 506529, 402443, 276264, 175645, 232390, 220664, 318120, 194631, -4241, -39199, -37855, 6521, 81810, 185486, 470460, 358742, 177011, 287662, 286874, 198953, 370429, 314526, 83139, 106594, 35568, -167302, -187704, -37392]
10125c7392Q2259J27936P9115o2711K23295P7886l04432J7978M5982j55040n7190
10114C7686O7112J68121q724j18478M2929m6310j33003k4307J83981R2834m8598
10103B13243o0999o0054j97693o9966J48481k4973r1688J49879M4301r4539j6357
10092f0365L0088J24822k79197k9037j4410K6062j8551P9594K02682O2813o1324
10081F3177r6158q3622N6058K17688P6523M6902l9636q4105o5033j23582m6065
10070g7853n4020Q1811k2128J6091k9239o5941R0810K05893L7093R8681K6254
10059C07452q7063J42581Q77j34969J16631M77617N26174Q19239J538773J153637
10049D860949p34653j308298j126820p11368l29109K2001j16069k7026j39726
$$ y = [-37392, 44867, 172803, 251918, 189207, 412502, 490388, 185956, 203934, 249916, 94876, 37686, 104798, 272919, 264195, 145717, 188646, 142336, 9333, -14974, 169007, 261841, 213243, 152244, 92190, -105503, -175469, -26988, -51961, -143649, 6230, 50531, -44008, -60365, -30277, 94545, -184652, -213689, -228099, -202037, -220588, -140994, 61688, 124501, 63177, -32981, -116603, -60545, 157143, 233666, 280568, 240932, 156827, 91794, -31788, -77853, -131873, -50062, -72190, -56099, -85338, -151279, -60469, 145424, 182517, 281198, 307452, 220389, 362970, 363847, 228878, 345509, 823126, 1349300, 2168539, 3707312, 4860949, 4126296, 2817998, 1691178, 979810, 650701, 672702, 556633, 529607, 389881]
10040C89881l5580j33093p0712K07085J35646j40975r5719P9932J72887L5456
10030E44808P7188K7628J9261J34398J44911K449Q5662K49167N92592Q19908J318838
10019D016810K127291L550131M844286M057565k15276l907076m739745l379096
10011F354890k116486j291285p73660m80531l15470k61533q286j9446j75553j29170
10001G83470k64752q7261M0486N7925L4157n127O4308J30216j94990k88041o8918
9990B01473J76147N8204R1901k6628M907q81P4416J59226M263j23658j56053q5230
9978C78087N9095K8727m7970m2449j12544O337J78210N3643k3488J10167l6383
9967E51432J9690P590J38983r3714l17610k2689Q8107l4301n748q0916k1799J72343
$$ y = [389881, 354301, 221208, 150496, 357581, 493227, 352252, 256533, 336465, 509352, 544808, 621996, 649624, 668885, 803283, 948194, 950643, 1036305, 1285472, 1878064, 2697972, 4016810, 6144101, 9694232, 14538518, 18596083, 18380807, 14473731, 9733986, 6354890, 4238404, 2947119, 2173459, 1692928, 1377458, 1115925, 1107639, 1088193, 912640, 783470, 518718, 431457, 471943, 529868, 564025, 558898, 623206, 753422, 558432, 270391, 201473, 377620, 435824, 527725, 501097, 506004, 505123, 579539, 738765, 743028, 619370, 463317, 378087, 437182, 465909, 417939, 375490, 262946, 269283, 447493, 501136, 477648, 587815, 551432, 571122, 578712, 717695, 623981, 306371, 283682, 371789, 337488, 331740, 250824, 229025, 401368]
9955D01368J50479N5697k21456j08756j75641j4386j46657N4685P9371j44071
9945f9367j25533J84832N0039K0589L1894r1627k7313K42249J38784n5941k14220
9934H4386j00422M5306J56739N03p0594J13418J77518q2132R7851j1590O8089
9923D79072N6397j26758R1586K26301q8519k4616R8667O7652o0908O8645L3636
9912H21155J99835J10371J44696K17942K37762M59646J60058l9832J76544J65400
9902B653577J59512L74432K88048K67295N70641K72610k05650l39525m42607j42631
9892C455702o1836p8615k81135k39198m0808k19572j82399q3925J55634K64308
9882B688156R6602J48724M59739O04646R03862J379498J709545J611714J118038
$$ y = [401368, 551847, 607544, 386088, 277332, 101691, 87305, -59352, -4667, 74704, -69367, -194900, -10068, 39971, 60560, 92454, 827, -26486, 215763, 354547, 298606, 84386, -16036, 29270, 186009, 186512, 115918, 229336, 406854, 324722, 422573, 410983, 479072, 535469, 408711, 500297, 726598, 638079, 613463, 712130, 779782, 718874, 787519, 821155, 1020990, 1131361, 1276057, 1493999, 1731761, 2191407, 2351465, 2311633, 2488177, 2653577, 2813089, 3187521, 3475569, 3742864, 4313505, 4586115, 4380465, 4040940, 3598333, 3455702, 3393866, 3315251, 3034116, 2794918, 2754110, 2534538, 2352139, 2268214, 2423848, 2688156, 2784758, 2933482, 3393221, 3997867, 4901729, 6281227, 7990772, 9602486, 10720524]
9873A0720524N98088O2224m12856m57678m80653m50976q39159p86874q46441o95082
9863F411117l08833j58318k00709k01364l53546j62253m6806J8525J91779J74507
9853E364099N27602R21692J113172R28367Q46117P24165Q18649J030707J347064
9844A3621634J789360K428728L342599M964358O715220R531198J3135916J7211531
9836G2740544K2075437K6974961K6694810J2190069r630059k3122189k5145650
9829A02777923k1412393j6253838j1133103p238531m286382j873414M71375K935602
9821D3987239N197695P585602J0541837J2748756J1995587J0233047R009444O326659
9813A17625866L002844J863381K181919J470681n58946k503219m176179o255133
$$ y = [10720524, 11318612, 11380836, 10967980, 10510302, 10029649, 9578673, 8739514, 7952640, 7106199, 6411117, 6102284, 5943966, 5743257, 5541893, 5188347, 5026094, 4979288, 4997813, 5189592, 5364099, 5891701, 6813393, 7926565, 8854932, 9701049, 10425214, 11243863, 12274570, 13621634, 15410994, 17839722, 21182321, 26146679, 32861899, 42393097, 55529013, 72740544, 94815981, 121790942, 148485752, 160675821, 151045762, 127923573, 102777923, 81365530, 65111692, 53978589, 46740058, 42453676, 40580262, 41051637, 43987239, 49184934, 56770536, 67312373, 80061129, 92056716, 102289763, 111299207, 117625866, 120628710, 122492091, 124674010, 126144691, 125585745, 123082526, 118906347, 112651214]
9805A12651214q391271q415111o335571m388582l236690j356027K304409P709160
9797I0541531J4992174K5068185L7919370N1441949O5721279P4151109N0740833
9790D10576430p846769n5438343o9920297o3019695m9373591l5636559k3905731
9783A05435445j4689511p927001k609083J567786M342773N718182O634525P042169
9775A05515285O491920N936798N228158M004133J494309j512021k099258p03645
9767A24355679j554064n429523r687943j3696337j5071821j3027983r635659o772536
9759D9479813m353959k210443j36514K040855M628759P780836J1679100J6180385
9751H5088832K0668147K3634127K0824747O620105j2695645k4191692k5497238
$$ y = [112651214, 104259943, 95844832, 89509261, 85120679, 81883989, 80527962, 82832371, 90541531, 105533705, 130601890, 168521260, 219963209, 285684488, 359835597, 410576430, 402729661, 347291318, 277371021, 214351326, 164977735, 129341176, 105435445, 90745934, 82818933, 80209850, 81777636, 86120409, 91838591, 98473116, 105515285, 112007205, 117944003, 123172161, 127176294, 128670603, 127158582, 125059324, 124355679, 122801615, 117372092, 107684149, 93987812, 78915991, 65888008, 56252349, 49479813, 45125854, 42915411, 42778897, 44819752, 49448511, 57229347, 68908447, 85088832, 105756979, 129391106, 150215853, 156835958, 144140313, 119948621, 94451383]
9744I4451383k1375908j6563902j2093169q879423o289810m403530l230027k388190
9736A9227424j581581j057092r79094q40278q08942q07624p75858n93732o14664
9727A1168559n87187m48635n01596m07845k76981j49649r1823m2286L2028l890
9717H690695J50769L67720P74333J030788J056684R08826O44969R08667N60800
9708A5094251j20208r37420j751859j989804j551605j244404q28601p48487n63430
9699E358433m17221j64033j92333j93793N451o6596P5747J44584J58732J44978
9689D853949J63442k7737O1714J39267r4736j03785p9528q8524k13460m31285
9679D179317j90640q7183m9741j75323j75281l53552k86323r4377j43399q5044
$$ y = [94451383, 73075475, 56511573, 44418404, 35538981, 29249171, 24845641, 21615614, 19227424, 17645843, 16588751, 15609657, 14769379, 13960437, 13152813, 12376955, 11783223, 11168559, 10581372, 10132737, 9631141, 9223296, 8946315, 8796666, 8704843, 8662557, 8694585, 8690695, 8841464, 9209184, 9983517, 11014305, 12070989, 12979815, 13624784, 14533451, 15094251, 14974043, 14036623, 12284764, 10294960, 8743355, 7498951, 6670350, 5921863, 5358433, 4941212, 4777179, 4584846, 4391053, 4396504, 4329908, 4405655, 4550239, 4708971, 4853949, 5017391, 4989654, 5051368, 5190635, 5095899, 4992114, 4912586, 4824062, 4610602, 4179317, 3988677, 3901494, 3851753, 3676430, 3501149, 3147597, 2861274, 2766897, 2623498, 2538454]
9669B538454j40788o0061j65323j9302k0049n2364m6783k59864l06110j13557
9659A354253j63572m0158Q1275J63265j3339j04376l2971p9957n2639j8920k5573
9648A067288J42060m5141q0042J4425j21980p7525n6984k1590j19638J27832J64338
9637I93043q524J18863o4804k9510M4058j6936J17091R1445o6874j61388n7542
9626I58922l8186p0082j61432j54879M6575n6200m0931J7176J06095j8568j13060
9615D75430n0043J22544M5172k3659l4721o9327l8966R021L9081L2912R0146J64665
9603G62255j18312j91854J0964J03754M367R7020J12468o4318j92356k08508m5495
9592B69985L1138j76139j96655J81749K34467O2636J46203P0639m9071k64887
$$ y = [2538454, 2397666, 2337605, 2172282, 2152980, 2132931, 2080567, 2033784, 1773920, 1467810, 1354253, 1190681, 1150523, 1231798, 1395063, 1381724, 1277348, 1244377, 1164420, 1111781, 1092861, 1067288, 1209348, 1164207, 1084165, 1098590, 976610, 899085, 842101, 820511, 700873, 828705, 993043, 984519, 1103382, 1038578, 1009068, 1053126, 1036190, 1153281, 1244726, 1177852, 1016464, 958922, 920736, 850654, 689222, 534343, 580918, 524718, 483787, 500963, 607058, 588490, 475430, 425387, 547931, 593103, 569444, 534723, 465396, 426430, 435451, 474532, 507444, 597590, 762255, 643943, 452089, 463053, 566807, 571174, 668194, 780662, 716344, 523988, 315480, 269985, 301123, 124984, -71671, 110078, 344545, 407181, 553384, 624023, 574952, 310065]
9582C10065l4956P0909P4489K6695j09623j3867P1148j07384L1524l0513M6212
9571C34699R0771p0222O3337J01191j54408M8027J3973j2287L4512P7693n2256
9560D75030j82N735P0002j91903k37649o8466L9752L2083l0372K8578Q8563J2673
9548B23844j2661L0926O0249J4007R1215k05140j31213R3193K05918l9801r7825
9537B32712o7021o2336J06362L9852r986n9035J9551n6026J33564o5551J46637
9526C58723N5339k7611N4325N49k2503q3473N2958P7876m1779o7139j40562j4249
9514B02454k915M2738R8605m347j38807J01680j17935j02395l6126N9687R4896
9503A97535O0716j24737J74331M6384j26239L7055R0949r586k73701m8977p097
$$ y = [310065, 275109, 346018, 420507, 447202, 337579, 323712, 394860, 287476, 319000, 288487, 334699, 425470, 355248, 418585, 519776, 365368, 413395, 427368, 415081, 449593, 527286, 475030, 474848, 480583, 550585, 358682, 121033, 52567, 92319, 124402, 94030, 122608, 211171, 223844, 211183, 242109, 302358, 316365, 407580, 202440, 71227, 164420, 370338, 330537, 232712, 165691, 103355, 209717, 249569, 239583, 180548, 200099, 144073, 277637, 212086, 358723, 414062, 386451, 440776, 441325, 418822, 335349, 388307, 466183, 424404, 357265, 216703, 202454, 199539, 242277, 340882, 336535, 197728, 299408, 181473, 79078, 42952, 102639, 197535, 258251, 133514, 307845, 354229, 227990, 265045, 355994, 346408, 72707, 23730, 16633]
9492A6633J77504K23627P4720M7134M7654n0519j23184Q2675M6174j2468j66580
9481C63370j16323k8971l5664n0096O0727p8917p5365J8502R4931Q0691Q4717
9470C17602L8432M871J38162p7008j37054p9291K1478J74593J55195K0667r6530
9459D81117o5471L4153K9387m65P4277R1910j4570j25641j37922K5467M2250l9074
9447C95418j20796k8064L6972J1378j04030J02239L3466l6357j27882J3020k3048
9436A52316L6879O2851j4718M1183K5484J86552p475j51277j21615J10831k5813
9425B95198j41480K04072P8958J09086J8975j02417k31316J33466K73377J82865
9415H20784M03758L84137P8960k972j53317q7537j95620p6868j95733j84211k38366
$$ y = [16633, 194137, 417764, 492484, 539618, 587272, 536753, 413569, 496244, 542418, 529950, 363370, 247047, 218076, 182412, 132316, 193043, 114126, 38761, 57263, 152194, 232885, 317602, 356034, 360905, 499067, 422059, 285005, 205714, 227192, 401785, 556980, 577647, 481117, 415646, 449799, 479186, 478721, 552998, 644908, 630338, 504697, 366775, 392242, 434492, 395418, 274622, 246558, 283530, 294908, 190878, 293117, 326583, 290226, 162344, 175364, 152316, 189195, 252046, 237328, 278511, 303995, 490547, 483072, 331795, 210180, 321011, 295198, 153718, 357790, 436748, 545834, 564809, 462392, 231076, 364542, 637919, 820784, 1224542, 1608679, 1687639, 1684667, 1531350, 1443813, 1248193, 1171325, 975592, 791381, 553015]
9404E53015q0438J3507L2894J7161n7048l9704j06446L7124p9898O0593N8838
9393D09598J0301r1126j84982N198J48150l1170N59J10253n1539j31409K9178
9382B23011j8820l5720J54926R6508J32563Q5459O7832J66644J98188K33447J19456
9371A423494P6469J43871K44430r0592q3589k20508j52669p8630l05613k02124
9361G54539j72325L2978j8982q2082L3584k8894o4411o6565j56270r7881Q0681
9350B14372J2216N0049J21319m7463j19498n9219N9543Q3728J0969j28394J83593
9339C81215Q0477J9579j6508r5963O2521N4178J37158K46949K92952j03511o8066
9328I90981K01175J44694N0882l6070j11797n8349j08162j98325j98505R2601
$$ y = [553015, 472577, 486084, 518978, 536139, 479091, 439387, 332941, 370065, 290167, 350760, 409598, 419899, 328773, 143791, 148989, 297139, 265969, 266528, 376781, 325242, 193833, 223011, 204191, 168471, 323397, 419905, 552468, 637927, 705759, 872403, 1070591, 1304038, 1423494, 1499963, 1643834, 1888264, 1797672, 1714083, 1493575, 1340906, 1262276, 956663, 754539, 582214, 615192, 596210, 514128, 547712, 518818, 454407, 387842, 231572, 133691, 214372, 226588, 276637, 397956, 350493, 230995, 171776, 231319, 315047, 326016, 197622, 381215, 461692, 481271, 464763, 368800, 431321, 485499, 622657, 869606, 1162558, 1059047, 990981, 1192156, 1336850, 1387732, 1351662, 1239865, 1181516, 1073354, 875029, 676524, 769125]
9318G69125j49873j60047j10143m9724M2904Q1238j95855j19182K227r9734J00739
9307A11675Q7384N6288Q5415O6458j79485o439R3744P5630q2424J8204J36762
9296D63212n3117j41532l3350l2908J39414J20287R6634j47574m5428j3517r6628
9285B55493K9957O6632J43456J48147r0012l8911K4914k69964m4634J88027K9850
9274D42955O1763j68408R6433N5145k3699M0840j921J01305L7867O503R464j5690
9262F42557j20659q1257J5004R4135L7124p1277q2438m587J30319j09915r5839
9251C53167J01084j23380j06751K5092J25307m928M5903M1586l2958o0428r4709
9240B68985p9125R9307K47769K09024l1687k0293j34838q2523k2956Q6442K2352
$$ y = [769125, 619252, 459205, 349062, 299338, 342242, 423480, 227625, 108443, 110670, 10936, 111675, 199059, 255347, 340762, 407220, 227735, 221296, 315040, 390670, 308246, 326450, 463212, 410095, 268563, 235213, 202305, 341719, 462006, 558640, 411066, 365638, 352121, 255493, 285450, 352082, 495538, 643685, 553673, 514762, 539676, 269712, 225078, 413105, 442955, 504718, 336310, 432743, 487888, 464189, 505029, 503108, 604413, 642280, 648783, 658247, 642557, 521898, 440641, 455645, 549780, 586904, 515627, 433189, 428602, 558921, 449006, 353167, 454251, 330871, 224120, 249212, 374519, 369591, 415494, 457080, 424122, 363694, 268985, 189860, 289167, 536936, 745960, 714273, 693980, 559142, 476619, 453663, 540105, 562457]
9229E62457m9717j79834M4097K45713J87465l3224q7421N6142j52417o6779L6765
9218E63247J12173M5389J9162R8891L9230J1743J24424O3906j05919M6036k307
9207A015975j9506M3376L8241J3787j24547j00836j47069P5816o251O5901J7578
9196H72465J28962J33127O8711O5282N2823J51728r314j51691j21490N2852K66474
9185A509929J49294J20503J87414N7802j00667l1485N0142K27012J44801Q0417
9175B395162O0340L3893J38724R3812M5453R7068K64264J99315P7141K57983J48316
9164C811471K61837K78124J60902J13839R9059K55910L06229L93477L80750K99015
9154F360613K97239K80276N30000N09252L24546M62828O61233O65670Q05302P58056
$$ y = [562457, 512740, 332906, 377003, 622716, 810181, 776957, 689536, 745678, 593261, 526482, 563247, 675420, 720809, 739971, 838862, 878092, 889835, 1014259, 1078165, 972246, 1018282, 1015975, 996469, 1039845, 1078086, 1091873, 967326, 866490, 719421, 795237, 788986, 854887, 872465, 1001427, 1134554, 1203265, 1268547, 1321370, 1473098, 1463784, 1312093, 1190603, 1243455, 1509929, 1659223, 1779726, 1967140, 2024942, 1924275, 1892790, 1942932, 2169944, 2314745, 2395162, 2455502, 2489395, 2628119, 2721931, 2767384, 2864452, 3128716, 3328031, 3405172, 3663155, 3811471, 4073308, 4351432, 4512334, 4626173, 4725232, 4981142, 5287371, 5680848, 6061598, 6360613, 6657852, 6938128, 7468128, 7977380, 8301926, 8764754, 9425987, 10091657, 10896959, 11655015]
9144A1655015P69866P10757P83676Q20432Q34971O79057O94201O73761P45091
9135A8366827P79847N77018K77822J06871j54128j42812l51577k66425l88539
9126A8804904p37626o74671p87126p44851q07148r09073p18383p35217o54440
9117A2036369n44224p47999o31300o70924o01365n79464m65944m60792m63751
9108F870606n77699l26252j97667l14325j73111j51745k77935n48430k46338j27503
9098C929601o9976j8952q8045j57513k26399k33491l29624j01444J1270l2909
9088B682518m4997j39976k75284q1705k121M7608j33171j62465j36531P5415L6906
9077A866197j63590n4447M3885r7741j90822J4372L547J87888M9732j95250j42813
$$ y = [11655015, 12424881, 13135638, 13919314, 14739746, 15574717, 16253774, 16947975, 17621736, 18366827, 19146674, 19723692, 20001514, 20108385, 19954257, 19811445, 19459868, 19193443, 18804904, 18067278, 17392607, 16605481, 15860630, 15053482, 14144409, 13426026, 12690809, 12036369, 11492145, 10744146, 10112846, 9441922, 8840557, 8261093, 7795149, 7334357, 6870606, 6292907, 5966655, 5768988, 5454663, 5281552, 5129807, 4851872, 4303442, 4057104, 3929601, 3859625, 3840673, 3752628, 3595115, 3368716, 3135225, 2805601, 2704157, 2715427, 2682518, 2637521, 2497545, 2222261, 2140556, 2138435, 2186043, 2052872, 1890407, 1753876, 1829291, 1866197, 1702607, 1648160, 1692045, 1594304, 1403482, 1417854, 1421401, 1609289, 1659021, 1463771, 1320958]
9066A320958k23558K3259J24028L4363N1635j9473j16543j58106q149j43323k36337
9055F48754N8383J07231J82846M0903k6508O1511j27074j09939O4783J88344l2210
9044A057024k66096k34125r5091L0780M5374J38955j44043J9139L0955J01871
9034F84743j04455o223K4917j87087j02791J06686J81099k18M4289L1891J23327
9023G96178j26378k5565O6404R1527p8110k39760j07792p4376K0409j350l2749
9012B88438l859O1554J42232o2910K3721k0298m0461R2314l2849j58119j63043
9001A26720R0330n4329J9177M4455m71K4929R1830q1228r6958O691q7795L06278
8989C89629P8776l8938Q1914N516R0082R3975j09879j88928j21223j09749l3308
$$ y = [1320958, 1097400, 1120659, 1244687, 1279050, 1330685, 1311212, 1194669, 1036563, 1028414, 885091, 648754, 707137, 814368, 997214, 1038117, 1011609, 1073120, 946046, 836107, 900890, 1089234, 1057024, 790928, 556803, 461712, 492492, 537866, 676821, 532778, 551917, 582872, 684743, 580288, 574065, 598982, 411895, 309104, 415790, 596889, 596671, 640960, 672851, 796178, 669800, 644235, 710639, 802166, 724056, 484296, 376504, 302128, 322537, 321187, 288438, 284579, 346133, 488365, 425455, 449176, 428878, 388417, 480731, 447882, 289763, 126720, 217050, 162721, 181898, 226353, 225882, 250811, 342641, 261413, 164455, 171146, 83351, 389629, 468405, 429467, 511381, 516897, 606979, 700954, 591075, 402147, 280924, 171175, 137867]
8978A37867j37324Q1235m0537n2370L6668J23996K37760J44482j68812j64820
8968A98145M5162Q7362N0688J12352J32951j42854k41992O085M4968q3739J72032
8957C81160n1640l45671o6285p41J40910K6510R71n3845K9995Q4343J35795k1182
8945B60320n2985p4716P7582M4464p7142j32853Q7186N023N4649n1008k3709o8375
8933D8436m3039m9319l7485R7384P6527r8748N0141J6547N8567R791R6717m7934
8921A77585K769j23004M1669J7410Q096r0061j24302p5092n7063Q5013K35778
8910I8798K059o4262N457K9595p5500j57601Q2962J51229m5065r0718N6399O6699
8898F0052O3086J51075P1946p1746q3367j078J7014m0011m4797Q1167J15288K03193
$$ y = [137867, 543, 81778, 41241, -11129, 25539, 149535, 387295, 531777, 362965, 198145, 243307, 330669, 381357, 493709, 626660, 483806, 241814, 247899, 292867, 209128, 381160, 329520, -16151, -82436, -83177, 57733, 84243, 85214, 31369, 61364, 145707, 281502, 260320, 207335, 132619, 210201, 254665, 177523, 44670, 131856, 136879, 191528, 140520, 116811, 48436, 5397, -43922, -81407, 15977, 92504, -6244, 43897, 60444, 119011, 128802, 225519, 177585, 180354, 57350, 99019, 116429, 124525, 34464, -89838, -164930, -221993, -136980, 98798, 100857, 36595, 42052, 71647, -3853, -161454, -78492, 72737, 27672, -63046, -6647, 60052, 123138, 274213, 346159, 274413, 191046, 189968, 206982, 166971, 122174, 203341, 318629, 521822]
8886E21822L8948k04414j13548m9k80818j6595R6262J35098q4020p7740l9716
8875b4770m2672l3447J11484J02318R479L9497Q2681J6115Q1883m4474q2476N732
8863B21350N7715K5881j82457M0716j96189m5097j15334P091J21811J27182M1685
8852A04354M7442O2660K4911q6339j45749M3818o844m5641K12270J05954K3676
8841C40512n480j04112o3075L705j2566j9506o8427j07452Q2612L2582j8591R7422
8829A57624J08950l1264q4830m6378j20197k95383M863P7032r6447K26843J11205
8818A2018J4892l2860n6960P6568M6074L1057p4155k0819l5153P780l1399P5204
8806A2247J8687m9114k0370J22637j5731j76135l4463J17484M9292J35335J5987
$$ y = [521822, 560770, 356356, 242808, 242759, -38059, -54654, 41608, 176706, 92686, 14946, -24770, -67442, -100889, 10595, 112913, 122392, 161889, 244570, 260685, 342568, 298094, 215618, 221350, 279065, 304946, 122489, 163205, -32984, -78081, -193415, -186324, -64513, 62669, 104354, 151796, 214456, 239367, 153028, 7279, 51097, 44253, -1388, 210882, 316836, 340512, 335032, 230920, 167845, 171550, 158984, 139478, 71051, -36401, 46211, 78793, 60202, 157624, 266574, 235310, 150480, 104102, -16095, -311478, -306615, -229583, -326030, -99187, 12018, 26910, -5950, -62910, 13658, 59732, 90789, 16634, -4185, -39338, -31558, -62957, 12247, 30934, -18180, -38550, 84087, 68356, -107779, -142242, -24758, 24534, 159869, 175856]
8795A75856n7080N3375j19336j18074J52532M5225r5039L8846J69139j44349j65341
8784f4246r1379j29416R0111l8219J6508J40987O8012k58055P922J66492m5130
8773a36413p8795l6073P3159J10459k1482j47087J01237J30270J39801m5974j41587
8762e2485o4641N9168K07122J03561J3278j25469N3599R8799K1021k55298j77036
8751a18381R0562m0209j41655k8831Q2253n5093k370Q1850L3372J12020L8515
8740E2033J9384J75405M0896j23143j56913j48612q9181J0710J38310j32015k8955
8729b42081M1485O2635O7899Q9067r9515P343m3893k5771M1496m6104L2560L9975
8717g4904P5782P7875K0209N2450j51100l8583N9890Q4929n1809O785r9519Q5760
$$ y = [175856, 118776, 172151, 52815, -65259, 87273, 132498, 37459, 76305, 245444, 101095, -64246, -155625, -285041, -194930, -233149, -216641, -75654, -7642, -265697, -257775, -91283, -136413, -215208, -251281, -178122, -67663, -89145, -236232, -134995, -4725, 135076, 89102, -52485, -117126, -57958, 149164, 252725, 266003, 140534, 194133, 292932, 313953, 58655, -118381, -27819, -68028, -209683, -238514, -156261, -211354, -213724, -131874, -98502, 13518, 52033, 71417, 246822, 287718, 164575, 7662, -140950, -230131, -219421, -81111, -213126, -242081, -200596, -137961, -70062, 19005, -80510, -73167, -117060, -142831, -101335, -147439, -114879, -74904, 878, 78753, 98962, 151412, 312, -38271, 21619, 106548, 54739, 61524, -37995, 47765]
8705D7765P773O6088O6999j0962j3992n8832J29082N4727n3550N6612l14o3155
8693B28241r4502m0595P0854P1131k2456Q4661k17345n9981K1803j06832J80713
8682A15692j25737j6094J4652l0247o3429L2958j4872J4260R6180J96164k212
8671B17315Q7965j84468r4627M433p4816o9862N9588M7837Q2441j4206k5091j36197
8659i9688M6052J18372k3347L3067r8563N4627q5877J1039J49972J7503R0947
8648B14104n9175n1951n3674J30993K04818M1188k5114J4104J816J2137j17218
8637C12028o1446m1931n8606Q9015j3850p2737K0388l9997l448K7809Q0616K1184
8625B59025j63173n3426Q8017O1882J26453P1271j4033j06360k8645j88301m8030
$$ y = [47765, 55538, 121626, 188625, 177663, 163671, 104839, 233921, 288648, 235098, 291710, 291396, 228241, 133739, 93144, 163998, 235129, 212673, 297334, 79989, 20008, 41811, -65021, 115692, -10045, -26139, -11487, -41734, -105163, -72205, -87077, -72817, 23363, 219527, 217315, 305280, 120812, 26185, 30618, -44198, -114060, -54472, -6635, 75806, 61600, 36509, -99688, -53636, 64736, 41389, 74456, -24107, 30520, -55357, -44318, 105654, 123157, 214104, 154929, 102978, 49304, 180297, 385115, 426303, 401189, 415293, 417109, 429246, 312028, 250582, 208651, 150045, 239060, 225210, 152473, 172861, 132864, 129416, 157225, 237841, 259025, 95852, 42426, 130443, 192325, 318778, 390049, 376016, 269656, 241011, 52710, 4680]
8614D680l9214M6503K2755J14409K10316j7019j32455r6375J27432R6148J35939
8603D73119j79473j79410J79107M9359j10605K28226M281M806m5642l06066n0311
8592F7391K2288J42674J03899n5143j67282Q2880j0242j68210p36J1168J01675
8581A30362P1002J77784P1512J50547P244j86642j78390o6110j46223q4784J15876
8570F2178L0594r8181r5644Q3004M1742j4568P8282n742r9525l3575L3772j125
8558a8788R6029j69241N343J7878O2997m3551q2328O4726R1018N9269M0051Q3354
8546B06757j37164l309q4245l5685o4557k2164p6903m156j08o6489Q7932L02999
8534A02908K69420L5958J378k29468k9668K9004j1979j55579j27548N6662M2081
$$ y = [4680, -34534, 11969, 34724, 149133, 359449, 342430, 209975, 113600, 241032, 337180, 473119, 293646, 114236, 293343, 342702, 232097, 460323, 464604, 469410, 423768, 117702, 67391, 89679, 232353, 336252, 281109, 113827, 196707, 186465, 18255, 17519, 28687, 130362, 201364, 379148, 450660, 601207, 608451, 421809, 243419, 177309, 31086, -53698, 62178, 92772, -5409, -101053, -18049, 23693, 9125, 87407, 81665, -17860, -51435, -17663, -18788, 77241, -92000, -86657, -68779, -5782, -49333, -131661, -66935, 24083, 83352, 123403, 206757, 69593, 66284, -17961, -53646, -118203, -140367, -217270, -221426, -221534, -288023, -200091, 102908, 372328, 408286, 409664, 180196, 150528, 179532, 167553, 11974, -115574, -58912, -16831]
8523a6831R2649J07293n9854k21403Q9259K10239j09030j45470M2340J78440N7542
8512B25174n6093k27193O9028J10729J33567J38704k34877k70637n0957M4219
8502a18336K20867j2006J810N606j38990l4925R8995L6536R496R3570R101n4659
8490A17065J73401j8845l2069j17864K9434R2169j9884o0437Q530l5292j75188
8479c8980j68191J26041L0848r7367L1338K48493L2459j34815K375J27633j19677
8468D0157L8280J51335N9091k21129j42488q3709L3169J75943N5015M9186j4458
8457A40392j84086p4226K22249J16167J2237l26399p6J75368P2449r7597l784
8446E2694J13442m1761j79920o7312J0723m2885J33053m5319j02192P8923J57155
$$ y = [-16831, 75818, 183111, 123257, -98146, -8887, 201352, 92322, -53148, -10808, 167632, 225174, 169081, -58112, 10916, 121645, 255212, 393916, 159039, -111598, -162555, -118336, 102531, 90525, 92335, 97941, -41049, -75974, 23021, 59557, 69053, 162623, 171724, 117065, 290466, 271621, 239552, 121688, 151122, 243291, 223407, 162970, 171500, 136208, -38980, -207171, -81130, -50282, -147649, -116311, 132182, 164641, 29826, 32201, 159834, 40157, 78437, 229772, 288863, 67734, -74754, -158463, -125294, 50649, 105664, 154850, 140392, -43694, -117920, 104329, 220496, 232733, -93666, -93742, 81626, 154075, 56478, 52694, 166136, 124375, -55545, -122857, -112134, -155019, -21966, -67285, -169477, -90554, 66601]
8435F6601p0800j59226K13183Q9903j8140J92572J13593k0660p9382j55425l7812
8424A34407m9150k6894j4910p612j86695p8878q0408J82995R9480m2938k16188
8413b86791P6940N9387J46123Q5411J26413m505k05116r3030J9711p0473R5820
8402e0110J76400J60306J2583o1873o8061j46566P9787L255N4220Q2668J645R171
8390B53425j9130o8066k053R5774O3719q9837k46449j53404J45566L1088R6514
8379A07147O4298m5787j00936n3680J72042j2040j15937Q4785j377n1074M6329
8368I3770O2868n6821j78050p8946j0486N7412N5531K3809R5848N9007N4033m0997
8356A36978r3557J0868q6787j73818J08948J71345j19821j2943l4018Q1544L1064
$$ y = [66601, -4199, -163425, 49758, 139661, 121521, 314093, 427686, 407026, 327644, 172219, 134407, 85257, 58363, 43453, 35841, -150854, -229732, -310140, -127145, -27665, -70603, -286791, -209851, -150464, -4341, 81070, 207483, 202978, -2138, -95168, -75457, -145930, -50110, 126290, 286596, 299179, 237306, 169245, 22679, 102466, 105721, 159941, 242609, 244254, 253425, 234295, 166229, 164176, 259950, 323669, 233832, -12617, -166021, -20455, 10633, 107147, 171445, 125658, 24722, -28958, 143084, 131044, 15107, 99892, 98515, 47441, 93770, 156638, 99817, -78233, -157179, -167665, -110253, -54722, -30913, 64935, 123942, 177975, 136978, 43421, 54289, -32498, -206316, -97368, 73977, -45844, -58787, -92805, -11261, 19803]
8345A9803K8194J95443l083j08272J29342M4514j11745j00871N070N5787m2307
8334A11875n0793J59128p1392j64450p0696l7493m1311K8761P3376R693J202k7698
8322g9798J425j08867L5422J07618N2327J45431J25118j29513n8654N254j16092
8311b0329K3790R6103N6999j10520o1293r0429k6129N9129K2297N9721q1992j49499
8299b22152j1701J4131O2175J07885Q1989l70176l5818J52750J81879J87147j37485
8288A0624j3085J30889m4003q641k5423P6976n9230m6261n3159j16078P8061J59331
8276I0001J33298j46055o373N1099j10388n3415P436j35335j13915R8042J82578
8265c027Q6733r1039j28262N9926J23519o381O1997q490j14639j61940m5748K3402
$$ y = [19803, 47997, 243440, 240357, 132085, 261427, 305941, 194196, 93325, 98395, 154182, 111875, 61082, 220210, 148818, -15632, -86328, -123821, -165132, -136371, -62995, -53302, -52100, -79798, -78373, -187240, -151818, -44200, 8127, 153558, 278676, 149163, 90509, 95763, -20329, 3461, 99564, 156563, 46043, -15250, -105679, -131808, -72679, -50382, 9339, -72653, -222152, -233853, -219722, -157547, -49662, 32327, -337849, -373667, -220917, -39038, 148109, 10624, -2461, 128428, 84425, 75784, 50361, 127337, 68107, 21846, -31313, -147391, -69330, 90001, 223299, 77244, 70871, 121970, 11582, -41833, -34397, -169732, -283647, -185605, -3027, 83706, -7333, -135595, -75669, 47850, 41469, 103466, 94976, -19663, -181603, -227351, -203949]
8253b03949J38661Q9922J6169k591j5025j8376j40091J75997m630L8663l2286
8242D2464n3559Q7656K3921J6954M5410P0161m2453M1457n4260m8321j48403N547
8230a3426J89837J43710j76388q7233M129P3714n1922l7504r6230j18669J56538
8219a3444J61629q1279n1736J62286J11904m9694j43288l8659j1227N4018M1599
8208A42109m6912j9688j53897j19017K4145J42138J00470O4215o3968r1257j9042
8197d0704o0794J53684J7787Q79j04860J21495P6602k12698j14680J33387m1918
8186g1820K3385N3752R658R0332L0350J8567L221l6688J82875R2627N0776j59850
8174B87185l37176r0843k2256o3827N6475k4856Q4673K032L0495J20136k1356
$$ y = [-203949, -65288, 24634, 40803, 38212, 23187, 4811, -135280, 40717, 36087, 74750, 42464, -11095, 76561, 100482, 117436, 162846, 233007, 190554, 232011, 177751, 129430, -18973, -13426, 176411, 320121, 143733, 56500, 60629, 134343, 82421, 44917, -51313, -169982, -13444, 148185, 66906, 15170, 177456, 289360, 239666, 96378, 57719, 46492, 100510, 142109, 95197, 75509, -78388, -197405, -173260, -31122, 69348, 133563, 69595, -21662, -40704, -101498, 52186, 69973, 70852, -34008, 87487, 164089, -48609, -163289, -29902, -71820, -48435, 5317, 14975, 105307, 135657, 154224, 157445, 120757, 303632, 396259, 447035, 287185, -49991, -140834, -163090, -226917, -170442, -195298, -110625, -108593, -78098, 42038, 20682]
8163B0682J01431J18687q1562M7503J3851r2761j71884j60172Q877j1271P9878
8152a26741j08564K7578J65539R4797j23508M441Q5351J03793L3421o2406k03499
8141a09798n0351q2101j02244K49309J39289r3704N3255l0325L6142q9521P4489
8130e560M6454J02800l0828j21645q5687N3510J75410q3809m0077J05253m0153
8119G5668j37174j70762N3257K99754J71589r2393j18791l2862k41949M1926l5860
8108a87597J9807J09218n719q7021J42475R0188N2152j32881j62188j47135J85004
8097a23697o5897J22579j25987j5361J92596J05481j72586P4609l791K1934k1136
8086a1256J18142N7640j68737p3132n9137J4131r4605K2706R7033J09574j6495
$$ y = [20682, 122113, 240800, 159238, 206741, 220592, 127831, -44053, -204225, -195348, -206619, -126741, -235305, -207727, -42188, 52609, -70899, -66458, 18893, 122686, 156107, 93701, -109798, -160149, -242250, -344494, -95185, 44104, -49600, 3655, -26670, 9472, -80049, -5560, 40894, 143694, 112866, -8779, -94466, -40956, 134454, 50645, 10568, 115821, 75668, -61506, -232268, -179011, 120743, 292332, 199939, 81148, 48286, -193663, -151737, -187597, -167790, -58572, -64291, -151312, -8837, 81351, 133503, 622, -161566, -308701, -123697, -189594, -67015, -193002, -208363, -15767, 89714, -82872, -8263, -12054, 9880, -11256, 106886, 164526, -4211, -77343, -136480, -122349, -216954, -194248, -97215, 12359, -4136]
8075d136j19180j43517J99002J65330o238P2782O7506q1942k05586j0251l7397
8064a03627J14091K00257o1564j32325j22337j32486M7389M3894J06816n7671
8054i7563J47274J1279k3164l1969J27287J9063l6491n3752j21306J06545j5195
8043C2008J10895J737J20240j33278j36750n5358N9476M2960p7883n372L5550
8032e775K3473J59939J105J0610n9472r7348k9847J38613L1439j8643K1671j18698
8020E7067n2275J20216J06753R1279r5819j53508j38192K9021J45733N2155k4435
8009A37995J13698j26870j57357J85610R2344j44524j10843n4050M6479k5017
7999d2535M3512K47006O5176O184J762q1057k675m2779r1297q4204m8348Q0825
$$ y = [-4136, -123316, -266833, -67831, 97499, 91261, 164043, 231549, 149607, -55979, -66230, -103627, 10464, 210721, 149157, 16832, -105505, -237991, -190602, -146708, -39892, -97563, 49711, 60990, 37826, 5857, 133144, 152207, 115716, 61964, -59342, 47203, 32008, 142903, 144640, 264880, 131602, -5148, -60506, -1030, 41930, -35953, -41325, -5775, 17698, 177637, 178742, 189352, 129880, 32532, 2685, 141298, 172737, 154094, 175765, 57067, 4792, 125008, 231761, 323040, 227221, 73713, -64479, -35458, 110275, 162430, 137995, 251693, 124823, -32534, 153076, 245420, 100896, -9947, -63997, -17518, -42535, 977, 247983, 313159, 319343, 321105, 240048, 237373, 194594, 103297, 19093, -29255, 51570]
7987E1570J21788j2158j93305n662K07447K01592j2795j72520j44776p2707j23594
7976a55120L9545K34000J07271n3616k5806j37540O3761K29610J41916J29385
7966E73406k0376k01795j07546o2598j42744R6398J83327K5384l7812L034o7995
7955B40683j12119J26343m6869q050J16062L1935J9865j5551j34354j3584P2146
7944B76507m1135k9801q9682R6452J19542M1237q1566j52824j31545K9727j7041
7933A9871r0379Q9768J89791j0024j02836N7268J99185J83319j17166n9440n1901
7922C07456J33525p6063r5102j69235L8560o8990q2644j32579J1886k0168L3859
7911a19495K700J06802P2546O4177J68159o5904o3358J76271m1455j90378r1094
$$ y = [51570, 173358, 161200, -32105, -37767, 169680, 371272, 358477, 185957, 41181, -31526, -155120, -115575, 118425, 225696, 172080, 146274, 8734, 72495, 302105, 444021, 573406, 553030, 351235, 243689, 181091, 38347, 134745, 318072, 343456, 305644, 308678, 240683, 128564, 254907, 208038, 199988, 316050, 347985, 367850, 352299, 217945, 204361, 276507, 235372, 205571, 115889, 212341, 331883, 373120, 291554, 138730, 7185, 36912, 19871, -70508, 19260, 209051, 199027, 96191, 153459, 352644, 535963, 418797, 359357, 307456, 440981, 364918, 269816, 100581, 139141, 70151, -12493, -145072, -133186, -153354, -119495, -116795, -9993, 62553, 126730, 294889, 228985, 165627, 341898, 300443, 110065, 18971]
7900A8971J01817J15983P1061J35305l3397q3458J71550j14973l6762j84513k04839
7889d3255j28505J8723Q1105O8979L6291K46099R6018l6977n0620j39269k17720
7878f9131n9063J23694M6491j0758l5550j11109J06416J01938r8108j02388p9689
7867a87257n3155N6919P4110R5077J95135P6760o3889j9759Q734j43650n2458
7856a3433p0173J13202J67229j34230n0644N6975k3551M0852R2645j18739Q3074
7845A43207Q4450o2225j56503J9320K508n7815k08033k22157N0602J50402m3104
7834b99348j08052K17270K14492R689q200Q106k1389o5838O3387O457l3501q9316
7822a06243O613l5548Q4654R6378J0818J73N3267o1658n4564j20360J61405J73080
$$ y = [18971, 120788, 236771, 307832, 443137, 409740, 326282, 497832, 382859, 346097, 161584, -43255, -171760, -153037, -71932, -2953, 33338, 279437, 375455, 338478, 287858, 148589, -69131, -128194, -4500, 41991, 31233, -4317, -115426, -9010, 92928, -5180, -107568, -187257, -240412, -183493, -109383, -14306, 180829, 257589, 193700, 173941, 182675, 39025, -13433, -83606, 29596, 196825, 62595, 11951, 68926, 45375, 86227, 178872, 60133, 143207, 227657, 165432, 8929, 28249, 30757, -27058, -235091, -457248, -406646, -256244, -299348, -407400, -190130, 24362, 34051, 25851, 33957, 12568, -53270, 10117, 16574, -16927, -106243, -99630, -135178, -50524, 45854, 56672, 56845, 110112, 48454, -6110, -126470, 34935, 208015]
7810B08015j2658j54921j10194L3030l0338N5578j11563l0489l0580O6980R7091
7799b0049P3069p7300K7830K5490j06811N5052R3849n679J725Q9269r1818j86941
7787a22314q7464K3722J6808K6052p1520N3746K06638O3657J2031k8926j37933
7776d5503o7875O1542J44456P2281N1791O7607j27944j21449o0366k9406j9386
7765g4252N1344R1883j24212k30996p1823M9939J49739P2050j30923K216K14808
7754b27J24457r832p5187k1535q2208j45203l063J30872n09O7014j9273p8139
7742a12833L4191R0909J3643N0731J494j8498K06742m2276O3813n8703j26840
7731A02373j9100k0023j10801l07333p776J05100o5277n5435n5687J0528J13219
$$ y = [208015, 195357, 40436, -69758, -36728, -67066, -11488, -123051, -153540, -184120, -117140, -20049, 53020, -24280, 3550, 29040, -77771, -22719, 71130, 65451, 67176, 156445, 64627, -122314, -209778, -186056, -169248, -143196, -214716, -160970, 45668, 109325, 121356, 92430, -45503, -113378, -51836, 92620, 164901, 216692, 284299, 156355, 34906, -25460, -54866, -74252, -22908, 68975, -55237, -286233, -358056, -308117, -158378, -86328, -217251, -215035, -227, 124230, 114398, 39211, 17676, -64532, -209735, -212798, -81926, -82435, -15421, -34694, -112833, -78642, 12267, 25910, 76641, 78135, 59637, 266379, 224103, 287916, 229213, 102373, 83273, 63250, -47551, -354884, -362660, -257560, -322837, -378272, -433959, -423431, -310212]
7720c10212Q0053J3679j42543J3774J49900J0866j75764l9329R9335J26570R1256
7709h2415j31690j33825K05321P2160j6040L8894K6582j68017K5506M4561r4139
7698b13102Q270j8700J9432n074p9675n8090M0499M5651L9639k7335J5355J08354
7686a24776O9175J7890j78468O0496Q5060k10496j85404J1096Q4272J87219J95841
7675A1905l4485j37543j32514K42344M7564j08517j07221J3507k0106N7395N0434
7664a17237O9086P1182J65818j34823j34821J3155N8767n9636M3470P6012l4202
7653A6771r245J5603N1497n9755O3814o4756m1210j16896q4076o8041n259P0176
7641b31377K01122Q1402q2795k34328P4504J05500J6196J49135J55006J3149j16959
$$ y = [-310212, -230159, -216480, -359023, -345249, -195349, -184483, -360247, -399576, -300241, -173671, -82415, -214105, -347930, -142609, -70449, -86489, -47595, -21013, -189030, -163524, -118963, -213102, -204832, -223532, -204100, -209174, -288849, -346939, -306440, -260789, -221150, -248485, -233130, -124776, -55601, -37711, -216179, -155683, -70623, -281119, -466523, -455427, -371155, -183936, 11905, -22580, -160123, -292637, -50293, -2729, -111246, -218467, -204960, -225066, -167671, -117237, -48151, 23031, 188849, 54026, -80795, -67640, -8873, -68509, -25039, 50973, 16771, 7526, 23129, 74626, 14871, 78685, 13929, -27281, -144177, -228253, -296294, -301553, -231377, -30255, 51147, -31648, -265976, -191472, -85972, -69776, 79359, 234365, 247514, 130555]
7630A30555j27428j20517p8595K08719J52660j36281n8482J16535o2064k59949
7620b34847o049o4979J43531K42045j71380J641J34866N1294m9503p498P5622
7609A14743m4049r6033j42051m4369J29502J20629M2058P8948j3246r3240k4226
7598B8666n9819j02579j9670l7263p994J60292r6090j38717j02228R1809J99642
7587h3951m4062N7426p616J8238J48134N472p0437L2832n2448k24978j28041N4971
7575b94460O3656K52200j7057l7920j75009p6532Q2077J12621j3066l5314j45296
7564b84100n9433o706r843L8961J47162J12815n0852m6254p431J23902M1207j00079
7552a00651L6415m9149j18161M5095N2961J68630N1847o0396n50j34269j46285
$$ y = [130555, 3127, -117390, -195985, 12734, 165394, 29113, -29369, 87166, 25102, -234847, -240896, -305875, -162344, 79701, -91679, -90038, 44828, 96122, 46619, 39121, 114743, 70694, -25339, -167390, -211759, -82257, 38372, 80430, 159378, 146132, 52892, 28666, -31153, -133732, -153402, -190665, -198659, -38367, -134457, -273174, -375402, -283593, -83951, -128013, -70587, -78203, -59965, 88169, 93641, 23204, 56036, 3588, -221390, -349431, -294460, -230804, 21396, 4339, -33581, -208590, -285122, -203045, -90424, -103490, -138804, -284100, -343533, -350239, -360082, -321121, -173959, -61144, -111996, -158250, -165681, -41779, -572, -100651, -64236, -113385, -231546, -186451, -133490, 35140, 86987, 26591, 26041, -108228, -254513]
7541b54513o4589n5262m0670R7162K8737J2688j180j29403m0138J17882K04483
7530a24803L7046L4957Q0031j29326r7871J8507Q8640J60596O5423j24052k69432
7519b60284N88J46390o0794J08187K7357j45594J58077m5556K09323M7567k6998
7508A58263n958M3026M7307l4979o3222j59230n9615o9582j73854o4691K13190
7497a69345J88368n8336o3898n5888l5594J4719J4648k3102J34301N0876p6673
7486g9924r3474J69206R5562P0623r4935q9737J10770k00392Q426K3308k2704
7475a03271j5226J80320O7115J6009m2922m9025j02644j00813J3950J7817J29459
7464A0769N8746l3949j51099m0616O8038r2145J9539J56406J00965o0706j0371
$$ y = [-254513, -319102, -374364, -415034, -317872, -289135, -276447, -277627, -407030, -447168, -329286, -124803, -87757, -52800, 27231, -102095, -199966, -181459, -92819, 67777, 133200, 9148, -260284, -259696, -113306, -174100, -65913, -38556, -184150, -26073, -71629, 137694, 185261, 158263, 152305, 195331, 242638, 207659, 144437, -14793, -74408, -143990, -317844, -382535, -169345, 19023, -39313, -103211, -159099, -194693, -179974, -165326, -188428, -54127, -3251, -79924, -173398, -4192, 91370, 161993, 67058, -22679, 88091, -112301, -103875, -80567, -103271, -118497, 61823, 128938, 144947, 102025, 53000, -49644, -150457, -136507, -118690, 10769, 69515, 35566, -115533, -156149, -88111, -180256, -160717, -4311, 96654, 35948, 25577]
7453B5577J27346k3612j87482q6653O8664Q3578R3917n8323J758N6433n0139J7206
7441F8270o8049J14201K60395j4478j16535k57289k44383M2072m6394J27148J21492
7430a3550O8864Q4657j49224m7038M5028K0790O1277N4307k00096m8807j25432
7419b49224o8415O8230N7859m0450K27002K62121Q2442j24769j66154r3321m2941
7408h7620J04097k54743o830J01225j15470J22092L3935L0278K38724j3535j8689
7397A33464p5551m5971j2842k60954r5194L0674K26747N4471j59328K02351R5265
7386I3132q5025k6881q0951J04238K179M7950N3700L7942P9630p814n2883O309
7374A71526j27765K0186K8757r7668j39664q8211N2365J21470K07091M4874m676
$$ y = [25577, 152923, 129311, -58171, -144824, -76160, 7418, 101335, 43012, 44770, 101203, 51064, 68270, 221, 114422, 374817, 360339, 243804, -13485, -257868, -215796, -262190, -135042, -13550, 55314, 139971, -9253, -56291, -11263, 9527, 70804, 125111, -74985, -123792, -249224, -317639, -249409, -191550, -232000, -4998, 257123, 339565, 214796, 48642, -44679, -87620, 16477, -238266, -245096, -143871, -259341, -137249, -103314, -73036, 165688, 152153, 133464, 57913, 11942, -900, -261854, -357048, -326374, -99627, -45156, -204484, -2133, 93132, 8107, -18774, -99725, 4513, 6692, 54642, 108342, 146284, 225914, 218100, 165217, 171526, 43761, 63947, 92704, -4964, -144628, -232839, -180474, -59004, 148087, 192961, 188285]
7363A88285o1251n0384k02160p7870M5328R7087P2411J07809J04167j81860N0795
7352I2357Q0203q8728J64814J5331j09491j90841o2753m0322N319j6151k8311
7341a78573q5079m0058k8322J76064J04497m0015P5698m088o5339Q9683J07528
7330A11996l7798q3764K4190J17814J11849o574K26654q5017o3988l3195k16928
7319F5239n1275K6168n6695k4003K4211o0277O6819N5271n3688n5045O3645N3208
7307E3578P9408j17507j17832m5138J54894m402q6882Q8655n7949M5155J16963
7296A08943p424j51247n950O064O6835n8701R9415J32451K18571j66007q1306
7285A61644j69257j56309q5368N662R4718J07454J54262j56206j19145o2430j53567
$$ y = [188285, 127034, 76650, -125510, -203380, -158052, -60965, 11446, 119255, 223422, 41562, 92357, 172560, 83832, 248646, 263977, 154486, -36355, -99108, -139430, -134111, -150262, -178573, -263652, -303710, -332032, -155968, -51471, -91486, -15788, -19876, -85215, 4468, 111996, 74198, -9566, 14624, 132438, 244287, 237713, 464367, 379350, 315362, 282167, 65239, 13964, 40132, -16563, -40566, -16355, -76632, -9813, 45458, -8230, -63275, 370, 53578, 132986, 15479, -102353, -147491, 7403, 3001, -83881, 4774, -53175, -8020, 108943, 101519, -49728, -55678, -49614, 17221, -41480, 57935, 190386, 408957, 242950, 161644, -7613, -163922, -249290, -243628, -148910, -41456, 112806, -43400, -162545, -224975, -378542]
7274c78542N3343Q2375J34758m7747O9963l8052j06144J06247o2095P5839Q5772
7263b4283n9497j30041K11328J27675j01461j08275K1876J60908J18709j56548
7253F0391k36234j51998R5502K47885j04469r4519J71138J60453k8808J54691
7243B74032P0587j21716j08382n5477l8554j16436Q1352Q6141O4327l6800j04453
7232e379m0758L8276j02008L9591j5072q0702j36721O6865K52221l5121J7225
7221a583J41588o3197k709k3310q7606j5757J45909j0978m0322j89755J5506N3207
7209g9007j9943R580J70013J89150m2927M7437L5449j34627J180k56991j90039
7198b70725J24909l3134J11488k4690j06026J1215J11260o599K9553j13352L1010
$$ y = [-378542, -325199, -242824, -108066, -155813, -85850, -123902, -230046, -123799, -185894, -110055, -24283, -83780, -213821, -2493, 125182, 23721, -84554, -62678, 98230, 216939, 60391, -175843, -327841, -232339, 15546, -88923, -183442, -12304, 148149, 119341, 274032, 344619, 222903, 114521, 59044, 20490, -95946, -14594, 71547, 135874, 99074, -5379, -46137, -7861, -109869, -70278, -85350, -166052, -302773, -235908, 16313, -18808, -1583, 140005, 76808, 74099, 50789, -36817, -52574, 93335, 82357, 42035, -147720, -132214, -79007, -98950, -89370, 80643, 269793, 226866, 274303, 309752, 175125, 176305, -80686, -270725, -145816, -178950, -67462, -92152, -198178, -186963, -75703, -82302, -52749, -166101, -135091]
7187a35091J7231R2964N3348j15753m6177K155J64171k2126o8311J9622M8562
7176A0595J12804O1123M4867J4397m6152q4685j64317j0738P019R7521J38491
7165A80925K9394N7113K1323n2835l1031j47251p2722K2910n2922L4128k333q3472
7153i6773q4350P9435O6097q4160K7192J40017O4517n7056k67130j18217J07028
7142b23400J25126L8007M273k0354J27555J14072l2870j50613q0217n2975p5217
7131b26613K17840O4690j25343j10343L0426K07344o8504j53587p2265J43935
7121i2420k8468j00646l2902P8004J38137L176l5227j18950l7124j20903J86554
7110a60769N7903L2277N9077K6469j5828q3044l9711R0217p687n0987p6217q8899
$$ y = [-135091, -117860, -24896, 28452, -87301, -133478, -131323, 32848, 10722, -57589, -37967, 10595, 123399, 184522, 229389, 243786, 197634, 112949, -51368, -62106, -55087, 42434, 180925, 210319, 267432, 288755, 235920, 204889, 57638, -15084, 7826, -45096, -10968, -13301, -96773, -181123, -101688, -35591, -119751, -92559, 47458, 111975, 54919, -212211, -330428, -223400, -98274, -60267, -55994, -76348, 51207, 165279, 132409, -18204, -98421, -151396, -226613, -8773, 55917, -69426, -179769, -149343, 58001, -10503, -164090, -236355, -92420, -120888, -221534, -254436, -176432, -38295, -35119, -70346, -189296, -226420, -347323, -160769, -102866, -70589, -11512, 14957, -871, -83915, -123626, -33409, -41096, -92083, -168300, -257199]
7098b57199n9600K85092R9368K2943l9976n3296j01871k5505M2173j42011p0269
7087c00151K06656o7333j88630R8160J53774K6515Q8488R7957r0173j04364L4910
7076d4191k9340q7453J33380m7887k26953M0400K25287k6027p0934p6535J6115
7065a94138K0712q3592K07900K68250l2312k6332Q7962J7529m1277q4961l2955
7054A06786j5953N0517j5148q4834j40157j36106J32424J45689N7763n0626p6016
7043b5661j72940j78901J30496K49345J98786Q8865j26614J8847R051o7937m4800
7032G8537j93964n0J14596j22099q5586k3318J7913Q925Q578J44613K03204R3191
7020B44540j78882j47206n8717r63O3753J8249p6263J9275J70891O3293O1070
$$ y = [-257199, -316799, -31707, 67661, 90604, 50628, -2668, -104539, -130044, -87871, -229882, -300151, -93495, -160828, -349458, -251298, -97524, -71009, 17479, 115436, 25263, -79101, -44191, -73531, -160984, -27604, -75491, -302444, -262044, -36757, -62784, -133718, -210253, -194138, -173426, -257018, -49118, 219132, 186820, 160488, 248450, 265979, 224702, 139741, 106786, 90833, 141350, 126202, 41368, -98789, -234895, -102471, 43218, 100981, 50355, -25661, -198601, -377502, -247006, 2339, 201125, 289990, 163376, 182223, 191274, 123337, 78537, -115427, -115477, -881, -122980, -208566, -231884, -213971, -205046, -196468, -51855, 151349, 244540, 65658, -81548, -140265, -141228, -77475, -59226, -135489, -116214, 54677, 117970, 179040]
7009A79040J67683j34283j69191n1080j06477M0792n5722J9836N7813M8460L0231
6998B7102j66935o975J12382K3240O3292J2030r270J6967N357n4176q4238O3328
6986B104j34219R7668J70726o8989j67845l0952j05678O9051K37537R6987l6407
6975A29983j28943j1124O7742r2001k41008J62402J30102l5391P2144J0012n0493
6964A3425n106j3138j98010j22035m7397J67828K37038Q5395k20910k64595Q0011
6953b87494J66514K16487J06636k43657j46674J53585k6397M4858J43471J7808
6943A45137o7058r0421j50750L1737M5416j3102n5614k6546l97O0835l7121j39073
6931b96957k9443K05893J18865L5924Q192J02888l5032p319J5174Q105j77980
$$ y = [179040, 346723, 212440, 43249, -7831, -114308, -73516, -129238, -109402, -51589, -3129, 27102, -139833, -146808, -34426, -11186, 52106, 64136, 54866, 71833, 77190, 23014, -61224, 2104, -132115, -34447, 136279, 67290, -100555, -131507, -237185, -168134, 69403, 166390, 129983, 1040, -10084, 57658, -34343, -275351, -112949, 17153, -18238, 53906, 63918, 13425, 8319, -4819, -202829, -324864, -372261, -204433, 32605, 118000, -102910, -367505, -287494, -120980, 95507, 202143, -41514, -188188, -34603, -61000, -16142, 127329, 145137, 78079, -12342, -163092, -131355, -85939, -99041, -154655, -181201, -181598, -120763, -157884, -296957, -326400, -120507, -1642, 34282, 42474, 145362, 110330, 103011, 118185, 126290, -51690]
6920e1690l3021N430r1197Q3569N007j3001n6653l175J27249n9050Q7547k2360
6908b1345j5025p0683j760J59898J04703r9924l5791J5236j00483N8223N1596
6897D4645O5315L5570j23260j88709o342L708J1622J17170J49654n5722j98193
6886a44542j05720R3866M9082J1160q7224k3209M1540K0500L9375L3191K0857
6875e1124n0723j53888P4175J45726R694j12478p3511r6138Q6168M4409k211K2450
6863a57451j74781j30979K14O2619K20044J12155L7193j69941Q8089N1186l2114
6852i3766j57733m2794K93006J37197l0623R6860J03800M274J50429J03203j48428
6841D15425n8385K4152j09244k18972o692J06202M4961R1744k9433k00265N101
$$ y = [-51690, -84711, -79281, -170478, -86909, -81902, -94903, -151556, -154731, -27482, -86532, 1015, -21345, -36370, -107053, -108813, 51085, 155788, 55864, 20073, 35309, -65174, -6951, 44645, 109960, 145530, 22270, -166439, -172781, -169073, -157451, -40281, 109373, 53651, -144542, -250262, -156396, -107314, -96154, -183378, -206587, -165047, -144547, -105172, -71981, -51124, -101847, -255735, -181560, -35834, -26140, -138618, -212129, -308267, -222099, -177690, -179901, -157451, -332232, -463211, -462997, -400378, -180334, -68179, -30986, -200927, -112838, -61652, -93766, -251499, -294293, -1287, 135910, 105287, 202147, 305947, 310221, 460650, 563853, 415425, 357040, 381192, 271948, 52976, 46284, 152486, 197447, 289191, 259758, 59493, 64594]
6830F4594K28345k3236k26002n7161N153o2524o3253j1310M6053J01902J09070
6819A11631J7409r7799j73249n646J08271K1290j40376R8543r2000l248n4205
6808b09379L79J867J63569P8823o7067j14092j19196J46228K17320J27699n2110
6797A74041p9587J45188J50422l0952J4398J32730j94903k14542o2021N8822r8797
6786e201Q8070N2385K3745o1074p36j43184j29149O36J8441p3638P0908j7603
6774a76400N344J66348M5569J0188M8357j33769k09037j05561P4883Q3878K68080
6763G7880J56850r0804j66234n4144l9444k196L5220m8760q1257J59041L01966
6752B48118j4125O7092J27645j47897k03519K4597j1253O9725P8546k0770p4938
$$ y = [64594, 292939, 269703, 43701, -13460, -8307, -70831, -134084, -145394, -99341, 2561, 111631, 129040, 31241, -142008, -147654, -39383, -18093, -158469, -59926, -151926, -155174, -209379, -209000, -207133, -43564, 35259, -31808, -145900, -265096, -118868, 98452, 226151, 174041, 94454, 239642, 390064, 359112, 373510, 506240, 311337, 96795, 34774, 93596, -5201, 82869, 135254, 158999, 97925, 97189, -45995, -175144, -174508, -156067, -229705, -158797, -176400, -171056, -4708, 40861, 51049, 99406, -34363, -243400, -348961, -274078, -190200, 77880, 234730, 143926, -22308, -76452, -115896, -118092, -82872, -131632, -212889, -53848, 248118, 233993, 301085, 428730, 280833, 77314, 101911, 90658, 160383, 238929, 218159, 143221]
6741A43221q4527O7139j23070q1077M8934J22233p5733J0836K1268r6289q0633
6730a27698L1105K53060J69956j9974j48326m3292J6235j65022o0451L04286N5980
6719B65859k73155m9298p1039j19626J36517k0193M4520N8188J65456o8878j22374
6708e4023q2092l8101M1883P4052L7105k1249r1160o5952L8683J76297q5476k1977
6696i2010m6780o399N8226L598L7177Q8315K54317p4853k88287p8424P3107k6781
6684i8794l1771j24994r1014l140Q7405j1524L2392O2764m9840J96747K38632
6673B06863O3211K45226M0579k33810k61744l2754R202P2973J22427j70517O3913
6662A25569P7258n5491k1555J2559p3945Q8997P4177j83735j14172Q2251R935
$$ y = [143221, 58694, 125833, 2763, -78314, -29380, 92853, 17120, 27956, 49224, -47065, -127698, -96593, 156467, 326423, 306449, 158123, 114831, 131066, -33956, -94407, 209879, 265859, -7296, -56594, -127633, -247259, -110742, -130935, -86415, -28227, 137229, 68351, -54023, -136115, -174216, -132333, -58281, -21176, -42425, -133585, -199537, -160854, 15443, -70033, -92010, -138790, -145189, -86963, -83365, -46188, 42127, 296444, 221591, -66696, -145120, -72013, -98794, -130565, -255559, -346573, -349713, -262308, -273832, -241440, -178676, -228516, -31769, 206863, 270074, 515300, 555879, 322069, 60325, 27571, 36773, 109746, 232173, 61656, 125569, 202827, 147336, 125781, 138340, 64395, 153392, 227569, 43834, -70338, 11913, 21848]
6651B1848R8479k0468l5707j16003N646p166K9610n7072r9916j02592j11990q1681
6639d77012M9859O3619P3943j54426j3099P7459J82025J77829R4540k11144j0790
6628a47197K09115Q6609n8113k6819L3802j46255j20251j1025R2003J60241R6248
6617A68358Q5516J4446n9162k02184l6197P7517J5397m1361m6141Q6680J1908
6606G4777Q4J01102o8336k23440N8254J251j05727l0240k08522o4067J18302J13132
6594b33430N3062J49936n7862k1942j49734j93659J04721J22229M2676M6154M2961
6583i4888k1636J14689j22223K4080P2602Q0016J03955J73247j2107r4145Q744
6572B32334l179q0464o0878l5789l6853j37707m7547l2601O2881J42721R4998
$$ y = [21848, 120327, 99859, 64152, -51851, -46205, -53371, -23761, -80833, -180749, -283341, -395331, -477012, -427153, -363534, -289591, -444017, -457116, -379657, -197632, -19803, 74737, -136407, -147197, 61918, 148527, 90414, 63595, 97397, -48858, -169109, -180134, -88131, 72110, 168358, 253874, 268320, 209158, 6974, -29223, 48294, 63691, 22330, -23811, 62869, 74777, 74861, 175963, 107627, -115813, -57559, -56308, -162035, -192275, -400797, -464864, -346562, -233430, -180368, -30432, -88294, -110236, -259970, -453629, -348908, -226679, -184003, -137849, -94888, -116524, -1835, -124058, -99978, -27376, 52640, 156595, 329842, 317735, 223590, 232334, 229155, 148691, 87813, 52024, 15171, -122536, -170083, -202684, -139803, 2918, 97916]
6561I7916p1266P5384k5710Q3903j01419j91703J2753J31644J33040J24123R573
6550B78238r5324O9880P094j05935J5182j78434j44687j54955q3416P3619R3052
6539b25686N8947R2446J75633o1144k00705q1221K1029J11599n6502L507k0138
6528a82235j1415m3788J4991j5862J34201J09916o0665j15954M8328O4251p7418
6517a35650L8246J58298n1693m0311k6334j94158k96936o9092J43426J33311J15324
6506b25569Q0561N7995P3509p878p735M5730n1142j07231J23945n8736J793k68
6494g5026J43476K55781j27557j38821k7303p9866r6084R245Q9419O7046p6684
6483e6374k07036p4997K4952M0253J65008O1945q8002L3993m1864m2528N2982
$$ y = [97916, 26650, 102034, 76324, 160227, 58808, -132895, -120142, 11502, 144542, 268665, 278238, 182914, 252794, 259888, 153953, 169135, -9299, -153986, -308941, -392357, -318738, -225686, -166739, -74293, 101340, 40196, -160509, -241730, -220701, -109102, -165604, -162097, -182235, -193650, -237438, -222447, -238309, -104108, 5808, -54857, -170811, -122483, -58232, -135650, -97404, 60894, 9201, -31110, -57444, -251602, -548538, -617630, -474204, -340893, -225569, -145008, -87013, -13504, -21382, -29117, 16613, -34529, -141760, -17815, -76551, -74758, -75026, 68450, 324231, 196674, 57853, 30550, -49316, -145400, -136155, -46736, 20310, -56374, -263410, -338407, -313455, -273202, -108194, -46249, -134251, -100258, -142122, -184650, -131668]
6472a31668Q1973R8120o5836Q023J11670J30873j8711J29343q5003k77333p9211
6461i7760O8517o2165q1594m7164K1794L0319Q725J4357J7183n9093j1946J02998
6449i5829q4887j15883l3054J03228J17967J40876J41525Q8991j921j05144R1271
6438B47140K7774j06507j31682K6601P7961p9957j31232r5428j39546J31490O9651
6427a03735K3430N3468L5808j09854K3862J05872J15777J19855P7270j81918k47207
6416h7372J49220J98896j62123j75302Q3935Q3475o9075n8874j11349J3498j6855
6405a51926M1440j7406k4143J2735J4201k8868O6217Q2736j23977Q9838L773J725
6393c3655j60997R0661r4007N7246J05013J64621R717l9003J85385j9666j95268
$$ y = [-131668, -49695, 48425, -17411, -9388, 102282, 233155, 214444, 343787, 258784, -18549, -97760, -29243, -91408, -173002, -220166, -198372, -168053, -159328, -144971, -127788, -186881, -198827, -95829, -180716, -296599, -329653, -226425, -108458, 32418, 173943, 262934, 261013, 155869, 247140, 274914, 168407, 36725, 63326, 141287, 61330, -69902, -165330, -304876, -173386, -103735, -80305, -26837, 8971, -100883, -77021, 28851, 144628, 264483, 341753, 159835, -87372, 61848, 260744, 98621, -76681, 7254, 90729, 21654, -37220, -148569, -135071, -151926, -110486, -127892, -152035, -139300, -125099, -153967, -87750, -5014, -128991, -39153, -35380, -33655, -194652, -103991, -197998, -140752, -35739, 128882, 138599, 99596, 284981, 265315, 70047]
6382G0047j76554N0825j2456q4845K04800P4561J1047l843k9432m7565j23706
6371f7121J6195J29923K18738j15649l61829l00221J76819J99430J13486K21702
6361B31473k74249j04356J88887l2988K0390J17888p4597q8101Q2767p8475j51301
6350a62662j38882M2863K3747L8632J72409L9978J2597K01295K8481j9580j87712
6339E1166k25868O4630K09325J18685J31068o1771k61892r1712j18790K0953J57805
6328f401J27868p0337k9650K342J51297M7421p6732K5019j43895j04399R5980
6317A8513J4555j2343k186P4878P3659l2115j01364n4644j5405m463L8669k82490
6305b84736l745M3620J19819J10853M2954L7286M4380m7269J17218m2771J2820
$$ y = [70047, -106507, -55682, -68138, -152983, 51817, 126378, 137425, 133582, 104150, 56585, -67121, -50926, 78997, 297735, 182086, -179743, -479964, -303145, -103715, 9771, 231473, -42776, -147132, 41755, 8767, 29157, 147045, 72448, -15653, 67114, -11361, -162662, -301544, -258681, -234934, -196302, -23893, 16085, 28682, 229977, 258458, 238878, 51166, -174702, -110072, 99253, 217938, 349006, 287235, 25343, -66369, -185159, -164206, -6401, 121467, 51130, 21480, 23822, 175119, 222540, 145808, 170827, 26932, -77467, 18513, 33068, 20725, 18539, 93417, 167076, 134961, 33597, -21047, -36452, -40915, -2246, -284736, -288481, -244861, -125042, -14189, 28765, 66051, 110431, 63162, 180380, 137609, 150429]
6294A50429P750j6907J1946l3880L9419q8976j44230K9151n3025R636K7509K15120
6282A53942J50621j35956j02628m161m3329M547k9067K3732l3920j9306O1655
6271B6130k7715j24567l4106l4762k824J5237n0279J20323p3114J78754J90218
6260A83295O186q7465k73984q1547J60814N2760k1130o886N6342K3130l7115k4531
6248e0131L0791Q8502Q7110J92574j12602m2243N6797O5880j23736k1484L0312
6237B01770p3488k98514M1332J19631K5307P4733j79711r23q92P6284o3955L5993
6225d2433J03773M2138j8440J04487O296j25275n5908o6616K4440P3007k9672
6214A5797K3743K3906R925N6084L9443r6334J0108p0174p6751q4581P6499J95436
$$ y = [150429, 158179, 141272, 153218, 119338, 158757, 69781, -74449, -45298, -98323, -88687, -61178, 153942, 304563, 168607, 65979, 61818, 18489, 23036, -6031, 17701, -16219, -35525, 26130, -1585, -126152, -160258, -195020, -197844, -182607, -232886, -112563, -185677, -6923, 183295, 189481, 102016, -171968, -253515, -92701, -39941, -61071, -67957, -11615, 11515, -25600, -50131, -19340, 69162, 156272, 348846, 236244, 194001, 250798, 316678, 192942, 171458, 201770, 128282, -170232, -128900, -9269, 16038, 90771, -88940, -89863, -90755, -14471, -78426, -42433, 61340, 103478, 85038, 189525, 195821, 70546, 14638, -51978, -27538, 45469, 15797, 39540, 63446, 73371, 129455, 168898, 72564, 82672, 12498, -64253, -148834, -72335, 123101]
6202A23101M9271j64470j97213j54152J6047P4666J02566p1887J58347Q2876R3988
6191A13140r5248j27549L8619L02495M292j14054q5610j06290j9167R4874r6610
6180i1108L5907J33951q1726j14352N1624J23034O6863p9121K458p6705n6054
6169h5229J58742j66084r0490j27988P2828K95861n9494J80649o498j14574l9393
6158A8330O6805Q3832r4213j42183n4552J8829k2037J50859J13667j758l8635
6147I8944J80753J4930j24980p8614J29418j02552k70124k7844P7664J0145k24635
6136c16895q8656K50856J81477Q3149R6250O5988L8773n4205j43110m2042j52192
6125h0607J1993O8400P1420k59667j36925J1661Q0916J72396J08092O3716k1102
$$ y = [123101, 172372, 7902, -189311, -343463, -327416, -252750, -150184, -222071, -63724, 19152, 113140, 17892, -109657, -71038, 231457, 235749, 121695, 36085, -70205, -89372, 5502, -91108, -55201, 78750, -2976, -117328, -65704, 57330, 124193, 45072, 47530, -29175, -85229, 73513, -92571, -183061, -311049, -238221, 57640, -1854, 178795, 172297, 57723, 18330, 85135, 168967, 74754, -67429, -121981, -103152, -125189, 25670, 139337, 137579, 98944, 279697, 294627, 169647, 91033, 220451, 117899, -152225, -180069, -102405, -92260, -316895, -405551, -154695, 26782, 109931, 206181, 272169, 310942, 256737, 113627, 71585, -80607, -68614, -214, 71206, -188461, -325386, -313725, -232809, -60413, 47679, 111395, 90293]
6114I0293j26864j69339n3124R3488K52701l8670J25942j03666k83556n2056J29921
6103a34930J19721r2490n5337J71145K05766Q2779p2333l4486j06863m2766j00601
6092f0395j61176j35794J39848L9718k7927M5819Q4861j10569j12710J38641J43497
6081a6187q4705m9318K48933n8260j09303j37264j16842L6894R7451P930P8351
6070a02320J44314l6061j09673j6071J257j08081j31335M9433J21282J16609J61711
6059I1065M5740j92064r2612o6251J08889L8084k4652K053m2932J45604J74267
6048A87191q8370j13996P335K7157j23023q3557l5165J16407P7527K8428L5409
6037C5343j02686j50353J21481J36708J53512l9818j03421r3095N3681J38218
$$ y = [90293, -36571, -205910, -259034, -165546, 87155, 48485, 174427, 70761, -212795, -264851, -134930, -15209, -107699, -163036, 8109, 213875, 296654, 224321, 189835, 82972, 40206, -60395, -221571, -357365, -217517, -177799, -205726, -159907, -75046, -185615, -298325, -159684, -16187, -100892, -150210, 98723, 40463, -68840, -206104, -322946, -286052, -188601, -180671, -102320, 41994, 5933, -103740, -119811, -118554, -226635, -357970, -308537, -187255, -70646, 91065, 136805, -55259, -147871, -214122, -105233, -67149, -91801, -89748, -132680, 12924, 187191, 98821, -15175, -7840, 19317, -103706, -187263, -222428, -106021, -28494, -66, 35343, -67343, -217696, -96215, 40493, 194005, 154187, 50766, -42329, 11352, 149570]
6027A49570j43623j22899l3106J7929L1094K2477n2260J5228r0412J20536k5251
6016a10717r748R4836K25534M8722p5342j71871k02719q6738J11773K29070K9964
6005H2764l2368j35706O0618K2021p4173R2945J62531J11623o2658L4261M313
5994B66171k8135j12353j64534j65006j3773j8076q5066P6036K6336N0427o2916
5983b30889J53820J30541j02680r3909J14663K21499r6702n2191k8682O621P1442
5972I3533k86832j79816P2998J46949K3261j5119N4441j03318M5611M8988J4155
5961h5149O25N6942k4296q1461j4865m7723J76925P3242p4688j3601R7094L5347
5949I8392K7642j05956m9675k9976r6094j07178m2022J50165O3958K4639K80821
$$ y = [149570, 5947, -116952, -150058, -132129, -101035, -78558, -130818, -115590, -206002, -85466, -110717, -120465, -25629, 199905, 248627, 173285, 1414, -201305, -288043, -176270, 52800, 82764, 50396, -85310, -24692, -2671, -76844, 16101, 178632, 290255, 227597, 261858, 266171, 238036, 125683, -38851, -203857, -217630, -235706, -320772, -244736, -218400, -167973, -230889, -77069, 53472, -49208, -143117, -28454, 193045, 96343, 44152, 15470, 22091, 93533, -193299, -373115, -300117, -153168, -129907, -145026, -90585, -193903, -148292, -99304, -85149, -84524, -27582, -51878, -133339, -148204, -195927, -19002, 54240, -20448, -34049, 63045, 98392, 126034, 20078, -29597, -59573, -155667, -262845, -304867, -154702, -90744, -66105, 214716]
5938B14716J61789k18193k6825j34600J27875J03103n178n8717q0947m7666M4699
5927H0056p8782N4459K8651j47066m1022J07375L5142j42601j11839O7913n7785
5916b05499q3615o964q384R7605J85884Q2926O6811j93065q6049N7045j01234
5905a94539j66599K05010J96460J82541J04889Q9812l5738o1366o4450k47517
5895H503j85958k1701P1536M0992j47915r9060P0647O8049J79484J66357J8885
5884A69819J33413J0495j05041l22145J18038O2852n7885J2247P4073k34945j51196
5873b90275M5933n0839P6700k7297K03000J02233m2565r4836l6207P9361q2911
5862a17703J54226Q3630p6580P4553J7031l4415J5087K0533j76176L5481J20120
$$ y = [214716, 376505, 158312, 131487, -3113, 124762, 227865, 222687, 163970, 83023, 35357, 80056, 1274, 55733, 84384, -62682, -103704, 3671, 38813, -103788, -215627, -147714, -205499, -289114, -296078, -304462, -206857, -20973, 61953, 128764, -64301, -150350, -93305, -194539, -361138, -156128, 40332, 222873, 327762, 417574, 381836, 320470, 256020, 8503, -177455, -199156, -127620, -86628, -234543, -333603, -262956, -194907, -15423, 150934, 169819, 303232, 313727, 208686, -113459, 4579, 67431, 9546, 21793, 95866, -139079, -290275, -244342, -295181, -218481, -245778, -42778, 59455, 16890, -77946, -114153, -34792, -117703, 36523, 120153, 43573, 118126, 135157, 100742, 115829, 136362, -39814, -4333, 115787]
5851A15787j49701l1196J69899R707j33865L4957J18242k07345J2666J8395j86080
5840b28534K920K87122O6079J17052M5350l0607J9084J8232Q4474o1531j56337
5829A63304k6697J17724k0716N1624j33320j72679m7651M0688p0649J04370L0488
5818C6486l5008j27071M1960J40862j6132L32j11021r6800J25858J59674j01214
5807A7926j8683M9432q8508q6259O2483R2870j09644l5607l3456J31137J29261
5796A10952m1950j28817k49456o3794N792J24583P0843N4978J55468m0076j39005
5785a40482k5438M5200J65518J10410n5453j12172P1902j3969j3073n6177o8712
5774i2446O3462J62064N1882m0286j66791j35097J03842N5803q5676j15779Q9316
$$ y = [115787, -33914, -65110, 104789, 114496, -19369, 15588, 133830, -73515, -60849, -42454, -228534, -225614, 61508, 127587, 244639, 289989, 259382, 278466, 296698, 381172, 319641, 163304, 136607, 254331, 233615, 285239, 151919, -20760, -68411, -27723, -98372, 5998, 36486, 1478, -125593, -83633, 57229, 41097, 41429, -69592, -166392, -40534, 119140, 17926, -757, 48675, -39833, -126092, -63609, 29261, -80383, -115990, -149446, -18309, 110952, 69002, -59815, -309271, -373065, -367273, -242690, -171847, -116869, 38599, -1477, -140482, -165920, -120720, 44798, 155208, 99755, -12417, 59485, 45516, 32443, -23734, -92446, -28984, 133080, 184962, 144676, -22115, -157212, -53370, 2433, -83243, -199022, -109706]
5763a09706P7798j52449q8925J11252K0563l3647k5937J31662J73859L8933j7770
5752A25633J3177j19680l25325J23975K16400J7611n3881j06396n6574M1026K2700
5741a01334j9552o1114N0855O5403k1915n0197K42841l3959j3635O3009N3592
5730A73994P322m4147j12540P1997J88874O2706J9425k19037j57750J51642L8464
5719A80950q3101o3417j14821N3529J55774j25948j43660r1455P2675R5868p1491
5708a35097Q1995K65179J55077Q9003q9659J7523k0777l6505l8456l9776j41990
5697A06517k5100q4565q8326L953o4108r0928M8745N5786K3011J12884K8651p6478
5685d9958o5377Q4802L5277j13959p3237J31419j5529j44323N0473j2969k5776
$$ y = [-109706, -31908, -184357, -273282, -162030, -141467, -175114, -201051, -69389, 104470, 143403, 125633, 138810, 19130, -306195, -182220, 34180, 51791, -2090, -108486, -165060, -124034, -101334, -120886, -182000, -131145, -65742, -87657, -137854, 104987, 71028, 57393, 120402, 173994, 181316, 137169, 24629, 96626, 285500, 348206, 367631, 148594, -9156, 142486, 180950, 97849, 34432, -80389, -26860, 128914, 2966, -140694, -232149, -159474, -63606, -135097, -53102, 212077, 367154, 456157, 366498, 384021, 363244, 326739, 288283, 248507, 106517, 81417, -3148, -91474, -87521, -151629, -242557, -193812, -138026, -115015, -2131, 26520, -49958, -115335, -30533, 4744, -109215, -182452, -51033, -66562, -210885, -160412, -173381, -199157]
5674a99157o2878N885J54421J13335R6459N7204j29088j41345Q3892o4743N6058
5663b9957k2288L6302j21950l1872J0311J03271J44401j08195k9848J16985l250
5652F3910K8731l9007k25176j18421j06283o9324k0616J14486O2926J37886L7910
5641a32978P7498N5169L2530K7423p2741Q5839j3066L476k2591j0187M7884q6695
5629h439j6443O7726R0834k0466j18868j03377j5834J20530J16111k2744Q8435
5618A77465L8414l6956L0088j113J6956j1319j90242j20224J27535J21673J36915
5607B89192J73586j09036k71683j13988n2546K8800J08101O2326l6698l0392j91109
5596a43447j556N0807N9649J75687J21657j30108j50540k8515j8872j11494k9794
$$ y = [-199157, -262035, -256150, -101729, 11606, 108065, 165269, 36181, -105164, -21272, -86015, -29957, -52245, -15943, -137893, -169765, -159454, -56183, 88218, -19977, -49825, 67160, 63910, 92641, 53634, -171542, -289963, -396246, -465570, -486186, -371700, -308774, -170888, -132978, -55480, -311, 32219, 59642, -13099, 72740, 59674, 63150, 40559, 30372, 78256, -8439, -24882, 42844, 133678, 113212, -5656, -109033, -124867, -4337, 111774, 89030, 177465, 215879, 178923, 209011, 207898, 224854, 213535, 23293, -96931, 30604, 152277, 289192, 462778, 353742, 82059, -31929, -84475, -55675, 52426, 114752, 78054, 47662, -143447, -145003, -94196, -34547, 141140, 262797, 132689, -17851, -46366, -65238, -176732, -206526]
5585b06526R9615m914J04200J14896j34663O5064O2926O5644K3669r6755j13326
5574b0170m8802P7890L2932r4437j41894n3078J41988J82494K4413j01831n6693
5563e7188Q3706R3724J13400r9549K4104L0609k13320j05680J66241j2467k7903
5552d323j8972L1401o6111K9428k1262j67900Q0595k1374j18653J06898N9084
5541a11189Q4359J079q6269O8086J2436M2680q2453r8183n9116p3551k2166K34902
5529h9385m4078q979J54192N6954m7745K5130j77557K3662q5072R1259N7352l8126
5517h2393o0007P1783m16m8666K1916O7468J3652m9592R2840o7243m4130l576
5505h8364J3403J43443o3360o7797k0764q9994j55426O3918J47936L42977J06914
$$ y = [-206526, -106911, -111825, -7625, 107271, -27392, 37672, 100598, 166242, 189911, 93156, -20170, -68972, 8918, 41850, -52587, -194481, -247559, -105571, 76923, 101336, -495, -57188, 26518, 120242, 233642, 134093, 158197, 188806, -24514, -130194, 36047, 23580, -4323, -23295, 8106, -58005, -28577, -49839, -217739, -137144, -158518, -277171, -170273, -111189, -26830, -25751, -112020, -43934, -31498, 11182, -71271, -169454, -228570, -302121, -324287, -89385, -133463, -142442, 11750, 68704, 20959, 46089, -131468, -107806, -192878, -101619, -44267, -82393, -142400, -70617, -71033, -119699, -97783, -30315, -16663, -66255, 26585, -40658, -84788, -88364, -74961, 68482, 5122, -62675, -83439, -173433, -328859, -264941, -117005, 225972, 332886]
5494C32886j05164k46903j47352k2520N5314K08797n4910o6588p8456m1363J30060
5483c6199L7728l1539p3235p6575J38580J94423P0857n9378j39101k47873J3666
5472b08646J22848l9837o3326j36209K27062J3162j05064P3270N9188P472J8827
5461c1253M9367j59342k65960m5986J05612M0377j4898J11303M3736K2999M2500
5450a01545J30756K9672M339k0302L1438p470M4502J26881Q3916r2884j78568
5439E0735k0011P8882k5225j75924Q5241O8838j04377p5108o6150j36732j01546
5428d21377j0426K29320J68815J38187j17843k24016j51492R3531N7784r5670
5418c33187k9566K12394J58435m9304J11520k303N994O279j6161q2787n6439J25854
$$ y = [332886, 227722, -19181, -166533, -189053, -133739, 75058, 20148, -46440, -124896, -166259, -36199, 1529, -30010, -103245, -179820, -41240, 153183, 224040, 164662, 25561, -222312, -208646, -85798, -125635, -188961, -325170, -98108, -84946, -190010, -116740, -57552, -50080, -31253, 18114, -141228, -407188, -453174, -347562, -307185, -322083, -210780, -167044, -144045, -101545, 29211, 58883, 63222, 42920, 74358, 66888, 111390, 238271, 322187, 229303, 50735, 30724, 109606, 84381, -91543, -6302, 62536, -41841, -116949, -183099, -319831, -421377, -431803, -202483, -33668, 104519, -13324, -237340, -388832, -295301, -237517, -333187, -362753, -150359, 8076, -41228, 70292, 67989, 73983, 80262, 64101, -18686, -75125, 50729]
5406E0729L8903j8865r660j64295o7592J10169P1365q4418r8361J12044P614n0013
5394a02380l1893j09770j1452Q6291J54959R3018k10593N5364j16189l3932p7139
5383c03716r84L9069J01898R9884l9729n4687J33050M3881m1659J28478Q2006
5372A87491j94121j56951L2301Q774R1918o3499j26176J63001j28979J26702M1262
5361a8277O5778K2103p5945N4904N1382J0328j7334o1753Q3002j95711j37586
5350b19109O2369M5771m3458j01415o4041K322J04720J21300j6091K4594J9749
5339f3289J36564J06306j51031j64345K5361N4801l5248j5811J04502o0570J58008
5328I5248J08553j47018j57301P2060M6414N2190M9342j09390j28923N6739J48504
$$ y = [50729, 89632, 70767, 61107, -103188, -170780, -60611, 10754, -73664, -172025, -59981, -52367, -102380, -134273, -244043, -255495, -169204, -14245, 78773, -131820, -76456, -192645, -226577, -303716, -304700, -265631, -163733, -63849, -103578, -158265, -25215, 18666, -22993, 105485, 187491, -6630, -163581, -131280, -122506, -30588, -94087, -220263, -57262, -186241, -59539, -18277, 47501, 69604, -6341, 48563, 99945, 110273, 92939, 31186, 114188, -81523, -219109, -156740, -110969, -154427, -255842, -319883, -317561, -212841, -91541, -107632, -83038, -63289, 73275, 179581, 28550, -135795, -110434, -55633, -90881, -106692, -2190, -62760, 95248, 203801, 56783, -100518, -28458, 17956, 70146, 119488, 10098, -118825, -62086, 86418]
5317H6418K38775M7479j56778m0554k8129k1470k3821J14137N9548N7411j24436
5306B08580k09337q6868R0539r9888J06532l0506p0510J45710J51925p186o8963
5295A30028j43572k14844K01469J73247l8916J30262J22436j9291j37194k14431
5285a0806r0509N0142p6594n710J27032p7496o6896J39136O151k41706k4644Q9197
5273a82703J44698J51304o1877r7883j38085q7450J46748K16382l262j47769n9234
5262a19131M7576J72003J37032j01267O2045l658p6896j52859j06711J2905J36771
5251G810n9050n9083K7322J00693O5292J05285o8776n5200P4236K4492K14197
5240C77218n9323j59412k14836r3304j05419M8698K039L5147J67744K62547Q6031
$$ y = [86418, 325193, 372672, 215894, 175340, 147211, 125741, 101920, 216057, 275605, 333016, 208580, -757, -87625, 2914, -96974, 9558, -20948, -91458, 54252, 206177, 198991, 130028, -13544, -228388, -26919, 146328, 107412, 237674, 360110, 340819, 203625, -10806, -101315, -51173, -127767, -133477, -6445, -83941, -150837, -11701, -5550, -247256, -271900, -182703, -38005, 113299, 51422, -46461, -184546, -271996, -125248, 91134, 87872, -59897, -119131, -71555, 100448, 237480, 136213, 198258, 194600, 117704, -35155, -141866, -128961, 7810, -51240, -110323, -83001, 17692, 82984, 188269, 119493, 64293, 138529, 163021, 377218, 317895, 158483, -56353, -149657, -255076, -206378, -204339, -169192, -1448, 261099, 347130]
5229C47130j24394o7094o8325J77722J83756j07511P78k17109k10547J4631J86953
5218A15990L0819L3611l0928K346j23544N5705J55478L4253n5539r3729j39365
5207a4903j24050j22159O1517R9827l652n9062m1334L1762J31142N6592R6456
5196A12136p5522M8645J8873k62264P463K1155j20214J09635J26901L6880J89481
5185B13169N4864r209n2768j78566n6633r4681N7316n8044m2132n7309L7966J57875
5173b8152N5596n7823m9488N0824J05063j1469j25801L224J22915l8643k849j97487
5161a74090J5623n1441K5924J38508J4742j39405P8177K2153l7420J3228P5636
5150a8365J44006J15617N90r9870j22493j14168j01609p1373j23135K21505K69834
$$ y = [347130, 222736, 155642, 87317, 265039, 448795, 341284, 342062, 124953, -85594, -70963, 115990, 146809, 180420, 149492, 151838, 28294, 83999, 239477, 273730, 218191, 124462, -14903, -138953, -261112, -199595, -99768, -103420, -162482, -203816, -172054, -40912, 15680, 112136, 36614, 85259, 104132, -158132, -150669, -129514, -249728, -140093, -13192, 23688, 213169, 268033, 258824, 206056, 27490, -29143, -123824, -66508, -124552, -166684, -223993, -186027, -28152, 27444, -30379, -79867, -29043, 76020, 64551, -61250, -58026, 64889, 26246, 23397, -174090, -158467, -209908, -183984, -45476, -30734, -170139, -91962, -69809, -107229, -94001, -18365, 125641, 241258, 241848, 141978, 19485, -94683, -196292, -267665, -390800, -169295, 100539]
5139A00539p9824J2841j1643m3961p6712K0312N7940L8695l9381j37493m2609
5128b01296o3453n5292o6488M1079J20143K1989O8190N4291m2056L9682K3678
5117e9533J49484q3665o6359j7640q3651O2654O5544K2296l3552n373M9723J09102
5105A09030O6128j11288J9449J21885q7470n8627o1661P4231P4866j9042n1010
5094G6491m0946J4853j4541l2834K4274j29417j33073R138J28880j6344l4566
5083a48085M9127j21514k8159J60623o791l9960J50162L9389l1812K02689K8259
5072B53928k1196j70844k52262l6346J5335o5389m8652J32267J55334m8233j64982
5061b51040M3179J02788K10503K220j58781j5931o0035R8839j16897j41064M8624
$$ y = [100539, 20715, 33556, 21913, -22048, -98760, -78448, -20508, 18187, -21194, -158687, -201296, -264749, -320041, -386529, -345450, -225307, -203318, -135128, -80837, -122893, -83211, -59533, 89951, 6286, -60073, -77713, -161364, -98710, -33166, -10870, -44422, -49795, -72, 109030, 175158, 63870, 83319, 205204, 117734, 59107, -2554, 71677, 146543, 127501, 76491, 35545, 50398, 35857, 3023, 27297, -102120, -235193, -226055, -97175, -113519, -148085, -98958, -220472, -248631, -88008, -94799, -134759, 15403, 54792, 22980, 225669, 253928, 232732, 61888, -190374, -226720, -211385, -276774, -325426, -193159, -37825, -86058, -251040, -207861, -105073, 105430, 107650, -51131, -67062, -127097, -28258, -145155, -286219, -237595]
5050b37595J02448J9118j77754m6352K1064J45760P3166j8837o7328J46540J66755
5039A26985j11551K5285l512o7403P2042J3067m2128Q6570M8696L9581K3967m9744
5027A61855n1412j53185o1041Q0072O2142n1287m9214M7433Q1680J45194O2380
5016B74617M3573j67524m4370M5244n8900k21375j50941J02885O5560j7246K71371
5005A42894M5964o2131J4127J86821J95331k01921k49392q4588l3475m4833K8650
4994f2553K4253M0067J2362L6103J59126J28708n7516k8066p3469k62607j07184
4983a90776k3170O398o1947l9379J25229M2328O4766q159J0730J5566O7183q4350
4971g5581j23376K0824J03105r7168q6294j28941N4282J01955K11525K3127j9115
$$ y = [-237595, -135147, -116029, -293783, -340135, -319071, -173311, -100145, -118982, -186310, -39770, 126985, 15434, 40719, 37207, -30196, 41846, 54913, 12785, 99355, 148051, 187632, 211599, 161855, 110443, -42742, -103783, -23711, 38431, -12856, -62070, -14637, 67043, 212237, 274617, 318190, 150666, 106296, 151540, 92640, -128735, -279676, -176791, -111231, -128477, 142894, 188858, 126727, 140854, 327675, 523006, 321085, 71693, -12895, -46370, -91203, -62553, -38300, 1767, 14129, 50232, 209358, 338066, 280550, 252484, 179015, -83592, -190776, -213946, -207548, -269495, -308874, -183645, -141317, -76551, -84710, -73980, -58414, 8769, -75581, -198957, -178133, -75028, -172196, -258490, -387431, -333149, -231194, -19669, 3458, -15657]
4960a5657k14543R770Q9807N5602n4962r6057J00700J78758K34854Q0016j26735
4949B41553k5634J6000N3399j88425j38267k4234N4799q8475L3441r3502o6088
4938b25433K13702J89471J06793k8810j54623K3239k6927j47607p4833J32636
4928G608m9142o6580p755R8547K886J18729N2229p0256j98447j03150N1492J20565
4916d3274K6974j59328J72479R7137j43167r7011P5309K7195L2922q0673m168
4905i5605j22114j54420J27092J09203J90439l588j06146J13563K44026j414j55356
4894A45680k48030j33936L056J68487J89376N7766j41155j00907q4366j33169
4884b77198O5484R8055J8342r620N3461R4890J35208R3942p8410K751k9654j25344
$$ y = [-15657, -230200, -220430, -130623, -75021, -129983, -226040, -125340, 53418, 288272, 368288, 241553, 215919, 231919, 285318, 96893, -41374, -65608, -10809, -99284, -65843, -159345, -225433, -11731, 177740, 284533, 255723, 101100, 124339, 97412, -50195, -125028, 7608, -41534, -108114, -115869, -17322, -14436, 104293, 156522, 86266, -112181, -215331, -163839, -43274, -16300, -175628, -3149, 93988, -49179, -146190, -70881, -43686, -10764, -91437, -95605, -217719, -372139, -245047, -135844, 54595, 51007, -55139, 58424, 302450, 301036, 145680, -102350, -236286, -233230, -64743, 124633, 182399, 41244, -59663, -144029, -277198, -211714, -113659, -95317, -104937, -51476, 43414, 178622, 272564, 194154, 196905, 167251, 41907]
4872D1907m1479k4025j26209J14198Q0286l02160o9354Q6065K26482M2126p8606
4861e0769M6864J52213J5302L0063L0043J9201p1749O0383m1239n0190O2472l6919
4849A65675J6605l5351k105P6086l3382k1573j48463j84939k8408K16752J2990
4838C3887O0129J0442O1787j26554q7693k05240o9297j04440N0318J00615J60900
4827a15146R4886N8086J27928N3798j53589j60432r2754j82036J1519P1368J02179
4816a84193J02367j5497K4714J80916j27353j12339l7713P0049m5771P1878l9787
4805a12729k5364j25023k4264N4791O0240J9083j791J86369J08777j71117j3800
4794d4828J43003j05828m5875l8083M0746P7110k7927j79552J48004J09441k7062
$$ y = [41907, 428, -23597, -149806, -35608, 44678, -257482, -326836, -240771, -14289, 27837, -50769, -3905, 148308, 163610, 193673, 223716, 242917, 171168, 231551, 190312, 140122, 202594, 165675, 182280, 146929, 144824, 220910, 187528, 165955, 17492, -167447, -195855, 20897, 33887, 94016, 104458, 166245, 39691, -48002, -253242, -322539, -426979, -376661, -276046, -115146, -20260, 37826, 165754, 219552, 65963, -94469, -187223, -369259, -357740, -286372, -184193, -81826, -97323, -72609, 108307, -19046, -131385, -169098, -99049, -144820, -72942, -112729, -138093, -263116, -287380, -232589, -172349, -153266, -155057, 31312, 140089, -31028, -44828, 98175, -7653, -53528, -91611, -50865, 26245, -1682, -181234, -33230, 76211, 49149]
4783D9149j87493j27721J99424J04656j20294j7494j91779Q2605k9284P4478J2756
4772a50997K3659N3599N3135O6194J03034J4321k39539j10122j1769O9560r6596
4761b25521O3549J10540O9511j26289j07207J03549K4065R007P2502P3717J6079
4750H3502j8257J08417r4937m9058o7836K2409q582K7073J5427O6022j94078q8512
4738a98410j23357n7847O5992J52808n9068j20071P3943L0490L8307J50778R7998
4727E1563K8621j22569m5255p8451j426M1896J34626o8712j28139P2363N8183
4716e7300r6063J45357k7570N8768j09214k07562N8490n6734r8707J11605R2905
4705a86025Q6127Q5433L1474P6194R6220j74627j43506j8806j81570j4460R309
$$ y = [49149, -138344, -266065, -66641, 38015, -82279, -99773, -291552, -208947, -238231, -163753, -150997, -127338, -73739, -20604, 45590, 148624, 162945, -76594, -186716, -198485, -128925, -225521, -161972, -51432, 18079, -108210, -215417, -111868, -87803, -78796, -6294, 67423, 83502, 65245, 173662, 78725, 29667, -38169, -15760, -24342, 2731, 18158, 84180, -109898, -198410, -321767, -379614, -313622, -160814, -219882, -339953, -266010, -235520, -197213, -46435, 51563, 80184, -42385, -87640, -166091, -167517, -125621, 9005, -59707, -187846, -115483, -57300, -153363, -8006, -35576, 23192, -86022, -293584, -235094, -291828, -390535, -278930, -186025, -99898, -14465, 17009, 93203, 189423, 14796, -128710, -147516, -329086, -343546, -334237]
4694c34237P4018P4572J21671l6442L969o6304j06920Q6145J43796j6572l887
4683f0191N9856L0307L8485j60550j77363q1786R3547J55296j12510j09840K26690
4672i8059J91949K8653j99892J8418R3645k98j6794Q770j59823j5308M364j24438
4660b68813o190J49951m4850Q4925Q8722L1510M3046j2602p7881q0296j22250
4649b14728O6168K55823j16022j35592Q9979N91j05577o809J44156J26309Q4217
4638A88515P1554q4416k71741j02089j28447j21849J91491L45292K04408P4489
4628C67207k42187J4298j7168r1618L5172j7825k1663p1135o2882Q7586K16505
4617A96290j21048j49708K7076J93798m047m1063r9013J46414K8513j53097n5611
$$ y = [-334237, -260219, -185647, -63976, -100418, -96449, -162753, -269673, -183528, -39732, -56304, -60191, -335, 29972, 68457, -92093, -269456, -351242, -257695, -102399, -214909, -324749, -98059, 93890, 122543, -77349, -58931, 34714, 34416, 17622, 26392, -133431, -148739, -144375, -268813, -275003, -125052, -169902, -84977, 3745, 35255, 78301, 65699, -12182, -92478, -214728, -148560, 107263, -8759, -144351, -54372, -53781, -159358, -166167, -22011, 104298, 188515, 260069, 175653, -96088, -198177, -326624, -448473, -256982, 88310, 292718, 367207, 125020, 139318, 122150, 30532, 65704, 47879, 26216, -44919, -107801, -20215, 196290, 75242, -74466, -47390, 146408, 142361, 101298, 2285, 148699, 177212, 24115, -31496]
4606c1496r5062J56113K62421J92225j68567j18156p9374o0275l3820Q8922N5934
4595A68865p5299L9334J81485p2223j2895k1066j16746r7952k21854o8267j9195
4584c15813M8688J31125o7021j18858k7445J71774L9983K06503P4254k14177j57039
4573b28026L6281N0747O2196m4907o6870j56254J5974M1057J12948J26200N0096
4562e58J7591K6554R9238k3728p4612L4642J24685m5250l5270Q023r9432p8495
4550d6612j4855o4039K1656k5005Q6641n1502l1006M731j74898j85037P9469M7378
4538c53079j2059J19731J67582O6580j6348o4620J31561Q3798K7574k8005j74112
4527e1397M9628Q287p9731O5961J05097M9146J04885J116j49578r6126l451Q1821
$$ y = [-31496, -126558, 29555, 291976, 484201, 315634, 197478, 118104, 57829, 24009, 112931, 168865, 93566, 132900, 314385, 242162, 229267, 208201, 91455, -6497, -228351, -296618, -315813, -267125, -136000, -203021, -321879, -349324, -177550, -137567, 68936, 143190, -70987, -228026, -191745, -140998, -78802, -123709, -190579, -346833, -330859, -289802, -176854, -50654, -558, 17033, 43587, 142825, 119097, 44485, 79127, 203812, 158562, 123292, 131315, 31883, -46612, -61467, -125506, -103850, -128855, -42214, -93716, -124722, -119991, -294889, -479926, -400457, -353079, -365138, -245407, -77825, -11245, -27593, -92213, 39348, 123146, 150720, 122715, -51397, -1769, 6518, -73213, -7252, 97845, 146991, 251876, 252992, 103414, 7288, 3837, 85658]
4515H5658J27749m3135j73274J05581k2429j75213P391j7844J1395J57970q7493
4504b3644j12151n2835m5265l5860Q2010J43642O8385o7963j73808O2160J51620
4493c709m7914p9381J19274J92079j15974j79751J09600L7861j28204J71631J81455
4482B56967J333p8621p0485j76580L7017L5921m413o986j30282J38253r990R808
4470A942J12716K2215k3337r9861L856j81130L6487P8691O3319K359j27026m8232
4458a58001q8210n4467K0898j18392k2605R4884J38460J21478k584J24025Q5254
$$ y = [85658, 213407, 170272, -3002, 102579, 80150, -95063, -87672, -105516, -94121, 63849, -23644, -135795, -188630, -233895, -269755, -187745, -44103, 24282, -43681, -217489, -155329, -3709, -51623, -131004, -11730, 180349, 64375, -115376, -5776, 32085, -96119, 75512, 256967, 258300, 179679, 109194, -67386, -30369, 5552, 1139, -5847, -136129, 2124, -7866, 1942, 114658, 136873, 113536, 13675, 17531, -163599, -127112, -48421, 14898, 17257, -109769, -158001, -246211, -300678, -279780, -398172, -420777, -325893, -187433, -65955, -68539, 55486, 140740]
$$ [...]
##END NTUPLES=NMR SPECTRUM
##END=
