##TITLE=Analysis number 328649
Compound Code cc 49508
Book Reference 486/160
Project Code adrs
Chemist Name simons
##JCAMPDX= 6.0         $$ Bruker NMR JCAMP-DX V2.0
##DATA TYPE= NMR SPECTRUM
##DATA CLASS= NTUPLES
##ORIGIN= Bruker BioSpin GmbH
##OWNER= nmr
$$ XWIN-NMR		Version 3.5
$$ Fri Jun 22 09:10:42 2007 GMT Daylight Time (UT+1h)  MAYBRIDGE\nmr@NMR_250MHZ
##.OBSERVE FREQUENCY= 250.131544655141
##.OBSERVE NUCLEUS= ^1H
##.ACQUISITION MODE= SIMULTANEOUS (DQD)
##.ACQUISITION SCHEME= undefined
##.AVERAGES= 16
##.DIGITISER RES= 18
##SPECTROMETER/DATA SYSTEM= dpx250
##.PULSE SEQUENCE= zg30
##.SOLVENT NAME= CDCl3
##.SHIFT REFERENCE= (INTERNAL, CDCl3, 0, 16.4531)
##AUDIT TRAIL= $$ (NUMBER, WHEN, WHO, WHERE, WHAT)
$$ ##TITLE= Audit trail, XWIN-NMR		Version 3.5
$$ ##JCAMPDX= 5.01
$$ ##ORIGIN= Bruker BioSpin GmbH
$$ ##OWNER= nmr
$$ C:\u/data/dgb/nmr/ADRS/1800/pdata/1/auditp.txt
$$ ##AUDIT TRAIL=  $$ (NUMBER, WHEN, WHO, WHERE, WHAT)
(   1,<2007-06-22 09:10:17.67 +100>,<MAYBRIDGE\nmr>,<NMR_250MHZ>,
      <created by zg, POWCHK disabled, PULCHK disabled
       configuration hash MD5:
       76 6E 9A 78 1E 09 19 81 EC 84 63 8F B0 6A 59 2D
       data hash MD5: 64K
       FE 57 BF AA C9 09 0A 19 AF F5 E6 86 1B EB 49 94>)
(   2,<2007-06-22 09:10:32.44 +100>,<MAYBRIDGE\nmr>,<NMR_250MHZ>,
      <Start of raw data processing
       ef LB = 0.3 FT_mod = 6 PKNL = 1 SI = 32K 
       data hash MD5: 32K
       C3 18 30 F6 EE F1 EA E4 5C CF 08 82 A1 B0 E2 42>)
(   3,<2007-06-22 09:10:34.25 +100>,<MAYBRIDGE\nmr>,<NMR_250MHZ>,
      <apk 
       data hash MD5: 32K
       CB 8F 53 B5 68 0F B9 40 7E 63 EF 0B 5E 42 19 0C>)
(   4,<2007-06-22 09:10:35.19 +100>,<MAYBRIDGE\nmr>,<NMR_250MHZ>,
      <abs ABSG = 5 
       data hash MD5: 32K
       1D DD 00 0C 73 25 A6 D5 E9 0C 34 D1 A5 A5 05 A5>)
$$ ##END=
$$ 
$$ hash MD5
$$ 07 25 5C 57 C4 B6 A7 07 DA E1 81 2E 63 C3 61 56
##$RELAX= 
##$RELAX= 
##$RELAX= 
##$RELAX= 
##$RELAX= 
##$RELAX= 
##$RELAX= 
$$ Bruker specific parameters
$$ --------------------------
##$DU= <C:\u>
##$EXPNO= 1800
##$NAME= <ADRS>
##$PROCNO= 1
##$TYPE= <nmr>
##$USER= <dgb>
##$AMP= (0..31)
100 100 100 100 100 100 100 100 100 100 100 100 100 100 100 100 100 100 
100 100 100 100 100 100 100 100 100 100 100 100 100 100 
##$AQSEQ= 0
##$AQ_mod= 3
##$AUNM= <au_zg>
##$AUTOPOS= <5 >
##$BF1= 250.13
##$BF2= 250.13
##$BF3= 250.13
##$BF4= 250.13
##$BF5= 500.13
##$BF6= 500.13
##$BF7= 500.13
##$BF8= 500.13
##$BYTORDA= 1
##$CFDGTYP= 0
##$CFRGTYP= 5
##$CHEMSTR= <none>
##$CNST= (0..31)
1 1 145 1 1 1 1 1 1 1 1 1 1 1 1 1 1 1 1 1 1 1 1 1 1 1 1 1 1 1 1 1 
##$CPDPRG= <>
##$CPDPRG1= <>
##$CPDPRG2= <>
##$CPDPRG3= <>
##$CPDPRG4= <mlev>
##$CPDPRG5= <mlev>
##$CPDPRG6= <mlev>
##$CPDPRG7= <mlev>
##$CPDPRG8= <mlev>
##$CPDPRGB= <>
##$CPDPRGT= <>
##$D= (0..31)
0 1 0 0 0 0 0 0 0 0.06 0 0 0 0 0 0 0.0002 0 0 0 0 0 0 0 0 0 0 0 0 0 0 
0 
##$DATE= 1182499816
##$DBL= (0..7)
120 120 120 120 120 120 120 120 
##$DBP= (0..7)
150 150 150 150 150 150 150 150 
##$DBP07= 0
##$DBPNAM0= <>
##$DBPNAM1= <>
$$ [...]
##$SUBNAM7= <"">
##$SUBNAM8= <"">
##$SUBNAM9= <"">
##$SW= 20.6930455092707
##$SWIBOX= (0..15)
0 0 3 0 0 0 0 0 0 0 0 0 0 0 0 0 
##$SW_h= 5175.983436853
##$TD= 65536
##$TD0= 1
##$TE= 296.16
##$TE2= 300
##$TE3= 300
##$TEG= 300
##$TL= (0..7)
0 120 120 120 120 120 120 120 
##$TP= (0..7)
150 150 150 150 150 150 150 150 
##$TP07= 0
##$TPNAME0= <>
##$TPNAME1= <>
##$TPNAME2= <>
##$TPNAME3= <>
##$TPNAME4= <>
##$TPNAME5= <>
##$TPNAME6= <>
##$TPNAME7= <>
##$TPOAL= (0..7)
0.5 0.5 0.5 0.5 0.5 0.5 0.5 0.5 
##$TPOFFS= (0..7)
0 0 0 0 0 0 0 0 
##$TUNHIN= 0
##$TUNHOUT= 0
##$TUNXOUT= 0
##$USERA1= <user>
##$USERA2= <user>
##$USERA3= <user>
##$USERA4= <user>
##$USERA5= <user>
##$V9= 5
##$VALIST= <valist>
##$VCLIST= <CCCCCCCCCCCCCCC>
##$VD= 0
##$VDLIST= <DDDDDDDDDDDDDDD>
##$VPLIST= <PPPPPPPPPPPPPPP>
##$VTLIST= <TTTTTTTTTTTTTTT>
##$WBST= 1024
##$WBSW= 4
##$XGAIN= (0..3)
0 0 0 0 
##$XL= 0
##$YL= 0
##$YMAX_a= 313900
##$YMIN_a= -303252
##$ZGOPTNS= <>
##$ZL1= 120
##$ZL2= 120
##$ZL3= 120
##$ZL4= 120
##$ABSF1= 16.45313
##$ABSF2= -4.240042
##$ABSG= 5
##$ABSL= 3
##$ALPHA= 0
##$AQORDER= 0
##$ASSFAC= 0
##$ASSFACI= 0
##$ASSFACX= 0
##$ASSWID= 0
##$AUNMP= <proc_1d>
##$AZFE= 0.1
##$AZFW= 0.1
##$BCFW= 0
##$BC_mod= 0
##$BYTORDP= 0
##$COROFFS= 0
##$CY= 12.5
##$DATMOD= 1
##$DC= 0
##$DFILT= <>
##$DTYPP= 0
##$F1P= 14.0000005364418
##$F2P= -0.99999901652339
##$FCOR= 0.5
##$FTSIZE= 32768
##$FT_mod= 6
##$GAMMA= 0
##$GB= 0
##$INTBC= 1
##$INTSCL= 1
##$ISEN= 128
##$LB= 0.3
##$LEV0= 0
##$LPBIN= 0
##$MAXI= 10000
##$MC2= 0
##$MEAN= 0
##$ME_mod= 0
##$MI= 0
##$NCOEF= 0
##$NC_proc= -3
##$NLEV= 6
##$NOISF1= 0
##$NOISF2= 0
##$NSP= 0
##$NTH_PI= 0
##$NZP= 0
##$OFFSET= 16.45313
##$PC= 1
##$PHC0= -55.43756
##$PHC1= 5.092342
##$PH_mod= 1
##$PKNL= yes
##$PPARMOD= 0
##$PSCAL= 4
##$PSIGN= 0
##$REVERSE= no
##$SF= 250.130017223685
##$SI= 32768
##$SIGF1= 0
##$SIGF2= 0
##$SINO= 400
##$SIOLD= 32768
##$SREGLST= <1H.CDCl3>
##$SSB= 0
##$STSI= 32768
##$STSR= 0
##$SW_p= 5175.98343685301
##$SYMM= 0
##$S_DEV= 0
##$TDeff= 65536
##$TDoff= 0
##$TI= <Analysis number 999999
Compound Code 99
Book Reference 9
Project Code 9>
##$TILT= no
##$TM1= 0
##$TM2= 0
##$TOPLEV= 0
##$USERP1= <user>
##$USERP2= <user>
##$USERP3= <user>
##$USERP4= <user>
##$USERP5= <user>
##$WDW= 1
##$XDIM= 32768
##$YMAX_p= 527895470
##$YMIN_p= -105468
$$ End of Bruker specific parameters
$$ ---------------------------------
##NTUPLES= NMR SPECTRUM
##VAR_NAME=  FREQUENCY,     SPECTRUM/REAL,   SPECTRUM/IMAG
##SYMBOL=    X,             R,               I
##VAR_TYPE=  INDEPENDENT,   DEPENDENT,       DEPENDENT
##VAR_FORM=  AFFN,          ASDF,            ASDF
##VAR_DIM=   32768,         32768,           32768
##UNITS=     HZ,            ARBITRARY UNITS, ARBITRARY UNITS
##FACTOR=    0.157963299565203, 1,           1
##FIRST=     4115.42187088888, 0,            0
##LAST=      -1060.56156596413, 0,           0
##MIN=       -1060.56156596413, -105468,     0
##MAX=       4115.42187088888, 527895470,    0
$$ Real data points
##PAGE= N=1
##DATA TABLE= (X++(R..R)), XYDATA
$$ [...]
21164 6927 -13514 -20004 -13954 -14473 -10201 3818 301 -2876 -10747 -32383 -26905 -14566 -5837 -6067
21150 -6067 3296 5094 2768 -3490 7024 4525 12072 25136 15790 28495 27478 13418 13762 14778
21136 14778 4976 1122 18068 22299 18776 18051 5465 1929 3093 13533 16501 14740 -873 2469
21122 2469 12699 10275 5193 7171 12902 6632 -7404 -1997 5982 -8470 -6761 -3547 12891 13149
21108 13149 4087 -2661 -2625 2324 2812 2501 5511 12469 14881 13862 16628 28948 23163 5783 3028
21093 3028 7660 13998 10888 3231 -24 -8115 -13207 -9962 3906 10652 3808 4183 6536 3926 12667
21078 12667 10188 -1233 -4002 -3419 4158 1286 -302 337 -147 12340 21564 17837 7521 -22454
21064 -22454 -27463 -17414 -15513 -22307 -12144 -1224 -9173 -11130 -11927 -4760 167 -7220 -13417 -15800
21050 -15800 -10403 -6090 -11890 -12348 -16510 -18479 -16447 -802 10584 3338 2383 3410 -5326 -7566
21036 -7566 -8837 -10214 -5190 4031 6744 5067 -403 6686 8344 5651 13218 8770 14660 17789 6986
21021 6986 -8023 -7777 -4135 -5621 1712 10559 2828 -6129 -8117 714 4640 5745 -2108 -4826 -707
21006 -707 -10699 -6067 -4811 -2692 4082 10607 19644 9748 5795 -6102 -31572 -26172 -21271 -21210 -21402
20991 -21402 -24095 -27236 -21162 -1455 3161 6821 5464 8318 15489 22646 23382 15065 5058 10598
20977 10598 8047 6008 8941 6282 12948 21446 23640 22351 21864 16848 3141 10977 25132 39617
20963 39617 28137 14181 9869 15530 12534 5736 -4970 -14585 -9973 -5197 -346 4411 7208 3370
20949 3370 20859 10253 5154 5973 8963 3005 2989 8531 8130 -4702 -18648 -14801 -5342 3422 9841
20934 9841 21872 20956 9899 7288 -5066 -6953 -5905 -14013 -19032 -11267 -17961 -11771 -320 4357
20920 4357 2807 4654 -508 3985 -5686 6476 11991 5973 -3923 -1742 12080 17877 10277 8254
20906 8254 12568 14967 17451 12508 7344 9739 1743 -4925 -8674 -5803 -4676 519 -14543 -11848
20892 -11848 -5685 -8789 -8736 -3712 3833 13842 24942 17037 6714 8800 8971 8782 11841 10525 -1543
20877 -1543 9012 12171 -1363 4972 7932 6635 7205 5885 10930 15419 17536 10833 -2053 -5869
20863 -5869 15778 10347 5870 11587 14669 14936 12509 11693 13107 6073 8774 13393 446 5946 3410
20848 3410 -15865 -21900 -9250 3058 693 5068 -4715 3088 9827 2315 10462 15387 172 -9723
20834 -9723 -17023 -10129 -8478 -1433 -741 -4447 -15167 -19601 -16647 -4233 6379 16746 14113 5176
20820 5176 11188 17230 3339 -8060 -10281 -8619 -2664 -6041 1667 4563 9937 10821 9716 6057
20806 6057 9232 11732 14513 10377 2456 -2260 -891 1704 903 4083 16908 29943 19016 13925
20792 13925 16337 34881 26557 8200 -5330 -17408 -14543 -18386 -8022 6110 10265 2467 -9639
20779 -9639 6445 17486 10667 -11188 -1036 6886 -7187 -12211 -10365 2361 7062 2037 22248
20766 22248 22018 -4595 -22626 -24227 -15300 -8382 -454 4543 6315 10818 13957 3045 5793 2369
20752 2369 -11341 -5435 -10498 -7185 -9870 -7075 5361 8939 6080 -9440 -18700 -6765 -1191 -11058
20738 -11058 -7343 -4931 -19683 -11128 2618 8791 6393 581 -492 -756 -1993 10734 24783 15647
20724 15647 6995 -5293 2829 20847 28296 27968 27201 11974 3307 8900 7487 546 274 17319
20710 17319 21889 7013 -8612 -9886 -20449 -26000 -13093 5115 12542 13673 10870 5288 -1555
20697 -1555 6401 10276 7638 16318 25792 16368 4174 5807 19757 11180 223 -6659 297 -1113
20683 -1113 -818 6402 21026 25533 24895 17930 11242 66 3811 30007 41903 43155 53494 77795
20669 77795 114637 130071 126895 112082 106170 96681 91629 95035 93448 98878 127630 155388 164859
20656 164859 149856 144337 159534 148263 115339 87693 75041 99219 120555 119674 116422 102556
20644 102556 91179 92304 85601 61333 58069 38983 48334 62736 50135 22042 -3237 -5331
20632 -5331 10892 15918 -3632 -7885 5016 3786 7039 20428 22728 15890 17620 -6891 -10495
20619 -10495 -786 -2522 7678 20544 23084 20938 23210 32494 39523 35671 21745 23965 27520 39831
20605 39831 45438 31746 13891 17397 27671 32203 32482 29924 31448 24875 28126 20907 8601 10158
20591 10158 19632 14169 10762 -760 323 6661 9626 7880 8098 11827 10734 10066 13174 11308 16904
20576 16904 11616 5303 4414 3502 2521 5817 7333 -501 -2709 -1260 14668 26900 32995 33632 29741
20561 29741 23582 25953 12246 -3542 1019 11158 17859 10835 6246 2353 9033 24297 13407
20548 13407 3773 1693 4797 11448 12547 21844 26151 7146 -5915 4677 -3170 1281 12131
20535 12131 17580 12497 6745 10957 12592 16026 7265 7081 14314 6989 3174 -3163 -22009 -12288
20521 -12288 8889 16010 29455 19704 19568 13281 4254 11602 24186 24832 17623 12649 7666 18078
20507 18078 26828 33112 27228 20790 7209 -5770 -1554 13631 15682 32484 43482 34426 24054
20494 24054 30130 26486 1175 15418 33940 23662 16602 19028 12308 18020 16077 14645 21570
20481 21570 21148 15809 8234 7981 1235 -2875 2107 10569 7807 7049 8861 1781 1668 1439 5198 6902
20465 6902 5203 19090 23213 19666 17920 5161 -5914 -4261 -15418 -21254 -24412 -21143 -23295 -18829
20451 -18829 -8864 -1399 627 3288 9428 5309 10042 14792 8928 7839 6608 8547 24464 20737
20437 20737 14869 16419 26704 18627 22782 15010 13179 17524 20942 8780 6796 7487 -3138 9805
20423 9805 16508 15902 22143 18484 -256 -9026 -7627 14950 25087 12965 4273 10826 19941 19775
20409 19775 8393 -11983 -7149 -15101 -32070 -35965 -30865 -27252 -19392 -21524 -18451 -20372 -15998 -13976
20395 -13976 -10838 -16231 3732 16586 12124 -1576 -18012 -30936 -22193 -4812 1345 14320 23385
20382 23385 10504 9173 7610 16956 9830 10426 -4834 -16686 -1843 20668 12465 8139 8283 9999
20368 9999 6373 -4127 -389 10506 -4024 -9048 3401 16143 16766 24366 13100 11950 25157
20355 25157 17971 8909 12028 22776 26781 13989 13007 16419 25869 22054 7128 7587 11345 17865
20341 17865 18838 14161 18997 27511 21837 5937 -3389 -1017 14507 3759 -4144 1687 11523 20624
20327 20624 25733 18260 4273 9856 24608 27441 30281 27081 23350 20576 21685 22611 20909 35490
20313 35490 33201 33594 33144 28763 25304 24437 18053 10174 22825 23092 2259 -7661 8377 18375 10967
20298 10967 7279 18722 27037 19218 19793 20663 11295 13278 20437 20054 17213 8554 2450 14973 18389
20283 18389 21811 27427 21418 6602 3885 169 3749 14228 20812 17759 20982 25301 20654 13519
20269 13519 -3712 348 9298 10805 10826 9126 8189 1024 10914 24727 37018 36367 28119 22949 14614
20254 14614 3937 2938 10657 22657 25837 34523 22325 26515 22433 24903 24492 19932 17811 21484
20240 21484 26488 31107 24341 26634 34657 20840 5700 -641 -10352 -13821 10459 19294 17957 24150
20226 24150 31951 16943 -4753 5854 16537 21068 24202 27954 40795 42209 29589 18893 20358
20213 20358 21464 26284 26305 31476 23993 19598 24221 32799 34149 35659 34145 28531 18875 16315 21465
20198 21465 8722 -7090 -12700 -3762 8119 4584 3987 1394 16360 16375 13235 25384 14538 15009
20184 15009 12678 10511 19285 11821 12300 22814 27228 30347 18959 10984 16191 23930 22039 30965
20170 30965 34642 32775 37496 37497 33832 24478 15098 10717 21565 16195 16287 31191 44945 41745 30807
20155 30807 27748 26483 35221 40556 47460 41150 27369 25571 34655 42002 45144 36710 16590 811
20141 811 6947 20100 27124 19647 1162 8348 21067 19587 12686 20777 24782 19523 21808 32155
20127 32155 33907 30706 20882 24050 12983 17060 30808 44349 37432 33165 38631 35475 42857 44701
20113 44701 46455 51770 32935 20060 20018 24494 31924 48964 61310 58016 47520 41323 37696 46827
20099 46827 57349 45146 32457 33993 31201 37510 44927 37028 27189 26330 24810 21994 24744 36340
20085 36340 38472 30590 21124 21207 27890 34665 21774 16557 17588 22799 20175 25317 29888 48362
20071 48362 66454 52414 32375 19831 28063 37384 39300 43059 50604 60414 64108 78123 86642
20058 86642 77733 67539 53141 52851 61508 60754 58995 61718 77857 69103 64659 49568 56525 58817
20044 58817 53431 52213 58651 61614 60353 56995 44916 44837 55123 69858 81112 100805 120013
20031 120013 160638 185576 195772 222390 233778 241387 235042 232811 226098 226660 243449 269911 297973
20018 297973 324132 350144 364309 350530 336169 315845 290399 257352 238196 230140 217291 224600
20006 224600 237490 234532 220761 208731 180723 159250 141529 130073 121685 100033 86201 69883
19994 69883 60731 59768 51430 45068 37410 38136 51383 63601 67384 61977 62670 58399 53457 56140 57790
19979 57790 59235 46786 36347 24463 25289 29260 43896 36656 36091 46624 42163 36432 36958 27828
19965 27828 21993 29108 28388 28876 40421 45081 45415 41166 38033 24751 26976 23919 22223 31527 32316
19950 32316 37505 61113 73470 56714 39289 35867 45540 38799 26197 29973 19836 12304 17665
19937 17665 11867 21506 23440 21734 18844 29021 39755 36005 39832 34967 31242 46028 49336 40419
19923 40419 39015 37348 39210 32490 35309 42858 30683 22516 24300 15731 23387 32526 47208 55692
19909 55692 48425 51498 51545 41707 38809 41962 54399 61071 53557 45970 46007 52965 57838 56718 49678
19894 49678 48860 39708 37585 50077 58126 48651 54605 74277 80122 87604 113055 135310 136265 132285
19880 132285 131315 146436 150774 157661 167129 171951 184819 196436 206256 210107 198049 183705 182535
19867 182535 165241 156506 158024 149348 137333 125204 119942 97438 80722 79512 74308 70894 60639
19854 60639 58681 51342 44686 51860 75193 78741 80850 81841 73117 94997 95453 72557 61560 75292
19840 75292 82189 80885 88880 109478 128534 138635 164176 180619 173152 175176 168456 163432 180327
19827 180327 189415 204261 240694 255693 257194 257818 252396 216079 190579 180389 177743 193659 210702
19814 210702 208567 197805 183842 160461 134013 117512 112747 124186 126423 146036 175784 212461
19802 212461 259253 289409 282220 235887 172681 145736 148322 146641 141963 172920 216958 259100
19790 259100 266154 246981 204310 167734 127745 103379 93268 85219 74918 90239 92655 82318
19778 82318 102314 115951 102364 88141 88567 83617 83808 78998 78467 79300 76477 72102 84676 98439
19764 98439 106009 122950 131744 141000 146808 148505 158605 173774 181382 203435 239540 277365 319772
19751 319772 332624 310590 256100 220129 202841 182465 181580 199444 217353 247734 309899 333644
19739 333644 292639 230002 166611 121049 96522 98469 110708 114637 112986 105671 92471 90215
19727 90215 86035 86486 87076 85505 85621 76823 93728 91507 73786 62621 61534 75374 77337 73943
19713 73943 71130 78318 91330 78440 72723 83293 83358 77778 79422 95838 102106 92542 80953 71597
19699 71597 71896 79312 73304 70944 80775 77852 72921 75151 79963 82652 90027 101274 97511 103070
19685 103070 104982 98473 92373 82103 89496 98390 88775 88016 78772 88393 83582 86580 94216 95153
19671 95153 80338 80467 91299 85376 86367 94368 97852 104089 110455 111836 98571 97936 98040 112058
19657 112058 118607 102708 107158 114791 110760 119943 126819 120371 123649 129945 138994 143019 153309 150322
19643 150322 149027 138099 146880 151492 164063 154225 153166 158847 165580 171337 167642 172141 167022 151152
19629 151152 143067 142001 139978 144965 147319 149150 151157 152702 143514 139853 141490 149347 163998 172849
19615 172849 170602 164959 156186 160416 142273 138354 153862 171585 178941 191855 188249 174142 182476
19602 182476 189574 185357 186791 188309 211143 215558 218541 215743 224136 237215 239467 269545 304615
19589 304615 338719 385056 454324 512945 553217 581618 571845 514426 471535 418860 364400 304863
19577 304863 274671 262424 253673 251615 258238 266513 275818 285211 291162 291592 296862 308038 316946 327393
19563 327393 333951 346941 349666 372084 390825 402103 416940 439986 466084 492384 507932 528417
19551 528417 554717 583527 604040 626634 656035 700555 730558 776961 847386 937944 1024973
19540 1024973 1129937 1245013 1367472 1509271 1646479 1805929 1965738 2133127 2328873
19531 2328873 2580273 2882671 3260392 3746426 4386180 5220454 6341371 7850553 9868926
19522 9868926 12551384 15967392 19693321 23357227 27202397 30257924 31599895 32355219
19514 32355219 33114654 33083817 32983660 34643287 38181920 42823446 48048575 53873139 58503024
19505 58503024 59590106 58338162 56005110 51414765 45081303 39568186 35949924 33955550
19497 33955550 33223816 33864818 35381089 35287375 33489854 31392691 28285045 23484915 18672331
19488 18672331 14608174 10999170 8159708 6233483 4963055 4098509 3481925 3022329
19480 3022329 2664345 2395641 2185219 2009263 1853787 1730166 1601626 1456211 1324516
19471 1324516 1199817 1071517 951454 854878 776716 733359 699572 664989 640562 608673 584273
19460 584273 568443 558487 531943 504916 484640 460133 449007 441310 419380 404183 386763 373688
19448 373688 377012 380884 374906 361014 351125 341399 322112 323511 324683 327501 326733 316583 302977
19435 302977 286776 273985 273356 283445 282452 283530 278905 275118 283570 282038 260629 241721 247385
19422 247385 260400 262198 264028 272046 256052 249290 257134 268822 280920 275021 277487 290855 295601
19409 295601 293729 299706 315279 318857 323531 326107 335658 345220 348846 344498 362426 394729 429681
19396 429681 446742 466932 492428 518493 560377 614464 677720 730008 790793 852884 906485
19385 906485 966254 1036593 1116731 1197946 1280967 1382788 1507474 1634644 1801564 1973679
19375 1973679 2204441 2521368 2947261 3565166 4419367 5617810 7269003 9478195 12355833
19366 12355833 15847665 19336785 21938045 22666802 21373964 19713526 18993950 20068644
19358 20068644 23014105 27073724 31120356 33792480 33692050 31461889 27438223 22732368
19350 22732368 18873392 16575344 16088682 17016097 18448018 19391519 18747721 16003672 12425047
19341 12425047 9058370 6578715 5012709 4077749 3505019 3145269 2922291 2780162 2707090
19332 2707090 2688343 2684566 2716217 2792494 2902613 3059674 3283481 3616407 4123528 4835473
19322 4835473 5856240 7322347 9343819 12042182 15498220 19461019 23076340 25279956
19314 25279956 25021224 23171399 21596221 21595596 23744160 27662016 32258976 36316214 38130957
19305 38130957 37064457 33713045 28556338 23471838 19813347 18184952 18491791 19953928
19297 19953928 21373173 21600354 19443691 15538761 11358331 7933045 5648349 4218326
19289 4218326 3331118 2749427 2337040 2052347 1832220 1652575 1496700 1342571 1217779
19280 1217779 1118179 1033186 952743 866896 793918 730637 674174 606934 539348 491391 444676
19269 444676 404567 378615 350812 318508 300273 273375 253704 240520 225616 219867 209612 195608
19257 195608 181034 181229 184784 189235 193328 183145 175202 167107 157900 146684 144833 141985 140580 150486
19243 150486 158050 138649 121677 123330 140012 144730 139826 121580 112369 109277 98937 83941 67926
19230 67926 78278 91493 86097 78654 80999 82600 71272 76845 73498 71513 76856 86417 75771
19217 75771 74047 67084 62474 56221 61780 64951 58084 65709 65744 63827 58112 49226 34192 39644 56313
19202 56313 67220 77982 93699 98430 116943 139364 158657 169688 160955 149550 149406 149394 142979
19189 142979 148052 176200 193636 199543 204678 185015 168125 173675 161895 155732 148627 146062 135786
19176 135786 117172 114485 114870 110021 99515 82465 67227 55895 63213 75703 83559 94063 105766
19163 105766 103381 104889 101578 91430 82634 71625 78403 73789 79017 82023 77056 78353 92130
19150 92130 95667 113040 134751 161861 160741 138366 122681 127623 132001 130747 129368 144279 172020
19137 172020 186822 193706 189848 164914 150155 147299 128817 125584 120633 120321 118273 120105 119606 103739
19123 103739 89224 57152 36572 34239 43285 42129 37909 37455 33240 25895 22046 23582 34431
19110 34431 51007 50511 46033 54090 52985 54362 56257 70012 61894 45324 44198 40040 39769 29730
19096 29730 22027 18641 13621 20612 17279 13641 8469 14111 31084 26831 33641 41473 47970 49323
19082 49323 56407 52834 38785 25448 24314 34142 40346 58271 75274 79715 79472 86448 99013
19069 99013 97247 95276 94393 110421 137594 154399 176348 202963 242554 278097 282451 281953 286303
19056 286303 286925 266162 226923 191172 180788 166607 153739 145531 129846 117380 118238 120604 110739
19043 110739 89505 78459 65024 51990 52743 53652 46856 44185 48406 62803 58327 43653 44523
19030 44523 39418 33919 34936 22604 21443 34038 41098 39373 28879 21400 21067 26940 50675 83525
19016 83525 95556 114620 147886 178886 228276 282403 326628 365965 382194 382411 362329 336643
19004 336643 306173 280053 271309 263495 256877 251119 254233 266690 256600 255976 259741 267967 269601
18991 269601 307138 330531 351009 357396 336044 330927 322809 287831 254784 243906 227805 229792
18979 229792 226883 232235 223927 205715 201185 184562 162320 135166 121350 97064 89196 93281 105062
18966 105062 113091 120519 120623 139112 161698 183786 206621 209950 197884 184277 171983 149613
18954 149613 136983 120011 95434 77221 84382 84733 84361 88487 83051 81101 84207 76098 63457
18941 63457 53060 67716 91448 89930 88593 73023 55439 56834 66586 75966 71029 61516 48604
18928 48604 50288 42256 42488 55111 68879 62274 50430 50954 46426 42666 41521 52443 47213 47209 47896
18913 47896 46990 51939 47013 55632 47014 49140 48998 49204 42275 39762 42648 49246 67151 73283 62718
18898 62718 65266 73416 79042 88339 95038 109340 111892 100643 86516 95206 104478 123209 138121
18885 138121 135116 126095 116205 104856 114736 126882 119084 114702 119836 120412 101934 101556 99127 84662
18871 84662 77102 91928 111970 110414 96960 91660 90518 88546 87671 100595 111306 121690 129547
18858 129547 133676 143012 154627 155600 163347 168602 185248 189538 171338 164502 158404 149093 159726
18845 159726 174335 171463 175136 176208 191650 205123 210764 214750 228742 254446 284581 296278
18833 296278 305265 304650 304512 293908 278387 259949 236890 230960 231023 227553 234005 222392 207779 192911
18819 192911 181652 173609 165557 159152 148885 147059 148084 151710 152889 161571 194711 219829 243997
18806 243997 258750 266142 276678 282016 265564 255887 249171 246855 240495 236895 244153 254520 277389
18793 277389 292622 288530 273120 279188 284520 293368 307617 322146 334811 345568 348429 341033 322073
18780 322073 294808 265870 239332 248938 262054 263371 281053 280740 266020 257663 242805 235320 243909
18767 243909 270460 294852 314581 304567 258911 223755 208913 198002 202568 213844 239116 261426
18755 261426 272117 264028 255513 266834 264795 239551 231545 231602 232724 225557 223627 234868 240601 253172
18741 253172 259603 251418 257180 260238 246048 239886 243267 249405 258184 254086 264159 296759 322790
18728 322790 329554 349036 367083 381136 404321 416709 433466 472288 513452 552875 600989 638558
18716 638558 674889 730830 789127 846452 917104 994302 1074085 1164395 1262279 1371382 1508475
18705 1508475 1683827 1906667 2193899 2611125 3194256 4003197 5090885 6537647 8436429
18696 8436429 10573462 12470599 14079012 15077225 14839158 14330768 14231247 14769153 16196355
18687 16196355 18081037 20174000 22176190 22700848 22026672 21067575 19279261 16842655
18679 16842655 14945710 13792514 13472912 13913439 14459568 14900584 14704096 13021000 10837458
18670 10837458 8712905 6687778 5156363 4174551 3578563 3215435 3007049 2889882 2830384
18661 2830384 2839935 2902312 3003262 3131457 3331590 3607948 3969562 4510021 5252911 6313815
18651 6313815 7786348 9813244 12542955 16104318 20203581 23908349 27021950 29016576
18643 29016576 28498294 27138002 26355355 26588439 28480125 31472566 35040688 38782980
18635 38782980 40559067 40238471 39224719 36524948 31958450 27940717 25062750 23544101
18627 23544101 23526799 23999664 24455853 24039086 21298707 17551130 13826828 10255947 7441447
18618 7441447 5572493 4379820 3590986 3030796 2618585 2314777 2096343 1900038 1736632
18609 1736632 1600717 1466323 1334419 1216421 1117024 1021677 942581 865267 794953 736175
18599 736175 693219 649016 605595 578301 555173 528001 504043 497270 489052 478360 459976 458546
18587 458546 454979 454678 446416 454722 463190 452602 455623 481597 495812 498803 517097 541645 559953
18574 559953 590352 633184 683933 746395 830917 921058 1023833 1136086 1208801 1247620 1273558
18563 1273558 1297466 1302635 1290606 1293177 1318247 1378742 1466835 1623800 1840788 2119424 2486710
18552 2486710 2970714 3621410 4489258 5669008 7314899 9599423 12752834 16976185 22415486
18543 22415486 28923335 35500255 40401548 41953716 41087989 38980007 35291177 28998937
18535 28998937 21535734 14978759 10334889 7409411 5598858 4435865 3641703 3087200
18527 3087200 2673336 2378931 2171843 2020003 1944232 1927551 1947143 2015984 2123035 2232375
18517 2232375 2331467 2389024 2407786 2395585 2344903 2270440 2195208 2151061 2178319 2279945 2460565
18506 2460565 2737618 3131280 3650367 4338931 5274476 6544505 8286528 10696947 14063403
18497 14063403 18707226 24872359 32691100 41721098 50403909 56153665 57316642 55506776
18489 55506776 51916877 45769195 36509878 26486304 18132855 12410312 8829205 6610433
18481 6610433 5168044 4173750 3450112 2918526 2534878 2260344 2046632 1890086 1780735
18472 1780735 1725801 1689673 1688681 1708190 1757270 1784112 1765288 1710254 1624908 1526624 1416413
18461 1416413 1314727 1239864 1218479 1252493 1343255 1478264 1655340 1891918 2239926 2717287
18451 2717287 3378370 4275880 5540524 7292971 9628898 12589215 15986480 19146463
18443 19146463 21048207 21238226 20435417 18999005 16511760 12899286 9200920 6240339
18435 6240339 4260966 3038878 2282981 1803570 1462972 1210628 1038328 895221 792265
18426 792265 711523 644043 594351 554559 529615 518326 510118 514202 523722 509285 497464 492353
18414 492353 464466 407564 347546 288677 248589 236281 224774 216620 200504 192343 187220 164771
18402 164771 138410 133094 131453 125499 112008 102848 90117 80981 89342 87781 81340 68189 52182
18389 52182 56225 60420 50509 52273 59073 70941 66576 56381 53474 60538 58289 52847 52183 43768
18375 43768 47898 59915 71936 73385 72897 92276 92628 93871 101156 89961 67465 58612 62683 47917
18361 47917 38473 42208 56206 59948 63135 61826 61652 46403 25254 18295 27213 24746 35843 47905
18347 47905 43789 41872 37409 20036 24205 33811 35009 39946 40323 42031 43026 34860 47244 46677 40249
18332 40249 36634 27070 11649 14745 11198 8760 9708 4706 12147 19134 19597 6855 6416 15659 25053
18317 25053 31564 20309 7029 12816 4711 10459 7566 -1061 -3247 -16188 -18813 -12031 -7394 -9527
18303 -9527 -23497 -26859 -24167 -18941 -1897 9838 26178 33769 25435 26346 25735 22996 21744 18582
18289 18582 11872 11687 13688 -3450 3981 15606 13510 11343 15792 3104 -17231 -19580 -7771
18276 -7771 -9272 -3349 -6470 -16559 -22221 -16350 -15668 -18279 -3005 -7142 -11963 -11708 -21391 -32010
18262 -32010 -34119 -9693 -8391 -20403 -22054 -12616 -21633 -21944 -16127 -10362 -9635 -8218 -4087 532
18248 532 -5631 -18371 -20519 -20004 -1227 14748 3601 -6872 -9618 -921 14975 9232 3871 14685
18234 14685 15617 14151 11565 16382 14588 9215 7643 -8569 -5288 11271 -935 -5133 -2591 3722
18220 3722 9802 9412 7419 12342 8501 6563 -4365 3267 21540 19884 16246 19461 22244 22599 28982
18205 28982 39385 52129 68489 84846 104017 121046 119460 105454 89721 76622 67848 78461
18193 78461 98406 116805 120343 111100 84194 73134 63650 61416 57859 57323 55711 62756 78059
18180 78059 104148 118017 124063 129011 136282 130758 131736 152040 164165 169406 180124 188433 184397
18167 184397 178371 180605 175181 172230 164781 146855 140125 147256 155763 151080 131623 116082 108291
18154 108291 93103 83392 81228 73483 49287 38750 51263 56005 66355 88015 91180 97433 106710
18141 106710 112323 114296 108436 119526 155853 170980 160589 170601 187951 211105 244280 276207
18129 276207 308538 341272 356425 367383 397679 455416 520687 587842 680216 812658 967435
18118 967435 1148262 1401199 1751919 2223222 2889429 3861901 5344686 7614847 10829024
18109 10829024 14751128 19762586 26126717 27112901 18940623 10884208 6277650 3932512
18101 3932512 2689138 1954398 1490362 1167824 943714 792300 658340 561649 486644 429695
18091 429695 381554 345745 299560 255829 215795 184182 151202 138067 125726 121758 118228 108837
18079 108837 109468 97337 82463 74557 60638 36786 29783 36545 42555 44808 44964 34903 17497
18066 17497 9411 25362 31595 45521 38855 34917 17283 12827 18321 20935 21721 15062 2121 -469
18052 -469 16070 19720 18493 22782 28159 26608 22174 10898 15778 26223 24936 26520 19247 4975
18038 4975 3613 10872 15204 -113 5765 18049 22740 31285 44793 69055 88057 111242 127985
18025 127985 146766 158116 156404 148142 121347 83377 63577 48989 32948 25763 15154 13673
18013 13673 16988 17022 10299 -125 -12862 -20641 -23045 -26422 -33790 -23544 -15900 -3351 -992 -17283
17999 -17283 -24246 -20224 -7376 -14583 -10860 -6540 -10707 -12515 -3328 7694 14469 29064 44319
17986 44319 48861 50346 70096 70184 65524 84892 121315 143954 185706 243253 280817 296026 289858
17973 289858 269227 241357 216981 177331 117494 64611 34649 22102 26143 26341 15125 17064
17961 17064 8412 4909 -2015 1683 7174 4982 4478 6818 9297 -2731 -3459 -9606 -14937 -5031 -2336
17946 -2336 -10646 -12897 -4396 -13664 -22777 -26323 -12221 -3405 -3676 -9602 -7217 -5261 -4158 5783 5084
17931 5084 12571 43478 73385 90809 97253 118199 131023 132196 118628 106902 97837 80231 63350
17918 63350 54847 39378 21123 11108 -6975 -9352 -12115 -15145 -14792 -17008 -20373 -14005 -14857 -19822
17904 -19822 -15920 -8743 329 9785 2925 7723 19753 9810 -1218 -15040 -21522 -22496 -23069 -30688
17890 -30688 -37575 -22018 -18233 -12780 -16490 -20468 -24665 -23662 -12289 -19107 -24608 -24742 -21410 -19393
17876 -19393 -19036 -16019 -12745 -20221 -12475 -2330 -5462 -8525 -4088 -1496 -9904 -12255 -22561 -19326
17862 -19326 -11519 -10452 1757 13612 5407 12723 1308 -17741 -18348 -25762 -23279 -22498 -26378 -11970
17848 -11970 -10549 -2723 9148 10955 13600 11870 818 -8684 -6667 -9004 -23852 -33875 -34898
17835 -34898 -37498 -28805 -17184 -20471 -16123 -11483 -18260 -26730 -27631 -25294 -28556 -14559 10382 3168
17821 3168 -17006 -30637 -38296 -40755 -39127 -45347 -45777 -31656 -26280 -26850 -23620 -20571 -15961 -28478
17807 -28478 -30033 -29664 -43094 -43061 -23016 -8900 550 -7790 -13860 -30128 -26580 -23478 -44627 -51671
17793 -51671 -48941 -47085 -38340 -31173 -17701 -5834 -10787 -24247 -40319 -43029 -28139 -20374 -32142
17780 -32142 -31457 -26139 -22733 -11941 -8784 -3575 -14740 -13066 -12250 -7390 -5534 -4931 516 125 -10657
17765 -10657 -1603 -12472 -26429 -32019 -35235 -34011 -24673 -18497 -10140 -15602 -16533 -26013 -16507 -2541
17751 -2541 -3922 9544 -1528 -22005 -21631 -23336 -19595 -22682 -15207 -18781 -18924 -29990 -20575 -19891
17737 -19891 -19589 -20411 -22944 -22887 -13218 -9101 -25674 -25076 -10088 -3866 -12609 -24177 -25439 -23940 -34041
17722 -34041 -45177 -33694 -34694 -35955 -36214 -33175 -34720 -35437 -29475 -26853 -12720 4592 3176 -16516
17708 -16516 -27337 -26963 -21910 -26389 -24809 -31941 -21614 -4933 -1767 -10988 -14582 -22705 -33614 -25075
17694 -25075 -10763 -3527 -644 1611 -1547 -9585 -11512 -16089 -9954 -3620 -5866 -10584 -8848 -12838
17680 -12838 -12992 -9186 -7499 -10866 -16329 -18117 -22085 -29481 -20255 -13439 -18974 -24844 -35215 -46123
17666 -46123 -33458 -25248 -20078 -2893 -2328 -4796 5020 -3036 -6457 -9520 1516 8681 -3539 3085
17652 3085 1283 4437 1477 1855 -3083 9628 11810 1904 -2717 -7944 -16219 -15161 -9498 -19011 -21222
17637 -21222 -31399 -33293 -31409 -31041 -25462 -17624 -23140 -27028 -25791 -32070 -28515 -16571 -22109 -21074
17623 -21074 -16728 -10168 -4724 -6776 4190 10838 3001 -16121 -29395 -38466 -55129 -29469 -11486
17610 -11486 -7807 -26648 -40443 -25964 -24379 -25472 -22631 -23895 -33817 -41290 -35213 -32609 -28640 -23285
17596 -23285 -12188 -10821 -19480 -30503 -39116 -24630 -1827 11367 440 -2933 -4541 -9709 -22482
17583 -22482 -23965 -15940 -17771 -13889 -11776 -24007 -39358 -41275 -23255 -23023 -28613 -21050 -24322 -18515
17569 -18515 -16418 -21365 -27106 -41858 -47063 -48455 -40202 -25925 -27090 -30214 -29651 -33612 -31311 -28805
17555 -28805 -35727 -41383 -44520 -27201 -18250 -12633 -17830 -16585 -19206 -31987 -34673 -34891 -36740 -26961
17541 -26961 -15080 -13518 -2663 -2992 -19498 -16067 -2851 6413 -14529 -26474 -20264 -15521 -13597
17528 -13597 -8518 -15363 -11971 -3698 12146 8581 -9660 -2168 3754 -1645 -7393 -27395 -29353 -33408
17514 -33408 -21174 -18256 -10061 -7390 -9964 -10009 -25440 -25757 -20388 -15594 5224 12706 7545 8734
17500 8734 6017 1123 -602 7322 8869 -2838 -19923 -21278 -26297 -38928 -32424 -20852 -5436
17487 -5436 -5654 -18951 -22265 -21033 -25119 -23972 -25269 -28745 -15506 -10074 -9526 5708 2985 -12889
17473 -12889 -16523 -21155 -16883 -15138 -10509 -17621 -31783 -30490 -13640 -11426 -9572 3481 22340
17460 22340 21201 9818 3956 5626 -1912 -8888 1265 -3522 3391 4176 -10079 -13681 -5221 3231
17446 3231 1829 17799 26340 37436 64312 93689 128595 115109 59414 13955 -13034 -25590
17434 -25590 -11898 -529 -3211 -13938 -31363 -40496 -34520 -33676 -32257 -38016 -39010 -40803 -43123 -32131
17420 -32131 -34408 -37557 -28728 -33686 -35579 -35297 -26203 -15271 -3437 -15641 -23623 -27305 -13591 -13697
17406 -13697 -28571 -28269 -9150 6583 15703 7041 -4293 -8077 -11060 -20131 -23757 -14898 -10675 5381
17392 5381 2853 5345 12482 10668 2476 -10809 -33104 -33678 -32336 -34724 -33084 -15063 -1456 8703
17378 8703 12762 3795 -4785 -1153 -8758 -5079 -3300 -9361 -17770 -22687 -20637 -22886 -9711 -12433
17364 -12433 -14833 -28032 -21647 -2635 -8601 -21659 -23028 -24481 -19583 -9629 -20422 -19476 -14927 -6520
17350 -6520 -12318 -26021 -21735 -18317 -21988 -28481 -38456 -30012 -27760 -35120 -38037 -18494 -6466 -3461
17336 -3461 -7474 -15743 -9090 413 -13653 -27712 -24007 -13514 -6276 -6596 -15239 -13910 -11821 -12991
17322 -12991 -4215 -4246 2274 1538 5468 -1618 -17728 -24417 -12623 -475 -885 -6835 -1664 -755 -2682
17307 -2682 -14858 -17637 -13733 -5142 -17917 -12429 -2682 -7716 -18381 -24353 -20068 -9671 2455
17294 2455 -874 4349 -8293 -17978 -20845 -21415 -19444 -4152 11138 -1571 -20066 -24339 -20969 -7348
17280 -7348 -1345 1868 2299 -7370 -12014 -8691 -6584 -15026 -24746 -23741 -24058 -30876 -19798 -10839 -19509
17265 -19509 -26475 -22253 -8907 -3430 -9496 -19402 -12997 -12962 -10715 -9745 -10093 -14620 -266 5554 10298
17250 10298 -1282 -16573 -6575 -4513 -8201 -16706 -29958 -18386 -17040 1776 3928 5284 215
17237 215 -6819 -5783 -1259 -3950 -5383 2128 -6390 -16081 -26311 -40366 -39353 -35037 -19357 -15488
17223 -15488 -4023 -8531 -9596 -7275 -942 9252 8957 -7635 -26576 -25457 -25664 -26647 -28438 -30763
17209 -30763 -22899 -15750 -15547 -21944 -25506 -17258 -9434 -3966 -2639 -783 9249 2939 8707 1023
17195 1023 -13722 -19258 -22220 -25479 -31563 -33529 -29151 -23831 -11334 -11625 -23064 -25926 -22985 -11741
17181 -11741 -7591 2889 5268 5171 10445 17877 2830 -11480 -4310 -12731 -10421 -4913 -1748 2845
17167 2845 -1824 -12738 -8776 -6007 -9550 -15417 -28248 -31366 -22918 -24574 -19678 -13136 -16594 -22464
17153 -22464 -27629 -25535 -22930 -31262 -35826 -26409 -17898 -16104 -6249 696 2849 -7039 -15657 -7297
17139 -7297 8784 -4383 -19491 -18012 -26028 -18901 -18751 -10975 -13323 -23547 -30147 -31881 -15762 -11637
17125 -11637 -22700 -25244 -17313 -5807 -12508 -19109 -10020 -5982 -17135 -27660 -23209 -20038 -24002
17112 -24002 -20234 -27448 -31940 -23743 -11371 -6243 -4854 98 -8554 -22055 -26147 -18850 -21022 -14641
17098 -14641 -6950 -12015 -18831 -12374 -9043 -6013 -4679 -12369 -10884 -9377 -22728 -24850 -26511 -21367
17084 -21367 -13802 -9653 -3213 -7770 -10553 -12129 -13589 -7727 -14493 -33278 -16597 -4076 -11552 -26351
17070 -26351 -24937 -15344 -3118 -6428 -5211 -5131 -15417 -8813 -7000 -16063 -25137 -32396 -37407 -34262
17056 -34262 -17244 -10934 -19632 -24518 -19327 -5324 -6354 -10443 -15800 -23479 -18491 -21759 -14213 -6826
17042 -6826 -12041 -4069 -4497 -2793 -1609 -2502 -2774 -1229 -4217 370 10247 19176 18675 15225 12017 12759
17026 12759 -4395 -3776 -5065 -3345 -2888 -13510 -13101 -12898 -11011 -2363 -22345 -38659 -34181 -32101
17012 -32101 -23893 -22795 -11820 633 -1627 1827 3804 -1167 -16502 -16463 -9227 104 785 -4291
16998 -4291 -1816 -7938 -20348 -22875 -26866 -34659 -24658 -24266 -35153 -33872 -22355 -9556 -20891
16985 -20891 -16383 -14193 -18723 -21238 -19827 -13200 -11223 -17082 -8878 -2484 -3040 -3134 -4576 -11589 49
16970 49 -10812 -28034 -25275 -9125 -22167 -29017 -15549 -15489 -21690 -8874 4084 -9591 -21188
16957 -21188 -22066 -13489 -25082 -24310 -14351 -13729 -24254 -19215 -5069 -8469 -9500 -13382 -11137 -2752
16943 -2752 1123 4526 6690 12424 3569 6214 6436 88 -6027 6085 16375 20309 14470 926
16929 926 4421 1556 -6812 -11923 830 9464 532 -5894 -18326 -17144 -21354 -12932 -1486 -8206
16915 -8206 -14922 3574 6464 -4146 -15592 -20501 -3550 4549 -9417 -22557 -29782 -28075 -33740
16902 -33740 -26866 -26524 -32623 -30284 -16453 -15160 -15503 -15396 -11104 -15063 -14671 -15107 -18937 -25869 -37394
16887 -37394 -29016 -17608 -24318 -20208 -14452 -25230 -22508 4909 4554 -2398 -9221 -13024 -18400 -22437
16873 -22437 -22739 -26038 -22124 -22838 -29527 -26010 -35558 -40760 -40236 -36812 -42672 -42464 -26835 -31174 -32013
16858 -32013 -38774 -32219 -10485 -11226 -13459 -14067 -17171 -14122 -3638 -6098 -5803 -1065 1333 -4044 -11205
16843 -11205 -28048 -22668 -20124 -31595 -31975 -26329 -20745 -7720 -4379 -4299 1151 6468 -6346 -25532
16829 -25532 -24764 -26438 -21817 -17865 -19854 -20039 -16633 -22276 -25559 -18893 -7945 -8246 -8486 -4255 -7985
16814 -7985 -11533 -15216 -8991 -5362 -2643 7811 12982 -307 -3271 -4422 -3149 3188 -364 -2788
16800 -2788 -6924 -20561 -40959 -29295 -21007 -14080 -11200 -9812 -17208 -7496 -9894 -5916 -14020 -22158
16786 -22158 -28880 -34244 -28397 -28870 -16178 -10888 -18720 -40438 -42158 -24641 -1301 -650 -4654 -16705
16772 -16705 -22149 -30747 -36319 -24555 -12506 -21901 -18671 -18126 -13913 -8348 -3012 -22221 -23144 -15745
16758 -15745 -5295 19632 20622 13260 14630 14712 9980 -5764 3265 12524 11037 19030 19107 -16 -17350
16743 -17350 -30609 -23848 -14456 -19653 -34340 -38095 -28626 -17410 -9075 -9668 -22157 -15148 -10352 -20527
16729 -20527 -39149 -31663 -21502 -15836 -17487 -17862 -25266 -38396 -30505 -18760 -12655 -4276 -2212 114
16715 114 3651 3597 -1681 9017 18170 14085 9628 -1809 -5262 -897 -8709 -11336 -12781 -19766 -6914
16700 -6914 1770 2661 1932 -7516 -6858 -4377 -8247 -11344 -969 -3875 -10302 -20775 -17317 -6567 -1027
16685 -1027 -6486 -3214 7001 24478 28696 13686 5891 6671 3128 4830 7717 7452 -9895 -19640
16671 -19640 -26347 -28861 -25225 -2576 3537 6417 11431 5702 -8017 -19512 -24564 -31171 -25482 -15405
16657 -15405 -20140 -25522 -13112 -6720 -21665 -25361 -19321 -15427 -9193 -19371 -28387 -17546 -15370
16644 -15370 -21282 -15344 1487 16626 9019 -9048 -17960 -24641 -13573 -20455 -24255 -19167 -10597
16631 -10597 -21819 -38678 -45210 -44073 -45086 -39284 -30831 -23995 -14037 -16613 -14645 -16172 -19102 -20722
16617 -20722 -21906 -14517 -13143 -3458 1683 -4087 -6043 -10730 -5385 -631 1948 6795 9514 -3060
16603 -3060 -10844 -16827 -20547 -7757 3927 10440 -2288 -18747 -28338 -39789 -37798 -18128 -12756
16590 -12756 -11657 -14740 -8227 -4923 -1503 2555 400 -2147 9541 12526 8196 -3123 -12965 -20663
16576 -20663 -13080 -16729 -1721 -2418 -12782 -8110 -9155 3675 11149 3479 -3956 -8130 -6339 1453
16562 1453 5032 -1075 -160 -1985 438 -2134 -7230 6956 7566 2218 -3433 2761 -16860 -25099 -17641
16547 -17641 -9548 -16518 -15508 -19871 -19475 -22628 -19427 -9359 -7211 -7586 -18014 -32523 -30700 -20232
16533 -20232 -25354 -20577 -24149 -18544 -2469 -5574 -20506 -18243 -16990 -13781 -10161 -21544 -16990 -11290
16519 -11290 -59 9479 11916 -3788 -20987 -12708 6987 -3644 -5535 -11540 -15283 -12778 -15139
16506 -15139 -14383 -7718 -9396 -14704 -3382 -2190 -2566 12231 22016 6300 -5297 -7394 3371 10690
16492 10690 13235 8541 -672 -8531 -10208 -10134 -7699 -16685 -29064 -25106 -14982 -4375 -364 -12664
16478 -12664 -17166 -18327 -11539 -8889 21344 28926 18418 7861 8726 -5987 -13573 550 2756
16465 2756 -10951 -5514 9216 9124 5172 203 -7533 -6831 -12457 -4221 865 6232 8729 4687 11370
16450 11370 5441 -14272 -19519 -10165 -11391 -15583 -22733 -26621 -32093 -25962 -14685 2467 4339 3794
16436 3794 2706 -9034 -28190 -36994 -30896 -16098 -1401 -1163 6592 -5887 -21075 -7036 3282
16423 3282 -5197 -12022 -17812 -20918 -6702 14549 -5208 -21702 -15624 -17445 -14415 -10981 -8986 -2029
16409 -2029 -5936 -9476 3702 20592 21249 8388 11504 23977 39373 32612 11937 -2534 -6648
16396 -6648 138 279 14794 12686 24612 29048 28834 23121 17608 8246 372 -9181 -19320 -7120
16382 -7120 7738 16287 22561 32236 27248 15501 3378 9636 16009 21516 10094 10369 1886 -9538
16368 -9538 -11432 -4653 -2097 2580 10947 3691 1589 -2729 -4709 -5869 4686 7873 -1440 -3066
16354 -3066 8254 5240 11523 3639 11596 15924 2160 -11711 -3098 -6936 -14014 -9328 -12390 -4481
16340 -4481 -7895 -16250 -22739 -5686 11761 11294 13855 20123 17273 5583 -1107 -3770 -7311 -6131
16326 -6131 -2730 -8724 -16520 -13229 -2563 -5002 -1921 -4346 -9454 -14085 -18302 -20682 -27821 -30926
16312 -30926 -26734 -30409 -31637 -24061 -8107 -11392 -22671 -14346 1308 6503 859 -10058 -19764
16299 -19764 -960 9811 -2789 -8007 -12470 -6351 -8179 -1218 416 -4507 633 2176 9027 8092
16285 8092 2640 -857 4528 -3636 -5547 -11978 -9594 -8938 6937 13902 6964 2753 5252 932 -7473
16270 -7473 -17785 1177 20375 11107 98 1620 -6709 -14253 -3594 -1514 -11098 1023 4904
16257 4904 -2341 -6687 4962 14582 12634 8773 11612 20992 23200 14511 8702 4776 11939 14735
16243 14735 -8708 -10446 -9778 -19417 -11313 -10584 -12591 -15150 2054 8097 2456 -9506 -11847 -21022
16229 -21022 -19644 -20288 -22794 -11506 729 -2976 -18641 -15700 -4970 -7757 -9732 -8352 -8288 2762
16215 2762 -1882 -691 -1617 -7881 -18723 -13600 -3360 -5955 6229 8272 1194 -8500 -7453 1717
16201 1717 9258 -1040 -2414 -7233 -23071 -30366 -16570 -6453 -15007 -12361 -4671 1948 -9292
16188 -9292 -5127 -10229 -20674 -12644 -11657 -1998 -2567 -14918 -11785 -9556 -405 -1240 11285 12200 3197
16173 3197 2008 3816 -7689 -13498 -6802 -12452 -6918 314 -10318 -11067 -13269 -12017 -9795 2262
16159 2262 6736 9975 4273 1107 2695 -4535 46 20273 18377 15816 6522 -3847 -6284 -10759
16145 -10759 -16570 94 1860 6809 8206 11696 22753 21240 2116 -11811 -8792 -16453 -16766 -14140
16131 -14140 -19407 -12685 -3936 -9795 -18832 -15905 -10500 -9862 -3823 -16179 -14171 -14189 -11733 1065 20810
16116 20810 26253 11810 -4492 -5132 -13952 -17474 -17283 -19361 -9607 -3839 -4597 -9502 -6432 -11047 -12968
16101 -12968 -6592 -10584 -11503 -860 907 -7370 -3652 10738 7637 6005 18617 24702 15596 27681
16087 27681 32152 18005 14197 10971 -2403 -20840 -15247 -4773 32 -7673 -10469 -14988 -14858 341
16073 341 -13329 -13820 -3021 -4395 -9093 -11037 -4006 -8379 -3666 7221 12774 11226 8628 3467
16059 3467 4683 -15470 -19022 -13715 -13303 -9272 -11954 -12195 -3224 9799 17441 10623 -7774 -20312
16045 -20312 -19359 -19956 -9045 -11400 -18224 -9125 3205 -17306 -26868 -19983 -10304 4474 -7802 -19108
16031 -19108 -13399 378 6784 4034 4177 20281 17341 1923 -6638 4577 11068 13635 11763 -1903
16017 -1903 -15984 -19060 -8041 -1240 -5479 -13312 -20098 -19657 -7144 820 3960 -7996 -9163 -11349
16003 -11349 -10864 2869 16401 6584 -2913 -3152 -4550 5993 3527 2155 -5723 -6408 -2609 -655
15989 -655 1330 -10193 -4358 -2864 -6897 -7718 -5884 3986 12062 6696 -15119 -18627 -9243 -20464
15975 -20464 -19583 -20842 -7521 -3566 -4933 -952 -8551 -25134 -18099 -4887 -8998 -20499 -23549 -10387
15961 -10387 -16056 -8293 3504 20429 8874 -2690 -7524 -6705 -16723 -17874 -8615 -5509 -1845
15948 -1845 -6127 -2593 12965 10803 -3409 -1969 1721 3912 -3484 -14637 -6687 438 -4120 7911
15934 7911 838 -10303 -23341 -11425 -9169 1801 7149 -6752 -10345 2000 5196 -6544 -10024
15921 -10024 6449 -1099 2593 3963 3239 -4705 -4863 -4183 -6399 -1771 4456 -5563 -16340 -4398
15907 -4398 13697 -1254 -11055 -3875 -3722 -18790 -16133 -13527 -342 -6846 -15164 -5947 10524 4496
15893 4496 5077 15799 30854 20238 -6723 -26436 -17802 -9968 -1448 2962 11604 14492 9763 6526
15879 6526 7421 6914 -5041 -4429 -19658 -26039 -13097 -29 -1578 10745 5239 -605 -3639 -479
15865 -479 4530 -2459 -12166 -6748 406 -4454 -13861 -13426 -8311 2014 5591 -6504 -9457 -9584 -9538
15850 -9538 -9416 -3460 5711 1365 -14256 -18941 -5713 2240 5332 12453 14292 7557 -971 -10170
15836 -10170 -12756 -17429 -25088 -26617 -18546 -25985 -27939 -21517 -19051 -17026 -2261 7190 10755 2075
15822 2075 -9683 -8830 -2377 6849 15542 5947 21349 22914 25032 27943 16817 12745 8107 3964
15808 3964 10001 9114 14346 22685 14444 -969 -9587 -739 15743 23637 18091 7074 -6732 -5481
15794 -5481 -5981 -616 10673 8481 4692 9805 25507 31545 11839 5097 4407 70 -10187 -8757
15780 -8757 12366 7444 14137 9958 2837 -4641 -3032 14919 14919 18498 15885 10508 4740 -8392 -7210
15765 -7210 1689 10793 9835 5702 11196 5254 6003 -3675 -2841 7893 -2924 -9820 -16325 1094 10684
15750 10684 5959 -6400 -19057 -20338 -9995 10 9299 18208 23584 25978 18837 19220 18462 12107
15736 12107 1341 -10837 -19654 -10538 3658 1882 -5280 3029 17393 28423 15124 372 -19990
15723 -19990 -22325 -1792 11299 6712 -13190 -20544 -22850 -20450 -12460 -7412 -17364 -19393 4884
15710 4884 12689 12032 696 -11092 -2851 5530 10058 14305 21257 12366 14758 6287 -4591 -16331
15696 -16331 -21072 -19039 -11876 -15390 -16359 -14705 -20500 -12503 -745 -7040 -12332 -18284 -5902 -2097
15682 -2097 -896 -5771 -8456 -13244 -15209 -8616 3132 5119 -3862 168 -3016 45 -3453 -10556
15668 -10556 -13983 -5692 4866 -4072 -4103 -4390 3572 3218 2218 4186 7725 -1600 -567 10179 17823
15653 17823 28506 19202 1125 -1643 -2245 -3281 7919 9288 2617 -3752 -435 7711 20592 17610
15639 17610 17393 31741 31461 18523 26813 25721 17680 8471 235 1844 8621 12640 19235 20007 10191
15624 10191 9474 21664 28128 20500 11164 -3609 -18173 -15349 -301 8802 -4929 -13681 -3855
15611 -3855 -1897 -10225 -11133 -22955 -25731 -25165 -11241 -1130 13210 29838 27946 19224 9914 8457
15597 8457 -2943 -4450 8873 11500 6837 3097 567 2944 -804 -13378 -8694 -17264 -17126 -17006
15583 -17006 -20404 -20057 -20909 -17190 -11409 -6140 7995 7646 -577 -2640 -12723 -15370 -12389 1816
15569 1816 13141 -698 -4400 -1019 -8223 75 50 866 4065 5637 2958 10539 1202 -9388 -13370
15554 -13370 -78 3331 5227 9084 12973 8861 13651 22681 19621 8999 8134 806 -9844 -23823
15540 -23823 -26344 -22074 -15896 -16542 -26531 -14824 -4692 -10958 -20791 -12884 -1235 2594 589 -13253
15526 -13253 -6251 -622 -5116 -12252 -17111 -17226 -6002 -2051 9597 13960 4177 1572 6564 798
15512 798 -7601 -8384 13405 8176 -13180 -29504 -22592 -16818 -6137 605 1761 5177 1799 -5438
15498 -5438 -6677 -7075 -8620 -13953 -7932 -8585 -10748 -9745 -4066 -1714 -7095 -8188 -3010 -371 6643
15483 6643 5499 -3110 -431 -1958 7130 2387 2137 5282 6083 18171 14652 -376 -4450 3892 481
15468 481 -7709 -6235 -6554 -7462 -598 374 -2823 -2077 -3201 -3366 251 2999 8280 21139 17984 16002
15452 16002 10109 3980 9079 12526 5989 11123 10348 4861 -1561 3863 5529 -11533 -13835 -6027
15438 -6027 -6225 6982 4283 1134 3110 2828 3344 1025 -2838 5556 6458 2541 2097 -2945 2366 -2079
15422 -2079 6273 15982 12718 6026 8406 13991 11504 18247 22315 13652 14923 17225 23012 20930 28161
15407 28161 33621 30970 24545 15372 21388 6415 -6155 -7008 -394 9831 -1380 13621 26995
15394 26995 39961 39504 22288 14271 -2221 -8335 -1300 -4617 -1574 8301 7908 -1473 -4633 -5328
15380 -5328 1950 10679 13106 4978 2762 -1074 5209 6345 6034 11935 12951 -2746 3150 -5836 -2690
15365 -2690 1560 4929 277 -3880 -2363 682 11242 9984 7095 13156 10868 17122 20493 297
15351 297 15127 22183 18202 13082 4053 -3136 8410 1155 -11995 -2350 -183 -10206 -6060 -13639
15337 -13639 -13753 -7248 6736 3469 11645 14144 15676 21017 31450 15883 4557 -1036 -11523
15324 -11523 -2760 6398 15738 14931 14233 26124 35378 11394 10526 8204 3840 -4818 244 14225
15310 14225 14483 -3280 4942 5355 2604 -3153 -11970 -13098 1205 -2275 -1152 -6538 -12159 -17524
15296 -17524 -7584 -1258 3471 8348 6881 13061 13476 -2829 -3825 3651 6087 1174 -2401 -727 10184
15281 10184 4766 -377 -5347 -19595 -16348 -7007 474 11974 10454 150 -20043 -22605 -9254
15268 -9254 -4113 -2117 6028 17555 20213 11804 1960 441 3561 9423 9494 13138 16017 3809 5508
15253 5508 -2141 5404 4666 -1425 -8850 -2765 9105 9798 12718 27964 34695 21853 22125 29498 22947
15238 22947 2002 -6178 4327 10749 21311 24438 22121 22672 22340 22538 19502 24192 19352 5842
15224 5842 -1567 -13080 -4185 16576 21920 31310 30212 22340 23899 36706 25692 19929 23415 32994
15210 32994 49953 61322 78309 109877 140169 181883 222714 269058 320396 355958 371147 338812
15198 338812 283462 236613 180183 135794 87182 61906 46313 28463 21997 21177 7610 11499
15186 11499 13175 4673 3266 2932 2014 14435 15008 22811 27833 20348 18066 14464 6588 9862 15748
15171 15748 -2294 3745 6021 4974 11944 3331 -12648 -17943 -15375 -806 11414 8805 3326
15158 3326 -3474 -8384 960 -2001 -14380 -15285 -2309 4505 11607 4415 4193 -2790 -8219 -7732 1290
15143 1290 -5327 -552 15925 21373 19552 19557 7266 2651 7266 -500 -15707 -19750 -12567 239
15129 239 -328 -264 13296 24936 25467 15766 10087 -4727 -7507 -12177 -11538 -8247 11747 17619 19998
15114 19998 9328 9171 4421 15610 32061 36109 27169 33863 17114 8959 11055 13250 21287 13601
15100 13601 -9557 -10174 -1391 8533 12426 16512 11140 -3867 -5326 -1347 7091 9630 6529 5805
15086 5805 4127 -4947 -2888 11469 17450 10681 11954 12344 23138 31403 33805 30791 31403 16746
15072 16746 9923 9114 4033 -1829 811 3901 20502 28757 20012 14001 8624 3302 13749 16322
15058 16322 -4372 -9142 1931 10443 -2766 -12885 -6492 -4901 3972 15806 11203 4747 6118
15045 6118 17448 12344 7595 13715 41113 42139 20225 23547 28191 23279 17625 15257 11216 11332
15031 11332 17446 21683 7039 1066 -8314 4030 16572 18199 19529 6575 3380 -51 5046
15018 5046 6845 7641 8119 17581 20132 32522 27791 23118 20687 18608 12176 7540 15670 21179 24303
15003 24303 19518 16857 14906 5195 -13083 -20827 -10406 1766 21973 17011 10527 19324 19751 16528
14989 16528 12799 6632 153 2389 3859 4399 11363 9075 13589 19755 27286 23740 28900 23571 14733
14974 14733 22210 29609 30966 22634 14727 6486 -3225 7895 10817 19862 21157 18870 16646 12655
14960 12655 4487 3462 2969 1208 -986 -8171 -11833 -13637 -2941 6617 2947 13176 16747 3233
14946 3233 -3129 7877 7848 10428 12702 357 5142 9249 8743 -6169 -5135 -18506 -26707 -21749
14932 -21749 8491 20152 25367 13801 14795 13293 23090 31127 29505 25429 29210 25391 17872 24447
14918 24447 38071 41904 35275 24945 29730 26805 24458 13585 14086 16194 20001 21965 29458 29327
14904 29327 10515 3884 12983 24868 26752 13267 13043 7597 -4755 6673 13383 12161 20677
14891 20677 26137 16367 9690 5287 21549 26905 19385 5561 733 8266 6291 14728 24468 35995
14877 35995 29860 22673 30707 32769 36048 39105 40322 23756 11533 12928 18112 25063 32467 37778
14863 37778 26651 26764 29326 27360 24367 28509 23281 22790 20962 13978 22729 37502 37557 45488 46795
14848 46795 42177 53200 48913 30097 28097 27935 28179 16859 9029 8031 13077 9239 3599 10638
14834 10638 18692 11949 5122 12649 10696 5534 12257 6640 11447 16768 16984 11690 7207 -696 4408
14819 4408 10721 9289 8171 3426 -1987 -3745 -2034 15113 19145 24183 19577 19828 15195 4482
14805 4482 9404 21835 17730 7283 9575 25491 38844 45422 42846 49892 59302 64184 60035 72516
14791 72516 76090 75110 66451 63446 51107 38873 22933 17943 21246 10406 20548 52515 62124
14778 62124 43694 36998 31566 15404 11688 9495 12043 14628 10822 1607 1097 1866 8568 8231 28419
14763 28419 33070 37548 19810 -2533 20421 22761 20767 22584 155 4592 8282 7887 9121 9505
14749 9505 14029 17793 1411 -1401 3069 -1015 -1236 1736 13061 14470 9831 19768 18668 15882
14735 15882 13276 17792 372 -1691 -6669 -6932 391 119 -14914 -13079 4662 16907 19378 17421
14721 17421 18163 16442 12902 9213 8002 17469 31256 20551 18019 17004 24987 18326 13520 13803
14707 13803 23604 12362 9456 12872 18757 27193 23441 21143 23171 18175 20996 12499 19221 36356
14693 36356 48229 44022 36470 34360 20608 5664 -4686 10479 20904 11689 4266 5037 6676
14680 6676 6044 11115 32582 34182 17986 14260 24546 29351 27064 29935 34136 41499 35006 17597
14666 17597 12469 22898 25053 25898 22270 11294 5290 6031 2136 5193 13228 20278 22166 9120
14652 9120 16773 29603 36285 32768 23017 11478 23121 20918 12968 7406 3372 10637 7067 5028
14638 5028 11336 14780 29513 45006 32793 13121 16522 28380 28423 21430 25508 36641 28777 20695
14624 20695 17693 13050 12941 17882 23098 32303 23702 13614 9862 11798 12649 19583 17183 20232 23975
14609 23975 17264 132 -8369 -12355 -10710 -2 12335 15718 21181 25449 38998 36469 26416
14596 26416 26081 33083 30186 27804 39648 38903 34943 22640 21280 26734 29379 31303 28705 20306
14582 20306 7829 -2515 9709 13892 16246 5857 15405 16719 11913 27293 37853 37461 35159
14569 35159 36998 36528 40419 48625 50707 42697 40329 46102 42281 20667 3950 10657 35481 38735
14555 38735 21068 7595 13817 7275 11548 6589 121 -864 17151 37663 38590 41047 31280 22344
14541 22344 12088 22312 29606 28892 28188 29308 23173 14555 8964 10659 11298 8544 8593 8087 17079
14526 17079 30903 42243 30571 24880 32250 31203 25920 21769 35197 36506 24408 17718 7103
14513 7103 760 5478 9190 5310 6211 16392 26628 12794 2417 5712 7675 11296 2395 8567
14499 8567 15159 16017 25928 35382 47264 49110 47879 33840 10525 5086 23991 32192 30037 27168
14485 27168 29489 27657 30290 40713 37821 26718 47495 55192 47159 35383 32901 38509 56820
14472 56820 56416 34751 28508 43496 38028 26043 25590 17887 19755 26937 41103 31794 17559 -1617
14458 -1617 -1528 9610 24421 23872 25943 21171 15243 16060 19450 25981 35616 30647 11325 5591 12592
14443 12592 23576 25129 14625 5651 -6562 7439 28253 32334 39915 38940 19702 24697 27345
14430 27345 21492 16025 22109 29379 36494 35338 32773 21142 15283 18531 20742 12046 15138 20158
14416 20158 27043 26100 14504 24796 38264 42415 43099 46972 44035 42616 39240 21046 13049 18193
14402 18193 24983 32492 35003 40587 41572 44086 44028 42062 43281 48912 50619 49500 53257 66022 76844
14387 76844 65962 46664 47899 42196 44837 63674 67082 53329 48950 45473 47296 29190 18380
14374 18380 27012 33893 29876 50394 53876 42423 34053 32802 33690 27795 15995 9892 10529 6481
14360 6481 10227 32825 35934 26796 27103 25130 20299 34342 36580 25002 25060 29317 46282 39820
14346 39820 42485 42884 36856 32819 39643 38731 39063 45701 45979 46788 34132 31489 37724 40550 39152
14331 39152 25771 14819 22302 22838 42441 46470 40091 44503 59451 51400 53512 66319 66282 36687
14317 36687 12468 14561 36186 41608 44327 40623 54962 55112 49530 41873 48737 52474 47428 46610
14303 46610 48609 49684 52085 60406 67987 66949 63655 62532 54540 56640 50418 43035 46024 55275
14289 55275 57066 54134 59927 60155 55833 60873 75606 96311 98348 94258 75244 70022 78636 90101
14275 90101 109226 142391 152272 170249 197051 235635 285229 344573 432578 560153 727950
14264 727950 900629 1063409 1201637 1288877 1293211 1204324 1043160 856042 651190 477922
14254 477922 369098 285827 211292 179990 163152 150004 142109 130512 115714 99560 96593 104373
14242 104373 115586 88061 73353 71764 74242 67323 50546 40629 39825 49543 53379 61306 53767
14229 53767 46540 61559 66867 67736 71773 66426 54502 52527 49325 62191 50014 45861 54303 62834
14215 62834 70383 70884 74503 69735 79177 95978 134717 178741 210166 248469 267676 283671 302840
14202 302840 316479 328330 339131 330415 298023 256701 214732 180281 138225 109763 104099 101164
14190 101164 92822 78152 64628 56338 66533 58606 49574 46708 30719 26962 20982 26678 36164
14177 36164 45934 46880 50427 53393 37777 28378 22081 16968 22974 33867 48446 49532 32361 29469
14163 29469 31305 39227 53011 58042 55833 49596 40686 26141 33429 34753 40388 36225 37495 48611
14149 48611 53491 39140 36582 46694 51219 47982 49088 44038 51377 52516 52585 55367 48402 32806
14135 32806 19641 27593 41843 36561 17397 20156 27326 48202 69130 69689 70812 65405 76277
14122 76277 83426 77641 56698 53747 53729 38392 33633 50026 51887 42910 38728 62833 67254 56940
14108 56940 54484 52668 56911 55849 47612 41609 42808 49822 48237 41575 49622 60453 63428 70144
14094 70144 70476 82404 81137 66235 52696 44494 55764 60421 68755 73940 77160 67969 63552 81689
14080 81689 91891 77404 59520 58735 71311 77636 80720 86100 98342 100983 100919 90993 87697 72655
14066 72655 63275 56726 55072 64819 76319 69154 72770 74756 60778 63077 70588 65028 63014 70857
14052 70857 73997 91161 103436 97908 88357 96922 87645 76062 76449 83541 72295 82377 117112
14039 117112 146835 164319 170738 189996 211952 235121 241964 259939 255787 231643 212419 200330
14027 200330 186894 168434 160833 149052 133725 110909 105145 116350 116774 115174 112351 106260 93328
14014 93328 87070 87926 99709 98723 97917 96868 78541 72032 75514 84602 76471 70714 82631 103409
14000 103409 117811 142557 161336 185716 196480 199100 203565 189838 177761 174599 165418 155904
13988 155904 143563 139800 128594 118809 111782 94573 94453 83256 79801 87225 89457 85566 88938
13975 88938 93393 117394 124949 118201 121066 125804 146622 172962 171648 174131 173583 165192 158236 166914
13961 166914 160733 146247 151854 157012 153991 159882 170990 174854 168735 179885 184118 178257 169207
13948 169207 147853 142992 158162 155789 155296 160809 150539 146362 158316 146207 136456 135149 125484
13935 125484 133201 136922 157399 176410 185662 183172 169246 174599 179577 191748 199706 205729 209005
13922 209005 203576 206660 217383 227987 239640 247016 252892 272375 290418 302118 317002 336889
13910 336889 348734 349280 342689 326858 306105 275486 249273 216766 215832 216665 208318 213734 222776
13897 222776 227585 231701 229296 211603 205927 209351 230768 246667 251855 255463 253638 245831 234327
13884 234327 238657 239356 243111 251960 255623 266378 278035 263046 257900 248709 251426 264318 283052
13871 283052 279661 272164 264244 272590 293265 304265 313626 328091 345968 348528 347268 361892 377472
13858 377472 392398 408920 427468 428729 424867 430765 444756 447260 460500 474503 474732 487061 508581
13845 508581 526187 527700 522593 519185 534870 566597 596580 616016 631862 671129 716177 744942
13833 744942 774336 828264 876782 908671 933419 959937 999280 1033814 1057147 1080476 1112797
13822 1112797 1168189 1228307 1293975 1366181 1468372 1587304 1699735 1797366 1919850 2052163
13812 2052163 2179441 2316297 2477123 2679156 2898286 3132286 3420827 3758548 4134182
13803 4134182 4598404 5182842 5870379 6675826 7613387 8662124 9807655 11048604 12410031
13794 12410031 13975570 15882797 18356093 21650359 26152313 32442790 41331591 53865542
13786 53865542 71258304 94884026 125071653 159319370 194209134 223725231 240851250
13779 240851250 242680141 226774363 196835910 159124925 120082824 85987757 59694171
13772 59694171 41934890 30876877 24032712 19635289 16681024 14584057 13011007 11762405
13764 11762405 10697603 9691801 8706225 7700309 6702404 5755891 4902039 4190954 3637777
13755 3637777 3207887 2901844 2694601 2551702 2442138 2338145 2227097 2098084 1938378
13746 1938378 1758912 1590394 1433733 1315180 1211352 1127003 1066602 1011472 964013 910482
13736 910482 843541 794157 736584 688173 642286 613391 589536 566789 543951 525099 528461 538376
13724 538376 529854 528628 525545 507336 480182 461694 435885 415924 396802 380221 363348 356215
13712 356215 351072 327695 323897 312780 294270 279866 259871 253164 245281 238250 237303 231920 242269
13699 242269 239719 229237 222596 204420 212471 217972 234102 252740 288658 327999 359829 390374
13687 390374 427406 451899 444544 406639 350289 288087 236203 197753 180157 167571 154801 127275
13675 127275 131576 143337 139223 130975 135899 129384 145714 134984 137780 142549 132262 132828 154874
13662 154874 179832 191910 209583 224889 234139 240627 238026 225061 209311 189150 174063 150203
13650 150203 120227 90516 77864 71707 60800 50824 44415 37496 38976 42071 42692 40404 24379
13637 24379 9484 8139 21223 28181 37319 47485 47742 45647 32744 28144 26218 35038 41755 49354
13623 49354 49829 51026 29291 8577 6327 1556 5341 20867 19910 10804 -2164 -20242 -32838
13610 -32838 -21152 2754 -17687 -32286 -33349 -30230 -33081 -41048 -48777 -37335 -29354 -24913 -32946
13597 -32946 -39156 -32462 -46225 -56441 -62652 -53170 -65286 -65702 -48603 -34936 -26738 261 14171
13584 14171 12957 29367 36659 29281 32089 34149 32098 24833 -1284 -9864 -5476 -16997 -14713 -3607
13570 -3607 -1360 -2995 -6025 -16387 -32749 -42262 -62263 -64137 -42308 -33184 -18469 -17330 -6363
13557 -6363 407 14634 27991 15896 15953 13434 12040 13585 2983 -13700 -20552 -8137 5772
13544 5772 2297 4500 17379 15605 6612 -5255 -11022 -8717 5108 17165 18193 20889 9838
13531 9838 2379 4817 9075 5282 22533 19863 25753 29827 30041 24584 25627 23065 13549 35477
13517 35477 42590 22780 -3495 -10885 -4759 -23177 -32933 -41290 -33287 -20900 -18916 -19629 -23704 -21942
13503 -21942 -26860 -31234 -25816 -26266 -11458 -6500 -2328 -4132 -11931 -5080 -11656 -17651 -35241 -25180
13489 -25180 -23047 -25805 -29728 -25046 -21599 -2613 -5856 -23799 -20879 -2434 -5101 -8845 -19721
13476 -19721 -40492 -40979 -18907 -8848 -8024 2593 -1490 -2804 -8623 -15040 -13668 -5281 -8791 -15206
13462 -15206 -9692 644 -1183 -10860 -13907 -15487 -25193 -27807 -17572 -15509 -11975 -18694 -22895 -21403
13448 -21403 -20713 -17618 -14560 -27715 -30872 -38328 -30783 -30207 -22198 -12123 -5154 -2969 197 -4025
13434 -4025 -9220 -13776 -9380 -7631 -12620 -15386 -7980 -6546 -1166 4210 -1155 -6843 -10489 -9776 -14666
13419 -14666 -31419 -36969 -29146 -17108 -12711 -22131 -25953 -24817 -13945 -17879 722 3726 1901
13406 1901 5481 14390 10066 11233 2660 -6352 -1078 1714 -1791 8952 16920 13068 12521 19726 30687
13391 30687 28307 25233 15044 11367 -2988 697 -4783 -1339 6421 844 8298 2731 1168 9376
13377 9376 21188 21076 23567 17307 -444 -10814 -5553 -8805 -24814 -22054 -16630 -20086 -2901 -13283
13363 -13283 -15125 -14674 -17657 -23133 -16335 -18118 -31174 -36737 -21551 -4299 -405 -3097 3520 4789
13349 4789 -1654 -4805 -2081 -6676 -4599 -7568 -9665 -17903 -23398 -14135 -3360 -10280 -22518 -13952
13335 -13952 -7607 4234 13500 10520 -714 -2421 12631 16673 12154 2919 2465 7565 10060 16832
13321 16832 12157 13067 20476 32012 34691 39932 41731 40707 39595 42362 52842 58560 49637 57643
13307 57643 68325 82015 89601 96310 113343 154010 175318 215986 287430 375238 486125 631734
13295 631734 803140 990380 1157573 1245364 1262340 1184916 1043583 863604 669751 507698
13285 507698 357230 250577 183941 147790 132765 112719 87790 93500 81139 90320 110573
13274 110573 110707 114049 127822 141807 165735 170869 173751 154456 123020 82761 68157 49002
13262 49002 32105 37217 45460 39791 40241 34918 26378 11690 -45 -12751 -7352 9316 26559
13249 26559 22052 26335 20987 28750 26984 33539 31065 32275 31094 19028 20783 25362 30088 26833
13235 26833 38940 58632 80778 99093 127461 166034 205357 275873 360146 467067 590830
13224 590830 632080 591824 504107 370342 238204 161761 129904 126505 142288 156955 189523
13213 189523 216777 232470 225445 197367 153837 107511 81651 67110 60282 54333 53826 55693 50574
13200 50574 43397 45818 44393 43099 42386 42360 40959 49714 57661 71902 71180 78029 104030 133473 161643
13185 161643 174265 221836 305894 419378 529107 640893 693997 654455 515789 354158
13175 354158 269103 244097 239462 261526 309969 381646 468342 574180 649524 629626 512410
13164 512410 373330 247010 172510 129808 117321 101259 79696 71271 49903 36879 33223
13153 33223 22264 26080 27359 34870 17091 6323 19185 28956 29234 34066 35584 44178 64329
13140 64329 96914 112376 133374 168382 205409 231221 250874 225568 168412 133749 131160 161314
13128 161314 195824 230165 303234 387940 483017 603277 691139 652178 490503 309869 208609
13117 208609 155586 119471 101870 86669 77335 70474 67316 45743 29739 25320 30046 37790 20337
13104 20337 10808 14608 17456 20756 19591 10736 4311 17559 35378 29463 26563 21112 24225 35374
13090 35374 40340 50790 38074 28553 40652 55988 52971 61339 71403 91643 127288 165570
13078 165570 210171 239347 207746 132471 68968 58409 50144 34101 23033 24451 37181 48911
13066 48911 37267 16199 9211 8929 4552 6259 -4230 -1526 2406 10562 10054 -4161 4217 15067
13052 15067 14487 13743 2918 1717 21182 25245 25125 25011 17688 14991 10674 17886 17140 9472 9024
13037 9024 4604 9734 33011 39514 37648 38036 24154 19959 16710 11484 7548 4053 5198 -9698
13023 -9698 -300 2283 -8580 -6102 19 -3322 -853 4379 6477 15105 17055 14169 7163 4707
13009 4707 2245 -1551 -11045 -12877 -7982 2444 21807 15958 -5370 -5293 -10777 -23094 -22284 -9332
12995 -9332 2289 3346 -3747 1057 17766 9374 18204 29354 29031 20315 5303 2782 -423 416
12981 416 -5853 -6551 13689 27691 26199 11173 3561 2885 1139 -9372 -4225 -4836 -17801 -29302
12967 -29302 -25229 -16362 -7183 -10647 -16537 -6385 1992 1793 -10896 -7306 -17297 -20834 -9632 8230
12953 8230 11933 7496 -1096 -9638 3534 -3462 -6951 -146 2649 -7246 -14017 -25571 -20743 -4092
12939 -4092 14963 9383 -2909 -9114 -18458 -24445 -11863 -916 7565 16313 1823 -9112 2038
12926 2038 3577 12520 5876 636 -1244 -10315 -13128 -12237 -10559 -8252 -659 -19606 -29823 -19314
12912 -19314 -10270 -16721 -5187 -1180 -18066 -19451 -4772 3968 630 -11229 -15209 -10367 10567
12899 10567 24052 15138 18875 10882 727 -2164 433 1408 716 9329 15509 22751 13428 21858
12885 21858 19837 15590 18370 7436 -703 -11517 -7772 10613 17231 18135 3710 -9904 -311
12872 -311 1118 -1526 -4671 -10658 -6958 -8383 -6930 -6054 458 5450 -10166 -17458 -28771 -22509 -15010
12857 -15010 -4378 1143 2 -1898 -7064 -958 -5890 -20192 -23569 -21898 -3973 -3249 -3897 -7977
12843 -7977 -8334 -13666 -2694 9429 13777 10505 10425 1196 -6546 1546 3623 1342 -8565 -12777 -5554
12828 -5554 -883 7484 14872 15854 8512 -606 2013 -758 1579 -674 -508 3553 11194 828 -13718
12813 -13718 -7259 -1961 -5669 -3435 -220 -9495 -25370 -24139 -21531 -10621 -9041 -11787 -22968 -27561
12799 -27561 -23413 -23831 -15469 -17139 -13031 -7327 -4467 -4587 -521 -18397 -15341 -8625 2560 17902
12785 17902 11978 1271 -14584 -24850 -20057 -20471 -30102 -24267 -12217 -2877 -3631 -8934 -2486 10273
12771 10273 18650 9612 -7346 -11195 -13784 -7318 15584 30530 32797 22227 8377 6174 6404
12758 6404 9846 18940 2271 -7023 -7452 -17969 -26104 -17875 -18730 -33689 -27789 -14528 -21094 -19748
12744 -19748 -8660 -6484 -5161 9936 3673 -13162 -24263 -22977 628 12483 5806 -3407 -9163
12731 -9163 -14125 -29813 -28746 -11908 -11339 -21353 -17821 -23120 -27995 -29644 -11803 -9014 -11110 -5298
12717 -5298 -7469 2025 12935 16545 -4634 -9522 5082 17094 17674 16296 24157 11560 4919 11608
12703 11608 -1468 -15264 -17363 -10855 -11452 -13372 -20155 -17682 3238 7532 8064 9106 1874 -5018
12689 -5018 9823 15401 11971 -3085 -6187 4046 3975 2792 -7084 -9290 -13697 -14984 -6057 4862
12675 4862 2658 -323 -3310 -3654 -7554 2646 6389 322 -17036 -10598 -1487 -4673 -20505 -8990
12661 -8990 9802 5214 -5505 -9000 -4704 -8484 -4586 9134 18395 9483 5689 -4465 -11365 -5522
12647 -5522 9816 4368 4014 -3124 -17247 -17840 -25392 -20865 -5443 -12122 -14591 -4596 2872 -5334
12633 -5334 -1197 2339 5898 -6128 -10854 -3393 -8527 -3043 8508 -720 -1642 -10796 -28091 -22727
12619 -22727 -14594 -19480 -17668 -20579 -12549 6957 17206 12889 13975 15385 10848 9961 -235 -10343
12605 -10343 -13414 -7839 3101 -499 -9280 -4446 -6169 4212 8331 8022 4816 14690 21255 17367
12591 17367 11634 8483 -1934 -13029 -23351 -19938 -19810 -17957 -11792 4503 16481 6815 -13084
12578 -13084 -13374 -10750 -14877 -2895 -3869 -20415 -17262 -14539 80 2504 4363 -585 -7665 -21636
12564 -21636 -25017 -27459 -34166 -26343 -21146 -28863 -17388 -12409 -12189 -8603 -8789 -947 4773 1800 4671
12549 4671 6947 4597 11764 7490 6452 8085 9060 12371 14274 21379 28599 24894 15161 17565 24096
12534 24096 20318 17152 16181 24774 30047 30040 23950 15900 8306 5030 4170 12641 2472 -3945 -13877
12519 -13877 -22416 -2499 -380 6552 11376 97 -4235 -10232 -10493 -15604 -5689 7388 16651 13938
12505 13938 12608 422 -16808 -19630 -4822 11063 3752 -4001 -10684 -18209 -2832 11798 -5937
12492 -5937 3531 15592 12066 4362 2463 6648 6947 5664 -2223 9097 6320 567 1241 7227 17241
12477 17241 12108 24552 36948 26926 12626 -2838 -1789 5793 7380 11480 2677 2289 9813
12464 9813 20906 24718 20430 6820 -2837 -651 3697 -2660 -11525 -20482 -23097 -24116 -11239 -4337
12450 -4337 794 13711 11852 4807 -3148 -6878 -8669 -4799 4441 8340 9769 -541 -8396 6680
12436 6680 10419 4427 7010 -2842 -10688 -7120 -5555 1175 2736 5776 19699 9414 -8259 -17861
12422 -17861 -27346 -18637 -3875 -1244 -9738 -1703 12201 10572 -6462 -5399 358 13027 15124
12409 15124 9486 8722 7353 -3226 -1898 2022 10105 27388 21923 -6052 -4937 2900 2079 -7305
12395 -7305 -11818 -6181 2390 135 9513 10843 19966 10283 3773 -1053 1060 -424 9447 17056 14535
12380 14535 18648 16968 12978 14105 2973 -3994 968 4957 2932 1846 9332 23811 14559 12138
12366 12138 4273 11127 -2373 -5966 5135 15882 23756 32670 22707 13095 10359 -6889 -13848
12353 -13848 -13736 -18903 -19103 -14437 12052 19742 10757 3458 -2171 -4940 -8004 -8721 5234 -2534 13710
12338 13710 22188 15995 9315 3454 8595 13530 -8037 -15230 -9052 -10875 8381 20479 200
12325 200 -18812 -15913 -3250 8880 8727 474 -8459 8622 22148 13729 2904 1299 8146 19068
12311 19068 21744 16927 11799 20110 29923 29120 28130 33891 29788 27929 19621 12531 16997 21115 29293
12296 29293 18316 16563 21254 23462 16429 20494 7724 7898 2827 -8194 -5224 2733 2423 15939
12282 15939 7535 4405 3127 -1185 -4177 -458 15107 22701 10350 12928 15023 5417 -9018 -6675
12268 -6675 176 13144 22833 15711 4960 2277 3679 21874 28391 16536 3329 -7178 -7796
12255 -7796 4430 8360 -7644 -10329 -10532 -8575 -65 6596 5824 -6038 -8606 1910 153 -8038
12241 -8038 -9858 -5516 6120 10101 21771 29576 23923 12912 14158 13854 7415 8248 16578 17363 20044
12226 20044 12435 10375 -8274 -18735 -14526 -4481 -1525 -5319 -5352 -12498 -6704 7961 28104 11527
12212 11527 -258 -289 609 2593 17141 20644 -191 -13275 -11470 -954 3822 5660 3537 3151
12198 3151 8982 -5625 -22932 -19557 -10937 -204 -3343 -7741 -1528 2322 -3244 8110 12524 8433
12184 8433 14855 11528 -6538 -20797 -14644 -5131 -4140 -3619 -4263 8142 20180 23902 24169 28706 28606
12169 28606 27102 37671 42148 39855 35474 34660 31203 26474 17509 12397 10289 13565 17196 11664
12155 11664 14357 20967 14909 8785 -2318 2681 10722 11472 9975 6945 13791 4722 3556 11278
12141 11278 20332 22523 10488 -2788 1162 11677 19654 8771 275 2239 1615 3879 27194
12128 27194 33750 30180 51154 67727 77750 85684 69071 52366 46393 41696 28469 28485 24825
12115 24825 14558 12596 5708 -2769 -2388 3666 11720 26318 45799 50297 32777 26853 16573
12102 16573 11218 7770 8024 14649 4266 -1911 -264 983 7555 11236 10696 1051 4228 8744 9000
12087 9000 5527 5685 15136 22889 36158 55987 67858 87368 89910 60389 41568 38175 35846
12074 35846 22642 5070 2787 4803 11753 8522 3926 6281 7056 16483 21622 20964 13555 14948
12060 14948 23171 29183 22328 22076 13937 18484 16251 3264 -7177 -11522 -1634 11315 19022 15425
12046 15425 -1197 -23040 -25891 -21629 -16965 -22577 -25945 -22395 -5335 9545 23421 38821 27536
12033 27536 10905 22108 34075 35282 33576 17719 6565 -8778 -15641 -8682 116 4641 6591
12020 6591 10898 821 -962 -12781 -23494 -7627 12701 4251 -6852 -2330 -8441 -10867 -6633
12007 -6633 -2867 -1146 -7591 -1836 -1077 -2997 -5603 -6200 -5061 7099 23168 31331 28807 25698 33446
11992 33446 32964 25932 11119 -1279 -1159 6042 23102 20549 18422 22817 16913 16171 9712 3875
11978 3875 -1331 -9337 -8524 -2058 1970 5836 23767 18371 84 4245 6206 2430 9828 24632
11964 24632 23319 31848 29616 24626 12003 3358 526 -879 -4617 7530 10907 23657 34180
11951 34180 28142 25917 30868 31466 25214 24686 30886 40329 40722 16503 585 1041 3028 12035 8966
11936 8966 -3753 -2479 -440 5605 7476 1575 -15338 -19860 -17531 -5963 -2364 -3897 -3520 -872
11922 -872 3711 7292 -6694 -6175 2409 16988 20189 31162 28065 23539 21649 19290 7827 13248
11908 13248 12375 17291 9090 12383 23890 17710 8993 3108 4689 1692 -15915 -3994 9511 11752
11894 11752 5053 11302 13849 18878 11802 -5602 -20773 -16366 -19481 -21083 -15944 1403 7084 11429
11880 11429 15264 5204 1544 5758 14388 21609 25601 29827 25808 26057 24155 23611 9539 -3798
11866 -3798 -9622 -7519 -214 4777 17910 14944 8670 -4084 -10456 -2069 -1913 -3037 11018 13472
11852 13472 -2322 -343 2884 -1503 -11547 1367 10096 6602 6683 -2907 -15897 -14943 -15341 -22881
11838 -22881 -7896 4854 1208 -10149 -12059 -9231 695 7884 2958 1853 12254 11366 17498 28196
11824 28196 20197 23611 24409 20274 32188 34105 13777 12314 8605 8838 4864 1913 -4201 -9784
11810 -9784 -11141 -19225 -10468 -1050 2001 -6743 -349 -4635 -3155 -395 1476 4721 17098 19543
11796 19543 23949 20069 7571 -844 -7617 -2822 -9803 -15711 -10846 -1599 10355 19660 13157 13349
11782 13349 2711 -8063 -13465 -14316 -15675 -1624 5746 22190 20035 17205 27489 30073 15631
11769 15631 4159 2802 1584 -4523 4935 13731 16422 5071 3287 17647 30885 31120 10110
11756 10110 11630 14742 -3707 925 6339 3901 1890 2254 11658 18817 8598 14335 17257 1538
11742 1538 11786 10182 9066 -4842 6910 32540 37078 13342 14042 23972 14047 4861 -2623 -17981
11728 -17981 -16620 -20142 -15543 -15429 -12133 8589 12591 7001 22034 30217 12329 13222 11012 5684
11714 5684 -1671 -757 6092 11222 19765 11649 16450 18232 706 -7347 -1476 5050 22385 36269
11700 36269 21952 2149 -3060 -1659 8008 9612 7247 2435 -321 -990 2524 7995 5250 10577
11686 10577 6014 4835 15036 10712 8377 11160 7485 -2636 1547 14495 20097 22355 31994 25994
11672 25994 12592 -3085 3550 13042 14924 -1343 3417 4640 3000 8973 21463 34102 20611
11659 20611 11319 17056 27324 30942 24354 11555 14721 23588 18510 14304 7399 7868 11592 3348
11645 3348 917 1345 6633 10546 9638 11876 7468 10150 7769 17005 19143 12875 21376 25268 17861
11630 17861 9077 10096 27473 28047 16550 -3433 -17799 -7142 -5394 -5282 12906 12296 13321 15525
11616 15525 16387 21212 7329 5981 12431 11593 13250 14315 13322 5420 10242 27236 23916 9670
11602 9670 26482 30008 22493 26706 21382 13557 23403 20241 5593 10410 10045 12112 21909 14307
11588 14307 18663 20540 26649 27551 26636 27827 32366 41462 48944 42431 31621 6488 6075 22763
11574 22763 30341 39698 31446 24596 22603 23992 20816 10960 9846 26636 39369 29377 11396 3260
11560 3260 -1616 5312 20881 23645 21711 22024 26024 27694 21710 28251 33437 30730 9723 -4919
11546 -4919 -8430 18823 44903 49941 41688 32891 29433 28005 27991 15429 13542 35757 53937 53046
11532 53046 36437 36334 41650 46406 42996 40622 36826 34796 37803 21933 18979 25015 35415 23464
11518 23464 3783 8166 16797 23363 23183 14739 21160 22395 20104 9005 10383 12968 11285 14832
11504 14832 20526 31889 17695 22193 18667 22452 20751 22787 27440 21594 8668 9354 3691 8599
11490 8599 8834 7881 18610 26358 15400 8341 5173 12928 16800 10100 8930 9991 11400 5492 9521
11475 9521 14151 13408 13613 15166 18021 17921 14250 5994 3618 -5353 -8797 5364 17312 25489 10585
11460 10585 9174 16902 12382 10989 21433 25906 17706 24518 23115 26568 30038 38354 31608 13618
11446 13618 3705 2842 7273 3104 3167 20019 31880 25025 9373 -479 -1830 12058 25391 26607
11432 26607 24491 8364 4151 -5204 -3504 2741 -1966 7127 13569 22744 16525 9561 11129 6018
11418 6018 6382 4463 -4165 -23610 -25440 -15243 -16003 -10099 10980 12386 16828 27449 20541 1969
11404 1969 5015 16363 20109 20016 12879 20114 23339 13873 14362 23089 24248 19825 14923 19755 25578
11389 25578 25054 38157 40854 36612 34055 26228 24840 35423 32120 25638 15524 21788 10938 9995
11375 9995 36455 48833 35980 19948 17259 19508 16430 26213 34727 28321 33953 21190 19258
11362 19258 29017 36551 51237 46394 36263 33909 26994 24688 37704 34005 24633 29063 37151 40621
11348 40621 36053 48693 46101 26391 16294 23904 37449 43396 34907 34197 38707 33781 21868
11335 21868 24658 25824 26324 23586 29705 39797 34829 25921 15083 18565 27033 26984 25578 37136
11321 37136 41979 37809 47713 53317 46191 42929 42936 47255 46774 45888 51549 54443 41401 31368 27765
11306 27765 33415 42242 29931 25199 32197 27141 27485 23777 7971 6084 10601 10209 27623 34081
11292 34081 22944 10185 4927 -7526 -17747 -19562 -9122 946 18394 28701 38574 33810
11280 33810 42100 45146 57168 58718 60551 50245 23433 19085 20664 15962 16375 32894 32415 39941
11266 39941 37454 24866 26671 29295 25590 23423 17526 21020 36766 26504 31060 35041 35366 24571
11252 24571 29314 38573 19647 12130 12416 5870 5946 17311 16014 10708 9629 9535 12503 24146 33363
11237 33363 30518 14197 12153 20356 25716 30009 32295 29890 30941 31792 37859 42269 35385 35619 36963
11222 36963 37640 39263 44427 48212 23976 18978 26092 23759 26468 32028 34486 35829 33359 22903
11208 22903 17904 31424 43471 26389 26927 32375 26276 18345 19056 21791 25320 25440 29578 31705
11194 31705 27112 22948 37550 28691 13262 8673 21065 19128 23141 27490 36714 38908 34961 33779
11180 33779 35891 24888 9589 9789 19299 23160 24048 32073 43065 43558 27870 23953 36034 38063
11166 38063 43425 44956 38743 28329 16461 16737 11367 21098 20478 19221 6687 262 15423 30921
11152 30921 22635 11117 20671 27734 36767 48088 42690 50478 70868 66687 43820 30442 21659
11139 21659 24910 28300 37406 46834 37762 25123 21391 24201 31668 33959 45111 42621 41031 43720
11125 43720 31621 21583 18484 9314 19472 47155 55636 48971 45878 37978 37072 38255 45444 50337
11111 50337 44630 38333 36013 35353 36400 37904 20798 23415 23975 49589 55756 41343 39888 36309
11097 36309 37665 46264 60123 65727 60080 58775 62704 50823 42933 54866 58399 54875 50246 44972
11083 44972 43036 46835 39039 32999 38709 25893 20936 28466 31974 30189 36591 54388 64506 78658
11069 78658 71352 44088 31805 33944 34396 37060 15287 1316 6116 14155 8511 14078 20603 19161
11055 19161 16323 17126 23160 27623 30768 32647 41998 43483 46554 50235 46365 47564 41908 38806 41910
11040 41910 36406 32468 28753 44038 36030 43305 58073 67224 62371 62350 60712 52895 38591 39196
11026 39196 33517 32518 36133 41070 35247 45979 53764 50908 34559 22555 25570 33772 39427 41451
11012 41451 54353 67535 63281 60494 71880 68194 57531 53744 64671 61544 42420 38919 50032
10999 50032 49231 44284 39611 48701 69654 58019 54166 66496 76314 69069 64271 61189 70623 78383
10985 78383 75576 64238 54410 42426 41718 39150 32131 39538 53862 78867 92769 87485 74000
10972 74000 70489 84165 92141 103800 113342 118722 128984 117279 92136 86267 88765 103333 107876
10959 107876 111178 111802 125590 135187 134449 142178 150893 148885 147198 171003 191005 198266 213519 254541
10945 254541 293526 362903 440817 553530 706683 940741 1261843 1662473 2133992 2659495
10935 2659495 2879922 2382364 1624940 1061453 712871 515643 393359 322735 272293 225051
10925 225051 191152 155859 128824 123033 107242 91574 89885 76414 92467 98432 105015 103210
10913 103210 114186 118901 116364 117093 115896 99166 80850 85286 92407 89729 89012 89320 77432 83416
10899 83416 80264 67484 53459 59213 65288 72075 76906 78972 74356 74786 84868 78683 72934 76357
10885 76357 79251 85914 95826 91152 89879 73510 73898 76193 82700 74027 74655 70803 58786 47723
10871 47723 56117 76717 83829 87678 89950 88991 92746 98306 94210 101100 105838 102279 104497 96013
10857 96013 89854 75816 66270 60011 74663 73541 71662 80237 89526 85004 85345 97654 96289 101541
10843 101541 96187 82591 64041 74944 101526 120641 107559 91221 82439 88216 100481 125005
10831 125005 141208 157461 156700 143312 125317 116199 109352 102984 112878 118412 129469 139529 150269
10818 150269 162410 158109 159196 167351 158366 141167 138173 132733 128544 132334 121777 122555 131879 136676
10804 136676 124710 110236 131333 140868 151751 150012 132495 141031 142388 133818 144369 160448
10792 160448 142506 129730 126232 118324 125308 143639 162356 190437 239694 290709 352566 391355
10780 391355 418241 458917 509200 448284 384856 326626 255012 218443 213782 216425 216342 225028 228606
10767 228606 213405 183908 175307 169180 160257 163496 162654 164055 163501 173583 184650 185028 191011 213647
10753 213647 252159 314661 408980 515620 642858 800653 985044 1078851 1006284 805718
10743 805718 607564 474889 381331 334825 291498 269341 253314 228945 199030 174140 141306
10732 141306 132581 137671 126796 134016 136943 128215 128746 137765 142116 143637 148401 169863 186260 204939
10718 204939 217744 232173 234836 247263 282579 307647 292753 268055 262540 266066 243864 220640
10706 220640 208115 210478 231924 250671 266163 263691 266222 252131 238279 230891 224939 223146 232207
10693 232207 240239 250740 255327 240915 231970 245856 245368 234142 210394 191277 188664 210327 223623
10680 223623 219292 213283 221196 231424 245395 271303 294627 304492 297126 287148 300005 322623 338001
10667 338001 356948 375025 369779 370183 380910 387153 412749 475738 523461 541228 566185 608726
10655 608726 606747 557929 485062 423502 371938 345977 320789 322130 340483 353925 358437 372477
10643 372477 372273 349484 342639 336590 349082 359576 354846 358069 370669 398754 403796 408330 406459
10630 406459 410398 424115 423483 429665 429634 425182 428873 447512 439567 437258 431395 438417 447626 454978
10616 454978 445881 441160 460929 487874 503205 526756 547237 568206 581966 596786 612016 628109
10604 628109 659549 685363 687294 696951 702375 722911 735840 742398 753493 772018 796201 819747
10592 819747 830024 834703 833655 832500 848143 864326 889598 930781 987313 1045007 1104254 1171810
10580 1171810 1261565 1332922 1400404 1501230 1569746 1616497 1655209 1700664 1772220 1890692 2015440
10569 2015440 2149401 2323479 2554673 2894514 3353712 3884500 4476628 5164240 5675938
10560 5675938 5539997 5011163 4615179 4510643 4633469 4889195 5287717 5844805 6498163
10551 6498163 7254491 8164157 9216681 9914730 9856404 9679889 9948248 10717910 11924703
10542 11924703 13546590 15640537 18388721 21881849 26241007 31901681 39490609 49693796
10534 49693796 63557689 82743870 110097954 149938898 206165975 277322422 361684546
10527 361684546 461425180 527895470 461932057 316358328 197953911 126682497 86414613
10520 86414613 62827613 47936837 37868619 30757905 25242234 20819473 17466246 14870539
10512 14870539 12827272 11234595 9983409 8983721 8161245 7494827 6989247 6687347 6561185
10503 6561185 6633429 6702798 6139862 5050671 4117971 3484835 3062611 2738268 2488903 2287634
10493 2287634 2102862 1945918 1832169 1722703 1632499 1553950 1472807 1424743 1402540 1339309
10483 1339309 1237811 1133432 1056385 989788 925042 856916 793857 770497 746139 741791 744447
10472 744447 752380 744618 739441 737329 736238 716325 682128 643331 611837 579183 551850 500118
10460 500118 433908 412587 425126 426738 420258 396704 358088 331407 317774 302607 313424 308204
10448 308204 296350 301361 311520 314067 296929 293714 289473 288441 298528 309314 315982 305734 282848
10435 282848 267284 241007 219703 191845 177492 182587 178802 156488 145333 153336 149523 143680
10423 143680 160060 165974 167461 151609 136213 120114 124717 144654 160317 164869 158717 170928
10411 170928 190360 202949 216773 239326 279301 316356 351582 387616 405024 393000 378145
10400 378145 364274 292665 179858 126962 97796 80785 81025 86930 64892 40759 27698 21451
10388 21451 28470 25577 26802 29652 29973 25707 21986 10078 1003 6292 9380 21042 30627 31695
10374 31695 31790 50463 55266 30819 17007 18929 23842 22185 11397 5859 2638 -13424 -23417 -23062
10360 -23062 -29773 -45492 -47421 -44295 -32162 -41685 -49588 -64007 -77210 -69828 -63349 -57532 -37028
10347 -37028 -28111 -29552 -39686 -48761 -71521 -88875 -97092 -101350 -97031 -92602 -73441 -61498 -54877
10334 -54877 -44933 -29875 -5375 13412 45387 72585 74129 61747 52383 44886 35402 27216 16902
10321 16902 12535 13994 10346 -8532 -32490 -45116 -56395 -81644 -89223 -101568 -105468 -77151 -60491
10308 -60491 -54024 -45441 -28309 -11272 -7972 592 9447 23177 24645 25003 23174 15340 5546 -3511
10294 -3511 -4395 -2084 -5560 -14009 -2427 -12550 -19719 -25756 -43442 -62569 -75840 -77229 -61907
10281 -61907 -52409 -55674 -34023 -13419 -14445 -24557 -13632 -1276 2250 5105 2397 16127 35908
10268 35908 26582 15403 4297 8901 30372 31743 9990 -4239 -17841 -30206 -28714 -41295
10256 -41295 -45602 -27030 -29733 -35819 -45615 -68752 -72428 -65671 -71253 -55745 -49967 -51101 -56019 -49962
10242 -49962 -51069 -66025 -56709 -53203 -52609 -47995 -48988 -50978 -59231 -62228 -60070 -48240 -38768 -35640
10228 -35640 -30749 -39459 -50864 -70025 -87895 -96142 -90877 -84073 -72331 -63691 -53125 -50498 -46939
10215 -46939 -38385 -26056 -10208 -9910 -13169 -21581 -17604 -29807 -22915 -10865 -6072 -11911 -12279 -12322
10201 -12322 -19440 -17520 -21118 -26269 -17493 -5601 -13801 -8911 4080 15799 14981 3059 -5908 -1289
10187 -1289 -7916 -7012 -21242 -28559 -35408 -40207 -34507 -32484 -28517 -17595 -2870 2772 -2014 193
10173 193 -9128 -10607 -9503 -21656 -35380 -31518 -23649 -21877 -16606 -15503 -20437 -14411 -5737 5258
10159 5258 17340 9138 -259 -6358 2304 5526 7865 -843 4203 7669 9468 7033 21703 35755
10145 35755 29866 12228 5388 10993 8776 7669 10611 22065 31319 22970 27612 38327 47021 41952
10131 41952 28856 17609 20363 37870 46991 50186 59648 94387 124215 151868 200759 264052
10119 264052 341972 449067 611327 814073 1113976 1509573 1980179 2521182 2809046 2384091
10109 2384091 1606560 1001563 640291 430528 296053 227448 168202 123905 103557 90545
10099 90545 70440 49560 37876 23204 -2112 -11797 -10 -12241 -26611 -31984 -22919 -26443
10087 -26443 -28985 -29149 -25250 -21779 -17465 1679 25474 23106 8600 3499 -2457 -10552 -9369 -11151
10073 -11151 -18492 -24579 -21158 -31634 -35749 -33961 -37732 -40635 -45305 -47940 -47846 -41320 -38976 -35706 -38395
10058 -38395 -24586 -20239 -12323 -16563 -22490 -30539 -38377 -39201 -33146 -17535 -15830 -16195 -19638 -42117
10044 -42117 -39124 -13601 274 -988 -15961 -33727 -34186 -25089 -18273 -6210 -13004 -23318 -27793
10031 -27793 -23777 -22616 -19236 -9563 -6653 -6848 -9335 -13479 -12540 -2941 -9622 -21313 -21305 -21803 -27090 -20352
10015 -20352 -26456 -32279 -33073 -48632 -35986 -34918 -35618 -17900 -12824 -22474 -24783 -24792 -41205 -49033 -46465
10000 -46465 -34005 -33252 -31447 -27250 -33482 -24137 -20619 -28370 -23424 -20774 -9225 -8549 -9989 -2137
9986 -2137 12058 34405 49760 56021 54522 38558 26797 30082 9376 -6937 -7002 2389 -6121 -17706
9972 -17706 -9709 -12065 -10912 -939 -9421 -13060 -16117 -3090 -4428 -13107 -8226 -8233 -11903 -20482 -35442
9957 -35442 -29436 -14142 -10345 -7454 -12580 -20054 -15825 -6443 1282 4907 16460 8301 -18262 -39556
9943 -39556 -39904 -20642 -7646 -16711 -12335 -10155 -7586 -15113 -19546 -9310 7591 9298 6709 311
9929 311 7740 7568 7788 6320 5427 12374 9191 5333 2999 4250 -4532 -4074 -15421 -18886 -24943 -18151
9913 -18151 -11709 -20018 -21030 -1459 4727 -9943 -14870 -19202 -30282 -27259 -25549 -11077 -6788 -1528
9899 -1528 -9482 -15921 -10022 -13542 -15936 -9110 -18979 -19744 -26218 -26695 -21538 -22060 -15987 -3525 -4929
9884 -4929 -18830 -23938 -11372 -11061 -10770 -12989 -14083 -4195 9307 13784 -3113 -20796 -15698 -12810
9870 -12810 -7798 -7230 -7238 -6390 -16072 -19093 -7191 -5403 -16806 -8812 -5883 -10235 -5854 -5882 -3283 -13292
9854 -13292 -14313 -18329 -14044 -14915 -18298 -17610 -6798 -19282 -22601 -16662 -6086 1735 -5011 -16250
9840 -16250 -11968 -9779 3558 18166 12859 5669 7216 2778 -8597 -16068 -22877 -21780 -20673 -30024
9826 -30024 -23438 -20658 -11043 -3441 1805 -448 -1229 -4723 -6081 7187 3787 349 -1509 8592
9812 8592 20391 13644 5491 -503 6387 5248 2895 -4562 -10959 -19272 -37470 -35092 -27301 -21821
9798 -21821 -14974 -7965 -515 859 408 -104 -9898 -13556 -11128 -14916 -16272 -3180 -10958 -19261 -17054
9783 -17054 -10145 2991 10177 5653 -18651 -19339 -15321 -40139 -45360 -21052 14185 18948 14019 18740
9769 18740 -1825 -13416 -18771 -6147 1882 -9143 -6631 -7056 -144 -4507 -13221 -3313 -3847 4582
9755 4582 10219 2840 1238 68 -5983 -5442 -3926 -11474 -22289 -19727 -8008 5357 5052 18758
9741 18758 18545 7395 -3311 -3319 -2374 3717 -9131 -13434 -21554 -26343 -22334 -11599 -7045 -18609 -6139
9726 -6139 13906 6389 -2059 1423 123 -11308 -16629 -13616 -8201 -6128 -11838 -7693 -8114 4090
9712 4090 12337 11172 -7010 -11826 2139 1171 8485 2140 12343 27427 14534 4683 4578 8417
9698 8417 12840 5792 -1890 3647 15867 26734 34781 29146 19305 14510 11201 5600 -7372 -5850
9684 -5850 -441 9711 9636 3394 6260 13896 14896 9925 -9661 -10612 682 15745 18168 9633 14386
9669 14386 1892 7986 23825 21198 -7765 -14985 383 15013 10223 132 2172 4125 -9834
9656 -9834 -19538 -15208 -6064 -2186 715 21869 30508 29865 32094 27998 7940 -1042 4112 6871 1113
9641 1113 7746 6929 4847 3460 -25 19738 21892 11160 -1817 -8983 -8635 -85 -7176 3618
9627 3618 20491 30009 32230 20572 2877 2358 3959 -4888 -4598 6018 6505 6151 16779 25147 22570
9612 22570 10012 12404 13856 4149 2737 3411 8947 15761 14131 17206 19150 21674 15493 26613
9598 26613 29187 30691 19201 13343 25119 36021 44276 46604 33240 29283 18377 10494 13067
9585 13067 15354 13342 9714 21930 30764 34492 29743 35987 36711 46897 48842 37290 30900 31031
9571 31031 39411 44840 38811 47707 46995 59349 58668 55454 52347 34089 40180 42046 36204 40121 49294
9556 49294 34230 29308 24044 34774 52255 49018 64007 61583 43585 47541 48253 40477 38181 37820
9542 37820 38023 47309 44415 50562 54683 49085 48098 55977 59432 61749 63145 51122 55557 70300 69509
9527 69509 68651 68539 68013 53745 48681 50123 54232 63774 67683 77055 62259 60650 55054 42401 35962
9512 35962 49523 58222 50546 47784 67079 71368 60679 68766 75262 69726 72763 80326 80197 79401
9498 79401 78136 83103 77678 73009 71552 84188 105165 84775 63676 74299 95635 104504 101099
9485 101099 101480 108824 119626 127967 129666 125200 120801 127581 125008 117341 122666 129609 141498 151091
9471 151091 144452 132806 138325 145548 156647 158325 164780 166399 161424 172363 185232 186841 185272
9458 185272 174969 175513 185999 193167 198247 213788 217056 220774 224599 227185 226624 220287 231563 244952
9444 244952 263087 283285 277189 277572 271474 266002 268973 280536 293736 306299 334255 342601 339165
9431 339165 350048 371371 398843 411128 424299 429768 443630 466482 481389 491165 511110 519783
9419 519783 517485 532911 557868 586891 623384 656477 668073 680992 702778 726407 751068 780923
9407 780923 810593 847878 898051 933529 971408 1020119 1080129 1133477 1173995 1201232 1226618 1268321
9395 1268321 1311250 1360699 1416109 1465400 1507829 1555936 1609761 1665649 1708261 1745656 1789268
9384 1789268 1827208 1884016 1934445 1971524 1994702 2025732 2049455 2055553 2069703 2064259 2062582 2068721
9372 2068721 2063783 2037600 2003921 1961639 1922328 1887451 1852104 1809584 1759045 1710252 1675328 1616612
9360 1616612 1568577 1517384 1458660 1404017 1362936 1309377 1263687 1208303 1178922 1146787 1092273
9349 1092273 1040147 990425 952244 915058 881440 848496 833239 808301 768714 729398 696662
9338 696662 676338 672524 645504 611197 588466 560041 538973 524794 510451 505381 496168 480819
9326 480819 458988 450878 449229 437350 398904 384624 384812 373148 352066 338920 322128 321442 322475
9313 322475 323786 303213 294902 294833 285816 282567 270475 266011 274042 263372 243505 222658 206030
9300 206030 209360 204118 194043 196175 205668 195245 175580 173484 179921 181247 173177 151415 138301
9287 138301 123046 125639 131469 140205 139634 131888 125159 121088 121852 115703 122735 128826 128769 121282 112984
9272 112984 115034 110601 114845 107504 107795 93896 83930 95542 88422 84635 86171 94662 106240 102975
9258 102975 103680 92191 86216 84574 87431 86375 76321 57674 49776 71813 78159 76507 69768 74298
9244 74298 71490 77399 54290 38935 51180 59380 45095 35359 38548 45997 31135 37899 56171
9231 56171 53063 53873 55286 46254 49160 53702 47050 43257 38997 31116 41277 40944 39066 37043 44565
9216 44565 62702 54629 32633 34008 35917 40620 35614 35422 40216 55217 51580 43478 44172 50621
9202 50621 46872 53103 57308 57789 44386 24557 11615 17688 22293 8813 1065 5729 4753 8472
9188 8472 6952 13094 7844 18498 13461 9644 24740 23876 6217 7930 17383 18958 16840 13600
9174 13600 26901 21442 27585 35781 39274 30520 36197 31864 25588 28710 33872 40998 39258 28929
9160 28929 28457 29883 14810 1602 770 11027 20435 20592 15169 24714 19030 13415 9157 4409 12875
9145 12875 27469 30361 28105 17726 23378 25350 24985 27532 28955 25293 28282 23556 35277 46873
9131 46873 50184 35091 27359 29674 18490 13911 24420 22497 15561 15238 8222 9135 21282 30331
9117 30331 31444 28873 29702 35460 21359 19305 10910 17774 19375 8505 5009 10180 20555 20098
9103 20098 20854 20261 19125 18586 13997 9205 32114 39465 32712 32518 30223 20770 15906 6260 182
9088 182 -2622 -7134 -1936 6796 -2725 -18139 -19365 -13293 1169 19890 16366 26230 24532 17084
9074 17084 15065 6753 1423 15425 13829 2170 -2958 -2900 -10778 -1516 12579 13537 5117 -6305
9060 -6305 -16838 -20035 -4114 8136 6754 -1008 821 15554 26676 17790 10107 14212 11202 2272
9046 2272 -4594 800 -3900 -9450 -10075 -49 -7673 4582 8796 640 5205 9419 10683 4324 2323
9031 2323 1982 -8543 1464 -5428 -19073 -4007 1998 -16609 -19684 -13685 -2094 7177 -3703
9018 -3703 -15142 -3940 2848 8834 14712 4150 -19412 -23055 -10614 6246 7290 -3696 -7083
9005 -7083 661 4753 -5747 3340 19827 15666 8453 -3444 6450 26539 34853 29229 7402 -4560
8991 -4560 -20336 -7639 -3632 -12727 -14823 -4436 11574 23663 38718 29352 12309 -3768 -7855
8978 -7855 2158 16375 18544 12800 4021 2579 -11050 -4645 -10096 -11270 2089 -5950 -16051 -21503
8964 -21503 -20238 -10635 -4817 9454 20114 11471 -393 -12119 -7227 -11006 -7523 -4715 -14186 -17734
8950 -17734 -849 27179 22954 22322 34279 22453 8720 2116 2656 543 13735 19911 20095 13998
8936 13998 86 355 11215 10703 9409 8874 17190 13393 -9924 -22364 -17138 -5243 -7420 -6588
8922 -6588 -15020 -13215 -10885 -22930 -16987 330 10562 3258 -5182 -14540 -11224 -10081 -12708 -10471
8908 -10471 -10490 8027 17928 14962 9792 7036 14912 30984 35750 33275 23209 20904 13217 1180
8894 1180 -14001 -13055 -11897 -10173 -3154 7280 7973 -7841 -10896 -9537 -10778 -4538 17368 16911 4240
8879 4240 5265 17727 19880 11754 18833 20853 31793 22229 14978 16475 22222 51107 85122 110990
8865 110990 147701 191344 251997 309742 335781 305472 228045 157193 113152 89240 78200 58678
8853 58678 43947 50413 43879 42370 35571 11420 6604 19811 27149 31568 44080 39763 37879 17076
8839 17076 11776 11046 31611 42632 26155 19973 12414 12728 12475 1439 12462 25750 36794 32296
8825 32296 28631 46119 53398 48365 58876 68219 75538 74393 98885 113477 131468 156977 174699
8812 174699 212104 280343 361346 500967 684592 899159 1109071 1235938 1224354 1052655
8802 1052655 797850 543403 348476 240986 172339 126380 106740 92511 86888 101860 118377
8791 118377 103131 86626 87354 96157 100286 107293 108641 94560 102536 109838 106150 101385 105087 100719
8777 100719 106976 109154 110149 131714 142621 165637 191364 217640 260203 336861 456051 621861
8765 621861 823801 1101201 1490378 1954738 2327413 2525930 2393829 1966372 1418698 933407
8755 933407 604378 408483 281947 220557 184337 153582 131233 121181 120676 118636 116247 124534
8743 124534 154218 168656 178324 180753 162127 152939 134213 109863 100420 94107 94045 97156 93699 110071
8729 110071 134820 147641 158972 175097 189391 208972 251048 288214 360756 477193 628783
8718 628783 816815 1027338 1181753 1229732 1139365 934146 661520 422112 274293 188305
8708 188305 140506 116169 107200 94530 89225 97032 100300 98061 97145 101333 118360 128716 130302
8695 130302 130200 128669 126863 126097 126516 113816 105600 112221 119290 126370 108829 87420 83414 90999
8681 90999 96573 93619 97413 101934 78923 57102 53594 63057 62344 60610 61695 58006 44198 30713
8667 30713 31208 33877 19333 24820 30500 32851 25597 29765 50384 53646 28699 26024 34686 35181
8653 35181 31862 25755 24241 28088 34898 31593 44209 56261 72785 86544 98733 93648 82733
8640 82733 76469 80171 68036 56452 63189 54666 39488 26627 41744 49564 45540 45343 48631 39131
8626 39131 38554 34769 39209 35233 31573 31364 33362 33716 28575 26029 25681 39824 48178 52284 31555
8611 31555 22156 30237 34727 39845 34979 24317 25696 33606 50286 38007 41170 60823 68164 81457
8597 81457 75844 79382 84663 74859 82042 88443 82706 88239 93819 97579 118741 138950 139799 158152
8583 158152 158328 159001 160227 160381 152395 142643 139599 122269 106107 94943 87699 80015 66369 60259
8569 60259 67578 55551 42925 44703 34490 30046 37848 46572 48247 37944 27757 20333 24361
8556 24361 32687 42824 57401 59971 68615 86981 81229 56192 33844 23366 18816 11229 19207
8543 19207 27601 25344 31853 30209 25101 14770 10244 -3383 -13374 1341 15078 21706 35245
8530 35245 22588 7074 -624 12953 27922 27101 24731 29925 44439 40451 38445 37403 31885 37924
8516 37924 61531 58051 46790 33621 33493 39273 52801 72864 100779 139387 163365 142725 95659
8503 95659 49032 29714 25415 22972 20385 23730 21321 3354 969 3023 -3264 1444 413 684
8489 684 5200 16581 13688 5954 2993 10168 17037 22514 28291 26500 31277 23753 9385 761 -1875
8474 -1875 159 8973 14824 9034 4464 8177 14450 13707 19370 30645 47703 66989 66009 50406
8460 50406 29378 23000 23293 22649 9017 -5764 -1459 -1231 -10893 -13662 -2590 9875 17337 16536
8446 16536 7088 -1346 -22110 -18993 -2745 5596 17878 22455 3933 -14687 -10826 -7134 -7360 -1684
8432 -1684 3670 6419 -4439 -15950 -18573 -9586 5417 182 -19496 -21866 -21120 -24437 -14043 -1534
8418 -1534 -5310 -9415 -15895 -13300 -1934 -4429 -14819 -11410 -15004 -26894 -21893 -15433 -17002 -12720
8404 -12720 -7081 2865 -6239 -9025 -6251 -11424 -17940 -3756 -1351 12875 14287 13750 13517 10147 22235
8389 22235 12477 -489 -8018 356 3956 13809 19215 4445 -9412 -20539 -28361 -23861 -28124 -25532
8375 -25532 -10583 -1321 -361 -6479 4313 16631 18144 24381 14407 7198 13284 14813 6264 1187
8361 1187 -1512 17383 21385 18839 11910 13408 19924 29257 23833 20123 14628 24395 21374 5153
8347 5153 155 -3110 -3776 9815 9435 3795 -12532 -14468 -18362 -8846 -2383 -7754 -4682 -5014 -7041
8332 -7041 -2467 -19710 -37874 -36340 -22920 -13862 -10698 -6207 -8984 -388 -5188 -5332 601 -1781
8318 -1781 4051 6124 10751 11931 14069 16155 2283 -3956 -13080 -16686 -19799 -27118 -33552 -32971 -22946
8303 -22946 -1539 7143 -1492 -3896 -7093 -16826 -10385 -10157 -8517 4173 14123 30016 11822 -9844
8289 -9844 -14464 -15758 -9955 -4594 -6188 -9946 -10674 -590 -521 -17998 -23377 -10681 -1673 4546 4842
8274 4842 9890 8974 14592 -2616 -4380 2369 5117 5479 -9946 -17964 -14473 -9710 -7121 -3679 -913
8259 -913 9787 6326 2780 9374 10270 585 4750 3655 5385 11414 11096 11529 11845 5840 -8815 -6051
8243 -6051 -5919 2182 -16935 -30603 -33505 -18950 -5805 -6583 -557 -8005 -8584 -9980 -6537 -973 10586
8228 10586 -5208 -14574 -16025 -8322 7607 5146 1569 -140 -13543 -24360 -11640 -19147 -20182
8215 -20182 -10130 -20385 -24522 -28791 -16613 -5399 -17699 -24483 -19714 -7629 -947 -9680 -17002
8202 -17002 -13280 -12832 -16353 -6089 -5182 -4299 325 -3673 -4642 -11486 -5842 14735 18576 12582 2765
8187 2765 10032 18108 6547 -4963 -8506 -8530 -10479 -18425 -15541 -11026 -11638 -13175 -5979 -9442 -20581
8172 -20581 -22014 -20598 -11049 -3101 3314 11155 3703 -1430 -17769 -17126 -9714 -7161 -9442 -3809 11182
8157 11182 20487 17141 11050 -2835 -1477 10901 21404 17495 12059 15176 11936 9973 -7049 -7118
8143 -7118 -12048 -7311 -842 17320 15999 10112 17758 14113 -10241 -21916 -30739 -32266 -8294 -1753
8129 -1753 6362 8992 4126 5061 6836 2667 4386 -1120 -8652 -8514 -25593 -30536 -22564 312 -2557
8114 -2557 5498 9724 -8203 -16681 6287 17326 6389 -4140 -13952 -18805 -28347 -10524 -1931
8101 -1931 -12676 -23268 -16098 -6495 -18656 -23124 -9749 -5794 -6775 12277 10592 3773 -3067 -10727
8087 -10727 -21160 -25317 -16031 -8827 -26503 -20768 -6504 -2293 7167 21011 34555 16202 3323
8074 3323 -7963 -22881 -16702 -18990 -34633 -42249 -25307 -6023 -9919 -17592 -14532 -203 9942
8061 9942 12092 -4599 -20857 -28292 -15599 -19201 -18198 -12040 6577 12191 3952 -6607 -15080 -11183
8047 -11183 1000 2171 -9635 -9951 3061 1112 926 13490 9990 1073 11222 18628 16787 10221
8033 10221 -871 10668 12872 9874 -5685 -10315 -3398 12967 7960 6984 19447 21656 18906 10410
8019 10410 13679 5694 -5490 -6073 5276 -608 -2956 4274 -1286 -9855 -21368 -20092 -5203 5692
8005 5692 12542 3605 2941 7806 151 11259 37069 46246 35487 33240 32012 39104 35606 32869
7991 32869 23032 19768 25712 31862 33486 34450 24675 11200 18498 25974 30625 19390 21154 20774 21760
7976 21760 24974 9904 3485 5890 923 293 3326 9807 8270 8153 17678 16202 22241 34083 26682
7961 26682 14543 8684 9918 2529 708 5121 36069 48559 38641 25221 29066 48323 52678
7948 52678 44679 50678 54489 57195 50325 46466 52806 44162 38687 36005 25243 21541 16237 20507
7934 20507 19757 27367 27660 29603 18242 5096 -4623 -5453 -5289 -682 -7190 -3427 478 5544 8586
7919 8586 1710 7765 10055 558 -8584 1381 20747 28682 22648 5459 2939 6935 11386 22327
7905 22327 4297 -2050 5979 6149 1766 8045 27110 42172 29294 19050 18734 27810 42776 37509
7891 37509 28960 26254 12946 10589 26257 30627 17004 3620 235 7202 21302 23277 22295 14292
7877 14292 1440 10342 20677 19349 21435 1919 -11466 4064 6211 758 -13820 10931 9340
7864 9340 -11074 -8215 -5746 -2240 1206 -7613 -16578 -28135 -30482 -24160 -24625 -11771 -10954 -3103 6496
7849 6496 12139 8075 -1760 -6939 -4271 6693 11665 6850 4455 14459 24558 20398 15206 4406
7835 4406 1255 -16423 -17176 -17921 -22477 -23307 -16680 -8212 -10549 -13812 -7287 -1943 5694 9247 3853
7820 3853 -18131 -23496 -18124 -21955 -5216 9805 3428 -7336 -9390 -14929 -15256 1970 20124 18903
7806 18903 16931 17744 17049 20738 24449 18637 569 8417 16637 12300 16578 13895 2808 -7559
7792 -7559 -13692 -12307 -3507 1660 10106 5081 8788 5337 17637 25377 6603 -12948 -15551 -13202
7778 -13202 6007 16468 11942 -4598 -5633 -7928 -3012 6430 4843 3690 -6486 -17307 -17897 -211
7764 -211 16411 11080 8977 4278 -6030 -4280 13704 3972 -8822 -6233 -771 -5671 -9397 -3655
7750 -3655 -9001 -9665 7122 632 2059 -9343 -12995 -6372 -4399 4705 1411 8298 -1370 -11515
7736 -11515 -9878 -24582 -18113 -14427 -6631 -4675 -2438 5198 6196 -2685 -18024 -17749 -3332 347
7722 347 4757 7664 -2695 -2035 -3500 -5682 -838 -14701 -26578 -22660 -15865 -15433 -12044 -515 -6946
7707 -6946 -22528 -33014 -5403 -421 -10814 -19832 -14348 -15972 -5933 1300 531 1310 11184 23000
7693 23000 15049 -7350 -11322 -7187 -5311 23044 31066 13478 -5617 -14560 -13554 -13473 -11468 -402
7679 -402 186 5347 11399 -906 -4998 10525 11901 13277 11284 -4097 -6017 1957 -157 -4782 -4895
7664 -4895 -6135 5309 2266 -5111 -6682 -5542 -3734 7618 4721 -11260 -11005 -16215 -14196 -19541
7650 -19541 -23361 -28684 -30270 -16499 -11902 -16310 -15396 -11921 -12200 -14777 -29706 -18840 -8965 -8886 -16058
7635 -16058 -6772 -5186 -15217 -22646 -30704 -16174 -14050 -7756 -18386 -12367 -6914 -9242 -9419 -15433
7621 -15433 -19867 -29031 -28828 -22381 -30950 -30889 -21183 -9914 -6075 -11301 -14014 -13161 -1957 -8328 -8975
7606 -8975 -10673 -6373 -3274 -7574 4301 4789 14023 17568 20286 -1224 -21658 -10817 1432 -5338
7592 -5338 -15803 -16607 -6543 -10181 -13655 -20581 -17230 -20612 6021 15856 6904 -9388 -1780 -3599
7578 -3599 -4368 -1668 2359 9209 8391 2153 -2591 7959 17259 7127 -7321 -7040 -15971 -22609 -28404
7563 -28404 -22156 -24523 -28982 -13423 -15065 -10538 -14699 -19323 -6322 5220 5173 -2351 -11241 -12776
7549 -12776 -8276 4046 10391 21984 18867 4974 -2432 -411 -4937 -7518 -19527 -19248 -5932 -3327
7535 -3327 -16338 -16168 -9104 -7625 -11258 -18132 -21688 -19201 -13313 -11768 -20433 -31327 -20009 -8341
7521 -8341 -11383 -16275 -9961 -2919 4302 3510 3307 2755 -11140 -2727 12491 2344 -3124 -11457 -17301
7506 -17301 -21299 -24885 -28573 -24233 -16677 -14289 -28653 -25241 -20031 -26444 -4764 7545 12450 7877
7492 7877 -3425 -378 -4386 -28141 -31783 -18329 -6580 15 143 -2847 3019 6428 3464 4258
7478 4258 10293 9255 11909 2921 12337 16600 638 -8984 -6816 5634 13887 2304 5838 1352
7464 1352 9011 9181 -8 -12565 -16833 -3148 5750 -306 2693 -7037 -21660 -13890 -9389 -29961
7450 -29961 -24887 -16436 -12037 -13306 -27721 -19187 -3700 -6572 -14120 -16461 -10405 -1547 -7895 -15260
7436 -15260 -6296 625 2035 6539 8090 7039 8138 -4680 -17046 -18999 -24013 -18289 -6556 -4570
7422 -4570 149 2304 3612 -3270 -8217 -15973 -23233 -15648 -8531 -5612 -2287 -704 -11669 -6872 -9079
7407 -9079 -18311 -21499 -9498 -10320 -4649 -1425 -12517 -18948 -18893 -19658 -18169 -4359 15153 8628 -6915
7392 -6915 -2108 5324 1376 10403 9134 1613 6776 -3565 -20222 -15595 -4878 -5980 421 12435
7378 12435 9343 -1740 383 -8534 -14187 -7856 -7436 -2287 5316 8852 -1241 -10515 -14110 -9809
7364 -9809 -10410 -2979 1666 -6757 -600 -1536 3725 14344 13390 8065 -6360 -15823 -13916 -5966 -2102
7349 -2102 7193 15564 20189 3303 -8927 -15790 -11313 -15753 -3054 -4699 -8078 -15094 -15938 -16085 -23112
7334 -23112 -20229 -10653 -9110 -5777 -11421 -26243 -26861 -19320 -4619 -14605 -20849 -7020 12788 13000
7320 13000 15416 -6820 -8359 -8616 -5145 -13545 -13798 -11661 -642 145 -10916 -6882 -10735 -25289
7306 -25289 -12648 5773 1430 -5023 4701 1556 -14264 -21955 -951 4559 2229 4880 5531 15537
7292 15537 29289 23411 8846 2430 224 -16915 -14262 -4244 -5598 -3206 -19491 -21296 -14779
7279 -14779 -3483 15614 33929 51187 66615 79087 79511 62675 25832 7709 -8114 -14354
7267 -14354 -10457 -15136 -29398 -36357 -26833 -23831 -27519 -11262 3186 7564 5408 2088 -5798 -22760
7253 -22760 -19830 -17671 -9486 -6989 -4614 -21533 -26176 -21072 -12870 -577 5362 -2172 -1097 -5284
7239 -5284 -12308 -13336 -10518 -8553 4194 24179 18868 11490 -27 -10996 -13691 -15474 -16377 -11122
7225 -11122 -23189 -26903 -19206 -7305 -10260 -2424 -272 -3832 275 -4667 -8379 -5313 -509 -9302
7211 -9302 -10169 4026 14212 16643 9394 7691 2251 -7702 -2151 -5581 -16990 -8235 -10131 -1633
7197 -1633 -1455 -5368 3029 9712 9687 10738 10534 10543 12260 13998 1977 -3146 -645 4170 2511 -3227
7181 -3227 -16292 3018 -88 -10549 -14063 -13677 -6341 -5065 -2217 406 -4436 -10261 -5327 -7535
7167 -7535 -16215 -293 -673 -1205 10088 12382 8585 6576 -2104 710 -7937 -7714 6384 7200 5348
7152 5348 3344 205 -3838 -11997 -26598 -15008 -8170 -17789 -28366 -25024 -14012 -4981 -6065 -10990
7138 -10990 630 12542 657 2164 8545 -3674 -16068 -15595 -16965 -38089 -33378 -14874 -12737
7125 -12737 -12456 -13242 -8815 7902 18449 11525 17035 7858 15400 19180 4016 -5660 -10827 3613
7111 3613 6206 -6959 -13423 -131 1067 11217 824 -13870 -12523 -10393 -8395 -2883 -4049 -9497
7097 -9497 -12608 -12239 -6942 -13396 -19920 -18072 -10027 -7041 -9674 -21045 -20135 -6328 -19282 -23532 -24813
7082 -24813 -11175 -11513 -21712 -29204 -27915 -28679 -24891 -17025 -25644 -23376 -13647 -10818 -10628 -8628 4828
7067 4828 18207 8530 6162 -1832 -5854 8276 8588 14107 11936 5119 -3992 -9767 -8888 -1009 -4481
7052 -4481 -11323 1146 3825 -10483 -14352 -8558 -11084 -8105 -1945 3810 12904 -2930 -18416 -20153
7038 -20153 -15158 -22170 -31155 -17836 -8638 -5246 -960 2204 2041 6566 1365 -7702 -10365 -6586 14090
7023 14090 13576 7093 -9568 -9272 4399 16770 26832 23552 15257 14068 13461 1520 4786 6516
7009 6516 9605 -2347 -20461 -27918 -24141 -14227 -10404 -22576 -11378 1321 677 -104 2015 -3894
6995 -3894 -7139 918 -2702 -13319 -12710 -7752 -504 9672 4389 -1595 -4920 290 1593 200 -5673
6980 -5673 -7321 -16177 -19590 -11439 9848 17699 14048 21215 6053 -10486 -9829 -15210 -17863 -9848
6966 -9848 -9937 -19045 -20065 -12889 -13308 -12161 -1522 -761 -1751 -9604 -14212 -12954 -15443 -14344 -29719 -33733
6950 -33733 -23929 -11419 1508 10506 21716 21965 16393 699 -2214 -3537 -22328 -17754 -16075 -9738
6936 -9738 -673 5675 9624 26550 33856 7958 -3250 -12007 -11371 -4039 13883 16736 9342 6967
6922 6967 2082 9820 11956 5797 9799 -389 -11397 -14961 -22429 -18535 -13942 -4455 -2141 5777
6908 5777 14284 7387 7694 9227 8887 10327 9343 2630 -836 -1377 6255 16483 7673 4455 -3688 -17041
6892 -17041 -13772 -9410 -11665 -9343 -8280 -9647 3577 6760 16799 16434 13015 8832 13349 10994
6878 10994 7324 6357 -5477 7708 16573 11293 -2431 -17680 -8762 -1583 -11127 -20877 -27713 -13510
6864 -13510 -7151 -616 -10796 -3590 3977 9159 7791 8221 5567 -4321 -8987 -8747 -16160 -2553 15053
6849 15053 26234 27426 22293 10519 6679 8978 14280 3472 -1191 15021 20863 23085 25103 7683
6835 7683 7248 10221 4237 -3119 -14772 -16582 -5729 7104 4820 -1452 3768 -608 -10865 -10506
6821 -10506 5359 -2213 -13953 -25437 -22001 -17834 -18252 4396 14478 -186 -15640 -6865 4860
6808 4860 13889 16407 13378 15437 13177 -991 -704 4453 -1841 870 -3327 -5331 -9211 -25610 -29049
6793 -29049 -21227 -9691 -2705 -14528 -10899 -822 -10893 -32329 -34860 -36046 -18531 -3292 7839
6780 7839 14379 9951 12717 202 -7203 -11244 -8033 156 2342 1756 -9435 -7561 11223 7477
6766 7477 9636 17081 4910 636 -7553 -6590 -13707 -18521 -8457 15810 24009 13473 10753 13315
6752 13315 22269 22603 22590 24822 21909 19829 19878 13338 8989 20443 18826 762 -3573 14986 27652
6737 27652 13159 2749 9090 13629 13417 25487 36826 38365 43932 43536 42122 46666 66088 79363
6723 79363 72758 68878 73147 88576 121859 163315 202345 243327 284719 310062 258149 164788
6711 164788 108661 73852 46315 20327 19974 17372 14212 23326 25947 22860 12893 6969 1163 3379
6697 3379 1403 12152 13102 19044 14225 -226 -9197 -4275 -8249 -5655 13599 24362 8217 -19671
6683 -19671 -28144 -14681 264 8458 27825 15274 14158 4636 1560 2135 1128 11377 1554 -9014
6669 -9014 -14381 -12750 -12370 -8787 -372 -9109 -14437 -15573 -3170 6173 22232 18000 2489 -486
6655 -486 -7543 -11184 6401 11211 2193 -4328 -1108 11888 9979 9924 10061 3321 6831 -8693 -28322
6640 -28322 -19461 -1292 11654 16654 4274 -14044 -10564 -13345 -13363 -6764 2618 165 -4652 1316
6626 1316 241 -16044 -9321 35 -3977 -6667 -8225 -2193 3345 12529 5744 -1159 -8664 -8486 -10608
6611 -10608 -8442 -3428 9961 4336 3088 4047 5136 461 3054 2198 -10751 -20203 -21804 -18653 -11108
6596 -11108 -8269 1434 -5969 -5817 -119 -9550 -17922 -22360 -10857 -6890 -11476 -23476 -32907 -28042
6582 -28042 -23465 -18666 -28615 -18563 -4260 -1902 -17226 -18607 -20591 -17090 -11810 -13368 -6656 -11522
6568 -11522 -17020 -19460 -20504 -12188 12874 12363 -2338 -22211 -25597 -11686 -7627 1786 9571 3696
6554 3696 6165 3358 8807 11343 14744 8039 -8052 -11735 -12147 -10517 -17018 -16335 -21064 -12137 92
6539 92 20832 26331 7538 -152 6265 13032 3187 -8858 -17269 -12424 6226 14484 8971 3807
6525 3807 -11871 -22747 -13296 -13271 -11834 -3628 -11513 -7332 8474 14973 14218 9099 808 -1242 -480
6510 -480 -1424 -24349 -40765 -28571 -17388 987 9191 1033 -13485 -11249 -1380 5820 -5779 -12096
6496 -12096 2917 8499 -8852 -19658 -7451 -3976 -565 2686 3084 4436 -9284 -14972 3244
6483 3244 17624 8890 -8696 -14865 -8837 2220 18640 8858 -6916 -8098 -5458 -22398 -18903
6470 -18903 -14908 -20527 -5108 8174 5349 -4947 -9081 4015 10693 23864 8742 -3560 -14296
6457 -14296 -24791 -16562 -4193 446 5760 6589 -2371 -8425 -11071 -16955 -23964 -37396 -31772 -13428
6443 -13428 9846 6441 -6663 -8778 -16490 -12508 -15314 -11274 -11826 -11967 -4091 -9320 -17051 -9498 7064
6428 7064 -6997 -19409 -12624 -17954 -12505 -20462 -20130 -8766 10369 15843 15683 7484 702 3745
6414 3745 6774 1799 -9220 -15490 -18750 273 13795 12936 13593 3328 5400 14224 5691 -12287
6400 -12287 -6102 2592 9878 18076 14105 9998 8394 6450 2011 -2654 -10651 -21472 -10616 741
6386 741 5857 -508 10302 2214 3089 4555 -23764 -24870 -29345 -27863 -7360 3751 4471 11390 5732
6371 5732 -3180 4592 -2469 -14135 -4833 14687 -1412 -17165 -9119 3613 1961 -6290 4091
6358 4091 18557 13354 11696 9074 -320 6797 -2845 -12482 -11776 -13190 -24320 -11550 11978 3485
6344 3485 -9734 -20736 -4198 14446 14820 4061 4212 12926 3331 -2649 -2299 4946 7619 5296
6330 5296 1775 -8219 -2552 -11477 -15829 -1410 3847 6732 4457 -9590 -6700 7301 15232 14348
6316 14348 -4328 -7732 -10436 -15516 -5493 -4052 -12664 -16782 -22947 -8880 8277 12177 1660
6303 1660 5627 2775 -10327 -16235 -21755 -27399 -21682 -10457 -7093 -9284 2664 -2103 -1420 -2798
6289 -2798 -27842 -31402 -14621 2937 16426 11501 3789 -5163 -8122 -8161 2401 755 -5008 -8276
6275 -8276 -5029 5726 -3538 -570 -1809 -5550 -6178 -388 12846 22400 23492 14339 -4717 -5966
6261 -5966 -10032 10496 24266 18660 13301 6974 634 -1630 -11759 -8911 -11354 -10931 714 -7412
6247 -7412 -8627 -4397 -10101 -22021 -23166 -19461 -16333 465 26448 25755 11565 3273 -2922 -260
6233 -260 -4079 1281 8427 214 -12482 -11336 -9520 -9351 -10814 -16719 -3019 -8820 -13259 -1887 9805
6218 9805 6228 -7013 -6267 9003 10692 3589 -18757 -26727 -5200 5745 -2033 -3007 -894 -6736
6204 -6736 -13921 -22768 -7361 5830 2900 4684 11539 10144 -4211 -9023 -2160 -916 382 3138
6190 3138 12434 -4470 -20270 -8907 11869 3099 -11341 -8180 -12612 -21258 -20134 -19103 -8115
6177 -8115 -6722 -23503 -22702 2321 8675 15350 22704 12423 -3636 -1758 8718 10593 4607 7912
6163 7912 6697 11456 2422 -11281 -15730 -7478 -17183 -29583 -29850 -24722 -30349 -18883 -11258 -14367
6149 -14367 -19546 -16829 -12473 -51 2347 -16879 -26883 -24644 -22645 -21807 -14080 -1854 -12760 -5934
6135 -5934 8120 2114 -452 -8498 -4630 4510 16584 13029 -3159 -11719 -11873 -12950 -6508 198
6121 198 856 -8127 -2593 -1271 -10446 -5837 798 -10 4747 5899 1170 -4040 -12481 -7461 -16135 -10546
6105 -10546 4274 7829 13828 5420 -5402 -3050 12671 21848 17052 19847 11565 -10654 -33870
6092 -33870 -31150 -746 3728 5112 5512 -6489 -6172 907 909 -11833 -12402 1316 522 9285 7457
6077 7457 -1180 -4200 -9556 -20212 -30006 -15966 -3718 -8368 4504 6605 7107 3727 -9736 -14251
6063 -14251 -4401 6017 230 -9665 -18038 -10509 -903 -10359 -20048 -13593 5642 10567 8976 5245
6049 5245 -507 -12521 -13527 -14833 -12740 -4696 -2411 -15994 -33088 -31759 -26065 -6107 -9958 -20901
6035 -20901 -17512 -21194 -24211 -20299 -6426 10329 20443 21753 6550 -800 12651 23316 18361
6022 18361 2283 -5495 -193 -8208 -10559 -5838 -3375 9209 25910 20254 10458 3075 -6098 4799
6008 4799 10050 7440 -6269 -7909 -8418 -17795 -21227 -7851 7379 -3547 -14176 -13768 -4803 8181
5994 8181 14532 10573 8476 1257 -3904 401 2179 11484 10366 -9009 -15329 -8560 -3017 740 3652
5979 3652 16412 7809 -2238 -6474 -11140 338 804 4593 8734 3529 10698 25108 33455 33611
5965 33611 15620 8906 15469 23185 28861 17806 2224 943 -3593 -1287 -2615 -9381 -2410 5307
5951 5307 4787 75 -5789 -7151 -4489 -1636 2217 5852 9814 7910 -10460 -7605 -4222 -17145 -14926
5936 -14926 -3736 1676 -6855 -2748 3658 -9302 -16744 -11628 -906 -5827 -2225 -4804 3116 3181
5922 3181 16761 19646 9328 21317 17341 4262 -1998 -14784 -7917 6698 13163 21138 10566
5909 10566 8186 7939 13325 21804 11811 2817 10143 26884 15373 10225 10512 127 -8819 -16278
5895 -16278 -10865 -8866 -8653 4859 9301 -1925 -18930 -22402 -16346 -10919 -9608 -2454 3524 -5346
5881 -5346 -8653 -6029 5757 11 -10388 -8787 -6902 -6866 -19246 -15170 -8452 -7942 -14833 -11401 -1662
5866 -1662 12174 -2743 -17692 -7833 6309 -4725 -11356 -12745 -5224 -1601 -7419 -12745 -17908 -18000
5852 -18000 -14842 -23403 -17149 -8310 -10610 -2167 -5054 -11737 -4890 8751 17598 22368 22299 32640 25993
5837 25993 20299 18490 9785 5192 10591 695 4769 -7858 -6098 -4340 -15152 -27149 -30316 -31126
5823 -31126 -15624 -4965 -3382 6838 17923 15598 1175 4741 1270 3025 -348 -642 -5839 -10976
5809 -10976 -12131 -5953 -2966 -8294 131 14329 14727 9871 7098 -1231 -5808 4863 8727 7134
5795 7134 -12670 -23759 -20455 -27505 -35812 -27582 -10144 -17808 -14355 -13836 317 4570 12062 17193
5781 17193 22612 19657 15349 3196 1214 -5538 -14119 -21423 -24550 -14529 -8285 -6983 -1732 6968
5767 6968 3059 -621 -1812 2236 -9617 -23592 -6398 7526 18049 7330 -7798 -11040 -16511
5754 -16511 -18373 -14848 -14700 -25780 -22674 -12608 -4679 -6929 -19553 -25275 -13689 1596 1495 971
5740 971 296 -12039 -8366 -10304 -16703 -21441 -23234 -16295 -11846 -10170 8289 7553 -8118 -4089 -7599
5725 -7599 -18238 -14451 -6548 -7885 -8013 -4103 -326 13684 11180 4906 16652 17843 22377 17457
5711 17457 10526 11360 16097 2132 -1446 12001 13366 -9379 -26347 -26173 -15096 -7980 766 -10065
5697 -10065 -13707 -7230 -898 634 -3312 -9852 -16316 -27281 -28017 -17899 -1956 -6521 -9534 -5542
5683 -5542 691 5508 14845 4192 -5219 -1447 -21402 -18454 -12995 -16441 -14784 9884 20239 8946
5669 8946 6223 -4261 -5522 5180 657 -629 -6211 -12194 -18354 -28948 -9846 1044 4563 1118
5655 1118 1461 13259 11322 9823 2966 -9362 -11977 -3621 10733 17430 14635 -3158 -935 9504
5641 9504 3407 -5938 -7874 3302 16155 30875 29156 13309 10491 11551 5517 1837 -6044 -7318
5627 -7318 -17028 -8051 9249 14941 6075 7890 11096 7041 10983 15384 7334 -12649 -17995 -7333
5613 -7333 -16022 -20693 -12080 -4670 -5142 -11685 -12923 -17247 -20498 -17261 -5335 -2963 177 6600 13955
5598 13955 11531 1286 -4017 -8090 -3784 820 5297 15103 20110 18018 13210 5114 4677 8412 3432
5583 3432 2512 -2435 2388 3516 -336 -11054 -8400 -955 -3605 -2406 -5730 -15561 -19464 -4533 13633
5568 13633 12769 11343 -6694 -2828 6634 1467 -870 2995 5191 7482 8637 12005 1214 1060 4986
5553 4986 5803 -5971 -18005 -3558 22403 22484 12907 13289 11159 1906 -5817 -3648 1484 3600 5422
5538 5422 -11756 -17643 -10170 -16923 -19178 5711 22494 18803 17240 13910 15349 14142 3152 -3834
5524 -3834 -2173 8910 19868 17096 -271 -5665 -13435 -22738 -21449 -19653 -7375 -1266 -5412 -2421
5510 -2421 14811 15962 4503 235 7253 19478 32098 21290 10275 15262 19680 17508 16160
5497 16160 13131 -952 -9115 578 2286 -1342 -6374 -2388 -12746 -8763 -3224 -2403 -5651 -14040
5483 -14040 -13205 -13990 -16497 -14159 -5777 -11796 -14642 -13559 -25536 -20668 -15579 -14809 -6904 -16861 -19492
5468 -19492 -7247 1983 8826 -11393 -20811 -13977 -19472 -14149 -8712 -10859 -6999 -11823 -8546 -4176
5454 -4176 -6268 -11576 -14907 -2716 17889 20852 -2333 126 5253 17031 17763 24665 17588 18654
5440 18654 -1360 -7731 1046 -3795 3344 11537 9548 7899 9465 5053 4219 7128 11381 7811 -2554
5425 -2554 4381 2853 -2427 -12881 -15512 -13002 -7587 -4111 925 -10704 -13018 -1524 -6544 -11193
5411 -11193 -13683 -14812 -21971 -19378 -15737 -21051 -25098 -12465 -15782 -2131 -3065 -14104 -18183 -16108
5397 -16108 -11908 -11067 -4823 -12874 -20941 -20475 -22137 -14189 -11689 -10198 1836 -9567 -12882 -19231 -23468
5382 -23468 -34366 -28214 -17513 -2723 6591 2983 -2761 2060 -3700 -14040 -1147 -931 14995
5369 14995 19131 16467 11875 9551 3972 -1987 1963 -2469 -8719 -7357 539 -10392 6362 27647
5355 27647 28369 13776 12074 8106 1983 10231 3369 -11488 -4482 12275 13544 12886 7457 6415
5341 6415 2996 298 9470 19837 21178 13692 7005 5432 10485 18245 25476 16349 11272 20638 27123
5326 27123 766 -14731 -15938 -4170 9990 19328 19997 10996 5335 -5385 -7990 10473 13813
5313 13813 -556 -5675 -6202 13866 4891 251 -2051 4392 12906 8433 23536 22837 10994 4445
5299 4445 9310 23911 27436 10349 1072 -13498 -14504 -3989 -6750 -10892 -3483 -1108 6752 16111
5285 16111 11404 16730 11961 6383 -3618 -3356 -9247 -11159 -2811 -1708 2196 16798 22202 19320
5271 19320 4836 4679 18583 14403 15949 9765 116 971 270 16505 23939 18086 -1511 -17291
5257 -17291 -21624 -8279 -2840 4223 11591 4516 -15697 -18093 -11968 -7815 -10069 -9116 -5792 -6288 -7759
5242 -7759 558 10912 19865 20991 19407 16000 -259 -16465 -10235 -8811 -14306 -11025 -342 1833
5228 1833 7041 11129 11373 1772 -8188 -13527 -9964 -3952 11694 6836 10170 12771 17009 8305 -12786
5213 -12786 -20376 -7421 1814 6889 -2178 -11438 -2021 -6956 -18974 -7668 -10400 -16239 -13481 -13915
5199 -13915 -17011 -13950 -24480 -21890 -10088 -2291 -12203 -12175 -12344 -25430 -29636 -30948 -25229 -18303 -20976
5184 -20976 -17920 -10010 -3009 2838 -4833 -14929 -27422 -21313 -16893 -8028 -8949 8529 14600 -7125
5170 -7125 -11971 -15541 -15409 -12996 -12145 -4937 -1914 -10596 -13143 -17179 -13918 -5457 3593 3866 727 -6348
5154 -6348 12630 5884 -7632 -1453 2259 -8049 -23318 -17445 -15408 -22562 -27360 -23241 -20336 -22472
5140 -22472 4793 26707 9550 2996 2267 -17317 -9441 -14764 -25843 -14796 -2617 -11344 -4119
5127 -4119 2208 -847 5896 2022 6695 13037 -480 -7063 -21568 -23115 -22312 -11265 -8632 3659
5113 3659 16855 18874 9514 12153 15902 7908 14876 590 -16106 -9393 11674 17752 21314 24156
5099 24156 21362 9631 10671 22510 13030 4461 4103 17983 18664 14613 -1864 6560 7036 13434
5085 13434 31129 34269 24889 20893 15562 7957 5597 -1217 -13691 -7207 6383 3261 425 7272
5071 7272 15076 20055 4407 -18036 -21202 -20949 3893 14158 -7 -15398 -19105 -11239 -10445 -4228
5057 -4228 5697 9765 -5420 -5491 1726 7716 7149 597 5519 14897 8984 -11986 -14870 -22275 -12551
5042 -12551 -10828 110 2465 -2595 -2340 -1945 -9782 -11029 -7970 -9761 -14964 -8527 4504 2040 -463
5027 -463 -5576 -536 2616 10866 8652 14165 13319 5101 -14580 -15592 -17791 -3953 -493 3125 -3047
5012 -3047 -6652 -7588 -13715 -11616 -17406 1467 21309 26785 16268 9530 3721 -9907 -11206 -10888
4998 -10888 -6749 -8333 -6088 -1814 13089 15936 -5556 -33096 -28470 -20936 -15257 -18777 -7575 2901
4984 2901 12614 6933 -3377 -827 -9511 3743 5869 12554 23591 6541 -11272 -8809 5698
4971 5698 5376 -4878 932 26603 27613 18558 16405 24116 18250 -4509 -11443 -814 10148 131
4957 131 -6194 17900 24884 24429 21528 21188 10364 -1482 -9638 2046 -2539 -7525 -644 14617
4943 14617 5290 9031 17312 9885 8827 9782 7124 4585 7207 22396 7728 -7908 -30460 -28340
4929 -28340 -12941 -16986 -4487 -136 13147 19423 31800 24334 3250 -2301 13 -4006 -5296
4916 -5296 2119 1464 -13075 -8667 -2653 -9735 -13480 -16896 -6704 -3441 -12041 -7801 7446 3638
4902 3638 15555 23235 21942 26143 31515 32917 12822 5217 10947 20085 20489 13937 -3811 -20333
4888 -20333 -28911 -28732 -13203 -1792 836 -6819 -17429 -8062 -1203 1025 5494 8155 -7517 -4004
4874 -4004 832 -904 -11929 -2499 -14 -11431 -3485 -1469 -3577 3848 -6839 -6006 -3268 -6358
4860 -6358 -257 488 12113 14086 10098 -334 2776 19950 28061 19532 12026 19791 -1248 -6785
4846 -6785 -5943 2853 -5418 -3421 -9457 -9621 -10191 -10321 430 3523 4280 376 -13876 -6395 4196
4831 4196 11411 16581 17675 19798 12039 -91 -8521 -8283 872 4240 -5693 -5444 4006 9921 9025
4816 9025 12378 13202 3180 311 14746 12774 3097 1085 13830 7272 2487 945 804 10922
4802 10922 29437 26544 12412 -1437 -7116 -1503 4335 878 5038 1332 -8485 -4854 1078 4762
4788 4762 1852 3767 18193 26542 18225 16232 17982 24255 32075 21762 7877 11189 3375 -4256
4774 -4256 -9934 -6447 7815 24152 22560 13341 18387 17425 13741 16433 8825 5094 -7187 -15029
4760 -15029 -15976 -13799 -7658 -1400 3396 8383 2933 -539 -2512 -7505 -5326 -9741 1747 14263
4746 14263 21417 13860 12402 23644 25487 26293 24382 7792 5810 4935 10475 7885 -1759 -4504 -4907
4731 -4907 -3718 -4758 -2228 11141 4740 -4405 -14751 -2483 491 -4576 -12916 -15613 -16153 -23879
4717 -23879 -29200 -24681 -30894 -20893 -4097 -1290 -10440 -10259 -7494 5396 6418 10430 20537 6451
4703 6451 -1188 -14043 -21586 -5411 -1496 -1154 -1252 -10782 -19060 -22641 -10794 6328 707 -4771 -4258
4688 -4258 -11849 -15604 -10761 4513 1791 -5291 -12309 -34434 -37961 -25786 -24870 -28382 -38479 -26323
4674 -26323 -9412 -18280 -28826 -27425 -15556 -10700 -11016 -8865 -9254 -3703 4890 1798 9272 8093
4660 8093 -4516 -7379 -11282 -7448 -7028 -15273 -15285 -12218 -4463 -1501 5134 -661 -10305 1844 12646
4645 12646 29580 38922 19442 -3446 -12378 -16081 -20810 -16622 -5951 6390 5488 -7341 -9743
4632 -9743 2070 7593 2239 -2187 -5096 -8415 -1756 -5861 -12638 -8556 -13817 -9123 7759 14037
4618 14037 19043 12254 1059 -980 -836 7156 17765 10446 10045 7006 -2424 -10808 -6900 -2687 6128
4603 6128 19695 17612 14905 13 -4954 -1885 -7683 -653 4631 -1665 -15578 -14087 -23075 -17762
4589 -17762 -9109 4162 2098 7409 -1404 -2106 6465 -8584 -8178 3772 14016 14039 18532 14932 8547
4574 8547 2834 9286 18461 16059 14887 5015 -3837 -17578 -23232 -22237 -31390 -15899 2868 6777
4560 6777 12126 8448 3416 17673 31514 28266 25788 17381 5047 11331 16582 12294 2678 -1723
4546 -1723 -12221 -19784 -26797 -11552 1783 -2955 -2978 -1057 2659 533 -1766 -14615 -16185 -3301
4532 -3301 9416 3370 -1343 2373 5290 12976 15053 17836 14399 -1742 -18905 -14384 -4697 -4328
4518 -4328 3435 4380 -13742 -14815 -259 8209 9274 20629 23989 14738 14141 11722 10848 -1459 -7018
4503 -7018 17479 22516 12576 7286 4018 1199 -420 -7168 3953 3747 -2726 -4020 -6515 -15450 -27826
4488 -27826 -35634 -24679 -1903 3130 6870 812 -5699 -3944 8478 5048 -8078 -1697 5955 1857
4474 1857 4055 7041 582 -6656 -8521 -2394 3899 -2523 -5428 4155 22292 38741 35677 24604
4460 24604 18808 16670 8399 -781 -12215 3810 16996 11178 1408 -7987 -12025 -1363 -4275 -1662
4446 -1662 13620 14209 10528 24754 23518 7346 7846 4661 1778 -3046 -9494 -5655 -16106 -17104 -84
4431 -84 -308 3144 2487 14214 14607 7823 -5711 7717 7095 3583 10929 11130 9778 5039 853 -5835
4415 -5835 -5363 -11184 -4083 -1941 -5001 -11257 -6709 -11978 -4940 -573 -3763 -5681 -8193 -9172 -12405
4400 -12405 -9685 -8105 -10621 -1656 873 -4274 -2481 -6430 -18282 -25578 -20240 -15216 -15346 -20714 -24476
4385 -24476 -18633 -26540 -20252 6317 7465 3709 10670 4951 -7353 -5666 -2622 6216 11969 -3137
4371 -3137 1990 7983 9125 -5300 -21565 -20178 -7685 -12056 -6480 -2918 -11495 -8030 -10103 -14055
4357 -14055 -10330 -12671 -1091 16872 12987 3486 316 -8361 -14065 829 612 -2946 10104 12797
4343 12797 5472 -6356 1535 17054 17915 8466 17588 28693 22510 21486 35614 31251 13065 12682
4329 12682 11432 11881 12702 5725 -6264 -5458 -12204 -21739 -17782 -7314 3682 10252 5664 4448 9052
4314 9052 8366 10269 4753 14660 14004 2292 -3449 -12105 -13859 1988 8719 4502 7921 3554 -2800
4299 -2800 -3391 -599 10891 8081 -13707 -18134 -11882 -4476 -2468 -8859 -5863 7502 15656 32143
4285 32143 33021 31326 38432 25220 5353 6828 -1387 -9187 -5085 -14399 -16322 -13668 -11086 2121
4271 2121 -3490 -24706 -29801 -15326 6010 8188 -11208 -18889 -4619 7522 14469 7642 11795
4258 11795 17817 15384 2441 7304 5106 -9432 -11680 -4162 1475 9642 12923 8118 7670 3742
4244 3742 12439 -7428 -14451 -4248 -1592 -712 10205 -2244 -2292 -8757 -10984 3659 2860 -114 -2178
4229 -2178 -2890 -3376 277 -3508 -1103 3591 7753 5566 896 -11244 -3617 -1804 -1319 8513 11547
4214 11547 6760 2380 11197 250 -6373 8047 557 -13776 -13518 -8949 -2707 3322 -1899 2739
4200 2739 19563 23331 17555 20778 18227 25312 28127 16893 5322 10657 19659 29639 31949 23206
4186 23206 -6104 -11542 -5646 -12268 -11401 -2319 7769 3538 -13213 -3719 4496 5484 -6979 -24039
4172 -24039 -31029 -31093 -30345 -19116 -2037 -4235 -9268 -10767 -7667 -17318 -11203 147 402 -6781 4463
4157 4463 4503 1685 13353 11806 3631 -1165 -496 -5512 -20179 -22997 -6710 207 -14849 -27568
4143 -27568 -26440 -18514 -13981 -12571 -8507 -8150 -10096 -1015 3011 -3738 2684 8559 7079 8351 11904
4128 11904 14054 5366 53 18157 20666 21069 14904 -2983 193 -2264 -7543 6767 7702 3298
4114 3298 4469 7884 7142 5367 15208 8767 10349 21749 5591 -2509 1647 -2942 -3258 1508 -1771
4099 -1771 2262 -5327 -4949 -5278 -14390 -18742 -17563 -9411 -6766 -2500 13 -7934 -26305 -17274 -19989
4084 -19989 -13746 -9904 -4127 -8892 -6135 2959 8532 16776 10670 6939 4953 4855 1707 -8625 -14848
4069 -14848 -17825 -13927 -11451 -3696 4249 -4409 3280 8526 8978 12109 12160 5574 -9727 -33933 -34615
4054 -34615 -26727 -14580 -21165 -27192 -20364 -9473 -133 5259 3175 4715 5478 20241 16702 14082
4040 14082 13470 7541 3912 1405 5106 6027 9564 2837 -568 -2142 883 -1838 9370 2385 -10854
4025 -10854 -22400 -35160 -30391 -26698 -19867 -8435 -28137 -20215 -23850 -19566 -20919 -12742 -8895 9792
4011 9792 13764 -2452 -5825 -1796 -33 -5394 -12958 -21485 -7055 -9636 -9692 -16569 -16707 -9150 2172
3996 2172 7787 2412 1242 8998 16546 1780 -2386 -5302 4113 7629 9157 8899 1091 -5358 -1958
3981 -1958 6334 -8912 -18342 -6695 14117 12352 9058 4328 -4756 -4320 -1873 2789 4270 1877
3967 1877 4011 2810 13413 14622 13170 10851 10914 17894 23138 18318 18459 20691 14034 1527 11067
3952 11067 10227 1576 -11760 3316 16369 15972 10978 2393 -4565 -4767 10355 20675 10627 -5030
3938 -5030 -13054 -5906 4173 3336 7143 -13857 -14064 -1024 929 -9472 -6310 -10098 -3120 -2356 -1806
3923 -1806 -6274 -6155 -945 982 -2625 14365 23976 14530 4546 8329 15424 23472 12820 -8722
3909 -8722 -15191 -12171 -5829 833 17835 23704 19169 13131 6535 -556 -554 -8917 -12582 -14631 4248
3894 4248 25758 23515 18230 11540 10489 8575 12480 18367 20812 23455 22184 12810 8554 12568 17103
3879 17103 6278 12496 13317 18328 16752 16239 4076 14172 23051 4797 -1305 -2368 -13995 -13851
3865 -13851 2861 6967 1908 -3785 2489 -2010 -14228 -10312 -6320 611 15690 12769 9073 16578
3851 16578 2358 6281 17077 10963 6053 11213 15724 11935 13275 15015 13664 22659 15017 10428
3837 10428 12931 23028 28318 18858 12923 2139 -8349 -11001 -9791 -3409 -2738 -770 -2741 -1345
3823 -1345 7691 3024 5007 -3638 -17119 -23032 -9144 697 10444 20396 17493 8223 15114 28172
3809 28172 37305 35090 27680 18613 9625 3011 -373 3274 9775 8151 -8516 -17799 -12676 -2412
3795 -2412 -2073 -1144 5955 9558 7745 2897 16251 25574 27906 26099 17274 9502 -1064 4531 21149
3780 21149 26187 467 -14495 -8497 4557 11610 5156 7316 -730 -31 6094 3920 -1568 4619
3766 4619 3535 3923 -8958 -13201 -18792 -11981 -10235 -15263 -5815 4743 11181 21189 34235 29480
3752 29480 35545 36929 16887 11176 21297 19985 22724 9682 -6831 -21920 -13621 -7873 -6417
3739 -6417 -1707 -5889 -15892 -18283 -29634 -23131 -5437 12325 12355 10684 5647 -2610 -15602 -26195
3725 -26195 -27888 -27521 -20624 -15722 -12272 -23791 -33878 -21263 -11030 -12017 -10616 -4733 -5348 -13460
3711 -13460 -9737 -808 -6955 -18389 -2471 -3094 -5181 -8777 -4421 -5178 7760 17678 33074 32435
3697 32435 25631 19210 12815 213 -10460 4110 13423 18449 13670 4892 355 -4837 -7435 -3824
3683 -3824 -3793 2848 -2366 -3660 -8610 -8567 -4361 -1161 -312 -13948 -24936 -18746 -8497 -16995 -18164
3668 -18164 -11316 1310 -2632 -21091 -25752 -20968 -15701 -21234 -27042 -29252 -28254 -2763 1088 -4363
3654 -4363 -7169 -13706 -7328 -1846 16093 45875 41026 28730 15511 6594 12126 11193 -4814 -17811
3640 -17811 -15018 -14671 -9346 4026 -1500 -4076 -4184 10676 6884 -17418 -25401 -12480 3291 5873
3626 5873 -1811 -10720 -13270 -16828 -10192 -14770 -29736 -30586 -22798 -11471 -10531 -3646 3645 8551 -5861
3611 -5861 -16744 -12796 -4387 2457 -8227 -7300 -5024 -4996 -6875 -15590 -13622 -7038 -5642 -3587 -152
3596 -152 8127 9923 -2190 621 -1956 3909 5552 11086 -8795 -10098 -5762 -3205 -524 7923 2027
3581 2027 -11659 -13087 -14101 -14821 -10066 -21693 -23555 -14491 -9146 -17185 -13895 -6010 50 -3565 3817
3566 3817 6922 -1144 -10568 -2347 -6426 10343 15352 6906 -5451 3229 20757 17416 7823 6749
3552 6749 14892 26440 26186 22513 17915 7168 3435 16059 23536 14760 4895 -10105 -24094 -12040
3538 -12040 -4403 -524 5272 15662 24436 9871 5802 -1693 -4320 7760 15223 1623 -3556 -10063
3524 -10063 -17642 -13337 1120 6580 -7496 -12821 -7356 6579 -3898 -5395 -2954 -4659 -9658 -12769
3510 -12769 -10146 -3524 9220 6483 -1187 -2039 -3516 -8959 -808 -3309 10013 12878 8557 8148 4365
3495 4365 -892 -8916 -12009 -11246 953 11602 8316 -10303 -13338 -5031 -619 -1057 5753 4511 3206
3480 3206 6232 2933 53 -6368 541 1256 3021 7587 7135 5555 3151 611 3702 -4947 -2349
3465 -2349 -9175 -10424 -11956 -9104 -11894 -18584 -30192 -28886 -19372 -18083 -16572 -18962 -8433 -4523
3451 -4523 1370 1782 -2568 5455 6902 1822 6652 13821 15889 11308 12434 11025 15774 6549 7428
3436 7428 326 4925 1661 8018 8155 5290 3696 4907 2231 13388 22463 19797 16699 2236 -4344
3421 -4344 -7891 -1492 -872 -2242 -380 -2471 -3427 -3711 -9635 -11228 -12268 -1906 12337 10991 10524
3406 10524 -619 4242 11703 4075 -7640 -9496 -3393 10988 20755 23425 31661 32037 13362 -1727
3392 -1727 -9403 -9955 3280 274 -10963 -12682 -17585 -6782 -2788 -11925 -21136 -25343 -24704 -19149 -15299
3377 -15299 -1207 8931 4451 12863 9618 -9793 -9466 -12672 -16891 -17844 -24389 -20737 -26535 -25309
3363 -25309 -6389 6949 4470 7827 3665 -492 627 4228 7837 17091 17668 21446 12736 5978
3349 5978 -15069 -25035 -19728 3766 15656 17669 16294 19412 14150 12402 16608 14012 9552 11008
3335 11008 157 -2885 -8937 -889 20348 8864 14825 14908 19516 14235 25484 26410 7554 -5920
3321 -5920 -3296 -1098 6800 17648 25143 3000 63 7442 35 -4491 4178 5602 -2305 -3573
3307 -3573 391 -338 5702 9597 831 -3819 2584 9997 -6413 -15458 -19041 -7710 486 10607
3293 10607 3889 4089 12394 1529 939 -8982 -16308 -12493 -12253 -15447 -10113 -2259 15505 19775 21245
3278 21245 41029 35589 14531 5907 -6756 -1792 -9659 -10633 -12562 -10051 -5425 -6586 159 2634
3264 2634 2381 8609 -10070 -17437 -21027 -26749 -23023 -10635 -1749 -7801 -13644 -16684 -21004 -22564 -28055
3249 -28055 -23758 -11587 -7035 -14040 -3353 3438 5141 2406 8595 17957 15220 3191 -2965 -2882
3235 -2882 -260 -907 7342 16303 23627 29257 25110 12250 4155 -6404 -15420 -22693 -23631 -28921 -16721
3220 -16721 -11495 6225 6630 -4491 -11957 -6936 -4317 -8827 -11313 -8649 -2211 103 2208 4437
3206 4437 -121 738 113 -2031 -16495 -32332 -25101 -13126 -8092 -10487 -10591 7994 8240 -783 -9034
3191 -9034 -13310 -21022 -15186 -5277 -10413 493 14607 6763 916 -9000 -12371 -16733 -8514 2405
3177 2405 5388 9992 3284 -2050 -8570 -12617 -30236 -28929 -25646 -10092 -1852 2855 4518 4907 -3495
3162 -3495 102 -747 1319 1778 9135 23476 18886 1563 165 1049 3049 8802 5248 3975 4313
3147 4313 -1713 -3209 6265 8029 5994 13105 5313 3576 4832 944 -3281 -9506 -4018 1702 7067
3132 7067 6104 20378 18837 20623 7899 -7055 -14203 -12650 -13914 -3643 8622 15933 14491 213
3118 213 -1989 -3048 -4197 -10 -10773 -10586 -8784 -1787 -3525 1748 14646 23863 20097 -1155 -2084
3103 -2084 5341 14124 21546 23973 14783 -4176 -14272 -13427 -9590 1030 -991 2857 3137 643 1611
3088 1611 -7198 -8482 -9320 -15722 -5413 5045 6985 -1213 6014 -2812 2797 14356 7353 4671
3074 4671 3334 3374 -6806 231 19599 21233 9500 14025 21769 11211 -264 4949 284 -10587
3060 -10587 -17998 -5142 4189 3645 4125 4259 13475 10733 13272 12135 8006 10072 16608 11738 -4689
3045 -4689 -19561 -11418 -2203 672 10618 8859 9895 10554 8291 16799 25110 17675 7236 5825 8926
3030 8926 11400 6816 4728 4153 -3353 -6765 -7348 -3513 -10600 -16825 -16103 -10518 -9887 -12189 -8887 -6963
3014 -6963 -11731 -17509 -13854 -15069 -24157 -38695 -48806 -42751 -17700 -7218 -6924 3666 4010 4954
3000 4954 364 -15265 -7414 -2369 -17415 -18961 -598 7523 11647 10987 12497 5941 8666 7707 3168
2985 3168 18327 31192 27531 24104 22025 20673 12606 2270 6507 7366 8479 -12811 -17374 -7875
2971 -7875 -4457 -3394 -3129 5470 18497 21627 21930 23033 9962 -4860 -5552 -2718 -6166 -13094 1046
2956 1046 8747 4510 19444 14216 7817 -598 -16463 -17417 -11849 2178 17912 22604 2411 4139
2942 4139 9624 21657 31835 21457 4656 -10989 -7151 -2731 -11915 -19864 -17656 -8896 -9921 -5391
2928 -5391 2012 2914 -4063 -10402 3597 17485 18324 10515 -2958 -8692 -6134 -14215 -17059 -1299
2914 -1299 6300 15747 26383 30774 20717 7963 -3716 -15877 1746 -2877 -12758 -24843 -32572
2901 -32572 -30366 -18340 -8991 8471 6893 -9490 -7733 -1925 764 -1956 2063 -48 -7819 -7418
2887 -7418 -7607 -3407 -5959 564 5888 11481 -469 19706 29374 15294 -670 -19454 -23701 -14321
2873 -14321 -7149 -4176 691 7326 6244 9544 12071 2052 -1296 -4574 -10199 -17783 -30445 -13270
2859 -13270 -5291 -17572 -21984 -19842 -15583 -527 2377 -4582 783 -1535 -3847 -10304 -3567 -10462
2845 -10462 -587 -1839 5572 14351 8580 6317 -7194 -7366 -1748 -1758 -1238 4084 -5864 -11126 -18664
2830 -18664 -8298 3897 -3051 4565 16008 9676 11983 16889 21442 14335 93 -29587 -35943
2817 -35943 -23862 -16099 -24465 -23959 -16328 -4763 -4050 -1948 3799 12824 4756 19049 22038 19632
2803 19632 8921 1656 -7680 4031 152 -3521 4114 14251 18213 17943 4794 5716 9348 1936
2789 1936 -7850 -18236 -15605 -19885 -19983 -15228 -3785 -7174 -9187 -4139 12596 -3901 -13694 -19897
2775 -19897 -9987 -6100 -4013 -14180 -20590 -29058 -31419 -21565 -5851 2041 9007 8258 12706 8024
2761 8024 -7689 -7911 -10149 -17864 -13325 -11063 -21001 -20569 -23941 -31161 -28697 -18845 411 22216 26934
2746 26934 9274 -8481 -12869 -5600 -660 2145 -3591 7930 2953 5528 -361 -1632 1334 6175
2732 6175 2395 -3240 -13146 -8855 855 -3080 8479 13518 10826 13521 14839 4504 -6316 -5133
2718 -5133 -10292 -4784 -9961 -20474 -22370 -17077 -12820 1789 13571 5160 -1704 3267 -1168 -7689
2704 -7689 -8275 -399 9306 16395 15211 26576 36462 37788 35884 34266 23997 16259 -868 -8767
2690 -8767 4420 9619 11128 20771 6148 -9915 -11563 -9250 -1389 -11640 -22845 -26830 -17922 -7056
2676 -7056 -1323 -4047 -3548 -9430 -7804 -11864 -22455 -17809 -11763 -10749 1687 7280 12228 1433
2662 1433 -2230 2766 11328 13644 22727 2508 -9874 -8715 -4855 -1364 -8536 -3550 -896 -1026 -2669
2647 -2669 -7977 -512 4737 12198 3958 1311 -3277 -3824 1541 -549 2304 -2283 7797 9319 11982
2632 11982 13989 15061 12469 12547 10568 2473 -381 16449 27166 18361 5521 11962 26559 13611
2618 13611 8723 6010 -3025 -7434 -1535 13783 20010 14053 11160 12131 3606 -4529 -7916 -2832 -9476
2603 -9476 -10182 1626 6279 -11665 -14591 -5258 3669 -6276 -8684 -8926 -19503 -18991 72 -704 -1680
2588 -1680 -1560 -3251 -870 -2516 6358 15584 14338 1025 -3877 -22581 -33477 -29565 -19381 -5465
2574 -5465 14218 4156 -5220 -6809 -5806 -4132 -893 3516 21246 30758 34991 15227 14122 20823
2560 20823 21531 9322 2842 -4915 1791 9372 11441 6896 -1713 4660 2006 2094 167 -8976 -15327
2545 -15327 -11874 -18805 -23568 -7014 4501 -11923 -22734 -21169 -12115 -2691 -1876 -6617 -18459 -15515
2531 -15515 -11535 -6988 -4103 1125 -2792 -7386 -1813 9796 13650 -707 -9380 -1565 2718 3365
2517 3365 -5477 -1358 7947 -2716 -8718 -12607 -12888 -5746 -10010 -6538 1400 13511 9082 14378 18585
2502 18585 9574 6092 9750 13451 23232 14051 -5790 -21648 -24263 -16992 -23945 -18167 -6386 10283
2488 10283 13483 -3367 -7348 -6961 -10361 -3037 636 8334 6496 -7141 3015 13679 22428 10119
2474 10119 8298 -2574 5557 1968 -1827 3012 9450 13059 17464 8366 2351 -8134 -5269 2641
2460 2641 -1959 -783 980 5891 12793 2429 -7860 -5390 6203 11993 13664 25331 37096 30376
2446 30376 15118 -1081 8775 20052 21846 17148 17295 13661 9710 5297 -3136 -9915 9887 24074
2432 24074 24881 23101 28961 18990 6680 6415 394 -8771 -9469 -18021 -19242 7622 18177 17094 17508
2417 17508 16635 14795 -8407 -3015 -2300 -11223 -9650 -10966 -8253 1555 5588 11211 -5976 -11252 5024
2402 5024 13545 7134 -434 -1946 4886 -1882 7475 12850 15344 9695 17289 19557 15378 -1704 -7226
2387 -7226 -6110 1582 -10285 -10310 3282 18826 27893 24983 17916 24308 31657 19015 2936 3242
2373 3242 952 -1618 -732 10931 21577 17520 10049 14510 19799 14236 16018 9507 315 -4907 -7201
2358 -7201 -6244 -7723 -10214 -15395 -22434 -22854 -8723 -15916 -19395 -11466 -3182 5444 10207 4249 1263
2343 1263 12488 14976 125 -7168 -13190 -11893 -8928 -7853 -1647 2008 11624 19869 18109 -2033
2329 -2033 -17093 -14059 -14959 -18379 -15243 -21602 -24588 -20510 -27706 -23813 -12364 -7478 -6997 -6240 -3127
2314 -3127 -8223 -2555 -2443 -14935 -14181 -8092 -1541 -7275 -3879 8118 4804 -3907 -8956 -3664 6246
2299 6246 -6498 -11857 -3083 -209 126 9618 21308 30428 17540 21996 18093 -1537 -4563 -13509
2285 -13509 -1317 267 -7084 -9984 -2777 1371 -13783 -16558 -21363 -15192 -11679 -10901 -10014 -11400 -8418
2270 -8418 -2728 -765 -6003 -7372 673 9323 -6909 -4920 8554 13193 14403 8700 -11034 -3207
2256 -3207 -1631 5657 9836 20482 35309 24657 15903 18983 9092 -2347 5351 9902 -6385 -10504
2242 -10504 6143 26300 20174 12404 -5230 -9533 -6245 -2694 -8089 -4181 -9816 -4139 -1508 -2400
2228 -2400 4213 -3707 -18889 -19475 -12678 -13595 -10334 -7957 -14165 -15122 -3833 9216 16853 17584 12510
2213 12510 3610 1350 2811 2956 829 -1134 -4458 -5091 -22239 -22799 -15098 -3061 1831 4441 8307
2198 8307 28387 34408 29118 13496 -4259 -2111 4006 4343 6380 14588 7194 2620 5342 5158 5011
2183 5011 6550 -2270 -1315 -10942 -15770 -5775 652 -2438 -224 -2002 -13812 -7995 5848 16236
2169 16236 12839 5860 -376 15762 23200 13694 -4370 -3298 -7478 -2318 -5174 -7526 -22811 -26147
2155 -26147 -27265 -22562 -21730 -12503 -12989 -4424 -4061 -1736 -338 6546 5588 8575 20069 10533 -9952
2140 -9952 -8598 2011 -1937 -491 -1995 16136 16214 -5707 -6922 -4820 -7399 -7663 -16463 -5709 16687
2125 16687 20283 20011 14688 15235 6742 4109 4680 -3459 -14743 -1363 -6634 -353 1491 2154 528
2110 528 35 -4335 -6728 217 4092 -5435 -18758 -8423 -3307 -9538 -10110 -15705 -11774 -9933 -7651
2095 -7651 -15620 -9819 -2150 -24625 -17107 -9964 -5037 -772 -3471 -14239 -14567 -4755 7690 -3517
2081 -3517 -6950 -3377 -3055 5965 26437 32351 27790 14958 16690 21928 12423 7235 -8615 -10459
2067 -10459 -801 -5231 8999 13551 6336 502 20682 26176 18503 14749 6090 -2982 -3619 -2515
2053 -2515 -6136 -12382 -8352 2388 2770 -5474 -11034 -17975 -7080 3663 15460 21773 9774 6046
2039 6046 0 14285 14334 15457 15100 14031 -1114 -21323 -18019 -13094 -12322 -9990 -6302 9937 19869
2024 19869 4230 -4808 -6798 -3200 0 2513 5767 1980 8295 14606 11446 6244 -4562 4096
2010 4096 17035 12509 15028 12535 10235 -1082 -2277 -338 10038 16673 6890 -3374 -2634 24542
1996 24542 31466 6425 -6867 -6301 9501 12038 -651 9458 12546 6516 3927 5209 3129 1793
1982 1793 13255 10268 16639 9120 -11518 -10741 -3916 1577 -19026 -16827 -11310 -14411 -14190 -5763 15734
1967 15734 15871 14448 22779 24030 25953 16352 21154 20314 18276 10094 -3484 -10728 973 6079 6076
1952 6076 -7784 -5734 12660 12655 16035 10378 9212 5274 -8736 -14756 -14882 -9399 -522 -3959 4060
1937 4060 7027 -33 -12073 -8534 -4556 -4709 9933 8872 10777 3165 8424 10170 8313 20047
1923 20047 26231 25187 12533 5676 -96 6287 14457 22631 13187 5274 21289 37910 22373 6390
1909 6390 1168 -3535 4064 -540 -3537 784 15739 20536 14706 8524 6075 7407 10632 1846 -6009
1894 -6009 -5484 280 12029 15718 2671 -791 -3569 6212 19764 23446 19161 5457 -2174 -14585
1880 -14585 -9756 -2844 -5379 -590 1627 -705 -6489 -13593 -5628 2640 8599 5732 1383 2282 -256
1865 -256 688 5042 10334 7160 16125 28001 20159 10915 6657 12923 -346 -7560 -10888 -16451 -4424
1850 -4424 -4234 -9521 6831 9599 -10813 -18976 -11380 -9715 -23177 -26242 -16980 6347 32165 41390
1836 41390 35893 24947 10459 -22476 -12811 1419 9776 8753 3925 1829 3844 -260 2073 -6072
1822 -6072 -2692 2989 11419 10010 3744 21655 33486 28459 24549 14492 16270 15359 11851 10867 -7425
1807 -7425 -21947 -14206 -5383 2242 8962 25266 28517 29435 18393 20602 13491 -4567 -12839 -13023
1793 -13023 -2958 5092 296 -2491 6542 14284 10525 -690 -3316 288 -4124 -13114 -7561 -5941
1779 -5941 -7371 1435 3806 -2268 -13383 -12922 -7810 2681 6804 8048 5 -10748 -10037 -15105 -28528
1764 -28528 -24204 -9901 -1504 -517 -11427 -8738 -7673 994 6863 4900 18099 21028 7417 2154
1750 2154 -2694 -9866 -4827 -8045 -15450 -22305 -16246 -7636 3622 937 -1721 1904 9294 23307
1736 23307 24519 13833 10471 10295 3889 1038 2008 5276 14118 6403 -2261 -8091 -4097 4845 5859
1721 5859 -753 316 -5780 -18056 -25727 -22716 -25804 -16420 -11110 -10960 -24712 -26035 -19988 -20985 -8997
1706 -8997 -10431 -14264 -18917 -12058 -2174 -1170 2834 11716 20538 10145 -10245 -30024 -23539 -16935
1692 -16935 -8840 -8294 -1858 -1774 1240 19777 17113 7956 -3003 -6347 -4737 -7841 -21518 -16608 -11834
1677 -11834 -7939 -16604 -13133 11795 18221 23067 26519 36865 36869 40726 22096 2831 13323 17777
1663 17777 11770 838 -4748 3103 12606 -3235 168 5762 2465 -1575 8989 9909 6098 2789
1649 2789 10736 17210 15750 -2603 -2308 5352 8589 -9693 -12441 856 8737 17212 25579 26983
1635 26983 21705 9488 10559 15410 8919 16497 15719 -987 -18382 -6594 9343 14104 2602
1622 2602 4448 19116 22522 22951 19035 11478 6302 4513 -2643 -18893 -14041 7519 10688 10386 6796
1607 6796 8327 5821 -2325 -14254 -4077 9034 9990 10787 15463 16760 937 -21601 -23974 -27258
1593 -27258 -15814 -7271 -12045 -14148 -6378 -4364 6481 16430 28091 18751 -2717 1532 8760 13867
1579 13867 12065 4000 -4817 6952 14107 703 -8064 -26547 -31642 -22235 -8516 -5288 -13847 -24985
1565 -24985 -33739 -28769 -14124 5472 4312 -326 1810 6965 15561 27686 31375 30047 33266 44945
1551 44945 38510 43917 34358 19314 2383 8575 12383 7212 7094 18307 9648 -3181 4707 6896
1537 6896 2201 10448 26069 33943 41484 27179 8855 6011 3975 1849 -621 4669 16697 24641
1523 24641 27624 16783 15927 18592 14860 10302 7428 2500 2491 4173 2634 -6237 -17163 -26339 -9850
1508 -9850 -6976 -21247 -28716 -14376 -1360 5466 6860 16217 4131 -10570 -16578 -14927 -11565 -12496
1494 -12496 -12912 -6760 -445 -2857 -3893 -10206 -3917 -9490 -23928 -19551 -11978 -12028 -13350 -6421 136
1479 136 -8594 -17937 -6662 -13812 -15411 -3258 -7298 -13085 -8754 2077 4054 7283 3793 15915
1465 15915 -711 -12347 760 8903 18656 21732 11139 -4809 -17272 -8115 -2128 1028 5527
1452 5527 2834 -3175 7488 6740 9799 4929 -2100 11619 7102 5823 7406 -5756 -12168 -5334
1438 -5334 -1225 6977 14181 10355 10596 17641 8893 -9540 -3633 7444 22621 26174 -3746 -16132
1424 -16132 -20501 -32677 -26444 -14722 -12702 -4746 6861 -7125 -19175 -12355 -5817 -2339 486
1411 486 -4259 6343 18510 11655 -219 8258 1142 7718 16028 17757 -4883 -11912 -17783 -9800
1397 -9800 3479 7698 4992 1846 -3088 5748 15966 34385 26903 552 -6730 -437 8379 11070
1383 11070 11007 -953 -16723 -13438 -10744 7612 17585 7781 2435 -156 -3174 -6368 -11171 -20315
1369 -20315 -15248 308 -2503 -7303 -12688 -19039 -20252 -15242 -6951 10882 11088 5251 3813 8610
1355 8610 19483 12765 8525 -7876 -6622 4805 -597 -4316 -10341 -10489 -4566 -4399 -3566 -257 -9312
1340 -9312 164 -900 -6117 -15693 -19525 -21304 -1122 8184 7051 11166 19398 20552 15723 7484 3181
1325 3181 7378 2035 3597 -680 1856 6015 4418 -12848 -23340 -17505 -16914 -26084 -19680 -8241
1311 -8241 -16755 -17500 -5196 663 4433 1861 -9786 -22796 -25423 -26879 -13523 108 3811 -8370
1297 -8370 -3634 8435 19412 13183 9948 4130 -178 -1867 4327 20269 22052 17322 8086 -6921
1283 -6921 -14964 -1202 8095 -500 -5209 -5066 1981 8140 5726 4592 5776 5091 5090 -8409 -3188 3106
1267 3106 13451 23424 6167 -8408 -10425 -3543 -3872 -5030 -1129 -1619 -4860 3167 7982 3737 8659
1252 8659 5674 4578 8941 6780 19418 20893 30215 44778 33858 17879 -1928 -6159 -120 9533
1238 9533 16842 5863 -10012 -13822 -12703 -9327 -240 -747 -11330 -13814 -9988 -3170 -7742 -6417
1224 -6417 -8960 -15857 -13722 2088 5828 5733 3635 -5299 -11018 -2445 -3703 -14975 -12865 1362 3374
1209 3374 8492 21685 20007 9719 -777 293 4253 12292 11063 7142 2319 5496 10955 7389
1195 7389 -13549 -26514 -22634 -32458 -33046 -11259 14606 8663 4557 6273 25087 21084 18556 6943
1181 6943 2735 4855 -9822 -20643 -14363 -10127 -2463 10737 13646 5965 6885 11020 12505 5701
1167 5701 -1243 -3067 -5183 601 -2814 -6548 -13104 -20254 -23487 -21918 -15032 -8452 668 6494 7379
1152 7379 -7317 -15282 -21098 -27044 -22820 -5015 -2988 -10277 -12398 -13375 -6091 1872 21815 23839
1138 23839 15589 8019 12434 3748 -8763 -12520 -1775 960 -14361 -15640 -20142 -27676 -28089 -23071
1124 -23071 -20661 -15282 -2775 5803 746 -5415 -10773 -586 10976 5060 1781 -8259 -2953 450
1110 450 -8220 -14109 -12437 -5694 -1354 2863 5089 5238 11906 12661 9920 13888 6621 8923 1483 -5942
1094 -5942 -4488 -1121 8422 7546 -13095 -16830 -12509 -17451 -18649 -13617 4629 8122 6209 741 7905
1079 7905 19407 12447 11629 10870 21570 25078 11874 -1593 5664 20487 27739 20174 14294 -7939
1065 -7939 -12495 -11931 -8744 -732 -7685 -1879 7962 17377 18270 7245 7998 5077 10342 1416 1779 -602
1049 -602 -3514 9857 15238 9109 -153 -2439 -529 -3385 3418 11530 13497 7074 3902 -574 15505
1034 15505 13681 8411 9182 11184 13418 7502 -3102 -8237 3930 13242 1716 10087 10916 10552 12098
1019 12098 16850 811 -17267 -860 43 -6300 2353 7081 3194 -10015 -14524 -6461 -2313 3074
1005 3074 5552 21724 27171 13059 -4130 -17413 -14972 -7945 -1368 13680 17087 15541 9966 6055
991 6055 -3906 767 8362 11909 1181 -10076 -18227 -404 -412 -9594 -9100 -6658 -1605 -466 -11331
976 -11331 -26246 -38406 -36573 -26841 -8378 -6376 -10701 -20404 -24045 -13294 -9888 -612 -582 2655
962 2655 4513 2771 -3187 1247 -3859 -7683 -18302 -28950 -20416 -18089 -9445 -236 10592 6930
948 6930 602 -844 -4810 -8016 -12854 -7215 -4949 -12248 -19710 -16335 -552 12893 10392 -5187
934 -5187 -4098 -770 4300 -7367 -12264 -7530 -6418 -11066 1223 -2448 -6683 -6910 -8907 -2752 7679
919 7679 16717 19417 27549 16574 -4868 -8940 -4340 -8522 -2906 5762 1377 -4928 -9815 -6227 10865
904 10865 10554 -1381 -10065 -6643 -215 14112 9573 -12374 -22038 -21225 -2587 7400 7896 -983 -6468
889 -6468 -7292 1368 -281 -993 -27005 -10819 2576 11321 4140 10471 9771 2096 3031 6803 2002
874 2002 2885 -806 -10194 204 -5870 -10469 2086 12598 6796 8120 4533 -4690 -6316 7162
860 7162 12986 14705 13655 15288 3238 3857 12134 14083 20336 14319 9101 9420 4909 3024 8150
845 8150 15338 16756 21202 17087 14358 18586 13069 16164 14050 18477 8910 -218 4596 16559 13669
830 13669 7781 -4030 7757 12776 10781 6850 7705 4159 4691 7224 7438 6594 -3849 6470 5209
815 5209 -8868 -10078 -20128 -31366 -19130 5864 8330 8805 -6550 -18704 -18695 -26219 -13290 -6975
801 -6975 -4444 -9614 -7734 -9681 5055 15698 2457 -12333 -17615 -18397 -14914 -681 2420 11907
787 11907 10790 3617 816 8494 19833 16460 3902 462 -2849 -12179 2184 7047 6635 10653
773 10653 19493 20649 16538 13340 19963 29359 33109 42003 25359 21371 17137 8911 -7684 -21835
759 -21835 -21509 -2883 7580 9162 7490 6379 -7502 -8549 -12138 -17873 -4595 408 4955 6579
745 6579 8209 13171 5843 546 10010 -4385 -19802 -18261 -3558 10924 -4450 -8736 -8683 2355
731 2355 14636 4732 -15217 -29653 -19378 -8926 -5931 -10560 -2892 15306 17593 1282 -11498
718 -11498 -21219 -21787 -12596 -5255 8292 2506 3891 3192 12516 21434 13769 13205 9510 -6707 -26563
703 -26563 -20897 -8010 -486 -2824 4212 7254 2167 5215 7822 7707 -2535 -13484 -12452 1651
689 1651 1463 -9215 -973 269 1378 -720 4631 -848 -10504 -8161 -7929 -12329 -19161 -23465 -8332
674 -8332 2723 3911 9386 5969 3472 5744 2501 3966 -4609 -6033 -5075 -22341 -27737 -25970 1209
659 1209 1906 3939 2092 -8209 -16565 -13246 784 10613 9117 2511 -13208 -22392 -8315 3366
645 3366 2149 -9702 -17945 -18695 -12132 -4587 -6451 -3749 925 -1529 -6919 -4372 3705 13043 12938
630 12938 13710 1206 -20806 -11424 714 18216 15042 16498 -350 -4036 -14987 -8008 -829 -6974
616 -6974 -4302 7427 6226 7768 10006 9746 5095 239 923 2359 2157 -1730 1515 -3233 -8833 -844
600 -844 14686 10867 4727 -8381 -8331 -2052 3512 12137 22237 20523 17087 6710 17619 24678 5417
585 5417 -12314 -11941 -6682 -10628 -14556 -4834 1327 3825 9881 7691 7533 11431 9084 7995 20714
570 20714 20524 15983 14045 10284 2546 -3193 -11580 -7695 -16344 -32387 -39462 -18491 -3363 -2936 -744
555 -744 7945 1461 -10946 -9006 -6149 -8941 4376 5597 5299 5724 8972 9668 18823 17694 11262 10135
539 10135 2574 -862 3117 4414 15034 9606 15258 10708 7894 -17277 -21251 -10246 -11961 1499
525 1499 1279 7952 -1349 -3908 -2134 -5453 7559 3618 -3903 -760 2064 -6289 -8245 -3261 1393
510 1393 -3118 -8761 -5925 793 10535 5395 1130 -2343 -15144 -16197 -4690 -5208 216 -13156 -24816
495 -24816 705 644 -7798 -7825 -2809 -3356 -5631 -2189 -7446 -14715 -9571 -3709 -11648 -6420 6093 -3374
479 -3374 -15278 -18151 -15951 -13702 -14895 -10160 -7044 -1850 -7959 121 7360 9019 8621 4102 -6895
464 -6895 -17390 -7632 978 6487 22325 19686 10907 -4876 -7058 2783 3791 4882 2418 4775
450 4775 3339 638 3519 1509 -538 -5718 -1350 6113 -1776 -15220 -29221 -32538 -20651 -12987
436 -12987 -3070 -4644 253 6855 -1651 -4750 -14622 -12594 2151 2771 -8572 2249 4190 -2357
422 -2357 -11673 -8021 -8028 -5795 -4671 2788 1204 -12825 -7849 9502 5454 4563 5186 10693 16869 24486
406 24486 26144 12842 10002 13938 9462 8071 9697 9901 986 -7517 -4980 -2124 9270 21177
392 21177 26157 10012 8100 23072 29591 16433 -1952 -7430 1764 -436 -6461 3576 4273 1520
378 1520 -5882 -15395 -20290 -5722 -432 4598 18942 17279 9797 2712 2275 6652 1305 -11333 -9334
363 -9334 12358 9609 -4841 -7880 -6944 -14934 -20605 -20894 -11859 -7956 -5361 -1467 9285 1306 -2504
348 -2504 -3721 -13919 -3670 5023 2003 7096 8345 7530 5376 -5447 -10425 -2548 -582 3503 15054
333 15054 16678 14114 11483 6509 -2275 -937 -4615 -8644 -9036 -12871 -23828 -19631 -15726 -17293 -11274
318 -11274 -10584 -29222 -41874 -38495 -32801 -24330 -23017 -21392 -17591 -6492 7480 3148 -2128 -1279
304 -1279 -10289 -3329 5975 12682 15267 17397 22077 27884 22490 10533 5711 -3535 -6004 1232 5022
289 5022 5350 3693 7607 14589 10604 -3138 10161 9681 11975 5411 -2169 -3441 858 8209 7604
274 7604 -3838 -15627 -7549 3958 11006 7835 4862 11361 14696 19309 20756 16392 10988 9010
260 9010 1605 1518 3650 231 1369 769 5409 4344 -6706 -9885 -494 9881 13900 18377 4843
245 4843 6931 1716 1867 -6593 -1301 9709 20919 24036 1942 -13929 -3236 8966 18303 15751
231 15751 5034 10237 265 -10918 -27446 -16967 -4027 -8376 -12718 -7079 -12600 -12471 -11027 -15397
217 -15397 -14431 -9420 -7765 -15326 -8703 -11732 -12222 -12617 -2895 2549 -456 -195 6131 4759 -3401 -8100
201 -8100 -7410 -6581 -1907 17340 24643 24776 16971 14705 14914 14708 21605 19487 16322 14476 9883 10593
185 10593 10978 636 -12463 -11552 -9974 -14923 -10760 -5955 1481 -5074 -11197 -16515 -7604 -9381 -5602
170 -5602 -455 9120 4145 -7936 -4514 9598 15514 15318 14434 11634 7174 -6966 -16814 -16346 1535
155 1535 11685 7267 -140 -9906 -8659 -11206 -3259 -8302 -6480 -1148 -7967 -14446 -8144 -1144 -970
140 -970 -11877 -8441 -6136 447 -7735 -9151 -8489 -6737 -13969 -11182 -9104 -2906 -8808 -11215 -7872
125 -7872 1931 2457 1791 -5438 -9366 -12716 -17939 -23666 -25903 -11711 -717 -1268 -9781 -3318 1222
110 1222 816 -4212 3317 6303 6517 10927 23321 19301 12367 16758 25347 18131 7911 257 10027
95 10027 9246 6129 -4952 -16967 -6576 -3575 -7872 279 8015 4019 -941 -4620 -3306 1351 4547
80 4547 7275 14416 15340 12009 10656 9663 10152 2314 4818 7009 10081 14639 11339 5087 -3239 -7800
64 -7800 -12382 -14678 -9373 -4125 -1860 418 1012 -515 7581 3846 1764 9758 8949 3621 -1677 99
48 99 1213 4087 6612 3644 -3729 -9567 -5805 -492 2365 -2100 -6598 -1782 4340 8075 14313 5318
32 5318 -3022 -3247 2787 -152 -1952 -4567 -5802 3261 -163 -4848 -4364 1956 -1019 -5484 -17311 -16674
16 -16674 -12467 -18325 -8686 5004 10210 11107 1727 -3972 -3664 -4089 3448 10368 11255 7885 11208 7872
0 7872
$$ Imaginary data points
##PAGE= N=2
##DATA TABLE= (X++(I..I)), XYDATA
32767 64957 70115 70730 75098 74864 75998 77116 68809 69204 76738 87150 89509 87871 87811 92557 98535
32752 98535 83210 78078 84399 83567 80244 78313 75839 73962 80872 96490 110550 103105 93591 86479
32738 86479 76720 80271 86235 86902 79485 69642 67122 76633 87384 89199 85906 93806 92585 88244
32724 88244 104001 114864 118147 117495 113858 110845 114436 116917 115503 110656 109595 111812 109197 114520
32710 114520 118386 110180 104971 114326 115656 116884 118285 110036 110940 113259 111126 121868 122775 124042
32696 124042 126558 123360 125363 125965 121509 113397 115781 127263 130852 141858 140596 129022 130698 129276
32682 129276 122213 124497 127595 130763 134868 138742 138021 138038 138970 132909 119063 120675 121582 120843 124849
32667 124849 124632 127661 127139 130072 128111 122793 136277 149117 145750 139219 138538 138048 135583 140908 146605
32652 146605 151226 148100 149485 151850 145018 150140 148171 153628 155001 144541 136942 135675 141831 142351
32638 142351 153246 152516 142807 145711 155133 151057 157698 165510 171237 166223 174605 183367 186233 173948
32624 173948 158797 168220 168885 172141 175113 173280 173497 168892 163607 157669 158584 166623 174310 184517
32610 184517 183184 175746 166752 165623 166286 162063 163975 168730 166391 168194 175929 177592 176947 180928 180958
32595 180958 187338 195411 187269 177565 179491 182034 181792 182548 184696 186447 193074 196123 198673 206512 207570
32580 207570 207644 205855 208743 220406 216294 206446 193524 197365 194785 184193 174828 163565 162385 164409
32566 164409 174132 184464 192927 193538 197401 205981 211259 217993 208901 192729 192221 191084 188028 187508
32552 187508 191152 186478 183764 181758 194338 208257 213536 213365 205043 205214 206573 222418 225824 225960
32538 225960 229389 218030 220285 216930 217086 209440 210250 209164 215302 220809 230479 238933 227863 209727
32524 209727 203102 193539 194379 203393 199891 195705 195503 195150 198165 207819 207438 216324 217663 214695 218288
32509 218288 216763 217004 216541 204116 200385 195760 205219 201443 207409 204156 206621 203421 205414 216557
32495 216557 223485 229620 219473 213238 221982 221278 214513 212941 216776 214074 220303 232880 236006 236988
32481 236988 225597 217134 223608 235177 226429 216243 207859 200361 205484 217620 233077 236126 234032
32468 234032 239979 246289 247415 250772 253952 259906 268108 261896 261675 265044 258741 249167 238207 230424
32454 230424 231747 240309 253628 253942 243747 231113 225164 228769 242991 237505 231997 222306 216997
32441 216997 219189 227559 232218 242301 245701 243595 251506 253719 250870 252616 267297 263502 253632 257922
32427 257922 261406 257350 259323 255147 253793 252876 248185 242208 236895 237152 237287 246946 244534 250375 266452
32412 266452 265455 264313 256540 253347 249822 252447 249958 241951 239685 249577 261014 256749 262054 256721
32398 256721 264698 270457 269839 262299 261667 254902 255985 255259 250789 252551 253350 259025 256424 248435 255948
32383 255948 258889 250911 247847 240092 240561 243078 243404 253919 263131 263644 251320 240267 242023 247617
32369 247617 261016 254260 262655 268461 279201 266453 274969 287451 284150 270402 266294 278209 278247
32356 278247 280688 280075 260456 258620 265237 265816 265387 268011 279690 284308 270357 264598 262256 253945
32342 253945 257231 257003 267746 264873 272989 278878 283819 283732 280072 282515 285917 281734 275770 271399 274719
32327 274719 279432 266992 279998 283799 272639 266862 265671 261204 261453 259466 262410 271255 278724 287814
32313 287814 286172 295676 301999 298504 288061 282171 289193 297949 292196 285764 269786 265582 257815 261700
32299 261700 264753 258618 259011 264612 264675 250624 256850 262659 269267 261580 266759 262073 257436 275536
32285 275536 296019 302362 287003 280286 282621 272809 260098 267235 271076 269488 268588 275811 272131 273094
32271 273094 288105 297407 291353 304816 308302 297192 296324 288680 274649 274652 282247 296754 297108 298926
32257 298926 302112 297773 292373 282109 265266 269135 268332 265227 260004 247941 250765 265743 292044
32244 292044 281204 278904 278857 271917 279935 285675 288634 282418 278036 277009 285339 292368 282530 278387
32230 278387 281659 281823 275565 263810 264730 280968 276613 271033 275827 284605 285719 281343 277379 283123
32216 283123 290563 281157 275774 276501 276275 286705 283648 282764 281411 277827 276689 280233 284869 271970
32202 271970 249951 258533 265310 270652 273635 280296 277978 273776 283762 291504 280446 274918 282316 284048
32188 284048 274857 273414 291565 299877 291999 290857 296486 287406 284859 287252 275078 283709 303881
32175 303881 296926 295744 303603 309277 293537 287603 289610 295390 294917 284950 275326 272563 283346 300380
32161 300380 304098 309088 285819 274449 292269 290010 294252 313593 314438 307083 299455 288237 285939
32148 285939 290306 297605 273910 255438 257102 274458 287630 282340 289581 290048 280510 285407 283223
32135 283223 279578 284617 275148 271216 267725 268741 269464 264981 271240 283403 287433 285522 289507 291757
32121 291757 286000 272813 284805 285278 272677 273741 282246 278437 293805 298261 289671 283252 279149
32108 279149 289498 301912 309569 299553 284894 297158 294760 288921 285657 295588 291949 279346 269797
32095 269797 281967 280586 270041 272773 281070 290381 286079 288172 293420 300408 300221 305340 286881 278112
32081 278112 281697 273815 260786 260830 259105 288248 298667 306111 297753 284591 280898 282071 288687 287668
32067 287668 279933 283329 291385 280870 270065 267270 276454 285951 280422 283681 291325 295598 285395
32054 285395 271388 251657 252054 267043 266996 266754 279472 286562 294486 292257 290654 280562 288699 296072
32040 296072 305000 312141 303462 283671 280569 298208 303949 301425 290573 283047 284998 276706 283474
32027 283474 292886 311334 322415 333422 332612 313625 305621 307198 300233 286038 273160 262969 272141
$$ [...]
##END NTUPLES=NMR SPECTRUM
##END=
