##TITLE=Analysis number 328555
Compound Code cc 49509
Book Reference 486/158
Project Code adrs
Chemist Name simons
##JCAMPDX= 6.0         $$ Bruker NMR JCAMP-DX V2.0
##DATA TYPE= NMR SPECTRUM
##DATA CLASS= NTUPLES
##ORIGIN= Bruker BioSpin GmbH
##OWNER= nmr
$$ XWIN-NMR		Version 3.5
$$ Fri Jun 15 10:13:07 2007 GMT Daylight Time (UT+1h)  MAYBRIDGE\nmr@NMR_250MHZ
##.OBSERVE FREQUENCY= 250.131544655141
##.OBSERVE NUCLEUS= ^1H
##.ACQUISITION MODE= SIMULTANEOUS (DQD)
##.ACQUISITION SCHEME= undefined
##.AVERAGES= 16
##.DIGITISER RES= 18
##SPECTROMETER/DATA SYSTEM= dpx250
##.PULSE SEQUENCE= zg30
##.SOLVENT NAME= CDCl3
##.SHIFT REFERENCE= (INTERNAL, CDCl3, 0, 16.4538)
##AUDIT TRAIL= $$ (NUMBER, WHEN, WHO, WHERE, WHAT)
$$ ##TITLE= Audit trail, XWIN-NMR		Version 3.5
$$ ##JCAMPDX= 5.01
$$ ##ORIGIN= Bruker BioSpin GmbH
$$ ##OWNER= nmr
$$ C:\u/data/dgb/nmr/ADRS/970/pdata/1/auditp.txt
$$ ##AUDIT TRAIL=  $$ (NUMBER, WHEN, WHO, WHERE, WHAT)
(   1,<2007-06-15 10:12:34.66 +100>,<MAYBRIDGE\nmr>,<NMR_250MHZ>,
      <created by zg, POWCHK disabled, PULCHK disabled
       configuration hash MD5:
       76 6E 9A 78 1E 09 19 81 EC 84 63 8F B0 6A 59 2D
       data hash MD5: 64K
       8C C5 E6 6A 8A AF 16 32 BB 4F B5 1E CF A5 4A 2D>)
(   2,<2007-06-15 10:12:56.42 +100>,<MAYBRIDGE\nmr>,<NMR_250MHZ>,
      <Start of raw data processing
       ef LB = 0.3 FT_mod = 6 PKNL = 1 SI = 32K 
       data hash MD5: 32K
       FC 85 C9 0C 15 75 B9 50 B7 EA B8 F3 A9 D4 A7 E0>)
(   3,<2007-06-15 10:12:58.39 +100>,<MAYBRIDGE\nmr>,<NMR_250MHZ>,
      <apk 
       data hash MD5: 32K
       C1 E6 41 AA 0E EF 3F 38 5D 93 E0 BE 7C 40 C8 20>)
(   4,<2007-06-15 10:12:59.30 +100>,<MAYBRIDGE\nmr>,<NMR_250MHZ>,
      <abs ABSG = 5 
       data hash MD5: 32K
       7A 7A C3 73 F7 1C C8 C2 73 A0 E6 17 A5 C2 FC 1E>)
$$ ##END=
$$ 
$$ hash MD5
$$ D8 F3 2C 09 1C 8B FD BD 1E 6C 07 18 BC E6 FD D1
##$RELAX= 
##$RELAX= 
##$RELAX= 
##$RELAX= 
##$RELAX= 
##$RELAX= 
##$RELAX= 
$$ Bruker specific parameters
$$ --------------------------
##$DU= <C:\u>
##$EXPNO= 970
##$NAME= <ADRS>
##$PROCNO= 1
##$TYPE= <nmr>
##$USER= <dgb>
##$AMP= (0..31)
100 100 100 100 100 100 100 100 100 100 100 100 100 100 100 100 100 100 
100 100 100 100 100 100 100 100 100 100 100 100 100 100 
##$AQSEQ= 0
##$AQ_mod= 3
##$AUNM= <au_zg>
##$AUTOPOS= <7 >
##$BF1= 250.13
##$BF2= 250.13
##$BF3= 250.13
##$BF4= 250.13
##$BF5= 500.13
##$BF6= 500.13
##$BF7= 500.13
##$BF8= 500.13
##$BYTORDA= 1
##$CFDGTYP= 0
##$CFRGTYP= 5
##$CHEMSTR= <none>
##$CNST= (0..31)
1 1 145 1 1 1 1 1 1 1 1 1 1 1 1 1 1 1 1 1 1 1 1 1 1 1 1 1 1 1 1 1 
##$CPDPRG= <>
##$CPDPRG1= <>
##$CPDPRG2= <>
##$CPDPRG3= <>
##$CPDPRG4= <mlev>
##$CPDPRG5= <mlev>
##$CPDPRG6= <mlev>
##$CPDPRG7= <mlev>
##$CPDPRG8= <mlev>
##$CPDPRGB= <>
##$CPDPRGT= <>
##$D= (0..31)
0 1 0 0 0 0 0 0 0 0.06 0 0 0 0 0 0 0.0002 0 0 0 0 0 0 0 0 0 0 0 0 0 0 
0 
##$DATE= 1181898753
##$DBL= (0..7)
120 120 120 120 120 120 120 120 
##$DBP= (0..7)
150 150 150 150 150 150 150 150 
##$DBP07= 0
##$DBPNAM0= <>
##$DBPNAM1= <>
$$ [...]
##$SUBNAM7= <"">
##$SUBNAM8= <"">
##$SUBNAM9= <"">
##$SW= 20.6930455092707
##$SWIBOX= (0..15)
0 0 3 0 0 0 0 0 0 0 0 0 0 0 0 0 
##$SW_h= 5175.983436853
##$TD= 65536
##$TD0= 1
##$TE= 297.16
##$TE2= 300
##$TE3= 300
##$TEG= 300
##$TL= (0..7)
0 120 120 120 120 120 120 120 
##$TP= (0..7)
150 150 150 150 150 150 150 150 
##$TP07= 0
##$TPNAME0= <>
##$TPNAME1= <>
##$TPNAME2= <>
##$TPNAME3= <>
##$TPNAME4= <>
##$TPNAME5= <>
##$TPNAME6= <>
##$TPNAME7= <>
##$TPOAL= (0..7)
0.5 0.5 0.5 0.5 0.5 0.5 0.5 0.5 
##$TPOFFS= (0..7)
0 0 0 0 0 0 0 0 
##$TUNHIN= 0
##$TUNHOUT= 0
##$TUNXOUT= 0
##$USERA1= <user>
##$USERA2= <user>
##$USERA3= <user>
##$USERA4= <user>
##$USERA5= <user>
##$V9= 5
##$VALIST= <valist>
##$VCLIST= <CCCCCCCCCCCCCCC>
##$VD= 0
##$VDLIST= <DDDDDDDDDDDDDDD>
##$VPLIST= <PPPPPPPPPPPPPPP>
##$VTLIST= <TTTTTTTTTTTTTTT>
##$WBST= 1024
##$WBSW= 4
##$XGAIN= (0..3)
0 0 0 0 
##$XL= 0
##$YL= 0
##$YMAX_a= 407868
##$YMIN_a= -475817
##$ZGOPTNS= <>
##$ZL1= 120
##$ZL2= 120
##$ZL3= 120
##$ZL4= 120
##$ABSF1= 16.45375
##$ABSF2= -4.239422
##$ABSG= 5
##$ABSL= 3
##$ALPHA= 0
##$AQORDER= 0
##$ASSFAC= 0
##$ASSFACI= 0
##$ASSFACX= 0
##$ASSWID= 0
##$AUNMP= <proc_1d>
##$AZFE= 0.1
##$AZFW= 0.1
##$BCFW= 0
##$BC_mod= 0
##$BYTORDP= 0
##$COROFFS= 0
##$CY= 12.5
##$DATMOD= 1
##$DC= 0
##$DFILT= <>
##$DTYPP= 0
##$F1P= 14.0000005364418
##$F2P= -0.99999901652339
##$FCOR= 0.5
##$FTSIZE= 32768
##$FT_mod= 6
##$GAMMA= 0
##$GB= 0
##$INTBC= 1
##$INTSCL= 1
##$ISEN= 128
##$LB= 0.3
##$LEV0= 0
##$LPBIN= 0
##$MAXI= 10000
##$MC2= 0
##$MEAN= 0
##$ME_mod= 0
##$MI= 0
##$NCOEF= 0
##$NC_proc= -2
##$NLEV= 6
##$NOISF1= 0
##$NOISF2= 0
##$NSP= 0
##$NTH_PI= 0
##$NZP= 0
##$OFFSET= 16.45375
##$PC= 1
##$PHC0= -54.69593
##$PHC1= 5.927472
##$PH_mod= 1
##$PKNL= yes
##$PPARMOD= 0
##$PSCAL= 4
##$PSIGN= 0
##$REVERSE= no
##$SF= 250.130017068812
##$SI= 32768
##$SIGF1= 0
##$SIGF2= 0
##$SINO= 400
##$SIOLD= 32768
##$SREGLST= <1H.CDCl3>
##$SSB= 0
##$STSI= 32768
##$STSR= 0
##$SW_p= 5175.98343685301
##$SYMM= 0
##$S_DEV= 0
##$TDeff= 65536
##$TDoff= 0
##$TI= <Analysis number 999999
Compound Code 99
Book Reference 9
Project Code 9>
##$TILT= no
##$TM1= 0
##$TM2= 0
##$TOPLEV= 0
##$USERP1= <user>
##$USERP2= <user>
##$USERP3= <user>
##$USERP4= <user>
##$USERP5= <user>
##$WDW= 1
##$XDIM= 32768
##$YMAX_p= 396397869
##$YMIN_p= -135901
$$ End of Bruker specific parameters
$$ ---------------------------------
##NTUPLES= NMR SPECTRUM
##VAR_NAME=  FREQUENCY,     SPECTRUM/REAL,   SPECTRUM/IMAG
##SYMBOL=    X,             R,               I
##VAR_TYPE=  INDEPENDENT,   DEPENDENT,       DEPENDENT
##VAR_FORM=  AFFN,          ASDF,            ASDF
##VAR_DIM=   32768,         32768,           32768
##UNITS=     HZ,            ARBITRARY UNITS, ARBITRARY UNITS
##FACTOR=    0.157963299565203, 1,           1
##FIRST=     4115.57692101321, 0,            0
##LAST=      -1060.4065158398, 0,            0
##MIN=       -1060.4065158398, -135901,      0
##MAX=       4115.57692101321, 396397869,    0
$$ Real data points
##PAGE= N=1
##DATA TABLE= (X++(R..R)), XYDATA
$$ [...]
17013A0320n341l149N67J1981n695j5201j0361m185l199m98J1091j03n42O693
16999g622l52l121J049j17o449M103J0374k561p286j739k914K424k6q263k468
16984b4968O272J092n586M025O223R829P766r38n815L822j602j6828J0299O929
16970E20q154N013P448p579k784m017J0960J1712l144j3232k228N431J5286N958
16956B1190j0355k1744j5321pK471J4610R737N653k195m203o761Q184J0416o307
16942E368r747Q96q95O350O454O630n688m763p963K468k423K772L131M008p260
16927f62k904M051q223o093N490J1026L139p358m757M015n322L466N080P927k941
16912E934q419j300p13k893j208j2625o01L091J0308L088K360J082J1394Q89r341
$$ plain form
17013 10320 4979 1830 2397 14378 8683 -6518 -16879 -21064 -24263 -24761 -13670 -13773 -14315 -7622
16999 -7622 -7974 -11095 -10046 -10163 -16612 -12509 -2135 -4696 -11982 -13721 -16635 -14211 -14237 -22500 -24968
16984 -24968 -18696 -17604 -23190 -19165 -12942 -3113 4653 3715 -2100 1722 120 -16708 -6409 520
16970 520 -7634 -2621 4827 -2752 -5536 -9553 1407 13119 9975 -3257 -5485 -54 15232 21190
16956 21190 10835 -10909 -26230 -26237 -23766 -9156 581 6234 4039 -164 -6925 1259 11675 5368
16942 5368 -4379 -3483 -4378 1972 8426 15056 9368 4605 -3358 -890 -3313 -541 2590 6598 -662
16927 -662 -3566 485 -7738 -13831 -8341 2685 5824 -1534 -6291 -2276 -7598 -4132 948 8875 5934
16912 5934 -2485 -3785 -4498 -7391 -8599 -21224 -21825 -18734 -8426 -5338 -2978 -1896 9498 10387 1046
16897A046j9394M227Q420Q327m016j2016O940N699K224j6817r445N320j469j308
16883b2262J0926J0766M629m20j406l045n365k963Q319j611p740l247l325L083
16869a3661P080m648R067N913K745M477o2J656Q087J3818N739K2001K0401P840
16855I0453o048o304j2928k1263m885j0908j301j4552o326R434J1106Q046n174
16842B9350Q201N198L18M320P397N102j194j6838j8211j4459N842L161M425j4871
16828G741j0833j3514r547J334P58J2181M949j1922l300K124M858M190J5623j9
16814D623j0283j249P645J557J38J385R078k979r225K558M850j2442o648l252
16800a4244M890j237k146J2195J5675J1593K469l103n857r612q215r306L091Q536
$$ plain form
16897 1046 -18348 -14121 -5701 2626 -1390 -13406 -6466 -767 1457 -15360 -24805 -19485 -20954 -22262
16883 -22262 -11336 -570 4059 3639 2233 -812 -6177 -9140 -821 -2432 -10172 -13419 -16744 -13661
16869 -13661 -6581 -11229 -2162 3751 6496 10973 10911 12567 20654 34472 40211 62212 82613 90453
16855 90453 84405 78101 65173 43910 39025 28117 26816 12264 5938 15372 26478 34524 29350
16842 29350 37551 42749 43067 47387 54784 59886 58692 41854 23643 9184 15026 18187 22612 7741
16828 7741 -3092 -16606 -26153 -24819 -24061 -11880 -6931 -18853 -22153 -20029 -15171 -10981 4642 4623
16814 4623 -5660 -6909 736 2293 2431 3816 12894 9915 690 3248 8098 -4344 -10992 -14244
16800 -14244 -9354 -10591 -12737 -542 15133 26726 29195 26092 20235 10623 2408 -6898 -3807 4729
16786D729M208L428k648O968J58q813l624n251n569J2728Q979n502j6697p164
16772a4070L562J0553l377j0206J444j137O457k185N376Q324J162p119M630N352
16758H766r92o881J145j8813p857J7489Q307J2282L937j1213n704O461l798J35
16744C264l297r499l606Q69L943K613P292M8J4137O646r019j8131K865J1314J689
16729A1128l602p840J1094M205K599m471n051Q052J5040P536K9758M3074N0977
16716A62499M0588J1421o903k3216n2811l9415j4347k0393j1404j5291l305N361
16704C2784M1790L8114L5156K9312L2802k10n720l7156n3789l5020j5822k0925
16692D1316j6341j2220j856m906q92q477j2440m188l598M369J0099K4009J991
$$ plain form
16786 4729 8937 12365 9717 16685 16843 8030 4406 -845 -6414 6314 15293 9791 -6906 -14070
16772 -14070 -10508 45 -3332 -13538 -12094 -13231 -6774 -8959 -3583 4741 5903 -1216 3414 8766
16758 8766 7774 893 2038 -16775 -24632 -7143 1164 13446 17383 6170 466 6927 3129 3264
16744 3264 -33 -9532 -13138 -12269 -8326 -5713 1579 1627 15764 22410 13391 -4740 -1875 9439 11128
16729 11128 7526 -314 10780 14985 17584 13113 8062 16114 31154 38690 68448 111522 162499
16716 162499 203087 214508 207605 184389 131578 92163 77816 57423 46019 30728 27423 32784
16704 32784 74574 112688 147844 177156 209958 209748 204028 166872 113083 78063 62241 41316
16692 41316 24975 12755 10899 5993 5101 -3376 -15816 -20004 -23602 -19233 -9134 14875 16866
16679A6866r687o319o152P587Q843J599j7495p882M274k86q512M315L82J108L842
16664g517J695o886j198R633n30l68M633p40N988J6261K962m534o562K381R816
16649B5034n01j0303J484J419p321j3770J855O106K347m125r202m365j0764J2235
16635i871Q056n56m776R855O493K665o243K696N631J845j0371j2123P387L131
16621C819m529j301N205J3142n465l96M950q685n830j807n725J77m29N954J4434
16606A3514m214L038L187p41n406J41p89j9000L41J0625j474q327m610m74o851
16591b1040Q974n46pQ90j511j931L58rO168R030j351j057Q032J5676J104j5780
16575G000L390q711m777J821p706j80M541R401j0722n447J979j0476j0123J0171
$$ plain form
16679 16866 7179 860 -5292 2295 11138 12737 -4758 -12640 -8366 -8652 -17164 -12849 -12467 -11359 -7517
16664 -7517 -5822 -12708 -13906 -4273 -4803 -5171 -538 -1278 4710 20971 23933 19399 12837 15218 25034
16649 25034 24533 14230 15714 17133 9812 -3958 -2103 4003 6350 2225 -6977 -11342 -22106 -9871
16635 -9871 -1815 -2371 -7147 2708 9201 11866 5623 8319 13950 15795 5424 -6699 688 3819
16621 3819 -710 -2011 3194 16336 10871 10475 15425 6740 910 -897 -6622 -6445 -6874 -920 13514
16606 13514 9300 12338 15525 14784 9378 9519 8730 -10270 -9929 696 -778 -9105 -13715 -14189 -21040
16591 -21040 -12066 -12612 -12619 -11729 -13240 -15171 -14813 -14822 -8654 376 -975 -2032 6000 21676 22780 7000
16575 7000 10390 1679 -3098 -1277 -8983 -9163 -4622 4779 -5943 -11390 -9411 -19887 -30010 -19839
16561a9839J7635o523m172P337J1928N414J405j1269j043j209o861L424L951l374
16547c196l733j073n419R527N826k192Q704o191q905l661j572l989n522l89O565
16532a5220N656m843j29J3086R786N289k707j6640o992J555O41M794o32J583L440
16517a333l074o739n959R590K401j625N96P404l170N811P215l657r137k814J813
16502b678l274m431k513O135O242K280p002O617J5290N465q837o349J930k00l884
16487D791N059k054m188j0398n209P961O306p215k063P976M886o357l346J2427
16473H576R686j0427q919o556j0138j409Q112n584j3820o407O010O711m090j843
16459c0098P835k183K075m765o06R935R628N341Q548P091o6r886L504J1440J914
$$ plain form
16561 -19839 -2204 -8727 -12899 -5562 6366 11780 13185 1916 873 -336 -7197 -3773 178 -3196
16547 -3196 -6929 -8002 -13421 -3894 1932 -260 8444 2253 -6652 -10313 -11885 -15874 -21396 -21785 -15220
16532 -15220 -9564 -14407 -14536 -1450 8336 13625 10918 -5722 -12714 -11159 -10518 -5724 -6356 -4773 -1333
16517 -1333 -4407 -11146 -17105 -7515 -5114 -6739 -6143 1261 -1909 3902 11117 7460 -1677 -4491 -2678
16502 -2678 -5952 -10383 -12896 -6761 -519 1761 -5241 1376 16666 22131 13294 6945 8875 8675 4791
16487 4791 9850 7796 3608 -6790 -11999 -4038 2268 -4947 -7010 966 5852 -505 -3851 8576
16473 8576 18262 7835 -1084 -7640 -17778 -19187 -11075 -16659 -30479 -36886 -30876 -24165 -28255 -30098
16459 -30098 -22263 -24446 -22371 -27136 -27742 -17807 -8179 -2838 5710 12801 12735 2849 6353 17793 19707
16444A9707j0658q127m526j220M265R163R073L143j2157j1032o861O10L226N892
16430D98P505O755k774n767R242m805j290l626q754j1893N691O000P089q778l813
16415h720L71m580j1720m747J2068J732q418J998J3542n87n640K064k073P176
16401g534J4216k234r765k440L677p644o604N69O573k386l540m373k378m999K652
16386b6210P773R802n715p378N72n336M674R877R670J1690r230j7850N281k199
16372a4579j050k696J889O451l993q515L258O766k41n745N692J5857J2785n53
16358A5326J731l501q380j522p355l292j434j560j3150j203N81M868k622N738
16344a5775P957J9192O598m369j5992m814l474l896M529R899l464j1992L862o860
$$ plain form
16444 19707 9049 922 -3604 -4824 -559 8604 17677 20820 8663 -2369 -9230 -8620 -5394 498
16430 498 8003 14758 11984 6217 15459 10654 9364 5738 -3016 -14909 -9218 -3218 3871 -4907 -8720
16415 -8720 -8349 -12929 -24649 -29396 -17328 -15596 -24014 -22016 -8474 -9061 -14701 -12637 -14710 -7534
16401 -7534 6682 4448 -5317 -7757 -4080 -11724 -18328 -17759 -11186 -13572 -17112 -21485 -23863 -28862 -26210
16386 -26210 -18437 -8635 -14350 -21728 -21156 -26492 -21818 -11941 -2271 9419 189 -17661 -12380 -14579
16372 -14579 -15629 -18325 -16436 -9985 -13978 -22493 -19235 -12469 -12710 -18455 -12763 3094 15879 15326
16358 15326 17057 13556 5176 3654 -3701 -6993 -8427 -9987 -23137 -24340 -23759 -18891 -21513 -15775
16344 -15775 -7818 11374 17972 13603 -2389 -7203 -10677 -14573 -10044 -145 -3609 -15601 -11739 -18599
16330a8599o928Q923J2798M392j125l482J336J2163N850j2792r409J2153m405
16317H75l635q281n095k484K642N759O108N465K823O034j004j3540L66q998m888
16302a7853L870J2662r206M214P289J1444J517j2873r59K779o569m532Q084J3067
16288A2934q3k3307j1168k099J2257L906J5965K67j2314j1103k672J5Q120O071
16274c211K402r670r235J304P107J539O173j691j300N721p256j2678k521L688
16260a9628K399K571R237O889J3224n183k497O183q474n54P376Q569K936m790
16246A8258j0769j4861n376j913m920l43L013J0599N019J906P781K069o784M558
16232H237R782O24m546p106j2343L415K314n076J2316p59j1232p573R768J241
$$ plain form
16330 -18599 -25527 -16604 -3806 586 -539 -4021 -2685 9478 15328 2536 -6873 5280 875
16317 875 -2760 -11041 -16136 -18620 -15978 -10219 -4111 1354 4177 10211 9207 -4333 -3967 -12965 -17853
16302 -17853 -13983 -1321 -10527 -6313 976 12420 13937 1064 105 2884 -3685 -8217 -133 12934
16288 12934 12851 -10456 -21624 -23723 -11466 -7560 8405 8672 -3642 -14745 -17417 -17402 -9282 -3211
16274 -3211 -809 -10479 -19714 -18410 -11303 -9764 -3591 -5282 -6582 -861 -8117 -20795 -23316 -19628
16260 -19628 -17229 -14658 -5421 1468 14692 9509 7012 13195 4721 4167 11543 20112 23048 18258
16246 18258 7489 -7372 -12748 -14661 -19581 -19924 -16911 -6312 -1293 613 8394 10463 3679 8237
16232 8237 18019 18643 14097 6991 -5352 -1937 377 -4699 7617 6858 -4374 -11947 -2179 -938
16218i38m482J68K407J621p6M585l954o54P426L928R401j2957j2414J745J834
16203b360j0990J0046J6312O82l759l436p11k421P450o829j0455K290L315M530
16189C664l387p891m809J512N490n193r129q6J0722k884l600J1115N192m527P580
16174C769p960N779J816k77l371K066l930J53O428N4j094n194p538j207R254O804
16158E552K722K030m717J062M368j4223k883p96p790n435r352Q746J9586P298
16144F168r34l367o937k662K930j286Q890m257j2037j2196k591J3407J7624K893
16130E645k879o154m371J406j1044j544P135O257j291l657k043R701O550j7891
16116a4180L361O159m383k979m694o015J200L281Q934J2957J983p760n948J123
$$ plain form
16218 -938 -5420 -5252 -2845 -1224 -1300 3285 -669 -1323 6103 10031 19432 6475 -5939 -4194 -2360
16203 -2360 -13350 -3304 13008 13690 9931 6495 5784 3363 10813 3984 -6471 -4181 -866 3664
16189 3664 277 -7614 -12423 -10911 -5421 -10614 -19743 -19829 -9107 -11991 -15591 -4476 716 -3811 3769
16174 3769 -4191 1588 3404 3127 -244 1822 -2108 -1955 4473 4527 3433 -1761 -9299 -10506 -1252 5552
16158 5552 8274 10304 5587 6649 11017 -3206 -6089 -6885 -14675 -20110 -29462 -20716 -1130 6168
16144 6168 5234 1867 -5070 -7732 -4802 -6088 2802 -1455 -13492 -25688 -28279 -14872 2752 5645
16130 5645 2766 -3388 -7759 -6353 -17397 -18941 -11806 -5549 -6840 -10497 -12540 -2839 3711 -14180
16116 -14180 -10819 -4660 -9043 -12022 -16716 -22731 -21531 -18250 -9316 3641 5624 -2136 -8084 -6961
16102f961J057O465J404j564n129N987J841j1965p671J267Q805J2561j449j884
16088B764q748m385J176o717r61n672R131M843J4019O641o004L004n716r115k008
16073g748L080Q401j3895n968n7L855q85J983O551N970p421J560l124R224o67
16058H59j7151p950K344J2270J5592K374L26O658L877K045r161p877M131J1086
16044A9423P99q542o563K279m907l054O764N525m775o535K64o317n985M393R40
16029f291P107L988k118K523M273q412n968J305l829j1387j1271N022K0220N507
16015F69j269L555M37K05O407m552j5131m96n12J0186J062l81q485N279J2500
16000I474p331K376J2523k100o146k469J2822P007q619q873q687P500P709L233
$$ plain form
16102 -6961 -5904 561 1965 401 -4728 1259 3100 -8865 -16536 -15269 -6464 6097 4648 2764
16088 2764 -5984 -10369 -9193 -15910 -16871 -22543 -13412 -8569 5450 12091 6087 9091 3375 -5740 -7748
16073 -7748 -4668 3733 -10162 -16130 -16187 -12332 -13217 -11234 -4683 1287 -6134 -4574 -7698 1526 859
16058 859 -16292 -24242 -21898 -9628 5964 8338 8664 15322 19199 21244 12083 4206 8337 19423
16044 19423 20222 11680 5117 7396 2489 -565 6199 11724 6949 414 678 -5639 -11624 -7231 -6291
16029 -6291 816 4804 2686 5209 9482 1070 -4898 -3593 -7422 -18809 -30080 -25058 -4838 669
16015 669 -600 2955 3392 3597 10004 5452 -9679 -10175 -10687 -501 561 180 -8305 -3026 9474
16000 9474 2143 4519 17042 14942 8796 6327 19149 26156 17537 8664 -23 7477 15186 18419
15986A8419k287j602o341q728q291J3942Q055j695N208K400J286j0535p945L677
15972E563M508j0957j159m030j0802K222J0215Q260J1805N519o679m379m964j609
15958C513k797r792j1390Q047n278j0044M109R897J551Q391O589n526j1968M529
15944a0169j773k514M047L397L723j0474J500Q325O277o092p143O34o430k766
15930a9458P551J4656J87n985L833k822m862M619N144K962j5188M749J3041P485
15916A5912j9662j6615N397Q598r23n375m50M641L599J0101P818M742L040j1967
15902H856o452m784j955L631o812K72L646l004J752J2025J1603j0509p302p413
15888f446r353o07J74P596P300n638K452M869K545k361j1976j470J853J4147Q657
$$ plain form
15986 18419 16132 14530 8189 -539 -8830 5112 13167 11472 16680 19080 20366 9831 1886 5563
15972 5563 10071 -886 -2045 -6075 -16877 -14655 -4440 3820 15625 21144 14465 10086 5122 3513
15958 3513 716 -9076 -20466 -12419 -17697 -27741 -23632 -13735 -12184 -3793 2796 -2730 -14698 -10169
15944 -10169 -11942 -14456 -10409 -7012 -3289 -13763 -12263 -3938 2339 -3753 -10896 -10262 -16692 -19458
15930 -19458 -11907 2749 2936 -3049 784 -2038 -6900 -2281 2863 5825 -9363 -4614 8427 15912
15916 15912 -3750 -20365 -14968 -6370 -7293 -12668 -13118 -8477 -4878 5223 13041 17783 20823 8856
15902 8856 2404 -2380 -4335 -704 -7516 -7244 -3598 -6602 -4850 7175 18778 8269 967 -6446
15888 -6446 -15799 -16406 -16232 -8636 -1336 -6974 -4522 347 2892 531 -11445 -12915 -11062 3085 11742
15873A1742n696j5335p841k023K687J6387N137n164k427P766j693K855N504n451
15859F448q857K895j576l493N289n773L029J8388M671j5276n003K051l355k07
15845g69j911O818L103p976m273J437L991j0423p981m642J6253J9382M411j4640
15831B780o249L201R203L426o820m100P493p856j3202j0635R256k391l547P557
15817a1884M966J0134R222l232K808Q383j865j3261o150N158k21o810n203P837
15803a18J17K089j769J132k46n383p843p261r246P673O601o807m249M941M835
15788a5534l970O174K734l590N651L807p72p68n22l716N342J1785k216k04K147
15773F348j535q028J3930P31j212K04j0584Q84N749M785j1080L727n714r375j768
$$ plain form
15873 11742 6046 -9289 -17130 -19153 -16466 -79 5058 -106 -2533 5233 3540 6395 11899 6448
15859 6448 -2409 486 -1090 -4583 706 -5067 -2038 16350 21021 5745 742 2793 -562 -769
15845 -769 -2680 4138 7241 -735 -5008 -3571 420 -10003 -17984 -22626 -6373 13009 17420 2780
15831 2780 -3469 -268 8935 12361 5541 1441 8934 1078 -12124 -22759 -13503 -15894 -19441 -11884
15817 -11884 -6918 3216 12438 9206 12014 20397 18532 5271 -879 4279 4058 -2752 -7955 -118
15803 -118 -1 2088 319 1451 1205 -4178 -12021 -19282 -28528 -20855 -14254 -21061 -25310 -20369 -15534
15788 -15534 -19504 -13330 -10596 -14186 -8535 -4728 -5500 -6268 -6790 -10506 -5164 6621 4405 4201 6348
15773 6348 4813 -3215 10715 11446 10234 10438 -146 738 6487 11272 192 3919 -1795 -11170 -12938
15758a2938J2880J6601m482l622O2j0603o154M667Q155L111n333m236l736P600
15744A972o543P071J0985l531j225J362k438o993l584l258M834n08M147K755p828
15729b782K56M752P296O300M345O502j0785l120n746n89L24k696O836p67j1054
15714i28j438L146Q867l255l550m265l864K931p681p466N843j369O42N745Q349
15699A707O533M082j324m207l361m144k940n449m985R017J877n003P977J33j190
15684a277K340n665J885r35K905N177M069j406M985L39o030n520R351n77o58p43
15668H240o637L354o830j0722J0967J1074L515L960N643O23n948r581P9j338o334
15653F5M207O536N515M491j727j5861R59O367M999l716o772k001l901k37J026
$$ plain form
15758 -12938 -58 16543 12061 8439 8501 -2102 -8256 -3589 4566 7677 2344 -1892 -5628 1972
15744 1972 -4571 2500 13485 9954 8729 10091 7653 660 -2924 -6182 -1348 -1856 2291 5046 -2782
15729 -2782 -2526 2226 9522 15822 20167 26669 15884 12764 7018 6429 6753 4057 10893 10126 -928
15714 -928 -2366 780 9647 6392 2842 -1423 -5287 -2356 -10037 -17503 -11660 -13029 -12387 -6642 1707
15699 1707 8240 12322 10998 6791 3430 -714 -3654 -9103 -14088 -5071 -3194 -8197 -220 -87 -1277
15684 -1277 1063 -4602 -2717 -3652 -747 4430 8499 7093 12078 12417 6387 867 10218 9641 8983 8240
15668 8240 1603 4957 -1873 -12595 -1628 9446 12961 16921 22564 23187 17239 7658 7737 6399 65
15653 65 4272 10808 16323 20814 19087 3226 4185 10552 15551 11835 5063 3062 -839 -1076 -50
15638e0M678p3N14J697j038p212Q985M381l334k972p310L147q623L121L094J620
15622F25j0871Q527j25q817K619J0640Q588R93n042k404M431l068P33p554n368
15607f093j602J1935O124L999J4142q449j5144K951J5398L709j1563l634K86J2559
15593B4618k100l492J651j661k126m600j745p222k739J0329p8J04m927p338l746
15578e072o171J94M945k451j706N411J4501M950n501o727j5026M459J4407Q921
15564A5134m130j6730J11q82K666m299o37N704M983q269R333J3035N809q782q028
15549E018J3577M048k588j544o14l704o414j2384J2353N34j1444o037r77P771
15535b405l373j0021J233R292p95q02n859J846O679N587j3959L871O501N307P674
$$ plain form
15638 -50 4628 4555 5069 6766 5728 -1484 7501 11882 8548 5576 -1734 1413 -7210 -4089 -995 625
15622 625 -10246 -1719 -1844 -10661 -8042 2598 11186 12179 7137 4733 9164 6096 6829 -725 -6093
15607 -6093 -7695 4240 10364 14363 28505 20056 4912 7863 23261 26970 15407 11773 12059 24618
15593 24618 22518 19026 20677 19016 16890 12290 10545 3323 584 10913 10835 10939 6012 -1326 -5072
15578 -5072 -11243 -11049 -6104 -8555 -10261 -4850 9651 14601 9100 2373 -12653 -8194 6213 15134
15564 15134 11004 -5726 -5615 -6497 -3831 -8130 -8767 -3063 1920 -6349 2984 16019 21828 13046 5018
15549 5018 18595 22643 20055 18511 17897 14193 7779 -4605 7748 8282 -3162 -9199 -10176 -2405
15535 -2405 -5778 -15799 -14566 -5274 -6069 -6871 -12730 -10884 -4205 1382 -12577 -8706 -2205 3102 10776
15520A0776q546j6117n823R496J4947R386l695L241M085L854j1945k3391r218
15507b2950K540J0790J8363J1595j5265p362Q995L164P14n100k218r152n816j0881
15493b2583L526Q547K713R016p96q207K925M24m561p95N569J2913K590j8306m455
15478a1480Q362l882J1016j4591n034J9837J9357l086j2873j1405Q752L407o639
15465A741m65m262K669J3294l238j2204J267K84L201l452j62l63M026m000p037
15450h701M39j888P065m468O283k194M263N732p760o672K516k01J725n159j6788
15435b5808o133J9003J2893L23q25K861L17R59N285p352j1671j3235l903K2565
15421d721P747O2N704L065J641J025j0874m801K992k214Q480K857p355J0398J0446
$$ plain form
15520 10776 2230 -13887 -19710 -10214 4733 14119 10424 13665 17750 21604 9659 -13732 -22950
15507 -22950 -20410 -9620 8743 20338 5073 -2289 6706 9870 10584 5484 3266 -5886 -11702 -22583
15493 -22583 -19057 -10510 -7797 1219 423 -7784 -4859 -4435 -8996 -9791 -4222 8691 11281 -7025 -11480
15478 -11480 -3118 -7000 4016 -10575 -15609 4228 23585 20499 7626 -3779 4973 8380 1741
15465 1741 1276 -2986 -317 12977 9739 -2465 -1198 -914 2287 -1165 -1327 -1690 2336 -1664 -8701
15450 -8701 -8262 -10150 -3085 -7553 -1270 -3464 799 6531 -1229 -7901 -5385 -5586 -3861 -9020 -25808
15435 -25808 -31941 -12938 -45 278 -547 2314 2631 3590 8875 1523 -10148 -23383 -27286 -4721
15421 -4721 3026 3088 8792 11857 13498 14523 3649 -1152 1840 -374 8106 10963 3608 14006 24452
15406B4452K33r168m204p778P053k423o837J821J0359L516M878k054n649j0459
15392C740n25L927K188k865j4435k921N276P597k699n413J228n23K94j956K318
15377d769o616o957O450O639Q050P772P463n871j5008k963L845N704k839j0179
15363i279r779L84M661R325P254K062o701M069j3549j0875n722L950J4015J6899
15349F714L77q354l726q379m949Q036Q83r569m90K328P056l738Q001Q204N172
15334G566P030m564O850J254n085l221m457p590l845J44K511n539q908O346J3396
15319A888o393j0117R33l41k152L140M937k136O060j2754k06J2968J3067j2997
15305d103J979J5120j0026n359J945O143k75j336j9292j0796M407L151N582M990
$$ plain form
15406 24452 24685 15517 11313 3535 10588 8165 1328 3149 13508 17024 21902 19848 14199 3740
15392 3740 3215 7142 9330 6465 -7970 -10891 -5615 1982 -717 -6130 -4902 -5425 -5131 -7087 -4769
15377 -4769 -11385 -18342 -11892 -5253 2797 10569 18032 12161 -2847 -5810 -1965 3739 900 -9279
15363 -9279 -19058 -18674 -14013 -4688 2566 4628 -2073 1996 -11553 -22428 -28150 -24200 -10185 6714
15349 6714 7091 -1263 -4989 -13368 -18317 -10281 -9398 -18967 -19457 -17129 -10073 -13811 -5810 2394 7566
15334 7566 14596 10032 16882 18136 13051 9830 5373 -2217 -6062 -5918 -3407 -8946 -17854 -11508 1888
15319 1888 -4505 -14622 -13689 -14030 -16182 -13042 -8105 -10241 -4181 -16935 -17141 -4173 8894 -4103
15305 -4103 -2124 12996 2970 -2389 -444 5699 5424 4088 -15204 -26000 -21593 -18442 -12860 -7870
15291g870Q980R58j2679m092j455k370Q869j755n886R853N673k316n141N5K885
15276f291J453j187J411M626n510L858P22q690J668M102O038R527R093K994o870
15261A6944o096l458j0809J718O672p862l210Q337R021j390j991o277n154L565
15247A0k523R312l153p472o288L794J6074j598m182k573p069k278l418J2281M074
15232D991j073k954l118J764N045O202P706J979j2967p209J998j813J957M115
15218F623k981j393k561O317J887M546q491l528m439p01Q309Q661j1883j149K007
15203A224j0465p517R26J1034m314j1843J057J1475J1681m098P956Q577o355j0130
15189g92l341P20L923k403r786O656k269K15O475Q778Q34p569m623R278L499l373
$$ plain form
15291 -7870 1110 2068 -10611 -14703 -16158 -18528 -9659 -11414 -17300 -7447 -1774 -4090 -9231 -9176 -6291
15276 -6291 -4838 -6025 -4614 12 -5498 -1640 -918 -9608 -7940 -3838 2200 11727 20820 23814 16944
15261 16944 10848 7390 -3419 -1701 4971 -2891 -6101 2236 11257 9867 7876 1599 -3555 10
15247 10 -2513 6799 3646 -3826 -10114 -6320 9754 8156 3974 1401 -5668 -7946 -11364 917 4991
15232 4991 3918 964 -2154 -390 4655 10857 18563 20542 7575 366 2364 551 2508 6623
15218 6623 3642 2249 -312 6005 7892 12438 3947 419 -4020 -4721 3588 12249 366 -783 1224
15203 1224 -9241 -16758 -15832 -4798 -9112 -20955 -19898 -8423 3258 -840 7116 15693 9338 -792
15189 -792 -4133 -3413 510 -1893 -11679 -5023 -7292 -7077 -602 8176 9010 1441 -3182 6096 9595 6222
15173F222j2q441J37k78N539o684O24O880p660j2393l645k144Q652J2452n010
15158e761J1770J8502q702j554p603o199M176k422o849n330J9911K464j0034j1689
15144i320Q546O685k0657k023L310r23J0838P291P39M135o729Q730J5444m591
15130B1475k2765K966L398M507L290m572j6144K591j078M003J0066J0756L064
15117B1557J11j5169j0622O85j284q35n04J0192R52j6915q949K1715K343o181
15103b904P199Q581n291k740R96J3380L838J084p468j2965o137o281L655O117
15089A064L833M135o887n976J0951J1346j291n673K976j945O465l988j0976o829
15075b795k030O124n86m465M552R116J450r363j992P186J56Q168L841p30j3440
$$ plain form
15173 6222 6210 -2231 -2094 -2372 3167 -3517 -2893 3987 -3673 -16066 -19711 -21855 -13203 -751 -5761
15158 -5761 6009 24511 15809 14255 6652 453 4629 2207 -4642 -9972 9939 12403 2369 -9320
15144 -9320 -774 5911 -14746 -16769 -13459 -14382 -3544 3747 4486 8621 1892 10622 26066 21475
15130 21475 -1290 1676 5074 9581 12871 8299 -7845 -5254 -6332 -2329 7737 18493 21557
15117 21557 21668 6499 -4123 -3438 -4722 -5557 -6061 4131 5083 -11832 -20781 934 3277 -2904
15103 -2904 4295 12876 7585 4845 5841 19221 23059 24143 16675 3710 -2427 -8708 -5053 1064
15089 1064 4897 9032 2145 -3831 7120 18466 17175 11502 14478 12533 18998 15010 4034 -2795
15075 -2795 -4825 1299 713 -3752 800 9916 11366 2003 11 7197 7353 15521 19362 18632 5192
15060E192o748p899l424L988K185q254l817n284M020j272m796J0561L476k344
15046a4416K574l898L963J3556L494Q396O721n341o195m093R83r7J239j0712m417
15031h243J2668M05N234N4j1840kJ0194J14K163L800o268l952N384n201J825L206
15015I541L18j851p61J7203j3359m064j976R66j3266j1413j028M877q19l128O289
15000a2471P041L332Q291L335j255j3674j3563P526K011n686j094J3038N237q073
14986f005n404J1376J4624j439p156P944p771r129R841J2421j0704j5712l597
14973a0711L066k022r90q246l292K214o738M169N482J5865K822J2913k476n169
14959F887M957L320m470O37j156N461K303k827j6364m739Q88j83O075L297J735
$$ plain form
15060 5192 -1556 -9455 -12879 -8891 -6706 -14960 -18777 -24061 -20041 -21313 -26109 -15548 -12072 -14416
15046 -14416 -11842 -15740 -11777 1779 5273 13669 20390 15049 8854 4761 5744 5647 6886 -3826 -8243
15031 -8243 4425 4830 10064 10118 -1722 -1724 8470 8584 10747 14547 8279 4327 9711 4510 6335 9541
15015 9541 9859 8008 7247 24450 11091 7027 5051 6017 -7249 -18662 -19690 -14813 -15632 -18760 -12471
15000 -12471 -5430 -2098 6193 9528 8273 -5401 -18964 -11438 -9427 -15113 -16207 -3169 2068 -6005
14986 -6005 -11409 -33 14591 13152 5996 13940 6169 -2960 6881 19302 8598 -7114 -10711
14973 -10711 -7645 -9667 -10657 -18903 -22195 -19981 -26719 -22550 -17068 -1203 1619 14532 12056 6887
14959 6887 11844 15164 10694 11331 10175 15636 17939 15112 -1252 -5991 -5103 -5286 789 4086 5821
14944E821K494M897l328j701k013l952r099j2939M254P325J7248N295p570j782
14930D950l071M603J048K548o256k716m946k763J0205J999J4114M982K417r981
14916A7133j9844n193j110J735q238j285J690J1823J3461m196O306l26n017J890
14902H829J1804k97J347K390K157q569n836M469o599j1432j085J4965R26o698
14888F371n184P223J033k868R499j4843r114J571L009m792n150m572J0405J6583
14874I171N039l170q912k838J192M896k818p898n470J2949N709j5744j1393J1464
14860g823R353m143r52J777o840n140l552P308J3868L891p146M410J089Q305M571
14845A8976r338j1530j78J2721R280j5317M700Q862N557k879M42N395o823K983
$$ plain form
14944 5821 8315 13212 9884 8183 6170 2218 -6881 -19820 -15566 -8241 9007 14302 6732 4950
14930 4950 1879 6482 7530 10078 3822 1106 -3840 -6603 3602 5601 19715 24697 27114 17133
14916 17133 -2711 -7904 -9014 -7279 -15517 -16802 -15112 -3289 10172 5976 12282 11956 6939 8829
14902 8829 20633 20336 21683 24073 26230 17661 11825 16294 9695 -1737 -2822 12143 13069 6371
14888 6371 1187 8410 9443 6575 16074 1231 -7883 -6312 -3303 -8095 -13245 -17817 -7412 9171
14874 9171 14210 11040 2128 -710 482 5378 2560 -5338 -10808 2141 7850 -7894 -19287 -7823
14860 -7823 1530 -2613 -3565 -1788 -8628 -13768 -17320 -10012 3856 7747 601 5011 6100 14405 18976
14845 18976 9638 -1892 -2070 10651 19931 4614 9314 18176 23733 20854 21296 26691 19868 22851
14831B2851o995j2962p395j580R188l376j0951R14Q609J4663J0q995K529P79q10
14816F479J145K486Q392o2j708j3344k630J6232J2671j2729n014L123o484n187
14802C370j1307m328r855j7K0730J6390k627j122K985O788N559l168j3835k478
14788G085q742L830n201m947K647O1O941P913n019q054r56k684K509J0402P772
14773A3557P20l835m509o614M807P149m168l883n080L988L58j757M809J141L590
14758A0273n457q167q631o409k816P236J8412J853j1786J2239J3835Q150o915
14745B1817j0713K418K746k841k045r268j0072L964P772k544r647N266J2155K468
14731A1476n031k750P772P178j1652q508J2214l154n315M622r841M816O322r767
$$ plain form
14831 22851 15856 2894 -4501 -6081 3107 -269 -11220 -10306 -1697 12966 12976 3981 6510 7289 6479
14816 6479 7624 10110 18502 18440 16732 3388 758 16990 29661 16932 11918 15041 8557 3370
14802 3370 -7937 -12265 -22120 -22137 -1407 14983 12356 11234 14219 21007 26566 23398 9563 7085
14788 7085 -1657 2173 -3028 -7975 -5328 -5267 1674 9587 4568 -3486 -4442 -7126 -4617 5785 13557
14773 13557 14277 10442 5933 -681 4126 11275 7107 3224 -1856 2132 2490 733 5542 6683 10273
14758 10273 4816 -3351 -11982 -18391 -21207 -13971 4441 6294 -5492 6747 20582 28732 21817
14745 21817 11104 13522 16268 13427 11382 2114 -7958 -3994 3778 1234 -8413 -3147 9008 11476
14731 11476 6445 3695 11467 18645 6993 -1515 10699 7545 2230 6852 -2989 1827 8149 -1618
14717a618p056K009O689j447k740Q627J8025j369j2111m283M230l028o733q756
14703i561o929l041P919P955j576M864k488j822J72l101J3702P946l689Q30O560
14688A7741K466j2953J1579j940j0127J691J102M827K867n865r577m478J1122
14675H455o086o813O232k145P41J5116Q635n235j290j2587j194J0499p52J1100
14661B4676L107M082O291L19M589k687J315o18M253J1062J5990J2935K964K4073
14647A12351J7789J7020J5697R936J4312L055o076J8360L285p619k881k400j1524
14634A81305p421q997j4440j4159j6416j0784j828K065k995l782P23J914k576
14621A02609N643J1522Q568J5796R151J1869J8140J8989J3902J6369J4106P368
$$ plain form
14717 -1618 -8674 -6665 24 -1423 -4163 4464 22489 21120 9009 4726 8956 5928 -805 -9561
14703 -9561 -16490 -19531 -11612 -3657 -5233 -369 -2857 -4679 -4507 -7608 6094 14040 10351 11181 17741
14688 17741 20207 7254 18833 16893 6766 8457 9559 14386 17253 11388 1811 -2667 8455
14675 8455 2369 -4444 1788 -357 384 15500 24135 18900 17610 5023 3829 14328 13576 24676
14661 24676 27783 31865 38156 38475 43064 40377 41692 41074 45327 56389 72379 85314 88278 112351
14647 112351 130140 147160 162857 172793 187105 190160 184084 202444 205729 198110 195229 192829 181305
14634 181305 173884 164887 150447 136288 119872 109088 107260 109325 106330 102548 103271 105185 102609
14621 102609 108252 119774 128342 144138 153289 165158 183298 202287 216189 232558 246664 254032
14609B54032Q964R142l087j3844k6476j3485p818k1028j7850k3762k2158j3134
14597A09496j4115j0509j4945j611j1810p931n051o650j694k502k678j0269l325
14584A6406O307l99N05O518j0285p116L121o524L825M763j52m940J5771L85j1294
14569A6891j3609o595J0681m340j3894L964P906R924J0524l03p011k824q612Q935
14555A1637L091j018j0271m160k434P272J972O158k408q130n543P284M132n677
14541A905j1287n89k375N772k493O155R047L369N348q18N421l658p201M304L775
14526A6675P78J67N706l306j779P260j2599o103O803O348J828j0512m767K28K951
14511I678K577L861j0727R81L97k391P985O143N501k456L134J5525j2959k0507
$$ plain form
14609 254032 262996 272138 269051 255207 228731 215246 207428 186400 168550 144788 122630 109496
14597 109496 95381 84872 69927 68316 56506 48575 43524 36874 35180 32678 30000 19731 16406
14584 16406 22713 22314 22819 29337 19052 11936 15057 8533 12358 17121 16969 12029 27800 28185 16891
14569 16891 3282 -3313 7368 3028 -10866 -6902 1004 10928 21452 21149 14138 11314 2702 11637
14555 11637 14728 13710 3439 -721 -3155 4117 6089 12247 9839 1709 -3834 3450 7582 1905
14541 1905 -9382 -9971 -12346 -6574 -9067 -2912 6135 9504 14852 14034 19455 15797 8596 12900 16675
14526 16675 17453 17620 23326 20020 18241 25501 12902 6799 13602 19950 21778 11266 6499 6727 9678
14511 9678 12255 16116 5389 6370 6767 4376 12361 18504 24005 21549 24683 40208 27249 6742
14497F742j0011Q135J0729L5J103M570N427r12n41J507j1643l795m341P519J7619
14482C2143q568j7451j86o979m1M105j163L976J0038J188J673k466J447J045n515
14467A3246N84N297Q340n601P301P6o238p547n143P577M479j764r493J4070J5614
14452D0798K564o643m55O233N799k530q871J1133M893K501r95m988k096o993K652
14437D3002O030K123L826p307j201M665j471j74O510q82m813k99R162J0612k11
14422F9572j2691j5721j294L926R78K051o731N034M337l10K735M790l490n64Q870
14407F1492R734q922j7583j1931M397p284J7539j3707k6056l453K438J2683o265
14394A3082J183m749j0495Q645O534J0786J2827K24k883l306j7043o685P546N746
$$ plain form
14497 6742 -3269 4866 15595 15630 16733 21303 26730 25818 25277 26784 15141 11346 7005 14524 32143
14482 32143 23575 6124 5938 -1041 -1082 3023 1860 5836 15874 17062 18735 16269 17716 18761 13246
14467 13246 13830 19127 27467 21866 29167 29243 23005 15458 10315 17892 22371 20607 11114 25184 40798
14452 40798 43362 36719 36264 42497 48296 45766 36895 48028 52921 55422 54427 49439 47343 40350 43002
14437 43002 49032 51155 54981 47674 46473 51138 49667 49493 56003 55121 50308 50009 59171 69783 69572
14422 69572 56881 41160 39866 43792 44770 46821 40090 45124 49461 49151 51886 56676 53186 52622 61492
14407 61492 71226 62304 44721 32790 37187 29903 47442 33735 7679 4226 6664 19347 13082
14394 13082 14265 9516 -979 7666 14200 24986 37813 38037 35154 31848 14805 8120 15666 21412
14380B1412q252M799J0269o030j7062l231r043J1921J9194M043j125j4479m073
14367H343m999K866Q127K842P057N889q3L52k859L511L355j539j5631j710o825
14352H696O344Q647M396k324j1362J2285L441j2900j2031N586Q816J1720P241
14339C8555O65O368r886k978K239j2771N57L726K977L246l946L775M957R624L51
14324D7459k0221j2486K3755J547L565J0031R656K162r08J0390J4041N103N09
14311I4603l959p340k496L573M991J1135K024o557q810J782j120J2975M549L860
14297A09210J312L87R499M475m508r159j4623M69Q869Q283N98Q62M472J8085N007
14282A43238n013L906J4615K527k998J3407P186J843P83P484J583q65N396r705
$$ plain form
14380 21412 13160 17959 28228 22198 5136 1905 -7138 4783 23977 28020 26895 12416 8343
14367 8343 3344 6210 14337 17179 24236 30125 30042 30394 27535 31046 34401 32862 17231 15521 8696
14352 8696 15040 23687 28083 25759 14397 26682 30123 17223 5192 10778 19594 31314 38555
14339 38555 39220 45588 35702 32724 34963 22192 22749 26475 29452 32698 28752 32527 37484 47108 47459
14324 47459 27238 14752 38507 40054 43619 53650 63306 65468 64560 74950 88991 94094 94603
14311 94603 90644 83304 80808 84381 89372 100507 102531 95974 87164 88946 87826 100801 105350 109210
14297 109210 110522 110909 120408 124883 120375 111216 96593 97062 105931 114214 114812 115674 120146 138231 143238
14282 143238 138225 142131 156746 159273 156275 169682 176868 178711 179494 186978 188561 187696 193092 183387
14268A83387K425L555K181L448m545O64m46N769O881M507j832J1259j886O609
14254B21976J4363R508J7628M564J1501K4025J6215J6737N682K127K694R661K0837
14241C77518J9276J3581P939K8875L1158J7945K3824K1467J9834L8293L9267L2961
14229F71938M3738M9255N5831O2116P3108P3116P7513R3190R9138J08952J35078
14218A542973J47072J75020J99607K32338K79198L07000L55980M11745M75334
14209D126267N76501O84858Q23995R80725J166246J394874J664191J953126K231561
14200A5602344K510970K725797K858429K888175K764005K525081K132374J615501
14192C5622676R99949L65814k54297q37947j313693j643399j865602j948395j932828
$$ plain form
14268 183387 185812 189367 191548 194996 190451 191115 190669 196438 203319 207826 205994 217253 215367 221976
14254 221976 236339 245847 263475 268039 279540 303565 319780 336517 342199 344326 347020 356681 377518
14241 377518 396794 410375 418314 447189 478347 496292 520116 541583 561417 599710 638977 671938
14229 671938 715676 764931 820762 882878 955986 1029102 1106615 1199805 1298943 1407895 1542973
14218 1542973 1690045 1865065 2064672 2297010 2576208 2883208 3239188 3650933 4126267
14209 4126267 4702768 5387626 6211621 7192346 8358592 9753466 11417657 13370783 15602344
14200 15602344 18113314 20839111 23697540 26585715 29349720 31874801 34007175 35622676
14192 35622676 36622625 36988439 36734142 35896195 34582502 32939103 31073501 29125106 27192278
14183B7192278j825068j643054j420310j196746r74009p61155n52613l65744j86094
14174A8267485j7063J48287L30129N33978P33361R37952J160659J409036J646800
14165B5150624J821588J956416K010956J970693J774229J455879J012950M54145
14157C7607480j90256q40363j450929k008179k463405k767995k915869k919712
14149B2050772k808424k598590k343236k048193j757887j491620j253650j049835
14141F699337q81765p37796o08207n30638m66234l82319l31068k82691k34860
14132B243759k00211j98183j71922j50605j25026j08573r0660q7546q4524o5520
14122I60989n4423n3044m9616n7210n9772m4848k3214j7182k3006k9217l6033
$$ plain form
14183 27192278 25367210 23724156 22303846 21107100 20133091 19371936 18819323 18453579 18267485
14174 18267485 18250422 18398709 18728838 19262816 19996177 20934129 22094788 23503824 25150624
14165 25150624 26972212 28928628 30939584 32910277 34684506 36140385 37153335 37607480
14157 37607480 37417224 36576861 35125932 33117753 30654348 27886353 24970484 22050772
14149 22050772 19242348 16643758 14300522 12252329 10494442 9002822 7749172 6699337
14141 6699337 5817572 5079776 4471569 3940931 3474697 3092378 2761310 2478619 2243759
14132 2243759 2043548 1845365 1673443 1522838 1397812 1289239 1198579 1111033 1026509 960989
14122 960989 906566 853522 803906 746696 686924 642076 618862 601680 578674 549457 513424
14111E13424j5544m668k4021k0897j4106j4668k1178j8549p417j0716j5375k971
14099C43314p269m162k078L755K800n027j4078k1240L294r29q420p078l401J3279
14085B92760N891P32J1980Q078M058J304N890K132l708J149L173Q317J9415J5754
14071C76925j118j7855J589J3657J13q277j0193q021j2455k713j0241k856L520
14058C22075l17m074L499R28k2689j0533m775N569J5517J1896J243J0380O801
14045C35520N781M039R296p125j1047j5480M406O788R74j4673r295j308j4366
14032B93510p848j1629j8885q171O910l464j7177j9248j9926j3420R76j664j094
14019A78870M586p928j5399j0341M478l041j0058l538j7l965k261r499p20K18
$$ plain form
14111 513424 497880 493212 469191 448294 434188 419520 398342 379793 372376 361660 346285 343314
14099 343314 336045 331883 329805 333560 336360 331333 317255 296015 299309 298380 289960 282882 279481 292760
14085 292760 298651 299383 311363 319441 323499 324803 330693 332825 329117 330266 333439 341756 361171 376925
14071 376925 375807 357952 359541 373198 373311 365034 354841 346820 334365 331652 321411 318555 322075
14058 322075 321758 317684 321183 322111 299422 288889 284114 289683 305200 317096 318339 328719 335520
14045 335520 341301 345340 354636 347511 336464 320984 325390 332178 333152 318479 309184 307876 293510
14032 293510 285662 274033 255148 246977 253887 250423 233246 213998 194072 180652 181628 179964 178870
14019 178870 183456 175528 160129 149788 154266 151225 141167 137629 137612 133647 131386 121887 121167 121385
14005A21385n88j1991j020Q924j2041j1030N932J786n344j3070o777n214m090
13992F6862L65L122M483p866L231L047o158m00j030m198O067j761o423L066m00
13977F2007n825j728R63J4409N213p268q544m922L125K491q095k743n746O277
13963D9614p866j0210j5310O392J2597j827o355p391n295l58M400O399L110N401
13949C3301l157J531Q842j086j886J607j185n556q572j891l993N810o172J638
13935A9231J50l894N621k061j304J84M225L587O770P582k936m307o832j168O3
13920B4911N623P45L4J4752M75n884j689K022k411r509o714N310J647l944J2239
13905C7607N485k833q895n755j1524p497r3J944q706P876O894r778J868O310n605
$$ plain form
14005 121385 120797 108806 107786 116710 104669 93639 99571 101357 96013 82943 76166 70952 66862
13992 66862 67227 70349 74832 66966 70197 73244 67086 66686 65656 61458 67525 65764 59341 62407 62007
13977 62007 56182 54454 55417 69826 75039 67771 59227 54305 57430 59921 51826 49083 43337 49614
13963 49614 41748 31538 16228 22620 35217 33390 27035 19644 14349 13991 18391 24790 27900 33301
13949 33301 30144 31675 40517 39431 37545 39152 37967 32411 23839 21948 17955 23765 17593 19231
13935 19231 19381 15487 21108 19047 17743 17927 22152 25739 32509 40091 37155 32848 26016 24848 24911
13920 24911 30534 31279 31313 46065 46540 40656 38967 40989 38578 29069 22355 27665 29312 25368 37607
13905 37607 43092 40259 31364 25609 14085 6588 6495 8439 -267 7609 14503 4725 6593 12903 7298
13890G298P24P196m616j3682K181J6150o005j319J6125k649o253r554Q556J0197
13876B4349Q661K811k783J296j2861j1221j1559q50J287N980O935l076n207r653
13862e891L18J3569J8629P221j1265j3839K676J1893O025k608r436n088j1762
13849D42m744L848Q954n086L631m519O690L711P723k04l180q523R322N940p84
13834B3221M46M32o166p607p036L158N768J821r297p151l783J41N939Q60q37Q694
13818H603R207N139r581J805K449j2069k314N179O42K648K195Q979l272j4387
13804E223k954k387J652J583k590O567j155O635L715J896K361p703p753L292n56
13789G826o633j980m40P595j138m50L256L370l464o93R49o18n928j2193q14M134
$$ plain form
13890 7298 8022 15218 10602 -3080 -899 15251 9246 7927 24052 21403 15150 5596 14152 24349
13876 24349 33010 35821 33038 34334 21473 10252 -1307 -2157 -870 5110 12045 8969 3762 -5891
13862 -5891 -5573 7996 26625 33846 22581 8742 11418 23311 29336 26728 17292 12204 442
13849 442 -4302 -454 8500 3414 7045 2526 9216 12927 20650 20446 17266 8743 18065 24005 23221
13834 23221 23667 24099 17933 10326 3290 6448 12216 14037 4740 -2411 -6194 -6053 -114 746 -91 8603
13818 8603 17810 22949 13368 15173 17622 5553 3239 8418 9060 11708 13903 22882 19610 5223
13804 5223 2269 -118 1534 3117 527 7094 5939 12574 16289 18185 20546 12843 5090 8382 7826
13789 7826 1193 -787 -1227 6368 5230 4780 8036 11406 7942 7249 8198 7580 1652 -10541 -11355 -7221
13773g221M718j203j29l335L541N474j567n545J379j080Q215J1671J7071n317
13759B6672r072J980R491n857j2068J4252K2803P149q843j0704Q432J5755M294
13746F4284R699J1724N765P500J9609K7694J8723M347R082J0066J1705J442N227
13733B06867O449j6573j1506j9478j9592j0356P014L91J017j4058j0623q800r287
13720A01465p385K629K467K336L514R593J4693N382J887J7233R063n311J916Q176
13706A67658P324J7668J7470l029r525Q414j0854o481j1644j3484j1771j5412
13694A36334j7658n261q945j5771j4097m98k3090j2567o154R015n964j0974m083
13681B0287m232M963L751P853p12p680L275k965k587j6787N38O587P124n272j0162
$$ plain form
13773 -7221 -2503 -3706 -3835 -7170 -3629 1845 278 -5267 -3888 -4968 3247 14918 31989 26672
13759 26672 17600 19580 29071 23214 11146 25398 48201 55350 46507 35803 44235 59990 64284
13746 64284 73983 85707 91472 98972 118581 146275 164998 169345 178427 188493 200198 201640 206867
13733 206867 213316 196743 185237 165759 146167 135811 142825 143216 144233 130175 119552 110752 101465
13720 101465 94080 96709 99176 101512 105026 114619 129312 134694 136581 153814 162877 157566 159482 167658
13706 167658 174982 192650 210120 207091 197566 205980 195126 188645 177001 163517 151746 136334
13694 136334 118676 113415 104470 88699 74602 74104 51014 38447 32293 41308 35344 24370 20287
13681 20287 16055 21018 24769 32622 31910 24230 27505 24540 21953 5166 5704 12291 19415 14143 3981
13666C981j24K386J0072N412l475j7971j1635l840J0416J0692K768P659j1402
13653D939j4821n735N92l670n484M988L805P635l484r068r16L965N506J1039M402
13638C693n98m789N626k00j90J080M48N134P226q201O31j4834o894J128J0229
13623e11K44m430n929j737J0832k018O388J918J421j86m283J174m415J088r847
13608a0291j6781k346J2971P291O046j433J206l858p410P731J0454J004k331j3502
13594a1249J598K370m019J0592K103r011J316Q927m152N922J009l575j191J1439
13580A2079K09o974R52r209J921q036m198L413j076k122N976J3378r733l61j846
13565e627K035N16J1362K568o684M84M427M08m933j459K543k88k655J724j2927
$$ plain form
13666 3981 3857 6243 16315 21727 18252 281 -11354 -15194 -4778 5914 8682 16341 4939
13653 4939 -9882 -15617 -15025 -18695 -24179 -19191 -15386 -7751 -11235 -20303 -21219 -17254 -11748 -709 3693
13638 3693 3095 -1694 3932 3732 3542 4622 5070 10204 17430 9229 9860 -4974 -11868 -10740 -511
13623 -511 -267 -4697 -10626 -12363 -1531 -3549 2839 4757 6178 5992 1709 2883 -1532 -444 -10291
13608 -10291 -27072 -29418 -16447 -9156 -3110 -4543 -3337 -7195 -14605 -6874 3580 4584 2253 -11249
13594 -11249 -9651 -7281 -11300 -708 1395 -7616 -6300 2627 -1525 4397 5406 1831 640 12079
13580 12079 12288 5314 6266 -2943 -1022 -9058 -13256 -9843 -10919 -13041 -7065 6313 -3420 -3781 -5627
13565 -5627 -3592 -3076 8286 10854 4170 4654 9081 9489 4556 3097 5640 5352 2697 4421 -8506
13550h506p774p01N42J0423l575j3057O473J458r76k027l779J214K460J7188K037
13535A400p919O005K518l207m088k189J754J857j004j3407J958J4625o054l745
13521a1496o91N76M378l561m072L354M955M517j010L881n445j0085k717J7039
13507c77J5045o262l771m564l27P021l58p536j6110J0737O80j0608j868K0o266
13492b4544J0636J501O051n887j080M585L563P094m247m627J4838m633o785j194
13478d729K445O916m264j4949j0651M330K1036m641K651P045n189k008M648q140
13464e500p152O246L775r615K844J3753M163p319k0239l52N261J937M416k898
13450a0680n795Q393Q317N977l648L369J0803M735p261k4020j661q360j6034Q842
$$ plain form
13550 -8506 -16280 -16981 -16439 -6016 -9591 -22648 -16175 -14717 -15693 -17720 -21499 -20285 -17825 -637 1400
13535 1400 -6519 -514 2004 -1203 -5291 -7480 -5726 -3869 -4873 -18280 -16322 -1697 -7751 -11496
13521 -11496 -12187 -11611 -7233 -10794 -14866 -11512 -6557 -2040 -3050 831 -4614 -14699 -17416 -377
13507 -377 14668 8406 4635 71 -256 6765 6407 -1129 -17239 -6502 -5822 -16430 -18298 -18278 -24544
13492 -24544 -13908 -12407 -6356 -12243 -13323 -8738 -5175 1919 -2328 -6955 7883 3250 -3535 -4729
13478 -4729 -2284 4632 368 -14581 -25232 -20902 134 -4507 -1856 5189 0 -2008 2640 -5500
13464 -5500 -12652 -6406 -2631 -12246 -9402 4351 8514 1195 -19044 -19396 -14135 -12198 -7782 -10680
13450 -10680 -16475 -8082 235 6212 2564 5933 16736 21471 14210 -9810 -11471 -19831 -35865 -27023
13436b7023K3804O519l648j566N190K112j618n141K178o179j827K313J636N019
13422A769M424K880l343R71M996j401l495r565j71J057M121O87m158l915L279
13407a864k2197j1676J0132J7004J6110m722o413M13k63l430j360m424n87N897
13393g380J4614n336p574R98R171j125j3726r913p22N18O81J7650N24j214M872
13378B038m715n530k948O428Q106j3426p232O221Q242k491o409l070p37o207J0899
13363a0831J2990j751m142J142m785L148m794m566m936J63m81N10L594M587L767
13348f385J1664j3547l920Q798K934m608p422N341K28o814l990R338J5395J760
13334H772p078m962r051r332K209R739J4721K291q88J3377o298q074j2309J936
$$ plain form
13436 -27023 -3219 3300 -348 -1914 3276 5388 3770 -1371 807 -5372 -7199 -4886 -3250 1769
13422 1769 6193 9073 5730 6701 11697 10296 6801 -2764 -2935 -1878 2243 2930 -1228 -5143 -1864
13407 -1864 -24061 -35737 -25605 -8601 7509 2787 -3626 -3213 -3476 -6906 -8266 -12690 -13277 -7380
13393 -7380 7234 1898 -5676 -4678 4493 3368 -10358 -20271 -20993 -20475 -19794 -2144 -1620 -2834 2038
13378 2038 -2677 -8207 -11155 -4727 3379 -10047 -17279 -11058 -2816 -5307 -11716 -14786 -15523 -21730 -10831
13363 -10831 2159 408 -3734 -2592 -7377 -4229 -9023 -13589 -18525 -18362 -18843 -18333 -14739 -10152 -6385
13348 -6385 5279 -8268 -12188 -3390 -456 -5064 -12486 -7145 -6917 -13731 -17721 -8383 7012 8772
13334 8772 1694 -3268 -12319 -21651 -19442 -9703 5018 7309 6421 19798 13500 5426 -6883 -4947
13320d947o846O39q022M239J6590Q377j6851p077L999N628L68p661N616k630j678
13305a0256R263M77m580n303K674P594j024k376M644K192k751R433k667q929n100
13290f709L578j3098j1637P173J0009j439l302J3337K854q66l308M018R528N37
13276A0675O64K938m455L124J224k764M45n62j717N68q473n067q895j655P39N398
13260g813l259N759P090M518Q531q012j1069l20Q444l575n539L295N791n246J0966
13245I561K952J0931K097j1264j926p627o065j0948l379n226J2442J3333m694
13232A87p443k033p41k754m776P915M680J0725o004q409P884l542N262J2761j73
13217A3539K044j7962j6559N892K779K823J033R424P5k408J829m466j6505m587
$$ plain form
13320 -4947 -11793 -11154 -19176 -14937 1653 10030 -6821 -13898 -9899 -4271 -3903 -11564 -5948 -8578 -10256
13305 -10256 -993 -516 -5096 -10399 -7725 -131 -1155 -3531 1113 3305 554 9987 7320 -1609 -6709
13290 -6709 -3131 -16229 -27866 -20693 -10684 -12123 -15425 -2088 766 -100 -3408 610 10138 10675
13276 10675 11339 14277 9822 12946 14170 11406 11851 11289 9572 10140 1667 -3400 -12295 -13950 -13211 -7813
13260 -7813 -11072 -5313 1777 6295 14826 6814 -4255 -4575 3869 294 -5245 -1950 3841 -1405 9561
13245 9561 12513 23444 25541 14277 12351 4724 -1341 -12289 -15668 -20894 -8452 4881 187
13232 187 -7256 -9289 -10030 -12784 -17560 -9645 -4965 5760 -244 -8653 -769 -4311 951 13712 13539
13217 13539 15583 -2379 -18938 -13046 -10267 -7444 -6411 3013 3088 680 2509 -1957 -18462 -23049
13203b3049Q292K3044n594j3659j352J6772J221j1601l137q541N055N187R710
13190B348M407O311l275j6089m530O849m505P73o327l554J0353L976M01o005M464
13175d403K840M589N444Q014p821j0049n920J4043K729P767k201j2340k954k773
13161c035r73o855j271r50j3435m273K161J124L928k00Q894O542Q83o494J4J2318
13145a622O481q336R742k981o941k036m905k80Q000J0185Q145p447r292p734l227
13130a2248J8816O137n937m303p532o098M742J2382J0425p066p693J729J3055
13117A6409J0138q002n936m218K832R074r802j1987j5248j520N678R546L776j977
13103a237r011k647R518J0724r929m96O891l941k901k089o324K899j1301K355
$$ plain form
13203 -23049 -14757 8287 2693 -10966 -12318 4454 5675 -5926 -9063 -17604 -12549 -7362 2348
13190 2348 6755 13066 9791 -6298 -10828 -3979 -8484 -7711 -14038 -17592 -7239 -3263 -2862 -8867 -4403
13175 -4403 -1563 3026 8470 16484 8663 -1386 -7306 6737 9466 17233 15032 2692 -262 -3035
13161 -3035 -4008 -10863 -12134 -13084 -26519 -30792 -28631 -27507 -23579 -23779 -14885 -8343 -7460 -13954 -13940 -1622
13145 -1622 4859 -3477 6265 3284 -3657 -5693 -10598 -10878 -2878 7307 15452 8005 -1287 -9021 -12248
13130 -12248 6568 12705 6768 2465 -5067 -11165 -6423 5959 16384 9318 1625 3354 16409
13117 16409 26547 18545 12609 8391 11223 20297 10495 -1492 -16740 -18260 -12582 -3036 740 -1237
13103 -1237 -10248 -12895 -3377 7347 -2582 -3078 3813 -128 -3029 -5118 -11442 -8543 -19844 -17489
13089a7489P726O73p365l822L359R810N959j1926M597P827l97J1103J9250K279
13075C1584Q48j3205k0067p716k545M586R318O09L447k060m429n322L88M1P395
13060B872J465k108l530M652o24j2592J788M36j78L161P088n709p390j2311o65
13045b3645J0289K3100J4459j7632q737q064n408o967l651J604N760P93J0080
13032h019N410n01K277N295p040K97K039l383M552R629o373j1834p120R4m01K173
13016a2905m80R717q26l165O565K214O148R54j764l64l439k347N53m539j6045
13001a9723k663P785J1922N366J823L124k35j4L197j174K355M270J354Q672R641
12986C5700p460q762j0456J287P292k197o383n622n348R48O144P902n888k233
$$ plain form
13089 -17489 -9763 -9090 -16455 -20277 -16918 -7108 -1149 -13075 -8478 -651 -1048 10055 29305 31584
13075 31584 32432 19227 -840 -8556 -11101 -6515 2803 3412 6859 4799 370 -4952 -4564 -4523 2872
13060 2872 4337 2229 -1301 3351 2727 -9865 -8077 -7641 -7819 -4658 2430 -3279 -10669 -22980 -23645
13045 -23645 -13356 9744 24203 6571 -2166 -10230 -15638 -22605 -26256 -24652 -18892 -18099 -8019
13032 -8019 -2609 -3110 -833 4462 -2578 -2281 -242 -3625 927 10556 4183 -7651 -14771 -14677 -15078 -12905
13016 -12905 -13385 -3668 -4494 -7659 -1094 1120 7268 8222 6458 6094 2655 308 861 -3678 -19723
13001 -19723 -22386 -14601 -2679 2687 4510 7634 7399 7385 10582 9408 11763 16033 17387 26059 35700
12986 35700 28240 19478 9022 10309 17601 15404 9021 3399 -1949 -1001 5143 13045 7157 4924
12972D924J2104L809m296r89o890j844j2764j5079o66J4072J2786M94j3972k29
12958h540P512L132o682k4569R712K0718O197k1594k631J5845m413n355R110l945
12944e503L17l098k971L96J2535k242l925m034n118M194l757P224N542J0690o812
12929C438n893O213K506J616J162k681j5903k476J313J0918L952J787n115m769
12915c932o567q459j540n790R252M789P11O387r45J509P63K809j083l322K522
12900b896M87r036J879O795L865P908J1477M592K269j1752n812l171J2293o854
12886A2044j5053j0442q345o189j634J1408O342Q244R79O066j86m553q950J662
12872h607j047J741k025P442O042L372M006m709k139j540k432p412j095L246q346
$$ plain form
12972 4924 17028 20837 16541 15552 8662 6818 -5946 -21025 -21691 -7619 5167 5661 -8311 -8540
12958 -8540 -1028 2104 -4578 -29147 -19435 1283 7480 -14114 -16745 -900 -5313 -10668 -1558 -5503
12944 -5503 -5186 -8284 -11255 -10859 1676 -566 -4491 -8525 -13643 -9449 -13206 -5982 -440 10250 3438
12929 3438 -2455 3758 6264 7880 9042 6361 -9542 -12018 -10705 213 4165 5952 837 -3932
12915 -3932 -10499 -18958 -20498 -26288 -17036 -12247 -11536 -5149 -6094 -4585 -3822 -1013 -2096 -5418 -2896
12900 -2896 -2409 -11445 -9566 -2771 1094 9002 20479 25071 27340 15588 9776 6605 18898 12044
12886 12044 -3009 -13451 -21796 -27985 -29619 -18211 -11869 -3625 -2646 3420 3234 -1319 -10269 -8607
12872 -8607 -9654 -7913 -9938 -2496 3546 6918 10924 6215 4076 2536 104 -7308 -8403 -5157 -13503
12857a3503P960M262j976P38r04m482K855M137r5n191M489O088j593q308j898
12842g421k485L953k754M237j193j1197n024L473O424j1591J032P173L215M347
12828g811J761j1846L599K350M924k258M927j398q718J3789R400p15k31r215l502
12813d944l025j662o925r404r458J7322J6160K341l666N26n188J402M259R873
12799G611R236n039j6877O225J3729q731K31r802q318q560L848J799P441J2352
12785E145K524q487m247J464n59J828M281n577m022o572R60J5969O384P245j577
12770A4759j2437o488J341O868R061K778o544q395r025j1847K234J4538P25k911
12756e343K946n253R196l15l190r09m305q60r13l797M308L755J561M459M779k417
$$ plain form
12857 -13503 -5543 -1281 -3257 -2519 -3423 -7905 -5050 -913 -1008 -6199 -1710 4378 2785 -5523 -7421
12842 -7421 -9906 -5953 -8707 -4470 -5663 -16860 -21884 -18411 -11987 -23578 -22546 -15373 -12158 -7811
12828 -7811 -6050 -17896 -14297 -11947 -7023 -9281 -4354 -5752 -14470 -681 8719 8004 7773 -1442 -4944
12813 -4944 -7969 -9631 -16556 -25960 -35418 -18096 -1936 405 -3261 -2735 -7923 -6521 -2262 7611
12799 7611 16847 11808 -5069 1156 14885 6154 6385 -3417 -11735 -20295 -16447 -14648 -7207 5145
12785 5145 7669 -818 -5065 -3601 -4160 -2332 1949 -3628 -7650 -14222 -13262 2707 9091 16336 14759
12770 14759 2322 -4166 -2825 4043 13104 15882 9338 943 -8082 -19929 -17695 -3157 -2432 -5343
12756 -5343 -2397 -7650 1546 1231 -1959 -2868 -7173 -8033 -8946 -12743 -8435 -4680 -3119 1340 6119 3702
12740C702o837o328O430N781R177P854K406J876m631j1489l165n15k458o182Q260
12725C881N281j3688r444M575K673j415j1045n692k811N093M391j159o917K346
12711b3931Q468K153J237p83o29J2869M340L430J0572J0358n180p513p484o354
12697A553J935p642j2013m169k780M177J4123R570k620r048j4031O737J0292l851
12683g767K70L304k650J4385P042J3299M608k0860k0539r446n986M008O856K252
12669a1224K168j2351Q881K191Q457L386J3684p92J686n287n572O745p88j1702
12655e18m017r996k693L570M402p328J0007J1790K470o561o635m30J0568M441
12641I070L432j173j2525j929n599l592J0597M101O773J561r942k818j0726o463
$$ plain form
12740 3702 -3135 -9463 -3033 2748 11925 19779 22185 24061 19430 7941 4776 4261 1803 -4379 3881
12725 3881 9162 -4526 -13970 -9395 -6722 -8137 -19182 -24874 -27685 -22592 -18201 -19360 -26277 -23931
12711 -23931 -15463 -13310 -12073 -12856 -13485 -616 3724 7154 17726 28084 22904 15391 7907 1553
12697 1553 3488 -4154 -16167 -20336 -23116 -18939 -4816 4754 2134 -6914 -20945 -14208 -3916 -7767
12683 -7767 -7497 -4193 -6843 7542 14584 27883 32491 11631 -8908 -18354 -24340 -20332 -13476 -11224
12669 -11224 -9056 -21407 -12526 -10335 -1878 1508 15192 14400 16086 10799 5227 11972 11184 -518
12655 -518 -4535 -14531 -17224 -13654 -9252 -16580 -6573 5217 7687 1126 -5509 -5939 4629 9070
12641 9070 12502 11329 -1196 -3125 -8724 -12316 -1719 2382 9155 10716 774 -2044 -12770 -19233
12627a9233m872P889J0660J0628R292J42r096j8293p234j839J2705j021M154L874
12613b244o304n837L7O819K516o25j1946R162P634J156j339M529l43J3181k086
12598A4310j6047r274L317R33l866j0339o585q212K60O367J1841n217Q951O001
12584g560n788Q976j979n260M346P662N392j991o32K963q716j1754M489R598o79
12569i33k972n969l046q997J3319J4471R260n730r052N76P323r75q71M797M959
12554A6160r451p725J4282R772r112j1294O538P158J263m896o879r418M156m118
12540c564m260Q880p432p205P880P411J381l670K69L389l03K279p38q184m020
12525g887m253k575J0439J1890o639m885P489J0003P528n709k778j601N592m731
$$ plain form
12627 -19233 -24105 -16216 -5556 5072 14364 14506 5410 -12883 -20117 -21956 -9251 -10272 -6118 -2244
12613 -2244 -8548 -14385 -14348 -7529 -5013 -5638 -17584 -8422 -788 368 -971 3558 3215 16396 14310
12598 14310 -1737 -11011 -7694 -6761 -10627 -20966 -27551 -35763 -35503 -29136 -17295 -22512 -13561 -7560
12584 -7560 -13348 -4372 -6351 -11611 -7265 397 5789 3798 3166 6129 -2587 -14341 -9852 -254 -933
12569 -933 -3905 -9874 -12920 -21917 -8598 5873 15133 9403 351 927 8250 7275 6404 11201 16160
12554 16160 6709 -1016 13266 23038 13926 2632 9170 16328 17591 12695 5816 -3602 554 -3564
12540 -3564 -7824 1056 -6376 -13581 -5701 1710 3091 -579 -310 3079 2776 5055 4317 -3867 -7887
12525 -7887 -12140 -14715 -4276 7614 975 -3910 3579 13582 21110 15401 12623 11022 16614 11883
12511A1883j8165J0950n03J680l314p609M681N755K255j2270O879O060J94J304
12497I780o291n151J421p691m840j033M433P034P696R509o509J878j358O465O19
12482A5962k82r03o097n187M971L663j42j1875o214J4483R444J0791L941j4124
12468A8431p483O429J2994m021j3658L57K2627J4499J1753J7318J7464J4793J8939
12455A30442L5543N7963P2428J28896K08787M10690Q59033J417936O01525j073891
12445B849352j231806o79990l43027j85163j08065p6209n6134l9477k8304k0666
12435H0511j8675m260J292p748p038j639L947Q062n017j3302L708r30K673k5056
12421A6528r225r47J88O988o834n119J0807J0108L863l656j7497L960J1098l192
$$ plain form
12511 11883 -6282 4668 4165 5845 2531 -5078 -397 5358 7613 -4657 2222 8282 8476 9780
12497 9780 3489 -1662 -241 -7932 -12772 -13805 -9372 -2338 5358 14867 8358 10236 8878 15343 15962
12482 15962 15680 14777 8680 3493 8464 12127 11985 110 -6104 8379 17823 28614 32555 18431
12468 18431 10948 17377 30371 26350 12692 13049 35676 50175 61928 79246 96710 111503 130442
12455 130442 165985 223948 296376 425272 634059 1044749 1903782 3321718 3923243 2849352
12445 2849352 1617546 937556 594529 409366 301301 225092 168958 129481 101177 80511
12435 80511 61836 57576 58868 51120 44082 42443 46390 54452 49435 36133 39841 38911 41584 16528
12421 16528 7303 6356 6544 13532 6698 1579 12386 22494 26357 22701 5204 9164 20262 17070
12407A7070j8905j0625q95J7311R000o033k868m63N596P167r075j0661M702l119
12393a798k207M177J0841J5500J2117j733k4731j799Q404N372j026j4657o1N882
12379A4281R075J453r482q698n568j3993j779N956O151Q829J1460n62m536l874
12365H713O607j1298n087L89k925L041M838p903n779K353J3954M868N04j0650
12351A625j3002R71K830j2517Q41J0352L809p816k743p863l23J4389J1088N567
12337G208J146Q804l935J985J950n184j2060q523n216J382J4315J811q060l501
12323g878K391K546R031K018o90j0574k248r20j41k535j4202J421Q110O204N617
12308a850o142l162J1521R02N534k932j347j720L189J430L509m846n293l73N89
$$ plain form
12407 17070 -1835 -12460 -13355 3956 12956 6923 4055 3592 9188 16355 7280 -3381 1321 -1798
12393 -1798 -4005 172 11013 26513 38630 36897 12166 10367 18771 24143 23117 8460 8399 14281
12379 14281 23356 24809 15327 6629 1061 -12932 -14711 -8755 -2604 6225 17685 17123 12587 8713
12365 8713 15320 4022 -1065 -676 -3601 -560 4278 -3625 -9404 -7051 6903 11771 12275 1625
12351 1625 -11377 -10406 -7576 -20093 -19252 -8900 -5091 -12907 -15650 -23513 -23836 -9447 1641 7208
12337 7208 8354 17158 13223 15208 17158 11974 -86 -8609 -13825 -12443 1872 3683 -4377 -7878
12323 -7878 -5487 -2941 6090 8108 7418 -3156 -5404 -6324 -6465 -9000 -23202 -21781 -13671 -7467 -1850
12308 -1850 -7992 -11154 367 1269 6803 3871 2524 804 3993 5423 8932 4086 -1207 -1580 -991
12293i91O174K136L89q39L038O934J212J677n360j6071j0917R393N803l669M40
12278f51J3722m429o258Q657j2476q846J2989n700o476q066r761R673J5970n097
12264f749R58O298N221K162M346r990l887n58q896J1503O825O79j063p105n758
12249f014M013M599k833n222O581O14k705m167l226k082J3612P731J2279n904
12235A7276j6371r421J2791P831K594J625j0368j5197m736p55J3730J4373Q627
12222B1999k858n607P645N080r1j3047r046M401P642m184q815l239J656J253m861
12207b072q576L481Q099J9628p546j8741p499m019O675m949j0193K1964Q119n953
12193a582PL266j0320m739Q119R973k266O443J6044M846k637M470n448m805j110
$$ plain form
12293 -991 5183 7319 7708 6869 9907 16841 18053 19730 14370 -1701 -12618 -3225 2578 -1091 -651
12278 -651 13071 8642 2384 11041 -1435 -10281 2708 -2992 -9468 -17534 -27295 -17622 -1652 -6749
12264 -6749 -5791 507 5728 7890 12236 2246 -1641 -2199 -11095 408 7233 7912 6849 -256 -6014
12249 -6014 -2001 2598 -235 -5457 1124 1738 -967 -5134 -8360 -10442 3170 10901 23180 17276
12235 17276 905 -8516 4275 12106 14700 16325 5957 -9240 -13976 -14731 -1001 13372 21999
12222 21999 19141 13534 21179 26259 26168 13121 4075 8476 16118 11934 3119 -120 1536 2789 -2072
12207 -2072 -10648 -7167 932 20560 13014 -5727 -13226 -17245 -10570 -15519 -25712 -3748 4371 -1582
12193 -1582 -1575 1691 -8629 -13368 -5249 4724 2458 8901 24945 29791 27154 31624 26176 21371 20261
12178B0261q709o048j896m795J2260K120j8096n605J1993J436Q203K78p928q778
12164e304j226l565j8127k97Q370k669M098J0525o870k133r11J3813J834M425
12150A963j523j4451J103K0511O561j3021K491J4723P036j4695K897k780j339
12137I476J323m622k592N267O159q576o491J4617K032m263L249J474m702k56n426
12122F669J439j735n854m189j1352j1628q868Q529K3025O254m303r730m758M575
12108a1926n993q21Q802o384k426k931P702q57k345Q072J257j024l598M990L158
12093d324j0551O41P984k658o765M320K812M177j760J4552j6607m402Q276J1054
12079F749j161P67M311l548n735m831Q798m43l38j008j3544O720L717j2044M506
$$ plain form
12178 20261 11552 5504 3608 -1187 11073 13193 -4903 -10508 1485 2921 11124 11402 3474 -5304
12164 -5304 -6530 -10095 -28222 -28519 -20149 -22818 -18720 -8195 -15065 -17198 -18109 -4296 -2462 1963
12150 1963 440 -14011 -12908 7603 14164 1143 3634 18357 25393 10698 13595 10815 9476
12137 9476 10799 6177 3585 8852 15011 6435 -56 14561 16593 12330 15579 17053 12351 12095 6669
12122 6669 8108 6373 519 -3670 -15022 -26650 -35518 -26989 -3964 2290 -2013 -11743 -16501 -11926
12108 -11926 -17919 -18740 -9938 -16322 -18748 -21679 -13977 -14834 -17179 -9107 -7850 -8874 -12472 -7482 -4324
12093 -4324 -14875 -14234 -6250 -8908 -15673 -11353 -8541 -4364 -6124 8428 -8179 -12581 -4305 6749
12079 6749 5588 6355 10666 7118 1383 -3448 5350 4907 4569 3561 -9983 -3263 454 -11590 -7084
12064g084P124m458k691L071o918l557J1284Q957K609l713k898r367n913j1227
12050b4781n887J1737J9862o746j071n218K921n637j312J0884N438l362n22l479
12036g173r27N962O547q966q029l978l014L577K588K060Q608O314q48n757O302
12021C266L100o035p704l831O414L969J303r232n450M592q955k034Q145K2254
12007I802J2083L630q438j2332N344r876q61q999J2466M55j1132N430L730l902
11993b600M434J024K815p30M896n61L144N165L227j6954k495k500k187J683j1967
11978a3606r52m777J47M42k025j036m005M638K533K359m716Q759N638M798J3435
11963A1632J449l105Q49l415n896K732j478r57M230M032o78j0451o916P425r92
$$ plain form
12064 -7084 40 -4418 -7109 -4038 -10956 -14513 -3229 5728 8337 4624 1726 -7641 -13554 -24781
12050 -24781 -30668 -18931 931 -5815 -6886 -12104 -9183 -14820 -16132 -5248 190 -3172 -3694 -7173
12036 -7173 -8100 -2138 4409 -4557 -12586 -16564 -19578 -16001 -13413 -11353 -2745 3569 2721 -3036 3266
12021 3266 6366 331 -7373 -11204 -4790 -821 482 -8750 -14200 -9608 -18563 -20597 -12452 9802
12007 9802 21885 25515 17077 4745 10089 213 -648 -9647 2819 3274 -7858 -2428 1302 -2600
11993 -2600 1834 2858 5673 4943 9839 9278 12422 17587 20814 3860 1365 -1135 -3322 -1639 -13606
11978 -13606 -14558 -19335 -19188 -18746 -20771 -21807 -25812 -21174 -18641 -16282 -20998 -12239 -6601 -1803 11632
11963 11632 13081 9976 10825 7410 1514 4246 2768 1811 6041 10073 9395 -1056 -7972 -547 -1539
11948a539K718J6610J0633j4336r436o399m44N058R460o07j396k284n994J013
11934C057L082k910m191P180J3939m958l576j3840k832j682j1867n577O862P463
11920i850M045R347L267m514N668P721n861j527K467j799J3751p467r953j851
11906C444m849q966K257K959j2450l649K089J574K33J9929L514j5002m444k063
11892a5424p612M166O265J411L333p873N389R788J0120J1038p968j0743k755r811
11878a0676J0182J1706j0246o461K308k513j921O904O2J0135N722q581L402O664
11864A6687R50o97l345l501p271o578K2522P58n574j4453l958L556r43O264O295
11849A0712l340J782J439Q674K731n937r255o832j265N645m540L82J3656l647
$$ plain form
11948 -1539 1179 17789 28422 14086 4650 -1749 -2193 2865 12325 11718 10322 8038 2044 3057
11934 3057 6139 3229 -962 6218 20157 15199 11623 -2217 -5049 -6731 -18598 -24175 -17313 -9850
11920 -9850 -5805 3542 6809 2295 7963 15684 9823 8296 10763 8964 22715 15248 5295 3444
11906 3444 -1405 -10371 -8114 -5155 -17605 -21254 -19165 -17591 -17358 2571 6085 -8917 -13361 -15424
11892 -15424 -23036 -18870 -12605 -11194 -7861 -15734 -10345 -557 9563 20601 12633 1890 -865 -10676
11878 -10676 -494 11212 966 -5495 -3187 -5700 -7621 -717 -655 9480 15202 6621 10023 16687
11864 16687 17637 16940 13595 10094 2823 -3755 18767 19525 13951 -502 -4460 -904 -1847 4417 10712
11849 10712 7372 9154 10593 19267 21998 16061 6806 -26 -1291 4354 -186 196 13852 10205
11835A0205K841K52k588j0667Q54P931j0198M397J2664n55j4074Q272n737j1760
11821h163K132J382J0645J9244R06j3847q504j0708R063J0886k374p346j2107
11808h791j905J3899M776p099o155N407L343P698P644o12n530k507J217n280O673
11793A2778o006j6778j335K0076M922j3911l014m868j2666j6301J746J3759J3730
11780g868o48k844K535O037O901o635m194J911n553o963J1942L571p160m848K956
11765a0860R558M452N705m460K300r916M269J5689j5432k3107q40l375l033L971
11751b5079J3084M354K177P658J707p405r659K283J6229J800j3623j6618m189
11738b7281J5783Q166L30N45p534M014n944n644K075J8958O33K055L469P679j430
$$ plain form
11835 10205 13046 13298 10710 43 897 8828 -1370 3027 15691 15136 1062 9334 3597 -8163
11821 -8163 -6031 -4649 5996 25240 26146 12299 3795 -6913 2150 13036 10662 3316 -8791
11808 -8791 -10696 3203 7979 880 -5275 132 3475 11173 18817 18205 12675 10168 11385 6105 12778
11793 12778 6772 -10006 -11341 8735 13657 -254 -3268 -8136 -20802 -37103 -35357 -21598 -7868
11780 -7868 -8516 -11360 -8825 -2788 4113 -2522 -6716 -4805 -10358 -17321 -5379 -1808 -8968 -13816 -10860
11765 -10860 -1302 3150 8855 4395 6695 -3221 1048 16737 1305 -21802 -22642 -26017 -29050 -25079
11751 -25079 -11995 -7641 -5464 2194 3901 -3504 -13163 -10880 5349 7149 -6474 -23092 -27281
11738 -27281 -11498 -3332 -3002 -2457 -9991 -5977 -11921 -17565 -15490 3468 4101 6156 9625 17304 15874
11723A5874o314k053L629k591P347n67o666K693P61p056q225J471J311M18q756
11708h724p37n412L646J0590o603l359j271J254K703N188J584o51P625K486k0761
11693a2442o005R028n702O746L752m970n4J738N938m72j1880O703J4601M160j195
11678I946L61O948O921o651j0054j636r18j3790k1281P015J4187J262k832l814
11664a4336q90L251O86J006j3303o542p16j875J505J280j326k107K429Q484Q359
11649a4095M335L097j618J185P107M71J671r295m776o066P329J107J4303J858
11635F613q677P475m070q673J289Q710K299o823J605n066o88M011l323k939L480
11620d777k862O807J1456Q75M320m897n720O236J2810p04k2135l371J3508K580
$$ plain form
11723 15874 9560 7507 11136 8545 15892 15325 8659 11352 12113 5057 -3168 -1697 -386 32 -8724
11708 -8724 -9461 -14873 -11227 -637 -7240 -10599 -11870 -10616 -7913 -2725 -1141 -1792 5833 8319 -12442
11693 -12442 -18447 -9419 -15121 -8375 -4623 -9593 -9647 -7909 -1971 -2443 -14323 -7620 6981 11141 9946
11678 9946 10307 17255 24176 17525 7471 5835 4917 -8873 -30154 -23139 -8952 -7690 -10522 -14336
11664 -14336 -15226 -11975 -11289 -10283 -23586 -30128 -30844 -32719 -31214 -29934 -31260 -33367 -30938 -22454 -14095
11649 -14095 -9760 -6663 -8281 -7096 11 482 2153 -7142 -11918 -17984 -10655 -9548 4755 6613
11635 6613 -2064 5411 1341 -7332 -6043 2667 4966 -1857 -252 -5318 -6006 -1995 -5318 -8257 -4777
11620 -4777 -7639 -832 10624 11499 15819 10922 5202 11438 24248 23544 1409 -1962 11546 14126
11606A4126L689l941n714K671n972j0141o195J1983N708J541j53j257K436K596
11592A1377Q097M270O08n945j6122p556j359J2033J2606Q351O664m483r344M269
11578B3466M785K112J1949J1961m097j633M664Q26K081l600Q875R423M180Q81
11564G5873o002O80J741N972J8483R321j4100J0265k895j3920j7842j1479P107
11551F3204J0670O061q52o717Q82j5969j2654l378k465P266p391l697l30j6439
11537A8191l734J2812L718k245q549j2136J210O268k68K077n039Q35o873N753
11523A2020m424k117J6370m1l350R68J6206P005o053p507M925K932n615K676o254
11508B7741j3703n619k738K23K06L087j3606R898J167K271Q677K920k229L667
$$ plain form
11606 14126 17815 13874 8160 10831 4859 -5282 -11477 506 6214 7755 7602 6345 8781 11377
11592 11377 19474 23744 24352 18407 2285 -5271 -6630 5403 18009 26360 33024 28541 19197 23466
11578 23466 28251 30363 42312 54273 50176 48543 53207 54033 56114 52514 61389 70812 74992 75873
11564 75873 69871 70551 72292 78264 96747 106068 91968 102233 99338 85418 67576 56097 63204
11551 63204 73874 79935 79083 72366 73248 57279 44625 41247 38782 46048 38657 34960 34630 18191
11537 18191 14457 27269 30987 28742 20193 8057 9267 15535 15267 17344 12305 13140 6267 12020
11523 12020 7596 5479 21849 21808 18458 19426 35632 42637 36584 29077 34002 36934 31319 33995 27741
11508 27741 14038 8419 5681 5904 6110 9197 -4409 5489 6656 8927 17604 20524 18295 21962
11494B1962j918r007n757J1619l315o058R80P46N966J0657r049j2352j0850k93
11480f669J0144K062N693O31n111n239O090q24J413j320N67L056j317m345J835
11465F666M709Q606J071m856k753M32N242o365l184k137m720L115k56k14J806
11450G162Q747Q31l101m670q634R859k235l864l244l151O107K126q233o614R867
11435I53P968n784J039J2449L366L212j5045K295M505K03L997O83O605O194o935
11420B5705j0012r998P446q39j1900j1944Q195R692L523L428j2538j1417j991
11407a2650R971J6404r826j026P790M196K780k966j921J769P13p748Q395P287
11393B3168J033j0193M569l19k205N815o64o50R892N893J346O92m035P435m028
$$ plain form
11494 21962 20044 11037 5280 16899 13584 7526 8506 9252 15218 25875 16826 4474 -6376 -6669
11480 -6669 3475 5537 11230 11861 6750 1511 7601 6777 8190 6870 7437 10493 9176 4831 6666
11465 6666 11375 19981 21052 16196 13443 13875 19117 12752 9568 7431 2711 5826 5570 5356 7162
11450 7162 15909 16740 13639 8969 335 10194 7959 4095 851 -2300 3807 5933 -2300 -8914 953
11435 953 8921 3137 4176 16625 19991 23203 8158 10453 14958 15161 19158 19841 26446 32640 25705
11420 25705 15693 5695 13141 12302 402 -11542 -3347 6345 9868 13296 758 -10659 -12650
11407 -12650 -2679 13725 3899 2873 10663 14859 17639 14673 12752 14521 15234 7486 15881 23168
11393 23168 24201 14008 18577 18258 16053 21868 21204 20554 30446 36339 37685 38377 34342 41777 37749
11378C7749l642p592m964N936J3651Q195J1863N057m523J0532m17o05o07J7694
11364H8327J2631K917j5676j4510Q988J1423O854M494L765k190j0366j7004o139
11351G3514J474m272p848j1299l473J044n094j0572q512m665J6675O20J1262L331
11337E2185j5125p745j6553l501L375Q61j848p907j3146R322J1372N508L467N297
11323B5562J1788n219n608m981l09R668N465j7160j2021n588J90j0527p231j716
11309a7687J84J7580Q529J141K980L406l725J1585R65n800r75q348N819M155q671
11294A1138p054K750L279K898j123R894j782j0626L571n195n096k904p044K351
11280d943k502j587L194J786R828O684K915o571L494K103m755M644L405O577N336
$$ plain form
11378 37749 34107 26515 21551 27487 41138 49333 61196 66253 61730 72262 71845 71240 70633 88327
11364 88327 100958 103875 88199 73689 82677 94100 100954 105448 109213 107023 96657 79653 73514
11351 73514 74988 70716 62868 51569 48096 49140 44046 33474 24962 20297 36972 37592 48854 52185
11337 52185 37060 29315 12762 9261 12636 13497 11649 3742 -9404 -82 11290 16798 20265 25562
11323 25562 37350 32131 26523 21542 21233 30901 36366 19206 7185 1597 1787 -8740 -15971 -17687
11309 -17687 -17503 77 8606 9747 12727 16133 12408 23993 24958 19158 18183 9835 15654 19809 11138
11294 11138 4084 6834 10113 13011 11888 21782 20000 9374 12945 7750 2654 -250 -7294 -4943
11280 -4943 -7445 -9032 -5838 -4052 5776 12460 15375 8804 12298 14401 9646 14290 17695 24272 29608
11265B9608n237j757l916O441L772j9678j2255J840O539R047O357r097o126O28
11251F166n681k398K774o400m529O689P859J661J1767L4j3675j0653O018Q939
11237H571J517J1078Q452j4615j3797O755Q398j2166n199M722M613m142j58j7
11223D012n834M662J26p301J3182J770Q262o31p645o405L249R51o659j1202m630
11208a4093O059Q709J395p354j0181Q539J1996J190p776O724J0125J025q065k472
11194E821L588p801j774Q385k549n597J1756J0481n188p89n107r705j0096l515
11180a2090O120O905J0700p241N622o90q664p473P90M510Q839p381J0254J13J926
11165A2240R643m025J89l01k0791L966N989p748M5L982L038k998pq201j695M64
$$ plain form
11265 29608 24371 22614 18698 25139 28911 9233 -3022 -1182 5357 14404 20761 11664 5538 6166
11251 6166 485 -1913 861 -5539 -10068 -3379 4480 6141 17908 17942 4267 -6386 -368 8571
11237 8571 10088 21166 29618 15003 1206 7961 16359 4193 -1006 3716 8329 4187 4029 4012
11223 4012 -1822 2840 2966 -4335 8847 10617 18879 18248 10603 4198 7447 8398 1739 -9463 -14093
11208 -14093 -8034 675 2070 -5284 -15465 -6926 5070 6260 -1516 5208 15333 16358 8293 5821
11194 5821 9409 1608 -166 8219 5670 73 11829 22310 17122 16333 11226 1521 -8575 -12090
11180 -12090 -5970 935 11635 4394 10016 9326 662 -6811 -6021 -1511 7328 -53 10201 10314 12240
11165 12240 21883 17858 18047 17746 -3045 921 6910 -838 -793 3189 6227 3229 3222 -4979 -6674 -6210
11149f210K555J1698O242n508j5806r871J7132K909r32L676M117O540j785k797
11135A1960M618j4020n21K538n135L789O786R881J7867O9j1808o313o397j060
11121A2254j1412j0590J0351J1383n344p238p18l637Q875J1247Q706l603K03q947
11107A1530p929r316M947m503l504o647R201J0794K337j108q2J0712l854j2702
11093a24N323J0651Q342L643j192k969j0459j695M70k672N201p243O748O56q163
11078F517K853J401K252p77M555l350N17l205q557p127J998M259P327K051N395
11063A6109p021r998N274R007J33O984J911l905k09M116j309n488L455m763k317
11048A1979L565j1393J319m78k3095N954J2526N282n298J1158L489L657J138m092
$$ plain form
11149 -6210 -3655 8043 14285 8777 -7029 -16900 232 3141 2209 5885 10002 16542 14757 11960
11135 11960 16578 2558 2037 4575 -560 3229 10015 19896 37763 37832 26024 19711 13314 12254
11121 12254 842 -9748 603 11986 6642 -596 -1314 -4951 3924 15171 23877 20274 20477 11530
11107 11530 3601 -5715 -768 -5271 -8775 -15422 -6221 4573 6910 5802 5720 16432 12578 -124
11093 -124 5199 15850 24192 27835 26643 23674 13215 11520 11990 9318 14519 7276 14024 14680 6517
11078 6517 9370 10771 13023 12246 16801 13451 13968 10763 2206 -4921 -2923 1336 8663 10714 16109
11063 16109 9088 -910 4364 13371 13504 20488 22399 18494 18285 22401 21092 15604 19059 14296 11979
11048 11979 15544 4151 5470 4992 -18103 -12149 377 5659 361 11519 15008 18665 19803 15711
11034A5711p466m38N116M320k638l383j610N886q21j568q343K126N583q838o112
11019b475m084J691Q249r068K332O734m246N384Q227Q169q95L974p773n10p830
11004G879J277Q653q943q846J1860M029k084M653M903r782L058R654l700K370
10990B4981Q0j770j0830j2832j0342J349M521Q862p068N111J1284J1385j2957
10977A1774k902J1363Q300n619r367l288p499O381M335n694j264P53Q456j433
10963A4296j609R301j744j1174M467m48k773R708O407l245O23m305N627K763o012
10948B1882o209l476l821K028M110r614L167M605m018M891L142K7M335J1359m380
10933B8028l304p213o66Q79L424Q978j795P826J7550P318P634R83n77J6919L2275
$$ plain form
11034 15711 8245 7807 12923 17243 14605 11222 9612 15498 14677 13109 4766 6892 12475 3637 -2475
11019 -2475 -6559 -4868 3381 -5687 -3355 3379 -867 4517 12744 20913 20018 23992 16219 15709 7879
11004 7879 9156 17809 8866 20 11880 15909 13825 18478 23381 13599 16657 26311 22611 24981
10990 24981 25061 23291 12461 -371 -10713 -9364 -4843 4019 -3049 2062 13346 24731 11774
10977 11774 8872 20235 28535 22916 13549 10261 2762 9143 13478 7784 6520 7273 15729 14296
10963 14296 12687 21988 20244 9070 13537 13089 10316 20024 26431 23186 23809 19504 25131 27894 21882
10948 21882 15673 12197 8376 10404 14514 4900 8067 12672 8654 13545 16687 16714 21049 32408 28028
10933 28028 24724 17511 16845 17724 21148 30126 28331 36157 53707 61025 68659 69642 69065 85984 118259
10918A18259L0360M8470O8115Q6504J53646K79206M81997O08056K25818m35867
10908A664564n81316m01330k30642j28194p6112m9973m4242k6638q570j6597j0478
10897I0472j7625p562q87K019n268k497j3992r769r399J391k809n278M219j419
10883B1596Q697J649R750n032o859J875N195J992o010o609L812n485p997J948
10869A8522L713p184n570k830P489m030j2015L739q987Q124J590J606n666n294
10855f793p3l238R26J4295N501J043K261J0096J077q792n866O965l362l012q20
10840A0208m086m168n984j073J19J1271J6699P512J1370j928j7425q587r129M947
10826I746P448K247M485L664r332q24j989j0199m761J876R412R675p977M262J0161
$$ plain form
10918 118259 148619 197089 265204 351708 505354 784560 1266557 1874613 2100431 1664564
10908 1664564 1083248 681918 451276 323082 246970 196997 152755 126117 117547 100950 90472
10897 90472 72847 65285 64398 66417 61149 58652 44660 34891 25492 26883 24074 18796 23015 21596
10883 21596 30293 31942 41692 36660 29801 31676 36871 38863 32853 26244 30056 24571 16574 18522
10869 18522 22235 15051 9481 6651 14140 10110 -1905 1834 -7153 971 2561 4167 -1499 -6793
10855 -6793 -6866 -10104 -9178 5117 10618 11661 13922 24018 25095 16303 10437 17402 14040 11028 10208
10840 10208 6122 1954 -4030 -5103 -4984 6287 22986 30498 41868 39940 22515 13928 4799 9746
10826 9746 17194 19441 23926 27590 18258 17434 15445 5246 485 2361 11773 21448 13471 17733 27894
10811B7894k181m741Q55P971j2435j0998j765p450l943L81J1846K465M119n503
10797F515J0446K939l012j387O91l794L146O431L114J652m117J0153r37q390O282
10782B9732J0494O277J0571n304k841l000J957M695j098l359j0409R470J1649
10769E8834p446k098j0201k208J2690J3847K646N367J726k564P370J6888L9609
10756A34460O5109K3542O943L7924J9920n3870r1688n1194k1629j7490q777L185
10744D6435J1100K327M09q489j6702j7288N231M852J3454P561o761M796P133M369
10730E8427l019j995j1328k2989j1598o063J1814J3647J7289J3991j518q527J50
10717D8281o040o451m428r585O68J3449M549m743o697L530M350o640O506J8658
$$ plain form
10811 27894 25713 20972 21827 29798 17363 6365 4600 -2850 -6793 -6412 5434 7899 12018 6515
10797 6515 16961 19900 16888 15501 16192 12398 15544 21975 25089 26741 22624 32777 31840 23450 29732
10782 29732 40226 46503 57074 51770 48929 45929 47886 52581 51483 48124 37715 47185 58834
10769 58834 51388 49290 39089 36881 49571 63418 66064 71431 73157 70593 77963 94851 134460
10756 134460 199569 223111 230054 267978 287898 234028 142340 91146 69517 52027 43250 46435
10744 46435 57535 59862 60271 51782 35080 17792 23023 27875 41329 48890 42129 46925 54058 58427
10730 58427 55408 53413 42085 19096 7498 1435 13249 26896 44185 58176 56658 48131 48281
10717 48281 42241 35790 31362 21777 22445 35894 40443 35700 29003 32533 36883 30243 36749 55407
10703E5407J1204k046K885j2187j4341j1265n508n618n73r091j1385P702L4355
10690C9539J6911j0646k7057j9605j2873o798j4716o173J3695K5069J7311J918
10678A6575r476n590J5080J2125r718j2163J1070J3058N969l154j2673n801r53
10665A4349j714J458K366K073J7823J612k65Q691o935k4993k8560j8379J8279
10652a4195M4718M7198J2830P870Q806k340O400k569j78J520p15j2013j7333p975
10638G2024o748k475M751N578k3562j9169k3657k9286m3865o3393o099J82441
10626D6540K63542J03565l1795m4391k6335j9919k2086j8575j5082j5371j7911
10615B02182l965r449o942O023N951q482j401j001p868M652j051q488j7165K833
$$ plain form
10703 55407 66611 64565 67450 55263 40922 29657 24149 18531 17958 8867 -2518 5184 39539
10690 39539 56450 45804 18747 -858 -13731 -20529 -35245 -41418 -27723 -2654 14657 16575
10678 16575 7099 1509 16589 28714 18996 6833 17903 30961 36930 33776 21103 15302 14349
10665 14349 12635 14093 16459 18532 36355 37967 37702 46393 39458 14465 -14095 -32474 -14195
10652 -14195 30523 77721 90551 98421 107227 104887 111287 108718 108540 110060 109345 97332 79999 72024
10638 72024 65276 62801 67552 73130 49568 30399 6742 -22544 -66409 -129802 -135901 46540
10626 46540 310082 413647 381852 337461 311126 291207 269121 250546 235464 220093 202182
10615 202182 198217 188768 181826 187849 193800 185318 183917 182916 175048 179700 178649 170161 152996 155829
10601A55829K8836J1636J371K010K555p284l786J680J7590N224J9267K2849J5449
10588B73226J3566J7974K5744J2565m065j6171j3069k1669j5371J3107K1654K3106
10576C30597P957j3976j1197m586k492Q300O849K2746J5018J4165L4947M0259
10564D48587L6401K7670M0383M6085P1710Q6453J14091J99556L92125O14266N79124
10553B656451m3888n58906n18463l21161j74567r2185m2870P167M4105N9581M9887
10542A065151M8893L1053P751J9846J9915L9716Q3940J24495R8851M7117O3998
10531A650726J22969J68827K00109K49422L72380N46259P95351Q93013L23813
10522E322869l41948k94145N9424L22255N14250O35109P78224R54233J128153
$$ plain form
10601 155829 184665 196301 197672 199682 202237 194953 191167 192847 210437 215661 234928 257777 273226
10588 273226 286792 304766 330510 343075 339010 322839 309770 288101 272730 285837 307491 330597
10576 330597 338554 324578 313381 308795 306303 314603 321452 344198 359216 373381 408328 448587
10564 448587 484988 512658 553041 599126 670836 757289 871380 1070936 1463061 2077327 2656451
10553 2656451 2612563 2053657 1535194 1214033 1039466 947281 904411 911578 955683 1015264 1065151
10542 1065151 1114044 1145097 1152848 1172694 1192609 1232325 1316265 1440760 1539611 1586728 1650726
10531 1650726 1773695 1942522 2142631 2392053 2764433 3310692 4106043 4999056 5322869
10522 5322869 4980921 4686776 4746200 5068455 5582705 6217814 6996038 7950271 9078424
10513I078424J456833K011658K674184L448485M492345O414707R707449J5312357
10505E4596442K6037553M7312196Q5967092J21102492O1382094p1432275j15444293
10498B09521301q0776801m6042068k5963957j5475254r874326o575791m655989
10491B0157115l732761l016794k276484j736237j356376j090522q82115o59230
10483E406596m62173l51777k65895j61365K0873K95227K21739m50614p67906n95462
10473B889243m21040k84954k04505j72482j83142j64235p5885m4277o3399p6183
10463A199141q3685q1797q2023n5588k3300j5014j405r26j4213m0695o1419m7009
10451F92067k9767j8802k0773k1975k3223j6209k0839l1736k6205j4619l909p192
$$ plain form
10513 9078424 10535257 12546915 15221099 18669584 23161929 29576636 39284085 54596442
10505 54596442 80633995 127946191 213913283 335015775 396397869 324965594 209521301
10498 209521301 128744500 82702432 56738475 41263221 31388895 24813104 20157115
10491 20157115 16424354 13407560 11131076 9394839 8038463 6947941 6065826 5406596
10483 5406596 4944423 4592646 4326751 4165386 4186259 4481486 4703225 4252611 3484705 2889243
10473 2889243 2468203 2183249 1978744 1806262 1623120 1458885 1383000 1338723 1275324 1199141
10463 1199141 1115456 1033659 951636 896048 872748 857734 856329 855403 841190 800495 739076 692067
10451 692067 662300 643498 622725 600750 577527 561318 540479 508743 482538 467919 464010 456818
10439D56818q925p301M756q377k655N115l433j3085j1988j4864p211k5881k4993
10426C37976k4107q930P456N989l776j3943l4686k5010k2267k1353J38J2810M342
10413B14639R634J4080K0480M420j3974p519j71j456N118M482j515K178J0161
10400B60557J1062j301j2574r620j2855j2145Q95j0295j42j271k090n931j406
10387B02884R743o126j9153j8970l492O550J7511J3624L5031P1584J02393J48346
10375E59925K13145P0883r4592j03621q6708o0230n3295k3295j4059o649k578
10364C98926q999o169p061j7876R077R666K1272J6875n873J4465J9270J2263L1263
10351D87099N6427P6589O2972L0603K2240N493O050L4097N8560N8982O8748P8306
$$ plain form
10439 456818 447893 440592 445348 436971 434316 439431 435998 422913 410925 396061 388850 362969 337976
10426 337976 313869 304939 312395 318384 314608 300665 265979 240969 218702 197349 197487 210297 214639
10413 214639 224273 238353 258833 263253 249279 241760 241589 240133 245251 249733 248218 250396 260557
10400 260557 271619 270318 257744 248124 235269 223124 224019 213724 213582 212311 210221 204290 202884
10387 202884 212627 206501 187348 168378 164886 171436 188947 202571 237602 309186 411579 559925
10375 559925 773070 843953 749361 645740 559032 498802 445507 422212 408153 401504 398926
10364 398926 389927 383758 376697 358821 367898 377564 398836 415711 409838 424303 443573 455836 487099
10351 487099 543526 620115 683087 713690 735930 741423 747473 781570 840130 899112 967860 1046166
10339A046166Q3041R7334J04067R5179J45820J71180J81963K05631K36859K78500
10329B645740L16470L59937M23623M92016N46304O08831O37471O43623O35505
10320G309520N72314M60341K98022J23972n6423j95749k89343l61761l72428l52005
10310G136460l28238l07568k81841k52843k00427j44769r6520p6946m6399J1968
10300E412877N9983J15813J65704K11124K92989L65913M34065N42869O58529P94236
10290I054102R65224J135212J310021J489497J649031J690329J573638J269243
10282B0136297P52274Q8446n86746j143620j520011j670893j647741j554387j394187
10273A1459432j195461j022488q66173p24231o05630n03197m02622l30626k72480
$$ plain form
10339 1046166 1129207 1226541 1330608 1425787 1571607 1742787 1924750 2130381 2367240 2645740
10329 2645740 2962210 3322147 3745770 4237786 4784090 5392921 6030392 6674015 7309520
10320 7309520 7881834 8342175 8640197 8764169 8707746 8511997 8222654 7860893 7488465 7136460
10310 7136460 6808222 6500654 6218813 5965970 5765543 5620774 5524254 5447308 5400909 5412877
10300 5412877 5472860 5588673 5754377 5965501 6258490 6624403 7058468 7601337 8259866 9054102
10290 9054102 10019326 11154538 12464559 13954056 15603087 17293416 18867054 20136297
10282 20136297 20888571 20977017 20390271 19246651 17726640 16055747 14408006 12853619 11459432
10273 11459432 10263971 9241483 8375310 7651079 7045449 6542252 6139630 5809004 5536524
10264E536524k12292j58906j16207p0137l7125J2214N7894J05499J44369J73705
10254E435538J96201K26517K51675K98245L30222L28018K97244K29927J27351
10245G720938J4522j18678k56691l82813m95852n50742n46194n31992n20004m76561
10235C855933m27980l73703l25055k84706k58305k24166k01872j78947j49478
10226A431721j33587j26059r9776q4227p9257p2137n3862n6882m0186l7729n7986
10215E90033m2493j1468k3117k1093j6686k0137j5959j7843k8844k4737k7506
10204C40150n31K613K754j5145j2160j3291j0009o602j4443k3969r680M98o808
10191B33377m267j0364j6442m06Q724m387j0073P729p476q489o338L920Q863M022
$$ plain form
10264 5536524 5324232 5165326 5049119 4978982 4941857 4954071 5011965 5117464 5261833 5435538
10254 5435538 5631739 5858256 6109931 6408176 6738398 7066416 7363660 7593587 7720938
10245 7720938 7735460 7616782 7360091 6977278 6481426 5930684 5384490 4852498 4332494 3855933
10235 3855933 3427953 3054250 2729195 2444489 2186184 1962018 1760146 1581199 1431721
10226 1431721 1298134 1172075 1072299 988072 908815 836678 782816 725934 685748 648019 590033
10215 590033 547540 536072 512955 491862 475176 455039 439080 421237 392393 367656 340150
10204 340150 339619 342232 344986 329841 317681 304390 294381 287779 273336 249367 239687 240185 233377
10191 233377 229110 218746 202304 201898 210622 206235 196162 203891 196415 187926 181588 185508 194371 198393
10177A98393l466o142j5047j2360j0180L40O704M075P439q723j2804j641k70K217
10163A48535Q967l677q624J297R768J3547K504j1035k516O944J2931M915q289
10150A75267j6173p958m599N114N592n234j1854j7525j0301R384L270J759N17
10137A27259P873j2193R52n078j8027N440Q304J886O575j0167n493j0200K187
10124I9318Q080n123N700J1375J6024l610q471j8634o136k122m0l996j4987L95
10110G7773J6340J8505r450j1930L93R755K844j285N609L575J0691J2558J2662
10097A48040J6766O538J0801K3893M1774N3442R8562J65218K63678M77244O22163
10086A928119K03466m53281n80118l93340k29350j32909p3417m9325k8307j7666
$$ plain form
10177 198393 194927 188785 173738 161378 151198 151538 158242 162317 169756 161033 148229 146588 146318 148535
10163 148535 157502 153825 145201 146498 156266 169813 172317 161282 158766 165710 178641 183556 175267
10150 175267 159094 151136 146537 151651 157243 152009 140155 122630 112329 121713 124983 126742 127259
10137 127259 135132 122939 123891 118813 100786 106226 114530 116416 122991 112824 107331 97131 99318
10124 99318 107398 102275 107975 119350 135374 131764 123293 104659 98523 96401 96361 92365 77378 77773
10110 77773 94113 112618 103168 91238 91631 101386 104230 102945 108554 112129 122820 135378 148040
10097 148040 164806 171344 182145 206038 247812 301254 399816 565034 828712 1305956 1928119
10086 1928119 2131585 1678304 1098186 704846 475496 342587 269170 219845 191538 173872
10076A73872l2338k3816j8345k979N811J56j201q628o535r645r569M566R59j404
10062G0904L044q176j4462L307r982k830l050O42O006J3780n384k599P177N814
10048F4191p438k823M546j529O681J3681k674j44O23O168R180K7338K7126L9758
10034A84684R0813J96020M21900N84539L5870n35949m24050k22268j24657o3616
10024A43286l9285j1014k660j5309j4436n961k783n766K189o346n212J248M766
10011D2717l127o453m071M449o817j2058K03R184l420Q726M310j138J309n325
9997B8489P595K162J570n98m346k090j473k153M526N481O867K6j2207R219K808
9982D5876M048k461j1382j087j1327j459l915L978P890N157P185P106J148r809
$$ plain form
10076 173872 141534 117718 99373 96394 102205 102361 101160 92532 85997 76352 66783 71349 72308 70904
10062 70904 73948 65772 51310 54617 44635 41805 38755 39397 45403 59183 53799 51200 58377 64191
10048 64191 56753 53930 58476 56947 63628 77309 74635 74491 75114 81282 90462 117800 144926 184684
10034 184684 275497 471517 893417 1477956 1513826 977877 553827 331559 206902 143286
10024 143286 104001 92987 90327 75018 60582 54621 51838 46072 48261 41915 36703 37951 42717
10011 42717 39590 33137 29066 33515 26698 14640 14843 24027 20607 29333 33643 32505 33814 28489
9997 28489 36084 38246 39816 39218 34872 32782 31309 29156 33682 39163 46030 46056 33849 43068 45876
9982 45876 49924 47463 36081 34994 23667 22208 18293 22271 30161 35318 42503 49609 50757 40948
9968D0948j0933J0099m773m703n296K7P463l426m182P165K934J297j4143K541
9954B5018l91L125O863L27n001j0716n222q06J012j0145k549K768N213J347r64
9939I879Q403j432K326L368J635L950N605r442r330j193l673j635Q555M604o620
9924A5000m126J199r301L0N315R30q376M207Q258k854J976R157n283r583K892
9909I441M112O064j573j4764p416R310Q390o386K502J693j0907P058L586N880
9895A6990O32J2747N719m500j5855j118J00n94k293n271O679Q912k142M957R184
9880C4147P847J0108r664r221j0412k030q043m076J2199M997r750M463l446j586
9866A5533J876O347j0860m946k911K530J21r659P593J542J1029O262K846q734
$$ plain form
9968 40948 30015 40114 35341 30638 25342 25369 32832 29406 25224 32389 35323 36620 22477 25018
9954 25018 24627 27752 34615 34942 29941 19225 14003 13197 14209 4064 1515 4283 9496 10843 9879
9939 9879 18282 16850 19176 22544 24179 28129 33734 24292 14962 13769 10096 8461 17016 21620 15000
9924 15000 10874 12073 2772 2802 8117 9047 671 4878 13136 10282 12258 21415 16132 6549 9441
9909 9441 13553 19617 18044 3280 -4136 5174 13564 7178 9680 11373 466 7524 11110 16990
9895 16990 17622 30369 36088 31588 15733 14615 14715 14121 11828 6557 13236 22148 20006 24963 34147
9880 34147 41994 52102 42438 33217 22805 20775 12732 8656 20855 25852 16102 20565 17119 15533
9866 15533 17409 23756 12896 7950 5039 7569 7690 -1969 5624 7166 18195 24457 27303 18569
9852A8569n72N398j012J3660K3514K140n79K0536K3978N5631J10471J28923O9512
9839D70169K480k0098r2015j16651o4843n8078l2002k2666k3233j1828L087m759
9827B9563q671Q29Q56m77P79p852m276r695m89j170l728K410K908R837R863o77
9811B0010k523N364P856L818j938M030K941K683J1799l126q75j866l591N047L568
9796E3197R786J1461J5856K4507L1882M1519R8066J91972L18738L59204J64966
9785A321154K1048p1046l01120l52773k31915j17723o5169m1846l3988m2872j4750
9774F9000j7090j0393o042N033L99Q526K555l725L607n903n716L097K852L144
9760D9344n72j0485K357J2353p974j4643j7895p769K328J1384M259J220o663p098
$$ plain form
9852 18569 17997 23395 22383 36043 59557 61697 61118 81654 105632 161263 271734 400657 470169
9839 470169 472649 452551 360536 243885 179042 120964 88962 66296 43063 31235 34322 29563
9827 29563 20892 21721 22577 22100 22879 15027 10751 1056 567 -603 -4331 -1921 987 10824 20687 20010
9811 20010 17487 22851 30707 34525 32587 36617 39558 42241 54040 50914 50039 48173 44582 49629 53197
9796 53197 62983 74444 90300 114807 146689 188208 286274 478246 796984 1156188 1321154
9785 1321154 1342202 1271156 970036 617263 385348 267625 202456 160610 126622 83750 69000
9774 69000 51910 41517 35475 40508 40907 49433 51988 48263 51870 45967 40251 43348 46200 49344
9760 49344 48772 38287 40644 52997 45023 30380 12485 4716 7044 18428 22687 23907 17244 10146
9746A0146M264R42p528j716n051m789J0994J099J177J068N720j705n600j417O35
9731H239J79m935l329M746R51L385r104O516Q045k668J829J0607q014j3145K734
9716F036M896J694J19L389j3293j5674Q37K641J0534O403j226K909J2322o167
9702A5420j0762M647J0371O030k016m696Q879j1776j910q082m348P481R099N361
9688B3698J062r762j3938j0393P927k060j597N901M830O771K943o440j0922O404
9674D424L213J2007j0170l699J1383j2453j0057J3078J305r612j21N48N240O814
9660A1900M740p88j423j2601J234l094n894N80M675K075Q124N243O527J598o122
9645A6774q152k361J917Q596P345K50r258n059q205M186j379j3855n379N040N404
$$ plain form
9746 10146 14410 15352 7824 6108 1057 -3732 7262 8361 9538 10606 16326 14621 9021 7604 8239
9731 8239 8418 3483 154 4900 5851 9236 132 6648 14693 12025 13854 24461 16447 3302 6036
9716 6036 10932 12626 12745 16134 2841 -12833 -11996 -9355 1179 7582 6356 9265 21587 15420
9702 15420 4658 9305 19676 25706 23690 18994 27873 16097 14187 6105 1757 9238 18337 23698
9688 23698 24760 14998 1060 -9333 -1406 -3466 -5063 838 5668 12439 15382 8942 -1980 4424
9674 4424 7637 19644 9474 5775 17158 4705 -5352 7726 9031 -581 -702 -154 5086 11900
9660 11900 16640 15852 14429 1828 3062 -32 -5926 -5346 -671 1404 9528 14771 21298 22896 16774
9645 16774 8622 6261 8178 16774 24119 24369 15111 10052 1847 6033 4654 -9201 -14580 -9540 -4136
9630d136K640P847J1349J0947J509k002l295q708j7599R13J792r47J0360m114
9616F556L804L223m555l042J2113R121j563o612r252K95P414K0941n130m800M708
9601C3221o372j2212j4862l268N096O883K751M741N47j4121N273P029p513L460
9587A0653p975K769l842N047J4435J265M074k975j0093p926M879M676J214P921
9573B4122j0979k424j54n162m685J0300M645j96Q737J700L401M662k1725p315
9559D927M230M963O655J3139K804q348m591N168k020J0760q971j2770J494N834
9545B3274R214j3245m916J412j253m768j1118N579P205n720q186N621N805L780
9531A2684j6309Q87M018L281K703m033N068R524K583p80J786J353j615M374q569
$$ plain form
9630 -4136 -1496 6351 17700 28647 30156 28154 24859 16151 -1448 -535 1257 310 10670 6556
9616 6556 10360 13583 9028 5986 18099 27220 25657 19045 9793 10088 17502 38443 33313 28513 33221
9601 33221 26849 14637 -225 -3493 1603 8486 11237 15978 16525 2404 7677 14706 7193 10653
9587 10653 2678 5447 1605 6652 21087 22352 26426 23451 13358 5432 10311 14987 16201 24122
9573 24122 13143 10719 10565 5403 718 11018 15663 15467 24204 25904 29305 33967 12242 4927
9559 4927 9157 14120 20775 33914 36718 28370 23779 28947 26927 37687 28716 15946 17440 23274
9545 23274 32488 19243 14327 15739 14486 9718 -1400 4179 11384 5664 -2522 3099 8904 12684
9531 12684 -3625 -2738 1280 4561 7264 3231 8299 17823 20406 19626 21412 22765 21150 25524 16955
9516A6955P08J4668K458m942K176L892J3318L9r793o491J5573N021j449j3482
9502C8651j7508o459J8677J8827L538Q441J117J3786J3735K1750J9943J2901k65
9489A47134r533j7282j8317j2047m841j3340j4170K131Q523n580j0492l159o297
9476D2730Q55R457M815j26J126p106P69J0567M856q311j000K801l292J745J511
9461F1397m823M35J3197N467P61J1198P077J756J1601L1354L0298J7172J8642
9448B05532J0885L27j47p135l0670j3640m07K904J5100p314j0083J2392M165q628
9434A73281K870K1285J3772J5066J5715K6000L231M830J0964J7319K4608J1120
9422C40061J7155J4106J2302K4145K7262M4519N0451N1191N6663O7493O8446N9105
$$ plain form
9516 16955 17663 32331 34789 29847 32023 35915 49233 49272 39479 32988 48561 53582 52133 38651
9502 38651 21143 14684 33361 52188 55726 64167 65284 79070 92805 114555 134498 147399 147134
9489 147134 137601 120319 102002 89955 85114 71774 57604 59735 68258 62678 52186 49027 42730
9476 42730 43585 53042 57857 57731 58857 51751 52520 63087 67943 59632 58632 61433 58141 59886 61397
9461 61397 56574 57009 70206 75673 76434 87632 94709 96465 108066 139420 169718 186890 205532
9448 205532 216417 216744 216597 209462 178792 165152 164745 167649 182749 175435 165352 177744 181909 173281
9434 173281 176151 197436 211208 226274 241989 267989 271220 276050 287014 304333 328941 340061
9422 340061 357216 371322 383624 407769 435031 479550 530001 581192 637855 705348 773794 832899
9410H32899P6466Q7431J05096J08282J20327J58382J82728J96838K10674K25075
9400B304198K48923K39403K14847J71902J26052N0390k8152j06416j77424k07208
9390B836515k32158k42573k26626k14651j97042j82270j74366j46801j25775j01746
9380I92507p9133p9462p4119p3331o5506n2582m5353l5340l4107l1232k5783l1188
9368C65371l3046k7959k5885m042j6845j4374l874n166p218k5706j9065l44j3591
9355A68256j0818q744o091P314Q25l553j3680j8485j4275n808N104j467n334j101
9341I2143R685j1425K109l360r490o678o12M996L61k244q62l167M57j5453j3374
9326D3086m344P185k774j811M059q496J2174M632k95m098r578n452j742M72q088
$$ plain form
9410 832899 909365 996796 1101892 1210174 1330501 1488883 1671611 1868449 2079123 2304198
9400 2304198 2553121 2792524 3007371 3179273 3305325 3355715 3327563 3221147 3043723 2836515
9390 2836515 2604357 2361784 2135158 1920507 1723465 1541195 1366829 1220028 1094253 992507
9380 992507 913374 833912 759793 686462 620956 568374 523021 487681 453574 422342 396559 365371
9368 365371 332325 304366 278481 274439 257594 243220 239346 234180 226962 201256 182191 181847 168256
9355 168256 157438 148694 142603 149917 150742 147189 133509 115024 100749 94941 100045 98578 93244 92143
9341 92143 101828 90403 92512 89152 79662 72984 72372 77368 77729 75485 74623 71456 71913 56460 43086
9326 43086 38742 45927 43153 41342 45401 36905 49079 53711 53416 49318 39740 34288 32546 33018 24930
9311B4930m948m333j3221l685K581K724O46O745P795P605N175Q849o68L951P599
9296E1745n997j0572j1371o140L021j0079j257M479k35J0507M310m555k073n442
9282A6341l339K206n623p095m197p07K436m211L504Q372O274l920M309J4721N566
9267C4637j3501j0390R763L453m747k293m266n082o457j538O16K009K792J37K792
9252G925R576j011J05m333j738n443m763N066M87M99j1276q199n237P147M864
9237f331N170N938J1360K761K991p163n351j615L319L612Q7k033Q80L818n99L145
9221A9989N498k201j1765o109N583n440J121L010K095J933k901n767o949o891
9207h794o748j0014N068P226M673N273R036J720l972L341j2146j264Q759R14m310
$$ plain form
9311 24930 19982 15649 2428 -1257 1324 4048 4694 11439 19234 26839 32014 40863 40195 44146 51745
9296 51745 45748 35176 23805 17665 20686 10607 9350 13829 13594 24101 28411 23856 21783 16341
9282 16341 13002 15208 9585 2490 -1707 -2414 22 -4189 -685 7687 13961 10041 14350 29071 34637
9267 34637 21136 10746 20509 23962 19215 16922 12656 7574 1117 -421 195 2204 4996 5133 7925
9252 7925 17501 16490 16595 12262 10524 5081 318 5384 5871 6370 -4906 -13105 -18342 -11195 -6331
9237 -6331 -1161 4777 16137 18898 21889 14726 9375 7760 11079 14691 14778 12745 13625 17443 16844 19989
9221 19989 25487 23286 11521 5412 10995 5555 6676 9686 11781 13714 10813 5046 -1903 -8794
9207 -8794 -15542 -25556 -20488 -13262 -8589 -3316 5720 7440 3468 6809 -5337 -6601 2158 3072 -1238
9192a238N357q227q992j905l398k902J5384J8310K225j5425p285O649M702m164
9178i09K401J152j0718j809Q336n962n90J1439O7N766J8058K046j9554J916K758
9163A4397r775R52J0509m395j0578L03q05l561M659N773M53j959J710J5683q203
9148A5163K380j948M355N307r005j0158p756M646L079q58O02P235K562J346O430
9133B3380J688k058q294p931k054j252R71MQ30k231j007L011N599m242k897J1501
9117A5018N979o035l605J1444J2193j1031j7582k271K775k355o102r39r632K388
9103i755J4963k348j2787j2451M561J4048J8999l774M977J0365P708p539o280
9090B0687N476L248j2120q797j1137o606Q028M746j497J806o758q322j2494N466
$$ plain form
9192 -1238 4119 -4108 -13100 -15005 -18403 -21305 -5921 12389 14614 -811 -8096 -1447 3255 -909
9178 -909 1492 2644 -8074 -9883 -1547 -7509 -8099 3340 3407 9173 27231 29277 9723 11639 14397
9163 14397 4622 5574 16083 11688 1110 1413 608 -2953 1706 7479 7932 5973 7683 23366 15163
9148 15163 17543 15595 19950 25257 16252 6094 -1662 2984 6063 5205 5807 13042 15604 16950 23380
9133 23380 25068 23010 14716 6785 4731 3479 4450 4454 5284 3053 2046 5057 10656 6414 3517 15018
9117 15018 20997 14962 11357 22801 34994 23963 6381 4110 6885 4530 -1572 -2511 -12143 -9755
9103 -9755 5208 2860 -9927 -22378 -17817 -3769 15230 11456 16433 26798 34506 26967 20687
9090 20687 26163 29411 17291 8494 -2643 -9249 -1221 3525 2028 3834 -2924 -11246 -23740 -18274
9076a8274N817k390l861L478N579J529M747R305l14k387q235R30P085j32M547
9061G424J570j1436n45L601o492j3149J043P348o976J559l501M112J4063O387
9047E008M058j555k201P302m510m294m077l605p709R8q59O216O047p929j260M301
9031d969j109l962j891n1Q334K088k494M202R362J058k768j0289M912P065N508
9016A4996j3633m190k076j0479K757J2556M751K848K007k93L495r363j393p593
9002e610j132N886j0252jo295j7564L410L656O460L345O203L183M942j950j517
8987g236J1999m877j2818J947M349k694j178K961l879n264J3501J2497k415r273
8973b380M73O098M443m63M399j6132r693j270N163J0718r400M554O592m626q023
$$ plain form
9076 -18274 -12457 -14847 -18708 -15230 -9651 -8122 -3375 5930 5616 3229 -5006 -4076 3009 2877 7424
9061 7424 8994 -2442 -2987 614 -5878 -19027 -17984 -10636 -17612 -16053 -19554 -15442 -1379 5008
9047 5008 9066 7511 5310 12612 8102 3808 -269 -3874 -11583 -11485 -12344 -6128 -81 -8010 -9270 -4969
9031 -4969 -6078 -10040 -11931 -11982 -3648 -1560 -4054 148 9510 10568 7800 -2489 2423 9488 14996
9016 14996 1363 -2827 -4903 -15382 -12625 -69 4682 7530 9537 9244 12739 3376 1983 -5610
9002 -5610 -6742 -856 -11108 -11109 -17404 -34968 -31558 -27902 -21442 -18097 -11894 -8711 -3769 -5719 -7236
8987 -7236 4763 -114 -12932 -10985 -6636 -9330 -10508 -7547 -11426 -16690 -3189 9308 6893 -2380
8973 -2380 -1907 4191 8634 8171 12570 -3562 -13255 -14525 -9362 1356 -8044 -3490 3102 -1524 -9547
8958i547O198K633O140Q018O12k578K308j5786n703L064m539l658N957J491L902
8943a488N889M358p30N568O543k010j1097o117O194K886N474k63p496M831p136
8928E406j901K650j7273K4P406m371J407J946k051o824l559n867J0791N552K41
8913f423m466l182n182O538J4287N385p77j1733M641J3241L903m258j8606j954
8899h586J431l69P941Q442Q494m25L387N487q964n805r82n86J856O061j032O655
8883B3005k0901o780o118K405L073n71N401N412j1332q300L917J892p726R089
8869g534M284L507m732n193l308M35J1590M417P843J4203p762o851j6622p546
8855a3269J4415m168j1878M196J4055k300K420K570p024k954q327k345L345K81
$$ plain form
8958 -9547 -3349 -716 5424 13442 14054 11476 13784 -2002 -7705 -4641 -9180 -12838 -6881 -5390 -1488
8943 -1488 4401 8759 8029 13597 20140 18130 7033 916 7110 9996 15470 15207 7711 12542 5406
8928 5406 3505 6155 -11118 -11094 -3688 -8059 -6652 -4706 -6757 -13581 -17140 -23007 -12216 -6664 -6423
8913 -6423 -10889 -14071 -19253 -12715 1572 6957 6180 -5553 -912 12329 16232 11974 -6632 -8586
8899 -8586 -7155 -7524 417 8859 17353 16928 20315 25802 16838 11033 10051 9465 11321 17382 16350 23005
8883 23005 2104 -4676 -10794 -8389 -5316 -5887 -486 4926 -6406 -14706 -10789 -8897 -16623 -7534
8869 -7534 -3250 257 -4475 -9668 -12976 -12541 -951 3466 11309 25512 17750 10899 -5723 -13269
8855 -13269 1146 -3022 -14900 -10704 3351 1051 3471 6041 -983 -3937 -12264 -14609 -11264 -10983
8841a0983L307J305k167R973O017J2364k520p257j337J027j6284r808j091j424
8827a8878j408J5207O311n393K64R357K36j5049j774K876J1969Q8o819M587k269
8812f95n851N53j1793M509J3239j318J0810O077q889j4013q013P469J0329Q96
8798C310p96j3586j3509o239J4498R144L688r708P52K186J765J20j2Q609J852
8783B074R97P573K344O402l025j4403N159K791K099j3526m168N477q945q866N005
8768a3012J8708L389r208m286J1890l465P264R52o499J0328K131q824L529j4Q159
8753B1042n161r778m07Q37j3670r677J278J1341J1088K083N487l463p219m50k012
8738A319N879J574K311J90k309Q88l439m018k979J238J758p44n045Q991J2073
$$ plain form
8841 -10983 -7676 -6371 -8538 1435 7452 19816 17296 10039 8702 9729 -6555 -16363 -17454 -18878
8827 -18878 -20286 -5079 1232 -4161 -3897 5460 5696 -9353 -11127 -8251 3718 3806 -3013 1574 -695
8812 -695 -6546 -5993 -17786 -13277 -38 -1356 9454 15531 6642 -7371 -15384 -7915 2414 3310
8798 3310 2514 -11072 -24581 -30820 -16322 -7178 -3490 -13198 -12446 -10260 -8495 -8375 -8387 222 2074
8783 2074 3071 10644 12988 19390 16365 1962 7121 9912 12011 -1515 -5683 -206 -9151 -18017 -13012
8768 -13012 5696 9085 -123 -4409 7481 4016 11280 12232 5733 16061 18192 9368 12897 12883 21042
8753 21042 15881 6103 5696 6533 -7137 -16814 -15536 -4195 6893 8976 14463 11000 3781 3331 1319
8738 1319 7198 8772 11083 11273 8964 9852 6413 2395 -584 654 2412 1668 -3377 5614 17687
8723A7687N978l665K716O65m950M029k825K623j4677q815J161r418m042L975p775
8708a7333N443O492N641l532n926J94J6498Q291n195n858j791J3335N467p331
8694A4395j1074L190p01M507k04p750k872J4782L836j348j709j838J081k677o592
8679E026m360J670p239j979J233P300J1724O465O10P356m442J741M030k36P992
8664C6891K949p617r737o43k040K006M520l948j0871L941O759k337m853m326L266
8649A3960n185r126N375J3644N895j874K945m91j554l427n53q251J1047N623p426
8634B0602L070Qj768O549L874j0091P07P257j3870R737R754P808Q200l3L648p839
8618D7613k0231j7153P924O400O299P853j1713l083j263O522J6509J1555j7119
$$ plain form
8723 17687 23665 20000 22716 23381 18431 22460 19635 22258 7581 -1234 -73 -9491 -13533 -9558 -17333
8708 -17333 -11890 -5398 243 -3289 -9215 -9021 7477 15768 10573 4715 2924 16259 21726 14395
8694 14395 3321 6511 5810 10317 10113 2363 -509 14273 18109 16761 15052 13214 14295 11618 5026
8679 5026 666 2336 -4903 -6882 -5649 1651 13375 19840 20450 27806 23364 25105 29135 28899 36891
8664 36891 39840 32223 22486 21843 19803 21809 26329 22381 11510 15451 22210 19873 15020 10694 13960
8649 13960 8775 -351 5024 18668 24563 22689 25634 25143 23589 20162 19609 11358 22405 28028 20602
8634 20602 23672 23680 21912 28461 32335 22244 22951 30208 16338 26075 35829 43637 51837 51804 55452 47613
8618 47613 27382 10229 18153 24553 30852 38705 26992 23909 22646 29168 45677 57232 40113
8605D0113q993J2320O224j1716M377Q849O654P095q97p101n960l041L250K390
8591E3564R141O300L106N122J1144J1640M388J6649K198K187p762r080p745q372
8577I2480j6441j0276j748l552k152r37N08j2168l030j0855p400j2416j13L909
8563A5809j537L972N435o48m782K073K6j1403l232o975J6759M156J312j946J739
8548B0758J538O091J614L820N670P64k0874k394j0633M678P059j1965N824M436
8534A6386k757J79k966o75J540n162n36N983K879k351N478j2231J074O914l919
8519I836j315p611L55L906K864p282j119k309M776J0930L205m057q092J1202M495
8504A9784j320q02k840J45M721q484N013m85M659m33j210J1394J381R90M398l2
$$ plain form
8605 40113 31120 43440 49664 37948 42325 51174 57828 64923 64026 56925 50965 47924 51174 53564
8591 53564 62705 69005 72111 77233 88377 100017 104405 121054 123252 125439 117677 108597 100852 92480
8577 92480 76039 65763 64015 60463 58311 57374 57882 45714 42684 31829 24429 12013 11900 15809
8563 15809 14272 18244 23679 23031 18249 20322 20348 8945 5713 -1262 15497 19653 20965 19019 20758
8548 20758 22296 28387 30001 33821 39491 40255 19381 16987 6354 11032 18091 6126 11950 16386
8534 16386 13629 13808 10842 10167 11707 6545 6009 11992 14871 12520 17998 5767 6841 13755 9836
8519 9836 8521 910 1265 5171 8035 753 -366 -2675 2101 13031 16236 12179 4087 15289 19784
8504 19784 18464 17662 14822 14967 19688 11204 16217 15732 20391 19958 18748 30142 31523 32513 36911 36879
8488C6879o542j0527o047j260K479L905K67k231O194K461m247r79r47O2M026K984
8472B6477r588K922O28j0572m145K862K034J439J302P120k143j0703q6J209m772
8457C984J4063J2587K083M297j5674j6531j1697N28R637J1745P813K242K286r022
8443A8341n388N903k201m080j0433n665n951k782M844K594R024L636M584o815
8429E611M279Q581p158o23j094K662J954k295p568n677o834Q024J0785m970Q847
8414A4524R2p327K557P292J014N492L995j0288j8370q894Q093K239N607Q460L084
8399A7570O480P081o336j7993q494l375O582j958J3169M732k313m546L157O894
8385B0650Q057k170j0777j131k147L740R615r617J22K7158J4041j2903k1155j401
$$ plain form
8488 36879 30337 19810 13763 12503 14982 18887 19154 16923 23117 25578 21331 20352 19405 19467 23493 26477
8472 26477 16889 19811 20439 9867 5722 8584 10618 12057 13359 20479 18336 7633 7547 8756 3984
8457 3984 18047 30634 32717 37014 21340 4809 -6888 -6360 3277 15022 22835 25077 27363 18341
8443 18341 12953 18856 16655 12575 2142 -3523 -9474 -12256 -7412 -4818 4206 7842 12426 5611
8429 5611 9890 18471 11313 10690 9596 12258 14212 11917 4349 -1328 -8162 -138 10647 5677 14524
8414 14524 14616 7289 9846 17138 18152 23644 27639 17351 -1019 -9913 -1820 419 6026 14486 17570
8399 17570 24050 31131 24795 6802 -1692 -5067 1515 -443 12726 17458 15145 10599 13756 20650
8385 20650 28707 26537 15760 14629 12482 16222 25837 16220 16342 43500 57541 44638 23483 22082
8371B2082M811j514j867l947q636N828N041q574p534q4k462p738l581J1530J0976
8356A4331O73N168J942j8835j1381k179K616K073L256N079Q892p746j1315l831
8342a1257J0242J0942R244K368q983N690r31l386L019o304n006r725l444m284
8328a1815J382n495k915R204J7021p552K442M032o152q634L16R58N878r61J599
8313f92r469O83J1850Q88Q244j186L384P63l950n704j984J585J2160Q494J623
8298B6689p792j0725r269M260r190J943J0882n649R279M564l677o519p834p961
8284a0999L131N173N197J2377J123M362j3606j0525K896J3053P336j3437j568
8271D513L171j1150q018N162n274r564J440J4735J8609R50P797m568l51O721Q138
$$ plain form
8371 22082 26893 25379 23512 19565 10929 16757 21798 13224 5690 5606 3144 -4594 -8175 3355 14331
8356 14331 15004 20172 22114 3279 -8102 -10281 -7665 -5592 -2336 2743 11635 3889 -7426 -11257
8342 -11257 -1015 9927 19171 21539 12556 18246 17315 13929 16948 10644 5638 -4087 -7531 -11815
8328 -11815 -10433 -15928 -18843 -9639 7382 -170 2272 6304 152 -8482 -8166 -7208 -1330 -2291 -692
8313 -692 -10161 -9478 2372 3260 11504 10318 13702 14465 10515 4811 2827 4412 16572 25066 26689
8298 26689 18897 8172 -1097 3163 -6027 -4084 6798 1149 10428 14992 11315 4796 -3038 -10999
8284 -10999 -7868 -2695 2502 14879 16002 20364 6758 -3767 -871 12182 19518 6081 4513
8271 4513 7684 -3466 -11484 -6322 -11596 -21160 -19720 -4985 13624 14574 22371 17803 17452 24173 32311
8256C2311l989k293j320j0702p418K326J709j1117p833%J0539M785j0187n270
8242h459j606P374M418m699j840M050L172Q568o433j3392J108K823R082n775j9672
8227b1281M567J3416J3984l047o519q486Q70o832p385L800R426J1390Q12r463
8213d748o25m24J1041N560l114J077l329p898p058J2539P073j861r039k79J5138
8198A4053N004J837j612j5244j624j732j344m756J0751L495j635n054j915O098
8184F322K939L661j2305j7063l063Q052Q261J01r055O77J5120J1699l462l251
8170H633r999n291k698m708Q625k430r064L825O250R920J24n056p637Q073m577
8155f010N036K655O41p35K139J2477j2188j0957J1213K262J386J2449n028j2124
$$ plain form
8256 32311 28322 26029 24709 14007 6589 8915 10624 -493 -8326 -8326 2213 6998 -3189 -8459
8242 -8459 -10065 -2691 1727 -2972 -4812 -762 2410 10978 4545 -8847 -7739 -4916 4166 -1609 -21281
8227 -21281 -16714 -3298 10686 7639 1120 -7366 -6496 -13328 -20713 -16913 -7487 3903 4715 -4748
8213 -4748 -5373 -5797 5244 10804 7690 8767 5438 -2460 -9518 3021 10094 8233 -806 -1085 14053
8198 14053 19057 20894 19282 4038 2414 682 -662 -5418 5333 8828 7193 2139 224 6322
8184 6322 9261 12922 617 -16446 -19509 -11457 -3196 -3095 -12150 -11473 3647 15346 11884 8633
8170 8633 -1366 -6657 -9355 -14063 -5438 -7868 -16932 -13107 -6857 3063 3187 -1869 -9506 -1433 -6010
8155 -6010 -974 1681 2322 1587 3726 16203 4015 -6942 4271 6533 7919 20368 15340 3216
8141C216j10L79o886K36M712K360q99k75l006o7L958L90J7705O293p843o93q805
8124A0665p039p804q396M419M125L094J2192J4713l488j5552r576o307q329O142
8110a1141N129N570K601R200k832N321l106K70n872K650p067r72J1737J325p764
8095E049M334n547n338K525L765O521J1927n160r217L19l331m401j238O585Q177
8080A4970l539j72k918n353M973L567O810o010K242m022j6749p925p655L816K5439
8065G474J6420m691j4475r161j2357L90M856J928Q330P961M08m020O033N426N324
8050A9846r659p320K394O18p774p631L519K975r446K954N171l726J1897K418n065
8035A171L973L81m992O681n3p99j532p044J142k456J441R544k138j0585L626m126
$$ plain form
8141 3216 3106 3485 -3401 -3165 1547 3907 3008 2733 -273 -340 3618 4008 21713 28006 20163 19470 10665
8124 10665 3626 -4178 -12574 -8155 -4030 -936 11256 25969 22481 6929 -2647 -8954 -17283 -11141
8110 -11141 -6012 -442 2159 11359 8527 13848 10742 11012 5140 7790 723 -249 11488 12813 5049
8095 5049 9383 3836 -1502 1023 4788 11309 23236 18076 8859 9178 5847 1446 208 6793 14970
8080 14970 11431 11259 8341 2988 7961 11528 18338 12328 14570 10548 -6201 -14126 -21781 -17965 7474
8065 7474 23894 19203 4728 -4433 -16790 -16400 -11544 -9616 -1286 6675 7083 3063 9096 14522 19846
8050 19846 10187 2867 5261 5879 -1895 -9526 -6007 -3032 -12478 -9524 -4353 -8079 3818 6236 1171
8035 1171 5144 5525 533 7214 7161 6362 4830 -2214 -1072 -3528 -2087 7457 5319 -5266 -1640 -5766
8019e766Q883L946K857j5113j2049M731J3494J3499O782M066J135j2305n939M638
8005A2859L389o186M000P327o380o03n546r91J798k544k284P66Q098k612k469
7990H622J1735J1534j0170j0518J254O364l671r507r639j732J1650M831k680m35
7976G638k445J240m529r174J161M492Q54J496Q565M869N481j826n226l226L518
7961A2888O081Q775J907j380l968j116O687K407j2454l309K439M296p342K843
7947A8754M743l46L679J1376q150n799j215q02N151k095M191K748r198j1056j984
7932I997j2393o386Q508N747J48j542R978J4358j147q228q093N241O267k507J17
7917B0065k437M375l988q124j045l257j0200L766N77j192l677O696J888L404P606
$$ plain form
8019 -5766 3117 7063 9920 -5193 -17242 -12511 983 14482 21264 25330 26465 14160 8221 12859
8005 12859 16248 10062 14062 21389 15009 14406 8860 7869 9667 7123 4839 5605 13703 11091 8622
7990 8622 20357 31891 21721 11203 12457 18821 15150 5643 -3996 -5728 5922 10753 8073 7638
7976 7638 5193 6433 1904 -7270 -6109 -1617 -763 733 9298 14167 19648 17822 12596 9370 12888
7961 12888 18969 27744 29651 28271 24303 23187 29874 32281 19827 16518 18957 23253 15911 18754
7947 18754 23497 23151 26830 38206 30056 24257 23042 22240 27391 25296 29487 32235 23037 11981 9997
7932 9997 -2396 -8782 -274 5473 5621 4079 14057 28415 27268 19040 10947 16188 22455 19948 20065
7917 20065 17628 22003 18015 9891 8846 5589 -4611 -845 -268 -1460 -5137 1559 3447 6851 14457
7902A4457l542m420j198k150K15n897j316J0008N452o659k716q932M334p90M531
7887A377J0023n599J500M244J147O1j4n758j777p959j551R94R215l784M190R564
7871A5873N900p018J234J3105l199l070l341j4088o699r65N788J0258q81J495
7857A4392O88l963L56m009o50L060l218j3606r293O136K545O300O486k967P831
7842A0088O016J063q150N589J438o110r928j5508N112O469k204O331R123O983
7828A6312p407j0727L456j583o606J0114L721j0511J947j25k459J137L502j202
7814d31r15m031p734o112J0391K713J809Q816J0925K035j0910p076M370L545k559
7799D836r534n6L040j0406J488L010k337M977J329N184J3718P963k961j9830j4428
$$ plain form
7902 14457 10915 6495 5297 3147 3362 -2535 -3851 6157 11609 4950 2234 -6698 -2364 -3154 1377
7887 1377 11400 5801 7301 11545 12692 12753 12739 6981 5204 -2755 -4306 -3312 5903 2119 6309 15873
7871 15873 21773 14755 15989 29094 25895 22825 19484 5396 -1303 -2268 3520 13778 12897 14392
7857 14392 15080 11117 11473 7464 6814 9874 6656 -6950 -16243 -10107 -7562 -1262 5224 2257 10088
7842 10088 16104 17167 9017 14606 16044 9934 6 -15502 -10390 -3921 -6125 206 9329 16312
7828 16312 8905 -1822 1634 51 -6555 3559 7280 -3231 -1284 -1409 -3868 -2731 771 -431
7814 -431 -1346 -5377 -13111 -19223 -8832 -6119 -4310 4506 15431 17466 6556 -520 3850 7395 4836
7799 4836 -4698 -4754 -1714 -12120 -10632 -7622 -9959 -4982 -3653 1531 15249 23212 20251 421 -14007
7784a4007l501K966N061L105J502m398o861P233Q356P03o292N998K609n116p48
7769c390k182j597m07l818n644k057o368O197J8771N871j037N72o512k3956o442
7754c1999M230O984M492J1860M919L322m274p831J205j6326n264J0468M985m342
7740a7571J0700R15K325R216k788q211N783P086K182m163p085N241l578o746P627
7725I33j874n963Q405P300Q212j5189j4558q703Q830J6006j0402N118K708j2487
7711a1664j736o61J264r94k90j181k272N385L058k341M170M917J936L929n225
7696a705k975J484Q381k798J072M64L532l092j866l543L683M972j129m991O440
7681G929Q37j2224j1089J668O258k597N443L796M840M539L146j4761j6958J1928
$$ plain form
7784 -14007 -17508 -14542 -9481 -6376 -4874 -9272 -16133 -8900 -544 159 -6133 -135 2474 -2642 -3390
7769 -3390 -5572 -7169 -7576 -11394 -17038 -19095 -25463 -19266 -495 5376 4339 4911 -1601 -25557 -31999
7754 -31999 -27769 -20785 -16293 -4433 486 3808 -466 -8297 -7092 -23418 -28682 -18214 -13229 -17571
7740 -17571 -6871 -5956 -3631 5585 2797 -5414 369 7455 9637 5474 -1611 3630 52 -6694 933
7725 933 -941 -6904 1501 8801 17013 1824 -12734 -21437 -12607 3399 -7003 -1885 823 -11664
7711 -11664 -13400 -14061 -12797 -13791 -14081 -15262 -17534 -12149 -9091 -11432 -7262 -2345 -409 3520 -1705
7696 -1705 -4680 -3196 5185 2387 3459 3923 7455 4363 2497 -1046 2637 7609 6480 1489 7929
7681 7929 8766 -3458 -14547 -12879 -6621 -9218 -3775 21 4861 9400 12546 -2215 -19173 -7245
7667g245j430k11K950m398J3055J3648O821l704r925m125n727J281J659j0085
7653g436l69J3691M331O959q883j628o540q064J370R028P172L543k900j1277j1722
7638a2725O132l309K571R034k97n036J91N721J760j645l701P702j026K39N354
7623A0965k768j4017j5161R534J7105k026J1779o485L311l646q193o816l338M117
7609e639K796Q334r077j0905J71k11K801L16P793j392k290K356o850n822N67K0847
7593C795P640J5766m479k2138j2542o983L340J3463K631k470K289k010K885p928
7579f741l661P052m40j0151P41M273j6166k537L417R539P808R785K682n069o776
7564f244K62N495j315k963m618J059K2065J2689j8950j4333m251l361J1795M401
$$ plain form
7667 -7245 -8675 -8886 -5936 -10334 2721 16369 23190 19486 9561 5436 -291 990 2649 -7436
7653 -7436 -7805 5886 10217 17176 8293 6665 125 -7939 -6569 2459 9631 13174 10274 -1003 -12725
7638 -12725 -6593 -9902 -7331 1703 1406 -3630 -3439 2282 4042 2397 -1304 6398 5372 5611 10965
7623 10965 8197 -5820 -20981 -11447 5658 3632 15411 8926 12237 8591 398 -6418 -9756 -5639
7609 -5639 -2843 5491 -3586 -14491 -14320 -14531 -11730 -11414 -3621 -5013 -7303 -4947 -11797 -17619 -17052 3795
7593 3795 11435 27201 22722 584 -11958 -18941 -15601 -2138 493 -1977 312 -1698 1187 -6741
7579 -6741 -10402 -3350 -3790 -13941 -13200 -8927 -25093 -27630 -24213 -14674 -6866 2919 5601 532 -6244
7564 -6244 -5982 -487 -1802 -4765 -9383 -8324 13741 26430 7480 -6853 -11104 -14465 -2670 1731
7550A731r825n237O542K145j815l867j607M812J0637M744p287r190J535K470j596
7535e808k737J086R378M961p063O309m679j0803j2195K907J5522M827q916j0217
7521a7428n551J3914K1113m467j3197o226j338P339L200J551m420K58L639O395
7507D782K846R449q070j4733j0135M637J7856j9809m465P257M950j70k915j646
7493a0166J229J1285J0262j9729j1486o77Q916n247j107R804N029J363l544j565
7479e633j0767O392L142l91N746J0620o239K342k774l432P565o0J341o792Q092
7464I152L066j0415j216j299J1051Q803j4814m086k065N406l933r84j846o53l077
7449f910O927P070p44o445J1167j326n998o271j1670m397J764m721N503M061P19
$$ plain form
7550 1731 -8094 -13331 -6789 -4644 -6459 -10326 -11933 -7121 3516 8260 973 -8217 -6682 -4212 -5808
7535 -5808 -8545 -7459 1919 6880 -183 6126 1447 -9356 -21551 -18644 -3122 1705 -7211 -17428
7521 -17428 -22979 -9065 12048 7581 -5616 -11842 -13180 -5841 -2641 -1090 -5510 -5252 -1613 4782
7507 4782 7628 17077 9007 -5726 -15861 -11224 6632 -13177 -17642 -10385 -5435 -5605 -8520 -10166
7493 -10166 -8937 2348 12610 -7119 -18605 -19282 -10366 -15613 -16720 -6916 -1887 -524 -4068 -5633
7479 -5633 -16400 -10008 -6866 -7257 -1511 9109 2870 5212 2438 -994 6571 6511 7852 1060 9152
7464 9152 12218 1803 587 -712 10339 19142 4328 242 -1823 3583 -350 -1334 -3180 -3833 -6910
7449 -6910 17 7087 6343 -102 11065 9739 3741 -2530 -14200 -18597 -16833 -21554 -16051 -11990 -11271
7434a1271p625Q80k841Q055J9414q7j5187p347O331L014m477q18L747j073j731
7419a1016N008N918K52L123N3q896P821N054p355j8760K996M057L291Q818r241
7404h877M307J0438J51o965j0392m362O729n266N45P311O452p826l991O968J0309
7389E531L369J69M631m843o936n419P865J095J83M390j4892n135J675L478p066
7374a1905n756O131N150R106n566j6177j09M866Q750k918P097Q240j380j1747
7360f218L336R144q089j7081j100O929m12k84J3881Q331j400m417j031J5781N136
7345B2506o431p149q713N076j002M257j0132o186j168P997n009R89K191j366N526
7330A386o810r064n385Q623J1533j009l307n074k016N328q23m469K05P461j301
$$ plain form
7434 -11271 -18896 -18016 -20857 -12802 6612 6525 -8662 -16009 -9678 -6664 -11141 -11959 -8212 -9285 -11016
7419 -11016 -6008 -90 162 3285 3338 -5558 2263 7317 -38 -18798 -15802 -11745 -8454 364 -8877
7404 -8877 -4570 5868 6019 -946 -11338 -15700 -8971 -14237 -13692 -6381 71 -7755 -11746 -4778 5531
7389 5531 8900 9069 13700 8857 1921 -3498 4367 5462 5645 10035 -4857 -9992 -8317 -4839 -11905
7374 -11905 -17661 -11530 -6380 2726 -2840 -19017 -19126 -14260 -5510 -8428 -1331 6909 5529 -6218
7360 -6218 -2882 6262 -1827 -18908 -20008 -13079 -13491 -13775 106 8437 7037 2620 1589 17370 22506
7345 22506 16075 8926 213 5289 4287 8544 -1588 -7774 -8942 -945 -5954 -4965 -2774 -4140 1386
7330 1386 -5424 -14488 -19873 -11250 283 -726 -4033 -9107 -11123 -5795 -6618 -11087 -10882 -3421 -4722
7315d722R87L444l954n144P460P703p216k546K101m650j0136P501J441K114P571
7300A954Q708L722l464J708j364k361r77K400k23o433j941J83O896O008N15p553
7284G778j3288M010J0001k970J537k150r081q600L571K430m843j380j531j297
7270a5813l393L893J5319l35q773K749k923m334j0417l241J3952P478J800Q825
7256D787L742q613R71n375m434Q777P474J330j357M584J1641q217k526M40k2471
7241i247k753O724q57O749L075p084J099P6J640P263R594k773m211k744j8735
7226a2184J109N240j975L551L697O990r981k35J0558N45o576p897q492L500k748
7211a4898R55R622N464J017q40P837j609m959j0599N695M597r255l269N522N649
$$ plain form
7315 -4722 -3735 -291 -4245 -9389 -1929 5774 -1442 -3988 -1887 -6537 -16673 -9172 -7731 -5617 1954
7300 1954 10662 14384 10920 12628 11264 8903 7926 10326 10103 3670 1729 1912 8808 14816 15331 7778
7284 7778 -5510 -1500 8501 5531 7068 4918 -4163 -12763 -9192 -6762 -11605 -12985 -14516 -15813
7270 -15813 -19206 -15313 6 -329 -9102 -6353 -9276 -13610 -24027 -27268 -13316 -5838 -4038 4787
7256 4787 8529 -84 887 -4488 -8922 -145 7329 8659 7302 11886 23527 15310 12784 13224 -9247
7241 -9247 -12000 -5276 -6133 616 3691 -3393 -2294 -2218 -578 6685 16279 13506 9295 6551 -12184
7226 -12184 -11075 -5835 -7810 -4259 -562 6428 -3553 -3788 6770 7315 739 -7158 -15650 -12150 -14898
7211 -14898 -13943 -4321 1143 2160 1320 9157 7548 2589 -8010 -2315 2282 -6973 -10242 -4720 929
7196I29N351l456j7382m877J726J320O651n981l781P418o0k616M187J3793n177
7181a955N594q135j0415m406O961J299N075m392r174N639K5483l769j0507k88
7167b990P227p716m377R72p543n935N961K119r639j274P413Q140k357o347J367
7152a4979J0307O343n295l219N819o040j0301K862J531n868j89N551Q041J2184
7138F747j0523l759j517m237k095L065N70P48P988K1348J7739j986q526j7931
7124G631j0996L222j903j0859l79O244l782n11l948N383L490k55R887N664j2021
7109c133m493N44j79O972j0188k231M659L303N748P789K307j5137j1310p550J0998
7094a1901L661l993L562L665M293K627r903n778P663K2476P644p160l694j413
$$ plain form
7196 929 6280 2824 -14558 -19435 -17709 -16389 -9738 -15719 -19500 -12082 -12142 -14758 -10571 3222 -1955
7181 -1955 3639 -4496 -14911 -19317 -12356 -11057 -5982 -10374 -19548 -13909 11574 7805 -2702 -2990
7167 -2990 4237 -3479 -7856 -6884 -14427 -20362 -14401 -12282 -21921 -23195 -15782 -7642 -9999 -16346 -14979
7152 -14979 -4672 1671 -3624 -6843 -1024 -7064 -17365 -14503 -12972 -18840 -19029 -13478 -5437 6747
7138 6747 -3776 -7535 -9052 -13289 -15384 -12319 -11749 -11001 -3013 18335 36074 34088 25562 7631
7124 7631 -3365 -143 -2046 -12905 -13284 -7040 -10822 -11333 -15281 -9898 -6408 -6663 3224 8888 -3133
7109 -3133 -7626 -7082 -7261 -289 -10477 -12708 -8049 -4746 1002 8791 11098 -4039 -15349 -22899 -11901
7094 -11901 -8240 -12233 -8671 -5006 -713 1914 -7989 -13767 -6104 16372 24016 16856 13162 11749
7080A1749n199o395j0439j0356n8N644P096N066K771j595N759p432m808K615j0261
7065a5843L332k79J605Q78l638r672O204J4924J1893j3262k827m04J8926L066
7051A4903l253j9346K493N242j0302j76j448k579R912o014k452M530l426k139
7037a4055L371q616o432K738J5670o354r560Q81n47P627K575P015q131j917L241
7022a2494k781p705N740Q028j315k338j895n127K18J3281P483p422L803O217L06
7007C999k025o745K268L361l997n487K089J187Q457m235j2023j4321O582J9354
6993a536J2218m424j0447j1225J764l875j8083k952J1281R866j857o08J6584L867
6979E73M451R423p463q127O834j2451j428k792j0374M148O523o424J5974N304
$$ plain form
7080 11749 6550 155 -10284 -20640 -20698 -15054 -7958 -2892 -121 -1716 4043 -3389 -8197 -5582 -15843
7065 -15843 -12511 -12790 -11185 -10307 -13945 -23617 -17413 -2489 9404 -3858 -6685 -7089 11837 14903
7051 14903 11650 -7696 -5203 39 -10263 -10439 -11887 -14466 -4554 -10568 -13020 -8490 -11916 -14055
7037 -14055 -10684 -19300 -25732 -22994 -7324 -13678 -23238 -22357 -22904 -15277 -12702 -5687 -13818 -15735 -12494
7022 -12494 -15275 -22980 -17240 -9212 -10527 -12865 -14760 -19887 -19669 -6388 1095 -6327 -2524 3693 3999
7007 3999 1974 -4771 -2503 858 -3139 -8626 -6537 -5350 3107 -1128 -13151 -27472 -20890 -1536
6993 -1536 10682 6258 -4189 -15414 -13650 -17525 -35608 -38560 -27279 -17413 -19270 -19878 -3294 573
6979 573 5024 14447 6984 -1143 5691 -6760 -8188 -10980 -21354 -17206 -10683 -17107 -1133 4171
6965D171j6355M586O23k611J1504o308P23o729m63Q419M228m757p873r49Q731
6950c060j462j478J302J2427J1783k387j1505o968l390n679n743l620J885J2870
6936e025K159l018K680K636J852l429j471k492Q640J2358r36j2988N073M871o267
6921D643q337j2899r878N047P945J7380P877l611J4962J05p068n665o717m186
6907d02p592R180o230O286J907j1626o379k969K411J0861o233q522N239j3521
6893b7590J0145K337j0128P566j647p536n612M044k68O216R898J0982o31L046
6879H22J609J949M412o079j3919q645R822R34j2898Q76M846R780l27n58L377k518
6863f517P609L958r548l071K77J344P507j918o515O237R36k072J14j303L491K61
$$ plain form
6965 4171 -12184 -7598 -6975 -9586 1918 -4390 -3667 -10396 -10859 -2440 1788 -2969 -10842 -11791 -3060
6950 -3060 -4522 -6000 -4698 7729 19512 17125 5620 -1348 -4738 -10417 -16160 -19780 -17895 -5025
6936 -5025 -2866 -5884 -3204 -568 1284 -2145 -3616 -6108 2532 14890 13954 966 6039 10910 4643
6921 4643 -3694 -16593 -26471 -21424 -13479 3901 11778 8167 23129 23234 16166 10501 3784 -402
6907 -402 -7994 1186 -5044 1242 3149 -8477 -14856 -17825 -15414 -4553 -10786 -19308 -14069 -27590
6893 -27590 -17445 -15108 -25236 -17670 -19317 -26853 -32465 -28421 -28689 -22473 -12575 -1593 -2224 822
6879 822 2431 4380 8792 2713 -11206 -19851 -10029 -9095 -21993 -21117 -16271 -6491 -6818 -7376 -3999 -6517
6863 -6517 1092 5050 -4498 -7569 -7292 -5948 1559 -359 -6874 -637 299 -1773 -1659 -2962 529 790
6847G90J561J4615K64K146N784j0165j3757r021J0653n801j218J526P617O458
6833A1452L823m793m632N22L400q275r279J692j743J407L670J0442K896j5230
6819d648J232P028M236J854n892M25o007k774q396N099K0380K496m64N90j0807
6804D352m689l979j3370L879K3094Q102j8169j0131o223J425O7L604J3339K417
6790C718J04N52j34k030R253O083n441j886o547j545k824J640O375J4002n710
6775A5610j6602j3180k686K039L077P347P543o284l661p255n224J633N337O638
6761e668K188O779M660n21j329m513j2294O72L559M807m351o132M038J091N747
6746a267k759L801N25m51n510J321k001l491m41N645J3309L913p442j2478m436
$$ plain form
6847 790 2351 16966 17230 19376 25160 14995 1238 -7783 2870 -2931 -4149 -2623 4994 11452
6833 11452 15275 10482 5850 6372 9772 1497 -7782 -6090 -7833 -6426 -2756 7686 10582 -4648
6819 -4648 -3416 3612 7848 9702 3810 4235 -1772 -4546 -12942 -7843 12537 15033 14569 15159 4352
6804 4352 -337 -4316 -17686 -13807 9287 17389 -780 -10911 -17134 -15709 -15642 -12038 1301 3718
6790 3718 3822 4374 4240 2210 11463 17546 12105 10219 3672 2127 -697 943 7318 21320 15610
6775 15610 -992 -14172 -16858 -14819 -11742 -4395 3148 -3136 -6797 -14052 -19276 -17643 -12306 -5668
6761 -5668 -3480 3299 7959 7438 6109 1596 -10698 -10026 -6467 -1660 -6011 -12143 -8105 -7014 -1267
6746 -1267 -4026 -225 300 -151 -5661 -4340 -6341 -9832 -10273 -4628 8681 12594 5152 -7326 -11762
6731a1762R96J3439J0978N230K11p434o297P069O857n471K587Q721R976J1140
6717D6240K3643L6138O2860Q2452K4297n4368p3791m5123l7963k0975r473k1889
6705A2048q145M555J870M562J421j1809p435R477J0856n696j3312k519j0785p277
6691b2189o274R072J4997J1163K084q485l166L765o061r098P63J0149K86q664
6677a1658N17N097q57p232l437O317O382n313n319M890k782j460O189J6950P367
6662A5651J3298o206j2703j2144l785L505Q710L760l579k112o650j1873M296n6
6648i888J355m619N303P760k629j0305k639n269j0975L360J0190J2146O092k547
6634b665k916P15k436l933N498P164j1434k1439j0033K602J3964M527l464l791
$$ plain form
6731 -11762 -10766 2673 13651 18881 19092 11658 5361 12430 19287 13816 16403 25124 35100 46240
6717 46240 69883 106021 168881 251333 275630 221262 147471 102348 64385 43410 33937 12048
6705 12048 3903 8458 10328 14890 16311 4502 -2933 6544 17400 11704 -1608 -4127 -14912 -22189
6691 -22189 -28463 -19391 -4394 6769 8853 368 -2798 967 -5094 -14192 -13429 -3280 -2994 -11658
6677 -11658 -11141 -6044 -6901 -14133 -17570 -11253 -4871 -10184 -15503 -10613 -13395 -14855 -8666 8284 15651
6662 15651 28949 22743 10040 -2104 -5889 -2384 6326 10086 6507 4395 -2255 -14128 -9832 -9888
6648 -9888 -8533 -13152 -7849 -89 -2718 -13023 -15662 -20931 -31906 -28546 -18356 -6210 -118 -2665
6634 -2665 -5581 -4866 -7302 -11235 -5737 1427 -10007 -31446 -41479 -38877 -24913 -20386 -23850 -27641
6620b7641Q567J962n315Q231J6030O19o124M715O011j0900M598q553j5638P015
6606a6423O039k602J255N702J1461o496q555l358N09k518N487J054l906q083J0372
6591a0062R815J870q695n436N62J3412R104J116j3925n361p892J420J9807J7116
6577B2851p523j3775j7691o446J0858J5718m785O75Q448O330q329n532O812j009
6563F602r109l423L524q705j0242J603J4033J1722K429Q213n800j1618o117M715
6549b173l092k87j1010J457K431n31j363m603m491K924J3187L64j573Q672j0066
6534a0154M809N926N857q458n17M964j607o161j5778o575N899J1479m71K831J172
6519f784m638M676m290k423L353P394j701M709l160r700J4105J1281j1056p757
$$ plain form
6620 -27641 -19074 -17112 -22427 -14196 1834 2453 -3671 1044 7055 -3845 753 -7800 -23438 -16423
6606 -16423 -10384 -12986 -11731 -6029 5432 -1064 -9619 -12977 -12468 -14986 -9499 -8445 -12351 -20434 -10062
6591 -10062 -247 1623 -7072 -12508 -11946 1466 10570 11686 -2239 -7600 -15492 -14072 5735 22851
6577 22851 15328 1553 -16138 -22584 -11726 3992 -793 -118 8330 14660 6331 799 7611 6602
6563 6602 -2507 -5930 -2406 -11111 -21353 -19750 -5717 6005 8434 16647 10847 -771 -6888 -2173
6549 -2173 -5265 -5552 -16562 -15105 -12674 -13205 -14568 -19171 -23662 -20738 -7551 -7187 -8760 -88 -10154
6534 -10154 -5345 581 6438 -2020 -2537 2427 820 -5341 -21119 -27694 -21795 -10316 -10787 -7956 -6784
6519 -6784 -11422 -6746 -11036 -13459 -10106 -2712 -4413 296 -2864 -12564 1541 12822 1766 -5991
6505e991o592k925j0301N001R424n904K134O165P791Q549q112l394o43j1772p591
6490b4161L536M648J7546K598P006O930q314M536l33O6j0231j5379m96Q346o59
6475d361K06j2138N182J1744J2946m590n51l915m513L710j01j2844N709O618j1580
6460h478M68M21R63k291k899j5129l505J3341k59m893J6482N969Q047J862JN508
6444A5608r19o296l528o380m320M647K744r47j1848K763L979L549j111M460P130
6429I531l46p074O143N909j8282r267L199J610K664J766L294J0315L775l489p67
6414H981q787J3985R69j3613j0937j2974K995Q076L211J025K819j603N400P463
6400G010p787j3368N711p247M09P919L01K485M966q81j0724J444L952K178j10
$$ plain form
6505 -5991 -12583 -15508 -25809 -20808 -11384 -17288 -15154 -8989 -1198 7351 -761 -4155 -4798 -16570 -24161
6490 -24161 -20625 -15977 1569 4167 11173 18103 9789 14325 13992 14058 3827 -11552 -12048 -3702 -4361
6475 -4361 -4155 -16293 -11111 633 13579 8989 8438 4523 10 3720 3619 -9225 -3516 3102 -8478
6460 -8478 -8010 -7589 -6626 -8917 -11816 -26945 -30450 -17109 -17368 -22261 -5779 190 8237 10099 10100 15608
6444 15608 14689 8393 4865 -1515 -5835 -1188 1556 609 -11239 -8476 -4497 -948 -2059 2401 9531
6429 9531 9185 2111 8254 14163 -4119 -13386 -10187 -8577 -5913 -4147 -853 9462 13237 9748 8981
6414 8981 194 14179 15148 1535 -9402 -22376 -19381 -11305 -8094 -7069 -4250 -5853 -453 7010
6400 7010 -777 -14145 -8434 -15681 -15272 -7353 -7052 -4567 399 -482 -11206 -9762 -5810 -3632 -3742
6385c742q814L31l977J430J1888J3765Q309q191p146j018O987K014K06l309j1673
6370b940j3492J4755p24p322J0221r711j175J0187l098J472L886q349n031Q19
6356a0502o584r9J3453J2024K72Q89O804r084l961J967n033k202p498j1628n3
6341b1235N282Q064J96l709L304J0924Q450M018o86o581J4455L496m1p374o084
6326A2479n659K477L523r919j0076N952K659K632p127o911p16m000Q092k324j355
6311a0273Q492k136J101o296j4260m901j054q873k095J6320J3989j890p529j492
6297b0897P210l333n105k116M855n608L19N639O74k317o425J77Q752J2282j848
6282g741P4l285J2018Q773o186j614j2958n483J0154J0940l189o562l813P734
$$ plain form
6385 -3742 -12556 -12225 -16202 -14772 -2884 10881 19190 10999 3853 2835 9822 11836 12042 8733 -2940
6370 -2940 -16432 -1677 -2401 -9723 498 -9213 -10388 -201 -3299 -1827 2059 -6290 -11321 -10502
6356 -10502 -17086 -17185 -3732 8292 8564 9453 16257 7173 3212 5179 146 -2056 -9554 -21182 -21235
6341 -21235 -15953 -7889 -7693 -11402 -8098 2826 11276 15294 14608 8027 22482 25978 25937 18563 12479
6326 12479 6820 9297 12820 2901 -7175 -1223 1436 4068 -3059 -9970 -10686 -14686 -6594 -8918 -10273
6311 -10273 -1781 -3917 -2816 -9112 -23372 -28273 -29327 -38200 -40295 -23975 -9986 -11876 -19405 -20897
6297 -20897 -13687 -17020 -22125 -24241 -19386 -24994 -24675 -19036 -18362 -20679 -27104 -26927 -18175 -5893 -7741
6282 -7741 -7667 -10952 1066 9839 3653 2039 -10919 -16402 -6248 4692 1503 -5059 -8872 -1138
6268a138M763K007j6008q422q11Q324J208k705q88k120N803J9000M464n531N48
6253H494K531J8261j5984j7617k862j969j5806O193K105j847P030R655k646l781
6239h243o482M27P718J043J84q808j271M872q555L937K1952N230j513M535O513
6224B1539Q314j7409j8104k838R38q374J123J3483Q771j7922o151P695P950j610
6210b595L553P072N473k359j024L360M121j2647N13j800j032J0874M81k42r880
6195C868K196J931k191J1187L985P381j235j6268L698j892p174n094j1589j22
6181a1319l028L165N349R387M01k73o549m555P77n50j1214P758K263j217J166
6166h439J2956K185j3378q178m057R479J5241J6120k71j0611m886q852n324L441
$$ plain form
6268 -1138 3625 5632 -10376 -18798 -19609 -11285 -10077 -12782 -13670 -15790 -9987 9013 13477 7946 8494
6253 8494 11025 29286 13302 -4315 -7177 -9146 -24952 -18759 -16654 -18501 -11471 -1816 -4462 -8243
6239 -8243 -14725 -14298 -6580 -5537 -5353 -14161 -15432 -10560 -19115 -15178 6774 12004 10491 15026 21539
6224 21539 29853 12444 -5660 -8498 -7560 -15934 -14811 -1328 7443 -10479 -16630 -8935 -985 -2595
6210 -2595 958 8030 13503 11144 10120 13480 17601 4954 5467 3667 2635 13509 13990 13748 3868
6195 3868 6064 7995 5804 16991 20976 28357 27122 10854 14552 12660 5486 392 -11197 -11319
6181 -11319 -14347 -11182 -5833 3554 3955 3682 -2867 -7422 -6645 -7195 -18409 -10651 -8388 -9605 -8439
6166 -8439 4517 6702 -6676 -14854 -18911 -9432 5809 21929 21658 11047 6161 -2691 -8015 -4574
6152d574R054J1821P663m131j4800J210o80k440l683k646j916j1485r651K359
6138b3899Q018o745j256J1163r3j163m320L096l179N844p641l131J1531j0365
6124b2140L120N412j236N078n979M706N4l631q84Q563q42j917O33J3618J43j1009
6108f311n449L278Q932l119m015o609j885l767j0388M351l264J0671Q480O677
6094b418l688M790O094L893l265L692m86Q462m220j7986j018L444M312n720M92
6079c622J986N105o852Q15q060p687L863n842n054l62J8752J4258j0090p441k723
6064a2954l825J055J2708R852J653q417j656L656M413M718l56R852l814r427L17
6049G775j331P146L603j906M572q137j3690j0218J0021J3426L151L488N582j0882
$$ plain form
6152 -4574 4480 16301 23964 19833 5033 6243 5563 3123 -560 -3206 -5122 -16607 -26258 -23899
6138 -23899 -15881 -22626 -23882 -12719 -12812 -13975 -18295 -15199 -18378 -12534 -20175 -23306 -11775 -22140
6124 -22140 -19020 -13608 -14844 -9766 -15745 -11039 -10985 -14616 -15500 -6937 -7779 -9696 -9063 4555 4698 -6311
6108 -6311 -11760 -8482 450 -2669 -6684 -13293 -15178 -18945 -29333 -24982 -28246 -17575 -9095 -2418
6094 -2418 -6106 -1316 4778 8671 5406 9098 8612 17074 12854 -5132 -6150 -2706 1606 -4114 -3622
6079 -3622 -1636 3469 -3383 -2568 -10628 -18315 -14452 -20294 -25348 -25710 -6958 7300 -2790 -10231 -12954
6064 -12954 -16779 -15724 -3016 6836 8489 72 -1584 2072 6485 11203 10847 20699 16885 7458 7775
6049 7775 6444 13590 17193 15287 19859 11722 -1968 -12186 -2165 11261 14412 17900 23482 12600
6035A2600p328L0j265p869N701M050j0501p758J839k266L545O797M056J77j440
6020C68q179J1592K85R16j3738O85J1808l384j5480j2866M095J3747Q100K402
6006C51m389J512L465L324J2287L195j1435M324j11m402L36L298j240j1942R59
5991d68P696J955o95o637N177M454j0988q666l753O924J5553R40l970j5640N352
5976b766L903j1092j0220L967m75m665m182r32J2808j244k543K680Q455o721j018
5961a4045j473k536N001q75R966j0943k10N923Q520j3166n150J1269J2739j5384
5947a0364m762k371J0046j982K393J1335r611o173J4407J0809m306q396p526Q0
5933f421p332J757Q361Q002j837j594m64p912j2806l460J151M862P410Q899R046
$$ plain form
6035 12600 5272 5302 4037 -3832 1869 5919 -4582 -12340 -10501 -12767 -9222 -2425 1631 1808 368
6020 368 -7811 3781 4066 4982 -8756 -8071 3737 353 -15127 -27993 -23898 -10151 -2051 351
6006 351 -4038 -2526 939 4263 16550 19745 8310 12634 12523 8121 8457 11755 10515 -1427 -468
5991 -468 7228 9183 8488 1851 7028 11482 494 -8172 -11925 -5001 10552 11492 7522 -8118 -2766
5976 -2766 1137 -9955 -20175 -16208 -16683 -21348 -25530 -26462 -13654 -14898 -17441 -14761 -6306 -13027 -14045
5961 -14045 -15518 -18054 -13053 -13928 -3962 -14905 -15115 -9192 -672 -13838 -18988 -7719 5020 -10364
5947 -10364 -15126 -17497 -7451 -9433 -7040 4295 -5316 -11489 2918 13727 9421 1025 -6501 -6421
5933 -6421 -13753 -11996 -3635 4367 2530 936 472 -7440 -20246 -23706 -22555 -17693 -10283 -1384 7662
5918G662q76j1319k314l994j949J2670M593L575O344q252q733r705q380P532M22
5903a2724N58M066Q363J3125j263m096n801n913J642O92j0931q675o292J0018
5889a7231N168P035R715j056k135Q106o564l390O073m708n033n522r565L899J1250
5874c958p480o797L843K174k515n005m649Q061n332Q498J1904L187m397K97J0099
5859G930p083P664N126O771o595m877K523k755k361n00k977N261j321j0982j1367
5844a5543j291m674K21J2413R124M954J597j0541j0488N127P972l290l986k797
5830a1202k3407K885R641J0095R30J78O419P636k537K787k104o478q806l417r01
5815a8281R500K182k159j4492o391l812k182R791Q299J5298O595j188p344L770
$$ plain form
5918 7662 6786 -4533 -6847 -10841 -12790 -120 4473 8048 14392 6140 -2593 -12298 -20678 -13146 -12724
5903 -12724 -12166 -8100 263 13388 12125 8029 2228 -3685 -2043 -1351 -12282 -20957 -27249 -17231
5889 -17231 -12063 -5028 4687 3631 1496 9602 3038 -352 5721 1013 -4020 -9542 -19107 -15208 -3958
5874 -3958 -11438 -18235 -14392 -12218 -14733 -19738 -24387 -16326 -21658 -13160 -1256 1931 -2466 -2169 7930
5859 7930 847 8511 13637 20408 13813 8936 11459 8704 6343 5843 2866 8127 6806 -4176 -15543
5844 -15543 -16834 -21508 -21287 -8874 250 5204 6801 -3740 -14228 -9101 -1129 -4419 -8405 -11202
5830 -11202 -34609 -31724 -22083 -11988 -11058 -10880 -4461 3175 638 3425 1321 -5157 -13963 -17380 -18281
5815 -18281 -8781 -6599 -8758 -23250 -29641 -33453 -35635 -25844 -17545 -2247 4348 3160 -4184 -414
5801d14O044p113l105l896j2493j0077Q5J3434q70O115P763p450m207O995l569
5786a2758K655k196M821J043l94m851l651p28K353J296m849O612l082j7752J4842
5771a6639J6379K462j5813j5668P920K206J2078J869o788o060K157k432J1496
5758f833L113p712N241n507P325p31k979j647j311n957L743J6434J2374P50l263
5743A3040q472o033N632R225J7749o300p162q649L82L611o553l434j792l050j3238
5728a5044n406P651L665L301j161J0412L021o304Q352j975p369J2872q58l22L820
5713A4655j1403r114M811n3l458K030N835j1647o745j42J662l042L862n62o51
5698a3962R704L35j814K150O498q76R038o972Q16N788M89p713r797O496K762j0112
$$ plain form
5801 -414 5630 -1483 -4588 -8484 -20977 -31054 -30969 -17535 -18405 -12290 -4527 -11977 -16184 -9189 -12758
5786 -12758 -10103 -12299 -7478 -6435 -6829 -11680 -15331 -16059 -13706 -12410 -17259 -10647 -13729 -31481 -16639
5771 -16639 -260 2202 -13611 -29279 -21359 -19153 -7075 -5206 -11994 -18054 -15897 -18329 -6833
5758 -6833 -3720 -11432 -6191 -11698 -4373 -5104 -8083 -9730 -11041 -16998 -13255 3179 15553 16303 13040
5743 13040 4568 -1465 4167 13392 31141 24841 17679 9030 9412 13023 6470 3036 1244 -1806 -15044
5728 -15044 -20450 -12799 -9134 -5833 -6994 3418 6439 135 8487 6512 -857 12015 11157 10835 14655
5713 14655 3252 -5862 -1051 -1104 -4562 -2532 3303 -8344 -15089 -15231 -13569 -16611 -12749 -13311 -13962
5698 -13962 -4258 -3923 -5737 -3587 2911 2035 11073 4101 4917 10705 11194 3481 -6316 180 2942 -7170
5682g170j3906M846L319J678J4406r53K675O762j398j1508k800l730l743L547
5668g975Q379k514j304J886p907r244J676N068L167p07N359Q629k41O789o225
5653D836p577J506R900R791N199n963q085r453M363n588j5906k924J661J012N950
5638a1278N634O428p869j0791J4744J767K338r754n296L734J7403R268j5834o242
5624e748K643l1j753K367p883O436L984j3165j863M193k337m212n366L019m175
5609b3891J3891R842p286k615O109Q615q983r001j217O697j133q74N348m06R029
5594D125l29j687K375o338q471l686J4097N653K20k524n844m615N163J0934R072
5579A8145p30J319o529j1298k625r274L153J3602k710L838L673k727p39l073L308
$$ plain form
5682 -7170 -21076 -16230 -12911 -11233 3173 2220 4895 11657 10259 -1249 -4049 -7779 -11522 -7975
5668 -7975 404 -2110 -3414 -1528 -9435 -18679 -17003 -11935 -8768 -9475 -4116 4513 4272 11061 4836
5653 4836 -2741 -1235 8665 18456 23655 17692 9607 154 4517 -1071 -16977 -19901 -18240 -17228 -11278
5638 -11278 -5644 784 -7085 -17876 -3132 -1365 973 -8781 -14077 -10343 7060 16328 494 -5748
5624 -5748 -3105 -3136 -4889 -2522 -10405 -3969 15 -13150 -15013 -10820 -13157 -17369 -22735 -19716 -23891
5609 -23891 -10000 -158 -7444 -10059 -3950 4665 -4318 -13319 -14536 -7839 -8972 -9846 -4498 -4904 4125
5594 4125 3796 2109 4484 -1854 -10325 -14011 86 5739 5959 3435 -2409 -7024 -1861 9073 18145
5579 18145 17415 18734 12205 907 -1718 -10992 -7839 5763 3053 6891 10564 7837 7098 4025 7333
5564G333L736n796k307j216j2248m740j30k580j510l52O419L001p218O729M942
5549e937J448j372L100M81r619j0299O491J7155K032p325n11M689o016m473r43
5534a1099q94j745J6814o659r547P069Q553O963j161o294k20k183J45m483q327
5519a3068l192L274J557N704L445O674r800Q75j0018Q812Q458m738r520m66O373
5504e630q44N083J466j5984k241Q60Q874O030M064k986k0107Q033P853N417N597
5489E485J6725O586m828m654K503k109k284k578q370l187K191k418Q042P88o996
5474D896o50J1481J139j1104p285J299J1472M251m738l794j630J914m339K309
5460E221l851j5344L76K951Q773p236o110r850N037P995J3187p82m601M224N501
$$ plain form
5564 7333 11069 5273 2966 1750 -10498 -15238 -15368 -17948 -19458 -19810 -13391 -10390 -17608 -10879 -5937
5549 -5937 -4489 -5861 -2761 -2280 -11899 -22198 -15707 1448 3480 -3845 -4356 333 -5683 -10156 -11099
5534 -11099 -11993 -13738 3076 -3583 -13130 -6061 2492 9455 8294 2000 1780 -403 -258 -4741 -13068
5519 -13068 -16260 -12986 -11429 -5725 -2280 4394 -5406 -4531 -14549 -5737 2721 -2017 -11537 -12003 -5630
5504 -5630 -6474 -1391 75 -15909 -18150 -17290 -8416 -2386 1678 -1308 -21415 -13382 -5529 -112 5485
5489 5485 22210 28796 23968 19314 21817 19708 17424 14846 6476 3289 5480 3062 11104 11892 4896
5474 4896 4246 15727 16866 5762 -1523 -224 11248 15499 10761 6967 5337 7251 2912 5221
5460 5221 1370 -13974 -13598 -10647 -1874 -9110 -15220 -25070 -20033 -12038 1149 367 -4234 -10 5491
5445E491L226q13p780j321l190p459p90L188R121K517p145K511J1411Q186j48
5430A7005P836P63p556r373r489j618n922J262N81j562P12k815l273K484P280
5415c685R129M871j5397q429J0161m768p895n414j0908J547J3605J5831M31m044
5401d965p96q139Q393J1890M794j1353r183k043o4P072O605L822L086K15J2k24
5385I122o081l015M536r792q418q724J1320M216o928l262j1522K390J1112M447
5371a0599q07L013J9072o279j3984M275M80l69j609J37Q142j517j633o603p281
5356a5562o302J614K945J4581O09j0951m695L540J6326J936k475l099j1081R481
5342c133P133n952j02k55j251j1355L528J6459L049l528l072l40P75j7892q190
$$ plain form
5445 5491 8717 7904 124 -1197 -4387 -11846 -12636 -9448 -327 2190 -4955 -2444 8967 17153 17005
5430 17005 24841 25604 18048 8675 -814 -2432 -8354 -7092 -6511 -8073 -7361 -10176 -13449 -10965 -3685
5415 -3685 5444 10315 -5082 -13511 -3350 -8118 -16013 -21427 -32335 -30788 -17183 -1352 -921 -4965
5401 -4965 -5761 -13900 -5507 6383 11177 -176 -9359 -11402 -11466 -4394 2211 6033 9119 9334 9346 9122
5385 9122 3041 26 4562 -5230 -13648 -22372 -11052 -6836 -13764 -17026 -28548 -26158 -15046 -10599
5371 -10599 -11406 -8393 10679 4400 -9584 -5309 -4829 -5198 -6807 -6670 1472 -45 -1678 -8281 -15562
5356 -15562 -21864 -20250 -17305 -2724 -2115 -13066 -17761 -14221 2105 4041 1566 -1533 -12614 -3133
5342 -3133 4000 -1952 -2054 -2309 -3560 -14915 -11387 5072 8121 4593 1521 1181 1956 -15936 -24126
5327b4126J5512J2321O38p348K776n658k6995m73J4021N364J96R868n358j0173
5313a9435N071P297P870o879r211r428L038j64J057J391L664L392J1979k22J3898
5298A3318K979j6907r042Q604L343J061l777k444M496r156j149R529r320p313
5284a5778K855L772J0394l688J618r982k235J640p158Q286R282m600J1913J978
5270H297m193l597l608J090n067o772P495J5973M029k30r662o687m246l836J9467
5255H453O026J823k296k985j0551o003l354j333O281j354p152M70N404r80j3904
5240b1455Q042K3284J5577L102q445j7910j5455K788N791O855l490L956N011J0028
5226A7679J72j0500j0402l534O461J103J288n052J570N082K598N639O772j997
$$ plain form
5327 -24126 -8614 3707 4345 -3003 -227 -5885 -32880 -33353 -19332 -13968 -13772 -3904 -9262 -19435
5313 -19435 -14364 -7067 803 -6076 -15287 -24715 -21677 -21841 -20784 -19393 -15729 -12337 -358 -580 13318
5298 13318 16297 -610 -9652 -1048 2295 3356 -421 -2865 1631 -7525 -8674 855 -8465 -15778
5284 -15778 -12923 -9151 1243 -2445 -827 -10809 -13044 -11404 -18562 -10276 -994 -5594 6319 8297
5270 8297 4104 507 -3101 -2011 -7078 -13850 -6355 9618 13647 13417 3755 -2932 -7178 -11014 8453
5255 8453 14479 16302 14006 11021 470 -5533 -8887 -10220 -3939 -5293 -12445 -11975 -6571 -7551 -21455
5240 -21455 -13413 9871 25448 28550 20105 2195 -13260 -10472 -4681 2174 -1316 2640 7651 17679
5226 17679 17851 7351 -3051 -6585 -124 979 2267 -2785 -1215 3867 6465 12104 18876 16879
5212A6879K84q212k964n156j2075q958r11O862J5250J0716j193L914n797O32n521
5197C750j418l761O67k128m445k493k866J276n336J4349N211K040m68o074r567
5182a1263j566k598Q511O861l76M49J4419J0080q099r207j2688J110q77n214j0556
5167b1014J2431P347k484N699O364k729p220k192j929p797O979K074k763n858
5153a3092m198l797l762j674M766J1681J4627J641N503J2743q31q133o172k404
5139F898K819l87L597J745L894j4674m636L756O586r992K475j992J1705P86l082
5124I498R220k997j4083K727j492j4833l22J6946J2078j3633j3130J5753j76K019
5110G575j3248j9136m249J7070k962M465J2799l331k268Q203J0162P623n311N607
$$ plain form
5212 16879 17163 8951 5987 831 -11244 -20202 -21113 -14251 999 11715 10522 14436 8639 9271 3750
5197 3750 2332 -1429 -762 -2890 -7335 -9828 -12694 -11418 -16754 -2405 2806 4846 4378 -1696 -11263
5182 -11263 -12829 -15427 -6916 -55 -431 18 14437 24517 16418 7211 -5477 -4367 -5244 -10458 -21014
5167 -21014 -8583 -1236 -3720 1979 8343 5614 -1606 -3798 -5727 -13524 -6545 -4471 -7234 -13092
5153 -13092 -17290 -21087 -24849 -26523 -21757 -10076 4551 6192 11695 24438 23607 15474 9302 6898
5139 6898 9717 9330 12927 14672 18566 3892 -744 3012 9598 -394 2081 89 11794 12580 9498
5124 9498 18718 15721 1638 4365 2873 -11960 -12282 4664 16742 3109 -10021 5732 5556 7575
5110 7575 -5673 -24809 -29058 -11988 -14950 -10485 2314 -1017 -3285 4918 15080 22703 17392 22999
5096B2999K934r05o898l264j478L89o63q590m859n864M07o50r180k80J2867R114
5080F079j6081J443J0525N959L078m573l762k375p396j811R210R124J1398r109
5066A1709j0234K422j936m374j614N725J0095M871p24O341j9472k4037o657p074
5052c4959l713J5947R15k984J1908L398L430m830K70l817q927m480J1669l338
5038a9511L070J2267L693m557R49L107j745j1588o682k083J527J6100J8329k066
5024A0810q632j0448q611M183J5383Q74q88j4125j2245L973L388Q577Q370j3702
5010a3093l67K598L786N864O823l942j2231J056L420k82M060l670j3313l51J7025
4995b617R630k08j3004L265j757m021J1671O561j5367O709O839j1387j2606J60
$$ plain form
5096 22999 25933 25028 18130 14866 13388 13777 13114 4524 -335 -6199 -5792 -6442 -15622 -15902 -3035 6079
5080 6079 -10002 -8559 1966 7925 11003 6430 2668 293 -7103 -8914 296 9420 20818 11709
5066 11709 1475 3897 1961 -2413 -4027 1698 11793 16664 15940 22281 2809 -21228 -27885 -34959
5052 -34959 -38672 -22725 -21810 -24794 -12886 -9488 -6058 -10888 -10618 -14435 -23362 -27842 -16173 -19511
5038 -19511 -16441 -4174 -481 -5038 -4089 -982 -2727 -14315 -20997 -23080 -21553 -5453 12876 10810
5024 10810 2178 -8270 -16881 -12698 2685 3559 2671 -11454 -23699 -19726 -16338 -7761 609 -13093
5010 -13093 -13460 -10862 -7076 -1212 5611 1669 -10562 -9506 -6086 -6368 -2308 -5978 -19291 -19642 -2617
4995 -2617 7013 6805 -6199 -2934 -4691 -8712 2959 9520 -5847 862 7701 -3686 -16292 -16132
4981a6132j066P79R735k222N169p848j1701P292N136O81j399K403L357K821M794
4966A799k648r147l524K980r87j405O320j026m623Q913R692m175l938L726L528
4951E485K1829J2839p89p476j1396n567j6811j251P22O149r308j0431o096L878
4937a8223J0469k889J899M590o892L838O144L231M886l053L520R34q727n309j3473
4922a9055K228Q953J1361r069M58k437l195m577R071O599j757l063Q794M339j65
4907H485n698k646Q005j681N706O03j367M865M529r829j520k628Q04L671l100
4892H199J227m954j6147j500J3169P348o830q058O946M474O04P264Q277m054j5329
4877F36j1430L134J6705N879j4719l995o138m49k837J0636K697j792m437J654
$$ plain form
4981 -16132 -17198 -16419 -6684 -8906 -3737 -11585 -23286 -15994 -10858 -10177 -11576 -9173 -5816 -2995 1799
4966 1799 -849 -9996 -13520 -10540 -11527 -12932 -6612 -7638 -12261 -3348 6344 2169 -1769 1957 5485
4951 5485 27314 40153 39364 31888 20492 14925 -1886 -3137 -2415 3734 -5574 -16005 -22101 -18223
4937 -18223 -7754 -10643 -8744 -4154 -11046 -7208 -1064 2167 7053 4000 7520 8454 -273 -5582 -19055
4922 -19055 -16827 -7874 3487 -5582 -5124 -7561 -10756 -15333 -6262 337 -1420 -4483 4311 8650 8485
4907 8485 2787 141 8146 6465 12171 12774 11407 16272 20801 10972 9452 6824 7628 11299 8199
4892 8199 9426 4472 -11675 -13175 -6 7342 512 -7546 -600 3874 4478 11742 20019 15965 636
4877 636 -10794 -7660 9045 14924 205 -3790 -9928 -10377 -13214 -2578 119 -1673 -6110 -4456
4863d456K192m0j2751l629M136j225k263O582K0590O46j0822O036k715N475M078
4848A1834o288o411L647n852k834l837r523P754J1564k020j255P354K979m22r150
4833b460r37j3367L325O304Q57M816k922M5l431j771q878m092M406N171N13N542
4817f879J3927o021K771p23q186k985K475p74O547J526J2054P43k329j4796j3443
4802a6093j0306l140N779J5404P220m756r196o434n92P324o41N633J0127O356
4788F685l581r195j0717J1071L317k2K990r74o877Q693j539q318M640K786N488
4773D447J4859k04j6264j1889M486k841K744p919n065J3004K382L924K279q382
4759d439q469q412N455J2483R657Q006o16j1002k3209N203J1188p918J439l836
$$ plain form
4863 -4456 -2264 -2304 -15055 -18684 -14548 -15773 -18036 -11454 9136 9782 -1040 4996 2281 7756 11834
4848 11834 5546 -865 2782 -3070 -5904 -9741 -19264 -11510 54 -1966 -3221 4133 7112 6690 -2460
4833 -2460 -3397 -16764 -13439 -7135 -6278 -1462 -4384 -4339 -7770 -9541 -18419 -22511 -18105 -12934 -12421 -6879
4817 -6879 7048 1027 3798 3075 -5111 -8096 -5621 -6395 152 1678 13732 14475 12146 -2650 -16093
4802 -16093 -26399 -29539 -23760 -8356 -1136 -5892 -15088 -21522 -22114 -14790 -15431 -9798 329 6685
4788 6685 3104 -6091 -16808 -5737 -2420 -2442 548 -426 -7303 1390 -149 -8467 -3827 -1041 4447
4773 4447 19306 19102 2838 -9051 -4565 -7406 -4662 -12581 -17646 -4642 -2260 1664 3943 -4439
4759 -4439 -12908 -21320 -15865 -3382 6275 14281 13665 2663 -20546 -15343 -4155 -12073 -10634 -14470
4745a4470R701R970r04J362n114q128M271M365M516m362n7K264M578o062j885
4730D5q358j754O704Q051q510m191m201k567l359N943R470K2573K418j2224l298
4715F742m807l874K213N233K195o844q108j110P60N584j0420j5994P399R777l693
4700a4947j481J159K71l821L889J4210K743p807m56M137m435k986k332P169J2069
4685G382J430r789j6027q028O052J9114K718k088J0023m439n59J6434M986j0475
4671A6734j2603j4617j721O163j47r7l071N447L111k14M6k710O291o078p926J6105
4655D713J3372o192j0670M960J801o836J940L965K192o924L587M275j6865J729
4641d953R422q437N196m846J207Q544n481j989j0173p539O162M808n362o565J2749
$$ plain form
4745 -14470 -4769 5201 4297 5659 545 -7583 -3312 1053 5569 1207 1150 3414 7992 1930 45
4730 45 -8313 -10067 -3363 4688 -3822 -8013 -12214 -14781 -18140 -12197 -2727 19846 22264 10040 6742
4715 6742 1935 -1939 274 5507 7702 858 -7250 -8360 -7600 -2016 -12436 -28430 -21031 -11254 -14947
4700 -14947 -16428 -15269 -14998 -18819 -14930 -720 2023 -5784 -6240 -2103 -6538 -9524 -11856 -4687 7382
4685 7382 8812 -977 -17004 -25032 -18980 134 2852 764 10787 6348 5789 22223 27209 16734
4671 16734 4131 -10486 -12207 -6044 -6191 -6288 -9359 -3912 -801 -1015 -969 -3679 2612 -3466 -11392 4713
4655 4713 18085 11893 1223 6183 7984 1148 3088 7053 9245 2321 5908 10183 -6682 -4953
4641 -4953 4469 -3968 1228 -3618 -2411 6133 652 -1337 -11510 -19049 -12887 -8079 -13441 -20006 -7257
4626g257N815q278o867J1177P828k318K370J89K92q649p253M198N092N845m851
4611b667j485K694M0m962j1883l916L040M990o253K466M817J0908J0460n936m474
4596b161m693k860j0333L814P67K364Q021j560L468o873k857Q097j3714j9456
4582c7976J8616P073o094J2764P876j04P737q531p581K527l291O450K1j642j129
4567c284m36j84P131K737j1122o723J647R521J768r799k405O625j224m275J3224
4552C201J3370p110j3126q693l555O672j350Q232M032L204J638k796k408m542
4538c231k970K123l207k113j0588n688P74N028k525n547j281K158l342P288J2164
4523a0957J8959kj1725j7047k570O767Q113J635J187q352N140J398M767N037O816
$$ plain form
4626 -7257 -1442 -9720 -16587 -5410 2418 100 2470 2659 2951 -5698 -12951 -8753 -3661 2184 -2667
4611 -2667 -4152 -1458 -1418 -6380 -18263 -22179 -19139 -14149 -20402 -17936 -13119 -2211 8249 2313 -2161
4596 -2161 -6854 -9714 -20047 -16233 -15466 -13102 -5081 -6641 -3173 -10046 -12903 -4806 -18520 -37976
4582 -37976 -19360 -12287 -18381 -5617 2259 2155 9892 1361 -6220 -3693 -6984 -534 -513 -2155 -3284
4567 -3284 -3720 -3904 3227 5964 -5158 -11881 -10234 -713 1055 -8744 -11149 -4524 -5748 -10023 3201
4552 3201 16571 9461 -3665 -12358 -15913 -9241 -10591 -2359 1673 4877 6515 3719 1311 -3231
4538 -3231 -6201 -4078 -7285 -9398 -19986 -25674 -24900 -19872 -22397 -27944 -29225 -27067 -30409 -23121 -10957
4523 -10957 8002 8000 -3725 -20772 -23342 -16575 -8462 -6827 -5640 -13992 -8852 -7454 -2687 2350 9166
4508I166P4P215p46j3689P187N069j4080l690k366l035o627m278O945N091M300
4493c464R428q38l348j860K657j686J282p503j2080q253M025Q446M951r89M085
4478e147J886p160L3J1906O454K93q907j1781j96L919J2878O103p914l925O668
4463E110J2602K347P28R22j6785n951O054n816j212L604o496l549Q708k382j2886
4448a5002o509j978L083J3177J702k842l828L450R546J621m578N333Q15k544N479
4433F925l082r363R75J3310O209m628M358o640N690j739k833K906n699K628p39
4418H278K299l95m75r578k0218j786J667M096Q810J3730J9630j890o092q167m524
4403E385j0730r934K807O248R505L025J962n423q69O867k458M931M866l088Q58
$$ plain form
4508 9166 9240 16455 15709 2020 9207 14276 196 -3494 -5860 -8895 -15522 -19800 -12855 -7764 -3464
4493 -3464 5964 5126 1778 -82 2575 889 2171 -5332 -17412 -25665 -21640 -13194 -8243 -9232 -5147
4478 -5147 -3261 -10421 -10388 1518 7972 8265 -642 -12423 -12619 -8700 4178 10281 2367 -1558 5110
4463 5110 17712 20059 20787 21709 4924 -1027 5027 -789 -2001 1603 -4893 -8442 266 -2116 -15002
4448 -15002 -21511 -23489 -20406 -7229 -5527 -8369 -12197 -8747 799 2420 -2158 3175 3990 1446 6925
4433 6925 3843 -5520 -4545 8765 14974 10346 14704 8064 13754 12015 9182 12088 6389 9017 8278
4418 8278 10577 10182 9707 129 -20089 -21875 -20208 -16112 -7302 6428 26058 24168 18076 9909 5385
4403 5385 -5345 -15279 -12472 -6224 3281 6306 8268 2845 1976 8843 6385 11316 16182 13094 13952
4388A3952J0410l32N340j0821k37N908J974r422j5295n271K061r686O363K487
4374b569J1792l336J95L934j0924L329O520L786N378k65j1725o281J018M029L427
4359H308J4549m006o571r203j1623o518k273L961M611J404k470J1889Q87j0769
4345g824l647N773J53k871P066J0757j4786q704n721K786l48Q07O865J1777L392
4330E475J563K481P558J1049j1640n975j2033P371P881j1813q293q739m690J2829
4316f976Q761j6794R107Q705l496o193q614O666N241L550R843k086j1258q106
4302a1650L570N78k339j166Q627k075J032P808J0022m157j2273q901n849p931
4288b4704J1203J1350L813J871O266N23p82j1455k094O01j125J3466J7795j5806
$$ plain form
4388 13952 24362 24030 29370 18549 18312 24220 26194 16772 1477 -3794 -1733 -11419 -5056 -2569
4374 -2569 9223 5887 6082 10016 -908 2421 8941 12727 18105 17840 6115 -166 852 4881 8308
4359 8308 22857 18851 12280 3077 -8546 -15064 -17337 -13376 -8765 -7361 -9831 2058 2945 -7824
4345 -7824 -11471 -5698 -5545 -8416 -1350 9407 -5379 -14083 -19804 -17018 -17366 -16559 -9694 2083 5475
4330 5475 7038 9519 17077 28126 16486 10511 -1522 5849 13730 1917 -6376 -15115 -19805 -6976
4316 -6976 1785 -15009 -5902 2803 -693 -6886 -15500 -8834 -3593 -43 9800 7714 -3544 -11650
4302 -11650 -8080 -7502 -9841 -11007 -2380 -4455 -3423 4385 14407 10250 -2023 -10924 -16773 -24704
4288 -24704 -13501 -2151 1662 3533 9799 10322 9540 -1915 -4009 -3408 -4533 8933 26728 10922
4274A0922j4071J814j289q554O828K804N261M042q590J119J2855j000l62M68R422
4259B1669r199r363p897j1802q490m55J3459J5600k489o369l062J372J4192n3
4245G113k30K863N461O08J026m329M398P120o983o779L075l071o448n066M320
4230C078k326P905L121L680J5230k599l044j2770j6911L3l619J237P37K515o080
4215i813J0882R531p526n144n687J0362Q609o379q042J894k24P313p190l999P356
4200A943R24M201P794J561k880k0959M18Q003j826m008L208Q698L646j011j1855
4185b143l410q751k147L139N265Q991N029q785l909K076K209Q772n363k351J62
4170a216R122K041l060o2l753N45J88P670o227n389k382R92J0781m907l863J0892
$$ plain form
4274 10922 -3149 -1335 -2624 -11178 -4350 -1546 3715 7757 -833 286 13141 12141 11779 12247 21669
4259 21669 12470 3107 -4790 -16592 -25082 -25537 -12078 3522 1033 -5336 -8398 -7026 7166 7113
4245 7113 6883 9746 15207 15815 16841 12512 16910 24030 17047 10268 13343 10272 3824 -1242 3078
4230 3078 752 8657 11778 15458 30688 28089 25045 12275 -4636 -4603 -8222 -6985 -6248 -3733 -9813
4215 -9813 1069 10600 3074 -2070 -7757 2605 11214 4835 -3207 -1313 -1537 5776 -1414 -5413 1943
4200 1943 2867 7068 14862 16423 13543 -7416 -6998 1005 -821 -4829 -1621 7077 10723 9712 -2143
4185 -2143 -5553 -14304 -16451 -13312 -8047 944 5973 -2812 -6721 -4645 -2436 6336 973 -1378 -1216
4170 -1216 7906 9947 6887 6825 3072 3617 3805 11475 5248 -141 -2523 -1531 9250 4343 480 11372
4154A1372J34n630K226j4074r43q882j086N543m681q01M567M818P71Q325R64n608
4138b985J771o124j1481L899K1055l233m852L899L117k323J2210r82J683L87n368
4123A0673j229j1004j2046j635R947J5759O291j272o831m983L555n255r458P75
4109f713j092r985Q139N37Q43o665p164O622J5987R449k702L625k582j1329K520
4094e10L332m006o373q118M59K0675M314R39N55n391o048j67P652M987j268q033
4078B999m730l948l326K802J5063M216j3571r798K732q680m574l206J6779Q663
4064A421J733M316r229J09P394L81l231o022k145p741l269j210J988N490O620
4049c395R892p45n493r932n160Q37j119K711K990r14j1904K316M388K528M986
$$ plain form
4154 11372 11506 5876 8102 -5972 -6915 -15797 -16883 -11340 -16021 -16822 -12255 -7437 -6666 1659 2623 -2985
4138 -2985 -1214 -7338 -18819 -14920 6135 2902 -1950 1949 5066 2743 14953 13971 15654 16041 10673
4123 10673 9444 -1560 -13606 -15241 -5294 10465 16756 15484 8653 3670 7225 1970 -7488 -6713
4109 -6713 -7805 -17790 -9651 -9114 -8271 -14936 -22100 -15478 509 9958 7256 10881 8299 -3030 -510
4094 -510 2822 -1184 -7557 -15675 -15216 5459 9773 10712 11267 5876 -172 -339 7313 12300 11032 2999
4078 2999 -1731 -5679 -9005 -6203 8860 13076 -495 -10293 -7561 -16241 -20815 -24021 -7242 1421
4064 1421 3154 7470 -1759 -1650 5744 6125 2894 -3128 -5273 -13014 -16283 -17493 -15505 -10015 -3395
4049 -3395 6497 5752 259 -9673 -14833 -13996 -15115 -12404 -9414 -10328 -22232 -19916 -15528 -13000 -8014
4034h014K65L248k226p811j3746R493Q670M7l452J0036R683N035N277p160m41
4019H904N68j892n745j374Q595k809r948k800M79j833J544O73o144J074L110J0028
4003B430O394j0816K092N76R618J094J868j0002m493P955q905m738P696K998J237
3988E004o991O674N951m109o565o442m999L329K186r368O00J3134O545m023j0933
3973a0007n2O342j693P422o529O748J0289q269k066L350O093K442j293P627j371
3958A9033l854l262j3756m655J0480M745j584K899j2731p308l900Q913J4221r472
3944b31N315O67k559j448J521j8090r145M084J804m2J2098Q841r971k031l382
3929a2569q297J0616J958P756j048l170P70P79R85n39o309o258p285J5973K0710
$$ plain form
4034 -8014 -7749 -4501 -6727 -14538 -28284 -18791 -10121 -10074 -13526 -3490 6193 11228 16505 9345 8904
4019 8904 9472 7580 1835 461 9056 6247 -3701 -6501 -6022 -7855 -6311 -5638 -11782 -10708 -7598 2430
4003 2430 8824 -1992 100 676 10294 11388 13256 3254 -1239 6716 -2189 -6927 769 3767 5004
3988 5004 -1987 4687 10638 6529 -36 -6478 -11477 -8148 -5962 -15330 -14730 -1596 4949 926 -10007
3973 -10007 -10059 -3717 -5410 2012 -4517 2231 12520 4251 2185 5535 11628 14070 12777 20404 19033
3958 19033 15179 11917 -1839 -6494 3986 8731 7147 10046 -2685 -9993 -13893 -4980 9241 -231
3944 -231 5084 5751 3192 1744 3265 -14825 -23970 -19886 -18082 -18124 -6026 2815 -7156 -9187 -12569
3929 -12569 -20866 -10250 -8292 -536 -1584 -4754 -3984 -3205 -2220 -2759 -9068 -15326 -22611 -6638 14072
3914A4072K914r95O824N032l972m828q431p230M612L893l916l308j6694j124Q171
3899d980q09J015j2796Q51O838j257p522M180J2324J1012o83j7776K858J2467
3885E722q268J1292Q811J5910j3274n841m718o940l095n37R057j2537P90J128
3871b500m852r417L473R350L074o764k220l97J180Q047R986R303j7556j0730O100
3856c923N497k837m680O538Q495j833p340o563P053L448L772L199N69j0706r793
3841i104o578K101n688M979P750n33J941N938n919j8022o673N011J794J2899J344
$$ plain form
3914 14072 16986 15991 22815 27847 23875 19047 10616 3386 7998 11891 7975 4667 -12027 -13151 -4980
3899 -4980 -5789 -4774 -17570 -16719 -9881 -11138 -18660 -14480 -2156 8856 8173 -9603 -6745 5722
3885 5722 -2546 8746 17557 33467 20193 14352 9634 2694 -401 -938 8119 -4418 -3628 -2500
3871 -2500 -7352 -16769 -13296 -3946 -872 -7636 -9856 -10253 -9073 -1026 8960 18263 707 -10023 -3923
3856 -3923 1574 -1263 -5943 595 9090 7257 -83 -6646 407 3855 7627 10826 11395 689 -9104
3841 -9104 -15682 -13581 -19269 -14290 -6540 -7073 -5132 806 -5113 -23135 -29808 -24797 -23003 -10104 -8760
$$ [...]
##END NTUPLES=NMR SPECTRUM
##END=
