##TITLE=Analysis number 310843
Compound Code mo 00014
Project Code adrs
Chemist Name prosynth
##JCAMPDX= 6.0         $$ Bruker NMR JCAMP-DX V2.0
##DATA TYPE= NMR SPECTRUM
##DATA CLASS= NTUPLES
##ORIGIN= Bruker BioSpin GmbH
##OWNER= NMR
$$ XWIN-NMR		Version 3.5
$$ Thu Jun 23 13:42:39 2005 GMT Daylight Time (UT+1h)  MAYBRIDGE\NMR@NMR_250MHZ
##.OBSERVE FREQUENCY= 250.131544655141
##.OBSERVE NUCLEUS= ^1H
##.ACQUISITION MODE= SIMULTANEOUS (DQD)
##.ACQUISITION SCHEME= undefined
##.AVERAGES= 16
##.DIGITISER RES= 18
##SPECTROMETER/DATA SYSTEM= dpx250
##.PULSE SEQUENCE= zg30
##.SOLVENT NAME= CDCl3
##.SHIFT REFERENCE= (INTERNAL, CDCl3, 0, 16.463)
##AUDIT TRAIL= $$ (NUMBER, WHEN, WHO, WHERE, WHAT)
$$ ##TITLE= Audit trail, XWIN-NMR		Version 3.5
$$ ##JCAMPDX= 5.01
$$ ##ORIGIN= Bruker BioSpin GmbH
$$ ##OWNER= NMR
$$ C:\u/data/dgb/nmr/ADRS/4720/pdata/1/auditp.txt
$$ ##AUDIT TRAIL=  $$ (NUMBER, WHEN, WHO, WHERE, WHAT)
(   1,<2005-06-23 13:42:03.57 +100>,<MAYBRIDGE\NMR>,<NMR_250MHZ>,
      <created by zg, POWCHK disabled, PULCHK disabled
       configuration hash MD5:
       62 19 C7 07 E1 42 D1 B7 37 6C 3D D0 77 39 F9 E6
       data hash MD5: 64K
       29 4F 0D 02 CB 39 6D CF E1 59 FA 50 7F CB 9E 3B>)
(   2,<2005-06-23 13:42:20.43 +100>,<MAYBRIDGE\NMR>,<NMR_250MHZ>,
      <Start of raw data processing
       ef LB = 0.3 FT_mod = 6 PKNL = 1 SI = 32K 
       data hash MD5: 32K
       02 06 22 35 A6 DA 58 70 98 3F 76 EF AC C0 06 38>)
(   3,<2005-06-23 13:42:25.77 +100>,<MAYBRIDGE\NMR>,<NMR_250MHZ>,
      <apk 
       data hash MD5: 32K
       FE AA 60 A3 96 20 5D C9 66 BA 45 E3 29 5A C7 B7>)
(   4,<2005-06-23 13:42:27.30 +100>,<MAYBRIDGE\NMR>,<NMR_250MHZ>,
      <abs ABSG = 5 
       data hash MD5: 32K
       C0 D6 24 CD A9 4D AD 19 FE A2 40 EF 19 22 C5 C8>)
$$ ##END=
$$ 
$$ hash MD5
$$ 27 6E 8F 14 82 6A 44 2A 88 01 CB 64 23 98 62 AC
##$RELAX= 
##$RELAX= 
##$RELAX= 
##$RELAX= 
##$RELAX= 
##$RELAX= 
##$RELAX= 
$$ Bruker specific parameters
$$ --------------------------
##$DU= <C:\u>
##$EXPNO= 4720
##$NAME= <ADRS>
##$PROCNO= 1
##$TYPE= <nmr>
##$USER= <dgb>
##$AMP= (0..31)
100 100 100 100 100 100 100 100 100 100 100 100 100 100 100 100 100 100 
100 100 100 100 100 100 100 100 100 100 100 100 100 100 
##$AQSEQ= 0
##$AQ_mod= 3
##$AUNM= <au_zg>
##$AUTOPOS= <25 >
##$BF1= 250.13
##$BF2= 250.13
##$BF3= 250.13
##$BF4= 250.13
##$BF5= 500.13
##$BF6= 500.13
##$BF7= 500.13
##$BF8= 500.13
##$BYTORDA= 1
##$CFDGTYP= 0
##$CFRGTYP= 5
##$CHEMSTR= <none>
##$CNST= (0..31)
1 1 145 1 1 1 1 1 1 1 1 1 1 1 1 1 1 1 1 1 1 1 1 1 1 1 1 1 1 1 1 1 
##$CPDPRG= <>
##$CPDPRG1= <>
##$CPDPRG2= <>
##$CPDPRG3= <>
##$CPDPRG4= <mlev>
##$CPDPRG5= <mlev>
##$CPDPRG6= <mlev>
##$CPDPRG7= <mlev>
##$CPDPRG8= <mlev>
##$CPDPRGB= <>
##$CPDPRGT= <>
##$D= (0..31)
0 1 0 0 0 0 0 0 0 0.06 0 0 0 0 0 0 0.0002 0 0 0 0 0 0 0 0 0 0 0 0 0 0 
0 
##$DATE= 1119530522
##$DBL= (0..7)
120 120 120 120 120 120 120 120 
##$DBP= (0..7)
150 150 150 150 150 150 150 150 
##$DBP07= 0
##$DBPNAM0= <>
##$DBPNAM1= <>
##$DBPNAM2= <>
$$ [...]
##$SUBNAM8= <"">
##$SUBNAM9= <"">
##$SW= 20.6930455092707
##$SWIBOX= (0..15)
0 0 3 0 0 0 0 0 0 0 0 0 0 0 0 0 
##$SW_h= 5175.983436853
##$TD= 65536
##$TD0= 1
##$TE= 295.16
##$TE2= 300
##$TE3= 300
##$TEG= 300
##$TL= (0..7)
0 120 120 120 120 120 120 120 
##$TP= (0..7)
150 150 150 150 150 150 150 150 
##$TP07= 0
##$TPNAME0= <>
##$TPNAME1= <>
##$TPNAME2= <>
##$TPNAME3= <>
##$TPNAME4= <>
##$TPNAME5= <>
##$TPNAME6= <>
##$TPNAME7= <>
##$TPOAL= (0..7)
0.5 0.5 0.5 0.5 0.5 0.5 0.5 0.5 
##$TPOFFS= (0..7)
0 0 0 0 0 0 0 0 
##$TUNHIN= 0
##$TUNHOUT= 0
##$TUNXOUT= 0
##$USERA1= <user>
##$USERA2= <user>
##$USERA3= <user>
##$USERA4= <user>
##$USERA5= <user>
##$V9= 5
##$VALIST= <valist>
##$VCLIST= <CCCCCCCCCCCCCCC>
##$VD= 0
##$VDLIST= <DDDDDDDDDDDDDDD>
##$VPLIST= <PPPPPPPPPPPPPPP>
##$VTLIST= <TTTTTTTTTTTTTTT>
##$WBST= 1024
##$WBSW= 4
##$XGAIN= (0..3)
0 0 0 0 
##$XL= 0
##$YL= 0
##$YMAX_a= 548561
##$YMIN_a= -498343
##$ZGOPTNS= <>
##$ZL1= 120
##$ZL2= 120
##$ZL3= 120
##$ZL4= 120
##$ABSF1= 16.46299
##$ABSF2= -4.230183
##$ABSG= 5
##$ABSL= 3
##$ALPHA= 0
##$AQORDER= 0
##$ASSFAC= 0
##$ASSFACI= 0
##$ASSFACX= 0
##$ASSWID= 0
##$AUNMP= <proc_1d>
##$AZFE= 0.1
##$AZFW= 0.1
##$BCFW= 0
##$BC_mod= 0
##$BYTORDP= 0
##$COROFFS= 0
##$CY= 12.5
##$DATMOD= 1
##$DC= 0
##$DFILT= <>
##$DTYPP= 0
##$F1P= 14.0000005364418
##$F2P= -0.99999901652339
##$FCOR= 0.5
##$FTSIZE= 32768
##$FT_mod= 6
##$GAMMA= 0
##$GB= 0
##$INTBC= 1
##$INTSCL= 1
##$ISEN= 128
##$LB= 0.3
##$LEV0= 0
##$LPBIN= 0
##$MAXI= 10000
##$MC2= 0
##$MEAN= 0
##$ME_mod= 0
##$MI= 0
##$NCOEF= 0
##$NC_proc= -4
##$NLEV= 6
##$NOISF1= 0
##$NOISF2= 0
##$NSP= 0
##$NTH_PI= 0
##$NZP= 0
##$OFFSET= 16.46299
##$PC= 1
##$PHC0= -75.90781
##$PHC1= -2.539927
##$PH_mod= 1
##$PKNL= yes
##$PPARMOD= 0
##$PSCAL= 4
##$PSIGN= 0
##$REVERSE= no
##$SF= 250.130014758669
##$SI= 32768
##$SIGF1= 0
##$SIGF2= 0
##$SINO= 400
##$SIOLD= 32768
##$SREGLST= <1H.CDCl3>
##$SSB= 0
##$STSI= 32768
##$STSR= 0
##$SW_p= 5175.98343685301
##$SYMM= 0
##$S_DEV= 0
##$TDeff= 65536
##$TDoff= 0
##$TI= <Analysis number 999999
Compound Code 99
Book Reference 9
Project Code 9>
##$TILT= no
##$TM1= 0
##$TM2= 0
##$TOPLEV= 0
##$USERP1= <user>
##$USERP2= <user>
##$USERP3= <user>
##$USERP4= <user>
##$USERP5= <user>
##$WDW= 1
##$XDIM= 32768
##$YMAX_p= 429893394
##$YMIN_p= -224599
$$ End of Bruker specific parameters
$$ ---------------------------------
##NTUPLES= NMR SPECTRUM
##VAR_NAME=  FREQUENCY,     SPECTRUM/REAL,   SPECTRUM/IMAG
##SYMBOL=    X,             R,               I
##VAR_TYPE=  INDEPENDENT,   DEPENDENT,       DEPENDENT
##VAR_FORM=  AFFN,          ASDF,            ASDF
##VAR_DIM=   32768,         32768,           32768
##UNITS=     HZ,            ARBITRARY UNITS, ARBITRARY UNITS
##FACTOR=    0.157963299565203, 1,           1
##FIRST=     4117.88788342897, 0,            0
##LAST=      -1058.09555342404, 0,           0
##MIN=       -1058.09555342404, -224599,     0
##MAX=       4117.88788342897, 429893394,    0
$$ Real data points
##PAGE= N=1
##DATA TABLE= (X++(R..R)), XYDATA
$$ [...]
$$ plain form
25448 58530 60022 40880 -32401 -62209 -78863 -83010 -8162 11725 7060 42055 52835 44039
25436 44039 -13152 -28575 -79330 -17874 51396 4001 -17174 -54121 -35998 13686 -5633 -16839
25424 -16839 -17421 -36520 -5010 49845 24518 36917 48150 73055 27998 -8543 -3543 -57723
25412 -57723 -92444 10015 53353 34867 56709 14844 -17714 42093 41389 39147 41672 72740
25400 72740 50615 21402 35325 5638 14019 43744 13101 20103 62990 93458 55631 1509
25388 1509 5511 43141 13058 1224 6564 -20325 25077 5368 -36946 -65861 -32772 -53277
25376 -53277 -103389 -40273 46980 64711 -456 -4284 -27476 -44677 33414 75838 68976 45426
25364 45426 25346 27282 35068 57550 94961 97043 74438 7677 -76 -1345 -38659 -52918 6764
$$ packed form
25448E8530J492j9142p3281k9808j6654m147P4848J9887m665L4995J0780q796
25436D4039n7191j5423n0755O1456O9270m7395k1175l6947J8123M9684j9319j1206
25424a6839n82j9099L1510N4855k5327J2399J1233K4905m5057l6541N000n4180
25412e7723l4721J02459M3338j8486K1842m1865l2558N9807p04k242K525L1068
25400G2740k2125k9213J3923k9687Q381K9725l0643P002M2887L0468l7827n4122
25388A509M002L7630l0083j1834N340k6889M5402j9709m2314k8915L3089k0505
25376e3277n0112O3116Q7253J7731o5167l828k3192j7201P8091M2424o862k3550
25364D5426k0080J936P786K2482L7411K082k2605o6761p753j269l7314j4259N9682
$$ plain form
25351 6764 -11916 -66326 -40751 -46407 -68471 -59679 5979 47596 22925 2479 -3670 -28975
25339 -28975 5538 18819 30795 31199 11303 -2558 -31075 -43873 -41539 -22690 -51820 -60434
25327 -60434 -31392 -59512 -66391 -38044 -29315 26988 64353 32465 8651 -16888 -65542 -67218
25315 -67218 -45064 -10791 6233 27694 7800 -10396 -10842 -11137 51128 60539 35498 1256 11600
25302 11600 45827 32555 9228 -35051 -74495 -4720 8728 2099 -27698 8749 21946 -28207
25290 -28207 -42057 -1628 -9830 3421 39188 20877 -36533 -28393 -41210 2012 46472 47165
25278 47165 43926 45366 -30565 -41724 -68553 -38892 8701 -132 271 32371 15304 37340 72013
25265 72013 43731 15029 13268 -21098 -56122 -87910 -75492 -20802 -3181 71550 140983 116144
$$ packed form
25351F764j8680n4410K5575n656k2064Q792O5658M1617k4671k0446o149k5305
25339b8975L4513J3281J1976M04j9896j3861k8517j2798K334J8849k9130q614
25327f0434K9042k8120o879K8347Q729N6303L7365l1888k3814k5539m8654j676
25315f7218K2154L4273J7024K1461j9894j8196m46k95O2265R411k5041l4242J0344
25302A1600L4227j3272k3327m4279l9444O9775J3448o629k9797L6447J3197n0153
25290b8207j3850M0429q202J3251L5767j8311n7410Q140j2817M3222M4460O93
25278D7165l239J440p5931j1159k6829K9661M7593q833M03L2100j7067K2036L4673
25265G2013k8282k8702j761l4366l5024l1788J2418N4690J7621P4731O9433k4839
$$ plain form
25253 116144 104831 78753 36643 -37046 -64435 -51802 -61444 -37470 -28168 9616 50264 42837
25241 42837 26342 21011 -35441 -35279 -12236 1702 -7985 23372 39546 47810 25597 -40502 -45785
25228 -45785 -29864 9989 32971 28330 24011 29532 8884 -69784 -86787 -44253 -6770 7349
25216 7349 -6872 -24020 13601 23104 13370 25851 41032 12706 -8447 31211 -2318 -56849
25204 -56849 -105921 -55442 -30671 -61930 -96404 -125042 -111766 -84555 -62114 -60766 -28906 -41838
25192 -41838 -33760 -9429 -24724 18028 27052 -516 -18713 4099 74979 56505 8737 -20903
25180 -20903 46588 47418 -5018 -25593 -67583 -39442 8160 -15820 -13169 -73666 -123195 -100033
25168 -100033 -101381 -84137 -63513 -46050 -1630 -4623 -20694 -18952 -37937 -67743 -75778 -62924
$$ packed form
25253A16144j1313k6078m2110p3689k7389J2633r642K3974R302L7784M0648p427
25241D2837j6495n331n6452J62K3043J3938r687L1357J6174Q264k2213o6099n283
25228d5785J5921L9853K2982m641m319N521k0648p8668j7003M2534L7483J4119
25216G349j4221j7148L7621R503r734J2481J5181k8326k1153L9658l3529n4531
25204e6849m9072N0479K4771l1259l4474k8638J3276K7211K2441J348L1860j2932
25192d1838Q078K4331j5295M2752R024k7568j8197K2812P0880j8474m7768k9640
25180b0903O7491Q30n2436k0575m1990K8141M7602k3980K651o0497m9529K3162
25168a00033j348J7244K0624J7463M4420k993j6071J742j8985k9806q035J2854
$$ plain form
25156 -62924 -28035 -36076 -21313 -49865 -108519 -59384 -47289 -5941 4787 9156 32542 30015
25144 30015 11436 -61331 -101011 -70590 -52208 18036 68721 45982 -12433 -26546 -25918 12099
25132 12099 67428 60807 89278 87938 51667 52156 28166 2134 168 31589 51247 65141 22627
25119 22627 -8824 -41990 -57196 -16238 -8433 22083 69782 91713 114981 95326 98601 55083
25107 55083 -15440 -51511 -95994 -87952 19709 25501 -47681 -75572 -69478 -55375 -88190 -94406
25095 -94406 -97107 -40200 -23503 -42863 -83571 -70334 -29703 -31684 -46983 -40052 -21849 -3027
25083 -3027 29409 11235 57845 48749 -56960 -104071 -51198 -19417 -46818 -73046 -25879 -42574
25071 -42574 -69685 -40887 12416 -41620 -59474 -117625 -134307 -106341 -75427 -63436 -13103 55852
$$ packed form
25156f2924L4889q041J4763k8552n8654M9135J2095M1348J0728M369K3386k527
25144C0015j8579p2767l9680L0421J8382P0244N0685k2739n8415j4113O28L8017
25132A2099N5329o621K8471j340l6271M89k3990k6032j966L1421J9658J3894m2514
25119B2627l1451l3166j5206M0958P805L0516M7699K1931K3268j9655L275m3518
25107E5083p0523l6071m4483Q042J07661N792p3182k7891O094J4103l2815o216
25095i4406k701N6907J6697j9360m0708J3237M0631j981j5299O931J8203J8822
25083c027L2436j8174M6610r096j05709m7111N2873L1781k7401k6228M7167j6695
25071d2574k7111K8798N3303n4036j7854n8151j6682K7966L0914J1991N0333O8955
$$ plain form
25059 55852 41278 62196 52074 -17915 -33033 -4184 -6521 36080 67771 83937 48666 45194
25047 45194 19031 25223 -12243 -63948 -54198 -12634 -57255 -75636 -18448 5652 6763 -13660
25035 -13660 42452 65419 33676 11475 12587 -10622 16910 37336 17645 7057 -26940 -34657
25023 -34657 -30176 9785 10852 59318 71302 31688 7326 5944 2771 20734 -52310 -74130
25011 -74130 3413 39860 64641 52549 52537 75866 86352 47902 19462 -2219 -4829 -4249 25244
24998 25244 -5473 29593 45826 20983 -63484 -96088 -52155 -27151 -53136 -78326 -72467 -23224
24986 -23224 -2674 -2194 -9672 14073 101620 122810 85207 89735 62506 59828 39524 9632 43459
24973 43459 62601 14354 -25912 -31518 18204 43615 6375 10247 32277 26787 -15204 -49099
$$ packed form
25059E5852j4574K0918j0122o9989j5118K8849k337M2601L1691J6166l5271l472
25047D5194k6163O192l7466n1705R750M1564m4621j8381N7188K4100J111k0423
25035a3660N6112K2967l1743k2201J112k3209K7532K0426j9691j0588l3997p717
25023c4657M481L9961J067M8466J1984l9614k4362j382l173J7963p3044k1820
25011g4130P7543L6447K4781j2092j2K3329J0486l8450k8440k1681k610N80K9493
24998B5244l0717L5066J6233k4843q4467l2604M3933K5004k5985k5190N859M9243
24986b3224K0550M80p478K3745Q7547K1190l7603M528k7229k678k0304k9892L3827
24973D3459J9142m8247m0266n606M9722K5411l7240L872K2030n490m1991l3895
$$ plain form
24961 -49099 -39690 -31541 -55239 -41693 -9722 27642 13458 2085 8386 -21205 -28435 -21934 -6434
24948 -6434 -25591 14581 57374 24612 -6413 52046 87958 9949 8491 39972 44023 28888
24936 28888 43570 45970 -3928 -55227 -52396 -48362 -46759 -8021 3779 -17820 -52275 -56608 -77063
24923 -77063 -102038 -59783 -23520 8397 -29149 -46310 5246 19319 29805 58039 92941 48103
24911 48103 -37185 -81050 -74655 -76429 -44949 -17340 1520 28101 18591 -17411 -8005 -26657
24899 -26657 -49854 -29605 -28969 10332 28541 67028 47305 34353 26705 -24 30409 -2815
24887 -2815 -50220 -54409 -30968 -23453 11439 10447 24743 38924 55143 24900 -13115 -24002 -26798
24874 -26798 -24743 16251 -8381 -55387 -59798 -57810 -62547 -58009 -41946 -36155 -57571 -49361 -35290
$$ packed form
24961d9099R409Q149k3698J3546L1971L7364j4184j1373O301k9591p230O501J5500
24948f434j9157M0172M2793l2762l1025N8459L5912p8009j458L1481M051j5135
24936B8888J4682K400m9898n1299K831M034J603L8738J1800k1599l4455m333k0455
24923g7063k4975M2255L6263L1917l7546j7161N1556J4073J0486K8234L4902m4838
24911D8103q5288m3865O395j774L1480K7609J8860K6581r510l6002R406j8652
24899b6657k3197K0249O36L9301J8209L8487j9723j2952p648k6729L0433l3224
24887b815m7405m189K3441P515L4892r92J4296J4181J6219l0243l8015j0887k796
24874b6798K055M0994k4632m7006m411J988m737M538J6063N791k1416Q210J4071
$$ plain form
24861 -35290 -34046 -3524 17884 -53742 -66280 -98655 -87555 -62916 -33777 -30080 6742 -4570
24849 -4570 -10402 1058 15137 65992 102274 40350 9737 9782 2118 13446 54548 29376 2764
24836 2764 5028 -26620 -27201 -44863 -44880 -12841 23828 3672 -30878 -66828 91 29262 -11614
24823 -11614 22015 10507 43251 25436 24798 20120 22198 31635 17041 -3314 7572 19580 40196
24810 40196 57990 43457 46082 -11361 -6106 -19218 -75696 -78605 -67588 -22130 873 10248
24798 10248 2375 10095 34592 77536 111814 71384 -12468 -39837 -34980 -69811 -107907 -109115
24786 -109115 -71879 -25152 -53912 -111276 -72210 -48809 9215 20982 -7386 -45582 -85488
24775 -85488 -100468 -66009 -48977 -74587 -115684 -76198 -12958 7164 -26170 -9963 -12758 -72357
$$ packed form
24861c5290J244L0522K1408p1626j2538l2375J1100K4639K9139L697L6822j1312
24849d570n832J1460J4079N0855L6282o1924l0613M5p664J1328M1102k5172k6612
24836B764K264l1648n81j7662j7L2039L6669k0156l4550l5950O6919K9171m0876
24823a1614L3629j1508L2744j7815o38m678K078R437j4594k0355J0886J2008K0616
24810D0196J7794j4533K625n7443N255j3112n6478k909J1017M5458K3003R375
24798A0248p873P720K4497M2944L4278m0430q3852k7369M857l4831l8096j208
24786a09115L7236M6727k8760n7364L9066K3401N8024J1767k8368l8196l9906
24775h5488j4980L4459J7032k5610m1097L9486O3240K0122l3334J6207k795n9599
$$ plain form
24763 -72357 -131037 -116200 -56028 -16655 44883 60909 16009 -48241 -89776 -74519 -64010 -101612
24751 -101612 -102373 -75399 -39445 -35853 -94437 -111578 -75097 -61940 -44926 -20561 -20391 -19757 -18521
24738 -18521 -225 43091 40525 21307 26929 17416 50394 18167 -15519 -22395 -33010 -50928
24726 -50928 -109348 -124064 -66241 -16406 13829 -1919 -26986 -10972 18106 -38319 -103079 -107280
24714 -107280 -99036 -78008 -60444 -26896 -45463 -40019 -6373 55601 83592 44592 -28922 -71886
24702 -71886 -97590 -73151 -11145 -46952 -53059 -39741 -4036 15650 -3992 11222 26950 28859
24690 28859 61807 30658 34407 -11405 -75917 -66336 -61766 -46012 -57506 -41144 -2095 39128
24678 39128 28899 25962 16595 -6095 -35405 -52646 -55709 7400 26976 28659 -4400 -12222 -22013
$$ packed form
24763g2357n8680J4837O0172L9373O1538J6026m4900o4250m1535J5257J0509l7602
24751a01612p61K6974L5954L592n8584j7141L6481J3157J7014K4365J70O34J236
24738a8521J8296M3316k566j9218N622r513L2978l2227l3686o876j0615j7918
24726e0928n8420j4716N7823M9835L0235j5748k5067J6014K9078n6425o4760m201
24714a07280Q244K1028J7564L3548j8567N444L3646O1974K7991l9000p3514m2964
24702g1886k5704K4439O2006l5807o107J3318L5705J9686j9642J5214J5728J909
24690B8859L2948l1149L749m5812o4512R581M570J5754j1494J6362L9049M1223
24678C9128j0229k937r367k2690k9310j7241l063O3109J9576J683l3059p822r791
$$ plain form
24665 -22013 -41962 -30100 6703 -6758 -67318 -66172 -6637 -16248 -44287 -67583 -54159 -58863
24653 -58863 -38194 -24683 -11928 14852 40140 40198 52595 103090 158567 99836 18926 -11440
24641 -11440 -5639 -10851 -14525 -20676 -6412 5944 -3268 33299 31211 12312 25290 50037 47507
24628 47507 -13124 -81032 -64234 -36417 -7242 -23767 -18114 -28828 1996 38212 22141 1911
24616 1911 -10855 5517 -12002 -15472 -13469 -26600 -40021 34287 78160 53957 7896 -11128
24604 -11128 -11906 -30844 -9463 39262 61536 -2492 -55302 -15799 -3147 -42750 -94259 -103112
24592 -103112 -35409 24414 66589 86203 67878 69927 30578 6972 8462 41038 74818 85596
24580 85596 82553 55098 41150 21817 -28408 -7099 12030 -62171 -41185 -19811 12674 3462
$$ packed form
24665b2013j9949J1862L6803j3461o0560J146N9535r611k8039k3296J3424m704
24653e8863K0669J3511J2755K6780K5288N8J2397N0495N5477n8731q0910l0366
24641a1440N801n212l674o151J4264J2356r212L6567k088j8899J2978K4747k530
24628D7507o0631o7908J6798K7817K9175j6525N653j0714L0824L6216j6071k0230
24616A911j2766J6372j7519l470K003j3131j3421P4308M3873k4203m6061j9024
24604a1128p78j8938K1381M8725K2274o4028n2810L9503J2652l9603n1509q853
24592a03112O7703N9823M2175J9614j8325K049l9349k3606J490L2576L3780J0778
24580H5596l043k7455j3948j9333n0225K1309J9129p4201K0986K1374L2485r212
$$ plain form
24568 3462 -2122 -16896 -4457 11052 26140 16110 24482 56927 42424 648 22739 22901 14547
24555 14547 -20947 -44248 -78244 -72134 -25743 24129 66867 64169 19606 -3301 -15006 -35802
24543 -35802 -61742 -79482 -57683 -73453 -79392 -74494 -77515 -76888 -87460 -76987 -39354 -69 661
24530 661 -22330 -81993 -74946 -49507 -35797 -12834 78776 120637 86512 62137 55808 46949 -5600
24517 -5600 -28520 -38226 -20144 19074 69780 54989 19468 -29734 -35689 -50859 -17848 4305
24505 4305 2430 28230 17804 -45188 -39949 -61385 -96048 -68395 -33229 -50895 -77582 -73223
24493 -73223 -26033 -6270 21920 32412 80437 77565 101574 92615 68918 28766 33996 34122 22884
24480 22884 42917 52155 56146 70717 28153 41838 57572 37034 -5279 -40262 -8542 33697
$$ packed form
24568C462n584j4774J2439J5509J5088j0030Q372L2445j4503m1776K2091J62q354
24555A4547l5494k3301l3996O110M6391M9872M2738k698m4563k2907j1705k0796
24543c5802k5940j7740K1799j5770n939M898l021O27j0572J0473L7633L9285P30
24530F61k2991n9663P047K5439J3710K2963R1610M1861l4125k4375o329q859n2549
24517e600k2920r706J8082L9218N0706j4791l5521m9202n955j5170L3011K2153
24505D305j875K5800j0426o2992N239k1436l4663K7653L5166j7666k6687M359
24493g3223M7190J9763K8190J0492M8025k872K4009q959k3697m0152N230J26j1238
24480B2884K0033R238L991J4571m2564J3685J5734k0538m2313l4983L1720M2239
$$ plain form
24468 33697 10437 -12101 5618 25388 69289 46543 -15690 -29893 1838 24618 30522 1959
24456 1959 -22270 -20715 -6075 -4672 18237 36942 35695 -7175 -7519 27706 -1523 -38353 -34207
24443 -34207 -68792 -58225 -12690 27404 771 -11112 42940 20531 -3716 -14997 -50943 -42564
24431 -42564 -7075 -17796 16938 43681 3019 -33406 -38775 -60456 -20713 1283 -20836 -41544
24419 -41544 -89470 -82368 4989 40051 9272 -37423 -27714 20954 760 1176 14176 -8261
24407 -8261 -24200 -28952 -84873 -77670 -59856 -18115 -38647 30051 4179 -3211 2921 -8252 -4749
24394 -4749 8774 -10026 -25716 -11136 9953 -27926 -59872 -64342 -15998 -39520 -61683 -9669
24382 -9669 6412 -40291 -39729 7505 4046 -26115 12304 -1821 14814 37044 -13538 -32352
$$ packed form
24468C3697k3260k2538J7719J9770M3901k2746o2233j4203L1731K2780N904k8563
24456A959k4229J555J4640J403K2909J8705j247m2870l44L5225k9229l6830M146
24443c4207l4585J0567M5535M0094k6633j1883N4052k2409k4247j1281l5946Q379
24431d2564L5489j0721L4734K6743m0662l6425n369k1681L9743K1996k2119k0708
24419d1544m7926P102Q7357L5062l0779m6695R709M8668k0194M16J3000k2437
24407h261j5939m752n5921P203J7814M1741k0532O8698k5872p390O132j1173L503
24394d749J3523j8800j5690J4580K1089l7879l1946m470M8344k3522k2163N2014
24382i669J6081m6703N62M7234l459l0161L8419j4125J6635K2230n0582j8814
$$ plain form
24370 -32352 -19218 -26676 -66947 -51684 -36840 1013 -15962 -13078 -27903 -17088 16350 35419
24358 35419 100791 109515 65481 67154 51336 31516 13674 49752 66784 130566 151848 120705
24346 120705 78554 37495 -18539 -16666 48837 79607 44434 23779 -23960 -45947 -3209 -2693
24334 -2693 -9516 -22948 12756 44516 44129 35247 2738 24428 57338 33445 48524 65690 81228
24321 81228 51407 15863 24217 33572 46488 79810 93798 47489 35834 72220 125093 104755
24309 104755 65299 34236 42106 40283 56519 63185 -14388 -63037 -81898 -17231 36934 38040
24297 38040 -924 -20051 -43818 -17984 -8814 9522 -24813 -60634 -25347 35884 74842 95857
24285 95857 81650 25120 44741 29583 -16022 -35236 -38582 -21825 29116 12321 22118 11932
$$ packed form
24370c2352J3134p458m0271J5263J4844L7853j6975K884j4825J0815L3438J9069
24358C5419O5372Q724m4034J673j5818j9820j7842L6078J7032O3782K1282l1143
24346A20705m2151m1059n6034J873O5503L0770l5173k0655m7739k1987M2738N16
24334b693o823j3432L5704L1760l87q882l2509K1690L2910k3893J5079J7166J5538
24321H1228k9821l5544Q354R355J2916L3322J3988m6309j1655L6386N2873k0338
24309A04755l9456l1063P870j823J6236O666p7573m8649j8861O4667N4165J106
24297C8040l8964j9127k3767K5834R170J8336l4335l5821L5287O1231L8958K1015
24285I5857j4207n6530J9621j5158m5605j9214l346J6757N0941j6795R797j0186
$$ plain form
24273 11932 -24747 -17763 9533 20185 20616 1451 14047 -28477 -44961 -32685 -61185 -71100
24261 -71100 -60950 -38804 -18144 -15375 -14028 11015 -11749 10555 37213 17478 -42211 -80131
24249 -80131 -56600 -57830 -79318 -79913 -108281 -122490 -84240 -49723 -67425 -72276 -62375 -72283 -32282
24236 -32282 55673 55032 60889 82150 81929 135231 155681 107788 -4895 -51988 -39561 -5511
24224 -5511 -50238 -48040 2618 -4866 -24941 -37681 -20199 -3469 -5257 -25243 -13568 33359
24212 33359 17565 56728 86924 101093 69091 44771 23526 35297 65690 35756 43265 23639
24200 23639 66975 81318 53181 40483 37294 30978 -627 11648 13366 -2777 -24466 -29968
24188 -29968 4007 58785 44462 15903 36975 64742 -1143 -33017 -58255 -78889 -89857 -89395
$$ packed form
24273A1932l6679O984K7296J0652M31j9165J2596m2524j6484J2276k8500r915
24261g1100J0150K2146K0660K769J347K5043k2764K2304K6658j9735n9689l7920
24249h0131K3531j230k1488n95k8368j4209L8250L4517j7702m851R901r908M0001
24236c2282Q7955o41N857K1261k21N3302K0450m7893j12683m7093J2427L4050
24224e511m4727K198N0658p484k0075j2740J7482J6730j788j9986J1675M6927
24212C3359j5794L9163L0196J4169l2002k4320k1245J1771L0393k9934P509j9626
24200B3639M3336J4343k8137j2698l189o316l1605J2275J718j6143k1689n502
24188b9968L3975N4778j4323k8559K1072K7767o5885l1874k5238k0634j0968M62
$$ plain form
24176 -89395 -37931 -52055 -69165 -24405 5969 29667 -21755 -67604 -65098 -22711 14999 11928
24164 11928 -61950 -72733 -70656 -93629 -108118 -72973 -40665 -27817 57407 89253 72137 34696
24152 34696 25967 5404 5717 -25572 -29519 50535 58849 -4257 -48847 -81931 -61297 -1909 32217
24139 32217 48381 42331 31625 5954 2064 6987 12803 27512 45316 -20811 -18559 -18985 -18452
24126 -18452 12145 9968 46847 31663 -7808 -37576 15231 52847 12938 -2111 31589 15704
24114 15704 956 -23798 -34607 -13236 -5646 11570 32054 -7200 -21574 1292 6256 -11446
24102 -11446 -46270 -29558 -12877 30426 38242 22491 24566 55646 72256 118714 126531 78643
24090 78643 9531 -45376 -75771 -35700 15383 -31082 -77799 -57317 -12177 -27030 -76728 -7438
$$ packed form
24176h9395N1464j4124j7110M4760L0374K3698n1422m5849K506M2387L7710l071
24164A1928p3878j0783K077k2973j4489L5145L2308J2848Q5224L1846j7116l7441
24152C4696q729k0563L13l1289l947Q0054Q314o3106m4590l3084K0634N9388L4126
24139C2217J6164o050j0706k5671l890M923N816J4709J7804o6127K252m26N33
24126a8452L0597k177L6879j5184l9471k9768N2807L7616l9909j5049L3700j5885
24114A5704j4748k4754j0809K1371P590J7216K0484l9254j4374K2866M964j7702
24102a1446l4824J6712J6681M3303P816j5751K075L1080J6610M6458P817m7888
24090G8643o9112n4907l0395M0071N1083m6465m6717K0482M5140j4853m9698O9290
$$ plain form
24078 -7438 45249 29140 29707 33511 26482 70778 53545 -11507 5936 -29070 -40849 -67732 -28524
24065 -28524 -19519 -13977 -68524 -25432 3235 -36000 -62694 -81017 -85963 -45723 -75002 -89123
24053 -89123 -65645 -60837 -88634 -69079 -52338 -69057 -41937 -26636 -10345 32986 51648 68994
24041 68994 102362 66964 -47314 -99191 -95666 -61627 -77468 -63985 -30606 -63423 -37888 -25922
24029 -25922 -5928 15540 -9168 324 -2136 26291 88095 100123 33974 -5801 -52828 -105716
24017 -105716 -131875 -124654 -60134 59353 44970 13059 55414 92045 103201 80741 90756
24006 90756 91989 66228 22354 -4963 32085 16477 -10267 60638 117022 71068 23639 -6188
23994 -6188 -31653 -50571 -50348 -54241 29857 32404 -1016 20430 53474 71192 42949 2332 -16718
$$ packed form
24078g438N2687j6109N67L804p029M4296j7233o5052J7443l5006j1779k6883L9208
24065b8524R005N542n4547M3092K8667l9235k6694j8323m946M0240k9279j4121
24053h9123K3478M808k7797J9555J6741j6719K7120J5301J6291M3331J8662J7346
24041F8994L3368l5398j14278n1877L525L4039j5841J3483L3379l2817K5535J1966
24029b5922J9994K1468k4708R492k460K8427O1804J2028o6149l9775m7027n2888
24017a05716k6159P221O4520J19487j4383l1911M2355L6631J1156k2460J0015
24006I0756J233k5761m3874k7317L7048j5608k6744P0905N6384m5954m7429k9827
23994f188k5465j8918K23l893Q4098K547l3420K1446L3044J7718k8243m0617j9050
$$ plain form
23981 -16718 -35957 -25464 -47498 -15299 33480 10101 -20175 -28987 7407 38698 46483 37251
23969 37251 30199 23562 21517 5560 -29417 -25038 -37954 -46735 -18452 5280 37035 12581 28353
23956 28353 53286 44030 23724 -29720 -56759 -23333 -25414 -94796 -97984 -59266 -52359 -58335 -7576
23943 -7576 -23994 -52189 -24627 35158 50358 53579 66381 51928 36936 4514 -56714 -17332
23931 -17332 -3515 -41263 -49165 -25104 31882 -5211 -30003 -50517 27935 28918 18232 54682
23919 54682 77867 64722 41200 18905 25889 -16279 -108429 -92034 -24482 7650 69014 113083
23907 113083 104148 47891 37260 33308 31724 30137 22354 3157 16797 10434 16271 21148 4494
23894 4494 -18497 18216 30370 12617 49194 53292 30691 40226 68752 62398 62138 69499 51882
$$ packed form
23981a6718j9239J0493k2034L2199M8779k3379l0276q812L6394L1291P785r232
23969C7251p052o637k045j5957l4977M379j2916q781K8283K3732L1755k4454J5772
23956B8353K4933r256k0306n3444k7039L3426k081o9382l188L8718O907n976N0759
23943g576j6418k8195K7562N9785J5200L221J2802j4453j4992l2422o1228L9382
23931a7332J3817l7748p902K4061N6986l7093k4792k0514P8452R83j0686L6450
23919E4682K3185j3145k3522k2295O984m2168r2150J6395O7552L2132O1364M4069
23907A13083q935n6257j0631l952j584j587p783j9197J3640o363N837M877j6654
23894D494k2991L6713J2154j7753L6577M098k2601R535K8526o354k60P361j7617
$$ plain form
23881 51882 -41532 -23560 37241 57409 90120 72421 23962 -61136 -86250 -40413 37477 71280
23869 71280 57316 63771 82290 51164 -14870 -33585 -31809 19408 26848 26323 25631 -19598 -25114
23856 -25114 57667 75595 113200 47569 -25736 -35529 -34571 -105588 -119489 -95111 -56504 -34959
23844 -34959 14324 29771 36456 7401 -8999 -18879 -53556 -96876 -86684 -87224 -69705 -55634
23832 -55634 -71630 -18635 -25703 -26746 -39241 -25260 -530 9122 -61641 -52896 3411 -1426 -41695
23819 -41695 -42845 -7528 22997 -14852 -6770 -3028 -50569 -89970 -64078 -58155 -36634 39899
23807 39899 63396 68144 35564 19030 42282 45482 24266 31157 12332 -55332 -88325 -48480
23795 -48480 -40131 -50692 -49146 -67925 -40891 -52134 -88078 -59853 -101991 -142508 -120872 -126599
$$ packed form
23881E1882r3414J7972O0801K0168L2711j7699m8459q5098k5114M5837P7890L3803
23869G1280j3964O455J8519l1126o6034j8715J776N1217P440n25o92m5229n516
23856b5114Q2781J7928L7605o5631p3305r793R58p1017j3901K4378L8607K1545
23844c4959M9283J5447O685k9055j6400r880l4677m3320J0192n40J7519J4071
23832e5634j5996N2995p068j043j2495J3981K4730R652p0763Q745N6307m837m0269
23819d1695j150L5317L0525l7849Q082L742m7541l9401K5892N923K1521P6533
23807C9899K3497M748l2580j6534K3252L200k1216O891j8825o7664l2993L9845
23795d8480Q349j0561J546j8779K7034j1243l5944K8225m2138m0517K1636n727
$$ plain form
23783 -126599 -73479 -19739 -49794 -54912 -19015 39491 76176 80041 -3369 -31072 7965 2296
23771 2296 16108 18595 -43991 -76260 -56564 -59735 -50964 -65846 -92253 -76851 -37659 31635
23759 31635 22302 -52560 -21204 18761 59548 48204 -10355 5262 8482 -9658 -12089 -44854
23747 -44854 -20973 17597 986 11247 -70770 -121392 -81305 -28963 -40238 -56267 -4796 36010
23735 36010 52967 65427 5843 -41742 -40418 13333 12128 1635 10660 23833 45682 22728
23723 22728 37904 39774 24991 -20602 -60182 -98031 -48376 -8525 8264 1276 15282 -11918
23711 -11918 -48764 -32920 -40550 -43468 -25062 -9180 -6578 -1380 -2957 -40476 -24959 4480 30274
23698 30274 64930 36623 37126 59810 4922 13546 -21084 -61064 -81546 -100166 -135848 -116116
$$ packed form
23783a26599N3120N3740l0055n118L5897N8506L6685L865q3410k7703L9037n669
23771B296J3812K487o2586l2269J9696l171Q771j4882k6407J5402L9192O9294
23759C1635r333p4862L1356L9965M0787j1344n8559J5617L220j8140k431l2765
23747d4854K3881L8570j6611J0261q2017n0622M0087N2342j1275j6029N1471M0806
23735C6010J6957J2460n9584m7585J324N3751j205j0493R025J3173K1849k2954
23723B2728J5176J870j4783m5593l9580l7849M9655L9851J6789o988J4006k7200
23711a1918l6846J5844p630k918J8406J5882K602N198j577l7519J5517K9439K5794
23698C0274L4656k8307N03K2684n4888Q624l4630l9980k0482j8620l5682J9732
$$ plain form
23686 -116116 -83337 -36051 -6066 45267 70053 5444 -70992 -31187 11985 14364 5906 -20002
23674 -20002 -23320 15943 54551 52867 27581 8971 5556 -17790 -34910 -97956 -65269 -30895
23662 -30895 -26219 30962 -10227 -41276 -1829 19233 -8522 9229 38640 72413 86994 23208
23650 23208 6002 72986 56431 -2768 -13353 -18288 10041 33913 8639 -31065 -58597 -41218
23638 -41218 -71904 -84380 -96650 -94134 -108639 -71054 -48229 -46628 -20161 -12896 -43161 -33533
23626 -33533 -40104 -46901 -28562 -13385 -41480 -80482 -77798 1759 103034 91329 56078 40726
23614 40726 53893 51051 10177 -22650 -42561 -2931 6677 -3289 13136 52016 49776 41850 30805
23601 30805 24626 22047 21738 31847 13924 -8856 -41511 -68004 -103023 14966 97942 60232
$$ packed form
23686a16116L2779M7286K9985N1333K4786o4609p6436L9805M3172K379q458k5908
23674b0002l318L9263L8608j684k5286j8610l415k3346j7120o3046L2687L4374
23662c0895M676N7181m1189l1049L9447K1062k7755J7751K9411L3773J4581o3786
23650B3208j7206O6984j6555n9199j0585m935K8329K3872k5274l9704k7532J7379
23638d1218l0686j2476j2270K516j4505L7585K2825J601K6467P265l0265R628
23626c3533o571o797J8339J5177k8095l9002K684P9557J01275j1705l5251j5352
23614D0726J3167k842m0874l2827j9911L9630R608r966J6425L8880k240p926j1045
23601C0805o179k579l09J0109j7923k2780l2655k6493l5019J17989Q2976l7710
$$ plain form
23589 60232 25087 -23890 -70202 -60260 5510 26185 -3051 20148 35271 -8478 7731 31740
23577 31740 20544 -33993 -57859 -66861 -67944 -56021 12019 67955 44366 40691 37317 7317
23565 7317 13523 19859 -12094 -64605 -91684 -64300 -65889 -71851 -49249 5332 -1604 -10750 -14627
23552 -14627 4233 64001 94239 124482 70366 62616 59320 22410 -5080 -16147 -4997 -4119
23540 -4119 -1316 -1490 -40989 -59770 -41716 -56519 -25523 -15671 -30746 18174 49076 34428 77866
23527 77866 81936 33765 -23344 -54255 -67183 -26290 2798 2673 9197 11768 -10416 -5725 -7369
23514 -7369 -3642 -5509 -13205 24473 15715 -7665 -9085 8107 5153 45345 55688 33108 -24041
23501 -24041 -12711 4692 11831 -41277 -84921 -54970 -117038 -94814 -62309 -72172 -56864 -66246
$$ packed form
23589F0232l5145m8977m6312R942O5770K0675k9236K3199J5123m3749J6209K4009
23577C1740j1196n4537k3866r002j083J1923O8040N5936k3589l675l374l0000
23565G317O206O336l1953n2511k7079K7384j589n962K2602N4581o936r146l877
23552a4627J8860N9768L0238L0243n4116p750l296l6910k7490j1067J1150Q78
23540d119K803j74l9499j8781J8054j4803L0996R852j5075M8920L0902j4648M3438
23527G7866M070m8171n7109l0911j2928M0893K9088j25O524K571k2184M691j644
23514g369L727j867p696L7678q758k3380j420J7192k954M0192J0343k2580n7149
23501b4041J1330J7403P139n3108m3644K9951o2068K2224L2505r863J5308r382
$$ plain form
23489 -66246 -54416 -37106 -65469 -63213 -61408 -48873 14989 64115 3151 -28192 -29824 -2998
23477 -2998 20250 52968 71658 73956 76007 66509 1447 -58 67620 66079 52643 49967 57596
23464 57596 39792 -44709 -53446 -32316 -41755 -31338 13304 14737 -55328 -122994 -90373 -111438
23452 -111438 -87586 -42293 -32439 -57502 -33724 -27329 3099 18470 47657 18332 25076 67472
23440 67472 103236 16820 -52274 -62963 -24267 -12382 6302 14 -8069 -885 -1915 -48503
23428 -48503 -78383 -93629 -128302 -116040 -44709 -50236 -73845 -73270 -74942 -58047 -27620 -22353 43662
23415 43662 38685 2137 -4562 -49955 -86780 -124531 -101359 -60259 -32946 -37260 -60245 -6493
23403 -6493 -10151 -39087 -9324 39972 11216 -7710 -57759 -76602 -30052 -23776 -16556 2478
$$ packed form
23489f6246J1830J7310k8363K256J805J2535O3862M9126o0964l1343j632K6826
23477b998K3248L2718J8690K298K051r498o5062j505O7678j541j3436k676P629
23464E7596j7804q4501q737K1130r439J0417M4642J433p0065o7666L2621k1065
23452a11438K3852M5293R854k5063K3778O395L0428J5371K9187k9325O744M2396
23440F7472L5764q6416o9094j0689L8696J1885J8684o288q083P184j030m6588
23428d8503k9880j5246l4673J2262P1331n527k3609N75j672J6895L0427N267O6015
23415D3662m977l6548o699m5393l6825l7751K3172M1100K7313m314k2985N3752
23403f493l658k8936K9763M9296k8756j8926n0049j8843M6550O276P220J9034
$$ plain form
23391 2478 -28880 -39043 -43265 -58573 -79627 -58629 -63289 -69948 -37859 -67080 -48712 -16715
23379 -16715 -28880 -56174 -18191 -21512 -25077 -61722 -1850 7465 33478 67491 43764 4495
23367 4495 -58889 -87270 -33460 332 19551 40786 56538 52732 1712 -31462 -113923 -87761
23355 -87761 -24846 17559 41776 26949 20215 -13749 -16659 -5376 -16225 -13886 -30624 -8260
23343 -8260 58562 88510 104865 109833 87091 21336 7930 28060 48293 82962 107748 26592
23331 26592 -58279 -85978 -110354 -92990 -58250 -72349 -84411 -82061 -39086 19012 -23377 -99657
23319 -99657 -124859 -134185 -104850 -122487 -49977 8836 30442 13336 3131 -11464 -17979 -52545
23307 -52545 -80841 -42743 -39762 -48330 -64064 -82169 -36312 41324 41407 19904 -36443 -19660 -1624
$$ packed form
23391B478l1358j0163m222j5308k1054K0998m660o659L2089k9221J8368L1997
23379a6715j2165k7294L7983l321l565l6645N9872R315K6013L4013k3727l9269
23367D495o3384k8381N3810L3792J9219K1235J5752l806n1020l3174q2461K6162
23355h7761O2915M2405K4217j4827o734l3964k910J1283j0849K339j6738K2364
23343h260O6822K9948J6355M968k2742o5755j3406K0130K0233L4669K4786q1156
23331B6592q4871k7699k4376J7364L4740j4099j2062K350M2975N8098m2389p6280
23319i9657k5202r326K9335j7637P2510N8813K1606j7106j0205j4595o515l4566
23307e2545k8296L8098K981q568j5734j8105M5857P7636Q3k1503n6347J6783J8036
$$ plain form
23294 -1624 3482 15393 35551 -3064 -8051 -23819 -38763 -62656 -57601 -8412 -10113 -5120 -27440
23281 -27440 -104445 -176764 -224599 -195565 -138270 -63305 -13564 3113 -43146 -57110 482 12898
23269 12898 -12787 -18612 -45669 -57042 -54240 -92728 -61196 -36911 -55632 -41340 -45036 17088
23257 17088 19765 -41137 -70378 -47304 -64973 -75100 -37143 -8683 3151 4015 -33758 -37391
23245 -37391 -28479 12971 15083 -72 -39278 -808 48432 34990 68768 88137 40988 11490
23233 11490 43851 50761 18328 -14818 -58232 -45282 -20061 -820 -17460 -50301 -55935 -30380
23221 -30380 -4088 -2797 61634 57469 43386 -26785 697 15663 14407 -10605 -12055 17700
23209 17700 -5675 4559 -26677 -60313 -60759 -39965 -38248 -9023 45068 17430 -22899 -32372
$$ packed form
23294a624N106J1911K0158l8615m987j5768j4944k3893N055M9189j701M993k2320
23281b7440p7005p2319m7835K9034N7295P4965M9741J6677m6259j3964N7592J2416
23269A2898k5685n825k7057j1373K802l8488L1532K4285j8721J4292l696O2124
23257A7088K677o0902k9241K3074j7669j0127L7957K8460J1834Q64l7773l633
23245c7391Q912M1450K112j5155l9206L8470M9240j3442L3778J9369m7149k9498
23233A1490L2361O910l2433l3146m3414J2950K5221J9241j6640l2841n634K5555
23221c0380K6292J291O4431m165j4083p0171K7482J4966j256k5012j450K9755
23209A7700k3375J0234l1236l3636m46K0794J717K9225N4091k7638m0329r473
$$ plain form
23197 -32372 -75145 -51039 -27244 -20374 -24072 978 32355 30900 4775 -37951 11209 38155
23185 38155 47448 34806 22128 12885 -18391 -49647 -79607 -60614 -33246 -63947 -25931 -14492
23173 -14492 -27313 -37563 7232 41068 41466 14636 51055 40717 62365 79978 62841 2923
23161 2923 -57808 -77663 -67865 -50133 -13156 9921 1318 7734 1245 9649 9451 -41704 -47029
23148 -47029 -70935 -70286 -60566 -47117 -94805 -62294 -43349 15944 69899 77613 44659 -29032
23136 -29032 -32088 4351 31988 34700 12744 -11203 -11323 21136 30047 -15813 -319 -31723 -25831
23123 -25831 -10413 52760 38186 -480 -25086 -38143 -28481 -57157 -9769 -6485 27278 87320
23111 87320 68079 3567 -44609 -47911 -16481 -20111 -18221 -33422 -10825 4369 71730 83717
$$ packed form
23197c2372m2773K4106K3795O870l698K5050L1377j455k6125m2726M9160K6946
23185C8155R293j2642j2678r243l1276l1256k9960J8993K7368l0701L8016J1439
23173a4492j2821j0250M4795L3836L98k6830L6419j0338K1648J7613j7137n9918
23161B923o0731j9855R798J7732L6977K3077q603O416o489Q404j98n1155n325
23148d7029k3906O49R720J3449m7688L2511J8945N9293N3955P714l2954p3691
23136b9032l056L6439K7637K712k1956k3947j20L2459Q911m5860J5494l1404N892
23123b5831J5418O3173j4574l8666k4606j3057R662k8676M7388L284L3763O0042
23111H7320j9241o4512m8176l302L1430l630J890j5201K2597J5194O7361J1987
$$ plain form
23099 83717 72292 45791 10932 -17129 -60480 -33810 -633 25396 27492 -29254 -29606 -28172
23087 -28172 38163 121518 110596 67916 31111 785 -47949 -69139 -43582 -35889 -24881 -1885
23075 -1885 -8556 -25064 -8370 -13622 -43421 -64539 -32206 -34053 -4415 -2900 8727 -38514 -85628
23062 -85628 -88041 -55975 -53344 -66568 -87377 -83477 -17919 -91564 -121175 -85879 -46146 -30084
23050 -30084 -53242 -72124 -70981 -59277 -53360 -24370 -45089 -67248 -21393 -13665 -31325 7519
23038 7519 40539 42614 9372 2246 -11297 -43295 -63958 -27262 -9416 -74841 -84753 -37029
23026 -37029 -34409 -86271 -71728 -52739 37090 31690 40136 41041 13212 7920 57496 67222 33777
23013 33777 -5556 -25926 -48667 -67967 -58182 -77865 -16283 18480 48726 55801 40967 26815
$$ packed form
23099H3717j1425k6501l4859k8061m3351K6670L3177K6029K096n6746l52J434
23087b8172O6335Q3355j0922m2680l6805l0326m8734k1190K5557P693J1008K2996
23075a885o671j6508J6694n252k9799k1118L2333j847K9638J515J1627m7241m7114
23062h5628k413L2066K631j3224k0809L900O5558p3645k9611L5296L9733J6062
23050c0084k3158j8882J143J1704N917K8990k0719k2159M5855P728j7660L8844
23038G519L3020K075l3242p126j3543l1998k0663L6696J7846o5425r912M7724
23026c7029K620n1862J4543J8989Q9829n400Q446R05k7829n292M9576R726l3445
23013C3777l9333k0370k2741j9300R785j9683O1582L4763L0246P075j4834j4152
$$ plain form
23001 26815 30228 52278 -27518 -112823 -105974 -72609 -51898 -15927 -3463 -23567 -68917 -107807
22989 -107807 -104745 -104884 -54786 -10303 26183 -7794 -52129 -66044 -38250 16343 44352 45162
22977 45162 40004 49124 69682 40588 -9416 -26150 27508 43758 64350 46959 8632 -5637
22965 -5637 -30096 -51773 -16227 64298 92472 132658 120528 46092 -5816 -25657 -39847 -26842
22953 -26842 8142 13257 -6979 9563 3357 -62549 -52670 -51664 -65710 -84110 -77944 -46127 4983
22940 4983 -4512 -37159 -39711 -43940 -16079 1209 21103 44778 73114 57598 52979 51294 25458
22927 25458 -167 -6896 -28972 2217 -27812 20471 6947 1020 4719 -37640 -26815 22523
22915 22523 19545 15129 45766 76127 15890 4086 -11592 -16532 -10666 -18749 -46365 -30941 17695
$$ packed form
23001B6815L413K2050p9796q5305O849L3365K0711L5971J2464k0104m5350l8890
22989a07807L062j39N0098M4483L6486l3977m4335j3915K7794N4593K8009Q10
22977D5162n158R120K0558k9094n0004j6734N3658J6250K0592j7391l8327j4269
22965e637k4459k1677L5546Q0525K8174M0186j2130p4436n1908j9841j4190J3005
22953b6842L4984N115k0236J6542o206o5906R879J006j4046j8400O166L1817N1110
22940D983r495l2647k552m229K7861J7288J9894K3675K8336j5516m619j685k5836
22927B5458k5625o729k2076L1189l0029M8283j3524n927L699m2359J0825M9338
22915B2523k978m416L0637L0361o0237j1804j5678m940N866q083k7616J5424M8636
$$ plain form
22902 17695 80555 75584 90301 14307 -50301 -59046 -42505 -10630 -3350 34483 38539 -5455
22890 -5455 -4073 2565 55307 67959 49805 77982 68408 42980 33343 8419 -20816 -43079 -44849
22877 -44849 -8422 -10848 6692 44094 73954 35702 -17807 -39619 -2929 15412 22111 20346
22865 20346 -22319 -5467 5764 -16560 -19890 -16585 -37476 -11852 45848 11138 -11892 -17303
22853 -17303 -11675 -32174 -10172 3111 2271 -6150 16420 47630 13549 -23830 -24755 -36176 -53410
22840 -53410 -97411 -89524 -92164 -86735 -62307 -41533 -29374 -34965 -41138 -52954 -7957 53017 59055
22827 59055 34658 -11836 -61062 -96318 -61084 1626 19988 -17169 -49414 4351 31869 -16065
22815 -16065 -55485 -49220 -74388 -80671 -119416 -74680 -16556 -11106 -61510 -98388 -110400 -71405
$$ packed form
22902A7695O2860m971J4717p5994o4608q745J6541L1875P280L7833M056m3994
22890e455J382O638N2742J2652j8154K8177r574k5428r637k4924k9235k2263j770
22877d4849L6427k426J7540L7402K9860l8252n3509k1812L6690J8341O699j765
22865B0346m2665J6852J1231k2324l330L305k0891K5624N7700l4710k3030n411
22853a7303N628k0499K2002J3283q40q421K2570L1210l4081l7379r25j1421j7234
22840e3410m4001P887k640N429K4428K0774J2159n591o173j1816M4997O0974O038
22827E9055k4397m6494m9226l5256L5234O2710J8362l7157l2245N3765K7518m7934
22815a6065l9420O265k5168o283l8745M4736N8124N450n0404l6878j2012L8995
$$ plain form
22803 -71405 -55510 -64956 -24051 3953 27627 6528 17478 47108 56005 14607 14829 21475 8561
22790 8561 -23734 -55411 -84899 -82660 -55368 -6560 -46309 -33810 -45523 -59667 -6999 20450
22778 20450 -51307 -29196 -4365 -37556 -38102 -71380 -95169 -70726 -37858 -7387 577 -26890
22766 -26890 -22780 35102 63102 69651 19715 10549 6780 1803 -12431 -41058 15135 22454 34045
22753 34045 13266 10066 -50875 -90814 -129533 -127368 -152942 -99510 -58976 -17594 11165 63911
22741 63911 73235 38074 29454 -6963 22104 -5945 -23207 -33093 -55198 -52293 -52235 -22286 51555
22728 51555 82088 107766 14250 -21037 14656 29555 49666 14970 858 33511 29466 -10428
22716 -10428 -15009 -32535 -57378 -37812 -49941 -32490 33538 88231 29478 -21219 23411 47708
$$ packed form
22803g1405J5895r446M0905K8004K3674k1099J0950K9630Q897m1398K22O646j2914
22790H561l2295l1677k9488K239K7292M8808l9749J2499j1713j4144N2668K7449
22778B0450p1757K2111K4831l3191n46l3278k3789K4443L2868L0471P964k7467
22766b6890M110N7882K8000O549m9936r166l769m977j4234k8627N6193P319J1591
22753C4045k0779l200o0941l9939l8719K165k5574N3432M0534M1382K8759N2746
22741F3911R324l5161q620l6417K9067k8049j7262r886k2105K905N8K9949P3841
22728E1555L0533K5678r3516l5287L5693J4899K0111l4696j4112L2653m045l9894
22716a0428m581j7526k4843J9566j2129J7451O6028N4693n8753n0697M4630K4297
$$ plain form
22704 47708 21034 32508 24225 53419 61084 -16296 -57948 -77177 -73199 -90940 -73410 -37900
22692 -37900 -41782 -28264 19343 10464 -56314 -48443 -66177 -83470 -84592 -83347 -66446 4655 40508
22679 40508 -16832 -56941 -33328 14156 8033 -22590 -17088 17450 -31249 -36684 -41276 -16424
22667 -16424 -11925 -61691 -75118 938 5640 10799 -4893 13127 -7687 -83112 -9608 37408
22655 37408 72987 89858 32762 -39580 -8837 25693 9181 -58851 -105445 -71284 -85551 -56085
22643 -56085 -21513 21782 -19908 -77708 -22210 -4876 25253 35754 -16654 -28962 -29638 25896
22631 25896 -12269 -45563 9469 50056 44305 29911 28886 -696 -15303 -26748 -32871 -27136
22619 -27136 -69232 -56406 -39294 -49862 -25348 3354 1782 -3126 -3443 -3615 2900 15446 22050
$$ packed form
22704D7708k6674J1474q283K9194P665p7380m1652j9229L978j7741J7530L5510
22692c7900l882J3518M7607q879o6778P871j7734j7293j122J245J6901P1101L5853
22679D0508n7340m0109K3613M7484o123l0623N502L4538m8699n435m592K4852
22667a6424M499m9766j3427P6056M702N159j5692J8020k0814p5425P3504M7016
22655C7408L5579J6871n7096p2342L0743L4530j6512o8032m6594L4161j4267K9466
22643e6085L4572M3295m1690n7800N5498J7334L0129J0501n2408j2308o76N5534
22631B5896l8165l3294N5032M0587n751j4394j025k9582j4607j1445o123N735
22619b7136m2096J2826J7112j0568K4514K8702j572m908l17j72O515J2546O604
$$ plain form
22606 22050 10784 24854 22574 -17206 2361 -22568 -68264 -70212 -50939 -63593 -54347 -50377
22594 -50377 -47858 -44633 -94601 -88430 -79041 -56467 -77355 -72119 -71302 -77887 -46231 -46877 -23127 -13347
22580 -13347 -10129 8407 -414 -36902 -42557 -64270 -79543 -46671 -63767 -58316 -1773 64906
22568 64906 6621 -41627 -40216 -23893 -18785 -31722 -36589 -41779 -48818 -20257 6723 -11116 853
22555 853 -15495 -37235 6450 28711 -370 -24111 -20359 7221 1723 -17760 -10190 -11725 12750
22542 12750 57206 99070 77915 31329 -15253 -68773 -41580 -45120 -20306 44333 4014 -5564
22530 -5564 -58723 -114990 -81063 -53433 -73093 -71029 -55967 -30978 -6169 -6380 -1623 -30361 -2474
22517 -2474 25093 26881 30364 25765 49771 14452 11197 -9472 53477 83662 62133 59425 31769
$$ packed form
22606B2050j1266J4070k280l9780J9567k4929m5696j948J9273j2654R246L970
22594e0377K519L225m9968O171R389K2574k0888N236Q17o585L1656o46K3750R780
22580a3347L218J8536q821l6488n655k1713j5273L2872j7096N451N6543O6679
22568F4906n8285m8248J411J6323N108j2937m867n190p039K8561K6980j7839J1969
22555H53j6348k1740M3685K2261k9081k3741L752K7580n498j9483P570j535K4475
22542A2750M4456M1864k1155m6586m6582n3520K7193l540K4814O4639m0319r578
22530e564n3159n6267L3927K7630j9660K064J5062K4989K4809k11M757k8738K7887
22517b474K7567J788L483m599K4006l5319l255k0669O2949L0185k1529k708k7656
$$ plain form
22504 31769 35538 35932 8100 3896 12609 -58096 -116012 -129071 -77254 9827 32480 434 179
22491 179 25562 20225 -17416 -12302 21667 5189 -10019 -50361 -59230 -34152 -61302 -61312 -42205
22478 -42205 -18821 172 -18376 -38503 21912 59455 61946 88192 91024 68271 24889 6622
22466 6622 -28510 -49937 -20187 5820 -22948 -33563 -33106 -21575 908 -19900 -20574 27500 30364
22453 30364 24644 36888 10022 1883 6240 -13554 -29895 -31828 -14059 -50298 -127270 -117172
22441 -117172 -48602 -26552 -55879 -30276 -35797 -72917 -54606 3073 40222 31469 25338 14805
22429 14805 8047 -19797 -39346 -52968 -32354 -57561 -51723 -2767 2409 -47024 -83544 -81818
22417 -81818 -64108 -56419 -57654 -45362 -24431 -36807 -43206 -93350 -53927 -6336 -40221 -26578
$$ packed form
22504C1769L769L94k7832m204Q713p0705n7916j3059N1817Q7081K2653l2046k55
22491A79K5383n337l7641N114L3969j6478j5208m0342q869K5078k7150j0J9107
22478d2205K3384J8993j8548k0127O0415L7543K491K6246K832k2753m3382j8267
22466F622l5132k1427K9750K6007k8768j0615M57J1531K2483k0808o74M8074K864
22453C0364n720J2244k6866q139M357j9794j6341j933J7769l6239p6972J0098
22441a17172O8570K2050k9327K5603n521l7120J8311N7679L7149q753o131j0533
22429A4805o758k7844j9549j3622K0614k5207N838M8956N176m9433l6520J726
22417h1818J7710P689j235J2292K0931j2376o399n0144L9423M7591l3885J3643
$$ plain form
22405 -26578 26559 29802 17601 -15262 -62009 -108419 -118683 -112287 -117980 -64131 -47245 -34307
22393 -34307 6141 -22939 -6606 -21498 -91629 -61069 3198 5517 38412 62727 54587 22417
22381 22417 18460 -47280 -5281 16369 12371 11663 15528 -25219 -49510 -64240 -68403 -16447 21515
22368 21515 -8597 -68345 -94588 -51327 -17353 -34741 -39457 -13763 -20061 -37429 -47031 -58145
22356 -58145 -91162 -94062 -82275 -77576 -92714 -96460 -53223 -48528 -50886 -1351 62113 50654 4565
22343 4565 -64104 -68874 -25798 -46954 -75797 -94102 -107587 -65789 -47456 -38344 -56345 -107988
22331 -107988 -158937 -191396 -147482 -108814 -55493 -32156 -25741 -10859 -51438 -53121 -4341 33080
22319 33080 19350 -23052 -35813 -16977 2178 -45027 -73146 -49651 -2229 80525 121468 70879
$$ packed form
22405b6578N3137L243j2201l2863m6747m6410j0264O396n693N3849J6886J2938
22393c4307M0448k9080J6333j4892p0131L0560O4267K319L2895K4315q140l2170
22381B2417l957o5740M1999K1650l998p08L865m0747k4291j4730m163N1956L7962
22368B1515l0112n9748k6243M3261L3974j7388m716K5694o298j7368r602j1114
22356e8145l3017k900J1787M699j5138l746M3237M695k358M9535O3464j1459m6089
22343D565o8669m770M3076k1156k8843j8305j3485M1798J8333R112j8001n1643
22331a07988n0949l2459M3914L8668N3321K3337O415J4882m0579j683M8780L7421
22319C3080j3730m2402j2761J8836J9155m7205k8119K3495M7422Q2754M0943n0589
$$ plain form
22307 70879 5897 -3277 34429 59503 60753 61613 80990 33359 34852 31065 40354 39710 43184 69514
22293 69514 41186 36886 13119 -31249 -62467 -50374 -65235 -62307 -45555 -87461 -118029 -98905
22281 -98905 -52800 -24657 -39560 -20760 11679 14003 -29237 -21920 -26921 -52204 -112253 -69001
22269 -69001 6271 30053 -24969 -49692 -44094 -58759 -55324 -15059 -20301 -59162 -40494 7267
22257 7267 19728 -34282 -67259 -84192 -68125 -37863 -59392 -76670 -58528 -5458 42185 26960
22245 26960 -14336 -26838 -41477 -56707 -38197 -23817 -34383 -36910 -47015 -71045 -33354 29036
22233 29036 59117 48322 30614 8725 10338 -5443 47417 43172 -13814 -20440 -1868 43403
22221 43403 54519 30760 22083 68791 64438 53374 7272 -61121 -125378 -102347 -80226 -78162
$$ packed form
22307G0879o4982r174L7706K5074J250Q60J9377m7631J493l787R289o44L474K6330
22293F9514k8328m300k3767m4368l1218J2093j4861K928J6752m1906l0568J9124
22281i8905M6105K8143j4903J8800L2439K324m3240P317n001k5283o0049M3252
22269f9001P5272K3782n5022k4723N598j4665L435M0265n242l8861J8668M7761
22257G267J2461n4010l2977j6933J6067L0262k1529j7278J8142N3070M7643j5225
22245B6960m1296j2502j4639j5230J8510J4380j0566k527j0105k4030L7691O2390
22233B9036L0081j0795j7708k1889J613j5781N2860m245n6986o626J8572M5271
22221D3403J1116k3759q677M6708m353j1064m6102o8393o4257K3031K2121K064
$$ plain form
22209 -78162 -42527 -69768 -105335 -80833 -26607 -11943 -44553 -67585 -88405 -88675 -83080 -57333
22197 -57333 -83229 -133178 -71905 -26557 27306 3438 -29211 -9241 -3757 -40503 -47780 -28919
22185 -28919 50593 74456 14356 -29757 -14335 39530 30588 64186 53274 -12608 -38618 3325
22173 3325 20894 -427 -3331 7607 6772 -28285 -8907 -22002 -59108 -84712 -78279 -56642 -67831
22160 -67831 -75726 -75371 -59421 -59534 4192 16730 -3250 -5646 7802 -3172 -19561 -35689 -31716
22147 -31716 -25805 -25251 -48945 -84114 -79967 -96491 -114745 -131882 -110648 -38686 -31778 -44216 -20353
22134 -20353 -23264 -58668 -84734 -36419 32615 49337 58919 66030 45709 21739 -33013 38995
22122 38995 42608 -9511 6964 -9388 -9420 59426 69217 39772 37996 -9770 -18873 13060 -24960
$$ packed form
22209g8162L5635k7241l5567K4502N4226J4664l2610k3032k0820k70N595K5747
22197e7333k5896m9949O1273M5348N3863k3868l2649J9970N484l6746p277J8861
22185b8919P9512K3863o0100m4113J5422N3865q942L3598j0912o5882k6010M1943
22173C325J7569k1321k904J0938q35l5057J9378j3095l7106k5604O433K1637j1189
22160f7831p895L55J5950j13O3726J2538j9980k396J3448j0974j6389j6128L973
22147c1716N911N54k3694l5169M147j6524j8254j7137K1234P1962O908j2438K3863
22134b0353k911l5404k6066M8315O9034J6722R582P111k0321k3970n4752P2008
22122C8995L613n2119J6475j6352l2O8846R791k9445j776m7766r103L1933l8020
$$ plain form
22109 -24960 -16817 31229 27431 -23572 -5063 -29445 -85693 -89969 -61643 16824 -9648 -33987
22097 -33987 -29733 7940 -16454 -29840 8048 32428 56094 68409 45913 31111 54783 43644
22085 43644 -72929 -100176 -119545 -92169 -2351 -4495 -16398 35806 48727 54372 1336 -52656
22073 -52656 -68884 -52391 -72279 -75538 -75238 -113143 -81674 -69261 -40673 -7723 -1529 14124
22061 14124 54605 46100 9471 18891 -35032 -52387 -52148 -19352 37623 114468 112392 19077 -15725
22048 -15725 11135 25194 36434 -4701 -22938 3281 53990 85658 74485 2360 -18770 5587
22036 5587 -20852 -54357 -6653 59538 96037 60108 9174 -3535 41720 57432 36844 68156
22024 68156 44761 14083 -25069 -278 14053 -22267 -19122 -26401 -68414 -50966 -20852 4152
$$ packed form
22109b4960Q143M8046l798n1003J8509k4382n6248m276K8326P8467k6472k4339
22097c3987M254L7673k4394j3386L7888K4380K3666J2315k2496j4802K3672j1139
22085D3644j16573k7247j9369K7376Q9818k144j1903N2204J2921N645n3036n3992
22073e2656j6228J6493j9888l259L00l7905L1469J2413K8588L2950O194J5653
22061A4124M0481q505l6629R420n3923j7355K39L2796N6975P6845k076r3315l4802
22048a5725K6860J4059J1240m1135j8237K6219N0709L1668j1173p2125k1130K4357
22036E587k6439l3505M7704O6191L6499l5929n0934j2709M5255J5712k0588L1312
22024F8156k3395l0678l9152K4791J4331l6320L145p279m2013J7448L0114K5004
$$ plain form
22012 4152 -30983 -72815 -110415 -78510 -44320 -10356 29204 68206 46738 4784 33823 52730
22000 52730 38384 6139 -15492 -3550 36896 59475 34698 41139 22076 10983 12785 38348
21988 38348 35449 -59639 -57192 -15846 4341 20302 -5076 -27278 -43795 -33271 17888 56924
21976 56924 477 -60041 -37246 46663 38128 53186 54777 -18646 -56196 -35769 -10718 -23759
21964 -23759 -23433 9743 -16383 -20942 33392 62409 15515 -11245 -35886 43348 42626 31086 36278
21951 36278 34813 53345 28954 6705 18983 28224 11318 70849 107736 86731 55881 32328
21939 32328 -22969 -14602 9483 46692 30909 7308 22571 -18228 -37291 -24885 -29723 -16440
21927 -16440 -15923 -30459 -97115 -69140 -24941 -39133 -63855 -72681 -47122 -46767 -44013 -22522 -6339
$$ packed form
22012D152l5135m1832l7600L1905L4190L3964L9560L9002k1468m1954K9039J8907
22000E2730j4346l2245k1631J1942M0446K2579k4777O441j9063j1093J802K5563
21988C8348k899r5088K447M1346K0187J5961k5378k2202j6517J0524N1159L9036
21976E6924n6447o0518K2795Q3909q535J5058J591p3423l7550K0427K5051j3041
21964b3759L26L3176k6126m559N4334K9017m6894k6760k4641P9234p22j1540N192
21951C6278j465J8532k4391k2249J2278R241j6906N9531L6887k1005l0850k3553
21939C2328n5297Q367K4085L7209j5783k3601J5263m0799j9063J2406m838J3283
21927a6440N17j4536o6656K7975M4199j4192k4722q826K5559L55K754K1491J6183
$$ plain form
21914 -6339 40581 17533 -13046 -75717 -42767 -3870 -18086 7494 40180 69841 17472 -14294
21902 -14294 44443 55798 20068 15288 19806 58089 86724 58688 5556 41362 109787 122108
21890 122108 91678 49932 29049 26590 44160 32478 48305 69828 77113 50282 29475 78054
21878 78054 98716 83172 89939 27508 -20079 -4309 23788 12363 31102 24382 10760 10454
21866 10454 -32278 -95100 -98427 -76248 -50810 -32914 -36098 -74003 -86243 -62463 -65497 -52976
21854 -52976 -26766 6857 3536 34721 91794 89088 66430 64065 20440 10735 -20404 4497
21842 4497 62495 85296 94298 110635 38502 42624 -620 -15183 -20018 -3870 1267 -32214 -54993
21829 -54993 -4618 -3578 -6684 -11347 -62181 -51473 -29540 -37923 -70910 -81489 -80413 -98676 -53849
$$ packed form
21914f339M6920k3048l0579o2671L2950L8897j4216K5580L2686K9661n2369l1766
21902a4294N8737J1355l5730m780M518L8283K8635k8036n3132L5806O8425J2321
21890A22108l0430m1746k0883k459J7570j1682J5827K1523P285k6831k0807M8579
21878G8054K0662j5544O767o2431m7587J5770K8097j1425J8739o720j3622l06
21866A0454m2732o2822l327K2179K5438J7896l184l7905j2240K3780l034J2521
21854e2976K6210L3623l321L1185N7073k706k2658k365m3625r705l1139K4901
21842D497N7998K2801R002J6337p2133M122m3244j4563m835J6148N137l3481k2779
21829e4993N0375J040l106m663n0834J0708K1933q383l2987j0579J076j8263M4827
$$ plain form
21816 -53849 -22135 3044 -25019 -58441 -21926 -46316 -35384 -51104 -77259 -68990 -66161 -10781
21804 -10781 1577 41900 40579 31999 -9912 -25379 -17414 49542 42908 41638 35596 37335 59658
21791 59658 60937 37281 51439 84334 78267 43996 -8019 -23647 -8526 5551 46580 94066
21779 94066 121967 159824 135436 80200 128631 123430 61686 33512 23466 10282 21496 70773
21767 70773 92969 11868 -57104 -87492 -92437 -30541 32973 47054 30365 10660 43603 87344
21755 87344 75320 61246 4611 2915 23123 2248 14336 75767 65705 9588 -16155 23533
21743 23533 21275 5178 -41792 -45549 11205 31279 1199 7736 18230 4843 13830 -16440
21731 -16440 2445 -3964 -20414 -35842 -37537 -23889 -73611 -59221 -6680 -32681 -34618 -8399
$$ packed form
21816e3849L1714K5179k8063l3422L6515k4390J0932j5720k6155Q269K829N5380
21804a0781J2358M0323j321q580m1911j5467P965O6956o634j270o042J739K2323
21791E9658J279k3656J4158L2895o067l4271n2015j5628J5121J4077M1029M7486
21779I4066K7901L7857k4388n5236M8431n201o1744k8174j0046j3184J1214M9277
21767G0773K2196q1101o8972l0388m945O1896O3514J4081j6689j9705L2943M3741
21755H7344j2024j4074n6635j696K0208k0875J2088O1431j0062n6117k5743L9688
21743B3533k258j6097m6970l757N6754K0074l0080O537J0494j3387Q987l0270
21731a6440J8885o409j6450j5428j695J3648m9722J4390N2541k6001j937K6219
$$ plain form
21719 -8399 41557 55082 79018 93941 98160 70389 65604 26603 12569 -11104 -35070 -92817
21707 -92817 -126104 -51965 50318 96282 57099 1484 -23164 -63358 -66228 -27188 41269 75445
21695 75445 61921 2788 -47664 -69796 -84447 -56041 -39137 -31030 -15685 -17120 36033 49107
21683 49107 -2259 11706 -14688 -32091 -18788 -1415 32003 40827 61660 78951 80070 76146
21671 76146 54438 -10583 -20514 -57863 -72265 -767 -3402 508 -8423 -36147 -103805 -141081
21659 -141081 -119264 -29615 37525 50749 45361 7316 -26078 -54347 -16982 12925 10595 42770
21647 42770 4486 -20363 -24926 22034 12298 13790 2500 15443 -5197 -16160 -31948 -6513
21635 -6513 -36660 -4620 38880 112073 41282 -13408 20385 74357 27888 -34180 -21530 -50173
$$ packed form
21719h399M9956J3525K3936J4923M219k7771m785l9001j4034k3673k3966n7747
21707i2817l3287P4139J02283M5964l9183n5615k4648m0194k870L9040O8457L4176
21695G5445j3524n9133n0452k2132j4651K8406J6904Q107J5345j435N3153J3074
21683D9107n1366J3965k6394j7403J3303J7373L3418Q824K0833J7291J119l924
21671G6146k1708o5021r931l7349j4402P1498k635L910q931k7724o7658l7276
21659a41081K1817Q9649O7140J3224n388l8045l3394k8269L7365K9907k330L2175
21647D2770l8284k4849m563M6960r736J492j1290J2943k0640j0963j5788K5435
21635f513l0147L2040M3500P3193p0791n4690L3793N3972m6469o2068J2650k8643
$$ plain form
21623 -50173 -80420 -38499 -6333 62 -19708 -45687 2236 25992 31886 20608 -26697 -35256
21611 -35256 3277 -6595 -12685 12484 -4869 -31193 41987 73939 -5449 -35590 -44445 -42191
21599 -42191 1296 9549 30374 46518 59508 44660 7419 -24713 19705 71044 63609 23419
21587 23419 2294 -10500 -16346 -8985 -19291 -2736 34078 4284 -22668 -35067 -53239 -18867
21575 -18867 31927 39396 49426 18863 38622 36898 6759 19817 64736 12530 -25696 22664
21563 22664 37536 -15797 -17301 28597 -20266 10661 50913 43842 21029 -3241 -26558 -8569
21551 -8569 -5973 -4568 21043 -2715 -59146 -56036 -28904 -42470 -53358 -57064 -10807 10201 18877
21538 18877 15482 -8426 -2213 68144 56769 69124 52236 30209 46628 26244 10591 -3148
$$ packed form
21623e0173l0247M1921L2166O395j9770k5979M7923K3756N894j1278m7305q559
21611c5256L8533r872o090K5169j7353k6324P3180L1952p9388l0141q855K254
21599d2191M3487Q253K0825J6144J2990j4848l7241l2132M4418N1339p435m0190
21587B3419k1125j2794n846P361j0306J6555L6814k9794k6952j2399j8172L4372
21575a8867N0794P469J0030l0563J9759j724l0139J3058M4919n2206l8226M8360
21563B2664J4872n3333j504M5898m8863L0927M0252p071k2813k4270k3317J7989
21551h569K596J405K5611k3758n6431L110K7132j3566j0888l706M6257K1008Q676
21538A8877l395k3908O213P0357j1375J2355j6888k2027J6419k0384j5653j3739
$$ plain form
21526 -3148 -13020 -18247 -30056 -58996 -35293 -29692 -47511 -44177 7833 50851 64681 10851 -48021
21513 -48021 -47236 -54814 -32574 9399 26873 12946 -30281 -32285 702 -14524 -8983 11861 32952
21500 32952 -3872 -2664 7702 -11690 12814 53596 22862 4911 47347 19517 -27894 -35554
21488 -35554 -50502 -54287 -41527 -48170 -48336 -58500 -40412 -5794 17451 50415 66067 109485
21476 109485 85198 -331 -14604 -27572 -51751 -32064 -39132 -77776 -67008 -72580 -51503 6404
21464 6404 -14341 -48602 -47070 -10681 37172 94877 -1217 -93307 -37347 30677 20061 -3706
21452 -3706 569 -22562 -60666 -31665 -31422 -21570 29651 6360 -13629 20242 73181 82051 93581
21439 93581 46323 55977 52276 10760 37964 72453 17704 -25869 -43853 -54664 -66791 -36830
$$ packed form
21526c148r872n227j1809k8940K3703N601j7819L334N2010M3018J3830n3830n8872
21513d8021P85p578K2240M1973J7474j3927m3227k004L2987j5226N541K0844K1091
21500C2952l6824J208J0366j9392K4504M0782l0734j7951M2436k7830m7411p660
21488c5554j4948l785J2760o643j66j0164J8088L4618K3245L2964J5652M3418
21476A09485k4287q5529j4273j2968k4179J9687p068l8644J0768n572K1077N7907
21464F404k0745l4261J532L6389M7853N7705r6094r2090N5960O8024j0616k3767
21452c706M275k3131l8104K9001K43R852N1221k3291j9989L3871N2939Q870J1530
21439I3581m7258R654l701m1516K7204L4489n4749m3573j7984j0811j2127K9961
$$ plain form
21427 -36830 -51884 -73593 -73384 -71032 -61200 -59858 -35843 -25289 -18107 -9757 -28922 6707 39522
21414 39522 24249 23699 48338 29412 -17877 9114 43854 83381 54353 12134 -22660 -50253
21402 -50253 -38400 10933 41125 12543 -36102 -30040 5681 27479 84161 68600 80978 59179
21390 59179 57192 25892 -21982 -45744 -53582 -45664 -106012 -77756 -8234 31608 22795 12210
21378 12210 -17482 -15893 -12338 29581 64002 32907 -13453 23563 82176 63897 17150 42340
21366 42340 34404 32669 42678 95512 83347 48639 -4695 -41768 -70093 -71627 -50246 -86498
21354 -86498 -84916 -67002 247 42073 532 36102 92985 133693 111207 71835 44352 -12043
21342 -12043 -65364 -61964 2243 12651 12879 3311 14322 9291 -27160 -82620 -77447 -23640 -12990
$$ packed form
21427c6830j5054k1709K09K352R832J342K4015J0554P182Q350j9165L5629L2815
21414C9522j5273n50K4639j8926m7289K6991L4740L9527k9028m2219l4794k7593
21402e0253J1853M9333L0192k8582m8645O062L5721K1798N6682j5561J2378k1799
21390E9179j987l1300m7874k3762p838P918o0348K8256O9522L9842q813j0585
21378A2210k9692J589L555M1919L4421l1095m6360L7016N8613j8279m6747K5190
21366D2340p936j735J0009N2834j2165l4708n3334l7073k8325j534K1381l6252
21354h6498J582J7914O7249M1826m1541L5570N6883M0708k2486l9372k7483n6395
21342a2043n3321L400O4207J0408K28r568J1011n031l6451n5460N173N3807J0650
$$ plain form
21329 -12990 -40714 -65689 -73876 -80364 -74725 -66764 -59564 -70723 -34740 10386 58810 51089 -8491
21316 -8491 -69851 -82946 -86063 -50877 55809 140495 116585 80039 75170 56521 -657 -22728
21304 -22728 -21744 3872 -977 -15177 -51259 -96641 -89317 -111610 -81955 6051 -18879 -48620
21292 -48620 -64519 -70163 -28762 -4830 19023 15460 -6370 33121 39475 -24235 -43517 29034
21280 29034 78408 96711 123847 155890 120036 5874 -53702 -36186 -39485 -22360 -21195 -31356
21268 -31356 -1660 25210 81763 69024 60528 102359 136761 97056 16304 -14939 -13378 16081
21256 16081 -3605 -19161 -764 -5563 1268 -15262 5290 11169 16852 -41304 -60153 -70927
21244 -70927 -91930 -34118 -2678 37075 54335 9953 -52951 -64962 -44929 -47615 -5299 16225
$$ packed form
21329a2990k7724k4975q187o488N639P961P200j1159L5983M5126M8424p721n9580
21316h491o1360j3095l117L5186J06686Q4686k3910l6546m869j8649n7178k2071
21304b2728R84K5616m849j4200l6082m5382P324k2293K9655Q8006k4930k9741
21292d8620j5899n644M1401K3932K3853l563k1830L9491O354o3710j9282P2551
21280B9034M9374J8303K7136L2043l5854j14162n9576J7516l299J7125J165j0161
21268c1356K9696K6870N6553j2739q496M1831L4402l9705q0752l1243J561K9459
21256A6081j9686j5556J8397m799O831j6530K0552N879N683n8156j8849j0774
21244g0927k1003N7812L1440L9753J7260m4382o2904j2011K0033k686M2316K1524
$$ plain form
21232 16225 -29427 -10473 11404 5517 -8564 -32973 -44537 -48988 -13043 4939 21646 39487
21220 39487 56265 33376 -4125 -3278 2128 -13296 -17270 49228 49369 11815 12596 6955 -7709
21207 -7709 -1277 -45204 -16136 -19956 -26486 6163 7160 31920 65482 27023 44863 33442 10915
21194 10915 -29 -20861 17325 -21006 -51312 -22278 -3793 -19556 -28742 -32303 12652 30642
21182 30642 67490 65825 55611 3298 -1941 -23668 -52561 7308 79655 32129 -13815 -8579
21170 -8579 -33209 -25940 -7092 -11568 -29995 10114 71321 53658 6914 13047 29863 16557
21158 16557 -34640 -44267 -30773 -9026 -8854 -14978 23583 66336 54201 56929 57512 23608 25091
21145 25091 16084 32541 45035 15489 -25494 2239 9431 5484 -10832 -5702 29062 -9123
$$ packed form
21232A6225m5652J8954K1877n887j4081k4409j1564m451L5945J7982J6707J7841
21220C9487J6778k2889l7501Q47N406j5424l974O6498J41l7554P81n641j4664
21207g709O432m3927K9068l820o530L2649R97K4760L3562l8459J7840j1421k2527
21194A0915j0944k0832L8186l8331l0306K9034J8485j5763r186l561M4955J7990
21182C0642L6848j665j0214n2313n239k1727k8893N9869P2347m7526m5944N236
21170h579k4630P269J8848m476j8427M0109O1207j7663m6744O133J6816j3306
21158A6557n1197r627J3494K1747J72o124L8561M2753j2135K728N83l3904J483
21145B5091r007J6457J2494k9546m0983K7733P192l947j6316N130L4764l8185
$$ plain form
21133 -9123 -71396 -73648 -47569 -27304 -33074 -68038 -59929 -33959 -33105 -3491 22524 -17226 -45230
21120 -45230 -19612 12432 -4320 -32379 -43831 -21353 -12764 -40741 -22256 -48739 -7672 17184
21108 17184 77126 125070 65579 21104 24825 31980 39728 -8042 -14898 26829 3826 -6470
21096 -6470 -18099 -8502 -30259 -28576 -38366 5032 60233 37739 10616 16538 14253 48352 54677
21083 54677 48347 21822 20096 2458 43065 15198 -4278 5714 30064 15778 -27081 -3741
21071 -3741 20489 29669 22089 44854 53350 -23899 -4038 8754 13401 60056 72411 43557 25143
21058 25143 -5329 -61328 -46978 -15 83896 112880 75732 67672 65103 73616 98259 100648
21046 100648 101109 91910 58448 19800 48152 57929 31318 5645 69249 83297 135018 134036 76016
$$ packed form
21133i123o2273k252K6079K0265n770l4964Q109K5970Q54K9614K6015l9750k8004
21120d5230K5618L2044j6752k8059j1452K2478Q589k7977J8485k6483M1067K4856
21108A7184N9942M7944n9491m4475L721P155P748m7770o856M1727k3003j0296
21096f470j1629R597k1757J683r790M3398N5201k2494k7123N922k285L4099O325
21083E4677o330k6525j726j7638M0607k7867j9476R992K4350j4286m2859K3340
21071c741K4230R180p580K2765Q496p7249J9861J2792M647M6655J2355k8854j8414
21058B5143l0472n5999J4350M6963Q3911K8984l7148q060k569Q513K4643K389
21046A00648M61r199l3462l8648K8352R777k6611k5673O3604J4048N1721r82n8020
$$ plain form
21033 76016 31676 43254 -22319 -62111 -68288 -6532 5615 -35142 -66989 8861 36628 -24063
21021 -24063 -39019 -86547 -62060 -22244 3253 9017 31417 3287 15497 47821 46317 42809
21009 42809 17350 -20100 -33408 17125 23496 12966 21455 -33111 -31693 33339 76490 43026
20997 43026 21022 28074 48042 7759 -17636 -18708 -13406 -29449 -52531 -14872 7353 -14795
20985 -14795 -41119 12839 23868 -13110 -34648 -34349 -23284 15330 44810 37763 53117 6091
20973 6091 -31345 -21401 -3930 48248 48182 -8251 -26566 -41562 -26578 -354 1172 -12442 -52422
20960 -52422 -41081 -6140 -11506 -69243 -96938 -41508 -56852 -27338 33424 59152 57405 66758
20948 66758 53703 91371 90903 90963 85614 138727 198757 161182 117067 64645 43899 33085 70290
$$ packed form
21033G6016m4340J1578o5573l9792o177O1756J2147m0757l1847P5850K7767o0691
21021b4063j4956m7528K4487L9816K5497N764K2400k8130J2210L2324j504l508
21009D2809k5459l7450j3308N0533O371j0530Q489n4566J418O5032M3151l3464
20997D3026k2004P052J9968m0283k5395j072N302j6043k3082L7659K2225k2148
20985a4795k6324N3958J1029l6978k1538K99J1065L8614K9480p047J5354m7026
20973F091l7436R944J7471N2178o6n6433j8315j4996J4984K6224J526j3614l9980
20960e2422J1341L4941n366n7737k7695N5430j5344K9514O0762K5728j747R353
20948F6758j3055L7668m68O0n349N3113O0030l7575m4115n2422k0746j0814L7205
$$ plain form
20935 70290 36929 -20499 -5163 34853 6442 -21901 -15786 4762 18087 15207 -15754 -44435
20923 -44435 9378 93164 122565 136027 126746 111407 111228 114387 80005 39167 29238 26061 51249
20910 51249 77796 61844 -12029 -35331 38560 41983 23330 8119 -250 6081 52449 17940
20898 17940 7762 19513 36215 15528 51500 57762 17914 -27894 -51231 -53885 -61371 -93632
20886 -93632 -141304 -142176 -100507 -27039 10285 -229 62892 92417 83147 -8665 -33708 -1798
20874 -1798 29291 -10523 -32072 -18197 -11578 -26567 -3395 -28077 -4424 50051 73801 68627
20862 68627 45270 43562 44922 42428 28475 26487 23888 47600 88466 86990 44586 1720 19127
20849 19127 11487 10879 48095 24659 41758 51058 26743 16924 26199 -7779 20665 10222 25513
$$ packed form
20935G0290l3361n7428J5336M0016k8411k8343O115K0548J3325k880l0961k8681
20923d4435N3813Q3786K9401J3462r281j5339j79L159l4382m0838r929l177K5188
20910E1249K6547j5952p3873k3302P3891L423j8653j5211q369O331M6368l4509
20898A7940j0178J1751J6702k0687L5972O262l9848m5808k3337k654p486l2261
20886i3632m7672q72M1669P3468L7324j0514O3121K9525r270r1812k5043L1910
20874a798L1089l9814k1549J3875O619j4989K3172k4682K3653N4475K3750n174
20862F8627k3357j708J360k494j3953j988k599K3712M0866j476m2404m2866J7407
20849A9127p640o08L7216k3436J7099R300k4315r819R275l3978K8444j0443J5291
$$ plain form
20836 25513 33840 43450 23382 30379 41514 32495 31484 14200 24215 42662 15226 -8341 -6055
20823 -6055 6609 15413 9818 8331 47079 86792 63102 -3894 8918 30746 -5510 -12641 5876
20810 5876 20124 34376 15138 -1100 -13963 10940 7637 -2982 4515 6159 13041 56087 94039
20797 94039 42737 -21055 -5666 11060 63495 52835 90841 91292 59899 53061 84931 93506
20785 93506 85535 74881 74657 77635 88149 93575 70429 12644 -17865 -15486 -1399 16084 49617
20772 49617 31673 16824 -262 -22141 -69015 -41816 -46916 -46409 -3735 -18853 2873 -5167
20760 -5167 -6517 -2555 7732 -47444 -12918 -11162 34122 29367 13224 64615 71590 108713 96186
20747 96186 -3030 -21223 -45302 -68360 -23101 6208 25845 50099 42954 12357 67725 117146
$$ packed form
20836B5513Q327R610k0068O997J1135r019j011j7284J0015J8447k7436k3567K286
20823f055J2664Q804n595j487L8748L9713k3690o6996J2812K1828l6256p131J8517
20810E876J4248J4252j9238j6238j2863K4903l303j0619P497J644O882M3046L7952
20797I4039n1302o3792J5389J6726N2435j0660L8006M51l1393o838L1870Q575
20785I3506p971j0654k24K978J0514N426k3146n7785l0509K379J4087J7483L3533
20772D9617j7944j4849j7086k1879m6874K7199n100N07M2674j5118K1726q040
20760e167j350L962J0287n5176L4526J756M5284m755j6143N1391O975L7123j2527
20747I6186r9216j8193k4079k3058M5259K9309J9637K4254p145l0597N5368M9421
$$ plain form
20735 117146 130110 101061 53867 18734 17427 7808 13080 41170 52241 15394 52806 41012
20723 41012 14648 557 -604 1532 -33154 -45801 -43483 -37689 11098 78295 55770 45950 55816
20710 55816 67943 45085 33729 61269 63932 70056 -4788 31760 27575 7110 1809 24270
20698 24270 53492 6295 -49867 -15637 -16062 -46903 -66870 -72392 -30449 6779 65590 68999
20686 68999 61233 31721 6359 -2381 -33759 -32304 -8860 22854 22240 1886 72725 96168 32473
20673 32473 37421 20508 -17600 -40124 42792 92967 96228 61762 -1608 -28984 -17008 -9742
20661 -9742 36408 115624 110357 88936 70456 104949 83355 60252 120424 84341 24618 8924
20649 8924 -11371 -14240 24925 34787 59040 85203 44646 17440 60242 121684 134423 100921
$$ packed form
20735A17146J2964k9049m7194l5133j307r619N272K8090J1071l6847L7412j1794
20723D1012k6364j4091j161K136l4686j2647K318N794M8787O7197k2525r820R866
20710E5816J2127k2858j1356K7540K663O124p4844L6548m185k0465n301K2461
20698B4270K9222m7197n6162L4230m25l0841j9967n522M1943L7228N8811L409
20686F8999p766k9512k5362q740l1378J455K3444L1714o14k0354P0839K3443o3695
20673C2473M948j6913l8108k2524Q2916N0175L261l4466o3370k7376J1976P266
20661i742M6150P9216n267k1421j8480L4493k1594k3103O0172l6083n9723j5694
20649H924k0295k869L9165R862K4253K6163m0557k7206M2802O1442J2739l3502
$$ plain form
20637 100921 20447 4974 54629 94484 103291 90302 95857 108777 49586 2664 -5935 17746
20625 17746 -3807 2476 -18274 6615 11348 15150 15603 32246 35300 44075 54223 37842 469
20612 469 4077 43031 735 -14174 -22610 -129 20645 72590 82657 121801 119531 101963 80545
20599 80545 78086 59113 34279 40637 56690 45233 15231 31276 36928 13546 29490 82796
20587 82796 114275 105521 86105 71849 85697 114317 108552 60752 16844 -3075 -24455 20977
20575 20977 5307 -4109 17596 26643 -8398 -41022 -42951 3358 48927 73842 35236 102070
20563 102070 105404 73663 57217 675 -36187 1454 -207 38986 92224 119784 45901 75531
20551 75531 68095 54611 82919 126308 140638 106886 70483 50350 44238 35861 84453 124802
$$ packed form
20637A00921q0474j5473M9655L9855Q807j2989N555J2920n9191m6922q599K3681
20625A7746k1553O283k0750K4889M733L802M53J6643L054Q775J0148j6381l7373
20612D69L608L8954m2296j4909q436K2481K0774N1945J0067L9144k270j7568k1418
20599H0545k459j8973k4834O358J6053j1457l0002J6045N652k3382J5944N3306
20587H2796L1479q754j9416j4256J3848K8620n765m7800m3908j9919k1380M5432
20575B0977j5670r416K1705R047l5041l2624j929M6309M5569K4915l8606O6834
20563A02070L334l1741j6446n6542l6862L7641j661L9193N3238K7560p3883K9630
20551G5531p436j3484K8308M3389J4330l3752l6403k0133o112q377M8592M0349
$$ plain form
20539 124802 165767 187068 169598 136206 107168 49793 64446 66384 41817 23828 34659 21374
20527 21374 34765 50221 52867 59126 80137 142939 117561 47423 75039 76445 77052 73045 77114
20514 77114 63483 46733 37768 44806 46490 83225 103695 111419 108199 56491 51263 17811 9828
20501 9828 -8280 18142 38290 23378 44305 60720 81865 99024 139047 83392 122799 138849
20489 138849 119063 73357 35355 17622 25747 -19122 -43302 1344 98790 72271 33914 5508
20477 5508 3827 40068 57570 32399 26532 51152 20315 -12160 -17661 39614 54779 48885 34908
20464 34908 -5732 10227 -8190 37521 66722 60975 107580 97104 88253 52590 2023 18010
20452 18010 34463 69726 157376 163674 116681 102181 83423 65372 70030 70799 37985 61823
$$ packed form
20539A24802M0965K1301j7470l3392k9038n7375J4653J938k4567j7989J0831j3285
20527B1374J3391J5456K646O259K1011O2802k5378p0138K7616J406O07m007M069
20514G7114j3631j6750q965P038J684L6735K0470P724l220n1708n228l3452p983
20501I828j8108K6422K0148j4912K0927J6415K1145J7159M0023n5655L9407J6050
20489A38849j9786m5706l8002j7733Q125m4869k4180M4646R7446k6519l8357k8406
20477E508j681L6241J7502k5171n867K4620l0837l2475n501N7275J5165n894j3977
20464C4908m0640J5959j8417M5711K9201n747M6605j0476q851l5663n0567J5987
20452A8010J6453L5263Q7650O298m6993j4500j8758j8051M658P69l2814K3838
$$ plain form
20440 61823 80599 9774 -16061 55281 139007 110475 103759 122674 103618 112862 131963 115523
20428 115523 77572 28008 -12960 -13200 83076 139074 130846 104649 87423 54606 76644 79423
20416 79423 9933 20005 74503 130743 139978 114269 61030 24846 13364 35916 74174 128937
20404 128937 155207 107855 99178 144546 137617 107890 110874 92378 80918 71710 32102 69979
20392 69979 100551 88288 87677 73981 66593 34810 37448 34518 41708 86345 68229 29692 -7380
20379 -7380 22195 79016 95680 89490 29830 38899 101909 162289 140951 97922 83797 96312
20367 96312 91566 116722 162142 116688 108170 108548 105921 86539 63598 47122 105483 126786 107456
20354 107456 129023 153522 192010 180656 193243 163805 125188 106236 129209 92106 68782
$$ packed form
20440F1823J8776p0825k5835P1342Q3726k8532o716J8915j9056R244J9101j6440
20428A15523l7951m9564m0968k40R6276N5998q228k6197j7226l2817K2038K779
20416G9423o9490J0072N4498N6240R235k5709n3239l6184j1482K2552L8258N4763
20404A28937K6270m7352q677M5368o929k9727K984j8496j1460r208l9608L7877
20392F9979L0572j2263o11j3696p388l1783K638k930P190M4637j8116l8537l7072
20379g380K9575N6821J6664o190n9660R069O3010O0380k1338m3029j4125J2515
20367I6312m746K5156M5420m5454q518L78k627j9382k2941j6476N8361K1303j9330
20354A07456K1567K4499L8488j1354J2587k9438l8617j8952K2973l7103k3324
$$ plain form
20343 68782 76985 32017 23837 69957 106163 111010 45146 79242 104975 114136 111887 81758 59435
20330 59435 90319 130908 168496 214219 191978 179422 256955 260155 181296 192841 238636 235016
20318 235016 155383 91884 85079 129836 123928 124102 158375 126920 60564 40157 31654 13352
20306 13352 81291 95067 89387 98266 147461 182930 163362 223668 205672 191883 175107 82090
20294 82090 1216 12527 96947 202772 228544 175653 216677 261790 234318 234218 274838 353665
20282 353665 400654 454830 520756 619360 701501 847308 972433 1144332 1400646 1723893
20272 1723893 2004147 2078371 1917072 1787898 1679653 1556755 1495666 1453976 1432299 1282166
20262 1282166 1149881 1127228 1081740 1036558 1017361 946538 935514 928333 917101 854305 849096
$$ packed form
20343F8782Q203m4968q180M6120L6206M847o5864L4096K5733R161k249l0129k2323
20330E9435L0884M0589L7588M5723k2241j2556P7533L200p8859J1545M5795l620
20318B35016p9633o3499o805M4757n908J74L4273l1455o6356k0407q503j8302
20306A3352O7939J3776n680Q879M9195L5469j9568O0306j7996j3789j6776r3017
20294H2090q0874J1311Q4420J05825K5772n2891M1024M5113k7472j00M0620P8827
20282C53665M6989N4176O5926R8604Q2141J45807J25125J71899K56314L23247
20272A723893K80254P4224j61299j29174j08245j22898o1089m1690k1677j50133
20262A282166j32285k2653m5488m5182j9197p0823j1024p181j1232o2796n209
$$ plain form
20251 849096 888433 906274 925855 984128 1014614 982955 1041589 1126918 1273993 1366202 1447772
20240 1447772 1605836 1783821 1902209 2026353 2202712 2432871 2517086 2471868 2215653 1887093
20230 1887093 1650912 1466614 1320041 1210576 1105626 1038075 963175 910481 883049 867488
20220 867488 800119 737569 709076 681841 643216 635951 600192 591873 614559 597890 591811 638904
20208 638904 616506 654591 676881 670668 594225 532280 504626 527550 552135 528028 459107 449753
20196 449753 500943 553937 474683 450612 429968 365760 339689 324434 325640 298372 306339 330024
20184 330024 325292 330885 335623 314376 285582 296561 273496 247919 246065 236280 237871 251607 237053
20171 237053 210275 250054 257928 298438 265695 243773 206720 100993 47653 72249 42432
$$ packed form
20251H49096L9337J7841J9581N8273L0486l1659N8634Q5329J47075R2209Q1570
20240A447772J58064J77985J18388J24144J76359K30159Q4215m5218k56215l28560
20230A887093k36181j84298j46573j09465j04950o7551p4900n2694k7432j5561
20220H67488o7369o2550k8493k7235l8625p265l5759q319K2686j6669o079M7093
20208F38904k2398L8085K2290o213p6443o1945k7654K2924K4585k4107o8921r354
20196D49753N1190N2994p9254k4071k0644o4208k6071j5255J206k7268P967K3685
20184C30024m732N593M738k1247k8794J0979k3065k5577j854r785J591J3736j4554
20171B37053k6778L9779P874M0510l2743k1922l7053j05727n3340K4596k9817
$$ plain form
20160 42432 79033 139608 143496 94269 80022 82619 83093 60293 47541 24084 33590 77685 138058
20147 138058 189192 206213 204749 198205 170849 166528 152976 128637 187665 204147 186984 226011
20135 226011 263210 229647 155789 142102 109945 122117 150365 166291 124153 80750 85489 106565
20123 106565 129631 105267 154735 184747 201327 212308 245507 268873 222862 183952 206748
20112 206748 260625 265609 229959 185904 197208 171994 210785 252459 298413 244493 145784 119710
20100 119710 137744 136632 123514 103922 161627 195378 222471 191300 173124 178504 138965 157612
20088 157612 216979 217506 222095 235749 241152 200203 161610 148141 221135 229188 233701 213438 153983
20075 153983 116442 103535 155103 156171 170321 198488 240771 253589 199797 157356 180097 151179
$$ packed form
20160D2432L6601O0575L888m9227j4247K597M74k2800j2752k3457R506M4095O0373
20147A38058N1134J7021j464o544k7356m321j3552k4339N9028J6482j7163L9027
20135B26011L7199l3563p3858j3687l2157J2172K8248J5926m2138m3403M739K1076
20123A06565K3066k4364M9468L0012J6580J0981L3199K3366m6011l8910K2796
20112B06748N3877M984l5650m4055J1304k5214L8791M1674M5954n3920r8709k6074
20100A19710J8034j112j3118j9592N7705L3751K7093l1171j8176N380l9539J8647
20088A57612N9367N27M589J3654N403m0949l8593j3469P2994Q053M513k0263n9455
20075A53983l7541j2907N1568J068J4150K8167M2283J2818n3792m2441K2741k8918
$$ plain form
20063 151179 150329 171246 151763 141631 167414 174988 209522 234721 224139 194319 179158 153448
20051 153448 188789 220224 208743 226870 227195 228003 164456 160760 164969 180894 170132 178901 205236
20038 205236 206911 213560 180241 175815 175492 138406 133999 178608 200755 216913 222090 209724 172374
20025 172374 169313 202548 185197 165725 184536 195787 210667 200565 163669 127624 182366 190092
20013 190092 168553 174907 175201 225185 247719 231456 204179 207691 207264 213054 218652 209247 246065
20000 246065 256581 208197 205519 224078 203218 183019 269481 274095 224275 228597 302012 311952
19988 311952 289698 261972 284990 293736 277154 312256 321299 259434 222247 244910 234768 182691
19976 182691 157495 182590 257014 348153 384940 377194 402854 403496 452138 468814 459038 447555
$$ packed form
20063A51179q50K0917j9483j0132K5783P574L4534K5199j0582k9820j5161k5710
20051A53448L5341L1435j1481J8127L25Q08o3547l696M209J5925j0762Q769K6335
20038B05236J675O649l3319m426l23l7086m407M4609K2147J6158N177j2366l7350
20025A72374l061L3235j7351j9472J8811J1251J4880j0102l6896l6045N4742P726
20013A90092k1539O354K94M9984K2534j6263k7277L512m27N790N598r405L6818
20000B46065J0516m8384k678J8559k0860k0199Q6462M614m9820M322P3415R940
19988C11952k2254k7726K3018Q746j6582L5102R043o1865l7187K2663j0142n2077
19976A82691k5196K5095P4424R1139L6787p746K5660O42M8642J6676r776j1483
$$ plain form
19964 447555 495164 552019 625126 645627 693311 763506 840210 851292 864221 906944 941714
19953 941714 993789 1048308 991337 900687 862600 885545 842832 783949 810135 803132 757736 753297
19941 753297 701450 619300 623842 634570 617852 607557 576128 601418 664014 689395 705794 688611
19929 688611 705368 737203 841456 903551 898712 944540 979690 988898 1014676 1039160 1048236 1077102
19917 1077102 1081154 1002075 977253 884744 749298 649359 631145 624700 577087 589805 585506 587677
19905 587677 577313 519735 501913 470717 425961 463365 475221 390984 334816 367377 387103
19894 387103 396006 375999 339502 321950 324606 292743 286003 277651 238912 242547 272139 252011
19882 252011 252884 281534 312006 312075 338647 375093 375316 344614 326359 346832 400677 469981 526116
$$ packed form
19964D47555M7609N6855P3107K0501M7684P0195P6704J1082J2929M2723L4770
19953I41714N2075N4519n6971r0650l8087K2945m2713n8883K6186p003m5396m439
19941G53297n1847q2150M542J0728j6718j0295l1429K5290O2596K5381J6399j7183
19929F88611J6757L1835J04253O2095m839M5828L5150R208K5778K4484R076K8866
19917A077102M052p9079k4822r2509j35446r9939j8214o445m7613J2718m299K171
19905E87677j0364n7578j7822l1196m4756L7404J1856q4237n6168L2561J9726
19894C87103Q903k0007l6497j7552K656l1863o740q352l8739L635K9592k0128
19882B52011Q73K8650L0472O9K6572L6446K23l0702j8255K0473N3845O9304N6135
$$ plain form
19869 526116 532199 513536 533060 503929 481200 486483 453331 467083 469838 445143 436950 372122
19857 372122 375877 390653 368138 357605 363832 367111 377676 367582 427214 454055 478741 469503
19845 469503 504503 529745 565651 625140 636940 611596 666790 746246 805977 825377 870628
19834 870628 987562 1041523 1052030 1087336 1158779 1152587 1171648 1254702 1304804 1277344 1250613
19823 1250613 1189528 1178810 1192515 1159404 1161134 1218747 1221115 1252687 1265511 1256757 1194568 1180636
19811 1180636 1190026 1239471 1261293 1296899 1390083 1449816 1491351 1538078 1628756 1707072 1759405
19800 1759405 1860114 1957522 1982285 2033228 2102190 2178126 2249309 2302635 2392522 2443907 2538240
19789 2538240 2675482 2793228 2817319 2804765 2820604 2892928 2913580 2983399 3054924 3141515 3216049
$$ packed form
19869E26116O083j8663J9524k9131k2729N283l3152J3752K755k4695q193o4828
19857C72122L755J4776k2515j0533O227L279J0565j0094N9632K6841K4686r238
19845D69503L5000K5242L5906N9489J1800k5344N5194P9456N9731J9400M5251
19834H70628J16934N3961J0507L5306P1443o192J9061Q3054N0102k7460k6731
19823A250613o1085j0718J3705l3111J730N7613K368L1572J2824q754o2189j3932
19811A180636R390M9445K1822L5606R3184N9733M1535M6727R0678P8316N2333
19800A759405J00709R7408K4763N0943O8962P5936P1183N3326Q9887N1385R4333
19789B538240J37242J17746K4091j2554J5839P2324K0652O9819P1525Q6591P4534
$$ plain form
19778 3216049 3289813 3371907 3463869 3493704 3522717 3617115 3699248 3803776 3903922 4036178 4128095
19767 4128095 4271128 4432965 4606439 4708163 4817967 4948146 5099213 5269025 5378931
19758 5378931 5545458 5741789 5896336 6013142 6152424 6250895 6353734 6536199 6803115 7091093
19748 7091093 7301383 7559878 7846037 8106595 8483612 8931985 9480619 10059964 10665524
19739 10665524 11204539 11667453 12112313 12615584 13257449 13935056 14534344 14937722 15237781
19730 15237781 15580250 15919704 16295361 16852641 17561214 18233828 18854984 19326214 19881199
19721 19881199 20648122 21769215 23302482 25237736 27673070 30700733 34488986 39311757
19713 39311757 45521589 53571148 64133317 78113555 96658594 120986805 152451087
$$ packed form
19778C216049P3764Q2094R1962K9835K9013R4398Q2133J04528J00146J32256R1917
19767D128095J43033J61837J73474J01724J09804J30179J51067J69812J09906
19758E378931J66527J96331J54547J16806J39282R8471J02839J82465K66916K87978
19748G091093K10290K58495K86159K60558L77017M48373N48634N79345O05560
19739A0665524N39015M62914M44860N03271O41865O77607N99288M03378L00059
19730A5237781L42469L39454L75657N57280P08573O72614O21156M71230N54985
19721A9881199P66923J121093J533267J935254K435334L027663L788253M822771
19713C9311757O209832Q049559J0562169J3980238J8545039K4328211L1464282
$$ plain form
19706 152451087 191350659 235556013 279969095 316869471 333943162 323224513 292585268
19699 292585268 258985416 235818245 226707759 230018016 241957754 255699082 260139607
19692 260139607 247948536 222569020 193810240 169326976 151067429 138141641 129300422
19685 129300422 123549823 120338847 119427705 120877281 124826447 131745569 142357807 157886598
19677 157886598 179537024 207446330 239278822 267830803 283259978 282664647 273721325
19670 273721325 267782443 272986812 292293097 325302182 367463636 405602116 420624616
19663 420624616 405822390 369405830 324642040 280891366 242702849 211926072 188325092
19656 188325092 170230005 156005294 144496140 134945241 126882784 119919215 113863225
$$ packed form
19706A52451087L8899572M4205354M4413082L6900376J7073691j0718649l0639245
19699B92585268l3599852k3167171r110486L310257J1939738J3741328M440525
19692B60139607j2191071k5379516k8758780k4483264j8259547j2925788q841219
19685A29300422n750599l210976r11142J449576L949166O919122J0612238J5528791
19677A57886598K1650426K7909306L1832492K8551981J5429175n95331q943322
19670B73721325n938882N204369J9306285L3009085M2161454L8138480J5022500
19663D20624616j4802226l6416560m4763790m3750674l8188517l0776777k3600980
19656A88325092j8095087j4224711j1509154r550899q062457o963569o055990
$$ plain form
19649 113863225 108602489 104092802 100194996 96779773 93870153 91313961 89001765 86793286
19641 86793286 84649444 82627482 80726787 78989832 77528817 76336734 75338742 74204229
19633 74204229 72660153 70660284 68340434 65890545 63460445 61137888 58963374 56748181
19625 56748181 54395627 51913758 49256710 46590920 44036830 41624988 39334181 37118093
19617 37118093 35151636 33312471 31507087 29831339 28263319 26839937 25479474 24118168
19609 24118168 22890654 21746722 20669011 19626063 18688843 17783523 16932356 16117680 15391105
19600 15391105 14711653 14031001 13356308 12727266 12108240 11501193 10952981 10429971 9951459
19591 9951459 9515215 9118876 8797183 8433569 8081462 7764069 7463497 7139415 6787902
$$ packed form
19649A13863225n260736m509687l897806l415223k909620k556192k312196k208479
19641H6793286k143842k021962j900695j736955j461015j192083r97992j134513
19633G4204229j544076j999869k319850k449889k430100k322557k174514k215193
19625E6748181k352554k481869k657048k665790k554090k411842k290807k216088
19617C7118093j966457j839165j805384j675748j568020j423382j360463j361306
19609B4118168j227514j143932j077711j042948r37220r05320q51167q14676p26575
19600A5391105o79452o80652o74693o29042o19026o07047n48212n23010m78512
19591I951459m36244l96339l21693l63614l52107l17393l00572l24082l51513
$$ plain form
19582 6787902 6526379 6229363 6003380 5787805 5519393 5286423 5141269 4950753 4696741
19573 4696741 4460328 4222544 4004210 3825137 3699047 3530707 3360275 3228958 3050656
19564 3050656 2850991 2698115 2591135 2505277 2354163 2245579 2202911 2157887 2077112 2006241
19554 2006241 1956792 1921178 1915566 1893495 1851756 1794857 1791561 1849212 1915742 1897600 1800713 1767711
19542 1767711 1779899 1811038 1797327 1845837 1929409 1935127 1899743 1817455 1749505 1714975 1674667
19531 1674667 1627208 1627246 1639026 1664515 1666826 1690523 1716126 1713567 1705108 1720641 1792634 1815568
19519 1815568 1864909 1877801 1839742 1840352 1895627 1911418 1943946 2025157 2045195 2053454 2093205 2141094
19507 2141094 2138363 2195228 2285112 2271977 2263826 2271516 2268220 2332694 2408233 2438485 2418358 2361640
$$ packed form
19582F787902k61523k97016k25983k15575k68412k32970j45154j90516k54012
19573D696741k36413k37784k18334j79073j26090j68340j70432j31317j78302
19564C050656j99665j52876j06980q5858j51114j08584m2668m5024q0775p0871
19554B006241m9449l5614n612k2071m1739n6899l296N7651O6530j8142r6887l3002
19542A767711J2188L1139j3711M8510Q3572N718l5384q2288o7950l4530m0308
19531A674667m7459L8J1780K5489K311K3697K5603k559q459J5533P1993K2934
19519A815568M9341J2892l8059O10N5275J5791L2528Q1211K0038Q259L9751M7889
19507B141094k731N6865Q9884j3135q151P690l296O4474P5539L0252k0127n6718
$$ plain form
19495 2361640 2309570 2277556 2341317 2342816 2324261 2356695 2385388 2352843 2324848 2312098 2305701 2310630
19483 2310630 2316650 2298397 2289020 2304878 2223964 2211294 2219788 2168520 2155730 2123926 2028105 1981778
19471 1981778 1985734 1895731 1855358 1837272 1779543 1775432 1784065 1722349 1705463 1719335 1703578 1619816
19459 1619816 1576140 1632846 1651802 1640702 1637674 1597857 1562673 1608675 1625054 1494853 1420098
19448 1420098 1448570 1452370 1373907 1259319 1274921 1300138 1263087 1202476 1167053 1123682 1152596
19437 1152596 1126500 1068518 1010449 971809 938534 929311 936669 915652 883934 862405 829299 802867
19425 802867 806422 798497 733533 719955 718555 726604 728650 747131 750246 739187 687226 736235 744987
19412 744987 767037 717125 711953 688924 562260 490608 468893 516597 520685 516775 547100 485632
$$ packed form
19495B361640n2070l2014O3761J499j8555L2434K8693l2545k7995j2750o397M929
19483B310630O020j8253r377J5858q0914j2670Q494n1268j2790l1804r5821m6327
19471A981778L956r0003m0373j8086n7729m111Q633o1716j6886J3872j5757q3762
19459A619816m3676N6706J8956j1100l028l9817l5184M6002J6379j30201p4755
19448A420098K8472L800p8463j14588J5602K5217l7051o0611l5423m3371K8914
19437A152596k6096n7982n8069l8640l3275r223P358k1017l1718k1529l3106k6432
19425H02867L555p925o4964j3578j400Q049K046J8481L115j1059n1961M9009Q752
19412G44987K2050m9912n172k3029j26664p1652k1715M7704M088l910L0325o1468
$$ plain form
19400 485632 489574 554731 571123 554146 511474 507150 470825 501188 541418 519984 488177 524265
19388 524265 523609 506014 501055 535192 517381 489062 510920 520271 517928 521218 488845 471413 473532
19375 473532 493455 528021 466014 475350 481649 491357 524057 608848 634703 616830 632358 615440
19363 615440 604234 562493 631703 754009 765682 725571 678604 609353 596489 644000 628859
19352 628859 626099 631880 652591 680785 670025 700064 697496 675536 654786 656149 652351 669752
19340 669752 748386 771994 727526 662154 617875 624904 606846 687244 721572 707478 635573 608033
19328 608033 686620 734627 746552 714344 662794 618975 551989 543965 605798 666985 672635 617076
19316 617076 629143 635456 702486 692845 699111 734613 820533 936728 999435 1103583 1176295 1396094
$$ packed form
19400D85632L942O5157J6392j6977m2672m324l6325L0363M0230k1434l1807L6088
19388E24265o56j7595m959L4137j7811k8319K1858R351k343L290l2373j7432K119
19375D73532J9923L4566o2007R336O299R708L2700Q4791K5855j7873J5528j6918
19363F15440j1206m1741O9210J22306J1673m0111m6967o9251j2864M7511j5141
19352F28859k760N781K0711K8194j0760L0039k568k1960k0750J363l798J7401
19340F69752P8634K3608m4468o5372m4279P029j8058Q0398L4328j4094p1905k7540
19328F08033P8587M8007J1925l2208n1550m3819o6986q024O1833O1187N650n5559
19316F17076J2067O313O7030r641O266L5502Q5920J16195O2707J04148P2712K19799
$$ plain form
19304 1396094 1620267 1722720 1775623 1842001 1879167 1854419 1790699 1678729 1645388 1651651 1707622
19293 1707622 1832929 1964241 2062142 2083838 2043145 2027659 1908508 1730758 1489960 1322734
19283 1322734 1182803 1078964 1013637 994667 992767 1003535 1030677 1123906 1182599 1219369 1318324
19272 1318324 1531887 1722930 1833072 1856887 1865611 1933094 1950308 1862028 1753326 1679449 1628961
19261 1628961 1659839 1789794 1940468 2052250 2040733 1988502 1970146 1883154 1757779 1539218
19251 1539218 1355901 1234767 1152677 1081060 1025362 1010741 968468 896811 885977 900786 846464
19240 846464 806174 800698 794483 812356 804846 835088 780416 747579 704452 607349 626854 649599
19228 649599 644246 628255 598844 608750 643387 676324 650782 615840 600877 611297 567496 593331
$$ packed form
19304A396094K24173J02453N2903O6378L7166k4748o3720j11970l3341O263N5971
19293A707622J25307J31312R7901K1696m0693j5486j19151j77750k40798j67226
19283A322734j39931j03839o5327j8970j900J0768K7142R3229N8693L6770R8955
19272A318324K13563J91043J10142K3815Q724O7483J7214q8280j08702p3877n0488
19261A628961L0878J29955J50674J11782j1517n2231j8356q6992j25375k18561
19251A539218j83317j21134q2090p1617n5698j4621m2273p1657j0834J4809n4322
19240H46464m0290n476o215J7873p510L0242n4672l2837m3127r7103J9505K2745
19228F49599n353j5991k9411R906L4637L2937k5542l4942j4963J0420m3801K5835
$$ plain form
19216 593331 605347 591751 541494 505902 521043 560832 592050 617277 594311 616341 524589
19205 524589 503846 541918 548630 495917 532370 562795 555218 551420 521526 497985 480422 427593
19193 427593 475590 473954 478707 460928 439010 441351 482915 463347 432330 418910 384827 319210
19181 319210 343673 331892 361336 372545 366119 389919 435388 422806 421070 407214 403350 431994
19169 431994 416832 406221 415853 426184 394979 303857 285435 297516 278398 308838 362859 373387
19157 373387 382061 373500 306524 307220 346881 378628 431521 469384 461686 465540 433410 357856 338769
19144 338769 392380 435580 410335 443848 438598 447883 501828 499804 489059 480283 516560 560800
19132 560800 640973 808516 988445 1230106 1490608 1865877 2048875 2067966 1985770 1843818
$$ packed form
19216E93331J2016j3596n0257l5592J5141L9789L1218K5227k2966K2030r1752
19205E24589k0743L8072O712n2713L6453L0425p577l798k9894k3541j7563n2829
19193D27593M7997j636M753j7779k1918K341M1564j9568l1017j3420l4083o5617
19181C19210K4463j1781K9444J1209o426K3800M5469j2582j736j3856l864K8644
19169D31994j5162j0611R632J0331l1205r1122j8422J2081j9118L0440N4021J0528
19157C73387Q674q561o6976O96L9661L1747N2893L7863p698L854l2130p5554j9087
19144C38769N3611M3200k5245L3513n250R285N3945k024j0745q776L6277M4240
19132E60800Q0173J67543J79929K41661K60502L75269J82998J9091q2196j41952
$$ plain form
19122 1843818 1762054 1689855 1562833 1452510 1336597 1210654 1155029 1034438 920146 884310
19112 884310 940762 1005887 1061849 1132824 1159127 1177654 1234572 1211777 1117474 1125148 1145290 1150602
19100 1150602 1200517 1280608 1346945 1469744 1625044 1784173 1891794 2008434 2135876 2313742
19090 2313742 2560189 2761580 2832202 2680633 2365882 2015965 1720410 1533972 1361088 1263437
19080 1263437 1221638 1209971 1192208 1196796 1172306 1087268 1007123 880412 825247 829154 848588
19069 848588 831076 863799 824062 812014 844867 822370 783467 806792 843317 829646 820619 763981
19057 763981 703984 653792 671107 676094 650857 683718 664396 646868 683235 686002 651480 653434
19045 653434 683282 694938 627120 568966 535927 515559 496592 550440 535032 526613 518170 513495
$$ packed form
19122A843818q1764p2199j27022j10323j15913j25943n5625j20591j14292l5836
19112H84310N6452O5125N5962P0975K6303J8527N6918k2795r4303P674K0142N312
19100A150602M9915Q0091O6337J22799J55300J59129J07621J16640J27442J77866
19090B313742K46447K01391P0622j51569l14751l49917k95555j86438j72884r7651
19080A263437m1799j1667j7763M588k4490q5038q0145j26711n5165L907J9434
19069H48588j7512L2723l9737j2048L2853k2497l8903K3325L6525j3671r027n6638
19057G63981n9997n0192J7315M987k5237L2861j9322j7528L6367K767l4522J954
19045F53434K9848J1656o7818n8154l3039k0368j8967N3848j5408q419q443m675
$$ plain form
19033 513495 576048 552993 587471 608632 627662 639442 670295 717237 754633 836849 907808
19022 907808 1000350 1068816 1127615 1145943 1176964 1195496 1170567 1130764 1108596 1027031 952160
19011 952160 933080 922365 889285 869971 866654 853100 826870 769462 647112 595257 585551 595013
18999 595013 621973 700798 765717 743840 726142 742540 815229 906423 927563 929502 916928 930084
18987 930084 972055 1012105 1048706 1044686 1038370 1087553 1119932 1127126 1096444 1084964 1100619 1030641
18975 1030641 868484 789732 744168 605616 577852 620488 607966 556317 556206 607272 600669
18964 600669 528109 525035 521481 483560 436475 412014 413101 441404 414018 390483 393077 413972
18952 413972 418758 431452 446973 446475 409785 398982 370666 355897 338017 305813 319654 373547
$$ packed form
19033E13495O2553k3055L4478K1161J9030J1780L0853M6942L7396Q2216P0959
19022I07808R2542O8466N8799J8328L1021J8532k4929l9803k2168q1565p4871
19011I52160j9080j0715l3080j9314l317j3554k6230n7408j22350n1855r706R462
18999E95013K6960P8825O4919k1877j7698J6398P2689R1194K1140J939j2574J3156
18987I30084M1971M0050L6601m020o316M9183L2379P194l0682j1480J5655o9978
18975A030641j62157p8752m5564j38552k7764M2636j2522n1649j11N1066o603
18964F00669p2560l074l554l7921m7085k4461J087K8303k7386k3535K594K0895
18952D13972M786J2694J5521m98l6690j0803k8316j4769j7880l2204J3841N3893
$$ plain form
18940 373547 475105 494423 480994 464891 407212 387933 429072 483284 517237 547574 547401 525758
18928 525758 532253 491617 482043 480838 406250 337781 315319 349509 414666 452166 417920 396390
18916 396390 379786 378779 372163 418697 474561 503161 517116 524341 488239 538533 637850 716502
18904 716502 685140 664959 702197 757511 828041 870457 916266 926817 990232 1006248 1055738
18893 1055738 1161512 1244185 1289935 1259516 1214179 1228937 1237185 1235203 1181977 1154043 1158667 1110883
18881 1110883 1123180 1148009 1131882 1156749 1205450 1249888 1228086 1250794 1264649 1279425 1317502
18870 1317502 1334512 1339011 1374836 1402684 1447602 1546752 1632591 1743368 1859146 1968770 2045605
18859 2045605 2118769 2176442 2227002 2345247 2412828 2492979 2509420 2527518 2625560 2715902 2755997
$$ packed form
18940C73547J01558J9318j3429j6103n7679j9279M1139N4212L3953L0337j73k1643
18928E25758O495m0636r574j205p4588o8469k2462L4190O5157L7500l4246k1530
18916C96390j6604j007o616M6534N5864K8600J3955P225l6102N0294R9317P8652
18904G16502l1362k0181L7238N5314P0530M2416M5809J0551O3415J6016M9490
18893A055738J05774Q2673M5750l0419m5337J4758Q248j982n3226k7934M624m7784
18881A110883J2297K4829j6127K4867M8701M4438k1802K2708J3855J4776L8077
18870A317502J7010M499L5825K7848M4918R9150Q5839J10777J15778J09624P6835
18859B045605P3164N7673N0560J18245O7581Q0151J6441J8098R8042R0342M0095
$$ plain form
18848 2755997 2822584 2843643 2859171 2920496 3023745 3134574 3187142 3191172 3249278 3342146 3358049
18837 3358049 3396274 3461217 3606663 3718108 3783763 3867329 3978562 4096513 4217041 4344540
18827 4344540 4469026 4573773 4721357 4873818 5028747 5167254 5316918 5465670 5557832 5662871
18817 5662871 5739910 5814919 5950294 6137718 6293755 6382207 6522110 6718443 6862644 6980284
18807 6980284 7165701 7325156 7485279 7693471 7843517 8057273 8261175 8440770 8703472
18798 8703472 8991517 9295753 9630068 9994013 10306545 10720599 11119109 11579672 12141161
18789 12141161 12757953 13471862 14276878 15127739 16034667 17148555 18452000 20027784 21845575
18780 21845575 24026924 26826550 30406026 35059100 40988402 48499121 58022277 70441665
$$ packed form
18848B755997O6587K1059J5528O1325J03249J10829N2568M030N8106R2868J5903
18837C358049L8225O4943J45446J11445O5655Q3566J11233J17951J20528J27499
18827D344540J24486J04747J47584J52461J54929J38507J49664J48752R2162J05039
18817E662871P7039P5009J35375J87424J56037Q8452J39903J96333J44201J17640
18807F980284J85417J59455J60123K08192J50046K13756K03902J79595K62702
18798H703472K88045L04236L34315L63945L12532M14054L98510M60563N61489
18789A2141161O16792P13909Q05016Q50861R06928J113888J303445J575784J817791
18780B1845575K181349K799626L579476M653074N929302P510719R523156J2419388
$$ plain form
18772 70441665 87037493 109758353 141055285 183271035 236494023 294806548 350498599
18765 350498599 391198930 393232539 355620797 301462236 258242467 236647278 234457419
18758 234457419 247727879 270907328 290832214 288847622 261806075 223052343 188414276
18751 188414276 163669404 147032402 135878720 128484727 124103400 122009347 121891611 123781373
18743 123781373 128205655 135647949 147320374 165259550 191430753 226051473 264905943
18736 264905943 293083174 296205903 279894167 260896608 254052251 264320837 292359939
18729 292359939 337083622 391425782 429893394 428905267 393648565 342471281 292202769
18722 292202769 248336305 213504468 187710055 168823053 154576151 143278532 133890536
$$ packed form
18772G0441665J6595828K2720860L1296932M2215750N3222988N8312525N5692051
18765C50498599M0700331K033609l7611742n4158561m3219769k1595189k189859
18758B34457419J3270460K3179449J9924886j984592k7041547l8753732l4638067
18751A88414276k4744872j6637002j1153682p393993m381327k094053j17736J889762
18743A23781373M424282P442294J1672425J7939176K6171203L4620720L8854470
18736B64905943K8177231L122729j6311736j8997559o844357J0268586K8039102
18729B92359939M4723683N4342160L8467612r88127l5256702n1177284n0268512
18722B92202769m3866464l4831837k5794413j8887002j4246902j1297619r387996
$$ plain form
18715 133890536 125634758 118282502 111790067 106088257 101228398 97056534 93382517 90135882
18707 90135882 87243479 84642168 82312803 79931350 77383904 74882862 72597463 70666533
18699 70666533 69092105 67778095 66760457 65670670 64060311 61954165 59656656 57317462
18691 57317462 55085791 52965613 51051227 49246265 47318612 45191024 42952005 40676320
18683 40676320 38479303 36325572 34245431 32304524 30487575 28792488 27169512 25651494
18675 25651494 24276192 22964964 21697744 20560029 19466199 18409134 17443148 16549890
18667 16549890 15633505 14794638 14017339 13289100 12567916 11924344 11344839 10831046 10311586
18658 10311586 9812395 9266699 8783188 8359440 8029398 7628812 7269695 6979234 6658028
$$ packed form
18715A33890536q255778p352256o492435n701810m859859m171864l674017l246635
18707I0135882k892403k601311k329365k381453k547446k501042k285399j930930
18699G0666533j574428j314010j017638j089787j610359k106146k297509k339194
18691E7317462k231671k120178j914386j804962j927653k127588k239019k275685
18683D0676320k197017k153731k080141j940907j816949j695087j622976j518018
18675B5651494j375302j311228j267220j137715j093830j057065r65986q93258
18667A6549890r16385q38867p77299p28239p21184o43572n79505n13793n19460
18658A0311586m99191n45696m83511m23748l30042m00586l59117k90461l21206
$$ plain form
18649 6658028 6305191 5984075 5750544 5554879 5335906 5128385 4908185 4723012 4588809
18640 4588809 4402725 4162425 4001661 3815419 3575165 3365966 3172618 3006080 2842365
18631 2842365 2671650 2521086 2427238 2355567 2215837 2015641 1837545 1727726 1592954 1516592
18621 1516592 1499768 1464485 1427873 1358821 1322791 1304412 1271183 1264833 1206918 1196449 1244842
18610 1244842 1275092 1287569 1370001 1367356 1336783 1345207 1304170 1309543 1366078 1401089 1478666 1515418
18598 1515418 1510377 1457356 1372516 1318594 1294233 1244099 1257237 1284870 1364669 1462770 1508044
18587 1508044 1511270 1534525 1552404 1557504 1577950 1606515 1619700 1635897 1685987 1735154 1764175 1774580
18575 1774580 1804024 1812142 1826440 1871121 1908675 1929397 1939783 1941989 1946135 1960019 1998903 2010044
$$ packed form
18649F658028l52837l21116k33531j95665k18973k07521k20200j85173j34203
18640D588809j86084k40300j60764j86242k40254k09199j93348j66538j63715
18631B842365j70715j50564r3848p1671j39730k00196j78096j09819j34772p6362
18621A516592j6824l5283l6612o9052l6030j8379l3229o350n7915j0469M8393
18610A244842L0250J2477Q2432k645l0573Q424m1037N373N6535L5011P7577L6752
18598A515418n041n3021q4840n3922k4361n0134J3138K7633P9799R8101M5274
18587A508044L226K3255J7879N100K0446K8565J3185J6197N0090M9167K9021J0405
18575A774580K9444Q118J4298M4681L7554K0722J0386K206M146J3884L8884J1141
$$ plain form
18563 2010044 2012260 2009786 2050832 2080665 2069479 2057293 2019937 1971088 2013359 2050039 2102956 2123845
18551 2123845 2139158 2142567 2144614 2080280 2090870 2135055 2138186 2108604 2077339 2022370 1996816 2006704
18539 2006704 2003824 1923158 1797104 1746727 1720741 1681459 1643328 1599925 1553139 1552650 1540618 1523886
18527 1523886 1434489 1348890 1319230 1337100 1322380 1223746 1203043 1268364 1309436 1255468 1262404
18516 1262404 1267726 1237853 1241198 1234631 1217189 1179519 1174938 1134617 1059044 1032258 995552 906069
18504 906069 881170 858697 857026 862944 806282 772222 750791 734967 690990 665200 635969 640083
18492 640083 654360 648748 617812 536586 523848 515629 467174 486300 461577 455788 472231 458426
18480 458426 470251 529490 511247 473661 476902 435371 403918 441813 437613 414346 405441 413130
$$ packed form
18563B010044K216k474M1046K9833j1186j2186l7356m8849M2271L6680N2917K0889
18551B123845J5313L409K047o4334J0590M4185L131k9582l1265n4969k5554R888
18539B006704k880q0666j26054n0377k5986l9282l8131m3403m6786m89j2032j6732
18527A523886q9397q5599k9660J7870j4720r8634k0703O5321M1072n3968O936
18516A262404N322k9873L345o567j7442l7670m581m0321p5573k6786l6706q9483
18504I06069k4899k2473j671N918n6662l4060k1431j5824m3977k5790k9231M114
18492F40083J4277n612l0936q1226j2738q219m8455J9126k4723n789J6443j3805
18480D58426J1825N9239j8243l7586L241m1531l1453L7895m200k3267q905P689
$$ plain form
18468 413130 396606 382078 329074 299848 308942 300479 289809 296903 318803 309802 329443 304263
18456 304263 287510 289804 310547 293058 311636 300748 290839 285145 285198 264898 229923 241337 246946
18443 246946 287121 290206 265826 275289 287321 304062 293524 302553 314730 298408 351299 421671
18431 421671 400109 421053 419448 387655 354537 377728 378187 316311 324964 334351 354323 421470
18419 421470 418150 450650 509704 563163 560931 543102 512143 482409 470975 496842 528345 527159
18407 527159 541041 528173 496000 471436 441062 465327 494987 524067 477324 472619 478361 473047
18395 473047 473263 433027 385063 355180 348887 361108 381965 418188 485199 476941 513747 537329
18383 537329 533152 491367 441651 444261 465660 439379 388966 383104 349673 348195 353427 336425
$$ packed form
18468D13130j6524j4528n3004k9226R094q463j0670P094K1900r001J9641k5180
18456C04263j6753K294K0743j7489J8578j0888r909n694N3k0300l4975J1414N609
18443B46946M0175L085k4380R463J2032J6741j0538R029J2177j6322N2891P0372
18431D21671k1562K0944j605l1793l3118K3191M59o1876Q653R387J9972O7147
18419D21470l320L2500N9054N3459k232j7829l0959k9734j1434K5867L1503j186
18407E27159J3882j2868l2173k4564l0374K4265K9660K9080m6743m705N742n314
18395D73047K16m0236m7964k9883o293J2221K0857L6223O7011q258L6806K3582
18383E37329m177m1785m9716K610K1399k6281n0413n862l3431j478N232j7002
$$ plain form
18371 336425 343415 349711 375354 420186 412079 336907 321760 338331 339376 327893 349885 365723
18359 365723 329819 324075 294390 216581 223761 229281 265348 269027 224417 197847 201655 145160
18347 145160 106040 104308 72972 64671 82778 120772 115035 70839 53293 74468 76636 52160
18335 52160 67686 106645 128250 123375 116745 176656 185355 138866 73514 88910 75473 59197
18323 59197 131572 138688 76247 32544 95813 150906 127041 174290 166354 189388 175523 157696
18311 157696 109417 96587 135423 126938 138786 185852 155769 143242 193662 239089 219844 165300
18299 165300 117159 83957 90856 152973 138609 161302 174623 190456 202661 201015 208744 245717
18287 245717 233773 209161 176290 179684 208548 238532 226204 213952 251941 247423 241802 249865
$$ packed form
18371C36425O990O296K5643M4832q107p5172j5147J6571J045j1483K1992J5838
18359C65723l5904n744k9685p7809P180N520L6067L679m4610k6570L808n6495
18347A45160l9120j732l1336q301J8107L7994n737m4196j7546K1175K168k4476
18335E2160J5526L8959K1605m875o630N9911Q699m6489o5352J5396j3437j6276
18323E9197P2375P116o2441m3703O3269N5093k3865M7249p936K3034j3865j7827
18311A57696m8279j2830L8836q485J1848M7066l0083j2527N0420M5427j9245n4544
18299A65300m8141l3202O899O2117j4364K2693J3321J5833J2205j646P729L6973
18287B45717j1944k4612l2871L394K8864K9984j2328j2252L7989m518n621Q063
$$ plain form
18275 249865 245203 206274 183884 186372 235167 277764 298086 228621 245807 269688 227899 209392
18263 209392 219868 226330 229988 190359 180030 209826 204189 170364 177826 216825 227177 243752
18251 243752 242936 254746 300102 277433 225134 203194 215627 253114 289051 318635 319147 289063
18239 289063 301295 334955 390604 512450 667599 782646 928574 1097327 1270804 1420159
18229 1420159 1481440 1515216 1542962 1563718 1542893 1438390 1360472 1301882 1351614 1477145 1606927
18218 1606927 1708119 1651121 1621281 1617892 1564744 1429253 1285938 1154005 1038058 932195
18208 932195 892076 839727 745919 741332 777530 815484 886265 969056 1101175 1241239 1433903
18197 1433903 1619979 1726647 1765133 1783655 1803642 1732864 1635093 1530885 1578695 1654466 1747194
$$ packed form
18275B49865m662l8929k2390K488M8795M2597K0322o9465J7186K3881m1789j8507
18263B09392J0476O462L658l9629j0329K9796n637l3825P462L8999J0352J6575
18251B43752q16J1810M5356k2669n2299k1940J2433L7487L5937K9584N12l0084
18239B89063J2232L3660N5649J21846J55149J15047J45928J68753J73477J49355
18229A420159O1281L3776K7746K0756k0825j04503p7918n8590M9732J25531J29782
18218A606927J01192n6998k9840l389n3148j35491j43315j31933j15947j05863
18208I32195m0119n2349r3808m587L6198L7954P0781Q2791J32119J40064J92664
18197A433903J86076J06668L8486J8522J9987p0778r7771j04208M7810P5771R2728
$$ plain form
18186 1747194 1898803 1988857 2013084 1988394 1959404 1891037 1720208 1562810 1437186 1242219
18176 1242219 1111030 1057893 1017228 942805 904851 931301 869494 855537 858656 825292 846801
18165 846801 838173 845754 846548 818553 795598 744794 717248 770381 767692 701087 708174 686391 717953
18152 717953 718293 735236 773220 770974 784036 772995 749510 722628 740528 765545 732663 767355
18140 767355 809824 832875 886574 891986 864108 897516 956570 1014384 1064398 1112644 1059051 1074851
18128 1074851 1159161 1300907 1473931 1699550 1878390 2114839 2456052 2854828 3338791 3953667
18118 3953667 4788666 5882321 7360151 9345840 12109227 16084133 21925321 30090972
18110 30090972 40631270 51528655 56320193 51623314 41228932 30963994 23825386
$$ packed form
18186A747194J51609R0054K4227k4690k8990o8367j70829j57398j25624j94967
18176A242219j31189n3137m0665p4423l7954K6450o1807j3957L119l3364K1509
18165H46801q628P581P94k7995k2955n0804k7546N3133k689o6605P087k1783L1562
18152G17953L40J6943L7984k246J3062j1041k3485k6882J7900K5017l2882L4692
18140G67355M2469K3051N3699N412k7878L3408N9054N7814N0014M8246n3593J5800
18128A074851Q4310J41746J73024K25619J78840K36449L41213L98776M83963O14876
18118C953667Q34999J093655J477830J985689K763387L974906N841188Q165651
18110C0090972J0540298J0897385M791538m696879j0394382j0264938p138608
$$ plain form
18103 23825386 19198304 16107390 13949655 12401225 11234695 10266507 9465013 8815281
18095 8815281 8219373 7719557 7351850 7011809 6705243 6455882 6274702 6100708 5926113
18086 5926113 5746733 5628746 5535668 5472967 5393050 5329275 5283051 5365591 5415086 5425718 5393248
18075 5393248 5251284 5067067 4882867 4761533 4661729 4526085 4378215 4235454 4033169 3790166
18065 3790166 3581792 3393543 3181164 2951126 2768852 2607882 2437346 2300179 2181890
18056 2181890 2062854 1914339 1788844 1725278 1596504 1482371 1407179 1370143 1342830 1282704
18046 1282704 1170310 1090039 1005254 967691 961178 906049 862602 820067 772655 692516 645887
18035 645887 658828 598759 525779 497514 487559 479003 463768 439277 456782 471666 426601 408968
$$ packed form
18103B3825386m627082l090914k157735j548430j166530r68188q01494o49732
18095H815281n95908m99816l67707l40041l06566k49361j81180j73994j74595
18086E926113j79380j17987r3078o2701p9917o3775m6224Q2540M9495J0632l2470
18075E393248j41964j84217j84200j21334r9804j35644j47870j42761k02285k43003
18065C790166k08374j88249k12379k30038j82274j60970j70536j37167j18289
18056B181890j19036j48515j25495o3566j28774j14133p5192l7036k7313o0126
18046A282704j12394q0271q4785l7563o513n5129m3447m2535m7412q0139m6629
18035F45887J2941o0069p2980k8265r955q556j5235k4491J7505J4884m5065j7633
$$ plain form
18023 408968 433660 411527 350420 327015 309954 296353 261741 239171 237322 225527 224210 208305
18011 208305 215353 203184 172856 154552 173377 161483 134045 170596 145566 70571 63298 70862
17999 70862 80579 111243 118757 126319 135958 157169 179870 167418 130201 81609 67230 78716
17987 78716 108473 99658 83613 56187 94575 75018 11241 10558 22570 39568 14970 2977
17975 2977 -13716 15802 62444 32145 33010 27609 -8707 45223 77394 74999 90604 43281 -17258
17962 -17258 16320 10913 11280 74875 73761 74245 95652 122976 129025 122103 156486 144649 99059
17949 99059 54627 27734 65755 146440 160740 116869 121783 85549 84442 83356 91793 49392
17937 49392 16888 15117 52560 95189 107666 92077 99872 124331 139078 144350 109489 65743
$$ packed form
18023D08968K4692k2133o1107k3405j7061j3601l4612k2570j849j1795j317j5905
18011B08305P048j2169l0328j8304J8825j1894k7438L6551k5030p4995p273P564
17999G0862R717L0664P514P562R639K1211K2701j2452l7217m8592j4379J1486
17987G8716K9757q815j6045k7426L8388j9557o3777o83J2012J6998k4598j1993
17975B977j6693K9518M6642l0299Q65n401l6316N3930L2171k395J5605m7323o0539
17962a7258L3578n407L67O3595j114M84K1407K7324O049o922L4383j1837m5590
17949I9059m4432k6893L8021Q0685J4300m3871M914l6234j107j086Q437m2401
17937D9392l2504j771L7443M2629J2477j5589P795K4459J4747N272l4861m3746
$$ plain form
17925 65743 75747 81651 60352 34240 48082 131482 105603 124420 147200 117781 116983 140671
17913 140671 143593 130173 112668 145348 128086 65525 60962 103777 135115 134379 116386 79522
17901 79522 80095 97267 88812 71918 47862 12065 7984 54857 136099 119910 110906 118001 106019
17888 106019 98765 66675 93638 101834 54525 43784 59677 77162 69592 27829 15259 24944
17876 24944 24294 -3913 36179 145679 213627 143209 79869 67133 57516 73396 76656 78114
17864 78114 99943 102360 79312 53594 61133 70445 133287 122984 71409 16619 37145 6039
17852 6039 -49833 -53064 -35590 -9632 -12605 -61330 -95726 -96014 -71641 -19978 -5073 -43294 -26505
17839 -26505 -19682 1396 -12809 -23711 25401 74127 55152 31040 2087 57930 101123 64839
$$ packed form
17925F5743J0004N904k1299k6112J3842Q3400k5879J8817K2780k9419p98K3688
17913A40671K922j3420j7505L2680j7262o2561m563M2815L1338p36j7993l6864
17901G9522N73J7172q455j6894k4056l5797m081M6873Q1242j6189r004P095j1982
17888A06019p254l2090K6963Q196m7309j0741J5893J7485p570m1763j2570R685
17876B4944o50k8207M0092J09500O7948p0418o3340j2736r617J5880L260J458
17864G8114K1829K417k3048k5718P539R312O2842j0303n1575n4790K0526l1106
17852F039n5872l231J7474K5958k973m8725l4396k88K4373N1663J4905l8221J6789
17839b6505O823K1078j4205j0902M9112M8726j8975k4112k8953N5843M3193l6284
$$ plain form
17827 64839 46996 84724 48110 -2166 -72271 -107921 -55290 14710 42536 60597 69507 9261
17815 9261 -79062 -126894 -137949 -112384 -35156 15741 -14851 -14587 1261 40466 17235 4337
17803 4337 11694 14517 66499 79987 53632 26280 21517 -358 -20587 -16279 33871 33289 56560
17790 56560 82383 79065 89341 74987 32911 -34669 -83573 -104730 -72921 -75070 -88814 -38897
17778 -38897 -69377 -28334 33528 80020 82642 51233 18449 12695 7206 10927 13044 52661 75693
17765 75693 81686 20553 -40164 -29534 -47878 -109483 -75576 -18385 14478 57715 67022 77836
17753 77836 47959 60321 -2315 -24179 21477 55783 31451 -19646 -31473 -4151 22193 19015
17741 19015 14826 -21387 -17497 24414 48370 76651 65144 63021 9546 -14167 -3522 20691
$$ packed form
17827F4839j7843L7728l6614n0276p0105l5650N2631P0000K7826J8061Q910o0246
17815I261q8323m7832j1055K5565P7228N0897l0592K64J5848L9205k3231j2898
17803D337P357K823N1982J3488k6355k7352m763k1875k0229M308N0150n82K3271
17790E6560K5823l318J0276j4354m2076o7580m8904k1157L1809k149j3744M9917
17778c8897l0480M1043O1862M6492K622l1409l2784n754n489L721K117L9617K3032
17765G5693N993o1133o0717J0630j8344o1605L3907N7191L2863M3237R307J0814
17753G7836k9877J2362o2636k1864M5656L4306k4332n1097j1827K7322K6344l178
17741A9015m189l6213L890M1911K3956K8281j1507k123n3475k3713J0645K4213
$$ plain form
17729 20691 42007 45678 -23932 -51240 29094 4133 -78747 -20307 17259 8097 60933 18830
17717 18830 -10040 -26488 -5321 12774 -32296 -75427 -96415 -30148 3894 -211 -40054 -19761
17705 -19761 1881 10195 32837 15731 9140 -44584 9158 43729 90460 86058 76302 79402 25174
17692 25174 49480 56496 77097 127804 131809 68932 -5936 -32137 -12199 40607 13288 -12155
17680 -12155 -7365 -11442 -15737 -34564 -47596 -54215 -57959 -25633 -8848 8312 46923 90773 38113
17667 38113 32983 62642 52840 48573 475 29134 20137 15578 -19982 -37536 -77344 -110867 -51997
17654 -51997 -53934 -29550 -5843 28330 41423 67964 23627 -16594 -7270 3559 23746 21922
17642 21922 42455 53155 53479 -12602 -23809 -54055 -67155 -40111 -50516 -68512 -87369 -100401
$$ packed form
17729B0691K1316L671o9610k7308Q0334k4961q2880N8440L7566r162N2836m2103
17717A8830k8870j6448K1167J8095m5070m3131k0988O6267L4042m105l9843K0293
17705a9761K1642Q314K2642j7106o591n3724N3742L4571M6731m402r756L100n4228
17692B5174K4306P016K0601N0707M005o2877p4868k6201J9938N2806k7319k5443
17680a2155M790m077m295j8827j3032o619l744L2326J6785J7160L8611M3850n2660
17667C8113n130K9659r802m267m8098K8659q997m559l5560j7554l9808l3523N8870
17654e1997j937K4384K3707L4173J3093K6541m4337m0221R324J0829K0187j824
17642B1922K0533J0700L24o6081j1207l0246j3100K7044j0405j7996j8857j3032
$$ plain form
17630 -100401 -91919 -99494 -102942 -53694 -40297 -18162 -47109 -30556 -41666 -35859 -50176 -57218
17618 -57218 19926 56017 61780 66480 66369 29030 -59289 -32786 -6406 -3203 -2634 31709 24769
17605 24769 6366 -11500 4858 -8948 -17074 -6405 -3299 -21657 -10611 13364 770 -19808
17593 -19808 24764 32992 50330 28294 -8498 -50093 -94405 -78536 -66526 -50936 -41643 -8634
17581 -8634 9365 11897 -7623 1014 24308 -13585 2968 -26223 -62812 -16192 -23533 -64013
17569 -64013 -50678 -4018 10346 -10157 5330 -4455 36379 38388 15293 -24246 -76252 -72955
17557 -72955 31726 1264 -64102 -111038 -33611 16836 29109 31095 25964 -3007 -45534 -49295
17545 -49295 -32307 -45178 -51649 -80466 -107714 -84191 -46723 5640 19430 28214 36015 -44367
$$ packed form
17630a00401Q482p575l448M9248J3397K2135k8947J6553j1110N807j4317p042
17618e7218P7144L6091N763M700j11l7339q8319K6503K6380L203N69L4343o940
17605B4769j8403j7866J6358j3806q126J0669L106j8358J1046K3975j2594k0578
17593a9808M4572Q228J7338k2036l6792m1595m4312J5869J2010J5590R293L3009
17581h634J7999K532j9520Q637K3294l7893J6553k9191l6589M6620p341m0480
17569f4013J3335M6660J4364k0503J5487r785M0834K009k3095l9539n2006L297
17557g2955J04681l0462o5366m6936P7427N0447J2273J986n131k8971m2527l761
17545d9295J6988j2871o471k8817k7248K3523L7468N2363J3790Q784P801q0382
$$ plain form
17533 -44367 -43714 -36727 -40686 2137 -13202 8986 -11516 -41409 -13170 -34474 -58305 -39566
17521 -39566 -37359 -24485 -7774 -20949 12252 -27352 -34050 -11454 -20363 1918 39765 28434
17509 28434 22286 -1575 -13781 -8243 -24643 -21300 -28788 -27738 -20151 -14766 4971 -10445 -23958
17496 -23958 -71749 -46957 408 -23253 -35292 -2516 -32392 -74159 -67887 -90493 -90203 -52105
17484 -52105 -75015 -66921 -71841 -32899 -43836 -72307 -64106 -57049 -49053 -8230 -6092 -8214 -4730
17471 -4730 22534 -17270 -6821 27662 -10942 -44806 -81836 -53571 -47162 -37003 -49009 -69034
17459 -69034 -64945 -55553 -12484 29481 -30134 -46903 -59460 -63994 -76680 -56759 -16118 68487
17447 68487 111090 151057 236563 246399 204194 281585 284161 248717 256742 231886 179129 78734
$$ packed form
17533d4367O53O987l959M2823j5339K2188k0502k9893K8239k1304k3831J8739
17521c9566K207J2874J6711j3175L3201l9604o698K2596q909K2281L7847j1331
17509B8434o148k3861j2206N538j6400L343p488J050P587N385J9737j5416j3513
17496b3958m7791K4792M7365k3661j2039L2776k9876m1767O272k2606K90L8098
17484e2105k2910Q094m920L8942j0937k8471Q201P057P996M0823K138k122L484
17471d730K7264l9804J0449L4483l8604l3864l7030K8265O409J0159j2006k0025
17459f9034M089R392M3069M1965n9615j6769j2557m534j2686J9921M0641Q4605
17447F8487M2603L9967Q5506R836m2205P7391K576l5444Q025k4856n2757j00395
$$ plain form
17435 78734 51008 70108 70123 64313 99558 112584 91062 53548 42654 30585 -3021 -71785
17423 -71785 -50240 -48947 -10466 38326 39978 20222 8473 -629 21356 17959 44947 22724
17411 22724 -43685 -5842 34967 92137 110243 57725 41698 17035 47610 48811 -743 -20079
17399 -20079 -16589 23162 -8567 -39977 -35935 -9568 33342 42768 41711 61254 58396 -1349 -41704
17386 -41704 -65249 -81997 -100246 -56876 -7326 26852 49553 24759 -7705 11818 -1927 -34524
17374 -34524 -37119 -57288 -64819 -20212 62893 95486 84585 44788 37675 57102 -4750 -31349
17362 -31349 17192 45291 -5923 -87329 -118452 -97046 -40950 -23250 9579 28745 18511 -51169
17350 -51169 -83384 -81860 -53764 -34711 -2035 -10875 -19050 -20134 -13611 -16281 -101850 -147126 -112322
$$ packed form
17435G8734k7726J9100J5n810L5245J3026k1522l7514j0894j2069l3606o8764
17423g1785K1545J293L8481M8792J652j9756j1749r102K1985l397K6988k2223
17411B2724o6409L7843M0809N7170J8106n2518j6027k4663L0575J201m9554j9336
17399b0079L490L9751l1729l1410M042K6367M2910R426j057J9543k858n9745m0355
17386d1704k3545j6748j8249M3370M9550L4178K2701k4794l2464J9523j3745l2597
17374c4524k595k0169p531M4607Q3105L2593j0901l9797p113J9427o1852k6599
17362c1349M8541K8099n1214q1406l1123K1406N6096J7700L2829J9166j0234o9680
17350e1169l2215J524K8096J9053L2676q840q175j084O523k670q5569m5276L4804
$$ plain form
17337 -112322 -22076 -13321 3121 2968 -91779 -127121 -112429 -87027 -53806 -25230 -53812 -47895
17325 -47895 -44232 -83425 -86128 -39098 -43414 -33899 -5134 -12914 -47586 -75454 -112395 -119551 -76221
17312 -76221 -4119 -27530 -48167 -22956 -3801 -34981 -38883 -22918 16648 19720 30316 -2767
17300 -2767 -23804 30971 619 -69963 -55893 -47826 -11452 19703 -20422 -3397 -25260 -33165
17288 -33165 48422 72464 37352 -9572 -15367 -6807 -18286 -3431 9191 -8982 -9421 1945
17276 1945 28590 27560 -7050 -17994 20696 33788 32287 16972 27461 9191 -8672 16866
17264 16866 38612 45101 39648 109347 77449 49905 -9130 -30750 -6747 -49452 -72724 -41167
17252 -41167 12555 43344 42579 43093 15690 19535 58867 71057 -12362 -80649 -29030 31241 10847
$$ packed form
17337a12322R0246Q755J6442j53r4747l5342J4692K5402L3221K8576k8582N917
17325d7895L663l9193k703M7030m316R515K8765p780l4672k7868l6941p156M3330
17312g6221P2102k3411k0637K5211J9155l1180l902J5965L9566L072J0596l3083
17300b767k1037N4775l0352p0582J4070Q067L6374L1155m0125J7025k1863p905
17288c3165Q1587K4042l5112m6924n795Q560j1479J4855J2622j8173m39J1366
17276A945K6645j030l4610j0944L8690J3092j501j5315J0489j8270j7863K5538
17264A6866K1746O489n453O9699l1898k7544n9035k1620K4003m2705k3272L1557
17252d1167N3722L0789p65N14k7403L845L9332J2190q3419o8287N1619O0271k0394
$$ plain form
17239 10847 -27692 -56833 -36905 -1588 46036 26699 -11343 -12280 2844 -4990 52660 66242
17227 66242 56252 9795 -46493 -81104 -104332 -104509 -132495 -104296 -87894 -65065 -42687 -43355 -55301
17214 -55301 -72097 -29673 -1608 332 -11924 -28104 -3972 22433 -16154 -15606 -373 2820
17202 2820 -8587 -33222 -4410 9908 -9495 -47681 -7022 14737 -11385 -16331 -22286 -53947
17190 -53947 -105204 -91171 -9663 -24989 -1031 21779 -17478 -18395 -76341 -103655 -38523 -32954
17178 -32954 -62125 -55877 -66042 -49802 -31708 -21991 -69055 -25297 53247 69575 86039 111518
17166 111518 78369 32863 -15542 -54223 -69088 -29098 -22327 -14147 -3666 -17209 -55575 -28793
17154 -28793 30629 26859 14307 24340 9663 21283 4034 18253 -31086 -81987 -32038 -26706
$$ packed form
17239A0847l8539k9141J9928L5317M7624j9337l8042r37J5124p834N7650J3582
17227F6242r990m6457n6288l4611k3228j77k7986K8199J6402K2829K2378o68j1946
17214e5301j6796M2424K8065J940j2256j6180K4132K6405l8587N48J5233L193
17202B820j1407k4635K8812J4318j9403l8186M0659K1759k6122m946n955l1661
17190e3947n1257J4033Q1508j5326K3958K2810l9257r17n7946k7314O5132N569
17178c2954k9171O248j0165J6240J8094R717m7064M3758P8544J6328J6464K5479
17166A11518l3149m5506m8405l8681j4865L9990O771Q180J0481j3543l8366K6782
17154b8793N9422l770j2552J0033j4677J1620j7249J4219m9339n0901M9949N332
$$ plain form
17142 -26706 -38450 -17326 -38051 -70594 -46824 -16776 -63882 -7657 51820 40671 -11922 -31406
17130 -31406 23613 54082 11227 -6220 -13729 -32775 -49211 -63034 -83791 -110488 -50650 -44644
17118 -44644 -14431 13674 1420 34651 12384 -30386 -62055 -24966 -9844 -72204 -94630 -125275
17106 -125275 -114704 -41230 -16044 -52225 -65513 -112035 -144162 -122831 -95476 -56094 -9582
17095 -9582 4843 21700 -12012 -47961 -65412 -52345 -92558 -102277 -30179 11892 -1309 14966
17083 14966 -50154 -95270 -86731 -71379 -103894 -62151 26896 44769 12682 29652 27524 33286
17071 33286 4035 3599 50946 68572 27651 25649 19158 25812 -18674 2981 44133 33757 48165
17058 48165 71641 84000 96517 72381 43845 60771 64565 42572 45561 -36783 -94232 -68478
$$ packed form
17142b6706j1744K1124k0725l2543K3770L0048m7106N6225N9477j1149n2593j9484
17130c1406N5019L0469m2855j7447p509j9046j6436j3823k0757k6697N9838O006
17118d4644L0213K8105j2254L3231k2267m2770l1669L7089J5122o2360k2426l0645
17106a25275J0571P3474K5186l6181j3288m6522l2127K1331K7355L9382M6512
17095i582J4425J6857l3712l5949j7451J3067m0213r719P2098M2071j3201J6275
17083A4966o5120m5116Q539J5352l2515M1743Q9047J7873l2087J6970k128N762
17071C3286k9251m36M7347J7626m0921k002o491O654m4486K1655M1152j0376J4408
17058D8165K3476J2359J2517k4136k8536J6926L794k1993K989q2344n7449K5754
$$ plain form
17046 -68478 -86174 -93356 -61994 -25131 1858 18924 29144 24433 -14548 -19194 -37338 15819
17034 15819 58684 52758 47744 12006 -1790 56798 57178 -50335 -76192 -81797 -112350 -102772 -73205
17021 -73205 -40116 -7849 10941 -14074 -60611 -117569 -132809 -122085 -87883 -66181 -55725 -81401
17009 -81401 -42927 -34004 -79401 -84685 -64009 -55399 -22599 -65617 -66647 -67277 -40401 -17773 -34707
16996 -34707 -32017 -37637 -14443 2956 -22338 -79924 -141022 -111796 -129128 -91236 -60446 -20801
16984 -20801 -7873 12331 8328 7705 869 7381 -24837 -30986 -87721 -27459 30228 38626 5037
16971 5037 -65327 -65581 -55854 -50646 -5390 8639 -11036 -20319 -12230 2833 -43015 -35852 -52394
16958 -52394 -33232 -50525 -70610 -52806 -25566 16028 -19329 -25086 29239 58121 25128 33691
$$ packed form
17046f8478j7696p182L1362L6863K6989J7066J0220m711l8981m646j8144N3157
17034A5819M2865n926n014l5738j3796N8588L80j07513k5857n605l0553R578K9567
17021g3205L3089L2267J8790k5015m6537n6958j5240J0724L4202K1702J0456k5676
17009h1401L8474Q923m5397n284K0676Q610L2800m3018j030o30K6876K2628j6934
16996c4707K690n620K3194J7399k5294n7586o1098K9226j7332L7892L0790L9645
16984b0801J2928K0204m003o23o836O512l2218o149n6735O0262N7687Q398l3589
16971E037p0364k54R727N208M5256J4029j9675r283Q089J5063m5848P163j6542
16958e2394J9162j7293k0085J7804K7240M1594l5357n757N4325K8882l2993Q563
$$ plain form
16946 33691 30112 -4990 -2924 -11629 -24027 -59220 -40581 -22397 26351 23750 -5601 -26590
16934 -26590 -55043 31705 87263 12881 -84498 -71686 -71118 -61655 -68689 -64665 -74667 -75115 -104853
16921 -104853 -140492 -142783 -133248 -110220 -139342 -165176 -99128 -5565 12961 44708 74107 12986
16909 12986 -17552 31919 49683 44536 -7086 -11283 11406 25476 28185 22756 9851 -62099
16897 -62099 -82330 -35111 10027 33758 34860 -47899 -97337 -110697 -77557 -59768 -24494 34697
16885 34697 83671 108186 85727 72112 32302 17292 -27354 -41206 -71661 -63584 -53771 -63857
16873 -63857 -37095 -14522 -38621 -52097 -61596 -20631 8815 -27046 -57764 -63664 -87380 -166144
16861 -166144 -142517 -100518 -69661 -56998 -37347 8171 -14997 -6411 -72793 -133573 -125639 -111800
$$ packed form
16946C3691l579l5102K066q705j2398l5193J8639J8184M8748k601k9351k0989
16934b6590k8453Q6748N5558p4382r7379J2812N68R463p034M024j0002m48k9738
16921a04853l5639k291R535K3028k9122k5834O6048R3563J8526L1747K9399o1121
16909A2986l0538M9471J7764n147n1622m197K2689J4070K709n429j2905p1950
16897f2099k0231M7219M5138K3731J102q2759m9438j3360L3140J7789L5274N9191
16885C4697M8974K4515k2459j3615l9810j5010m4646j3852l0455Q077R813j0086
16873f3857K6762K2573k4099j3476r499M0965K9446l5861l0718n900k3716p8764
16861a66144K3627M1999L0857J2663J9651M5518k3168Q586o6382o0780P934J3839
$$ plain form
16849 -111800 -85581 -34782 -11423 -5485 -5256 67187 81059 95286 77384 6590 -34716 -37228
16837 -37228 -39266 -69390 -89161 -63782 -59113 -34628 8511 12080 16898 -20084 -20529 -38495 -37932
16824 -37932 -53931 -56836 -40984 3459 23468 28752 19987 8191 -19154 -8572 -3427 -4453 -44265
16811 -44265 -75609 -94867 -43442 -32572 -44733 -57328 -77254 -86425 -71864 -44637 -37946 -58589
16799 -58589 -48664 4939 21239 -26288 -69839 -25332 -17695 -2747 5539 8160 -23072 -9494
16787 -9494 50122 59090 19001 35470 61029 29332 31036 66861 62393 27966 54333 77523
16775 77523 40541 17873 -22408 -58369 -6494 31206 12041 -2503 -33847 -20899 -19363 -12605
16763 -12605 -69040 -39307 9523 -8554 -11326 -45174 -45789 -67551 -41191 -21458 -30329 13314
$$ packed form
16849a11800K6219N0799K3359N938K29P2443J3872J4227j7902p0794m1306k512
16837c7228k038l0124j9771K5379M669K4485M3139L569M818l6982m45j7966N63
16824c7932j5999k905J5852M4443K0009N284q765j1796k7345J0582N145j026l9812
16811d4265l1344j9258N1425J0870j2161j2595j9926r171J4561K7227O691k0643
16799e8589R925N3603J6300m7527m3551M4507P637J4948Q286K621l1232J3578
16787i494N9616Q968m0089J6469K5559l1697J704L5825m468l4427K6367K3190
16775G7523l6982k2668m0281l5961N1875L7700j9165j4544l1344J2948J536O758
16763a2605n6435K9733M8830j8077k772l3848o15k1762K6360J9733q871M3643
$$ plain form
16751 13314 55989 32906 59692 67078 31666 38485 53995 21403 17350 -18943 -34645 -36690
16739 -36690 -51827 -56158 -80844 -72430 -53037 -47295 -69143 -112050 -70472 -58989 -47971 -58834
16727 -58834 -89668 -98294 -52381 -32668 -301 45733 42271 9900 -32544 -62227 -57591 -18748
16715 -18748 10843 751 -27762 -26476 -31398 -19967 -34891 -23371 -56137 -36852 -4132 18257
16703 18257 28477 10492 33612 52915 -2723 -41400 -41970 -31258 -27280 -17826 11014 -22274
16691 -22274 -32822 -32829 18721 33138 13569 -38360 -12168 18876 -11838 -14004 -20980 -36804 -12552
16678 -12552 44898 7536 5664 -13765 -28596 -3039 -39187 -43603 -60966 -32443 4631 37567
16666 37567 12757 4148 4619 -13000 -14740 -6764 1812 43685 36556 -3234 9877 -19090 -29630
$$ packed form
16751A3314M2675k3083K6786P386l5412O819J5510l2592m053l6293j5702k045
16739c6690j5137m331k4686Q414J9393N742k1848m2907M1578J1483J1018j0863
16727e8834l0834q626M5913J9713L2367M6034l462l2371m2444k9683M636L8843
16715a8748K9591j0092k8513J286m922J1431j4924J1520l2766J9285L2720K2389
16703A8257J0220j7985K3120J9303n5638l8677n70J0712L978R454K8840l3288
16691b2274j0548pN1550J4417j9569n1929K6192L1044l0714k166o976j5824K4252
16678a2552N7450l7362j872j9429j4831K5557l6148m416j7363K8523L7074L2936
16666C7567k4810q609M71j7619j740P976Q576M1873p129l9790J3111k8967j0540
$$ plain form
16653 -29630 -47779 -52856 -6973 -11332 18611 29102 37910 42141 -766 -26837 -46244 -76644
16641 -76644 -83565 -59896 -7316 -64954 -91334 -47383 6439 -20086 -53423 -13329 10639 44153
16629 44153 42676 61990 58724 25690 -40320 -59227 -74825 -90884 -117414 -115299 -89690 -8636
16617 -8636 22911 -17128 -18907 -12889 -26023 -16992 17271 2295 -31361 -32545 -38352 -8871 -24754
16604 -24754 -39918 -62292 -48349 -70953 -94586 -46637 -18016 -13999 11756 46541 57415 77561
16592 77561 42473 -20008 -12341 -38868 -57566 -71029 -98841 -80513 -84887 -103437 -144238 -59691
16580 -59691 -60385 -101608 -74851 -38297 -24741 -9364 4095 -750 5679 3564 2560 -6432 21012
16567 21012 30768 -2932 -17488 -15685 19320 19682 9251 -9934 -14842 -23499 -32430 -69645 -48417
$$ packed form
16653b9630j8149n077M5883m359K9943J0491Q808M231m2907k6071j9407l0400
16641g6644o921K3669N2580n7638k6380M3951N3822k6525l3337M0094K3968L3514
16629D4153j477J9314l266l3034o6010j8907j5598j6059k6530K115K5609Q1054
16617h636L1547m0039j779O018j3134R031L4263j4976l3656j184n807K9481j5883
16604b4754j5164k2374J3943k2604k3633M7949K8621M017K5755L4785J0874K0146
16592G7561l5088o2481P667k6527j8698j3463k7812J8328m374j8550m0801Q4547
16580e9691o94m1223K6757L6554J3556J5377J3459m845O429k115j004q992K7444
16567B1012R756l3700j4556J803L5005L62j0431j9185m908q657q931l7215K1228
$$ plain form
16554 -48417 -37415 -14444 -44185 -65920 -75868 -24809 -21565 -74095 -59272 -21212 769 -29957
16542 -29957 -33336 -32047 -54333 -31020 -17542 -6471 61246 90156 106683 95670 5024 -45125
16530 -45125 -17154 11414 29945 18091 -10412 -22595 -3528 71386 51359 47667 13523 -27669
16518 -27669 30234 70375 58300 -23392 -234 25851 -236 -12551 -11350 -55206 -63002 -59313
16506 -59313 -57820 -20195 -53222 -93673 -72822 -33099 6241 3023 -9609 -7170 -47998 -31210
16494 -31210 14422 -25176 -66612 -64533 -70352 -86185 -93133 -1499 50615 32010 16556 32368
16482 32368 34275 81171 83997 31174 20161 -4882 -6025 21347 13036 25988 -7090 -6268 7333
16469 7333 10384 -11468 -89812 -86740 -59732 -60839 -55863 -52792 -72050 -57746 -44093 -44169 -72521
$$ packed form
16554d8417J1002K2971k9741k1735r948N1059L244n2530J4823L8060K1981l0726
16542b9957l379J289k2286K3313J3478J1071O7717K8910J6527j1013r0646n0149
16530d5125K7971K8568J8531j1854k8503j2183J9067P4914k0027l692l4144m1192
16518b7669N7903M0141j2075q1692K3158K6085k6087j2315J201m3856p796L689
16506e9313J493L7625l3027m0451K0851L9723L9340l218j2632K439m0828J6788
16494c1210M5632l9598m1436K079n819j5833o948R1634N2114j8605j5454J5812
16482C2368J907M6896K826n2823j1013k5043j143K7372q311J2952l3078Q22J3601
16469G333L051k1852p8344L072K7008j107M976L071j9258J4304J3653p6k8352
$$ plain form
16456 -72521 -81763 -95277 -86057 -61745 -37774 -16998 -15486 -9068 -5239 14654 13773 -48561 -104977
16443 -104977 -134776 -97768 -26915 40982 66759 73167 41003 12419 18462 23827 11571 -57606
16431 -57606 -91424 -93771 -89616 -62603 -17614 -38012 -67227 -97043 -63397 -59347 -142623 -111591
16419 -111591 -37993 -29179 -22660 27692 41870 210 -19920 -38537 -33167 -7113 -25819 -23773
16407 -23773 -24036 -50580 -25170 -39048 -79595 -42187 -45888 -47405 -85640 -72921 -23005 -4479
16395 -4479 40209 62030 -22915 -71653 -18333 56705 76442 42415 -2620 -25147 -27380 24629
16383 24629 39901 33020 41842 46425 61003 -9655 -22717 -20082 -19734 16076 72563 64021 61774
16370 61774 66706 -21919 -61114 -40491 -23485 -18327 2812 -2203 43911 11104 -92902 -98623
$$ packed form
16456g2521r242j3514R220K4312K3971K0776J512O418L829J9893q81o2334n6416
16443a04977k9799L7008P0853O7897K5777O408l2164k8584O043N365j2256o9177
16431e7606l3818k347M155K7013M4989k0398k9215k9816L3646M050q3276L1032
16419a11591P3598Q814O519N0352J4178m1660k0130j8617N370K6054j8706K046
16407b3773k63k6544K5410j3878m0547L7408l701j517l8235J2719M9916J8526
16395d479M4688K1821q4945m8738N3320P5038J9737l4027m5035k2527k233N2009
16383B4629J5272o881Q822M583J4578p0658j3062K635L48L5810N6487q542k247
16370F1774M932q8625l9195K0623J7006N158K1139n015M6114l2807j04006n721
$$ plain form
16358 -98623 -90033 -23421 27340 38224 38711 57999 59457 35313 -1448 -35433 352 25408
16346 25408 73193 73421 77679 86751 69018 21317 14930 -1594 -95563 -93836 -67315 36771 62153
16333 62153 43419 60297 13660 -47383 3270 15052 11874 -5432 13448 -44135 -117041 -129628
16321 -129628 -72104 -29345 -30855 -35550 -51440 -53800 -12576 15537 6786 -3166 -26165 -15886
16309 -15886 403 58846 54198 77620 40568 82404 75582 -6233 -15705 26273 22772 18606 84809
16296 84809 86683 59526 -25000 -58867 -54221 -2779 56727 75803 71822 21653 17056 36583
16284 36583 46778 68362 109980 99892 80216 76994 41487 -9558 -18917 36362 32553 11799
16272 11799 6909 -35711 -50538 -71333 -53685 -42757 -65492 -90604 -77965 -80052 -88941 -37344
$$ packed form
16358i8623Q590O6612N0761J0884M87J9288J458k4144l6761l3985L5785K5056
16346B5408M7785K28M258R072j7733m7701o387j6524r3969J727K6521J04086K5382
16333F2153j8734J6878m6637o1043N0653J1782l178j7306J8880n7583p2906j2587
16321a29628N7524M2759j510m695j5890k360M1224K8113q751r952k2999J0279
16309a5886J6289N8443m648K3422l7052M1836o822q1815r472M1978l501m166O6203
16296H4809J874k7157q4526l3867M646N1442N9506J9076l981n0169m597J9527
16284C6583J0195K1584M1618j0088j9676l222l5507n1045r359N5279l809k0754
16272A1799m890m2620j4827k0795J7648J0928k2735k5112J2639k087q889N1597
$$ plain form
16260 -37344 -37352 -37194 4964 19641 1698 25401 -3698 -7617 -24904 -35980 -58882 -60900 -51758
16247 -51758 -39851 -51247 -74501 -93790 -139584 -112233 -32649 -40595 -71036 -65810 -54886 -67465
16235 -67465 -88735 -115501 -61555 -50912 -66683 -20241 -7514 -78018 -111923 -87969 -77779 -43673
16223 -43673 -20372 -39587 -84797 -22390 -8365 -34479 -65340 -37148 -24625 -36823 -48758 -9900
16211 -9900 24530 6904 -11678 -6442 -12599 -10097 -39536 -67529 -12568 77467 92934 44431
16199 44431 22241 13399 49019 103484 85320 52457 8201 -19111 -49139 -71923 -53589 -53112
16187 -53112 -57040 -20841 20312 57425 32048 -24160 -46501 -85959 -119069 -40594 30513 49293
16175 49293 65407 23335 -14508 -74984 -57126 -20511 -37347 -30171 7542 63259 89243 77073
$$ packed form
16260c7344qJ58M2158J4677j7943K3703k9099l919j7287j1076k2902k018R142
16247e1758J1907j1396k3254j9289m5794K7351P9584p946l0441N226J0924j2579
16235f7465k1270k6766N3946J0643j5771M6442J2727p0504l3905K3954J0190L4106
16223d3673K3301j9215m5210O2407J4025k6114l0861K8192J2523j2198j1935L8858
16211i900L4430j7626j8582N236o157K502k9439k7993N4961R0035J5467m8503
16199D4431k2190q842L5620N4465j8164l2863m4256k7312l0028k2784J8334M77
16187e3112l928L6199M1153L7113k5377n6208k2341l9458l3110P8475P1107J8780
16175D9293J6114m2072l7843o0476J7858L6615j6836P176L7713N5717K5984j2170
$$ plain form
16163 77073 69070 42669 844 -28276 -15871 -1553 26726 53024 71824 48700 2247 -6551
16151 -6551 7298 14678 -11198 -39674 -56279 -89015 -104459 -99800 -89020 -99164 -71543 -47588
16139 -47588 -28069 -50607 -99984 -103316 -86230 -107784 -78891 -71940 -76313 -32806 -34386 -109183
16127 -109183 -132158 -98384 -53194 -44298 -44150 -16104 19688 -5345 -30407 -46261 -20031 14196
16115 14196 48435 37547 -3815 -16849 20144 12663 5736 8832 -29852 -36120 -11198 37550
16103 37550 51328 14604 6474 19721 42626 11108 16657 28315 40886 66243 41087 -45540
16091 -45540 -45561 13841 -31888 -64542 -52507 -6546 -11736 -46744 -41857 -45351 -40402 17233 73173
16078 73173 77906 55822 28602 -16296 13867 23806 21918 45258 97900 129550 86761 592
$$ packed form
16163G7073q003k6401m1825k9120J2405J4318K8279K6298J8800k3124m6453q798
16151f551J3849P380k5876k8476j6605l2736j5444M659J0780j0144K7621K3955
16139d7588J9519k2538m9377l332J7086k1554K8893O951m373M3507j580p4797
16127a09183k2975L3774M5190Q896J48K8046L5792k5033k5062j5854K6230L4227
16115A4196L4239j0888m1362j3034L6993p481o927L096l8684o268K4922M8748
16103C7550J3778l6724q130J3247K2905l1518N549J1658J2571K5357k5156q6627
16091d5540k1N9402m5729l2654J2035M5961n190l5008M887l494M949N7635N5940
16078G3173M733k2084k7220m4898L0163R939j888K3340N2642L1650m2789q6169
$$ plain form
16066 592 -63984 -55957 -52534 -22819 5745 36086 67520 72309 -2431 -41139 -13969 29499 125116
16053 125116 72305 38157 13792 -44097 -40399 -7713 17979 46656 24274 23533 39388 57761
16041 57761 44243 49922 37414 30917 20621 19840 30019 8592 -9544 17693 69957 88478
16029 88478 85466 109995 114936 76438 29503 15721 -26884 1681 60193 94864 105953 79105
16017 79105 40954 85039 56014 -1939 13711 82606 65171 -614 13352 71648 24875 -20398
16005 -20398 59653 118409 50514 39706 35197 -4499 -8182 -60258 -105278 -116884 -91720 -95784
15993 -95784 -94507 -28446 284 9960 14957 6285 -32810 -56406 -62106 -65238 -116329 -166125 -128328
15980 -128328 -20315 23360 22647 30083 44575 12942 -14873 -20364 17649 71086 55870 -33174
$$ packed form
16066E92o4576Q027L423K9715K8564L0341L1434M789p4740l8708K7170M3468R5617
16053A25116n2811l4148k4365n7889L698L2686K5692K8677k2382p41J5855J8373
16041E7761j3518N679j2508o497j0296p81J0179k1427j8136K7237N2264J8521
16029H8478l012K4529M941l8498m6935j3782m2605K8565N8512L4671J1089k6848
16017G9105l8151M4085k9025n7953J5650O8895j7435o5785J3966N8296m6773m5273
16005b0398Q0051N8756o7895j0808m509l9696l683n2076m5020j1606K5164m064
15993i5784J277O6061K8730R676M997q672l9095k3596n700l132n1091m9796L7797
15980a28328J08013M3675p13P436J4492l1633k7815n491L8013N3437j5216q9044
$$ plain form
15968 -33174 -63348 -78025 -53846 -49468 -84579 -124843 -124510 -59652 -15124 -10714 -37633 -88321
15956 -88321 -5102 67873 35593 26633 11302 -23478 -58188 -81754 -49577 -36091 -57435 -3994
15944 -3994 -24528 -6603 -5688 -21101 -38937 -81395 -124269 -102190 -18783 49363 5101 -6024
15932 -6024 -2569 -29269 -65877 -52150 -45193 -33302 16449 39555 11208 16826 57513 69663
15920 69663 81072 101382 73854 43891 5954 -13212 24170 68765 41508 36151 -15679 -4338
15908 -4338 53565 93302 110090 50367 -5251 21521 3169 -27415 25848 52071 48272 86517
15896 86517 84043 74076 15418 33731 50008 64696 68898 69317 85516 78632 48521 68922 46713
15883 46713 -12652 2822 -64684 -80856 7466 35555 -4473 -24349 -49742 -59887 -76971 -57158
$$ packed form
15968c3174l0174j4677K4179M378l5111m0264L33O4858M4528M410k6919n0688
15956h8321Q3219P2975l2280q960j5331l4780l4710k3566L2177J3486k1344N3441
15944c994k0534J7925R15j5413j7836m2458m2874K2079Q3407O8146m4262j1125
15932f024L455k6700l6608J3727O957J1891M9751K3106k8347N618M0687J2150
15920F9663J1409K0310k7528k9963l7937j9166L7382M4595k7257n357n1830J1341
15908d338N7903L9737J6788n9723n5618K6772j8352l0584N3263K6223l799L8245
15896H6517k474r967n8658J8313J6277J4688M202M19J6199o884l0111K0401k2209
15883D6713n9365J5474o7506j6172Q8322K8089m0028j9876k5393j0145j7084J9813
$$ plain form
15871 -57158 -49033 440 -1685 -7056 21097 30310 21740 11822 -40166 -55950 -20681 -28462 -32253
15858 -32253 -60357 -49119 -39788 -68276 -95774 -95475 -114860 -76536 -65105 -52426 -40699 -3033
15846 -3033 -23660 -72042 -78753 -73974 -67638 -73147 -68313 -28281 -27512 -35820 16110 30214 13949
15833 13949 -5618 -25140 -24189 -76727 -111919 -61954 -24694 -45556 -37175 -12154 -12896 -17762 -24646
15820 -24646 -77748 -64396 -30907 -48461 -38128 -72491 -48044 3548 47939 29848 12602 -10455
15808 -10455 -16360 17991 -12025 -37165 -13261 -31199 -63338 -49023 -36930 -8170 -31909 979
15796 979 14471 32726 27149 19021 14134 39412 65928 46746 -21491 -28442 -35847 -67566 -93963
15783 -93963 -46524 11383 3420 -21266 -26171 45229 29468 36967 79489 67005 30524 7012
$$ packed form
15871e7158Q125M9473k125n371K8153R213q570r918n1988j5784L5269p781l791
15858c2253k8104J1238R331k8488k7498K99j9385L8324J1431J2679J1727L7666
15846c033k0627m8382o711M779O336n509M834M0032P69q308N1930J4104j6265
15833A3949j9567j9522R51n2538l5192M9965L7260k0862Q381K5021p42m866o884
15820b4646n3102J3352L3489j7554J0333l4363K4447N1592M4391j8091j7246k3057
15808a0455n905L4351l0016k5140K3904j7938l2139J4315J2093K8760k3739L2888
15796I79J3492J8255n577q128m887K5278K6516j9182o8237o951p405l1719k6397
15783i3963M7439N7907p963k4686m905P1400j5761P499M2522j2484l6481k3512
$$ plain form
15771 7012 -25393 -14828 -3635 4957 -4882 16005 -25101 -75159 -97418 -41162 14215 9325
15759 9325 17944 -10570 -64793 -76379 -46552 -8491 16625 32119 78725 99228 68688 13342
15747 13342 -53839 -36639 22613 59296 33213 -12105 5427 -18349 -2751 1998 -10029 -32086
15735 -32086 -51177 -35576 -46320 -59312 -73525 -62213 -85254 -73716 -16765 -4580 23943 28357
15723 28357 -30156 -34011 -86747 -118972 -52179 -10639 6190 -449 14366 36847 28749 91942
15711 91942 133642 121844 62182 41197 -816 8391 20407 10251 28120 20979 22564 47839
15699 47839 71365 83308 53255 12103 -11838 -27556 -70388 -90957 -48199 11111 -10199 -51410
15687 -51410 -26159 48563 53842 30187 -19500 -46398 -49689 -74106 -107272 -44194 166 -33821
$$ packed form
15771G012l2405J0565J1193Q592r839K0887m1106n0058k2259N6256N5377m890
15759I325Q619k8514n4223j1586K9827L8061K5116J5494M6606K0503l0540n5346
15747A3342o7181J7200N9252L6683k6083m5318J7532k3776J5598M749j2027k2057
15735c2086j9091J5601j0744j2992j4213J1312k3041J1538N6951J2185K8523M414
15723B8357n8513l855n2736l2225O6793M1540J6829o639J4815K2481q098O3193
15711I1942M1700j1798n9662k0985m2013R207J2016j0156J7869p141J585K5275
15699D7839K3526J1943l0053m1152k3941j5718m2832k0569M2758N9310k1310m1211
15687e1410K5251P4722N279k3655m9687k6898l291k4417l3166O3078M4360l3987
$$ plain form
15675 -33821 -52127 -43282 -45151 -82868 -110424 -80565 -41814 -63511 -64633 -62369 -31923 1054
15663 1054 8998 35155 -18621 -14498 -12588 3601 -23367 -43597 -9175 28328 -1344 -55725
15651 -55725 -43213 -29938 -51159 -40504 -31727 -73100 -39181 44338 19574 -792 19917 47972
15639 47972 108583 73790 22257 7755 -38690 -8664 26154 -57 -29744 7668 13884 1101
15627 1101 -38855 -30230 -5505 34075 64469 38215 12986 -3830 24704 47503 51737 77839
15615 77839 53194 53393 46627 18264 57429 26751 -20010 -47027 -7457 35987 11624 -45573
15603 -45573 -68678 -13096 34873 30477 21873 36966 54947 86866 93834 25279 -17987 -11704
15591 -11704 1883 25892 26542 61174 86376 52501 58414 30896 54881 2677 -36487 -21844
$$ packed form
15675c3821j8306Q845j869l7717k7556K9859L8751k1697j122K264L0446L2977
15663A054P944K6157n3776M123J910J6189k6968k0230L4422L7503k9672n4381
15651e5725J2512J3275k1221J0655Q777m1373L3919Q3519k4764k0366K0709K8055
15639D7972O0611l4793n1533j4502m6445L0026L4818k6211k9687L7412O216j2783
15627A101l9956Q625K4725L9580L0394k6254k5229j6816K8534K2799M234K6102
15615G7839k4645J99o766k8363L9165l0678m6761k7017L9570M3444k4363n7197
15603d5573k3105N5582M7969m396q604J5093J7981L1919O968o8555m3266O283
15591a1704J3587K4009O50L4632K5202l3875N913k7518K3985n2204l9164J4643
$$ plain form
15579 -21844 -1417 -10329 -8958 4465 25994 -11211 -66446 -20509 -5515 -5929 8693 -24994
15567 -24994 -10738 39094 10754 49259 -5131 -49503 -5911 -33614 -30758 43738 66911 -1117
15555 -1117 4028 16370 32824 69469 51004 44943 29570 35564 34802 -12723 24437 65705 35912
15542 35912 32762 -12858 -29879 -32382 -44359 -35639 -9080 -26303 25581 78930 82957 85902 56189
15529 56189 30706 7092 41159 68432 1136 -26819 -30240 -17075 -945 31683 27643 29322
15517 29322 27557 56612 56270 43034 74802 72297 75510 92222 53239 12591 -24507 -42984 -25207
15504 -25207 12863 -8987 -42982 -29757 -26150 -12159 -65002 -158610 -210484 -133839 -66370 -63190
15492 -63190 -57313 -68562 -32000 11534 13440 -13540 -21377 -21561 47948 59962 42684 27851 20202
$$ packed form
15579b1844K0427q912J371J3423K1529l7205n5235M5937J4994m14J4622l3687
15567b4994J4256M9832k8340L8505n4390m4372M3592k7703K856P4496K3173o8028
15555a117N145J2342J6454L6645j8465o061j5373N994p62m7525L7160M1268k9793
15542C5912l150m5620j7021k503j1977Q720K6559j7223N1884N3349M027K945k9713
15529E6189k5483k3614L4067K7273o7296k7955l421J3165J6130L2628m040J679
15517B9322j765K9055l42j3236L1768k505L213J6712l8983m0648l7098j8477J7777
15504b5207L8070k1850l3995J3225L607J3991n2843r3608n1874P6645O7469L180
15492f3190N877j1249L6562M3534J906k6980p837j84O9509J2014j7278j4833p649
$$ plain form
15479 20202 10457 6715 15799 24446 49359 16191 -18691 -725 -20851 -29805 -11892 -17364 -53557
15466 -53557 -38991 -31124 13262 37191 38281 57932 92278 63482 82359 59522 43152 40290
15454 40290 21004 -43125 -44008 -63807 -17606 -23886 -53225 -12791 24321 91828 45695 26889
15442 26889 8501 16895 41042 22949 -6112 -38375 -48815 -40092 21512 22255 2004 9145 3395
15429 3395 7136 5255 5631 16001 -18805 -17430 -51055 -70446 -55817 -51436 -61166 -3188 53548
15416 53548 76776 57250 20527 25895 33958 9470 81835 122102 92898 101671 57417 66782
15404 66782 82794 39471 25859 33334 7939 -28279 -73751 -41946 -30767 -36663 -11080 12233
15392 12233 29828 -33450 -91657 -46686 10325 68278 98418 89910 35083 11612 19962 61471
$$ packed form
15479B0202r745l742R084Q647K4913l3168l4882J7966k0126q954J7913n472l6193
15466e3557J4566P867M4386K3929J090J9651L4346k8796J8877k2837j6370k862
15454D0290j9286o4129q83j9799M6201o280k9339M0434L7112O7507m6133j8806
15442B6889j8388Q394K4147j8093k9061l2263j0440Q723O1604P43k0251P141n750
15429C395L741j881L76J0370l4806J375l3625j9391J4629M381r730N7978N6736
15416E3548K3228j9526l6723N368Q063k4488P2365M0267k9204Q773m4254R365
15404F6782J6012m3323j3612P475k5395l6218m5472L1805J1179n896K5583K3313
15392A2233J7595o3278n8207M4971N7011N7953L0140q508n4827k3471Q350M1509
$$ plain form
15380 61471 67198 53453 -8451 -29714 -27971 -40790 3627 21675 71788 88495 52651 -46848
15368 -46848 -90233 -23218 15879 19208 -2061 30446 57175 -53873 -78476 -52434 -24977 -44267
15356 -44267 -53109 -48373 -37039 681 -14689 -20447 -8741 -38161 -47250 26865 20606 59839 50919
15343 50919 41518 26968 8378 -46714 -65372 -32218 -14682 -40354 -43079 -47292 -46625 22883 64277
15330 64277 46250 -12344 -13828 -11170 -32639 -42122 -39343 -36409 -23735 -4128 -52704 -49053 690
15317 690 -8025 -7965 -32798 15583 -4831 -29369 -50423 -54796 -40439 -70655 -55105 -53275 -81843
15304 -81843 -62989 -33536 -10662 5566 -46663 -68514 -75224 -61168 -12084 24698 17809 16050
15292 16050 19470 63592 91456 81840 22235 29744 97352 75375 -14628 -18409 22173 29445 48589
$$ packed form
15380F1471N727j3745o1904k1263J743j2819M4417J8048N0113J6707l5844r9499
15368d6848m3385O7015L9097L329k1269L2507K6729j11048k4603K6042K7457j9290
15356d4267q842M736J1334L7720j5370n758J1706k9420r089P4115o259L9233q920
15343E0919r401j4550j8590n5092j8658L3154J7536k5672k725m213O67O9508M1394
15330F4277j8027n8594j484K658k1469r483K779K934J2674J9607m8576L651M9743
15317F90q715O0k4833M8381k0414k4538k1054m373J4357l0216J5550J830k8568
15304h1843J8854K9453K2874J6228n2229k1851o710J4056M9084L6782o889j759
15292A6050L420M4122K7864r616n9605P509O7608k1977r0003l781M0582P272J9144
$$ plain form
15279 48589 47551 6324 -41373 -79165 -15072 96416 91202 78905 88495 57449 15682 -9725
15267 -9725 -72380 -31814 24026 32212 45268 60163 33909 -37578 -6566 31819 -7317 -16995
15255 -16995 -5967 -11788 -16916 -21831 19852 47982 17374 -46218 -46756 9781 31986 -14081 -28022
15242 -28022 25798 56612 7537 -10190 57667 92060 78835 54506 54742 5701 24780 64744
15230 64744 62218 15372 -3920 31035 20722 23024 -46332 -71653 -26441 -21304 -10859 2246
15218 2246 4256 -19958 -4739 -9884 55068 71656 66812 32571 -26141 -40599 -26844 3929
15206 3929 -27932 -67800 -50250 -59157 -89249 -79202 -95645 -66913 13382 29280 24943 3082
15194 3082 403 2775 17767 -4413 -20036 11622 33869 -14840 -60250 -36416 -24278 -23410 -55049
$$ packed form
15279D8589j038m1227m7697l7792O4093J11488n214j2297R590l1046m1767k5407
15267i725o2655M0566N5840Q186J3056J4895k6254p1487L1012L8385l9136r678
15255a6995J1028n821n128m915M1683K8130l0608o3592n38N6537K2205m6067j3941
15242b8022N3820L0814m9075j7727O7857L4393j3225k4329K36m9041J9079L9964
15230F4744k526m6846j9292L4955j0313K302o9356k5321M5212N137J0445J3105
15218B246K010k4214J5219n145O4952J6588m844l4241n8712j4458J3755L0773
15206C929l1861l9868J7550q907l0092J0047j6443K8732Q0295J5898m337k1861
15194C082k679K372J4992k2180j5623L1658K2247m8709m5410K3834J2138Q68l1639
$$ plain form
15181 -55049 -117926 -118739 -96465 -79987 -116762 -140145 -90535 -61911 -77412 -24159 15143 -22199
15169 -22199 -21967 -28526 -6253 37140 56775 41634 33321 41220 -16017 -22935 -2810 15853 26737
15156 26737 2913 21496 5341 16522 36938 39039 33686 34063 29454 37596 45797 35276 42319
15143 42319 14553 25997 66199 75365 9088 -10849 -4909 65439 14236 -28539 1705 -30051
15131 -30051 -91227 -54080 46235 79519 60602 66208 68198 60791 107117 139964 155114 56811
15119 56811 -3378 1577 -14840 15645 4766 9671 47463 58106 90591 60984 -132 7676
15107 7676 4650 -25262 -32580 4901 -9703 -64473 -47922 -5505 -38102 -38483 -58176 -64629 -40156
15094 -40156 1362 656 48709 87226 46913 -13020 -6088 51747 -10430 -27308 25877 58842
$$ packed form
15181e5049o2877q13K2274J6478l6775k3383M9610K8624j5501N3253L9302l7342
15169b2199K32o559K2273M3393J9635j5141q313P899n7237o918K0125J8663J0884
15156B6737k3824J8583j6155J1181K0416K101n353L77m609Q142Q201j0521P043
15143D2319k7766J1444M0202R166o6277j9937N940P0348n1203m2775L0244l1756
15131c0051o1176L7147J00315L3284j8917N606J990p407M6326L2847J5150r8303
15119E6811o0189M955j6417L0485j0879M905L7792J0643L2485k9607o1116P808
15107G676l026k9912p318L7481j4604n4770J6551M2417l2597l81j9693o453K4473
15094d0156M1518p06M8053L8517m0313n9933O932N7835o2177j6878N3185L2965
$$ plain form
15082 58842 60704 17918 -48562 -68417 -2951 52831 29892 28731 -11468 -7229 45389 83961
15070 83961 95002 66811 50049 57125 66793 86023 42970 8064 47216 82239 102176 90920
15058 90920 26896 6739 24595 22492 29392 15614 32607 62243 33151 53683 47857 60559
15046 60559 13334 47057 87578 52766 40512 56311 22829 41686 119940 96014 37870 49969
15034 49969 58731 66410 20598 -17856 -17097 -5307 17583 45849 70590 68558 77887 99488 83761
15021 83761 72640 64290 34501 -11609 13421 32309 31076 18647 15957 30980 54900 95520
15009 95520 136421 151178 81167 72709 116800 67990 9468 75338 133781 144659 155083 173608
14997 173608 198437 212822 186392 202780 207587 233028 291686 295637 374792 480788 587129
$$ packed form
15082E8842J862m2786o6480j9855O5466N5782k2939j161m0199M239N2618L8572
15070H3961J1041k8191j6762P076R668J9230m3053l4906L9152L5023J9937j1256
15058I0920o4024k0157J7856k103O900j3778J6993K9636k9092K0532n826J2702
15046F0559m7225L3723M0521l4812j2254J5799l3482J8857P8254k3926n8144J2099
15034D9969Q762P679m5812l8454P59J1790K2890K8266K4741k032R329K1601j5727
15021H3761j1121q350k9789m6110K5030J8888j233j2429k690J5023K3920M0620
15009I5520M0901J4757p0011q458M4091m8810n8522O5870N8443J0878J0424J8525
14997A73608K4829J4385k6430J6388M807K5441N8658L951P9155J05996J06341
$$ plain form
14986 587129 738048 923518 1119664 1389892 1781883 2430100 3265827 4404206 5731393
14977 5731393 6676430 6546143 5467774 4140234 3144169 2528296 2090328 1771917 1543411
14968 1543411 1368321 1242781 1118328 1049657 941336 860275 831207 776207 767541 837690 849505
14957 849505 786220 746553 716161 695567 769490 783032 715524 629333 593073 565307 560433 531792
14945 531792 498815 516854 509921 520455 555129 574806 546342 540841 533392 512196 443087 428284
14933 428284 396374 414945 343662 306151 276398 291237 281379 241904 225535 118831 148832
14922 148832 168676 163908 167156 165751 176545 210570 184201 178360 151222 117708 75862 44746
14910 44746 39346 46720 67495 70817 117548 132018 49613 29184 2747 21244 -61254 -80968
$$ packed form
14986E87129J50919J85470J96146K70228L91991O48217Q35727J138379J327187
14977E731393R45037j30287j078369j327540r96065o15873m37968l18411k28506
14968A543411j75090j25540j24453o8671j08321q1061k9068n5000q666P0149J1815
14957H49505o3285l9667l0392k0594P3923J3542o7508q6191l6260k7766m874k8641
14945E31792l2977J8039o933J0534L4674J9677k8464n501p449k1196o9109j4803
14933D28284l1910J8571p1283l7511k9753J4839r858l9475j6369j06704L0001
14922A48832J9844m768L248j405J0794L4025k6369n841k7138l3514m1846l1116
14910D4746n400P374K0775L322M6731J4470q2405k0429k6437J8497q2498j9714
$$ plain form
14898 -80968 -55633 -79173 -136080 -106813 -86489 -88135 -87823 -85932 -98790 -85576 -37097 -10503
14886 -10503 5975 41856 -10482 -64295 -88841 -75996 -35408 -45866 -14523 6020 -17765 -17109
14874 -17109 -33635 -12030 -12365 13940 7244 -44806 -111160 -40442 -7593 31451 23750 47494
14862 47494 16397 45364 61951 71824 50852 7993 25255 6509 -10974 -5949 -41383 -44099
14850 -44099 -11271 10011 33682 8131 30066 50675 23963 25273 15230 -13713 17898 23854
14838 23854 -26162 -54838 -75081 -90373 -107394 -33987 9137 -27875 -95319 -59020 829 22123
14826 22123 -22735 -17215 28112 48556 72352 62064 54353 93287 110384 112071 61129 1503
14814 1503 -34051 -33252 -4257 -23761 -12075 13351 56512 22881 16039 15344 -4607 33707 35733
$$ packed form
14898h0968K5335k3540n6907K9267K0324j646L12J891j2858J3214M8479K6594
14886a0503J6478L5881n2338n3813k4546J2845M0588j0458L1343K0543k3785O56
14874a7109j6526K1605l35K6305o696n2050o6354P0718L2849L9044p701K3744
14862D7494l1097K8967J6587R873k0972m2859J7262j8746j7483N025l5434k716
14850d4099L2828K1282K3671k5551K1935K0609k6712J310j0043k8943L1611N956
14838B3854n0016k8676k0243j5292j7021P3407M3124l7012o7444L6299N9849K1294
14826B2123m4858N520M5327K0444K3796j0288p711L8934J7097J687n0942n9626
14814A503l5554P99K8995j9504J1686K5426M3161l3631o842o95j9951L8314K026
$$ plain form
14801 35733 60864 72381 73457 34965 16248 62387 122681 91839 35224 10275 -2140 18834
14789 18834 29793 10652 5945 50172 47854 -51507 -72826 -51480 -32809 53275 64239 58953
14777 58953 80748 64922 43130 34232 69568 43571 -752 -16689 -552 54092 72822 55649
14765 55649 11152 -59983 -1747 -30795 -64036 -72608 -94119 -98712 -25060 1763 -32629 -10404
14753 -10404 12112 58 -7398 -56637 -51112 -5558 14607 23981 38238 70525 63630 30029
14741 30029 22135 29416 -10625 -18891 19883 -27854 4886 19568 33772 33096 25752 -4792 -24063
14728 -24063 -11860 -23291 -21118 31391 51680 9695 6232 -15607 34341 22252 -6899 -29552
14716 -29552 10336 60744 108608 128881 61504 -3712 -77966 -116702 -74476 -39786 18590 -16080
$$ packed form
14801C5733K5131J1517J076l8492j8717M6139O0294l0842n6615k4949j2415K0974
14789A8834J0959j9141m707M4227k318r9361k1319K1346J8671Q6084J0964n286
14777E8953K1795j5826k1792q898L5336k5997m4323j5937J6137N4644J8730j7173
14765E5649m4497p1135N8236k9048l3241q572k1511m593P3652K6823l4392K2225
14753a0404K2516j2054p456m9239N525M5554K0165R374J4257L2287o895l3601
14741C0029p894P281m0041q266L8774m7737L2740J4682J4204o76p344l0544j9271
14728b4063J2203j1431K173N2509K0289m1985l463k1839M9948j2089k9151k2653
14716b9552L9888N0408M7864K0273o7377o5216p4254l8736M2226L4690N8376l4670
$$ plain form
14704 -16080 -16611 5422 27806 65729 62802 -6219 -71397 -104802 -84032 -55262 -46910 -38991 -71139
14691 -71139 -48356 48166 102065 91325 121867 116151 99680 52700 -69 -8097 19457 28186
14679 28186 18051 -17374 -7429 22037 -9777 6410 31767 35169 -5291 2953 36966 13225
14667 13225 58811 86274 47266 34590 41760 11006 51419 16775 9486 38228 35789 19751
14655 19751 34588 -13367 -67726 -41135 12285 13661 61989 70794 14241 -3963 18554 23338
14643 23338 18840 -2439 -16411 -58858 -63460 -80536 658 39874 22053 33281 -138 -64821
14631 -64821 -82022 -81765 -74607 -61714 -41464 -6193 11649 4119 14514 -5274 17818 28190
14619 28190 20269 -8181 -76844 -75498 -11593 -12769 -36536 -37344 -32331 -61631 -67528 -36910 -8462
$$ packed form
14704a6080n31K2033K2384L7923k927o9021o5178l3405K0770K8770Q352P919l2148
14691g1139K2783R6522N3899j0740L0542n716j6471m6980n2769q028K7554Q729
14679B8186j0135l5425R945K9466l1814J6187K5357L402m0460Q244L4013k3741
14667A3225M5586K7463l9008j2676P170l0754M0413l4644p289K8742k439j6038
14655A9751J4837m7955n4359K6591N3420J376M8328Q805n6553j8204K2517M784
14643B3338m498k1279j3972m2447m602j7076Q1194L9216j7821J1228l3419o4683
14631f4821j7201K57P158J2893K0250L5271J7842p530J0395j9788K3092J0372
14619B8190p921k8450o8663J346O3905j176k3767q08N013k9300n897L0618K8448
$$ plain form
14606 -8462 -44527 -45814 -3548 9423 22801 -4645 -47860 -83827 -29564 20739 48105 28121
14594 28121 3706 -15196 -29326 -1558 42281 40698 30959 48516 87192 108357 68401 21013
14582 21013 -45030 -93958 -79579 -35778 -18893 -8476 -4518 -24726 -37156 -32482 25809 16362
14570 16362 -10644 -25892 59 -16875 -5953 -14054 3980 -27688 -34444 58 -7842 -25692
14558 -25692 -20470 19631 44820 73750 24384 -22927 -65269 -82352 -44585 -13950 -52954 -123805
14546 -123805 -154340 -97604 -22111 -78387 -121654 -156598 -209231 -160477 -72567 -25240 102471
14535 102471 141207 88624 33294 23744 50720 57967 52616 30919 -17020 -34167 -90420 -61217
14523 -61217 -36161 -77467 -98636 -45454 -40065 -1434 34846 38645 -6510 -37476 -41916 -24793
$$ packed form
14606h462l6065j287M2266J2971J3378k7446m3215l5967N4263N0303K7366j9984
14594B8121k4415j8902j4130K7768M3839j583r739J7557L8676K1165l9956m7388
14582B1013o6043m8928J4379M3801J6885J0417L958k0208j2430M674N8291r447
14570A6362k7006j5248K5951j6934J0922q101J8034l1668o756L4502p900j7850
14558b5692N222M0101K5189K8930m9366m7311m2342j7083L7767L0635l9004p0851
14546a23805l0535N6736P5493n6276m3267l4944n2633M8754Q7910M7327J27711
14535A02471L8736n2583n5330r550K6976P247n351k1697m7939j7147n6253K9203
14523f1217K5056m1306k1169N3182N389L8631L6280L799m5155l0966m440J7123
$$ plain form
14511 -24793 -9076 16172 -27890 -58505 -35538 16308 81086 42494 9217 24615 28351 -14886
14499 -14886 -31802 -132 11551 20594 70696 96863 66388 5393 -22609 -76340 -148980 -93094
14487 -93094 -74456 -15723 19224 -20310 -22592 4600 -23099 -42158 -26308 2086 40280 16532
14475 16532 40322 52804 32303 1552 -12080 -12231 -3842 17816 55897 99040 79714 42377
14463 42377 51039 12627 -21530 -33984 -47004 -40802 -20089 11536 13407 66688 84180 89968
14451 89968 81869 36261 2632 -33258 -40110 6392 27030 36019 16218 -18244 -6427 -851
14439 -851 -17441 31667 54154 28123 10953 11075 9583 -12337 -35431 -44729 36055 60880 29271
14426 29271 -2305 -24580 -16625 -37042 -25532 -43915 -44897 -20696 -15183 -27945 -18694 -29454 1824
$$ packed form
14511b4793J5717K5248m4062l0615K2967N1846O4778l8592l3277J5398L736m3237
14499a4886j6916L1670J1683R043N0102K6167l0475o0995k8002n3731p2640N5886
14487i3094J8638N8733L4947l9534k282K7192k7699j9059J5850K8394L8194k3748
14475A6532K3790J2482k0501l0751j3632j51Q389K1658L8081M3143j9326l7337
14463D2377Q662l8412l4157j2454j3020O202K0713L1625J871N3281J7492N788
14451H9968q099m5608l3629l5890o852M6502K0638Q989j9801l4462J1817N576
14439h51j6590M9108K2487k6031j7170J22j492k1920k3094r298Q0784K4825l1609
14426B9271l1576k2275P955k0417J1510j8383r82K4201N513j2762R251j0760L1278
$$ plain form
14413 1824 43040 42114 34455 52502 4168 -30501 -13459 -43106 -51178 -11607 3150 26288 42308
14400 42308 21372 -859 -8516 7367 23696 28423 67863 28964 39294 50233 56795 64729
14388 64729 27746 28085 14867 -5770 -8612 -5095 -3020 -55741 -5163 19062 11652 -902 -13744
14375 -13744 -78602 -67374 14083 45925 25421 42611 7428 52 -14424 52621 39410 45022
14363 45022 -5867 -11128 -14906 -40528 -110334 -89972 -60270 -13712 12792 27349 8762 -39330
14351 -39330 -100289 -80742 -40698 -12051 64205 77723 64925 20773 55385 34415 20047 -15166
14339 -15166 -50997 -80963 -75608 -30560 12825 -20443 12483 47570 -19353 -55522 -25218 -7272
14327 -7272 34318 112749 147530 140931 108979 47694 -48022 -49494 19875 58578 66812 69928 100515
$$ packed form
14413A824M1216r26p659J8047m8334l4669J7042k9647q072L9571J4757K3138J6020
14400D2308k0936k2231p657J5883J6329M727L9440l8899J0330J0939O562P934
14388F4729l6983L39j3218k0637k842L517K075n2721N0578K4225p410j2554j2842
14375a3744o4858J1228Q1457L1842k0504J7190l5183p376j4476O7045j3211N612
14363D5022n0889n261l778k5622o9806K0362K9702M6558K6504J4557j8587m8092
14351c9330o0959J9547M0044K8647P6256J3518j2798m4152L4612k0970j4368l5213
14339a5166l5831k9966N355M5048M3385l3268L2926L5087o6923l6169L0304J7946
14327g272M1590P8431L4781o599l1952o1285r5716j472O9369L8703Q234L116L0587
$$ plain form
14314 100515 147649 147028 46888 22250 -16584 -52679 19055 46696 42008 85404 127032 81983
14302 81983 44566 41149 12951 28005 51359 66587 -3105 400 15980 -10314 10706 -1787
14290 -1787 22300 39193 6561 15711 59653 38671 51729 71800 17755 -58056 -69432 -79223
14278 -79223 -80072 -80892 -68107 -37805 -69416 -17677 85025 114169 113170 61123 40042 12712 -22084
14265 -22084 -47007 -822 -17058 -59349 -33179 -68701 -57340 -45362 -6004 11917 14655 -23268
14253 -23268 78 46593 81087 103284 127027 72015 45339 -236 -29824 -34508 -8472 -7194
14241 -7194 5748 -8718 -48916 -64988 -96199 -101169 -43431 -48659 -75159 -67829 2595 -9925
14229 -9925 -44295 -78047 -118046 -93951 -41281 -22368 -58562 -93757 -91498 -68854 -36338 -43013
$$ packed form
14314A00515M7134o21j00140k4638l8834l6095P1734K7641m688M3396M1628m5049
14302H1983l7417l417k8198J5054K3354J5228o9692L505J5580k6294K1020j2493
14290a787K4087J6893l2632R150M3942k0982J3058K0071n4045p5811j1376r791
14278g9223q49q20J2785L0302l1611N1739J02702K9144r99n2047k1081k7330l4796
14265b2084k4923M6185j6236m2291K6170l5522J1361J1978L9358J7921K738l7923
14253b3268K3346M6515L4494K2197K3743n5012k6676m5575k9588m684K6036J278
14241g194J2942j4466m0198j6072l1211m970N7738n228k6500P330P0424j2520
14229i925l4370l3752l9999K4095N2670J8913l6194l5195K259K2644L2516o675
$$ plain form
14217 -43013 -55416 -49888 -46764 -23950 -31113 -32159 -23757 -28169 -3114 -7739 -52972 -73596 -42609
14204 -42609 -57078 -25332 -2730 22882 49595 39943 -25872 -73493 -10974 77577 76278 -10699
14192 -10699 -3966 -32538 -54108 -60588 -86050 -50423 -4400 -15445 288 -44346 -67940 -81928
14180 -81928 -36205 -27854 -30847 -22642 18302 -13491 -51213 -61410 -43635 -61391 -45652 -53660
14168 -53660 -114601 -123553 -51301 33227 59781 41205 33008 -1964 7763 -6771 -8299 -41431
14156 -41431 8241 -46717 -64194 -44689 -39605 -28925 -53181 -78528 -78660 -36724 7360 16423
14144 16423 20332 45635 -9449 3107 18511 10609 -22721 -7032 10466 -6220 -32746 -101300
14132 -101300 -148970 -166179 -130536 -50909 -54420 -52608 -2741 74111 96868 -2682 -39353 -31297
$$ packed form
14217d3013j2403N528L124K2814p163j046Q402m412K5055m625m5233k0624L0987
14204d2609j4469L1746K2602K5612K6713r652o5815m7621O2519Q8551j299q6977
14192a0699O733k8572k1570o480k5462L5627M6023j1045J5733m4634k3594j3988
14180h1928M5723Q351k993Q205M0944l1793l7722j0197J7775j7756J5739q008
14168e3660o0941q952P2252Q4528K6554j8576q197l4972R727j4534j528l3132
14156d1431M9672n4958j7477J9505N084J0680k4256k5347j32M1936M4084R063
14144A6423L909K5303n5084J2556J5404p902l3330J5689J7498j6686k6526o8554
14132a01300m7670j7209L5643P9627l511J812M9867P6852K2757r9550l6671Q056
$$ plain form
14120 -31297 -46852 1096 36679 12306 29899 36412 62697 15120 -8119 16213 -7362 -7361 4339
14107 4339 63679 48640 18654 -6152 -21251 -8 -36423 -27006 -34531 -72151 -52985 -39888
14095 -39888 -12592 -2095 -54811 -37797 -9910 -23773 -42052 -40158 -59472 -40933 -16304 -24726
14083 -24726 -27443 3172 17395 17283 -5439 -28442 -12607 -2539 -6120 -4710 36908 94597 102927
14070 102927 46512 -13064 -7471 -6603 -6429 -41682 -70581 -60069 -20877 -22285 -49765 -65633 -22544
$$ packed form
14120c1297j5555M7948L5583k4373J7593O513K6285m7577k3239K4332k3575JJ1700
14107D339N9340j5039k9986k4806j5099K1243l6415R417p525l7620J9166J3097
14095c9888K7296J0497n2716J7014K7887j3863j8279J894j9314J8539K4629q422
14083b4726k717L0615J4223j12k2722k3003J5835J0068l581J410M1618N7689Q330
14070A02927n6415n9576N593Q68J74l5253k8899J0512L9192j408k7480j5868M3089
$$ [...]
##END NTUPLES=NMR SPECTRUM
##END=
