##TITLE=Analysis number 313356
Compound Code mo 00298
Book Reference 450/53/2
Project Code adrs
Chemist Name paulaf
##JCAMPDX= 6.0         $$ Bruker NMR JCAMP-DX V2.0
##DATA TYPE= NMR SPECTRUM
##DATA CLASS= NTUPLES
##ORIGIN= Bruker BioSpin GmbH
##OWNER= NMR
$$ XWIN-NMR		Version 3.5
$$ Tue Sep  6 15:25:35 2005 GMT Daylight Time (UT+1h)  MAYBRIDGE\NMR@NMR_250MHZ
##.OBSERVE FREQUENCY= 250.131544655141
##.OBSERVE NUCLEUS= ^1H
##.ACQUISITION MODE= SIMULTANEOUS (DQD)
##.ACQUISITION SCHEME= undefined
##.AVERAGES= 16
##.DIGITISER RES= 18
##SPECTROMETER/DATA SYSTEM= dpx250
##.PULSE SEQUENCE= zg30
##.SOLVENT NAME= DMSO
##.SHIFT REFERENCE= (INTERNAL, DMSO, 0, 16.522)
##AUDIT TRAIL= $$ (NUMBER, WHEN, WHO, WHERE, WHAT)
$$ ##TITLE= Audit trail, XWIN-NMR		Version 3.5
$$ ##JCAMPDX= 5.01
$$ ##ORIGIN= Bruker BioSpin GmbH
$$ ##OWNER= NMR
$$ C:\u/data/dgb/nmr/ADRS/9050/pdata/1/auditp.txt
$$ ##AUDIT TRAIL=  $$ (NUMBER, WHEN, WHO, WHERE, WHAT)
(   1,<2005-09-06 15:25:16.42 +100>,<MAYBRIDGE\NMR>,<NMR_250MHZ>,
      <created by zg, POWCHK disabled, PULCHK disabled
       configuration hash MD5:
       62 19 C7 07 E1 42 D1 B7 37 6C 3D D0 77 39 F9 E6
       data hash MD5: 64K
       BA 0A 4E 98 C6 DF B7 F1 C8 CA C7 64 FC 55 9B EC>)
(   2,<2005-09-06 15:25:28.06 +100>,<MAYBRIDGE\NMR>,<NMR_250MHZ>,
      <Start of raw data processing
       ef LB = 0.3 FT_mod = 6 PKNL = 1 SI = 32K 
       data hash MD5: 32K
       0D 72 3F 99 58 6C 71 51 18 8B C1 4D 15 59 32 15>)
(   3,<2005-09-06 15:25:29.80 +100>,<MAYBRIDGE\NMR>,<NMR_250MHZ>,
      <apk 
       data hash MD5: 32K
       07 BF 54 6C 85 C8 92 8A 87 26 B1 2B C0 38 24 86>)
(   4,<2005-09-06 15:25:30.56 +100>,<MAYBRIDGE\NMR>,<NMR_250MHZ>,
      <abs ABSG = 5 
       data hash MD5: 32K
       4F 4B B4 86 BD 9F F1 21 A3 50 10 4C F0 2A 86 42>)
$$ ##END=
$$ 
$$ hash MD5
$$ F8 6E 04 EE 51 3D 58 A8 A5 65 8A 18 CF 65 10 AA
##$RELAX= 
##$RELAX= 
##$RELAX= 
##$RELAX= 
##$RELAX= 
##$RELAX= 
##$RELAX= 
$$ Bruker specific parameters
$$ --------------------------
##$DU= <C:\u>
##$EXPNO= 9050
##$NAME= <ADRS>
##$PROCNO= 1
##$TYPE= <nmr>
##$USER= <dgb>
##$AMP= (0..31)
100 100 100 100 100 100 100 100 100 100 100 100 100 100 100 100 100 100 
100 100 100 100 100 100 100 100 100 100 100 100 100 100 
##$AQSEQ= 0
##$AQ_mod= 3
##$AUNM= <au_zg>
##$AUTOPOS= <23 >
##$BF1= 250.13
##$BF2= 250.13
##$BF3= 250.13
##$BF4= 250.13
##$BF5= 500.13
##$BF6= 500.13
##$BF7= 500.13
##$BF8= 500.13
##$BYTORDA= 1
##$CFDGTYP= 0
##$CFRGTYP= 5
##$CHEMSTR= <none>
##$CNST= (0..31)
1 1 145 1 1 1 1 1 1 1 1 1 1 1 1 1 1 1 1 1 1 1 1 1 1 1 1 1 1 1 1 1 
##$CPDPRG= <>
##$CPDPRG1= <>
##$CPDPRG2= <>
##$CPDPRG3= <>
##$CPDPRG4= <mlev>
##$CPDPRG5= <mlev>
##$CPDPRG6= <mlev>
##$CPDPRG7= <mlev>
##$CPDPRG8= <mlev>
##$CPDPRGB= <>
##$CPDPRGT= <>
##$D= (0..31)
0 1 0 0 0 0 0 0 0 0.06 0 0 0 0 0 0 0.0002 0 0 0 0 0 0 0 0 0 0 0 0 0 0 
0 
##$DATE= 1126016715
##$DBL= (0..7)
120 120 120 120 120 120 120 120 
##$DBP= (0..7)
150 150 150 150 150 150 150 150 
##$DBP07= 0
##$DBPNAM0= <>
##$DBPNAM1= <>
$$ [...]
##$SUBNAM7= <"">
##$SUBNAM8= <"">
##$SUBNAM9= <"">
##$SW= 20.6930455092707
##$SWIBOX= (0..15)
0 0 3 0 0 0 0 0 0 0 0 0 0 0 0 0 
##$SW_h= 5175.983436853
##$TD= 65536
##$TD0= 1
##$TE= 296.16
##$TE2= 300
##$TE3= 300
##$TEG= 300
##$TL= (0..7)
0 120 120 120 120 120 120 120 
##$TP= (0..7)
150 150 150 150 150 150 150 150 
##$TP07= 0
##$TPNAME0= <>
##$TPNAME1= <>
##$TPNAME2= <>
##$TPNAME3= <>
##$TPNAME4= <>
##$TPNAME5= <>
##$TPNAME6= <>
##$TPNAME7= <>
##$TPOAL= (0..7)
0.5 0.5 0.5 0.5 0.5 0.5 0.5 0.5 
##$TPOFFS= (0..7)
0 0 0 0 0 0 0 0 
##$TUNHIN= 0
##$TUNHOUT= 0
##$TUNXOUT= 0
##$USERA1= <user>
##$USERA2= <user>
##$USERA3= <user>
##$USERA4= <user>
##$USERA5= <user>
##$V9= 5
##$VALIST= <valist>
##$VCLIST= <CCCCCCCCCCCCCCC>
##$VD= 0
##$VDLIST= <DDDDDDDDDDDDDDD>
##$VPLIST= <PPPPPPPPPPPPPPP>
##$VTLIST= <TTTTTTTTTTTTTTT>
##$WBST= 1024
##$WBSW= 4
##$XGAIN= (0..3)
0 0 0 0 
##$XL= 0
##$YL= 0
##$YMAX_a= 314262
##$YMIN_a= -332907
##$ZGOPTNS= <>
##$ZL1= 120
##$ZL2= 120
##$ZL3= 120
##$ZL4= 120
##$ABSF1= 16.522
##$ABSF2= -4.171173
##$ABSG= 5
##$ABSL= 3
##$ALPHA= 0
##$AQORDER= 0
##$ASSFAC= 0
##$ASSFACI= 0
##$ASSFACX= 0
##$ASSWID= 0
##$AUNMP= <proc_1d>
##$AZFE= 0.1
##$AZFW= 0.1
##$BCFW= 0
##$BC_mod= 0
##$BYTORDP= 0
##$COROFFS= 0
##$CY= 12.5
##$DATMOD= 1
##$DC= 0
##$DFILT= <>
##$DTYPP= 0
##$F1P= 14.0000005364418
##$F2P= -0.99999901652339
##$FCOR= 0.5
##$FTSIZE= 32768
##$FT_mod= 6
##$GAMMA= 0
##$GB= 0
##$INTBC= 1
##$INTSCL= 1
##$ISEN= 128
##$LB= 0.3
##$LEV0= 0
##$LPBIN= 0
##$MAXI= 10000
##$MC2= 0
##$MEAN= 0
##$ME_mod= 0
##$MI= 0
##$NCOEF= 0
##$NC_proc= -3
##$NLEV= 6
##$NOISF1= 0
##$NOISF2= 0
##$NSP= 0
##$NTH_PI= 0
##$NZP= 0
##$OFFSET= 16.522
##$PC= 1
##$PHC0= -86.1944
##$PHC1= 6.388683
##$PH_mod= 1
##$PKNL= yes
##$PPARMOD= 0
##$PSCAL= 4
##$PSIGN= 0
##$REVERSE= no
##$SF= 250.13
##$SI= 32768
##$SIGF1= 0
##$SIGF2= 0
##$SINO= 400
##$SIOLD= 32768
##$SREGLST= <1H.DMSO>
##$SSB= 0
##$STSI= 32768
##$STSR= 0
##$SW_p= 5175.98343685301
##$SYMM= 0
##$S_DEV= 0
##$TDeff= 65536
##$TDoff= 0
##$TI= <Analysis number 999999
Compound Code 99
Book Reference 9
Project Code 9>
##$TILT= no
##$TM1= 0
##$TM2= 0
##$TOPLEV= 0
##$USERP1= <user>
##$USERP2= <user>
##$USERP3= <user>
##$USERP4= <user>
##$USERP5= <user>
##$WDW= 1
##$XDIM= 32768
##$YMAX_p= 405056271
##$YMIN_p= -1135814
$$ End of Bruker specific parameters
$$ ---------------------------------
##NTUPLES= NMR SPECTRUM
##VAR_NAME=  FREQUENCY,     SPECTRUM/REAL,   SPECTRUM/IMAG
##SYMBOL=    X,             R,               I
##VAR_TYPE=  INDEPENDENT,   DEPENDENT,       DEPENDENT
##VAR_FORM=  AFFN,          ASDF,            ASDF
##VAR_DIM=   32768,         32768,           32768
##UNITS=     HZ,            ARBITRARY UNITS, ARBITRARY UNITS
##FACTOR=    0.157963299565203, 1,           1
##FIRST=     4132.6476996994, 0,             0
##LAST=      -1043.33573715361, 0,           0
##MIN=       -1043.33573715361, -1135814,    0
##MAX=       4132.6476996994, 405056271,     0
$$ Real data points
##PAGE= N=1
##DATA TABLE= (X++(R..R)), XYDATA
$$ [...]
18567A16236N8669J9979j15045j38343k2652J0413K4394O1114l7149J5945N0738
$$ 116236 174905 194884 79839 -58504 -81156 -70743 -46349 14765 -22384 -6439 44299
18556D4299J4538j3647n572M8267J7838k826n2955l370K5544k273r779P0958j0727
$$ 44299 58837 45190 39618 87885 105723 102897 49942 46572 72116 69843 60064 131022 120295
18543A20295M916m820J102K5405J1197j5057q678J7040M616o4121m7631r650l886
$$ 120295 125211 120391 121493 146898 158095 143038 134360 151400 156016 91895 44264 34614 30728
18530C0728k6792k3715j2394O7667N0903j99n7276r214k8577M3218L9621l6484
$$ 30728 3936 -19779 -32173 35494 86397 86198 28922 19708 -8869 34349 73970 37486
18518C7486N135K6874J1370K3482K1484m465K2873j574k7627K541p8359l1767
$$ 37486 42621 69495 80865 104347 125831 121366 144239 142665 115038 117579 39220 7453
18506G453M0147O2100J9129L202R1836j2720m0906k1656m3162j9453m455M7655
$$ 7453 47600 109700 128829 132031 223867 211147 170241 148585 105423 85970 81515 129170
18494A29170K9171k5600O481l7604N7671P962m1957j7702r814K2996k2753J8024
$$ 129170 158341 132741 139222 101618 159289 167251 125294 107592 97778 120774 98021 116045
18482A16045j3394K0114L4006K9733n2598p2529k0898n8093k9394N9105K2237
$$ 116045 102651 122765 156771 186504 133906 61377 40479 -17614 -47008 12097 34334
18471C4334o0181J5494J8712j956K3988Q9618P9532l4p1413n7690K4080J524k3091
$$ 34334 -25847 -10353 8359 6403 30391 120009 199541 199507 128094 70404 94484 96008 72917
18458G2917k8539k2023j0271k1251j4101N6026R021L614K0759n6220n1792j5074
$$ 72917 44378 22355 12084 -9167 -23268 32758 41779 45393 66152 9932 -41860 -56934
18446e6934L2300N9870J9060j3863l2623n0288m214K7454M776l3312K8301K0308
$$ -56934 -24634 35236 54296 40433 7810 -42478 -46692 -19238 -14462 -47774 -19473 835
18434H35m7001l3495N3514J30588L9534L2710j0425k4936o2805l4753m7201J3372
$$ 835 -46166 -79661 -26147 104441 143975 176685 166260 141324 78519 43766 -3435 9937
18422I937K4019j5806J7541M0797N5838j8578r5642n6746N6061N9297m8546k1199
$$ 9937 33956 18150 35691 76488 132326 113748 18106 -38640 17421 76718 28172 6973
18410F973j3745N662n25L3985M9572k4685M0371p653K4181k5705n0322l1040j3965
$$ 6973 -6772 -1110 -1635 32350 81922 57237 97608 89955 114136 88431 38109 7069 -6896
18397f896N6678Q5110n2211k9751k5281k5075J060n404q3418J6794J1345m0955
$$ -6896 49782 134892 82681 52930 27649 2574 3634 -1770 -85188 -68394 -57049 -98004
18385i8004L2073k1639m959O4552L0781L9666l0626n0775M161P050P0727P627
$$ -98004 -65931 -87570 -92529 -27977 2804 42470 11844 -38931 -34770 -27720 43007 50634
18373E0634k6239l1182L853J6228J1779j0593L2012O739l721k7777n4561p482
$$ 50634 24395 -6787 -2934 13294 25073 14480 46492 53231 49510 21733 -32828 -40310
18361d0310K6443J1041Q12K00m0314l063l2153L9126L0862M429j8003O9199O4466
$$ -40310 -13867 -2826 -2014 -1814 -42128 -45191 -77344 -38218 -7356 -2927 -20930 48269 112735
18348A12735q636m838k1590o1951l7748j0213k4111m5054l5839J9551L2194j0640
$$ 112735 104099 99261 77671 15720 -22028 -32241 -56352 -101406 -137245 -117694 -85500 -96140
18336i6140K4398L620l7521N3844N1909L2159K8995K5312P802j2025k3656o733
$$ -96140 -71742 -68122 -105643 -51799 110 32269 61264 86576 94378 82353 58697 51964
18324E1964j5509K094K0582k7405k6925J0624K875L1774j3186m9197n7676k3315
$$ 51964 36455 38549 59131 31726 4801 15425 18300 50074 36888 -12309 -69985 -93300
18312i3300J5253Q2131K3476K4169k2286k8551k7626K3032L5123k0279k0664L3643
$$ -93300 -78047 4084 27560 51729 29443 892 -26734 -3702 31421 11142 -9522 24121
18300B4121l6255l8812K9471N5572P1422N1562m4131l723K3838n233P307K7494
$$ 24121 -12134 -50946 -21475 34097 105519 157081 112950 109227 133065 127832 135139 162633
18288A62633J3851m2953R243P779O3588L4188l4448j1906k475l8767m9983l8873
$$ 162633 176484 133531 142774 150553 214141 248329 213881 201975 199500 160733 110750 71877
18276G1877n4404L4343J1136n422k066m8756l3735L9565N1290N6262j2897l5360
$$ 71877 17473 51816 62952 57530 55464 6708 -27027 12538 63828 120090 107193 71833
18264G1833J9591j0066n6279J849p396j7694k4534R573L5560j6496k948P0930
$$ 71833 91424 81358 25079 26928 19532 1838 -22696 -13123 22437 5941 2993 73923
18252G3923J6274K1326j9928k931N639o0587L2843K0222k129J1775K2777P207
$$ 73923 90197 111523 91595 88664 94303 33716 66559 86781 84652 96427 119204 126411
18240A26411O6837J4717n1607o544j9419l367O1497l3008j6056O211J7029J5979
$$ 126411 193248 207965 156358 149814 130395 127028 188525 155517 139461 145672 162701 178680
18228A78680j2280j3983k319p5723R05r253l2568k6547J7529j6505R333P582l4946
$$ 178680 166400 152417 150098 74375 75280 66027 33459 6912 24441 7936 17269 24851 -10095
18215a0095n0305k0433J8506M8530K290O474O1027M4124k6694M19j1149J5115
$$ -10095 -60400 -80833 -62327 -13797 -11507 -5033 55994 100118 73424 73843 62694 77809
18203G7809N835j9850L226J5917l5620n4282l9228r420K1772L7650K7435o2127
$$ 77809 83644 63794 67020 82937 47317 -6965 -46193 -55613 -33841 3809 31244 -30883
18191c0883J6278K3129K9926L3199J4679j5294K767j3404k4467l6411P857M5777
$$ -30883 -14605 8524 38450 71649 86328 71034 73801 60397 35930 -481 7376 53153
18179E3153j7714p7796J8142M3738M6114R286j0514j5942l2938m6943k7341N7639
$$ 53153 35439 -42357 -24215 19523 65637 74923 64409 48467 15529 -31414 -58755 -1116
18167a116l042Q8222K2538q611K5422l5621m1724K8390K1068j1295k4353k1810
$$ -1116 -4158 84064 106602 97991 123413 87792 46068 74458 95526 84231 59878 38068
18155C8068O6366m3046k9047p626M207o300N6743q588n4195J5465k8830m35l0746
$$ 38068 104434 61388 32341 24715 28922 22622 79365 70777 16582 32047 3217 2782 -27964
18142b7964Q0377L1610j8258P3474J4895k3236m0700l6237q582M5390n8791k3578
$$ -27964 52413 84023 65765 139239 154134 130898 90198 53961 45379 90769 31978 8400
18130H400l5221M2952K2982j3420p5937j7408R30m1564K5853k479L3888j9181
$$ 8400 -26821 16131 39113 25693 -50244 -67652 -66722 -108286 -82433 -84912 -51024 -70205
18118g0205M1547L7065l4781K6943J9963o8816j9919J6846K7560L9772M752J7114
$$ -70205 -28658 8407 -26374 569 20532 -48284 -68203 -51357 -23797 15975 20727 37841
18106C7841l8527k7626Q115j1023L9297P973L4966K9996l7458K9077N4053K0651
$$ 37841 -686 -28312 -20197 -31220 8077 16050 51016 81012 43554 72631 126684 147335
18094A47335n1351m7297q354o819N9557l0473l4701K2070J0736l2905n418M4170
$$ 147335 95984 48687 40333 33514 93071 62598 27897 49967 60703 27798 22380 66550
18082F6550k8115R159Q789m3702q9792p3762L8527N9959N1218j1121l8972m3097
$$ 66550 38435 47594 56383 12681 -77111 -150873 -112346 -52387 -1169 -12290 -51262 -94359
18070i4359N450J9578R703l8268K4446J8876J3323o9r282p428k1789M4571M9934
$$ -94359 -88909 -69331 -59628 -97896 -73450 -54574 -41251 -41320 -50602 -58030 -79819 -35248 14686
18057A4686J2739M7691K9811l6967l4566r055j0724J6560l8196k219O3153K8276
$$ 14686 27425 75116 104927 67960 33394 24339 13615 30175 -8021 -10240 52913 81189
18045H1189N399n9557l8582j4187M0976K0727J2405O490l772P978l2787J1013
$$ 81189 86588 27031 -11551 -25738 15238 35965 48370 54860 51088 59066 26279 37292
18033C7292J5940P456p808K3548k3177k3834p4489J0761R4582q989l8445m9653
$$ 37292 53232 60688 52880 76428 53251 29417 -45072 -34311 60271 51282 12837 -36816
18021c6816j1075M391m6934N980O1496P7985L7866j4791j954m4611l6112O5974
$$ -36816 -47891 -43500 -90434 -84454 -22958 55027 92893 78102 76148 31537 -4575 61399
18009F1399k801n7622j5174j739l2940l9198L7857M6630J3228o431n3882j4644
$$ 61399 58598 976 -14198 -15937 -48877 -88075 -50218 -3588 9640 3209 -50673 -65317
17997f5317n309n0178m5975M204L2467J8500L3074N6935L1439n3227r701r818
$$ -65317 -70626 -120804 -166779 -162575 -130108 -111608 -78534 -21599 9840 -43387 -53088 -62906
17985f2906k5452L7641L4206j0444K7768j490Q879m7634K438K6728M6553k689
$$ -62906 -88358 -50717 -16511 -26955 813 -677 8202 -39432 -36994 -10266 36287 33598
17973C3598k0086N7288N0408j1538k6886q317J3235N665l0159R126L646p6178
$$ 33598 13512 70800 121208 109670 82784 74467 87702 93367 63208 72334 75980 -198
17961a98m7762K7452L3936K0867j900K908l4992j0793l4262K5837M9016M3421
$$ -198 -47960 -20508 13428 34295 32395 35303 311 -10482 -44744 -18907 30109 73530
17949G3530K719j0341p6248m7620N2415K8178m2987q675K0192R3097L3172l7927
$$ 73530 76249 65908 -10340 -57960 -5545 22633 -20354 -29029 -8837 84260 117432 79505
17937G9505k1358M3551K453k1522r3396l853K5049M6995K4079J4914k7183j277
$$ 79505 58147 101698 104151 82629 -10767 -14620 10429 57424 81503 96417 69234 67957
17925F7957K4864n5361k1655J4931J6270j7382l9032l3736k880j8567k327O2989
$$ 67957 92821 37460 15805 30736 47006 29624 -9408 -43144 -46024 -64591 -66918 -3929
17913c929k915l458J15m1018K3063p533k385M1432m9686j17646N1310J7713L0370
$$ -3929 -6844 -10302 -10187 -51205 -28142 -35675 -38060 3372 -46314 -163960 -112650 -94937 -64567
17900f4567N4203J5809l7604m1080n2329L7122O8698O1691P681l7821k2713K2423
$$ -64567 -10364 5445 -32159 -73239 -125568 -88446 -19748 41943 49624 11803 -10910 11513
17888A1513L5624q268M0008l6145j07409J9134Q3689K0715K8470j3636j4206j3773
$$ 11513 47137 38869 78877 42732 -64677 -45543 38146 58861 87331 73695 59489 45716
17876D5716n0346k1129L1432l6754k9673p463K1400K6375l717k409k0727j481
$$ 45716 -4630 -25759 5673 -31081 -60754 -68217 -46817 -20442 -24159 -26568 -47295 -48776
17864d8776K3995J2064J9864n9173k7484O016K9146M6259J6836m3921N922N475
$$ -48776 -24781 -12717 7147 -52026 -79510 -73494 -44348 1911 18747 -25174 -19252 -13777
17852a3777k291M740O3849j7369o7361j8114K4512L1147L8743K885j9258Q261
$$ -13777 -16068 -11328 52521 35152 -32209 -50323 -25811 5336 44079 46964 27706 35967
17840C5967O497l0846m7302M4865O067L2466n3241j46715L598L8034N6996O3588
$$ 35967 42464 11618 -35684 9181 15248 47714 -5527 -152242 -148644 -110610 -53614 9974
17828I974o983j5452K1020l0707n949K8315M2792k1994m0004L9884J9247O233
$$ 9974 2991 -12461 8559 -22148 -28097 218 43010 21016 -18988 20896 40143 46376
17816D6376K9526l0086l1711m2402k310K6619k106R279l896m3563k5407j1008
$$ 46376 75902 45816 14105 -28297 -30607 -3988 -6094 3185 -711 -44274 -69681 -80689
17804h0689N8384O1525K9724k7034m4909j1158O5377j6251l0847j4939J4064N5451
$$ -80689 -22305 39220 68944 41910 -2999 -14157 51220 34969 4122 -10817 3247 58698
17792E8698l5185j9371p0003P758L8450K833k578N4521K62l1581j2690k360M58
$$ 58698 23513 4142 -65861 -58103 -19653 -16820 -19398 35123 35385 3804 -8886 -11246 -10788
17779a0788q69O943n330r798L7201K5391m825o5934o7382k6650j2044L8809M0250
$$ -10788 -11657 -4714 -10044 -19842 17359 42750 37925 -28009 -95391 -122041 -134085 -95276 -55026
17766e5026m6730k3847K6292k0319n6745L4404O3737N0748l3827m6583j7036k4141
$$ -55026 -101756 -125603 -99311 -119630 -176375 -141971 -78234 -27486 -61313 -107896 -124932 -149073
17754a49073j8258O3079P0868K8742j1562o7269M510m76L6894N8284r589q9632
$$ -149073 -167331 -104252 -33384 -4642 -16204 -83473 -78963 -79439 -42545 15739 6150 -83482
17742h3482K7277K3125j313k7667J2208O2768J5895p545j4957J0076j2749m286
$$ -83482 -56205 -33080 -34393 -62060 -49852 12916 28811 21266 6309 16385 3636 -650
17730f50k9767K3402L6995k7988j9407l5441O2454K1217l3269K2470L3677j6531
$$ -650 -30417 -7015 29980 1992 -17415 -52856 9598 30815 -2454 20016 53693 37162
17718C7162j1287K8937k4877p6229N1510k116M7888J1670j3277j4643l972k9524
$$ 37162 25875 54812 29935 -46294 5216 3100 50988 62658 49381 34738 30766 1242
17706A242l334O2027m708p7019j495J7537K9809O468J3558k6727j8953P0723n0703
$$ 1242 -2092 59935 55227 -21792 -23287 -5750 24059 30527 44085 17358 -1595 69128 18425
17693A8425m6089q642L0333K8870k0619M1559M8821m9492j50524l27L2452N4319
$$ 18425 -27664 -36306 -5973 22897 2278 43837 92658 43166 -107358 -107685 -75233 -20914
17681b0914k5685N115N5487L8176j3716j8192O253L518J9101o4495k963L4309
$$ -20914 -46599 -41484 14003 52179 38463 20271 26524 30042 49143 -15352 -18315 15994
17669A5994K8488R154j8244m1587k2668J2753M0270l7639o1283j9472j5581O5169
$$ 15994 44482 53636 35392 -6195 -28863 -16110 24160 -13479 -74762 -94234 -109815 -44646
17657d4646O7371L0359l9381j9696j6360m5940K0261L2393l5541k5636L9273k3698
$$ -44646 22725 53084 13703 -5993 -22353 -68293 -48032 -15639 -51180 -76816 -37543 -61241
17645f1241K4285j1607j9273M1008O9269K6575J6885m0654K2856l7268j0594M0350
$$ -61241 -36956 -48563 -67836 -26828 42441 69016 85901 45247 68103 30835 20241 60591
17633F0591j1160l3208l296M5628j0998o4822M4031O3825J3378o580l2311n0227
$$ 60591 49431 16223 12927 58555 47557 -17265 26766 90591 103969 97389 65078 14851
17621A4851l8029M2756M502j6019k7993K0078j201K3398m9550j8785L2639K2926
$$ 14851 -23178 19578 24080 8061 -19932 146 -1055 22343 -27207 -45992 -13353 9573
17609I573R8006J374l0392j8981r54J7525L4876m8463J5104K1597J1227k8837
$$ 9573 107579 108953 78561 59580 58626 76151 111027 62564 77668 99265 110492 81655
17597H1655j1401j9018q064k3392l3892j5869K4718K0083Q741j825m6406m6271
$$ 81655 70254 51236 43172 19780 -14112 -29981 -5263 14820 23561 21736 -24670 -70941
17585g0941K1046O2546M8687M7056k6263k8912o2057J744m021K1718k7650P440
$$ -70941 -49895 12651 61338 108394 82131 53219 -8838 -7094 -11115 10603 -17047 -9607
17573i607J0147M1801L353L9924J7550j0237m0406J7571M0446J8082q7425o6442
$$ -9607 540 42341 45694 85618 103168 92931 52525 70096 110542 128624 41199 -25243
17561b5243j6605k100J530K4251O8031P6243J1254n7185n2685L1470K6167l3087
$$ -25243 -41848 -43948 -42418 -18167 49864 126107 137361 80176 27491 58961 85128 52041
17549E2041l8300J4145K2302R776m1750K6653M264j3613k1749J7751M9889P77
$$ 52041 13741 27886 50188 59964 18214 44867 49131 35518 13769 31520 81409 82186
17537H2186o6406l293J0903m6713o716K8772M4121K2265r172L4393p2217n0973
$$ 82186 15780 12487 23390 -23323 -30039 -1267 42854 65119 55947 90340 18123 -32850
17525c2850M4879k216q18J7090O246k6477O5612L842K3641O176n670l1360m0683
$$ -32850 12029 9813 8995 26085 32331 5854 71466 75308 98949 105125 99455 68095 27412
17512B7412r503j4665K1958P059m5429M1442K5157l7061o8059K1723j129L668
$$ 27412 17909 3244 25202 32261 -13168 28274 53431 16370 -51689 -29966 -31095 -27427
17500b7427k206L6903j9633o3556j6078j6832K0569p286N308O5554P4296j533
$$ -27427 -29633 7270 -12363 -75919 -91997 -108829 -88260 -95546 -90238 -24684 49612 48079
17488D8079r0001p0539L8649k6028m0099L3925O7179P599M507j2419l9184l3923
$$ 48079 -41922 -112461 -73812 -99840 -139939 -106014 -38835 -31236 -26729 -39148 -78332 -112255
17476a12255k9496K2194L0404o945l0497j7044P6920P5430J7382m8822J9100m901
$$ -112255 -141751 -119557 -89153 -96098 -126595 -143639 -66719 8711 26093 -22729 -3629 -8530
17464h530k6311l531J8496K3243j9116l7954r58n553M8175K6780M1644r38m3038
$$ -8530 -34841 -38372 -19876 3367 -15749 -53703 -54661 -60214 -12039 14741 56385 55447 12409
17451A2409n6640n7752j5261k1523J3792N7516P9871N8780K6574l555q1130k5609
$$ 12409 -44231 -101983 -117244 -138767 -124975 -67459 12412 71192 97766 94211 13081 -12528
17439a2528O838L7627l270q8413j7909K8260K9215k2153K248J2193J872K2064
$$ -12528 -5690 31937 28667 -59746 -77655 -49395 -20180 -42333 -40085 -27892 -26020 -3956
17427c956K3185M4472L268j4665K9343j1952m2908n7993J8444O7583n540K1047
$$ -3956 19229 63701 66969 52304 81647 69695 26787 -31206 -12762 54821 49281 70328
17415G0328j3664J8450j0693q0334p3742l546M6884K9578K4489Q297J6223J5749
$$ 70328 56664 75114 64421 -15913 -89655 -93201 -46317 -16739 7750 16047 32270 48019
17403D8019L5460k1261j3605k3539o4809j0665O8362L7476r6j6693m1234R049
$$ 48019 83479 62218 48613 25074 -39735 -50400 17962 55438 55342 38649 -2585 6464
17391F464n6167j9715K1797N1880M5323k1713l9956K9244n4141m2816R21K7708
$$ 6464 -49703 -69418 -47621 4259 49582 27869 -12087 17157 -36984 -79800 -78879 -51171
17379e1171K5538j5743m820N9722K1558j6827k3156j6145l8178o806J5232K1200
$$ -51171 -25633 -41376 -46196 13526 35084 18257 -4899 -21044 -59222 -66028 -50796 -29596
17367b9596Q076j8358O07P0475L9646K5166l67m9106m5987o406n876N0405L8120
$$ -29596 -21520 -39878 -39271 31204 70850 96016 95649 46543 556 -5850 -11726 38679 76799
17354G6799R896k4872k3298k7552r6806O5828P7250J92m7831m4663l7124L648
$$ 76799 86695 61823 38525 10973 -85833 -20005 57245 57437 9606 -35057 -72181 -68533
17342f8533M1220J8682m1892J5334J9860l1757r128N2492J3290r194L938J5125
$$ -68533 -27313 -8631 -50523 -35189 -15329 -47086 -56214 -3722 9568 374 4312 19437
17330A9437j0677L7001j9557m6835j4658J1670K8837K3369m5819k0983K5835n46
$$ 19437 8760 45761 26204 -20631 -35289 -23619 5218 28587 -17232 -38215 -12380 -12926
17318a2926j0543J1551m801q604O395J0310L7941K7879l4746j5288M8148o056
$$ -12926 -23469 -11918 -16719 -25323 -18928 -8618 29323 57202 22456 7168 55316 49260
17306D9260j7480K3035k7175k3912l022J1042j368R194M20o8865r152K0671J8446
$$ 49260 31780 54815 27640 3728 706 11748 10380 19574 19994 -48871 -58023 -37352 -18906
17293a8906J3567j9823M5433K7328j2045J67k2449N6898J4360n0354j468k979
$$ -18906 -5339 -25162 20271 47599 35554 35721 13272 70170 84530 34176 32708 29729
17281B9729L2669J3580k0416k5915o011j911r089r951p316j7866M0686k707n0538
$$ 29729 62398 75978 55562 29647 23636 21725 12636 2685 -4631 -22497 18189 15482 -35056
17268c5056L3421J0337j2719k8812J1372K7586k4817k4245m8606j4256k5319r155
$$ -35056 -1635 8702 -4017 -32829 -21457 6129 -18688 -42933 -91539 -105795 -131114 -140269
17256a40269Q529M0420Q2574L4111k5108o9245m317J21l326N0699M5722L111N1775
$$ -140269 -131740 -91320 -8746 25365 257 -68988 -73305 -73184 -76510 -25811 19911 23022 74797
17243G4797J0555j3474k8702n511j0815J5196P578k979j7295r896j7803n4621
$$ 74797 85352 71878 43176 37665 26850 42046 49624 46645 29350 19454 1651 -52970
17231e2970k0120L3299j0378l7810N6599K303j1374M2445J4946J0701n2079l1924
$$ -52970 -73090 -39791 -50169 -87979 -31380 -29077 -40451 1994 16940 27641 -24438 -56362
17219e6362K4555j4672l1644K2190M8666K6299m9018k3460J9064o568l2581J8372
$$ -56362 -31807 -46479 -78123 -55933 -7267 19032 -29986 -53446 -34382 -40950 -73531 -55159
17207e5159J5028J0317L8993j1203J1740n954L6668O2369P730l4644j0476l0291
$$ -55159 -40131 -29814 9179 -2024 9716 3762 40430 102799 110529 75885 65409 35118
17195C5118p7740J1858K6742J2569p331L5464k8974l6309Q4457J9312k1638J3558
$$ 35118 -42622 -30764 -4022 8547 1216 36680 7706 -28603 55854 75166 53528 67086
17183F7086l8753l2385K6548N7291j7435m9485k3356L651M2878M2160j8984j8875
$$ 67086 28333 -4052 22496 79787 62352 12867 -10489 -6838 36040 78200 59216 40341
17171D0341k1653j6233k7161j0790J447L7207N3824M2829k8237J1840k8110l1659
$$ 40341 18688 2455 -24706 -35496 -34049 3158 56982 99811 71574 83414 55304 23645
17159B3645l8476p9203J4767j4682L4191Q505K5522j8738j6202K9556L6232J4547
$$ 23645 -14831 -94034 -79267 -93949 -59758 -51253 -25731 -44469 -60671 -31115 5117 19664
17147A9664l6262l3856j5994N5947J6133L6448j8439n5459m8256M2773K1397J5923
$$ 19664 -16598 -50454 -66448 -10501 5632 42080 23641 -31818 -80074 -37301 -15904 19
17135A9L5390L572M0472L1974k077o0863n7273K0273Q0347J9290m7553l7713j5119
$$ 19 35409 38981 79453 111427 109350 48487 -8786 11487 91834 111124 63571 25858 10739
17122A0739J5583O760M8864P758n1594o0816K8968r617K1832K5596j7763q391
$$ 10739 26322 33082 81946 89704 38110 -22706 6262 -3355 18477 44073 26310 17919
17110A7919j1811j2707K6140J560l5879L5971j171m6929l2630J8074K4729L5642
$$ 17919 6108 -6599 19541 21101 -14778 21193 20022 -26907 -59537 -41463 -16734 18908
17098A8908j7377k151n4670j0808K6728R859K2263O4016o541k0557l4393K8876
$$ 18908 1531 -620 -55290 -66098 -39370 -29511 -7248 56768 50227 29670 -4723 24153
17086B4153n293r379j1197l4353l4261R5830J7465j7028K904k7873m0836L9260
$$ 24153 18860 9481 -1716 -36069 -70330 25500 42965 25937 28841 968 -39868 -608
17074f08j439L9521K8853m0262p1196O6686M2689k8472k4866k0099N195O3196
$$ -608 -2047 37474 66327 26065 -45131 21555 64244 35772 10906 -9193 -3998 59198
17062E9198k4433m0440P397J0714J4934M0272k3066k1167m081j5368m6502L567
$$ 59198 34765 -5675 1722 12436 27370 67642 44576 23409 19328 3960 -42542 -38975
17050c8975M7814J070j2692l4245n4731L9538j614M3999J6037K0147K741k617
$$ -38975 8839 9909 -2783 -37028 -91759 -52221 -53835 -9836 6201 26348 29089 26472
17038B6472j2884J6102L0183q401p0351L8008K4640M6260L8617n6067K2508J787
$$ 26472 13588 29690 59873 51472 -18879 19129 43769 90029 128646 72579 95087 96874
17026I6874o41m7776o455l8208k6894O724l8886L3581L2648p9020J0308K9142
$$ 96874 96233 48457 42002 3794 -23100 -16376 -55262 -21681 10967 -68053 -57745 -28603
17014b8603M5083P759m289M709j0557m2760q13N7235J7244J3004M3420j4801n5580
$$ -28603 16480 24239 19950 24659 14102 -28658 -29471 27764 45008 58012 101432 86631 31051
17001C1051j9288J1010k9807J6567Q900L5417N1669j4271n9582K3082L462j0336
$$ 31051 11763 22773 -7034 9533 18433 53850 105519 91248 31666 54748 58210 47874
16989D7874J2792m1017l2735m5320k7809J6886J0045M311N6081L0039m5702m753
$$ 47874 60666 19649 -13086 -58406 -86215 -69329 -59284 -54973 1108 31147 -14555 -19308
16977a9308m6029L1142M8227M1437J1071j08599p4487k0655J8035Q2252N0237
$$ -19308 -65337 -34195 14032 55469 66540 -42059 -116546 -137201 -119166 -36914 13323
16966A3323j5738l7480m0862j0614L1310P5233N0738k4367L5115j9384p2334p6923
$$ 13323 -2415 -39895 -80757 -91371 -60061 15172 65910 41543 76658 57274 -15060 -91983
16954i1983K205K2945n3824J9919M4276p760o6111Q313M3358P6286M5228k2304
$$ -91983 -89778 -66833 -120657 -100738 -56462 -64222 -130333 -122020 -78662 -2376 42852 20548
16942B0548k8959j9827j1951j1067L3065K0089m4368l8988L3996k0029p02L1456
$$ 20548 -8411 -28238 -40189 -51256 -18191 1898 -42470 -81458 -47462 -67491 -68193 -36737
16930c6737K4881J710L349P477P515K3786o4834m9932j0435j2740L70J9124q5721
$$ -36737 -11856 -10146 -6797 680 8195 31981 -32853 -82785 -93220 -105960 -105590 -86466 -172187
16917a72187J3587J16339P1382K1983m1419l3273l2293j3829l7925k7163j523
$$ -172187 -158600 -42261 29121 51104 9685 -23588 -55881 -69710 -107635 -134798 -136321
16906a36321r998K0434K5125M5227J0905m8380P520K4556J110P4694m627j1969
$$ -136321 -146319 -125885 -100760 -55533 -44628 -93008 -85488 -60932 -59822 14872 10245 -1724
16894a724P4070o845o9677P7668N145m2287j6381P149K5613n1537m9119J9200
$$ -1724 72346 65501 -4176 73492 78637 36350 19969 27118 52731 1194 -47925 -28725
16882b8725m946m8555J312J8214K7148j2312M6782J2825n0967j9407P7870O0072
$$ -28725 -33671 -82226 -80914 -62700 -35552 -47864 -1082 11743 -39224 -58631 19239 79311
16870G9311J3128l3830j1199o3116n0563p3j8164j911K6763O2574M7400N501o0985
$$ 79311 92439 58609 47410 -15706 -66269 -66342 -84506 -86417 -59654 2920 50320 55821 -5164
16857e164l0745l497p374L7879J5268N9134N90j2019j2364p5582K166N9148P19
$$ -5164 -35909 -39406 -46780 -8901 6367 65501 66091 54072 41708 -33874 -31708 27440 28159
16844B8159k3531l5593N0141l6060m3353l3206l6607k7245O8259N7045L0596n2586
$$ 28159 4628 -30965 19176 -16884 -60237 -93443 -130050 -157295 -89036 -31991 -1395 -53981
16832e3981k9507J9736J0338j5777J7314M1563l5071l7454j7565o4873j0771Q4957
$$ -53981 -83488 -63752 -53414 -69191 -51877 -10314 -45385 -82839 -100404 -165277 -176048 -91091
16820i1091M9885j1481J6909j404p333J6838M3925l8494j7085M2468m1955o531
$$ -91091 -41206 -52687 -35778 -37182 -44515 -27677 16248 -22246 -39331 3137 -38818 -45349
16808d5349L7880m3006k8309J4461n874L453J2459R8336L3205l1558n2380k003
$$ -45349 -7469 -50475 -78784 -64323 -70197 -66744 -54285 44051 77256 45698 -6682 -8685
16796h685k6720l1050k116J7508J3153M286M6905K1040k342m5287N740k8791k6096
$$ -8685 -35405 -66455 -68571 -51063 -37910 -33624 13281 34321 31979 -13308 -7568 -36359 -62455
16783f2455N2529Q992k4219J0727m5800k0649l1697J4183Q6457K569K5817K6805
$$ -62455 -9926 -934 -25153 -14426 -60226 -80875 -112572 -98389 -11932 -9363 16454 43259
16771D3259j7344l5049k2193l9423R537J9337N557N2584N8389n494k2291J5072
$$ 43259 25915 -9134 -31327 -70750 -61213 -41876 -36319 16265 74654 69160 46869 61941
16759F1941n4280m0935k4881J8392K1850m056K1579M7751k8737K396L8818m9774
$$ 61941 7661 -33274 -58155 -39763 -17913 -21969 -390 47361 18624 21020 59838 10064
16747A0064K8591j7445n0009K4007M5145K8106l0340l8107l1728j3481N283M8468
$$ 10064 38655 21210 -28799 -4792 40353 68459 38119 12 -31716 -45197 -39914 8554
16735H554J0296n5728J9120M4245J5288o7546l4792n850J2491L8831o4348k6520
$$ 8554 18850 -36878 -17758 26487 41775 -25771 -60563 -66413 -53922 -15091 -79439 -105959
16723a05959k2053K4849N312J7523j4755o6054K9893J5125j351P993J6764m5979
$$ -105959 -128012 -103163 -97851 -80328 -95083 -161137 -131244 -116119 -117470 -109477 -92713 -138692
16711a38692j7558P3510O6765K9439n6983K6319K1370k6928J2163K7214l9216
$$ -138692 -156250 -82740 -15975 13464 -43519 -17200 4170 -22758 -10595 16619 -22597
16700b2597l236N1015L9341K1599n2718m6701K859m2937K4837K5522m046l0997
$$ -22597 -25833 25182 64523 86122 33404 -13297 -10438 -53375 -28538 -3016 -7062 -38059
16688c8059J4263N540O941O854N1095P4543m3956m0864J9779j7407k6594J340
$$ -38059 -23796 -18256 -11315 -4461 46634 121177 77221 36357 56136 38729 12135 13475
16676A3475M1103J5021J1652k5399j5876j593K2007j5127J2591n3814K0355k7097
$$ 13475 54578 69599 81251 55852 39976 38383 60390 45263 57854 4040 24395 -2702
16664b702n4423P2970L9901K0624J7892l2305k9954j5089l8651n5695r014L6871
$$ -2702 -57125 15845 55746 76370 94262 61957 32003 16914 -21737 -77432 -86446 -49575
16652d9575M484O7006k9033p436J685L297k4142J936M5535L0644M3521j7691M5450
$$ -49575 -45091 21915 -7118 -14554 -12869 -9572 -33714 -31778 13757 44401 87922 70231 115681
16639A15681p45p8745k7538K652M231l3400L4560N3437p7773m6298M5294N1818
$$ 115681 114936 36191 8653 11305 15536 -17864 16696 70133 -7640 -53938 -8644 43174
16627D3174l2616j7926j1700k7343p3111J5939M5321K6499L9800J1970l7604J2130
$$ 43174 10558 -7368 -19068 -46411 -119522 -103583 -58262 -31763 8037 20007 -17597 -5467
16615e467K8217l5346q4884j5988j276K9426M5156R2940k0566k2607n6145O2458
$$ -5467 22750 -12596 -97480 -113468 -114744 -85318 -40162 52778 32212 9605 -46540 15918
16603A5918L3315j847k676k5417L605l580j0059M0963j3265n2224K6581M8925
$$ 15918 49233 47386 44710 19293 22898 19318 9259 50222 36957 -15267 11314 60239
16591F0239j9983k117k2497N019j7608m1836P182j3096Q109j9356J6537O526k9398
$$ 60239 40256 38139 15642 20661 3053 -38783 -31601 -44697 -36588 -55944 -39407 -32881 -62279
16578f2279L2762l4784J8487J5150j7531N909J1139K1710Q6821L3012o404l4130
$$ -62279 -29517 -64301 -45814 -30664 -48195 -42286 -31147 -9437 77384 110396 103992 69862
16566F9862q0106k6672j3292J1802N248l1399j1538l4210K5641Q769L5006k4472
$$ 69862 -10244 -36916 -50208 -38406 -33158 -64557 -76095 -110305 -84664 -75895 -40889 -65361
16554f5361K8090k2300o607k1194J9023N3865K9925r654k0890N470j8643J9481
$$ -65361 -37271 -59571 -66178 -87372 -68349 -14484 15441 5787 -15103 -9633 -28276 -8795
16542h795m676K4502K2023m0664l6553J5971P1147L9391m703k3334k72k1907K6061
$$ -8795 -13471 11031 33054 -7610 -44163 -28192 42955 82346 77643 54309 54037 32130 58191
16529E8191Q480j1721k7000j7166k2743l1447k456R182j3937k0364J2740L9068
$$ 58191 66671 54950 27950 10784 -11959 -43406 -45862 -36680 -50617 -70981 -58241 -19173
16517a9173L6553j176j4743k2244J5623k2214M4786K7812j815j3249P716K5301
$$ -19173 17380 16204 1461 -20783 -5160 -27374 17412 45224 43409 30160 37876 63177
16505F3177m4384m720o0010m3470J5669M1564l129n1867n5696k7051L3622O5388
$$ 63177 18793 14073 -45937 -89407 -73738 -32174 -35303 -87170 -142866 -169917 -136295 -70907
16493g0907Q5077j8169p8471k1955J8150J2856k5400J501M930j1437N7289O6931
$$ -70907 14170 -3999 -82470 -104425 -86275 -73419 -98819 -97318 -92388 -103825 -46536 20395
16481B0395j8493M930k3090J1413P0084O6795k1464r3393j3197k6548k7515J868
$$ 20395 1902 6832 -16258 -4845 65239 132034 110570 17177 3980 -22568 -50083 -48215
16469d8215N2813j7693m0267O142l4220J7111N3266j3876j086m4631K1848K0905
$$ -48215 4598 -13095 -53362 -47220 -81440 -64329 -11063 -24939 -26025 -70656 -48808 -27903
16457b7903l3011j559L2867J9765L7544k9966j08717R046M5999K7932L8349k4747
$$ -27903 -60914 -62473 -29606 -9841 27703 -2263 -110980 -101934 -55935 -28003 10346 -14401
16445a4401m9104n725P302M180q896N6633J7941l4223J0866j038O812J8453l4580
$$ -14401 -63505 -69230 -61928 -57748 -66644 -10011 7930 -26293 -15427 -16465 -9653 8800 -25780
16432b5780j1734J5898m092K5817k6178M8800L9895r049l4065r453n2841m0118
$$ -25780 -37514 -21616 -25708 109 -26069 22731 62626 53577 19512 10059 -42782 -82900
16420h2900K1299q500L3686P3230O673k1080R438k3023n148J4068o898K2485m649
$$ -82900 -61601 -70101 -36415 36815 43488 22408 31846 8823 3675 17743 10845 33330 28681
16407B8681m3302K8624j557j0211n3483M0480M0315m0596K427l548Q3179M4491
$$ 28681 -14621 14003 12446 2235 -51248 -10768 29547 -11049 -8622 -12170 71009 115500
16395A15500n9842J741j8424l7519m7984j2087J9539P7k2450o5504M4028M9228
$$ 115500 55658 57399 38975 1456 -46528 -58615 -39076 -38999 -61449 -126953 -82925 -33697
16383c3697K6936k0371n8488j6008K4040M5543m8812M698P0436N7132m350q4956
$$ -33697 -6761 -27132 -85620 -101628 -77588 -32045 -80857 -76159 -5723 51409 47059 -37897
16371c7897r6260l4263R6658K5103Q82l543q724L3923M7721N757K7119j2608n6139
$$ -37897 -134157 -168420 -71762 -46659 -45777 -49320 -58044 -24121 23600 29357 56476 43868 -12271
16358a2271l464P655l0565k4885O5413K8424J3493k3802M9232J139J1602r338
$$ -12271 -15735 -8080 -38645 -63530 1883 30307 43800 19998 69230 70369 81971 72633
16346G2633o5447j4922q881r034J3234N2462L7014K773l9574k1911j09809K770
$$ 72633 7186 -7736 -16617 -25651 -12417 40045 77059 79832 40258 18347 -91462 -88692
16334h8692R2709J1072L6363J1551j9817L6244k3167l9905k4825m5665m776M8286
$$ -88692 4017 15089 51452 63003 43186 79430 56263 16358 -8467 -54132 -58908 -10622
16322a0622P644L3907l1125m5645k4853N1205K1139j9057k7K6K8984j825l007
$$ -10622 -2978 30929 -196 -45841 -70694 -19489 1650 -17407 -17434 -17408 11576 9751 6744
16309F744n316N108J051l1310M7827l784Q787J9915n0970l8962M15K5093M767
$$ 6744 1428 6536 7587 -23723 24104 20320 29107 49022 -1948 -40910 -40495 -15402 -10635
16296a0635M1425j2573p552m2671j01950k157M5015K2022L6046L1845L1767J6115
$$ -10635 30790 18217 10665 -32006 -133956 -136113 -91098 -69076 -33030 -1185 30582 46697
16284D6697J5843Q12l5924k1700p235j1711k1779r7667k9236N6171Q1972K9729
$$ 46697 62540 63352 27428 5728 -1507 -13218 -34997 -132664 -161900 -105729 -23757 5972
16272E972J4681J8941L8230k1760l8091J041M0597k53m5625l0128R57J9414p550
$$ 5972 20653 39594 77824 56064 17973 19014 59611 59358 13733 -16395 -15438 3976 -3574
16259c574o2202J4416J4656k847k8887l8417O1548M5922k7732m4689L2516J5472
$$ -3574 -65776 -51360 -36704 -39551 -68438 -106855 -45307 615 -27117 -71806 -39290 -23818
16247b3818k1600k2891k8166j2877M0141L0309L8029j4991Q178j068J5150J615
$$ -23818 -45418 -68309 -96475 -109352 -69211 -38902 -873 -15864 -7686 -8754 6396 8011
16235H011R98Q832L6812M3132o920m4852M461j496o6920M154L7161L1899k5481
$$ 8011 9009 17841 54653 97785 90865 46013 50474 48978 -17942 -13788 23373 55272 29791
16222B9791n5369k0161j2496n1870j0394M1190L2433k1293L849m6812L4479P9298
$$ 29791 -25578 -45739 -58235 -110105 -120499 -79309 -46876 -68169 -64320 -111132 -76653 2645
16210B645L6779k3200p7930Q786r214k5284j4697N2752M6479N4507l320l703l2522
$$ 2645 39424 16224 -61706 -52920 -62134 -87418 -102115 -49363 -2884 51623 48303 44600 12078
16197A2078r853k6150j02269J3058M9969M2138M9333J9531k9816j4345J957j3420
$$ 12078 2225 -23925 -126194 -113136 -63167 -21029 28304 47835 18019 3674 5631 -7789
16185g789k0640k6148P13m3771k9611o280M7318k1112n7806L1601Q9474L748L2551
$$ -7789 -28429 -54577 -53864 -97635 -127246 -133526 -86208 -107320 -165126 -133525 -44051 -40303 -7752
16172g752K7637K9891m128l0876m9423j0174K9488r767k5902J3708o733R859J2324
$$ -7752 19885 49776 45648 14772 -34651 -44825 -15337 -25104 -51006 -37298 -44031 -34172 -21848
16159b1848j622m4929k1739L5154M3012K887L5591k778l1098r296j8883R590k5621
$$ -21848 -23470 -68399 -90138 -54984 -11972 -9085 26506 23728 -7370 -16666 -35549 -25959 -51580
16146e1580j1578O2116P9021M6599O942p744l3034l1379o30Q284q3289j3945K6734
$$ -51580 -63158 -1042 77979 124578 131520 123776 90742 59363 58733 67017 -16272 -30217 -3483
16133c483M4597J5333M3598l688n3447l4034O416j8941K8912j2797r6616R763
$$ -3483 41114 56447 100045 96357 42910 8876 15292 -3649 25263 12466 -84150 -74387
16121g4387P238m7974K2362L6210L8644j6151K9839N069m9490P9605J1517J905
$$ -74387 -67149 -115123 -92761 -56551 -17907 -34058 -4219 850 -48640 30965 42482 44387
16109D4387q7890l7441O1993O1688m2844l6306k801O851j8616k4400K3999l3102
$$ 44387 -43503 -80944 -18951 42737 -107 -36413 -39214 -32363 -50979 -75379 -51380 -84482
16097h4482J4776J0525K3922q054M2381J9110K1035m4203k6387M2257O1641K531
$$ -84482 -69706 -59181 -35259 -43313 -932 18178 39213 -4990 -31377 10880 72521 75052
16085G5052k3204j5279K3857N7863m6274k9957l4582r0412K7018O0134J5847n7760
$$ 75052 51848 36569 60426 118289 72015 42058 7476 -82936 -55918 4216 20063 -37697
16073c7697P803L4581k5694Q594K1305k2771m4386j1586J3173L6971O041J0852
$$ -37697 -29894 4687 -21007 -12413 8892 -13879 -58265 -69851 -56678 -19707 -13666 -2814
16061b814K7155l7340q42J1027Q501m668M0997l6418q2056J376K2076K129L6698
$$ -2814 24341 -12999 -13841 -2814 5687 1019 42016 5598 -76458 -75082 -53006 -50877 -14179
16048a4179M655K5259m6841j180K2844k3248j2856k996K2582L4731L9462j9341
$$ -14179 -9524 15735 -31106 -32286 -9442 -32690 -45546 -48542 -25960 8771 48233 28892
16036B8892l0899j7555m4553L606j4445j7025K3147O6877N006j9664j6851L3742
$$ 28892 -2007 -19562 -64115 -60509 -74954 -91979 -68832 -1955 3051 -16613 -33464 278
16024B78P05m0N269K8661q738q360j3970k0171J9028J5202K6104o3493L273j2285
$$ 278 983 943 6212 34873 26135 17775 3805 -16366 2662 17864 43968 -19525 -16252 -28537
16010b8537N674K2715j49q102J3354k0393K3697l2403l9449J0478k6671Q079N4586
$$ -28537 -22863 -148 -297 -8399 4955 -15438 8259 -24144 -63593 -53115 -79786 -71707 -17121
15997a7121J6081o398K398k2182k0500n790q611l769K8425K634J8758K100O396
$$ -17121 -1040 -7438 -5040 -27222 -47722 -53512 -62123 -65892 -37467 -34833 -16075 -13975 -7579
15984g579M2630J4522J51q887k950j0171M4842Q074k4942J105l0418n3817n301
$$ -7579 35051 49573 49724 40837 37887 27716 72558 80632 55690 56795 26377 -27440 -32741
15971c2741K3597k5973j809N5496m3027m0395L1375k9464M910K2727M2389J1739
$$ -32741 -9144 -35117 -36926 18570 -24457 -64852 -33477 -62941 -58031 -35304 7085 18824
15959A8824p320J1676k4727K2544j2346K2571k3225m3990J1715o690o3619j1163
$$ 18824 11504 23180 -1547 20997 8651 31222 7997 -35993 -24278 -30968 -94587 -105750
15947a05750L7889O3623M3897o996J8531K9134k4205j1290m8052m3565j9645Q704
$$ -105750 -67861 -4238 39659 32663 51194 80328 56123 44833 -3219 -46784 -66429 -57725
15935e7725K5751L3246l3013l6986K5296J2681K4521L5153K3260l0796k6061n574
$$ -57725 -31974 1272 -31741 -68727 -43431 -30750 -6229 28924 52184 21388 -4673 -10247
15923a0247m7752n5559M0398R9037L1539m4334l4728O6127L5696n0256o5354q3427
$$ -10247 -57999 -113558 -73160 25877 57416 13082 -21646 44481 80177 29921 -35433 -118860
15911a18860K4045M8761O8182M2740J7806j2845o1503l6622K3120R301R819k9712
$$ -118860 -94815 -46054 22128 64868 82674 69829 8326 -28296 -5176 4125 13944 -15768
15899a5768K5112j6968J1767m6541l0336L3350M5717J2533j7407j5352J2556P3647
$$ -15768 9344 -7624 4143 -42398 -72734 -39384 6333 18866 1459 -13893 -1337 72310
15887G2310K6125m8824j3233J2252k2749j7631l0360m0716K4118N2937K5664N997
$$ 72310 98435 49611 36378 48630 25881 8250 -22110 -62826 -38708 14229 39893 45890
15875D5890l6983k4818j8220J0709O1794J2006N61J648j9434J1002o6594l6061
$$ 45890 8907 -15911 -34131 -23422 38372 50378 50939 52587 33153 44155 -22439 -58500
15863e8500Q745N5775P926n809k3540J2188l2858J8864o58r356J6695j8236L1463
$$ -58500 -49755 6020 13946 8137 -15403 -3215 -36073 -17209 -17867 -27223 -10528 -28764 2699
15850B699M7052K473N3619l289l8543l1619O3437p1810j09008J0106L4938K2664
$$ 2699 49751 52224 105843 102554 64011 32392 95829 24019 -84989 -74883 -39945 -17281
15838a7281J2082l5616l1458n1055K9394M5744K2289M8469j6883q062k0215k7994
$$ -17281 -5199 -40815 -72273 -123328 -93934 -48190 -25901 22568 5685 -2377 -22592 -50586
15826e0586J5857m668k9014J4228R817k7564m1642K1747N6675J451K0722L9997
$$ -50586 -34729 -39397 -68411 -54183 -44366 -71930 -113572 -91825 -35150 -33699 -12977 27020
15814B7020K8045n1016m1099L752K6554l4740J2253o036j4951j851m0160K55J4572
$$ 27020 55065 4049 -37050 -33298 -6744 -41484 -29231 -35267 -50218 -52069 -92229 -91974 -77402
15801g7402L0781K8790l7552k0300L9150j7022j6723K0767N2008N6884j3480j6030
$$ -77402 -46621 -17831 -55383 -75683 -36533 -53555 -70278 -49511 2497 59381 45901 29871
15789B9871j9769j6048L7887J6397p623J1726K1977n9917k3592K0955n22j8973
$$ 29871 10102 -5946 31941 48338 40715 52441 74418 14501 -9091 11864 11342 -7631
15777g631K3204O0774K0034m1113l9596P242j7212n5783l713K7852L2249K4668
$$ -7631 15573 76347 96381 55268 15672 22914 5702 -50081 -53794 -25942 6307 30975
15765C0975k7998K9049J5736l6752o7841J5169J9059J8539q636M985R620k1039
$$ 30975 2977 32026 47762 11010 -56831 -41662 -22603 -4064 -12700 -7715 1905 -19134
15753a9134k9407K6461K2219o736N6055Q66m0948n6708q5309j6261N6979P2304
$$ -19134 -48541 -22080 139 -6597 49458 50324 9376 -47332 -132641 -148902 -91923 -19619
15741a9619M6121N2482L7968q3039o0464l7358K705K3010o0417N4205M9237l3343
$$ -19619 26502 78984 116952 33913 -26551 -63909 -61204 -38194 -98611 -44406 4831 -28512
15729b8512m909k2729M3401J3713K7886J3661k3286n3780q724j3367K8410O7556
$$ -28512 -33421 -56150 -12749 964 28850 42511 19225 -34555 -43279 -56646 -28236 39320
15717C9320Q274N0995j1468k3336n7626l5312M3304k1604m4552K752M0465L0023
$$ 39320 47594 98589 87121 63785 6159 -29153 14151 -7453 -52005 -49253 -8788 21235
15705B1235L5233L1987l7764j807m7674n6305l2549k314M4070L5316m9746m3375
$$ 21235 56468 88455 50691 48884 1210 -55095 -87644 -89958 -45888 -10572 -60318 -103693
15693a03693K5255j5692K4607j2493M6589K0658K2236j1250k5707J6062J7742
$$ -103693 -78438 -94130 -69523 -82016 -35427 -14769 7467 -3783 -29490 -13428 4314
15682D314j1283l8652k8589l3359K2567P2148K4346Q358j0739p5321Q588N6249
$$ 4314 -6969 -45621 -74210 -107569 -85002 -12854 11492 19850 9111 -66210 -57622 -1373
15670a373J0769n5747m4296l0166J8515O6918p010J3910L0096R82N2412r78m5168
$$ -1373 9396 -46351 -90647 -120813 -102298 -35380 -42390 -28480 1616 2598 55010 54032 8864
15657H864p347k7957k0012O7167j3779m0336l227J1402M0742K4519P888k8117
$$ 8864 1517 -26440 -46452 20715 6936 -33400 -36627 -25225 15517 40036 47924 19807
15645A9807n3797J5299j7287L253k7298r947J4828N2759K5392l7545j2843O0255
$$ 19807 -33990 -18691 -35978 -32725 -60023 -69970 -55142 -2383 23009 -14536 -27379 32876
15633C2876j4363k6809Q193N0832k7056m0670J5692L9913M4359l8615J4362l9
$$ 32876 18513 -8296 -103 50729 23673 -16997 -1305 38608 82967 44352 58714 58675
15621E8675o7676J1841q14l149L3399r280L047l3115m1935k7462l106J5038J9922
$$ 58675 -9001 2840 2026 -1123 32276 22996 26043 -7072 -49007 -76469 -79575 -64537 -44615
15608d4615O8704K2048o97q204j1444J1437K1288j4156o123m3049j9686O575n628
$$ -44615 24089 46137 45440 37236 25792 37229 58517 44361 38238 -4811 -24497 -17922 -23550
15595b3550r383l2452m637L7858K8290l6377J6117K0237p0932o2826M5222r380
$$ -23550 -32933 -65385 -70022 -32164 -3874 -40251 -24134 -3897 -74829 -137655 -92433 -101813
15583a01813P6477M9636n940k4136k8411P448r04o1617l9278l0775N4274K8891
$$ -101813 -25336 24300 18360 -5776 -34187 -26739 -27643 -89260 -128538 -159313 -105039 -76148
15571g6148N967o9528n378k912K671O1678N5983M8328M0527K5966m7035m8205
$$ -76148 -70181 -139709 -145087 -147999 -145328 -83650 -27667 20661 61188 87154 40119 -8086
15559h086K7694J9610m9943j5904l0980M3221L7288K5647L68l46k6217O660O3664
$$ -8086 19608 39218 -10725 -26629 -57609 -14388 22900 48547 48915 48569 22352 29012 92676
15546I2676K7828Q58r9627n3995K9062M7564Q1185J540j5457o5965k2299M4937
$$ 92676 120504 121362 21735 -32260 -3198 44366 125551 127091 111634 45669 23370 68307
15534F8307k0290R037j2736k5314o331l8648k9135K7981M8681L5914O214l9195
$$ 68307 48017 57054 44318 19004 12673 -25975 -55110 -27129 21552 57466 63680 24485
15522B4485l5560K7983k5463k2328j0915M917J495j3418J8900K7016J728m9721
$$ 24485 -11075 16908 -8555 -30883 -41798 -36881 -35386 -48804 -29904 -2888 -1160 -50881
15510e0881r042L2553J7413M2864N6441O098k3102k3994K3499J129q0043m779
$$ -50881 -59923 -27370 -9957 32907 89348 95446 72344 48350 71849 72978 -7065 -11844
15498a1844N8309P590l0459k7246M6215O716l3337q6552n0852M9621l5613j2340
$$ -11844 46465 54055 23596 -3650 42565 49281 15944 -70608 -121460 -71839 -107452 -119792
15486a19792O9554N1349K1756n5183k6880R410L2644k4871N0575J9010k9198L062
$$ -119792 -50238 1111 22867 -32316 -59196 -49786 -17142 -42013 8562 27572 -1626 1436
15474A436j140Q321R239J1655K1243k2698n572k1133n2417j679J1451M1314R49
$$ 1436 296 8617 17856 29511 50754 28056 22484 1351 -51066 -52745 -41294 20 969
15461I69j5459l6793m9491L9837P725k0485M9176K5694Q678j6513k2265k6621
$$ 969 -14490 -51283 -100774 -60937 -53212 -73697 -24521 1173 9851 -6662 -28927 -55548
15449e5548M8951k0056l8655j458j2672j2120K6542p807K7809K7925L4926J1282
$$ -55548 -6597 -26653 -65308 -66766 -79438 -91558 -65016 -72823 -45014 -17089 17837 29119
15437B9119k3484K1727j4370l6246K0978L5980J369l0431k1886J778l3123K2265
$$ 29119 5635 27362 12992 -23254 -2276 33704 35073 4642 -17244 -15466 -48589 -26324
15425b6324M3266L2337k5402j4639L3523N7586r2211q2439n718L4859Q0278O4088
$$ -26324 16942 49279 23877 9238 42761 100347 8136 -74303 -80021 -45162 35116 99204
15413I9204k4805q0307m1315n5961j3928M478M5826L7459L8526J4509K4117k8424
$$ 99204 74399 -5908 -47223 -103184 -117112 -112634 -66808 -29349 9177 23686 47803 19379
15401A9379k7488r406o634m305J5029m239K3813K585m6730m3045J3391M7569M143
$$ 19379 -8109 -17515 -24149 -28454 -13425 -17664 6149 8734 -37996 -81041 -67650 -20081 -15938
15388a5938k0410j7592j9007J4440P7510K2403k5190r146K3450j5669m7094j2880
$$ -15938 -36348 -53940 -72947 -58507 19003 41406 16216 7070 30520 14851 -32243 -45123
15376d5123L1502k7178J3822N2523l4407m0772l246p031l0090l0045M2542J9107
$$ -45123 -13621 -40799 -26977 25546 -8861 -49633 -52879 -59910 -90000 -120045 -77503 -58396
15364e8396K9007L5672m0576k9342m6534j1163N1710L1861j8184k4845K9931k2385
$$ -58396 -29389 6283 -34293 -63635 -110169 -121332 -69622 -37761 -55945 -80790 -50859 -73244
15352g3244R344q012Q588R991K6897J201N7969J6583P773K2574m2308k5371N0112
$$ -73244 -63900 -71912 -63324 -53333 -26436 -25235 32734 49317 57090 79664 37356 11985 62097
15339F2097j1691j6148k4093l8270J9018P8091q052o7658k3904M993n98j0954
$$ 62097 50406 34258 10165 -28105 -9087 69004 60952 -6706 -30610 -25617 -26215 -37169
15327c7169J2906j5320k3828k2919k8306M3052M0499K3992j8883J05137k0939
$$ -37169 -24263 -39583 -63411 -86330 -114636 -71584 -31085 -7093 -25976 79161 58222
15316E8222o8629R650n868l8541k9190r481Q7908m4397j317L9272M4413m8968
$$ 58222 -10407 -757 -6625 -45166 -74356 -83837 4071 -40326 -41643 -2371 42042 -6926
15304f926p237j9743K7357M2035J3192k1225n6663k5623K7336M2193J9289J8498
$$ -6926 -14163 -33906 -6549 35486 48678 27453 -29210 -54833 -27497 14696 33985 52483
15292E2483R309j1694J3608j9059j8753j0075n4891K9922J6095K1812R145k5374
$$ 52483 61792 50098 63706 44647 25894 15819 -39072 -9150 6945 28757 37902 12528
15280A2528l9735L3421K4696j0912L1846P916O458j3245m086r180L4470r899o5287
$$ 12528 -27207 6214 30910 19998 51844 59760 66218 52973 48887 39707 74177 64278 -1009
15267a009q490k4572J8303J0365k3534O4114M2614n8695n1192L2919R989k3492
$$ -1009 -9499 -34071 -15768 -5403 -28937 35177 77791 19096 -32096 823 10812 -12680
15255a2680j8299j3240M3734P308L0524R698j0101n0941k0833J5580l301j5195
$$ -12680 -30979 -44219 -485 6823 37347 47045 36944 -13997 -34830 -19250 -22551 -37746
15243c7746k096j7125L8929J0695J9048k5940Q115k3718o0396m3283N3825P9458
$$ -37746 -39842 -56967 -18038 -7343 11705 -14235 -6120 -29838 -90234 -133517 -79692 -234
15231b34k638j819J1417J5038k9052m7758p5459p262M6840N3955R839k7975q816
$$ -234 -2872 -4691 6726 21764 -7288 -55046 -130505 -137767 -90927 -36972 -27133 -55108 -63924
15218f3924K0668J015p774j111N7410j3488P18L6419n0160j3748j8113m2595K1658
$$ -63924 -43256 -42241 -50015 -51126 6284 -7204 -6486 29933 -20227 -33975 -52088 -94683 -73025
15205g3025L048o8824j4995j6532O6970P3972j9653j9684M8990O5572J7952K043
$$ -73025 -69977 -138801 -153796 -170328 -103358 -29386 -49039 -68723 -19733 45839 63791 65834
15193F5834r4941j7199J8194N443L0542j023l5798j22582j2127O8507R535k138
$$ 65834 -29107 -46306 -28112 -22669 7873 6850 -28948 -151530 -163657 -95150 -85615 -87753
15181h7753J6342K1077J1411l4732K3965j2054j6859k2908N322L4688r80q916
$$ -87753 -71411 -50334 -38923 -73655 -49690 -61744 -78603 -101511 -96189 -61501 -62481 -71397
15169g1397R405N8987N900k7324n8740n9311J8664K6000j9943k7730O9414K1499
$$ -71397 -61992 -3005 2895 -24429 -83169 -142480 -123816 -97816 -117759 -145489 -76075 -54576
15157e4576l5333L9370K8940L4188M3726J1716k1139k9049k1245K0234j0638O161
$$ -54576 -89909 -50539 -21599 12589 56315 68031 46892 17843 -3402 16832 6194 12355
15145A2355J6904o9474m2054J7631L3612N47n291N667L7137K9917J4042o1406
$$ 12355 29259 -40215 -82269 -64638 -31026 -30479 -35770 -30103 7034 36951 50993 -10413
15133a0413l8249P418k1524L3748N273j9009L7020N781l5764j5410N9096p006
$$ -10413 -48662 -41244 -62768 -29020 -23747 -42756 -5736 45 -35719 -51129 7967 961
15121I61m0196l8710M6324K1035q549N0844K2422k0919l2494J3833n7924J1601
$$ 961 -39235 -77945 -31621 -10586 -19135 31709 54131 33212 718 14551 -43373 -31772
15109c1772N5804l300J3228r746j3527L4192P6643J6937n1534l7096m0336l9915
$$ -31772 24032 20732 33960 24214 10687 44879 121522 138459 86925 49829 9493 -30422
15097c0422k7082k6643K6000O0436N3887N93m7231o8542L7187J6558L927k3191
$$ -30422 -57504 -84147 -58147 2289 56176 56769 9538 -59004 -21817 -5259 -1332 -24523
15085b4523J6984N558l8301l1749J5220k6709K9767R2970j10J2665M2632O339
$$ -24523 -7539 -1981 -40282 -72031 -56811 -83520 -53753 39217 39107 51772 94404 100743
15073A00743j1911n3928m575l0552k2680L3556k918L7274k707L873r128n167L4290
$$ 100743 88832 34904 30329 -223 -22903 10653 7735 45009 42302 46175 37047 31880 66170
15060F6170Q702n2394m6369K0247j6098l0985K9150n654O86M1652L802O9383k8686
$$ 66170 74872 22478 -23891 -3644 -19742 -50727 -21577 -27231 -26545 15107 18909 88292 59606
15047E9606n5542l2659m0131k0676L2423P9746J0299M760j6268n4530l9841R941
$$ 59606 4064 -28595 -68726 -89402 -56979 22767 33066 37826 21558 -32972 -72813 -62872
15035f2872M6841M1099N806q570J0152l1508o6463j7003J2495M5236J7958j2428
$$ -62872 -16031 25068 30874 22304 32456 948 -65515 -82518 -70023 -24787 -6829 -19257
15023a9257n3114J1117J5473L2810L0136m799j1474l3926j3624K7316n3801M608
$$ -19257 -72371 -61254 -45781 -12971 17165 12366 892 -33034 -46658 -19342 -73143 -68535
15011f8535J0920O5380L5314m2522K8945j4322O073M0683Q293l9824r0074j0610
$$ -68535 -57615 7765 43079 557 29502 15180 21253 61936 70229 30405 -59669 -70279
14999g0279j4659l773M2177R991L5723K7593l9716m7438M2957k4315L2544l4098
$$ -70279 -84938 -88711 -46534 -36543 -820 26773 -12943 -60381 -17424 -41739 -9195 -43293
14987d3293m7943K3976M8820j655l6553N283k1914J8521M7528M0491N209l2017
$$ -43293 -91236 -67260 -18440 -20095 -56648 -51365 -73279 -54758 -7230 33261 38470 6453
14975F453o8888M9157L9889J7646K0673p056k438j3602R175J6245n6286p0393
$$ 6453 -62435 -13278 26611 44257 64930 57874 55436 41834 51009 67254 10968 -59425
14963e9425o55Q2430J2506j5768L5104J9134k3831o6489o331J3198N287J7921
$$ -59425 -60080 22350 34856 19088 54192 73326 49495 -16994 -23325 -10127 -4840 13081
14951A3081L9259j4268l670k9369r965K4120p854J5412k3677n271r503J7732l1954
$$ 13081 52340 38072 34402 5033 -4932 19188 11334 26746 3069 -2202 -11705 6027 -25927
14938b5927j6869J8136k7664K4439K4409m6986J2937K5747J3336J8178m004L4867
$$ -25927 -42796 -24660 -52324 -27885 -3476 -50462 -37525 -11778 1558 19736 15732 50599
14926E0599m4692m9375N965j0957R0271l7854o4977n0806P10J3049J887K2408
$$ 50599 5907 -43468 -37503 -48460 41811 3957 -61020 -111826 -111116 -98067 -96180 -73772
14914g3772J01181P9462l8475M090k3077n6133k6643K2600N059nM8498J3506p7902
$$ -73772 27409 106871 68396 72486 49409 -6724 -33367 -10767 -5708 -5713 42785 56291 -21611
14901b1611M1557L7756L067o466L3545q752J8010K0214o2642j0656l8449r451
$$ -21611 19946 57702 60769 54303 87848 79096 97106 117320 54678 44022 5573 -3878
14889c878r357l3188M7976k1471r506M608K4410P126k4724l0202K3988j8433K2882
$$ -3878 -13235 -46423 1553 -19918 -29424 -24816 -406 6720 -18004 -48206 -24218 -42651 -19769
14876a9769L6569l0077l2045Q670J1014Q142j0413l305K027J0748j359L9635k113
$$ -19769 16800 -13277 -45322 -36652 -25638 -17496 -27909 -31214 -29187 -18439 -19798 19837 17724
14863A7724r914j8770k4215J4969L6632l106L4703j4801K0838N553Q548K4903
$$ 17724 7810 -10960 -35175 -20206 16426 13320 48023 33222 54060 59613 68161 93064
14851I3064j8762l4843o2128L5930L6456l2426m3387J7885j561J1453K8055N626
$$ 93064 74302 39459 -22669 13261 49717 17291 -26096 -8211 -9772 1681 29736 35362
14839C5362L2052L729n0156K932P926m3818k9720j3020J6220M8104O1352l7690
$$ 35362 67414 71143 20987 23919 31845 -11973 -41693 -54713 -38493 9611 70963 33273
14827C3273R749P848j8944l4222m8476n231J9036j4549j3562O291R9070L9305
$$ 33273 43022 50870 31926 -2296 -50772 -56003 -36967 -51516 -65078 -58787 40283 79588
14815G9588L8187l1073p8140n390K1405J011o010p169j3696L5669n028P96m4605
$$ 79588 117775 86702 8562 3172 24577 25588 19578 12409 -1287 34382 29354 30150 -14455
14802a4455O5338K5215l9088k1098L840J534l5227j2127k9852J759L0656O296
$$ -14455 50883 76098 37010 15912 19752 21286 -13941 -26068 -55920 -54161 -23505 -17209
14790a7209o0099J5323K3166K2537L2321M0872K1908j00985k6099K4143M4003
$$ -17209 -77308 -61985 -38819 -16282 16039 56911 78819 -22166 -48265 -24122 19881
14779A9881j5989n5326L3518J7419k0534N8781j4293k689n640k3150Q251J9524
$$ 19881 3892 -51434 -17916 -497 -21031 37750 23457 20768 15128 -8022 229 19753
14767A9753j6833k1275l9674k4187K4240p568J1642j0706O4137N4069n109l5246
$$ 19753 2920 -18355 -58029 -82216 -57976 -65544 -53902 -64608 -471 53598 48489 13243
14755A3243l5232k7428L8353K8504j4736Q546k2034K8514J7586K4746m4086K9906
$$ 13243 -21989 -49417 -11064 17440 2704 11250 -10784 17730 35316 60062 15976 45882
14743D5882K6075k1842m2709J9949N9609K0592k4690l5748k4985m9576j5597O914
$$ 45882 71957 50115 7406 27355 86964 107556 82866 47118 22133 -27443 -43040 -36126
14731c6126j7758l4469L3849P9290K5739j161l4585l473k9471k8323j1820l4889
$$ -36126 -53884 -88353 -54504 24786 50525 49364 14779 11306 -18165 -46488 -58308 -93197
14719i3197K6741J4216p807K1713j0161m2226j3142L5446J06961P537m8100k8164
$$ -93197 -66456 -52240 -60047 -38334 -48495 -90721 -103863 -68417 38544 46081 -2019 -30183
14707c0183M2964N180J1983K6506j1112m2388j765L6866O2221K780K4210l2621
$$ -30183 12781 17961 29944 56450 45338 2950 1185 38051 100272 103052 127262 94641
14695I4641n0570l3903k25L1266k416r155l735l7486k0063K1650R301P287K6160
$$ 94641 44071 10168 9943 41209 38793 29638 25903 -11583 -31646 -9996 -695 6592 32752
14682C2752l8990k2128j6030k8300M8786K5034L0381l223M0457j1085n9862j0391
$$ 32752 -6238 -28366 -44396 -72696 -23910 1124 31505 28282 68739 57654 -2208 -12599
14670a2599p578L054n6961N5906L8314J6013l0266L4721J0758k5805L410O897
$$ -12599 -20177 -17123 -74084 -18178 20136 36149 5883 40604 51362 25557 28967 35864
14658C5864k7341l8845m95j1091l1231j4170M0684P57j2706l5501Q3180M9660
$$ 35864 8523 -30322 -30817 -41908 -73139 -87309 -46625 -45868 -58574 -94075 -10895 38765
14646C8765r1827l0530O8525L6094k6086r158K7474O4585j7841n094n5109L4855
$$ 38765 -53062 -83592 -15067 21027 -5059 -14217 13257 77842 60001 54907 -202 34653
14634C4653M763M0479K8059n5678p2976l3671j0667J3512j4147J0756K7086p005
$$ 34653 39416 79895 107954 52276 -20700 -54371 -65038 -51526 -65673 -54917 -27831 -34836
14622c4836m580P781M1385N004L3029N6525n647o6061o775j7737o0569J6538M1652
$$ -34836 -39416 -31635 9750 14754 47783 104308 98661 32600 25825 8088 -52481 -35943 5709
14609E709K2463k6618m3487j3199N632K4276M167J5902J2336j2174q406m0877
$$ 5709 28172 1554 -41933 -55132 -49500 -25224 -21057 -5155 7181 -4993 -13399 -54276
14597e4276M220j6545j3707N947P7885P9266l791q9647L565K5622J1347q7159
$$ -54276 -50056 -66601 -80308 -74361 3524 82790 78999 -10648 -7083 18539 29886 -57273
14585e7273o5199K9263O2761j1622m9148N0592O3131N39L672N175l4788p634J5428
$$ -57273 -122472 -93209 -30448 -42070 -91218 -40626 22505 23044 26716 31891 -2897 -10531 4897
14572D897j2676J2567p156L6829m340n5580l0010k9055J9660M2552k3152j3085
$$ 4897 -7779 4788 -2368 34461 30121 -25459 -55469 -84524 -64864 -22312 -45464 -58549
14560e8549l126L3598k1363J1948k1308J3846L2624j3156j147M675O320l6882
$$ -58549 -61675 -28077 -49440 -37492 -58800 -44954 -12330 -25486 -26633 -21958 -15638 -52520
14548e2520J9778N5068L8844q948m4830o613L1097r66o388L5532J3800J6514l0232
$$ -52520 -32742 22326 61170 52222 7392 779 31876 30910 24522 60054 73854 90368 60136
14535F0136j2915p017j0908o7100k0523n8194k9207L5853N8448K3945L7285k8261
$$ 60136 47221 40204 29296 -37804 -58327 -116521 -145728 -109875 -51427 -27482 9803 -18458
14523a8458m6000j3055J1325K4293J1879l6143J871L4908M6162m5095K0744p650
$$ -18458 -64458 -77513 -66188 -41895 -30016 -66159 -64288 -29380 16782 -28313 -7569 -15219
14511a5219o5370l958O6465O165J1319j2950J0033q143m762p664p628J4697q659
$$ -15219 -80589 -84547 -18082 -11917 -598 -13548 -3515 -11658 -16420 -24084 -31712 -17015 -25674
14498b5674L0145M1058q1945n770J3946N394Q5113q707n1364m6296K1554k7603
$$ -25674 4471 45529 -36416 -42186 -28240 -22846 62267 53560 2196 -44100 -22546 -50149
14486e0149K8811N2083J690n6075o8139l9003J5615J7870L3735k4294m303P4257
$$ -50149 -21338 30745 32435 -23640 -91779 -130782 -115167 -97297 -63562 -87856 -92159 -17902
14474a7902P3721M0113N900o9499k5068j5651O328r29N0242o974k2370m697O2282
$$ -17902 55819 95932 101832 32333 7265 -8386 -2058 -2987 47255 40281 17911 13214 75496
14461G5496N2177K2918p5837q4522l9353l2584J0222L3287Q119O075j5027j4563
$$ 75496 127673 150591 74754 -9768 -49121 -81705 -71483 -38196 -30077 -24002 -39029 -53592
14449e3592k85m145n5048J3792J15781J6408j9947r96j9587p90M39M9023J900
$$ -53592 -53877 -58022 -113070 -99278 16503 32911 12964 11968 -7619 -8409 -7970 41053 42953
14436D2953l8624p379k3488J9972K525k6217L4123J0912m091K7282M2615r711
$$ 42953 4329 -3050 -26538 -6566 -4041 -30258 3865 14777 10686 37968 80583 70872
14424G0872j8192m7462k1742J2516J7559k2220l7455p8759p26O3593L7610N297
$$ 70872 52680 5218 -16524 -4008 13551 -8669 -46124 -124883 -125609 -62016 -24406 -19109
14412a9109J4948J3702M1891k3450k9532r284K1087M638k8241J8359O7179J0109
$$ -19109 -4161 9541 51432 27982 -1550 -10834 10253 14891 -13350 5009 72188 82297
14400H2297n7753P514Q614l2371J9346j6775L931J0215l1224J1937K4124L6298
$$ 82297 24544 32058 40672 8301 27647 10872 14803 25018 -6206 5731 29855 66153
14388F6153k7845J492j765J2053R0902P535l8680J2819j8216o1496r1292j3103
$$ 66153 38308 39800 38035 50088 140990 148525 109845 122664 104448 42952 -48340 -61443
14376f1443Q4532K5528J44k314p0469j4050N3419k3650p2241O4831M3814k7024
$$ -61443 23089 48617 48761 46447 -24022 -38072 15347 -8303 -80544 -15713 28101 1077
14364A077l5013J6097k0783K0832k5794p9M7781o734m3870j5980k612O641L9159
$$ 1077 -33936 -17839 -38622 -17790 -43584 -43663 4118 -2616 -46486 -62466 -65078 -58437 -19278
14351a9278M6344N6300k1674j4080q626o0078J2793N9084L9824L2709l6548r0809
$$ -19278 27066 83366 61692 47612 38986 -21092 -8299 50785 90609 123318 86770 -4039
14339d039m2221J84K9659N2342N535o5368k4799M2868N1535l7029m5574N5778
$$ -4039 -46260 -46076 -16417 35925 41460 -23908 -48707 -5839 45696 8667 -36907 18871
14327A8871m7294p4215j0450J8629Q1550L1691o297n3505j2817K4329O4106Q950
$$ 18871 -28423 -102638 -113088 -94459 -12909 18782 12485 -41020 -53837 -29508 34598 43548
14315D3548K9434P141j1553l1964j0265j6009O937q3293j723M8982N7074K5628
$$ 43548 72982 80123 68570 36606 26341 10332 17269 -66024 -67747 -18765 38309 63937
14303F3937m6403k5332j7533L958J3443j5906k8357j6234k7201M1070M9437J432
$$ 63937 17534 -7798 -25331 -21373 -7930 -23836 -52193 -68427 -95628 -54558 -5121 -3689
14291c689l5952M4394M9582m362j4211q3714k8123J3326Q08k2342L8902J8993
$$ -3689 -39641 4753 54335 49973 35762 -47952 -76075 -62749 -61941 -84283 -45381 -26388
14279b6388K3766K7368q030J2737P462K0935m4417m2681m8299N5586M1820J0205
$$ -26388 -2622 24746 16716 29453 36915 57850 13433 -29248 -77547 -21961 19859 30064
14267C0064n6324Q424L1006j6046k6809M9473M2536j013k9354j6828n2238L9163
$$ 30064 -26260 -17836 13170 -2876 -29685 19788 62324 61311 31957 15129 -37109 2054
14255B054j5310q893K4839J2797J9614m10R986m3105J588j3706k1108p036P0633
$$ 2054 -13256 -22149 2690 15487 35101 34691 44677 1572 3160 -10546 -31654 -38690 31943
14242C1943L7480j9155L3788m4278n4529m016L9172L9728j084k0547l337N0813
$$ 31943 69423 50268 84056 39778 -14751 -18767 20405 60133 59049 38502 35165 85978
14230H5978k1888n7114N7260p516l2871l8175L7767M8344j8724m5072k1117J2694
$$ 85978 64090 6976 64236 56720 23849 -14326 23441 71785 53061 7989 -13128 -434
14218d34K218N8236R769m7188k8726o3084l1762P9005L8803m0801K572l8003J2778
$$ -434 1784 60020 69789 22601 -6125 -69209 -100971 -21966 16837 -23964 -21392 -59395 -46617
14205d6617M4240n5912P2097K7909k6680j4101n143J7283J0864N9640o21n4471
$$ -46617 -2377 -58289 13808 41717 15037 936 -4207 13076 23940 83580 82959 28488
14193B8488J7247n5781J1190k1038m2241M6896L1204L5180p497K058L3134o5119
$$ 28488 45735 -10046 1144 -19894 -62135 -15239 15965 51145 43648 45706 78840 13721
14181A3721j110N0087n9490j4153N775L086K8799L8384J8906k8953r4621o8706
$$ 13721 12611 62698 3208 -10945 -5170 -2084 26715 65099 84005 55052 -39569 -108275
14169a08275L3296M6716J5700n0936m3192K2013P5763N635M7955K6740K6530l4828
$$ -108275 -74979 -28263 -12563 -63499 -106691 -84678 -8915 -3280 44675 71415 97945 63117
14157F3117m8480j11186N7806O4890M704n5082M189L3485m569L3518L2505L0196
$$ 63117 14637 -96549 -38743 26147 30851 -24231 -20042 13443 8874 42392 74897 105093
14145A05093m1210p0978p568N5379j3456j4522J4437J7607o398O372K4661l1159
$$ 105093 63883 -7095 -14663 40716 27260 12738 27175 44782 38384 44756 69417 38258
14133C8258l6027L0800L8114l7971k5643k5247o267o155L2665J6736J4885j9806
$$ 38258 2231 33031 71145 33174 7531 -17716 -23983 -30138 2527 19263 34148 14342
14121A4342K8651L6729n7166q018M7227N4037j1206J6412K7216N262j3230j6088
$$ 14342 42993 79722 22556 14538 61765 115802 104596 121008 148224 153486 140256 124168
14109A24168J11M628k5892k1380l0260k4515j9854J5458O2366k7265p2674l6637
$$ 124168 124279 128907 103015 81635 51375 26860 7006 22464 84830 57565 -15109 -51746
14097e1746M311r923J385L6332K1360M9378q6516q2990R862N2010N8544K7227
$$ -51746 -47435 -57358 -55973 -19641 1719 51097 -35419 -118409 -108547 -56537 2007 29234
14085B9234J4098n141L781P96q04O3100K515j6176j1039k1931l5417m8341k4573
$$ 29234 43332 38191 41972 42768 41964 105064 107579 91403 80364 58433 23016 -25325 -49898
14072d9898q05L8699J7011L9639N390m1967k4814J3586M7969K3926l9425p4397
$$ -49898 -50703 -12004 5007 44646 50036 8069 -16745 -3159 44810 68736 29311 -45086
14060d5086j4176M098j5433k2368L4369Q0407K8412m1333m1141K9350k763k2168
$$ -45086 -59262 -55164 -70597 -92965 -58596 21811 50223 8890 -32251 -2901 -5664 -27832
14048b7832K9311k4488l3825M1591L9731k0235k9687r569K824L6248N146k3234
$$ -27832 1479 -23009 -56834 -15243 24488 4253 -25434 -35003 -32179 4069 9215 -14019
14036a4019o357K7395k4115K8013n559m2060j7254K6067l42J9544k215p89N5653
$$ -14019 -20376 7019 -17096 10917 5358 -36702 -53956 -27889 -28231 -8687 -10902 -11691 43962
14023D3962j339k9277m1631k8336L0128M6469k1217l7289N842J3933O8021q772
$$ 43962 42623 13346 -28285 -56621 -26493 19976 -1241 -38530 -32688 -18755 49266 40494
14011D0494l5053n4649m8055k2582K2764L0669M2817K6953l3379o8599Q745K5126
$$ 40494 5441 -49208 -97263 -119845 -97081 -66412 -23595 3358 -30021 -98620 -89875 -64749
13999f4749K6023K3504j744L2414m7858m5560N9218j5006J8192o64L569J5890
$$ -64749 -38726 -15222 -16966 15448 -32410 -77970 -18752 -33758 -15566 -16230 -12661 3229
13987C229m4721l5506n4530J5616K6363L7580J9249o776K3916J3876P968L9603
$$ 3229 -41492 -76998 -131528 -115912 -89549 -51969 -32720 -39496 -15580 -1704 6264 45867
13975D5867q1737m511O5407k4759L172L175k3626o686J550L7261L0643J9819m4693
$$ 45867 -35870 -40381 25026 267 3439 6614 -17012 -23698 -22148 15113 45756 65575 20882
13962B0882j0499l2184J95J3750m3878R122J151J982M6943J7317j2489J5920L551
$$ 20882 10383 -21801 -21606 -7856 -51734 -42612 -41461 -39479 7464 24781 12292 28212 31763
13949C1763l9054o119q168L4849j9373n2849o9881m5401o280M3119K6569N692
$$ 31763 -7291 -13410 -21578 13271 -6102 -58951 -128832 -174233 -180513 -137394 -110825 -105133
13937a05133N7675K2282k0139j2407n7673k4161M7737M5313O435J2069K5134L9192
$$ -105133 -47458 -25176 -45315 -57722 -115395 -139556 -91819 -46506 -40071 -28002 -2868 36324
13925C6324j2438k3886J5163l20m2943J0998N9460k4176o0241l0442j567L3748
$$ 36324 23886 0 15163 14843 -28100 -17102 42358 18182 -42059 -72501 -74068 -40320
13913d0320j2322K0235M407n9802J6619J0328L8564J039j3439M2539j1475p2787
$$ -40320 -52642 -32407 -28000 -87802 -71183 -60855 -22291 -21252 -34691 7848 -3627 -76414
13901g6414M1016m504j7830K3397K3928j4312J3838r996n924o0978q806J9552
$$ -76414 -35398 -39902 -57732 -34335 -10407 -24719 -10881 -20877 -26801 -87779 -96585 -77033
13889g7033M2659K8764O486J3849K2789m9605k041P0178J905J7732r698k7623
$$ -77033 -34374 -5610 876 14725 37514 -12091 -14132 56046 57951 75683 65985 38362
13877C8362o110k2542k7544j160J827J2325l1157l2715P2471J6530k9662l6571
$$ 38362 32252 9710 -17834 -18994 -17167 -4842 -35999 -68714 3757 20287 -9375 -45946
13865d5946L800K1534J8221K0062k6230l803K956J5251r9771m5350O3955O3865
$$ -45946 -42146 -20612 -2391 17671 -8559 -12362 -9406 5845 -93926 -139276 -75321 -11456
13853a1456R313j9151l4210m587L839k6419k7447M155J4853Q977K9085J148j4468
$$ -11456 -2143 -21294 -55504 -60091 -56252 -82671 -110118 -105963 -91110 -82133 -53048 -51900 -66368
13840f6368O744J5314l658K7525L7439J5457k5834j2416L9993L8713n4672L053
$$ -66368 -59624 -44310 -47968 -20443 16996 32453 6619 -5797 34196 72909 18237 21290
13828B1290j7484r436m9808k2369L331Q115n3160O668J8073J02787N9489j017
$$ 21290 3806 -5630 -55438 -77807 -74476 -66361 -119521 -112853 -94780 8007 67496 66479
13816F6479r4398o8691l871Q1622j1167k856K3110j6347k8300j399L9387K5183
$$ 66479 -27919 -96610 -100481 -18859 -30026 -32882 -9772 -26119 -54419 -55818 -16431 8752
13804H752R2456N8720l6815p1553m9813l5679k850L2223K688J874k3793L3850
$$ 8752 101208 159928 123113 51560 1747 -33932 -36782 -4559 -1871 3 -23790 10060
13792A0060K3679K8125k3304j3895M027p3571j5056K6362k1745P7481l8o286l7272
$$ 10060 33739 61864 38560 24665 28692 -44879 -59935 -33573 -55318 22163 22125 15839 -21433
13779b1433j9470M8973k6445p3917J368J6434K2716Q8308j149m8211m4169J5616
$$ -21433 -40903 8070 -18375 -92292 -90924 -74490 -51774 36534 35385 -12826 -56995 -41379
13767d1379P1681K0099j4487j265k9246o1854j0330M730M2836J7737N1566K3556
$$ -41379 30302 50401 35914 34649 5403 -56451 -66781 -62051 -19215 -1478 50088 73644
13755G3644k4077n9374o754K6452L1466k9581k1481L968j190m2969M2213P0785
$$ 73644 49567 -9807 -16561 9891 41357 11776 -9705 -5737 -6927 -49896 -7683 63102
13743F3102M9825l0746m996K6318L7860j01590j4836k4002j5649m0839k1598k4272
$$ 63102 112927 82181 77185 103503 141363 39773 24937 935 -14714 -55553 -77151 -101423
13731a01423N690L037M4983J9929M715n9187l6265O4794N2364N693K7300J659
$$ -101423 -95733 -92696 -47713 -27784 -23069 -82256 -118521 -53727 -1363 4330 31630 33289
13719C3289k1955L6120L9488k2417l5253K4137K8446Q328l1654J4219n3111k6224
$$ 33289 11334 47454 86942 64525 29272 53409 81855 90183 58529 72748 19637 -6587
13707f587N151l8920k7019K8274J2828j1372M1314J5405m9980l6649Q4226J2925
$$ -6587 -1436 -40356 -67375 -39101 -26273 -37645 3669 19074 -30906 -67555 16671 29596
13695B9596j6891l9127K695k1380K2403L3358j6991J9748l8843o751J6648J0675
$$ 29596 12705 -26422 -23727 -45107 -22704 10654 -6337 13411 -25432 -32183 -15535 -4860
13683d860L7713J400K4926J0590m6406o1793M002j173L6780J2467P717j2784j4969
$$ -4860 32853 34253 59179 69769 23363 -38430 -34428 -35601 1179 13646 21363 8579 -6390
13670f390M0244l512n4285l5461J6127j3110J6736K7450n4123m39N7049O0120
$$ -6390 33854 30342 -23943 -59404 -43277 -56387 -39651 -12201 -66324 -66763 -9714 50406
13658E0406K383j9725J9605j7980n5404M6140l313M0725l7670k4727K9313O1909
$$ 50406 52789 33064 52669 34689 -20715 25425 22112 62837 25167 440 29753 91662
13646I1662J8689n3241l8267o5930m7640K2115L3460N3592M6502J2312o5104r3709
$$ 91662 110351 57110 18843 -47087 -94727 -72612 -39152 14440 60942 73254 8150 -85559
13634h5559q004L6113K5246M1082j5687l9355N6295N5056J0859j0139j12875n4552
$$ -85559 -93563 -57450 -32204 8878 -6809 -46164 10131 65187 76046 65907 -46968 -101520
13622a01520L3015J1554L3084N3247L678l022k4433p481K5855l6035k971k6379
$$ -101520 -68505 -56951 -23867 29380 33058 30036 5603 -1878 23977 -12058 -15029 -41408
13610d1408P579M2197l5179R987L8953j1991L1756p393k4084k8431j4360k2989
$$ -41408 -33829 8368 -26811 -16824 22129 10138 41894 34501 10417 -18014 -32374 -55363
13598e5363L0726K8440m0712o1254j1467L7142P8983L4664J3583N718o1730j0193
$$ -55363 -24637 3803 -36909 -98163 -109630 -72488 6495 41159 54742 60460 -1270 -11463
13586a1463m3900k3908M6028J7940J2876K0317k2150K9002L160o566l5907n5101
$$ -11463 -55363 -79271 -33243 -15303 -2427 17890 -4260 24742 27902 21336 -14571 -69672
13574f9672k1286J3638R83l8452K6035J975M1070K3324o551L6036J0839N2390
$$ -69672 -90958 -77320 -76337 -114789 -88754 -86779 -45709 -22385 -28936 7100 17939 70329
13562G0329n664n0434J7789j1569L1826k5195l5651M9285m3832j7045J6086j147
$$ 70329 64665 14231 32020 20451 52277 27082 -8569 40716 -3116 -20161 -4075 -5222
13550e222J1586n751K646l3991J2867M328K2799j1953K8630n205l1515J3660N701
$$ -5222 6364 613 3259 -30732 -17865 -13537 9262 -2691 25939 20734 -10781 2879 8580
13537H580j0246o299k2884p690O149J8571o543K776K0189K0179q015O2411J7547
$$ 8580 -1666 -7965 -30849 -38539 -32390 -13819 -20362 -17586 2603 22782 14767 77178 94725
13524I4725p3975K39j2378o786J2516o513J2558j2192J8267m6972M594M7295K7538
$$ 94725 20750 20989 8611 1825 14341 7828 20386 8194 26461 -20511 -15917 31378 58916
13511E8916J5120m4946m0282O329q1987l1245Q5465P2267M0609l2812o4441n2472
$$ 58916 74036 29090 -11192 -4863 -86850 -118095 -32630 39637 80246 47434 -17007 -69479
13499f9479p390J1302J016K7348M623o851l5468M6341j5597N327l885O981j8320
$$ -69479 -76869 -65567 -64551 -37203 -32580 -39431 -74899 -28558 -44155 -38828 -42713 -35732 -54052
13486e4052k4847K3906M2207K7650j6611m8548j9005K5660L3202R335k9611J2352
$$ -54052 -78899 -54993 -12786 14864 -1747 -50295 -69300 -43640 -10438 -1103 -30714 -18362
13474a8362M5994j1287k7122m3322M0226M4373m5533o1287p078Q735K0795Q8800
$$ -18362 27632 16345 -10777 -54099 -13873 30500 -15033 -76320 -83398 -74663 -53868 34932
13462C4932M4729m6056n8250J0474J4718J6841r858k1761K0023j9907n5081p0089
$$ 34932 79661 33605 -24645 -14171 547 17388 7530 -14231 5792 -14115 -69196 -139285
13450a39285m511J6008N8490O4425P082N6714k918J3630K2456k2422q889L702
$$ -139285 -143796 -127788 -69298 -4873 2209 58923 56005 69635 92091 69669 60780 64482
13438F4482j962r1536J6282K1261Q96K5679K1899k8243J3709n8688K1905L586
$$ 64482 62520 -29016 -12734 8527 9423 35102 57001 28758 42467 -16221 5684 9270
13426I270k8894o677o946N8326M4311j2849j1409r514l9387n6588k360J1991J740
$$ 9270 -19624 -26301 -33247 25079 69390 56541 45132 35618 -3769 -60357 -62717 -50726 -48986
13413d8986l9200m0298Q2194L9443L0745L1985l1807l6678K7986q862k5569L6842
$$ -48986 -88186 -128484 -46290 -6847 23898 55883 24076 -12602 15384 6522 -19047 17795
13401A7795l1753j2832K5183J7682L9085O6781k2804j5055K0675k3167o1498m9450
$$ 17795 -13958 -26790 -1607 16075 55160 121941 99137 84082 104757 81590 20092 -29358
13389b9358M1356j8460J965J1001M5568j3966l5114p179j6463j5187L6337L2146
$$ -29358 11998 -6462 -4497 6504 52072 38106 2992 -4187 -20650 -35837 500 32646
13377C2646r396m1787n137L1801R101q227m0766j459Q7463N0823J4773k6978n3458
$$ 32646 23250 -18537 -23674 8127 17228 9001 -31765 -33224 54239 105062 119835 92857 39399
13364C9399n8011n6378M549N1858M8219k0740o1940L2242J8357J595p5737N895
$$ 39399 -18612 -74990 -70441 -18583 29636 8896 -53044 -20802 -2445 -850 -76587 -70692
13352g0692K874O1007M0402m5579r2595j3687M349Q06M9065K095R728l0403O0811
$$ -70692 -67818 -6811 33591 -11988 -104583 -118270 -113921 -113115 -64050 -61955 -52227 -82630 -21819
13339b1819Q2204l0253j31176m939Q4749J0017K9314m2847k7681K6618N735q3638
$$ -21819 60385 30132 -101044 -105983 -21234 -11217 18097 -24750 -52431 -25813 -20078 -103716
13327a03716R792L7397L745J8778k7431o4426l8195P8188P0328J2393N0597l5614
$$ -103716 -93924 -56527 -52782 -34004 -61435 -125861 -164056 -85868 -15540 -3147 47450 11836
13315A1836j3408N3936N5404M406Q186n9565j6536k2477q307J5292P341R429j8699
$$ 11836 -1572 52364 107768 112174 120360 60795 44259 21782 13475 28767 36108 45537 26838
13302B6838n6597n018K124j3078J170J6733k3786K0349K7273K0110l202M1142
$$ 26838 -29759 -34777 -32653 -45731 -44561 -27828 -51614 -31265 -3992 16118 12916 54058
13290E4058M4170j5025k8601l6256N341L1127m8105j0446J8667K121L7983J0212
$$ 54058 98228 83203 54602 18346 23687 54814 6709 -3737 14930 17051 55034 65246
13278F5246o0195j4671l63j2185j8739k1336J4948J3511k7334L6420Q9458m5453
$$ 65246 5051 -9620 -9983 -22168 -40907 -62243 -47295 -33784 -61118 -24698 64760 19307
13266A9307n4797K4605M8011m6577Q868J4895K3158J6596L3368m1594o5848q5380
$$ 19307 -35490 -10885 37126 -9451 -583 14312 37470 54066 87434 45840 -20008 -105388
13254a05388k3049n603j763L5233J6000N1914j126j4127j4194K484K8625O6467
$$ -105388 -128437 -134040 -135803 -100570 -84570 -32656 -33782 -47909 -62103 -59619 -30994 35473
13242C5473l7695m09k1606n0058K9340J8702M1814N2207J2527R774j9736n6886
$$ 35473 -2222 -2631 -24237 -74295 -44955 -26253 15561 67768 80295 90069 70333 13447
13230A3447M0529j3934k4489M8872N9136k6690q702n790K7691J2784L9737O4290
$$ 13447 53976 40042 15553 64425 123561 96871 88169 82379 110070 122854 162591 226881
13218B26881P0895J42527J93333K62090M37939M49385J54337k59684l74358l06138
$$ 226881 297776 440303 633636 895726 1333665 1783050 1937387 1677703 1303345 997207
13208I97207k70137j64836j13789j18950p0901k8467K8104l2901m9635p9758m3429
$$ 997207 727070 562234 448445 329495 258594 230127 258231 225330 175695 95937 52508
13197E2508J2955M6861O4331m2505q0104N908L7591j7583m1536k0748K8357q269
$$ 52508 65463 112324 176655 134150 54046 59954 97545 79962 38426 17678 46035 37766
13185C7766n836o2962J8305N9882L6292J736o3443j8674K9988m5123m8219r25
$$ 37766 31930 -31032 -12727 47155 83447 85183 21740 3066 33054 -12069 -60288 -61213
13173f1213k3560O5141N0256L584M5762M7385L255k3306j2497m1995k0943n1637
$$ -61213 -84773 -19632 30624 34208 79970 127355 130610 107304 94807 52812 31869 -19768
13161a9768n4623l9190M0011L4J1125L4846K8419L4999k0446q165k5283k5198
$$ -19768 -74391 -113581 -73570 -73536 -62411 -27565 854 35853 15407 7242 -18041 -43239
13149d3239L1312J7322j2835R646l609l9080k242N3212J1116J3864J6853n7307
$$ -43239 -11927 5395 -7440 2206 -1403 -40483 -42725 10487 21603 35467 52320 -4987
13137d987l3735J7486N9709R795p9477j5334j7179j4781j136P4789R241l754M438
$$ -4987 -38722 -21236 38473 48268 -31209 -46543 -63722 -78503 -79639 -4850 4391 637 5075
13124E075P542j719m3706q49L0986j1387O0412J3240n2085l1116j1935l5395J1920
$$ 5075 12617 10898 -32808 -33657 -2671 -14058 46354 59594 7509 -23607 -35542 -70937 -59017
13111e9017j7811J9921M8840L8526M435k5855k1322k1901j0757p970K0367j0854
$$ -59017 -76828 -56907 -8067 30459 34894 9039 -12283 -34184 -44941 -52911 -32544 -43398
13099d3398P8067M4352l867K2620L1345m9279m7494j6939j251L8720J2629k1889
$$ -43398 34669 79021 75154 97774 129119 79840 32346 15407 14156 52876 65505 43616
13087D3616j2097j3692K5622K4932k4430N511J7318k2320N062l4605J0807j1914
$$ 43616 31519 17827 43449 68381 43951 49462 66780 44460 49522 14917 25724 13810
13075A3810o7287N4681p91L064Q1822L8897n9172j8313K1428k2535n7665j7360
$$ 13810 -53477 1204 413 3477 85299 124196 65024 46711 68139 45604 -12061 -29421
13063b9421k0016n4335K8897P996J7447N1390L663n111k8131L9321j7456r3617
$$ -29421 -49437 -103772 -74875 -66879 -49432 1958 5621 510 -27621 11700 -5756 -99373
13051i9373Q0545O9760J6085k0831n1355j7298Q7587K4770m6846l4755j5588J0225
$$ -99373 -18828 50932 67017 46186 -5169 -22467 65120 89890 43044 8289 -7299 2926
13039B926J5722M6409j7568n9616K1857l0379O3726M4704k0740J4759L872l972
$$ 2926 18648 65057 47489 -12127 9730 -20649 43077 87781 67041 81800 85672 81700
13027H1700J290n504l0621L4070K4002p6931o9254K9440L2591k6119L1548K1830
$$ 81700 82990 77486 46865 80935 104937 28006 -41248 -11808 20783 -5336 26212 48042
13015D8042L722j76L2818m0601O583K3377K2649r715J5414K0974J0602J7517R9117
$$ 48042 51764 51588 84406 43805 50388 73765 96414 86699 102113 123087 133689 151206 250323
13002B50323K5372m2794n6729l294L5443J5990J1807j15283q1516m9298n193J4256
$$ 250323 275695 232901 176172 172878 208321 224311 236118 120835 39319 -9979 -15172 -916
12990i16m3058K6877L5059O8682l6263l1958j9703j1513O2870K5812l0336K069
$$ -916 -43974 -17097 17962 86644 50381 18423 -1280 -12793 50077 75889 45553 47622
12978D7622N8133K2758K5083k0790K9656q158j4387J08526O4874l4411l9007j3391
$$ 47622 105755 128513 153596 132806 162462 154304 139917 248443 313317 278906 239899 226508
12966B26508m0988n5700L431J1404J4215M9828O3009M7023O3032K9028p5509j5197
$$ 226508 185520 129820 133251 144655 158870 208698 271707 318730 381762 410790 335281 320084
12954C20084O6272L7106m49L2271N5614J23984J57364R9861J34815J72790K28315
$$ 320084 386356 423462 423013 455284 510898 634882 792246 892107 1026922 1199712 1428027
12943A428027J31764j77626o66506p60237m41031k15253K0914M2205N9969R0757
$$ 1428027 1559791 1382165 715659 -44578 -485609 -700862 -679948 -637743 -577774 -487017
12933d87017K7453J5450L3949K2624r760P160K3042n706K896P4564k2709k0928
$$ -487017 -459564 -444114 -410165 -387541 -397301 -390141 -367099 -372805 -369909 -295345 -318054 -338982
12921c38982K8676q359J907n684N5987J09125L5034K8689O5444J854j5021l5017
$$ -338982 -310306 -318665 -316758 -322442 -266455 -157330 -122296 -93607 -28163 -26309 -41330 -76347
12909g6347q87K5096p5078k6770n6626J612M5505L7135q4544r2472K4759P1611
$$ -76347 -77234 -52138 -127216 -153986 -210612 -209000 -163495 -126360 -210904 -303376 -278617 -207006
12897b07006O8255P927l0485l321J443J9585L2428K6500o4403l5006j7022M1478
$$ -207006 -138751 -130824 -161309 -164630 -163187 -143602 -111174 -84674 -149077 -184083 -201105 -159627
12885a59627L0982J2174L3068J05991R3295Q6139P4390J09340Q6059J10542L5686
$$ -159627 -128645 -116471 -83403 22588 115883 202022 276412 385752 471811 582353 618039
12874F18039m4727q3496j14987j11843o5201l0371o7181l0579M099l4140l0672
$$ 618039 573312 489816 374829 262986 197785 167414 100233 69654 73753 39613 8941
12863H941o8169j9985M33L6131N2582m030j2674L3266P1632j3405m6884p0188
$$ 8941 -59228 -79213 -78780 -42649 9933 5903 -6771 26495 98127 84722 37838 -32350
12851c2350l5481l0695k584q948L1332L0078J2328N0390K6531k8078L6898j0251
$$ -32350 -67831 -98526 -101110 -110058 -78726 -48648 -36320 14070 40601 12523 49421 39170
12839C9170m3591N2358N9138J5543m5303m860L4793l1600k9653K793N75K8952
$$ 39170 -4421 47937 107075 122618 77315 72455 107248 75648 45995 48788 49363 78315
12827G8315l1179j1252m473M3209O3170o6238N109P0318j4509m8118k8161J6690
$$ 78315 47136 35884 31411 74620 137790 71552 76661 146979 132470 84352 56191 72881
12815G2881K7253J9182O4890O7985N2700p35p6351l8820Q2576M7580J1310N664
$$ 72881 100134 119316 184206 252191 304891 304156 227805 188985 271561 319141 330451 336115
12803C36115M517L7189l164M1040O8121K4271l7309J2455L1229O8745Q5911Q9406
$$ 336115 340632 377821 374657 415697 483818 508089 470780 483235 514464 583209 669120 758526
12791G58526N5509K4665O9316N7923N4480J34858P7160O4024J17260P1983Q5022
$$ 758526 814035 838700 908016 965939 1020419 1155277 1232437 1296461 1413721 1485704 1570726
12780A570726J10682J35584J89217J66873J81527K12475L19149L56932L63693
$$ 1570726 1681408 1816992 2006209 2173082 2354609 2567084 2886233 3243165 3606858
12771C606858L84084M56056N82821P12278Q85808J152914J426995J784243K308511
$$ 3606858 3990942 4446998 5029819 5742097 6627905 7780819 9207814 10992057 13300568
12762A3300568K528903K601521L292888M664352O894475J0166686J5347058K4095309
$$ 13300568 15829471 18430992 21723880 26388232 33282707 43449393 58796451 82891760
12754H2891760L9155146O3982846R5894329J01235307K1896883p1883472q4873094
$$ 82891760 122046906 186029752 281924081 383159388 405056271 333172799 248299705
12747B48299705o8447712m9465591l3736376k2839013j5738948j1229124q237590
$$ 248299705 179851993 130386402 96650026 73811013 58072065 46842941 38605351
12740C8605351o069039m575363l714492l432297l063832k468110j983250j587083
$$ 38605351 32536312 27960949 24246457 20814160 17750328 15282218 13298968 11711885
12732A1711885j290486j129665r33000p83245o02052m19067l38890l66088m38405
$$ 11711885 10421399 9291734 8358734 7575489 6973437 6554370 6215480 5849392 5410987
12723E410987m53292l92741l17695k69750k87430k49566k20539j91571j55212
$$ 5410987 4957695 4564954 4247259 3977509 3690079 3440513 3219974 3028403 2873191
12714B873191j54861j72282j44791q0757l6715M568n7943q6180p8773p8518n9891
$$ 2873191 2718330 2546048 2401257 2320500 2283785 2288353 2230410 2144230 2065457 1986939 1927048
12703A927048n9314p100j27751q3239n3313l8488J3228n2499n6597m9647o0399
$$ 1927048 1867734 1860634 1732883 1649644 1596331 1557843 1571071 1518572 1461975 1412328 1351929
12692A351929j9649j7027p1505k8987l6855n2109l6545r2677m9499K8920L6032
$$ 1351929 1332280 1315253 1243748 1214761 1177906 1125797 1089252 996575 947076 975996 1012028
12681A012028p4555N030K3433J4059n419l4389n702p173k5516k5616J6978m9976
$$ 1012028 937473 942503 965936 979995 974576 940187 934485 927312 901796 876180 893158 843182
12669H43182p0821l0509J4136m667M783k2803j2865J1218j9111q0k5706Q250M4447
$$ 843182 772361 741852 755988 751321 756104 733301 720436 731654 712543 712463 686757 695007 739454
12656G39454p296l3584o8844r679J0906K2433n5701k7667K0937k6228o9127K9566
$$ 739454 732158 698574 629730 620051 630957 653390 597689 570022 590959 564731 495604 525170
12644E25170K7496L9299k1375l9328K3126M8414L579o0038N9579J4679j1483J7234
$$ 525170 552666 591965 570590 531262 554388 602802 606381 546343 605922 620601 609118 626352
12632F26352R102O350r0M7378M0241M5751L8795o9931j03940m7456M0801M5799
$$ 626352 635454 641804 641714 689092 729333 775084 813879 743948 640008 592552 633353 679152
12620F79152N150o3707o5438o4903l2179J013K7351L7201j631J5994P7548k0634
$$ 679152 684302 620595 555157 490254 458075 459088 486439 523640 522009 538003 615551 594917
12608E94917n4564r38n3248j6093O883K5628l3206L3279j848n3678k4914k6221
$$ 594917 540353 539415 486167 470074 476957 502585 469379 502658 500810 447132 422218 395997
12596C95997J3754k7296o5985j3453M3549J0555L0097J04847j9972r836N902M811
$$ 395997 409751 382455 316470 303017 346566 357121 387218 492065 472093 462257 468159 472970
12584D72970K4691L5277K6137K8095J607j3588n2999l2301k1771K750O3102R8342
$$ 472970 497661 532938 559075 587170 588777 575189 522190 489889 468118 470868 533970 632312
12572F32312N75J5447n465Q378N3713L6419O1939N4729P4948J33315p2048l50669
$$ 632312 632887 648334 642869 651247 704960 741379 803318 858047 932995 1066310 994262 643593
12560F43593o93670p15078l24416m6243N6501J97003J53303J35839R2729J4780
$$ 643593 -50077 -765155 -1089571 -1135814 -1079313 -882310 -729007 -593168 -500439 -485659
12550d85659N7329O2264n735J2924N2652L2049P936p102R86K7063L2210M0459
$$ -485659 -428330 -366066 -371801 -358877 -306225 -274176 -266240 -273342 -272356 -245293 -213083 -172624
12538a72624K7527K2198j6154R373k360m1860l921K6747P0437j4978j6223L5072
$$ -172624 -145097 -122899 -139053 -129680 -132040 -173900 -177821 -151074 -80637 -95615 -111838 -76766
12526g6766K3629K5115m3492K4500J6547L0657R80m184K6771P613L8565K8833
$$ -76766 -53137 -28022 -71514 -47014 -30467 190 1170 -3014 23757 31370 69935 98768
12514I8768l3397o6451k090k6441L5852K8053k2342J5588n11L2715L1409m6754
$$ 98768 65371 -1080 -3170 -29611 6241 34294 11952 27540 27029 59744 91153 44399
12502D4399m0101l3214J9033L8222M9505K5772R332R758J9846m6528l8351R092
$$ 44399 4298 -28916 -9883 28339 77844 103616 112948 122706 142552 96024 57673 66765
12490F6765K7612m2511J0712j8791p880j2922K4338K4342Q093L5444J1455M0673
$$ 66765 94377 51866 62578 43787 35907 22985 47323 71665 79758 115202 126657 167330
12478A67330m5741O476L0251j2517j3701L2983k2196O37l4437l0567j1747J0534
$$ 167330 121589 128065 158316 145799 132098 165081 142885 143522 109085 78518 66771 77305
12466G7305K3318n314p6417j350n0388J7087L7444O1758O0260J0393n4412j00359
$$ 77305 100623 95309 18892 17542 -32846 -15759 21685 83443 143703 154096 99684 -675
12454f75o668Q2770L8630j6067k1095q192l4876k1129j367J2459L5504k6533l3525
$$ -675 -7343 75427 114057 97990 76895 68703 33827 12698 11331 23790 59294 32761 -764
12441g64k994O9574K290k8214m4236K6132j1037N096q06o21k6321k3358j5680
$$ -764 -3758 65816 68106 39892 -4344 21788 10751 15847 15041 14420 -11901 -35259 -50939
12428e0939J6593K743q289L5590R2737l560n1216Q245M136O61M0661m9979j8841
$$ -50939 -34346 -31603 -39892 -4302 88435 84875 33659 41904 46040 46701 87362 37383 18542
12415A8542O0425M7779j3377l0443o6077p651j2030j7613P602N7696N5589k2100
$$ 18542 78967 126746 113369 82926 16849 9198 -2832 -20445 -12843 44853 100442 78342
12403G8342k7001j4446j2297L5349O79m7872M8743J2992N6150K5691r3998m7258
$$ 78342 51341 36895 24598 59947 60626 12754 61497 74489 130639 156330 62332 15074
12391A5074m490M8757K7447L3230K6142k5596p4971K7086L7524k0642l7318K4789
$$ 15074 10584 59341 86788 120018 146160 120564 45593 72679 110203 89561 52243 77032
12379G7032k3706o107K786J8179K1453r930M111N554o2394J2172K5329j4314o014
$$ 77032 53326 47219 50005 68184 89637 79707 83818 89372 26978 39150 64479 50165 44151
12366D4151P9364k2062p2393m289N49O822J4046J4713r261O949K2072J6729K4641
$$ 44151 123515 101453 29060 24771 25320 32142 46188 60901 51640 58589 80661 97390 122031
12353A22031k3324m3779m2786j0398M2307L5815K8871M2961M1785J9955J2407
$$ 122031 98707 54928 12142 1744 44051 79866 108737 151698 193483 213438 225845
12342B25845k1970L0665m3857k3113R576m0930q5552o2481J8417P5666K0125l2881
$$ 225845 203875 234540 190683 167570 177146 136216 50664 -11817 6600 82266 102391 69510
12330F9510o3900l5003N3593K6658j0366j9210L6339J1056M5968R216J3908l1245
$$ 69510 5610 -29393 24200 50858 40492 21282 57621 68677 114645 123861 137769 106524
12318A06524k9009J4651K8897N2743K6836q0808P532M6794K3936L6010l9147p9918
$$ 106524 77515 92166 121063 173806 200642 119834 127366 174160 198096 234106 194959 115041
12306A15041K2402K802j2618K9181K4843J5173l539q4353J1426M2146M7547N1999
$$ 115041 137443 140245 127627 156808 181651 196824 193285 108932 120358 162504 210051 262050
12294B62050j4807j2647k5762k8338M8098j7970K4353J13532P7949J44415K42006
$$ 262050 247243 234596 208834 180496 228594 210624 234977 348509 426458 570873 812879
12283H12879L61762M44125L81489r044l29885l55122k55629j91612j58046j20711
$$ 812879 1174641 1618766 2000255 1991211 1661326 1306204 1050575 858963 700917 580206
12273E80206j42221j14346o3245p805j9682k1554k5470l4332J2669L924q976j5910
$$ 580206 437985 323639 260394 252589 232907 211353 185883 151551 164220 168144 159168 143258
12261A43258k6354j5300j9433L2564N4584j6754l093N3723j4313k2196J2281q901
$$ 143258 116904 101604 82171 114735 169319 152565 149472 203195 188882 166686 178967 170066
12249A70066k7804O849L785P523L148M734J2779K535k5349K2123K1078L75n5517
$$ 170066 142262 149111 152896 160419 163567 168301 181080 183615 158266 180389 201467 201842 146325
12236A46325P059K9563J7337K5847K8381L3596m7673k819L8991J0733M138k9297
$$ 146325 153384 182947 200284 226131 254512 288108 240435 237616 276607 287340 291478 262181
12224B62181p2693n6625l1274K7986L6096N6383n5053m7914J5530P582l3675L7474
$$ 262181 189488 132863 101589 129575 165671 222054 167001 119087 134617 142199 108524 145998
12212A45998J8697K2010p501J6749k1805l7789n1530K7807P7612K8307O8170K730
$$ 145998 164695 186705 179204 195953 174148 136359 84829 112636 190248 218555 286725 289455
12200B89455j5616j9768J3507J1436l7995l9140o8656m363n448L5919j946Q31
$$ 289455 273839 254071 267578 279014 241019 201879 133223 128860 123412 159331 157385 158216
12188A58216q613M8632M9651j2038n472L2318k3676J3055m931k1218J6475J4080
$$ 158216 149603 198235 247886 235848 230376 262694 239018 252073 247142 225924 242399 256479
12176B56479L2699J346l8439l325j2454M2841M4623k4573o7499j6991j6815m787
$$ 256479 289178 290524 252085 248760 236306 279147 323770 299197 231698 214707 197892 193105
12164A93105O1234K4435o226M6809r000K6904j0300l7719k4898j6533K3188j4888
$$ 193105 254339 278774 272548 319357 310357 337261 326961 289242 264344 247811 270999 256111
12152B56111l4210M4572k7393o845J6494K5957O0988k2174j8647P507m177M071
$$ 256111 221901 266473 239080 232235 248729 274686 335674 313500 294853 302360 298183 302254
12140C02254K2486M6167j7279k115O2095k4867k6908N071l188J4114q492J0659
$$ 302254 324740 370907 353628 351513 413608 388741 361833 366904 363716 377830 369338 379997
12128C79997N0195q016l6998n8516j9288L2057M9330J6085J4255m732m75K9142
$$ 379997 430192 422176 385178 326662 307374 339431 388761 404846 419101 414369 413894 443036
12116D43036p0643k2849N1677M7631J4586L3803L7652K0469n7657j01008k5003
$$ 443036 372393 349544 401221 448852 463438 497241 534893 555362 497705 396697 371694
12105C71694N9379M4424k4007L719K8649o1631M3J2545m6693j9170q898m1193
$$ 371694 431073 475497 451490 455209 483858 422227 422270 434815 388122 368952 360054 318861
12093C18861n89J5241k4595J7419k530R817j3876L2236L4846m281l8572j1642
$$ 318861 318272 333513 308918 326337 323807 333624 319748 351984 386830 382549 343977 332335
12081C32335O913l456K1262k2125j1922N4832M4561M1151M154K6029J7510p817
$$ 332335 339248 335792 357054 334929 323007 377839 422400 463551 467705 493734 511244 503427
12069E03427j6890J3266L9631O981J119L4053J8693N1195p1317o9588j7665J6052
$$ 503427 486537 499803 539434 546415 547534 581587 600280 651475 580158 510570 492905 508957
12057E08957K5756L0871M3976q376j2071M7826R4414N1285K19L1868j7756q859
$$ 508957 534713 565584 609560 601184 589113 636939 731353 782638 782857 814725 796969 788110
12045G88110L2540l453j1676R727J6764L7421j5956o368L667R4931J947N7332
$$ 788110 820650 817197 805521 815248 832012 869433 853477 847109 850776 945707 947654 1004986
12033A004986M1486o6550Q159j2359K5426P6005k7J2154l6009k6840J8097R439
$$ 1004986 1046472 979922 988081 975722 1001148 1077153 1077126 1089280 1053271 1026431 1044528 1053967
12021A053967R141o108L0877P1488O3174q097k6369m793M2683L3452M5777M2065
$$ 1053967 1063108 1057000 1087877 1159365 1222539 1214442 1188073 1183280 1225963 1259415 1305192 1347257
12009A347257m313k6572N8371N1674L1720L0280L7322K6409R717J4936N7750O0264
$$ 1347257 1342944 1316372 1374743 1426417 1458137 1488417 1525739 1552148 1561865 1576801 1634551 1694815
11997A694815M1507M1567P7872j8086M1638Q0966N6451N7566N8552P7701M3412
$$ 1694815 1736322 1777889 1855761 1837675 1879313 1960279 2016730 2074296 2132848 2210549 2253961
11986B253961O8653O3079J5477J4141Q3412Q2093Q8900O9634O1060M4523J28571
$$ 2253961 2322614 2385693 2401170 2415311 2498723 2580816 2669716 2739350 2800410 2844933 2973504
11975B973504J65028J49513O6275J16980P0604R9578J12071J14487J34823J37900
$$ 2973504 3138532 3288045 3354320 3471300 3541904 3641482 3753553 3868040 4002863 4140763
11965D140763J12422J74393K26248J89307J82057J94274J69352J52217J64685
$$ 4140763 4253185 4427578 4653826 4843133 5025190 5219464 5388816 5541033 5705718
11956E705718J96158K46259K07054K77640K93057L31654K30481K55848L64889
$$ 5705718 5901876 6148135 6355189 6632829 6925886 7257540 7488021 7743869 8108758
11947H108758L74783M19564M17018M23798M30187M52956M92195N20775N10630
$$ 8108758 8483541 8903105 9320123 9743921 10174108 10627064 11119259 11640034 12150664
11938A2150664N84693N30428O07084O46980O64572O99165O70417O94635P60779
$$ 12150664 12735357 13265785 13872869 14519849 15184421 15883586 16554003 17248638 18009417
11929A8009417P15272P19524O98520O48087O92866O79968O95242O16922M88590
$$ 18009417 18724689 19444213 20142733 20790820 21483686 22163654 22858896 23475818 23964408
11920B3964408M90138M06930K77184K07149J42402M4870q5994k11662k10864l31556
$$ 23964408 24454546 24861476 25138660 25345809 25488211 25533081 25447087 25235425 25024561 24693005
11910B4693005l87417m70428n22451n47228o09416o96150o96576o53865p36030
$$ 24693005 24305588 23835160 23312709 22765481 22156065 21459915 20763339 20109474 19373444
11901A9373444p55818o88126o33601o13432p03590o77976n85885n80772n34972
$$ 19373444 18617626 17929500 17295899 16682467 15978877 15300901 14715016 14134244 13599272
11892A3599272m98404n27044n94504n20879m18117m41168m46295m13427m20172
$$ 13599272 13100868 12573824 11979320 11458441 11040324 10599156 10152861 9739434 9319262
11883I319262l39513l55859l55497l22576k83845k28563k63738k95287k75626
$$ 9319262 8979749 8623890 8268393 7945817 7661972 7433409 7169671 6874384 6598758
11874F598758j52344k21838k67560k05552j58985k48529k03351j12564j93447
$$ 6598758 6446414 6224576 5957016 5751464 5592479 5343950 5140599 5028035 4834588
11865D834588j44891j08084j28400j47126j30292j60239j05419j15270o6761j10896
$$ 4834588 4689697 4581613 4453213 4306087 4175795 4015556 3910137 3794867 3728106 3617210
11855C617210j10841j31101q1579m8631q9481j64118p9042l8020j1724k3676j36172
$$ 3617210 3506369 3375268 3293689 3245058 3155577 2991459 2912417 2874397 2862673 2838997 2702825
11844B702825j20180n5565J0212J8398p3918j43796q3130n7055k6992j0480m4765
$$ 2702825 2582645 2527080 2537292 2555690 2481772 2337976 2254846 2197791 2170799 2160319 2115554
11833B115554m9945r6481p6735j5666j1664m7877l2747o9696l5148M34J4613k7306
$$ 2115554 2065609 1969128 1892393 1876727 1865063 1817186 1784439 1714743 1679595 1680029 1694642 1667336
11821A667336q0074j06025L661M343K9374l18p9599o9308m0015N25R0J3435k6178
$$ 1667336 1587262 1481237 1484898 1489241 1518615 1518297 1438698 1369390 1329375 1329900 1329990 1343425 1317247
11808A317247k4281r0910q0332L2581m657k3185J5136L2904j2221m7876n5930
$$ 1317247 1292966 1202056 1121724 1154305 1149648 1126463 1141599 1174503 1162282 1114406 1058476
11797A058476j0594j014J6395J1556k8170j4622o2092k9372O776J1358P985p377
$$ 1058476 1047882 1046868 1063263 1074819 1046649 1032027 969935 940563 947339 958697 966682 959305
11785I59305k5625m2120n472P286M4880L1491m8472j22831m8843J5060J0852l1489
$$ 959305 933680 891560 886088 893374 938254 969745 921273 798442 749599 764659 775511 744022
11773G44022J313L5227k5218l6529l2853o8952K3019L4453L9917J215o281j262
$$ 744022 745335 780562 755344 718815 685962 617010 640029 674482 714399 715614 709333 708071
11761G08071o8248p0282N0370O0211M812M4708J4165q2752J7388Q534j5052p968
$$ 708071 639823 569541 619911 680122 684934 729642 743807 661055 678443 686977 671925 663957
11749F63957n9026K5280J62n778m2137K8017k6182k2781n3383K8981l6534n9430
$$ 663957 604931 630211 630373 624595 582458 610475 584293 561512 508129 537110 500576 441146
11737D41146K2290Q3143K390p0015m6372o108j6564l76k614m4821n3416m1107
$$ 441146 463436 546579 548969 478954 432582 426474 409910 409534 406920 362099 308683 267576
11725B67576K0929M361K5391Q401m9282J8236L1647j0971j4688l8665N492k0312
$$ 267576 288505 292866 318257 326658 277376 295612 327259 316288 301600 262935 268427 248115
11713B48115n4243L4201K4953n3352P1455m3639K9562L4372n71m0338J1244J0178
$$ 248115 193872 228073 253026 199674 271129 227490 257052 291424 290853 250515 261759 271937
11701B71937l5790n9089l6733M0973O1558O0021j8706m2298M792l2740K3318k0592
$$ 271937 236147 177058 140325 181298 242856 302877 284171 241873 246665 213925 237243 216651
11689B16651j3785O9269K1376N9982J0748j3599n3236p4001j4263L4259Q2183
$$ 216651 202866 272135 293511 353493 364241 350642 297406 223405 209142 243401 325584
11678C25584k7372k9254l1259m9506L6988M7232p2110k7533L3525k5277L994K5541
$$ 325584 298212 268958 237699 188193 225181 272413 200303 172770 206295 181018 185012 210553
11666B10553l4183n0984q068N9504J8312k3016K2506n1661n7682j0227O4250L0143
$$ 210553 176370 125386 117318 176822 195134 172118 194624 142963 85281 75054 139304 169447
11654A69447n29M6995K4126P060n0328m2399L2294R73Q082j1511j8773k4957p7662
$$ 169447 168918 215913 240039 247099 196771 154372 186666 187639 195721 184210 165437 140480 62818
11641F2818J249P3001J4079l1545L0767J131j3352j2583N5278R195k7052j5960
$$ 62818 64067 137068 151147 119602 150369 151500 138148 125565 180843 190038 162986 147026
11629A47026l8999R960N8637K9635n427N071k1377q1534q2733J4453K7581r189
$$ 147026 108027 117987 176624 206259 200832 205903 184526 102992 20259 34712 62293 53104
11617E3104J9524O0837Q5375L1170n0786o4763l5030j0291n5215R277N1195P6531
$$ 53104 72628 133465 218840 250010 199224 134461 99431 89140 33925 43202 94397 170928
11605A70928M1972l6365j560n653N8750k3298k6775p871k8782m6087o4424L6993
$$ 170928 212900 176535 174975 169322 228072 204774 177999 170128 141346 95259 30835 67828
11593F7828J580Q752J2868N4449L4756j334m5372j865l587L3140L9793k208k4092
$$ 67828 69408 78160 91028 145477 180233 178899 133527 131662 128075 161215 201008 198800 174708
11580A74708k430n182j7509l4574j6305l3586j2025P902N5371M1567K8162N319
$$ 174708 172278 167096 149587 115013 98708 65122 53097 60999 116370 157937 186099 191418
11568A91418l4192l1467R823K6170L3277l4170m697k0618k0790l6128l445J24931
$$ 191418 157226 125759 135582 161752 195029 160859 156162 135544 114754 78626 75181 200112
11556B00112K8189j20194r1632L4652k6145K2220M8661J0838K0095n6056m5184
$$ 200112 228301 108107 16475 51127 24982 47202 95863 106701 126796 70740 25556
11545B5556n2382N4397J09787L3866k2362J0420J3596j2476k2634j8848K8437
$$ 25556 -26826 27571 137358 171224 148862 159282 172878 160402 137768 118920 147357
11534A47357o315l9398n3736J7195J2308J8117J541L2914M3579N913k3669l8621
$$ 147357 141042 101644 47908 65103 77411 95528 97069 129983 173562 179475 155806 117185
11522A17185m5658m0445l4007N3103R2481N2876j3578n580l0843l5355k9777k6815
$$ 117185 71527 31082 -2925 50178 142659 195535 181957 176377 145534 110179 80402 53587
11510E3587Q363k5056L2611Q93j9232J8073k2992k4574J6089J0180M2948M3714
$$ 53587 61950 36894 69505 70398 51166 69239 46247 21673 37762 47942 90890 134604
11498A34604k3708p6061j5078J428M3468J3548J5852N1018K255K0369K6182n6987
$$ 134604 110896 34835 19757 21185 64653 78201 94053 145071 147326 167695 193877 136890
11486A36890j2006k7453o3684O021M6482M0096j6062l0949m161p21L608r750J6015
$$ 136890 124884 97431 33747 39768 86250 126346 110284 79335 75174 74453 78061 68311 84326
11473H4326l0245m2998N8310M34K2676N4852J1293J2617o1984q1289K2816k3493
$$ 84326 54081 11083 69393 69827 92503 147355 158648 171265 109281 27992 50808 27315
11461B7315L800Q254J7244m3250K3350J6230k6936J1697L3676K52k1658r085k4617
$$ 27315 31115 39369 56613 13363 36713 52943 26007 37704 71380 71632 49974 40889 16272
11448A6272L5167M833l4481K2926L7958j9259k3845k4160J8937N6022M4468n7837
$$ 16272 51439 56272 21791 44717 82675 63416 39571 15411 34348 90370 134838 77001
11436G7001m5090J2923J4754k5745r2617K372O9999L3023o370j6853J0494l6970
$$ 77001 31911 44834 59588 33843 -58774 -56402 13597 46620 40250 23397 33891 -3079
11424c079P682J5787j0729K6215l3718L5459l5189M714n071o740M378L758K0121
$$ -3079 4603 20390 9661 35876 2158 37617 2428 7142 2071 -4669 -291 3467 23588
11411B3588M7150o517l1728K567j9962L4548M4623J974j0196j1284L088o5996
$$ 23588 70738 64221 32493 35060 15098 49646 94269 96243 86047 74763 77851 11855
11399A1855J9922J6563j6556M2415j4320k7255R258K7780j7385m0718k164K4866
$$ 11855 31777 48340 31784 74199 59879 32624 41882 69662 52277 11559 9395 34261
11387C4261O95j9886Q728N8614J1923j564k1486j6937m1195j8747J9064O176J5208
$$ 34261 34956 15070 23798 82412 94335 92771 71285 54348 13153 -5594 13470 19646 34854
11374C4854J8313J6768r034N3864Q432n7343n3262m4349l4460O6419K4878l617
$$ 34854 53167 69935 60901 114765 123197 65854 12592 -31757 -66217 202 25080 21463
11362B1463M484k8679j9682M7376M5191l9268n5953K5889m671m5716R7597m6814
$$ 21463 25947 -2732 -22414 24962 70153 30885 -25068 821 -3850 -49566 48031 1217
11350A217k9052N2128K988L9932j3422o611j2577l7629l6514M2590J4457K9613
$$ 1217 -27835 24293 27281 67213 53791 47180 34603 -3026 -39540 3050 17507 47120
11338D7120P7719J4853n3491j8574J3188j9394l0653N593j5362n6324k6559l2631
$$ 47120 124839 139692 86201 67627 80815 61421 30768 36361 20999 -35325 -61884 -94515
11326i4515J8433O8711K9510p1003O4898m949M8268L1874m9078k5542j2922J0032
$$ -94515 -76082 -7371 22139 -48864 16034 11085 59353 91227 42149 16607 3685 13717
11314A3717p2917N044J8111l3762N7787J7375K084J5863L2481K1680q076M668
$$ 13717 -59200 -54156 -36045 -69807 -12020 5355 7439 23302 55783 77463 69387 74055
11302G4055o940P7483L5372k7664p4900k0080m3025J3489J7493l2591m6925J1016
$$ 74055 67115 144598 179970 152306 77406 57326 14301 27790 45283 12692 -34233 -23217
11290b3217R280J524L4410M717J4572M1706R156J99L2096l5239q1712j0087M1777
$$ -23217 -13937 -12413 21997 26714 41286 82992 92148 92347 124443 89204 7492 -2595 39182
11277C9182O1978M5331m0587n6054k5704L491R293l1633m2392p0o517P960K4481
$$ 39182 101160 146491 105904 49850 24146 27637 36930 5297 -37095 -37165 -43682 -35722 -11241
11264a1241R137j2271M209O163N6326o603p679N63k5296M7j8767k4027j8297N2036
$$ -11241 -2104 -14375 -10166 -4003 52323 45720 38041 38604 13308 13355 -5412 -29439 -47736 4300
11250D300o379M02j5543Q962J5924j0230k4545l6037r032M769R0953L9674m1009
$$ 4300 -2079 -1677 -17220 -8258 7666 -2564 -27109 -63146 -72178 -67409 23544 63218 22209
11237B2209k3014L2319Q0039K9047p1276o3790J6136j6835R064K9214M450l9314
$$ 22209 -805 31514 111553 140600 69324 5534 21670 4835 13899 43113 47563 8249
11225H249j9238L5680L3972M143j0654m4746k4975J4060J662p960l5678K2970
$$ 8249 -10989 24691 58663 62806 52152 7406 -17569 -3509 -1847 -9807 -45485 -22515
11213b2515o53j057L8666n2465Q172J7101R052m338Q505J9978k6497O201K2100
$$ -22515 -23168 -24225 14441 -38024 -29852 -12751 -3699 -8037 468 20446 -6051 150 22250
11200B2250j2482q652K0927r349L1625j1218J9767M1572n763K2678j2145r332
$$ 22250 9768 1116 22043 12694 44319 33101 52868 94440 88677 111355 99210 89878
11188H9878J9478p984l7855k5590k9955J6343N7118j7875m4891J5458l638k6312
$$ 89878 109356 101372 63517 37927 7972 24315 81433 63558 18667 34125 30487 4175
11176D175j0691L8613J169o3741o425k222j1240J4570J8105L8725m17J3835L6125
$$ 4175 -6516 32097 33266 -30475 -36900 -39122 -50362 -35792 -17687 21038 20621 34456 70581
11163G0581p149l3442l7667j3641j0897J8953J8557N738l6423M443j1283q814
$$ 70581 63432 29990 -7677 -21318 -32215 -13262 5295 11033 -25390 -20947 -32230 -41044
11151d1044k0680K075L5179j1139J5656Q0126L5952k629K2585J4119j7847k2001
$$ -41044 -61724 -59649 -24470 -35609 -19953 60173 96125 93496 116081 130200 112353 90352
11139I0352k403j6805m7580J4962l607L2368M1007P027j3673m4652l3839l9338
$$ 90352 87949 71144 23564 38526 34919 67287 108294 115321 101648 56996 23157 -16181
11127a6181k7904O5453j8576k2888j466M8992M7429L6351j7367m6473K7542P515
$$ -16181 -44085 21368 2792 -20096 -21562 27430 74859 111210 93843 47370 74912 82427
11115H2427k2722n1017o782N7775O047j6131M2182j5245o0275K5161P784j0737
$$ 82427 59705 8688 1906 59681 65728 49597 91779 76534 16259 41420 49204 38467
11103C8467m1672L1350J3349O349l86l8347j4501m5280L3008L0004O4485K3203
$$ 38467 -3205 28145 41494 47843 47457 9110 -5391 -50671 -17663 12341 76826 100029
11091A00029n6768k6048m0885M0217K2328k6512l1728k940m89L9217N539K9896
$$ 100029 43261 17213 -23672 16545 38873 12361 -19367 -22307 -22796 16421 21960 51856
11079E1856L6675l6847l751j5537n9146j8027k8656q0017K8684N2262P794J778
$$ 51856 88531 51684 47933 32396 -26750 -44777 -73433 -153450 -124766 -72504 -64710 -62932
11067f2932L9011p814J9331j3819K4239L4652J7357j2401k5464K2885K5142M4933
$$ -62932 -23921 -31735 -12404 -26223 -1984 32668 50025 37624 12160 35045 60187 105120
11055A05120L9516j0311m5140l2070m5888o6397J8550N3582R3833j532L5784P355
$$ 105120 144636 134325 89185 57115 11227 -55170 -36620 16962 110795 109263 145047 152402
11043A52402o1057M1031Q5665l456q842j647o8427K0676N5283M2021m44L2243
$$ 152402 91345 132376 218041 214585 205743 204096 135669 156345 211628 253649 253205 285448
11031B85448N5588j0057j773K1627j0532q398j9223P123M7491N1307P8231K8082
$$ 285448 341036 330979 329206 350833 340301 331903 312680 319803 367294 418601 496832 524914
11019E24914m476n3777p3160p2712p0589p5465k0830R725L4026K7079M5267R9526
$$ 524914 520438 466661 393501 320789 250200 174735 153905 163630 197656 224735 270002 369528
11007C69528j6964l2042l0122m7186n9181o8267M5677R297m452k0199L7452M5676
$$ 369528 352564 320522 290400 243214 184033 115766 161443 170740 166288 146089 183541 229217
10995B29217O3135K9792p2828r0215j31084P648M7084J6850J1811o4780j7859
$$ 229217 292352 322144 249316 159101 28017 35665 82749 99599 111410 46630 28771
10984B8771k2004m069K4195M467Q061k1302J4527k1482O669j1646r78m5878n1577
$$ 28771 6767 2698 26893 31360 39421 18119 32646 11164 17833 6187 5209 -40669 -92246
10971i2246j5814P9605J9122n738J2394N5996j3994j5021j0194k0300j3243j3825
$$ -92246 -108060 -28455 -9333 -15071 -2677 53319 39325 24304 14110 -6190 -19433 -33258
10959c3258M5826K4526J8256j329k5655J3498n1055k5795K6256J9602K732R026
$$ -33258 12568 37094 55350 54021 28366 41864 -9191 -34986 -8730 10872 13604 22630
10947B2630L2378L5078J8442n1645M7213L3978j5082n1756l2413k6962l291L5015
$$ 22630 55008 90086 108528 56883 104096 138074 122992 71236 38823 11861 8570 43585
10935D3585P0712j4353j3370k0533l3357k4726L2795j8455l5804j5092M0227N588
$$ 43585 114297 99944 86574 66041 32684 7958 40753 22298 -13506 -28598 11629 17217
10923A7217N412M0057o1469m3274M2901k784o1686J5646Q325L0134j5226q602
$$ 17217 22629 62686 1217 -42057 844 -1940 -63626 -47980 -39655 -9521 -24747 -33349
10911c3349k3796r372J4650N0868R9673K4990q95k0976m9367q8945l788N999l2698
$$ -33349 -57145 -66517 -51867 -999 98674 123664 122769 101793 52426 -36519 -40307 -34308 -67006
10898f7006O384K2825K7153n4086l5042j4757P8017L1682K570P447j4418J8127
$$ -67006 -60622 -37797 -10644 -64730 -99772 -114529 -36512 -4830 -2260 5187 -9231 8896
10886H896m1480l1979N7009M9906n4507p473j0724L5122J6485K7283R158p558
$$ 8896 -32584 -64563 -7554 42352 -12155 -19628 -30352 4770 21255 48538 57696 50138
10874E0138L2632N094j8353l2859l8537o251Q300R0568j3770r0212j3580Q5009
$$ 50138 82770 87864 69511 36652 -1885 -8136 164 90732 76962 -13250 -26830 58179
10862E8179M066m824n6094L645J9138J881k1856l5469n8458L9896P2497O4626
$$ 58179 62245 57421 1327 4972 24110 25991 4135 -31334 -89792 -49896 22601 87227
10850H7227q906P55K2969m9641k1241l3052j5186L7656k9167K9513K4521k3728
$$ 87227 78321 79076 102045 52404 31163 -1889 -17075 20581 -8586 20927 45448 21720
10838B1720m1034l7400j5310p377J0803N0698K4256Q1119q819o903N5134J3058
$$ 21720 -19314 -56714 -72024 -79401 -68598 -17900 6356 87475 78656 71753 126887 139945
10826A39945n2422j9715M1364l937k3724l841O412l0261M2639L740J4756k5841
$$ 139945 87523 67808 109172 105235 81511 77670 84082 53821 96460 100200 114956 89115
10814H9115l9062n813J9002j2961O3043K3687L53J0944L4857J3465l1767l3539
$$ 89115 50053 44240 63242 50281 113324 137011 137364 148308 183165 196630 164863 131324
10802A31324j7861m482j9855K4769K2386P6350P9418P6059P742k8123r4548r1231
$$ 131324 113463 108981 89126 113895 136281 212631 292049 368108 375850 347727 253179 161948
10790A61948p0588l7762l4869L5228N2676O4768P5695P1123M1366p3820j46541
$$ 161948 91360 53598 18729 53957 106633 171401 247096 318219 359585 285765 139224
10779A39224o8966n1415o4145o3190k3302O9888K6264N2767M549l2128l0088m8532
$$ 139224 70258 18843 -45302 -108492 -131794 -61906 -35642 17125 21674 -10454 -40542 -89074
10767h9074n5350N964M0181K3922m6990K0392J8958m225R891O162l8545m5508
$$ -89074 -144424 -138460 -98279 -74357 -121347 -100955 -81997 -86222 -76331 -70169 -108714 -154222
10755a54222l2829l2949m1853r820R391J4669j8P0138O1768J3133j7743q015k5149
$$ -154222 -187051 -220000 -261853 -271673 -262282 -247613 -247631 -177493 -115725 -102592 -120335 -128350 -153499
10742a53499j7797K5246K1600L7882l1305R224L5703M7346n9077m4916L0164K082
$$ -153499 -171296 -146050 -124450 -86568 -117873 -108649 -72946 -25600 -84677 -129593 -99429 -97347
10730i7347J733J5309j9090K1297L5391K8031j3154q3896o7093K9408R4464J6503
$$ -97347 -95614 -80305 -99395 -78098 -42707 -14676 -27830 -111726 -178819 -149411 -54947 -38444
10718c8444L4134J4784P5840J3254k5380K2195l2407n7342n2413m9168J8092P0007
$$ -38444 -4310 10474 86314 99568 74188 96383 63976 6634 -45779 -94947 -76855 -6848
10706f848l4472j3043l2858N8080q990m0499J0501l5160j6646o568j8623O9925
$$ -6848 -41320 -54363 -87221 -29141 -38131 -78630 -68129 -103289 -119935 -126503 -145126 -75201
10694g5201J7219k6641l03R373K878q916R129J4890k7507j5837p446n8083L752
$$ -75201 -57982 -84623 -84926 -75553 -72675 -81591 -72462 -57572 -85079 -100916 -108362 -166445 -162693
10681a62693O8791O054J3196K8837n5486p025j5212J0021N55J8705k7958l2763
$$ -162693 -93902 -87848 -74652 -45815 -101301 -108326 -123538 -113517 -112962 -94257 -122215 -154978
10669a54978q973L2288O8210N700J4105j8169p189K1404j0364M874N391m2329
$$ -154978 -163951 -131663 -63453 -57753 -43648 -61817 -69006 -47602 -57966 -53092 -47701 -90030
10657i0030r945p0718n472M3655O8454M8282P441J1146l527K8380K4358J2354
$$ -90030 -99975 -170693 -176165 -132510 -64056 -15774 -8333 2813 -714 27666 52024 64378
10645F4378L0810M9703Q163o1899l640M3037P875N2440M5882K5946P6295J08891
$$ 64378 95188 144891 153054 91155 87515 130552 138427 190867 236749 262695 338990 447881
10633D47881M7427L9235J29006J60261J33932J01286J45244J84167J96570L04853
$$ 447881 495308 534543 663549 823810 957742 1059028 1204272 1388439 1585009 1889862
10623A889862M20199N53127O57004R02425J260036J807030K580328L560372M527492
$$ 1889862 2310061 2863188 3520192 4422617 5682653 7489683 10070011 13630383 18157875
10614A8157875M718552L373662R47653j022594j749467j482245n90254O99562
$$ 18157875 22876427 26250089 27197742 26175148 24425681 22943436 22353182 23052744
10606B3052744K382395M457758P052252R404584R638074N754829n71798n019813
$$ 23052744 25435139 29892897 36945149 46349733 55987807 61742636 61170838 56151025
10598E6151025o154921n018129k876643l67481K517575N897482R534048J2367606
$$ 56151025 49996104 44977975 42101332 41733851 44251426 50148908 59682956 72050562
10590G2050562J1684853N065574m315865j0128609j1043426r153282o338153l494789
$$ 72050562 83735415 88800989 84485124 74356515 63313089 54159807 47821654 44326865
10582D4326865o89005K292094N068649O771356N785765Q90919n270696q664092
$$ 44326865 43637860 45929954 50998603 57769959 63555724 64446643 59175947 50511855
10574E0511855q647635p028911m972845l003615j298567K45688J363948J875670
$$ 50511855 41864220 34835309 29862464 26858849 25560282 25805970 27169918 29045588
10566B9045588J177765q49518l107242m302901m367222l659139k911158k173520
$$ 29045588 30223353 29373835 26266593 21963692 17596470 13937331 11026173 8852653
10558H852653j552151j194156q97982p10480n63301m25474m24783l62108k62402
$$ 8852653 7300502 6106346 5208364 4497884 3934583 3509109 3084326 2722218 2459816
10549B459816j98896j32854j50798j67991j78418j05534p9683r6148r8372n6385
$$ 2459816 2260920 2128066 1977268 1809277 1630859 1525325 1445642 1349494 1251122 1194737
10539A194737l9598n4010l4364l7457m9839J578m1325r7576q5484Q807j052m0878
$$ 1194737 1155139 1101129 1066765 1029308 979469 981047 939722 842146 756662 765469 764417 723539
10527G23539o9032o776k9020o482L4273j1851J4961K0276J0228k0426m5146m7957
$$ 723539 654507 647731 618711 612229 646502 634651 649612 669888 680116 659690 614544 566587
10515E66587o8111q442P985O7051L9328L1068O990r2415k5558j8166J3230L3298
$$ 566587 498476 490034 498019 565070 604398 635466 642456 550041 524483 506317 519547 552845
10503E52845K0575j5954o0372l5547K7664k1761k2350j6600m5560k5154l0797
$$ 552845 573420 557466 497094 461547 489211 467450 445100 428500 382940 357786 326989
10492C26989J7410N2067R844L1957n7594l6513J1002K5572m2991n1911l1121P605
$$ 326989 344399 396466 406310 438267 380673 344160 355162 380734 337743 285832 254711 262316
10480B62316R9204R4470n838p313P12J8873o2255k7625j1998l5311L1214N1142
$$ 262316 361520 455990 450152 442839 443551 462424 400169 372544 360546 325235 356449 407591
10468D07591J7790n1634n4529M053j4925o61k0396N417j2212J9037N545L4330
$$ 407591 425381 373747 319218 323271 308346 307685 287289 292706 280494 299531 305076 339406
10456C39406J4331k9267k590L3826m380l2268j9820J9288K5474k2834k4602j2531
$$ 339406 353737 324470 321880 355706 351326 319058 299238 318526 344000 321166 296564 284033
10444B84033n2835l4573J9477J6894j4573N342J2525K4029N7673J5316m7099K1724
$$ 284033 231198 196625 216102 232996 218423 223765 236290 260319 317992 333308 286209 307933
10432C07933N2231J8984n0717m6152k733J1703O9787K6995l4991l0876l8739m3014
$$ 307933 360164 379148 328431 282279 279546 291249 361036 388031 353040 322164 283425 240411
10420B40411J1363r535l583K7958P0965J6373n343k6619q000o3270p5812n7308
$$ 240411 251774 242239 238656 266614 337579 353952 348609 321990 313990 250720 174908 117600
10408A17600j5097j4117J1139J6422N7712K344P642L9626n8615p7566o6067q1515
$$ 117600 102503 88386 99525 115947 173659 176003 183645 223271 164656 87090 21023 -60492
10396f0492k7657j3182M0373K4087R305j8403L3312O453o0608q4135Q1k2218j7295
$$ -60492 -88149 -101331 -60958 -36871 -27566 -45969 -12657 -6204 -66812 -150947 -150866 -173084 -190379
10383a90379J8431J3240L1580J1108M1757P29l1676l4647l7587O286M1059q909
$$ -190379 -171948 -158708 -127128 -116020 -74263 -73534 -105210 -139857 -177444 -171158 -130099 -139008
10371a39008n1694j8118N9744N9042J2039M7179n1058n1019J3896J5434L3879
$$ -139008 -190702 -208820 -149076 -90034 -77995 -30816 -81874 -132893 -118997 -103563 -69684
10360f9684L0437l9621n125N7318p090o7703O4329N9659K6636k9170k5931N058
$$ -69684 -39247 -78868 -83993 -26675 -33765 -101468 -37139 22520 49156 19986 -5945 -887
10348h87k9256p209l0603O4657O8319k842l9105k5231j8247j1870K6575L1940
$$ -887 -30143 -37352 -67955 -3298 65021 62179 23074 -2157 -20404 -32274 -5699 26241
10336B6241R7005J3989o5784j3921k175o785Q180M2727M8381j8412m9802r845
$$ 26241 123246 137235 71451 57530 55355 48570 56750 99477 147858 129446 79644 69799
10324F9799l1441J3222M827K6593J102j8868M445J4344m4372j9830K4141Q671
$$ 69799 38358 51580 56407 83000 84102 65234 69679 84023 39651 19821 43962 52633
10312E2633j9975K1052k3868n957k4267K1146K5352q629K1815J6863l4443l3409
$$ 52633 32658 53710 29842 23885 -382 20764 46116 37487 59302 76165 41722 8313
10300H313r2866l3850O4709L8849j0261k4975J1445L017j9709J2827P1747K6794
$$ 8313 -84553 -118403 -53694 -14845 -25106 -50081 -38636 -35619 -55328 -42501 29246 56040
10288E6040r6597r381R3702N8063j2559m1083l7905j9421k25k1856O7940J7358
$$ 56040 -40557 -49938 43764 101827 89268 48185 10280 -9141 -9366 -31222 36718 54076
10276E4076m1960l6513k0844k0831M7973K436n524K1123K3112L7837k1639n996
$$ 54076 12116 -24397 -45241 -66072 -18099 -15663 -21187 -64 23048 60885 39246 33250
10264C3250Q608k3508n3810N152O144o768l946M3560K2773k1329k6157J262L6827
$$ 33250 41858 18350 -35460 -30308 -24164 -30932 -34878 8682 31455 10126 -16031 -14769 22058
10251B2058j7533l9948K835O2072O0022m9119q005q361n7419K9190M8093l4538
$$ 22058 4525 -35423 -32588 29484 89506 40387 32382 24021 -33398 -4208 43885 9347
10239I347Q27J3992l884N066l5698k9128M5821Q1778o0975j9520K2323L1729L1117
$$ 9347 10174 24166 20282 25348 -10350 -39478 6343 88121 27146 7626 29949 61678 92795
10226I2795N8684j0127q3661k0327l8542j5902j1987K2123Q227J2679K8664j7961
$$ 92795 151479 141352 57691 37364 -1178 -17080 -29067 -6944 1283 13962 42626 24665
10214B4665j8070K2783J4671l9714K3942k3563j0956K2881N170j7451L3554K450
$$ 24665 6595 29378 44049 4335 28277 4714 -6242 16639 21809 4358 37912 40362
10202D0362p9011J922M4877K2512J7671M014K3511K2901m5047n8516J3608L4549
$$ 40362 -38649 -36727 8150 30662 48333 52347 75858 98759 53712 -4804 8804 43353
10190D3353M328J6349J6808M388j0657p1168l8539N7430K79N7634O0426O6728
$$ 43353 47681 64030 80838 85226 74569 3401 -35138 22292 22571 80205 140631 207359
10178B07359O7843k1199j0172R45p6206o6185j8266L7563P3780K0353P9672N1975
$$ 207359 275202 254003 243831 244776 168570 102385 84119 121682 195462 215815 295487 347462
10166C47462L6032K1746L0956j6214l6558n5987n1747k4483J807L0334M5906O0137
$$ 347462 383494 405240 436196 419982 383424 327437 275690 251207 253014 283348 329254 389391
10154C89391J36009O0723n9803n7225k4501q0735r8638l6510M1775O1321l0502
$$ 389391 525400 586123 526320 469095 444594 363859 265221 228711 270486 331807 301305
10143C01305m0407N4710O7695M9726j271n1241r0894m4902K0573o0074k2313L0134
$$ 301305 260898 315608 383303 433029 431758 380517 289623 244721 265294 205220 182907 213041
10131B13041L9397J5083m2985m2308n8036n9331N2167P5347r313n623o1086j333
$$ 213041 252438 267521 224536 182228 124192 64861 117028 192375 183062 177439 116353 115020
10119A15020K6295q868l1038l0879k6815k9474J7684k8854r474J8133L3239L8207
$$ 115020 141315 132447 101409 70530 43715 14241 31925 3071 -6403 11730 44969 83176
10107H3176J7422o1272p5840k3786O9905M4509J7394J264N5893j3571n7350K0022
$$ 83176 100598 39326 -36514 -60300 9605 54114 71508 72772 128665 115094 57744 77766
10095G7766K0909L0274l5617j3888m1498l078J4202p922l5699n0234J9146r444
$$ 77766 98675 128949 93332 79444 37946 34868 49070 41148 5449 -44785 -25639 -35083
10083c5083N953k8212k0657K8212l3451k935M4684K3288P6031J7634l4167M3595
$$ -35083 -29130 -57342 -77999 -49787 -83238 -86173 -41489 -18201 57830 75464 41297 84892
10071H4892J4657l2606l0242r974k4634L9975K1582n5603n5631P5905K9692J1473
$$ 84892 99549 66943 36701 26727 2093 42068 63650 8047 -47584 28321 58013 69486
10059F9486m1275l1971O4796L2201J3221K722j1828n3509K3709j6305l4323R802
$$ 69486 28211 -3760 61036 93237 106458 109180 97352 43843 67552 51247 16924 26726
10047B6726P704k7910r241J1993p02J3803q487K6790M2685L8317m1784m8846J6821
$$ 26726 34430 6520 -2721 9272 8570 22373 13886 40676 83361 121678 79894 31048 47869
10034D7869J5544l2501l9994n013O2119M56Q110j0769m2515N4714J818l6206K3671
$$ 47869 63413 30912 -9082 -14095 48024 48480 56590 45821 3306 58020 59838 23632 47303
10021D7303L5144J3542k5882k5346L2406m9985j097m427J3178K739j9211j6850
$$ 47303 82447 95989 70107 44761 77167 27182 26085 21658 34836 37575 18364 1514
10009A514k5755q757N1285k4088M5122k7197j9781J4077J8848k9986M31Q3059
$$ 1514 -24241 -32998 18287 -5801 39321 12124 -7657 6420 25268 -4718 -4287 78772
9997G8772o043k5069J7074n3449k3577L0825J5089M713K6432M0282p912k0567
$$ 78772 72729 47660 64734 11285 -12292 18533 33622 38335 64767 105049 97137 76570
9985G6570m1614r717P637k0245k849O6889n81l1640J9740J7652m4688K464N098
$$ 76570 34956 25239 32876 12631 9782 76671 76090 44450 64190 81842 37154 39618 44716
9972D4716m4501J720K3636L8913o1671l0973J9849K4077O2557J6450n4663k3271
$$ 44716 215 1935 25571 64484 2813 -28160 -8311 15766 78323 94773 40110 16839
9960A6839k4691N104L4028Q3878L9418l0560l2701P965p898k6066q620k7021R964
$$ 16839 -7852 -2748 31280 115158 154576 124016 91315 99280 91382 65316 56696 29675 39639
9947C9639n6274J4242J53l2323k040R6411K9762n5120l655j3748N457N255k4773
$$ 39639 -16635 -2393 -2240 -34563 -36603 59808 89570 34450 30795 17047 22504 27759 2986
9934B986o2408r41P0282R3296J4146p5292j3758q691q279n0055K3703O7026J0599
$$ 2986 -59422 -60363 9919 103215 117361 42069 28311 19620 11341 -38714 -15011 52015 62614
9921F2614L0127j0415J08328J80752L13748O19774O75353j64408o13405m26445
$$ 62614 92741 82326 190654 371406 685154 1304928 1980281 1815873 1202468 776023
9911G76023k87799j64698j40328q2955m4297J3504Q5444N071o3358q3861n0083
$$ 776023 488224 323526 183198 100243 55946 69450 154894 159965 96607 12746 -37337
9900c7337j3282N7189L3164k9611n9670J8287P4419o388m2507K1962L1899m3652
$$ -37337 -50619 6570 39734 10123 -49547 -31260 43159 36771 -5736 16226 48125 4473
9888D473n7541M9975P54r498N1423l0254K5966l002J6470j4799k5560K550K8306
$$ 4473 -53068 -3093 -2339 -11837 39586 9332 35298 32296 48766 33967 8407 10957 39263
9875C9263n6477J8576N6026j5178j4887L8546k7243m9559K153L8255K0309j6759
$$ 39263 -17214 1362 57388 42210 27323 65869 38626 -10933 -8780 29475 49784 33025
9863C3025p1757L3763l0227l4574m642r19K6420P0220M2674L7291k9649k1342
$$ 33025 -38732 -4969 -35196 -69770 -74412 -75331 -48911 21309 63983 101274 71625 50283
9851E0283l2489n7550M269O1058j007N447m7953J2835j0001j9595J1744M7590
$$ 50283 17794 -39756 -35487 25571 24564 30011 -17942 -5107 -15108 -34703 -22959 24631
9839B4631n29l24L305q435J029j6362k1435k966k174K6335r360j7330K5197L1867
$$ 24631 24102 23778 27083 18648 19677 3315 -18120 -21086 -23260 3075 -6285 -23615 1582 33449
9825C3449N0066o2259m4176R779q261J7488L8908r56m5309n1998J5219J8649J3223
$$ 33449 83515 21256 -22920 -13141 -21402 -3914 34994 34038 -11271 -63269 -48050 -29401 -16178
9812a6178j5028k5816m946j1432K3160K940j7135L6800N6645J8746M6469m11k3172
$$ -16178 -31206 -57022 -61968 -73400 -50240 -47300 -64435 -27635 29010 47756 94225 93814 70642
9799G0642J0917k1968l7284R954k8501k7334L2677L9114M0902K2318m0037m1872
$$ 70642 81559 59591 22307 32261 3760 -23574 9103 48217 89119 111437 71400 29528
9787B9528k8254J9040N2913J0368q050J7572L2145P136j6973p9067l6120M445
$$ 29528 1274 20314 73227 83595 75545 93117 125262 132398 115425 36358 238 4683
9775D683j0525q589P302J6448l4712P349J1489L8701L0536n1481J5810r50j851
$$ 4683 -5842 -14431 -7129 9319 -25393 -18044 -6555 32146 62682 11201 27011 26061 24210
9762B4210k0399J3160L6167n780n1664Q957k2257N698j1058k3288J9440k0896
$$ 24210 3811 16971 53138 47358 -4306 4651 -17606 -11908 -22966 -46254 -26814 -47710
9750d7710m6391J9682J00891J4358K962m712r719K5946K6647Q523l2960n6371
$$ -47710 -94101 -74419 26472 40830 43792 39080 29361 55307 81954 90477 57517 1146
9738A146r095n9973m3035N6956J6776j8147L2947R3665M6340N1413k3269m7870
$$ 1146 -7949 -67922 -110957 -54001 -37225 -55372 -22425 71240 117580 168993 145724 97854
9726I7854o8338M931J9745n9578m0771l9090M8742L7781q326o877N1459j2723
$$ 97854 29516 34447 54192 -5386 -46157 -85247 -36505 1276 -7050 -13927 37532 24809
9714B4809l0361M1957L6350p7752n8381P0283O3881k0124l4637P903j4203J4743
$$ 24809 -5552 36405 72755 -4997 -63378 6905 70786 50662 16025 23928 9725 24468
9702B4468j4483j9852K114m4931m5945M90R4008Q0384M1544l9934m2637n5077
$$ 24468 9985 -9867 -7753 -52684 -98629 -98139 -4131 76253 117797 77863 35226 -19851
9690a9851k0118K7729l1435J2018j7010l848j3016K3544j384q237j2296k3278
$$ -19851 -39969 -12240 -43675 -31657 -48667 -52515 -65531 -41987 -43371 -51608 -63904 -87182
9678h7182l9666j6263k0124N2401M0955J6255L8970N6076j2081M4479j4112l2373
$$ -87182 -126848 -143111 -163235 -110834 -69879 -53624 -14654 41422 29341 73820 59708 27335
9666B7335J0844K3939m7592J9328N4523k6041j8469J3543o2668j9701J11308J0400
$$ 27335 38179 62118 14526 33854 88377 62336 43867 57410 -5258 -24959 86349 96749
9654I6749k3751j1877p6915r074M1010Q3112j4714m5123j9984m5894N7879J57665
$$ 96749 72998 61121 -15794 -24868 16142 99254 84540 39417 19433 -26461 31418 189083
9642A89083J98689J62632j1886j11615j14515q9512j13384k565J8153o9137o1280
$$ 189083 387772 550404 538518 426903 312388 222876 109492 106927 125080 55943 -5337
9631e337R577k5659l8128j3091P0836L2360L2986K5068m4726o7638k3J403r630
$$ -5337 4240 -21419 -59547 -72638 -1802 30558 63544 88612 43886 -23752 -23775 -22372 -32002
9618c2002N2618O5106O4794k8611k9969j077M1223O4755J1104l2859k3972l3583
$$ -32002 20616 85722 150516 121905 91936 90859 132082 196837 207941 175082 151110 117527
9606A17527l919Q154m5202m0825K8107J8469q9200n3135K1007J4973q401J3926
$$ 117527 113608 121762 76560 35735 63842 82311 -6889 -60024 -39017 -24044 -32445 -18519
9594a8519m420j7763J0704L1794o3981j1486R1992K6098k8946q6416n4275M2845
$$ -18519 -22939 -40702 -29998 1796 -62185 -73671 18321 44419 15473 -70943 -125218 -82373
9582h2373P2020K7664M928k4205n7761p686M8309M0897J2414k0247j0676j1301
$$ -82373 -10353 17311 22239 -1966 -59727 -67413 -19104 21793 34207 13960 3284 -8017
9570h017K541L0524K9893r370j03034K142J10241j7083J592J0653M713m81k0798
$$ -8017 -5476 25048 54941 45571 -57463 -55321 54920 37837 39429 50082 54795 54314 33516
9557C3516n0453l5296k3969P4779L5814P184j9518l5875L780N1223N775j6512
$$ 33516 -16937 -52233 -76202 -1423 34391 41575 22057 -13818 -10038 41185 46960 30448
9545C0448r449k9703j8941K5899L0887L3276l5582q981K470k0171o092J9117l7284
$$ 30448 20999 -8704 -27645 -1746 29141 62417 26835 17854 20324 153 -5939 13178 -24106
9532b4106p555R765n265k9837k1563k1709N3039P5931K8911m242k4677m7100k0005
$$ -24106 -31661 -21896 -27161 -56998 -78561 -100270 -47231 28700 57611 53369 28692 -18408 -38413
9519c8413M4128L9456o5561n6886J2354L5986m1426N3727L9451o7012k1910M4422
$$ -38413 5715 45171 -20390 -77276 -64922 -28936 -70362 -16635 22816 -44196 -66106 -21684
9507b1684m3875Q345l3232j3895M4420Q7201N2415l2363n0307r090M3643N414
$$ -21684 -65559 -57214 -90446 -104341 -59921 27280 79695 47332 -2975 -12065 31578 36992
9495C6992J0062J5247k7579j1140J8818j0090l6153j2344r841L5650L6430L0306
$$ 36992 47054 62301 34722 23582 42400 32310 -3843 -16187 -26028 9622 46052 76358
9483G6358L3240o249o7304k5572n2112j8789j4332L7538K3359n315n02K2594m7063
$$ 76358 109598 103349 36045 10473 -41639 -60428 -74760 -37222 -13863 -19178 -19680 2914 -44149
9470d4149K1135N095o0300O521Q432m844L7241M076L1068m1219j2980K1734k2659
$$ -44149 -23014 -17919 -78219 -71698 -63266 -68110 -30869 -26793 4275 -36944 -49924 -28190 -50849
9457e0849L8992K8005N7668K2553o1012k2194j5387k6667j4069l5891O3069P2279
$$ -50849 -11857 16148 73816 96369 35357 13163 -2224 -28891 -42960 -78851 -15782 56497
9445E6497l5681L4895J8503k57j52n6042r202j1323k0171K4653l3306Q969R5895
$$ 56497 20816 55711 74214 73957 73805 17763 8561 -2762 -22933 1720 -31586 -22617 73278
9432G3278K9101k6656o4355o183o634j4306j7075k6191k8886Q1063L8365J5908
$$ 73278 102379 75723 11368 5185 -1449 -15755 -32830 -59021 -87907 -6844 31521 47429
9420D7429M2991j3203q1456k6303n005n4863K4424O8789J8079L3891j2600j1409
$$ 47429 90420 77217 -4239 -30542 -35547 -90410 -65986 2803 20882 54773 42173 30764
9408C0764K5657J8114j4161M000N8747k5256q7200M595N2064j4780K4086o410
$$ 30764 56421 74535 60374 64374 123121 97865 10665 15260 67324 52544 76630 70220
9396G0220l9806J5359J6996Q0j5912M965L3829l2522k4925k8707k056J3786k7252
$$ 70220 30414 45773 62769 62849 46937 51902 85731 53209 28284 -423 -2479 11307 -15945
9383a5945k6069l213L611K1907N3574J2145J5514k7351l2798k9081N5332L5699
$$ -15945 -42014 -45227 -41616 -19709 33865 46010 61524 34173 1375 -27706 27626 63325
9371F3325j0251j09M3394m278l5034j2713k9575O380K8661m2665n3326L6932M4690
$$ 63325 53074 52965 96359 92081 57047 44334 14759 21139 49800 7135 -46191 -9259 35431
9358C5431K0905j7831J4024K3379k5923M320k9571r5235L5188K1767l2607K3737
$$ 35431 56336 38505 52529 75908 49985 54305 24734 -70501 -35313 -13546 -46153 -22416
9346b2416j608l5328O751J4850N7187M0401k366o1013l5337P545L1536K8027p437
$$ -22416 -24024 -59352 -52601 -37751 19436 59837 57471 -3542 -38879 -31334 202 28229 20792
9333B0792l2335K0382l0080k6601k1735l5360L3396L3423O5401L8615J6273m438
$$ 20792 -11543 8839 -21241 -47842 -69577 -104937 -71541 -38118 27283 65898 82171 77733
9321G7733k7838m6159l189O0421M9198j487k0964O981p0471j2235k8998o4409
$$ 77733 49895 3736 547 60968 110166 108679 87715 94696 24225 11990 -17008 -81417
9309h1417L8904M3883R092J5991n457n3103m9485O8268N4207n228j7958q890O748
$$ -81417 -42513 1370 10462 26453 20996 -32107 -81592 -13324 40883 35655 17697 8807 15555
9296A5555M1608J3062l2112K085o1072k0249l2497Q877J9290k1876l2126L8382
$$ 15555 57163 70225 38113 40198 -20874 -41123 -73620 -64743 -45453 -67329 -99455 -61073
9284f1073M4693K8263K6279J0479o878n7709l9289m5489l311P7425N7329O2315
$$ -61073 -16380 11883 38162 48641 41763 -15946 -55235 -100724 -104035 -26610 30719 93034
9272I3034J8933m57m8992j11484l7363K7034N9123M4488L7649p1593k8372k86
$$ 93034 111967 111510 62518 -48966 -86329 -59295 -172 44316 81965 10372 -18000 -18286
9260a8286l492N2735J6881K894o454l4311k022l864n7791l7847K7953K5253J7296
$$ -18286 -21778 30957 47838 50732 44278 9967 7945 4081 -53710 -91557 -63604 -38351 -21055
9247b1055q110O3710p0317n0537P9098j9885L740k9729M0530j2584j9240O6599
$$ -21055 -29165 34545 -35772 -86309 -7211 -27096 -23356 -53085 -12555 -25139 -44379 22220
9235B2220N4456p8538O750J9854J6233k5075k1630L5943K6226n4548n0923P1554
$$ 22220 76676 -1862 4888 24742 40975 15900 -5730 30213 56439 1891 -49032 22522
9223B2522N3723k1239m565l1667k6145J7478k901j0369J9302j1557M6216K2268
$$ 22522 76245 55006 50441 18774 -7371 10107 7206 -3163 16139 4582 50798 73066
9211G3066l9558k0259l8634l7123L9727N1093O279l3787K5523j6087n7665Q3484
$$ 73066 33508 13249 -25385 -62508 -22781 28312 34591 804 26327 10240 -47425 36059
9199C6059K7633M466J0427k3452q8032K5808N6758J1055l9677k5089L0275P4819
$$ 36059 63692 68158 78585 55133 -32899 -7091 49667 60722 21045 -4044 26231 101050
9187A01050r472m6349M5895j0228l0510j6988J674L1566L8125l1711p8739K793
$$ 101050 91578 45229 91124 80896 50386 33398 35072 66638 104763 73052 -5687 -2894
9175b894r136O3391L9505J1237M3940j9442k3324r160n4179k367j2812J3214J4194
$$ -2894 -12030 51361 90866 102103 146043 126601 103277 94117 39938 37571 24759 37973 52167
9162E2167k8061J0003L1639j0983l0354m0587l5646n921N7662j1979p498Q953
$$ 52167 24106 34109 65748 54765 24411 -16176 -51822 -57743 -81 -12060 -19558 -10605
9150a0605k8524P285L0339J9187j0186j8037K7850k555K5922k4091p3693o3354
$$ -10605 -39129 -31844 -1505 17682 7496 -10541 17309 14754 40676 16585 -57108 -120462
9138a20462m5447O8294N1693O6858r586l2299k1804m7237K5591K0283m408J94
$$ -120462 -165909 -97615 -45922 20936 11350 -20949 -42753 -89990 -64399 -44116 -48524 -48330
9126d8330K5285L8224m6341M831K0790K8468q389K8210k6136j2747L911J8857
$$ -48330 -23045 15179 -31162 -26331 -5541 22927 14538 42748 16612 3865 7776 26633
9114B6633M1215m5256l5854k1363J8104M8131K8132K663l873n1583l2987J404
$$ 26633 67848 22592 -13262 -34625 -16521 31610 59742 62405 58532 6949 -26038 -24634
9102b4634J8324n2944M755N2981K6293n7218n1937o941J2249J8516K5510L83l4072
$$ -24634 -6310 -59254 -54499 -1518 24775 -32443 -84380 -91321 -79072 -60556 -35046 -34663 -68735
9089f8735M4865O4015r163j4366J5704k080M5650L7277m5860m7583j5188k7570
$$ -68735 -23870 40145 30982 16616 32320 30240 75890 113167 67307 19724 4536 -23034
9077b3034m4471r850M7207j6106M8865Q3931m7053j1889l011l1022K0653M256
$$ -23034 -67505 -77355 -30148 -46254 2611 86542 39489 27600 24589 -6433 14220 18476
9065A8476k2900j5132M6081k6429m6660O116j0636K7577L4284L6481J8572n9581
$$ 18476 -4424 -19556 26525 96 -46564 -40448 -51084 -23507 10777 47258 65830 6249
9053F249l2014k709K249K9752J1333j00150m8867K3108Q4010O344k1101L3476
$$ 6249 -25765 -28474 -26225 3527 14860 -85290 -134157 -111049 -27039 -20695 -41796 -8320
9041h320k8266k7337L5614O5708K3085l3418n1130p1982N8559M723m3598J4398
$$ -8320 -36586 -63923 -28309 37399 60484 27066 -24064 -96046 -37487 -32764 -76362 -61964
9029f1964Q9921O854l8130O5893K8365j6114l5988m0310k4068p914O2816j9218
$$ -61964 27957 34811 -3319 62574 90939 74825 38837 -1473 -25541 -33455 29361 10143
9017A0143J955j0576m1968m3213P478k3554j3024K0082R9048J1625L8632K1446
$$ 10143 12098 1522 -40446 -83659 -76181 -99735 -112759 -92677 6371 17996 56628 78074
9005G8074o1848l9239L4905L5998n3875q856L8810M7490l0828q596j1857K6892
$$ 78074 16226 -23013 11892 47890 -5985 -14841 23969 71459 40631 32035 20178 47070
8993D7070m5626L99J0362K9622L1235r4976l0553K8017M9578M4846l8762l8523
$$ 47070 1444 1843 12205 41827 73062 -21914 -52467 -24450 25128 69974 31212 -7311
8981g311j8840k3438N7135L7668L068M992L6870K5774n2451o5759l0148o216R059
$$ -7311 -26151 -49589 7546 45214 48282 53274 90144 115918 63467 -2292 -32440 -38656 -29597
8968b9597O3622l3551l1600M133n1917J1875K7477L7079M8736J5463n991L5163
$$ -29597 34025 474 -31126 -26993 -78910 -67035 -39558 -2479 46257 61720 55729 90892
8956I0892J6324k4080j7349K6681m447K4271k1523n2468J0179J2144K9372R087
$$ 90892 107216 83136 65787 92468 88021 112292 90769 38301 48480 60624 89996 99083
8944I9083J5146o2390n0265p42p361K8288r969k2375J8264o5072j8552L3389j5339
$$ 99083 114229 51839 1574 832 -6529 21759 11790 -10585 7679 -57393 -75945 -42556 -57895
8931e7895l4618J0514O7042P3213O5334o3544r5377n1846m0659P535M0214O0818
$$ -57895 -92513 -81999 -14957 58256 123590 60046 -35331 -87177 -127836 -120301 -80087 -19269
8919a9269N5423M3880j6729m6510l487L4517M41j9886J3411k9496l7998J9235
$$ -19269 36154 80034 63305 16795 13308 47825 48266 28380 41791 12295 -25703 -6468
8907f468m866O571M0182l2104j7872O127p44K6135Q794j2282k5556m2084J5256
$$ -6468 -11334 -4763 35419 3315 -14557 -8430 -9174 16961 25755 13473 -12083 -54167 -38911
8894c8911j1483J8679M4781l8961L1208N9913l024o9870n351J2602m6946K2050
$$ -38911 -50394 -31715 13066 -25895 5313 65226 62202 -7668 -13019 -417 -47363 -25313
8882b5313j0913J7250r352k538O0751K5025l9226o0994K3652L9427k2122j15K6941
$$ -25313 -36226 -18976 -28328 -30866 29885 54910 15684 -45310 -21658 17769 -4353 -4468 22473
8869B2473j8947k9984K1778m667n0212J3290Q919k4312o6475L0108N6421N7385
$$ 22473 3526 -26458 -4680 -9347 -59559 -46269 -37350 -61662 -128137 -98029 -41608 15777
8857A5777Q787M5438m598k6613l4613Q963J7019k4521l9159J9026l722k5649M5628
$$ 15777 24564 70002 65404 38791 4178 13141 30160 5639 -33520 -14494 -18216 -43865 1763
8844A763L0436O864j700L8545j9164O964j9795K1370l1758j8646k3957N1912p589
$$ 1763 32199 39063 37363 75908 56744 63708 43913 65283 33525 14879 -9078 42834 35245
8831C5245J2915k2033p5001n8194M7868N4186L9398o671j3145j78K0901J5904
$$ 35245 48160 26127 -48874 -107068 -59200 -5014 34384 27713 14568 14390 35291 51195
8819E1195j5170M0686K9083o391K7672r848n1976m2702l1404Q447J0453J4495
$$ 51195 36025 76711 105794 99403 127075 117227 65251 22549 -8855 -408 10045 24540
8807B4540O046J5245m4276J1973m414K4937n609K1792L2877J9295j7329l0505
$$ 24540 30586 45831 1555 13528 9114 34051 28442 50234 83111 102406 85077 54572
8795E4572J654l2163R845l0016l0546n7860l3027J9325M0961j1447M7173j5412
$$ 54572 56226 24063 33908 3892 -26654 -84514 -117541 -98216 -57255 -68702 -21529 -36941
8783c6941l5413k347m6432j7678Q4270P2748K2072m5561J1357L3180N9489j9198
$$ -36941 -72354 -74701 -121133 -138811 -54541 18207 40279 -5282 6075 39255 98744 79546
8771G9546q2014J9887Q541j5108K2025O898j0417l9567m8938r096K8398K757l126
$$ 79546 -2468 17419 25960 10852 32877 39775 29358 -10209 -59147 -68243 -39845 -37088 -40214
8758d0214k3764K0123Q5l7316J4693M10N8048Q8830K2709q476k5041q8405n9450
$$ -40214 -63978 -43855 -43770 -81086 -66393 -65983 -7935 80895 103604 95128 70087 -18318 -77768
8745g7768j7080M6316K6849M3448K4067O910M0308L0077m7736n2866l9397O800
$$ -77768 -94848 -48532 -21683 21765 45832 52742 93050 123127 75391 22525 -16872 -10072
8733a0072K9588J5699o175J2586o5275m4944n1031m7894P7899K6124p626k5834
$$ -10072 19516 35215 29040 41626 -23649 -68593 -119624 -167518 -89619 -63495 -71121 -96955
8721i6955o667P4006J4441L2372L3738l7180K165l8861l0995O1509R332k760J6897
$$ -96955 -103622 -29616 -15175 17197 50935 13755 15920 -22941 -53936 7573 16905 14145 31042
8708C1042k8105j1902j3191j6739j4951K2579K4837k1451L7690N8094j6807l1492
$$ 31042 2937 -8965 -22156 -38895 -53846 -31267 -6430 -27881 9809 67903 51096 19604
8696A9604k3761k8415K1228P4113L4219M847K5741l5549m2684j7417l4725L2889
$$ 19604 -4157 -32572 -11344 62769 96988 101835 127576 92027 49343 31926 -2799 30090
8684C0090j4902K1056L9634J116J2292n913k652K6384K0712l5608l4939K97J2570
$$ 30090 15188 36244 75878 76994 89286 83373 80721 107105 127817 92209 57270 57567 70137
8671G0137l0075j6505l7631n3215K0674j1765J8945P1606k1948j07905m3660k0261
$$ 70137 40062 23557 -14074 -67289 -46615 -58380 -39435 32171 10223 -97682 -141342 -161603
8659a61603K1586J8720J23850N8105l0122o7913j6655L0927o184J986j7674k481
$$ -161603 -140017 -121297 2553 60658 30536 -37377 -54032 -23105 -29289 -27303 -44977 -47458
8647d7458k21q399j8962K4799L4994J0427K3005L9446q2K2301k4251p932o9751
$$ -47458 -47679 -56078 -75040 -50241 -15247 -4820 18185 57631 57549 79850 55599 47667 -22084
8634b2084j4208j3531j5447N4881J06751M3268l0032k2914l4158m5821q246j000
$$ -22084 -36292 -49823 -65270 -10389 96362 139630 109598 86684 52526 6705 -1541 -2541
8622b541R215J2060J2821K8802k3983O084J4139L374J3270L7359K2140j2633j4440
$$ -2541 6674 18734 31555 60357 36374 42458 56597 59971 73241 110600 132740 120107 105667
8609A05667J4764L0017N576K4259j0672q488m8889O051j6971m323l2035J593O1767
$$ 105667 120431 150448 156024 180283 169611 161123 112234 118285 101314 96991 64956 66549 128316
8596A28316J8314l0268r158K6628K7385l4327K6291n010l9536N865k2139k3426
$$ 128316 146630 116362 107204 133832 161217 126890 153181 148171 108635 114500 92361 68935
8584F8935l8736Q424M0860P3155K3308o720j6314J5241L9503K7590L3356O9704
$$ 68935 30199 38623 79483 152638 175946 169226 152912 168153 207656 235246 268602 338306
8572C38306K7490N4864l4803k9572j688l8974p007o2861j01875l3738L2684K6488
$$ 338306 365796 420660 385857 356285 354597 315623 308616 245755 143880 110142 142826 169314
8560A69314j7968q926m0507q249J3236Q745n158k458J4760l0323k8135J6538j4454
$$ 169314 151346 142420 101913 93664 106900 115645 110487 108029 122789 92466 64331 80869 66415
8547F6415o7443N6303R1066J4766n7470J4280n9529l6871N581O5941k0159p1689
$$ 66415 -1028 55275 146341 161107 103637 117917 58388 21517 27098 93039 72880 1191
8535A191m86M7534M0828p626n519O4979j8340j9048k8291m8133n0224l7084j0778
$$ 1191 705 48239 89067 81441 75922 140901 122561 103513 75222 27089 -23135 -60219 -70997
8522g0997R945L6061M8023R814k1696j7204m1633r400j1686O5069O0149k5446
$$ -70997 -61052 -24991 23032 32846 11150 -6054 -47687 -57087 -68773 -3704 56445 30999
8510C0999n0084J806O5495m146J6237l7004k0975J0428L8704K3242m7814m0394
$$ 30999 -19085 -17279 48216 44070 60307 23303 2328 12756 51460 74702 26888 -13506
8498a3506N194n7426J9221K3242K6262J4728N9654N2128p1098r736k3129K4105
$$ -13506 -8312 -65738 -46517 -23275 2987 17715 77369 129497 58399 48663 25534 49639
8486D9639n795K0667j4695j9016K9452j4729p8308L94K8304L5720J4477j0712
$$ 49639 43844 64511 49816 30800 60252 45523 -32785 -32391 -4087 31633 46110 35398
8474C5398K1802L8214j5024l3432N5249M5223L2363K418J0429q3604q0882j2589
$$ 35398 57200 95414 80390 46958 102207 147430 179793 182211 192640 109036 28154 15565
8462A5565k1277L2708P698l4035j2994J5773P5807N498Q866K9744k4519m5523
$$ 15565 -5712 26996 34694 659 -12335 3438 79245 84743 93609 123353 98834 53311
8450E3311l2094j5749J4901N0471K964q540j645J1136K2785L9638j3099o0942
$$ 53311 21217 5468 20369 70840 73804 65264 63619 74755 97540 137178 124079 63137
8438F3137K776K2519k5206K916O6954L1003k3331J848L3009o9866j28265o6311
$$ 63137 65913 88432 63226 66142 133096 164099 140768 142616 175625 105759 -22506 -88817
8426h8817p091N809m7350N8850J03058L1340k0456j1200n9890J8748l8697O3936
$$ -88817 -95908 -90099 -137449 -78599 24459 55799 35343 24143 -35747 -16999 -55696 8240
8414H240R4870P711N821r3778l7692J5351K0578J8711j2264K9571K4040q4901
$$ 8240 103110 110821 116642 22864 -14828 523 21101 39812 27548 57119 81159 -3742
8402c742j9258p2343j0721N9701K0415P6866N255Q7422p148m5480N132o6769k2066
$$ -3742 -23000 -95343 -106064 -46363 -25948 50918 56173 143595 136447 90967 96099 29330 7264
8389G264J0214m0620k9559N8690N0643j1991k6777m4918J8312K059j3552P706
$$ 7264 17478 -23142 -52701 5989 56632 44641 17864 -27054 -8742 -6683 -20235 -12529
8377a2529M2026k3426l1865P143j6962j9735M213o5638j9672L8159K0532N3534
$$ -12529 29497 6071 -25794 -18651 -35613 -55348 -51135 -116773 -136445 -98286 -77754 -24220
8365b4220j2297J252m3552p085k6109k047M1498K4206K3977k875j9007L4460l055
$$ -24220 -36517 -35265 -78817 -85902 -112011 -114058 -72560 -48354 -24377 -27252 -46259 -11799 -14854
8352a4854J2887N6096q0742p5066J7458K3880N8530o88k9156j3J6089K239j2567
$$ -14854 -1967 54129 -26613 -101679 -84221 -60341 -1811 -2499 -31655 -31668 -15579 -13340 -25907
8339b5907L6245L1791K4288m077k3529p237l7517K0889k2764l8758P529k0734
$$ -25907 10338 42129 66417 62340 38811 31574 -5943 14946 -7818 -46576 -39047 -59781
8327e9781J6494J8342L2688j5333L8676J2151m5853M4348O5501l0349k1805k3841
$$ -59781 -43287 -24945 7743 -7590 31086 43237 -2616 41732 107233 76884 55079 31238
8315C1238k273K9021r840J5142q279l5456p586J7428K3441M778o4572n5858J6001
$$ 31238 28965 57986 48146 63288 55009 19553 11967 29395 52836 57614 -6958 -62816 -46815
8302d6815Q5768q415n555m9418m7702N644J9757O160R2872N8927k1058r1599L460
$$ -46815 38953 30538 24983 -24435 -72137 -66493 -46736 -40576 52296 111223 90165 -1434 2026
8289B026N7927n5467l8616J5010n3324k0222M176L9128J0270J1742N5014R592
$$ 2026 59953 4486 -34130 -19120 -72444 -92666 -88490 -49362 -39092 -27350 27664 37256
8277C7256m8494r577n7203m2885R919J06247O26m263m1446q382M5205O52n1051
$$ 37256 -11238 -20815 -78018 -120903 -110984 -4737 -4111 -8374 -49820 -58202 -12997 -12345 -63396
8264f3396j875M3119J6081k2979l098o755k5164M2747q073j7614N5899P049k6332
$$ -63396 -65271 -22152 -6071 -29050 -32148 -38903 -64067 -21320 -29393 -47007 8892 15941 -10391
8251a0391q543j2605O1060L8999j6490M112k5100J0071L6634k7104l0163l5870
$$ -10391 -18934 -31539 29521 68520 52030 56142 31042 41113 77747 50643 20480 -15390
8239a5390K2444J7913L8775M3682L3446j228k6299o7241j7467p9021k0455K2442
$$ -15390 7054 24967 63742 107424 140870 139642 113343 46102 28635 -50386 -70841 -48399
8227d8399r835n672L6938K2302M2793N0602j9639o2398q750J863q3683K8247R6468
$$ -48399 -58234 -63906 -26968 -4666 38127 88729 69090 6692 -2058 -195 -83878 -55631 40837
8214D0837M3088p0642k4077L3504M7250O855k6679o8315l2933M7863n009p8954
$$ 40837 83925 13283 -10794 22710 69960 76815 50136 -18179 -51112 -3249 -8258 -87212
8202h7212n6631n096L814O3431O6775r589j9519L6187N4838j518J5438n0320j5062
$$ -87212 -143843 -148939 -145125 -81694 -14919 -24508 -44027 -7840 46998 45480 60918 10598 -4464
8189d464J4099o227l0153P3282Q6193m1676j9978m4037J1227o8857K2169J2758
$$ -4464 9635 3408 -26745 46537 132730 91054 71076 27039 38266 -30591 -8422 4336
8177D336k0479n5936l1063J6741K9787M0037j1673J7841O7278J2873J0523o5078
$$ 4336 -16143 -72079 -103142 -86401 -56614 -16577 -28250 -10409 56869 69742 80265 15187
8165A5187l1105M2194R885J9696N0353m7053j2011l8451P658P7682j7788k0688
$$ 15187 -15918 26276 36161 55857 106210 59157 47146 8695 16353 94035 76247 55559
8153E5559n5416m1195l7303J2269P96K1091J2828l804j0160J077m0087J775N1294
$$ 55559 143 -41052 -78355 -66086 -65290 -44199 -31371 -35175 -45335 -44258 -84345 -82570 -31276
8140c1276M2587M6369Q3122p335l9167J4208K0499p5561o9730r738N9432j0398
$$ -31276 11311 57680 140802 133467 94300 108508 129007 53446 -16284 -26022 33410 23012
8128B3012R204K8571j6935l9745o0626M7512L1333n1441J9981Q4638K1678q7699
$$ 23012 32216 60787 43852 4107 -56519 -9007 22326 -29115 -9134 75504 97182 9483
8116I483k6359k7339L6833N2534m956J4606r645k098J2217M82K9098l2553l9353
$$ 9483 -16876 -44215 -7382 45152 40196 54802 45157 43059 55276 55758 84856 52303 12950
8103A2950l9363m9328N0952J0572k0982L388K9600L0838L561j7955J1795k0312
$$ 12950 -26413 -75741 -24789 -14217 -35199 -31811 -2211 28627 32188 14233 26028 5716
8091E716m3782J759J0359j7237O83L1281M7482j7289j2239K0551J8929m9762l2241
$$ 5716 -38066 -36307 -25948 -43185 -42502 -11221 36261 18972 6733 27284 46213 -3549 -35790
8078c5790l649l4863o8423q328n020R4567L8598K4561P125J6677j9192n3147m3752
$$ -35790 -39439 -74302 -142725 -151053 -156073 -61506 -22908 1653 8778 25455 6263 -46884 -90636
8065i0636O4880O3244r192o1090p5535l9880L9552L3842J5599L3991J2808K8200
$$ -90636 -25756 37488 28296 -32794 -108329 -148209 -108657 -74815 -59216 -25225 -12417 15783
8053A5783N2380l2581l6216K6445J8548k5668L3245l0646k3658q492K7623O6850
$$ 15783 68163 35582 -634 25811 44359 18691 51936 21290 -2368 -10860 16763 83613
8041H3613k0515l2812m6505N316j023k3866J5707J9866R011m0638l889J0701o35
$$ 83613 63098 30286 -16219 -10903 -11926 -35792 -20085 -219 8792 -31846 -35735 -25034 -25669
8028b5669K995M0690L2867k2446k6939K4565L672k8853m2493L5430P4338j7725
$$ -25669 -22674 18016 50883 28437 1498 26063 29735 882 -41611 -6181 68157 50432
8016E0432J7589l4827k713N1686J8347l8772p33l2296j187L9056l4886l5990k4590
$$ 50432 68021 33194 30481 82167 100514 61742 61009 28713 27526 66582 31696 -4294 -28884
8003b8884L2993K5537K2615k7190N338K9207K7917j0993l2418k7479L098J6475
$$ -28884 4109 29646 52261 25071 30409 59616 87533 76540 44122 16643 19741 36216
7991C6216J2266j6908k8270M366j7497k9207l6721M5902P6474l4508l2529j2464
$$ 36216 48482 31574 3304 7670 -9827 -39034 -75755 -29853 46621 12113 -20416 -32880
7979c2880N7419l4033K5130J5973k1164L820O8983J31J5000M681k7566N382m9082
$$ -32880 24539 -9494 15636 31609 10445 14265 83248 83379 98379 103060 75494 80876 31794
7966C1794n319m175K8894L3435j9356m0257M0435J5903l5037n99L598m5249k834
$$ 31794 26475 22300 51194 84629 65273 25016 65451 81354 46317 45718 49316 4067 1233
7953A233K9072N3338n170l1764J7050j7318n0435j2672L8967K537n7659k8254
$$ 1233 30305 83643 78473 46709 63759 46441 -3994 -16666 22301 24838 -32821 -61075
7941f1075R1327M6371k0393J8342J1024m8040k9565r24J5476m743J6808K096k0156
$$ -61075 30252 76623 56230 74572 85596 37556 7991 7067 22543 17800 34608 36704 16548
7928A6548l2958J1367K7540N3676j3023m8M485O654L6233m119m8359l0259K4529
$$ 16548 -16410 -5043 22497 76173 63150 63102 67587 74241 110474 106355 57996 27737 52266
7915E2266J5052m228k3615k0205l7579J4192K8783O3042K2207k4127Q003m8494
$$ 52266 67318 63090 39475 19270 -18309 -4117 24666 87708 109915 85788 93791 45297
7903D5297j5335j4985k8258j560L1802L0137J4852Q952K539k7111j4176j1733
$$ 45297 29962 14977 -13281 -14841 16961 47098 61950 70902 73441 46330 32154 20421
7891B0421J2917j5419m1116o221Q886K5564K566L5853K3020k285l7709m0591j8284
$$ 20421 33338 17919 -23197 -29418 -20532 5032 7598 43451 66471 64186 26477 -14114 -32398
7878c2398m344r317J4260L7668N8336l3818o2609m3504J9456O3521L4340N4887
$$ -32398 -36742 -46059 -31799 5869 64205 30387 -32222 -75726 -56270 7251 41591 96478
7866I6478J3882L550k7027q3115M0419l5954k5128J1813K031P5241R680K1193
$$ 96478 110360 113910 86883 3768 44187 8233 -16895 -5082 -3051 72190 81870 103063
7854A03063m5238p7037k4288J5911J1705k2704J0430O2002k47J1449J164j2278
$$ 103063 57825 -19212 -43500 -27589 -15884 -38588 -28158 33844 33597 45046 46210 33932
7842C3932m2487J3244P2376M7463M54l9902o4222j0519L041o077L0816K9904m1494
$$ 33932 -8555 4689 77065 124528 124982 85080 20858 10339 13380 7303 38119 68023 26529
7829B6529j4674L5030l286l3392m272j3420J9026O8878M7896k8694m6142r432
$$ 26529 11855 46885 43599 10207 5935 -7485 11541 80419 128315 99621 53479 44047
7817D4047P111p9924p5550l8853K8190J4033O4260R6250q374m0415j443j4587
$$ 44047 51158 -28766 -104316 -143169 -114979 -100946 -36686 59564 51190 10775 9332 -5255
7805e255l929J4505o160l9603K5508j1596j9679J7293j182J1603O019k0889R091
$$ -5255 -9184 5321 -839 -40442 -14934 -26530 -46209 -28916 -30098 -18495 -12476 -33365 -24274
7792b4274M3955j0136j0284K9413P409j8681L20j3458N3812N974m1327k4426k879
$$ -24274 19681 9545 -739 28674 36083 17402 17722 4264 58076 64050 22723 -1703 -4582
7779d582K0687j94j5357m3432K3669j8272k9341l067j2147J6246J736j4098o486
$$ -4582 16105 15911 554 -42878 -19209 -37481 -66822 -69889 -82036 -65790 -64054 -78152 -84638
7766h4638K690O8127P7616L1368o977j01233m5661m839L5836N5990M7428r41p5427
$$ -84638 -81948 -13821 63795 95163 88186 -13047 -58708 -63547 -27711 28279 75707 74766 -661
7753f61l4633J1393L0480K8140k9543l659O29k6607k3723j9864K8596k6022K0208
$$ -661 -35294 -23901 6579 34719 5176 1517 2146 -24461 -48184 -68048 -39452 -65474 -45266
7740d5266K3857J2994J4611P620L1521K9719l6201m1638K0906l52m6392n1387
$$ -45266 -21409 -8415 6196 13816 45337 75056 38855 -2783 18123 17771 -28621 -80008
7728h0008Q4957O7861J5253j1812r0069l0661j3095L9103L3657j3820K3511o959
$$ -80008 4949 72810 88063 76251 -13818 -44479 -57574 -18471 15186 1366 24877 17918
7716A7918l6524m9056n329J9841J1937q0428r084K4326L9721j934L4000k1935
$$ 17918 -18606 -67662 -72991 -53150 -41213 -121641 -130725 -106399 -66678 -68612 -34612 -56547
7704e6547O532L186K5443M211k958J1502J4110N1057J9496m0314j5585j5324J2657
$$ -56547 -50015 -46829 -21386 -17175 -20133 -8631 5479 56536 76032 35718 20133 4809 17466
7691A7466j7090o50K9039K8905K6741p453o1017j481K0620l6468L5117N6702k8800
$$ 17466 376 -274 28765 57670 84411 76958 15941 14460 35080 -1388 33729 90431 61631
7678F1631j0295k2416j1445k2382J1098K2802M847L3823l253l1935j7099l6349
$$ 61631 51336 28920 17475 -4907 6191 28993 33840 67663 64410 32475 15376 -20973
7666b0973L667n0089j1711L4277L5775J4550m3563m1647k3832L0537M2236R779
$$ -20973 -17306 -67395 -79106 -44829 -9054 5496 -38067 -79714 -103546 -73009 -30773 -20994
7654b0994J7350m8871L1843P7881K1790p8210P615j3342l0391O310O953L0321
$$ -20994 -3644 -52515 -20672 57209 78999 789 8404 -4938 -35329 -29019 -22066 8255
7642H255k617K2079K0454l1571l7783J2339j6254M3511K3071n8967M7672L4645
$$ 8255 5638 27717 48171 16600 -21183 -8844 -25098 18413 41484 -17483 30189 64834
7630F4834o6055k7386N0561n29r791K8879R943r086Q053n3968Q073Q6225K3194
$$ 64834 -1221 -28607 21954 21425 11634 40513 50456 41370 49423 -4545 3528 89753 112947
7617A12947J8913j2939M921m7614n0568j4035n1101p7478L646P5944K9780k7868
$$ 112947 131860 118921 123842 76228 25660 11625 -39476 -116954 -113308 -37364 -7584 -35452
7605c5452j955O2820J591l8332l2076q497K3573k8064j6908N2717M2221j3112
$$ -35452 -37407 25413 27004 -11328 -43404 -51901 -28328 -56392 -73300 -20583 21638 8526
7593H526q138j008L5398k7408o7573N859K5851M5038L3111L0041k0055k3791o4678
$$ 8526 388 -620 34778 7370 -60203 -54344 -28493 16545 49656 79697 59642 35851 -28827
7580b8827N286Q5547N7581l150R935q1725n6416l2015O1637J8974m1607j9377
$$ -28827 -23541 62006 119587 116437 126372 44647 -11769 -43784 17853 36827 -4780 -24157
7568b4157J6704l8089K894O340L1402k2711j2890j1126L9122n061Q13l918J1883
$$ -24157 -7453 -45542 -42648 -36308 -4906 -27617 -40507 -51633 -12511 -17572 -16759 -20677 -8794
7555h794L4620J3317J6502K9982k559n2001j4446J3302m5355p9345K1306N4857
$$ -8794 25826 39143 55645 85627 83068 31067 16621 29923 -15432 -94777 -73471 -18614
7543a8614O1674l9631o2203j273J3786J6050o6449N339M2140R593P014j1751J7556
$$ -18614 43060 3429 -58774 -60047 -46261 -30211 -96660 -91321 -49181 -39588 -32574 -44325 -26769
7530b6769M4785O372J4761J53Q446q2517o3842N68L1807L4544J25R177L3385K0310
$$ -26769 18016 24388 39149 39302 47748 -34769 -98611 -98043 -66236 -31692 -31567 -22390 10995 31305
7516C1305l7725o4318M3716J5611k6538n5265q446N4330L9759N5214P811k8098
$$ 31305 -6420 -70738 -27022 -11411 -37949 -93214 -101660 -47330 -7571 47643 55454 27356
7504B7356k0865L1948m1855m0637m840k5208l3941J936L6981Q1984N434j8366
$$ 27356 6491 38439 -3416 -44053 -48893 -74101 -108042 -106106 -69125 12859 18293 -73
7492g3n8934J6104J0347M1066K5118K5117m0616k9297n9703l9979M0429K0140
$$ -73 -59007 -42903 -32556 8510 33628 58745 18129 -11168 -70871 -110850 -70421 -50281
7480e0281J870q203L2153M8159L843k8093p770R656k6586j2688K8287L206N8697
$$ -50281 -48411 -56614 -24461 23698 27541 -552 -8322 1334 -25252 -37940 -9653 -6447 52250
7467E2250M1820M5352n8432n8051m3200k1933J6539j5188N7275K7315P5j0022
$$ 52250 94070 139422 80990 22939 -20261 -42194 -25655 -40843 16432 43747 43822 33800
7455C3800M0721N1074l9840l7423j1078K026J1001j9751m4528l734J4489O254
$$ 33800 74521 125595 85755 48332 37254 39280 50281 30530 -13998 -17732 -3243 3011
7443C011k6591K208L507R201m0354l1504m0776j4501m8559K8385M1034J8465P5029
$$ 3011 -23580 -21372 -17865 -8664 -49018 -80522 -121298 -135799 -184358 -155973 -114939 -96474 -21445
7430b1445L6251j3894q816l8415m3982p859o287r24J0351K9369j5938k2811j2911
$$ -21445 14806 912 -7904 -46319 -90301 -98160 -104447 -105371 -95020 -65651 -81589 -104400 -117311
7417a17311K7536J1044j6837l3468L8420M8069q901l724k5954R658M4277L2209
$$ -117311 -89775 -78731 -95568 -129036 -90616 -42547 -51448 -55172 -81126 -71468 -27191 5018
7405E018M7347o6451m3221L068M2881k7013Q724o349M353R505J2593M6727K2697
$$ 5018 52365 -14086 -57307 -54239 -11358 -38371 -29647 -35996 -31643 -22138 -9545 37182 59879
7392E9879j5570o030m0690k5728J963J8853m3905K754Q0573O3335L1223l159p0150
$$ 59879 44309 38279 -2411 -28139 -26176 -7323 -51228 -48474 32099 95434 126657 123498 53348
7379E3348m0858L8705O5581L4715k1107l6155m0360k0938j90j1421J7578o800
$$ 53348 12490 51195 116776 151491 130384 94229 53869 32931 32741 21320 38898 32098
7367C2098j9984J4547m996m743K043M624K7319j8782M293M892j01467k3274Q226
$$ 32098 12114 26661 21665 16922 18965 23589 50908 32126 36419 41311 -60156 -83430 -75204
7354g5204p615o195O3577k4379L1389M3569j7227L6130l4523J0660K2899J8117
$$ -75204 -82819 -89014 -25437 -49816 -18427 25142 7915 44045 9522 20182 43081 61198
7342F1198K6965k1473k7054j7691J8316R234r924n9081K3123M0496k3030l7292
$$ 61198 88163 66690 39636 21945 40261 49495 39571 -19510 3613 44109 21079 -16213
7330a6213L4682j5266P861j4956L245Q720N919O95m6572R653M7572l4077m4N6787
$$ -16213 18469 3203 11064 -3892 -647 8073 13992 14687 -31885 -22232 25340 -8737 -8781 48006
7316D8006j7396n5819M246m3961M329K9530L3148J0877J4510l2007l8786L2439
$$ 48006 30610 -25209 -20963 -64924 -60595 -31065 2083 12960 27470 -4537 -43323 -10884
7304a0884J5531o0719n1424J8230K9413n163J3592j7903N9960L6273K2093n38
$$ -10884 4647 -56072 -107496 -89266 -59853 -65016 -51424 -69327 -9367 26906 48999 48461
7292D8461L8091L4277o2216m7225J2192j1417q910K0665L6446N757n608k0309
$$ 48461 86552 120829 58613 11388 23580 12163 3253 23918 60364 66121 60513 40204
7280D0204l0018K4542J2805n8385L4112M8660k67m6634j9710m8307Q3392j5644
$$ 40204 10186 34728 47533 -10852 23260 71920 71653 25019 5309 -42998 40394 24750
7268B4750r8593k4992L8310k2600L6366M8706j1701J2228J4822l2227j2784l4590
$$ 24750 -73843 -98835 -60525 -83125 -46759 1947 -9754 2474 17296 -14931 -27715 -62305
7256f2305l0547L8542Q437L7554K5840k765l0183l4334l007L2922L2705P616N390
$$ -62305 -92852 -54310 -45873 -8319 17521 14756 -15427 -49761 -52768 -19846 12859 20475 25865
7243B5865n142n314k4571k1538j5523K6828K0086j0062N828n2603j1170R514p279
$$ 25865 20723 15409 -9162 -30700 -46223 -19395 691 -9371 -3543 -56146 -67316 -57802 -65081
7230f5081K3877j4421J9143O31M622l806M9259L376N863J661N3170L8889J206
$$ -65081 -41204 -55625 -36482 -35851 -31229 -35035 14224 17600 23463 25124 78294 117183 118389
7217A18389K0901q8253p1993o0229M1267P0174K9516J621k8451o562m3196l0579
$$ 118389 139290 51037 -20956 -81185 -39918 30256 59772 61393 32942 26380 -16816 -47395
7205d7395J3483j5787N0948j6912l9572j6072o444Q56K3638P782J8202j5063K6689
$$ -47395 -33912 -49699 1249 -15663 -55235 -71307 -77751 -76895 -53257 -45475 -27273 -42336 -15647
7192a5647L6812N0437l0897p2318L661K3473N1697J5322k7004l3759m0029O4310
$$ -15647 21165 71602 40705 -31613 -27952 -4479 47218 62540 35536 1777 -38252 26058
7180B6058k3048l3489L456R807K1990q640m4115L072M3515J5307M132o555j4278
$$ 26058 3010 -30479 -27023 -17216 4774 -3866 -47981 -44909 -1394 13913 18045 11490 -2788
7167b788j0652L193J590K5736m151n1290L4368J2076p437j9604J1178l5985J1269
$$ -2788 -13440 -10247 -8657 17079 12928 -38362 -3994 8082 645 -18959 -7781 -43766 -32497
7154c2497r549k0593K437J9584q627K2352O2139K4094r922o049j2928m9397K9026
$$ -32497 -42046 -62639 -60202 -40618 -49245 -26893 35246 59340 49418 43369 30441 -18956 10070
7141A0070k5454J174k9511J3317L6197J4536m5166n7135J1595K0853L7949M4977
$$ 10070 -15384 -14210 -43721 -30404 5793 20329 -24837 -81972 -70377 -49524 -11575 33402
7129C3402n6370K4997P1527m6917p5792p935K8347N3430K0552q387m1902p9081
$$ 33402 -22968 2029 73556 26639 -49153 -57088 -28741 24689 45241 36854 -5048 -84129
7117h4129j832R989K5916p440L0458L7914j7332M835j1084r407P9654L3925N447
$$ -84129 -85961 -75972 -50056 -57496 -27038 10876 -6456 -1621 -12705 -22112 57542 91467 96914
7104I6914o572n2490l627j1856o8822K6220j9558j276L845J7197M4312M9303k1390
$$ 96914 90342 37852 34225 22369 -46453 -20233 -39791 -41067 -37222 -20025 24287 73590 52200
7091E2200K3860K1692j6120m6250r109L5193M577m4007P683J535n0682r069j7336
$$ 52200 76060 97752 81632 35382 26273 61466 66043 22036 29719 31254 -19428 -28497 -45833
7078d5833M5848O2933J712k4358k6640J7493k1637k2352J8959N364k0424j6389
$$ -45833 15 62948 64660 40302 13662 31155 9518 -12834 6125 11489 -8935 -25324
7066b5324K0708K133n2838J4268N7823J5004l207k1313J7433J7767k1042n3909
$$ -25324 -4616 -2483 -55321 -41053 16770 31774 28567 7254 24687 42454 21412 -32497
7054c2497q602K1513J0861n489r34K2832L210m8010k7880R131K8672k6248l402
$$ -32497 -41099 -19586 -8725 -14214 -15148 7684 10894 -37116 -64996 -55865 -27193 -53441 -56843
7041e6843M1753k1041L0629Q874m9184J8686n570j5996j7392K1210j8792l5390
$$ -56843 -15090 -36131 -5502 3372 -45812 -27126 -32696 -48692 -66084 -44874 -63666 -99056
7029i9056L5595M1564L3443N9200m1037p8436L281o867k8269K6210K745K6185
$$ -99056 -63461 -21897 11546 70746 29709 -48727 -45446 -52313 -80582 -54372 -51627 -25442
7017b5442K0995M7070j4473m3908L7578M9536q530m2356m5879j2145Q63N203j5722
$$ -25442 -4447 42623 28150 -15758 21820 71356 62826 20470 -25409 -37554 -36691 -31488 -47210
7004d7210j0355j1854O7416J24966q704k3179l0844j9125p5995l6232J8888k367
$$ -47210 -57565 -69419 -2003 122963 114259 91080 60236 41111 -34884 -71116 -52228 -54595
6992e4595M8692n6895k8680O0287M689J0448M596k5082l2379k5460R065J6191
$$ -54595 -5903 -62798 -91478 -31191 -26502 -16054 -11458 -36540 -68919 -94379 -85314 -69123
6980f9123K674K4574K5572p791M5300j5831J3054K4641k6703j1690J6978R238
$$ -69123 -66449 -41875 -16303 -24094 21206 5375 18429 43070 16367 4677 21655 30893
6968C0893j4674k0746J090K079N9552j9845j6941n6456n1826J148O5111r788l7141
$$ 30893 16219 -4527 -3437 -1358 58194 38349 21408 -35048 -86874 -85726 -20615 -30403 -67544
$$ [...]
##END NTUPLES=NMR SPECTRUM
##END=
